
##TITLE=AC1142_Costa_5974993_e28T5zyfrc
##JCAMPDX= 6.0         $$ Bruker NMR JCAMP-DX V2.0
##DATA TYPE= NMR SPECTRUM
##DATA CLASS= NTUPLES
##ORIGIN= BRUKER
##OWNER= Administrator
$$ 1.72 TOPSPIN		Version 2.1
$$ 2012-04-16 18:49:27.281 -0500  Administrator@TOPSPIN
$$ Compression mode = diff/dup
##.OBSERVE FREQUENCY= 400.13188235
##.OBSERVE NUCLEUS= ^1H
##.ACQUISITION MODE= SIMULTANEOUS (DQD)
##.ACQUISITION SCHEME= undefined
##.AVERAGES= 64
##.DIGITISER RES= 22
##SPECTROMETER/DATA SYSTEM= spect
##.PULSE SEQUENCE= noesygpps1d.comp
##.SOLVENT NAME= COFFEE_meoh
##.SHIFT REFERENCE= INTERNAL, COFFEE_meoh, 1, 14.96855
##AUDIT TRAIL= $$ (NUMBER, WHEN, WHO, WHERE, PROCESS, VERSION, WHAT)
$$ ##TITLE= Audit trail, TOPSPIN		Version 2.1
$$ ##JCAMPDX= 5.01
$$ ##ORIGIN= Bruker BioSpin GmbH
$$ ##OWNER= Administrator
$$ $$ C:\Bruker\TOPSPIN/data/COFFEE/nmr/AC1142_Costa_5974993_e28T5zyfrc/12/pdata/1/auditp.txt
$$ ##AUDIT TRAIL=  $$ (NUMBER, WHEN, WHO, WHERE, PROCESS, VERSION, WHAT)
(   1,<2012-04-15 19:28:15.671 -0500>,<Administrator>,<TOPSPIN>,<go>,<TOPSPIN 2.1>,
      <created by zg
	started at 2012-04-15 19:16:44.093 -0500,
	POWCHK enabled, PULCHK disabled,
       configuration hash MD5:
       1A 1E CE 29 27 FD 77 03 67 4E F0 E3 C4 B2 CB 90
       data hash MD5: 64K
       F9 3C 3E 3D A4 67 78 11 D2 D3 93 D6 0F A4 CF 65>)
(   2,<2012-04-15 19:28:18.343 -0500>,<Administrator>,<TOPSPIN>,<proc1d>,<TOPSPIN 2.1>,
      <Start of raw data processing
       efp LB = 0.3 FT_mod = 6 PKNL = 1 PHC0 = 0 PHC1 = 0 SI = 128K 
       data hash MD5: 128K
       E5 54 7D 4A 25 36 E8 DE 33 74 A8 FC 52 FD E1 D6>)
(   3,<2012-04-15 19:28:19.609 -0500>,<Administrator>,<TOPSPIN>,<proc1d>,<TOPSPIN 2.1>,
      <pk PHC0 = 37.74353 PHC1 = 0 
       data hash MD5: 128K
       A6 F1 33 1E 01 55 96 2B 15 F5 D2 E4 E4 28 C2 79>)
(   4,<2012-04-15 19:28:19.843 -0500>,<Administrator>,<TOPSPIN>,<proc1d>,<TOPSPIN 2.1>,
      <abs ABSG = 1 
       data hash MD5: 128K
       F4 06 FF 0E B8 25 6A 49 EF 5E 8A 44 4C A0 85 F7>)
(   5,<2012-04-15 19:28:19.921 -0500>,<Administrator>,<TOPSPIN>,<proc1d>,<TOPSPIN 2.1>,
      <abs ABSG = 2 
       data hash MD5: 128K
       6E F5 EA 2D DA 0A D0 B8 E7 6B 2A 5B F0 84 37 03>)
(   6,<2012-04-15 19:28:20.046 -0500>,<Administrator>,<TOPSPIN>,<proc1d>,<TOPSPIN 2.1>,
      <abs ABSG = 3 
       data hash MD5: 128K
       60 C1 FB 10 3F AD 7B 9A 0C 8C B6 35 04 4D 3C 19>)
(   7,<2012-04-15 19:28:20.234 -0500>,<Administrator>,<TOPSPIN>,<proc1d>,<TOPSPIN 2.1>,
      <abs ABSG = 4 
       data hash MD5: 128K
       14 16 AC 84 5B 2A 9B 39 26 20 F2 BE 90 C0 78 E4>)
(   8,<2012-04-15 19:28:20.296 -0500>,<Administrator>,<TOPSPIN>,<proc1d>,<TOPSPIN 2.1>,
      <abs ABSG = 5 
       data hash MD5: 128K
       72 6D 8C AB 9A B7 38 E4 F5 E6 B9 5F 09 46 73 AA>)
(   9,<2012-04-15 19:28:20.531 -0500>,<Administrator>,<TOPSPIN>,<audit>,<TOPSPIN 2.1>,
      <user comment:
       ICON-NMR User ID: COFFEE
       data hash MD5: 128K
$$ [...]
##$TP07= 0
##$TPNAME0= <>
##$TPNAME1= <>
##$TPNAME2= <>
##$TPNAME3= <>
##$TPNAME4= <>
##$TPNAME5= <>
##$TPNAME6= <>
##$TPNAME7= <>
##$TPOAL= (0..7)
0.5 0.5 0.5 0.5 0.5 0.5 0.5 0.5
##$TPOFFS= (0..7)
0 0 0 0 0 0 0 0
##$TUNHIN= 0
##$TUNHOUT= 0
##$TUNXOUT= 0
##$USERA1= <user>
##$USERA2= <user>
##$USERA3= <user>
##$USERA4= <user>
##$USERA5= <user>
##$V9= 5
##$VALIST= <valist>
##$VCLIST= <CCCCCCCCCCCCCCC>
##$VD= 0
##$VDLIST= <DDDDDDDDDDDDDDD>
##$VPLIST= <PPPPPPPPPPPPPPP>
##$VTLIST= <TTTTTTTTTTTTTTT>
##$WBST= 2048
##$WBSW= 25
##$XGAIN= (0..3)
0 0 0 0
##$XL= 0
##$YL= 0
##$YMAX_a= 11606369
##$YMIN_a= -7557649
##$ZGOPTNS= <>
##$ZL1= 120
##$ZL2= 120
##$ZL3= 120
##$ZL4= 120
##$ABSF1= 14.96855
##$ABSF2= -5.583981
##$ABSG= 5
##$ABSL= 3
##$ALPHA= 0
##$AQORDER= 0
##$ASSFAC= 0
##$ASSFACI= 0
##$ASSFACX= 0
##$ASSWID= 0
##$AUNMP= <proc_prof1d_extract.lims>
##$AXLEFT= 0
##$AXNAME= <>
##$AXNUC= <1H>
##$AXRIGHT= 0
##$AXTYPE= 0
##$AXUNIT= <>
##$AZFE= 0.1
##$AZFW= 0.1
##$BCFW= 0
##$BC_mod= 0
##$BYTORDP= 0
##$COROFFS= 0
##$CY= 15
##$DATMOD= 1
##$DC= 0
##$DFILT= <>
##$DTYPP= 0
##$F1P= 0
##$F2P= 0
##$FCOR= 0.5
##$FTSIZE= 131072
##$FT_mod= 6
##$GAMMA= 0
##$GB= 0
##$INTBC= 1
##$INTSCL= 1
##$ISEN= 128
##$LB= 0.3
##$LEV0= 0
##$LPBIN= 0
##$MAXI= 10000
##$MC2= 0
##$MEAN= 0
##$ME_mod= 0
##$MI= 0
##$NCOEF= 0
##$NC_proc= -2
##$NLEV= 6
##$NOISF1= 0
##$NOISF2= 0
##$NSP= 0
##$NTH_PI= 0
##$NZP= 0
##$OFFSET= 14.96855
##$PC= 1
##$PHC0= 37.74353
##$PHC1= 0
##$PH_mod= 1
##$PKNL= yes
##$PPARMOD= 0
##$PPDIAG= 0
##$PPIPTYP= 0
##$PPMPNUM= 2147483647
##$PPRESOL= 1
##$PSCAL= 4
##$PSIGN= 0
##$PYNMP= <proc.py>
##$REVERSE= no
##$SF= 400.130004827803
##$SI= 131072
##$SIGF1= 0
##$SIGF2= 0
##$SINO= 400
##$SIOLD= 131072
##$SPECTYP= <>
##$SREGLST= <1H.CDCl3>
##$SSB= 0
##$STSI= 131072
##$STSR= 0
##$SW_p= 8223.68421052632
##$SYMM= 0
##$S_DEV= 0
##$TDeff= 65536
##$TDoff= 0
##$TI= <>
##$TILT= no
##$TM1= 0
##$TM2= 0
##$TOPLEV= 0
##$USERP1= <user>
##$USERP2= <user>
##$USERP3= <user>
##$USERP4= <user>
##$USERP5= <user>
##$WDW= 1
##$XDIM= 131072
##$YMAX_p= 223130206
##$YMIN_p= -404605610
##$CURPLOT= <Network HP LaserJet P1505>
##$CURPRIN= <$Network HP LaserJet P1505>
##$DFORMAT= <normdp>
##$LAYOUT= <+/1D_H.xwp>
##$LFORMAT= <normlp>
##$PFORMAT= <normpl>
##$SURQMSG= 1
$$ End of Bruker specific parameters
$$ ---------------------------------
##NTUPLES= NMR SPECTRUM
##VAR_NAME=  FREQUENCY,     SPECTRUM/REAL,   SPECTRUM/IMAG
##SYMBOL=    X,             R,               I
##VAR_TYPE=  INDEPENDENT,   DEPENDENT,       DEPENDENT
##VAR_FORM=  AFFN,          ASDF,            ASDF
##VAR_DIM=   131072,        131072,          131072
##UNITS=     HZ,            ARBITRARY UNITS, ARBITRARY UNITS
##FACTOR=    0.0627417313425165, 1,          1
##FIRST=     8223.62146879498, 4390,         -38166
##LAST=      0,             4113,            -37308
##MIN=       0,             -404605610,      0
##MAX=       8223.62146879498, 223130206,    0
$$ Real data points
##PAGE= N=1
##DATA TABLE= (X++(R..R)), XYDATA
$$ [...]
$$ plain form
61995 2135525 2165346 2192959 2218370 2241265 2261253 2278117 2292030 2303588 2313506 2322349 2330655 2339098
61983 2339098 2348024 2356902 2364843 2371976 2379777 2389648 2401491 2414121 2426796 2439854 2454024 2469669
61971 2469669 2486763 2505234 2525179 2546852 2570334 2595100 2620161 2645005 2670227 2696864 2725223
61960 2725223 2754783 2785102 2816279 2848425 2881181 2914045 2946926 2980182 3014180 3048843 3083454
61949 3083454 3116980 3148861 3179461 3209442 3238751 3266578 3292250 3315706 3337063 3356287 3373484
61938 3373484 3389008 3402888 3414552 3423549 3430198 3435066 3438060 3438603 3436636 3432913 3428234 3422773 3416258
61925 3416258 3408491 3399623 3390222 3381114 3372817 3365017 3356952 3348540 3340820 3335042 3331591 3330038 3329954 3331245
61911 3331245 3333815 3337459 3342199 3348393 3356327 3365944 3377069 3389663 3403685 3418917 3435078 3451965
$$ packed form
61995B135525K9821K7613K5411K2895J9988J6864J3913J1558R918Q843Q306Q443
61983B339098Q926Q878P941P133P801R871J1843J2630J2675J3058J4170J5645
61971B469669J7094J8471J9945K1673K3482K4766K5061K4844K5222K6637K8359
61960B725223K9560L0319L1177L2146L2756L2864L2881L3256L3998L4663L4611
61949C083454L3526L1881L0600K9981K9309K7827K5672K3456K1357J9224J7197
61938C373484J5524J3880J1664Q997O649M868K994N43j967l723m679n461o515
61925C416258p767q868r401r108q297p800q065q412p720n778l451j553q4J291
61911C331245K570L644M740O194P934R617J1125J2594J4022J5232J6161J6887
$$ plain form
61899 3451965 3469335 3486854 3504285 3521508 3538200 3553785 3568045 3581481 3594612 3607016 3617573
61888 3617573 3625630 3631447 3635453 3637586 3637659 3635936 3633022 3629391 3625295 3620850 3615913 3610116 3603360 3596146
61874 3596146 3589178 3582808 3577115 3572322 3568813 3566905 3567012 3569883 3576266 3586372 3600113 3617894 3640751
61861 3640751 3669681 3705234 3747953 3798836 3859152 3930134 4013089 4109545 4220964 4348521 4493538
61850 4493538 4658172 4845370 5058005 5298079 5566729 5864804 6193163 6552171 6940915
61841 6940915 7356979 7796748 8255238 8724973 9194999 9651187 10077196 10454792 10764129
61832 10764129 10985935 11105630 11116626 11020748 10826930 10549983 10208928 9823619 9410931 8983380
61822 8983380 8550491 8120206 7698626 7289378 6894376 6515302 6153994 5811749 5488891
$$ packed form
61899C451965J7370J7519J7431J7223J6692J5585J4260J3436J3131J2404J0557
61888C617573Q057N817M006K133P3j723k914l631m096m445m937n797o756p214
61874C596146o968o370n693m793l509j908J07K871O383J0106J3741J7781K2857
61861C640751K8930L5553M2719N0883O0316P0982Q2955R6456J11419J27557J45017
61850D493538J64634J87198K12635K40074K68650K98075L28359L59008L88744
61841F940915M16064M39769M58490M69735M70026M56188M26009L77596L09337
61832A0764129K21806J19695J0996r5878j93818k76947l41055l85309m12688m27551
61822H983380m32889m30285m21580m09248l95002l79074l61308l42245l22858
$$ plain form
61813 5488891 5185177 4900194 4633268 4383352 4149369 3930640 3726822 3537459 3361701
61804 3361701 3198486 3046932 2906480 2776596 2656434 2544973 2441457 2345558 2257015 2175275
61794 2175275 2099594 2029360 1964204 1903917 1848457 1797903 1752230 1711098 1673984 1640406 1609894
61783 1609894 1581872 1555901 1532043 1510757 1492412 1476986 1464141 1453299 1443685 1434689 1426335 1419180
61771 1419180 1413597 1409381 1406108 1403645 1402120 1401591 1401938 1402937 1404326 1406057 1408687 1413255 1420443 1429937 1440888
61756 1440888 1452897 1466306 1481670 1499322 1519451 1542219 1567609 1595380 1625358 1657730 1692956
61745 1692956 1731475 1773495 1818994 1867931 1920510 1977249 2038687 2105071 2176426 2252917 2335075
61734 2335075 2423688 2519541 2623213 2735104 2855833 2986738 3129877 3287392 3460994 3652187
$$ packed form
61813E488891l03714k84983k66926k49916k33983k18729k03818j89363j75758
61804C361701j63215j51554j40452j29884j20162j11461j03516r5899q8543q1740
61794B175275p5681p0234o5156o0287n5460n0554m5673m1132l7114l3578l0512
61783A609894k8022k5971k3858k1286j8345j5426j2845j0842r614q996q354p155
61771A419180n583m216l273k463j525n29L47R99J389J731K630M568P188R494J0951
61756A440888J2009J3409J5364J7652K0129K2768K5390K7771K9978L2372L5226
61745A692956L8519M2020M5499M8937N2579N6739O1438O6384P1355P6491Q2158
61734B335075Q8613R5853J03672J11891J20729J30905J43139J57515J73602J91193
$$ plain form
61724 3652187 3862828 4095294 4352332 4637095 4953297 5305008 5696177 6130434 6611129
61715 6611129 7141204 7722917 8357660 9045674 9785411 10572902 11401555 12261808 13139993
61706 13139993 14017062 14868401 15664682 16372935 16958350 17388182 17637436 17693788 17559647
61697 17559647 17251327 16795880 16225933 15573947 14868438 14133210 13387835 12647450 11922363
61688 11922363 11218991 10541782 9894409 9279638 8698960 8152758 7640719 7161990 6715162
61679 6715162 6298377 5909695 5547565 5210993 4899040 4610161 4342262 4093524 3862885
61670 3862885 3649581 3452513 3270328 3101870 2946246 2802603 2670061 2547708 2434466
61661 2434466 2329158 2230956 2139647 2055278 1977728 1906687 1841714 1782091 1726993 1676074 1629446
$$ packed form
61724C652187K10641K32466K57038K84763L16202L51711L91169M34257M80695
61715F611129N30075N81713O34743O88014P39737P87491Q28653Q60253Q78185
61706A3139993Q77069Q51339P96281P08253N85415M29832K49254N6352j34141
61697A7559647l08320m55447n69947o51986p05509p35228p45375p40385p25087
61688A1922363p03372o77209o47373o14771n80678n46202n12039m78729m46828
61679F715162m16785l88682l62130l36572l11953k88879k67899k48738k30639
61670C862885k13304j97068j82185j68458j55624j43643j32542j22353j13242
61661B434466j05308r8202r1309q4369p7550p1041o4973n9623n5098n0919m6628
$$ plain form
61650 1629446 1586759 1546824 1508784 1473195 1441179 1412741 1386748 1362476 1340223 1320261 1302121
61639 1302121 1285351 1270145 1256617 1244047 1231626 1219607 1208936 1199825 1191421 1183016 1174948 1167957
61627 1167957 1162035 1156373 1150305 1143846 1137254 1130430 1123058 1115159 1107160 1099402 1091815 1084183 1076445 1068603
61613 1068603 1060526 1052078 1043327 1034443 1025467 1016366 1007240 998266 989466 980663 971641 962274 952603 942914
61599 942914 933655 925205 917808 911677 906879 903062 899737 897037 895806 896550 898727 901488 904721 908712
61585 908712 913140 917295 921301 926272 932966 940881 948905 956323 962899 968604 973735 978942 984638 990530
61571 990530 995997 1000708 1004617 1007632 1009655 1010765 1011071 1010514 1008990 1006528 1003164 998878 993934 988953 984323
61556 984323 979728 974639 969139 963835 958997 954231 949119 943884 939261 935892 933961 933209 933175 933506 934163
$$ packed form
61650A629446m2687l9935l8040l5589l2016k8438k5993k4272k2253j9962j8140
61639A302121j6770j5206j3528j2570j2421j2019j0671r111q404q405q068o991
61627A167957n922n662o068o459o592o824p372p899p999p758p587p632p738p842
61613A068603q077q448q751q884q976r101r126q974q800q803r022r367r671r689
61599I42914r259q450p397o131m798l817l325k700j231P44K177K761L233L991
61585I08712M428M155M006M971O694P915Q024P418O576N705N131N207N696N892
61571I90530N467M711L909L015K023J110L06n57j524k462l364m286m944m981m630
61556I84323m595n089n500n304m838m766n112n235m623l369j931p52l4L31O57
$$ plain form
61541 934163 935397 937490 940514 944301 948644 953520 959112 965569 972802 980596 988860 997552 1006393 1014970
61527 1014970 1023200 1031440 1039958 1048513 1056717 1064560 1072286 1079938 1087398 1094866 1102887 1111823 1121599 1132017
61513 1132017 1142994 1154337 1165718 1177247 1189840 1204533 1221377 1239406 1257788 1276644 1296494
61502 1296494 1317233 1338088 1358471 1378423 1398150 1417483 1436031 1453697 1470762 1487522 1503960
61491 1503960 1519793 1534694 1548447 1560862 1571542 1579872 1585455 1588612 1590232 1591073 1591335 1590837 1589381
61478 1589381 1586906 1583615 1580082 1576911 1574173 1571423 1568453 1565655 1563486 1561977 1561094 1561154 1562469 1564919 1568394
61463 1568394 1573424 1580833 1590924 1603545 1618849 1637504 1660193 1687432 1719795 1757845 1801814 1851823
61451 1851823 1908386 1972307 2044230 2124808 2215127 2316207 2428068 2550019 2681931 2824456
$$ packed form
61541I34163J234K093L024L787M343M876N592O457P233P794Q264Q692Q841Q577
61527A014970Q230Q240Q518Q555Q204P843P726P652P460P468Q021Q936R776J0418
61513A132017J0977J1343J1381J1529J2593J4693J6844J8029J8382J8856J9850
61502A296494K0739K0855K0383J9952J9727J9333J8548J7666J7065J6760J6438
61491A503960J5833J4901J3753J2415J0680Q330N583L157J620Q41K62m98j456
61478A589381k475l291l533l171k738k750k970k798k169j509q83O0J315K450L475
61463A568394N030P409J0091J2621J5304J8655K2689K7239L2363L8050M3969N0009
61451A851823N6563O3921P1923Q0578R0319J01080J11861J21951J31912J42525
$$ plain form
61441 2824456 2977692 3140335 3310345 3485638 3663528 3840016 4010147 4168789 4310920
61432 4310920 4431884 4528062 4597174 4637900 4649964 4635067 4596964 4539775 4466460 4379439 4282080
61421 4282080 4178589 4072533 3966178 3861134 3758891 3660676 3567445 3480219 3399999 3327369
61411 3327369 3262576 3205967 3157849 3117904 3085320 3059694 3041440 3031154 3028858 3033909 3045305 3061956
61399 3061956 3082967 3107794 3136009 3166986 3200030 3234719 3270738 3307363 3343523 3378555 3412674
61388 3412674 3446589 3480890 3515841 3551472 3587639 3624078 3660524 3696803 3732848 3768674 3804291
61377 3804291 3839483 3873695 3906192 3936222 3962937 3985354 4002649 4014477 4020967 4022582 4020084 4014272
61365 4014272 4005381 3992872 3976177 3955642 3932571 3908491 3884560 3861434 3839295 3818080 3798033
$$ packed form
61441B824456J53236J62643J70010J75293J77890J76488J70131J58642J42131
61432D310920J20964R6178O9112M0726J2064j4897l8103n7189p3315q7021r7359
61421D282080j03491j06056j06355j05044j02243r8215r3231q7226q0220p2630
61411C327369o4793n6609m8118l9945l2584k5626j8254j0286k296N051J1396J6651
61399C061956K1011K4827K8215L0977L3044L4689L6019L6625L6160L5032L4119
61388C412674L3915L4301L4951L5631L6167L6439L6446L6279L6045L5826L5617
61377C804291L5192L4212L2497L0030K6715K2417J7295J1828O490J615k498n812
61365D014272q891j2509j6695k0535k3071k4080k3931k3126k2139k1215k0047
$$ plain form
61354 3798033 3779974 3764725 3752374 3742410 3734458 3728474 3724211 3720912 3717694 3714034 3709847 3705239 3700203
61341 3700203 3694475 3687790 3680256 3672209 3663722 3654864 3646798 3641992 3642648 3649302 3661682 3680553 3707821
61328 3707821 3745060 3792992 3852514 3925097 4011774 4112500 4226908 4354898 4496054 4649252
61318 4649252 4813389 4987803 5171168 5360405 5551278 5739585 5921008 6090149 6240788
61309 6240788 6367374 6465987 6534188 6570825 6576316 6552610 6502487 6428875 6334546 6221834 6092437
61298 6092437 5947899 5790541 5623625 5450350 5272946 5092988 4912379 4733576 4558807
61289 4558807 4389480 4226616 4071606 3926057 3790723 3664941 3547470 3437868 3336846
61280 3336846 3245402 3163993 3092530 3030796 2978593 2935672 2901719 2876316 2858848 2848643 2845323
$$ packed form
61354C798033j8059j5249j2351r964p952n984m263l299l218l660m187m608n036
61341C700203n728o685p534q047q487q858q066m806O56O654J2380J8871K7268
61328C707821L7239M7932N9522P2583Q6677J00726J14408J27990J41156J53198
61318D649252J64137J74414J83365J89237J90873J88307J81423J69141J50639
61309F240788J26586R8613O8201L6637N491k3706n0123p3612r4329j12712j29397
61298F092437j44538j57358j66916j73275j77404j79958j80609j78803j74769
61289D558807j69327j62864j55010j45549j35334j25782j17471j09602j01022
61280C336846r1444q1409p1463o1734n2203m2921l3953k5403j7468j0205l320
$$ plain form
61269 2845323 2848835 2858972 2874968 2895691 2920123 2947492 2977094 3008180 3040010 3071919 3103342
61258 3103342 3133830 3163048 3190797 3217094 3242152 3266029 3288315 3308334 3325711 3340555 3353050
61247 3353050 3363065 3370183 3373889 3373737 3369579 3361712 3350511 3335850 3317240 3294619 3268617 3239816
61235 3239816 3208143 3173321 3135634 3095840 3054568 3012247 2969533 2927378 2886558 2847427 2810183
61224 2810183 2775142 2742641 2712760 2685196 2659488 2635428 2613287 2593412 2575596 2559117 2543463
61213 2543463 2528634 2514459 2500058 2484561 2468232 2452327 2437811 2424626 2412346 2401093 2391575
61202 2391575 2384503 2380262 2379086 2381397 2388027 2400127 2418697 2444044 2475778 2513481 2557338 2608005
61190 2608005 2665882 2730536 2800825 2875438 2953238 3033127 3113724 3193131 3268786 3337338 3394835
$$ packed form
61269B845323L512J0137J5996K0723K4432K7369K9602L1086L1830L1909L1423
61258C103342L0488K9218K7749K6297K5058K3877K2286K0019J7377J4844J2495
61247C353050J0015P118L706j52m158p867j1201j4661j8610k2621k6002k8801
61235C239816l1673l4822l7687l9794m1272m2321m2714m2155m0820l9131l7244
61224B810183l5041l2501k9881k7564k5708k4060k2141j9875j7816j6479j5654
61213B543463j4829j4175j4401j5497j6329j5905j4516j3185j2280j1253r518
61202B391575p072m241j176K311O630J2100J8570K5347L1734L7703M3857N0667
61190B608005N7877O4654P0289P4613P7800P9889Q0597P9407P5655O8552N7497
$$ plain form
61179 3394835 3437469 3462416 3468055 3453683 3419538 3367223 3299667 3220174 3131516 3036021 2936218
61168 2936218 2834905 2734524 2636686 2542318 2452035 2366281 2285271 2208925 2136922 2068974 2005165
61157 2005165 1945868 1891263 1841083 1795025 1753206 1715824 1682463 1652151 1624260 1599084 1577388
61146 1577388 1559619 1545739 1535508 1528528 1524068 1521266 1519752 1519847 1521910 1525595 1530022 1534538 1538873 1542521
61132 1542521 1544597 1544729 1543669 1542374 1540686 1537569 1532610 1526482 1519723 1511859 1502302 1491545 1480759 1470452
61118 1470452 1460156 1449339 1438018 1426440 1414641 1402496 1389871 1376652 1362842 1348705 1334525
61107 1334525 1320188 1305192 1289109 1271909 1253882 1235408 1216744 1197766 1177961 1156903 1134755
61096 1134755 1112082 1089247 1066216 1042948 1019679 996757 974378 952541 931110 909909 888876
$$ packed form
61179C394835M2634K4947N639j4372l4145n2315o7556p9493q8658r5495r9803
61168B936218j01313j00381r7838r4368r0283q5754q1010p6346p2003o7948o3809
61157B005165n9297n4605n0180m6058m1819l7382l3361l0312k7891k5176k1696
61146A577388j7769j3880j0231o980m460k802j514R5K063L685M427M516M335L648
61132A542521K076J32j060j295j688l117m959o128o759p864r557j0757j0786j0307
61118A470452j0296j0817j1321j1578j1799j2145j2625j3219j3810j4137j4180
61107A334525j4337j4996j6083j7200j8027j8474j8664j8978j9805k1058k2148
61096A134755k2673k2835k3031k3268k3269k2922k2379k1837k1431k1201k1033
$$ plain form
61085 888876 868096 847640 827567 808259 790514 774925 761277 748848 737241 726645 717334 709330
61073 709330 702563 697029 692744 689769 688218 687997 688622 689702 691520 694707 699327 704749 710477 716648 723541
61058 723541 731058 738973 747381 756601 766727 777404 787933 797688 806691 815718 825455 835619 845325
61045 845325 854223 862574 870243 876424 880712 883648 885738 886630 885932 884224 882429 880582 878152 875384 873336
61030 873336 872358 871297 868588 863711 857391 850750 844518 838754 833069 827209 821407 815931 810422 804148
61016 804148 797098 790338 784929 780703 776451 771285 765513 760148 755740 751861 747705 742972 738024 733291
61002 733291 728795 724289 719556 714418 708771 702919 697665 693712 690986 688733 686183 683014 679481 676433
60988 676433 674949 675504 677595 680533 684392 689621 695941 702388 708572 715212 723135 732342 742338 752797
$$ packed form
61085H88876k0780k0456k0073j9308j7745j5589j3648j2429j1607j0596r311q004
61073G09330o767n534m285k975j551k21O25J080J818L187M620N422N728O171O893
61058G23541P517P915Q408R220J0126J0677J0529R755R003R027R737J0164R706
61045H45325Q898Q351P669O181M288K936K090Q92o98j708j795j847k430k768k048
61030H73336r78j061k709m877o320o641o232n764n685n860n802n476n509o274
61016H04148p050o760n409m226m252n166n772n365m408l879m156m733m948m733
61002G33291m496m506m733n138n647n852n254l953k726k253k550l169l533l048
60988F76433j484N55K091K938L859N229O320O447O184O640P923R207R996J0459
$$ plain form
60974 752797 763395 773497 782723 791648 801356 812290 823977 835849 847849 860139 872663 885280
60962 885280 898140 911682 926330 942311 959724 978655 999211 1021554 1046028 1073235 1103773
60951 1103773 1137698 1174256 1212407 1251733 1292770 1336457 1383430 1434004 1488591 1547795 1611921
60940 1611921 1680538 1752782 1828324 1908053 1993671 2086649 2187811 2297942 2418313 2550340
60930 2550340 2695206 2854468 3030920 3228460 3451578 3705995 3999835 4343086 4745175
60921 4745175 5213114 5751513 6363313 7050651 7816860 8668383 9612894 10653762 11786705
60912 11786705 13000496 14272935 15555765 16762496 17784784 18540645 19020062 19287388
60904 19287388 19439168 19556501 19685698 19840855 20001387 20101107 20035446 19703725 19062903 18149961
$$ packed form
60974G52797J0598J0102R226Q925R708J0934J1687J1872J2000J2290J2524J2617
60962H85280J2860J3542J4648J5981J7413J8931K0556K2343K4474K7207L0538
60951A103773L3925L6558L8151L9326M1037M3687M6973N0574N4587N9204O4126
60940A611921O8617P2244P5542P9729Q5618R2978J01162J10131J20371J32027
60930B550340J44866J59262J76452J97540K23118K54417K93840L43251M02089
60921D745175M67939N38399O11800O87338P66209Q51523R44511J040868J132943
60912A1786705J213791J272439J282830J206731J022288P55861M79417K67326
60904A9287388J51780J17333J29197J55157J60532R9720o5661l31721o40822r12942
$$ plain form
60894 18149961 17057473 15888035 14722310 13611173 12580100 11634837 10768134 9968608
60886 9968608 9227565 8540267 7904078 7317501 6779987 6290613 5846463 5442855 5075015
60877 5075015 4739081 4431887 4150669 3892968 3656263 3437731 3234819 3045952 2870243
60868 2870243 2706701 2554328 2412762 2281989 2161115 2048066 1940894 1839045 1743080 1653483
60858 1653483 1570126 1492637 1420734 1354053 1291914 1233572 1178708 1127574 1080496 1037271 997207
60847 997207 959672 924339 890850 858684 827724 798691 772458 748968 727218 706350 686371
60836 686371 667693 650428 634414 619609 606101 593821 582536 572094 562489 553683 545582 538212
60824 538212 531750 526274 521574 517315 513425 510217 508119 507288 507543 508636 510518 513353 517379 522752 529359
$$ packed form
60894A8149961j092488j169438j165725j111137j031073r45263q66703p99526
60886I968608p41043o87298o36189n86577n37514m89374m44150m03608l67840
60877E075015l35934l07194k81218k57701k36705k18532k02912j88867j75709
60868B870243j63542j52373j41566j30773j20874j13049j07172j01849r5965q9597
60858A653483q3357p7489p1903o6681o2139n8342n4864n1134m7078m3225m0064
60847I97207l7535l5333l3489l2166l0960k9033k6233k3490k1750k0868j9979
60836F86371j8678j7265j6014j4805j3508j2280j1285j0442r605q806q101p370
60824E38212o462n476m700m259l890l208k098q31K55J093J882K835M026N373O607
$$ plain form
60809 529359 536774 544556 552736 561868 572438 584199 596226 607612 618121 628202 638412 648767
60797 648767 658635 667297 674544 680576 685378 688552 689892 689851 689211 688456 687604 686476 684868 682663 680032
60782 680032 677428 675193 673350 671953 671319 671506 671805 671282 669869 668485 668034 668645 669974 671768 673946 676450
60766 676450 679353 682962 687575 693210 699704 706996 715185 724337 734300 744730 755395 766438 778223
60753 778223 790777 803584 816014 827829 839070 849712 859697 869075 877722 885107 890808 895186 899044
60740 899044 902638 905519 907319 908084 907681 905496 901097 894775 887136 878456 868716 857893 845955 832887
60726 832887 819046 805204 791908 779053 766419 754347 743539 734360 726694 720304 714995 710589
60714 710589 707143 705147 705153 707154 710523 714557 718945 723825 729544 736200 743167 749202 753279 755345 756189
$$ packed form
60809E29359P415P782Q180R132J0570J1761J2027J1386J0509J0081J0210J0355
60797F48767R868Q662P247O032M802L174J340m1o40p55q52j128j608k205k631
60782F80032k604k235j843j397o34J87K99n23j413j384m51O11J329J794K178K504
60766F76450K903L609M613N635O494P292Q189R152R963J0430J0665J1043J1785
60753G78223J2554J2807J2430J1815J1241J0642R985R378Q647P385N701M378L858
60740H99044L594K881J800P65m03k185m399o322p639q680r740j0823j1938j3068
60726H32887j3841j3842j3296j2855j2634j2072j0808r179p666o390n309m406
60714G10589l446j996OK001L369M034M388M880N719O656O967O035M077K066Q44
$$ plain form
60699 756189 756777 757776 759353 761079 762252 762769 763516 765543 768967 773173 777985 784044 791932 801422 811889
60684 811889 823016 834720 846682 858460 870044 881983 894851 908678 922863 936418 948345
60673 948345 958109 966010 972960 979622 985754 990567 993717 995634 996780 996980 995822 993508 990865 988531
60659 988531 986461 984175 981043 976316 969464 960823 951523 942381 933042 922533 910566 897905 885433
60646 885433 873155 860261 846135 831190 816667 803622 792229 782057 772756 764238 756423 749230
60634 749230 742731 736915 731411 725904 720811 716965 714658 713586 713761 715641 719122 723271 727573 732658
60620 732658 739165 746513 753615 760217 766594 772292 776254 778167 778669 778101 775896 771566 765627 759064 752225
60605 752225 744595 735500 724886 713525 702512 692446 683092 673891 664584 655217 645918 637041 629176
$$ packed form
60699G56189N88R99J577J726J173N17P47K027L424M206M812O059P888R490J0467
60684H11889J1127J1704J1962J1778J1584J1939J2868J3827J4185J3555J1927
60673I48345R764P901O950O662O132M813L150J917J146K00j158k314k643k334
60659I88531k070k286l132m727o852q641r300r142r339j0509j1967j2661j2472
60646H85433j2278j2894j4126j4945j4523j3045j1393j0172r301q518p815p193
60634G49230o499n816n504n507n093l846k307j072J75J880L481M149M302N085
60620G32658O507P348P102O602O377N698L962J913N02n68k205m330n939o563o839
60605G52225p630r095j0614j1361j1013j0066r354r201r307r367r299q877p865
$$ plain form
60592 629176 622505 616361 609933 603256 597000 591489 586468 581665 576943 572027 566759 561630 557369 553972
60578 553972 550701 547109 543491 540290 537701 535935 535194 535261 535711 536671 538710 541850 545411 549050 553281
60563 553281 558617 564898 571886 579875 589246 599956 611872 625143 639754 655215 671243 688380
60551 688380 707429 728551 751322 775332 800254 825523 850363 873930 895298 913680 928913
60540 928913 941329 950886 957047 959897 960646 960342 958567 954175 946901 937482 926582 914619 902492 891340
60526 891340 881296 871290 860435 849024 837844 827150 816787 806883 797800 789469 781256 772646
60514 772646 763892 755822 749026 743392 738496 734310 731166 729101 727687 726725 726638 727879 730285 733443 737388
60499 737388 742480 748864 756539 765742 776719 789232 802890 817878 834791 853802 874601 897185
$$ packed form
60592F29176o671o144o428o677o256n511n021m803m722m916n268n129m261l397
60578E53972l271l592l618l201k589j766p41O7M50R60K039L140L561L639M231
60563E53281N336O281O988P989R371J0710J1916J3271J4611J5461J6028J7137
60551F88380J9049K1122K2771K4010K4922K5269K4840K3567K1368J8382J5233
60540I28913J2416R557O161K850P49l04j775m392p274r419j0900j1963j2127j1152
60526H91340j0044j0006j0855j1411j1180j0694j0363r904r083q331q213q610
60514G72646q754q070o796n634m896m186l144k065j414r62q7J241K406L158L945
60499G37388N092O384P675R203J0977J2513J3658J4988J6913J9011K0799K2584
$$ plain form
60487 897185 921979 949013 977658 1007530 1039122 1073128 1109563 1147843 1187227 1226649 1264488
60476 1264488 1299091 1329352 1354217 1371945 1380669 1379956 1371274 1356708 1337759 1315742 1292732 1271128
60464 1271128 1252166 1235441 1220202 1206708 1195951 1188467 1183999 1182247 1183359 1187524 1194552 1204091 1216043
60451 1216043 1230545 1247844 1268403 1292899 1321933 1356031 1396153 1443897 1500786 1567646 1645136
60440 1645136 1734723 1838598 1958561 2095364 2249178 2420181 2608384 2812999 3032012 3262129
60430 3262129 3499087 3738149 3974091 4200134 4406736 4582221 4715509 4798766 4827924 4801734
60420 4801734 4721592 4592675 4424491 4229234 4018771 3802459 3586861 3376453 3174131 2981393
60410 2981393 2798780 2626521 2464770 2313394 2171973 2040210 1918110 1805513 1701635
$$ packed form
60487H97185K4794K7034K8645K9872L1592L4006L6435L8280L9384L9422L7839
60476A264488L4603L0261K4865J7728Q724p13q682j4566j8949k2017k3010k1604
60464A271128j8962j6725j5239j3494j0757p484m468j752J112M165P028R539J1952
60451A216043J4502J7299K0559K4496K9034L4098M0122M7744N6889O6860P7490
60440A645136Q9587J03875J19963J36803J53814J71003J88203K04615K19013K30117
60430C262129K36958K39062K35942K26043K06602J75485J33288Q3257K9158k6190
60420D801734q0142j28917j68184j95257k10463k16312k15598k10408k02322j92738
60410B981393j82613j72259j61751j51376j41421j31763j22100j12597j03878
$$ plain form
60401 1701635 1605351 1515895 1433006 1356459 1285791 1220613 1160901 1106668 1057379 1011918 969282
60390 969282 929253 892223 858400 827385 798635 772088 747980 726155 705897 686546 667973
60379 667973 650330 633593 617524 601955 587007 573214 561356 551834 544073 536927 529847 523281
60367 523281 517726 512878 508129 503521 499579 496468 493937 492132 491789 493397 496509 500029 502983 504953
60353 504953 506199 507519 509740 513064 516913 520469 523329 525716 528303 531738 536063 540532 544190 546745
60339 546745 548711 550771 553227 556109 559478 563405 567802 572446 577161 581889 586653 591465 596220 600613
60325 600613 604247 606895 608737 610300 612044 613890 615234 615642 615437 615290 615246 614606 612980 610969 609480 608762
60309 608762 608610 609128 610566 612490 613866 614215 614233 615010 616969 619737 622736 625652 628563 631852 635921 640785
$$ packed form
60401A701635r6284q9456q2889p6547p0668o5178n9712n4233m9289m5461m2636
60390I69282m0029l7030l3823l1015k8750k6547k4108k1825k0258j9351j8573
60379F67973j7643j6737j6069j5569j4948j3793j1858r522p761p146p080o566
60367E23281n555m848m749m608l942l111k531j805l43J608L112L520K954J970
60353E04953J246J320K221L324L849L556K860K387K587L435M325M469L658K555
60339E46745J966K060K456K882L369L927M397M644M715M728M764M812M755M393
60325F00613L634K648J842J563J744J846J344M08k05j47m4o40j626k011j489p18
60309F08762j52N18J438J924J376L49J8P77J959K768K999K916K911L289M069M864
$$ plain form
60293 640785 646025 651200 656290 661690 667781 674479 681127 686984 691917 696445 700992 705352 709134 712467
60279 712467 715864 719528 723277 727066 731100 735323 739242 742433 744988 747447 750549 755021 761167 768502
60265 768502 776035 783056 789398 794937 799241 801864 802762 802270 800878 798995 796637 793381 788967 784002 779569
60250 779569 776015 772591 768549 764212 760634 758521 757787 757907 758313 758588 758664 758851 759500 760602 761763 762496
60234 762496 762517 761928 761186 760783 760872 761325 762028 762860 763509 763786 764203 765749 768823 772756 776613 780069 783261
60217 783261 786277 789348 793276 799037 806872 816122 826054 836624 848456 862283 878436 896645 916291
60204 916291 936933 958606 981638 1006357 1033086 1062238 1094136 1128836 1166309 1206694 1250217
60193 1250217 1296999 1347213 1401409 1460374 1524535 1593663 1667229 1744971 1826999 1913316 2003321
$$ packed form
60293F40785N240N175N090N400O091O698O648N857M933M528M547M360L782L333
60279G12467L397L664L749L789M034M223L919L191K555K459L102M472O146P335
60265G68502P533P021O342N539M304K623Q98m92j392j883k358l256m414m965m433
60250G79569l554l424m042m337l578k113p34J20M06K75P6J87O49J102J161P33
60234G62496K1n89p42m03Q9M53P03Q32O49K77M17J546L074L933L857L456L192
60217G83261L016L071L928N761P835R250R932J0570J1832J3827J6153J8209J9646
60204I16291K0642K1673K3032K4719K6729K9152L1898L4700L7473M0385M3523
60193A250217M6782N0214N4196N8965O4161O9128P3566P7742Q2028Q6317R0005
$$ plain form
60182 2003321 2095832 2189551 2283399 2376353 2467162 2554457 2637120 2714325 2785272 2849106 2905100
60171 2905100 2952727 2991557 3021394 3042628 3056238 3063315 3064729 3061298 3054104 3044582 3034434 3025408
60159 3025408 3018888 3015637 3016133 3021093 3031339 3047172 3068415 3095253 3128598 3169283 3217251 3271870
60147 3271870 3332816 3400211 3473901 3552824 3634997 3717996 3799647 3878551 3953873 4024437 4088132
60136 4088132 4142449 4185596 4217010 4236922 4245627 4243118 4229300 4204548 4170070 4127653 4079117 4026211
60124 4026211 3970940 3915607 3862331 3812679 3767822 3728821 3696686 3672425 3657096 3651503 3655707 3669095
60112 3669095 3691048 3721242 3759204 3803906 3853943 3907754 3963537 4019332 4073413 4124248 4170028
60101 4170028 4208930 4240220 4264592 4282875 4294886 4300125 4299266 4294303 4287493 4280885 4276730 4277488 4285138
$$ packed form
60182B003321R2511R3719R3848R2954R0809Q7295Q2663P7205P0947O3834N5994
60171B905100M7627L8830K9837K1234J3610P077J414l431p194r522j0148r026
60159C025408o520l251M96M960J0246J5833K1243K6838L3345M0685M7968N4619
60147C271870O0946O7395P3690P8923Q2173Q2999Q1651P8904P5322P0564O3695
60136D088132N4317M3147L1414J9912Q705k509j3818k4752l4478m2417m8536n2906
60124D026211n5271n5333n3276m9652m4857l9001l2135k4261j5329n593M204J3388
60112C669095K1953L0194L7962M4702N0037N3811N5783N5795N4081N0835M5780
60101D170028L8902L1290K4372J8283J2011N239q59m963o810o608m155P58P650
$$ plain form
60088 4285138 4300952 4326096 4362061 4410285 4471687 4546871 4636616 4742008 4864056 5003226 5159345
60077 5159345 5332090 5521567 5728211 5951965 6191780 6446071 6713351 6992080 7279954
60068 7279954 7573469 7868018 8158429 8439852 8708409 8960689 9192465 9398483 9574068
60059 9574068 9716666 9825419 9899631 9938186 9940148 9905311 9834393 9729423 9593949 9432422
60049 9432422 9249430 9049853 8839294 8623558 8407789 8196615 7994802 7806746 7635191
60040 7635191 7481256 7345892 7230640 7136818 7064680 7013716 6983121 6971635 6977370 6998103 7031337
60029 7031337 7073900 7121968 7171591 7218808 7259331 7289117 7305788 7308998 7299107 7276014 7239566 7190257
60017 7190257 7128774 7055317 6970027 6873752 6767858 6653594 6532183 6405216 6274297 6140510
$$ packed form
60088D285138J5814K5144L5965M8224O1402P5184Q9745J05392J22048J39170J56119
60077E159345J72745J89477K06644K23754K39815K54291K67280K78729K87874
60068G279954K93515K94549K90411K81423K68557K52280K31776K06018J75585
60059I574068J42598J08753P4212L8555J962l4837p0918j04970j35474j61527
60049I432422j82992j99577k10559k15736k15769k11174k01813j88056j71555
60040G635191j53935j35364j15252r3822p2138n0964l0595j1486N735K0733L3234
60029G031337M2563M8068M9623M7217M0523K9786J6671L210r891k3093l6448m9309
60017G190257o1483p3457q5290r6275j05894j14264j21411j26967j30919j33787
$$ plain form
60007 6140510 6004903 5869401 5736645 5608890 5487559 5373826 5269091 5174780 5092096 5022083
59997 5022083 4965633 4923303 4895349 4881891 4882788 4897417 4924908 4964541 5015494 5076166 5144109 5216706
59985 5216706 5291534 5365956 5436854 5501172 5556574 5601362 5633925 5652622 5656291 5644723 5618541
59974 5618541 5578667 5525934 5461186 5385704 5301387 5210486 5115273 5018092 4921545 4828272 4740393
59963 4740393 4659297 4585987 4521453 4466628 4422226 4388960 4367814 4359772 4365152 4383472 4414193 4457464
59951 4457464 4513790 4583010 4663927 4755030 4855261 4963776 5079183 5199218 5320896 5440603
59941 5440603 5554331 5658529 5750974 5830484 5895782 5945092 5976988 5991078 5987551 5966567 5928664
59930 5928664 5875457 5809340 5732676 5647849 5558005 5466952 5377973 5293095 5213752 5141699 5078898
$$ packed form
60007F140510j35607j35502j32756j27755j21331j13733j04735r4311q2684p0013
59997E022083n6450m2330k7954j3458Q97J4629K7491L9633N0953O0672O7943P2597
59985E216706P4828P4422P0898O4318N5402M4788L2563J8697L669j1568k6182
59974E618541l9874n2733o4748p5482q4317r0901r5213r7181r6547r3273q7879
59963D740393q1096p3310o4534n4825m4402l3266k1146q042N380J8320L0721M3271
59951D457464N6326O9220Q0917R1103J00231J08515J15407J20035J21678J19707
59941E440603J13728J04198R2445P9510O5298M9310L1896J4090l527k0984l7903
59930E928664n3207o6117p6664q4827q9844r1053q8979q4878p9343p2053o2801
$$ plain form
59919 5078898 5026784 4986126 4957485 4941408 4938117 4947336 4968555 5001233 5044563 5097216 5157555 5224106
59907 5224106 5295657 5370835 5447710 5523987 5597678 5667562 5732990 5793359 5847954 5896342 5938796
59896 5938796 5976220 6009729 6040478 6069865 6099735 6132261 6169678 6214213 6268195 6334104 6414473
59885 6414473 6511671 6627673 6763909 6921423 7101154 7303875 7529653 7777396 8044980 8329572
59875 8329572 8627477 8933703 9241957 9545073 9835167 10103491 10340837 10538681 10690105
59866 10690105 10789836 10834234 10822020 10755166 10638713 10479589 10285494 10064285 9823508 9569999
59856 9569999 9309950 9049257 8793441 8547077 8313514 8095232 7894308 7712543 7551532
59847 7551532 7412849 7297911 7207413 7141034 7098002 7077794 7079915 7102996 7144504 7201570 7271775
$$ packed form
59919E078898n2114m0658k8641j6077l291R219K1219L2678M3330N2653O0339O6551
59907E224106P1551P5178P6875P6277P3691O9884O5428O0369N4595M8388M2454
59896E938796L7424L3509L0749K9387K9870L2526L7417M4535N3982O5909Q0369
59885F414473R7198J16002J36236J57514J79731K02721K25778K47743K67584K84592
59875H329572K97905L06226L08254L03116K90094K68324K37346J97844J51424
59866A0690105R9731M4398j2214o6854j16453j59124j94095k21209k40777k53509
59856I569999k60049k60693k55816k46364k33563k18282k00924j81765j61011
59847G551532j38683j14938r0498o6379m3032k0208K121K3081M1508N7066P0205
$$ plain form
59836 7271775 7352703 7440775 7530932 7617562 7695392 7759292 7803750 7823318 7813803 7772916 7700008
59825 7700008 7595811 7462537 7303568 7122555 6923055 6709268 6486499 6260064 6033751
59816 6033751 5809810 5590336 5377955 5174940 4982245 4799896 4628156 4467940 4320117
59807 4320117 4184714 4060919 3947784 3844739 3751351 3666716 3589363 3517861 3451360 3389378
59797 3389378 3331251 3276052 3223001 3171821 3122764 3076356 3033038 2992933 2956129 2923095 2894346
59786 2894346 2869464 2846876 2825064 2803664 2782893 2762234 2740337 2716076 2689055 2659192 2626683
59775 2626683 2592617 2558894 2527050 2497475 2470014 2444962 2423175 2405541 2392642 2384722 2381703 2383358
59763 2383358 2389623 2400566 2416083 2435891 2459858 2487938 2519663 2554187 2591084 2630660 2673182
$$ packed form
59836G271775Q0928Q8072R0157Q6630P7830O3900M4458J9568r515m0887p2908
59825G700008j04197j33274j58969j81013j99500k13787k22769k26435k26313
59816F033751k23941k19474k12381k03015j92695j82349j71740j60216j47823
59807D320117j35403j23795j13135j03045r3388q4635p7353p1502o6501o1982
59797C389378n8127n5199n3051n1180m9057m6408m3318m0105l6804l3034k8749
59786B894346k4882k2588k1812k1400k0771k0659k1897k4261k7021k9863l2509
59775B626683l4066l3723l1844k9575k7461k5052k1787j7634j2899p920l019J655
59763B383358O265J0943J5517J9808K3967K8080L1725L4524L6897L9576M2522
$$ plain form
59752 2673182 2718112 2764459 2811491 2858530 2904155 2946182 2982713 3013167 3038278 3059276 3077089
59741 3077089 3092256 3105439 3117809 3130717 3145211 3162122 3182566 3207937 3239459 3278179 3325466
59730 3325466 3383019 3452249 3534094 3629618 3740219 3866992 4010353 4170706 4348970 4545906
59720 4545906 4761226 4993687 5241518 5501809 5769541 6037663 6297908 6540747 6754729
59711 6754729 6927338 7048049 7111505 7118608 7075497 6991777 6878678 6747195 6606554 6463573
59701 6463573 6322953 6187930 6060722 5942767 5834983 5738159 5653204 5580998 5522110 5476886
59691 5476886 5445867 5429869 5429481 5444665 5475076 5520695 5581914 5659085 5752343 5862009 5989018
59680 5989018 6134705 6300183 6486133 6693338 6923298 7177993 7458921 7766639 8101375
$$ packed form
59752B673182M4930M6347M7032M7039M5625M2027L6531L0454K5111K0998J7813
59741C077089J5167J3183J2370J2908J4494J6911K0444K5371L1522L8720M7287
59730C325466N7553O9230Q1845R5524J10601J26773J43361J60353J78264J96936
59720D545906K15320K32461K47831K60291K67732K68122K60245K42839K13982
59711F754729J72609J20711O3456P103m3111q3720j13099j31483j40641j42981
59701F463573j40620j35023j27208j17955j07784r6824q4955p2206n8888m5224
59691E476886l1019j5998l88J5184L0411M5619O1219P7171R3258J09666J27009
59680E989018J45687J65478J85950K07205K29960K54695K80928L07718L34736
$$ plain form
59671 8101375 8463749 8854441 9273292 9719150 10190453 10685311 11200818 11732781 12276485
59662 12276485 12827381 13380782 13931415 14473909 15003982 15519294 16019785 16507796 16987806
59653 16987806 17465397 17945940 18433784 18932046 19442556 19965641 20499768 21041002 21582661
59644 21582661 22115662 22629563 23113478 23556525 23948353 24280154 24545694 24741962 24869677
59635 24869677 24933588 24941877 24904668 24832904 24738362 24633797 24532040 24444699 24381797 24352267 24364178
59624 24364178 24424475 24538900 24712290 24948634 25250676 25619468 26054150 26551719 27106693
59615 27106693 27710674 28351912 29015040 29681296 30328902 30933149 31466722 31901486 32211725
59606 32211725 32377104 32384316 32228275 31913468 31454090 30871616 30191029 29437935 28636933 27810119
$$ packed form
59671H101375L62374L90692M18851M45858M71303M94858N15507N31963N43704
59662A2276485N50896N53401N50633N42494N30073N15312N00491M88011M80010
59653A6987806M77591M80543M87844M98262N10510N23085N34127N41234N41659
59644B1582661N33001N13901M83915M43047L91828L31801K65540J96268J27715
59635B4869677O3911Q289l7209p1764r4542j04565j01757q7341o2902k9530J1911
59624B4364178O0297J14425J73390K36344L02042L68792M34682M97569N54974
59615B7106693O03981O41238O63128O66256O47606O04247N33573M34764L10239
59606C2211725J65379P212j56041l14807m59378n82474o80587p53094q01002q26814
$$ plain form
59596 27810119 26975593 26147004 25334071 24542957 23776110 23032218 22306579 21591576 20877497
59587 20877497 20154339 19414283 18653797 17874726 17084160 16292676 15511211 14748495 14010729
59578 14010729 13302732 12628412 11990117 11388302 10822206 10290640 9792419 9326797 8893668
59569 8893668 8492806 8122710 7780750 7464661 7173378 6906212 6661820 6438431 6234590
59560 6234590 6049015 5879879 5724798 5581638 5449103 5326423 5212559 5105649 5003232
59551 5003232 4903153 4804324 4706561 4609706 4513152 4416214 4318727 4221235 4124739 4030262 3938407
59540 3938407 3849344 3763410 3681602 3605095 3534320 3469002 3409153 3355425 3308209 3266939 3230786
59529 3230786 3199706 3174215 3154344 3139352 3128535 3121828 3119455 3121301 3126873 3135623 3147100 3160863
$$ packed form
59596B7810119q34526q28589q12933p91114p66847p43892p25639p15003p14079
59587B0877497p23158p40056p60486p79071p90566p91484p81465p62716p37766
59578A4010729p07997o74320o38295o01815n66096n31566m98221m65622m33129
59569H893668m00862l70096l41960l16089k91283k67166k44392k23389k03841
59560F234590j85575j69136j55081j43160j32535j22680j13864j06910j02417
59551E003232j00079r8829r7763r6855r6554r6938r7487r7492r6496r4477r1855
59540C938407q9063q5934q1808p6507p0775o5318n9849n3728m7216m1270l6153
59529C230786l1080k5491j9871j4992j0817o707k373J846N572Q750J1477J3763
$$ plain form
59517 3160863 3176623 3194562 3215302 3239339 3266540 3296438 3329065 3365297 3406237 3452507 3504361
59506 3504361 3562307 3627246 3699960 3780816 3870084 3968325 4076342 4194877 4324524 4465793
59496 4465793 4619090 4784620 4962412 5152465 5354766 5569046 5794546 6030174 6274941
59487 6274941 6528004 6787946 7052156 7317345 7580769 7840666 8095482 8343237 8581972
59478 8581972 8810480 9028352 9235592 9432437 9619054 9794986 9959361 10112181 10255128
59469 10255128 10390482 10519462 10642068 10757985 10866461 10965116 11049778 11115891 11159577 11177159
59459 11177159 11164512 11117566 11033323 10910280 10748451 10549591 10317201 10055821 9770134 9464785
59449 9464785 9144737 8815416 8482316 8150328 7823255 7503843 7194328 6896870 6613377
$$ packed form
59517C160863J5760J7939K0740K4037K7201K9898L2627L6232M0940M6270N1854
59506C504361N7946O4939P2714Q0856Q9268R8241J08017J18535J29647J41269
59496D465793J53297J65530J77792J90053K02301K14280K25500K35628K44767
59487F274941K53063K59942K64210K65189K63424K59897K54816K47755K38735
59478H581972K28508K17872K07240J96845J86617J75932J64375J52820J42947
59469A0255128J35354J28980J22606J15917J08476R8655Q4662O6113M3686J7582
59459A1177159j2647m6946q4243j23043j61829j98860k32390k61380k85687l05349
59449I464785l20048l29321l33100l31988l27073l19412l09515k97458k83493
$$ plain form
59440 6613377 6345195 6093268 5858420 5641078 5440896 5257184 5089629 4938089 4801813
59431 4801813 4679643 4571179 4477074 4397876 4333200 4282396 4245442 4222649 4213929 4218967 4237816
59420 4237816 4270785 4317848 4378692 4453341 4542355 4646348 4765526 4899581 5047657 5208275
59410 5208275 5379415 5558750 5743729 5931415 6118204 6299659 6470726 6626346 6761877
59401 6761877 6872902 6954964 7004167 7018368 6997610 6943349 6857646 6743184 6603591 6443226
59391 6443226 6266650 6078292 5882314 5682419 5481664 5282383 5086209 4894350 4708183
59382 4708183 4529506 4359816 4199456 4048027 3905653 3773171 3650970 3538354 3434491
59373 3434491 3339326 3253077 3175387 3105653 3043807 2990110 2944312 2905627 2873424 2847458 2827549
$$ packed form
59440F613377k68182k51927k34848k17342k00182j83712j67555j51540j36276
59431D801813j22170j08464r4105p9198o4676n0804l6954k2793q720N038J8849
59420D237816L2969M7063O0844P4649Q9014J03993J19178J34055J48076J60618
59410E208275J71140J79335J84979J87686J86789J81455J71067J55620J35531
59401F761877J11025Q2062M9203J4201k0758n4261q5703j14462j39593j60365
59391F443226j76576j88358j95978j99895k00755j99281j96174j91859j86167
59382D708183j78677j69690j60360j51429j42374j32482j22201j12616j03863
59373C434491r5165q6249p7690o9734o1846n3697m5798l8685l2203k5966j9909
$$ plain form
59362 2827549 2813528 2805370 2802810 2804856 2810307 2818932 2831650 2849303 2871664 2897944 2927909 2961916
59350 2961916 2999846 3040459 3082211 3124682 3168970 3216777 3269503 3328419 3395237 3471867 3559696
59339 3559696 3659603 3772523 3899248 4039481 4192001 4356446 4534693 4730093 4945717 5183691
59329 5183691 5445600 5732562 6044868 6382116 6743729 7128799 7535320 7959883 8398113
59320 8398113 8844854 9293785 9737455 10168318 10579980 10967657 11327888 11658261 11957404
59311 11957404 12224887 12460798 12665258 12838280 12979937 13090258 13168729 13214012 13224500 13199122
59301 13199122 13137464 13039479 12905892 12739204 12544001 12326069 12091437 11846087 11595601 11344305
59291 11344305 11094800 10848501 10606094 10367030 10129091 9889225 9644817 9393848 9134326
$$ packed form
59362B827549j4021q158k560K046N451Q625J2718J7653K2361K6280K9965L4007
59350B961916L7930M0613M1752M2471M4288M7807N2726N8916O6818P6630Q7829
59339C559696R9907J12920J26725J40233J52520J64445J78247J95400K15624K37974
59329E183691K61909K86962L12306L37248L61613L85070M06521M24563M38230
59320H398113M46741M48931M43670M30863M11662L87677L60231L30373K99143
59311A1957404K67483K35911K04460J73022J41657J10321P8471M5283J0488k5378
59301A3199122o1658r7985j33587j66688j95203k17932k34632k45350k50486k51296
59291A1344305k49505k46299k42407k39064k37939k39866k44408k50969k59522
$$ plain form
59282 9134326 8864644 8584818 8296883 8003756 7707993 7411636 7116811 6825981 6541687
59273 6541687 6266158 6001131 5747861 5507198 5279531 5064700 4862181 4671624 4493138
59264 4493138 4327018 4173289 4031580 3901186 3781121 3670404 3568590 3475798 3391906 3315926
59254 3315926 3246647 3183864 3128555 3081666 3043001 3011447 2986079 2966831 2954136 2948196 2948805 2955766
59242 2955766 2969127 2988892 3014883 3047233 3086726 3134104 3189202 3251343 3320513 3397506 3482875
59231 3482875 3576591 3678919 3790816 3912979 4045189 4187067 4338793 4500389 4670829 4848469
59221 4848469 5031881 5219538 5409116 5597874 5783378 5963118 6133748 6291579 6433650
59212 6433650 6557643 6661150 6741995 6799058 6831716 6838553 6817899 6770000 6697815 6605406 6496484
$$ packed form
59282I134326k69682k79826k87935k93127k95763k96357k94825k90830k84294
59273F541687k75529k65027k53270k40663k27667k14831k02519j90557j78486
59264D493138j66120j53729j41709j30394j20065j10717j01814r2792q3892p5980
59254C315926o9279o2783n5309m6889l8665l1554k5368j9248j2695n940O09O961
59242B955766J3361J9765K5991L2350L9493M7378N5098O2141O9170P6993Q5369
59231C482875R3716J02328J11897J22163J32210J41878J51726J61596J70440J77640
59221D848469J83412J87657J89578J88758J85504J79740J70630J57831J42071
59212F433650J23993J03507Q0845N7063L2658O837k0654m7899p2185r2409j08922
$$ plain form
59201 6496484 6374785 6244664 6110320 5974842 5840582 5709999 5585544 5469011 5361572
59192 5361572 5264326 5178496 5105313 5045928 5001209 4971405 4956398 4956565 4973061 5007071 5059184 5129836
59180 5129836 5219885 5330378 5462101 5615820 5792558 5993083 6217203 6463969 6732216 7020337
59170 7020337 7325658 7644557 7973022 8306335 8638104 8960204 9263870 9540377 9780666
59161 9780666 9975385 10116446 10198740 10220174 10180442 10080496 9923206 9713712 9458598 9164956
59151 9164956 8840468 8493801 8134017 7769138 7405294 7046918 6697278 6358761 6033156
59142 6033156 5721974 5426400 5146965 4883639 4636354 4405118 4189513 3988521 3801095
59133 3801095 3626495 3463873 3312011 3169954 3037555 2914895 2801398 2695974 2597790 2506316
$$ packed form
59201F496484j21699j30121j34344j35478j34260j30583j24455j16533j07439
59192E361572r7246q5830p3183n9385m4719k9804j5007J67J6496L4010N2113P0652
59180E129836R0049J10493J31723J53719J76738K00525K24120K46766K68247K88121
59170G020337L05321L18899L28465L33313L31769L22100L03666K76507K40289
59161I780666J94719J41061Q2294K1434l9732r9946j57290k09494k55114k93642
59151I164956l24488l46667l59784l64879l63844l58376l49640l38517l25605
59142F033156l11182k95574k79435k63326k47285k31236k15605k00992j87426
59133C801095j74600j62622j51862j42057j32399j22660j13497j05424r8184r1474
$$ plain form
59123 2506316 2420854 2340726 2265899 2196771 2133151 2074051 2018728 1967464 1920893 1878872 1840400
59112 1840400 1804577 1771388 1741481 1715300 1692497 1672246 1654105 1638384 1625652 1616190 1610114 1607661
59100 1607661 1608937 1613562 1621021 1631234 1644351 1660154 1678255 1698929 1723103 1751274 1782912 1817178
59088 1817178 1853917 1893592 1936540 1982713 2032096 2084995 2141715 2202029 2265281 2331279 2401025
59077 2401025 2476124 2557249 2643611 2734338 2830043 2932520 3043155 3162283 3289948 3426477
59067 3426477 3572095 3726509 3889157 4059391 4236308 4418921 4606721 4799540 4996483
59058 4996483 5195341 5393367 5588238 5777846 5959560 6130274 6287091 6427432 6548311
59049 6548311 6645803 6715412 6753050 6756034 6723650 6657092 6558843 6432138 6281040 6110804 5927613
$$ packed form
59123B506316q5462q0128p4827o9128o3620n9100n5323n1264m6571m2021l8472
59112A840400l5823l3189k9907k6181k2803k0251j8141j5721j2732r462o076k453
59100A607661J276M625P459J0213J3117J5803J8101K0674K4174K8171L1638L4266
59088A817178L6739L9675M2948M6173M9383N2899N6720O0314O3252O5998O9746
59077B401025P5099Q1125Q6362R0727R5705J02477J10635J19128J27665J36529
59067C426477J45618J54414J62648J70234J76917J82613J87800J92819J96943
59058D996483J98858J98026J94871J89608J81714J70714J56817J40341J20879
59049F548311R7492O9609L7638K984l2384o6558r8249j26705j51098j70236j83191
$$ plain form
59038 5927613 5737306 5544149 5350965 5160494 4976129 4800833 4635620 4479874 4333336
59029 4333336 4197119 4072506 3959556 3857506 3765963 3684861 3613644 3551415 3497935 3453682
59019 3453682 3418808 3392626 3374170 3362651 3357237 3356925 3360774 3367828 3376733 3385894 3393968 3399717 3401448
59006 3401448 3397324 3386312 3368175 3342446 3308235 3265387 3215114 3159016 3098004 3032553 2963346
58995 2963346 2891101 2816177 2738891 2659878 2579663 2498226 2415550 2332416 2250187 2169936 2092139
58984 2092139 2017062 1945055 1876510 1811780 1750988 1693804 1639722 1588787 1541754 1499185 1460670
58973 1460670 1425235 1392310 1361912 1334151 1309005 1286455 1266438 1248657 1232748 1218567 1206065
58962 1206065 1194975 1184905 1175763 1167775 1161066 1155432 1150616 1146616 1143579 1141457 1139949 1138936 1138885 1140567
$$ packed form
59038E927613j90307j93157j93184j90471j84365j75296j65213j55746j46538
59029D333336j36217j24613j12950j02050r1543q1102p1217o2229n3480m4253
59019C453682l4874k6182j8456j1519n414l12L849P054Q905R161Q074N749J731
59006C401448m124j1012j8137k5729l4211m2848n0273n6098o1012o5451o9207
58995B963346p2245p4924p7286p9013q0215q1437q2676q3134q2229q0251p7797
58984B092139p5077p2007o8545o4730o0792n7184n4082n0935m7033m2569l8515
58973A460670l5435l2925l0398k7761k5146k2550k0017j7781j5909j4181j2502
58962A206065j1090j0070r142p988o709n634m816m000l037k122j508j013n1J682
$$ plain form
58948 1140567 1144163 1148883 1153748 1158607 1164046 1170472 1177746 1185637 1194084 1202940 1212046 1221746 1232794 1245400
58934 1245400 1258836 1272386 1286334 1301602 1318605 1336867 1355596 1374384 1393428 1413315 1434495
58923 1434495 1456774 1479419 1501845 1524049 1546370 1569189 1593076 1618850 1647094 1677666 1709947
58912 1709947 1743501 1778381 1814921 1853362 1893636 1935456 1978722 2023733 2070809 2119750 2169963
58901 2169963 2221092 2273146 2325999 2379252 2432739 2486871 2542349 2599893 2660406 2724961 2794309
58890 2794309 2868620 2947886 3032492 3123319 3221495 3327974 3443135 3566934 3699811 3843238
58880 3843238 3998867 4167334 4348698 4544029 4755703 4985942 5235899 5506491 5799334
58871 5799334 6116330 6459011 6828734 7226923 7654507 8111591 8598010 9113548 9657002
$$ packed form
58948A140567L596M720M865M859N439O426P274P891Q447Q856R106R700J1048J2606
58934A245400J3436J3550J3948J5268J7003J8262J8729J8788J9044J9887K1180
58923A434495K2279K2645K2426K2204K2321K2819K3887K5774K8244L0572L2281
58912A709947L3554L4880L6540L8441M0274M1820M3266M5011M7076M8941N0213
58901B169963N1129N2054N2853N3253N3487N4132N5478N7544O0513O4555O9348
58890B794309P4311P9266Q4606R0827R8176J06479J15161J23799J32877J43427
58880C843238J55629J68467J81364J95331K11674K30239K49957K70592K92843
58871E799334L16996L42681L69723L98189M27584M57084M86419N15538N43454
$$ plain form
58862 9657002 10225445 10814734 11419940 12034443 12649113 13253070 13834809 14381891 14880225
58853 14880225 15315029 15672980 15943401 16118356 16193195 16167545 16045354 15833934 15543338 15186062
58843 15186062 14775826 14325464 13845746 13345853 12834196 12318401 11804794 11298278 10802674
58834 10802674 10321203 9856754 9411635 8987022 8582922 8199018 7835400 7492354 7169751
58825 7169751 6867061 6583722 6318888 6070938 5837780 5617892 5410826 5216566 5034599
58816 5034599 4863643 4702201 4549406 4405430 4270992 4146419 4031244 3924715 3826403 3736211
58806 3736211 3654061 3579749 3512937 3453157 3399939 3352929 3311654 3275336 3243518 3216910 3197029
58795 3197029 3184719 3179478 3180374 3187109 3199901 3218968 3244506 3276753 3315732 3361394 3414238 3475269
$$ packed form
58862I657002N68443N89289O05206O14503O14670O03957N81739N47082M98334
58853A4880225M34804L57951K70421J74955P4839k5650j22191k11420k90596l57276
58843A5186062m10236m50362m79718m99893n11657n15795n13607n06516m95604
58834A0802674m81471m64449m45119m24613m04100l83904l63618l43046l22603
58825G169751l02690k83339k64834k47950k33158k19888k07066j94260j81967
58816E034599j70956j61442j52795j43976j34438j24573j15175j06529r8312r0192
58806C736211q2150p4312o6812n9780n3218m7010m1275l6318l1818k6608j9881
58795C197029j2310n241Q96O735J2792J9067K5538L2247L8979M5662N2844O1031
$$ plain form
58783 3475269 3545057 3623460 3710501 3806791 3912666 4027780 4152193 4287200 4434330 4594158
58773 4594158 4766862 4953408 5155435 5374450 5611904 5869572 6149062 6451352 6777586
58764 6777586 7129823 7510121 7919274 8357224 8824116 9319707 9841900 10386842 10950105
58755 10950105 11526523 12108780 12687169 13250776 13787993 14285918 14730555 15108367 15407571
58746 15407571 15618560 15734569 15752693 15673982 15502685 15246125 14915051 14522656 14082165 13605233
58736 13605233 13102145 12582357 12054275 11524988 11000476 10485589 9983657 9496693 9026310
58727 9026310 8574143 8141462 7728898 7336620 6964280 6610850 6275273 5957402 5657720
58718 5657720 5376005 5110884 4860942 4625621 4404702 4197398 4002372 3818430 3644921
$$ packed form
58783C475269O9788P8403Q7041R6290J05875J15114J24413J35007J47130J59828
58773D594158J72704J86546K02027K19015K37454K57668K79490L02290L26234
58764F777586L52237L80298M09153M37950M66892M95591N22193N44942N63263
58755A0950105N76418N82257N78389N63607N37217M97925M44637L77812K99204
58746A5407571K10989J16009J8124p8711j71297k56560l31074l92395m40491m76932
58736A3605233n03088n19788n28082n29287n24512n14887n01932m86964m70383
58727I026310m52167m32681m12564l92278l72340l53430l35577l17871k99682
58718E657720k81715k65121k49942k35321k20919k07304j95026j83942j73509
$$ plain form
58709 3644921 3481578 3328094 3183829 3048080 2920714 2802185 2692550 2590844 2495877 2407357
58699 2407357 2325694 2251043 2183117 2121566 2065780 2014549 1966752 1922235 1881330 1843733 1808629
58688 1808629 1775691 1745028 1716292 1688776 1662378 1637481 1613873 1590729 1567705 1545078 1522688
58677 1522688 1499839 1476496 1453589 1431774 1410747 1390060 1369717 1349588 1329151 1308252 1287339
58666 1287339 1266486 1244965 1222366 1199415 1177168 1155897 1135252 1114907 1094557 1073826 1052772
58655 1052772 1032123 1012629 994449 977413 961401 946191 931425 917065 903482 890872 878985
58644 878985 867575 856587 845805 834952 824335 814715 806250 798193 789964 781825 774081 766335 758111
58631 758111 749724 741971 735340 729958 725882 722953 720737 719130 718704 719884 721911 723082 722123 719155 715439
$$ packed form
58709C644921j63343j53484j44265j35749j27366j18529j09635j01706r4967q8520
58699B407357q1663p4651o7926o1551n5786n1231m7797m4517m0905l7597l5104
58688A808629l2938l0663k8736k7516k6398k4897k3608k3144k3024k2627k2390
58677A522688k2849k3343k2907k1815k1027k0687k0343k0129k0437k0899k0913
58666A287339k0853k1521k2599k2951k2247k1271k0645k0345k0350k0731k1054
58655A052772k0649j9494j8180j7036j6012j5210j4766j4360j3583j2610j1887
58644H78985j1410j0988j0782j0853j0617r620q465q057q229q139p744p746q224
58631G58111q387p753o631n382m076k929k216j607m26J180K027J171r59k968l716
$$ plain form
58616 715439 712287 710111 708377 706467 704448 702805 701665 700674 699514 698164 696778 695744 695694 696997 699354
58601 699354 702359 706157 710937 716115 720846 725259 730323 736554 743764 752066 762155 774377 788286
58588 788286 803323 819269 835978 853506 872630 894447 919325 946899 977062 1010117 1046043
58577 1046043 1084690 1126748 1173464 1225253 1281682 1342965 1410309 1484540 1565701 1654388 1752213
58566 1752213 1860325 1978556 2106560 2244660 2392925 2550481 2716359 2889794 3068803
58557 3068803 3249423 3427124 3597943 3757385 3899336 4017401 4106814 4164422 4187961 4176885
58547 4176885 4133596 4062680 3968956 3856789 3730673 3595331 3455104 3313577 3173396 3036001
58537 3036001 2901946 2771933 2647150 2528423 2415856 2309725 2210829 2119305 2033932 1953410
$$ packed form
58616G15439l152k176j734j910k019j643j140r91j160j350j386j034n0J303K357
58601F99354L005L798M780N178M731M413N064O231P210Q302J0089J2222J3909
58588G88286J5037J5946J6709J7528J9124K1817K4878K7574L0163L3055L5926
58577A046043L8647M2058M6716N1789N6429O1283O7344P4231Q1161Q8687R7825
58566A752213J08112J18231J28004J38100J48265J57556J65878J73435J79009
58557C068803J80620J77701J70819J59442J41951J18065Q9413N7608K3539j1076
58547D176885m3289p0916r3724j12167j26116j35342j40227j41527j40181j37395
58537C036001j34055j30013j24783j18727j12567j06131r8896r1524q5373q0522
$$ plain form
58527 1953410 1877684 1807292 1742071 1681315 1624715 1572431 1524675 1481765 1443983 1410782 1380717
58516 1380717 1352765 1327097 1304058 1283147 1263633 1245408 1228525 1212674 1197858 1184779 1173710
58505 1173710 1163601 1153046 1141479 1128736 1114284 1097829 1079988 1061445 1042050 1021557 1000537
58494 1000537 979723 959116 938658 919006 900677 883170 865996 849840 835554 822567 809574
58483 809574 796381 783909 772688 762374 752466 742573 732341 722036 712800 705391 699083 692672 686081
58470 686081 679988 674402 668741 662975 657635 652956 648901 645667 643231 640867 638090 635659 634543 634297
58456 634297 633677 632560 632140 633320 635961 639551 643581 647272 649831 651045 650975 649311 645768 640810 635256
58441 635256 629363 622953 616007 608494 600117 590982 582018 573896 566104 557924 549703 542207 535378 528783
$$ packed form
58527A953410p5726p0392o5221o0756n6600n2284m7756m2910l7782l3201l0065
58516A380717k7952k5668k3039k0911j9514j8225j6883j5851j4816j3079j1069
58505A173710j0109j0555j1567j2743j4452j6455j7841j8543j9395k0493k1020
58494A000537k0814k0607k0458j9652j8329j7507j7174j6156j4286j2987j2993
58483H09574j3193j2472j1221j0314r908r893j0232j0305r236p409o308o411o591
58470F86081o093n586n661n766n340m679m055l234k436k364k777k431j116k46
58456F34297o20j117m20J180K641L590M030L691K559J214p0j664l543m958n554
58441F35256n893o410o946p513q377r135q964q122p792q180q221p496o829o595
$$ plain form
58427 528783 522766 517956 514047 510139 506008 502045 498336 494763 491618 489187 487119 485061 483365 482329
58413 482329 481420 480136 478892 477996 476636 474094 471158 468952 467100 464508 461322 458611 456678 455200 454446
58398 454446 454859 455927 456968 458514 461423 465228 468976 473097 478654 485260 491598 497591 504203 511483
58384 511483 518736 526239 534638 542841 548736 552076 554542 556820 557751 556641 554269 551102 546464 540134
58370 540134 532988 525502 517270 508528 500487 493565 486877 480062 474057 469418 465430 461587 458540 456877
58356 456877 456201 456034 456369 456788 456319 454877 453715 453886 455214 457217 459945 463483 467630 472470 478290 484685
58340 484685 490710 496180 501918 508655 516572 525730 535829 545780 554859 564048 574815 586714 597822
58327 597822 607356 616192 624823 632687 639598 645970 651303 654266 654656 653657 651875 648874 644956 641522 639082
$$ packed form
58427E28783o017m810l909l908m131l963l709l573l145k431k068k058j696j036
58413D82329r09j284j244q96j360k542k936k206j852k592l186k711j933j478p54
58398D54446M13J068J041J546K909L805L748M121N557O606O338N993O612P280
58384E11483P253P503Q399Q203N895L340K466K278R31j110k372l167m638o330
58370E40134p146p486q232q742q041o922o688o815o005m639l988l843l047j663
58356D56877o76j67L35M19m69j442j162J71J328K003K728L538M147M840N820O395
58340D84685O025N470N738O737P917R158J0099R951R079R189J0767J1899J1108
58327E97822R534Q836Q631P864O911O372N333K963L90r99j782l001l918l434k440
$$ plain form
58312 639082 636615 633431 630096 626979 623576 619856 616750 614641 612761 610607 608656 607299 606383 606098 606900
58297 606900 608325 609259 609556 609986 610614 610765 610569 610820 611408 611632 611900 613148 614759 615264 615073 616099 618654
58280 618654 621227 623533 627118 632396 637731 642130 646451 651255 655866 660204 665115 670306 674437 677875
58266 677875 682670 689077 694938 699386 704238 710596 716995 722343 727889 734724 741902 748726 756425 765894
58252 765894 775972 785597 795561 806636 818097 829520 841926 855745 869725 883125 896897 911511
58240 911511 925911 939827 954801 971687 989393 1007234 1026068 1046049 1065814 1085016 1104988
58229 1104988 1125818 1145711 1164460 1184457 1206913 1230219 1253473 1278288 1305398 1332932 1359968
58218 1359968 1388522 1419966 1452747 1485705 1520359 1557756 1596403 1635515 1676980 1721735 1767640
$$ packed form
58312F39082k467l184l335l117l403l720l106k109j880k154j951j357r16k85Q02
58297F06900J425R34K97M30O28J51j96K51N88K24K68J248J611N05j91J026K555
58280F18654K573K306L585N278N335M399M321M804M611M338M911N191M131L438
58266F77875M795O407N861M448M852O358O399N348N546O835P178O824P699R469
58252G65894J0078R625R964J1075J1461J1423J2406J3819J3980J3400J3772J4614
58240I11511J4400J3916J4974J6886J7706J7841J8834J9981J9765J9202J9972
58229A104988K0830J9893J8749J9997K2456K3306K3254K4815K7110K7534K7036
58218A359968K8554L1444L2781L2958L4654L7397L8647L9112M1465M4755M5905
$$ plain form
58207 1767640 1813353 1860919 1912056 1965403 2020097 2078456 2142244 2209712 2279262 2352584 2431147
58196 2431147 2513042 2596344 2682312 2772274 2864774 2958842 3056642 3159888 3267134 3377461 3493109
58185 3493109 3615538 3742865 3874137 4011941 4157826 4309700 4467000 4633587 4812104
58176 4812104 5000580 5198264 5409330 5636645 5877448 6129646 6396703 6681529 6981418
58167 6981418 7294167 7623269 7971724 8336973 8717667 9119264 9547025 10000094 10478610
58158 10478610 10989682 11539786 12128724 12758289 13439412 14183424 14994598 15879277 16853919
58149 16853919 17936099 19137637 20476452 21985907 23703717 25663619 27908686 30500506
58141 30500506 33505117 36986329 41025317 45725253 51176367 57436437 64567156 72661098
$$ packed form
58207A767640M5713M7566N1137N3347N4694N8359O3788O7468O9550P3322P8563
58196B431147Q1895Q3302Q5968Q9962R2500R4068R7800J03246J07246J10327J15648
58185C493109J22429J27327J31272J37804J45885J51874J57300J66587J78517
58176D812104J88476J97684K11066K27315K40803K52198K67057K84826K99889
58167F981418L12749L29102L48455L65249L80694M01597M27761M53069M78516
58158A0478610N11072N50104N88938O29565O81123P44012Q11174Q84679R74642
58149A6853919J082180J201538J338815J509455J717810J959902K245067K591820
58141C0500506L004611L481212M038988M699936N451114O260070P130719Q093942
$$ plain form
58133 72661098 81790710 91938901 103012339 114919343 127624500 141157216 155547184
58126 155547184 170559975 185242656 197703853 205634825 207426514 203011541 193735667
58119 193735667 181502472 167998895 154434448 141592828 129892209 119434628 110123217
58112 110123217 101789763 94248753 87317077 80860801 74830410 69233328 64085157 59397848
58104 59397848 55185032 51447872 48165217 45314320 42887721 40874646 39240567 37940441
58096 37940441 36939430 36210496 35729361 35477970 35414673 35404785 35202848 34557746 33361079
58087 33361079 31692259 29733728 27663514 25610909 23659786 21855929 20213883 18730811
58079 18730811 17396199 16191269 15091274 14075868 13134213 12259698 11446245 10690938 9993436
$$ packed form
58133G2661098R129612J0148191J1073438J1907004J2705157J3532716J4389968
58126A55547184J5012791J4682681J2461197P930972J791689m414973r275874
58119A93735667j2233195j3503577j3564447j2841620j1700619j0457581r311411
58112A10123217q333454p541010o931676o456276o030391n597082n148171m687309
58104E9397848m212816l737160l282655k850897k426599k013075j634079j300126
58096C7940441j001011p28934m81135k51391o3297r888k01937o45102j196667
58087C3361079j668820j958531k070214k052605j951123j803857j642046j483072
58079A8730811j334612j204930j099995j015406r41655q74515q13453p55307o97502
$$ plain form
58070 9993436 9350434 8755206 8203171 7693070 7222482 6787009 6383867 6011576 5666275
58061 5666275 5342962 5040101 4758657 4497176 4252162 4022566 3809376 3611368 3425473
58052 3425473 3250619 3086938 2931939 2781777 2635870 2496509 2364761 2240493 2125187
58043 2125187 2020506 1924876 1835353 1751873 1675818 1605735 1538800 1475446 1418072 1366020 1316271
58032 1316271 1268522 1225071 1185973 1148726 1112716 1079767 1050119 1021763 993993 967935 943367
58021 943367 918563 893486 869772 847427 824850 802228 781527 762953 744686 726355 709585
58010 709585 694823 680737 667118 655338 645444 635670 625316 615566 607120 599497 592842 587838 583668
57997 583668 578554 572512 567054 562133 556031 548476 541257 535383 530077 524917 520506 516678 512325 507432
$$ packed form
58070I993436o43002n95228n52035n10101m70588m35473m03142l72291l45301
58061E666275l23313l02861k81444k61481k45014k29596k13190j98008j85895
58052C425473j74854j63681j54999j50162j45907j39361j31748j24268j15306
58043B125187j04681r5630q9523q3480p6055p0083o6935o3354n7374n2052m9749
58032A316271m7749m3451l9098l7247l6010l2949k9648k8356k7770k6058k4568
58021I43367k4804k5077k3714k2345k2577k2622k0701j8574j8267j8331j6770
58010G09585j4762j4086j3619j1780r894r774j0354r750q446p623o655n004m170
57997E83668n114o042n458m921o102p555p219n874n306n160m411l828m353m893
$$ plain form
57983 507432 503211 500031 497290 495280 494928 495637 495785 495441 496217 498330 500284 501699 503844 506885 509017
57968 509017 509019 507488 504955 500928 495504 489901 484642 478972 472611 466432 460873 455350 449619 444124 438756
57953 438756 432874 426725 421179 415945 409868 403091 397052 392183 387489 382530 377903 373566 368737 363745
57939 363745 359973 357572 355204 352465 350554 350013 349773 349080 348561 348756 349318 350279 352409 355637 358658 360749
57923 360749 362524 364504 366411 368256 370547 372983 374484 374846 374787 374160 371943 368375 365201 363166 361042
57908 361042 357750 353686 349304 344165 338218 332457 327435 322550 317471 312843 308910 304941 300693 297056
57894 297056 294541 292520 290494 288693 286859 284077 280513 277760 276631 275998 274608 272637 270774 269118
57880 269118 267781 267138 266817 265795 264162 263284 263551 263631 262848 262564 264012 266278 267734 268189 268292 268002 267092
$$ packed form
57983E07432m221l180k741k010l52P09J48l44P76K113J954J415K145L041K132
57968E09017Kj531k533m027n424n603n259n670o361o179n559n523n731n495n368
57953D38756n882o149n546n234o077o777o039m869m694m959m627m337m829m992
57939C63745l772k401k368k739j911n41k40o93n19J95N62R61K130L228L021K091
57923C60749J775J980J907J845K291K436J501L62n9o27k217l568l174k035k124
57908C61042l292m064m382n139n947n761n022m885n079m628l933l969m248l637
57894B97056k515k021k026j801j834k782l564k753j129o33j390j971j863j656
57880B69118j337o43l21j022j633q78K67Q0p83k84J448K266J456M55J03k90r10
$$ plain form
57863 267092 266283 266531 267757 269325 271144 273441 276051 278738 281645 284873 288287 292107 296819 302062 306623
57848 306623 309968 312744 315347 317273 318381 319424 320607 320936 319818 318012 316167 313706 310102 306018
57834 306018 302135 298024 293280 288648 284860 281329 277117 272343 267597 262875 258140 254067 251149 248800
57820 248800 246315 243914 242002 240337 238878 238541 239985 242500 245093 247828 251048 254281 257089 260141
57806 260141 264109 268210 271176 273090 274997 277194 279139 280566 281470 281400 279950 277619 275131 272276 268493
57791 268493 264224 260472 257247 253589 249062 244206 239526 234966 230443 226129 222112 218262 214454 210560
57777 210560 206435 202208 198286 194722 191032 186967 182939 179287 175808 172376 169279 166419 163037 158832
57763 158832 154591 150945 147339 143049 138428 134228 130423 126708 123474 121208 119400 117103 114247 111493
$$ packed form
57863B67092q09K48J226J568J819K297K610K687K907L228L414L820M712N243M561
57848C06623L345K776K603J926J108J043J183L29j118j806j845k461l604m084
57834C06018l883m111m744m632l788l531m212m774m746m722m735m073k918k349
57820B48800k485k401j912j665j459l37J444K515K593K735L220L233K808L052
57806B60141L968M101K966J914J907K197J945J427R04p0j450k331k488k855l783
57791B68493m269l752l225l658m527m856m680m560m523m314m017l850l808l894
57777B10560m125m227l922l564l690m065m028l652l479l432l097k860l382m205
57763A58832m241l646l606m290m621m200l805l715l234k266j808k297k856k754
$$ plain form
57749 111493 109152 107125 105534 104583 104060 103677 103516 103619 103667 103747 104733 107096 109991 112394 114512 117170 120506
57732 120506 124233 128473 133170 137233 139517 140264 140465 140235 139053 137229 135826 135248 135033 134863 134713 134226
57716 134226 133119 132135 132409 133862 135301 136155 137047 138511 140132 141244 141771 142157 143051 145053 148178 151576
57700 151576 154356 156557 158742 160860 162301 162963 163582 165001 167584 171147 174954 178067 180279 182372 185037
57685 185037 188039 191008 194295 198194 202068 205301 208522 212709 217582 222184 226637 231934 238245 244847
57671 244847 251689 259556 268573 277870 286992 296399 306326 316325 326381 337378 349981 363884 378509
57658 378509 393613 408951 424221 439788 456632 475171 494807 514952 535888 558321 582757
57647 582757 609596 639158 671356 705893 743071 783810 828744 877970 931900 991606 1057939
$$ packed form
57749A11493k341k027j591r51n23l83j61J03M8Q0R86K363K895K403K118K658L336
57732A20506L727M240M697M063K284P47K01k30j182j824j403n78k15j70j50m87
57716A34226j107r84K74J453J439Q54Q92J464J621J112N27L86Q94K002L125L398
57700A51576K780K201K185K118J441O62O19J419K583L563L807L113K212K093K665
57685A85037L002K969L287L899L874L233L221M187M873M602M453N297O311O602
57671B44847O842P867R017R297R122R407R927R999J0056J0997J2603J3903J4625
57658C78509J5104J5338J5270J5567J6844J8539J9636K0145K0936K2433K4436
57647E82757K6839K9562L2198L4537L7178M0739M4934M9226N3930N9706O6333
$$ plain form
57636 1057939 1130901 1210297 1296528 1390348 1492193 1602121 1720132 1846259 1980370 2121799
57626 2121799 2268912 2419121 2569578 2717622 2860179 2993041 3111471 3211613 3291188 3349300
57616 3349300 3386406 3404323 3405599 3392858 3369127 3338359 3304521 3269744 3233337 3192030 3140636
57605 3140636 3073440 2986885 2881877 2763414 2638091 2512067 2390229 2275544 2168757 2069477
57595 2069477 1977665 1893548 1816553 1745519 1680048 1620765 1568255 1522631 1484049 1452625 1427850
57584 1427850 1409053 1396449 1390717 1391575 1397919 1409489 1427268 1452095 1484064 1523545 1571592 1628833
57572 1628833 1694927 1769477 1852484 1943477 2041196 2144556 2252947 2365007 2477956 2588507
57562 2588507 2693533 2789441 2871977 2937447 2983433 3007890 3008631 2984747 2938022 2872156 2790943
$$ packed form
57636A057939P2962P9396Q6231R3820J01845J09928J18011J26127J34111J41429
57626B121799J47113J50209J50457J48044J42557J32862J18430J00142P9575N8112
57616C349300L7106J7917J276j2741k3731l0768l3838l4777l6407m1307n1394
57605C140636o7196q6555j05008j18463j25323j26024j21838j14685j06787r9280
57595B069477r1812q4117p6995p1034o5471n9283n2510m5624l8582l1424k4775
57584A427850j8797j2604n732Q58O344J1570J7779K4827L1969L9481M8047N7241
57572A628833O6094P4550Q3007R0993R7719J03360J08391J12060J12949J10551
57562B588507J05026R5908Q2536O5470M5986K4457P41k3884m6725o5866q1213
$$ plain form
57551 2790943 2697622 2595369 2487479 2376978 2266179 2156406 2048181 1942174 1839901 1742806
57541 1742806 1650767 1562488 1477503 1396839 1321539 1251595 1186594 1126232 1069742 1016012 964973
57530 964973 917861 875383 836557 800066 765779 734088 704654 676842 650768 626984 605602
57519 605602 586498 569752 555081 541432 528013 515253 503950 493983 484686 476049 468663 462819
57507 462819 458434 455550 454172 453905 454429 456008 458929 462866 467483 473254 480938 490609 501907 514857
57493 514857 529651 545985 563507 582689 604388 628742 655325 684278 716340 751739 789927
57482 789927 830719 875081 924466 979696 1040621 1106604 1177193 1252500 1332902 1418299 1507775
57471 1507775 1600016 1693632 1786785 1876880 1960975 2036304 2100233 2150200 2184090 2200505 2198591
$$ packed form
57551B790943r3321j02253j07890j10501j10799j09773j08225j06007j02273r7095
57541A742806r2039q8279q4985q0664p5300o9944o5001o0362n6490n3730n1039
57530I64973m7112m2478l8826l6491l4287l1691k9434k7812k6074k3784k1382
57519F05602j9104j6746j4671j3649j3419j2760j1303r967r297q637p386n844
57507D62819m385k884j378k67N24J579K921L937M617N771P684R671J1298J2950
57493E14857J4794J6334J7522J9182K1699K4354K6583K8953L2062L5399L8188
57482G89927M0792M4362M9385N5230O0925O5983P0589P5307Q0402Q5397Q9476
57471A507775R2241R3616R3153R0095Q4095P5329O3929M9967L3890J6415j914
$$ plain form
57460 2198591 2178347 2141472 2091264 2031019 1962897 1888701 1810934 1732194 1653928 1576691 1501428
57449 1501428 1429582 1361988 1298431 1238403 1181764 1128611 1079031 1033152 991097 952835 918261
57438 918261 887305 859821 835598 814729 797626 784370 774348 766865 761925 760119 762099 768341
57426 768341 778978 793515 811231 832243 857664 888255 923531 962790 1006394 1055246 1109436
57415 1109436 1168330 1231684 1299730 1372179 1447999 1526181 1605953 1685946 1763581 1835435 1897963
57404 1897963 1948015 1983226 2002107 2003727 1987582 1954050 1904765 1842167 1768876 1687696 1601715
57393 1601715 1513694 1425388 1337765 1251716 1168171 1087789 1011006 938260 869862 805778 745819
57382 745819 689764 637189 587585 540928 497633 457653 420181 384624 351213 320181 291078
$$ packed form
57460B198591k0244l6875n0208o0245o8122p4196p7767p8740p8266p7237p5263
57449A501428p1846o7594o3557o0028n6639n3153m9580m5879m2055l8262l4574
57438I18261l0956k7484k4223k0869j7103j3256j0022p483m940j806J980O242
57426G68341J0637J4537J7716K1012K5421L0591L5276L9259M3604M8852N4190
57415A109436N8894O3354O8046P2449P5820P8182P9772P9993P7635P1854O2528
57404A897963N0052L5211J8881J620j6145l3532m9285o2598p3291q1180q5981
57393A601715q8021q8306q7623q6049q3545q0382p6783p2746o8398o4084n9959
57382G45819n6055n2575m9604m6657m3295l9980l7472l5557l3411l1032k9103
$$ plain form
57371 291078 263563 238152 215308 194337 174219 155124 138084 123322 109889 96945 84509
57360 84509 72894 62131 52093 42646 33596 24922 17005 10231 4518 -395 -4499 -7805 -10759 -13818
57346 -13818 -16918 -19845 -22815 -26083 -29362 -32189 -34542 -36533 -37954 -38798 -39730 -41264 -42963 -44237 -45390
57331 -45390 -46949 -48495 -49314 -49864 -51327 -53823 -56237 -57811 -58847 -59831 -60876 -62154 -63902 -65884 -67666
57316 -67666 -69397 -71477 -73554 -74791 -75096 -75099 -74949 -74161 -72734 -71392 -70612 -70334 -70636 -71618 -72553 -72312 -70873
57299 -70873 -69438 -68830 -68745 -68692 -68558 -68013 -66579 -64668 -63501 -63582 -64189 -64701 -65339 -66251 -67003 -67451 -67986 -68436 -67951
57280 -67951 -66620 -65907 -66563 -67257 -66408 -64385 -62672 -61630 -60413 -58665 -57015 -55995 -55456 -55004 -54217 -52545
57264 -52545 -49737 -46333 -43130 -40256 -37274 -34018 -30752 -27646 -24643 -21784 -19120 -16293 -12676 -8090
$$ packed form
57371B91078k7515k5411k2844k0971k0118j9095j7040j4762j3433j2944j2436
57360H4509j1615j0763j0038r447r050q674p917o774D518c95m104l306k954l059
57346a3818l100k927k970l268l279k827k353j991j421q44r32j534j699j274j153
57331d5390j559j546q19n50j463k496k414j574j036r84j045j278j748j982j782
57316f7666j731k080k077j237l05lJ50P88J427J342P80K78l02r82r35K41J439
57299g0873J435O08Q5N3J34N45J434J911J167q1o07n12o38r12p52m48n35m50M85
57280f7951J331P13o56o94Q49K023J713J042J217J748J650J020N39M52P87J672
57264e2545K808L404L203K874K982L256L266L106L003K859K664K827L617M586
$$ plain form
57250 -8090 -3093 1548 5658 9916 15318 22161 29620 36640 43186 50134 57908 65800 72856 78919 84496
57235 84496 90103 96083 102701 109991 117742 125855 134488 143712 153358 163362 173905 185058 196551
57222 196551 207975 218971 229239 238732 247735 256322 263805 269323 272922 275471 277481 278609 278295 276215
57208 276215 272138 266048 258416 249644 239357 227050 213319 199347 185217 169961 153460 136977
57196 136977 121410 106300 91199 76762 63727 51849 40699 30595 21887 14166 7037 932
57183 -3727 -7544 -11478 -15816 -20474 -25659 -31413 -37104 -42146 -46756 -51424 -56218 -61170 -66506 -71805 -75820
57168 -75820 -77921 -78792 -78775 -76429 -69984 -59509 -46407 -31346 -14008 5544 26652 48979 72589
57155 72589 97129 122016 147275 173205 199396 225013 249998 275087 300733 326780 352991 379011
$$ packed form
57250h090c093A548M110M258N402O843P459P020O546O948P774P892P056O063N577
57235H4496N607N980O618P290P751Q113Q633R224R646J0004J0543J1153J1493
57222A96551J1424J0996J0268R493R003Q587P483N518L599K549K010J128l14k080
57208B76215m077o090p632q772j0287j2307j3731j3972j4130j5256j6501j6483
57196A36977j5567j5110j5101j4437j3035j1878j1150j0104q708p721G037I32
57183c727l817l934m338m658n185n754n691n042m610m668m794m952n336n299m015
57168g5820k101q71J7K346O445J0475J3102J5061a4008E544K1108K2327K3610
57155G2589K4540K4887K5259K5930K6191K5617K4985K5089K5646K6047K6211K6020
$$ plain form
57143 379011 403937 426781 447350 466024 483019 498546 513260 527557 540831 552388 562806
57132 562806 573201 583412 592162 598954 604616 609929 614953 619941 625640 632153 638453 643568 647601 651154
57118 651154 654340 656778 658082 658016 656504 653723 649930 645159 639417 633017 626209 618494 608758 596202
57104 596202 580894 563467 544483 523837 500533 473348 441916 406706 367685 323787 274168
57093 274168 219116 158953 92872 19825 -60137 -146525 -239704 -340506 -449039 -565237 -690155
57082 -690155 -825447 -971929 -1129894 -1300427 -1484885 -1683252 -1894532 -2118848 -2357781 -2612619
57072 -2612619 -2883542 -3170642 -3474564 -3796255 -4137409 -4501139 -4890926 -5308911 -5756581
57063 -5756581 -6236982 -6754672 -7313531 -7916336 -8566629 -9269302 -10029283 -10851564 -11743047
$$ packed form
57143C79011K4926K2844K0569J8674J6995J5527J4714J4297J3274J1557J0418
57132E62806J0395J0211Q750O792N662N313N024M988N699O513O300N115M033L553
57118F51154L186K438J304o6j512k781l793m771n742o400o808p715r736j2556
57104E96202j5308j7427j8984k0646k3304k7185l1432l5210l9021m3898m9619
57093B74168n5052o0163o6081A9825f0137q6388r3179j00802j08533j16198j24918
57082f90155j35292j46482j57965j70533j84458j98367k11280k24316k38933k54838
57072b612619k70923k87100l03922l21691l41154l63730l89787m17985m47670
57063e756581m80401n17690n58859o02805o50293p02673p59981q22281q91483
$$ plain form
57054 -11743047 -12712648 -13769372 -14922455 -16184227 -17571168 -19101954 -20797175 -22682619
57046 -22682619 -24791743 -27165197 -29851755 -32912810 -36425920 -40485158 -45203023 -50715144
57038 -50715144 -57179942 -64769256 -73657807 -84014708 -95982247 -109630956 -124914702
57031 -124914702 -141669968 -159671842 -178705357 -198597322 -219192561 -240302743 -261667675
57024 -261667675 -282955018 -303802476 -323875424 -342882154 -360499843 -376240325 -389368591
57017 -389368591 -398981079 -404235821 -404605610 -400014700 -390816542 -377666808 -361366067 -342717985
57009 -342717985 -322431223 -301087497 -279171456 -257119614 -235342352 -214212997 -194051311
57002 -194051311 -175118889 -157615518 -141662071 -127278532 -114381567 -102815258 -92403461
$$ packed form
57054a1743047r69601j056724j153083j261772j386941j530786j695221j885444
57046b2682619k109124k373454k686558l061055l513110m059238m717865n512121
57038e0715144o464798p589314q888551j0356901j1967539j3648709j5283746
57031a24914702j6755266j8001874j9033515j9891965k0595239k1110182k1364932
57024b61667675k1287343k0847458k0072948j9006730j7617689j5740482j3128266
57017c89368591r612488n254742l69789M590910R198158J3149734J6300741J8648082
57009c42717985K0286762K1343726K1916041K2051842K1777262K1129355K0161686
57002a94051311J8932422J7503371J5953447J4383539J2896965J1566309J0411797
$$ plain form
56995 -92403461 -82995901 -74485248 -66794384 -59853189 -53584494 -47903043 -42720843 -37956321
56987 -37956321 -33548682 -29470910 -25728221 -22339106 -19313305 -16642433 -14304030 -12268801
56979 -12268801 -10504450 -8977278 -7654082 -6504345 -5501907 -4625728 -3859146 -3187882
56971 -3187882 -2598634 -2079511 -1620941 -1215371 -856229 -537521 -253860 -249 227857 433710
56961 433710 618861 784198 931273 1062271 1178993 1282457 1373281 1451795 1517771 1570531
56951 1570531 1609545 1634836 1646962 1646700 1634434 1609378 1569491 1512662 1438643 1350560 1255239 1161909
56939 1161909 1079419 1013293 964582 930782 907084 886940 863232 830958 789622 742753 694987
56928 694987 649617 608258 571576 539702 512215 488216 466465 445546 424214 401870 378659
$$ packed form
56995i2403461R407560Q510653P690864O941195O268695N681451N182200M764522
56987c7956321M407639M077772L742689L389115L025801K670872K338403K035229
56979a2268801J764351J527172J323196J149737J002438Q76179P66582O71264
56971c187882N89248N19123M58570M05570L59142L18708b53860b49B27857K05853
56961D33710J85151J65337J47075J30998J16722J03464R0824P8514O5976N2760
56951A570531L9014K5291J2126k62j2266k5056l9887n6829p4019q8083r5321r3330
56939A161909q2490o6126m8711l3800k3698k0144k3708l2274m1336m6869m7766
56928F94987m5370m1359l6682l1874k7487k3999k1751k0919k1332k2344k3211
$$ plain form
56917 378659 355133 331977 310032 290176 272816 257552 243596 230567 218777 208728 200568 194138
56905 194138 189431 186680 185974 187028 189525 193557 199509 207493 217009 227077 236494 243976 248455 249599
56891 249599 248092 245246 242244 239710 237862 236950 237447 239871 244433 250870 258602 267027 275723 284422 292975
56876 292975 301416 310069 319455 329908 341210 352615 363265 372462 379505 383512 383696 379871 372550
56863 372550 362612 351138 339404 328543 318946 310279 302302 295291 289385 283873 277765 271018 264562
56850 264562 258932 253371 246693 238718 230365 222397 214668 206742 198722 191002 183495 175757 167900 160790
56836 160790 155058 150466 146602 143744 142436 142488 143095 143886 145287 147838 151742 157099 163875 171440 178802
56821 178802 185599 192328 199285 205895 211613 216987 223235 231008 240059 249835 259851 269658 279066 288449
$$ packed form
56917C78659k3526k3156k1945j9856j7360j5264j3956j3029j1790j0049q160o430
56905A94138m707k751p06J054K497M032N952P984R516J0068R417P482M479J144
56891B49599j507k846l002k534j848r12M97K424M562O437P732Q425Q696Q699Q553
56876B92975Q441Q653R386J0453J1302J1405J0650R197P043M007J84l825p321
56863C72550r938j1474j1734j0861r597q667p977p011n906n512o108o747o456
56850B64562n630n561o678p975q353p968p729p926q020p720p507p738p857p110
56836A60790n732m592l864k858j308N2O07P91J401K551L904N357O776P565P362
56821A78802O797O729O957O610N718N374O248P773R051R776J0016R807R408R383
$$ plain form
56807 288449 298483 309641 322152 336249 352050 369316 387672 406906 426611 445611 462162
56796 462162 474786 482731 485849 484498 479564 472255 463822 455599 448926 444572 442300 441404 441644 443426
56782 443426 447321 453926 463978 477942 495406 515409 537454 561738 588254 616065 643421 667924
56770 667924 686448 695830 694605 684218 668139 649652 630453 611036 591870 573985 558501 545881
56758 545881 535816 527812 521612 517043 513953 512742 514643 520751 530706 542907 556200 570746 586760
56745 586760 602681 615081 620411 616831 604837 586730 565506 543700 522755 503174 485111 468681
56733 468681 453910 440721 429146 419421 411748 406042 402054 399719 399228 400755 404302 409826 417188 425666
56719 425666 433659 439258 441163 438930 432586 422547 409948 396448 383336 371041 359651 349451
$$ packed form
56807B88449J0034J1158J2511J4097J5801J7266J8356J9234J9705J9000J6551
56796D62162J2624P945L118j351m934p309q433q223o673m354k272q96K40J782
56782D43426L895O605J0052J3964J7464K0003K2045K4284K6516K7811K7356K4503
56770F67924J8524R382j225j0387j6079j8487j9199j9417j9166j7885j5484j2620
56758E45881j0065q004o200m569l090j211J901O108R955J2201J3293J4546J6014
56745E86760J5921J2400N330l580j1994j8107k1224k1806k0945j9581j8063j6430
56733D68681j4771j3189j1575r725p673n706l988k335m91J527L547N524P362Q478
56719D25666P993N599J905k233o344j0039j2599j3500j3112j2295j1390j0200
$$ plain form
56707 349451 340604 332623 324663 316276 307680 299456 292231 286322 281363 276466 271185 266165 262410 260037
56693 260037 258173 256085 253917 252227 251179 250435 249650 248798 247980 247004 245336 242656 239418 236557 234575
56678 234575 233231 232148 231233 230263 228611 225905 222640 219591 216913 214254 211541 209009 206653 204297 202171
56663 202171 200800 200241 199882 199095 197700 195832 193863 192499 192368 193271 194168 194092 192895 191097 189386 188285
56647 188285 187950 188059 188115 187937 187701 187570 187528 187444 187061 186074 184537 183002 181846 180750 179398 178393 178678 180080
56629 180080 181367 181921 182520 184032 186154 187970 189203 190193 191059 191588 191848 192346 193529 195450 197857 200331
56613 200331 202369 203667 204311 204600 204717 204716 204628 204386 203831 203034 202480 202645 203431 204229 204553 204429 204146 203847 203414
56594 203414 202727 201936 201472 201701 202545 203480 204044 204378 205179 207018 209670 212187 213678 213996 213595 212925 212217
$$ packed form
56707C49451q847p981p960q387q596q224p225n909m959m897n281n020l755k373
56693B60037j864k088k168j690j048p44p85q52q18r76j668k680l238k861j982
56678B34575j344j083r15r70j652k706l265l049k678k659k713k532k356k356k126
56663B02171j371n59l59p87j395j868j969j364j31R03Q97p6j197j798j711j101
56647A88285l35J09N6j78k36j31m2q4l83r87j537j535j156j096j352j005K85J402
56629A80080J287N54N99J512K122J816J233R90Q66N29K60M98J183J921K407K474
56613B00331K038J298O44K89J17jq8k42n55p97n54J65P86P98L24j24k83k99m33
56594B03414o87p91m64K29Q44R35N64L34Q01J839K652K517J491L18m01o70p08
$$ plain form
56577 212217 211718 211706 212119 212550 212790 213075 213557 213855 213492 212528 211401 210301 209101 207818 206770 206229 206140 206174
56559 206174 205920 205159 204138 203335 202792 201863 199931 197201 194515 192586 191645 191567 191946 192212 192050 191645 191385
56542 191385 191590 192584 194497 196687 197988 198085 198046 198808 199757 199751 199112 199405 201318 203878 205878 207053 207579 207401
56524 207401 206611 205810 205529 205654 205759 205652 205448 205493 206330 208262 210826 213200 215185 217254 219492 221180 221773
56507 221773 221734 222100 223550 226195 229822 234009 238263 242282 246034 249610 253242 257301 261829 266184 269577
56492 269577 271861 273366 274270 274785 275677 277571 279770 280807 280351 279608 279556 279717 279112 277548 275426 273064
56476 273064 270817 269192 268199 267114 265449 263691 262585 262155 261924 261649 261248 260450 259033 257161 255036 252563
56460 252563 249787 247313 245821 245361 245446 245581 245419 244783 243885 243244 243062 242952 242450 241427 239883 237812 235510
$$ packed form
56577B12217m99j2M13M31K40K85M82K98l63r64j127j100j200j283j048n41q9L4
56559B06174k54p61j021q03n43r29j932k730k686j929r41p8L79K66j62m05k60
56542A91385K05R94J913K190J301R7l9P62R49oo39K93J913K560K000J175N26j78
56524B07401p90q01k81J25J05j07k04M5Q37J932K564K374J985K069K238J688N93
56507B21773l9L66J450K645L627M187M254M019L752L576L632M059M528M355L393
56492B69577K284J505R04N15Q92J894K199J037m56p43n2J61o05j564k122k362
56476B73064k247j625r93j085j665j758j106m30k31k75m01p98j417j872k125k473
56460B52563k776k474j492m60Q5J35j62o36q98o41j82j10n02j023j544k071k302
$$ plain form
56443 235510 233544 232136 231008 229939 228904 227522 225203 222254 219995 219184 218991 218219 216953 216214 216436
56428 216436 217102 217634 217919 218094 218427 219320 220866 222445 223209 222960 222284 221966 222506 223986 226073 228268 230320
56411 230320 232268 234090 235737 237527 239961 242929 245719 248011 250197 252424 254128 255043 255915 257497 259452
56396 259452 260990 262123 263430 264961 266244 267180 268074 268836 268977 268543 268397 269263 270854 272163 272483 272023
56380 272023 271576 271595 271660 271061 269813 268711 268303 268188 267449 265457 262209 258324 254754 252020 249638 246760
56364 246760 243411 240496 238611 237559 237090 237251 237741 237855 237388 236865 236519 235918 234962 234357 234557 235155 235785
56347 235785 236730 238022 238873 238783 238397 238523 239057 239580 240201 240989 241443 241444 241965 243807 246307 248235 249362 250200
56329 250200 250832 251100 251384 252112 252973 253602 254554 256532 259084 261164 262579 263832 264947 265622 266259 267615
$$ packed form
56443B35510j966j408j128j069j035j382k319k949k259q11j93p72j266p39K22
56428B16436O66N32K85J75L33Q93J546J579P64k49o76l18N40J480K087K195K052
56411B30320J948J822J647J790K434K968K790K292K186K227J704R15Q72J582J955
56396B59452J538J133J307J531J283R36Q94P62J41m34j46Q66J591J309L20m60
56380B72023m47J9O5n99j248j102m08j15p39j992l248l885l570k734k382k878
56364B46760l349k915j885j052m69J61M90J14m67n23l46o01r56o05K00N98O30
56347B35785R45J292Q51r0l86J26N34N23O21P88M54JN21J842K500J928J127Q38
56329B50200O32K68K84P28Q61O29R52J978K552K080J415J253J115O75O37J356
$$ plain form
56313 267615 269505 270883 271185 270789 270277 270080 270596 271795 272895 273255 273317 273880 274824 275459 275753 276255 277087 278041
56295 278041 279393 281572 284178 286323 287789 288972 289947 290548 291176 292535 294714 297353 300415 303894 307173
56280 307173 309774 312393 316022 320323 324106 327214 330613 334663 338631 342044 345338 348967 352958 357476
56266 357476 362866 368908 374901 380567 386062 391244 395872 400465 405867 411945 417758 423028 428358 433961
56252 433961 439296 444131 448902 453836 458673 463423 468431 473502 477940 481681 485448 489543 493355 496383
56238 496383 499022 502040 505883 510586 515794 520935 526033 532198 540590 551057 562599 574883 588296
56225 588296 602720 617360 631850 646585 661936 678089 695662 715537 738042 762991 790343
56214 790343 820000 851341 884063 919277 958642 1002565 1050364 1102069 1158890 1221896 1291327
$$ packed form
56313B67615J890J378L02l96n12j97N16J199J100L60O2N63R44O35K94N02Q32R54
56295B78041J352K179K606K145J466J183R75O01O28J359K179K639L062L479L279
56280C07173K601K619L629M301L783L108L399M050L968L413L294L629L991M518
56266C57476N390O042N993N666N495N182M628M593N402O078N813N270N330N603
56252D33961N335M835M771M934M837M750N008N071M438L741L767M095L812L028
56238D96383K639L018L843M703N208N141N098O165Q392J0467J1542J2284J3413
56225E88296J4424J4640J4490J4735J5351J6153J7573J9875K2505K4949K7352
56214G90343K9657L1341L2722L5214L9365M3923M7799N1705N6821O3006O9431
$$ plain form
56203 1291327 1367207 1449727 1539122 1636010 1741497 1856017 1978580 2108211 2245288 2389981
56193 2389981 2540141 2692597 2846045 3000534 3154322 3303375 3444086 3574437 3692337
56184 3692337 3795071 3881105 3950663 4003930 4040311 4059921 4064153 4054271 4031076 3996374 3952995
56173 3952995 3902755 3845983 3783438 3716765 3646398 3570990 3489919 3404676 3316756 3225841 3131150
56162 3131150 3033126 2932618 2829728 2724697 2618832 2513465 2408858 2304974 2202464 2102171
56152 2102171 2004580 1910317 1820198 1734282 1651966 1573432 1499830 1431583 1367801 1307774 1251749
56141 1251749 1199771 1151199 1105830 1064065 1025509 988953 954265 922658 894464 868315 843262
56130 843262 819944 798839 779091 760134 742870 728155 715538 704445 695154 687623 680816 674225
$$ packed form
56203A291327P5880Q2520Q9395R6888J05487J14520J22563J29631J37077J44693
56193B389981J50160J52456J53448J54489J53788J49053J40711J30351J17900
56184C692337J02734Q6034O9558N3267L6381J9610M232r882k3195l4702m3379
56173C952995n0240n6772o2545o6673p0367p5408q1071q5243q7920r0915r4691
56162C131150r8024j00508j02890j05031j05865j05367j04607j03884j02510j00293
56152B102171r7591r4263r0119q5916q2316p8534p3602o8247o3782o0027n6025
56141A251749n1978m8572m5369m1765l8556l6556l4688l1607k8194k6149k5053
56130H43262k3318k1105j9748j8957j7264j4715j2617j1093r291p531o807o591
$$ plain form
56118 674225 668648 664529 660988 657459 654758 653496 652943 652478 652695 654060 656019 658438 662260 667550 672523
56103 672523 675825 678263 680991 683589 685376 687140 689938 693375 696515 699461 702763 706349 710178 714875
56089 714875 720762 727488 735421 745887 759111 773591 788664 805904 826759 850555 876270 904520
56077 904520 936276 971265 1009225 1051165 1097674 1147311 1198078 1248948 1298636 1344754 1386023
56066 1386023 1423761 1459526 1492842 1522926 1550810 1577625 1602124 1621919 1636002 1644431 1647056 1644423
56054 1644423 1638504 1630585 1619628 1604245 1584700 1561366 1533193 1499904 1464036 1428508 1393683 1358961
56042 1358961 1325579 1295254 1267431 1240433 1214267 1189879 1166761 1143724 1121161 1100287 1080971
56031 1080971 1062360 1044670 1028360 1012625 996704 981623 968704 957538 947278 938546 932056 926820
$$ packed form
56118F74225n577m119l541l529k701j262n53m65K17J365J959K419L822N290M973
56103F72523L302K438K728K598J787J764K798L437L140K946L302L586L829M697
56089G14875N887O726P933J0466J3224J4480J5073J7240K0855K3796K5715K8250
56077I04520L1756L4989L7960M1940M6509M9637N0767N0870M9688M6118M1269
56066A386023L7738L5765L3316L0084K7884K6815K4499J9795J4083Q429K625k633
56054A644423n919p919j0957j5383j9545k3334k8173l3289l5868l5528l4825l4722
56042A358961l3382l0325k7823k6998k6166k4388k3118k3037k2563k0874j9316
56031A080971j8611j7690j6310j5735j5921j5081j2919j1166j0260q732o490n236
$$ plain form
56019 926820 921840 918124 916887 917274 918078 920104 924481 930264 936113 942727 951121 960150 968416 976992 987447
56004 987447 998762 1009054 1018875 1029924 1041974 1054024 1067012 1082253 1098562 1114024 1129377 1146558
55992 1146558 1165144 1183325 1201221 1220177 1239980 1259755 1280415 1303230 1327231 1350976 1375477
55981 1375477 1402447 1431171 1460216 1490549 1523735 1558717 1593760 1629919 1669214 1711074 1753994
55970 1753994 1798750 1846415 1895275 1943624 1993564 2048017 2106044 2165297 2226921 2293467 2363950
55959 2363950 2435748 2509623 2588135 2670864 2755941 2844383 2937978 3034873 3132383 3232204 3337629
55948 3337629 3447700 3559681 3675157 3797822 3927176 4060486 4199111 4346689 4502879
55939 4502879 4665223 4835361 5016982 5209594 5411012 5623920 5852946 6097290 6353481
$$ packed form
56019I26820m980l716j237L87Q04K026M377N783N849O614Q394R029Q266Q576J0455
56004I87447J1315J0292R821J1049J2050J2050J2988J5241J6309J5462J5353J7181
55992A146558J8586J8181J7896J8956J9803J9775K0660K2815K4001K3745K4501
55981A375477K6970K8724K9045L0333L3186L4982L5043L6159L9295M1860M2920
55970A753994M4756M7665M8860M8349M9940N4453N8027N9253O1624O6546P0483
55959B363950P1798P3875P8512Q2729Q5077Q8442R3595R6895R7510R9821J05425
55948C337629J10071J11981J15476J22665J29354J33310J38625J47578J56190
55939D502879J62344J70138J81621J92612K01418K12908K29026K44344K56191
$$ plain form
55930 6353481 6623242 6910992 7215832 7533986 7866950 8219021 8589277 8974845 9379724
55921 9379724 9811204 10270185 10754737 11270441 11826762 12425995 13067019 13757322 14509841
55912 14509841 15331158 16225574 17207913 18299145 19513247 20863563 22379193 24100284
55904 24100284 26062298 28302967 30880497 33866743 37330541 41351927 46043998 51527129
55896 51527129 57881139 65153775 73415119 82767323 93295622 105037015 117980174 132038731
55888 132038731 147025655 162699861 178759592 194550771 208637519 218846546 223130206
55881 223130206 220688275 212373104 200086238 185819927 171092691 156881982 143724821
55874 143724821 131803076 121060210 111349180 102517052 94415828 86919778 79962490 73531793
$$ packed form
55930F353481K69761K87750L04840L18154L32964L52071L70256L85568M04879
55921I379724M31480M58981M84552N15704N56321N99233O41024O90303P52519
55912A4509841Q21317Q94416R82339J091232J214102J350316J515630J721091
55904B4100284J962014K240669K577530K986246L463798M021386M692071N483131
55896E1527129O354010P272636Q261344R352204J0528299J1741393J2943159J4058557
55888A32038731J4986924J5674206J6059731J5791179J4086748J0209027M283660
55881B23130206k441931q315171j2286866j4266311j4727236j4210709j3157161
55874A43724821j1921745j0742866r711030q832128q101224p496050o957288o430697
$$ plain form
55866 73531793 67620585 62200632 57236775 52694801 48530398 44694412 41155455 37901012
55858 37901012 34915100 32171649 29650004 27339195 25224637 23286142 21511398 19897406
55850 19897406 18436278 17111767 15910679 14825204 13842757 12945737 12123235 11372291 10686276
55841 10686276 10052738 9464068 8919957 8417545 7948812 7509351 7100440 6720531 6363323
55832 6363323 6025957 5710852 5417761 5141801 4880853 4637249 4410690 4196860 3994462
55823 3994462 3806302 3631928 3466285 3307194 3157298 3017132 2883174 2754383 2633879
55814 2633879 2522082 2414557 2308713 2206623 2109198 2013625 1918956 1828750 1745709 1668589
55804 1668589 1596504 1531337 1473741 1421268 1372504 1328846 1290552 1255471 1223280 1196545 1175667
$$ packed form
55866G3531793n911208n419953m963857m541974m164403l835986l538957l254443
55858C7901012k985912k743451k521645k310809k114558j938495j774744j613992
55850A9897406j461128j324511j201088j085475r82447q97020q22502p50944o86015
55841A0686276o33538n88670n44111n02412m68733m39461m08911l79909l57208
55832F363323l37366l15105k93091k75960k60948k43604k26559k13830k02398
55823C994462j88160j74374j65643j59091j49896j40166j33958j28791j20504
55814B633879j11797j07525j05844j02090r7425r5573r4669r0206q3041p7120
55804A668589p2085o5167n7596n2473m8764m3658l8294l5081l2191k6735k0878
$$ plain form
55793 1175667 1156858 1136893 1116056 1094988 1072669 1049185 1026657 1005760 984844 963718 944566
55782 944566 927854 911144 893334 876247 860613 844374 826549 809157 793536 778292 762532
55771 762532 747739 734668 721640 707693 694395 682798 671521 659496 647893 637737 628235 618828
55759 618828 610319 602806 595083 587203 580921 576626 572561 567975 564173 561518 558478 554712 551933 550468
55745 550468 548125 543839 539397 536100 532717 528281 523880 520034 515186 508519 501560 495248 488167 479434
55731 479434 470638 462982 455100 445657 435663 426230 416442 405619 395465 387757 381724 375746 369917 364984
55717 364984 360461 355718 351462 348250 344841 339623 332503 324165 314898 305397 297209 291055 285965 281032
55703 281032 276492 272360 267860 263153 259617 257346 254435 249883 245068 241032 236536 230399 223680 217831
$$ packed form
55793A175667j8809j9965k0837k1068k2319k3484k2528k0897k0916k1126j9152
55782I44566j6712j6710j7810j7087j5634j6239j7825j7392j5621j5244j5760
55771G62532j4793j3071j3028j3947j3298j1597j1277j2025j1603j0156r502r407
55759F18828q509p513p723p880o282m295m065m586l802k655l040l766k779j465
55745E50468k343m286m442l297l383m436m401l846m848o667o959o312p081q733
55731D79434q796p656p882r443r994r433r788j0823j0154p708o033n978n829m933
55717C64984m523m743m256l212l409n218p120q338r267r501q188o154n090m933
55703B81032m540m132m500m707l536k271k911m552m815m036m496o137o719n849
$$ plain form
55689 217831 212596 207444 203254 200691 198531 195422 191949 189305 187304 185275 183522 182349 180978 178908
55675 178908 176989 175845 174723 173255 172683 173779 175137 175157 174250 173449 172368 170329 168048 166405 164783
55660 164783 162464 160375 159606 159342 158198 156638 156165 156951 158056 159263 161008 163095 164992 166838 168845
55645 168845 170436 171259 172215 174180 176504 178043 178798 179338 179618 179725 180775 183485 186670 188681 189621 190697
55629 190697 192122 193095 193266 192858 191837 190244 188833 188382 188861 190097 192404 195623 198554 200431 201991
55614 201991 204051 206097 207456 208704 210598 212705 214451 216417 219116 221543 222506 222442 222343 221910 220503 219023
55598 219023 218902 219806 220199 219699 219129 218584 217249 215007 212695 210790 209105 207597 206256 204488 201761 198531
55582 198531 195371 191614 186143 179175 172091 165839 160585 156439 153242 150036 145985 141532 137606 134159
$$ packed form
55689B17831n235n152m190k563k160l109l473k644k001k029j753j173j371k070
55675A78908j919j144j122j468n72J096J358K0r07q01j081k039k281j643j622
55660A64783k319k089p69k64j144j560m73P86J105J207J745K087J897J846K007
55645A68845J591Q23R56J965K324J539P55N40K80J07J050K710L185K011R40J076
55629A90697J425R73J71m08j021j593j411m51M79J236K307L219K931J877J560
55614B01991K060K046J359J248J894K107J746J966K699K427R63o4r9m33j407j480
55598B19023j21R04L93n00n70n45j335k242k312j905j685j508j341j768k727l230
55582A98531l160l757n471o968p084o252n254m146l197l206m051m453l926l447
$$ plain form
55568 134159 130617 127226 124643 122637 120438 118020 115807 113562 110769 107746 105206 103134 101235 99939
55554 99939 99669 99649 98808 97375 96221 95105 93162 90742 89149 88682 88392 87699 86807 85586 83564 81157
55538 81157 79518 79003 78917 78813 78918 79236 79408 79574 80297 81518 82584 83371 84461 86113 87886 89257 89890
55521 89890 89512 88403 87712 88396 90063 91723 93277 95271 97670 100073 102754 106213 109925 112859 115070
55506 115070 117491 120305 122842 125028 127500 130206 132211 133083 133311 133106 131971 129698 126810 123761 120656
55491 120656 117833 115823 114524 113257 111716 110149 108700 107377 106465 106009 105219 103527 101990 102343 104654
55476 104654 107215 108769 109601 110349 111155 112245 113998 115982 117111 117219 117368 118154 118742 118135 116443 114350
55460 114350 112203 110162 108439 106795 104491 101250 97681 94349 91055 87516 84147 81620 79972 78633
$$ packed form
55568A34159l542l391k583k006k199k418k213k245k793l023k540k072j899j296
55554I9939k70k0q41j433j154j116j943k420j593m67k90o93q92j221k022k407
55538H1157j639n15q6j04J05L18J72J66P23J221J066P87J090J652J773J371O33
55521H9890l78j109o91O84J667J660J554J994K399K403K681L459L712K934K211
55506A15070K421K814K537K186K472K706K005Q72K28k05j135k273k888l049l105
55491A20656k823k010j299j267j541j567j449j323r12m56p90j692j537L53K311
55476A04654K561J554Q32P48Q06J090J753J984J129J08J49P86N88o07j692k093
55460A14350k147k041j723j644k304l241l569l332l294l539l369k527j648j339
$$ plain form
55446 78633 77099 75303 73459 71692 69737 67163 64144 61637 60382 59999 59549 58623 57275 55329 52662
55431 52662 49970 48311 47932 48277 48996 50108 51296 51953 52056 52244 52946 54004 55067 55763 55699 54968 54459
55414 54459 54935 56007 56711 56731 56291 55292 53560 51561 49839 48081 45853 43844 43112 43325 43168 42402 42058
55397 42058 42508 42805 42241 41305 40705 40530 40642 40879 40662 39477 37926 37265 37747 38471 38897 39255 39411 38834
55379 38834 38012 38402 40331 42257 42806 42407 42181 42297 42267 42007 41848 42067 42881 44261 45425 45345 44136 43045
55361 43045 42789 42831 42662 42669 43224 43912 44314 44621 44903 44683 43893 43385 43832 44890 46027 47375 49070 50544
55343 50544 51200 51191 50918 50376 49555 48875 48658 48677 48642 48520 48136 47207 46107 45682 45886 45568 44190 42788 42512
55324 42512 43095 43544 43560 43424 43126 42507 41795 41283 40890 40558 40574 40980 41272 41196 41200 41575 41841 41600 41260 41224 40993
$$ packed form
55446G8633j534j796j844j767j955k574l019k507j255l83m50r26j348j946k667
55431E2662k692j659l79L45P19J112J188O57J03J88P02J058J063O96o4p31n09
55414E4459M76J072P04K0m40r99j732j999j722j758k228k009p32K13j57p66l44
55397D2058M50K97n64r36o00j75J12K37k17j185j551o61M82P24M26L58J56n77
55379C8834q22L90J929J926N49l99k26J16l0k60j59K19Q14J380J164q0j209j091
55361D3045k56M2j69PN55O88M02L07K82k20p90n08M47J058J137J348J695J474
55343E0544O56rk73n42q21o80k17J9l5j22l84r29j100m25K04l18j378j402k76
55324D2512N83M49J6j36k98o19p12n12l93l32J6M06K92p6ML75K66k41l40l6k31
$$ plain form
55303 40993 39879 38062 36203 34500 32856 31531 30838 30543 30164 29623 29130 28807 28840 29519 30700 31693 32112
55286 32112 32272 32345 31833 30435 28834 27979 28087 28823 29873 30826 31132 30789 30538 30884 31415 31564 31313 30726
55268 30726 29610 28224 27501 27838 28422 28486 28431 28856 29359 29252 28748 28424 28108 27409 26721 26618 26711 26248 25480
55249 25480 25297 25799 26314 26637 27189 27994 28486 28326 27694 26853 26156 26202 27231 28567 29350 29567 29607 29342 28569
55230 28569 27923 28211 29059 29392 29116 29142 29806 30494 30962 31738 32864 33390 32689 31461 30813 30976 31433 31731 31672
55211 31672 31095 30015 28825 28096 28269 29466 31299 32890 33529 33413 33376 33805 34200 33894 32865 31737 31191
55194 31191 31451 32152 32733 33027 33304 33647 33717 33428 33355 33945 34670 34660 33966 33535 33971 34897 35547 35506 34880 34152
55174 34152 33858 34057 34231 34024 33849 34313 35248 35873 35759 35112 34229 33221 32198 31255 30310 29338 28657 28493
$$ packed form
55303D0993j114j817j859j703j644j325o93k95l79n41m93l23L3O79J181R93M19
55286C2112J60P3n12j398j601q55J08P36J050R53L06l43k51L46N31J49k51n87
55268C0726j116j386p23L37N84O4n5M25N03j07n04l24l16o99o88j03R3m63p68
55249B5480j83N02N15L23N52Q05M92j60o32q41o97M6J029J336P83K17M0k65p73
55230B8569o46K88Q48L33k76K6O64O88M68P76J126N26p01j228o48J63M57K98n9
55211C1672n77j080j190p29J73J197J833J591O39j16l7M29L95l06j029j128n46
55194C1191K60P01N81K94K77L43P0k89p3N90P25j0o94m31M36R26O50m1o26p28
55174C4152k94J99J74k07j75M64R35O25j14o47q83j008j023r43r45r72o81j64
$$ plain form
55156 28493 28506 28260 27995 28359 29450 30771 32047 33474 35106 36551 37408 37669 37632 37714 38211 38881 38941 37923
55138 37923 36411 35485 35601 36357 37090 37208 36306 34606 33065 32368 32035 31211 30043 29415 29523 29663 29467 29329
55120 29329 29462 29505 29412 29826 31097 32652 33811 34632 35432 36023 36060 35784 35815 36312 36749 36507 35488 34234 33510
55101 33510 33618 34025 33933 33232 32651 32900 33956 35228 36127 36398 36252 36249 36750 37379 37375 36573 35689 35454 35825 36308
55081 36308 36745 37354 38110 38478 37965 36780 35728 35359 35404 35268 34979 35278 36686 38853 41010 42689 43754
55064 43754 44054 43489 42243 40745 39575 39442 40785 43067 44985 45803 45999 46140 45839 44601 43136 42705
55048 42705 43345 43853 43598 43299 43801 45000 46447 48125 49998 51347 51324 50036 48636 48349 49568 51768
55032 51768 54056 55866 57233 58421 59436 60056 60216 60103 59988 60163 60911 62213 63613 64673 65455 66224
$$ packed form
55156B8493J3k46k65L64J091J321J276J427J632J445Q57K61l7Q2M97O70O0j018
55138C7923j512r26J16P56P33J18r02j700j541o97l33q24j168o28J08J40j96j38
55120B9329J33M3r3M14J271J555J159Q21Q00N91L7k76L1M97M37k42j019j254p24
55101C3510J08M07r2p01n81K49J056J272Q99K71j46lN01O29mq02q84k35L71M83
55081C6308M37O09P56L68n13j185j052l69M5j36k89K99J408K167K157J679J065
55064D3754L00n65j246j498j170j33J343K282J918Q18J96J41l01j238j465m31
55048D2705O40N08k55k99N02J199J447J678J873J349k3j288j400k87J219K200
55032E1768K288J810J367J188J015O20J60j13j15J75P48J302J400J060P82P69
$$ plain form
55016 66224 66909 67224 67213 67212 67343 67397 67116 66283 64735 62711 60961 60015 59521 58857 58156 58048 58516 58776 58369
54997 58369 57676 57156 56662 55780 54398 52785 51469 51085 51857 53100 53705 53245 52291 51587 51341 51341 51326 51144 50972
54978 50972 51389 52754 54474 55399 55061 54028 52951 51853 50652 49877 50357 52295 54931 57087 58046 58037 57899
54961 57899 58275 59261 60794 62903 65316 67370 68807 70227 72128 73956 74860 75051 75462 76277 76785 76658
54945 76658 76325 75905 74865 73143 71708 71384 71727 71605 70486 68726 66989 65755 65112 64693 64024 63033 62023
54928 62023 61217 60722 60847 61878 63444 64659 65027 64769 64293 63849 63701 64021 64595 65194 66155 67831 69582
54911 69582 70292 70093 70603 73031 76785 80365 82953 84762 86551 89262 93515 98984 104717 110341 116412
54896 116412 123408 131177 139633 149084 159382 169618 179311 189144 199793 210687 220625 228987 235466
$$ packed form
55016F6224O85L15j1jJ31N4k81q33j548k024j750r46m94o64p01j08M68K60m07
54997E8369o93n20m94q82j382j613j316l84P72J243O05m60r54p04k46%j5j82j72
54978E0972M17J365J720R25l38j033j077j098j201p75M80J938K636K156R59rj38
54961E7899L76R86J533K109K413K054J437J420J901J828R04J91M11Q15N08j27
54945G6658l33m20j040j722j435l24L43j22j119j760j737j234o43m19o69r91j010
54928F2023q06m95J25J031J566J215L68k58m76m44j48L20N74N99R61J676J751
54911F9582P10j99N10K428L754L580K588J809J789K711M253N469N733N624O071
54896A16412O996P769Q456R451J0298J0236R693R833J0649J0894R938Q362O479
$$ plain form
54883 235466 239220 239417 236453 231760 226336 220148 212976 205198 197557 190484 183775 176799 169186 161404
54869 161404 154435 148762 144033 139843 136356 133874 132270 131163 130271 129271 127863 126352 125715 126587 128596
54854 128596 131132 134314 138687 144403 151224 158961 167324 175661 183491 191070 198877 206711 213749 219336
54840 219336 223235 225256 225102 222533 217509 210365 202008 193537 185387 177270 169182 161817 155461 149162
54826 149162 141814 133689 126106 119841 114640 110127 106305 103084 100056 96986 94094 91643 89626 87957
54812 87957 86677 85792 85142 84557 84145 84308 85340 86820 87666 87281 86480 86553 87342 87142 84862 81422 78442
54795 78442 76360 74662 73173 72057 70982 69467 67945 67424 68039 68815 68998 68804 68679 68622 68537 68629 68989 69207
54777 69207 68817 67935 67220 67244 67930 68515 68138 66719 65171 64567 65205 66640 68328 69888 70963 71373 71363 71365
$$ packed form
54883B35466L754J97k964m693n424o188p172p778p641p073o709o976p613p782
54869A61404o969n673m729m190l487k482j604j107q92j000j408j511o37Q72K009
54854A28596K536L182M373N716O821P737Q363Q337P830P579P807P834P038N587
54840B19336L899K021j54k569n024p144q357q471q150q117q088p365o356o299
54826A49162p348q125p583o265n201m513l822l221l028l070k892k451k017j669
54812H7957j280q85o50n85m12J63J032J480Q46l85q01P3P89k00k280l440k980
54795G8442k082j698j489j116j075j515j522n21O15P76J83j94j25n7q5R2L60K18
54777F9207l90q82p15K4O86N85l77j419j548o04O38J435J688J560J075M10j0K
$$ plain form
54759 71365 71539 71808 72174 72658 73046 73171 73436 74634 77162 80623 84230 87487 90528 93931 98103 102833
54743 102833 107746 113186 120127 128988 139012 149240 159548 170296 181348 192100 202176 211505
54731 211505 219919 227200 233286 237934 240432 240238 237691 233559 228131 221378 213817 206456 199906 194125
54717 194125 188995 184535 180559 176720 172941 169328 165687 161668 157425 153611 150681 148662 147559 147436
54703 147436 148066 149033 150327 152438 155729 160063 165167 171077 178162 186858 197242 208640 219853 230052
54689 230052 239247 247667 255079 261114 265739 268838 269772 268146 264719 260731 256557 251867 246814 242004
54675 242004 237270 231586 224449 216485 208414 200272 192035 184131 176845 169835 162807 156182 150498 145523
54661 145523 140441 134795 128906 123519 119174 115797 112800 109766 106952 104832 103294 101802 100266 99066
$$ packed form
54759G1365J74K69L66M84L88J25K65J198K528L461L607L257L041L403M172M730
54743A02833M913N440O941Q861J0024J0228J0308J0748J1052J0752J0076R329
54731B11505Q414P281O086M648K498j94k547m132n428o753p561p361o550n781
54717A94125n130m460l976l839l779l613l641m019m243l814k930k019j103j23
54703A47436O30R67J294K111L291M334N104N910P085Q696J0384J1398J1213J0199
54689B30052R195Q420P412O035M625L099R34j626l427l988m174m690n053m810
54675B42004m734n684p137p964q071q142q237p904p286p010p028o625n684m975
54661A45523n082n646n889n387m345l377k997l034k814k120j538j492j536j200
$$ plain form
54647 99066 98152 96855 94927 93192 92722 93658 95139 96056 95678 93949 91595 89741 89130 89704 90874 91978
54631 91978 92555 92545 92315 92172 91898 91207 90566 90933 92505 94276 95137 94978 94508 94413 95036 96498 98696 101267
54613 101267 103788 105993 107798 109285 110611 111832 112971 114501 117371 121967 127222 131453 134111 136142
54599 136142 138676 142118 146547 152063 158308 164352 169549 174105 178442 182518 186158 189593 193186 196925
54585 196925 200537 203816 206529 208342 209242 209810 210781 212464 214693 217102 219345 221410 223824 227178 231328
54570 231328 235485 239226 242866 246550 249566 250964 250481 248434 245075 240517 235093 229323 223578 217914
54556 217914 212144 205981 199379 192862 187225 182788 179270 176392 174124 172235 170267 168312 167220 167497
54542 167497 168471 169177 169730 171134 173841 177098 179830 181646 182780 183395 183326 182445 181004 179385 177643 175570
$$ packed form
54647I9066r14j297j928j735m70R36J481R17l78j729k354j854o11N74J170J104
54631I1978N77j0k30j43k74o91o41L67J572J771Q61j59m70r5O23J462K198K571
54613A01267K521K205J805J487J326J221J139J530K870M596N255M231K658K031
54599A36142K534L442M429N516O245O044N197M556M337M076L640L435L593L739
54585A96925L612L279K713J813R00N68R71J683K229K409K243K065K414L354M150
54570B31328M157L741L640L684L016J398m83k047l359m558n424n770n745n664
54556B17914n770o163o602o517n637m437l518k878k268j889j968j955j092K77
54542A67497R74P06N53J404K707L257K732J816J134O15o9q81j441j619j742k073
$$ plain form
54526 175570 173245 171034 168859 165886 161503 156245 151149 146501 141900 137309 133099 129053 124435 119316
54512 119316 114887 111910 109672 106982 103570 99933 96420 93154 90473 88726 87808 87284 86822 86248 85476
54497 85476 84656 84081 83711 83137 82155 80961 79674 78312 77355 77548 78750 79757 79765 79366 79517 80257 81094 82026
54479 82026 83328 84705 85471 85415 84953 84660 85057 86464 88635 91022 93734 97519 102262 106352 108473 109352
54463 109352 110712 113052 115599 117959 120453 122923 124555 125140 125456 126072 126574 126233 124786 122398 119510
54448 119510 116820 114771 112973 110743 108235 106305 105226 104311 102937 101187 99318 97379 95625 94596
54434 94596 94346 94183 93465 92207 90673 88965 87263 85877 84728 83342 81746 80842 81423 83176 85094 86550
54418 86550 87595 88535 89604 90832 91857 92116 91525 90745 90480 90699 90885 90892 91141 92073 93680 95551 97165
$$ packed form
54526A75570k325k211k175k973m383n258n096m648m601m591m210m046m618n119
54512A19316m429k977k238k690l412l637l513l266k681j747r18n24m62n74p72
54497H5476q20n75l70n74r82j194j287j362r57J93J202J007Ql99J51P40Q37R32
54479H2026J302J377P66n6m62k93L97J407K171K387K712L785M743M090K121Q79
54463A09352J360K340K547K360K494K470J632N85L16O16N02l41j447k388k888
54448A19510k690k049j798k230k508j930j079r15j374j750j869j939j754j029
54434I4596k50j63p18j258j534j708j702j386j149j386j596r04N81J753J918J456
54418H6550J045R40J069J228J025K59n91p80k65K19J86PK49R32J607J871J614
$$ plain form
54401 97165 98068 98039 97245 96227 95591 95531 95630 95253 94207 92876 91657 90542 89443 88611 88316 88303 87960 86968
54383 86968 85468 83684 81829 80242 79184 78446 77563 76426 75347 74574 74180 74330 75130 76139 76534 75988
54367 75988 75029 74439 74643 75676 77286 78932 80122 80930 81848 83042 84168 84964 85576 86132 86502 86666 86907
54350 86907 87443 88295 89629 91691 94166 96161 97258 98148 99774 102188 104683 106786 108633 110649 113299
54335 113299 116977 121655 126734 131572 136095 140630 145291 149939 154623 159629 165067 170715 176338 181871
54321 181871 187171 191749 194943 196382 196343 195642 195029 194577 193745 192054 189563 186646 183542 180282 176870 173356
54305 173356 169823 166399 163165 159936 156336 152254 148132 144615 141950 139807 137571 134795 131488 128096
54291 128096 125097 122591 120472 118881 118161 118323 118955 119839 121207 123113 125002 126415 127835 130262 133978
$$ packed form
54401I7165R03k9p94j018o36o0R9l77j046j331j219j115j099q32k95j3l43r92
54383H6968j500j784j855j587j058p38q83j137j079p73l94J50Q00J009L95n46
54367G5988r59n90K04J033J610J646J190Q08R18J194J126P96O12N56L70J64K41
54350H6907N36Q52J334K062K475J995J097Q90J626K414K495K103J847K016K650
54335A13299L678M678N079M838M523M535M661M648M684N006N438N648N623N533
54321A81871N300M578L194J439l9p01o13m52q32j691k491k917l104l260l412l514
54305A73356l533l424l234l229l600m082m122l517k665k143k236k776l307l392
54291A28096k999k506k119j591p20J62O32Q84J368J906J889J413J420K427L716
$$ plain form
54276 133978 138265 142346 146158 150098 154442 159253 164498 169946 175121 179607 183331 186353 188511 189509
54262 189509 189365 188526 187466 186357 185158 183798 182050 179418 175533 170639 165416 160265 155083 149848 144976
54247 144976 140772 136878 132755 128513 124695 121373 118060 114581 111391 108783 106355 103625 100674 97761
54233 97761 94695 91161 87494 84524 82689 81661 80938 80386 80142 80274 80668 81074 81192 80843 80082 79044 77785
54216 77785 76417 75262 74567 74101 73407 72489 71915 72071 72618 72907 72755 72545 72704 73381 74526 75995 77435
54199 77435 78338 78399 77782 76911 76096 75544 75579 76507 78008 78988 78449 76597 74748 73993 74204 74574 74833 75453 76697
54180 76697 77958 78306 77439 75811 74072 72711 72086 72305 72947 73270 72943 72411 72317 72769 73341 73600 73318 72403
54162 72403 71051 69917 69649 70076 70230 69390 67868 66589 66128 66383 66897 67143 66667 65374 63739 62491 61988
$$ packed form
54276A33978M287M081L812L940M344M811N245N448N175M486L724L022K158R98
54262A89509j44q39j060j109j199j360j748k632l885m894n223n151n182n235m872
54247A44976m204l894m123m242l818l322l313l479l190k608k428k730k951k913
54233I7761l066l534l667k970j835j028p23n52k44J32L94M06J18l49p61j038j259
54216G7785j368j155o95m66o94r18n74J56N47K89j52k10J59O77J145J469J440
54199G7435R03O1o17q71q15n52L5R28J501R80n39j852j849p55K11L70K59O20J244
54180G6697J261L48q67j628j739j361o25K19O42L23l27n32r4M52N72K59k82r15
54162G2403j352j134k68M27J54q40j522j279m61K55N14K46m76j293j635j248n03
$$ plain form
54145 61988 62012 62203 62550 63368 64821 66506 67589 67587 66993 66879 67713 68795 69001 67903 65976 64010 62595
54128 62595 61963 61809 61376 60179 58709 58053 58663 59851 60634 60777 60767 61029 61497 61849 61839 61325 60269 58938
54110 58938 57960 57906 58732 59815 60669 61386 62139 62566 62109 60936 59972 59854 60336 60902 61464 62101 62568 62615 62533
54091 62533 62850 63597 64281 64485 64210 63715 63309 63147 62981 62338 61218 60340 60360 61169 62239 63235 63835 63600 62735
54072 62735 62469 63712 65661 66719 66596 66354 66492 66305 65314 63987 62611 60677 58117 56030 55287 55301 55119
54055 55119 54971 55635 56863 57655 57859 58343 59518 60644 60808 59943 58738 58018 58236 59084 59600 59121 58132 57729
54037 57729 58364 59558 60743 61733 62396 62537 62303 62161 62257 62255 61966 61724 61876 62227 62253 61680 60694 59762 59346 59611
54017 59611 60345 61298 62459 63744 64594 64450 63682 63459 64419 65950 67077 67581 67847 67967 67639 66822 65976 65602
$$ packed form
54145F1988K4J91L47Q18J453J685J083kn94j14Q34J082K06j098j927j966j415
54128F2595o32j54m33j197j470o56O10J188P83J43j0K62M68L52j0n14j056j331
54110E8938r78n4Q26J083Q54P17P53M27m57j173r64j18M82N66N62O37M67M7q2
54091F2533L17P47O84K04k75m95m06j62j66o43j120q78K0Q09J070R96O00k35q65
54072F2735k66J243J949J058j23k42J38j87r91j327j376j934k560k087p43J4j82
54055E5119j48O64J228P92K04M84J175J126J64q65j205p20K18Q48N16m79r89m03
54037E7729O35J194J185R90O63J41k34j42R6kk89k42J52L51K6n73r86r32m16K65
54017E9611P34R53J161J285Q50j44p68k23R60J531J127N04K66J20l28q17q46l74
$$ plain form
53999 65602 65925 67078 69123 71728 74167 75976 77462 79293 81653 84055 86016 87668 89529 91804 94120
53984 94120 95971 97286 98422 99711 101200 102902 105073 107957 111298 114429 117017 119529 122693 126641
53970 126641 130903 135185 139700 144607 149561 154144 158450 162901 167606 172218 176347 179889 183012 186029
53956 186029 189132 192077 194321 195726 196832 198074 198995 198822 197606 196189 195053 193855 192170 190022 187457
53941 187457 184244 180375 176366 172678 169197 165635 162096 158922 156264 154156 152679 151717 150817 149601 148080
53926 148080 146340 144248 141819 139573 138113 137551 137636 138166 138970 139728 140225 140555 140761 140636 140224 140121 140692
53909 140692 141331 141195 140491 140347 141369 142998 144322 144901 144679 143772 142682 142189 142544 143031 142692 141388 139888
53892 139888 139010 138872 138936 138629 137895 137210 137126 137956 139842 142813 146534 150280 153542 156607 160225 164766 170008
$$ packed form
53999F5602L23J153K045K605K439J809J486J831K360K402J961J652J861K275K316
53984I4120J851J315J136J289J489J702K171K884L341L131K588K512L164L948
53970A26641M262M282M515M907M954M583M306M451M705M612M129L542L123L017
53956A86029L103K945K244J405J106J242R21j73j216j417j136j198j685k148k565
53941A87457l213l869m009l688l481l562l539l174k658k108j477r62r00j216j521
53926A48080j740k092k429k246j460n62Q5N30Q04P58M97L30K06j25m12j03N71
53909A40692O39j36p04j44J022J629J324N79k22r07j090m93L55M87l39j304j500
53892A39888q78j38O4l07p34o85q4Q30J886K971L721L746L262L065L618M541N242
$$ plain form
53875 170008 175645 181549 187569 193458 199163 204886 210753 216684 222663 228838 235192 241275 246355 249732
53861 249732 251085 250899 250545 251458 254014 257470 261104 265055 269795 275159 280356 284840 288817 292854 297259
53846 297259 301915 306511 310764 314499 317655 320317 322679 324870 326756 327972 328187 327361 325681 323339 320385
53831 320385 316787 312612 308212 304104 300397 296381 291004 283984 276199 268803 262196 256049 250067 244300
53817 244300 238833 233557 228266 222755 216877 210702 204553 198667 192935 187211 181687 176662 172091 167713
53803 167713 163504 159587 155776 151718 147476 143557 140271 137527 135328 133895 133036 131898 129786 126949
53789 126949 124142 121621 118970 115865 112576 109657 107497 106278 106047 106539 107024 106709 105451 103940 103007
53774 103007 102842 102974 102845 102162 100825 98970 97149 96009 95600 95302 94673 93976 93601 93423 93177 93161 93954 95564
$$ packed form
53875A70008N637N904O020N889N705N723N867N931N979O175O354O083N080L377
53861B49732J353j86l54R13K556L456L634L951M740N364N197M484L977M037M405
53846B97259M656M596M253L735L156K662K362K191J886J216K15q26j680k342k954
53831C20385l598m175m400m108l707m016n377p020p785p396o607o147n982n767
53817B44300n467n276n291n511n878o175o149n886n732n724n524n025m571m378
53803A67713m209l917l811m058m242l919l286k744k199j433q59j138k112k837
53789A26949k807k521k651l105l289k919k160j219k31M92M85l15j258j511r33
53774A03007j65J32j29o83j337j855j821j140m09k98o29o97l75j78k46j6P93J610
$$ plain form
53756 95564 97411 99090 100631 101989 102916 103463 104103 105094 106072 106539 106529 106664 107739 110344 114541 119677 124691
53739 124691 128872 132298 135589 139297 143501 147829 151812 155386 158883 162418 165505 167666 169261 171271
53725 171271 174259 177921 181612 184876 187425 189067 189824 189845 189160 187838 186310 185051 183964 182567 180844
53710 180844 179291 177984 176240 173559 170309 167104 163960 160556 156907 153298 149829 146510 143596 141363
53696 141363 139723 138393 137275 136318 135198 133615 131795 130282 129264 128418 127381 126013 124250 121995 119222
53681 119222 116060 112864 110293 109033 109079 109470 109161 108051 106792 105737 104663 103542 102912 103138 103792 104198
53665 104198 104319 104641 105321 105997 106453 106980 107853 108764 109186 109106 109081 109529 110336 111230 112278 113783 115901 118559
53647 118559 121566 124551 126933 128365 129251 130582 133106 136757 140932 145128 149208 153197 157002 160349
$$ packed form
53756I5564J847J679J541J358R27N47O40R91R78M67j0J35J075K605M197N136N014
53739A24691M181L426L291L708M204M328L983L574L497L535L087K161J595K010
53725A71271K988L662L691L264K549J642P57K1o85j322j528j259j087j397j723
53710A80844j553j307j744k681l250l205l144l404l649l609l469l319k914k233
53696A41363j640j330j118r57j120j583j820j513j018q46j037j368j763k255k773
53681A19222l162l196k571j260M6L91l09j110j259j055j074j121o30K26O54M06
53665A04198J21L22O80O76M56N27Q73R11M22q0k5M48Q07Q94J048J505K118K658
53647A18559L007K985K382J432Q86J331K524L651M175M196M080L989L805L347
$$ plain form
53633 160349 162993 165010 166849 169017 171590 174086 175814 176543 176874 177801 179598 181303 181703 180855 180030 179984
53617 179984 179940 178735 176374 173759 171309 168798 166356 164703 164206 164413 164716 164875 164736 164093 163103 162278 161748
53600 161748 161039 159830 158473 157438 156763 156360 156385 156901 157572 158109 158730 159760 161090 162404 163668 164990
53584 164990 166273 167406 168666 170524 173092 175988 178635 180583 181789 182776 184280 186462 188671 190150
53570 190150 190754 190862 190866 190942 191048 190908 190315 189591 189431 190079 191044 191760 192087 191953 191084 189549 188103 187502 187731
53551 187731 188263 188741 189077 189322 189874 191362 193792 196213 197780 198818 200197 202030 203688 204861 205899
53536 205899 207185 208828 210913 213445 216036 218130 219565 220547 221258 221886 222806 224179 225625 226859 228399
53521 228399 230918 234091 236844 238727 240220 241671 242777 243332 243710 244252 244737 244835 244625 244421 244379 244488 244654
$$ packed form
53633A60349K644K017J839K168K573K496J728P29L31R27J797J705M00q48q25m6
53617A79984m4j205k361k615k450k511k442j653m97K07L03J59j39o43r90q25n30
53600A61748p09j209j357j035o75m03K5N16O71N37O21J030J330J314J264J322
53584A64990J283J133J260J858K568K896K647J948J206R87J504K182K209J479
53570A90150O04J08MP6J06j40n93p24j60O48R65P16L27j34q69j535j446o01K29
53551A87731N32M78L36K45N52J488K430K421J567J038J379J833J658J173J038
53536B05899J286J643K085K532K591K094J435R82P11O28R20J373J446J234J540
53521B28399K519L173K753J883J493J451J106N55L78N42M85R8k10k04m2J09J66
$$ plain form
53504 244654 244742 244770 245006 245549 246009 246141 246516 247838 249753 251248 252210 253617 255930 258341 260054 261416 263168
53487 263168 265323 267475 269645 272141 275058 278469 282653 287503 292156 295922 299239 303060 307648 312615
53473 312615 317769 323146 328489 333575 338963 345546 353266 361080 368400 375857 384287 393610 403192 412914
53459 412914 423366 435139 448275 462328 476686 490848 504595 518006 531379 545167 559878
53448 559878 575769 592557 609651 626766 644135 662013 680140 697909 715002 731692 748431
53437 748431 765277 781874 798035 814184 831014 848734 866875 884935 902943 921196 939585
53426 939585 957431 973991 988989 1002701 1015733 1028669 1041791 1055070 1068456 1082073 1095945
53415 1095945 1109673 1122595 1134348 1145124 1155361 1165373 1175216 1184679 1193303 1200629 1206600 1211633
$$ packed form
53504B44654Q8K8K36N43M60J32L75J322J915J495R62J407K313K411J713J362J752
53487B63168K155K152K170K496K917L411M184M850M653L766L317L821M588M967
53473C12615N154N377N343N086N388O583P720P814P320P457Q430R323R582R722
53459D12914J0452J1773J3136J4053J4358J4162J3747J3411J3373J3788J4711
53448E59878J5891J6788J7094J7115J7369J7878J8127J7769J7093J6690J6739
53437G48431J6846J6597J6161J6149J6830J7720J8141J8060J8008J8253J8389
53426I39585J7846J6560J4998J3712J3032J2936J3122J3279J3386J3617J3872
53415A095945J3728J2922J1753J0776J0237J0012R843R463Q624P326N971N033
$$ plain form
53403 1211633 1216184 1220315 1223799 1226490 1228377 1229337 1229106 1227593 1225080 1221956 1218333 1213976 1208530 1201766
53389 1201766 1193744 1184887 1175767 1166678 1157435 1147788 1137898 1128180 1118716 1109134 1099124 1088799 1078499
53376 1078499 1068547 1059165 1050196 1040820 1030052 1017984 1006106 995924 987544 980035 972826 966092 959966
53363 959966 954233 948894 944337 940669 937397 934019 930478 926844 923080 919389 916312 914101 912442 911146
53349 911146 910660 911381 912856 914312 915866 918623 923545 930619 939127 948349 957956 968122 979345 992015
53335 992015 1006071 1021263 1037587 1055256 1074313 1094620 1116186 1139157 1163485 1188874 1215132
53324 1215132 1242265 1270176 1298554 1327185 1356187 1385805 1416112 1446979 1478186 1509458 1540519
53313 1540519 1571138 1601046 1629847 1657222 1683301 1708614 1733520 1757754 1780578 1801343 1819893
$$ packed form
53403A211633M551M131L484K691J887R60k31j513k513l124l623m357n446o764
53389A201766q022q857r120r089r243r647r890r718r464r582j0010j0325j0300
53376A078499r952r382q969r376j0768j2068j1878j0182q380p509p209o734o126
53363I59966n733n339m557l668l272l378l541l634l764l691l077k211j659j296
53349I11146m86P21J475J456J554K757M922P074Q508R222R607J0166J1223J2670
53335I92015J4056J5192J6324J7669J9057K0307K1566K2971K4328K5389K6258
53324A215132K7133K7911K8378K8631K9002K9618L0307L0867L1207L1272L1061
53313A540519L0619K9908K8801K7375K6079K5313K4906K4234K2824K0765J8550
$$ plain form
53302 1819893 1836504 1851398 1864207 1873972 1879885 1882049 1881332 1878474 1873559 1866337 1856758 1845017 1831310
53289 1831310 1815796 1798620 1779885 1759691 1738363 1716402 1694072 1671197 1647597 1623477 1599099
53278 1599099 1574265 1548609 1522430 1496776 1472504 1449528 1427107 1404580 1381606 1357972 1333605
53267 1333605 1308723 1283769 1259176 1235379 1212897 1192088 1172758 1154263 1136146 1118590 1102127
53256 1102127 1087030 1073067 1059727 1046533 1033227 1019857 1006742 994227 982322 970642 958842
53245 958842 947118 936137 926378 917675 909573 902057 895664 890877 887678 885764 884877 884749 885050 885718 887177
53230 887177 889932 894034 899218 905437 912897 921690 931781 943311 956456 970952 986147 1001624 1017418
53217 1017418 1033578 1049926 1066348 1082885 1099432 1115743 1131924 1148401 1165130 1181292 1196065
$$ packed form
53302A819893J6611J4894J2809R765N913K164p17k858m915p222r579j1741j3707
53289A831310j5514j7176j8735k0194k1328k1961k2330k2875k3600k4120k4378
53278A599099k4834k5656k6179k5654k4272k2976k2421k2527k2974k3634k4367
53267A333605k4882k4954k4593k3797k2482k0809j9330j8495j8117j7556j6463
53256A102127j5097j3963j3340j3194j3306j3370j3115j2515j1905j1680j1800
53245I58842j1724j0981r759q703q102p516o393m787l199j914q87j28L01O68J459
53230H87177K755M102N184O219P460Q793J0091J1530J3145J4496J5195J5477J5794
53217A017418J6160J6348J6422J6537J6547J6311J6181J6477J6729J6162J4773
$$ plain form
53206 1196065 1209374 1221579 1232910 1243567 1253882 1263869 1272929 1280489 1286645 1291746 1295737 1298429 1300040
53193 1300040 1300825 1300484 1298664 1295752 1292411 1288527 1283489 1277402 1271059 1264700 1257748 1249982 1241971 1233984
53179 1233984 1225339 1215353 1204223 1192476 1180278 1167907 1156180 1145573 1135329 1124244 1112102 1099634
53167 1099634 1087332 1075048 1062689 1050513 1038618 1026741 1014759 1002973 991704 980942 970534
53156 970534 960433 950665 941243 932227 923664 915355 906814 897520 887196 875903 863993 851860 839585
53143 839585 826899 813629 800071 786713 773713 760874 748026 735180 722354 709468 696506
53132 696506 683653 671237 659603 648874 638766 628741 618532 608378 598625 589300 580333 571978
53120 571978 564634 558245 552189 545786 538762 531338 524146 518040 513580 510559 508198 505819 503130 499881
$$ packed form
53206A196065J3309J2205J1331J0657J0315R987R060P560O156N101L991K692J611
53193A300040P85l41j820k912l341l884n038o087o343o359o952p766q011p987
53179A233984q645r986j1130j1747j2198j2371j1727j0607j0244j1085j2142j2468
53167A099634j2302j2284j2359j2176j1895j1877j1982j1786j1269j0762j0408
53156I70534j0101r768r422r016q563q309q541r294j0324j1293j1910j2133j2275
53143H39585j2686j3270j3558j3358j3000j2839j2848j2846j2826j2886j2962
53132F96506j2853j2416j1634j0729j0108j0025j0209j0154r753r325q967q355
53120E71978p344o389o056o403p024p424p192o106m460l021k361k379k689l249
$$ plain form
53106 499881 495650 490167 483662 476680 469676 462955 456788 451253 445953 440183 433563 426394 419220 412109
53092 412109 404620 396487 388064 379953 372404 365351 358857 353111 347939 342714 336924 330670 324478 318853
53078 318853 314060 310001 306100 301638 296518 291561 287748 285271 283601 282364 281821 282509 284622 287812 291419
53063 291419 294866 297956 300795 303445 305802 307859 309807 311641 312829 312737 311354 309371 307465 305633 303255
53048 303255 299715 295022 289874 285028 280584 276040 271124 266191 261577 256893 251422 245098 238657 232801
53034 232801 227607 222784 218124 213554 209006 204481 200102 195931 191850 187752 183816 180452 177893 175842
53020 175842 173639 170976 168346 166475 165240 163552 160553 156619 152793 149524 146466 143348 140464 138223
53006 138223 136709 135776 135163 134399 133026 131150 129430 128282 127420 126382 125181 124092 123076 121855 120452
$$ packed form
53106D99881m231n483o505o982p004o721o167n535n300n770o620p169p174p111
53092D12109p489q133q423q111p549p053o494n746n172n225n790o254o192n625
53078C18853m793m059l901m462n120m957l813k477j670j237n43O88K113L190L607
53063B91419L447L090K839K650K357K057J948J834J188r2j383j983j906j832k378
53048C03255l540m693n148m846m444m544m916m933m614m684n471o324o441n856
53034B32801n194m823m660m570m548m525m379m171m081m098l936l364k559k051
53020A75842k203k663k630j871j235j688k999l934l826l269l058l118k884k241
53006A38223j514r33o13p64j373j876j720j148q62j038j201j089j016j221j403
$$ plain form
52991 120452 119271 118599 118286 117925 117131 115696 113696 111545 109691 108201 106817 105497 104657 104647 105153 105460
52975 105460 105282 105014 105024 105027 104474 103407 102505 102238 102339 102318 102195 102474 103496 105024 106409 107011 106583 105471
52957 105471 104399 103887 103876 104017 104215 104686 105602 106887 108348 109753 110787 111242 111336 111610 112334 113156 113522 113354
52939 113354 113156 113513 114606 116244 118117 119873 121070 121464 121505 122320 124801 128645 132577 135619 137923 140263
52923 140263 143043 146135 149517 153616 158836 164987 171385 177451 183101 188495 193661 198528 203261 208201
52909 208201 213358 218231 222385 225877 228762 230476 230359 228720 226746 225173 223655 221634 219187 216631
52895 216631 213863 210671 207358 204470 202109 199945 197671 195037 191721 187708 183690 180582 178686 177604
52881 177604 176800 175890 174664 173309 172380 172089 171823 170925 169754 169287 169852 170940 172242 174072 176591 179256
$$ packed form
52991A20452j181o72l13l61p94j435k000k151j854j490j384j320q40j0N06L07
52975A05460j78k68J0Ln53j067r02k67J01k1j23K79J022J528J385O02m28j112
52957A05471j072n12j1J41J98M71R16J285J461J405J034M55R4K74P24Q22L66j68
52939A13354j98L57J093J638J873J756J197L94M1Q15K481L844L932L042K304K340
52923A40263K780L092L382M099N220O151O398O066N650N394N166M867M733M940
52909B08201N157M873M154L492K885J714j17j639j974j573j518k021k447k556
52895B16631k768l192l313k888k361k164k274k634l316m013m018l108j896j082
52881A77604q04r10j226j355r29k91k66q98j171m67N65J088J302J830K519K665
$$ plain form
52865 179256 181337 182490 182724 182310 181909 182265 183471 184916 186015 186608 186628 186064 185436 185686 187186 189281 191058
52848 191058 192148 192574 192463 192314 192950 194659 196731 198275 199105 199442 199197 198203 196883 196059 196190 197207 198904
52831 198904 201019 203109 204800 206155 207445 208704 209820 210777 211440 211397 210580 209840 210273 212023 214309 216523
52815 216523 218645 220585 221955 222763 223675 225188 227001 228587 229977 231526 233283 235060 236903 238970 241137
52800 241137 243235 245619 248949 253303 257976 262350 266611 271326 276588 281901 286757 290999 294686 297931
52786 297931 300976 304153 307564 310866 313467 314972 315433 315197 314514 313262 311103 307966 304259 300475 296719
52771 296719 292859 289052 285756 283158 280878 278341 275195 271302 266681 261617 256512 251453 246272 241217
52757 241217 237016 233839 230718 226695 222286 218981 217295 216126 214266 211782 209490 207628 205721 203532
$$ packed form
52865A79256K081J153K34m14m01L56J206J445J099N93K0n64o28K50J500K095J777
52848A91058J090M26j11j49O36J709K072J544Q30L37k45r94j320q24J31J017J697
52831A98904K115K090J691J355J290J259J116R57O63m3q17p40M33J750K286K214
52815B16523K122J940J370Q08R12J513J813J586J390J549J757J777J843K067K167
52800B41137K098K384L330M354M673M374M261M715N262N313M856M242L687L245
52786B97931L045L177L411L302K601J505M61k36o83j252k159l137l707l784l756
52771B96719l860l807l296k598k280k537l146l893m621n064n105n059n181n055
52757B41217m201l177l121m023m409l305j686j169j860k484k292j862j907k189
$$ plain form
52743 203532 201481 199976 198744 197117 194897 192632 190883 189415 187481 184927 182541 181032 180129 179136 177964
52728 177964 176939 175887 174252 172160 170487 169585 168706 167094 165048 163385 162316 161442 160559 159888 159531 159174
52712 159174 158427 157253 156012 155096 154474 153640 152178 150356 148812 147738 146793 145827 145054 144342 143010 140852
52696 140852 138810 137955 138023 137552 135421 131874 128116 125342 124084 124026 124247 123859 122611 120969 119658 119046
52680 119046 118727 117768 115681 113205 111710 111697 112275 112309 111629 110821 110302 110017 109742 109228 108294 107122 106272 106107
52662 106107 106452 107064 108097 109717 111599 113236 114464 115350 115911 116441 117695 120111 123060 125496 127241
52647 127241 129103 131785 135171 138592 141341 143109 144352 146021 148443 150742 151963 152389 152971 153770 154031
52632 154031 153734 153793 154383 154218 152224 149068 146143 143627 140468 136077 131155 126752 123180 120066 117064
$$ packed form
52743B03532k051j505j232j627k220k265j749j468j934k554k386j509r03r93j172
52728A77964j025j052j635k092j673r02q79j612k046j663j069q74q83o71l57l57
52712A59174p47j174j241r16o22q34j462j822j544j074r45r66p73p12j332k158
52696A40852k042q55O8m71k131l547l758k774j258n8K21l88j248j642j311o12
52680A19046l19r59k087k476j495j3N78L4o80q08n19k85k75n14r34j172q50j65
52662A06107L45O12J033J620J882J637J228Q86N61N30J254K416K949K436J745
52647A27241J862K682L386L421K749J768J243J669K422K299J221M26N82P99K61
52632A54031k97N9N90j65j994l156k925k516l159m391m922m403l572l114l002
$$ plain form
52617 117064 114168 111491 109019 106654 104404 102335 100317 98033 95442 93041 91346 90200 88987 87477
52603 87477 86014 84765 83337 81404 79326 77743 76778 76027 75222 74543 74186 73942 73354 72202 70681 69091
52587 69091 67533 66050 64912 64422 64406 64317 64030 64123 64954 65898 66062 65528 65231 65666 66421 67057 67703 68429 68717
52568 68717 68114 67054 66451 66586 66861 66642 65999 65501 65472 65645 65532 65111 64985 65766 67393 69192 70470 70862
52550 70862 70328 69245 68406 68396 68846 68715 67525 65932 64903 64685 64820 64859 64729 64576 64561 64737 64986 65178 65429
52531 65429 65969 66716 67233 67286 67190 67456 68260 69411 70585 71472 71977 72441 73402 74948 76528 77561 77977 78029
52513 78029 77977 78179 79111 80804 82568 83721 84423 85334 86615 87839 88826 89969 91528 93083 94074 94517 94845
52496 94845 95213 95364 95213 95220 95983 97593 99504 100977 101563 101308 100689 100328 100534 101066 101493 101765 102174 102722 102973
$$ packed form
52617A17064k896k677k472k365k250k069k018k284k591k401j695j146j213j510
52603H7477j463j249j428j933k078j583r65p51q05o79l57k44n88j152j521j590
52587F9091j558j483j138m90j6q9k87R3Q31R44J64n34k97M35P55O36O46P26K88
52568F8717o03j060o03J35K75k19o43m98k9J73j13m21j26P81J627J799J278L92
52550G0862n34j083q39j0M50j31j190j593j029k18J35L9j30j53j5J76K49J92K51
52531F5429N40P47N17N3r6K66Q04J151J174Q87N05M64R61J546J580J033M16N2
52513G8029n2K02R32J693J764J153P02R11J281J224R87J143J559J555R91M43L28
52496I4845L68J51j51PP63J610J911J473N86k55o19l61K06N32M27K72M09N48K51
$$ plain form
52477 102973 102835 103064 104500 106980 109524 111457 112854 113912 114566 114849 115051 115295 115430 115601 116391 118041
52461 118041 119988 121604 123029 124766 126795 128627 130049 131249 132288 132959 133252 133490 133897 134336 134617 134826
52445 134826 135186 135711 136072 135788 134633 132975 131585 130926 130783 130768 130959 131671 132700 133301 133027 132215 131465 130934
52427 130934 130397 129776 129340 129465 130356 131934 133800 135371 136249 136490 136360 135908 134948 133537 132143 131137 130309
52410 130309 129209 127893 126924 126589 126592 126732 127462 129239 131549 133193 133568 133192 132880 132887 133033 133193 133306 133257 133158
52391 133158 133547 134909 137048 139215 140775 141528 141526 141007 140526 140715 141644 142620 142925 142745 143062 144503 146499
52374 146499 147878 148183 147990 147836 147407 146263 144951 144617 145548 146779 147349 147277 147089 147005 147115 147788 149220 150840
52356 150840 151843 152219 152641 153344 153769 153462 152766 152283 152109 152020 152156 152989 154626 156606 158534 160571 163033
$$ packed form
52477A02973j38K29J436K480K544J933J397J058O54K83K02K44J35J71P90J650
52461A18041J947J616J425J737K029J832J422J200J039O71K93K38M07M39K81K09
52445A34826L60N25L61k84j155j658j390o59j43j5J91P12J029O01k74q12p50n31
52427A30934n37o21m36J25Q91J578J866J571Q78K41j30m52r60j411j394j006q28
52410A30309j100j316r69l35LJ40P30J777K310J644L75l76l12PJ46J60J13m9r9
52391A33158L89J362K139K167J560P53kn19m81J89R29R76L05j80L17J441J996
52374A46499J379L05j93j54m29j144j312l34R31J231N70p2j88q4J10O73J432J620
52356A50840J003L76M22P03M25l07o96m83j74q9J36Q33J637J980J928K037K462
$$ plain form
52339 163033 165667 167739 168908 169703 170970 173018 175480 177777 179496 180464 180804 180857 180766 180171 178648 176419
52323 176419 174236 172509 170932 169048 166849 164663 162818 161568 161019 160849 160358 159071 157191 155371 154198
52308 154198 153904 154210 154374 153762 152579 151684 151571 151911 152287 152822 153693 154550 155005 155373 156327 157911 159478 160604
52290 160604 161559 162781 164264 165655 166782 167920 169544 171754 174031 175808 177292 179305 182168 185173
52276 185173 187497 189218 191052 193414 196136 198859 201285 203323 205402 208279 212080 215921 219033 221892
52262 221892 225457 229590 233248 236201 239566 244280 249895 255322 260220 265065 270291 275897 281732 287768
52248 287768 294131 301043 308690 317066 326014 335403 345103 354873 364560 374409 384853 395933 407229
52235 407229 418415 429625 441235 453592 466962 481392 496487 511540 526057 539990 553540
$$ packed form
52339A63033K634K072J169P95J267K048K462K297J719R68L40N3r1n95j523k229
52323A76419k183j727j577j884k199k186j845j250n49j70m91j287j880j820j173
52308A54198k94L06J64o12j183q95j13L40L76N35Q71Q57M55L68R54J584J567J126
52290A60604R55J222J483J391J127J138J624K210K277J777J484K013K863L005
52276A85173K324J721J834K362K722K723K426K038K079K877L801L841L112K859
52262B21892L565M133L658K953L365M714N615N427M898M845N226N606N835O036
52248B87768O363O912P647Q376Q948R389R700R770R687R849J0444J1080J1296
52235D07229J1186J1210J1610J2357J3370J4430J5095J5053J4517J3933J3550
$$ plain form
52224 553540 566913 580231 593372 605966 617823 629301 640934 652788 664499 675805 686582
52213 686582 696497 705251 713161 720919 728665 735875 742258 748200 754105 759855 765187 770085 774555 778480
52199 778480 781997 785458 788798 791494 793548 795948 799617 804301 809004 813164 816908 820526 824358 828976
52185 828976 834837 841741 849075 856624 864774 874007 884479 895966 907897 919598 930880 942310 954531
52172 954531 967484 980614 993674 1006769 1019619 1031340 1041205 1049373 1056674 1063828 1070936 1077614 1083546
52159 1083546 1088856 1093823 1098214 1101278 1102631 1102901 1103125 1103702 1104281 1104464 1104127 1103099 1101075 1098017 1094331
52144 1094331 1090528 1086970 1083939 1081617 1079807 1077927 1075475 1072418 1069105 1066011 1063602 1062177 1061650 1061549
52130 1061549 1061357 1060883 1060364 1060252 1060875 1062189 1063865 1065558 1066980 1067716 1067402 1066289 1065325 1065265 1065854 1066256 1066097
$$ packed form
52224E53540J3373J3318J3141J2594J1857J1478J1633J1854J1711J1306J0777
52213F86582R915Q754P910P758P746P210O383N942N905N750N332M898M470L925
52199G78480L517L461L340K696K054K400L669M684M703M160L744L618L832M618
52185H28976N861O904P334P549Q150R233J0472J1487J1931J1701J1282J1430J2221
52172I54531J2953J3130J3060J3095J2850J1721R865Q168P301P154P108O678N932
52159A083546N310M967M391L064J353K70K24N77N79J83l37j028k024l058l686
52144A094331l803l558l031k322j810j880k452l057l313l094k409j425n27j01
52130A061549j92m74n19j12O23J314J676J693J422P36l14j113r64o0N89M02j59
$$ plain form
52113 1066097 1065648 1065112 1064332 1063314 1062478 1062110 1061879 1061091 1059270 1056373 1052798 1049263 1046356 1044045 1041881 1039722
52097 1039722 1037855 1036268 1034398 1031954 1029485 1027557 1025743 1023110 1019606 1016257 1013875 1012135 1010118 1007291
52083 1007291 1003708 999631 995323 991014 986744 982370 977909 973709 970016 966558 962849 958845 954978 951499
52069 951499 948117 944415 940494 936978 934390 932571 930795 928518 925972 923836 922281 920636 918256 915473
52055 915473 913266 912095 911505 910953 910520 910543 910988 911598 912429 913780 915722 918043 920692 923970 928285 933914
52039 933914 940952 949258 958520 968607 979850 992666 1006928 1021975 1037272 1052786 1068709 1085085
52027 1085085 1101789 1118596 1135165 1151226 1166910 1182623 1198502 1214191 1229269 1243630 1257275
52016 1257275 1269964 1281325 1291215 1299829 1307507 1314494 1320702 1325665 1328973 1330829 1331937 1332731 1333029 1332608
$$ packed form
52113A066097m49n36p80j018q36l68k31p88j821k897l575l535k907k311k164k159
52097A039722j867j587j870k444k469j928j814k633l504l349k382j740k017k827
52083A007291l583m077m308m309m270m374m461m200l693l458l709m004l867l479
52069I51499l382l702l921l516k588j819j776k277k546k136j555j645k380k783
52055I15473k207j171n90n52m33K3M45O10Q31J351J942K321K649L278M315N629
52039I33914P038Q306R262J0087J1243J2816J4262J5047J5297J5514J5923J6376
52027A085085J6704J6807J6569J6061J5684J5713J5879J5689J5078J4361J3645
52016A257275J2689J1361R890Q614P678O987O208M963L308J856J108P94K98m21
$$ plain form
52002 1332608 1331762 1330945 1330109 1328805 1326847 1324541 1322328 1320479 1319073 1317956 1316759 1315212 1313543 1312332 1311946
51987 1311946 1312214 1312608 1312583 1311877 1310739 1309857 1309839 1310725 1312139 1313795 1315608 1317361 1318637 1319240 1319482 1319889 1320659
51970 1320659 1321444 1321650 1321000 1319814 1318646 1317513 1315738 1312695 1308549 1303941 1299178 1294144 1288868 1283597 1278151
51955 1278151 1271767 1263936 1255101 1246183 1237582 1228832 1219084 1207752 1194919 1181361 1167959 1154792 1140990
51942 1140990 1125792 1109566 1093332 1077395 1061010 1043502 1025203 1006895 988724 970121 950676
51931 950676 930650 910609 890877 871403 851827 831578 810211 787904 765487 743781 723024
51920 723024 703042 683741 665116 646950 628919 611104 594035 578069 562947 548149 533503
51909 533503 519263 505750 493145 481570 471098 461635 452939 444805 437186 430111 423512 417132 410621
$$ packed form
52002A332608q46q17q36j304j958k306k213j849j406j117j197j547j669j211l86
51987A311946K68L94k5p06j138q82j8Q86J414J656J813J753J276O03K42M07P70
51970A320659P85K06o50j186j168j133j775l043m146m608m763n034n276n271n446
51955A278151o384p831q835q918q601q750r748j1332j2833j3558j3402j3167j3802
51942A140990j5198j6226j6234j5937j6385j7508j8299j8308j8171j8603j9445
51931I50676k0026k0041j9732j9474j9576k0249k1367k2307k2417k1706k0757
51920G23024j9982j9301j8625j8166j8031j7815j7069j5966j5122j4798j4646
51909E33503j4240j3513j2605j1575j0472r463q696q134p619p075o599o380o511
$$ plain form
51896 410621 403863 397271 391593 387178 383467 379381 374294 368520 362812 357495 352213 346521 340587 335178
51882 335178 330931 327740 324909 321791 318135 313982 309490 304950 300681 296791 293163 289755 286732 284183
51868 284183 281949 279873 278031 276536 275313 274356 274014 274657 276047 277401 278161 278486 278872 279527 280288 281039
51852 281039 281990 283435 285305 287060 288088 288196 287663 286906 286269 286058 286421 287066 287426 287318 287137 287093 286547 284603
51834 284603 281248 277468 274200 271619 269445 267460 265531 263495 261356 259378 257758 256328 254751 252931
51820 252931 251083 249521 248408 247578 246554 244985 243131 241701 241105 241106 241286 241587 242165 242992 243804 244282 244104
51803 244104 243167 241987 241556 242331 243635 244473 244758 245150 245952 246900 248013 249716 251803 253135 253010 252245 252148
51786 252148 252906 253824 254866 256796 259668 262272 263645 264439 266084 268999 272244 274742 276188 276919 277510
$$ packed form
51896D10621o758o592n678m415l711m086n087n774n708n317n282n692n934n409
51882C35178m247l191k831l118l656m153m492m540m269l890l628l408l023k549
51868B84183k234k076j842j495j223r57l42O43J390J354P60L25L86O55P61P51
51852B81039R51J445J870J755J028J08n33p57o37k11L63O45L60j08j81m4n46j944
51834B84603l355l780l268k581k174j985j929k036k139j978j620j430j577j820
51820B52931j848j562j113q30j024j569j854j430n96JJ80L01N78Q27Q12M78j78
51803B44104r37j180m31P75J304Q38K85L92Q02R48J113J703K087J332j25p65r7
51786B52148P58R18J042J930K872K604J373P94J645K915L245K498J446P31N91
$$ plain form
51771 277510 278631 280825 284143 288130 292235 296119 299689 303104 306657 310342 313573 315750 317108 318583
51757 318583 320702 322995 324693 325614 326063 326142 325584 324181 322100 319749 317490 315496 313833 312683 312423 313236
51741 313236 314633 315698 316013 316117 316807 318176 319608 320594 321287 322254 323941 326372 329217 332118 335003 338040
51725 338040 341270 344408 347127 349432 351597 353812 355963 357751 358970 359775 360623 361735 362637 362486 360993
51710 360993 358786 356762 355370 354588 354229 353984 353483 352627 351695 350875 349966 348769 347443 346211 345041 343939
51694 343939 343169 342708 341943 340556 339385 339578 340957 342016 341669 340306 338944 338046 337514 337297 337472 337998 338678
51677 338678 339232 339305 338709 337791 337150 336865 336400 335529 334835 334948 335651 336221 336406 336601 337134 337803 338194 338210 338226 338806
51657 338806 340185 341971 343494 344543 345662 347593 350620 354555 359170 364376 370068 375991 381839 387439
$$ packed form
51771B77510J121K194L318L987M105L884L570L415L553L685L231K177J358J475
51757C18583K119K293J698R21M49P9n58j403k081k351k259j994j663j150k60Q13
51741C13236J397J065L15J04O90J369J432R86O93R67J687K431K845K901K885L037
51725C38040L230L138K719K305K165K215K151J788J219Q05Q48J112R02j51j493
51710C60993k207k024j392p82l59k45n01q56r32q20r09j197j326j232j170j102
51694C43939p70m61p65j387j171J93J379J059l47j363j362q98n32k17J75N26O80
51677C38678N54P3n96r18o41k85m65q71o94J13P03N70J85J95N33O69L91J6J6N80
51657C38806J379J786J523J049J119J931L027L935M615N206N692N923N848N600
$$ plain form
51643 387439 392935 398692 404819 410672 414993 416651 415250 411158 405241 398509 391629 384642 377354 369922
51629 369922 362708 355619 348224 340677 333901 328407 323520 318267 312634 307339 302736 298651 295122 292428
51615 292428 290334 288008 284988 281728 278891 276551 274413 272417 270696 269140 267459 265653 264069 263015
51601 263015 262528 262517 262871 263375 263813 264289 265212 266740 268395 269577 270395 271633 273830 276770 280084 283959
51585 283959 288772 294221 299323 303388 306670 309951 313765 318050 322318 326056 329109 331711 333930 335266
51571 335266 335145 333710 331594 328897 324985 319530 313146 306690 300425 294317 288651 283707 279101 274135
51557 274135 268751 263624 259334 255815 252665 249617 246659 243935 241532 239194 236453 233263 230286 228206
51543 228206 226946 225942 224958 224124 223300 222045 220304 218600 217425 216845 216838 217518 218770 219986 220482 220087 219205
$$ packed form
51643C87439N496N757O127N853M321J658j401m092n917o732o880o987p288p432
51629C69922p214p089p395p547o776n494m887n253n633n295m603m085l529k694
51615B92428k094k326l020l260k837k340k138j996j721j556j681j806j584j054
51601B63015m87j1L54N04M38M76R23J528J655J182Q18J238K197K940L314L875
51585B83959M813N449N102M065L282L281L814M285M268L738L053K602K219J336
51571C35266j21j435k116k697l912n455o384o456o265o108n666m944m606m966
51557B74135n384n127m290l519l150l048k958k724k403k338k741l190k977k080
51543B28206j260j004r84q34q24j255j741j704j175n80pO80J252J216M96l95q82
$$ plain form
51526 219205 218438 218110 217938 217231 215719 214173 213791 214980 217111 219470 221904 224427 226834 229119 231807
51511 231807 235399 239734 244248 248647 252955 257180 261359 265813 270959 276986 283918 291798 300455 309255
51497 309255 317491 324876 331308 336387 339779 341980 344009 346105 347327 346792 344831 342452 340019 337075
51483 337075 333349 329343 325804 323023 320847 319088 317691 316659 315975 315542 315189 314927 315251 316896 320103
51468 320103 324308 328740 333171 337861 343064 348952 355826 363801 372213 379880 386305 392229 398654 405526
51454 405526 411742 416335 419279 421176 422446 422925 422093 419684 416101 412192 408509 404893 400858 396238 391314
51439 391314 386570 382498 379442 377316 375636 374108 373047 372896 373554 374568 375834 377628 380000 382634 385293
51424 385293 387929 390324 392187 393738 395585 397771 399479 400052 399771 399189 398093 395728 391885 387236 382658
$$ packed form
51526B19205p67l28j72p07j512j546l82J189K131K359K434K523K407K285K688
51511B31807L592M335M514M399M308M225M179M454N146O027O932P880Q657Q800
51497C09255Q236P385O432N079L392K201K029K096J222n35j961k379k433k944
51483C37075l726m006l539k781k176j759j397j032o84m33l53k62L24J645L207
51468C20103M205M432M431M690N203N888O874P975Q412P667O425N924O425O872
51454D05526O216M593K944J897J270M79q32k409l583l909l683l616m035m620m924
51439C91314m744m072l056k126j680j528j061j51O58J014J266J794K372K634K659
51424C85293K636K395J863J551J847K186J708N73k81n82j096k365l843m649m578
$$ plain form
51409 382658 378569 374830 370942 366503 361814 357905 355541 354253 352814 350624 348141 345837 343294 339719
51395 339719 335147 330728 327758 326613 326631 326965 327340 327961 328927 330187 332045 335121 339434 344006 347953 351624
51379 351624 355976 360963 365418 368652 371371 374594 378355 381980 385095 387690 389511 390150 389682 388617 387063
51364 387063 384517 380622 375823 371010 366689 362649 358370 353679 349087 345456 343242 342116 341438 341001 341147
51349 341147 342344 344866 348689 353273 357586 360869 363519 366717 371010 375591 379162 381118 381624 381046 379727
51334 379727 377986 375786 372553 367814 361910 355604 349041 341634 333046 323770 314574 305836 297706 290484
51320 290484 284354 278936 273546 267981 262741 258429 255060 252059 248883 245590 242779 240947 240027 239653 239781
51305 239781 240816 243058 246279 249942 253670 257381 261117 264912 268713 272343 275633 278617 281386 283714
$$ packed form
51409C82658m089l739l888m439m689l909k364j288j439k190k483k304k543l575
51395C39719m572m419k970j145J8L34L75O21R66J260J858L076M313M572L947L671
51379C51624M352M987M455L234K719L223L761L625L115K595J821O39m68j065j554
51364C87063k546l895m799m813m321m040m279m691m592l631k214j126o78m37J46
51349C41147J197K522L823M584M313L283K650L198M293M581L571J956N06n78j319
51334C79727j741k200l233m739n904o306o563p407q588r276r196q738q130p222
51320B90484o130n418n390n565n240m312l369l001l176l293k811j832r20l74J28
51305B39781J035K242L221L663L728L711L736L795L801L630L290K984K769K328
$$ plain form
51291 283714 285094 285316 284752 283771 282129 279218 274777 269043 262304 254703 246497 238223 230475 223628 217667
51276 217667 212172 206618 200937 195706 191486 188121 184976 181703 178309 174662 170604 166635 163768 162323
51262 162323 161381 159859 157752 155833 154470 153330 152078 150775 149529 148245 146864 145613 144879 144982 146029
51247 146029 147721 149335 150173 150098 149508 148919 148824 149715 151685 153940 155314 155542 155664 156848 159166 161875 164593
51230 164593 167714 171767 176794 182383 188006 193355 198618 204379 210961 217888 224338 230102 235765 241897
51216 241897 248405 254764 260449 265036 268330 270646 272585 274117 274205 271806 267101 261278 255225 248912 242017
51201 242017 234670 227354 220496 214308 208738 203420 197956 192406 187212 182496 177808 172836 167999 163903
51187 163903 160431 156894 153052 149510 146941 145257 143757 141849 139462 136924 134712 133230 132587 132460 132280
$$ packed form
51291B83714J380K22n64r81j642k911m441n734o739p601q206q274p748o847n961
51276B17667n495n554n681n231m220l365l145l273l394l647m058l969k867j445
51262A62323r42j522k107j919j363j140j252j303j246j284j381j251p34J03J047
51247A46029J692J614Q38p5n90n89r5Q91J970K255J374K28J22J184K318K709K718
51230A64593L121M053N027N589N623N349N263N761O582O927O450N764N663O132
51216B41897O508O359N685M587L294K316J939J532Q8k399m705n823o053o313o895
51201B42017p347p316o858o188n570n318n464n550n194m716m688m972m837m096
51187A63903l472l537l842l542k569j684j500j908k387k538k212j482o43j27j80
$$ plain form
51172 132280 131700 130909 130428 130515 130866 131060 131224 131999 133690 135716 137124 137550 137391 137195 137240 137736 138997 141104
51154 141104 143595 145744 147168 148016 148640 149233 149731 149948 149746 149191 148618 148483 149077 150301 151633 152358 151955
51137 151955 150425 148321 146436 145354 145150 145368 145350 144736 143730 142825 142255 141809 141182 140331 139366 138264 136970
51120 136970 135707 134825 134260 133425 131903 130009 128388 127188 126045 124843 124007 123838 123936 123610 122637 121313
51104 121313 119944 118645 117572 117016 117161 117899 118821 119256 118606 116992 115414 114828 115121 115415 115309 115233 115560
51087 115560 116068 116527 117200 118327 119603 120666 121654 122745 123465 123178 122211 121825 122900 124975 126756 127373
51071 127373 127123 127134 128219 129931 130939 130486 129248 128439 128406 128501 128084 127107 125873 124799 124366 124731 125325 125396
51053 125396 124971 124746 124952 124936 124120 122823 121822 121539 121962 122930 124158 125328 126497 128152 130514 133042
$$ packed form
51172A32280n80p91m81Q7L51J94J64P75J691K026J408M26j59j96M5M96J261K107
51154A41104K491K149J424Q48O24N93M98K17k02n55n73j35N94J224J332P25m03
51137A51955j530k104j885j082k04K18j8o14j006r05n70m46o27q51r65j102j294
51120A36970j263q82n65q35j522j894j621j200j143j202q36j69R8l26r73j324
51104A21313j369j299j073n56J45P38R22M35o50j614j578n86K93K94j06p6L27
51087A15560N08M59O73J127J276J063R88J091P20k87r67l86J075K075J781O17
51071A27373k50J1J085J712J008m53j238q09l3R5m17r77j234j074m33L65N94P1
51053A25396m25k25K06j6q16j297j001k83M23R68J228J170J169J655K362K528
$$ plain form
51037 133042 134958 136084 136876 137855 139297 141254 143605 146170 149002 152391 156394 160609 164602 168257 171423
51022 171423 173592 174407 174287 174047 173978 173728 172995 171838 170286 168178 165635 163309 161853 161264 160965 160419 159580
51005 159580 158844 158688 159294 160391 161460 162087 162144 161734 161064 160307 159495 158552 157509 156570 155844 155085 153887 152150
50987 152150 150183 148349 146815 145691 145199 145494 146395 147469 148435 149424 150790 152662 154682 156174 156600 156000
50971 156000 155159 155246 156982 159952 162916 165012 166530 168274 170432 172502 174244 176056 178292 180763 183248
50956 183248 186041 189524 193520 197549 201439 205162 208307 210396 211803 213677 216745 220615 224473 227941
50942 227941 230982 233474 235521 237873 241342 245705 249745 252627 254790 257227 260234 263312 266127 269090
50928 269090 272950 278171 284789 292564 301031 309690 318357 327216 336429 345935 355791 366442 378346 391558
$$ packed form
51037A33042J916J126P92R79J442J957K351K565K832L389M003M215L993L655L166
51022A71423K169Q15j20k40o9k50p33j157j552k108k543k326j456n89k99n46q39
51005A59580p36j56O06J097J069O27N7m10o70p57q12r43j043r39p26p59j198j737
50987A52150j967j834j534j124m92K95R01J074R66R89J366J872K020J492M26o00
50971A56000q41Q7J736K970K964K096J518J744K158K070J742J812K236K471K485
50956A83248K793L483L996M029L890L723L145K089J407J874L068L870L858L468
50942B27941L041K492K047K352L469M363M040K882K163K437L007L078K815K963
50928B69090L860N221O618P775Q467Q659Q667Q859R213R506R856J0651J1904J3212
$$ plain form
50914 391558 406051 422214 440592 461177 483469 507277 533012 561062 591341 623688 658331
50903 658331 695588 735307 776866 819694 863642 908853 955223 1001921 1047617 1091511 1134006
50892 1134006 1175923 1217140 1256587 1293541 1328220 1360876 1391164 1418926 1444924 1469970 1493758
50881 1493758 1515359 1534680 1552718 1570448 1588139 1605694 1622861 1638905 1652654 1663198 1670222
50870 1670222 1673519 1672569 1666772 1655744 1639294 1617356 1590135 1558005 1521217 1480099 1435616 1389266
50858 1389266 1342060 1293942 1244506 1194076 1143748 1094581 1047151 1001768 958722 918162 880015
50847 880015 844188 810738 779759 751182 724828 700606 678491 658289 639549 621911 605432
50836 605432 590448 577153 565466 555275 546534 539053 532480 526696 521997 518694 516660 515430 514641
$$ packed form
50914C91558J4493J6163J8378K0585K2292K3808K5735K8050L0279L2347L4643
50903F58331L7257L9719M1559M2828M3948M5211M6370M6698M5696M3894M2495
50892A134006M1917M1217L9447L6954L4679L2656L0288K7762K5998K5046K3788
50881A493758K1601J9321J8038J7730J7691J7555J7167J6044J3749J0544P024
50870A670222L297r50n797j1028j6450k1938k7221l2130l6788m1118m4483m6350
50858A389266m7206m8118m9436n0430n0328m9167m7430m5383m3046m0560l8147
50847H80015l5827l3450l0979k8577k6354k4222k2115k0202j8740j7638j6479
50836F05432j4984j3295j1687j0191q741p481o573n784m699l303k034j230p89
$$ plain form
50823 514641 514276 514627 516077 518691 521910 524996 527924 531494 536320 542124 548396 555284 563305 572510 582630
50808 582630 593863 606751 621262 636703 652681 669543 687684 707014 727509 749791 774760
50797 774760 802919 834402 869455 908557 952114 1000184 1052504 1108814 1169390 1235197 1307155
50786 1307155 1385116 1467896 1554407 1644481 1738376 1835759 1935437 2035956 2136230 2235565 2333065
50775 2333065 2427049 2515343 2596468 2670438 2738042 2799611 2855132 2905390 2952099 2996512 3038598
50764 3038598 3078073 3115642 3152654 3189924 3227525 3265386 3303278 3340154 3373993 3402390 3423032
50753 3423032 3433753 3432742 3418924 3392008 3352122 3299563 3234751 3158083 3069907 2970995 2863139
50742 2863139 2748972 2631092 2511498 2391798 2273558 2158205 2046748 1939859 1838205
$$ packed form
50823E14641l65L51J450K614L219L086K928L570M826N804O272O888Q021R205J0120
50808E82630J1233J2888J4511J5441J5978J6862J8141J9330K0495K2282K4969
50797G74760K8159L1483L5053L9102M3557M8070N2320N6310O0576O5807P1958
50786A307155P7961Q2780Q6511R0074R3895R7383R9678J00519J00274R9335R7500
50775B333065R3984Q8294Q1125P3970O7604O1569N5521N0258M6709M4413M2086
50764C038598L9475L7569L7012L7270L7601L7861L7892L6876L3839K8397K0642
50753C423032J0721j011j3818k6916l9886n2559o4812p6668q8176r8912j07856
50742B863139j14167j17880j19594j19700j18240j15353j11457j06889j01654
$$ plain form
50733 1838205 1742551 1653447 1570823 1493954 1421981 1354501 1291650 1233655 1180486 1131957 1087908
50722 1087908 1048052 1011753 978217 946938 917858 891105 866675 844450 824432 806844 791786
50711 791786 778721 766494 754162 741803 730316 720439 712209 705284 699376 694247 689651 685530 682028
$$ packed form
50733A838205r5654q9104q2624p6869p1973o7480o2851n7995n3169m8529m4049
50722A087908l9856l6299l3536l1279k9080k6753k4430k2225k0018j7588j5058
50711G91786j3065j2227j2332j2359j1487r877q230o925n908n129m596m121l502
$$ [...]
##END NTUPLES=NMR SPECTRUM
##END=
