
##TITLE=AC1142_Costa_5974993_e28T5zyfrc
##JCAMPDX= 6.0         $$ Bruker NMR JCAMP-DX V2.0
##DATA TYPE= NMR SPECTRUM
##DATA CLASS= NTUPLES
##ORIGIN= BRUKER
##OWNER= Administrator
$$ 1.72 TOPSPIN		Version 2.1
$$ 2012-04-16 18:49:17.484 -0500  Administrator@TOPSPIN
$$ Compression mode = diff/dup
##.OBSERVE FREQUENCY= 400.13188235
##.OBSERVE NUCLEUS= ^1H
##.ACQUISITION MODE= SIMULTANEOUS (DQD)
##.ACQUISITION SCHEME= undefined
##.AVERAGES= 8
##.DIGITISER RES= 22
##SPECTROMETER/DATA SYSTEM= spect
##.PULSE SEQUENCE= zg30
##.SOLVENT NAME= COFFEE_meoh
##.SHIFT REFERENCE= INTERNAL, COFFEE_meoh, 1, 14.98061
##AUDIT TRAIL= $$ (NUMBER, WHEN, WHO, WHERE, PROCESS, VERSION, WHAT)
$$ ##TITLE= Audit trail, TOPSPIN		Version 2.1
$$ ##JCAMPDX= 5.01
$$ ##ORIGIN= Bruker BioSpin GmbH
$$ ##OWNER= Administrator
$$ $$ C:\Bruker\TOPSPIN/data/COFFEE/nmr/AC1142_Costa_5974993_e28T5zyfrc/10/pdata/1/auditp.txt
$$ ##AUDIT TRAIL=  $$ (NUMBER, WHEN, WHO, WHERE, PROCESS, VERSION, WHAT)
(   1,<2012-04-15 19:14:38.171 -0500>,<Administrator>,<TOPSPIN>,<go>,<TOPSPIN 2.1>,
      <created by zg
	started at 2012-04-15 19:13:31.750 -0500,
	POWCHK enabled, PULCHK disabled,
       configuration hash MD5:
       1A 1E CE 29 27 FD 77 03 67 4E F0 E3 C4 B2 CB 90
       data hash MD5: 64K
       01 53 3A 18 30 4A D6 60 4D 0A C5 AC 1A AD 6D 92>)
(   2,<2012-04-15 19:14:40.796 -0500>,<Administrator>,<TOPSPIN>,<proc1d>,<TOPSPIN 2.1>,
      <Start of raw data processing
       efp LB = 0 FT_mod = 6 PKNL = 1 PHC0 = 0 PHC1 = 0 SI = 32K 
       data hash MD5: 32K
       85 3C 0B 41 32 93 92 FB A6 2D E2 64 BD ED 87 85>)
(   3,<2012-04-15 19:14:41.234 -0500>,<Administrator>,<TOPSPIN>,<proc1d>,<TOPSPIN 2.1>,
      <pk PHC0 = 217.3975 PHC1 = 0 
       data hash MD5: 32K
       A1 D3 CF E2 AA 59 1E 9C 1F 3E 63 92 A6 AE AE 2C>)
(   4,<2012-04-15 19:14:41.312 -0500>,<Administrator>,<TOPSPIN>,<proc1d>,<TOPSPIN 2.1>,
      <abs ABSG = 1 
       data hash MD5: 32K
       9F 37 01 C9 91 1E 0A 16 AF 53 A6 C9 52 0C B7 7E>)
(   5,<2012-04-15 19:14:41.343 -0500>,<Administrator>,<TOPSPIN>,<proc1d>,<TOPSPIN 2.1>,
      <abs ABSG = 2 
       data hash MD5: 32K
       C8 DF 42 E5 00 90 A0 0F A8 0D CC 26 54 72 84 74>)
(   6,<2012-04-15 19:14:41.375 -0500>,<Administrator>,<TOPSPIN>,<proc1d>,<TOPSPIN 2.1>,
      <abs ABSG = 3 
       data hash MD5: 32K
       07 4B A7 27 1F 87 FC D8 B6 73 AB F0 51 29 EE 92>)
(   7,<2012-04-15 19:14:41.406 -0500>,<Administrator>,<TOPSPIN>,<proc1d>,<TOPSPIN 2.1>,
      <abs ABSG = 4 
       data hash MD5: 32K
       B6 8A ED FE 74 5A 54 28 3A 60 A8 55 E5 9A 21 5E>)
(   8,<2012-04-15 19:14:41.421 -0500>,<Administrator>,<TOPSPIN>,<proc1d>,<TOPSPIN 2.1>,
      <abs ABSG = 5 
       data hash MD5: 32K
       F7 CC 89 25 D2 0B 83 26 86 0B CF EE F2 D7 41 EF>)
(   9,<2012-04-15 19:14:45.062 -0500>,<Administrator>,<TOPSPIN>,<audit>,<TOPSPIN 2.1>,
      <user comment:
       ICON-NMR User ID: COFFEE
       data hash MD5: 32K
       F7 CC 89 25 D2 0B 83 26 86 0B CF EE F2 D7 41 EF>)
$$ ##END=
$$ 
$$ [...]
150 150 150 150 150 150 150 150
##$TP07= 0
##$TPNAME0= <>
##$TPNAME1= <>
##$TPNAME2= <>
##$TPNAME3= <>
##$TPNAME4= <>
##$TPNAME5= <>
##$TPNAME6= <>
##$TPNAME7= <>
##$TPOAL= (0..7)
0.5 0.5 0.5 0.5 0.5 0.5 0.5 0.5
##$TPOFFS= (0..7)
0 0 0 0 0 0 0 0
##$TUNHIN= 0
##$TUNHOUT= 0
##$TUNXOUT= 0
##$USERA1= <user>
##$USERA2= <user>
##$USERA3= <user>
##$USERA4= <user>
##$USERA5= <user>
##$V9= 5
##$VALIST= <valist>
##$VCLIST= <CCCCCCCCCCCCCCC>
##$VD= 0
##$VDLIST= <DDDDDDDDDDDDDDD>
##$VPLIST= <PPPPPPPPPPPPPPP>
##$VTLIST= <TTTTTTTTTTTTTTT>
##$WBST= 2048
##$WBSW= 25
##$XGAIN= (0..3)
0 0 0 0
##$XL= 0
##$YL= 0
##$YMAX_a= 460998
##$YMIN_a= -543385
##$ZGOPTNS= <>
##$ZL1= 120
##$ZL2= 120
##$ZL3= 120
##$ZL4= 120
##$ABSF1= 14.98061
##$ABSF2= -5.57192
##$ABSG= 5
##$ABSL= 3
##$ALPHA= 0
##$AQORDER= 0
##$ASSFAC= 0
##$ASSFACI= 0
##$ASSFACX= 0
##$ASSWID= 0
##$AUNMP= <proc_prof1d_extract_pilot.lims>
##$AXLEFT= 0
##$AXNAME= <>
##$AXNUC= <1H>
##$AXRIGHT= 0
##$AXTYPE= 0
##$AXUNIT= <>
##$AZFE= 0.1
##$AZFW= 0.1
##$BCFW= 0
##$BC_mod= 0
##$BYTORDP= 0
##$COROFFS= 0
##$CY= 15
##$DATMOD= 1
##$DC= 0
##$DFILT= <>
##$DTYPP= 0
##$F1P= 0
##$F2P= 0
##$FCOR= 0.5
##$FTSIZE= 32768
##$FT_mod= 6
##$GAMMA= 0
##$GB= 0
##$INTBC= 1
##$INTSCL= 1
##$ISEN= 128
##$LB= 0
##$LEV0= 0
##$LPBIN= 0
##$MAXI= 10000
##$MC2= 0
##$MEAN= 0
##$ME_mod= 0
##$MI= 0
##$NCOEF= 0
##$NC_proc= -8
##$NLEV= 6
##$NOISF1= 0
##$NOISF2= 0
##$NSP= 0
##$NTH_PI= 0
##$NZP= 0
##$OFFSET= 14.98061
##$PC= 1
##$PHC0= 217.3975
##$PHC1= 0
##$PH_mod= 1
##$PKNL= yes
##$PPARMOD= 0
##$PPDIAG= 0
##$PPIPTYP= 0
##$PPMPNUM= 2147483647
##$PPRESOL= 1
##$PSCAL= 4
##$PSIGN= 0
##$PYNMP= <proc.py>
##$REVERSE= no
##$SF= 400.13
##$SI= 32768
##$SIGF1= 0
##$SIGF2= 0
##$SINO= 400
##$SIOLD= 32768
##$SPECTYP= <>
##$SREGLST= <1H.CDCl3>
##$SSB= 0
##$STSI= 32768
##$STSR= 0
##$SW_p= 8223.68421052632
##$SYMM= 0
##$S_DEV= 0
##$TDeff= 65536
##$TDoff= 0
##$TI= <>
##$TILT= no
##$TM1= 0
##$TM2= 0
##$TOPLEV= 0
##$USERP1= <user>
##$USERP2= <user>
##$USERP3= <user>
##$USERP4= <user>
##$USERP5= <user>
##$WDW= 1
##$XDIM= 32768
##$YMAX_p= 431928462
##$YMIN_p= -723356
##$CURPLOT= <Network HP LaserJet P1505>
##$CURPRIN= <$Network HP LaserJet P1505>
##$DFORMAT= <normdp>
##$LAYOUT= <+/1D_H.xwp>
##$LFORMAT= <normlp>
##$PFORMAT= <normpl>
##$SURQMSG= 1
$$ End of Bruker specific parameters
$$ ---------------------------------
##NTUPLES= NMR SPECTRUM
##VAR_NAME=  FREQUENCY,     SPECTRUM/REAL,   SPECTRUM/IMAG
##SYMBOL=    X,             R,               I
##VAR_TYPE=  INDEPENDENT,   DEPENDENT,       DEPENDENT
##VAR_FORM=  AFFN,          ASDF,            ASDF
##VAR_DIM=   32768,         32768,           32768
##UNITS=     HZ,            ARBITRARY UNITS, ARBITRARY UNITS
##FACTOR=    0.250966925370066, 1,           1
##FIRST=     8223.43324360095, -95416,       -301486
##LAST=      0,             69100,           -59348
##MIN=       0,             -723356,         0
##MAX=       8223.43324360095, 431928462,    0
$$ Real data points
##PAGE= N=1
##DATA TABLE= (X++(R..R)), XYDATA
$$ [...]
19491A8595a15662A34405a94704c0968n2025j29057d8104a1949l0336l84620a15155
$$ 18595 -115662 134405 -194704 -30968 -82993 -212050 -48104 -11949 -42285 -426905 -115155
19479c97139B39405J0659a6292k13606j89843e8145n0629J7213J4091j51913a0412
$$ -397139 239405 250064 -16292 -229898 -419741 -58145 -108774 -91561 -77470 -229383 -10412
19467i6742j99679N4834R8861I7723b35589I0860J236a23539A41516a60015G3015
$$ -96742 -296421 -241587 -142726 97723 -235589 90860 92096 -123539 141516 -160015 73015
19455B7067K66260a81715b05k54993c5909j30250A76664f8788k34945c0124j18455
$$ 27067 293327 -181715 -205 -255198 -35909 -166159 176664 -68788 -303733 -30124 -148579
19444a48579A6956b46925P6993d0666H7943d1241j26197A00318a00003A14812
$$ -148579 16956 -246925 -169932 -40666 87943 -41241 -167438 100318 -100003 114812
19433c2401r8548j87828f7185A64758E0398K77029A25938b03298j13554a5799
$$ -32401 -130949 -318777 -67185 164758 50398 327427 125938 -203298 -316852 -15799
19422b77313i7764A07002i1815R648K1113k71797B96047A6434a4534j9166E3124
$$ -277313 -97764 107002 -91815 -82167 -61054 -332851 296047 16434 -14534 -33700 53124
19410B4325L2023R6498a76905K6996L1641a4991k00874E5726A7671f158D0140
$$ 24325 56348 152846 -176905 -149909 -118268 -14991 -215865 55726 17671 -6158 40140
19398B11480a01478c440l955n9544A08092h1445k4842J286L5993j01827j27315
$$ 211480 -101478 -3440 -7395 -66939 108092 -81445 -106287 -105001 -69008 -170835 -298150
19387b98150B2075J31028a06881H8498b45186B16030a37798J3396I4394d3190
$$ -298150 22075 153103 -106881 88498 -245186 216030 -137798 -124402 94394 -43190
19376a69394k62815a97974E3159b36900d742j31293f1729r3523k44743A38290
$$ -169394 -432209 -197974 53159 -236900 -4742 -136035 -61729 -155252 -399995 138290
19365b39663m8652c8143k22919g2399A29045b80122n0979E2492A7422b3409q2272
$$ -239663 -288315 -38143 -261062 -72399 129045 -280122 -331101 52492 17422 -23409 -105681
19354a05681c566A14663c09269a08573L9159j74502J20435j11379E9889a87259
$$ -105681 -3566 114663 -309269 -108573 -69414 -243916 -123481 -234860 59889 -187259
19343a20188A44101a13288j03163i9502k6773L4075r5768E6927K8334b35561A89327
$$ -120188 144101 -113288 -216451 -99502 -126275 -92200 -187968 56927 85261 -235561 189327
19331D8377a39392j85551A55529a05190j14805G1584M3925h7104n109q7496n249
$$ 48377 -139392 -324943 155529 -105190 -219995 71584 115509 -87104 -92213 -179709 -184958
19320a84958m3848a4034B05308b0585j2160n3820l39389R6150R2434P2391A3115
$$ -184958 -228806 -14034 205308 -20585 -32745 -86565 -425954 -329804 -237370 -164979 13115
19308a71452A26879m3782a88079j7124M8528j37423C14078A6079J91716b25629
$$ -171452 126879 83097 -188079 -205203 -156675 -294098 314078 16079 207795 -225629
19297e8102J591j27747p3840e685j37505m5616q6727a37511A16547a8076A38173
$$ -58102 -56511 -184258 -258098 -5685 -143190 -188806 -275533 -137511 116547 -18076 138173
19285c34817J61284K4597l04073F587N1370i3470k36226A80447c85690h8363l08922
$$ -334817 -173533 -148936 -453009 6587 57957 -93470 -329696 180447 -385690 -88363 -397285
19274c97285A60498a55613e190j44819j05099Q9513D8411a44737F3574J5165K23225
$$ -397285 160498 -155613 -5190 -150009 -255108 -165595 48411 -144737 63574 78739 301964
19263C01964d36883B05290d9469D0897N409b33196c2279C5107b31035J2204Q3890
$$ 301964 -436883 205290 -49469 40897 46306 -233196 -32279 35107 -231035 -218831 -134941
19252a34941f1960K1605F5325a65765C403c15421E8314i6620p3020p1636p8752
$$ -134941 -61960 -40355 65325 -165765 3403 -315421 58314 -96620 -169640 -241276 -320028
19241c20028F9506d71628A46160a75567j7027A57781a83736B39599A6116M4681
$$ -320028 69506 -471628 146160 -175567 -192594 157781 -183736 239599 16116 60797
19231F0797C0180a0734A95122g948m00914J63552G9142b04735a158F1281J93010
$$ 60797 30180 -10734 195122 -7948 -408862 -245310 79142 -204735 -1158 61281 254291
19220B54291F0343a83517m3190Q0981A8540e9688I0097a73858O1120A80489a50162
$$ 254291 60343 -183517 -226707 -145726 18540 -59688 90097 -173858 -112738 180489 -150162
19208g101l14033a00622k01638h9338l42718a71079j43457J01166r5779d9488
$$ -7101 -321134 -100622 -302260 -89338 -432056 -171079 -314536 -213370 -309149 -49488
19197C77483b63239M0356A26923b0055k52574A38403e1910A81688a52029O344
$$ 377483 -263239 -222883 126923 -20055 -272629 138403 -51910 181688 -152029 -145685
19187a45685m7307f6065E386K0368g959C5026a7937A84532l9901b21693a2724
$$ -145685 -192992 -66065 5386 25754 -7959 35026 -17937 184532 144631 -221693 -12724
19175A95271f5377l48923A65775b75097E825a36678j67376A28944b53027c1710
$$ 195271 -65377 -414300 165775 -275097 5825 -136678 -304054 128944 -253027 -31710
19164A88421E2688g2994F8079D806e32773A99350b72740e8996A47412b53975G2244
$$ 188421 52688 -72994 68079 4806 -532773 199350 -272740 -58996 147412 -253975 72244
19152a9574A97341d46685A22670J53760j7078c57477J77803A33071B8366a05871
$$ -19574 197341 -446685 122670 276430 259352 -357477 -179674 133071 28366 -105871
19141f8896A9464K29146h936j57862r3234A53626l9241Q5237g5688A06924a11454
$$ -68896 19464 248610 -8936 -166798 -260032 153626 114385 199622 -75688 106924 -111454
19129c05358C5144b11692C9613a38152d2426l9789j75067B92976F0941c10531
$$ -305358 35144 -211692 39613 -138152 -42426 -82215 -257282 292976 60941 -310531
19118B0112e930B24583c07100g1405C8797J39779N1232c7669j13380l9672b9003
$$ 20112 -5930 224583 -307100 -71405 38797 178576 229808 -37669 -151049 -190721 -29003
19106a9396j18j33335d684l93914a81167j0624d9381a2980C30257J45541G1771
$$ -19396 -19514 -152849 -4684 -398598 -181167 -191791 -49381 -12980 330257 475798 71771
19094a09901A05013f4271r4721B155b15185q2334d3162j0384A27464k6829L0628
$$ -109901 105013 -64271 -158992 2155 -215185 -297519 -43162 -53546 127464 100635 131263
19083A31263d23088G9829e29308b9982j361k70345a2139j05575d0099m2491A41492
$$ 131263 -423088 79829 -529308 -29982 -31343 -301688 -12139 -117714 -40099 -82590 141492
19071c6937E9464d6952I584a99305b2323l38492E1658a26215l7401A84550a12394
$$ -36937 59464 -46952 9584 -199305 -22323 -360815 51658 -126215 -163616 184550 -112394
19059f9172A45015n7777c7954I1618j4443c09517g9888l06159J54513M7752c0090
$$ -69172 145015 87238 -37954 91618 77175 -309517 -79888 -386047 -231534 -183782 -30090
19047a19647G8786l2387a55126l2125c2308k61493l0593o3644J24852i9775m6574
$$ -119647 78786 46399 -155126 -187251 -32308 -293801 -324394 -388038 -263186 -99775 -146349
19036a46349c0295k70973d2124Q617B96393b4385B22381C8686h8087L7700j51378
$$ -146349 -30295 -301268 -42124 -33507 296393 -24385 222381 38686 -88087 -50387 -201765
19025b01765I8538e1551p3891j09797j1522N1077j00950G6000j4238e2579r148
$$ -201765 98538 -51551 -125442 -235239 -246761 -195684 -296634 76000 61762 -52579 -61727
19014f1727m1102A24637c6912A33829A4287J74415i9744E6289b17292A75984q1606
$$ -61727 -102829 124637 -36912 133829 14287 188702 -99744 56289 -217292 175984 94378
19003I4378a96780a4152j94827n6437L8288B10137O2308b8286k4721n8851j82596
$$ 94378 -196780 -14152 -208979 -265416 -227128 210137 272445 -28286 -53007 -111858 -294454
18992b94454b9874j84617C9987b42112A90272K49672e2026o694J1786C7510b50375
$$ -294454 -29874 -214491 39987 -242112 190272 439944 -52026 -58720 -46934 37510 -250375
18980a29431j4628r7070i1093b0071j29215j0198B61692l1250a02925c8285r432
$$ -129431 -144059 -241129 -91093 -20071 -149286 -159484 261692 230442 -102925 -38285 -47717
18969d7717k52804b1111B93593j40377c35373c0763B11517d1318G9754M6829M7359
$$ -47717 -300521 -21111 293593 153216 -335373 -30763 211517 -41318 79754 126583 173942
18958A73942L56479A85900a62604A82382b40317C45880c568l00360g9778l20768
$$ 173942 530421 185900 -162604 182382 -240317 345880 -3568 -303928 -79778 -400546
18948d00546C13352b0880G3488d58540J76793m7382j3927h7074j57405A12928
$$ -400546 313352 -20880 73488 -458540 -281747 -329129 -343056 -87074 -244479 112928
18937f8377k00793a09704e0311j33484B9555h4786j14057Q7084B38834G3296J5741
$$ -68377 -269170 -109704 -50311 -183795 29555 -84786 -198843 -111759 238834 73296 89037
18926H9037c75124B6157J86110I3381B184J66016N9147a77866A84004a01118j38656
$$ 89037 -375124 26157 212267 93381 2184 168200 227347 -177866 184004 -101118 -239774
18915b39774c7946j39417I2833P6361a02502A78955N2225J1823M800c26322g5693
$$ -239774 -37946 -177363 92833 169194 -102502 178955 231180 243003 247803 -326322 -75693
18903a8273n5819k3266A7213c09663b2984A49637m1753J43519L9566j41364c04304
$$ -18273 -74092 -97358 17213 -309663 -22984 149637 107884 251403 290969 149605 -304304
18891b86490F2710K49192b29459c820D7247a71282k7504e5337B91416A09295a38084
$$ -286490 62710 311902 -229459 -3820 47247 -171282 -198786 -55337 291416 109295 -138084
18879b6943a40r788B00742d19957Q8576e1723p3506I6562g0461A55034B369a92366
$$ -26943 -140 -9928 200742 -419957 -331381 -51723 -125229 96562 -70461 155034 2369 -192366
18866a18915M3973l93968a219j5913b348q0353A5871a09097k27548J38368A59060
$$ -118915 -74942 -468910 -1219 -17132 -2348 -82701 15871 -109097 -336645 -198277 159060
18854D826a27620K989B02978F4705N2678J07136b04485r7279C6705i0049j15037
$$ 4826 -127620 -124631 202978 64705 117383 224519 -204485 -301764 36705 -90049 -205086
18843b05086j8522J8622i0935B12572d3411l9690j17542F3506k2023e3798k80783
$$ -205086 -223608 -204986 -90935 212572 -43411 -83101 -200643 63506 41483 -53798 -334581
18832c34581a47132A80279b2503B14756l1595H877a19672F9066K58861g1168q0633
$$ -334581 -147132 180279 -22503 214756 183161 8877 -119672 69066 327927 -71168 -151801
18821a51801A52458A9918a1423r050j88670c8744A32092a96994G0358J85866c1621
$$ -151801 152458 19918 -11423 -20473 -209143 -38744 132092 -196994 70358 256224 -31621
18809B81942b3597C3801J6754a96530B5779J90629f6389A23523b98056P8091E09845
$$ 281942 -23597 33801 50555 -196530 25779 216408 -66389 123523 -298056 -219965 509845
18797B78956J6194P6486A9428J07127P9477b1309j20352A5641b02705O8292a3682
$$ 278956 295150 371636 19428 126555 206032 -21309 -141661 15641 -202705 -134413 -13682
18785b81151E9707M848J2465c94662b9702j95362E3467b89034A24831e8149j09034
$$ -281151 59707 64555 77020 -394662 -29702 -225064 53467 -289034 124831 -58149 -167183
18774a67183K9573d414A56439a73666M872J9916L7354j70453i8111b1467A31600
$$ -167183 -137610 -4414 156439 -173666 -168794 -148878 -111524 -281977 -98111 -21467 131600
18762i819j924q2637K674j48648a01373j97520Q5951b5401j08354k29550c8588
$$ -9819 -11743 -94380 -91706 -240354 -101373 -298893 -212942 -25401 -133755 -363305 -38588
18750E4410b7185j26162B9769e56271f7650j5138o201q3922B10921L6441B6515
$$ 54410 -27185 -153347 29769 -556271 -67650 -82788 -88989 -172911 210921 247362 26515
18738G9481K24425d94761I796K9519a90450G6477b6152A6934a98106f0782l5045
$$ 79481 303906 -494761 9796 39315 -190450 76477 -26152 16934 -198106 -60782 -95827
18727i5827C40381g6685L3034a9227m9734A63985a46953M4558j83270Q5291F6065
$$ -95827 340381 -76685 -43651 -19227 -68961 163985 -146953 -102395 -285665 -200374 66065
18715D916M9980J58724a9104B8845c37796A7556f07259F7673o511a50513B40650
$$ 4916 54896 213620 -19104 28845 -337796 17556 -607259 67673 61162 -150513 240650
18703a27779I0606b1662j94761c2245n4263F2054J38731b16534i2453k10688k4608
$$ -127779 90606 -21662 -216423 -32245 -86508 62054 200785 -216534 -92453 -303141 -327749
18692c27749a11375o7407B456K32463o0197a89942a215j33113q8435a00872A55919
$$ -327749 -111375 -178782 2456 234919 174722 -189942 -1215 -134328 -222763 -100872 155919
18680a78817j16791A04953g9910k62824A28483b56831A80560d00104J65853A93752
$$ -178817 -295608 104953 -79910 -342734 128483 -256831 180560 -400104 -234251 193752
18669b00334h6925J7633A39893c7458j13571L2590F9103J69023J41875B2096J34054
$$ -200334 -86925 -69292 139893 -37458 -151029 -118439 69103 238126 380001 22096 156150
18658A56150K8887a68297f4478j93130J8707A33550g8549l9039a4919j16710A08062
$$ 156150 185037 -168297 -64478 -257608 -238901 133550 -78549 -117588 -14919 -131629 108062
18646b39300f8660l3399k3150b6053j50808D4335b21524P2582k44598H7277K00680
$$ -239300 -68660 -102059 -125209 -26053 -176861 44335 -221524 -148942 -393540 87277 287957
18635B87957a7880B9277g1524r6719C7965J45934D2192q351h2361f617F68K9775
$$ 287957 -17880 29277 -71524 -168243 37965 183899 42192 33841 -82361 -6617 668 30443
18623C0443j3863J62816i1956j65731C73972f6425j53775I2135j8678a90335P8743
$$ 30443 16580 179396 -91956 -257687 373972 -66425 -220200 92135 73457 -190335 -111592
18612a11592H7105a57455H3708b57218i226r4064r8348c2277a683I9039K35859
$$ -111592 87105 -157455 83708 -257218 -9226 -103290 -201638 -32277 -1683 99039 334898
18601C34898f1791A34385d37799a93396K7634I075R9670b83476a00382D5173J34860
$$ 334898 -61791 134385 -437799 -193396 -165762 9075 108745 -283476 -100382 45173 180033
18590A80033d26358a66928b4990C4670C31J14168a3973j24619A37933P672A990
$$ 180033 -426358 -166928 -24990 34670 331 114499 -13973 -138592 137933 145605 1990
18578a6245l3450j36763j43587A86971b99828B00270a44298A84897h3030k73701
$$ -16245 -49695 -186458 -330045 186971 -299828 200270 -144298 184897 -83030 -356731
18568c56731J16237b0938o3929j90051j39904A03638b28152k03224D2260a22913
$$ -356731 -240494 -20938 -84867 -274918 -414822 103638 -228152 -431376 42260 -122913
18557b14222b6521j6261q8973j28434J06713r2658H4186f2287j79407j28032C9177
$$ -214222 -26521 -42782 -131755 -260189 -153476 -246134 84186 -62287 -241694 -369726 39177
18545a22472j0294j77582A16383b55948A54878a76922a5742j32373a6452F8863
$$ -122472 -132766 -310348 116383 -255948 154878 -176922 -15742 -148115 -16452 68863
18534a33245p3811O4891E7262a77951N3945c6252j4485A21523e7395A17695b05587
$$ -133245 -207056 -142165 57262 -177951 -124006 -36252 -50737 121523 -57395 117695 -205587
18522b24602c4572k19499D96332G527b30316A03352B9604g3795C49777D3588b17951
$$ -224602 -34572 -254071 496332 7527 -230316 103352 29604 -73795 349777 43588 -217951
18510b2168j65017A56148h5212J9671k19205f8878l8035d7035n8137d8450A90556
$$ -22168 -187185 156148 -85212 -65541 -284746 -68878 -106913 -47035 -105172 -48450 190556
18498d21989a10219m7067k34821c7680j76949O627Q1171k4792I6282b74586B461
$$ -421989 -110219 -157286 -392107 -37680 -214629 -208002 -126831 -151623 96282 -274586 2461
18486A33276b61267a21072M1507j48053E5178d05953d8590J4711k6725p8075l2485
$$ 133276 -261267 -121072 -79565 -227618 55178 -405953 -48590 -33879 -60604 -138679 -171164
18475a71164E8879a06619F7427a29642e6809R76K3851j4526o7492i127d059j43073
$$ -171164 58879 -106619 67427 -129642 -56809 -55833 -31982 -46508 -114000 -9127 -4059 -147132
18463a47132J4329f2861l5957E4072f76E3787k0716a19755H9922O0822J6741c25630
$$ -147132 -132803 -62861 -98818 54072 -676 53787 33071 -119755 89922 150744 167485 -325630
18450A2115M7504a23848d8433A5429a55241A39268K5820e33814B22124a38327
$$ 12115 59619 -123848 -48433 15429 -155241 139268 165088 -533814 222124 -138327
18439e7926j75867D6224a03143A36582F5047d2099K783A77413j78B6688c12419
$$ -57926 -233793 46224 -103143 136582 65047 -42099 -39316 177413 177235 26688 -312419
18427A07341e8595b2045n2513A75205e5120B62561d7348l55249a62430A3649c30226
$$ 107341 -58595 -22045 -74558 175205 -55120 262561 -47348 -402597 -162430 13649 -330226
18415A30748k375a62120C3364c47655a65630l5481Q9274L9805c3320C4256a1525
$$ 130748 128373 -162120 33364 -347655 -165630 -201111 -111837 -72032 -33320 34256 -11525
18403A73565B2934Q3099h5935I2588b6746k6800p5179B2056a05493K2028q2905
$$ 173565 22934 106033 -85935 92588 -26746 -53546 -128725 22056 -105493 -83465 -166370
18392a66370q1472A82869b65774L267a18434j11545A9422g8481k5819A73458o9089
$$ -166370 -247842 182869 -265774 -262507 -118434 -229979 19422 -78481 -104300 173458 104369
18381A04369c3057j4708B2483b65993K3040f1925p8672L8031A54680b96610A01024
$$ 104369 -33057 -47765 22483 -265993 -242953 -61925 -140597 -102566 154680 -296610 101024
18369A13031R0982a89101f4207c0773j33658A11992a6177A04640k6206J63822
$$ 113031 204013 -189101 -64207 -30773 -164431 111992 -16177 104640 78434 242256
18359B42256e1679f649p0435o7934l7109B94860E4204c11054R418C402e09227
$$ 242256 -51679 -6649 -77084 -145018 -182127 294860 54204 -311054 -301636 3402 -509227
18347F7732c62783J68089B55558b3797B51367G2027b43546c781C75450a01748
$$ 67732 -362783 -194694 255558 -23797 251367 72027 -243546 -3781 375450 -101748
18336C58598a10057F881c21828A24827a08917C0988A4511K03430r3140D7214N0559
$$ 358598 -110057 6881 -321828 124827 -108917 30988 14511 217941 124801 47214 97773
18325I7773c24642J52908I8127M5591R4411q6294F8703B3130Q4181a30036b0057
$$ 97773 -324642 -171734 98127 143718 238129 151835 68703 23130 107311 -130036 -20057
18313B24562b62202a8625j29900F9135a27880J5216j84180h5733c669m17957a34866
$$ 224562 -262202 -18625 -148525 69135 -127880 -112664 -296844 -85733 -3669 -421626 -134866
18301B7483N2967b28829A95274a22387L0900l21276B53013n2872a12786B7470
$$ 27483 80450 -228829 195274 -122387 -91487 -412763 253013 200141 -112786 27470
18290b89953a07208A01255b09463H9911K09590B216b64341B6260N9217C1007a52122
$$ -289953 -107208 101255 -209463 89911 299501 2216 -264341 26260 85477 31007 -152122
18278B08311I555f6862j99556D567a27312a5737j16154b1922g982n9788k36267
$$ 208311 9555 -66862 -266418 4567 -127312 -15737 -131891 -21922 -7982 -67770 -304037
18267c04037J32636B07899r1561a86917H3429C5259h3152q3099B69453e2186A63630
$$ -304037 -171401 207899 116338 -186917 83429 35259 -83152 -166251 269453 -52186 163630
18255B4554J0534i5424j28938G8811i1526B50159A03231J0000L993L7559d5339
$$ 24554 35088 -95424 -224362 78811 -91526 250159 103231 113231 117224 154783 -45339
18243a01312d0519n5729d432k5587A63196F6284f2964k9263A22666C3961h5427
$$ -101312 -40519 -96248 -4432 -30019 163196 66284 -62964 -92227 122666 33961 -85427
18231b7723j41587J8166m560f1217A29502b50000e2211j35399q3016B9575L90642
$$ -27723 -169310 -151144 -155704 -61217 129502 -250000 -52211 -187610 -270626 29575 420217
18220D20217j08226a70911A28904K0666a38255j07897n470G443R0578J83272h6622
$$ 420217 311991 -170911 128904 149570 -138255 -246152 -251622 7443 98021 281293 -86622
18208g0241l490K8607R626B27289j8462a70494A13350b50668g7455j52285B40864
$$ -70241 -73731 -45124 -35498 227289 208827 -170494 113350 -250668 -77455 -229740 240864
18196b44916a11279B6273b42525J07947L5405c2586D3601a66017e0749a0826B01799
$$ -244916 -111279 26273 -242525 -134578 -99173 -32586 43601 -166017 -50749 -10826 201799
18184a56439B71759d84841B1767J39912M3597a08263A8496J33670c50240J68i4386
$$ -156439 271759 -484841 21767 161679 205276 -108263 18496 152166 -350240 -350072 -94386
18172B2949e4481A11851b32707A09130b21945e4314p5339A68864a19870k51874
$$ 22949 -54481 111851 -232707 109130 -221945 -54314 -129653 168864 -119870 -371744
18162c71744b2497k00535A06479J20047h7970G5935L8876P5643c19021C1059d4889
$$ -371744 -22497 -223032 106479 226526 -87970 75935 114811 190454 -319021 31059 -44889
18150A70885a71583A30551J63598a97225b9538A86448a5421j11000E76034k26831
$$ 170885 -171583 130551 294149 -197225 -29538 186448 -15421 -126421 576034 349203
18140C49203b1004B16545l2f6435b1423i503A44100a13728A59725i1852l55896
$$ 349203 -21004 216545 216513 -66435 -21423 -9503 144100 -113728 159725 -91852 -447748
18129d47748f6810j37741B51988B0870g1026J0790A22831J83077h6648C2245h4165
$$ -447748 -66810 -204551 251988 20870 -71026 -60236 122831 305908 -86648 32245 -84165
18117B0531M5031a19798j75316P3100q0285B27095a48806c5358D52617a61230
$$ 20531 65562 -119798 -295114 -222014 -302299 227095 -148806 -35358 452617 -161230
18106A07731c5256l60118D560b67855m754C58286b22052J5966r065A49188a8954
$$ 107731 -35256 -395374 4560 -267855 -272609 358286 -222052 -206086 -215151 149188 -18954
18094c11373c7301A68791a17650F2224K8833C144J55582j7016M6076d27153f7711
$$ -311373 -37301 168791 -117650 62224 91057 3144 158726 141710 187786 -427153 -67711
18082a04758e1622r4899n9804H370i8923k17709c1557q9833G8072L3105D8826
$$ -104758 -51622 -146521 -206325 8370 -98923 -316632 -31557 -121390 78072 111177 48826
18070I3689c69611J62804H8017A5724P6325P253c2192d236p2565E7106N2055A6395
$$ 93689 -369611 -206807 88017 15724 92049 99302 -32192 -4236 -76801 57106 109161 16395
18057c39543a38091K0018N3819A95270b86309A48415i7068k4372n0042e1708b0386
$$ -339543 -138091 -118073 -64254 195270 -286309 148415 -97068 -121440 -171482 -51708 -20386
18045b04455a7772p2020D735K0541f5074a1530D6912N8730H480M9450K5000f9547
$$ -204455 -17772 -89792 4735 25276 -65074 -11530 46912 105642 8480 57930 82930 -69547
18032a59192A10140i6810A34184a98879C41570F4492a17052B19132Q1487f9878
$$ -159192 110140 -96810 134184 -198879 341570 64492 -117052 219132 300619 -69878
18021G2912J35403a13161A01695c24070G164d18030H6397J40184a27941N0742
$$ 72912 208315 -113161 101695 -324070 7164 -418030 86397 226581 -127941 -77199
18011g7199L8046C84458j50262j13307b03337H7464J90878H7926a094k11401c3914
$$ -77199 -39153 384458 234196 120889 -203337 87464 278342 87926 -1094 -212495 -33914
17999E6805O2747b83297R0646B37860a22785a0563H5395b1497C37056k3539i2000
$$ 56805 119552 -283297 -192651 237860 -122785 -10563 85395 -21497 337056 313517 -92000
17987B35778a467k1833H7147A3914a25111H0363a96539B04291a98622C0658J05683
$$ 235778 -1467 -23300 87147 13914 -125111 80363 -196539 204291 -198622 30658 136341
17976A36341b87487d7266C2310Q027M9318D2197K4006d8436j65321A60849J96799
$$ 136341 -287487 -47266 32310 40337 89655 42197 66203 -48436 -213757 160849 357648
17965C57648h3347k2187j47021a13004L3513B1686a10194A17882L465m8331B0776
$$ 357648 -83347 -105534 -252555 -113004 -79491 21686 -110194 117882 121347 73016 20776
17953A40895a54804r2367A84730c684k31712l19743D2675J23021e0549j8801A03044
$$ 140895 -154804 -247171 184730 -3684 -235396 -555139 42675 165696 -50549 -69350 103044
17941f0073l5162R779k69049h1921j9972E0905J84557j05817K3704C0649J7887
$$ -60073 -95235 -85456 -354505 -81921 -101893 50905 235462 129645 153349 30649 48536
17930D8536a09464C75026A9039J2364K18040D2133P6075b37946C7972a33097M2344
$$ 48536 -109464 375026 19039 31403 249443 42133 118208 -237946 37972 -133097 -90753
17919i0753j64495B64352o0897g5797A39097D7339J78522a44295D7644Q780K21175
$$ -90753 -255248 264352 203455 -75797 139097 47339 225861 -144295 47644 56424 277599
17908B77599A8477a38220A86612b2433B51616a34694d6034k67488A92030b4447
$$ 277599 18477 -138220 186612 -22433 251616 -134694 -46034 -313522 192030 -24447
17897A25429L4755a80131C39197a08279L6579k63813c041I7646R9636p7896a60672
$$ 125429 160184 -180131 339197 -108279 -71700 -335513 -3041 97646 197282 119386 -160672
17885b19859P0999B65905b56711A05594C0364b63873A60542d7547L380m5700p221
$$ -219859 -148860 265905 -256711 105594 30364 -263873 160542 -47547 -44167 -89867 -97088
17874i7088H5732h5157k60629e0548m404B64064D4532R0446Q0532a67443B47509
$$ -97088 85732 -85157 -345786 -50548 -54952 264064 44532 134978 215510 -167443 247509
17862F354J14907e9927B20886i5134d2561j67295g4137j13377B91227h9893A92257
$$ 6354 121261 -59927 220886 -95134 -42561 -209856 -74137 -187514 291227 -89893 192257
17850A4685f3396E7695a51040L1926F5088M5594j7018N267K24941c66970F6583
$$ 14685 -63396 57695 -151040 -119114 65088 110682 93664 98931 323872 -366970 66583
17838f8020A51405c98264a50654J0416A1572J18286q343l9605L5084l3393M6942
$$ -68020 151405 -398264 -150654 -140238 11572 129858 121515 81910 116994 83601 130543
17827A30543c63052J02483A98046b44549J0417E9835a33485C335J16528C8210
$$ 130543 -363052 -260569 198046 -244549 -234132 59835 -133485 3335 119863 38210
17816a71448c4795D9038N9737H600a89252P284P9246M14K9889F118a43569D3527
$$ -171448 -34795 49038 108775 8600 -189252 -181968 -102722 -102308 -72419 6118 -143569 43527
17803e8231C0981L96665j49877A0143b2558p0144B12293c01658B43193p5142G2850
$$ -58231 30981 427646 277769 10143 -22558 -92702 212293 -301658 243193 168051 72850
17791H6869h3454B10241j843K48414f3982H7239c824H8452d47444C38862A62579
$$ 86869 -83454 210241 208398 456812 -63982 87239 -3824 88452 -447444 338862 162579
17779a95178e6477G5166d9919q5974f5476B48142I5469c3106G3550K2991J20118
$$ -195178 -56477 75166 -49919 -135893 -65476 248142 95469 -33106 73550 96541 216659
17768B16659o1198n6285a80487C20098a95377F8187a85874F904b09567M7249A23363
$$ 216659 155461 99176 -180487 320098 -195377 68187 -185874 6904 -209567 -162318 123363
17756C6375b71045a07195J7735p0762I1630a15332A76366m5778C4395L22318j43398
$$ 36375 -271045 -107195 -89460 -160222 91630 -115332 176366 130588 34395 356713 213315
17745B13315b9195A4198g2951B06747b8350A31494a25766A11933B3413J4392L42154
$$ 213315 -29195 14198 -72951 206747 -28350 131494 -125766 111933 23413 37805 379959
17734C79959F3327K91758r9442A17921D7187a16754K4930l5099A15804C0728J66707
$$ 379959 63327 355085 255643 117921 47187 -116754 -91824 -126923 115804 30728 197435
17723A97435b69984A53857G0794a09057A34266J33863g2186A85968K46957r7459
$$ 197435 -269984 153857 70794 -109057 134266 268129 -72186 185968 432925 335466
17713C35466j39415F545J33384d5163A34176a50936M4794A25659g5552I1119b6327
$$ 335466 196051 6545 139929 -45163 134176 -150936 -106142 125659 -75552 91119 -26327
17701b00991B41974L3290A18039b7175G9415N6925b96159B142J7528e5441A46247
$$ -200991 241974 275264 118039 -27175 79415 136340 -296159 2142 19670 -55441 146247
17689B53381A09293P3090F9460b80247B24171B172g4863G4970K7117j7716J34490
$$ 253381 109293 182383 69460 -280247 224171 2172 -74863 74970 102087 84371 218861
17678B18861E598b31336b5721A75255n2374Q8929b64635A39438a45112f3993C14552
$$ 218861 5598 -231336 -25721 175255 122881 211810 -264635 139438 -145112 -63993 314552
17666B14029G1142J54409I1130Q4686g3691j7946B83002j31026b05967j18959
$$ 214029 71142 225551 91130 175816 -73691 -91637 283002 151976 -205967 -324926
17656c24926E7424Q6262k9970b3850A94726p3446n6898L4190h0925A3594K19202
$$ -324926 57424 143686 113716 -23850 194726 121280 64382 98572 -80925 13594 232796
17645B32796a81540A4967L4814R817J90818d3425j59965B5162N4882N06548a40521
$$ 232796 -181540 14967 49781 59598 250416 -43425 -203390 25162 80044 586592 -140521
17633B03710b34920A86494e3742E450K62133A05687M9241J12870L5807k5857j08738
$$ 203710 -234920 186494 -53742 5450 267583 105687 154928 267798 303605 277748 169010
17622A69010K074a05844k5750M2855A53970B4372L88115A1066J7067L56984a75367
$$ 169010 171084 -105844 -131594 -88739 153970 24372 412487 11066 28133 385117 -175367
17610a5004H8739b2919A8146J38733p324a86532B98858n3364d0248G0171B6221
$$ -15004 88739 -22919 18146 156879 149555 -186532 298858 245494 -40248 70171 26221
17598c9013A34692J14130i445A48517B2658L68269j86003I23h6549B63120M3586
$$ -39013 134692 248822 -9445 148517 22658 390927 204924 923 -86549 263120 306706
17587C06706A01418B6157M6413d9548B13341A969K99843j42895B6688b2269A95934
$$ 306706 101418 26157 72570 -49548 213341 1969 301812 158917 26688 -22269 195934
17575a2656A61121J2173d47167a49452A87029F2134K62200r1546L6753L9391a55355
$$ -12656 161121 173294 -447167 -149452 187029 62134 324334 232788 269541 308932 -155355
17563a45179A07163j950K11913H0633O4092a74969G3453J99477h3286E9041J28064
$$ -145179 107163 105213 317126 80633 144725 -174969 73453 272930 -83286 59041 187105
17552A87105J09135a40511c2431B85349J66935j06479b3708A30047Q0503H263
$$ 187105 296240 -140511 -32431 285349 452284 345805 -23708 130047 210550 8263
17541B66874C9218M88862j15607A65685J79094j70225k8429O3440r6117Q0267
$$ 266874 39218 528080 412473 165685 344779 174554 146125 209565 113448 193715
17531A93715F5535J9458C7631h7707C61758j55614J29396A56375K39109m3842
$$ 193715 65535 84993 37631 -87707 361758 206144 335540 156375 395484 351642
17521C51642a80161B71399D6991c825C86622E8759K96207j05752K84776L95325
$$ 351642 -180161 271399 46991 -3825 386622 58759 354966 249214 533990 929315
17511I29315j54780P8984k13272j84377l6313J0305A46520L97354A90277K57865
$$ 929315 774535 853519 640247 455870 419557 429862 146520 543874 190277 448142
17501D48142B00632K19349j75259N04700l36499K52092L42647k10646l94621K58640
$$ 448142 200632 419981 244722 749422 412923 665015 1007662 797016 402395 661035
17491F61035p3362j55454J99247l02807A12476K15346k1118j12248G7659D597
$$ 661035 587673 432219 631466 328659 112476 327822 306704 194456 77659 4597
17480H1533J97264n8514r7696a02836I7450B5982K65396C3862L32308J38997L1540
$$ 81533 278797 220283 122587 -102836 97450 25982 291378 33862 366170 505167 536707
17469E36707j58797A80467d5031B48373j7434K92603j91553j0586n9741K7969
$$ 536707 377910 180467 -45031 248373 230939 523542 331989 321403 261662 289631
17459B89631J96819b8942D16235l9132J81268B12447F0753L61932j54251j04257
$$ 289631 486450 -28942 416235 377103 558371 212447 60753 422685 268434 164177
17449A64177C4600K35478J12601A76309J55595R7938A16730J75210r0251L3461
$$ 164177 34600 270078 382679 176309 331904 429842 116730 291940 201689 235150
17439B35150Q3369A4245K56298j00228J25102A17734K15104Q4019h4069A99868
$$ 235150 318519 14245 270543 170315 295417 117734 332838 416857 -84069 199868
17428B04123a12743C56937B1389L39001E112L1279K77333L9867j40445J59062
$$ 204123 -112743 356937 21389 360390 5112 36391 313724 353591 213146 372208
17418C72208j80611Q4921d7864m6810C79040K06604k41428B3895J45453N8532
$$ 372208 191597 276518 -47864 -94674 379040 585644 344216 23895 169348 227880
17408B27880k5244P3918K08975A77559K63023j52356J9019J47212n2142j89624
$$ 227880 202636 276554 485529 177559 440582 288226 307245 454457 402315 212691
17398B12691o3597O1900J40846A47990M175F6213K23746m5600l6085J39665A70766
$$ 212691 149094 210994 351840 147990 152165 66213 289959 244359 208274 347939 170766
17386A34458M64162E1463K1149K1834J23230j7308G1478R8340b66012C04911j40274
$$ 134458 598620 51463 72612 94446 217676 200368 71478 169818 -266012 304911 164637
17375A64637M31065I049J23036b09589B83036b7198B18315p2276N41014a40163
$$ 164637 595702 9049 132085 -209589 283036 -27198 218315 146039 687053 -140163
17364B39801r6594L06528k6383m6990k6098N0161j22036O6184A72008p1880m1854
$$ 239801 143207 449735 423352 376362 350264 400425 278389 344573 172008 100128 58274
17353E8274b723B6867J41574J10738A9853J77616K1826k1683d0071A26534k2992
$$ 58274 -2723 26867 168441 279179 19853 197469 219295 197612 -40071 126534 103542
17342A03542J3219m2429J1833K00358i233C82270I4J56162m7979L09345G9276
$$ 103542 116761 74332 86165 286523 -9233 382270 94 156256 108277 417622 79276
17330H1036J74321a5273B42305h6080C8082J33455h0909A47343M0884J39056A60909
$$ 81036 255357 -15273 242305 -86080 38082 171537 -80909 147343 188227 327283 160909
17318D29628E8603P3028N1102K45091K50508B53516e8351B47779k2988N8323A07067
$$ 429628 58603 131631 182733 427824 678332 253516 -58351 247779 224791 283114 107067
17306b141C62258A4164f7775A40187L01874B02947J34115M2873d0279B56833N6029
$$ -2141 362258 14164 -67775 140187 442061 202947 337062 379935 -40279 256833 312862
17295C12862K74122A57658J40074j21132M76595j72087k25872A01289J87662E1393
$$ 312862 586984 157658 297732 176600 653195 481108 255236 101289 288951 51393
17284A43951J59522j32581l1390K42671A10263J07663J14467J24197k80k09340
$$ 143951 303473 170892 139502 382173 110263 217926 332393 456590 456310 246970
17274B46970K1880Q7419J5877I2673K06889b991D49574H0787K57302j27599L6233
$$ 246970 268850 356269 372146 92673 299562 -2991 449574 80787 338089 210490 246723
17263B46723J14598Q7974d1448j0168A36098k8840J94272A43626J1893K26364
$$ 246723 361321 449295 -41448 -51616 136098 107258 301530 143626 155519 381883
17253C81883J49278j35116A38224K52544B8782M66837j19900j9258j37275J79317
$$ 381883 531161 396045 138224 390768 28782 495619 375719 356461 219186 398503
17243C98503A00516L15151p5157A53481j7112L29262M532N12j58975E3120J75728
$$ 398503 100516 415667 340510 153481 136369 465631 470163 470675 311700 53120 228848
17232B28848M14296k60465D5436M21029G3306O1423K25622P0822j66239a2585
$$ 228848 643144 382679 45436 466465 73306 134729 360351 431173 264934 -12585
17221I6128J03412L65739D3096L81222A73567K28349R4783j99162j12670O7646
$$ 96128 199540 565279 43096 424318 173567 401916 496699 297537 184867 252513
17211B52513K00173q0292J30140k34213J48850F3600K80447r0298O2908J38615
$$ 252513 452686 372394 502534 268321 417171 63600 344047 253749 316657 455272
17201D55272I2157N63385A67618K92516j78357m7835J65029A52438L12295A92320
$$ 455272 92157 655542 167618 460134 281777 233942 398971 152438 464733 192320
17190D63103J31994B12440N3044L8194J1111Q9134Q9443j20865o522J69627J38676
$$ 463103 595097 212440 265484 303678 314789 403923 493366 372501 365979 535606 674282
17179F74282j37699j02998K12856A42924B4800N36191B42083j8064k9754Q943
$$ 674282 536583 433585 646441 142924 24800 560991 242083 224019 194265 203208
17169B03208M06507A82342J28367N1574A64027L98034A24033O16443B49642J45174
$$ 203208 609715 182342 310709 362283 164027 562061 124033 740476 249642 394816
17159C94816k5806J80057j16233R3977j64075K07965o3910M1414L56756k39694
$$ 394816 369010 549067 432834 526811 362736 570701 506791 548205 904961 665267
17149F65267k34235P0487A96247K72905J9016J63602k88583J50646L12495l31430
$$ 665267 431032 501519 196247 469152 488168 651770 363187 513833 826328 494898
17139D94898B32891J15278Q318K08730C4112N55987k39767O9866J46750k51242
$$ 494898 232891 348169 356487 565217 34112 590099 350332 420198 566948 315706
17129C15706K93491k10128G7445K42771n0166K88134k8194J29505I6181J96537
$$ 315706 609197 399069 77445 320216 270050 558184 529990 659495 96181 292718
17119B92718K72068j35825L08730q9433j04986k61254Q7367J88213J82432B69751
$$ 292718 564786 428961 737691 648258 543272 282018 369385 557598 740030 269751
17108E90735j71334N9009K61149q0112B89439K00424K29931k18868L69662o5551
$$ 590735 419401 478410 739559 659447 289439 489863 719794 500926 870588 805037
17098H05037j43371k03557J90262j46006N9664O6364K35809l06790M9365k43043
$$ 805037 661666 458109 648371 502365 562029 628393 864202 557412 606777 363734
17088C63734K15202j95814O0518L75478C72178K19773k15497L82237l53203j9693
$$ 363734 578936 383122 443640 819118 372178 591951 376454 758691 405488 385795
17078C85795K45094K78757k70594J2722j54449j85824M69929K8825O4646j53749
$$ 385795 630889 909646 639052 651774 497325 311501 781430 810255 874901 721152
17068G21152m1541L9793J50813D15694J92884L60630l34582j37788L51201k01664
$$ 721152 679611 719404 870217 415694 608578 969208 634626 496838 848039 646375
17058F46375L0775j09884j55481L60858K11433l26428O297n2773R4948j89983
$$ 646375 677150 567266 411785 772643 984076 657648 663945 611172 706120 516137
17048E16137M45350l72493K12838N1342k83317N2816J78421M4827j85151K23735
$$ 516137 961487 588994 801832 853174 569857 622673 801094 845921 660770 884505
17038H84505p1463k24183K42586C69715M49931p4178R6129K96178m71171l337
$$ 884505 813042 588859 831445 369715 819646 745468 841597 1137775 666604 663267
17028F63267K70714l95044N16055k47972p3014p9647J72582K0319L2476n4885
$$ 663267 933981 538937 1054992 807020 734006 654359 826941 847260 879736 824851
17018H24851K5395j53419K67345k07962M24093m15895L16658k1772L0508o8737
$$ 824851 850246 696827 964172 756210 1180303 764408 1081066 1059294 1089802 1021065
17008A021065N8480q0785n9758j87083K42102q1370K47832l28928O691J24859
$$ 1021065 1079545 998760 939002 751919 994021 912651 1160483 831555 838246 963105
16998I63105k871R5905p6771k43003R7275L34458E64405K48261J13016o120k31036
$$ 963105 960234 1056139 979368 736365 833640 1168098 564405 812666 925682 919562 688526
16987F88526M39475j18209p8875j04096R7818J37571J53886j70690j67701N41284
$$ 688526 1128001 1009792 930917 826821 924639 1062210 1216096 1045406 877705 1418989
16977A418989M6487j96300j46662J41760l10726J93983l13961N07581o1025j27125
$$ 1418989 1465476 1269176 1122514 1264274 953548 1147531 833570 1341151 1280126 1153001
16967A153001M1700R76J80359m59102J17065K09713j50599L71042k23934J48880
$$ 1153001 1194701 1195677 1376036 916934 1033999 1243712 1093113 1464155 1240221 1389101
16957A389101K2487l68997L47870J56444j88819j45026M67771l49675j65791L54082
$$ 1389101 1411588 1042591 1390461 1546905 1358086 1213060 1680831 1331156 1165365 1519447
16947A519447J02759l57291M83515l02140l2763L00916k70399m1P0658K4144j57644
$$ 1519447 1622206 1264915 1748430 1446290 1413527 1714443 1444044 1444003 1514661 1538805 1381161
16936A381161J12283j05514Q814Q3596p2137K03356l19857L86013K01761k59321
$$ 1381161 1493444 1387930 1396744 1480340 1408203 1611559 1291702 1677715 1879476 1620155
16926A620155K34780k44273m5385M11427j38672j60637K43272J68499l14368J10720
$$ 1620155 1854935 1610662 1565277 1976704 1838032 1677395 1920667 2089166 1774798 1885518
16916A885518J0570q995j13021p8793L63171j22933Q2063L733o3710L40852k89620
$$ 1885518 1896088 1887093 1774072 1695279 2058450 1935517 2017580 2021313 1957603 2298455 2008835
16905B008835k25164K15902J66483J74855K7994j76998l81791L29074k4876N759
$$ 2008835 1783671 1999573 2166056 2340911 2368905 2191907 1810116 2139190 2114314 2120073
16895B120073K06578j18826K19933K0664K5965o8199M6601M69959k90982j63467
$$ 2120073 2326651 2207825 2427758 2448422 2474387 2406188 2452789 2922748 2631766 2468299
16885B468299J9741K84402l74947L62230q1309k06543P2914M30231l92665O55709
$$ 2468299 2488040 2772442 2397495 2759725 2678416 2471873 2544787 2975018 2582353 3238062
16875C238062k62046L5641K36914k47310k67224j16377M54977n1502q1748R0613
$$ 3238062 2976016 3011657 3248571 3001261 2734037 2617660 3072637 3021135 2939387 3030000
16865C030000p6972M14987L4626M1076l30519K96129M2615j30705K12422K10603
$$ 3030000 2953028 3368015 3402641 3443717 3113198 3409327 3451942 3321237 3533659 3744262
16855C744262l09426L22993R9996k69955J41525K03779Q0639J73140j84655J36321
$$ 3744262 3434836 3757829 3857825 3587870 3729395 3933174 4013813 4186953 4002298 4138619
16845D138619P2814R1134j28358K06803L6359K21321J07739k63122J91799q2465
$$ 4138619 4211433 4302567 4174209 4381012 4417371 4638692 4746431 4483309 4675108 4592643
16835D592643L06213r1410J30907K76554l09498R4339K26105M08866m62321M69929
$$ 4592643 4898856 4807446 4938353 5214907 4905409 4999748 5225853 5634719 5172398 5642327
16825E642327k43064K84487k36642K29845N90776k63105L61142K42918l18665
$$ 5642327 5399263 5683750 5447108 5676953 6267729 6004624 6365766 6608684 6290019
16816F290019K11417L6143K28817K16406j64424K24049K4001L30812N8691j341
$$ 6290019 6501436 6537579 6766396 6982802 6818378 7042427 7066428 7397240 7455931 7454590
16806G454590K76841J56153L99302K6903K295L63733l0354M26313k2631K3537
$$ 7454590 7731431 7887584 8286886 8313789 8316084 8679817 8649463 9075776 9053145 9076682
16796I076682M86229k43777O24996Q4399L09112j69969K77746N45559M13907K22574
$$ 9076682 9562911 9319134 9944130 10028529 10337641 10167672 10445418 10990977 11404884 11627458
16786A1627458J91353K05809K3788M91407k76868Q91612O412J81730O73441K59764
$$ 11627458 11818811 12024620 12048408 12539815 12262947 13154559 13160971 13342701 14016142 14275906
16776A4275906K71401O58939R2273P26083K56612J86892P06804Q84169o6526O71028
$$ 14275906 14547307 15206246 15298519 16024602 16281214 16468106 17174910 18059079 17992553 18663581
16766A8663581N03233N61473O41390K75236Q80613K38083J057543N89071Q49409
$$ 18663581 19166814 19728287 20369677 20644913 21525526 21763609 22821152 23410223 24259632
16757B4259632O66037M92058J047351P21002J004592Q79115R46273R32254J129211
$$ 24259632 24925669 25417727 26465078 27186080 28190672 29069787 30016060 30948314 32077525
16748C2077525J223557J124329R24633J523496J288129R71203J378876J787629
$$ 32077525 33301082 34425411 35350044 36873540 38161669 39132872 40511748 42299377
16740D2299377J591059J489296J499067J982318J907113J626421K081843J929722
$$ 42299377 43890436 45379732 46878799 48861117 50768230 52394651 54476494 56406216
16732E6406216J903981K313760K592170J709164K498856K715032J997535K110670
$$ 56406216 58310197 60623957 63216127 64925291 67424147 70139179 72136714 74247384
16724G4247384K719156K502408K684569K384568K867804K123424K412063K268613
$$ 74247384 76966540 79468948 82153517 84538085 87405889 89529313 91941376 94209989
16716I4209989K321320K021895J600666J882025J048462J792915J385540K89442
$$ 94209989 96531309 98553204 100153870 102035895 103084357 104877272 106262812 106552254
16708A06552254J084446k8302J145k24092k85245r04794r97899j499751j373157
$$ 106552254 107636700 107608398 107609543 107385451 107100206 106195412 105197513 103697762 102324605
16699A02324605j467735k036594k199308j927419k361966k667592k156688k386248
$$ 102324605 100856870 98820276 96620968 94693549 92331583 89663991 87507303 85121055
16691H5121055k632130k528288k541543k804163k344711k513288k677831j744150
$$ 85121055 82488925 79960637 77419094 74614931 72270220 69756932 67079101 65334951
16683F5334951k530009k116971k371299k101870k031153j959026j968373j741965
$$ 65334951 62804942 60687971 58316672 56214802 54183649 52224623 50256250 48514285
16675D8514285j599067j832336j691920j288386j586606j555268j242020j378715
$$ 48514285 46915218 45082882 43390962 42102576 40515970 38960702 37718682 36339967
16667C6339967j358909j049410j234542r51108j148438r39685j282600j085879
$$ 36339967 34981058 33931648 32697106 31745998 30597560 29657875 28375275 27289396
16659B7289396o52745q75030p26118r45070p65777l02850r52624o27049o92400
$$ 27289396 26636651 25761621 25035503 24090433 23324656 23021806 22069182 21442133 20749733
16650B0749733o84406j80815q07717p03291j01714q51758n72151j20705n86570
$$ 20749733 20065327 19884512 19076795 18373504 18271790 17420032 16847881 16727176 16140606
16641A6140606l45723p29706m20480q1731k74896n92749p49121J62474o12173
$$ 16140606 15794883 15065177 14644697 14562966 14288070 13695321 12946200 13108674 12496501
16632A2496501k0715m92330J88107m62500n25045K41221n48852M8725m37285o4732
$$ 12496501 12475786 11983456 12171563 11709063 11184018 11425239 10876387 10925112 10487827 10423095
16622A0423095p44962o3483m02483j81722K1395m97592R8329j31420l44979O1998
$$ 10423095 9678133 9614650 9212167 9030445 9051840 8554248 8652577 8521157 8176178 8238176
16612H238176k37618k1915k8657n47820j519n7728k43002J93287n39413q1467
$$ 8238176 8000558 7978643 7949986 7402166 7400647 7342919 7099917 7293204 6753791 6672324
16602F672324l988l65020K90736k60430k82375Q5558m05444j8255J48984l94042
$$ 6672324 6668336 6303316 6594052 6333622 6051247 6136805 5731361 5713106 5862090 5468048
16592E468048K68021L6762k08751l88757k40299J48401O0711k31732k7693k88089
$$ 5468048 5736069 5772831 5564080 5175323 4935024 5083425 5144136 4912404 4884711 4596622
16582D596622J79688L4783l6362m56462K29642m29578J51422O3307r1801m5639
$$ 4596622 4776310 4811093 4774731 4318269 4547911 4118333 4269755 4333062 4241261 4195622
16572D195622k82913J5423J13177l89391J95786K7857k86306M5854J7156p6590
$$ 4195622 3912709 3928132 4041309 3651918 3847704 3875561 3589255 3635109 3652265 3575675
16562C575675K672o3638n5125J49330k89819K4901J14626n90814j14287N11325
$$ 3575675 3578347 3514709 3459584 3608914 3319095 3343996 3458622 2867808 2753521 3264846
16552C264846k29266N1898M2247k18974l4210J61967l95512L12515j68574J95264
$$ 3264846 3035580 3087478 3129725 2910751 2876541 3038508 2642996 2955511 2786937 2982201
16542B982201k30164J61504m37466K98615k84957l10407L74748r7508K99325j88230
$$ 2982201 2752037 2913541 2476075 2774690 2489733 2179326 2554074 2456566 2755891 2567661
16532B567661L424K1478l74872j2025J07540j44079L43546j91613k57171J05356
$$ 2567661 2571085 2592563 2217691 2205666 2313206 2169127 2512673 2321060 2063889 2169245
16522B169245K11142k87821M8986L6359l32330M54429j82104J7760j31356k4106
$$ 2169245 2380387 2092566 2141552 2177911 1845581 2300010 2117906 2135666 2004310 1980204
16512A980204l09823J0670M02821m5706j95731M0958K9402k76229J84437Q076
$$ 1980204 1670381 1681051 2083872 2038166 1842435 1883393 1912795 1636566 1821003 1829079
16502A829079j1355k35688L16980j88307j41537l9460Q2855k92739M70838j95528
$$ 1829079 1817724 1582036 1899016 1710709 1569172 1529712 1612567 1319828 1790666 1595138
16492A595138J82882j74723q0338J16988l4355K79046n03116K93389k03977m3544
$$ 1595138 1778020 1603297 1522959 1639947 1605592 1884638 1381522 1674911 1470934 1427390
16482A427390P1985k10008o5346O19362l90959j67365o604L15156j95042n5130
$$ 1427390 1499375 1289367 1224021 1843383 1452424 1285059 1278455 1593611 1398569 1343439
16472A343439m1225l4351n7121K61569l02383K97677j45486l79952M84762m91264
$$ 1343439 1302214 1267863 1210742 1472311 1169928 1467605 1322119 942167 1426929 935665
16462I35665j14144M38602j77481o2862k4095L8588O4466j17200L71902p6413
$$ 935665 821521 1260123 1082642 1019780 995685 1034273 1098739 981539 1353441 1277028
16452A277028j91058Q8010n9373J80109q9323l72861M69433k30994K4070M9115
$$ 1277028 1085970 1173980 1114607 1294716 1205393 832532 1301965 1070971 1095041 1144156
16442A144156m9544k86987J67459J35366l0043k0006k28464L40899m51773K57390
$$ 1144156 1094612 807625 975084 1110450 1080407 1060401 831937 1172836 721063 978453
16432I78453J0692n8242N7965K3502o8528N173j8358J54950j29906J2041k37018
$$ 978453 989145 930903 988868 1012370 943842 949015 930657 1085607 955701 967742 730724
16421G30724J83499N5010k04649J91682k7551j37314J53808j49257j91622P8424
$$ 730724 914223 969233 764584 956266 928715 791401 945209 795952 604330 682754
16411F82754K11582j1203D13101N91596N7638m23752Q0299j90373O37306k63136
$$ 682754 894336 883133 413101 1004697 1062335 638583 718882 528509 1165815 902679
16401I02679J57871j78337J735m6646J04933N648K43681m40895j62222J13557
$$ 902679 1060550 882213 883948 837302 942235 947883 1191564 750669 588447 702004
16391G02004K49118m34373J69695j37714L66319o370l37097J63335j13080j28369
$$ 702004 951122 516749 686444 548730 915049 908679 571582 734917 621837 493468
16381D93468J75976l31221L78902q0333j56701J31470J80555j136k90428K4527
$$ 493468 669444 338223 717125 636792 480091 611561 792116 790980 500552 525079
16371E25079P403j84637M80346B99765L0172L17407J47674j04990l31445K69111
$$ 525079 532482 347845 828191 299765 329937 647344 795018 690028 358583 627694
16361F27694K51698C48709K14798P656J5370j7151j42173r8836Q2470J6088J68281
$$ 627694 879392 348709 563507 571163 586533 569382 427209 328373 410843 426931 595212
16350E95212k34284K59356k4183k08708L85727k51825L45173A26286K39243n1084
$$ 595212 360928 620284 596101 387393 773120 521295 866468 126286 365529 314445
16340C14445N9907j51482L94969O7993K32711l45396r4160A35153N76333k577
$$ 314445 374352 222870 617839 685832 918543 573147 478987 135153 711486 708909
16330G08909L0197l62100k1073K4754M16996k18526j19584r6867L26759l2215
$$ 708909 739106 377006 355933 380687 797683 579157 459573 362706 689465 657250
16320F57250k21590J35420k71601L23231k9930j24753A54280J28854Q2247M8041
$$ 657250 435660 571080 299479 622710 592780 468027 154280 283134 365381 413422
16310D13422j32367J39647A86747N56779j00185k35819M7598q0190r3529M36707
$$ 413422 281055 420702 186747 743526 643341 407522 455120 374930 281401 718108
16300G18108l49640q3019J03990l8957j16120K93717k2560l6521k9724J07286
$$ 718108 368468 285449 389439 350482 234362 528079 505519 468998 439274 546560
16290E46560k05431A12050M92377A52253J96908F5325K4375b58529C13352n7327
$$ 546560 341129 112050 604427 152253 349161 65325 89700 -258529 313352 256025
16280B56025K20872A07333J17776I2878J61269l5060K33364m4829A90852m244
$$ 256025 476897 107333 225109 92878 254147 219087 452451 407622 190852 186608
16270A86608J61087A24697J79278J65092A6081M69886B33098q5565K94777j12877
$$ 186608 347695 124697 303975 469067 16081 485967 233098 147533 442310 329433
16260C29433j53194L5009L56717A94500l8992K72475j25729O8515l253m6901A9213
$$ 329433 176239 211248 567965 194500 155508 427983 302254 370769 367516 320615 19213
16248E66174B52064K1340J82561A35247J38560j0142Q7648p3286h4297C13759
$$ 566174 252064 273404 455965 135247 273807 263665 351313 278027 -84297 313759
16237C80219P2505L6848A59407L50633p5588H4483J99638p2808J2132o0072G2367
$$ 380219 452724 489572 159407 510040 434452 84483 284121 211313 223445 163373 72367
16225C32121O869K514H875K30526J70081E347K02947J48260i016A4002M56604
$$ 332121 338990 341504 8875 239401 409482 5347 208294 356554 -9016 14002 470606
16214D70606D8426L5353J10164A5018K80666G5249L03809I7043M0880F4849j661
$$ 470606 48426 83779 193943 15018 295684 75249 379058 97043 137923 64849 63188
16203F3188J23487J75172A44961B0029J40104K13847A64218L26287P5291I4329
$$ 63188 186675 361847 144961 20029 160133 373980 164218 490505 565796 94329
16192B04991j2938M18850B77929j16875e5948D30757H4924K07937m4467J52495
$$ 204991 192053 610903 277929 161054 -55948 430757 84924 292861 248394 400889
16182D00889p8583M959A03371b17038A74947O6963k2640J04332a88227A61087
$$ 400889 322306 327265 103371 -217038 174947 241910 219270 323602 -188227 161087
16171A22270R0033r7728L01679A819L52877J1662n5966R334j18111E424J69432
$$ 122270 212303 114575 416254 1819 354696 366358 310392 319726 201615 5424 174856
16160A74856P4916a18202e1719D58034k25799k4238K39503j84647a29407A36298
$$ 174856 249772 -118202 -51719 458034 232235 207997 447500 262853 -129407 136298
16149A94345F4607K01659J33905A09943k198P5987l6406j0890K35790c23959C43758
$$ 194345 64607 266266 400171 109943 107745 183732 147326 136436 372226 -323959 343758
16137A99159J78787N195A50805a05393F6085J96459M6888p0811b5627D57451D2196
$$ 199159 377946 383141 150805 -105393 66085 262544 309432 238621 -25627 457451 42196
16125A05582b08077C82967A84454o2623F0665J70180o1163a05842B23688P8740
$$ 105582 -208077 382967 184454 121831 60665 230845 169682 -105842 223688 302428
16115C02428j18265P2281A19615j7012J72617J05032b24397A21433J53021m467
$$ 302428 184163 256444 119615 102603 275220 380252 -224397 121433 274454 269987
16105B69987j30138N8915b48690A32321L4092L6806n1847E1634d8924j395E9950
$$ 269987 139849 198764 -248690 132321 166413 203219 151372 51634 -48924 -50319 59950
16093B08139q7203B8074K80814A0483a10385a6590B27869a09540a3406I4187J6526
$$ 208139 120936 28074 308888 10483 -110385 -16590 227869 -109540 -13406 94187 110713
16082A10713h5533M345g073D43672H3450L794k923a83238B28909j12846L09583
$$ 110713 -85533 -81188 -7073 443672 83450 87244 84321 -183238 228909 116063 425646
16071D25646I3334J05383J80749A39529b3239B19459n6700g9742b077A56134d40123
$$ 425646 93334 198717 379466 139529 -23239 219459 162759 -79742 -2077 156134 -440123
16059C9067L00845A44339K58872C1170J94440n4278b35833E1050J00549b88344
$$ 39067 339912 144339 403211 31170 225610 171332 -235833 51050 151599 -288344
16048C84091F1683c116I6334L5164c86609A46794l0095a34681B3856e3397G5153
$$ 384091 61683 -3116 96334 131498 -386609 146794 116699 -134681 23856 -53397 75153
16036A59529D439Q7188N0834c50117B131b152B8427b28307F9385a98442i8876
$$ 159529 4439 91627 142461 -350117 2131 -2152 28427 -228307 69385 -198442 -98876
16024D3615Q7244L7895B0638J98859c9895A44578n1037a17194j05266k8500A71108
$$ 43615 130859 168754 20638 219497 -39895 144578 93541 -117194 -222460 -250960 171108
16012a12638A72204k9956b35420A76522b77782M4585g0639n2841D56171a29538
$$ -112638 172204 142248 -235420 176522 -277782 -233197 -70639 -123480 456171 -129538
16001B28879a06318d0495B31301a7351A09271C5740e1706A77368n1794i4728A3866
$$ 228879 -106318 -40495 231301 -17351 109271 35740 -51706 177368 125574 -94728 13866
15989D8394d5006A68478L11744b67382A78171a16941a874k48712k023a23536A09306
$$ 48394 -45006 168478 480222 -267382 178171 -116941 -1874 -250586 -252609 -123536 109306
15977B06951g7378A45645l5917K85868k5797Q3109N88911k70479j8799Q6830l43848
$$ 206951 -77378 145645 109728 395596 369799 452908 1041819 771340 752541 839371 495523
15966D95523K47702C52880A16406K66151i4324B22581P1754A8488a52860A13427
$$ 495523 743225 352880 116406 382557 -94324 222581 294335 18488 -152860 113427
15955B60629b69639D7319C816e3882k30581D79048C0343J23951d9234B60549j30148
$$ 260629 -269639 47319 3816 -53882 -284463 479048 30343 154294 -49234 260549 130401
15944A30401e2514j29502A00479J69549j23111a03178l5896A81670e0781J1136
$$ 130401 -52514 -182016 100479 270028 146917 -103178 -139074 181670 -50781 -39645
15934c9645q4591j27057D6293J49283H977g255D4536f5794A62958G6425K4422
$$ -39645 -124236 -251293 46293 195576 8977 -7255 44536 -65794 162958 76425 100847
15923A00847h2379G7510c49424B81443h1095J2019n5675D25797c6292A47161d07631
$$ 100847 -82379 77510 -349424 281443 -81095 -69076 -124751 425797 -36292 147161 -407631
15911h844j35437A57227a10122A96804c3003F7588i3388c9156j50683p2508O9791
$$ -8844 -144281 157227 -110122 196804 -33003 67588 -93388 -39156 -189839 -262347 -192556
15900a92556f7738l751A53625g8787j3459j57012L076a7868n5966j15263D1678
$$ -192556 -67738 -71489 153625 -78787 -92246 -249258 -246182 -17868 -73834 -189097 41678
15888a83179A39430j5722a10159A05322l6344c92933D4668L04492h0172A81631
$$ -183179 139430 123708 -110159 105322 68978 -392933 44668 349160 -80172 181631
15877a4447p9779j1035j73863J36579e6599k69786n8169G1980Q7404i5245o6802
$$ -14447 -94226 -105261 -279124 -142545 -56599 -326385 -384554 71980 159384 -95245 -162047
15866a62047P8682A01381L5524a72588I2804b29359O3824p707Q0282q5136A0231
$$ -162047 -83365 101381 136905 -172588 92804 -229359 -165535 -173242 -92960 -178096 10231
15854c8550H2920c0569r6973j5861A50053L0710P2010a64851E4046i9730G3607
$$ -38550 82920 -30569 -127542 -143403 150053 180763 252773 -164851 54046 -99730 73607
15842A68098f7533B10368a18078A65596b22717c5559m2321Q234H2091m0098d746
$$ 168098 -67533 210368 -118078 165596 -222717 -35559 -77880 -69646 82091 41993 -4746
15830B58500A21207a18384B75830E2941a84824A95646I4944a4753j08280q4202
$$ 258500 121207 -118384 275830 52941 -184824 195646 94944 -14753 -123033 -207235
15820b07235D8206b0999A62232B1202J62859G6059a94260k58004A00103J78708
$$ -207235 48206 -20999 162232 21202 184061 76059 -194260 -452264 100103 278811
15810B78811c04411H7420c15592c3695F6318b82199h719C3284b07846O2583k137
$$ 278811 -304411 87420 -315592 -33695 66318 -282199 -8719 33284 -207846 -145263 -147400
15799a47400c1183A23403e0133o5337a9838A59860b25288L3320B5532K8677J29858
$$ -147400 -31183 123403 -50133 -115470 -19838 159860 -225288 -191968 25532 54209 184067
15788A84067a03033H0602R4011b6792j38081G904J02824K6464B5701L7936A2830
$$ 184067 -103033 80602 174613 -26792 -164873 7904 110728 137192 25701 63637 12830
15776C9871b1892k00978A16284J42909a89917B5518a29549C81328h8183G1443
$$ 39871 -21892 -222870 116284 259193 -189917 25518 -129549 381328 -88183 71443
15765c49221a8614D7d34110a98903H4379C2564J46401A0905i3148A74491a84701
$$ -349221 -18614 47 -434110 -198903 84379 32564 178965 10905 -93148 174491 -184701
15753b12243f0685E159c00724q797C1050h8482j15620H9762a66830B35983o2707
$$ -212243 -60685 5159 -300724 -309521 31050 -88482 -204102 89762 -166830 235983 173276
15742A73276a0452j54745A64857K10465j44304e4669j11495B04352n2162J20292
$$ 173276 -10452 -165197 164857 375322 231018 -54669 -166164 204352 152190 272482
15732B72482n9110F2675B5579K18187a46013E501a69519P5486D3599J94344a2535
$$ 272482 213372 62675 25579 243766 -146013 5501 -169519 -94033 43599 237943 -12535
15720H3341a98432J3259P7313J8j80871G4459a47634a1462l574o1671B02336G7569
$$ 83341 -198432 -185173 -107860 -107842 -288713 74459 -147634 -11462 -15036 -76707 202336 77569
15707a89925P0948j71607B1316a92948R3183j64141L9532R9133M1421F7262a97907
$$ -189925 -118977 -290584 21316 -192948 -99765 -263906 -224374 -125241 -83820 67262 -197907
15695d58505A02068F974Q7036b00651B12683r7303J77853a51729A85495a2545
$$ -458505 102068 6974 94010 -200651 212683 115380 293233 -151729 185495 -12545
15684B7533J25527Q3393g5621B1957b32052R9283A32196C7050c8403A77933m1531
$$ 27533 153060 236453 -75621 21957 -232052 -132769 132196 37050 -38403 177933 136402
15673A36402l5713b8299j16310f1929D4178a27707l1349k5481f7171j7990K8631
$$ 136402 100689 -28299 -144609 -61929 44178 -127707 -159056 -184537 -67171 -85161 -56530
15662e6530B12045a78558p6467h103j90416A11030c3021n8858j3793A48600E5740
$$ -56530 212045 -178558 -255025 -8103 -198519 111030 -33021 -91879 -105672 148600 55740
15650C22032b07466A88976k3555d7986A50337c6641n2042n953j07569p5960A86228
$$ 322032 -207466 188976 165421 -47986 150337 -36641 -88683 -94636 -202205 -278165 186228
15638c15130A14393i0228d4036l26861h9925j02519Q1368j04305f2724k92789
$$ -315130 114393 -90228 -44036 -370897 -89925 -192444 -111076 -215381 -62724 -355513
15628c55513a57959B21606a54183e1674k2540q7397g3940p3513O6323j49820m0858
$$ -355513 -157959 221606 -154183 -51674 -74214 -161611 -73940 -147453 -81130 -230950 -271808
15617b71808F4764J87896H8161d25488a4885k92007A96980G8293c5845A08852
$$ -271808 64764 252660 88161 -425488 -14885 -306892 196980 78293 -35845 108852
15606A64791B8763K3366a95593m3105A00012m0048J25395d5732j69231m40933
$$ 164791 28763 52129 -195593 -238698 100012 59964 185359 -45732 -214963 -655896
15596f55896A08303N895j515d1138j55090f9585a3608B22680A7107d61605b03827
$$ -655896 108303 114198 112683 -41138 -196228 -69585 -13608 222680 17107 -461605 -203827
15584a46717e3409A62901G5387a48442j4460g1094a3596k9851j25850O3023E6477
$$ -146717 -53409 162901 75387 -148442 -162902 -71094 -13596 -43447 -169297 -106274 56477
15572A07646a53025d9013I1498a91684a8342K823B22540F6432j7902O5984n0513
$$ 107646 -153025 -49013 91498 -191684 -18342 -15519 222540 66432 48530 114514 64001
15561F4001i4956b9736q4773A53156o6713J94302g8638H1568A4987b23632h7101
$$ 64001 -94956 -29736 -114509 153156 86443 280745 -78638 81568 14987 -223632 -87101
15549b09222F019O3759a69012D41911A15677c1375A9074d71588a29619j58340
$$ -209222 6019 69778 -169012 441911 115677 -31375 19074 -471588 -129619 -287959
15539b87959E5027a18142a3194A14177J13733B481f5737j51173L3423H9652a18064
$$ -287959 55027 -118142 -13194 114177 227910 2481 -65737 -216910 -183487 89652 -118064
15527E7621b93226B25883d38328D4473a03227A24571R9100H7756B3102a10134
$$ 57621 -293226 225883 -438328 44473 -103227 124571 223671 87756 23102 -110134
15516i7093I9774a45486B86946o2037c24966A91280J25055A07436b05731e571
$$ -97093 99774 -145486 286946 224909 -324966 191280 316335 107436 -205731 -5571
15505A90490B5163K04181n7267H3117J78590H5712b33272R0575D1116J93224i2205
$$ 190490 25163 229344 172077 83117 261707 85712 -233272 -142697 41116 234340 -92205
15493B41280j3304b96017h3692B16858d0279A83387J7219H7930N1518K13732A27067
$$ 241280 227976 -296017 -83692 216858 -40279 183387 200606 87930 139448 353180 127067
15481A25631Q1260b38823i0312G4937R1778L43587B26974d6508e886B20370A7243
$$ 125631 206891 -238823 -90312 74937 166715 510302 226974 -46508 -5886 220370 17243
15469a72045F8740K16016g3052K5830A29932a70278K9585A33838J11699K15229
$$ -172045 68740 284756 -73052 -47222 129932 -170278 -140693 133838 245537 460766
15459D60766E658L97558J76463B75267J50348A06326B4754a50089D62041A79443
$$ 460766 5658 403216 579679 275267 425615 106326 24754 -150089 462041 179443
15448A24337J41771H1921g749p5131j33143A57835e7907q3227B5067J05759a34912
$$ 124337 266108 81921 -7749 -82880 -216023 157835 -57907 -141134 25067 130826 -134912
15436i2570J432F6619Q5789h60n2526A95298d7577A96493L93024J19994K78472
$$ -92570 -91138 66619 152408 -860 -53386 195298 -47577 196493 589517 709511 987983
15425I87983j87568r8701j70181k58783o5203a7543B4737f3479b9967a07A53169
$$ 987983 800415 701714 531533 272750 207547 -17543 24737 -63479 -29967 -107 153169
15413C68033H7779M203e0024D9093h3989c7040H8271c7133F9427J09792a70439
$$ 368033 87779 91982 -50024 49093 -83989 -37040 88271 -37133 69427 179219 -170439
15401d3932B6891b39856B09788G9619c0777B45415a17099A55786a94309A79276
$$ -43932 26891 -239856 209788 79619 -30777 245415 -117099 155786 -194309 179276
15390A80561E8752b21065j02484h1253A79431M3539G9916K9552B4494c03320A15601
$$ 180561 58752 -221065 -323549 -81253 179431 222970 79916 109468 24494 -303320 115601
15378I0228c65169C06488b68356C4739a12891a9544l477C59101A23099a35704
$$ 90228 -365169 306488 -268356 34739 -112891 -19544 -23021 359101 123099 -135704
15367a95436A41205C1154i0947A30256a14249L3053A2604L0761e740B56349J95503
$$ -195436 141205 31154 -90947 130256 -114249 -81196 12604 43365 -5740 256349 451852
15356D51852j92680K0477J522f3623r1247P4058B22743E9114K16895A31930e0618
$$ 451852 259172 279649 281171 -63623 -154870 -80812 222743 59114 276009 131930 -50618
15344A97122b6249H7172f6581j5672A13254l6892K4035J0373J61111H9954J07476
$$ 197122 -26249 87172 -66581 -82253 113254 76362 100397 110770 271881 89954 197430
15333A97430m6172i0409B00954I8667J24980I3882K03644q6104E2525M84402J58482
$$ 197430 151258 -90409 200954 98667 223647 93882 297526 211422 52525 536927 695409
15322F95409C8050E174d7034A49187g7601I4647N6087J68280j5069A44044J06353
$$ 695409 38050 5174 -47034 149187 -77601 94647 150734 319014 303945 144044 250397
15311B50397b2821j34390C5868J85100p2113B9760J36246i9158B27760b55377
$$ 250397 -22821 -157211 35868 220968 148855 29760 166006 -99158 227760 -255377
15300E6720O5953O528l7777L5287L11016i1545G04372a00292I3679M39873a15871
$$ 56720 122673 129201 91424 126711 437727 -91545 704372 -100292 93679 533552 -115871
15288a0132A6661J73226f266B21759c7618C3809K97566j42672C6901a60351B85257
$$ -10132 16661 189887 -6266 221759 -37618 33809 331375 188703 36901 -160351 285257
15276d343D1783O350c34046A00713d9606A93988b08719L3537B88327c1394G0205
$$ -4343 41783 48133 -334046 100713 -49606 193988 -208719 -175182 288327 -31394 70205
15264I9124D8183M10044j39099a95771A47932c98047c7649j38849A73160h6295
$$ 99124 48183 458227 319128 -195771 147932 -398047 -37649 -176498 173160 -86295
15253A43902H864a41352c8216A06834a54619F1879g0987B94655a9049j39311A63362
$$ 143902 8864 -141352 -38216 106834 -154619 61879 -70987 294655 -19049 -158360 163362
15241a51874D3860K09215a11784A51294m9236a75486K1138B09769l7972J41708
$$ -151874 43860 253075 -111784 151294 102058 -175486 -154348 209769 171797 313505
15231C13505j47452L7575L19605p4678N50245O7110P9785R5717l31751k16803
$$ 313505 166053 203628 523233 448555 998800 1065910 1145695 1241412 909661 692858
15221F92858A99467J32859p9083A6936L39614A47550O2303E2170J6270k6476h9308
$$ 692858 199467 332326 253243 16936 356550 147550 209853 52170 68440 41964 -89308
15209A83349i0598H3257o738h3910A71953E1874b913j13586A28921a65050c3704
$$ 183349 -90598 83257 76519 -83910 171953 51874 -2913 -116499 128921 -165050 -33704
15197a67079b3308j33353B51074H3408c05963g4530A60752b64836B99698h6824
$$ -167079 -23308 -156661 251074 83408 -305963 -74530 160752 -264836 299698 -86824
15186D2552J44545g1218l759m1461A50054a13792A6735M8338a94463L1178A44676
$$ 42552 187097 -71218 -74977 -116438 150054 -113792 16735 65073 -194463 -163285 144676
15174B4330i2439p0137B3252O8147K6309C6236L9085K72257i2355C388J9753Q8775
$$ 24330 -92439 -162576 23252 91399 117708 36236 75321 347578 -92355 3388 23141 111916
15162A11916f4837H9422b7393A04306a52638C55885b828B68801e1373B58065d34520
$$ 111916 -64837 89422 -27393 104306 -152638 355885 -2828 268801 -51373 258065 -434520
15150A00623Q160a64859H0693K53633j21853j4501h5371J2914A85866q1880f15744
$$ 100623 108783 -164859 80693 334326 212473 197972 -85371 -72457 185866 103986 -615744
15138f5620j36597A72767P2034I110J38084P4716A09782c49599J74320B51864
$$ -65620 -202217 172767 244801 9110 147194 221910 109782 -349599 -175279 251864
15127C6196R2556n9652C0445a07255B76871r2920q4327K34001A26608c9430A76762
$$ 36196 128752 69100 30445 -107255 276871 183951 99624 333625 126608 -39430 176762
15115f2819C4884j1299Q5561J63018m7844o3595E881L4131K42317J27619P0770
$$ -62819 34884 23585 109146 272164 224320 160725 5881 40012 282329 409948 480718
15104D80718H6575J51012J73588n9077A40450Q8065q7876J85519f5219D2721k1255
$$ 480718 86575 237587 411175 352098 140450 228515 140639 326158 -65219 42721 21466
15093B1466K19297e2796p3068B84314i1181C1420R7813b28650d2000A39857F9567
$$ 21466 240763 -52796 -125864 284314 -91181 31420 129233 -228650 -42000 139857 69567
15081C29455F4779K56678e62810C26201Q2455b11375A13778a7545p3662Q670B11933
$$ 329455 64779 321457 -562810 326201 408656 -211375 113778 -17545 -91207 -82537 211933
15069A01038Q3663c233B79366l6925d3706A04211C4752c5182A91524h082l3354
$$ 101038 184701 -3233 279366 242441 -43706 104211 34752 -35182 191524 -8082 -41436
15058d1436D25493h7051A79878o8261N1515B1384J2413N07096f534B86972g9628
$$ -41436 425493 -87051 179878 111617 163132 21384 33797 540893 -6534 286972 -79628
15046A22856J07149J81385A95893j0413A9177J69943R2194m1792m2234r6061K29921
$$ 122856 230005 411390 195893 185480 19177 189120 281314 239522 197288 101227 331148
15035C31148K8031J9391A63550J70210o5650a60539D07125B8523K74221G7145
$$ 331148 359179 378570 163550 333760 268110 -160539 407125 28523 302744 77145
15024D03809A26157L49521A61007K46887j22017K52124j44642L2957N5117j6459
$$ 403809 126157 475678 161007 407894 285877 538001 393359 426316 481433 464974
15014D64974L16605J44960l43625j73998j39802j10743L09956M3510O1231K07870
$$ 464974 781579 926539 582914 408916 269114 158371 468327 511837 573068 780938
15004G80938l20128o3309j8632A69475K12648j2146n331l5970r120A30232K37063
$$ 780938 460810 397501 378869 169475 382123 369977 364646 328676 319556 130232 367295
14993C67295j42745g1023A17291J05452P8864A36958J59263j9093l1280K43699
$$ 367295 224550 -71023 117291 222743 301607 136958 296221 277128 245848 489547
14983D89547H1765L12591N1993C5578O77094B24238K86765B54722j00696L02602
$$ 489547 81765 394356 446349 35578 712672 224238 511003 254722 154026 456628
14973D56628J10223k15600L17460k98974K65703r5730r5861M38811q375l36505
$$ 456628 566851 351251 668711 369737 635440 539710 443849 882660 874285 537780
14963E37780J13063j05980j13911K96974k44580P5384K24236l14574j27100K51874
$$ 537780 650843 544863 430952 727926 483346 558730 782966 468392 341292 593166
14953E93166k14564o818j2588A74722J50523j24312J26912J02891J779G3421L33707
$$ 593166 378602 371784 359196 174722 325245 200933 327845 430736 432515 73421 407128
14942D07128A39775K23668r2689F7411a04179E36359M9109j48261j40158R9271
$$ 407128 139775 363443 270754 67411 -104179 536359 585468 437207 297049 396320
14932C96320J89440E4209J73037Q8736J87354k4954J42737A76518J63494L3774
$$ 396320 585760 54209 227246 315982 503336 478382 621119 176518 340012 373786
14922C73786M18092C35992J75232K53017l03295J86015M53529q0449j48055L20686
$$ 373786 791878 335992 511224 764241 460946 646961 1100490 1020041 871986 1192672
14912A192672R7212r7989L92406J87633l05843L2157J21279p0047p2355J55577
$$ 1192672 1289884 1191895 1584301 1771934 1466091 1498248 1619527 1549480 1477125 1632702
14902A632702N56441L4667n46415l54723K18152j94206m00648D65994J72170j55423
$$ 1632702 2189143 2223810 1677395 1322672 1540824 1346618 945970 465994 638164 482741
14892D82741k10198N70961k45382A72331J60148K29046j87292m2678K01196A88350
$$ 482741 272543 843504 598122 172331 332479 561525 374233 331555 532751 188350
14881D90539j24875j11139M5567K69703j29541m2469K26569A13340N39507r2050
$$ 490539 365664 254525 300092 569795 440254 397785 624354 113340 652847 560797
14871E60797j05022R2439L23821k74338j37920J45804M44841l03925L8181l26835
$$ 560797 455775 548214 872035 597697 459777 605581 1050422 746497 784678 457843
14861D57843J14380k1630j07842j95172J09459J70859A73820K05693M28849B77041
$$ 457843 572223 550593 442751 247579 357038 527897 173820 379513 808362 277041
14850F68173q5012L93390k53314o557j97618p0331R3626M5919j08452k14101m7655
$$ 668173 583161 976551 723237 716680 519062 448731 542357 588276 479824 265723 218068
14839B18068J31832K23343j64949R4927k37375R4479j28699M79036O4802m5836
$$ 218068 349900 573243 408294 503221 265846 360325 231626 710662 775464 729628
14829G29628k02955R7300K07736Q8094k20928J97405M074j7944k45375r0927N9767
$$ 729628 526673 623973 831709 919803 698875 896280 900354 882410 637035 546108 605875
14818F05875L34230D25515j00532J8979J03830j49531K65072j48985j03655p5793
$$ 605875 940105 425515 324983 343962 447792 298261 563333 414348 310693 234900
14808B34900J65539A96937L02885j24882L19266P4172M9655k48308m8473r6937
$$ 234900 400439 196937 499822 374940 694206 768378 818033 569725 521252 424315
14798D24315J9795K45386r5133k24720r530N52263j75859J0326K13202q0265l79403
$$ 424315 444110 689496 594363 369643 360113 912376 736517 746843 960045 879780 500377
14787E00377K89107k70030B25905K40534o1570K11329A74411K33006j88704K82283
$$ 500377 789484 519454 225905 466439 404869 616198 174411 407417 218713 500996
14777E00996K98626k36139j12424j07790J52910C639M67002B24068K56227q1642
$$ 500996 799622 563483 451059 343269 496179 3639 470641 224068 480295 398653
14767C98653O6479K11008B37393O84836k24259J30698l27067K84972q6278j33633
$$ 398653 465132 676140 237393 922229 697970 828668 501601 786573 700295 566662
14757E66662B31685K62869L24170k10664J7948k90135K15388r3045q7307n0116
$$ 566662 231685 494554 818724 608060 626008 335873 551261 458216 370909 320793
14747C20793N9199q323K02608q7916o7471L74429q147C04365K0316Q5144J21074
$$ 320793 379992 371669 574277 486361 418890 793319 785172 304365 324681 409825 530899
14736E30899k51460J82902J21565k5738M6190k00626K02626l0180L76992D69736
$$ 530899 279439 462341 583906 558168 604358 403732 606358 576178 953170 469736
14725G36514p5180J06125J629J31689k80098l7773R4517N5425M6960r1609O77441
$$ 736514 661334 767459 769088 900777 620679 582906 677423 732848 779808 688199 1365640
14714A365640P1805j63403R8323P3116l14540j45155k601N0433l67988L01493
$$ 1365640 1437445 1274042 1372365 1445481 1130941 985786 983185 1033618 665630 967123
14704I67123l88722n7075j97770J17690N34381L6376k27272R6134j4656l80989
$$ 967123 578401 521326 323556 441246 975627 1012003 784731 880865 866209 485220
14694D85220K44099L65597l6498l3065L84783r3738P3594M22626j7529l35873
$$ 485220 729319 1094916 1058418 1025353 1410136 1316398 1389992 1812618 1795089 1459216
14684A459216J15156k10452q6281l93736j3280j26570O4084J33559j52793N4988
$$ 1459216 1574372 1363920 1277639 883903 870623 744053 808137 941696 788903 843891
14674H43891M7364k71362K17391j94309O4256J68626K99462l58863j61463Q1215
$$ 843891 891255 619893 837284 642975 707231 875857 1175319 816456 654993 736208
14664G36208K39720j36216j87926k24782M12818n9393J0886L24421k74630o9441
$$ 736208 975928 839712 651786 427004 839822 780429 791315 1115736 841106 771665
14654G71665K14118m82290L85812k09413P5846Q7021k06043N0708K91981n5664
$$ 771665 985783 503493 889305 679892 755738 842759 636716 687424 979405 923741
14644I23741L0219k6228r3480K33976l30421K17660J96250j56583j6749K50886
$$ 923741 953960 927732 834252 1068228 737807 955467 1151717 995134 978385 1229271
14634A229271l66166J67311j56751J92933k69073k39782K37920J12194K54807
$$ 1229271 863105 1030416 873665 1066598 797525 557743 795663 907857 1162664
14625A162664n0341R0949R5626j45716k93703K01155j38994J83631k22727J63857
$$ 1162664 1112323 1203272 1298898 1153182 859479 1060634 921640 1105271 882544 1046401
14615A046401j42355k4316K67391j66611K98868E53670K67828J47294k1872L49258
$$ 1046401 904046 879730 1147121 980510 1279378 553670 821498 968792 946920 1296178
14605A296178j06612k82424O3768J43285J27276j34276J37708m75322N66096l72365
$$ 1296178 1189566 907142 970910 1114195 1241471 1107195 1244903 769581 1335677 963312
14595I63312K96764m95486M91044k35853J59213L36119j51592l45989K87813k59489
$$ 963312 1260076 764590 1255634 1019781 1178994 1515113 1363521 1017532 1305345 1045856
14585A045856L12886L9459k83463R2783P805P2787K85600k14169J34206j09875
$$ 1045856 1358742 1398201 1114738 1207521 1215326 1288113 1573713 1359544 1493750 1383875
14575A383875R507L17232k95457m91149N55454K89824k7057j81302j90096j08855
$$ 1383875 1393382 1710614 1415157 924008 1479462 1769286 1742229 1560927 1370831 1261976
14565A261976J67601p9548L91561k98578L18277l820o5473o7126K33686L04114
$$ 1261976 1429577 1350029 1741590 1443012 1761289 1757469 1691996 1624870 1858556 2162670
14555B162670o03011M10208j64817m11117M13011K192K10237k49746N16449j58335
$$ 2162670 1559659 1969867 1805050 1393933 1806944 1809136 2019373 1769627 2286076 2127741
14545B127741J07991K42038k8771K26876j63325J99557K42928M67857M12644P62625
$$ 2127741 2235732 2477770 2448999 2675875 2512550 2712107 2955035 3422892 3835536 4598161
14535D598161Q99665K406668M148889N959695Q202211j249576r566721m756553
$$ 4598161 5497826 7904494 12053383 18013078 26215289 24965713 15398992 10642439
14527A0642439k913781k398257j119818l60997j6390Q4535q86041n87146m28029
$$ 10642439 7728658 5330401 4210583 3849586 3833196 3917731 3031690 2444544 2016515
14518B016515o7479J98920l34281J20684K89967m96977J65252K12386J2145m6480
$$ 2016515 1949036 2147956 1813675 1934359 2224326 1727349 1892601 2104987 2117132 2070652
14508B070652k37510R0011J87493j40618J74912P3205k39079N4603j62611K30890
$$ 2070652 1833142 1923153 2110646 1970028 2144940 2218145 1979066 2033669 1871058 2101948
14498B101948j59298J81269J10798M488m3155K36778l61239r4453L28425J4919
$$ 2101948 1942650 2123919 2234717 2239205 2196050 2432828 2071589 1977136 2305561 2320480
14488B320480J04736j56995K00683J20067j36852K17433q3593L07756l69256K76929
$$ 2320480 2425216 2268221 2468904 2588971 2452119 2669552 2585959 2893715 2524459 2801388
14478B801388k67302K52633j48362J63657J78441N4894l6488j14539j94910J06618
$$ 2801388 2534086 2786719 2638357 2802014 2980455 3035349 2998861 2884322 2689412 2796030
14468B796030K52758J00495K3260K7066L5804R0694m7124k03042K33551Q8457
$$ 2796030 3048788 3149283 3172543 3199609 3235413 3326107 3278983 3075941 3309492 3397949
14458C397949q3482K05005J40411k88834L40941p8229j46149K12242j06854R9479
$$ 3397949 3314467 3519472 3659883 3371049 3711990 3633761 3487612 3699854 3593000 3692479
14448C692479k86065L67025j29323M61333p04095M90475J47150O9001J60071k26813
$$ 3692479 3406414 3773439 3644116 4105449 3401354 3891829 4038979 4107980 4268051 4041238
14438D041238Q8546p3491M1991J04597M77362m32382Q3416K21647K7506L9465
$$ 4041238 4129784 4056293 4098284 4202881 4680243 4247861 4331277 4552924 4580430 4619895
14428D619895J12168l1323K3040K04913J91705K5562q2715n5612J87218j15838
$$ 4619895 4732063 4700740 4723780 4928693 5120398 5145960 5063245 5007633 5194851 5079013
14418E079013K26581K138Q5522K57940J42769j97004K85594M24594l59056J17954
$$ 5079013 5305594 5307732 5393254 5651194 5793963 5596959 5882553 6307147 5948091 6066045
14408F066045K10954L35003J3405J90724J87184l08179R8291L21848K7048M2284
$$ 6066045 6276999 6612002 6625407 6816131 7003315 6695136 6793427 7115275 7142323 7184607
14398G184607P2313Q2955L72193k65906J22283J30701j39909N88343o0720K82170
$$ 7184607 7256920 7339875 7712068 7446162 7568445 7699146 7559237 8147580 8086860 8369030
14388H369030j53285j7520K62354K64211j32005J36227L5650K12164L75793j27252
$$ 8369030 8215745 8198225 8460579 8724790 8592785 8729012 8764662 8976826 9352619 9225367
14378I225367M10378L75604O9404J67929N8763r3227L61973M11405J47921K061
$$ 9225367 9635745 10011349 10080753 10248682 10307445 10214218 10576191 10987596 11135517 11137578
14368A1137578M23645J55018M23561J9125L80081o7812M75190M38908j09184O5376
$$ 11137578 11561223 11716241 12139802 12158927 12539008 12471196 12946386 13385294 13276110 13341486
14358A3341486O95357O4574K28775K49593K03169R7849P23662K88712J01492M94355
$$ 13341486 14036843 14101417 14330192 14579785 14782954 14880803 15604465 15893177 15994669 16489024
14348A6489024K90080L17227O32720J21593J51637J019687j40374N20151N41435
$$ 16489024 16779104 17096331 17729051 17850644 18002281 19021968 18881594 19401745 19943180
14339A9943180M78602N40036K27441P09694P41864M57811O17759M36628P61181
$$ 19943180 20421782 20961818 21189259 21898953 22640817 23098628 23716387 24153015 24914196
14330B4914196N14700P40937L30554P31805Q33077J069557O83542R09165R78670
$$ 24914196 25428896 26169833 26500387 27232192 28065269 29134826 29818368 30727533 31706203
14321C1706203M47778J483601Q83980R28180R91071R33756J391452J327617J387575
$$ 31706203 32153981 33637582 34521562 35449742 36440813 37374569 38766021 40093638 41481213
14312D1481213J539405J034539J886521J072188J898344J887336J805967K401827
$$ 41481213 43020618 44055157 45941678 47013866 48912210 50799546 52605513 55007340
14304E5007340J367436K364169K107398K067460K501676K783645K389025L109661
$$ 55007340 56374776 58738945 60846343 62913803 65415479 68199124 70588149 73697810
14296G3697810L167253L544086L348462L607706M304814M034519M851794N153154
$$ 73697810 76865063 80409149 83757611 87365317 91670131 95704650 100556444 105709598
14288A05709598M804784N528738O388615N812609O399653O744741Q006279P831726
$$ 105709598 110514382 116043120 122431735 128244344 134643997 141388738 149395017 157226743
14280A57226743Q723032Q986813R518087J0159598J1346188J0767873J2212742
$$ 157226743 165949775 174936588 184454675 194614273 205960461 216728334 228941076
14273B28941076J2227694J2689473J3358411J3950823J3666830J4389556J4423156
$$ 228941076 241168770 253858243 267216654 281167477 294834307 309223863 323647019
14266C23647019J4695571J3898416J3654014J3569525J3052061J2553198J1593426
$$ 323647019 338342590 352241006 365895020 379464545 392516606 405069804 416663230
14259D16663230R177262O022835O5135j27389Q3587k671658q967111n634476n102404
$$ 416663230 425840492 431863327 431928462 431801073 431884660 429213002 420245891 414611415 409509011
14250D09509011p641763p605735q942230j0279503j2007215j4005257j4069343
$$ 409509011 401867248 394261513 385319283 375039780 363032565 349027308 334957965
14243C34957965j4230895j4313173j4163782j3707758j3986774j3143119j2256260
$$ 334957965 320727070 306413897 292250115 278542357 264555583 251412464 239156204
14236B39156204j2088809j1927594j2598997j1263406j0437978r924234q885741
$$ 239156204 227067395 215139801 202540804 191277398 180839420 170915186 162029445
14229A62029445q320629p969343p671119o783801o195503o089831n068662n725924
$$ 162029445 153708816 145739473 138068354 131284553 125089050 118999219 113930557 108204633
14221A08204633m739571n269514m150861m057202l750089l481226l433851l315601
$$ 108204633 103465062 98195548 94044687 89987485 86237396 82756170 79322319 76006718
14213G6006718l238558k817289k565380k908443k459548k010252k535340j536963
$$ 76006718 72768160 69950871 67385491 64477048 62017500 60007248 57471908 55934945
14205E5934945j984133k117196j714859j867810j522556j689982q97482j831664
$$ 55934945 53950812 51833616 50118757 48250947 46728391 45038409 44140927 42309263
14197D2309263j220181j519379r59528j154841r13154q04005j110173j436327
$$ 42309263 41089082 39569703 38610175 37455334 36542180 35738175 34628002 33191675
14189C3191675r35079r34453n17763r87569o43016q32477j041557k90548q49733
$$ 33191675 32256596 31322143 30804380 29816811 29173795 28341318 27299761 27009213 26159480
14180B6159480n02429r73938l82304j041115l64839m82931l59076q71358l48766
$$ 26159480 25657051 24683113 24300809 23259694 22894855 22411924 22052848 21181490 20832724
14171B0832724n70112k81273o26254j47417n53455o91101j01542n04414k36965
$$ 20832724 20262612 19981339 19355085 19207668 18654213 17963112 17861570 17357156 17120191
14162A7120191m44041m30708k98832m18616Q7052n72729n90832J04946l37900
$$ 17120191 16676150 16245442 15946610 15527994 15615046 15042317 14451485 14556431 14218531
14153A4218531l04494l97376K52297l13196k65573p14621k77079J08866j76325
$$ 14218531 13914037 13516661 13768958 13455762 13190189 12475568 12198489 12307355 12131030
14144A2131030l10934r7908m01092q2689l28280j22012L6329p04195o3131K20951
$$ 12131030 11820096 11722188 11321096 11238407 10910127 10788115 10824444 10120249 10057118 10278069
14134A0278069k94834j75060j73508L2322k39505l99487k93045P08537r27083
$$ 10278069 9983235 9808175 9634667 9666989 9427484 9027997 8734952 9443489 8516406
14125H516406M73895n79393L3245j11122k25163j93983J53909k55439j67054N0375
$$ 8516406 8990301 8410908 8444153 8333031 8107868 7913885 8067794 7812355 7645301 7695676
14115G695676n04519m6208o5452K94225j34029k48880j10694l63663J79121n6472
$$ 7695676 7191157 7144949 7079497 7373722 7239693 6990813 6880119 6516456 6695577 6639105
14105F639105j21281k79759M43575p51800J32844J78355j94399k48358J02609
$$ 6639105 6517824 6238065 6681640 5929840 6062684 6241039 6046640 5798282 5900891
14096E900891o3820m5489L6851l64536j61122K41654n16920M44300k83155o719
$$ 5900891 5837071 5791582 5828433 5463897 5302775 5544429 5027509 5471809 5188654 5181935
14086E181935J82375k40519j76263Q5366j56882k64482K2834o5783l3496L7034
$$ 5181935 5364310 5123791 4947528 5032894 4876012 4611530 4634364 4568581 4535085 4572119
14076D572119J06184j07897k48124J63433j66076J35916j15624l15333K17351
$$ 4572119 4678303 4570406 4322282 4485715 4319639 4455555 4339931 4024598 4241949
14067D241949p3582l15930L19155m48731J28932m1486J88183j28078k80017K65576
$$ 4241949 4168367 3852437 4171592 3722861 3851793 3810307 3998490 3870412 3590395 3855971
14057C855971j0685l28414l4227J6872M2585J7184R8261j71985j82526k2980P2753
$$ 3855971 3845286 3516872 3482645 3499517 3542102 3559286 3657547 3485562 3303036 3280056 3352809
14046C352809J98805r0641J59396j53422M2141k21534l12487L03242m24114O7888
$$ 3352809 3551614 3460973 3620369 3466947 3509088 3287554 2975067 3278309 2854195 2922083
14036B922083M6432R1823k7376o5205k98348j33704P3830L4050q6352J91159K63093
$$ 2922083 2968515 3060338 3032962 2967757 2669409 2535705 2609535 2643585 2557233 2748392 3011485
14025C011485k99870M5721n8209j09685M4503j06264Q5097r7801n5837J61190
$$ 3011485 2711615 2757336 2699127 2589442 2633945 2527681 2612778 2514977 2459140 2620330
14015B620330k3320l55345N81904k55057m29683O12145m45957m23658K13488M39277
$$ 2620330 2597010 2241665 2823569 2568512 2138829 2750974 2305017 1881359 2094847 2534124
14005B534124p5810j07535o8405J01303J027k32160O3440j35991O9228k34898
$$ 2534124 2458314 2350779 2282374 2383677 2384704 2152544 2215984 2079993 2149221 1914323
13995A914323o8058K83069j908r2852o4297K6899j42604P5155J84061k47231R4081
$$ 1914323 1846265 2129334 2127426 2034574 1970277 1997176 1854572 1929727 2113788 1866557 1960638
13984A960638k8041k882o3355K01781J96488r612j48918M53170J52867M41247
$$ 1960638 1932597 1929715 1866360 2068141 2264629 2255017 2106099 2559269 2712136 3153383
13974C153383J730853L443544N730937Q758945M190869q939319m681191l167194
$$ 3153383 4884236 8327780 14058717 22817662 27008531 18069212 13388021 10220827
13966A0220827k323461j833180r84411j053476l79295n40807N2244k85547r8339
$$ 10220827 7897366 6064186 5079775 4026299 3647004 3106197 3158441 2872894 2774555
13957B774555l1672j9287o69719K03693J00898k27378j72308l12934J36386J4572
$$ 2774555 2742883 2723596 2053877 2257570 2358468 2131090 1958782 1645848 1782234 1796806
13947A796806j25229K96695l36133J28692j21233L8415N7487m5894J90073k68373
$$ 1796806 1671577 1968272 1632139 1760831 1639598 1678013 1735500 1689606 1879679 1611306
13937A611306L06331k16417R132j28179L85545k97048L37211n23362K51461k84303
$$ 1611306 1917637 1701220 1710352 1582173 1967718 1670670 2007881 1484519 1735980 1451677
13927A451677J13792J22975j72356J73347k42926r499n2552J32475k54802K64820
$$ 1451677 1565469 1688444 1516088 1689435 1446509 1437010 1384458 1516933 1262131 1526951
13917A526951r352j66989j1669j47356q9516K77578r1497K33688n9984k88155
$$ 1526951 1517599 1350610 1338941 1191585 1102069 1379647 1288150 1521838 1461854 1173699
13907A173699j5246Q6279J29974j59615N7849J99286N314j35916l22227K20079
$$ 1173699 1158453 1244732 1374706 1215091 1272940 1472226 1477540 1341624 1019397 1239476
13897A239476M5333P5570l78574l524L62897n7314j6186j32245J97357k35640
$$ 1239476 1284809 1360379 981805 978281 1341178 1283864 1267678 1135433 1332790 1097150
13887A097150N35322m80426K31o0357J19715q9818k7497l5071N0707j38222L64170
$$ 1097150 1632472 1152046 1152277 1091920 1211635 1121817 1094320 1059249 1109956 971734 1335904
13876A335904E66575M23393N6103L8095k00487J69169k48712J47919L65864k43598
$$ 1335904 566575 989968 1046071 1084166 883679 1052848 804136 952055 1317919 1074321
13866A074321l28450K14450L1005J98194j25096l71471K54915K6248j21493j49039
$$ 1074321 745871 960321 991326 1189520 1064424 692953 947868 974116 852623 703584
13856G03584L84844k06100J09717l05443M68524o0067k71686K59715M7164k80193
$$ 703584 1088428 882328 992045 686602 1155126 1095059 823373 1083088 1130252 850059
13846H50059r5076M40813m37849n630Q5990K73802E40283L17350q3215j24060
$$ 850059 754983 1195796 757947 752317 838307 1112109 540283 857633 774418 650358
13836F50358J59351L78252m14516q852Q7358j35648J70900n3188l0873R9444j99851
$$ 650358 809709 1187961 773445 764593 851951 716303 887203 834015 803142 902586 702735
13825G02735K25131k23565K03904l4399j89224q9773J68022M0224J61232D26231
$$ 702735 927866 704301 908205 873806 684582 594809 762831 803055 964287 426231
13814G50170J85395j48681j81142K49802O9351j53085L81380l80608l4447k12990
$$ 750170 935565 786884 605742 855544 924895 771810 1153190 772582 738135 525145
13804E25145J22550K3797k56409K99019k3451o8164q6146J38406l3670j8638J55097
$$ 525145 647695 671492 415083 714102 690651 622487 536341 674747 641077 622439 777536
13793G77536k65050l8228K55113j2378j49183L69108K3981k29682N13862F09872
$$ 777536 512486 474258 729371 716993 567810 936918 960899 731217 1245079 609872
13782E62702q5672M63061D26153O63191D99425J7312j07100L18175q4406J9410
$$ 562702 477030 940091 426153 1089344 499425 516737 409637 727812 643406 662816
13772F62816K87414k43303Q3181A88106M62671r833k09321q166J35229O7307j23897
$$ 662816 950230 706927 790108 188106 650777 640944 431623 423457 558686 625993 502096
13761E02096M5716L8018L2398O8679r1840j48044K33088j49631K40228A99717
$$ 502096 547812 585830 618228 686907 595067 447023 680111 530480 770708 199717
13750B97927J680Q4560L91237N3534C06978J80599L9799K76640B63448L02250
$$ 297927 299607 384167 775404 828938 306978 487577 527376 804016 263448 565698
13740E65698J71433B68481M06862L2732k55600q7666k4592K75271r0754k46629
$$ 565698 737131 268481 675343 708075 452475 364809 340217 615488 524734 278105
13730B78105L42838L4328l15823j16997L10308J06078j66222O9229j2470L7822
$$ 278105 620943 655271 339448 222451 532759 638837 472615 541844 529374 567196
13720E67196K5159M7192C08874j10832M55737j43197r0090n8642J37476K87376
$$ 567196 592355 639547 308874 198042 653779 510582 420492 361850 499326 786702
13710G86702q8861k77818J58169j30189j85330K88502j05571j75523k4206J4014
$$ 786702 697841 420023 578192 448003 262673 551175 445604 270081 245875 259889
13700B59889K50615K13303p6585k37510J36690j14869P4261j02430L2864A29967
$$ 259889 510504 723807 647222 409712 546402 431533 505794 403364 436228 129967
13689D85027j79859A45303M04281K4305k83402R2331K69463j53078J8165j76368
$$ 485027 305168 145303 549584 573889 290487 382818 652281 499203 517368 341000
13679C41000N1408J96596j19344j51639l3242K045L4606K11653j18954J81053
$$ 341000 392408 589004 469660 318021 284779 286824 321430 533083 414129 595182
13669E95182B45341K19801q2533J46262p7069j44954J50401M5270B14577K81287
$$ 595182 245341 465142 382609 528871 451802 306848 457249 502519 214577 495864
13659D95864J15017j01912k25032L41166K55024G5522L47138L45425B08172J12247
$$ 495864 610881 508969 283937 625103 880127 75522 422660 768085 208172 320419
13649C20419l273e088I2470L5088l3468J36055J02020B6622L45646n197L18973
$$ 320419 317146 -5088 92470 127558 94090 230145 332165 26622 372268 367071 686044
13638F86044j24237A88270L75172J25256A01210J56651A25142E7289N73510l00959
$$ 686044 561807 188270 563442 688698 101210 257861 125142 57289 630799 329840
13628C29840g4410F77543C07098J89276k39620n8878j9623m1608K54590m7125
$$ 329840 -74410 677543 307098 496374 256754 197876 178253 136645 391235 344110
13618C44110l6062O5668j39187L5185K59340B29089G243L42604L5958J86539l9818
$$ 344110 308048 373716 234529 269714 529054 229089 7243 349847 385805 572344 532526
13607E32526B50350N5860j07403L28960j57013O3424J65480A76160P9562K56407
$$ 532526 250350 306210 198807 527767 370754 434178 599658 176160 255722 512129
13597E12129a47831B87208j13113J76943L38995k63521A22765L37790A47491R8452
$$ 512129 -147831 287208 174095 351038 690033 426512 122765 460555 147491 245943
13587B45943L34648A46393L05890A52159M4382R9613a1507B45187L368Q7793J89418
$$ 245943 580591 146393 452283 152159 196541 296154 -11507 245187 248555 336348 525766
13576E25766j36587L367r7262j10950R692L32388H9638J21051M06410k61337N577
$$ 525766 389179 392546 295284 184334 194026 526414 89638 210689 617099 355762 361339
13565C61339G8176J68857R5988A37668J26068J22086A9589K65573M38524H9369
$$ 361339 78176 247033 343021 137668 263736 385822 19589 285162 723686 89369
13554B40399i5079G3615J57806O6247M1585d1115C39116q6094n7786o3469K60319
$$ 240399 -95079 73615 231421 297668 339253 -41115 339116 253022 195236 131767 392086
13543C92086q8363J70457k13723M9923q5832J61798l8832I0100K66223J49772
$$ 392086 303723 474180 260457 310380 224548 386346 347514 90100 356323 506095
13533E06095k34063m9171B1560M1751M79741A13117K01139c4149D20557A87752
$$ 506095 272032 222861 21560 63311 543052 113117 314256 -34149 420557 187752
13522B69615j28552A1262J83186L37100H2764J47614p5826J65419j44706J08061
$$ 269615 141063 11262 194448 531548 82764 230378 154552 319971 175265 283326
13512B83326K93086B18145p6008n7139E312J41257J26196L698R9083B3887N2356
$$ 283326 576412 218145 142137 84998 5312 146569 272765 276463 375546 23887 76243
13501G6243J18067R5616A44366B4497J65769N7949H7170L41755j68162m2192p1525
$$ 76243 194310 289926 144366 24497 190266 248215 87170 428925 260763 218571 147046
13490A47046L660J99723l280j59197a01790I438h3637l7177A39513L01480H0646
$$ 147046 150706 350429 347149 187952 -101790 9438 -83637 -120814 139513 440993 80646
13478A10008J55699F6470L42320A72805D5306J34547R5011n123A25981J37905
$$ 110008 265707 66470 408790 172805 45306 179853 274864 269741 125981 263886
13468B63886l4454o1623J79056n8517d4315I1825J41585P8776F3905L3247l6937
$$ 263886 229432 167809 346865 288348 -44315 91825 233410 312186 63905 97152 60215
13457F0215K815K67323f3259B21948L59338A28478L6034m6450L6600L69245F9552
$$ 60215 63030 330353 -63259 221948 581286 128478 164512 118062 154662 523907 69552
13445B41453O0045a00415A25232O9876J82522H4328B313O518J67393d60D77444
$$ 241453 301498 -100415 125232 195108 377630 84328 2313 8831 176224 -460 477444
13433A24422n0568K81540r4967n4083l8480J47107q804d7132A87535q8514L42780
$$ 124422 73854 355394 260427 206344 167864 314971 306167 -47132 187535 99021 441801
13422D41801j52021q4609a38557A39341C1477o855L07528A23776L19092A1990
$$ 441801 289780 205171 -138557 139341 31477 24622 332150 123776 442868 11990
13411a4244A25735C6369b16007C87024a80206a739B21370J54491j30863r9267
$$ -14244 125735 36369 -216007 387024 -180206 -1739 221370 375861 244998 145731
13401A45731B4403b05145G3897Q5460E4225J34386q1646l2058J86192J1632b62919
$$ 145731 24403 -205145 73897 159357 54225 188611 106965 74907 261099 272731 -262919
13389a8526B43549L136a98165H9731M7762b9519A50934K14806i1770D9437J98413
$$ -18526 243549 246685 -198165 89731 137493 -29519 150934 365740 -91770 49437 247850
13378B47850a8983F1587a05076A20266i8616A16693K74317k9595a25002e069k5855
$$ 247850 -18983 61587 -105076 120266 -98616 116693 391010 361415 -125002 -5069 -30924
13367c0924j02232C91651j24386C5491J72491M1755J32140A01801J93351K38844
$$ -30924 -133156 391651 267265 35491 207982 249737 381877 101801 295152 533996
13357E33996A16396N8347E2162J79695K0277l5071j1850c2049A89834N3551A00878
$$ 533996 116396 174743 52162 231857 252134 217063 205213 -32049 189834 243385 100878
13345B01784E8182K01083j18678o681M2561M05335j92164j04436N292K5332A07640
$$ 201784 58182 259265 140587 133906 176467 581802 389638 285202 290494 315826 107640
13333B10386J76511j68183n0218d2718B61666J57146m2158A37871J20898M9165
$$ 210386 386897 218714 168496 -42718 261666 418812 376654 137871 258769 307934
13323C07934o4507A01583J14281p2626c2423B70762I5576J95859A1952Q0752h6574
$$ 307934 243427 101583 215864 143238 -32423 270762 95576 291435 11952 92704 -86574
13311A39903J84090q9344K51357a04820G4845L01195A65600R2244A11179L13106
$$ 139903 323993 234649 486006 -104820 74845 376040 165600 257844 111179 424285
13301D24285A00820J99743E4149M22064A78575J3233K02029j77532I2279K58246
$$ 424285 100820 300563 54149 476213 178575 191808 393837 216305 92279 350525
13291C50525g8075q7357A14338M9062J83214j26988D1853P7284K19461j35182
$$ 350525 -78075 -165432 114338 163400 346614 219626 41853 119137 338598 203416
13281B03416A3933J38556O2863D4584J33805K52013B14929n6535c83712g2854
$$ 203416 13933 152489 215352 44584 178389 430402 214929 158394 -383712 -72854
13270A91846C5032J1098M4026P9880R2713j07270Q0628b99009H2425J6587c1093
$$ 191846 35032 46130 90156 170036 262749 155479 236107 -299009 82425 99012 -31093
13258G9330M0236g101H7776a35285D34216A080b21079j51764A24941J31564D2652
$$ 79330 119566 -7101 87776 -135285 434216 1080 -221079 -372843 124941 256505 42652
13246a23184A05216C9334d1329A35020J60628L612a41513b8534k9403o4474A89220
$$ -123184 105216 39334 -41329 135020 295648 299260 -141513 -28534 -57937 -122411 189220
13234A73273J6098r1473c1407C78602p6846h0606I4683l7938J75463a86577f5137
$$ 173273 189371 97898 -31407 378602 301756 -80606 94683 56745 232208 -186577 -65137
13222I8462h200F5755L047c16060f7666K9994A52706N2382m0878c4002r1480E25753
$$ 98462 -8200 65755 68802 -316060 -67666 -37672 152706 205088 164210 -34002 -125482 525753
13209i1796o4842A85008O5580a65919A54496D1905O6172c1690j94008G7759a0105
$$ -91796 -156638 185008 250588 -165919 154496 41905 108077 -31690 -225698 77759 -10105
13197B53845E0461J54371a32320B16328k8086b56253d1716A16828M5200N8302
$$ 253845 50461 204832 -132320 216328 188242 -256253 -41716 116828 162028 220330
13187B20330D762e2054k3326H8769k7129a21298A42148J10602A05995A5890j227
$$ 220330 4762 -52054 -75380 88769 61640 -121298 142148 252750 105995 15890 14663
13176A4663J69752l593H3720R259i9801o3615b3195A84108g7944A0141h8453g744
$$ 14663 184415 180822 83720 92979 -99801 -163416 -23195 184108 -77944 10141 -88453 -7744
13163C60910d8239j23665a3138C25235G9335L23274A31792i4077d3732A24066
$$ 360910 -48239 -171904 -13138 325235 79335 402609 131792 -94077 -43732 124066
13152g6981B5691N68258k95768A38754k4075j6300k6203J01221b34648J2900B16092
$$ -76981 25691 593949 298181 138754 114679 98379 72176 173397 -234648 -221748 216092
13140B60083K3839m0398H1899a74179j501M6689j35191A28862B9718L46235A15207
$$ 260083 283922 243524 81899 -174179 -175680 -128991 -264182 128862 29718 375953 115207
13128I0224b98123B4560a23965k8934j66150d9490A94347N3612D9801J036a9911
$$ 90224 -298123 24560 -123965 -152899 -319049 -49490 194347 247959 49801 50837 -19911
13116a85629j38958O8924B8025P4216h4944C93044B7112J52845j4444Q3351H9918
$$ -185629 -324587 -255663 28025 102241 -84944 393044 27112 179957 165513 248864 89918
13104B68254A17817R1548d2699B82222j02278b32107C02019a62969A21303J8846
$$ 268254 117817 209365 -42699 282222 179944 -232107 302019 -162969 121303 140149
13094A40149e811B18517f8437B59462q0842o9824j7761B7154a6144D4892h0923
$$ 140149 -5811 218517 -68437 259462 178620 108796 91035 27154 -16144 44892 -80923
13082B4059h8188n802A05221d2945C5709G999K41099A03067P6750d3190K1428
$$ 24059 -88188 -93990 105221 -42945 35709 7999 249098 103067 179817 -43190 -21762
13071b1762j35088j9917C6391a07325l08541C9264J21256K4257g5958B12344h0237
$$ -21762 -156850 -176767 36391 -107325 -415866 39264 160520 184777 -75958 212344 -80237
13059b4791B01761a05959L4225l0575d6599A79206O5076m9216N1232J11375a86993
$$ -24791 201761 -105959 -71734 -102309 -46599 179206 244282 195066 246298 357673 -186993
13047A1322K11612b0246B67781h555q0628B11856l3210k1568h8501G3655k639
$$ 11322 222934 -20246 267781 -8555 -89183 211856 178646 157078 -88501 73655 71016
13036G1016L9878d392A77425K5262J60457j73560A4710L05751d9037j20666j45920
$$ 71016 110894 -4392 177425 202687 363144 189584 14710 320461 -49037 -169703 -315623
13025c15623F194f7614k82941a15882p1608F579M1278A2282K23093j14901O248
$$ -315623 6194 -67614 -350555 -115882 -187490 6579 47857 12282 235375 120474 126722
13014A26722k7725M4740Q7216G2383C225Q6619J27506A5740J92810J21495D8972
$$ 126722 98997 143737 230953 72383 3225 89844 217350 15740 208550 330045 48972
13002B35982h6196J140G1678J02748E1863J56540J4479a19346A0746L61551b45144
$$ 235982 -86196 -85056 71678 174426 51863 208403 222882 -119346 10746 372297 -245144
12990A03065K28659H0653e0708A62216n6947g72m4251j80884a5476C9727K04805
$$ 103065 331724 80653 -50708 162216 105269 -772 -45023 -225907 -15476 39727 244532
12979B44532f5493B45117H5447j5515I206L17670a01271A34758M9032l0298h4451
$$ 244532 -65493 245117 85447 69932 9206 326876 -101271 134758 183790 153492 -84451
12967C4007f2189A2118i2211p9027q7772A01287j5106c8796F6752e7168r6458
$$ 34007 -62189 12118 -92211 -171238 -259010 101287 86181 -38796 66752 -57168 -153626
12956a53626a9310j4948k09358C6043c0609D52507b9689k52470j4992h2263A20748
$$ -153626 -19310 -34258 -243616 36043 -30609 452507 -29689 -282159 -297151 -82263 120748
12944C4310a34823C61355B6498K5249L977Q8490E1317Q3175m9704g0544A80987
$$ 34310 -134823 361355 26498 51747 55724 144214 51317 134492 84788 -70544 180987
12932B69537a34942B13587a21472A03916a00428d5276I772J49596b6537B0359
$$ 269537 -134942 213587 -121472 103916 -100428 -45276 9772 159368 -26537 20359
12921b00793G4732b05648H2588L9960a02647j7614B42788p005D7151h1823B00537
$$ -200793 74732 -205648 82588 122548 -102647 -120261 242788 235783 47151 -81823 200537
12909A98070a7139o9372o8888d1746J7524B9421J65409p7607C4716J35377G5686
$$ 198070 -17139 -86511 -155399 -41746 -24222 29421 194830 117223 34716 170093 75686
12897a3681j46858c7176D9799i9377G2092b3490E8187G116K28302H3811k0701
$$ -13681 -160539 -37176 49799 -99377 72092 -23490 58187 7116 235418 83811 63110
12886F3110M8740d9288G2094b21195C99644A61689O908a47349C1800J93426G9814
$$ 63110 111850 -49288 72094 -221195 399644 161689 168597 -147349 31800 225226 79814
12874d6987D13384j02745b43223l4992e5675G732K31409a27347d8617B59978E9870
$$ -46987 413384 310639 -243223 -278215 -55675 7732 239141 -127347 -48617 259978 59870
12862A28941m5541J83830a27567M9771l99286A17241h1194J3107L2371j7248A04271
$$ 128941 83400 267230 -127567 -77796 -477082 117241 -81194 -68087 -35716 -52964 104271
12850A94888n504D5344d467o75j36624E2860a34899A76434l7065J51727D6307
$$ 194888 189384 45344 -4467 -5142 -141766 52860 -134899 176434 139369 291096 46307
12838i5370k7184A66059a88155p7197F9181c13577A3317j246a59463B52082F9004
$$ -95370 -122554 166059 -188155 -265352 69181 -313577 13317 12071 -159463 252082 69004
12826C40658b73796D906J4175b45153D4956q510N221M3072O1390p0005c99631
$$ 340658 -273796 4906 19081 -245153 44956 36446 41667 84739 146129 76124 -399631
12814a19282G526L3877J87880c3095l6445j46546A811J0753a74608k70420K21546
$$ -119282 7526 41403 229283 -33095 -69540 -216086 1811 12564 -174608 -445028 -223482
12803b23482j92098a72993A9570F632c23861i7766A87175a79008A59778J03901
$$ -223482 -415580 -172993 19570 6632 -323861 -97766 187175 -179008 159778 263679
12793B63679g9501J3594A18323b54623A5410b1312j02885B33644n2878m3798a76645
$$ 263679 -79501 -65907 118323 -254623 15410 -21312 -124197 233644 180766 136968 -176645
12781A34630d5796k029j44132L8991G0969k426E160b27216J3799P5352B1809J91569
$$ 134630 -45796 -47825 -191957 -152966 70969 68543 5160 -227216 -213417 -138065 21809 213378
12769B13378F15d6758E6102a3569k32150B38176c665k21211a7984k71901N3027
$$ 213378 615 -46758 56102 -13569 -245719 238176 -3665 -224876 -17984 -289885 -236858
12758b36858j61732i0604j52411J3164P0002H8649J35239b59596c667C11227b50450
$$ -236858 -398590 -90604 -243015 -229851 -159849 88649 223888 -259596 -3667 311227 -250450
12746E0429a60491A6399N335a56586C3197Q1228a07174C5366j2115a55054A75407
$$ 50429 -160491 16399 21734 -156586 33197 114425 -107174 35366 23251 -155054 175407
12734a2561j67206I8919g3266k88301a4994c133B52670J45663a24696k7107D34488
$$ -12561 -179767 98919 -73266 -361567 -14994 -3133 252670 398333 -124696 -151803 434488
12722E1675c68112A61329a24889B36808r9099a96087A63893a10154A47947J68768
$$ 51675 -368112 161329 -124889 236808 137709 -196087 163893 -110154 147947 316715
12712C16715b37946B53219A23071b07424g5828B05092b19723B08871B212g1958
$$ 316715 -237946 253219 123071 -207424 -75828 205092 -219723 208871 2212 -71958
12701E074M8250f0732b5779j61270d9013J5347H0315a66508B91983G3226J61204
$$ 5074 53324 -60732 -25779 -187049 -49013 -33666 80315 -166508 291983 73226 234430
12690B34430O8391A27646g0391F2701J8440f6415D73861j38628a03048M9861E1890
$$ 234430 302821 127646 -70391 62701 81141 -66415 473861 335233 -103048 -53187 51890
12678A60325b5900G4686J34074a23929b3513m3524k65695D7933a48951K2045d6006
$$ 160325 -25900 74686 208760 -123929 -23513 -67037 -332732 47933 -148951 -126906 -46006
12666A53649d7623C9821A3261L32569G1653d2718C4523J42747O8631j01641j5941
$$ 153649 -47623 39821 13261 345830 71653 -42718 34523 177270 245901 144260 128319
12655A28319f3860C4982h0389B77596K55620b5371A69213l6294J20877i9381l0937
$$ 128319 -63860 34982 -80389 277596 533216 -25371 169213 132919 253796 -99381 -130318
12644a30318c9695B8378P6877Q5145k3593m7385j0025b06206B59342a19524c1481
$$ -130318 -39695 28378 105255 190400 166807 119422 109397 -206206 259342 -119524 -31481
12632B59106d0662F7928M4741E222b80388A25984J37872C9844K2057K96377b23317
$$ 259106 -40662 67928 112669 5222 -280388 125984 263856 39844 61901 358278 -223317
12620B05993P9650b6721A45589h3238m6090f036B3679K07532F3375J86175A24635
$$ 205993 285643 -26721 145589 -83238 -129328 -6036 23679 231211 63375 249550 124635
12608C91603A09638J5985R1228R6917A25739p128K78585j50054i5813I0529J61406
$$ 391603 109638 125623 216851 313768 125739 118611 397196 247142 -95813 90529 251935
12597B51935j25256h7942A86064i2176A54107i1877A47436N89076A90627b68143
$$ 251935 126679 -87942 186064 -92176 154107 -91877 147436 736512 190627 -268143
12586b17895o4939B07361b76486J8313A06804j220a62425b908j35766k07662h3069
$$ -217895 -282834 207361 -276486 -258173 106804 105584 -162425 -2908 -138674 -346336 -83069
12574A72833i650B85560b25073C8586Q3407a12975I8249O9869b1119A11909k8798
$$ 172833 -9650 285560 -225073 38586 121993 -112975 98249 168118 -21119 111909 83111
12563H3111g7440r9863N6864M2838B08822n7016a54961A33835a122m0477p77a1843
$$ 83111 -77440 -177303 -120439 -77601 208822 151806 -154961 133835 -1122 -41599 -42376 -11843
12550c37877a17837A75869D321J18768b75568J32573F0636B0788c400A94080D584
$$ -337877 -117837 175869 4321 123089 -275568 -142995 60636 20788 -3400 194080 4584
12538g1941j31262e0392p3605M7615h156A31063J78495h3213k5852c5717A51540
$$ -71941 -203203 -50392 -123997 -76382 -8156 131063 309558 -83213 -109065 -35717 151540
12526H1424b24559C09460b38567l2138C5091f3920A6950K13375r6713b53765f6311
$$ 81424 -224559 309460 -238567 -270705 35091 -63920 16950 230325 133612 -253765 -66311
12514d9407b0593l3910K6527B27024h5520k69888A8423a42332A92004D8878J656
$$ -49407 -20593 -54503 -27976 227024 -85520 -355408 18423 -142332 192004 48878 50534
12503E0534r210a4175N111A02113a8767o5425C3848b42088A03003A0391K75182
$$ 50534 41324 -14175 -9064 102113 -18767 -84192 33848 -242088 103003 10391 285573
12492B85573b73815B81337i2508M6140o2406r2289b4470q3177B06461q1061d7033
$$ 285573 -273815 281337 -92508 -46368 -108774 -201063 -24470 -107647 206461 125400 -47033
12480F3918K34738h1648b6253o900O388l54690i86A6303b3531G8123c00881j24533
$$ 63918 298656 -81648 -26253 -33153 -26765 -381455 -986 16303 -23531 78123 -300881 -425414
12468d25414i8218p0824B09905m9297F1266J26786A5614c87324A22609a71920
$$ -425414 -98218 -169042 209905 160608 61266 188052 15614 -387324 122609 -171920
12457A53546R7180i1001k12939O9772F9456L38336a49734d9660I8705B582b39377
$$ 153546 250726 -91001 -303940 -234168 69456 407792 -149734 -49660 98705 2582 -239377
12445a40451B23936b44292a02257c0577j7912B11639n3722c840l74036N5424a44644
$$ -140451 223936 -244292 -102257 -30577 -48489 211639 157917 -3840 -377876 -322452 -144644
12433c7729B0251b98151A20134a0668I6629a44206k7577L7592B37739a48128o4282
$$ -37729 20251 -298151 120134 -10668 96629 -144206 -171783 -134191 237739 -148128 -212410
12422b12410C29740A11729i6656J6299H04J45931l7126J26287a8022j22599G8451
$$ -212410 329740 111729 -96656 -80357 804 146735 109609 235896 -18022 -140621 78451
12410A9022F45c4009A43797f2393j41963h5380A19337K7013p1107D706a58048
$$ 19022 645 -34009 143797 -62393 -204356 -85380 119337 146350 75243 4706 -158048
12398g964n11256I9242D8412b01077d2730E975c8276e92p1275q388j47272n6164
$$ -7964 -519220 99242 48412 -201077 -42730 5975 -38276 -592 -71867 -80255 -227527 -283691
12386b83691C9805M6661c9409k49972D27504a74785A75830L2346h3802B07567
$$ -283691 39805 86466 -39409 -289381 427504 -174785 175830 208176 -83802 207567
12375B53032A19243a07292A31544A8639A852c7846j4744l2150A56390h670k60823
$$ 253032 119243 -107292 131544 18639 1852 -37846 -52590 -84740 156390 -8670 -269493
12364b69493b572G9418j6745J4582Q7447L2145a9101D214a68005D2903K12425
$$ -269493 -2572 79418 62673 77255 164702 196847 -19101 4214 -168005 42903 255328
12353B55328E0336h2971D01735b03472o9522g2449B5781A2481a7856A68485b6575
$$ 255328 50336 -82971 401735 -203472 -272994 -72449 25781 12481 -17856 168485 -26575
12341c04757I520K43326A02331f612B50373d505k58212A80752a1713G6526J66307
$$ -304757 9520 252846 102331 -6612 250373 -4505 -262717 180752 -11713 76526 242833
12330B42833l0602G6968a73825g8948j4734p2702j58982J39388a216A26221P1771
$$ 242833 212231 76968 -173825 -78948 -93682 -166384 -325366 -185978 -1216 126221 197992
12319A97992a99008E1385h8602B8068N3511k5174J18285q0766A6137J0781K32862
$$ 197992 -199008 51385 -88602 28068 81579 56405 174690 93924 16137 26918 259780
12308B59780a9806C51836J3618A35307L6574b34755N0638E3016J11221d0405C8455
$$ 259780 -19806 351836 365454 135307 171881 -234755 -184117 53016 164237 -40405 38455
12296B64754r8248b6443B30653e9392I8335n556c6733C36217p3977b24959f8410
$$ 264754 166506 -26443 230653 -59392 98335 92779 -36733 336217 262240 -224959 -68410
12284I7972l5190e1704A74172K03897H8906b66900D31933c0535C62113o8591a58216
$$ 97972 62782 -51704 174172 378069 88906 -266900 431933 -30535 362113 293522 -158216
12272E8657g8108B51107B628d8895A22660L59246k17509C8601M0664g723B881
$$ 58657 -78108 251107 2628 -48895 122660 481906 264397 38601 79265 -7723 2881
12260a84903p8871C4275M8625J71347a75534D1942J98169b3001A36926L50376
$$ -184903 -263774 34275 82900 254247 -175534 41942 240111 -23001 136926 487302
12250D87302m06A69398J5656a52575A82625I020a83911B8834c246C30238G2232
$$ 487302 486896 169398 185054 -152575 182625 9020 -183911 28834 -3246 330238 72232
12238B92639o1443d4459r078G7951L27543D5067L19923q3936Q8208Q829j76360
$$ 292639 231196 -44459 -53537 77951 405494 45067 364990 281054 369262 378091 201731
12227B01731m7685a21034A44194J60737j27142E7729M9109R1058M1646a06705
$$ 201731 154046 -121034 144194 304931 177789 57729 106838 197896 239542 -106705
12216A38453J14574A9081K36796j5155a6061A11363B6148L84819A86513F8575
$$ 138453 253027 19081 255877 240722 -16061 111363 26148 410967 186513 68575
12205A48197M3932q8018C5243J42264Q1888Q3628b12488A78732F7962a9514A18907
$$ 148197 192129 104111 35243 177507 259395 343023 -212488 178732 67962 -19514 118907
12193c0477B52222M4373j47711E7903K58441b15692B02803D9928g3675C9948A3913
$$ -30477 252222 296595 148884 57903 316344 -215692 202803 49928 -73675 39948 13913
12181G9070J3183K0865E0684J53702a16309B57635j21281j507b2433H1822J03192
$$ 79070 92253 113118 50684 204386 -116309 257635 136354 134847 -22433 81822 185014
12170A85014b9205H4204C8515a42461J5523b7928A3150K70158J26857A94140h9667
$$ 185014 -29205 84204 38515 -142461 -126938 -27928 13150 283308 410165 194140 -89667
12158C26790j16979A03639k2090a91089B67600o6060p0347d559C44088A20132
$$ 326790 209811 103639 81549 -191089 267600 201540 131193 -4559 344088 120132
12147F4863L24066J7339A03345P252J60642b66698A03623O4586m2896m3999L2010
$$ 64863 388929 406268 103345 110597 271239 -266698 103623 168209 125313 81314 113324
12136A13324g6506H5365K20386j3809d42563B13031H4803a61663B0009L79536
$$ 113324 -76506 85365 305751 291942 -442563 213031 84803 -161663 20009 399545
12126C99545a59365A49043D2206g993A15561D2520b4699A76476L5820m2970F9923
$$ 399545 -159365 149043 42206 -7993 115561 42520 -24699 176476 212296 169326 69923
12114C19463c3710j9245j06525J6795l1441A98064J13423e8783E52055B11276
$$ 319463 -33710 -52955 -159480 -142685 -174126 198064 311487 -58783 552055 211276
12103C87996h4062B98067C2853d675D39794o5283j05517A0219a7435A44225J69943
$$ 387996 -84062 298067 32853 -4675 439794 374511 268994 10219 -17435 144225 314168
12092C14168a66892I7516b03582h2679C27332b36598i2101n3206C50432C8547
$$ 314168 -166892 97516 -203582 -82679 327332 -236598 -92101 -145307 350432 38547
12081A94848C1313J52647A1700M9355J31764l9492G1450j4627a6504A43235g9420
$$ 194848 31313 183960 11700 61055 192819 153327 71450 56823 -16504 143235 -79420
12069B85066g9104I8485b31730M1988P9902a2746n8105C18629h5368p0220B25036
$$ 285066 -79104 98485 -231730 -189742 -109840 -12746 -70851 318629 -85368 -155588 225036
12057g6138B80023m2913r4350n0789J34539J77307j81581A5366a02096A42022
$$ -76138 280023 237110 142760 91971 226510 403817 222236 15366 -102096 142022
12046B27576A2208J64065d3433l3262B36459a14313q5621C84825A80843a06265
$$ 227576 12208 176273 -43433 -76695 236459 -114313 -199934 384825 180843 -106265
12035b28322B68975B1232e4017C16070j36897G3621a08464c2309A61825h4385
$$ -228322 268975 21232 -54017 316070 179173 73621 -108464 -32309 161825 -84385
12024a47285B10546F4062g7738C7240E259a68624H9436J28405F1745H242K08177
$$ -147285 210546 64062 -77738 37240 5259 -168624 89436 217841 61745 8242 216419
12013B16419e4144j14595A33031m8427a15941A11193f0313k77810A38434a29958
$$ 216419 -54144 -168739 133031 84604 -115941 111193 -60313 -338123 138434 -129958
12002B0744K5432J2347a48782G1732Q4060J17317a19887D9761n391A5886P6278
$$ 20744 46176 58523 -148782 71732 155792 273109 -119887 49761 44370 15886 92164
11991I2164a60469p4569A03039K6992a67748f6422C95661b07436C35919q1055
$$ 92164 -160469 -235038 103039 130031 -167748 -66422 395661 -207436 335919 254864
11981B54864e0945K402l87143B53576C2047b05214A0695J07657D94K03417B2875
$$ 254864 -50945 -48543 -435686 253576 32047 -205214 10695 118352 494 203911 22875
11969b10014F9118e0821A33513a44309B55907F4513Q1100a01863B7953J77775
$$ -210014 69118 -50821 133513 -144309 255907 64513 145613 -101863 27953 205728
11959B05728a41779B0731a1179j14309H6156c36725B9303L2139d79A03977a31337
$$ 205728 -141779 20731 -11179 -125488 86156 -336725 29303 61442 -479 103977 -131337
11947C5472a49101q6871b7420B85223e3578F6840L28260e5631j77436i389j03666
$$ 35472 -149101 -235972 -27420 285223 -53578 66840 395100 -55631 -233067 -9389 -113055
11936a13055G1461b12834B11946a53045B92564A41971b0608A52165N8606a21448
$$ -113055 71461 -212834 211946 -153045 292564 141971 -20608 152165 210771 -121448
11925C37520F7297k7184J9710L7705c24145B29766F4917a92044a0197a282C1957
$$ 337520 67297 40113 59823 97528 -324145 229766 64917 -192044 -10197 -1282 31957
11913a98019B30450a1219p9121A12524K34524C6027h3638l28506i6045E7477J85365
$$ -198019 230450 -11219 -90340 112524 347048 36027 -83638 -412144 -96045 57477 242842
11902B42842H7649N9795k8408j4175I67c22830B36184b61574E2429a59062B03330
$$ 242842 87649 147444 119036 104861 967 -322830 236184 -261574 52429 -159062 203330
11890b08069E82d9271H519J73781c94168E8109b11637a00195G6248K76482G5056
$$ -208069 582 -49271 8519 182300 -394168 58109 -211637 -100195 76248 352730 75056
11878H6981M246a04931J4273F2327b86483g4417A08076a89217k47406F3695b51487
$$ 86981 91227 -104931 -90658 62327 -286483 -74417 108076 -189217 -436623 63695 -251487
11866b42137Q6197H7079a74027A94727e4405E919a0626n9523j22654j6863E1669
$$ -242137 -155940 87079 -174027 194727 -54405 5919 -10626 -70149 -192803 -209666 51669
11854a97305A84761H2473N1730K5251L6946b17621A89945M6324d1316j56902j17320
$$ -197305 184761 82473 134203 159454 196400 -217621 189945 236269 -41316 -198218 -315538
11843c15538B10606E4072h4326A57371p2615c31251J56440j38242A3218d02267
$$ -315538 210606 54072 -84326 157371 84756 -331251 -174811 -313053 13218 -402267
11832B8981M1497A6306f47122a67144F4971C1593L1874d8655b3260C09559b11383
$$ 28981 70478 16306 -647122 -167144 64971 31593 63467 -48655 -23260 309559 -211383
11820b3678C5934g9338A68292F8751a49875n4714J3966j04809J13059A27590E9610
$$ -23678 35934 -79338 168292 68751 -149875 -204589 -190623 -295432 -182373 127590 59610
11808b7749A11388J02731F5443a54550A72516b34281c5089m808n4642A96148c44161
$$ -27749 111388 214119 65443 -154550 172516 -234281 -35089 -39897 -94539 196148 -344161
11796b63873f3811G2964a48947N7487a0320o091D1397e5706A39619i7139J3609
$$ -263873 -63811 72964 -148947 -91460 -10320 -16411 41397 -55706 139619 -97139 -83530
11785h3530k4557A09461a29564B6680A655d6273A00996a36361l5955l0891B43927
$$ -83530 -108087 109461 -129564 26680 1655 -46273 100996 -136361 -172316 -203207 243927
11773a48746C2778c15606D0262J38749a39300j13860A25956k857c6365j2690l2900
$$ -148746 32778 -315606 40262 179011 -139300 -253160 125956 123099 -36365 -49055 -81955
11762h1955k46571B15454a78292c1375A9036O9903f4369A52338K2859a72283p782
$$ -81955 -328526 215454 -178292 -31375 19036 88939 -64369 152338 175197 -172283 -180065
11751a80065h2910j9700A3250a04803k05495H6867d086A20536a26713D7866a67102
$$ -180065 -82910 -102610 13250 -104803 -310298 86867 -4086 120536 -126713 47866 -167102
11739B21257K12251D1850j9443b68491J3232d8974m56210B161N0821a66055C0096
$$ 221257 433508 41850 22407 -268491 -255259 -48974 -505184 2161 52982 -166055 30096
11727D1415M1067l8820p425a2070B26388O7235b2435j12565j35561c8473C0148
$$ 41415 82482 43662 36237 -12070 226388 293623 -22435 -135000 -270561 -38473 30148
11715C01621a97390j0823A185c88371J39432b8117o5046o5093p4837e6477E5077
$$ 301621 -197390 -208213 1185 -388371 -248939 -28117 -93163 -158256 -233093 -56477 55077
11703c07988f3522n3755B75390a79516H7801h7893A93341K1313a54617A18000
$$ -307988 -63522 -117277 275390 -179516 87801 -87893 193341 214654 -154617 118000
11692b82923A97845C5903J5684K13049a67781f6997F7220i1956B39391C2083Q149
$$ -282923 197845 35903 51587 264636 -167781 -66997 67220 -91956 239391 32083 40232
11681D0232J42632E1230b26484A15494P9626b25197B71107D4448L85277A84808
$$ 40232 182864 51230 -226484 115494 195120 -225197 271107 44448 429725 184808
11670A53195d16049a0467A20958O3814b0776E3534O7565i2471B8665H569i9730
$$ 153195 -416049 -10467 120958 184772 -20776 53534 121099 -92471 28665 8569 -99730
11658h273A5075J32597o1644Q9684b65485A73364J64220A64104b02365M1129O4356
$$ -8273 15075 147672 86028 175712 -265485 173364 337584 164104 -202365 -161236 -96880
11647i6880I6869K2635a99597j43930G2242b73068A79660F5829R649J72409a8225
$$ -96880 96869 119504 -199597 -343527 72242 -273068 179660 65829 75478 247887 -18225
11635i1725o481K7895j21885B78820C0584b50207F0524a33274K4267j44107D7622
$$ -91725 -98206 -70311 -192196 278820 30584 -250207 60524 -133274 -109007 -253114 47622
11623i7371A18324B771K4350M5282d6561b0759B4550J58038a53674I601K0591
$$ -97371 118324 2771 27121 72403 -46561 -20759 24550 182588 -153674 9601 30192
11612C0192f160j19942j35151C4199a17844A92763e0685C20069A18160b58058
$$ 30192 -6160 -126102 -261253 34199 -117844 192763 -50685 320069 118160 -258058
11601c2281I5045a16533A29509c8932G0056a84991e7039L041B6239J6337J41460
$$ -32281 95045 -116533 129509 -38932 70056 -184991 -57039 -53998 26239 42576 184036
11590A84036j6051J49064a6878G6734J12828Q1933j33012H745J27830a05856B06960
$$ 184036 167985 317049 -16878 76734 189562 271495 138483 8745 136575 -105856 206960
11578A89648b0372j2396A38162B991d470A17163c6826l43861A43652c21123A26358
$$ 189648 -20372 -32768 138162 2991 -4470 117163 -36826 -380687 143652 -321123 126358
11566A63211J42314A41744o2104a10584a6874I4291J33050b78303B11624D9335
$$ 163211 305525 141744 79640 -110584 -16874 94291 227341 -278303 211624 49335
11555E30821k50006A5427d2151B29091e5059k735a1265l29111H8357O0421a182
$$ 530821 280815 15427 -42151 229091 -55059 -57794 -11265 -340376 88357 148778 -1182
11543A25244k1825k6023a43652B52849G7728A5890R6372J05449D9766c9843A75848
$$ 125244 103419 77396 -143652 252849 77728 15890 112262 217711 49766 -39843 175848
11531A48998d4729a4924A50291a40666B22308H4632d5288j19618A56978g3052
$$ 148998 -44729 -14924 150291 -140666 222308 84632 -45288 -164906 156978 -73052
11520a29116m9917B89571N6705j29679c8318q8017D6115L51584j90266a591B15391
$$ -129116 -179033 289571 346276 216597 -38318 -126335 46115 397699 207433 -1591 215391
11508F75Q6871a892j16003g385D4490K2399J22637K85807c97630a72575H3734
$$ 675 87546 -1892 -117895 -7385 44490 66889 189526 475333 -397630 -172575 83734
11496D4318N1994i2863K3527j17350D0966J84707a07385A52071i5169b5579A68603
$$ 44318 96312 -92863 -69336 -186686 40966 225673 -107385 152071 -95169 -25579 168603
11484b20147k08608G4507j0643J63781q4434E5912g472A07209K15684h2492D30102
$$ -220147 -428755 74507 63864 227645 143211 55912 -7472 107209 322893 -82492 430102
11472b68698b22B45686r3921J91090n6051a09995B82835J21138b7837k549D64037
$$ -268698 -222 245686 151765 342855 286804 -109995 282835 403973 -27837 -30386 464037
11460C04357a96212a3870j93088B11018e8249A63050J01476J90238e7778k8755
$$ 304357 -196212 -13870 -206958 211018 -58249 163050 264526 454764 -57778 -86533
11450h6533j12414I6553K12953A52868l1562N11066B45061J14039a39328j500
$$ -86533 -198947 96553 309506 152868 121306 632372 245061 359100 -139328 -140828
11440a40828A00846K24150n2624g2334q0382G6053K3665a1385j82614C08769r4161
$$ -140828 100846 324996 272372 -72334 -152716 76053 99718 -11385 -193999 308769 214608
11429B14608i6446j68615C34697b92553A33712a99847G4770B4612i1555a891A93014
$$ 214608 -96446 -265061 334697 -292553 133712 -199847 74770 24612 -91555 -1891 193014
11417b4420B17485q6417p420a10007A84945f374j02255G6190a8818E7901J40202
$$ -24420 217485 131068 123648 -110007 184945 -6374 -108629 76190 -18818 57901 198103
11406A98103a34877A91760a00024D31563a21184A12309J6609M346a89761A02287
$$ 198103 -134877 191760 -100024 431563 -121184 112309 128918 133264 -189761 102287
11395B54661f8371A28551a62499A51958a49244D80013A13425a3496K236j8402
$$ 254661 -68371 128551 -162499 151958 -149244 480013 113425 -13496 -11260 -29662
11385b9662G7313e090G9194K24977k8392b50809d9493A12551b03946E4367b70265
$$ -29662 77313 -5090 79194 304171 275779 -250809 -49493 112551 -203946 54367 -270265
11373H6857a17965A33922C0572a16552A76168K5170F0963b23352C9454b48926
$$ 86857 -117965 133922 30572 -116552 176168 201338 60963 -223352 39454 -248926
11362c6335j0279B97530a31793o9616A10302h0114q5346j04989F8026L8023d8487
$$ -36335 -46614 297530 -131793 -201409 110302 -80114 -165460 -270449 68026 106049 -48487
11350i2255J9556H455c97793a76181O4575j27066A65837a7853C52525a54188G437
$$ -92255 -72699 8455 -397793 -176181 -111606 -238672 165837 -17853 352525 -154188 7437
11338A77688h3386C50463a18478H1115o538a91334g7149k52865A71349O3892i3874
$$ 177688 -83386 350463 -118478 81115 74577 -191334 -77149 -330014 171349 235241 -93874
11326B34748d3686A41944b711A17018a1175j57075j83321B07207e4644o2152A56448
$$ 234748 -43686 141944 -2711 117018 -11175 -168250 -351571 207207 -54644 -116796 156448
11314a53350i701o2209c1824F3903J3109g5916i645K89r2539A48998R571f5102
$$ -153350 -9701 -71910 -31824 63903 77012 -75916 -9645 -9356 -101895 148998 158569 -65102
11301A5138f014E3350M8117d02669A75517C6773a5731C8921i3752F7644B2734
$$ 15138 -6014 53350 101467 -402669 175517 36773 -15731 38921 -93752 67644 22734
11289a62857C4592g6721p1844O9711m0840B8624h4272A8712a21197B65867B521
$$ -162857 34592 -76721 -148565 -78854 -119694 28624 -84272 18712 -121197 265867 2521
11277I461c10390H535J542d65433e064A06473J30714a28734B38280a65412B1237
$$ 9461 -310390 8535 10077 -465433 -5064 106473 237187 -128734 238280 -165412 21237
11265b01072d3657C46958b51793f835A75159m059p580f1241E2110b51762j26511
$$ -201072 -43657 346958 -251793 -6835 175159 171100 163520 -61241 52110 -251762 -378273
11254c78273e8245j56235F5418h5709c8062k73262d1795G5510b16380C31300A55125
$$ -378273 -58245 -214480 65418 -85709 -38062 -311324 -41795 75510 -216380 331300 155125
11242b52820a23008r9025f3966q7151A07758J25941b385q0860q7103a3659r4337
$$ -252820 -123008 -222033 -63966 -151117 107758 233699 -2385 -83245 -170348 -13659 -107996
11231a07996B4098b89049D2989c53936a04711c6789j97317A62594d29610H4715
$$ -107996 24098 -289049 42989 -353936 -104711 -36789 -234106 162594 -429610 84715
11220c07378f9183r6603D5922b01513A9057J90935c32297N4538H0065B9613c046
$$ -307378 -69183 -165786 45922 -201513 19057 209992 -332297 -277759 80065 29613 -3046
11208A72217a18413N7323p371o3914N4037p8543N786k5753l520k83034B19944
$$ 172217 -118413 -61090 -68461 -132375 -78338 -156881 -151095 -176848 -180368 -463402 219944
11196A16681g5374E1061c2671j13859k19743D75728c19316M9171b7003p7616l02076
$$ 116681 -75374 51061 -32671 -146530 -366273 475728 -319316 -270145 -27003 -104619 -406695
11185d06695f8494B29016b02313A0723b5559C3972c1700C3458a45957O0508o1436
$$ -406695 -68494 229016 -202313 10723 -25559 33972 -31700 33458 -145957 -85449 -146885
11174a46885c3201A34990B4677P5908a8763k36812A13138a12576j65480K3408
$$ -146885 -33201 134990 24677 100585 -18763 -255575 113138 -112576 -278056 -254648
11164b54648B65808d6105o6909j72540A5967J53255J06005e3681B19886a70240
$$ -254648 265808 -46105 -113014 -285554 15967 169222 275227 -53681 219886 -170240
11153b99780J09346m038P6514N0388A2396b5615B2184a34411k12645f3154b3518
$$ -299780 -190434 -194472 -117958 -67570 12396 -25615 22184 -134411 -347056 -63154 -23518
11141A93790b19975B65552E3920f682j16857H6982R4755a41956p678N7625B11285
$$ 193790 -219975 265552 53920 -6682 -123539 86982 181737 -141956 -149634 -92009 211285
11129a65653A14975C3989b2686j76783D4625a84465A12146K0019L6535o8305A3709
$$ -165653 114975 33989 -22686 -199469 44625 -184465 112146 132165 168700 100395 13709
11117a07723A80334a51422A5122a2242A26233E3528b36393c0480k13773e5589
$$ -107723 180334 -151422 15122 -12242 126233 53528 -236393 -30480 -244253 -55589
11106A68125d541A89671a99604B36982j15238a92063h3237D7238J36203D0129
$$ 168125 -4541 189671 -199604 236982 121744 -192063 -83237 47238 183441 40129
11095H8490O0286a83264A85775g8745B17304f4097j86492B34200G8477J878a38540
$$ 88490 148776 -183264 185775 -78745 217304 -64097 -250589 234200 78477 80355 -138540
11083B68606a9269o8112a3799p9855D9713A8654d1083r647A89014g3469q3490
$$ 268606 -19269 -87381 -13799 -93654 49713 18654 -41083 -50730 189014 -73469 -156959
11072a56959j27696B2665d3964B41945a25000A83511P185p6633J52398q4869J10043
$$ -156959 -284655 22665 -43964 241945 -125000 183511 190696 114063 266461 181592 291635
11061B91635A6049g3595B49138J14874I3074D147J38215C6743M07369A79127p9002
$$ 291635 16049 -73595 249138 364012 93074 4147 142362 36743 444112 179127 100125
11050A00125J47984B1303P3098L05930G910O6109J47667K01047M2028M4396L9334
$$ 100125 248109 21303 94401 400331 7910 74019 221686 422733 464761 509157 548491
11039E48491A63834L04686B23269K24884K9782M04442k11501n5317A05219N01517
$$ 548491 163834 468520 223269 448153 477935 882377 670876 615559 105219 606736
11029F06736j94594J11657p8798k0889R461J46779j94818j21582J68378J05J14795
$$ 606736 412142 523799 445001 424112 433573 580352 385534 263952 432330 432435 547230
11018E47230j75142L66661k78439O2202j27209M65404C79284A69343L22828J16279
$$ 547230 372088 738749 460310 522512 395303 860707 379284 169343 492171 608450
11008F08450O9251j37671j12034Q1732N4869l5944B39152m7870J27810K74693
$$ 608450 677701 540030 427996 509728 564597 528653 239152 191282 319092 593785
10998E93785K21720C01445N8892J72302j20777m2106J19283L4540R0971j56649
$$ 593785 815505 301445 360337 532639 411862 369756 489039 523579 614550 457901
10988D57901n9036J16629j15568A45671L95303r9726K10419J32303k69594k30366
$$ 457901 398865 515494 399926 145671 540974 441248 651667 783970 514376 284010
10978B84010K02159j13606O6471p5526L81157l46602J09192J67074q2911N2651
$$ 284010 486169 372563 439034 363508 744665 398063 507255 674329 591418 644069
10968F44069P8123j72997L50781l40496K74002l442m8024J29933K25805k24549
$$ 644069 722192 549195 899976 559480 833482 830040 782016 911949 1137754 913205
10958I13205P6362L39363J84059K85513n4057l3495j68705L90865R7939k04025
$$ 913205 989567 1328930 1512989 1798502 1744445 1710950 1542245 1933110 2031049 1827024
10948A827024k58926J47438k94112K00788j37919j23344J87130j58209J39276
$$ 1827024 1568098 1715536 1421424 1622212 1484293 1360949 1548079 1389870 1529146
10939A529146J9472M8837J76342j30162k9832m58581M8278p5182m09047k35453
$$ 1529146 1548618 1597455 1773797 1643635 1613803 1155222 1203500 1128318 719271 483818
10929D83818j28393L65901k2841B54503K01920A99469J78201A78893K70233j96451
$$ 483818 355425 721326 698485 254503 456423 199469 377670 178893 449126 252675
10919B52675K15144C1745R9130J69869A50084m8416M1914m92a56606D8935j1873
$$ 252675 467819 31745 130875 300744 150084 101668 143582 143090 -156606 48935 37062
10908C7062J21845o7979c51671h3592D0967i68B4541q244b43823M7049g1285q1107
$$ 37062 158907 90928 -351671 -83592 40967 -968 24541 16297 -243823 -196774 -71285 -152392
10896a52392k89711A35822d7180k03996B94100G513R1734l3195c64560C59265
$$ -152392 -442103 135822 -47180 -251176 294100 7513 99247 66052 -364560 359265
10885C2626J61751g8904J4073E919M880g2298l31094G5491A4676E859R7673N2753
$$ 32626 194377 -78904 -64831 5919 10799 -72298 -403392 75491 14676 5859 103532 156285
10873A56285o7538a22840j31663B67916a09720k00143A04550l1140b3950D5355
$$ 156285 88747 -122840 -254503 267916 -109720 -309863 104550 73410 -23950 45355
10862b03704a1818k83404b1147j99000J08217D91504a18458C4421d7039j46455
$$ -203704 -11818 -295222 -21147 -220147 -111930 491504 -118458 34421 -47039 -193494
10852a93494f843l4956P353C033J11130O1966a64519j85834a01229M9887C8549
$$ -193494 -6843 -41799 -34446 3033 114163 176129 -164519 -350353 -101229 -51342 38549
10840b13026q2519g7812j33823b8940B97161g4497b0914C4223J87361a1615j51467
$$ -213026 -295545 -77812 -211635 -28940 297161 -74497 -20914 34223 221584 -11615 -163082
10829a63082D54a20749e7912a8316j66740j0668Q6385A78488b6670B20264N913
$$ -163082 454 -120749 -57912 -18316 -185056 -195724 -109339 178488 -26670 220264 226177
10818B26177j04690l2872b9065A61726E3826J1596M8027R7143b019A22252J02592
$$ 226177 121487 88615 -29065 161726 53826 65422 113449 210592 -2019 122252 224844
10807B24844a78175g63C03046o1474d04629A65710a47966j40256J02585D2599
$$ 224844 -178175 -763 303046 241572 -404629 165710 -147966 -288222 -185637 42599
10796E827b43777a0929j10025I8196a52143k0661A6271a34589k6044A54927M6562
$$ 5827 -243777 -10929 -120954 98196 -152143 -172804 16271 -134589 -160633 154927 201489
10785B01489b56272C6044N500H779c38169A55746b67503R7201B23271c5845J3941
$$ 201489 -256272 36044 41544 8779 -338169 155746 -267503 -170302 223271 -35845 -21904
10774b1904j29207K8627n1981B07312c607j49780M9317d3445A31706a46702a3277
$$ -21904 -151111 -122484 -174465 207312 -3607 -153387 -104070 -43445 131706 -146702 -13277
10762H9233C8397a33499q7985a9024r5940L3818M124l8587E373O4308C1826a60161
$$ 89233 38397 -133499 -221484 -19024 -114964 -81146 -77022 -115609 5373 69681 31826 -160161
10749a8617j41951H7815a57386G6855a41507O4293j11298Q6948l33973J44083
$$ -18617 -160568 87815 -157386 76855 -141507 -77214 -188512 -101564 -435537 -291454
10739b91454J33282A96210m7651c9743H9971a08326B51815a7604k21817J3099
$$ -291454 -158172 196210 148559 -39743 89971 -108326 251815 -17604 -239421 -226322
10729b26322h7112G3128h4008r4680k85364g5934B93640b39697K5406m928O168
$$ -226322 -87112 73128 -84008 -178688 -464052 -75934 293640 -239697 -214291 -219219 -213051
10718b13051H48L0839f0206j45658f7138k76320C32345A56957B0140a32432q9785
$$ -213051 848 31687 -60206 -205864 -67138 -343458 332345 156957 20140 -132432 -222217
10707b22217L2757E8471A2653a3012j85697C48687A36077a80769h7441A53646
$$ -222217 -189460 58471 12653 -13012 -198709 348687 136077 -180769 -87441 153646
10696g8153m1713A70864a13206l3300a9642k34487B29113E8597P6460A5685P1325
$$ -78153 -119866 170864 -113206 -146506 -19642 -254129 229113 58597 135057 15685 87010
10685H7010a05520j69809A40516e1503K4822A064a44372O9839H7095c7275j34437
$$ 87010 -105520 -275329 140516 -51503 -26681 1064 -144372 -74533 87095 -37275 -171712
10674a71712K4899q8991o5405a02607q5354r3211j49612A9860c8710l5313j27246
$$ -171712 -146813 -235804 -301209 -102607 -187961 -281172 -430784 19860 -38710 -74023 -201269
10663b01269A02434B0938Q3563b25594k142A5012M7390l465d0652a2860q9992
$$ -201269 102434 20938 104501 -225594 -227736 15012 62402 58937 -40652 -12860 -102852
10652a02852j81684e2369l49865a76242o3657a16994o6999E9113K02547e6688
$$ -102852 -284536 -52369 -402234 -176242 -239899 -116994 -183993 59113 261660 -56688
10641c6996j20692A41696J38563b20912C4138M5130H261a00382M556k3458N1124
$$ -36996 -157688 141696 280259 -220912 34138 79268 8261 -100382 -95826 -119284 -68160
10630f8160A60448c15242c9551n353k10726J10684l6721r2956F1512A9347L48150
$$ -68160 160448 -315242 -39551 -44904 -255630 -144946 -181667 -274623 61512 19347 367497
10619C67497b19331j22860a51381K3294k17505d387A09377B1178c26606C10094
$$ 367497 -219331 -342191 -151381 -128087 -345592 -4387 109377 21178 -326606 310094
10608B3990a61145O464o6342A59132a76834A41088J14809a81356p2573a23367
$$ 23990 -161145 -154681 -221023 159132 -176834 141088 255897 -181356 -253929 -123367
10597B10484h170k74886q00a02248A99383c15622C5724K8988g6280H9136b82796
$$ 210484 -8170 -283056 -283856 -102248 199383 -315622 35724 64712 -76280 89136 -282796
10585F7428J07441K1876b25161J0940K193P5160A424P0798M0016f3921l4999j27009
$$ 67428 174869 196745 -225161 -214221 -212028 -136868 1424 72222 112238 -63921 -98920 -225929
10573b25929C17986a70578J0824j57500d021D3640b04837b8713C56138b42790
$$ -225929 317986 -170578 -159754 -317254 -4021 43640 -204837 -28713 356138 -242790
10562i6776m40923a72871C0042g5250b7859A90911i4667j8665j49208B36731a31236
$$ -96776 -537699 -172871 30042 -75250 -27859 190911 -94667 -113332 -262540 236731 -131236
10550a44944a9357A2521J49533F8829m49N7661n5378g4284k6062a1459j2356l19892
$$ -144944 -19357 12521 162054 68829 68380 126041 70663 -74284 -100346 -11459 -23815 -343707
10538c43707B09506B0256J108O4913f2566C19076a41822p0203B29538E6090e670
$$ -343707 209506 20256 21364 86277 -62566 319076 -141822 -212025 229538 56090 -5670
10526c73709c3692A68173a97659L1484M0509n3908A02935D2340K37684c292j29192
$$ -373709 -33692 168173 -197659 -166175 -125666 -179574 102935 42340 280024 -3292 -132484
10515a32484L2335F8818b3260k34273j97882a43892A55054d6737k17302J7526
$$ -132484 -100149 68818 -23260 -257533 -455415 -143892 155054 -46737 -264039 -246513
10505b46513a08675g856m2534B0929a04378E493c21768c6325F2297a74613A9470
$$ -246513 -108675 -7856 -50390 20929 -104378 5493 -321768 -36325 62297 -174613 19470
10493A17747E5673a06439I5768a07038k9916j72831D9449b70985Q8200b9481H6175
$$ 117747 55673 -106439 95768 -107038 -136954 -309785 49449 -270985 -182785 -29481 86175
10481d0364A8588M4785i7623j82735N821a8099k1760j14466A10722C8887a36572
$$ -40364 18588 63373 -97623 -280358 -274537 -18099 -39859 -154325 110722 38887 -136572
10469b54845a15963D4663J21500k3075a27417n5099f9686K979A32904R4336L6965
$$ -254845 -115963 44663 166163 143088 -127417 -182516 -69686 -66707 132904 227240 264205
10458B64205j19709E4586K56933A29844d8794p5778E1622a27085A96799a18717
$$ 264205 144496 54586 311519 129844 -48794 -124572 51622 -127085 196799 -118717
10447f3758a7792q4793m1997e5985B03294h1459j34762L5043C1302J44150b28018
$$ -63758 -17792 -102585 -144582 -55985 203294 -81459 -216221 -181178 31302 175452 -228018
10435a73351g1155c4407C61481F9351B544N1078a7205j18509j2974A46260b59672
$$ -173351 -71155 -34407 361481 69351 2544 53622 -17205 -135714 -148688 146260 -259672
10423f8831C24747c30741c9382r0005j36428c0605A7281c4951A22593b12970Q1509
$$ -68831 324747 -330741 -39382 -129387 -265815 -30605 17281 -34951 122593 -212970 -131461
10412a31461R748A60825f9668m1298M3355l21536a28544j7078J3665k35708F7594
$$ -131461 -121713 160825 -69668 -110966 -67611 -389147 -128544 -145622 -131957 -367665 67594
10400G0195c05434f2121i818A20571d247C7753b27579d6616K3199F6844C97b57446
$$ 70195 -305434 -62121 -9818 120571 -4247 37753 -227579 -46616 -23417 66844 397 -257446
10387a36648e2760J5390A35978c13763J10287A55857O4739c00799N6622C818J29171
$$ -136648 -52760 -37370 135978 -313763 -203476 155857 220596 -300799 -244177 3818 132989
10376A32989a91706N7094c7823A06472P6586h6159o3059D0174M7278f1769A30308
$$ 132989 -191706 -134612 -37823 106472 183058 -86159 -149218 40174 87452 -61769 130308
10364e7066A53113a04934E3766O2152d7482C04229H268a27762D7203J68475E0981
$$ -57066 153113 -104934 53766 115918 -47482 304229 8268 -127762 47203 215678 50981
10352C86613r5207c6467f41B53724q063M1162m9773a3666B44639M5463j19839
$$ 386613 291406 -36467 -641 253724 245661 286823 237050 -13666 244639 290102 170263
10341A70263K00604f1583B13941p0183J75942r558A47847K72847B04552P5581
$$ 170263 370867 -61583 213941 143758 319700 310142 147847 420694 204552 280133
10331B80133M48041B55875H6595R6432R3537j3404J25631j52956K2204J076Q5055
$$ 280133 728174 255875 86595 183027 276564 263160 388791 235835 258039 259115 344170
10320C44170j03572M4712j04989K7701p1946d0112A06270a98378E1652b4202f674
$$ 344170 240598 285310 180321 208022 136076 -40112 106270 -198378 51652 -24202 -6674
10308A8341J89014a56295B28881a12768M1696p4763A8732a64117A71379i0757
$$ 18341 207355 -156295 228881 -112768 -71072 -145835 18732 -164117 171379 -90757
10297B28681A14000B6391M125h8209j32070J07356k2933A18376j3490P1254a52970
$$ 228681 114000 26391 30516 -88209 -220279 -112923 -135856 118376 104886 176140 -152970
10285A00115b09267G8051b28597N8647c0584A4140M5387c3882j13345K8198d1247
$$ 100115 -209267 78051 -228597 -169950 -30584 14140 59527 -33882 -147227 -119029 -41247
10273b56000M1858o5587h527A98843k2134J9154e5199q0014o4284K2015I8007
$$ -256000 -214142 -279729 -8527 198843 176709 195863 -55199 -135213 -199497 -177482 98007
10261A94250q6856A1937b59933J07852a7835A21768c00054b8769j4549q03j35227
$$ 194250 107394 11937 -259933 -152081 -17835 121768 -300054 -28769 -43318 -44121 -179348
10250a79348O4781D868j543O8932b80470J24372J9154I2084a86975A80278q6656
$$ -179348 -114567 4868 3325 72257 -280470 -156098 -136944 92084 -186975 180278 93622
10239I3622L02964I0171M3674J12329C8499N43847j09481A99283C0830J9742J40387
$$ 93622 396586 90171 133845 246174 38499 582346 472865 199283 30830 50572 190959
10228A90959D1265R0109A4805Q4864I233c64868A33474d77857C32142b1977m8157
$$ 190959 41265 131374 14805 99669 9233 -364868 133474 -477857 332142 -21977 -70134
10217g0134a7556q3153A70670d7471J2017k3536I4210d8146a190G3526a07427
$$ -70134 -17556 -100709 170670 -47471 -35454 -58990 94210 -48146 -1190 73526 -107427
10205a76367g7066j44356A1275h6376n747o1504j05779A24557b41112J3133p7306
$$ -176367 -77066 -221422 11275 -86376 -92123 -153627 -259406 124557 -241112 -227979 -305285
10194c05285a10968q0848F0371B7500O920f789A6394h6888A09458J60516f2672
$$ -305285 -110968 -191816 60371 27500 34420 -6789 16394 -86888 109458 269974 -62672
10182a52808B68928k9355a61607n3559M2979A7521g0445A1745a43588D2951O2110
$$ -152808 268928 239573 -161607 -215166 -172187 17521 -70445 11745 -143588 42951 105061
10171A05061K22019A19180K0526E8048c35272A03093b69765i971l449o7039j12163
$$ 105061 327080 119180 139706 58048 -335272 103093 -269765 -9971 -13420 -80459 -192622
10160a92622K2722J8192B9310a14437C08724a72749r5791J5773I958f9352k01099
$$ -192622 -169900 -151708 29310 -114437 308724 -172749 -268540 -252767 9958 -69352 -270451
10149b70451O930G7157a41441k1059M581l0616m5376J16454r69k32113b7018k9628
$$ -270451 -263521 77157 -141441 -162500 -157919 -188535 -233911 -117457 -118426 -350539 -27018 -56646
10137e6646j28936J4271A65884a32014I2840a33442H8772b0541j98656F4290a18302
$$ -56646 -185582 -171311 165884 -132014 92840 -133442 88772 -20541 -219197 64290 -118302
10125D7126B0705d083C30682b39865i5480G9419b21515G3951J47831b15074j68112
$$ 47126 20705 -4083 330682 -239865 -95480 79419 -221515 73951 221782 -215074 -383186
10114c83186G5367a85020H8908h1156A79769I470J16386m0120a00915b776I096
$$ -383186 75367 -185020 88908 -81156 179769 9470 125856 85736 -100915 -2776 9096
10102e281j11516H706a47080A69753l9777A2956e61665D3818a10270B13051f189
$$ -5281 -116797 8706 -147080 169753 129976 12956 -561665 43818 -110270 213051 -6189
10090a29973O0663j310e072k08257I0377h208p7694A20007i1384K79l16550E783
$$ -129973 -69310 -70620 -5072 -213329 90377 -8208 -85902 120007 -91384 -91105 -407655 5783
10077h2743j0064o4270r361H7145J45012j04831K23865a59924e2655m3715B79758
$$ -82743 -92807 -157077 -166438 87145 232157 127326 351191 -159924 -52655 -96370 279758
10065a12808r367p9430A6654a40610A98562b23439A17880E330i6239j99867J42354
$$ -112808 -122175 -201605 16654 -140610 198562 -223439 117880 5330 -96239 -296106 -153752
10054a53752c7750k6600b48m9634l30333K475B35718a29142m1185n3497J09242
$$ -153752 -37750 -64350 -248 -49882 -380215 -377740 235718 -129142 -170327 -223824 -114582
10043a14582D6402a26223m1188O02e620p7977B8689a95131O0840A41287a93417
$$ -114582 46402 -126223 -167411 -166809 -5620 -83597 28689 -195131 -134291 141287 -193417
10031A6354d0280k8690a0147F2126Q2122a40164b010B6517J02913a0845B8864
$$ 16354 -40280 -68970 -10147 62126 144248 -140164 -2010 26517 129430 -10845 28864
10019b33428A09008k3299a99521k27612K10048I618d12336e6620b5527J0318A09067
$$ -233428 109008 85709 -199521 -427133 -217085 9618 -412336 -56620 -25527 -15209 109067
10007a84027R617G058a58256K8380m48421g7590m1032d0770A8453J17266d44481
$$ -184027 -174410 7058 -158256 -129876 -578297 -77590 -118622 -40770 18453 135719 -444481
9995A20510a71798B4893J11554e890j15607G2138P5441M9897b42597N7395c8052
$$ 120510 -171798 24893 136447 -5890 -121497 72138 147579 197476 -242597 -185202 -38052
9983B104a4079j04131N8812k41327a25282A45153g8613a3479j21802f4930d788
$$ 2104 -14079 -118210 -59398 -300725 -125282 145153 -78613 -13479 -135281 -64930 -4788
9971b55236B47833e1680k05861r3392i794m7370B09818a38292A25595a05460j98364
$$ -255236 247833 -51680 -257541 -350933 -9794 -57164 209818 -138292 125595 -105460 -303824
9960c03824a47040A84647b12795a05843k60220J22247Q0379k298M2718L6034c0346
$$ -303824 -147040 184647 -212795 -105843 -366063 -243816 -163437 -165735 -123017 -86983 -30346
9948a7892r4988G5543b5456l24944A40846K32595a55933f4752F6370i5030c4890
$$ -17892 -112880 75543 -25456 -350400 140846 373441 -155933 -64752 66370 -95030 -34890
9936A3259N4761c62804J66924M7473E3902Q7381a50197n1030A70565D0300J99374
$$ 13259 68020 -362804 -195880 -148407 53902 141283 -150197 -201227 170565 40300 239674
9925B39674c81565f2343q5600J9060N7408A50636c42415a27399N6489j211r2107
$$ 239674 -381565 -62343 -147943 -128883 -71475 150636 -342415 -127399 -70910 -72121 -164228
9914a64228B6774a03367A2504b6752l36921B27427r7647o0674a09393A42825A2450
$$ -164228 26774 -103367 12504 -26752 -363673 227427 129780 69106 -109393 142825 12450
9902b72921a25182G3761J00270b28769D6858K8696B3988b47471N9228G1897K0095
$$ -272921 -125182 73761 174031 -228769 46858 75554 23988 -247471 -188243 71897 91992
9891I1992c32280a03170j86632i1046k2380A19329a19822A41379Q803b06734d1
$$ 91992 -332280 -103170 -289802 -91046 -113426 119329 -119822 141379 150182 -206734 -41
9879b5471k47348e1762A6024L7827O6662l443M4803a70727K7100a9156R299F8464
$$ -25471 -272819 -51762 16024 53851 120513 117070 161873 -170727 -143627 -19156 -9857 68464
9866d17306f9701k28264L0203e3362m11397D7364c7420A60387e34407f639j20268
$$ -417306 -69701 -297965 -267762 -53362 -464759 47364 -37420 160387 -534407 -6639 -126907
9855a26907N6922m2408L5017A03341b47996o1276A96697d1792B0051a954C00004
$$ -126907 -69985 -112393 -77376 103341 -247996 -309272 196697 -41792 20051 -1954 300004
9843a05292A48654a18071K3861j36749a5453l32429J41246j49140e413m23136
$$ -105292 148654 -118071 -94210 -230959 -15453 -347882 -206636 -355776 -5413 -428549
9833d28549b03032b7793A92256B2317a55912A23359a20943J5394k4751B36965
$$ -428549 -203032 -27793 192256 22317 -155912 123359 -120943 -105549 -130300 236965
9822b08625B130b10311G4071a86995k0255A45530a17291n1381b8728m1542l68001
$$ -208625 2130 -210311 74071 -186995 -207250 145530 -117291 -168672 -28728 -70270 -438271
9811d38271P8970e2630i646B3110a64338H1050C270d8389D51a27585n7155c0222
$$ -438271 -359301 -52630 -9646 23110 -164338 81050 3270 -48389 451 -127585 -184740 -30222
9798b2397d342G6383a23796B98212A15413h3406A33529b05240e4498B6367O1081
$$ -22397 -4342 76383 -123796 298212 115413 -83406 133529 -205240 -54498 26367 87448
9787H7448a60690l22507a10508N1504A46621J2099e27279B0180a94311J1751k4850
$$ 87448 -160690 -483197 -110508 -59004 146621 158720 -527279 20180 -194311 -182560 -207410
9776b07410d2684r8142a8074E1824c6836J681E6911b80018K0652b4958j9783F3728
$$ -207410 -42684 -140826 -18074 51824 -36836 -35155 56911 -280018 -259366 -24958 -44741 63728
9763B05731b6862j08469A57349C3949a32283F5987d6888I1477f5954A33354a83474
$$ 205731 -26862 -135331 157349 33949 -132283 65987 -46888 91477 -65954 133354 -183474
9751B4259J5562J4379d45096a91432j1787E3173j1084b91951L5820N0615i3239
$$ 24259 39821 54200 -445096 -191432 -203219 53173 42089 -291951 -256131 -205516 -93239
9739B86469e8145j29070C66347B9536a08585a2301A4999b0022l06212a26296j14798
$$ 286469 -58145 -187215 366347 29536 -108585 -12301 14999 -20022 -326234 -126296 -241094
9728b41094c0469j13762N3504q2911f4950l7911A30107b18325A93570a66186A49768
$$ -241094 -30469 -144231 -90727 -173638 -64950 -102861 130107 -218325 193570 -166186 149768
9716a7926H147J90501B6820a1860D0535c53354a51676a5885F3809P2253o7720
$$ -17926 8147 198648 26820 -11860 40535 -353354 -151676 -15885 63809 136062 68342
9705F8342A1195O5485Q300i8328J7966I802a08889e1411j70756P2731A25176b08990
$$ 68342 11195 76680 84980 -98328 -80362 9802 -108889 -51411 -222167 -149436 125176 -208990
9692E9626a01331L781o53B64227a84966g6580o8873A32747i3112L5105A97831
$$ 59626 -101331 -97550 -98203 264227 -184966 -76580 -145453 132747 -93112 -58007 197831
9680C36510c0884A23641b86204f7717n2960K9809D5968j3251a26340p1370j06159
$$ 336510 -30884 123641 -286204 -67717 -120677 -90868 45968 32717 -126340 -197710 -303869
9669c03869j52626J24984G771J40611o3229c48662k42527a7075D25808A7489K1804
$$ -303869 -456495 -331511 7771 148382 85153 -348662 -591189 -17075 425808 17489 39293
9658C9293A0461J3834J02130i5059j00046K5994H939b19182A05732c5643f333
$$ 39293 10461 24295 126425 -95059 -195105 -169111 8939 -219182 105732 -35643 -6333
9646a16745A03784D8212L09411A21064b50034H16K22855B0407G464Q2885l7144
$$ -116745 103784 48212 357623 121064 -250034 816 223671 20407 7464 90349 53205
9635E3205a19323A75795a36859m9180j02126a01173A94398a72607P3799M2212
$$ 53205 -119323 175795 -136859 -186039 -288165 -101173 194398 -172607 -98808 -56596
9625e6596a7124l36569I7669d21418f660m8514j65201j84578a48100A4153b90317
$$ -56596 -17124 -353693 97669 -421418 -6660 -55174 -220375 -404953 -148100 14153 -290317
9613C0001e6512I642L49551b40249i9213o1920M5942B46145a28642j22798a1368
$$ 30001 -56512 9642 359193 -240249 -99213 -161133 -115191 246145 -128642 -251440 -11368
9601A99589d7035k09001a7793C4069a82992A86329a81679j50642G3763P8215a17915
$$ 199589 -47035 -256036 -17793 34069 -182992 186329 -181679 -332321 73763 151978 -117915
9589b18245r9424d6353e303l32004a0900B87253D0904Q784b2095r4252B24899
$$ -218245 -317669 -46353 -5303 -337307 -10900 287253 40904 49688 -22095 -116347 224899
9577A33246E5190O7009e037B2812C081h5877k40912A9321e831r3859k78456D0749
$$ 133246 55190 122199 -5037 22812 3081 -85877 -326789 19321 -5831 -99690 -378146 40749
9564H394L9123a39967j3940O118j22394a04916k970a6102q1475j01447k5776J12188
$$ 8394 47517 -139967 -153907 -147789 -270183 -104916 -107886 -16102 -97577 -199024 -224800 -112612
9552a12612m3057I544a96279A32371C0354e14234I9603f3212k09755A59875d8042
$$ -112612 -155669 9544 -196279 132371 30354 -514234 99603 -63212 -272967 159875 -48042
9540a42919k08507J47877H2889j4234j4525f4000E374a23627E9160a89048l2033
$$ -142919 -351426 -203549 82889 68655 54130 -64000 5374 -123627 59160 -189048 -221081
9529b21081l21807J74878B23261b26341n0553K816C8635d14220e1988A12259c01958
$$ -221081 -542888 -368010 223261 -226341 -276894 -274078 38635 -414220 -51988 112259 -301958
9517A5501R5505a97715G6553C2752c89125B53942A7J27810h4368I1764b22025
$$ 15501 111006 -197715 76553 32752 -389125 253942 17 127827 -84368 91764 -222025
9505b75393J15476G733f1866k6805O011q5037B3852b77945g9392J8258I3463b23450
$$ -275393 -159917 7733 -61866 -88671 -82660 -167697 23852 -277945 -79392 -61134 93463 -223450
9492h9411A86376h0275F07K8347Q4793h5792r6756N9519B33058c50517b2484p0740
$$ -89411 186376 -80275 607 28954 113747 -85792 -182548 -123029 233058 -350517 -22484 -93224
9480i3224H166a53619j33479d2857C7534i2942A62859d4684k55407a4836l2763
$$ -93224 8166 -153619 -287098 -42857 37534 -92942 162859 -44684 -300091 -14836 -47599
9469d7599o2254k5696N2469F3901a59069j62580A17973d3479B86762a27354k38750
$$ -47599 -109853 -135549 -83080 63901 -159069 -321649 117973 -43479 286762 -127354 -366104
9458c66104o456a14485m2466N2748l21864b0204A51763a75905A03236D679i2599
$$ -366104 -372560 -114485 -156951 -104203 -426067 -20204 151763 -175905 103236 4679 -92599
9446c9583k00407B22105a3335k1094C64736a663l4761r321J1772A75016n9814
$$ -39583 -239990 222105 -13335 -34429 364736 -1663 -36424 -45745 -33973 175016 115202
9435A15202f4096a0557n0427j00383K7721l48191a39564a0781C23727B9454g7060
$$ 115202 -64096 -10557 -60984 -161367 -133646 -481837 -139564 -10781 323727 29454 -77060
9423b03155D48313a63153A50758g6327A14022g89G1397f6777H5640d13039a11843
$$ -203155 448313 -163153 150758 -76327 114022 -789 71397 -66777 85640 -413039 -111843
9411c8422A473b30595J01591p7632d4864j76671A54657K2471a15301M1967p7182
$$ -38422 1473 -230595 -129004 -206636 -44864 -221535 154657 177128 -115301 -73334 -150516
9400a50516A93215a05583G5460a45767H9937J56095c6338B56043g9746A75495
$$ -150516 193215 -105583 75460 -145767 89937 246032 -36338 256043 -79746 175495
9389c50771a51669j42104h6351b4330j15507L7581C4950a04716j88349B82617
$$ -350771 -151669 -293773 -86351 -24330 -139837 -102256 34950 -104716 -293065 282617
9378E3715J7555M4229a4902j29699A0618f1965R205k27661J25718l016o3275Q4198
$$ 53715 71270 115499 -14902 -144601 10618 -61965 -52760 -280421 -154703 -157719 -220994 -136796
9366a36796k6730d6108A29103a02229a9879j76387j31046A25451M5010E3867K84680
$$ -136796 -163526 -46108 129103 -102229 -19879 -196266 -327312 125451 170461 53867 338547
9355C38547A68047E3745g535C07651G5828a85374g2940j77032J18418k816O6033
$$ 338547 168047 53745 -7535 307651 75828 -185374 -72940 -249972 -131554 -134370 -68337
9344f8337A52375G0944a31762b6943k9932A76187e1083C02572m0391c83789h2962
$$ -68337 152375 70944 -131762 -26943 -56875 176187 -51083 302572 262181 -383789 -82962
9332e1038l6585A40103b85287B5248c27372Q466A57759c25770J54791C15452d5763
$$ -51038 -87623 140103 -285287 25248 -327372 -318906 157759 -325770 -170979 315452 -45763
9320c57437J54406b6736j52413D0323a5483j30646a3998q8204A90582B1881b1940
$$ -357437 -203031 -26736 -179149 40323 -15483 -146129 -13998 -102202 190582 21881 -21940
9308a80879a0114A23578a3246l02018i9411j04469B10160a14286m8935m8675j89099
$$ -180879 -10114 123578 -13246 -315264 -99411 -203880 210160 -114286 -163221 -211896 -400995
9297d00995K00193A00087A3901J98390a78871Q4852k84690G300J79169p7102h982
$$ -400995 -200802 100087 13901 212291 -178871 -94019 -378709 7300 186469 109367 -8982
9285a35006B18790o9367a7327l18631a02062k0872I3366a89120G7680c9441k29331
$$ -135006 218790 149423 -17327 -335958 -102062 -122934 93366 -189120 77680 -39441 -268772
9274b68772j86276A85697a56590J7427j81818R3824a6142j9647l05247g3012r3519
$$ -268772 -455048 185697 -156590 -139163 -320981 -227157 -16142 -35789 -341036 -73012 -166531
9263a66531B40564f9456j98427A57986o4013a13789A38272c66059e5213j81348
$$ -166531 240564 -69456 -267883 157986 93973 -113789 138272 -366059 -55213 -236561
9253b36561j1276o8939a19198B26534F2783a8709q5883j82554c0697j35876P9678
$$ -236561 -247837 -316776 -119198 226534 62783 -18709 -104592 -287146 -30697 -166573 -86895
9242h6895j36500R0781B13155E2328c02562J4958k117J39629A15285J05045C7962
$$ -86895 -223395 -132614 213155 52328 -302562 -287604 -289721 -150092 115285 220330 37962
9230b67704A7376J21537a64028G6854e5029M652k62338O2972J03312H7388a21640
$$ -267704 17376 138913 -164028 76854 -55029 -50377 -312715 -249743 -146431 87388 -121640
9218A07691b38938C0626a09761M3239k25840C9066K32323J32835a07853l538B5346
$$ 107691 -238938 30626 -109761 -66522 -292362 39066 271389 404224 -107853 -111391 25346
9206a54314B5017A458J90942d81476K13367a31417B7713L10415C7439R6074d8010
$$ -154314 25017 1458 192400 -481476 -268109 -131417 27713 338128 37439 133513 -48010
9194B3193c82238a30459c6347j49130O7627A11822B5686b18221C2284a71250J976
$$ 23193 -382238 -130459 -36347 -185477 -117850 111822 25686 -218221 32284 -171250 -169274
9183a69274E2737e0942j24258c182j35793o0056p2825J08251P1923D205L13830
$$ -169274 52737 -50942 -175200 -3182 -138975 -199031 -271856 -163605 -91682 4205 318035
9172C18035e3744C3661L6342D949e4385A63961a22934M9326A6916J49537n6421
$$ 318035 -53744 33661 70003 4949 -54385 163961 -122934 -73608 16916 166453 110032
9161A10032M3987n7964a30893M7958I6288a97579A13520O2834c91889a86519C46844
$$ 110032 154019 96055 -130893 -82935 96288 -197579 113520 176354 -391889 -186519 346844
9149a12700L5470G3272f1053A50718h0079o3304A9015a03590M9268j29419p8078
$$ -112700 -77230 73272 -61053 150718 -80079 -143383 19015 -103590 -54322 -183741 -261819
9138b61819O483f6248C31763j20046e73113B60748e9838l24606I5839j9683k2592
$$ -261819 -255336 -66248 331763 211717 -573113 260748 -59838 -384444 95839 76156 53564
9127E3564a76773n742N1313K6003E204a55490G0909c8131k62938a22175J2973
$$ 53564 -176773 -182515 -131202 -105199 5204 -155490 70909 -38131 -301069 -122175 -109202
9116a09202r8345A09990b67118D7832a46646r4097J04920k2377A38344C8298a57914
$$ -109202 -207547 109990 -267118 47832 -146646 -240743 -135823 -158200 138344 38298 -157914
9104B05211b97672a06514D1366e322m2045n9764I7150a98271I4424a52725J4910
$$ 205211 -297672 -106514 41366 -5322 -47367 -107131 97150 -198271 94424 -152725 -137815
9093a37815A31672a26822q7380R3464N4204q5735j28530D9086A8131b11199F9752
$$ -137815 131672 -126822 -214202 -120738 -66534 -152269 -280799 49086 18131 -211199 69752
9081b50692E26913c9463D08104e0768k56785D1558G038a04427j1836j33811a00522
$$ -250692 526913 -39463 408104 -50768 -307553 41558 7038 -104427 -116263 -250074 -100522
9069e34014a19092C18883d2639A6189c49527J00885D0871b66187B29799K4246
$$ -534014 -119092 318883 -42639 16189 -349527 -248642 40871 -266187 229799 254045
9059B54045b4927j66837f5873b1553j57377A61886G4453b45407K6199G9464a05693
$$ 254045 -24927 -191764 -65873 -21553 -178930 161886 74453 -245407 -219208 79464 -105693
9047b96979F5436g8853k9319d3220j43799M8931g971k37069i7275L5318l20996
$$ -296979 65436 -78853 -108172 -43220 -187019 -138088 -7971 -245040 -97275 -61957 -382953
9036c82953d2835G6721a31256q249B27255c6095A88780b40979j09462A19203f686
$$ -382953 -42835 76721 -131256 -139505 227255 -36095 188780 -240979 -350441 119203 -6686
9024c64677B7846l835a03395l19666a31560k12825a33225J9083E865c73969J40672
$$ -364677 27846 24011 -103395 -423061 -131560 -344385 -133225 -114142 5865 -373969 -233297
9013b33297A4883a77745F0684a35499A3020J04706b09469B04894a42923O0894
$$ -233297 14883 -177745 60684 -135499 13020 117726 -209469 204894 -142923 -82029
9003h2029G021R5225c6468j15876H5373e8512l43057A18162J35458p5675O1609
$$ -82029 7021 102246 -36468 -152344 85373 -58512 -401569 118162 253620 177945 239554
8992B39554B8901Q6654D4278a52593B18927e4033j04071F4112b75930f6454E6022
$$ 239554 28901 115555 44278 -152593 218927 -54033 -158104 64112 -275930 -66454 56022
8980B09592G9693J46422b113B60819i5497L71j00832Q137D1857a70349j50607
$$ 209592 79693 226115 -2113 260819 -95497 -95126 -195958 -187821 41857 -170349 -320956
8969c20956I5330J71385c3266C1692b18590A1086Q2898P8760a65220j43201R8896
$$ -320956 95330 266715 -33266 31692 -218590 11086 93984 172744 -165220 -308421 -209525
8958b09525l008A05338a0563l03147C006M39681d25902F7418J549a6228k57211
$$ -209525 -212533 105338 -10563 -313710 3006 442687 -425902 67418 68967 -16228 -273439
8947b73439c2989j73167e5812a3067k20974L6660N6971L422n1935N1004A30387
$$ -273439 -32989 -206156 -55812 -13067 -234041 -197381 -140410 -136988 -188923 -137919 130387
8935a8017G5932J11039d08466f7345r1246I0953K25702A16693B9087c55792r5475
$$ -18017 75932 186971 -408466 -67345 -158591 90953 316655 116693 29087 -355792 -451267
8924d51267A5411K65414j06930h5998n0939A20672C5167K20141j21106A2461J78895
$$ -451267 15411 280825 173895 -85998 -136937 120672 35167 255308 134202 12461 191356
8913A91356R2063B0788e0059j74231P2121C1012L70362L17650L92606P18031K114596
$$ 191356 283419 20788 -50059 -224290 -152169 31012 401374 719024 1111630 1829661 3944257
8902C944257j231904j106934o59053n8547m42011j02871A53718N4728H599L70920
$$ 3944257 2712353 1605419 946366 887819 445808 342937 153718 208446 8599 379519
8892C79519c0695F051K64872b38770B66015A5153J53560b62908N7168l7801A43441
$$ 379519 -30695 6051 270923 -238770 266015 15153 168713 -262908 -205740 -243541 143441
8880B66327c678j42300B67733c35303a27097a2707j52870J5720r8880J02632b1941
$$ 266327 -3678 -145978 267733 -335303 -127097 -12707 -165577 -149857 -248737 -146105 -21941
8868a10764A29056a3509A45222g2905j852F926R3445D2858R980g2036j1944G1790
$$ -110764 129056 -13509 145222 -72905 -74757 6926 100371 42858 52838 -72036 -83980 71790
8855b0411j60146F8937L22351F3257k6497l326N1477b61389I3202c1272k02525
$$ -20411 -180557 68937 391288 63257 36760 33434 84911 -261389 93202 -31272 -233797
8844b33797D0453a55731G0985J3069b50026C83999C1058f0858A49606K0918a00623
$$ -233797 40453 -155731 70985 84054 -250026 383999 31058 -60858 149606 170524 -100623
8832b00855e0193n6068A27317R9016l3741D8790L1859i9522p1732A52622a79770
$$ -200855 -50193 -106261 127317 226333 192592 48790 80649 -99522 -171254 152622 -179770
$$ [...]
##END NTUPLES=NMR SPECTRUM
##END=
