
##TITLE=AC1143_Valledupar_5874666_tQ3Y5EkvwF
##JCAMPDX= 6.0         $$ Bruker NMR JCAMP-DX V2.0
##DATA TYPE= NMR SPECTRUM
##DATA CLASS= NTUPLES
##ORIGIN= BRUKER
##OWNER= Administrator
$$ 1.72 TOPSPIN		Version 2.1
$$ 2012-03-31 17:07:45.937 -0500  Administrator@TOPSPIN
$$ Compression mode = diff/dup
##.OBSERVE FREQUENCY= 400.13188235
##.OBSERVE NUCLEUS= ^1H
##.ACQUISITION MODE= SIMULTANEOUS (DQD)
##.ACQUISITION SCHEME= undefined
##.AVERAGES= 64
##.DIGITISER RES= 22
##SPECTROMETER/DATA SYSTEM= spect
##.PULSE SEQUENCE= noesygpps1d.comp
##.SOLVENT NAME= COFFEE_meoh
##.SHIFT REFERENCE= INTERNAL, COFFEE_meoh, 1, 14.9684
##AUDIT TRAIL= $$ (NUMBER, WHEN, WHO, WHERE, PROCESS, VERSION, WHAT)
$$ ##TITLE= Audit trail, TOPSPIN		Version 2.1
$$ ##JCAMPDX= 5.01
$$ ##ORIGIN= Bruker BioSpin GmbH
$$ ##OWNER= Administrator
$$ $$ C:\Bruker\TOPSPIN/data/COFFEE/nmr/AC1143_Valledupar_5874666_tQ3Y5EkvwF/12/pdata/1/auditp.txt
$$ ##AUDIT TRAIL=  $$ (NUMBER, WHEN, WHO, WHERE, PROCESS, VERSION, WHAT)
(   1,<2012-03-31 17:07:40.765 -0500>,<Administrator>,<TOPSPIN>,<go>,<TOPSPIN 2.1>,
      <created by zg
	started at 2012-03-31 16:56:08.859 -0500,
	POWCHK enabled, PULCHK disabled,
       configuration hash MD5:
       1A 1E CE 29 27 FD 77 03 67 4E F0 E3 C4 B2 CB 90
       data hash MD5: 64K
       A4 CB 09 8F E0 DE EF C5 2D 2B 9F E8 A6 E1 F9 34>)
(   2,<2012-03-31 17:07:43.750 -0500>,<Administrator>,<TOPSPIN>,<proc1d>,<TOPSPIN 2.1>,
      <Start of raw data processing
       efp LB = 0.3 FT_mod = 6 PKNL = 1 PHC0 = 0 PHC1 = 0 SI = 128K 
       data hash MD5: 128K
       CF 4B 43 4E 59 F3 E1 4C 97 BA BB 79 CB 5D 77 D9>)
(   3,<2012-03-31 17:07:45.078 -0500>,<Administrator>,<TOPSPIN>,<proc1d>,<TOPSPIN 2.1>,
      <pk PHC0 = 34.48608 PHC1 = 0 
       data hash MD5: 128K
       4B B4 89 03 96 47 70 0D AB 92 DA DF 8C E0 A4 A0>)
(   4,<2012-03-31 17:07:45.359 -0500>,<Administrator>,<TOPSPIN>,<proc1d>,<TOPSPIN 2.1>,
      <abs ABSG = 1 
       data hash MD5: 128K
       96 33 C0 6E C9 E1 7E 7A 8A C6 80 AE 0B 0F 41 5A>)
(   5,<2012-03-31 17:07:45.437 -0500>,<Administrator>,<TOPSPIN>,<proc1d>,<TOPSPIN 2.1>,
      <abs ABSG = 2 
       data hash MD5: 128K
       D0 CF A6 12 77 E5 6E DE DD 1F 45 6C E4 7D A4 63>)
(   6,<2012-03-31 17:07:45.515 -0500>,<Administrator>,<TOPSPIN>,<proc1d>,<TOPSPIN 2.1>,
      <abs ABSG = 3 
       data hash MD5: 128K
       39 83 F1 D4 E6 A0 5A 7B D0 BA FF 0E 98 0D F2 51>)
(   7,<2012-03-31 17:07:45.781 -0500>,<Administrator>,<TOPSPIN>,<proc1d>,<TOPSPIN 2.1>,
      <abs ABSG = 4 
       data hash MD5: 128K
       44 11 FB 82 49 F2 CB 8A 12 67 3D D2 E1 B7 13 50>)
(   8,<2012-03-31 17:07:45.828 -0500>,<Administrator>,<TOPSPIN>,<proc1d>,<TOPSPIN 2.1>,
      <abs ABSG = 5 
       data hash MD5: 128K
       E9 3C E8 96 0F 00 77 C8 49 9A F4 90 A3 BB 69 F8>)
$$ ##END=
$$ 
$$ $$ hash MD5
$$ $$ 69 9B 99 DD 4F 8C 97 5F CC 91 3E 8F 0D 23 1D 53
##$RELAX= 
##$RELAX= 
##$RELAX= 
##$RELAX= 
##$RELAX= 
##$RELAX= 
##$RELAX= 
##$RELAX= 
$$ Bruker specific parameters
$$ [...]
##$TP07= 0
##$TPNAME0= <>
##$TPNAME1= <>
##$TPNAME2= <>
##$TPNAME3= <>
##$TPNAME4= <>
##$TPNAME5= <>
##$TPNAME6= <>
##$TPNAME7= <>
##$TPOAL= (0..7)
0.5 0.5 0.5 0.5 0.5 0.5 0.5 0.5
##$TPOFFS= (0..7)
0 0 0 0 0 0 0 0
##$TUNHIN= 0
##$TUNHOUT= 0
##$TUNXOUT= 0
##$USERA1= <user>
##$USERA2= <user>
##$USERA3= <user>
##$USERA4= <user>
##$USERA5= <user>
##$V9= 5
##$VALIST= <valist>
##$VCLIST= <CCCCCCCCCCCCCCC>
##$VD= 0
##$VDLIST= <DDDDDDDDDDDDDDD>
##$VPLIST= <PPPPPPPPPPPPPPP>
##$VTLIST= <TTTTTTTTTTTTTTT>
##$WBST= 2048
##$WBSW= 25
##$XGAIN= (0..3)
0 0 0 0
##$XL= 0
##$YL= 0
##$YMAX_a= 12675843
##$YMIN_a= -6500018
##$ZGOPTNS= <>
##$ZL1= 120
##$ZL2= 120
##$ZL3= 120
##$ZL4= 120
##$ABSF1= 14.9684
##$ABSF2= -5.58413
##$ABSG= 5
##$ABSL= 3
##$ALPHA= 0
##$AQORDER= 0
##$ASSFAC= 0
##$ASSFACI= 0
##$ASSFACX= 0
##$ASSWID= 0
##$AUNMP= <proc_prof1d_extract.lims>
##$AXLEFT= 0
##$AXNAME= <>
##$AXNUC= <1H>
##$AXRIGHT= 0
##$AXTYPE= 0
##$AXUNIT= <>
##$AZFE= 0.1
##$AZFW= 0.1
##$BCFW= 0
##$BC_mod= 0
##$BYTORDP= 0
##$COROFFS= 0
##$CY= 15
##$DATMOD= 1
##$DC= 0
##$DFILT= <>
##$DTYPP= 0
##$F1P= 0
##$F2P= 0
##$FCOR= 0.5
##$FTSIZE= 131072
##$FT_mod= 6
##$GAMMA= 0
##$GB= 0
##$INTBC= 1
##$INTSCL= 1
##$ISEN= 128
##$LB= 0.3
##$LEV0= 0
##$LPBIN= 0
##$MAXI= 10000
##$MC2= 0
##$MEAN= 0
##$ME_mod= 0
##$MI= 0
##$NCOEF= 0
##$NC_proc= -3
##$NLEV= 6
##$NOISF1= 0
##$NOISF2= 0
##$NSP= 0
##$NTH_PI= 0
##$NZP= 0
##$OFFSET= 14.9684
##$PC= 1
##$PHC0= 34.48608
##$PHC1= 0
##$PH_mod= 1
##$PKNL= yes
##$PPARMOD= 0
##$PPDIAG= 0
##$PPIPTYP= 0
##$PPMPNUM= 2147483647
##$PPRESOL= 1
##$PSCAL= 4
##$PSIGN= 0
##$PYNMP= <proc.py>
##$REVERSE= no
##$SF= 400.130004886623
##$SI= 131072
##$SIGF1= 0
##$SIGF2= 0
##$SINO= 400
##$SIOLD= 131072
##$SPECTYP= <>
##$SREGLST= <1H.CDCl3>
##$SSB= 0
##$STSI= 131072
##$STSR= 0
##$SW_p= 8223.68421052632
##$SYMM= 0
##$S_DEV= 0
##$TDeff= 65536
##$TDoff= 0
##$TI= <>
##$TILT= no
##$TM1= 0
##$TM2= 0
##$TOPLEV= 0
##$USERP1= <user>
##$USERP2= <user>
##$USERP3= <user>
##$USERP4= <user>
##$USERP5= <user>
##$WDW= 1
##$XDIM= 131072
##$YMAX_p= 500109755
##$YMIN_p= -566532277
##$CURPLOT= <Network HP LaserJet P1505>
##$CURPRIN= <$Network HP LaserJet P1505>
##$DFORMAT= <normdp>
##$LAYOUT= <+/1D_H.xwp>
##$LFORMAT= <normlp>
##$PFORMAT= <normpl>
##$SURQMSG= 1
$$ End of Bruker specific parameters
$$ ---------------------------------
##NTUPLES= NMR SPECTRUM
##VAR_NAME=  FREQUENCY,     SPECTRUM/REAL,   SPECTRUM/IMAG
##SYMBOL=    X,             R,               I
##VAR_TYPE=  INDEPENDENT,   DEPENDENT,       DEPENDENT
##VAR_FORM=  AFFN,          ASDF,            ASDF
##VAR_DIM=   131072,        131072,          131072
##UNITS=     HZ,            ARBITRARY UNITS, ARBITRARY UNITS
##FACTOR=    0.0627417313425165, 1,          1
##FIRST=     8223.62146879498, 995,          -93446
##LAST=      0,             4178,            -93660
##MIN=       0,             -566532277,      0
##MAX=       8223.62146879498, 500109755,    0
$$ Real data points
##PAGE= N=1
##DATA TABLE= (X++(R..R)), XYDATA
$$ [...]
61766B721975N264O171P717R554J1033J1845J2286J3282J5756J9520K3065K5098
61754B882566K6200K8368L2874L9103M5601N1604N7120O2129O6591P1123P6838
61743C440117Q4170R2365J00424J08144J15851J23789J32397J42693J55339J69461
61733D664750J83412J96780K10751K26313K43278K61482K81677L04386L29027
61724F901856L55343L84720M18629M56537M97313N42222N94428O55068P21865
61715A1527981P92475Q67498R48926J036890J129240J223317J316459J405045
61707B0247831J484100J547294J585919J588036J540117J430496J251937J003188
61699C1678918O91311L33924m2316m08065p38614j017691j237118j394830j493600
$$ plain form
61766 2721975 2727239 2733410 2741127 2750681 2761714 2773559 2785845 2799127 2814883 2834403 2857468 2882566
61754 2882566 2908766 2937134 2970008 3009111 3054712 3106316 3163436 3225565 3292156 3363279 3440117
61743 3440117 3524287 3616652 3717076 3825220 3941071 4064860 4197257 4339950 4495289 4664750
61733 4664750 4848162 5044942 5255693 5482006 5725284 5986766 6268443 6572829 6901856
61724 6901856 7257199 7641919 8060548 8517085 9014398 9556620 10151048 10806116 11527981
61715 11527981 12320456 13187954 14136880 15173770 16303010 17526327 18842786 20247831
61707 20247831 21731931 23279225 24865144 26453180 27993297 29423793 30675730 31678918
61699 31678918 32370229 32704153 32661837 32253772 31515158 30497467 29260349 27865519 26371919
61690B6371919j540740j547088j523924j479380j417825j342849j259695j173830
61682A5086588j088220j003671r21525q44088p72354p05243o41886n83166n30116
61673G996319m82160m38077l97703l61440l28895k99247k72495k49115k28734
61664D938453k10192j92774j76523j61620j48296j37066j28011j19951j11271
61655C552749j01664r2315q4448p8400p3889p0242o6407o1806n7254n4068n2171
61644B760085n0119m7271m4769m3765m3697m3110m1508l9624l8249l7569l7435
61633B292969l7620l7835l7786l7290l6348l5251l4384l3504l1575k8054k4241
61622A919081k2111k1746k1048j8554j5306j3250j2789j2925j2910j2659j2109
$$ plain form
61690 26371919 24831179 23284091 21760167 20280787 18862962 17520113 16260418 15086588
61682 15086588 13998368 12994697 12073172 11229084 10456730 9751487 9109601 8526435 7996319
61673 7996319 7514159 7076082 6678379 6316939 5988044 5688797 5416302 5167187 4938453
61664 4938453 4728261 4535487 4358964 4197344 4049048 3911982 3783971 3664020 3552749
61655 3552749 3451085 3358770 3274322 3195922 3122033 3051791 2985384 2923578 2866324 2812256 2760085
61644 2760085 2709966 2662695 2617926 2574161 2530464 2487354 2445846 2406222 2367973 2330404 2292969
61633 2292969 2255349 2217514 2179728 2142438 2106090 2070839 2036455 2002951 1971376 1943322 1919081
61622 1919081 1896970 1875224 1854176 1835622 1820316 1807066 1794277 1781352 1768442 1755783 1743674
61611A743674j1189j0071q665o548m214l537n663q961j0525r443p313n873n540
61598A646132o098p216q082p959p449p945r497j0591j0362r628r157q423o858
61585A536867n108l991l345k847k927l713m052k918j099r2K22J318L644N893O842
61570A524694O781O746P091P300O783N607M633M781N980P103P282O784O108M874
61556A612547K512l52k330l012l271l763m127m025m021m870o431p886q736r203
61542A553032r847j1020j2506j3477j3044j1121q696o979o251n705m553l141k493
61529A444199k711k456o43J995L926N123O941R767J2330J3862J5377J7915K0907
61516A546532K3443K5781K8229K9884L0322L1414L5218M0734M5124M7752N0436
$$ plain form
61611 1743674 1732485 1722414 1713749 1707201 1702987 1699450 1693787 1684826 1674301 1664858 1657545 1651672 1646132
61598 1646132 1640034 1632818 1624736 1616777 1609328 1601383 1591886 1581295 1570933 1561305 1552148 1543725 1536867
61585 1536867 1531759 1527768 1524423 1521576 1518649 1514936 1510884 1507966 1506867 1506775 1506997 1508315 1511959 1517852 1524694
61570 1524694 1531475 1538221 1545312 1552612 1559395 1565002 1569635 1574416 1580396 1587499 1594781 1601565 1607673 1612547
61556 1612547 1615059 1614707 1612377 1609365 1606094 1602331 1598204 1594179 1590158 1585288 1578857 1570971 1562235 1553032
61542 1553032 1543185 1532165 1519659 1506182 1493138 1482017 1473321 1466342 1460091 1454386 1449833 1446692 1444199
61529 1444199 1441488 1439032 1438389 1440384 1444310 1449433 1456374 1466141 1478471 1492333 1507710 1525625 1546532
61516 1546532 1569975 1595756 1623985 1653869 1684191 1715605 1750823 1791557 1836681 1884433 1934869
61505A934869N3559N4986N3683N1759N1218N0811M8193M3788M0421L9674M0359
61494B463320M0358L8579L5248L1362K7769K4219J9648J3952Q723N435L585J498
61482B713696j575n137q487j1067j2351j2554j3026j4761j6784j7183j5436j2677
61470B572658r873p017m005r98K236O231J0960J6018K1726K8875L7196M5244N2204
61457B771455N8856O6273P4561Q3405R2912J03270J14308J26101J39400J54749
61447C785290J71580J88931K06586K24960K44044K63128K81436K98551L14097
61438E978603L27137L35670L36660L27131L05720K73085K30774J80361J24118
61429H419259O5816R747m1225q6361j25891j59659j86805k06307k17835k22407
$$ plain form
61505 1934869 1988428 2043414 2097097 2148856 2200074 2250885 2299078 2342866 2383287 2422961 2463320
61494 2463320 2503678 2542257 2577505 2608867 2636636 2660855 2680503 2694455 2703178 2708613 2712198 2713696
61482 2713696 2712121 2706984 2698497 2687430 2675079 2662525 2649499 2634738 2617954 2600771 2585335 2572658
61470 2572658 2562785 2555768 2551763 2550765 2553001 2559232 2570192 2586210 2607936 2636811 2674007 2719251 2771455
61457 2771455 2830311 2896584 2971145 3054550 3147462 3250732 3365040 3491141 3630541 3785290
61447 3785290 3956870 4145801 4352387 4577347 4821391 5084519 5365955 5664506 5978603
61438 5978603 6305740 6641410 6978070 7305201 7610921 7884006 8114780 8295141 8419259
61429 8419259 8485075 8494822 8453597 8367236 8241345 8081686 7894881 7688574 7470739 7248332
61419G248332k22107k18682k12327k02217j88203j71609j54270j37261j20599
61410E621057j03756q6308o8503n1355l5716k1098o106R567K4312L6565M6911
61399E365570N7093O7229P5418Q0312Q2728Q4161Q4975Q4918Q4245Q3151Q0957
61388F230757P7269P3387P1012O9911O8483O6480O5301O5285O4645O1833N7485
61377F971848N2992M8538M3667L8634L3826K8797K3088J7239J1765O018n82p055
61365G268775j2301j7190k3240k9594l3594l4627l5112l6966l9023l9105l7007
61354F931016l3930l0262k5596k0476j6403j3999j2341j0489q969r219j1800j5526
61342F722006j8460j9724k0044k0483k1069k1056j9823j6743j0725j245J0364
$$ plain form
61419 7248332 7026225 6807543 6595216 6392999 6204796 6033187 5878917 5741656 5621057
61410 5621057 5517301 5430993 5362490 5311135 5275419 5254321 5248215 5257782 5282094 5318659 5365570
61399 5365570 5422663 5489892 5565310 5645622 5728350 5812511 5897486 5982404 6066649 6149800 6230757
61388 6230757 6308026 6381413 6452425 6522336 6590819 6657299 6722600 6787885 6852530 6914363 6971848
61377 6971848 7024840 7073378 7117045 7155679 7189505 7218302 7241390 7258629 7270394 7276412 7275830 7268775
61365 7268775 7256474 7239284 7216044 7186450 7152856 7118229 7083117 7046151 7007128 6968023 6931016
61354 6931016 6897086 6866824 6841228 6820752 6804349 6790350 6778009 6767520 6758551 6749332 6737532 6722006
61342 6722006 6703546 6683822 6663778 6643295 6622226 6601170 6581347 6564604 6553879 6552634 6562998
61331F562998K2197L4540M9783O9045R0483J11913J33555J56743J81204K05548
61321G618009K29753K54993K80862L04667L24053L38910L49708L54983L51556
61312A0407494L36991L11099K75183K30525J77969J18909N6465m997o1980j13483
61302A1734175j60198k02438k39487k70789k96714l17695l33377l43285l47835
61293I222357l47986l44123l36142l24577l10774k95552k78553k59656k40320
61284F484674k22320k05367j87359j67410j47341j29232j12675r5790p8148o0965
61274E078067m4735k8648j2706J505J3006K2865L2397M1218M8392N4473O0707
61263E266541O6788P0958P2270P1437O9396O6268O1946N6794N1345M5951M0880
$$ plain form
61331 6562998 6585195 6619735 6669518 6738563 6829046 6940959 7074514 7231257 7412461 7618009
61321 7618009 7847762 8102755 8383617 8688284 9012337 9351247 9700955 10055938 10407494
61312 10407494 10744485 11055584 11330767 11561292 11739261 11858170 11914635 11909638 11847658 11734175
61302 11734175 11573977 11371539 11132052 10861263 10564549 10246854 9913477 9570192 9222357
61293 9222357 8874371 8530248 8194106 7869529 7558755 7263203 6984650 6724994 6484674
61284 6484674 6262354 6056987 5869628 5702218 5554877 5425645 5312970 5217180 5139032 5078067
61274 5078067 5033332 5004684 4991978 4993483 5006489 5029354 5061751 5102969 5151361 5205834 5266541
61263 5266541 5333329 5404287 5476557 5547994 5617390 5683658 5745604 5802398 5853743 5899694 5940574
61252E940574L6279L1922K7333K2159J6191R409K296m420j0801j7782k5587l2979
61240E994594l8970m4328n0073n5476n9272o2128o5638o9335p1123p0921p1145
61229E336185p2799p3686p1865o8454o5184o1252n5133m8093m3071m0665l8573
61218D697410l4969l0291k5721k1965j9851k0162k2245k4247k5291k6044k6739
61207D419885k6201k3649k0001j6330j2216o837p33M820R778J5372K2498L1022
61195D397408M0583N1141O2602P4604Q6839R9123J11169J22601J33112J42120
61185E321302J48365J50429J47665J40162J27553J08428Q1513M7462R207k9810
61175F252276o7704j04079j37899j66227j86009j96882k01325k01895j99388j93974
$$ plain form
61252 5940574 5976853 6008775 6036108 6058267 6074458 6083867 6086163 6081743 6070942 6053160 6027573 5994594
61240 5994594 5955624 5911296 5861223 5805747 5746475 5684347 5618709 5549374 5478251 5407330 5336185
61229 5336185 5263386 5189700 5117835 5049381 4984197 4922945 4867812 4819719 4776648 4735983 4697410
61218 4697410 4662441 4632150 4606429 4584464 4564613 4544451 4522206 4497959 4472668 4446624 4419885
61207 4419885 4393684 4370035 4350034 4333704 4321488 4314651 4313918 4318738 4328516 4343888 4366386 4397408
61195 4397408 4437991 4489132 4551734 4626338 4713177 4812300 4923469 5046070 5179182 5321302
61185 5321302 5469667 5620096 5767761 5907923 6035476 6143904 6225417 6272879 6282086 6252276
61175 6252276 6184572 6080493 5942594 5776367 5590358 5393476 5192151 4990256 4790868 4596894
61165D596894j86765j79092j70907j61205j49831j37817j26054j14679j03910
61156C266634r4374q6200p8497p0311o1690n3460m6307m0276l4797k8961k2244
61145B649517j5158q939m335r45K263O076J0651J5362J9015K0695K0588J9446
61133B734236J7434J4278J0587P755O133M352J280k356n259p561j0292j3500j6342
61120B740745j8669k1045k3300k4522k4744k5157k6269k7152k7169k7144k7983
61109B467591k9161k9753l0165l1585l3943l5632l5482l4272l3981l5760l8701
61098B099156m0515l9690l7054l4879l4372l4687l4545l3923l3521l3417l3304
61087A709249l3475l4482l5887l6372l5210l2954l0616k8751k7315k5768k3437
$$ plain form
61165 4596894 4410129 4231037 4060130 3898925 3749094 3611277 3485223 3370544 3266634
61156 3266634 3172260 3086060 3007563 2937252 2875562 2822102 2775795 2735519 2700722 2671761 2649517
61145 2649517 2634359 2625420 2621085 2620140 2622403 2628479 2639130 2654492 2673507 2694202 2714790 2734236
61133 2734236 2751670 2765948 2776535 2784290 2790423 2794775 2796055 2793699 2788440 2780879 2770587 2757087 2740745
61120 2740745 2722076 2701031 2677731 2653209 2628465 2603308 2577039 2549887 2522718 2495574 2467591
61109 2467591 2438430 2408677 2378512 2346927 2312984 2277352 2241870 2207598 2173617 2137857 2099156
61098 2099156 2058641 2018951 1981897 1947018 1912646 1877959 1843414 1809491 1775970 1742553 1709249
61087 1709249 1675774 1641292 1605405 1569033 1533823 1500869 1470253 1441502 1414187 1388419 1364982
61076A364982k0252j7018j4411j1984q954n645l190j924j052J18J593L369N518
61063A291150P441Q172P826P650Q279R005R257R653J0865J2455J3664J4457J4971
61050A424845J4927J4455J4602J5880J7143J7116J6245J5656J4954J2692Q867
61039A587382N325L659L777M590M944M003K002M92N94J241N89j019j501n70n28
61024A614980k769n641p139p833r259j0997j1453j0654j0108j0282j0177r339
61012A509329q535q249q026p541o969o226n066m071m118m748m586l736l993n892
60998A427573p304o264l849k563k784k601q45J552L276M169M579M508M148M364
60984A427959N762P786R388J0292J0950J1644J2284J3032J4381J6462J8853K1219
$$ plain form
61076 1364982 1344730 1327712 1313301 1301317 1292363 1286718 1283528 1281604 1280552 1280670 1282263 1285632 1291150
61063 1291150 1298591 1306763 1314589 1322239 1330518 1339523 1348780 1358433 1369298 1381753 1395417 1409874 1424845
61050 1424845 1439772 1454227 1468829 1484709 1501852 1518968 1535213 1550869 1565823 1578515 1587382
61039 1587382 1592707 1596366 1600143 1604733 1609677 1613680 1615682 1616174 1616768 1618009 1618598 1617579 1616078 1615508 1614980
61024 1614980 1612211 1606570 1599431 1591598 1582339 1571342 1559889 1549235 1539127 1528845 1518668 1509329
61012 1509329 1500794 1492545 1484519 1476978 1470009 1463783 1458717 1454646 1450528 1445780 1441194 1437458 1433465 1427573
60998 1427573 1420269 1414005 1410156 1407593 1404809 1402208 1401363 1402915 1406191 1410360 1414939 1419447 1423595 1427959
60984 1427959 1433721 1441507 1450895 1461187 1472137 1483781 1496065 1509097 1523478 1539940 1558793 1580012
60972A580012K3677K6202K8200K9257L0089L2056L5605L9748M3174M5472M7052
60961A960544M8414M9928N1913N4349N6727N8702O0828O4179O9140P4956Q0499
60950B630179Q5255Q9708R5003J02139J11153J21247J31830J42916J54167J64290
60940C827887J72440J79940J89504K02811K19788K40017K63380K89124L15918
60931E900809L43760L74726M11004M53290N02162N60072O30577P15993Q16539
60922A0708932R30963J057074J193184J341367J509111J705451J935080K196921
60914B2578083K483780K771158K996396L055316K844831K338139J631867R12404
60906D1611974L58515N8345p81J09195K87206M03250L14077p1968p23500j485246
$$ plain form
60972 1580012 1603689 1629891 1658091 1687348 1717437 1749493 1785098 1824846 1868020 1913492 1960544
60961 1960544 2008958 2058886 2110799 2165148 2221875 2280577 2341405 2405584 2474724 2549680 2630179
60950 2630179 2715434 2805142 2900145 3002284 3113437 3234684 3366514 3509430 3663597 3827887
60940 3827887 4000327 4180267 4369771 4572582 4792370 5032387 5295767 5584891 5900809
60931 5900809 6244569 6619295 7030299 7483589 7985751 8545823 9176400 9892393 10708932
60922 10708932 11639895 12696969 13890153 15231520 16740631 18446082 20381162 22578083
60914 22578083 25061863 27833021 30829417 33884733 36729564 39067703 40699570 41611974
60906 41611974 41970489 42028834 42028053 42137248 42424454 42827704 43141781 43069813 42346313 40861067
60896D0861067k163107k625384k842973k859765k741808k547177k319830k091382
60888B0669641j881419j697252j535942j389519j251393j119813r96346q82781
60880I915176p80437o90814o14503n49691m93430m44168m01478l63930l29499
60871E247226k98142k71647k50277k31610k13555j96723j82660j71445j62296
60862C268871j55005j49035j42337j33076j22117j12145j04517r8285r2133q5714
60852B074507p9077p2305o6129o1593n8520n5356n1175m6903m3828m1719l9389
60841A458513l6497l3690l1175k8318k4873k1622j9350j7785j6153j4301j2671
60830A202078j1455j0416r458q695p832o130l540j286o61j337j539j44K045L458
$$ plain form
60896 40861067 38697960 36072576 33229603 30369838 27628030 25080853 22761023 20669641
60888 20669641 18788222 17090970 15555028 14165509 12914116 11794303 10797957 9915176
60880 9915176 9134739 8443925 7829422 7279731 6786301 6342133 5940655 5576725 5247226
60871 5247226 4949084 4677437 4427160 4195550 3981995 3785272 3602612 3431167 3268871
60862 3268871 3113866 2964831 2822494 2689418 2567301 2455156 2350639 2252354 2160221 2074507
60852 2074507 1995430 1923125 1856996 1795403 1736883 1681527 1630352 1583449 1539621 1497902 1458513
60841 1458513 1422016 1388326 1357151 1328833 1303960 1282338 1262988 1245203 1229050 1214749 1202078
60830 1202078 1190623 1180207 1170749 1162054 1154222 1148092 1144552 1143266 1142605 1141268 1139729 1139585 1141630 1145088
60816A145088L720L777M326M964N052M705M306L653K293N81n02p03r71k274m373
60801A173642o107o520n516l949l293m461o467p000n018k098l34L02J292K962
60787A127435M268N045O561R344J2136J3755J4566J5125J4822J2987J0394Q427
60775A254865P649Q096R832J1942J2262J0029P856Q895J2462J4646J3273J0078
60763A381885P757P079P549Q806J0091J0026Q402O945P015P528O527L985J579
60750A475174K14p82k259m298o678r243j1606j3259j4157j4793j5716j7135j8746
60737A346716j9633j8976j7348j6587j7636j9092j8920j7079j5180j3887j2159
60726A160219r346o527m987m342l210j249N92J677K567L944N399N990N805O212
$$ plain form
60816 1145088 1148808 1152585 1156911 1161875 1166927 1171632 1175938 1179591 1181884 1182465 1181963 1181260 1180289 1178015 1173642
60801 1173642 1167535 1161015 1155499 1151550 1148257 1143796 1137329 1130329 1125311 1123213 1122879 1123181 1124473 1127435
60787 1127435 1131703 1136748 1143309 1152653 1164789 1178544 1193110 1208235 1223057 1236044 1246438 1254865
60775 1254865 1262514 1270610 1280442 1292384 1304646 1314675 1322531 1331426 1343888 1358534 1371807 1381885
60763 1381885 1389642 1396721 1404270 1413076 1423167 1433193 1441595 1448540 1455555 1463083 1469610 1473595 1475174
60750 1475174 1475388 1474606 1472347 1468049 1461371 1452128 1440522 1427263 1413106 1398313 1382597 1365462 1346716
60737 1346716 1327083 1308107 1290759 1274172 1256536 1237444 1218524 1201445 1186265 1172378 1160219
60726 1160219 1150873 1144346 1139359 1135017 1131807 1130558 1131150 1132827 1135394 1139338 1144737 1150727 1156532 1162744
60712A162744Q234J1249J3806J5343J6434J7582J8694J9785K1164K2501K2609
60701A350145K0813J7947J5340J3430J2011J1220J1303J1847J2149J2158J2232
60690A500595J2203J1570J0568J0050J0267J0460R839Q268O005L487J392J95n28
60677A594371j733l682n723p299q567r839j1048j2013j2722j3204j3593j4274
60665A480674j5445j6547j6797j6263j5649j4970j3376j0587p643n818n371n686
60653A336522n965n556m351l190l040l472k955j090M47K0j887l655m711n545o105
60638A285467n618l812j270J440M001N822O322N823N242M741L657J905M64o0m62
60623A313662j865m138o132p266q230j0105j3127j6350j8386j8549j7393j6112
$$ plain form
60712 1162744 1170978 1182227 1196033 1211376 1227810 1245392 1264086 1283871 1305035 1327536 1350145
60701 1350145 1370958 1388905 1404245 1417675 1429686 1440906 1452209 1464056 1476205 1488363 1500595
60690 1500595 1512798 1524368 1534936 1544986 1555253 1565713 1575552 1583820 1589825 1593312 1594704 1594899 1594371
60677 1594371 1592638 1588956 1583233 1575934 1567367 1557528 1546480 1534467 1521745 1508541 1494948 1480674
60665 1480674 1465229 1448682 1431885 1415622 1399973 1385003 1371627 1361040 1353397 1347579 1342208 1336522
60653 1336522 1330557 1325001 1320650 1317460 1314420 1310948 1307993 1306903 1307350 1307370 1305483 1301828 1297117 1291572 1285467
60638 1285467 1279849 1276037 1274767 1276207 1280208 1286030 1292352 1298175 1303417 1308158 1311815 1313720 1314184 1314124 1313662
60623 1313662 1311797 1307659 1301527 1294261 1286031 1275926 1262799 1246449 1228063 1209514 1192121 1176009
60611A176009j5421j5159j4796j3966j2526j0611q722p371o279m422j385J591
60599A066942K595J154j171k546k763k876l361l409k175J6K136L500L800K768
60585A064610P61p13l25J200J729O16l85K35J556J809J120J103K327L849N083
60570A084575O500Q228R483R983J0624J2075J3691J4601J5039J5823J7190J8782
60558A236594K0251K1213K1334K1049K1511K3051K4431K4499K3847K3636K3410
60547A484826K1569J7866J3855J0628P518L557r72n204q899j2151j4656j6252
60535A501685j7558j9065j9967j9008j6328j3497j1643j0540r584q615p356n186
60523A343338k359o26j379l517m353k813o67k74k000m367n951o236n240l360j585
$$ plain form
60611 1176009 1160588 1145429 1130633 1116667 1104141 1093530 1084808 1077437 1071158 1066736 1065351 1066942
60599 1066942 1069537 1070691 1069520 1066974 1064211 1061335 1057974 1054565 1052390 1052406 1054542 1058042 1061842 1064610
60585 1064610 1065371 1064658 1064333 1065533 1067262 1067878 1067493 1067728 1069284 1071093 1072213 1073316 1075643 1079492 1084575
60570 1084575 1091075 1099303 1108786 1118769 1129393 1141468 1155159 1169760 1184799 1200622 1217812 1236594
60558 1236594 1256845 1278058 1299392 1320441 1341952 1365003 1389434 1413933 1437780 1461416 1484826
60547 1484826 1506395 1524261 1538116 1548744 1556262 1559819 1558847 1553643 1544744 1532593 1517937 1501685
60535 1501685 1484127 1465062 1445095 1426087 1409759 1396262 1384619 1374079 1364495 1355880 1348524 1343338
60523 1343338 1340979 1340353 1338974 1335457 1331104 1328291 1327624 1327350 1325350 1320983 1315032 1308796 1303556 1300196 1298611
60508A298611r47j435j870j008J435M691P362Q164P050N724O345R358J3009J5190
60494A371679J5341J4515J4307J5886J9230K2851K4926K5394K6214K8939L2685
60483A611967L5452L6880L8628M2167M7266N2707N7394O0514O1418N9818N5702
60472B159913M8932L9402K7621J4618J273j1578k2472k9741l3047l3779l3474
60461B127668l2372k9796k5349j9237j2052m692J927P557J2698J7699K2239K5935
60449B092225K8954L1618L4162L7304M2310M9733N8707O8155P8081Q8867J00104
60438B710220J11417J23976J39609J58344J78105J97145K15534K33901K52079
60429D320330K69852K87970L07304L27520L47541L66967L85449M00069M03952
$$ plain form
60508 1298611 1297664 1296229 1294359 1293351 1294786 1299477 1306839 1315003 1322053 1327777 1334122 1343480 1356489 1371679
60494 1371679 1387020 1401535 1415842 1431728 1450958 1473809 1498735 1524129 1550343 1579282 1611967
60483 1611967 1647419 1684299 1722927 1765094 1812360 1865067 1922461 1982975 2044393 2104211 2159913
60472 2159913 2208845 2248247 2275868 2290486 2291759 2280181 2257709 2227968 2194921 2161142 2127668
60461 2127668 2095296 2065500 2040151 2020914 2008862 2004170 2006097 2013654 2026352 2044051 2066290 2092225
60449 2092225 2121179 2152797 2186959 2224263 2266573 2316306 2375013 2443168 2521249 2610116 2710220
60438 2710220 2821637 2945613 3085222 3243566 3421671 3618816 3834350 4068251 4320330
60429 4320330 4590182 4878152 5185456 5512976 5860517 6227484 6612933 7013002 7416954
60420G416954L88594L48193K82265J94682R1029k2377j37277k42979l29253l90601
60410G599230m27631m44369m45047m33378m13244l88414l61510l34080l07583
60401D043974k83411k61565k40220k17461j93538j70888j51696j35877j21838
60392B267480j08942r8283r0691q4746p7824o8998o0090n3608n0222m8485m6436
60381A479155m3123l8978l5065l1967k9308k6617k4286k2987k2290k0876j8440
60370A165218j6270j5329j4766j3267j1134r797r624r513q564p089n740m562l232
60357A036331j620Q9J400J698J046O92J928M296N864N518M113L066K808L109L889
60342A074227M875N176M357L453L926N745P558Q520Q999R300Q852P211N170M159
$$ plain form
60420 7416954 7805548 8153741 8436006 8630688 8721717 8699340 8562063 8319084 7989831 7599230
60410 7599230 7171599 6727230 6282183 5848805 5435561 5047147 4685637 4351557 4043974
60401 4043974 3760563 3498998 3258778 3041317 2847779 2676891 2525195 2389318 2267480
60392 2267480 2158538 2060255 1969564 1884818 1806994 1737996 1677906 1624298 1574076 1525591 1479155
60381 1479155 1436032 1397054 1361989 1330022 1300714 1274097 1249811 1226824 1204534 1183658 1165218
60370 1165218 1148948 1133619 1118853 1105586 1094452 1084655 1075031 1065518 1056954 1049865 1044125 1039563 1036331
60357 1036331 1034711 1034800 1036200 1037898 1038944 1039636 1041564 1045860 1051724 1057242 1061355 1064421 1067229 1070338 1074227
60342 1074227 1079102 1084278 1088635 1092088 1096014 1101759 1109317 1117837 1126836 1136136 1144988 1152199 1157369 1161528
60328A161528M691N821O051M740K763J763K369L337K896R35q59j129k99L89M54
60313A195450J45l48q34p89p3L12p36k645l460k059P51L467N237N886N641N377
60297A211322O190P966R283R375R391J0724J2840J3969J3559J2812J2905J3838
60285A344174J4994J5711J5170J2887R662P133O029N624N119M497L717K268L40
60272A447325n65O85L156M851N009M578M671N503O701P779Q161P406N580L064
60258A513904M0l367o509q384q551p585o561o124o079n727m824m124m519n637
60244A435953o115n545n176n943o740n811l323j179n47r31j593k367k773j816
60230A386094O00L164M838O041P336P922O791M769L949N044O599P259P709R415
$$ plain form
60328 1161528 1166219 1172040 1178091 1182831 1185594 1187357 1189726 1193063 1195959 1196894 1196035 1194906 1194607 1194996 1195450
60313 1195450 1195595 1195247 1194413 1193624 1193551 1193863 1193127 1190482 1187022 1184963 1185714 1189181 1194418 1200304 1205945 1211322
60297 1211322 1217512 1225478 1234761 1244136 1253527 1264251 1277091 1291060 1304619 1317431 1330336 1344174
60285 1344174 1359168 1374879 1390049 1402936 1412598 1419731 1425760 1431384 1436503 1441000 1444717 1446985 1447325
60272 1447325 1446760 1447445 1450601 1455452 1460461 1465039 1469710 1475213 1481914 1489693 1497854 1505260 1510840 1513904
60258 1513904 1513944 1510577 1504068 1495684 1487133 1479548 1472987 1466863 1460784 1455057 1450233 1446109 1441590 1435953
60244 1435953 1429838 1424293 1419117 1413174 1406434 1400623 1397300 1396121 1395574 1394643 1393050 1390683 1387910 1386094
60230 1386094 1386694 1389858 1394696 1400737 1408073 1415995 1422786 1427555 1431504 1436548 1443147 1450406 1458115 1467530
60216A467530J2005J3159J1521Q904Q717J2210J7076K0067K0367J9770K0094K1423
60204A652843K2952K4547K6879L0413L4739L8954M2516M5764M9428N3650N7795
60193B080480O1561O5685P0917P6760Q2195Q7451R3905J02100J11067J19865J28589
60182C080575J37380J45585J52759J59423J65814J70788J73097J73048J71593
60173D530062J68374J62156J52898J41834J29360J14517R7010P8358O0223M2819
60163E677611K5936J0535k096j2273k1507l0152l6531l8831l7027l2452k6076
60152E477137j7872p550M656J7959L1522M5041N8992P4099R0303J06517J21653
60141F002457J35579J48422J59140J65714J67145J64432J59003J50716J38285
$$ plain form
60216 1467530 1479535 1492694 1504215 1513119 1521836 1534046 1551122 1571189 1591556 1611326 1631420 1652843
60204 1652843 1675795 1700342 1727221 1757634 1792373 1831327 1873843 1919607 1969035 2022685 2080480
60193 2080480 2142041 2207726 2278643 2355403 2437598 2525049 2618954 2721054 2832121 2951986 3080575
60182 3080575 3217955 3363540 3516299 3675722 3841536 4012324 4185421 4358469 4530062
60173 4530062 4698436 4860592 5013490 5155324 5284684 5399201 5496211 5574569 5634792 5677611
60163 5677611 5703547 5714082 5711986 5699713 5678206 5648054 5611523 5572692 5535665 5503213 5477137
60152 5477137 5459265 5451715 5456371 5474330 5505852 5550893 5609885 5683984 5774287 5880804 6002457
60141 6002457 6138036 6286458 6445598 6611312 6778457 6942889 7101892 7252608 7390893
60132G390893J21450J01763Q1020N9685L7235J3504j0845l4809n7419p7628r4337
60121G530512j06743j14560j17779j16375j10434j00583q8024p3955n9000m3378
60111F599681k7350j1067N899K4169M3378O1964P8481R2568J04133J12211J15446
60100G199513J13477J07161R7651Q5888P2738N8843M4440L0047J7055O843l50
60089G833306m739n562j734O160J6182K7782M2653O2137Q5186J09909J35885J63562
60077H470727J92379K21134K49993K80616L14094L49626L85365M19778M52101
60068A1335813M82021N09128N32361N49996N60426N62744N56396N40767N15545
60059A6145197M81159M38423L88061L30916K68057K00137J27218M9909k9644j08419
$$ plain form
60132 7390893 7512343 7614106 7695126 7754811 7792046 7805550 7794705 7759896 7702477 7624849 7530512
60121 7530512 7423769 7309209 7191430 7075055 6964621 6864038 6776014 6702059 6643059 6599681
60111 6599681 6572331 6561264 6567163 6591332 6634710 6696674 6775155 6867723 6971856 7084067 7199513
60100 7199513 7312990 7420151 7517802 7603690 7676428 7735271 7779711 7809758 7826813 7833656 7833306
60089 7833306 7828567 7823005 7821271 7827431 7843613 7871395 7914048 7976185 8061371 8171280 8307165 8470727
60077 8470727 8663106 8884240 9134233 9414849 9728943 10078569 10463934 10883712 11335813
60068 11335813 11817834 12326962 12859323 13409319 13969745 14532489 15088885 15629652 16145197
60059 16145197 16626356 17064779 17452840 17783756 18051813 18251950 18379168 18429077 18399433 18291014
60049A8291014j83774k53533l15490l67851m09885m41303m61249m68752m64063
60040A4925114m48787m24800l93746l57355l17385k74988k30640j84727j38064
60031A2154622r2114m9009j0786K1951M9929P3195Q9923R8174R8047R0887P7192
60020A2602011N6998L2021N439k0860m7133p3539r8662j21245j41966j62161j81517
60009A1849386j98299k11578k22171k31303k39116k44661k46858k45175k39446
60000I770779k29529k15448j97935j78251j57186j34592j10334q5170o0065l4991
59990H367278r145J7723M4750P0589R4163J15026J33365J49233J61502J68313
59980I312797J69077J64880J56181J41488J19831R3294O5034L5635L799k9861
$$ plain form
60049 18291014 18107240 17853707 17538217 17170366 16760481 16319178 15857929 15389177 14925114
60040 14925114 14476327 14051527 13657781 13300426 12983041 12708053 12477413 12292686 12154622
60031 12154622 12062508 12013499 12002713 12024664 12074593 12147788 12237711 12335885 12433932 12524819 12602011
60020 12602011 12659009 12691030 12696469 12675609 12628476 12554937 12456275 12335030 12193064 12030903 11849386
60009 11849386 11651087 11439509 11217338 10986035 10746919 10502258 10255400 10010225 9770779
60000 9770779 9541250 9325802 9127867 8949616 8792430 8657838 8547504 8462334 8402269 8367278
59990 8367278 8358133 8375856 8420606 8491195 8585358 8700384 8833749 8982982 9144484 9312797
59980 9312797 9481874 9646754 9802935 9944423 10064254 10157548 10222582 10258217 10262016 10232155
59970A0232155o2379r1820j18484j42372j62117j77258j88943j97188j99811j95650
59960H696133j86664j75139j60850j42847j22159j00453p7526n2633k7082k838
59950G647942K0759M6180P3779J01046J26006J49205J71802J93445K12690K28261
59940H971115K39301K45241K45795K40473K28313K08831J83018J52648J19087
59931A0833822Q3679M8378J4410j9104n3453q7561j18584j44982j67042j84348
59921A0205215j94946j97593j93059j82575j66688j46354j23477r9357p3945m7467
59911H779754k1361L409K7622N2150P6126R7895J16857J33240J46903J57575J65456
59900I735626J70421J71398J67699J60343J50906J39938J27762J15960J06169
$$ plain form
59970 10232155 10169776 10077956 9959472 9817100 9654983 9477725 9288782 9091594 8891783 8696133
59960 8696133 8509469 8334330 8173480 8030633 7908474 7808021 7730495 7677862 7650780 7647942
59950 7647942 7668701 7714881 7788660 7889706 8015712 8164917 8336719 8530164 8742854 8971115
59940 8971115 9210416 9455657 9701452 9941925 10170238 10379069 10562087 10714735 10833822
59931 10833822 10917501 10965879 10980289 10961185 10907732 10820171 10701587 10556605 10389563 10205215
59921 10205215 10010269 9812676 9619617 9437042 9270354 9124000 9000523 8901166 8827221 8779754
59911 8779754 8758393 8761802 8789424 8841574 8917700 9015595 9132452 9265692 9412595 9570170 9735626
59900 9735626 9906047 10077445 10245144 10405487 10556393 10696331 10824093 10940053 11046222
59891A1046222R7939Q9755Q2173P7974P8936Q4270R2926J05609J23463J46242
59881A2025509J73142K04338K40121K79292L19940L61456M04170M46887M86253
59872A4941108N18955N43328N58161N61019N48729N19060M71224M05220L21776
59863A9388580K23235J14105N27j11000k15008l07932l87657m52313n00088n30605
59853A7221844n45649n47683n38063n17605m88431m53824m16002l75118l30670
59844A3008799k83001k33143j82246j31844q3685l8472M651M6624Q6785J23061
59834A2317529J53423J76706J92379J99931J98171J85264J60177J24181P9765
59825A3787526K8083l1095r6263j62740k25504k82105l31547l71973m01550m20744
$$ plain form
59891 11046222 11144161 11233916 11316089 11394063 11472999 11557269 11650195 11755804 11879267 12025509
59881 12025509 12198651 12402989 12643110 12922402 13242342 13603798 14007968 14454855 14941108
59872 14941108 15460063 16003391 16561552 17122571 17671300 18190360 18661584 19066804 19388580
59863 19388580 19611815 19725920 19726447 19615447 19400439 19092507 18704850 18252537 17752449 17221844
59853 17221844 16676195 16128512 15590449 15072844 14584413 14130589 13714587 13339469 13008799
59844 13008799 12725798 12492655 12310409 12178565 12094880 12056408 12061059 12107683 12194468 12317529
59834 12317529 12470952 12647658 12840037 13039968 13238139 13423403 13583580 13707761 13787526
59825 13787526 13815609 13784514 13688251 13525511 13300007 13017902 12686355 12314382 11912832 11492088
59815A1492088m31511m34786m30708m20766m07252l90578l69520l44512l18459
59806G943996k93579k69472k45177k21197j98268j75883j53497j32040j12910
59797F141973r6452q2559p1692o4077n8765n4701n1980n0872n0372m8992m6460
59786E465051m3461m0235l6611l3030l0330k8794k8359k9412l2378l6812m1875
59775E083754m7226n2539n6697n8788n9431n9677n8882n5319m8814m1098l3229
59764D512054k4549j4791n608J336O517J1569J6987K2289K7863L4982M3842N3000
59752D685491O1194O8709P6224Q3124Q7906R0001R0238Q9464Q7491Q3756P8376
59741E581974P1972O4887N7345N0162M4383M0033L6118L2385L0440L2364L8374
$$ plain form
59815 11492088 11060577 10625791 10195083 9774317 9367065 8976487 8606967 8262455 7943996
59806 7943996 7650417 7380945 7135768 6914571 6716303 6540420 6386923 6254883 6141973
59797 6141973 6045521 5962962 5891270 5827193 5768428 5713727 5661747 5610875 5560503 5511511 5465051
59786 5465051 5421590 5381355 5344744 5311714 5281384 5252590 5224231 5194819 5162441 5125629 5083754
59775 5083754 5036528 4983989 4927292 4868504 4809073 4749396 4690514 4635195 4586381 4545283 4512054
59764 4512054 4487505 4472714 4467106 4468442 4474959 4486528 4503515 4525804 4553667 4588649 4632491 4685491
59752 4685491 4746685 4815394 4891618 4974742 5062648 5152649 5242887 5332351 5419842 5503598 5581974
59741 5581974 5653946 5718833 5776178 5826340 5870723 5910756 5946874 5979259 6009699 6042063 6080437
59730F080437M6554N4949O3561P4195Q8625J06964J27826J49922J73331J98909
59720G165273K26751K55921K85798L16908L50020L84923M20447M54919M85706
59711A0346666N08593N18280N09535M77750M19424L33894K25551J04281j6753
59702A3427221j24793k10970k72131l10018l28458l31164l21652l03679k80246
59693A0944110k52457k20483j85596j50194j15836q2310m8863j5364J7950N0795
59683I941752Q2533J12530J41483J71379K03331K36122K67874K98645L30453L65011
59673A2151113M02413M41931M83196N26360N71839O20115O71323P24680P78693
59664A7371663Q32120Q84451R35266R83413J026972J063712J091331J107648J111156
$$ plain form
59730 6080437 6126991 6181940 6245501 6319696 6408321 6515285 6643111 6793033 6966364 7165273
59720 7165273 7392024 7647945 7933743 8250651 8600671 8985594 9406041 9860960 10346666
59711 10346666 10855259 11373539 11883074 12360824 12780248 13114142 13339693 13443974 13427221
59702 13427221 13302428 13091458 12819327 12509309 12180851 11849687 11528035 11224356 10944110
59693 10944110 10691653 10471170 10285574 10135380 10019544 9937234 9888371 9873007 9890957 9941752
59683 9941752 10024285 10136815 10278298 10449677 10653008 10889130 11157004 11455649 11786102 12151113
59673 12151113 12553526 12995457 13478653 14005013 14576852 15196967 15868290 16592970 17371663
59664 17371663 18203783 19088234 20023500 21006913 22033885 23097597 24188928 25296576 26407732
59655B6407732J101632J080262J049402J012478R73993R38889R11217Q93118Q84802
59646C5253525Q85148Q91934R01662R09803R11564R02480Q78415Q35612P71577
59637D3141720O86304N82625M65277L39582K11041Q5798k9238j27676k05420k61001
59627D4889012k94079l04212k91450k57561k05545j37890n5985L8617J43376K55614
59617D3779897L73563M96034O21467P47480Q70524R85275J084974J162933J213232
59608E1335379J229265J202718J125514R93126Q05760N67508K86355k4678l47996
59599E7172951o64366r55947j208080j410873j560653j659292j711353j722062
59591D6280325j697795j646597j576863j496041j411596j332453j267975j225151
$$ plain form
59655 26407732 27509364 28589626 29639028 30651506 31625499 32564388 33475605 34368723 35253525
59646 35253525 36138673 37030607 37932269 38842072 39753636 40656116 41534531 42370143 43141720
59637 43141720 43828024 44410649 44875926 45215508 45426549 45512347 45483109 45355433 45150013 44889012
59627 44889012 44594933 44290721 43999271 43741710 43536165 43398275 43342290 43380907 43524283 43779897
59617 43779897 44153460 44649494 45270961 46018441 46888965 47874240 48959214 50122147 51335379
59608 51335379 52564644 53767362 54892876 55886002 56691762 57259270 57545625 57520947 57172951
59599 57172951 56508585 55552638 54344558 52933685 51373032 49713740 48002387 46280325
59591 46280325 44582530 42935933 41359070 39863029 38451433 37118980 35851005 34625854
59583C4625854j207008j212629j237099j271437j304297j325469j328665j312103
59575B4427147j277680j229540j172123j108563j040810r70943r01368q33590
59567A5892530p67733p03899o43252n87090n35503m87783m43712m03419l66236
59558A0953903l30947k97378k66681k39567k15307j93250j74460j60582j51494
59549H924237j45277j40612j38020j38342j41028j44670j48439j52133j55331
59540G620385j57444j58380j58206j56203j51357j43987j35875j28155j19856
59531F310922j09359r6890q4513p3720o3933n3651m2343l0567j8892p508L141
59520E732687J2277J9679K6094L2258L7955M2567M6273M9916N3866N7768O1484
$$ plain form
59583 34625854 33418846 32206217 30969118 29697681 28393384 27067915 25739250 24427147
59575 24427147 23149467 21919927 20747804 19639241 18598431 17627488 16726120 15892530
59567 15892530 15124797 14420898 13777646 13190556 12655053 12167270 11723558 11320139 10953903
59558 10953903 10622956 10325578 10058897 9819330 9604023 9410773 9236313 9075731 8924237
59549 8924237 8778960 8638348 8500328 8361986 8220958 8076288 7927849 7775716 7620385
59540 7620385 7462941 7304561 7146355 6990152 6838795 6694808 6558933 6430778 6310922
59531 6310922 6201563 6104673 6020160 5946440 5882507 5828856 5786513 5755946 5737054 5729546 5732687
59520 5732687 5744964 5764643 5790737 5822995 5860950 5903517 5949790 5999706 6053572 6111340 6172824
59509F172824O5522P0258P5581Q1577Q8910R7931J08183J19304J31661J45372
59499G157123J59525J73521J88386K05512K24514K43919K63695K85167L08274
59490I209636L30944L51952L72449L93232M12155M26215M35140M40871M43869
59481A2816463M42105M33942M20140M02314L80896L55545L26495K94455K59950
59472A6132305K23757J87679J53968J24148R8959P9156O5384N7366N4029N4898
59462A7231649O0798P2478Q8793J06812J23799J38339J48955J52253J43709J20789
59452A8388374Q4604L7898j7726q1782j52779k27581l02797l75417m41793m97612
59442A6413389n40058n69281n86821n93301n88770n74656n53757n28113m98034
$$ plain form
59509 6172824 6238346 6308604 6384185 6465762 6554672 6652603 6760786 6880090 7011751 7157123
59499 7157123 7316648 7490169 7678555 7884067 8108581 8352500 8616195 8901362 9209636
59490 9209636 9540580 9892532 10264981 10658213 11070368 11496583 11931723 12372594 12816463
59481 12816463 13258568 13692510 14112650 14514964 14895860 15251405 15577900 15872355 16132305
59472 16132305 16356062 16543741 16697709 16821857 16920816 16999972 17065356 17122722 17176751 17231649
59462 17231649 17292447 17364925 17453718 17560530 17684329 17822668 17971623 18123876 18267585 18388374
59452 18388374 18472978 18510876 18493150 18411368 18258589 18031008 17728211 17352794 16911001 16413389
59442 16413389 15873331 15304050 14717229 14123928 13535158 12960502 12406745 11878632 11380598
59433A1380598m63564m25974l87273l48942l11632k75605k40933k07567j75537
59424H543571j44869j15213q6003n7229k9465k771K3883N1535P9948J07988J35030
59413H506405J61387J87491K13292K38370K62150K83904L02889L18457L29627
59404A0803972L34680L31712L19688K98411K67517K26231J74642J14832N0263
59395A2921948j5898q1676j45789k06700k62262l10022l47981l75370l93047m03073
59385A0380130m07500m07131m01432l89994l74058l56123l37837l18802k97909
59376G089344k75375k52699k30978k10252j90565j72563j56524j41511j26219
59367E332658j10419r4958q0604o7448n5366m4429l4568k5210j5671n957L211
$$ plain form
59433 11380598 10917034 10491060 10103787 9754845 9443213 9167608 8926675 8719108 8543571
59424 8543571 8398702 8283489 8197486 8140257 8110792 8108021 8131904 8183439 8263387 8371375 8506405
59413 8506405 8667792 8855283 9068575 9306945 9569095 9852999 10155888 10474345 10803972
59404 10803972 11138652 11470364 11790052 12088463 12355980 12582211 12756853 12871685 12921948
59395 12921948 12906050 12824374 12678585 12471885 12209623 11899601 11551620 11176250 10783203 10380130
59385 10380130 9972630 9565499 9164067 8774073 8400015 8043892 7706055 7387253 7089344
59376 7089344 6813969 6561270 6330292 6120040 5929475 5756912 5600388 5458877 5332658
59367 5332658 5222239 5127281 5046677 4979229 4923863 4879434 4844866 4819656 4803985 4798028 4801239
59356D801239J1378J9069K7170L5755M4167N2111N9631O5677O7918O5267N9970
59345E309352N6077N6016N9679O6257P5379Q6565R9185J13323J29109J44767J57023
59334F352732J64564J69998J77503J89546K06557K28374K54473K83630L14839
59325H342216L48319L84679M23656M64608N07541N52650N99350O46685O93840
59316A2963544P39187P79642Q12285Q35845Q49392Q50619Q37381Q10453P72841
59307B0251189P26677O72775O13038N50969M89335M29006L70323L13671K58299
59298B4675282K02445J45322Q7240K7346l6614j05276j76151k46229l14085l78259
59288B3881021m35792m84633n26081n62566n94052o18921o37759o53679o68730
$$ plain form
59356 4801239 4812617 4831686 4858856 4894611 4938778 4990889 5050520 5116197 5184115 5249382 5309352
59345 5309352 5365429 5421445 5481124 5547381 5622760 5709325 5808510 5921833 6050942 6195709 6352732
59334 6352732 6517296 6687294 6864797 7054343 7260900 7489274 7743747 8027377 8342216
59325 8342216 8690535 9075214 9498870 9963478 10471019 11023669 11623019 12269704 12963544
59316 12963544 13702731 14482373 15294658 16130503 16979895 17830514 18667895 19478348 20251189
59307 20251189 20977866 21650641 22263679 22814648 23303983 23732989 24103312 24416983 24675282
59298 24675282 24877727 25023049 25110289 25137635 25101021 24995745 24819594 24573365 24259280 23881021
59288 23881021 23445229 22960596 22434515 21871949 21277897 20658976 20021217 19367538 18698808
59279A8698808o81931o91146o95167o93567o86058o72835o54658o32178o05875
59270A2685393n76650n45438n12259m76920m40753m06214l74097l42620l10251
59261H700191k78310k49332k23584j98836j73602j49081j27321j08482r1001p3883
59251G026759n7624m2660k8025j2402L923J9161L2283M4365N7190P1013Q4420
59240G198403R6178J06681J17279J28602J39801J49421J56771J62283J66504J69013
59230H590936J68643J64885J58794J52323J46694J41421J35032J26919J18519
59221I904166J12352J09728J09788J10875J12268J14176J16778J20011J23593
59212A0933735J26156J24809J16998J02696Q3560O0149L1725r38l4487o5762r4126
$$ plain form
59279 18698808 18016877 17325731 16630564 15936997 15250939 14578104 13923446 13291268 12685393
59270 12685393 12108743 11563305 11051046 10574126 10133373 9727159 9353062 9010442 8700191
59261 8700191 8421881 8172549 7948965 7750129 7576527 7427446 7300125 7191643 7100642 7026759
59251 7026759 6969135 6926475 6898450 6886048 6889971 6909132 6941415 6985780 7042970 7113983 7198403
59240 7198403 7294581 7401262 7518541 7647143 7786944 7936365 8093136 8255419 8421923 8590936
59230 8590936 8759579 8924464 9083258 9235581 9382275 9523696 9658728 9785647 9904166
59221 9904166 10016518 10126246 10236034 10346909 10459177 10573353 10690131 10810142 10933735
59212 10933735 11059891 11184700 11301698 11404394 11487954 11548103 11579828 11578890 11544403 11478641 11384515
59201A1384515j19926j41977j58212j68096j72766j73171j69314j61210j49262
59192I970581j33774j15087r4339p3227n2798l2979j3305O395K5908M4579O1398
59181I593352P5625Q7285R6846J04626J10865J15939J20128J23616J27246J32683
59171A0688211J41129J52260J65187J80165J98632K21683K49006K79015L09608
59162A2584896L39063L66529L91161M10539M20838M18980M03618L73489L26542
59153A6035655K62238J83482R4451k493j05489k09660l08010l96265m74050n40411
59143A4539448n91006o22077o35540o37452o31889o18416n95784n65821n32464
59134I108999m98092m62518m25586l89329l56596l28069l01854k76062k50794
$$ plain form
59201 11384515 11264589 11122612 10964400 10796304 10623538 10450367 10281053 10119843 9970581
59192 9970581 9836807 9721720 9627381 9554154 9501356 9468377 9455072 9461467 9487375 9531954 9593352
59181 9593352 9668977 9756262 9853108 9957734 10068599 10184538 10304666 10428282 10555528 10688211
59171 10688211 10829340 10981600 11146787 11326952 11525584 11747267 11996273 12275288 12584896
59162 12584896 12923959 13290488 13681649 14092188 14513026 14932006 15335624 15709113 16035655
59153 16035655 16297893 16481375 16575826 16573333 16467844 16258184 15950174 15553909 15079859 14539448
59143 14539448 13948442 13326365 12690825 12053373 11421484 10803068 10207284 9641463 9108999
59134 9108999 8610907 8148389 7722803 7333474 6976878 6648809 6346955 6070893 5820099
59125E820099k27257k06011j86961j70198j55697j42679j30274j18573j08034
59116D374415r8256q8311p8137o8451n9544n1144m3388l6714l0780k4579j7700
59105C777411j0508l199M230J1248J7248K2767K8868L5328M1022M6268N3030O2035
59093D085748P1293P8569Q3991Q9126R4636J00190J06012J12937J20974J28863
59083E072339J35282J40120J44577J50034J56449J61826J63921J62577J59760
59074F446885J57057J53951J48802J40733J30180J18400J06798R6047Q5466P4067
59064G658386O2465N2927M7135M4787M4798M6858N1353N8617O8943Q2466R8484
59053H317219J15721J33664J52748J72751J92097K09353K24271K36621K45159
$$ plain form
59125 5820099 5592842 5386831 5199870 5029672 4873975 4731296 4601022 4482449 4374415
59116 4374415 4276159 4187848 4109711 4041260 3981716 3930572 3887184 3850470 3819690 3795111 3777411
59105 3777411 3766903 3763704 3767934 3779182 3796430 3819197 3848065 3883393 3924415 3970683 4023713 4085748
59093 4085748 4157041 4235610 4319601 4408727 4503363 4603553 4709565 4822502 4943476 5072339
59083 5072339 5207621 5347741 5492318 5642352 5798801 5960627 6124548 6287125 6446885
59074 6446885 6603942 6757893 6906695 7047428 7177608 7296008 7402806 7498853 7584319 7658386
59064 7658386 7720851 7773778 7820913 7865700 7910498 7957356 8008709 8067326 8136269 8218735 8317219
59053 8317219 8432940 8566604 8719352 8892103 9084200 9293553 9517824 9754445 9999604
59044I999604K48638K46684K38666K22678J96866J61226J17387O7737J5661l4601
59034A1480546p9946j19655j53742j81161k00916k13850k21611k24546k22345
59025I862774k16090k07914j98999j89775j81750j77139j76498j78343j81299
59016H154967j85218j90066j95383k01112k07504k13806k18431k20795k21694
59007F300958k21509k19373k14754k08635k02395j96401j90123j82778j73531
58998D491459j62161j50010j39248j30699j23235j15628j07844j00209r2709q5805
58988C283911q0568p6996p3471o9079o5407o4495o5728o6368o4766o1497n7537
58977B537999n3009m8113m3734m0222l6549l1646k6115k1690j9154j7533j5425
$$ plain form
59044 9999604 10248242 10494926 10733592 10956270 11153136 11314362 11431749 11499486 11515147 11480546
59034 11480546 11400600 11280945 11127203 10946042 10745126 10531276 10309665 10085119 9862774
59025 9862774 9646684 9438770 9239771 9049996 8868246 8691107 8514609 8336266 8154967
59016 8154967 7969749 7779683 7584300 7383188 7175684 6961878 6743447 6522652 6300958
59007 6300958 6079449 5860076 5645322 5436687 5234292 5037891 4847768 4664990 4491459
58998 4491459 4329298 4179288 4040040 3909341 3786106 3670478 3562634 3462425 3369716 3283911
58988 3283911 3203343 3126347 3052876 2983797 2918390 2853895 2788167 2721799 2657033 2595536 2537999
58977 2537999 2484990 2436877 2393143 2352921 2316372 2284726 2258611 2236921 2217767 2200234 2184809
58966B184809j2527r590p309n728m591l823l489l452l229k243k99J962L226K614
58952B136331P64n59j73J541L460N020O360P625Q717R481R707R240Q506Q421R195
58937B223636R708Q900P508P449R504J2479J4668J5364J4968J4449J4887J6752
58925B370272J9331K1469K2913K4315K5948K7310K8175K9060L0250L1283L1904
58914B662230L2790L4716L7475M0191M2342M4159M6403M9841N4371N8608O1132
58903C164258O2301O3804O6074O7566O7375O7341P0013P5211Q0141Q2847Q4223
58892C951154Q6507R0767R6263J01570J06049J10484J16266J23810J32198J40736
58882E055804J50137J61324J73776J86294J98996K13103K28840K45024K61028
$$ plain form
58966 2184809 2172282 2162692 2155383 2149655 2145064 2141241 2137752 2134300 2131071 2128828 2128529 2130491 2133717 2136331
58952 2136331 2137095 2136536 2136363 2137904 2141364 2146384 2152744 2160369 2169086 2178567 2188274 2197514 2206020 2214441 2223636
58937 2223636 2233344 2242244 2249752 2257201 2266705 2279184 2293852 2309216 2324184 2338633 2353520 2370272
58925 2370272 2389603 2411072 2433985 2458300 2484248 2511558 2539733 2568793 2599043 2630326 2662230
58914 2662230 2695020 2729736 2767211 2807402 2849744 2893903 2940306 2990147 3044518 3103126 3164258
58903 3164258 3226559 3290363 3356437 3424003 3491378 3558719 3628732 3703943 3784084 3866931 3951154
58892 3951154 4037661 4128428 4224691 4326261 4432310 4542794 4659060 4782870 4915068 5055804
58882 5055804 5205941 5367265 5541041 5727335 5926331 6139434 6368274 6613298 6874326
58873F874326K77730K96019L15852L37453L62006L90062M20374M51661M84638
58864A0210121N20889N60364O01610O44193O89209P37219P87036Q36981Q86099
58855A6473721R33589R78057J017781J050762J073916J083027J074210J044824
58847B4729887R92620R15090Q10788O80853N28565L58097J74767j4135k00231
58838B8976301l76239n36799o77614p95066q87166r54290r98753j023738j032227
58829B1694409j026140j006472r74812r34409q89077q41233p91834p41871o92742
58820A3795819o45123n98798n54019n12132m74433m41220m12192l86717l63325
58811I407860l40150l16717k94500k74864k57180k39830k22414k05797j90315
$$ plain form
58873 6874326 7152056 7448075 7763927 8101380 8463386 8853448 9273822 9725483 10210121
58864 10210121 10731010 11291374 11892984 12537177 13226386 13963605 14750641 15587622 16473721
58855 16473721 17407310 18385367 19403148 20453910 21527826 22610853 23685063 24729887
58847 24729887 25722507 26637597 27448385 28129238 28657803 29015900 29190667 29176532 28976301
58838 28976301 28600062 28063263 27385649 26590583 25703417 24749127 23750374 22726636 21694409
58829 21694409 20668269 19661797 18686985 17752576 16863499 16022266 15230432 14488561 13795819
58820 13795819 13150696 12551898 11997879 11485747 11011314 10570094 10157902 9771185 9407860
58811 9407860 9067710 8750993 8456493 8181629 7924449 7684619 7462205 7256408 7066093
58802G066093j75103j59401j43727j29280j16469j04363r1778p8759o6535n5771
58792E944907m5501l4534k3284j2995l520O532J7419K7913L7763M8665O1688P5453
58780F100506Q8225J00375J13214J26588J39538J52496J66878J82895J99551K16623
58770G586889K34941K54778K75500K96878L19438L43347L68331L94838M24054
58761A0498994M56503M91642N28986N68647O10665O54863P01320P50010P99770
58752A6061400Q48641Q95184R38313R75836J004318J020508J021753J004963R66478
58743B4737394R03528Q14916P00339N60581L99036K21993L6847j49252l28968
58734B7896414m94921o41559p66331q68261r46365j000432j032587j046552j045210
$$ plain form
58802 7066093 6890990 6731589 6587862 6458582 6342113 6237750 6145972 6067213 6000678 5944907
58792 5944907 5899406 5864872 5841588 5828593 5825073 5831605 5849024 5876937 5914700 5963365 6025053 6100506
58780 6100506 6188731 6289106 6402320 6528908 6668446 6820942 6987820 7170715 7370266 7586889
58770 7586889 7821830 8076608 8352108 8648986 8968424 9311771 9680102 10074940 10498994
58761 10498994 10955497 11447139 11976125 12544772 13155437 13810300 14511620 15261630 16061400
58752 16061400 16910041 17805225 18743538 19719374 20723692 21744200 22765953 23770916 24737394
58743 24737394 25640922 26455838 27156177 27716758 28115794 28337787 28374634 28225382 27896414
58734 27896414 27401493 26759934 25993603 25125342 24178977 23178545 22145958 21099406 20054196
58725B0054196j029820j001943r65246r24398q82127q38129p91475p43394o96514
58716A2181150o51829o08296n65886n26929m93040m62498m32660m03677l77484
58707G658851l54117l31692l09711k89611k71823k54859k37843k21608k06604
58698E180983j91886j77077j63295j51225j40047j29248j19514j10987j02525
58689C895179r3852q6454q1135p6535p1461o6649o2699n8213n2168m6465m3705
58678C155843m3493m3221m1717l9944l8669l7527l6280l5222l4355l3459l2782
58667B739174l2585l2489l2375l3114l5234l7711l9529m1420m4392m7488m8922
58656B313915m8679m7920m6538m3717m0524l9330m0370m1226m0197l8064l5976
$$ plain form
58725 20054196 19024376 18022433 17057187 16132789 15250662 14412533 13621058 12877664 12181150
58716 12181150 11529321 10921025 10355139 9828210 9335170 8872672 8440012 8036335 7658851
58707 7658851 7304734 6973042 6663331 6373720 6101897 5847038 5609195 5387587 5180983
58698 5180983 4989097 4812020 4648725 4497500 4357453 4228205 4108691 3997704 3895179
58689 3895179 3801327 3714873 3633738 3557203 3485742 3419093 3356394 3298181 3246013 3199548 3155843
58678 3155843 3112350 3069129 3027412 2987468 2948799 2911272 2874992 2839770 2805415 2771956 2739174
58667 2739174 2706589 2674100 2641725 2608611 2573377 2535666 2496137 2454717 2410325 2362837 2313915
58656 2313915 2265236 2217316 2170778 2127061 2086537 2047207 2006837 1965611 1925414 1887350 1851374
58645A851374l3768l1237k9139k7791k6292k4228k2704k2483k2512k1657k0745
58634A568818k1291k2969k3905k3261k2042k1219k0291j8190j4954j1884j0165
58623A358647r767r761r457q866q033o564m287j926l76N39J788L558M695M046
58609A314236J796p27k253k379j530l96O68J630K240J976R37K65J062L015M787
58594A325327N683O324P630R723J1945J3700J5157J7218K0525K4355K7064K8032
58582A512683K8500K9996L2587L5550L9029M3660M8938N3380N6531N9579O3537
58571B003970O7978P2173P6630Q2578R0287R8679J06684J14592J23825J35489
58561B972885J49237J63745J78234J93091K08952K25589K42085K57671K72001
$$ plain form
58645 1851374 1817606 1786369 1757230 1729439 1703147 1678919 1656215 1633732 1611220 1589563 1568818
58634 1568818 1547527 1524558 1500653 1477392 1455350 1434131 1413840 1395650 1380696 1368812 1358647
58623 1358647 1348880 1339119 1329662 1320796 1312763 1306199 1301912 1299986 1299610 1300149 1301937 1305495 1310190 1314236
58609 1314236 1316032 1315305 1313052 1310673 1309143 1308747 1309415 1311045 1313285 1315261 1316198 1316463 1317525 1320540 1325327
58594 1325327 1331010 1337334 1344964 1354687 1366632 1380332 1395489 1412707 1433232 1457587 1484651 1512683
58582 1512683 1541183 1571179 1603766 1639316 1678345 1722005 1770943 1824323 1880854 1940433 2003970
58571 2003970 2071948 2144121 2220751 2303329 2393616 2492295 2598979 2713571 2837396 2972885
58561 2972885 3122122 3285867 3464101 3657192 3866144 4091733 4333818 4591489 4863490
58552D863490K84851K95852L03999L07035L01781K85714K58075K19297J70248
58543G290342J12796N0572j1935p1231j25329j72855k12347k42480k62682k73728
58533F081123k77820k77353k73105k64233k50567k34154k17874k03109j89383
58524C893525j75591j60937j45539j30829j18457j08020r7043q4353p2167o3302
58514B737287n7499n2446m7464m3808m1750l9951l7980l7144l8034l9154l8884
58503B263173l7459l6137l5579l5746l6451l7343l8036l8575l9189l9631l9710
58492A849317m0167m1702m3183m2480l9299l5578l2698l0053k7058k4808k4448
58481A467843k5139k5086k3782k2102k0783j9905j9434j9198j8535j6719j3831
$$ plain form
58552 4863490 5148341 5444193 5748192 6055227 6357008 6642722 6900797 7120094 7290342
58543 7290342 7403138 7453710 7441775 7370544 7245215 7072360 6860013 6617533 6354851 6081123
58533 6081123 5803303 5525950 5252845 4988612 4738045 4503891 4286017 4082908 3893525
58524 3893525 3717934 3556997 3411458 3280629 3162172 3054152 2957109 2872756 2800589 2737287
58514 2737287 2679788 2627342 2579878 2536070 2494320 2454369 2416389 2379245 2341211 2302057 2263173
58503 2263173 2225714 2189577 2153998 2118252 2081801 2044458 2006422 1967847 1928658 1889027 1849317
58492 1849317 1809150 1767448 1724265 1681785 1642486 1606908 1574210 1544157 1517099 1492291 1467843
58481 1467843 1442704 1417618 1393836 1371734 1350951 1331046 1311612 1292414 1273879 1257160 1243329
58470A243329j0725q244o670n813n386n347n779o399o573o303o546p765q659p505
58456A145615m636k205j516j789j840j722k111l048m048m827n410n881o252o331
58442A093999n803m928m742n776p023p135o304n762n670n081l922l457m380n759
58428A018257o359n932m896l717k930k804k899k779k959m047n343n762n638n862
58414I56330n624l435m10K42k169m402l786j824j464k854l890l676l125k798k068
58399I15047l72K020M277N404M838L384K788L794N417O744Q168R970J0967R938
58385I92384P423M864K755R41j13R1N46o36l827p079p980o009l062j823l235n541
58369I69699o369n590n019n348n100l221j010k33n71m48M23Q77L09m71l22J091
$$ plain form
58470 1243329 1232604 1224360 1217690 1211877 1206491 1201144 1195365 1188966 1182393 1176090 1169544 1161779 1153120 1145615
58456 1145615 1140979 1138774 1137258 1135469 1133629 1131907 1129796 1126748 1122700 1117873 1112463 1106582 1100330 1093999
58442 1093999 1088196 1083268 1078526 1072750 1065727 1058592 1052288 1046526 1040856 1035775 1031853 1028396 1024016 1018257
58428 1018257 1011898 1005966 1001070 997353 994423 991619 988720 985941 982982 978935 973592 967830 962192 956330
58414 956330 950706 947271 946861 947103 944934 940532 936746 934922 933458 930604 926714 923038 919913 917115 915047
58399 915047 914675 916695 920972 926376 931214 934598 937386 941180 946597 953341 961509 971479 982446 992384
58385 992384 999807 1004671 1007426 1008367 1008254 1008345 1008891 1008255 1004428 997349 989369 983360 980298 978475 975240 969699
58369 969699 963330 957740 952721 947373 942273 939052 938042 937809 937238 936790 937213 938090 938399 937928 937606 938697
58353I38697L232N107N913N662N062M817N314O822R116J0986J1283J0557J0593
58340A033161J2073J3949J5209J5859J5867J4766J3046J2398J3563J5168J5484
58329A190543J4350J2679J1246J0557J0734J0961J0222Q950Q530Q770P761M804
58317A310107J587n32k270m269n289m243k383j606j812j623n21J142L209N286
58303A296783O299N883N231N374N696N362M934N281O026O366O249N636M032J871
58289A371023Q92J798L075L512M072N688P092P005O790Q583J1942J4663J5921
58276A462056J6377J6051J4539J2846J2751J4500J6632J7848J7797J6703J5603
58265A633703J6120J8595K1216K2245K2210K2540K3176K3065K2200K1584K1843
$$ plain form
58353 938697 941929 947036 952949 958611 963673 968490 973804 980626 989742 1000728 1012011 1022568 1033161
58340 1033161 1045234 1059183 1074392 1090251 1106118 1120884 1133930 1146328 1159891 1175059 1190543
58329 1190543 1204893 1217572 1228818 1239375 1250109 1261070 1271292 1280242 1288772 1297542 1305303 1310107
58317 1310107 1311694 1311162 1308892 1304623 1299334 1295091 1292708 1291102 1289290 1287667 1287146 1288288 1291497 1296783
58303 1296783 1303082 1308965 1314196 1319570 1325266 1330628 1335562 1340843 1346869 1353235 1359484 1365120 1369152 1371023
58289 1371023 1371915 1373713 1376788 1380300 1384372 1390060 1397152 1404157 1410947 1419530 1431472 1446135 1462056
58276 1462056 1478433 1494484 1509023 1521869 1534620 1549120 1565752 1583600 1601397 1618100 1633703
58265 1633703 1649823 1668418 1689634 1711879 1734089 1756629 1779805 1802870 1825070 1846654 1868497
58254A868497K2944K4581K5937K6274K6444K8192L1139L2534L1309L0043L1097
58243B178991L3048L3274L2196L2404L4786L7845L9987M0686M0283L9973M0856
58232B584329M2216M2364M1806M2993M6059M8069M7978M8744N2377N6444N8322
58221C111701N9362O1658O4091O5152O6611P0353P4461P6444P7785Q1090Q5152
58210C893860Q7141Q7392Q7867Q8132Q7306Q7839R2810J01226J10096J19066J28856
58199D971591J37711J44061J50364J59432J69402J77240J84667J95179K07706
58190F497353K19065K30287K44381K59861K72802K83673K95936L09641L22665
58181H935664L36545L54442L75137L95594M17588M44693M74639N02358N29072
$$ plain form
58254 1868497 1891441 1916022 1941959 1968233 1994677 2022869 2054008 2086542 2117851 2147894 2178991
58243 2178991 2212039 2245313 2277509 2309913 2344699 2382544 2422531 2463217 2503500 2543473 2584329
58232 2584329 2626545 2668909 2710715 2753708 2799767 2847836 2895814 2944558 2996935 3053379 3111701
58221 3111701 3171063 3232721 3296812 3361964 3428575 3498928 3573389 3649833 3727618 3808708 3893860
58210 3893860 3981001 4068393 4156260 4244392 4331698 4419537 4512347 4613573 4723669 4842735 4971591
58199 4971591 5109302 5253363 5403727 5563159 5732561 5909801 6094468 6289647 6497353
58190 6497353 6716418 6946705 7191086 7450947 7723749 8007422 8303358 8612999 8935664
58181 8935664 9272209 9626651 10001788 10397382 10814970 11259663 11734302 12236660 12765732
58172A2765732N60438N96871O33724O70176P09843P53360P98403Q46229R00160
58163A9234936R58741J018704J083387J159389J246216J338465J436755J546903
58155B9023496J670259J805171J955856K128303K319074K519935K731761K962247
58147D7116102L214322L492053L814682M207899M684268N251046N934340O773542
58139H4488254P793144R002698J0420544J2063795J3904416J5857915J7828072
58132A71358838J9774442K1802213K4252035K7598276L1955511L6424194L8965991
58125C72131500L7253877L0043915J8037233L610464j0294517k1344826k8470403
58118D00967243l1853126l2435582l1305999k9302131k6940913k4514802k2169113
$$ plain form
58172 12765732 13326170 13923041 14556765 15226941 15936784 16690144 17488547 18334776 19234936
58163 19234936 20193677 21212381 22295768 23455157 24701373 26039838 27476593 29023496
58155 29023496 30693755 32498926 34454782 36583085 38902159 41422094 44153855 47116102
58147 47116102 50330424 53822477 57637159 61845058 66529326 71780372 77714712 84488254
58139 84488254 92281398 101284096 111704640 123768435 137672851 153530766 171358838
58132 171358838 191133280 212935493 237187528 264785804 296741315 333165509 372131500
58125 372131500 409385377 439429292 457466525 461076989 450782472 429437646 400967243
58118 400967243 369114117 336678535 305372536 276070405 249129492 224614690 202445577
58111B02445577j9941399j7821974j5816359j3951125j2241278j0680421r255159
58104A02737862p946816o727600n579406m514632l560928k725802j982637j279407
58096F8420634n58888J86732Q33132J113877P69886k32232j623542k984524l984561
58087F1940514m510359m628617m474174m166710l787971l394461l029082k716374
58079C1232766k455438k229294k023984j835434j661752j499034j346560j208525
58071A6972745j087780r82848q92065q15181p49926o92335o41303n98005n60494
58062I952808n24357m88971m57653m30975m05441l79537l55601l34677l14717
58053F260879k95061k77831k63622k50326k37245k25899k15820k04244j91073
$$ plain form
58111 202445577 182504178 164682204 148865845 134914720 122673442 111993021 102737862
58104 102737862 94791046 88063446 82484040 77969408 74408480 71682678 69700041 68420634
58096 68420634 67861746 68048478 68881610 69995487 70765373 70533141 68909599 65925075 61940514
58087 61940514 57430155 52801538 48327364 44160654 40372683 36978222 33949140 31232766
58079 31232766 28777328 26548034 24524050 22688616 21026864 19527830 18181270 16972745
58071 16972745 15884965 14902117 14010052 13194871 12444945 11752610 11111307 10513302 9952808
58062 9952808 9428451 8939480 8481827 8050852 7645411 7265874 6910273 6575596 6260879
58053 6260879 5965818 5687987 5424365 5174039 4936794 4710895 4495075 4290831 4099758
58044D099758j79653j71262j63068j53026j42798j34309j26992j19907j13375
58035B795368j07389j01264r5536r1159q6653p9558p0991o4998o2773o1244n8097
58024A915706n4502n1911m9750m7442m5488m3640m0960l8296l7515l7843l6354
58013A432005l2696k9725k8729k7789k5832k4503k4550k3948k1391j8504j6847
58002A157491j5531j3556j1965j1918j2768j3405j3665j3381j2147j0729j0668
57991A017758j1873j2687j2615j2512j2034r931p190o568q205q982p280n136m433
57978H98312m139k949j655j171q20k05k41q48k65J673K271j24l322m409l557k825
57962H75726l135m304o218q222q999q690r359j1791j3759j3119j0940r742j0229
$$ plain form
58044 4099758 3920105 3748843 3585775 3432749 3289951 3155642 3028650 2908743 2795368
58035 2795368 2687979 2586715 2491179 2400020 2313367 2233809 2162818 2097820 2035047 1973803 1915706
58024 1915706 1861204 1809293 1759543 1712101 1666613 1622973 1582013 1543717 1506202 1468359 1432005
58013 1432005 1399309 1369584 1340855 1313066 1287234 1262731 1238181 1214233 1192842 1174338 1157491
58002 1157491 1141960 1128404 1116439 1104521 1091753 1078348 1064683 1051302 1039155 1028426 1017758
57991 1017758 1005885 993198 980583 968071 956037 946106 938916 932348 924143 915161 907881 902745 898312
57978 898312 894173 891224 889569 888398 887578 887373 887132 886284 886019 887692 889963 889839 886517 882108 878551 875726
57962 875726 872591 868287 862069 853847 844848 836158 826799 815008 801249 788130 777190 767448 757219
57949G57219j1461j2732j3534j3021j1223r618r115q765p694o767o860p042o185
57936F33202n027m865n348n236m481m005m091m293m211l518k034n05j17n80j77
57921E84714J497K559J812P88J231K294K167J164J070K179K988K465J011o36k137
57906F05166l372m392n322n818n329m352m355n842p540q283q353q190p218n238
57892E21562l630l642m492m652m075l704l593l084k185j248K18K790N449O191
57878E01905M491K016O39O24Q73L61r76k473l657m713n884o672o456n712n643
57863D68723o473p155o942o208n490m772l934k840q85K246N239O195N321M999
57849D48024O595Q896J0243J0458R906Q596P250P310Q542Q410N492J868L84R46
$$ plain form
57949 757219 745758 733026 719492 706471 695248 685630 676515 667750 660056 653289 646429 639387 633202
57936 633202 628175 623310 617962 612726 608245 604240 600149 595856 591645 588127 586093 585588 585471 584891 584714
57921 584714 586211 588770 590582 591370 592601 594895 597062 598226 599296 601475 604463 606928 607939 607303 605166
57906 605166 601794 597402 592080 586262 580933 576581 572226 566384 558844 550561 542208 534018 526800 521562
57892 521562 517932 514290 509798 505146 501071 497367 493774 490690 488505 487257 487475 490265 495714 501905
57878 501905 506396 508412 509051 509675 510548 510909 509933 507460 503803 499090 493206 486534 480078 474366 468723
57863 468723 462250 455095 448153 441945 436455 431683 427749 424909 424024 426270 431509 437704 443025 448024
57849 448024 454619 463515 473758 484216 494122 502718 509968 517278 525820 534230 539722 541590 541974 542920
57835E42920J397P81l27j773l879n965o786o372n970o340p327q622r631r171o817
57820D66118m262l761n333o799o539m967l321k230j636j170l80Q08J911K615L310
57805D34364M323N166N333N328N956O976P437O920N571L392O44j438j630n51l73
57790D87418k295n078o585o305n958p549j1012j4022j4386j2389j0114q779p763
57777C75183o365n047m375m042l905m877p356r632r410o714l951l106m023n557
57763B96823p082q388r043q793q211q177q583q264o541m377l271l342l412l032
57749B06307l101m015m514l418j403O3O05N65L5k36J600N848R363R123O824O786
57733B30432R565J1231R379O183M380L635K670J938K002J692J83j079p00J44m04
$$ plain form
57835 542920 544317 545098 544771 542998 539119 533154 526368 519996 514026 507686 500359 491737 482106 472935 466118
57820 466118 461856 458095 452762 445963 439424 434457 431136 428906 427270 426100 425720 426528 428439 431054 434364
57805 434364 438687 443853 449186 454514 460470 467446 474883 481803 487374 490766 491410 489972 488342 487791 487418
57790 487418 485123 480045 473460 467155 461197 453648 442636 428614 414228 401839 391725 382946 375183
57777 375183 368818 363771 359396 355354 351449 346572 339216 329584 320174 313460 309509 306403 302380 296823
57763 296823 289741 281353 272310 263517 255306 247129 238546 230282 223741 219364 216093 212751 209339 206307
57749 206307 203206 199191 194677 191259 189856 189919 190524 191089 191124 190888 192488 198336 207699 216822 223646 230432
57733 230432 239997 251228 260607 266790 271170 274805 277475 279413 281415 283107 283290 282211 281511 281655 281251
57718B81251k024l170l423l093k015n90m04j961l371l189k810l863m948l662n87
57703B42141J630K194K536L282L550L080K721K759K602K010J179mj390j923j076
57688B65291j18k66o09K17J373J050m62j288r75o33l96Q14L117N355O953Q168
57672B87591Q741Q188P267P260Q066Q816R854J1964J4131J4465J3271J2848J4175
57659D26637J5969J7058J7464J7107J5851J5064J6713K0331K3210K4232K5359
57648F34995K8449L2569L5625L7006L7578L8320L9911M2529M5502M8026N0616
57637A071126N4755O0833O7608P3990Q0161Q6772R4051J01983J10433J19028J27803
57626B048543J37777J50031J64539J80699J98142K15911K32083K45770K58322
$$ plain form
57718 281251 279227 276057 272634 269541 267526 266936 266532 264571 261200 258011 255201 251338 246390 242728 242141
57703 242141 243771 245965 248501 251783 255333 258413 261134 263893 266495 268505 269684 269680 268290 266367 265291
57688 265291 265173 264907 264298 264515 265888 266938 266476 265188 264213 263580 263184 263998 267115 272470 279423 287591
57672 287591 296332 304520 311787 319047 327113 335929 345783 357747 371878 386343 399614 412462 426637
57659 426637 442606 459664 477128 494235 510086 525150 541863 562194 585404 609636 634995
57648 634995 663444 696013 731638 768644 806222 844542 884453 926982 972484 1020510 1071126
57637 1071126 1125881 1186714 1254322 1328312 1408473 1495245 1589296 1691279 1801712 1920740 2048543
57626 2048543 2186320 2336351 2500890 2681589 2879731 3095642 3327725 3573495 3831817
57617C831817K70350K78769K79333K71296K56810K36590K09548J76525J40661
57608E951699J03328O2749J7471l1604q3176j36066j86336k27097k53544k66503
57598D950921k69745k65839k56134k42448k26619k09502j91792j74673j58665
57589B955504j43140j27789j13107r8917q4352p0174n8822n1012m4119l5305k4644
57578B104123j4062m931K313Q143J4446K3129L3176M1475M7643N5268O6665P9352
57566B456740R0075R9710J11162J24496J37515J49660J61981J74080J84251J92112
57556C881782J98010K00016J94517J80134J58561J31112R7039N6222J1532l2750
57546E076175p3727j10371j42297j68938j89530k03525k11295k14261k13786k10142
$$ plain form
57617 3831817 4102167 4380936 4660269 4931565 5188375 5424965 5634513 5811038 5951699
57608 5951699 6055027 6117776 6135247 6103643 6020467 5884401 5698065 5470968 5217424 4950921
57598 4950921 4681176 4415337 4159203 3916755 3690136 3480634 3288842 3114169 2955504
57589 2955504 2812364 2684575 2571468 2472551 2388199 2318025 2259203 2208191 2164072 2128767 2104123
57578 2104123 2090061 2085130 2087443 2095586 2110032 2133161 2166337 2207812 2255455 2310723 2377388 2456740
57566 2456740 2546815 2646525 2757687 2882183 3019698 3169358 3331339 3505419 3689670 3881782
57556 3881782 4079792 4279808 4474325 4654459 4813020 4944132 5041171 5097393 5108925 5076175
57546 5076175 5002448 4892077 4749780 4580842 4391312 4187787 3976492 3762231 3548445 3338303
57536C338303k03162j93542j82719j71726j60852j50102j39305j28171j16962
57527A891762j06812r8624r1923q5465p8702p2088o6136o0852n5917n1108m6624
57516A077511m2953l9982l6456l1277k5285k0610j8124j6873j6156j6415j7321
57505G96059j6889j3814r468o293n059m761m178k610k3K606M055M699O322R386
57491G60032J2052J3096J3995J6627K0476K3908K6914L0495L4397L7645M0576
57480A030213M4202M7998N0450N1746N4097N9181O6634P5038Q3224R0672R7664
57469A751119J05003J12875J20584J28028J36246J45439J53605J58610J60391
57460B971900J59301J53553J40667J20838R6521O9035L7951L972k9921o0771q7380
$$ plain form
57536 3338303 3135141 2941599 2758880 2587154 2426302 2276200 2136895 2008724 1891762
57527 1891762 1784950 1686326 1594403 1508938 1430236 1358148 1292012 1231160 1175243 1124135 1077511
57516 1077511 1034558 994576 958120 926843 901558 880948 862824 845951 829795 813380 796059
57505 796059 779170 765356 755888 749595 744536 739775 735597 732987 732964 735570 739625 744324 750646 760032
57491 760032 772084 785180 799175 815802 836278 860186 887100 917595 951992 989637 1030213
57480 1030213 1074415 1122413 1172863 1224609 1278706 1337887 1404521 1479559 1562783 1653455 1751119
57469 1751119 1856122 1968997 2089581 2217609 2353855 2499294 2652899 2811509 2971900
57460 2971900 3131201 3284754 3425421 3546259 3642780 3711815 3749766 3753738 3723817 3663046 3575666
57449C575666j09385j26340j38297j46028j50126j50901j49141j45743j40626
57440B319079j33281j24360j15288j06293r6500q6140p6902o9569o2949n5919
57430A391878m9147m3738l9215l3942k7111j9444j2290o435j639L059Q579J5239
57418A185794K2975L1534M0138M7580N3466N8908O5216P2290P9113Q5453R2037
57407A834504R9393J07561J16643J26427J35409J41293J42812J40413J35102J27046
57397C106603J15156R7532P2825M1928Q052k5461n7099q6587j13219j35709j53111
57386B870910j65022j71501j73591j73038j70578j65330j56936j47194j38169
57377A409551j29669j20259j09900r9847r0697q2389p5524p0564o6173o0499n3907
$$ plain form
57449 3575666 3466281 3339941 3201644 3055616 2905490 2754589 2605448 2459705 2319079
57440 2319079 2185798 2061438 1946150 1839857 1743357 1657217 1580315 1510746 1447797 1391878
57430 1391878 1342731 1298993 1259778 1225836 1198725 1179281 1166991 1160556 1158917 1161976 1170555 1185794
57418 1185794 1208769 1240303 1280441 1328021 1381487 1440395 1505611 1577901 1657014 1742467 1834504
57407 1834504 1933897 2041458 2158101 2284528 2419937 2561230 2704042 2844455 2979557 3106603
57397 3106603 3221759 3319291 3392116 3434044 3442096 3416635 3359536 3272949 3159730 3024021 2870910
57386 2870910 2705888 2534387 2360796 2187758 2017180 1851850 1694914 1547720 1409551
57377 1409551 1279882 1159623 1049723 949876 859179 776790 701266 630702 564529 504030 450123
57366D50123m8363m4379m0683l6903l4124l2556l0932k8795k7216k6551k5636
57355G3985k3999k2899D054a9065k2024k0651k0311k0441j9460j7122j4643j3116
57343a66833j2738j3168j3718j3508j2254j0573r203q235p444o889o806p210p730
57330b96309p730o849n793n922p414q510p653n626m201l432k182q70j304l511
57316c67306n119m655l502l447m126m197l661l360l185k389j232q94j751k774
57302d11598k918k559l106n182p471p923o238m351m054m966n705n989o209n946
57288d84215m655l291l259m058l909k564j424q49K43J825K262J157L97J217K346
57273d98777K412K281L291M716M923M019L539M066M736M838M633M565M600M364
$$ plain form
57366 450123 401760 357381 316698 279795 245671 213115 182183 153388 126172 99621 73985
57355 73985 49986 27087 4054 -19065 -41089 -61740 -82051 -102492 -121952 -139074 -153717 -166833
57343 -166833 -179571 -192739 -206457 -219965 -232219 -242792 -251995 -260230 -267674 -274563 -281369 -288579 -296309
57330 -296309 -304039 -310888 -316681 -322603 -330017 -338527 -346180 -351806 -356007 -359439 -361621 -362491 -363795 -367306
57316 -367306 -372425 -377080 -380582 -384029 -388155 -392352 -396013 -399373 -402558 -404947 -406179 -407073 -408824 -411598
57302 -411598 -414516 -417075 -420181 -425363 -432834 -440757 -446995 -451346 -455400 -460366 -466071 -472060 -478269 -484215
57288 -484215 -488870 -492161 -495420 -499478 -503387 -505951 -507375 -508224 -507981 -506156 -503894 -502737 -502340 -501123 -498777
57273 -498777 -496365 -494084 -490793 -486077 -481154 -477135 -473596 -469530 -464794 -459956 -455323 -450758 -446158 -441794
57259d41794L584K518K145L368N835Q121R212R303R128R257J0001J1119J1667
57246c46536J1144J0575J1296J2845J3446J2620J1705J1647J1921J1908J1781
57235b15648J1661J1458J1848J3778J6613J8557J9270K0169K1800K3120b3207
57223C655L1802L6409L8192L7978L8193L9442M0706M1582M2183M1637L8610L3031
57211D63420K5949J8121R921K020n061j1660j8269k4597l0005l4298l7396l9151
57199C18994m0001m0896m1826m1404l8672l4278k9341k4317H613g418j3228r884
57187c0530n677k170n75p5O17J490K181L139M490N242N210O219g65A3392J7345
57172C0737J9302K1835K5339K8262K9363K8912K7861K7013K6702K6283K4558K1651
$$ plain form
57259 -441794 -438210 -435692 -433547 -430179 -424344 -416223 -407011 -397708 -388580 -379323 -369322 -358203 -346536
57246 -346536 -335392 -324817 -313521 -300676 -287230 -274610 -262905 -251258 -239337 -227429 -215648
57235 -215648 -203987 -192529 -180681 -166903 -150290 -131733 -112463 -92294 -70494 -47374 -23207
57223 3655 35457 71866 110058 148036 186229 225671 266377 307959 350142 391779 430389 463420
57211 463420 489369 507490 517411 519431 514370 502710 484441 459844 429839 395541 358145 318994
57199 318994 278993 238097 196271 154867 116195 81917 52576 28259 8613 -7418 -20646 -30530
57187 -30530 -36207 -38377 -38952 -39027 -38410 -36920 -34739 -31600 -27110 -21868 -16658 -10439 -765 13392 30737
57172 30737 50039 71874 97213 125475 154838 183750 211611 238624 265326 291609 316167 337818
57160C37818J9596K0030K2265K4734K7292L0693L4849L9172M3871M9283N4482
57149G04085N8043N9784O0547O0813O0698O0799O1766O3347O4707O5284O4720
57138A384593O2897O0641N9343N8973N7623N3793M7936M1009L3152K4929J8025
57127A902914J3167Q932M208L02j221j362k257m234o303q394j0827j2622j2555
57114A869748j1229r916p993l829K302Q287J3036J7092K0413K1555J9464J4750
57102A953680Q721K109n049j2824k0776k7926l3933m0288m8947n9533o9359p6845
57090A569030q3237r0304r8181j06482j15570j25575j35873j46620j59074j73524
57080C34590A45736e9237k23190k43197k62668k81075l01282l25901l54821l87507
$$ plain form
57160 337818 357414 377444 399709 424443 451735 482428 517277 556449 600320 649603 704085
57149 704085 762128 821912 882459 943272 1003970 1064769 1126535 1189882 1254589 1319873 1384593
57138 1384593 1447490 1508131 1567474 1626447 1684070 1737863 1785799 1826808 1859960 1884889 1902914
57127 1902914 1916081 1925013 1929221 1929523 1928302 1926940 1924683 1920449 1914146 1905752 1894925 1882303 1869748
57114 1869748 1858519 1848603 1840610 1836781 1839083 1847370 1860406 1877498 1897911 1919466 1938930 1953680
57102 1953680 1962401 1964510 1959461 1946637 1925861 1897935 1864002 1823714 1774767 1715234 1645875 1569030
57090 1569030 1485793 1395489 1297308 1190826 1075256 949681 813808 667188 508114 334590
57080 334590 145736 -59237 -282427 -525624 -788292 -1069367 -1370649 -1696550 -2051371 -2438878
57070b438878m24272m63686n02563n40837n82817o31368o84575p40501q00811
57061g810308q66896r37003j010834j092665j186132j290403j405425j536160
57053a7135826j686915j856266k042690k250876k487480k755593l058880l405988
57045c6680514l804746m256961m765200n339964n995050o742933p601147q594881
57037h3781396r744479j1057259j2539185j4206182j6076283j8155439k0418983
57030a85979206k2768027k5002347k6919366k8524118l0098262l1916544l3813223
57023c85021093l5082591l4886687l2772020k8802309k3300921j6598806r030474
57016e65494901j037376O839749J4079669K0282034K5205253K8777499L1086312
$$ plain form
57070 -2438878 -2863150 -3326836 -3829399 -4370236 -4953053 -5584421 -6268996 -7009497 -7810308
57061 -7810308 -8677204 -9614207 -10625041 -11717706 -12903838 -14194241 -15599666 -17135826
57053 -17135826 -18822741 -20679007 -22721697 -24972573 -27460053 -30215646 -33274526 -36680514
57045 -36680514 -40485260 -44742221 -49507421 -54847385 -60842435 -67585368 -75186515 -83781396
57037 -83781396 -93525875 -104583134 -117122319 -131328501 -147404784 -165560223 -185979206
57030 -185979206 -208747233 -233749580 -260668946 -289193064 -319291326 -351207870 -385021093
57023 -385021093 -420103684 -454990371 -487762391 -516564700 -539865621 -556464427 -565494901
57016 -565494901 -566532277 -559692528 -545612859 -525330825 -500125572 -471348073 -440261761
57009d40261761L2323454L2706564L2428335L1643939L0471435K8996007K7284703
57002b24407324K5401824K3409447K1361364J9306764J7296661J5377573J3580187
56995h8673504J1920479J0409420R054718P855419O802355N884247N089164M402225
56987b7255477L808129L296208K859215K488014K171355J900155J668537J471272
56979g592592J302775J157730J030571R16040Q12345P21600O44746d28630H8884
56969E51160M13283L68953L27312K89631K58162K31944K08365J87223J69628J54256
56959C159917J38515J22507J08090R4611P8953N9649L7888J4695r994l5427n9714
56948C709690q1339r8812j09399j10698j03372q9881p0722m4661j3355J6257L4771
$$ plain form
57009 -440261761 -407938307 -375231743 -342803408 -311159469 -280688034 -251692027 -224407324
57002 -224407324 -199005500 -175596053 -154234689 -134927925 -117631264 -102253691 -88673504
56995 -88673504 -76753025 -66343605 -57288887 -49433468 -42631113 -36746866 -31657702 -27255477
56987 -27255477 -23447348 -20151140 -17291925 -14803911 -12632556 -10732401 -9063864 -7592592
56979 -7592592 -6289817 -5132087 -4101516 -3185476 -2373131 -1651531 -1006785 -428630 88884
56969 551160 964443 1333396 1660708 1950339 2208501 2440445 2648810 2836033 3005661 3159917
56959 3159917 3298432 3420939 3529029 3623640 3702593 3762242 3800130 3814825 3804831 3769404 3709690
56948 3709690 3628351 3529539 3420140 3309442 3206070 3116189 3045467 3000806 2987451 3003708 3038479
56937C038479L4689J3081k6863p5745j21259j53767j69821j71663j64532j53766
56927B048833j42550j31555j20710j10539j01532r3430q6313q1182p8211p5456
56917A027355p0919o5092n9823n5404n0478m4250l7126k9608k2185j5893j1156
56906E65421o478j21O996J2040J4031J5085J7431K0787K3502K4804K4742K2800
56894G41040J7948J0240J607n475j0073j3160j5720j7125j6258j3713j1460j0136
56882F57715q322n029j248J923N034Q884J2698J5488J8218K2614K8305L2870L4515
56869H23665L3036K8375J9995Q217m937j6702k4916k8757k9068k7832k6530k5048
56857G29498k2675j9544j6240j2694q706n118l089k442j873p09P99K673N275P983
$$ plain form
56937 3038479 3073168 3086249 3059386 2983641 2862382 2708615 2538794 2367131 2202599 2048833
56927 2048833 1906283 1774728 1654018 1543479 1441947 1348517 1262204 1181022 1102811 1027355
56917 1027355 956436 891344 831521 776117 725639 681389 644263 614655 592470 576577 565421
56906 565421 558943 558822 565818 577858 591889 606974 624405 645192 668694 693498 718240 741040
56894 741040 758988 769228 770835 765360 755287 742127 726407 709282 693024 679311 667851 657715
56882 657715 649393 644364 643116 645039 650073 658957 671655 687143 705361 727975 756280 789150 823665
56869 823665 856701 885076 905071 913288 908351 891649 866733 837976 808908 781076 754546 729498
56857 729498 706823 687279 671039 658345 649639 644521 641432 638990 637117 636408 637207 639880 645155 653138
56843F53138R258Q502O962O310P173R238J1874J4101J4772J3618J1936J1731J3998
56830G92611J7819K1154K2736K3198K3980K5067K4564K0928J4810P966J096o051
56818I89878j2833j7372j8393j6656j4176j2446j1503j0440q553o027l255K78
56806H58502N647J2746J9763K5037K8702L1897L4958L7184L7591L5055K8466J8072
56794A173620O221m306j2435j8331k1548k1252j8064j4063j0528o993k866J299
56782A050754M880Q619J4017K1589L0182L7954M3938M8718N3473N7889N9237N4109
56770A485359M1199K2302J058j8715l4087m3784m8484m9882m9273m7119m3622
56759A214952l8980l3307k6882k0461j4614q864k158N684J3611K0565K6541L2279
$$ plain form
56843 653138 662396 670898 677860 684170 691343 700581 712455 726556 741328 754946 766882 778613 792611
56830 792611 810430 831584 854320 877518 901498 926565 951129 972057 986867 994833 995929 989878
56818 989878 977045 959673 941280 924624 910448 898002 886499 876059 867506 861479 858224 858502
56806 858502 864149 876895 896658 921695 950397 982294 1017252 1054436 1092027 1127082 1155548 1173620
56794 1173620 1179841 1175535 1163100 1144769 1123221 1101969 1083905 1069842 1059314 1052321 1049455 1050754
56782 1050754 1055634 1064253 1078270 1099859 1130041 1167995 1211933 1260651 1314124 1372013 1431250 1485359
56770 1485359 1526558 1548860 1549918 1531203 1497116 1453332 1404848 1354966 1305693 1258574 1214952
56759 1214952 1175972 1142665 1115783 1095322 1080708 1071844 1069686 1075370 1088981 1109546 1136087 1168366
56747A168366L8051M2544M2750L5514K0295O05j7914l1169l8528m1712m2585m2002
56735A134215m0065l6949l3289k9542k5301j9918j4012r234o127l211R79O062
56723I23608J1042J6152K1722K5905K5510J9392R549j138j0796j8264k2822k5006
56711I74854k6369k7627k7931k6574k4314k2275k0467j8220j5539j3160j1639
56700G40739j0854j0236r158p516o059n576n667n066l420j895j531j789j424j66
56686F70382J141J670J237J11j159j886j778j357j526k625m105n027m885m023
56672F46170l281l134l472m200n514p058p504o053l974l421m651n763n453m642
56658E78050m685n252n097m026k854j980j215p56j076j900k352k310k531l178
$$ plain form
56747 1168366 1206417 1248961 1291711 1327225 1347520 1348125 1330211 1299042 1260514 1218802 1176217 1134215
56735 1134215 1094150 1057201 1023912 994370 969069 949151 935139 925905 919778 916567 917546 923608
56723 923608 934650 950802 972524 998429 1023939 1043331 1052880 1051742 1040946 1022682 999860 974854
56711 974854 948485 920858 892927 866353 842039 819764 799297 781077 765538 752378 740739
56700 740739 729885 719649 710491 702975 696916 691340 685673 680607 677187 675292 673761 671972 670548 670382
56686 670382 671523 673193 674430 674541 673382 671496 669718 668361 666835 664210 660105 655078 650193 646170
56672 646170 642889 639755 636283 632083 626569 619511 612007 605954 601980 598559 593908 588145 582692 578050
56658 578050 573365 568113 563016 558990 556136 554156 552941 552185 551109 549209 546857 544547 542016 538838
56644E38838l193j845j67M4j565l583m655m781m565m090l348l091m111n736o260
56629D87892n200m038l997m212l174j257l27j044k108k333k113k208k254j448
56615D52179M5J260J685J632J584J786K360L216L861L698K618J105k72j361k444
56600D72952l738m878n051m006k716k496l458m346m085k933j757p21P31K866N210
56585D41574P059Q102Q532Q772R128R508R522Q930P993P229O875O675O283N735
56571E51917N393N348N136M338L336K917K991K424O06j322j607MK001K812K101
56556E88395L91j650l251l571k375m58Q77Q04m88j868j931j21K550M256M014K382
56540E87956N15j017k192k839k541j250L67J439J687J521J341J068O39N59J268
$$ plain form
56644 538838 535645 533800 533633 533677 532112 528529 523874 519093 514528 510438 507090 503999 499888 494152 487892
56629 487892 482692 478654 474657 470445 467271 466014 465687 464643 462535 460202 458089 455881 453627 452179
56615 452179 452224 453484 455169 456801 458385 460171 462531 465747 469608 473306 475924 477029 476757 475396 472952
56600 472952 469214 464336 459285 455279 452563 450067 446609 442263 438178 435245 433488 432767 433498 436364 441574
56585 441574 448633 456735 465267 474039 483167 492675 502197 511127 519120 526349 533224 539899 546182 551917
56571 551917 557310 562658 567794 572132 575468 578385 581376 583800 584406 583084 581477 581481 583482 586294 588395
56556 588395 588786 587136 583885 580314 577939 577481 578358 579162 578674 576806 574875 574754 577304 581560 585574 587956
56540 587956 588471 587454 585262 582423 579882 578632 578999 580438 582125 583646 584987 586055 586694 587253 588521
56525E88521K053J520n02k421k869k311j933j732r17L90J242J555K327L954N446
56510E94323N712M827L682L077L360M280N019M923M357M269M949N938P016Q446
56496F64178J0054J0989J0586Q913O539M490M056N465O925O394M219K524J968
56483G47300R83j286l388m008m113n206o837p626p551p442p150o093n028n269
56469F77286o377o516n248m110m075m135l223k146k494m341o113o525n864n216
56455F10903m899m055k063J41Q28l39j884k653l218m283m930m025k557k502l619
56440E70845l554j447O60R72M34P31J325N22j395k262j113O09J292J055Q43Q55
56424E70372Q02R48J846L229M020L511K117Q51M02Q30J868L305M983O564P473
$$ plain form
56525 588521 590574 592094 591592 589171 586302 583991 582058 580326 579409 579799 581041 582596 584923 588877 594323
56510 594323 600035 604862 608544 611621 614981 619261 624280 629203 633560 637829 642778 648716 655732 664178
56496 664178 674232 685221 695807 704720 711259 715749 719805 725270 732195 738589 742808 745332 747300
56483 747300 748283 746997 743609 739601 735488 730282 723445 715819 708268 700826 693676 687583 682555 677286
56469 677286 670909 664393 659145 655035 650960 646825 643602 641456 638962 634621 628508 621983 616119 610903
56455 610903 606004 601949 599886 600027 600855 600516 598632 595979 592761 588478 583548 579523 576966 574464 570845
56440 570845 567291 565844 566504 567476 567910 568641 569966 570488 569093 566831 565718 566327 567619 568674 569517 570372
56424 570372 571174 572122 573968 577197 581217 584728 586845 587696 588098 588928 590796 594101 599084 605648 613121
56409F13121P382O646O035N911N977N922O052O824P948Q443P768O605O190O917
56395G07741P932Q187P671P236P268P129O206M973M265L791K517N53n82j75M19
56380G75131j86j228j234q46k152n212p417p026n503n253o456p435p113n759l991
56365G08320k488k137l217m617m973m418m265n089n953n543l524j019l3j669m448
56350F54927n395l507j087o25j630j920q87L94J302J800J201q70k651j936M92
56335F39608J663Q56M67J844L130K584J412J450K005J339k48r12j93M80j36j878
56319F53471l733m641m168l168l183m502n631n269l799k068l5K255L642L252K033
56304F24456J484J650J739J863K635L607L780L278L166L786M521M902M899M459
$$ plain form
56409 613121 620503 627149 633184 639095 645072 650994 657046 663870 671818 680261 688029 694634 700824 707741
56395 707741 715673 723860 731531 738767 746035 753164 759370 764343 768608 772399 774916 775469 774887 774712 775131
56380 775131 774945 773717 772483 771637 769485 764273 756856 749830 744327 739074 732618 725183 718070 712311 708320
56365 708320 705832 703695 700478 695861 690888 686470 682205 677116 671163 665620 662096 661077 661044 659375 654927
56350 654927 649532 646025 644938 644313 642683 640763 639876 640270 641572 643372 644573 643703 641052 639116 639608
56335 639608 641271 642127 642594 644438 647568 650152 651564 653014 655019 656358 656110 655198 655005 655485 655349 653471
56319 653471 649738 645097 640929 637761 634578 630076 624445 619176 615377 613309 613274 615529 619171 622423 624456
56304 624456 625940 627590 629329 631192 633827 637434 641214 644492 647658 651444 655965 660867 665766 670225
56290F70225L824L809M629N063L989K128Q74J40r65j821q63J528K707J148j369
56275F95046j811Q08M729P401P687O683O598Q397J0745J1792J1546J1392J1772
56262G92785J1648J0347Q610P456P117P519Q784J0730J2501J3278J3024J2365
56250I16164J2054J2501J3301J3369J2091J0230R055Q772Q434P317N692M472M585
56237A038037O362Q893J0424J0206R463R657J0468J0633J0176J0268J1273J2572
56225A158432J4171J6681J9595K1443K2037K2925K4949K7063K8390K9832L2525
56214A418043L5987L9179M2394M6640N1772N6779O1543O6930P3100P9071Q4427
56203B055865R0377R8317J07831J17069J25079J33001J42535J53736J65082J75453
$$ plain form
56290 670225 674049 677858 682487 687550 691539 693667 694541 694681 693716 691895 691032 692560 695267 696415 695046
56275 695046 693235 694043 698772 706173 713860 720543 727141 735538 746283 758075 769621 781013 792785
56262 792785 804433 814780 823390 830846 837963 845482 854266 864996 877497 890775 903799 916164
56250 916164 928218 940719 954020 967389 979480 989710 998765 1007537 1015971 1023288 1028980 1033452 1038037
56237 1038037 1044399 1053292 1063716 1073922 1083385 1093042 1103510 1114143 1124319 1134587 1145860 1158432
56225 1158432 1172603 1189284 1208879 1230322 1252359 1275284 1300233 1327296 1355686 1385518 1418043
56214 1418043 1454030 1493209 1535603 1582243 1634015 1690794 1752337 1819267 1892367 1971438 2055865
56203 2055865 2146242 2244559 2352390 2469459 2594538 2727539 2870074 3023810 3188892 3364345
56193C364345J85100J94424K02710K08626K11338K10565K06186J98487J88189
56184E169970J75431J59218J38630J14172Q7270N9268L1765O954j3970l2247m9828
56173E846633o6375p9540q8202r3827r8484j02893j06840j10151j12697j14552
56163D873072j16599j20030j24853j29774j33802j37024j39601j41162j41591
56154C688636j41330j40449j38412j35118j31137j26451j20184j12202j03978
56145B539375r7015r1307q6012q0791p5553o9693o2733n5491m9600m5780m3120
56134A782280m0190l6552l3025l0588k9142k7652k5506k3138k0932j8210j4185
56123A483160r475n681l738l427m101m707l627o2M428P219P732P858R192J1257
$$ plain form
56193 3364345 3549445 3743869 3946579 4155205 4366543 4577108 4783294 4981781 5169970
56184 5169970 5345401 5504619 5643249 5757421 5844691 5903959 5935724 5942678 5928708 5896461 5846633
56173 5846633 5780258 5700718 5612516 5518689 5420205 5317312 5210472 5100321 4987624 4873072
56163 4873072 4756473 4636443 4511590 4381816 4248014 4110990 3971389 3830227 3688636
56154 3688636 3547306 3406857 3268445 3133327 3002190 2875739 2755555 2643353 2539375
56145 2539375 2442360 2351053 2265041 2184250 2108697 2039004 1976271 1920780 1871180 1825400 1782280
56134 1782280 1742090 1705538 1672513 1641925 1612783 1585131 1559625 1536487 1515555 1497345 1483160
56123 1483160 1473685 1468004 1464266 1460839 1456738 1452031 1448404 1448342 1452770 1459989 1467721 1475579 1484771 1496028
56109A496028J2990J4452J6239J8274K0080K1538K2753K3682K4264K4332K3418
56098A718050K1454J9621J9320K0163K0317J9156J8185J8785K0336K1454K1973
56087A938814K2827K4781K8063L2561L7784M3168M8866N5551O3197P0990P8880
56076B445482Q8177R9958J13542J27088J38879J47640J52290J52109J46829J36733
56066C748727J23337J09809R9261R2212Q6488P9712P0777N8971M3466K4632M860
56055D542252j2833k6732l7094m5813n5352o6869p9427r1910j04934j19031j31557
56044C770700j38116j37337j31838j24083j14084j02100r0527q1123p2719o3782
56034B714991n5252m8683m3176l6748k9670k4056k0801j8954j7673j6817j5841
$$ plain form
56109 1496028 1509018 1523470 1539709 1557983 1578063 1599601 1622354 1646036 1670300 1694632 1718050
56098 1718050 1739504 1759125 1778445 1798608 1818925 1838081 1856266 1875051 1895387 1916841 1938814
56087 1938814 1961641 1986422 2014485 2047046 2084830 2127998 2176864 2232415 2295612 2366602 2445482
56076 2445482 2533659 2633617 2747159 2874247 3013126 3160766 3313056 3465165 3611994 3748727
56066 3748727 3872064 3981873 4081134 4173346 4259834 4339546 4410323 4469294 4512760 4537392 4542252
56055 4542252 4529419 4502687 4465593 4419780 4364428 4297559 4218132 4126222 4021288 3902257 3770700
56044 3770700 3632584 3495247 3363409 3239326 3125242 3023142 2932615 2851492 2778773 2714991
56034 2714991 2659739 2611056 2567880 2531132 2501462 2477406 2456605 2437651 2419978 2403161 2387320
56023B387320j3850j0889p986n940m853m345l542j361K355O564J0417J4000J7056
56010B384946J8422J7905J7483J9153K2347K4979K6327K7443K9244L1543L3717
55999B653509L5225L5731L5586L5804L6844L7919L8313L8741M0559M3959M7768
55988C079958N0650N2043N2312N2431N3243N4810N6786N9170O1981O4687O6981
55977C705052O9547P2723P5175P5718P5798P7731Q0975Q2942Q3471Q5371R0052
55966D574555R5781J01027J06431J12435J18039J23358J30441J40128J50639J60523
55956E813357J70254J79947J88721J97532K09079K23319K36722K47582K58369
55947G724882K70855K83083K93607L04605L17960L32244L46648L63829L85453
$$ plain form
56023 2387320 2373470 2362581 2354595 2348655 2343802 2339457 2335915 2334554 2336909 2343473 2353890 2367890 2384946
56010 2384946 2403368 2421273 2438756 2457909 2480256 2505235 2531562 2559005 2588249 2619792 2653509
55999 2653509 2688734 2724465 2760051 2795855 2832699 2870618 2908931 2947672 2988231 3032190 3079958
55988 3079958 3130608 3182651 3234963 3287394 3340637 3395447 3452233 3511403 3573384 3638071 3705052
55977 3705052 3774599 3847322 3922497 3998215 4074013 4151744 4232719 4315661 4399132 4484503 4574555
55966 4574555 4670336 4771363 4877794 4990229 5108268 5231626 5362067 5502195 5652834 5813357
55956 5813357 5983611 6163558 6352279 6549811 6758890 6982209 7218931 7466513 7724882
55947 7724882 7995737 8278820 8572427 8877032 9194992 9527236 9873884 10237713 10623166
55938A0623166M08918M32085M57292M86869N18782N50872N85236O23686O63025
55929A5349931P00091P37854P81099Q29558Q80615R35260R95514J059558J125776
55920B3395256J198506J283344J379576J483537J596537J723011J864050K019680
55912C5943497K194390K392976K613625K852067L109798L392370L705524M061935
55904F0266182M486633N006464N640186O408970P346669Q481398R810927J1314693
55896A18762122J2988759J4851978J6921205J9203140K1713937K4489854K7574780
55889B56505775L0984044L4582077L7826052L9549135L8146022L2305206K1893518
55882D91791829Q317926n965849j8479500k7626603l3016290l5198111l5123818
$$ plain form
55938 10623166 11032084 11464169 11921461 12408330 12927112 13477984 14063220 14686906 15349931
55929 15349931 16050022 16787876 17568975 18398533 19279148 20214408 21209922 22269480 23395256
55920 23395256 24593762 25877106 27256682 28740219 30336756 32059767 33923817 35943497
55912 35943497 38137887 40530863 43144488 45996555 49106353 52498723 56204247 60266182
55904 60266182 64752815 69759279 75399465 81808435 89155104 97636502 107447429 118762122
55896 118762122 131750881 146602859 163524064 182727204 204441141 228930995 256505775
55889 256505775 287489819 322071896 359897948 399447083 437593105 469898311 491791829
55882 491791829 500109755 494143906 475664406 448037803 415021513 379823402 344699584
55875C44699584l3689288l1531162k9035413k6420418k3807894k1273369j8880077
55868A60061963j6683724j4714981j2972605j1438665j0092431q909502p862871
55861G7387184o934527o119173n411468m797421m263222l803765l415374l086666
55853C9555568k803286k556285k339822k145774j966988j802022j651247j511877
55845B2778267j381590j263001j159191j067807r84305r07867q39583p77883p20578
55836A3676462o68811o24396n85282n47994n12598m81311m53931m28412m04438
55827H969289l82925l63480l45471l30011l17823l06715k94110k80580k68212
55818F079962k57119k46331k36249k27320k17980k06785j95141j85110j75898
$$ plain form
55875 344699584 311010296 279479134 250443721 224023303 200215409 178942040 160061963
55868 160061963 143378239 128663258 115690653 104251988 94159557 85250055 77387184
55861 77387184 70452657 64333484 58922016 54124595 49861373 46057608 42642234 39555568
55853 39555568 36752282 34195997 31856175 29710401 27743413 25941391 24290144 22778267
55845 22778267 21396677 20133676 18974485 17906678 16922373 16014506 15174923 14397040 13676462
55836 13676462 13007651 12383255 11797973 11249979 10737381 10256070 9802139 9373727 8969289
55827 8969289 8586364 8222884 7877413 7547402 7229579 6922864 6628754 6348174 6079962
55818 6079962 5822843 5576512 5340263 5112943 4894963 4688178 4493037 4307927 4132029
55809D132029j65260j53142j41343j30795j21563j14269j09090j04536r9343r4182
55799B898506q9563q3983p6554o9568o5674o4171o2893o2005o2811o4140o3406
55788B133738o0469n7291n4411n0754m6515m3085m0304l6579l1844k7909k5562
55777A659015k3593k0977j8169j5972j4679j4393j4841j5035j4492j4396j6249
55766A476219j9664k2833k4716k5563k5901k6256k7190k8330k8244k6517k4895
55755A196110k4928k5528k4586k1974j9325j7698j7175j7692j8498j7732j4482
55744I76492j0463p828o250m116j590k01j49j96J39L03J83n2r68k896m676n264
55728I32468n720p488r616j0139r425r486j0622j1491j2041j3341j4668j3930
$$ plain form
55809 4132029 3966769 3813627 3672284 3541489 3419926 3305657 3196567 3092031 2992688 2898506
55799 2898506 2808943 2724960 2648406 2578838 2513164 2448993 2386100 2324095 2261284 2197144 2133738
55788 2133738 2073269 2015978 1961567 1910813 1864298 1821213 1780909 1744330 1712486 1684577 1659015
55777 1659015 1635422 1614445 1596276 1580304 1565625 1551232 1536391 1521356 1506864 1492468 1476219
55766 1476219 1456555 1433722 1409006 1383443 1357542 1331286 1304096 1275766 1247522 1221005 1196110
55755 1196110 1171182 1145654 1121068 1099094 1079769 1062071 1044896 1027204 1008706 990974 976492
55744 976492 966029 958201 951951 947835 946245 946044 945895 945699 945838 946141 946324 946272 945304 942408 937732 932468
55728 932468 926748 919260 909644 899505 890080 880594 869972 858481 846440 833099 818431 804501
55716H04501j1369r869j0949j3170j5138j7352j9994k1586k1242k0117j9273j8045
55704F06397j5840j3759j2855j2348j1086r617r345j0456j1922j2947j3420j3536
55692D59266j3666j4130j4594j4233j2753j0588q099n481l396k530k436j983j098
55679C54279q05j419k018j929j413o87L28J109R00K27M69J578K019J271N27L17
55663C54753m98k370l771l603l055l566m509m598m155m061l659j789P90K118J866
55648C19893J596K272L217L624L590L294K432R88l11p38k43O84J395J380Q22P07
55632C44602J736L262M020L827L808M910O841Q680R770R789Q629O730N096M355
55618D26055L925K604J70k043k505j316k21o51k306l873m599m472l402j203J543
$$ plain form
55716 804501 793132 783263 772314 759144 744006 726654 706660 685074 663832 643715 624442 606397
55704 606397 590557 576798 563943 551595 540509 530892 521547 511091 499169 486222 472802 459266
55692 459266 445600 431470 416876 402643 389890 379302 371203 365722 362326 359796 357360 355377 354279
55679 354279 353474 352055 350037 348108 346695 346008 346336 347445 348345 348572 349041 350619 352638 353909 354436 354753
55663 354753 354255 351885 348114 344511 341456 337890 333381 328783 324628 320567 316908 315119 315909 318027 319893
55648 319893 321489 323761 326978 330602 334192 337486 339918 340906 340595 339857 339614 340298 341693 343073 343895 344602
55632 344602 346338 349600 353620 357447 361255 366165 373006 381686 391456 401245 409874 416604 421700 426055
55618 426055 429980 432584 432754 430711 428206 426890 426669 426018 423712 419839 415240 410768 407366 406163 407706
55603D07706L569M123L547K565J702J406J813K102J123q72k091j467k06j69j426
55588D23425k483k428j806j522j973l229n101o807p471p281p484q861j0729j1830
55574C44420j1801j1285j0851j0366r502q494q023q335q687q051o372m718l999
55561B33936l896l570l022k989l549l809l333l027l807m941m821l227j778j778
55547A86389k573k664j674m93O1j24q96j971k689k474j605q87m77J65J069J376
55531A70533O20m42p12l2R27J515J409N75n42j160r93o32p41j139j094k78Q24
55514A68638J280M65j138k016j235J44K20j063j682l60J784L139L694M153M294
55499A80317L660K872K668K367R54r65j919j828j769j852j205Q2R05J017J260
$$ plain form
55603 407706 411275 415398 418945 421510 423212 424618 426431 428533 429656 428784 426693 425226 425020 424851 423425
55588 423425 420942 418514 416708 415186 413213 409984 404883 398076 390605 383324 375840 366979 356250 344420
55574 344420 332619 321334 310483 300117 290615 282121 274098 265763 257076 249025 242653 237935 233936
55561 233936 230040 226470 223448 220459 216910 213101 209768 206741 202934 197993 193172 189945 188167 186389
55547 186389 183816 181152 179478 178985 179046 178922 178026 176055 173366 170892 169287 168400 167923 168088 169157 170533
55531 170533 171153 170711 169999 169967 170894 172409 173818 174393 173851 172691 171698 171066 170325 169186 168092 167814 168638
55514 168638 169918 170383 169245 167229 165994 166138 166358 165295 163613 163253 165037 168176 171870 176023 180317
55499 180317 183977 186849 189517 191884 192838 191873 189954 188126 186357 184505 183300 183382 184287 185304 186564
55484A86564J666J294J78l32K21P00M53L41R02J317J201J648L268M782N071N077
55468B14351N973O851O248M905M644N043L795M83k326k399m46J430K191J744j94
55453B52293l649p517j0488j2466j3946j4447j2848r408o295n506o871q527q902
55440A31423p813o126m942n021o381q174r164q540o462l951k191j563j293m12
55426E9390Q76J316M04o50l79R93J951J601L49j045k021k012q99K96L69l28l29
55409E9882N86J001K30n57l53P8k69q92q14k33J63N59J208J290J21j260j311k20
55391E9209N91O35N76P46J013J535K183J850N5j454o75J456K077L85j614k348
55375F6220k320k152j402j45L60m14j330j453j311j488j499r78n25m33M4J292
$$ plain form
55484 186564 188230 189524 189702 189370 189591 190291 190744 191085 191987 193304 194505 196153 199421 204203 209274 214351
55468 214351 220324 227175 233423 238328 242972 248015 251810 252293 249967 247568 247122 248552 250743 252487 252293
55453 252293 248644 241127 230639 218173 204227 189780 176932 167524 161229 155723 148852 140325 131423
55440 131423 123610 117484 112542 107521 101140 92966 83802 75262 68800 64849 62658 61095 59802 59390
55426 59390 60266 61582 61986 61336 60957 61950 63901 65502 65851 64806 62785 60773 59874 60170 60539 60211 59882
55409 59882 60468 61469 61699 61142 60789 60867 60598 59706 58892 58659 58822 59381 60589 61879 62000 60740 59429 59209
55391 59209 59800 60435 61011 61757 62770 64305 66488 68338 68393 66939 66264 67720 69797 70182 68568 66220
55375 66220 63900 61748 60346 60201 60561 60147 58817 57364 56053 54565 53066 52088 51563 51130 51174 52466
55359E2466K493K941K919K536J256m83q93P48K631K794J795J558K620L914M534
55344H3829M286L071J064q74k019k727l659m520m429l204j633o70p91j681k285
55329F3758j757o33k86j095k037k250j851r80N63K254K855K081R95K23o74j554
55313E9612j230L81J479Q95k51n66m58p96j236j339j693k302j628Q06K618J568
55297E5860j024k277j809j221p64N17J987J863L14o40m23m29j112j143K3J128
55281E0850J367J451J650R56q14j999j321L30J471J917K138J980J199L44M5M7
55265F1611k43q04j164j092o39mL91K14l55q78j345j944k380k174j438o71j16
55248D6969K5o42j636j172J570M405M287J345j209j218L06J412J491P55n58j641
$$ plain form
55359 52466 54959 57900 60819 63355 64611 64128 63235 63983 66614 69408 71203 72761 75381 79295 83829
55344 83829 88115 91186 92250 91376 89357 86630 82971 78451 74022 70818 69185 68515 67724 66043 63758
55329 63758 62001 61368 61082 59987 57950 55700 53849 52869 53432 55686 58541 60622 61617 61840 61166 59612
55313 59612 58382 58763 60242 61137 60886 60320 59862 59066 57830 56491 54798 52496 50868 51674 54292 55860
55297 55860 54836 52559 50750 49529 48765 49282 51269 53132 53446 52806 52383 51954 50842 49699 49722 50850
55281 50850 52217 53668 55318 56274 55460 53461 52140 52470 53941 55858 57996 59976 61175 61519 61564 61611
55265 61611 61368 60564 59400 58308 57669 57665 58056 58270 57915 57037 55692 53748 51368 49194 47756 47085 46969
55248 46969 46994 46352 44716 43544 45114 49519 53806 55151 53942 52724 53030 54442 55933 56688 56130 54489
55232E4489j425k48L17j02m1J215K338K208J640J561J164l78j863j627j77O70
55216E9741N60O61J375J738J092n1r40j212o64M86J237O97o58j562j625j395r47
55199E8533K23J754K211R66p46j377q42k1P49J631K233J774M00p24q76m44J13
55182F5557R59J878J693r3j874j644J85J343R89N46Q94Q63l95j503r40L74N27
55165F9359m53r88n52J40R35K120K814J692n60j603o13P14Q91N45Q93J810K335
55148G9479J989Q50p45k072k418j890j132k88O88J004q7j495j180Q65K376K036
55132G7980J008N60J74q64j738j359j13Q64J147P90k35j440j809j245r06j251
55116G1563j153N4J113P18n00j103q33j52R00J990J898L07q95JJ780J791m24k835
$$ plain form
55232 54489 53064 52816 53133 53031 52990 54205 56543 58751 60391 61952 63116 62738 60875 59248 59071 59741
55216 59741 60301 60962 62337 64075 65167 65116 64176 62964 62300 62786 64023 64720 64062 62500 60875 59480 58533
55199 58533 58756 60510 62721 63687 62941 61564 60722 60701 61450 63081 65314 67088 67488 66764 65888 65444 65557
55182 65557 66516 68394 70087 69994 68120 66476 66661 68004 68993 69539 70433 71296 70901 69398 68458 68832 69359
55165 69359 68906 67918 67366 67506 68441 70561 73375 75067 74507 72904 72291 73005 73896 74441 75334 77144 79479
55148 79479 81468 82318 81573 79501 77083 75193 74061 73773 74461 75465 75378 73883 72703 73568 75944 77980
55132 77980 78988 79548 79722 78858 77120 75761 75648 76512 77659 78449 78214 76774 74965 73720 72814 71563
55116 71563 70410 70464 71577 72295 71795 70692 69859 69707 70607 72597 74495 74802 73907 73908 75688 77479 77055 74220
55098G4220l862l666k655n59K505N268O235M932K262o7q39m62k83o89q75o67r66
55081G9832j672j269L90J003o09j937m22K123J914j042l096k539j378j194p58
55066F9346R22K257J598j8n85J7N49N76N28N04M55Q98K244L851M656M334L194
55049I5326J586N0o34l02K74M64N85R85J117L85o58q47K0Q76N97q87k526k956
55031I3455j594P95K871M017M420L960K026j013l103k342O90L242L236J241n05
55016A11396n76M79J283J313J090J057R69N47Rl78o74p65j62J147K228K333J845
54999A23141J341M76j097k461k514j852j941k638k235k48J580J643M02p47j203
54984A11647j088o03l17j041k496l096j939j35P35O57N99Q23J000J404K460L401
$$ plain form
55098 74220 70358 66692 64037 63478 65983 71251 77486 82418 84680 84613 83774 83312 83029 82340 81465 80798 79832
55081 79832 78160 76891 77281 78284 77675 75738 75316 77439 79353 78311 75215 72676 71298 70104 69346
55066 69346 70268 72525 74123 74105 73520 73537 74086 74662 75190 75694 76149 77047 79291 83142 87798 92132 95326
55049 95326 96912 96962 96328 96026 96300 96764 97349 98334 99451 99836 99178 98331 98351 99227 99824 98937 96411 93455
55031 93455 91861 92656 95527 99544 103964 107924 109950 108937 105834 103492 104182 107424 110660 111901 111396
55016 111396 110820 111299 112582 113895 114985 116042 117011 117558 117567 117189 116515 115750 115588 116735 118963 121296 123141
54999 123141 124482 124958 123861 121400 118886 117034 115093 112455 110220 109972 111552 113195 113597 112850 111647
54984 111647 110559 109956 109639 108598 106102 103006 101067 100932 101667 102324 102923 103746 104746 106150 108610 112011
54968A12011K905J145j48m2L82j91j433k089j882j526j211l60R35J445N05p39
54952A09707p65J75O11L00O15K150L454L068J660R61J429K123K349K119J408K41
54936A31605o63n40K65Q12R66J122Q64n74k565l364k397r29j01K87O88R05Q60
54919A27241R76J131M81r86j854j083N89J822K308K449K371K065J719J133k41
54904A40121j955k271l10K361L493K798J838J790K474L283M004M716N592O677
54890A74611P653Q173Q549R332J0147J0212J0267J2213J5837J7852J5952J2260
54878C13058J0524J0872R959N855J90m742q461j1193j2542j2541j2467j3227j3948
54865B61337j3258j1337r606q918q880q587p464n629l789k491j433p2J169J201
$$ plain form
54968 112011 114916 116061 115913 115871 116253 116062 114629 112540 110658 109132 107921 107561 108496 109941 110446 109707
54952 109707 108942 109117 109728 110028 110643 112793 116247 119315 120975 121936 123365 125488 127837 129956 131364 131605
54936 131605 130942 130402 130667 131479 132445 133567 134431 133857 131292 127928 125531 124602 124501 124788 125476 126381 127241
54919 127241 128217 129348 129829 128843 126989 125906 126495 128317 130625 133074 135445 137510 139229 140362 140121
54904 140121 138166 135895 135585 137946 141439 144237 146075 147865 150339 153622 157626 162342 167934 174611
54890 174611 182264 190437 198986 208318 218465 228677 238944 251157 266994 284846 300798 313058
54878 313058 323582 334454 344413 350268 350458 345716 337255 326062 313520 300979 288512 275285 261337
54865 261337 248079 236742 227136 218218 209338 200751 193287 187658 183869 181378 179945 179873 181042 182243
54851A82243O3p36j89R20J556K269M270P263R592J0514J1065J2219J3330J3120
54837B67499J1624J0140R375Q517O447L234k31l576o978r966j1299j0657r589
54824B64540r878j1398j2483j2187j1173j0348r609q312o410m536l240k472j846
54811A60648j359j657l126m692m400j914N24P45m08m24R75J433k32j978j619j66
54795A42350k93k528m854n582m808l174j033Q09J142q0j353j525j175j391k050
54780A14455k281j937j571j313q30l44n90j535k055j399l37j56r27j487j011J44
54764I6826J233K068K758L006K330R03l14m32N74K000L071L409L208L083L493
54749A27216M138M201L332K146J531J742K493L534M648N278M928L996L582M303
$$ plain form
54851 182243 182306 181570 181381 182301 183857 186126 190396 197659 207251 217765 228830 241049 254379 267499
54837 267499 279123 289263 298638 307155 313602 316836 316605 313029 306051 296085 284786 274129 264540
54824 264540 254662 243264 230781 218594 207421 197073 187464 179152 172742 168206 164966 162494 160648
54811 160648 159289 157632 154506 149814 145414 143500 144024 144769 144361 143937 144912 146345 146113 144135 142516 142350
54795 142350 142057 139529 134675 129093 124285 121111 120078 120887 122029 121949 120596 119071 117896 116505 114455
54780 114455 112174 110237 108666 107353 106523 106179 105589 104054 101999 100600 100263 100107 99180 97693 96682 96826
54764 96826 98059 100127 102885 105891 108221 109124 108810 108378 108952 110952 114023 117432 120640 123723 127216
54749 127216 131354 135555 138887 141033 142564 144306 146799 150333 154981 160259 165187 169183 172765 177068
54735A77068N687P012Q181R463J0894J2328J3705J4773J4975J4116J2914J2258
54723C13374J2079J1402R350N668P16m354p834q856q478q444q982q884p709o571
54709B82477o350o583o657o803o989o145l730j071K30M03O48R57N21j78L96K451
54693B43577M526N743O867Q630J0445J1452J1736J1959J2751J4775J8228K1695
54681C82384K2723K0146J5002Q938K962j920m543n199o024q551j1882j4377j5904
54668C83755j7081j7500j6499j4919j4146j3862j2555j0136q228p732p805p562
54656B35730p204o928o157m693l553l741m790n282m429k691j131n23q22j318j422
54641A81046j160o99Q1R66R50m47j784j036J574L397K584K61j075l99J311K563
$$ plain form
54735 177068 182755 189767 197948 207411 218305 230633 244338 259111 274086 288202 301116 313374
54723 313374 325453 336855 346205 351873 352589 348235 340401 331545 323067 314623 305641 296757 289048 282477
54709 282477 276127 269544 262887 256084 249095 242950 239220 238149 238379 238782 239430 240387 240908 240730 241126 243577
54693 243577 248103 253846 260713 269343 279788 291240 302976 314935 327686 342461 360689 382384
54681 382384 405107 425253 440255 449193 452155 450235 445692 440493 434469 425918 414036 399659 383755
54668 383755 366674 349174 332675 317756 303610 289748 277193 267057 258829 251097 243292 235730
54656 235730 228526 221598 215441 210748 207195 203454 198664 193382 188953 186262 185131 184608 183786 182468 181046
54641 181046 179886 179187 179268 180234 181184 180737 178953 177917 179491 182888 185472 185733 184658 184259 185570 188133
54625A88133K450R29j096k190j540K38J768K123J273j12r58m29J213K755L356
54610A97913L360L399L333K716J928J993L278N002O153O399N947M868L198J546
54596B51033J122K488M497N126L689J636P79J303K115K471K347J774R94R82K476
54581B84832M523N341M740M392N349O812P791Q478R202R527R513J0477J3071J5497
54567C99545J5252J2016P514L113r01m171o152p303q901j1301j3391j4093j3475
54554C57752j2283j1144j0434j0152r771q829p588o557n614m432l360k834k265
54541B62489q70O04N93p78j669j420j622l420n446n864n013m523m779m969m969
54526B18344n394o015n787m525l175k323j637j056j248k441l809m468m333l667
$$ plain form
54625 188133 190583 191512 190416 188226 186686 186924 188692 190815 192088 191976 191018 190589 191802 194557 197913
54610 197913 201273 204672 208005 210721 212649 214642 217920 222922 229075 235474 241421 246289 249487 251033
54596 251033 252155 254643 259140 264266 267955 269591 270370 271673 273788 276259 278606 280380 281374 282356 284832
54581 284832 289355 294696 299436 303828 309177 315989 323780 332258 341460 350987 360500 370977 384048 399545
54567 399545 414797 426813 434327 437440 436539 432368 426216 418913 410012 398711 385320 371227 357752
54554 357752 345469 334325 323891 313739 303968 295139 287551 280994 275380 270948 267588 264754 262489
54541 262489 261619 262223 262816 262038 260369 258949 257327 253907 248461 242597 237584 233061 228282 223313 218344
54526 218344 212950 206935 201148 196623 193448 191125 189488 188432 187184 184743 180934 176466 172133 168466
54512A68466k601j553j312k148l346m009l774k578o05J175J439K31o35J58J495
54497A50403J291n75k119j914n08Q23J510J369Q8k064l714l527j555R80K929L672
54481A47089K948J108n73q27K62J420J828J969K593L480L757L176K483K553L495
54466A76761M616N146M892M368M210M588N208N830O360O370N099K468l56k083
54452B33477k816l641m663m626l022j574k446n332p591p271m985k656j476j556
54438A79822k406l092k680j471j059k306l844l742k140r44j169j950k173j664
54424A49182n24J266K960L121J425n51j193o66j43j34m39q90j116m13J174K307
54408A55366K002J154J188J893K005J402J044J136R95O94R84J489Q40r49k026
$$ plain form
54512 168466 165865 164312 163000 160852 157506 153497 149723 147145 146540 147715 149154 149385 148750 148908 150403
54497 150403 151694 151119 149000 147086 146578 147401 148911 150280 150368 148304 144590 141063 139508 140488 143417 147089
54481 147089 150037 151145 150572 149745 150007 151427 153255 155224 157817 161297 165054 168230 170713 173266 176761
54466 176761 181377 186523 191415 195783 199993 204581 209789 215619 221979 228349 233448 235916 235560 233477
54452 233477 230661 227020 222357 217731 214709 213135 210689 205357 197766 190495 185510 182854 181378 179822
54438 179822 177416 174324 171644 170173 169114 166808 162964 159222 157082 156138 154969 153019 150846 149182
54424 149182 148658 149924 152884 156005 157430 156879 155686 155020 154877 154743 154304 153414 152298 151885 153059 155366
54408 155366 157368 158522 159710 161603 163608 165010 166054 167190 168185 168879 169863 171352 172192 171243 169217
54393A69217j326m8L39n2o12j614l155m054l328j913j405j762j751j054m45k82
54377A46755k47l78q97j237o67R9m57k188k883j091J774L021J719m90j348k44
54361A41241J299J372p5j158o41K05n31k261k362J89L388N060N399N610N408L647
54345A65790P89r85k55K171M374N114M337K789J575J530K660M197N401O154O776
54330B12417P375P551O802N345M246M284M744M032J665j039k598l033l294l670
54316B44827l710l384l301l664l872l404k563k031k088k544l082l418l314k742
54302B01710k008j584j710k108k173j657j151j463k471l107k727j886j324p72
54288A75569M38K027K991L048K863K872K814K685L213M785O505O980N833M068
$$ plain form
54393 169217 167891 167843 168182 168130 167518 165904 162749 158695 155367 153454 152049 150287 148536 147482 147037 146755
54377 146755 146508 146130 145233 143996 143329 143428 142971 140783 137900 136809 138583 141604 143323 142833 141485 141241
54361 141241 142540 143912 143837 142679 142038 142243 141712 139451 137089 137278 140666 145726 151125 156735 162143 165790
54345 165790 166579 165594 165339 167510 171884 176998 181335 184124 185699 187229 189889 194086 199487 205641 212417
54330 212417 219792 227343 234145 239490 243736 248020 252764 256796 258461 257422 254824 251791 248497 244827
54316 244827 241117 237733 234432 230768 226896 223492 220929 218898 216810 214266 211184 207766 204452 201710
54302 201710 199702 198118 196408 194300 192127 190470 189319 187856 185385 182278 179551 177665 176341 175569
54288 175569 176007 178034 181025 184073 186936 189808 192622 195307 198520 203305 209810 216790 222623 226691
54274B26691L001L063L454L070J872J077J547K300J537r84l550m579m149l197
54260B31153k299j837k313l674m995n575n687n602m835l342k515l594n572o236
54246A73077n104l851l761m180l843k536r76nl53k134m133m562l152j617j360
54231A31510j604p27J229K529K025M73n13k24O20P80j50j334j688j178o97p84
54215A30267j144j465j857k176j861r61m01n20k62J236L039L560K713J644Q01
54200A32613k50j269j203Q8J311J395O21l02j164j697j308j87L46m93j616j454
54184A25431m9J251J687J522J006K21j37P49K230K440O95j366j836p97L74J095
54168A34516J696K020J443K74l21j63m52j617k143p35J340J590l15k018j448R50
$$ plain form
54274 226691 229692 232755 236209 239279 241151 242228 243775 246075 247612 246628 243078 238499 234350 231153
54260 231153 228854 227017 224704 221030 216035 210460 204773 199171 194336 190994 188479 184885 179313 173077
54246 173077 167973 164122 160361 156181 152338 149802 148826 148821 148468 146334 142201 137639 134487 132870 131510
54231 131510 129906 129179 130408 132937 134962 135435 134922 134698 135318 136098 135948 134614 132926 131748 131051 130267
54215 130267 129123 127658 125801 123625 121764 120803 120402 119882 119620 120856 123895 127455 130168 131812 132613
54200 132613 132363 131094 129891 129979 131290 132685 133306 133004 131840 130143 128835 128648 128994 128501 126885 125431
54184 125431 125382 126633 128320 129842 130848 131069 130932 131681 133911 136351 137046 135680 133844 133047 133421 134516
54168 134516 136212 138232 139675 139949 139628 139465 139013 137396 135253 134518 135858 137448 137133 135115 133667 134617
54152A34617L134L562K108o5j157k86J246J268l32j285j17J746K213J428R10Q23
54136A49813J22j094j435n18M21N04J63k16r26j627j075P81J887O56j568k148
54120A43740o23R06O96o97j545j034J61Q28M13n21r50o05k17m76j246k043k743
54103A34044l213k925j672k27O07J235K522M032M201K529N30n9P03J452J396R50
54087A46105P02N11j51j311k281k308j394m15l00j096j959k141j772j537j753
54072A28900k073k021j578j062o66l59j12J40P02J788K765K255l47l693n439m509
54056A14691j951M90J967K523K260J316L46K67J229K293K394J488M89P2p8n75
54040A29221j174r76J04R24O68J01K87O94j06j939k789j454Q82K417K836K682
$$ plain form
54152 134617 137751 141313 143421 143356 142199 141913 143159 144427 144095 142810 142693 144439 146652 148080 148990 149813
54136 149813 149935 148841 147406 146888 147309 147813 147976 147760 146834 145207 144132 144913 146800 147456 145888 143740
54120 143740 143117 144023 144719 144022 142477 141443 141604 142432 142845 142324 141374 140769 140552 140076 138830 136787 134044
54103 134044 130831 127906 126234 126007 126614 127849 130371 134403 138604 141133 141663 141604 142307 143759 145155 146105
54087 146105 146807 147318 147167 145856 143575 141267 139873 139458 139158 138062 136103 133962 132190 130653 128900
54072 128900 126827 124806 123228 122166 121500 121141 121029 121169 121871 123659 126424 128679 128332 124639 119200 114691
54056 114691 112740 113230 115197 117720 119980 121296 121642 121909 123138 125431 127825 129313 129802 129874 129796 129221
54040 129221 128047 127071 127175 128099 128767 128868 129155 129849 129743 127804 125015 123561 124443 126860 129696 132378
54024A32378J830J1j763j931n21P04M31q04j678j619r50k02K09k2q49j754j978
54007A21492j036Q27K549K996K127J133J015J408J345P45L05J77j55p01o71J69
53991A33725Q85P45M26J058K481L414L317L107L683M494M368L481L380M708N849
53976A79121M962K874K399M544O901O813M899L994N238O895P098O116N438N757
53962B53049O557O975O469N195M100M116M940N108L718J481k10o54N8J471K675
53947C05048K417L78j929k479j052N04M19j071k204j726j08J062P84l82r89l14
53931B98358Q50J051m17l027n605p134p189o032m453l320l126l682m181l806k651
53916B45636j889k567m221n243m745l445k387j539l26J010J552J124O57R50J735
$$ plain form
54024 132378 134208 134219 132456 130525 130004 130708 131139 130335 128657 127038 126088 125886 126095 126073 125224 123470 121492
54007 121492 120456 121283 123832 126828 128955 130088 131103 132511 133856 134601 134906 135083 134928 134227 133556 133725
53991 133725 134610 135355 135781 136839 139320 142734 146051 149158 152841 157335 161703 165184 168564 173272 179121
53976 179121 184083 186957 189356 193900 200801 207614 212513 216507 221745 228640 235738 241854 247292 253049
53962 253049 259606 266581 273050 278245 282345 286461 291401 296509 300227 301708 301498 300844 300902 302373 305048
53947 305048 307465 307843 305914 303435 302383 302887 303306 302235 300031 298305 298197 299259 300043 299661 298672 298358
53931 298358 299208 300259 299842 296815 291210 284076 276887 270855 266402 263082 259956 256274 252093 248287 245636
53916 245636 243747 241180 236959 231716 226971 223526 221139 219600 219274 220284 221836 222960 223617 224567 226302
53901B26302K223K043J285K01o49m65R22K413K680J765J051J448K361K804K834
53886B49218L142L708L897L743M052M873M953L506J802J824L684N366N255L937
53872C02960L101L485M549N590O297O311N131K812L14j256j562r61J70J499K415
53857C40855K322J495J051J638K633L160L413M143N199N575M979M338M410M862
53843C90073N149N446N942N969M699K322j50j920k659k231j059l40j042k721m029
53828D03449m202l507k657k502l777o244q442r205r097r262r482q753p444o991
53814C11884p396o859m620k416k094l119l705l372l183m006n720p634q833q503
53800B40424o750m788l671l258k942k767l093l723m220m472m284l080j003M14
$$ plain form
53901 226302 228525 230568 231853 232054 231405 230940 231862 234275 236955 238720 239771 241219 243580 246384 249218
53886 249218 252360 256068 259965 263708 267760 272633 277586 281092 282894 284718 288402 293768 299023 302960
53872 302960 306061 309546 314095 319685 325982 332293 337424 340236 340550 339294 337732 336771 336941 338440 340855
53857 340855 343177 344672 345723 347361 349994 353154 356567 360710 365909 371484 376463 380801 385211 390073
53843 390073 395222 400668 406610 412579 417278 419600 419450 417530 414871 412640 411581 411241 410199 407478 403449
53828 403449 399247 395740 393083 390581 386804 380560 372118 362913 353816 344554 335072 326319 318875 311884
53814 311884 304488 297629 293009 290593 288499 285380 281675 278303 275120 271114 265394 257760 248927 240424
53800 240424 233674 228886 225215 221957 219015 216248 213155 209432 205212 200740 196456 193376 192373 192787
53786A92787l4j402j713o29M21N30J95j50r12k141k981l029l040l436l224j478
53770A69764Q86K067J685R88R10J088Q69K41m70j038j015J26K028L253K822J450
53754A85654N11J34n29j350q69J538M310N379M535L123J981R51J83M87J957L409
53738B11404L878L940M752O316P439P243O076M985M726N230N782N620M649L561
53724B85601L181L724M631M955L953J659j063l143m040l812k814j648j028j013
53710B89143p62K34R40j12k549m286m143l083k359j812q91k00o71j893k600k499
53694B62457k456k943l327k913j884r78n47k21N57J515J432m21k747l307j796
53679B42421m03p82j817j537p7Q76P56M98O84J119K111M284O832P729O366M550
$$ plain form
53786 192787 192753 191351 189638 189009 189430 189960 190155 190005 189093 186952 183971 180942 177902 174466 171242 169764
53770 169764 170650 172717 174402 175390 176300 177388 178257 178498 178028 176990 175975 176101 178129 181382 184204 185654
53754 185654 186165 186299 185770 184420 183551 185089 189399 194778 199313 202436 204417 205368 205551 206038 207995 211404
53738 211404 215282 219222 223974 230290 237729 244972 251048 256033 260759 265989 271771 277391 282040 285601
53724 285601 288782 292506 297137 302092 306045 307704 306641 303498 299458 295646 292832 291184 290156 289143
53710 289143 288381 288615 289555 289443 286894 282608 278465 275382 273023 271211 270320 270120 269449 267556 264956 262457
53694 262457 260001 257058 253731 250818 248934 247956 247409 247188 247745 249260 250692 250271 247524 244217 242421
53679 242421 242018 241236 239419 237882 237805 238681 239437 239935 240619 241738 243849 248133 254965 262694 269060 273610
53663B73610M028M222L475J661L06L75J069R93m3q79n11O13J216Q92N33Q08J093
53646B93461N36n41j136r09j87Q03J678J549J60j119q84J22J8j308k063j301R9
53629B88978J489L341N494O479N653M345L725L223K249J789K620L370K384N31
53615C35670J56J776L690M523M336L517K419K010L044M435M208K415J293K010
53601C75502K982K343N38q26j397j896k346k084j270r31j490k282k775l225l812
53586C57031l952l055j478j71L10J17m02j024j513j556r64K7P90O78l88j641k026
53569C40783j235K3J001J782K830L872M118L535L056L213L413L150L236M737P116
53554C84630Q450P474M647J295j398k393j079J893M702O027O212O361O782O957
$$ plain form
53663 273610 277638 281860 285335 286996 287302 287677 288746 289739 289696 288817 288306 288919 290135 291027 291560 292368 293461
53646 293461 293997 293456 292320 291411 291224 292027 293705 295254 295414 294295 293411 293533 293551 292243 290180 288879 288978
53629 288978 290467 293808 299302 305781 311434 315779 319504 322727 324976 326765 329385 332755 335139 335670
53615 335670 335826 337602 341292 345815 350151 353668 356087 358097 361141 365576 369784 372199 373492 375502
53601 375502 378484 380827 381365 380539 379142 377246 374900 372816 371546 370615 369125 366843 364068 360843 357031
53586 357031 353079 350024 348546 348375 348685 348802 348400 347376 345863 344307 343343 343370 344160 344838 344450 342809 340783
53569 340783 339548 339571 340572 342354 345184 349056 353174 356709 359765 362978 366391 369541 372777 377514 384630
53554 384630 393080 400554 405201 406496 405098 402705 401626 403519 408221 414248 420460 426821 433603 440560
53540D40560O595N915N132M230L433L283M098N529O793P279P030O714O965P584
53526E21140P562O164L868J975J326J581J772J412Q60O48O49K93m23n50P59L061
53510E52097M911N267M349L189K623K606K287J060k91j11J966M055M273L301L449
53495E95031N369P265P525O656O059O270P071Q184R008Q632P015N356M564M263
53481F88268M024M497O224Q253R193R017Q707Q690Q854R427J0489J1105J0339
53468G97087R013R034J1067J3909J6052J6800J6113J4652J3919J5012J7150J8543
53456I68351J8757J8977J9969K1085K1525K1361K1066K1131K2265K4620K6764
53445A205871K6947K5730K5764K8291L1534L3297L3588L3630L3852L4283L5560
$$ plain form
53540 440560 447155 453070 458202 462432 465865 469148 473246 478775 485568 492847 499877 506591 513556 521140
53526 521140 528702 534866 538734 540709 542035 543616 545388 546800 547660 548308 548957 549250 548827 548277 549036 552097
53510 552097 557008 562275 566624 569813 572436 575042 577329 578389 578098 577987 579953 584008 588281 591582 595031
53495 595031 600400 607665 615190 621846 627905 634175 641246 649430 658438 667070 674085 679441 684005 688268
53481 688268 692292 696789 703013 711266 720459 729476 738183 746873 755727 765154 775643 786748 797087
53468 797087 806100 815134 826201 840110 856162 872962 889075 903727 917646 932658 949808 968351
53456 968351 987108 1006085 1026054 1047139 1068664 1090025 1111091 1132222 1154487 1179107 1205871
53445 1205871 1232818 1258548 1284312 1312603 1344137 1377434 1411022 1444652 1478504 1512787 1548347
53434A548347L7886L9814L9720L7974L6211L5076L4117L3426L3652L4548L5089
53423A945860L5107L5378L5912L5633L4160L2658L2259L2563L2378L1202K9495
53412B312605K7963K7084K6968K7227K7182K6219K3930K0164J5539J1562R425
53401B555868Q678P772N832L156K53k538m605n636o786r755j4240j7723j8748
53388B501528j8904k0421k3004k4708k4997k5070k5530k5751k5724k6793k9631
53377B230995l2690l3554l1435k7871k5271k4977k6177k6597k4705k1271j8182
53366A938265j6039j3933j1454r454q375p319n689m551m917n591m322q76K506
53353A848251L923L850M076N566P935J0388J2600J4812J7380K0148K2500K4220
$$ plain form
53434 1548347 1586233 1626047 1665767 1703741 1739952 1775028 1809145 1842571 1876223 1910771 1945860
53423 1945860 1980967 2016345 2052257 2087890 2122050 2154708 2186967 2219530 2251908 2283110 2312605
53412 2312605 2340568 2367652 2394620 2421847 2449029 2475248 2499178 2519342 2534881 2546443 2555868
53401 2555868 2564546 2572318 2578150 2581306 2581559 2579021 2574416 2568780 2561994 2552239 2537999 2520276 2501528
53388 2501528 2482624 2462203 2439199 2414491 2389494 2364424 2338894 2313143 2287419 2260626 2230995
53377 2230995 2198305 2164751 2133316 2105445 2080174 2055197 2029020 2002423 1977718 1956447 1938265
53366 1938265 1922226 1908293 1896839 1887385 1879010 1871691 1866002 1861451 1856534 1850943 1846621 1845745 1848251
53353 1848251 1852174 1856024 1860100 1865666 1873601 1883989 1896589 1911401 1928781 1948929 1971429 1995649
53341A995649K5955K8189L0284L1391L2124L4077L7587M1152M3477M5044M6994
53330B391923M9509N2121N4774N7571O0070O1849O3295O4770O5514O4667O3193
53319C049256O3197O5089O6751O6159O3702O1173N9407N7905N6090N3736N0450
53308C712915M5848M0372L5064L0376K5865K1187J6715J2828R146M824o70p247
53296C947223j4227k0675k6109l1072l6283m1148m4065m4773m5395m8045n2099
53285C543332n5083n5851n5447n4996n4495n3903n3707n3611n2234m9278m6667
53274B958060m6096m6543m5815m3796m2274m1950m1575m0213l8490l7189l6029
53263B498090l4464l2436k9833k6464k3158k1476k1552k1469j9763j7426j6278
$$ plain form
53341 1995649 2021604 2049793 2080077 2111468 2143592 2177669 2215256 2256408 2299885 2344929 2391923
53330 2391923 2441432 2493553 2548327 2605898 2665968 2727817 2791112 2855882 2921396 2986063 3049256
53319 3049256 3112453 3177542 3244293 3310452 3374154 3435327 3494734 3552639 3608729 3662465 3712915
53308 3712915 3758763 3799135 3834199 3864575 3890440 3911627 3928342 3941170 3950316 3955140 3954470 3947223
53296 3947223 3932996 3912321 3886212 3855140 3818857 3777709 3733644 3688871 3643476 3595431 3543332
53285 3543332 3488249 3432398 3376951 3321955 3267460 3213557 3159850 3106239 3054005 3004727 2958060
53274 2958060 2911964 2865421 2819606 2775810 2733536 2691586 2650011 2609798 2571308 2534119 2498090
53263 2498090 2463626 2431190 2401357 2374893 2351735 2330259 2308707 2287238 2267475 2250049 2233771
53252B233771j6355j6319j5729j5425j5914j6628j6797j6121j4643j2728j1002
53241B066110r558p609m627j501M17J057J521K549M106O227R036J2042J4459J6288
53227B110517J8098J9869K1196K2462K4427K6655K7841K8128K9357L2287L4902
53216B395739L4718L1780K8319K6174K5529K5566K5132K3178J9539J5281J1621
53205B662576Q651N631K201j277m239o325p601q864j1126j4285j6964j8358j9548
53192B570472k1962k5086k7075k7320k7096k7680k9027l0528l1832l2506l2036
53181B258324l0626k9224k8236k7072k5389k3839k2968k2232k1067k0145k0376
53170A987150k1108k0566j8187j5451j4089j4270j4951j5351j5438j5279j4492
$$ plain form
53252 2233771 2217416 2201097 2185368 2169943 2154029 2137401 2120604 2104483 2089840 2077112 2066110
53241 2066110 2056552 2048943 2044316 2042815 2043232 2044289 2045810 2048359 2052465 2058692 2067728 2079770 2094229 2110517
53227 2110517 2128615 2148484 2169680 2192142 2216569 2243224 2271065 2299193 2328550 2360837 2395739
53216 2395739 2430457 2462237 2490556 2516730 2542259 2567825 2592957 2616135 2635674 2650955 2662576
53205 2662576 2671227 2676858 2679059 2677782 2673543 2667218 2659617 2650753 2639627 2625342 2608378 2590020 2570472
53192 2570472 2548510 2523424 2496349 2469029 2441933 2414253 2385226 2354698 2322866 2290360 2258324
53181 2258324 2227698 2198474 2170238 2143166 2117777 2093938 2070970 2048738 2027671 2007526 1987150
53170 1987150 1966042 1945476 1927289 1911838 1897749 1883479 1868528 1853177 1837739 1822460 1807968
53159A807968j2623r907p477o503p101q302r243r967j0813j1450j1304j0749j1017
53146A681512j2750j5198j7142j8174j8708j9217j9748j9995j9603j8625j7723
53135A484629j7607j8206j8883j9417k0025k0371j9652j8232j8070k0355k3499
53124A270312k4842k3932k2677k2451k2697k2617k2564k2927k3034k2295k1442
53113A018834k1458k1914k1593k0358j9260j8930j8975j8887j8576j7868j6503
53102H04512j4933j4232j4747j5489j5385j4659j4401j4986j5505j4747j2482
53091F42946r698p721p177p657q335q744q902q977r091r333r592r425q507p242
53077E22545o513o598o767o260n421n355o369p263o536m240k152j960l543n281
$$ plain form
53159 1807968 1795345 1785438 1777961 1771458 1764357 1756055 1746812 1736845 1726032 1714582 1703278 1692529 1681512
53146 1681512 1668762 1653564 1636422 1618248 1599540 1580323 1560575 1540580 1520977 1502352 1484629
53135 1484629 1467022 1448816 1429933 1410516 1390491 1370120 1350468 1332236 1314166 1293811 1270312
53124 1270312 1245470 1221538 1198861 1176410 1153713 1131096 1108532 1085605 1062571 1040276 1018834
53113 1018834 997376 975462 953869 933511 914251 895321 876346 857459 838883 821015 804512
53102 804512 789579 775347 760600 745111 729726 715067 700666 685680 670175 655428 642946
53091 642946 633248 625527 618350 610693 602358 593614 584712 575735 566644 557311 547719 538294 529787 522545
53077 522545 516032 509434 502667 496407 490986 485631 479262 471999 465463 461223 459071 457111 453568 448287
53063D48287n818n186m304l912m037m075l287j578J73R15N25l13j189k089k471
53048D11641j356J070K938K630O87r85j145J31K109L637L511J752J33J82J143
53033D28078J194J53p27j294k645m562n163l963l156m395o086n778l945l143m154
53018C80414n284n437n568o467p007n815l552k242k843m465n699n892n185m026
53004C10932k903k175j901j882j883j783j569j254q72n22m73j050k261l524m071
52989B82809l715l102k964l263l307k686j772j086n55J78Q70P10n80k106k634
52974B56797j711J13J749K084P57j094j573k65R54K73j466j961q24m1q69k084
52958B50839k121j353r33o11P21K789L829K709J12k359l462k833j099M09Q48O90
$$ plain form
53063 448287 442469 437283 432979 429067 425030 420955 417668 416090 416263 417178 417703 417390 416201 414112 411641
53048 411641 410285 411355 414293 416923 417610 416625 415480 415611 417720 421357 424868 426620 426753 426935 428078
53033 428078 429272 429425 428698 427404 424759 420197 415034 411071 407915 403520 397434 391656 387711 384568 380414
53018 380414 375130 369693 364125 357658 350651 344836 341284 339042 336199 331734 326035 320143 314958 310932
53004 310932 308029 305854 303953 302071 300188 298405 296836 295582 294710 294188 293715 292665 290404 286880 282809
52989 282809 279094 275992 273028 269765 266458 263772 262000 260914 260359 260537 261407 262117 261537 259431 256797
52974 256797 255086 255199 256948 259032 259789 258695 257122 256857 257811 258084 256618 254657 253833 253792 252923 250839
52958 250839 248718 247365 246432 245821 246542 249331 253160 255869 255981 253622 250160 247327 246228 246637 247485 248175
52942B48175Q24J112P57p3j64J002K484L186L092K686J987Q40m01j113j033j68
52926B63193J419L096L425J428j869l996l491j263P23J599J894K086J733L69j352
52911B68994j982q08J355K925L014K203J991L379N800P573P640O622N801N452
52897C19959M973M392M567N615O397O277O233P083P613O103L236J671K458L665
52883C90242L191J453J81k42p80j784k525k585k472k601k683k419k033j826j807
52868C71310k015k597l281l317k367j059l04m72j381k518k949j894k8N62j247
52853C46443l785m376k726j137j143j560n60J557K872K396Q46o68j604j685q11
52838C34059N06J362J471J419J718K128K129J665J135R19R96Q74Nj407k186j272
$$ plain form
52942 248175 248999 250111 250868 250795 250631 251633 254117 257303 260395 263081 265068 265908 265507 264394 263361 263193
52926 263193 264612 267708 271133 272561 270692 266696 263205 261942 262665 264264 266158 268244 269977 270346 268994
52911 268994 267012 266204 267559 270484 273498 275701 277692 281071 286871 294444 302084 308706 314507 319959
52897 319959 324932 329324 333891 339506 345903 352180 358413 365496 373109 379212 382448 384119 386577 390242
52883 390242 393433 394886 395067 394825 394045 392261 389736 387151 384679 382078 379395 376976 374943 373117 371310
52868 371310 369295 366698 363417 360100 357733 356674 356370 355898 354517 351999 349050 347156 347128 347690 346443
52853 346443 342658 338282 335556 334419 333276 331716 331156 332713 335585 337981 338827 338159 336555 334870 334059
52838 334059 334565 335927 337398 338817 340535 342663 344792 346457 347592 348511 349507 350381 350386 348979 346793 345521
52822C45521Q88K611K725J593M21L2N02J469K302K367J482J75o68n37L04J051
52806C62238J124P72O74Q73O40k34p21J53J709K310J521O46R93K383L560L428
52790C82069J779m87j760r49J336L300L738K965K171K393L808N366N472L905K574
52775D17680L303N325O366N781M814M025K662Q65R6N60M61j044k340k269k289
52760D43996l800n240m376k039q76j398k072k618m235o493p064n322l609l817
52746C91037m801m595l437k999l707m544m981n591o713p484o665m168j501m87
52732C29364j448k944l531l227k802k380j738j451k425m333n735n798m970l933
52718B82649k882j908j090k53N23K61j798m552n895n265m013l084j988m86L73
$$ plain form
52822 345521 346409 349020 351745 353338 353759 353791 354293 355762 358064 360431 361913 362088 361420 360883 361187 362238
52806 362238 363362 364134 364808 365681 366321 366087 365366 365519 367228 369538 371059 371705 372698 375081 378641 382069
52790 382069 383848 383361 381601 380652 381988 385288 389026 391991 394162 396555 400363 405729 411201 415106 417680
52775 417680 420983 426308 432674 438455 443269 447294 449956 450821 450917 451477 451938 450894 448554 446285 443996
52760 443996 440196 434956 430580 428541 427665 426267 424195 421577 417342 410849 403785 398463 394854 391037
52746 391037 386236 381641 378204 375205 371498 366954 361973 356382 349669 342185 335520 331352 329851 329364
52732 329364 327916 324972 321441 318214 315412 313032 311294 309843 307418 303085 297350 291552 286582 282649
52718 282649 279767 277859 276769 276516 277039 277300 275502 270950 265055 259790 255777 252693 250705 250219 250592
52703B50592p6q10o14J72N20M07M18K98p36k428l442l034k039j911l146m822n544
52686B23805m827l467k502k075j676j219j099j364j579j604j762k149k472k606
52672A93404k600k197j150o3R0o66j294j175o41p4M43N37j48r35q06k57q70k646
52654A78952l499k207k19N29O6n67j228k075k243r22R20J588R98N01O69P34J58
52637A72155m83l54P45K312L392L125J730O01Q40K058L262M230N160N683N263
52622B09719M189L170K328J450P82O35O60M37K74M02J14j108k150j614k52l49
52606B18687k503m631m685l035j521j088j230j178r32j175k357l840m299l280
52592A82933j941j620k069j914n90J022J742J149l56j829k397k205k407l560m572
$$ plain form
52703 250592 250516 249706 249092 249264 249784 250191 250609 250907 250171 247743 244301 241267 239228 237317 234171 229349 223805
52686 223805 218978 215511 213009 210934 209258 208039 206940 205576 203997 202393 200631 198482 196010 193404
52672 193404 190804 188607 187457 187394 187484 186818 185524 184349 183708 183634 184077 184614 184466 183531 182725 182468 181598 178952
52654 178952 175453 173246 173027 173556 173622 173055 171827 169752 167509 166587 167507 169095 170093 170594 171263 171997 172155
52637 172155 171672 171318 172063 174375 177767 180892 182622 183223 184063 186121 189383 193613 198773 204456 209719
52622 209719 213908 217078 219406 220856 221638 222273 222933 223370 223644 224046 224160 223052 220902 219288 219036 218687
52606 218687 216184 211553 206868 203833 202312 201224 199994 198816 197884 196709 194352 190512 186213 182933
52592 182933 180992 179372 177303 175389 174799 175821 177563 178712 178356 176527 174130 171925 169518 165958 161386
52577A61386m113k451q02N81K282M101N043M800L824K123m50k816l363k287j492
52562A66366j780j844p04O33R49P25J038J696J739J031J92l84n64j90M01K67q42
52545A68729j756j353j67M75L36K70P19J262J465J292P93J59p2L72Q77O83R5J65
52527A74344J125J923J507R1j088r70M03J992K724K532K225K316K448K223J970
52512A95765K067K058J239m6o39p2Q77J382J516J764K128K272K172K073J947J495
52496B17998P56K95N43J175J413Q81o6p53o99J49J305J926J585R46J122K182K955
52479B33713K639J797J305J172J233K082M005N612N228L364K125K061J496m56
52465B67376k097j436J084L489M733M927M083K281N60N8L53P9r14j275k40J245
$$ plain form
52577 161386 157273 154822 154020 154601 156883 160984 166027 170827 174651 176774 176324 173508 170145 167858 166366
52562 166366 164586 162742 162038 162671 163620 164345 165383 167079 168818 169849 170041 169657 169093 168903 169304 169571 168729
52545 168729 166973 165620 165453 165928 166264 166534 167253 168515 169980 171272 172065 172224 172152 172524 173401 174084 174179 174344
52527 174344 175469 177392 178899 178990 177902 176932 177335 179327 182051 184583 186808 189124 191572 193795 195765
52512 195765 197832 199890 201129 201083 200444 200372 201249 202631 204147 205911 208039 210311 212483 214556 216503 217998
52496 217998 218754 219049 219592 220767 222180 223061 222995 222242 221543 221692 222997 224923 226508 227454 228576 230758 233713
52479 233713 236352 238149 239454 240626 241859 243941 247946 253558 258786 262150 264275 266336 267832 267376
52465 267376 265279 263843 264927 268416 273149 278076 282159 284440 285000 285058 285411 285490 284576 283301 283061 284306
52449B84306J847J284Qj623l211l972l288j452N32J778K035J609J011N12m1q82
52433B80453j774k067j410k26P02J065J308J931K626K423R85o43j155o26k28l17
52417B83047Q9J490K686K311Q26j26Q0O31P80O64O39P52J047J514J689J148M48
52400B99715O08J548K021J444P19P68J294J687K171L069L630K890J318M23P49
52385C24054J272J060N20O44J579K584L070L204L465L863L761K677J202P18J684
52370C55357K673J913l22j803j166L20N14q02j845j256M73K016K709K674K175
52355C63630J337L57m29o10L5J148J813J549J111J591K679K838J500R1J31J334
52339C80105K385K852L154L236K650J717J336J608J856J895K097K141J265l3j43
$$ plain form
52449 284306 286153 287437 287445 285822 282611 278639 275351 273899 274431 276209 278244 279853 280864 281376 281335 280453
52433 280453 278679 276612 275202 274976 275678 276743 278051 279982 282608 285031 286016 285373 284218 283592 283364 283047
52417 283047 283136 284626 287312 289623 290449 290323 290403 291034 291814 292478 293117 293869 294916 296430 298119 299267 299715
52400 299715 300323 301871 303892 305336 306055 306823 308117 309804 311975 315044 318674 321564 322882 323305 324054
52385 324054 325326 326386 326906 327550 329129 331713 334783 337987 341452 345315 349076 351753 352955 353673 355357
52370 355357 358030 359943 359621 357818 356652 356972 357486 356684 354839 353583 354056 356072 358781 361455 363630
52355 363630 364967 365324 364895 364285 364320 365468 367281 368830 369941 371532 374211 377049 378549 378640 378771 380105
52339 380105 382490 385342 388496 391732 394382 396099 397435 399043 400899 402794 404891 407032 408297 408264 408121
52324D08121J056J360p70l694m509k719n00K90j31o11n45o6M09M72K25M39J599
52307D00426K961L325K625J904J786J942K053K312K667K572J866J209J168J526
52293D30342J923K527L581M740N395N299M581L562K883L242M569N864O356O387
52279D91251O648P026O845O058N412N462O096P022Q123R124R465Q807P406N769
52265E90514M267L301L493N133P501R166R358Q667Q284Q689R581J0785J2497J4451
52251G05687J5695J5776J5642J6511J8191J9346J9306J8694J8331J8618K0068
52240I01865K3091K6601K8196K6938K5054K5555K8552L1459L2566L2773L3575
52229A216225L4866L5634L5579L5003L3861L2075L0350K9565K9451K8874K7421
$$ plain form
52324 408121 409177 410537 409767 406073 401564 398845 398345 398635 398504 397893 397348 397282 397691 398163 398388 398827 400426
52307 400426 403387 406712 409337 411241 413027 414969 417022 419334 422001 424573 426439 427648 428816 430342
52293 430342 432265 434792 438373 443113 448508 453807 458388 461950 464833 468075 472644 478508 484864 491251
52279 491251 497899 504925 511770 517828 523240 528702 534798 541820 549943 559067 568532 577339 584745 590514
52265 590514 594781 598082 601575 606708 614209 623375 632733 641400 649684 658373 667954 678739 691236 705687
52251 705687 721382 737158 752800 769311 787502 806848 826154 844848 863179 881797 901865
52240 901865 924956 951557 979753 1006691 1031745 1057300 1085852 1117311 1149877 1182650 1216225
52229 1216225 1251091 1286725 1322304 1357307 1391168 1423243 1453593 1483158 1512609 1541483 1568904
52218A568904K5863K4944K4483K3971K3237K2034J9678J5937J1923R280Q356P883
52206A786493O626M734L121K036R61l11j251j376q91k19O09J619K379K445K187
52191A809162K642M387O905R094J0051R573Q450Q289J0281J3874J7260J9362K0728
52178A950058K2136K3337K3838K4062K4557K4609K3001K0071J7719J7052J7129
52167B187569J6429J4547J1911Q789N365K177l26k286m025n575p109r228j2087
52154B206151j4748j6266j7118j8586k0971k3268k4597k5096k5202k4956k4340
52143A971003k3759k3648k3822k3550k2256k0087j7895j6564j6238j6319j6238
52132A750627j5875j5079j3403j0937q801p963p889p320o186n691o417p419p563
$$ plain form
52218 1568904 1594767 1619711 1644194 1668165 1691402 1713436 1733114 1749051 1760974 1770254 1778610 1786493
52206 1786493 1793119 1797853 1800974 1803010 1803971 1803660 1802409 1801033 1800142 1799923 1800532 1802151 1804530 1806975 1809162
52191 1809162 1811804 1816191 1823096 1832190 1842241 1851814 1860264 1868553 1878834 1892708 1909968 1929330 1950058
52178 1950058 1972194 1995531 2019369 2043431 2067988 2092597 2115598 2135669 2153388 2170440 2187569
52167 2187569 2203998 2218545 2230456 2239245 2244610 2246787 2246461 2244175 2240150 2234575 2227466 2218238 2206151
52154 2206151 2191403 2175137 2158019 2139433 2118462 2095194 2070597 2045501 2020299 1995343 1971003
52143 1971003 1947244 1923596 1899774 1876224 1853968 1833881 1815986 1799422 1783184 1766865 1750627
52132 1750627 1734752 1719673 1706270 1695333 1686532 1678569 1670680 1663360 1657174 1651483 1645066 1637647 1630084
52119A630084o861n933m942l792k931l171m658o360o810n458l371k352l039m311
52105A566095m970n381o440p564p321n972n524o667p444o104l840l126m323n642
52091A485777n860n396m803l907k695j811j665j917k189k534k976l232l164k941
52077A440687k641k237j968k087k302k185k070k621l438l146j269R72K193K307
52063A420195J893J046k45j311j381o50J39R26K350M606O977Q564Q972Q484Q017
52048A468582Q679J0729J3156J4951J6485J8748K1563K3750K5067K6568K8595
52037A676873K9905K9745K9558L1190L4158L6254L6617L6691L7901L9747M0618
52026B059257L9619L7017L3680L0577K8271K6535K4882K3412K2376K0913J7460
$$ plain form
52119 1630084 1623223 1617290 1612348 1608556 1605625 1602454 1597796 1591436 1584626 1579168 1575797 1573445 1570406 1566095
52105 1566095 1561125 1555744 1549304 1541740 1534419 1528447 1522923 1516256 1508812 1502708 1498868 1495742 1491419 1485777
52091 1485777 1479917 1474521 1469718 1465811 1463116 1461305 1459640 1457723 1455534 1453000 1450024 1446792 1443628 1440687
52077 1440687 1438046 1435809 1433841 1431754 1429452 1427267 1425197 1422576 1419138 1415992 1414723 1415695 1417888 1420195
52063 1420195 1422088 1423134 1422889 1421578 1420197 1419547 1419686 1420612 1422962 1427568 1434545 1443109 1452081 1460565 1468582
52048 1468582 1477261 1487990 1501146 1516097 1532582 1551330 1572893 1596643 1621710 1648278 1676873
52037 1676873 1706778 1736523 1766081 1797271 1831429 1867683 1904300 1940991 1978892 2018639 2059257
52026 2059257 2098876 2135893 2169573 2200150 2228421 2254956 2279838 2303250 2325626 2346539 2363999
52015B363999J1915O293K514M51j136k827m706p197j0323j2735j3107j2189j2092
52002B308860j3626j5565j6492j6192j5252j4498j4730j5786j5995j3879j0351
51991B146494p664o262m467j553R81K075L009N273Q133R876J0298J0325J0169
51978B186687R570R183J0009J1682J2719J2352J1028R401P876O774N834L951O57
51965B297723k585l875l454l423n121q021j1188j4222j6753j8531k0358k3384
51953B166808k7001k8825k7749k5778k5791k8292l1401l3498l4766l6121l7595
51942A829991l8277l7696l6829l7233l9033m0416l9716l7432l5259l3664l1910
51931A422526l0261l0355l2768l5621l6715l5987l4796l3684l2177l0262k8668
$$ plain form
52015 2363999 2375914 2382207 2384721 2385172 2384036 2381209 2376503 2369306 2358983 2346248 2333141 2320952 2308860
52002 2308860 2295234 2279669 2263177 2246985 2231733 2217235 2202505 2186719 2170724 2156845 2146494
51991 2146494 2138830 2132568 2128101 2126548 2127529 2129604 2132613 2137886 2146019 2155895 2166193 2176518 2186687
51978 2186687 2196257 2205440 2215449 2227131 2239850 2252202 2263230 2272631 2280507 2287281 2293115 2297066 2297723
51965 2297723 2295138 2291263 2287809 2284386 2279265 2271244 2260056 2245834 2229081 2210550 2190192 2166808
51953 2166808 2139807 2110982 2083233 2057455 2031664 2003372 1971971 1938473 1903707 1867586 1829991
51942 1829991 1791714 1754018 1717189 1679956 1640923 1600507 1560791 1523359 1488100 1454436 1422526
51931 1422526 1392265 1361910 1329142 1293521 1256806 1220819 1186023 1152339 1120162 1089900 1061232
51920A061232k7688k6901k6216k6168k6778k6925k5508k2849k0364j8950j8165
51909G94720j7063j5466j4101j3659j3987j4245j3624j1914r680q009p776q856
51897F46340j0218j0867j0559r608q483p764p858q404q554q214q282r068r355
51884E29106q064o077n177n566n958n909o371p631q357p453n651m323l688l063
51870D45818k233j658j710k339l183l581k965j749j220k093l631m592m509l552
51856D06803j914j02P68r2k094l944n056n651n789n278m517m414n012m886k760
51841C56062N26K367J169j652l029j708M62J002j75j204j183j142k002l033l116
51826C43344k467k106k232k106j238N1J139J548J183N18K57L30k25j846l369l306
$$ plain form
51920 1061232 1033544 1006643 980427 954259 927481 900556 875048 852199 831835 812885 794720
51909 794720 777657 762191 748090 734431 720444 706199 692575 680661 670981 662972 655196 646340
51897 646340 636122 625255 614696 605088 596605 588841 580983 572579 564025 555811 547529 538461 529106
51884 529106 521042 514965 509788 504222 498264 492355 485984 478353 469996 462543 456892 452569 448881 445818
51870 445818 443585 441927 440217 437878 434695 431114 428149 426400 425180 423087 419456 414864 410355 406803
51856 406803 404889 404787 405555 405463 403369 399425 394369 388718 382929 377651 373134 368720 363708 358822 356062
51841 356062 356588 358955 360124 358472 355443 353735 354197 355199 355024 353820 352637 351495 349493 346460 343344
51826 343344 340877 338771 336539 334433 333195 333246 334385 335933 337116 337634 337891 338221 337996 336150 332781 329475
51810C29475j917r88j511k521k442r61R61K320K838K701K169J566J272J443J727
51795C36132J529O80l19p81m12P44K473M144M754L866K379J594J645J540Q16J28
51779C60912K7O3l17p77o57o1L13J83j33l40n24p43p16p7R51J308k1k552m258
51760C52581l631j392N26J194R60Q0j369k376j593N49J905J431M53M63J159J602
51744C52542J844K168J980Q27m32p57m34l05k79J01N28N46N27Q06P81J13j37Q72
51726C61291K013J784P75N81R68L25j465k783k729j787k08J995L476K425m38k064
51710C64159r88R93J867K011K590L287L203K640K535L000L508L701L275J988M54
51695C98223j47K13L17j15K58K026L655L760L112K954K858K136J931L771O751
$$ plain form
51810 329475 327558 326570 325059 322538 320096 319135 320096 322416 325254 327955 330124 331690 332962 334405 336132
51795 336132 337661 338341 338022 337241 336829 337573 340046 344190 348944 352810 355189 356783 358428 359968 360784 360912
51779 360912 360939 361002 360685 359908 359251 359190 359503 359686 359553 359213 358689 357946 357230 357153 358104 359412 359391 356839 352581
51760 352581 348950 347558 348084 349278 350238 350318 348949 346573 344980 345529 347434 348865 349318 349781 350940 352542
51744 352542 354386 356554 358534 359361 358929 358172 357738 357433 357154 357255 357783 358329 358856 359662 360443 360556 360419 361291
51726 361291 363304 365088 365863 366444 367412 367737 366272 363489 360760 358973 358765 360760 364236 366661 366223 364159
51710 364159 363171 364164 366031 368042 370632 373919 377122 379762 382297 385297 388805 392506 395781 397769 398223
51695 398223 398076 398289 398606 398491 398749 400775 404430 408190 411302 414256 417114 419250 421181 424952 431703
51680D31703Q334P496N406L472K482L095N188P022O984O011O278P773Q387P503
51666E17134P004Q124R671J0370J0822J1660J1736R844O957M931M026L346K797
51653F18422K821K800J621l67j677j853j644j109N02K566K738m2l527m489k350
51638F14412O78K537L117L338L614L641L109K265J851K365L330L696L273L143
51624F54369L992M699L732J683J089L345O828Q647P518M324O61k424m599o033
51610F87831o992p352o734n381m363m371m727m332l267k658k973l238k224M8K194
51595F31461K679J293m78p42P46K217J947K29j397k322l268m702o073o855p310
51580F07425p761p946p626p140o864o679o469o600p416q624r589r935r549q502
$$ plain form
51680 431703 440037 447533 452939 456411 458893 461988 467176 474198 481182 487193 493471 501244 509631 517134
51666 517134 524138 532262 541933 552303 563125 574785 586521 596365 603322 608253 612279 615625 618422
51653 618422 621243 624043 625664 625297 623620 621767 620123 619014 619516 622082 624820 624778 621251 616762 614412
51638 614412 615090 617627 620744 624082 627696 631337 634446 636711 638562 640927 644257 647953 651226 654369
51624 654369 658361 663060 666792 668475 669564 672909 679737 688384 695902 700226 700887 698463 693864 687831
51610 687831 680839 673487 666753 661372 657009 652638 647911 643579 640312 637654 634681 631443 629219 629267 631461
51595 631461 634140 635433 634955 634213 634959 637176 639123 639352 637955 635633 632365 627663 621590 614735 607425
51580 607425 599664 591718 584092 576952 570088 563409 556940 550340 542924 534300 524711 514776 505227 496725
51566D96725p290o610o548o445n983n709n956o030n271m286m091m417m044k698
51552D21347j461j206j621k051k312k292j705q01n59j495k786l263k789k073j538
51537C93395j158j023j268j540j326p10p6P08J880K733K228Q55M02J399K163J495
51521D00157R31K629N937Q095Q017P315P388P578O952O085N844N793N124M085
51507D81930L236K212O00q23j160j082j905l482m596n101n954p103p192n600l313
51492D40667j373Q1Q37K69j296k176j233Q45K766M100M797M461L206K298K865
51477D61114M559O302P591Q165P440N452L694L460L931L251J301j13J58J201J538
51462E19044Q30k84j152j460j296j245j828k662k743j784o09j3J36L61P52J102
$$ plain form
51566 496725 489435 482825 476277 469832 463849 458140 452184 446154 440883 436597 432506 428089 424045 421347
51552 421347 419886 418680 417059 415008 412696 410404 408699 407898 407339 405844 403058 399795 397006 394933 393395
51537 393395 392237 391214 389946 388406 387080 386370 386294 387002 388882 391615 393843 394698 395100 396499 398662 400157
51521 400157 401088 403717 409654 417749 425766 433081 440469 448047 454999 461084 466928 472721 477845 481930
51507 481930 485166 487378 487978 487155 485995 484913 483008 479526 474930 469829 463875 456772 449580 443980 440667
51492 440667 439294 439375 440212 440481 439185 437009 435776 436621 439387 443487 448284 452745 455951 458249 461114
51477 461114 465673 471975 479566 487731 495171 500623 504317 507777 511708 514959 516260 516147 516305 517506 519044
51462 519044 519874 519590 518438 516978 515682 514437 512609 509947 507204 505420 504811 504798 504934 505295 506047 507149
51446E07149J404J871K702L954N287N813M771K587O70j81n60j378k567l414l565
51431E24543l132k155q53o6o08k121l386l808l779l503k470o83N59O5j503k391
51415D94709j894p46M47J826L101L302K411K107L653N932O923O441O038O403O645
51400E47298O211N885O303O919P264P924R266J0183R468P749O891P713R310J0435
51386F58819J0540R661Q154O574N124L386J188o42j303j376j961k707k123q3J551
51371F94802J393L26r2J53P5l10m9J054K045K263K071J939J801J515J162N55o84
51354G10019k191k921k698k809m186n828o241n837o415q313r774r541q588q348
51340F26329q557q121p224o997p472p399o198m851m470m978n548n507m484k488
$$ plain form
51446 507149 508553 510424 513126 517080 522367 528180 532951 535538 536208 536027 535467 534089 531522 528108 524543
51431 524543 521411 519256 518403 518337 517729 515608 512222 508414 504635 501132 498662 497979 498538 498603 497100 494709
51415 494709 492815 492069 492516 494342 497443 500745 503156 505263 508916 514848 521771 528212 534250 540653 547298
51400 547298 553509 559394 565697 572616 579880 587804 597070 607253 616721 624470 631361 639074 648384 658819
51386 658819 669359 679020 687174 693748 698872 702258 703446 702804 701501 700125 698164 695457 693334 693251 694802
51371 694802 696195 696521 696429 696582 696657 696347 696298 697352 699397 701660 703731 705670 707471 708986 710148 710703 710019
51354 710019 707828 704907 702209 699400 695214 689386 683145 677308 670893 662580 652806 643265 634677 626329
51340 626329 617772 609651 602427 595430 587958 580559 574361 569510 565040 560062 554514 549007 544523 542035
51326E42035k88Q90N79l93r65r03n66j30M96J332K182K495J447j220m275n772
51310E36944n286m608n502p468q620q365q112r163j0841j1376j0234q869q909
51297D29591j0067j0502r310p679p002o771n588l721l033m246n955o753o828o719
51283C35417o044m554l190k725k456j542p36j205k407k811k248j785j661j140
51269C00913l44l76j347k035j903j763j834r08J415L189K351k77j847j042N11
51254B94703O18p88j741n67K322M923N691M907M060M120M814N259M842L631K542
51239C39336K964N294P856Q239O091L744L426M553M671K610k86k014k146j805
51225C82533k012k698l379m168n599p602r250r767r308q365o904m754k445r68
$$ plain form
51326 542035 541747 542637 543216 542823 541858 540955 540389 540259 540755 542087 544269 546764 548211 546991 542716 536944
51310 536944 531658 527050 521548 514080 505460 497095 488983 479820 468979 457603 447369 438500 429591
51297 429591 419524 409022 399712 392033 385031 378260 372672 368951 365918 361672 355717 348964 342136 335417
51283 335417 329373 324819 321629 318904 316448 314906 314170 312965 310558 307747 305499 303714 302053 300913
51269 300913 300569 300193 298846 296811 294908 293145 291311 290403 291818 295007 297358 297081 295234 294192 294703
51254 294703 295321 294533 292792 292225 294547 299470 305161 310068 314128 318248 323062 328321 333163 336794 339336
51239 339336 342300 347594 355450 363689 369780 373524 376950 381503 386174 388784 388498 386484 384338 382533
51225 382533 380521 377823 374444 370276 364677 357075 347825 338058 328750 320385 313481 308727 306282 305314
51211C05314p21j378k560l970m947m840l949l275l224l269l047k833k688k086
51197B62527r07L3O4n15j226k147l076k903r89J361K156J237L02L65N49j32j032
51180B55667q37L85J061K9k082l450k736k08K494L778L524K958K974K929J595
51165B68081q70k731k640j166J17M47K49N4r3j99o3L32O61O90N15K62J7k4K46
51146B63885N57Q30J768L793N484M597J301j164k95K374L390J909K31J83J045
51131B89888J292O35l77j340j760j058L24P48o22k458k875j908j282k057l464
51116B73686m136l586k268q56J43M57J18n78j341k149l102l949l973k655n33J076
51100B46354J399J011Q74J058R76N71M10O25N55k32j255j811j856j845j996k094
$$ plain form
51211 305314 304593 303215 300655 296685 291738 286898 282949 279674 276450 273181 270134 267301 264613 262527
51197 262527 261620 261653 261717 261202 259976 257829 254753 251850 250861 252222 254378 255615 255917 256282 256831 256699 255667
51180 255667 254830 255215 256276 256305 254223 250773 248037 247829 250323 254101 257625 260583 263557 266486 268081
51165 268081 267211 264480 261840 260674 260791 261238 261487 261541 261448 261249 261186 261518 262179 262869 263384 263646 263663 263639 263885
51146 263885 264442 265272 267040 270833 276317 280914 282215 281051 280756 283130 286520 288429 288660 288843 289888
51131 289888 291180 291815 291438 290098 288338 287280 287604 288352 287730 285272 282397 280489 279207 277150 273686
51116 273686 269550 265964 263696 262840 262983 263440 263558 262980 261639 259490 256388 252439 248466 245811 245278 246354
51100 246354 247753 248764 249638 250696 251672 252243 252653 253278 253833 253601 252346 250535 248679 246834 244838 242744
51084B42744j823j121k82L03O12J065J818K245J590O3j280j783j687j377o70P51
51068B41168K540L608K954P53j347j529J93J747J372k69j043P3K316M504N861
51053B62901N724L899J543M31R34J704J628J060P80R20J373K215L087L066J826
51038B93091K20p81j039q10k92M8l63j169j182O9J697K793L299L116J708n65j972
51021B97868j375K79J378J589J462J101M25o6j9kn34j034q56m38l26O8J349K676
51003C03545K938K575K530K197M20j958k749j623n47o84r15l3J354J976J587O52
50987C11265m44j171r14N9O60O18R63K243L456L622L374L855M806N014M284L762
$$ plain form
51084 242744 240921 239800 239518 239821 240433 241498 243316 245561 247151 247214 245934 244151 242464 241087 240417 241168
51068 241168 243708 247316 250270 251023 249676 248147 248340 250087 251459 251190 250147 250220 252536 257040 262901
51053 262901 268625 272524 274067 274498 275432 277136 278764 279824 280604 281524 282897 285112 288199 291265 293091
51038 293091 293311 292530 291491 290681 290389 290437 290074 288905 287723 287792 289489 292282 295581 298697 300405 299840 297868
51021 297868 296493 296772 298150 299739 301201 302302 302727 302661 302642 302640 302106 301072 300216 299778 299452 299520 300869 303545
51003 303545 306483 309058 311588 313785 314205 312247 309498 307875 307328 306644 305729 305696 307050 309026 310613 311265
50987 311265 310821 309650 308736 308795 309455 310073 311036 313279 316735 320357 323731 327586 332392 337406 341690 345452
$$ [...]
##END NTUPLES=NMR SPECTRUM
##END=
