
##TITLE=AC1144_Santa_5874622_tngZuRgah2
##JCAMPDX= 6.0         $$ Bruker NMR JCAMP-DX V2.0
##DATA TYPE= NMR SPECTRUM
##DATA CLASS= NTUPLES
##ORIGIN= BRUKER
##OWNER= Administrator
$$ 1.72 TOPSPIN		Version 2.1
$$ 2012-03-31 18:26:30.500 -0500  Administrator@TOPSPIN
$$ Compression mode = diff/dup
##.OBSERVE FREQUENCY= 400.13188235
##.OBSERVE NUCLEUS= ^1H
##.ACQUISITION MODE= SIMULTANEOUS (DQD)
##.ACQUISITION SCHEME= undefined
##.AVERAGES= 64
##.DIGITISER RES= 22
##SPECTROMETER/DATA SYSTEM= spect
##.PULSE SEQUENCE= noesygpps1d.comp
##.SOLVENT NAME= COFFEE_meoh
##.SHIFT REFERENCE= INTERNAL, COFFEE_meoh, 1, 14.96831
##AUDIT TRAIL= $$ (NUMBER, WHEN, WHO, WHERE, PROCESS, VERSION, WHAT)
$$ ##TITLE= Audit trail, TOPSPIN		Version 2.1
$$ ##JCAMPDX= 5.01
$$ ##ORIGIN= Bruker BioSpin GmbH
$$ ##OWNER= Administrator
$$ $$ C:\Bruker\TOPSPIN/data/COFFEE/nmr/AC1144_Santa_5874622_tngZuRgah2/12/pdata/1/auditp.txt
$$ ##AUDIT TRAIL=  $$ (NUMBER, WHEN, WHO, WHERE, PROCESS, VERSION, WHAT)
(   1,<2012-03-31 18:26:25.171 -0500>,<Administrator>,<TOPSPIN>,<go>,<TOPSPIN 2.1>,
      <created by zg
	started at 2012-03-31 18:14:53.265 -0500,
	POWCHK enabled, PULCHK disabled,
       configuration hash MD5:
       1A 1E CE 29 27 FD 77 03 67 4E F0 E3 C4 B2 CB 90
       data hash MD5: 64K
       B3 D5 41 0F 1F C0 B1 B5 CB 8E FA 69 DA 19 C2 05>)
(   2,<2012-03-31 18:26:28.187 -0500>,<Administrator>,<TOPSPIN>,<proc1d>,<TOPSPIN 2.1>,
      <Start of raw data processing
       efp LB = 0.3 FT_mod = 6 PKNL = 1 PHC0 = 0 PHC1 = 0 SI = 128K 
       data hash MD5: 128K
       F4 63 74 64 A9 EA 20 0C 08 0A 71 0B BA AD 02 AA>)
(   3,<2012-03-31 18:26:29.578 -0500>,<Administrator>,<TOPSPIN>,<proc1d>,<TOPSPIN 2.1>,
      <pk PHC0 = 40.37476 PHC1 = 0 
       data hash MD5: 128K
       1F 2A A2 9B 3C 24 79 A9 AE 7E 7D B6 E3 EC 5B 42>)
(   4,<2012-03-31 18:26:30.156 -0500>,<Administrator>,<TOPSPIN>,<proc1d>,<TOPSPIN 2.1>,
      <abs ABSG = 1 
       data hash MD5: 128K
       7A 62 D5 9C 82 95 85 CF 7D 2E B6 DE DB 8B E8 72>)
(   5,<2012-03-31 18:26:30.250 -0500>,<Administrator>,<TOPSPIN>,<proc1d>,<TOPSPIN 2.1>,
      <abs ABSG = 2 
       data hash MD5: 128K
       45 DD 32 01 99 85 C2 55 0D 7A 8F D8 30 E0 A6 A6>)
(   6,<2012-03-31 18:26:30.296 -0500>,<Administrator>,<TOPSPIN>,<proc1d>,<TOPSPIN 2.1>,
      <abs ABSG = 3 
       data hash MD5: 128K
       85 33 7B 58 36 BB 89 CB 97 AF 87 8E FA F4 1D C5>)
(   7,<2012-03-31 18:26:30.359 -0500>,<Administrator>,<TOPSPIN>,<proc1d>,<TOPSPIN 2.1>,
      <abs ABSG = 4 
       data hash MD5: 128K
       AD 6F 9A 0F C3 26 05 BC 23 E3 50 AD C3 8A 4D B8>)
(   8,<2012-03-31 18:26:30.406 -0500>,<Administrator>,<TOPSPIN>,<proc1d>,<TOPSPIN 2.1>,
      <abs ABSG = 5 
       data hash MD5: 128K
       15 E1 44 39 58 57 D6 79 4E 67 CD 16 0B E5 2E 6E>)
$$ ##END=
$$ 
$$ $$ hash MD5
$$ $$ 20 4D 95 3F 9F D1 A1 1E A6 A7 3B 7F 43 55 4E 57
##$RELAX= 
##$RELAX= 
##$RELAX= 
##$RELAX= 
##$RELAX= 
##$RELAX= 
##$RELAX= 
##$RELAX= 
$$ Bruker specific parameters
$$ [...]
##$TP07= 0
##$TPNAME0= <>
##$TPNAME1= <>
##$TPNAME2= <>
##$TPNAME3= <>
##$TPNAME4= <>
##$TPNAME5= <>
##$TPNAME6= <>
##$TPNAME7= <>
##$TPOAL= (0..7)
0.5 0.5 0.5 0.5 0.5 0.5 0.5 0.5
##$TPOFFS= (0..7)
0 0 0 0 0 0 0 0
##$TUNHIN= 0
##$TUNHOUT= 0
##$TUNXOUT= 0
##$USERA1= <user>
##$USERA2= <user>
##$USERA3= <user>
##$USERA4= <user>
##$USERA5= <user>
##$V9= 5
##$VALIST= <valist>
##$VCLIST= <CCCCCCCCCCCCCCC>
##$VD= 0
##$VDLIST= <DDDDDDDDDDDDDDD>
##$VPLIST= <PPPPPPPPPPPPPPP>
##$VTLIST= <TTTTTTTTTTTTTTT>
##$WBST= 2048
##$WBSW= 25
##$XGAIN= (0..3)
0 0 0 0
##$XL= 0
##$YL= 0
##$YMAX_a= 12182584
##$YMIN_a= -6494890
##$ZGOPTNS= <>
##$ZL1= 120
##$ZL2= 120
##$ZL3= 120
##$ZL4= 120
##$ABSF1= 14.96831
##$ABSF2= -5.58422
##$ABSG= 5
##$ABSL= 3
##$ALPHA= 0
##$AQORDER= 0
##$ASSFAC= 0
##$ASSFACI= 0
##$ASSFACX= 0
##$ASSWID= 0
##$AUNMP= <proc_prof1d_extract.lims>
##$AXLEFT= 0
##$AXNAME= <>
##$AXNUC= <1H>
##$AXRIGHT= 0
##$AXTYPE= 0
##$AXUNIT= <>
##$AZFE= 0.1
##$AZFW= 0.1
##$BCFW= 0
##$BC_mod= 0
##$BYTORDP= 0
##$COROFFS= 0
##$CY= 15
##$DATMOD= 1
##$DC= 0
##$DFILT= <>
##$DTYPP= 0
##$F1P= 0
##$F2P= 0
##$FCOR= 0.5
##$FTSIZE= 131072
##$FT_mod= 6
##$GAMMA= 0
##$GB= 0
##$INTBC= 1
##$INTSCL= 1
##$ISEN= 128
##$LB= 0.3
##$LEV0= 0
##$LPBIN= 0
##$MAXI= 10000
##$MC2= 0
##$MEAN= 0
##$ME_mod= 0
##$MI= 0
##$NCOEF= 0
##$NC_proc= -3
##$NLEV= 6
##$NOISF1= 0
##$NOISF2= 0
##$NSP= 0
##$NTH_PI= 0
##$NZP= 0
##$OFFSET= 14.96831
##$PC= 1
##$PHC0= 40.37476
##$PHC1= 0
##$PH_mod= 1
##$PKNL= yes
##$PPARMOD= 0
##$PPDIAG= 0
##$PPIPTYP= 0
##$PPMPNUM= 2147483647
##$PPRESOL= 1
##$PSCAL= 4
##$PSIGN= 0
##$PYNMP= <proc.py>
##$REVERSE= no
##$SF= 400.130004921425
##$SI= 131072
##$SIGF1= 0
##$SIGF2= 0
##$SINO= 400
##$SIOLD= 131072
##$SPECTYP= <>
##$SREGLST= <1H.CDCl3>
##$SSB= 0
##$STSI= 131072
##$STSR= 0
##$SW_p= 8223.68421052632
##$SYMM= 0
##$S_DEV= 0
##$TDeff= 65536
##$TDoff= 0
##$TI= <>
##$TILT= no
##$TM1= 0
##$TM2= 0
##$TOPLEV= 0
##$USERP1= <user>
##$USERP2= <user>
##$USERP3= <user>
##$USERP4= <user>
##$USERP5= <user>
##$WDW= 1
##$XDIM= 131072
##$YMAX_p= 532853046
##$YMIN_p= -552155465
##$CURPLOT= <Network HP LaserJet P1505>
##$CURPRIN= <$Network HP LaserJet P1505>
##$DFORMAT= <normdp>
##$LAYOUT= <+/1D_H.xwp>
##$LFORMAT= <normlp>
##$PFORMAT= <normpl>
##$SURQMSG= 1
$$ End of Bruker specific parameters
$$ ---------------------------------
##NTUPLES= NMR SPECTRUM
##VAR_NAME=  FREQUENCY,     SPECTRUM/REAL,   SPECTRUM/IMAG
##SYMBOL=    X,             R,               I
##VAR_TYPE=  INDEPENDENT,   DEPENDENT,       DEPENDENT
##VAR_FORM=  AFFN,          ASDF,            ASDF
##VAR_DIM=   131072,        131072,          131072
##UNITS=     HZ,            ARBITRARY UNITS, ARBITRARY UNITS
##FACTOR=    0.0627417313425165, 1,          1
##FIRST=     8223.62146879498, -2495,        -89854
##LAST=      0,             -203,            -92062
##MIN=       0,             -552155465,      0
##MAX=       8223.62146879498, 532853046,    0
$$ Real data points
##PAGE= N=1
##DATA TABLE= (X++(R..R)), XYDATA
$$ [...]
$$ plain form
61783 2810506 2762645 2719128 2681055 2649041 2621926 2597364 2573658 2550828 2529999 2511927 2496245
61772 2496245 2482024 2468859 2457261 2448128 2442104 2439355 2439548 2441812 2445098 2448945 2453746 2459953 2467185
61759 2467185 2474590 2482010 2490308 2500496 2513071 2528448 2547425 2570674 2598126 2629471 2665041 2705436
61747 2705436 2750338 2798610 2850011 2906163 2969145 3039466 3116018 3197822 3285182 3379083 3480077
61736 3480077 3588083 3703078 3825758 3957626 4100468 4255654 4423906 4605677 4801575
61727 4801575 5012424 5239281 5483699 5747772 6033689 6343532 6679875 7046246 7446532
61718 7446532 7884166 8362557 8886368 9461836 10095732 10794172 11562116 12403348 13320996
61709 13320996 14318639 15400651 16570306 17826881 19164492 20572413 22033561 23520091
$$ packed form
61783B810506m7861m3517l8073l2014k7115k4562k3706k2830k0829j8072j5682
61772B496245j4221j3165j1598r133o024k749J93K264L286L847M801O207P232
61759B467185P405P420Q298J0188J2575J5377J8977K3249K7452L1345L5570M0395
61747B705436M4902M8272N1401N6152O2982P0321P6552Q1804Q7360R3901J00994
61736C480077J08006J14995J22680J31868J42842J55186J68252J81771J95898
61727D801575K10849K26857K44418K64073K85917L09843L36343L66371M00286
61718G446532M37634M78391N23811N75468O33896O98440P67944Q41232R17648
61709A3320996R97643J082012J169655J256575J337611J407921J461148J486530
$$ plain form
61701 23520091 24989914 26387729 27649393 28706690 29493101 29952909 30052220 29786250 29179062
61692 29179062 28277132 27140517 25834178 24420572 22954628 21481645 20037194 18647578
61684 18647578 17330386 16095577 14947403 13886599 12911951 12020628 11207730 10466318 9788755
61675 9788755 9168556 8601125 8082859 7609814 7177371 6780973 6416983 6082869 5776791
61666 5776791 5497022 5241567 5008056 4793964 4597042 4415780 4249491 4097802 3959857
61657 3959857 3833903 3717706 3609451 3508386 3414677 3328604 3249796 3177177 3109604 3046483
61647 3046483 2987701 2933042 2881841 2833248 2786657 2741787 2698405 2656193 2614963 2574865 2536074
61636 2536074 2498108 2459697 2419822 2379061 2339458 2302513 2267316 2231221 2192668 2153041 2115372
$$ packed form
61701B3520091J469823J397815J261664J057297P86411M59808R9311k65970o07188
61692B9179062r01930j136615j306339j413606j465944j472983j444451j389616
61684A8647578j317192j234809j148174j060804r74648q91323q12898p41412o77563
61675I788755o20199n67431n18266m73045m32443l96398l63990l34114l06078
61666E776791k79769k55455k33511k14092j96922j81262j66289j51689j37945
61657C959857j25954j16197j08255j01065r3709q6073p8808p2619o7573o3121
61647C046483n8782n4659n1201m8593m6591m4870m3382m2212m1230m0098l8791
61636B536074l7966l8411l9875m0761l9603l6945l5197l6095l8553l9627l7669
$$ plain form
61625 2115372 2081444 2050613 2021378 1993244 1966571 1941233 1916486 1892274 1869753 1849956 1832499
61614 1832499 1816159 1800340 1785387 1771889 1760397 1751481 1745074 1739785 1733819 1726715 1719353 1712219 1704732
61601 1704732 1696511 1688126 1680048 1672000 1664146 1657783 1653712 1650748 1647080 1642583 1638526 1635432 1632480 1628797
61587 1628797 1624019 1617772 1609884 1601265 1593387 1586699 1580592 1574992 1570796 1568446 1567133 1565857 1564386 1562955
61573 1562955 1561937 1562088 1564005 1567000 1569697 1572187 1576322 1583135 1591171 1598374 1604608 1611074 1618008 1624357
61559 1624357 1629426 1633605 1637452 1641000 1643993 1646020 1646426 1644814 1641762 1638430 1635283 1631651 1626668 1620326
61545 1620326 1613429 1606641 1599679 1591536 1581684 1570951 1560767 1551544 1542350 1532363 1521976 1512174 1503399
61532 1503399 1495459 1488053 1480937 1473990 1467505 1462012 1457595 1453907 1451079 1449930 1451079 1454751 1461707 1473034
$$ packed form
61625B115372l3928l0831k9235k8134k6673k5338k4747k4212k2521j9797j7457
61614A832499j6340j5819j4953j3498j1492q916o407n289n966p104p362p134p487
61601A704732q221q385q078q048p854o363m071k964l668m497m057l094k952l683
61587A628797m778o247p888q619p878o688o107n600m196k350j313j276j471j431
61573A562955j018J51J917K995K697K490M135O813Q036P203O234O466O934O349
61559A624357N069M179L847L548K993K027M06j612l052l332l147l632m983o342
61545A620326o897o788o962q143r852j0733j0184r223r194r987j0387r802q775
61532A503399p940p406p116o947o485n493m417l688k828j149J149L672O956J1327
$$ plain form
61518 1473034 1488194 1504555 1520154 1535995 1554287 1575226 1597359 1620656 1647251 1678832 1714870
61507 1714870 1753841 1794887 1837771 1882298 1928389 1975868 2023747 2070674 2116485 2162369 2208860
61496 2208860 2254572 2297643 2337631 2375090 2409874 2440938 2467727 2490906 2511575 2530200 2546314
61485 2546314 2558848 2566734 2569628 2568299 2564150 2558071 2549616 2537394 2520630 2500602 2480295 2462170
61473 2462170 2446257 2430746 2414387 2397955 2383478 2372573 2365689 2362508 2362766 2366783 2375271 2388594
61461 2388594 2406558 2429289 2457911 2493605 2536123 2584187 2637718 2698921 2770648 2854086 2948434
61450 2948434 3052482 3166145 3290913 3429268 3583496 3754621 3942481 4146751 4367434
61441 4367434 4604264 4856422 5123305 5404824 5699773 6003761 6309278 6607573 6889686
$$ packed form
61518A473034J5160J6361J5599J5841J8292K0939K2133K3297K6595L1581L6038
61507A714870L8971M1046M2884M4527M6091M7479M7879M6927M5811M5884M6491
61496B208860M5712M3071L9988L7459L4784L1064K6789K3179K0669J8625J6114
61485B546314J2534P886K894j329m149o079q455j2222j6764k0028k0307j8125
61473B462170j5913j5511j6359j6432j4477j0905o884l181K58M017Q488J3323
61461B388594J7964K2731K8622L5694M2518M8064N3531O1203P1727Q3438R4348
61450B948434J04048J13663J24768J38355J54228J71125J87860K04270K20683
61441D367434K36830K52158K66883K81519K94949L03988L05517K98295K82113
$$ plain form
61432 6889686 7145744 7364764 7536740 7655387 7718808 7727989 7685519 7595928 7466265 7305146
61422 7305146 7120831 6920344 6710123 6496544 6285215 6080142 5884183 5700136 5530688
61413 5530688 5377369 5240257 5119037 5013805 4924542 4850393 4790249 4743861 4711790 4694341
61403 4694341 4691185 4702007 4726681 4764327 4812828 4869872 4934046 5004230 5078514 5154976 5233417
61392 5233417 5314849 5398786 5482449 5563545 5642530 5720594 5796514 5867654 5933806 5997663 6060912
61381 6060912 6121977 6178751 6231796 6283066 6332526 6377856 6417086 6450098 6477833 6501461 6522230
61370 6522230 6540802 6556444 6567728 6574073 6575825 6573074 6565470 6553121 6536573 6515848 6490759 6462313
61358 6462313 6432599 6402900 6373076 6343355 6315500 6291297 6270677 6252235 6235043 6219077 6204375
$$ packed form
61432F889686K56058K19020J71976J18647O3421R181m2470q9591j29663j61119
61422G305146j84315k00487k10221k13579k11329k05073j95959j84047j69448
61413E530688j53319j37112j21220j05232q9263p4149o0144m6388l2071j7449
61403D694341l156J0822K4674L7646M8501N7044O4174P0184P4284P6462P8441
61392E233417Q1432Q3937Q3663Q1096P8985P8064P5920P1140O6152O3857O3249
61381F060912O1065N6774N3045N1270M9460M5330L9230L3012K7735K3628K0769
61370F522230J8572J5642J1284O345J752k751p604j2349j6548k0725k5089k8446
61358F462313k9714k9699k9824k9721k7855k4203k0620j8442j7192j5966j4702
$$ plain form
61347 6204375 6190689 6177769 6165158 6151662 6135654 6116024 6092619 6065862 6036348 6004836 5972466
61336 5972466 5941023 5912964 5890860 5876617 5871450 5876741 5894528 5926940 5975539 6041536 6126194 6230548
61324 6230548 6354958 6499554 6665228 6853906 7067668 7307399 7571839 7857700 8160926
61315 8160926 8477964 8805472 9138492 9469186 9787522 10082798 10344394 10562247 10728243
61306 10728243 10837713 10889220 10883046 10820804 10706703 10547792 10351468 10122767 9864922 9582433
61296 9582433 9282261 8971447 8654643 8334975 8016507 7704234 7401704 7110168 6830579
61287 6830579 6565052 6315587 6082533 5865593 5665518 5483444 5319042 5170872 5038513
61278 5038513 4922955 4824718 4742877 4676329 4624808 4588081 4565110 4554734 4556330 4569091 4591403
$$ packed form
61347F204375j3686j2920j2611j3496j6008j9630k3405k6757k9514l1512l2370
61336E972466l1443k8059k2104j4243n167N291J7787L2412M8599O5997Q4658J04354
61324F230548J24410J44596J65674J88678K13762K39731K64440K85861L03226
61315H160926L17038L27508L33020L30694L18336K95276K61596K17853J65996
61306A0728243J09470N1507o174o2242j14101j58911j96324k28701k57845k82489
61296I582433l00172l10814l16804l19668l18468l12273l02530k91536k79589
61287F830579k65527k49465k33054k16940k00075j82074j64402j48170j32359
61278E038513j15558r8237q1841o6548n1521l6727k2971j0376J596J2761K2312
$$ plain form
61267 4591403 4621795 4659993 4706228 4759828 4819171 4882701 4949296 5017861 5087219 5156296 5223853
61256 5223853 5288296 5348428 5404178 5455829 5502480 5542147 5573635 5597679 5615774 5628453 5635261
61245 5635261 5636027 5631226 5620906 5604036 5579531 5547691 5510052 5467902 5421526 5370982 5316883 5260016
61233 5260016 5200682 5138954 5075188 5009729 4942505 4873708 4804856 4738444 4676436 4619495 4567517
61222 4567517 4520174 4476833 4436664 4399185 4364392 4332256 4302458 4274525 4247679 4220588 4191911
61211 4191911 4161218 4128916 4095420 4061183 4027469 3996111 3968217 3943952 3923807 3909063 3900580
61200 3900580 3898093 3901332 3910908 3927328 3950062 3978807 4015183 4062102 4121556 4193830 4278529 4375232
61188 4375232 4483070 4600657 4726863 4860904 5001144 5144145 5285307 5420095 5543910
$$ packed form
61267D591403L0392L8198M6235N3600N9343O3530O6595O8565O9358O9077O7557
61256E223853O4443O0132N5750N1651M6651L9667L1488K4044J8095J2679O808
61245E635261P66m801j0320j6870k4505l1840l7639m2150m6376n0544n4099n6867
61233E260016n9334o1728o3766o5459o7224o8797o8852o6412o2008n6941n1978
61222D567517m7343m3341m0169l7479l4793l2136k9798k7933k6846k7091k8677
61211D191911l0693l2302l3496l4237l3714l1358k7894k4265k0145j4744q483
61200C900580k487L239R576J6420K2734K8745L6376M6919N9454P2274Q4699R6703
61188D375232J07838J17587J26206J34041J40240J43001J41162J34788J23815
$$ plain form
61179 5543910 5650666 5732284 5780789 5791524 5764107 5700285 5601835 5471479 5315022 5140747
61169 5140747 4956161 4766267 4575083 4387262 4207081 4036678 3876356 3726333 3587486
61160 3587486 3460742 3346322 3243243 3149331 3062464 2982335 2910237 2846611 2789780 2737941 2691347
61149 2691347 2651224 2617365 2588356 2563796 2544622 2531139 2522203 2516710 2514720 2516716 2522634 2532007
61137 2532007 2544267 2558557 2573908 2589813 2605977 2621357 2634178 2643136 2647931 2648570 2645059 2638114
61125 2638114 2629255 2619656 2609472 2598539 2586811 2573496 2556699 2535082 2509722 2483518 2458771 2435816
61113 2435816 2413720 2391433 2368115 2343133 2316412 2288578 2260298 2231441 2201144 2168738 2134409
61102 2134409 2098880 2062734 2026297 1989868 1953610 1917320 1880854 1844799 1810172 1777304 1745634
$$ packed form
61179E543910J06756Q1618M8505J0735k7417o3822r8450j30356j56457j74275
61169E140747j84586j89894j91184j87821j80181j70403j60322j50023j38847
61160C587486j26744j14420j03079r3912q6867q0129p2098o3626n6831n1839m6594
61149B691347m0123l3859k9009k4560j9174j3483q936n493j990J996N918R373
61137B532007J2260J4290J5351J5905J6164J5380J2821Q958M795O39l511o945
61125B638114q859r599j0184j0933j1728j3315j6797k1617k5360k6204k4747k2955
61113B435816k2096k2287k3318k4982k6721k7834k8280k8857l0297l2406l4329
61102B134409l5529l6146l6437l6429l6258l6290l6466l6055l4627l2868l1670
$$ plain form
61091 1745634 1714730 1684691 1655118 1624561 1591808 1557269 1522313 1487795 1454142 1422438 1394080
61080 1394080 1369100 1345753 1322131 1297838 1274249 1253716 1238283 1228190 1221399 1215305 1209128 1204152
61068 1204152 1201776 1202141 1204633 1208764 1214225 1220885 1229060 1239124 1250564 1262096 1272959 1283454 1294097
61055 1294097 1305041 1316581 1329228 1342798 1356281 1369142 1381965 1395212 1408186 1419981 1430675
61044 1430675 1440762 1450014 1457823 1464103 1468909 1471714 1472257 1471879 1472826 1476034 1480326 1483896 1485936 1486962
61030 1486962 1488305 1491142 1495200 1498455 1498957 1496901 1493951 1490620 1485602 1478034 1469130 1460912 1454341 1449486
61016 1449486 1446433 1444754 1442779 1438862 1433234 1427460 1422083 1416005 1408268 1399228 1389533 1379205 1368608
61003 1368608 1359348 1352877 1348518 1344042 1338368 1332750 1328921 1326799 1324631 1321045 1316356 1311889 1308604 1306654
$$ packed form
61091A745634l0904l0039k9573l0557l2753l4539l4956l4518l3653l1704k8358
61080A394080k4980k3347k3622k4293k3589k0533j5433j0093o791o094o177m976
61068A204152k376L65K492M131N461O660Q175J0064J1440J1532J0863J0495J0643
61055A294097J0944J1540J2647J3570J3483J2861J2823J3247J2974J1795J0694
61044A430675J0087R252P809O280M806K805N43l78R47L208M292L570K040J026
61030A486962J343K837M058L255N02k056k950l331n018p568q904q218o571m855
61016A449486l053j679j975l917n628n774n377o078p737r040r695j0328j0597
61003A368608r260o471m359m476n674n618l829k122k168l586m689m467l285j950
$$ plain form
60989 1306654 1306010 1306992 1309996 1314981 1321690 1330345 1341640 1355722 1371592 1387911 1404248 1421065 1438703
60976 1438703 1457042 1476241 1497164 1520596 1546347 1573519 1601624 1631181 1663337 1699015 1738394
60965 1738394 1780984 1826108 1873340 1922667 1974596 2030235 2090809 2156600 2226539 2299479 2375840
60954 2375840 2457456 2545799 2641104 2743348 2853145 2971014 3096474 3228812 3368519 3517137
60944 3517137 3675776 3844746 4025044 4219479 4431509 4663122 4914589 5186573 5481954
60935 5481954 5805210 6160494 6551308 6982236 7460249 7994068 8593131 9267773 10029848
60926 10029848 10892809 11872129 12986045 14254270 15695036 17325200 19162804 21220321
60918 21220321 23482279 25886985 28342698 30774788 33155449 35476331 37689716 39686966
$$ packed form
60989A306654o44R82L004M985O709Q655J1295J4082J5870J6319J6337J6817J7638
60976A438703J8339J9199K0923K3432K5751K7172K8105K9557L2156L5678L9379
60965A738394M2590M5124M7232M9327N1929N5639O0574O5791O9939P2940P6361
60954B375840Q1616Q8343R5305J02244J09797J17869J25460J32338J39707J48618
60944C517137J58639J68970J80298J94435K12030K31613K51467K71984K95381
60935E481954L23256L55284L90814M30928M78013N33819N99063O74642P62075
60926A0029848Q62961R79320J113916J268225J440766J630164J837604K057517
60918B1220321K261958K404706K455713K432090K380661K320882K213385J997250
$$ plain form
60910 39686966 41344044 42587575 43415992 43868736 43993221 43844745 43496978 43021256 42436180
60901 42436180 41676386 40619882 39158823 37261488 34988118 32464249 29838438 27245850
60893 27245850 24785645 22513740 20449729 18591371 16927401 15443885 14126130 12959398
60885 12959398 11929189 11020792 10219043 9509097 8877643 8313439 7807005 7350011 6935073
60876 6935073 6556091 6208447 5888197 5590943 5312192 5049179 4801560 4569550 4351935
60867 4351935 4146601 3952297 3768671 3594899 3429536 3271819 3122229 2981560 2850026
60858 2850026 2727046 2611194 2500749 2395353 2296907 2207564 2126771 2051474 1979342 1910471
60848 1910471 1845700 1784794 1727180 1673337 1624303 1580327 1540747 1504755 1471634 1440597 1410950
$$ packed form
60910C9686966J657078J243531Q28417M52744J24485j48476l47767m75722n85076
60901D2436180p59794j056504j461059j897335k273370k523869k625811k592588
60893B7245850k460205k271905k064011j858358j663970j483516j317755j166732
60885A2959398j030209r08397q01749p09946o31454n64204n06434m56994m14938
60876F935073l78982l47644l20250k97254k78751k63013k47619k32010k17615
60867D351935k05334j94304j83626j73772j65363j57717j49590j40669j31534
60858B850026j22980j15852j10445j05396r8446q9343q0793p5297p2132o8871
60848A910471o4771o0906n7614n3843m9034m3976l9580l5992l3121l1037k9647
$$ plain form
60837 1410950 1382338 1354730 1328527 1304567 1283272 1263727 1244514 1225647 1208671 1194571 1182727
60826 1182727 1172464 1164340 1158943 1155511 1152963 1151493 1151777 1153114 1153933 1154087 1155220 1158518 1163192 1167745
60812 1167745 1171840 1176190 1181072 1185800 1189676 1192855 1195966 1199217 1202331 1205281 1208441 1211762 1214287 1215015
60798 1215015 1213812 1210856 1205699 1197941 1188685 1180073 1173083 1166829 1160463 1154707 1150850 1149134 1149027 1150482
60784 1150482 1153960 1159436 1166121 1173183 1180403 1188196 1196996 1206304 1214452 1220202 1224678 1230605 1239147 1248549
60770 1248549 1256602 1263373 1270424 1278290 1286222 1294043 1302807 1313490 1326062 1339991 1354846 1370302 1386207
60757 1386207 1402671 1419518 1435767 1450333 1463199 1475200 1486692 1497131 1506012 1513504 1519909 1525002
60745 1525002 1528143 1528737 1526506 1521607 1514485 1505440 1494414 1481377 1466631 1450379 1432304 1412058 1389995
$$ packed form
60837A410950k8612k7608k6203k3960k1295j9545j9213j8867j6976j4100j1844
60826A182727j0263q124n397l432k548j470K84J337Q19J54J133L298M674M553
60812A167745M095M350M882M728L876L179L111L251L114K950L160L321K525P28
60798A215015j203k956n157p758r256q612o990o254o366n756l857j716j07J455
60784A150482L478N476O685P062P220P793Q800R308Q148N750M476N927Q542R402
60770A248549Q053O771P051P866P932P821Q764J0683J2572J3929J4855J5456J5905
60757A386207J6464J6847J6249J4566J2866J2001J1492J0439Q881P492O405N093
60745A525002L141N94k231m899p122r045j1026j3037j4746j6252j8075k0246k2063
$$ plain form
60732 1389995 1367016 1343877 1321083 1299220 1278852 1260212 1243385 1228580 1215847 1204904 1195809
60721 1195809 1189428 1186437 1185999 1186227 1186084 1186269 1188186 1192562 1199078 1206840 1215065 1223739 1233672 1245769 1260335
60706 1260335 1277250 1296433 1317699 1340392 1363632 1386752 1409195 1430476 1450776 1471038 1491650
60695 1491650 1511422 1528741 1543552 1557295 1571096 1585045 1599125 1613612 1628213 1641939 1654425
60684 1654425 1666676 1679858 1693807 1707062 1717945 1725265 1728628 1728683 1726834 1724227 1721006 1716660 1710969
60671 1710969 1704446 1697996 1692164 1686569 1680138 1672016 1662101 1650564 1637393 1622902 1608268 1594683 1582076
60658 1582076 1569435 1556267 1542966 1529926 1517378 1506279 1498071 1492938 1489184 1485138 1481000 1478007
60646 1478007 1476261 1474383 1471200 1467030 1463090 1460063 1457245 1452907 1445659 1435891 1425873 1418050 1413146 1410114
$$ packed form
60732A389995k2979k3139k2794k1863k0368j8640j6827j4805j2733j0943r095
60721A195809o381k991m38K28j43J85J917M376O516P762Q225Q674R933J2097J4566
60706A260335J6915J9183K1266K2693K3240K3120K2443K1281K0300K0262K0612
60695A491650J9772J7319J4811J3743J3801J3949J4080J4487J4601J3726J2486
60684A654425J2251J3182J3949J3255J0883P320L363N5j849k607l221m346n691
60671A710969o523o450n832n595o431q122r915j1537j3171j4491j4634j3585j2607
60658A582076j2641j3168j3301j3040j2548j1099q208n133l754m046m138k993
60646A478007j746j878l183m170l940l027k818m338p248r768j0018p823m904l032
$$ plain form
60632 1410114 1407755 1405882 1404701 1403654 1401761 1399331 1398579 1401627 1407987 1414871 1420094 1423722 1426448 1427544
60618 1427544 1425636 1420725 1413885 1405061 1392779 1376381 1357191 1336728 1314952 1291237 1266331 1242237
60606 1242237 1220484 1201376 1184648 1169993 1156971 1145255 1135146 1127334 1121885 1117765 1113507 1108308
60594 1108308 1102637 1098039 1096141 1097284 1099907 1101544 1100681 1097736 1094370 1092096 1091450 1092066 1093148 1093884 1093798
60579 1093798 1093015 1092171 1091831 1091909 1091820 1091292 1090811 1091177 1092896 1096138 1100998 1107524 1115691 1125557 1137077 1149528
60563 1149528 1161776 1173729 1187066 1203635 1223391 1244838 1267295 1291563 1318268 1346867 1376879
60552 1376879 1408992 1444061 1481732 1520831 1560417 1599428 1635902 1667766 1694453 1716739 1734911
60541 1734911 1748040 1755359 1757449 1755347 1748925 1736971 1718953 1696245 1671309 1645788 1619661 1592345
$$ packed form
60632A410114k359j873j181j047j893k430p52L048O360O884N223L628K726J096
60618A427544j908m911o840q824j2282j6398j9190k0463k1776k3715k4906k4094
60606A242237k1753j9108j6728j4655j3022j1716j0109p812n449m120m258n199
60594A108308n671m598j898J143K623J637q63k945l366k274o46O16J082P36q6
60579A093798p83q44l40P8q9n28m81L66J719L242M860O526Q167R866J1520J2451
60563A149528J2248J1953J3337J6569J9756K1447K2457K4268K6705K8599L0012
60552A376879L2113L5069L7671L9099L9586L9011L6474L1864K6687K2286J8172
60541A734911J3129P319K090k102o422j1954j8018k2708k4936k5521k6127k7316
$$ plain form
60529 1592345 1564401 1537775 1514356 1494591 1477651 1462582 1448932 1436511 1425170 1415033 1406631
60518 1406631 1400420 1396061 1392268 1387503 1380995 1373161 1364960 1356817 1348391 1339555 1331392 1325815 1323972 1325177
60504 1325177 1327654 1330258 1333322 1337882 1344514 1353125 1363399 1374903 1386920 1398991 1411818 1427010
60492 1427010 1445389 1465988 1487181 1508503 1530897 1555561 1583178 1613971 1647712 1683653 1721109
60481 1721109 1760163 1801291 1844309 1888265 1932358 1976224 2019171 2059619 2095345 2123702 2141780
60470 2141780 2147512 2141165 2125183 2102306 2074533 2043912 2012946 1983282 1954979 1928205 1905031 1888232
60458 1888232 1878631 1874825 1875502 1880807 1891271 1906526 1925652 1948034 1973257 2000719 2030018 2061639
60446 2061639 2097059 2138316 2187508 2246158 2314749 2393210 2482128 2583197 2698314 2828697 2975267
$$ packed form
60529A592345k7944k6626k3419j9765j6940j5069j3650j2421j1341j0137q402
60518A406631o211m359l793m765o508p834q201q143q426q836q163n577j843J205
60504A325177K477K604L064M560O632Q611J0274J1504J2017J2071J2827J5192
60492A427010J8379K0599K1193K1322K2394K4664K7617L0793L3741L5941L7456
60481A721109L9054M1128M3018M3956M4093M3866M2947M0448L5726K8357J8078
60470B141780N732o347j5982k2877k7773l0621l0966k9664k8303k6774k3174j6799
60458A888232r601l806O77N305J0464J5255J9126K2382K5223K7462K9299L1621
60446B061639L5420M1257M9192N8650O8591P8461Q8918J01069J15117J30383J46570
$$ plain form
60435 2975267 3139367 3322382 3524814 3746421 3987420 4248955 4532052 4836327 5159785
60426 5159785 5499225 5850153 6206102 6558124 6894657 7201405 7461582 7657531 7773846
60417 7773846 7800483 7734191 7578267 7341693 7038173 6684615 6299068 5898912 5499671 5113814
60407 5113814 4749425 4410056 4096592 3809541 3549352 3314919 3103110 2910588 2735749
60398 2735749 2578356 2437746 2312134 2199399 2097614 2004756 1918929 1839308 1766248 1700008
60388 1700008 1639851 1584728 1534137 1487663 1444352 1403441 1365378 1331138 1300579 1272311 1245205
60377 1245205 1219230 1194716 1171723 1150418 1131342 1114784 1100314 1087243 1075107 1063502 1052005
60366 1052005 1040623 1029890 1020168 1011204 1002603 994366 986799 980319 975448 972466 970887 969929 969619 970699
$$ packed form
60435B975267J64100J83015K02432K21607K40999K61535K83097L04275L23458
60426E159785L39440L50928L55949L52022L36533L06748K60177J95949J16315
60417G773846K6637o6292j55924k36574l03520l53558l85547m00156l99241l85857
60407E113814l64389l39369l13464k87051k60189k34433k11809j92522j74839
60398B735749j57393j40610j25612j12735j01785r2858q5827p9621p3060o6240
60388A700008o0157n5123n0591m6474m3311m0911l8063l4240l0559k8268k7106
60377A245205k5975k4514k2993k1305j9076j6558j4470j3071j2136j1605j1497
60366A052005j1382j0733r722q964q601q237p567o480m871k982j579r58l10J080
$$ plain form
60352 970699 973257 976369 979542 983521 988997 995424 1001940 1008602 1015689 1022569 1028535 1034289 1041219 1049233
60338 1049233 1056589 1062073 1066411 1071321 1077903 1086110 1095103 1103860 1111840 1119145 1125853 1131591 1136258 1140756
60324 1140756 1146207 1152596 1158800 1163612 1166147 1165769 1162711 1158566 1155196 1153250 1152391 1152429 1152986 1152559 1149584
60309 1149584 1144671 1140388 1138522 1138688 1139813 1141601 1144012 1146687 1149670 1153853 1159958 1167741 1176429 1185040
60295 1185040 1192144 1196772 1200267 1205952 1215952 1229200 1243383 1257704 1272571 1287690 1302120 1315836
60283 1315836 1329651 1343473 1355816 1365328 1372081 1377083 1381112 1384256 1386221 1386935 1386882 1386723 1386514 1385655 1383881
60268 1383881 1381896 1380820 1381367 1383717 1387536 1391753 1394934 1396438 1396780 1396418 1394818 1391335 1386372 1380771 1374486
60253 1374486 1366838 1357958 1349072 1341284 1334795 1329441 1325263 1322227 1319902 1317880 1316315 1315659 1315790 1315679 1314197
$$ packed form
60352I70699K558L112L173L979N476O427O516O662P087O880N966N754O930Q014
60338A049233P356N484M338M910O582Q207Q993Q757P980P305O708N738M667M498
60324A140756N451O389O204M812K535l78l058m145l370j946q59L8N57m27k975
60309A149584m913m283j866J66J125J788K411K675K983M183O105P783Q688Q611
60295A185040P104M628L495N685J0000J3248J4183J4321J4867J5119J4430J3716
60283A315836J3815J3822J2343R512O753N002M029L144J965P14n3j59k09q59j774
60268A383881j985j076N47K350L819M217L181J504L42l62j600l483m963n601o285
60253A374486p648q880q886p788o489n354m178l036k325k022j565o56J31j11j482
$$ plain form
60238 1314197 1311297 1308074 1305503 1303453 1301355 1299375 1298194 1297867 1297907 1298480 1300333 1303148 1305089 1304811 1303181
60223 1303181 1302322 1303614 1307346 1313512 1321765 1330909 1339593 1347643 1355923 1364877 1373973 1382711 1391500 1401205
60209 1401205 1412239 1424405 1437417 1451315 1466330 1482405 1498990 1515605 1532701 1551730 1574190
60198 1574190 1600734 1631098 1664505 1700110 1737640 1778024 1823106 1874335 1931690 1993894 2059625
60187 2059625 2128732 2202684 2283772 2373472 2471606 2577406 2691003 2813211 2944229 3083468
60177 3083468 3230453 3384602 3544025 3705738 3867506 4028346 4186895 4340413 4485972
60168 4485972 4621424 4744514 4852239 4942234 5014166 5068947 5107285 5129725 5137310 5131374 5113289
60157 5113289 5085215 5050341 5011657 4971252 4931588 4896423 4869274 4851540 4843248 4845071 4858633 4885435
$$ packed form
60238A314197k900l223k571k050k098j980j181l27M0N73J853K815J941k78j630
60223A303181q59J292L732O166Q253R144Q684Q050Q280Q954R096Q738Q789R705
60209A401205J1034J2166J3012J3898J5015J6075J6585J6615J7096J9029K2460
60198A574190K6544L0364L3407L5605L7530M0384M5082N1229N7355O2204O5731
60187B059625O9107P3952Q1088Q9700R8134J05800J13597J22208J31018J39239
60177C083468J46985J54149J59423J61713J61768J60840J58549J53518J45559
60168D485972J35452J23090J07725Q9995P1932N4781L8338K2440P585n936j8085
60157E113289k8074l4874l8684m0405l9664l5165k7149j7734q292J823J3562K6802
$$ plain form
60145 4885435 4926643 4983483 5056691 5145703 5249153 5365771 5494090 5632046 5777814 5930360
60135 5930360 6087918 6246423 6400537 6545835 6679059 6797062 6896998 6977198 7036503 7073068
60125 7073068 7085119 7072660 7037304 6980943 6905941 6816103 6715726 6607822 6494773 6380508
60115 6380508 6270172 6167578 6074645 5993515 5927279 5878048 5845955 5830973 5834474 5858109 5901998
60104 5901998 5964503 6042818 6133286 6232153 6336621 6444540 6552760 6656674 6751646 6834183
60094 6834183 6901892 6953762 6990960 7016056 7030782 7035464 7031065 7020642 7008161 6996998 6990411 6992452
60082 6992452 7007280 7037935 7086402 7154568 7244826 7360103 7503202 7675288 7875239 8101824
60072 8101824 8356696 8643748 8965093 9319265 9704011 10118962 10564015 11036389 11530881
$$ packed form
60145D885435M1208N6840P3208Q9012J03450J16618J28319J37956J45768J52546
60135E930360J57558J58505J54114J45298J33224J18003R9936Q0200N9305L6565
60125G073068J2051j2459l5356n6361p5002q9838j00377j07904j13049j14265
60115F380508j10336j02594r2933q1130o6236m9231l2093j4982L501K3635M3889
60104E901998O2505P8315R0468R8867J04468J07919J08220J03914R4972Q2537
60094F834183O7709N1870L7198K5096J4726M682m399j0423j2481j1163o587K041
60082F992452J4828L0655M8467O8166R0258J15277J43099J72086J99951K26585
60072H101824K54872K87052L21345L54172L84746M14951M45053M72374M94492
$$ plain form
60063 11530881 12042088 12564721 13092191 13616395 14128623 14619595 15079243 15498117 15869110
60054 15869110 16186770 16445307 16638729 16762895 16815910 16796229 16701926 16532868 16293082 15990617
60044 15990617 15635871 15240524 14817151 14378472 13936339 13501117 13081491 12684532 12316213
60035 12316213 11981921 11686164 11431653 11219287 11049332 10922088 10836782 10790243 10777491 10793729
60025 10793729 10835164 10897777 10975954 11062673 11150626 11232810 11302753 11355133 11386387 11394327 11377395
60014 11377395 11334858 11267443 11176799 11064154 10930343 10777254 10608027 10425080 10228874 10019634
60004 10019634 9799664 9573043 9343672 9114834 8890264 8674142 8469741 8279100 8104239
59995 8104239 7947674 7811357 7695935 7601609 7529181 7479792 7454066 7451995 7473462 7518519 7587040
$$ packed form
60063A1530881N11207N22633N27470N24204N12228M90972M59648M18874L70993
60054A5869110L17660K58537J93422J24166N3015j9681r4303j69058k39786l02465
60044A5990617l54746l95347m23373m38679m42133m35222m19626l96959l68319
60035A2316213l34292k95757k54511k12366j69955j27244q5306m6539j2752J6238
60025A0793729M1435O2613P8177Q6719Q7953Q2184O9943N2380L1254P940j6932
60014A1377395m2537o7415r0644j12645j33811j53089j69227j82947j96206k09240
60004A0019634k19970k26621k29371k28838k24570k16122k04401j90641j74861
59995H104239j56565j36317j15422r4326p2428m9389k5726k071K1467M5057O8521
$$ plain form
59984 7587040 7677962 7788760 7915982 8056646 8208725 8369579 8534106 8695182 8845986 8981409
59974 8981409 9097476 9190392 9256603 9293396 9299189 9273436 9216307 9128499 9011800 8870071 8708983
59963 8708983 8534014 8349133 8157964 7965389 7776862 7596614 7427691 7273277 7136463
59954 7136463 7018944 6921515 6845873 6794264 6767014 6762134 6778220 6816521 6879385 6967834 7081561
59943 7081561 7220122 7382744 7567286 7770419 7988827 8219630 8459451 8702996 8942316
59934 8942316 9167948 9371926 9550038 9700582 9821121 9907559 9956520 9967331 9941186 9879579
59924 9879579 9784309 9658192 9505182 9330609 9141704 8946660 8752167 8562584 8382033 8216032
59914 8216032 8069830 7945929 7844678 7766920 7714668 7689150 7689379 7713241 7759506 7828357 7919999
$$ packed form
59984G587040R0922J10798J27222J40664J52079J60854J64527J61076J50804J35423
59974H981409J16067R2916O6211L6793N793k5753n7129q7808j16699j41729j61088
59963H708983j74969j84881j91169j92575j88527j80248j68923j54414j36814
59954G136463j17519r7429p5642n1609k7250m880J6086L8301O2864Q8449J13727
59943G081561J38561J62622J84542K03133K18408K30803K39821K43545K39320
59934H942316K25632K03978J78112J50544J20539Q6438M8961J0811k6145o1607
59924I879579r5270j26117j53010j74573j88905j95044j94493j89583j80551j66001
59914H216032j46202j23901j01251p7758n2252k5518K29K3862M6265O8851R1642
$$ plain form
59903 7919999 8032886 8163373 8307151 8460715 8621198 8785256 8949042 9109214 9263145
59894 9263145 9408254 9542235 9664178 9774499 9873561 9961493 10039792 10111925 10181597 10251332
59884 10251332 10323504 10401963 10491923 10598844 10727886 10883604 11069337 11287391 11540342 11831499
59874 11831499 12163411 12536393 12948689 13397089 13876622 14380234 14899164 15422642 15936485
59865 15936485 16422885 16862756 17238335 17533783 17735075 17831354 17817078 17693127 17466658 17150156
59855 17150156 16759324 16310538 15819892 15303791 14778508 14258121 13753587 13274011 12827221
59846 12827221 12418350 12049567 11722501 11439872 11203754 11013792 10868598 10767489 10709269
59837 10709269 10690788 10709088 10764070 10856519 10983585 11138244 11313041 11502006 11698417 11892702
$$ packed form
59903G919999J12887J30487J43778J53564J60483J64058J63786J60172J53931
59894I263145J45109J33981J21943J10321R9062Q7932P8299P2133O9672O9735
59884A0251332P2172P8459Q9960J06921J29042J55718J85733K18054K52951K91157
59874A1831499L31912L72982M12296M48400M79533N03612N18930N23478N13843
59865A5936485M86400M39871L75579K95448K01292R6279j4276j23951k26469l16502
59855A7150156l90832m48786m90646n16101n25283n20387n04534m79576m46790
59846A2827221m08871l68783l27066k82629k36118j89962j45194j01109n8220
59837A0709269j8481J8300N4982R2449J27066J54659J74797J88965J96411J94285
$$ plain form
59827 11892702 12073596 12230181 12352174 12429552 12453239 12416474 12315938 12152465 11930718 11657427
59817 11657427 11339817 10985993 10605801 10209585 9805875 9401268 9002289 8615745 8246839
59808 8246839 7898277 7571763 7269155 6991368 6737160 6504226 6291380 6099137 5928461
59799 5928461 5779426 5650894 5540967 5447571 5368733 5302404 5246278 5198062 5155858 5118004 5082574
59788 5082574 5047386 5010881 4973206 4936284 4902237 4871287 4841602 4811771 4782766 4756247 4731287
59777 4731287 4704365 4672732 4636122 4594770 4547804 4494828 4437483 4377980 4317338 4256586 4198378
59766 4198378 4145455 4098270 4055931 4018932 3989029 3966795 3951175 3941369 3937406 3938839 3944628 3954710
59754 3954710 3970392 3992900 4022589 4059470 4103136 4152135 4204972 4262037 4325219 4395133 4469896
$$ packed form
59827A1892702J80894J56585J21993P7378K3687l6765j00536j63473k21747k73291
59817A1657427l17610l53824l80192l96216m03710m04607l98979l86544l68906
59808H246839l48562l26514l02608k77787k54208k32934k12846j92243j70676
59799E928461j49035j28532j09927r3396p8838o6329n6126m8216m2204l7854l5430
59788E082574l5188l6505l7675l6922l4047l0950k9685k9831k9005k6519k4960
59777D731287k6922l1633l6610m1352m6966n2976n7345n9503o0642o0752n8208
59766D198378n2923m7185m2339l6999k9903k2234j5620r806l963J433N789J0082
59754C954710J5682K2508K9689L6881M3666M8999N2837N7065O3182O9914P4763
$$ plain form
59743 4469896 4546993 4625165 4703900 4782079 4857830 4929047 4993569 5049466 5095827 5133267 5163796
59732 5163796 5190410 5216245 5243286 5272027 5303147 5339158 5383619 5439009 5506440 5587207 5683522
59721 5683522 5797698 5931439 6085912 6261797 6459806 6682142 6933003 7216226 7532648
59712 7532648 7880879 8260220 8671108 9112390 9578996 10061185 10543343 11002573 11410238
59703 11410238 11736926 11957719 12056451 12029949 11890389 11661686 11371121 11043034 10698126 10354506
59693 10354506 10026712 9724494 9453901 9218976 9021765 8861838 8737151 8645361 8584362 8552846
59683 8552846 8551016 8579711 8638202 8723921 8834991 8971799 9135332 9325442 9542110 9787274
59673 9787274 10063682 10372436 10713280 11087085 11496625 11944817 12433389 12963619 13537448
$$ packed form
59743D469896P7097P8172P8735P8179P5751P1217O4522N5897M6361L7440L0529
59732E163796K6614K5835K7041K8741L1120L6011M4461N5390O7431Q0767R6315
59721E683522J14176J33741J54473J75885J98009K22336K50861K83223L16422
59712G532648L48231L79341M10888M41282M66606M82189M82158M59230M07665
59703A1410238L26688K20793R8732k6502j39560k28703k90565l28087l44908l43620
59693A0354506l27794l02218k70593k34925j97211j59927j24687r1790o0999l1516
59683H552846j830K8695N8491Q5719J11070J36808J63533J90110K16668K45164
59673I787274K76408L08754L40844L73805M09540M48192M88572N30230N73829
$$ plain form
59664 13537448 14157397 14825880 15544978 16316459 17141347 18019130 18947266 19921302 20934994
59655 20934994 21979644 23043202 24111016 25168707 26204676 27210154 28178517 29106675
59647 29106675 29997299 30858088 31697998 32524620 33344668 34164567 34988439 35815160 36637376
59638 36637376 37442412 38213454 38930834 39574022 40123965 40565109 40887086 41085828 41163577
59629 41163577 41128311 40993545 40777982 40503693 40193641 39870572 39556948 39273699 39038191
59620 39038191 38864299 38764766 38752276 38837517 39027336 39325877 39736984 40264510 40910415 41672988
59610 41672988 42546365 43520680 44581684 45709203 46874902 48041320 49163598 50192529
59602 50192529 51076602 51763734 52205302 52362365 52211141 51746129 50981421 49949419 48695486
$$ packed form
59664A3537448O19949O68483P19098P71481Q24888Q77783R28136R74036J013692
59655B0934994J044650J063558J067814J057691J035969J005478R68363R28158
59647B9106675Q90624Q60789Q39910Q26622Q20048Q19899Q23872Q26721Q22216
59638C6637376Q05036P71042P17380O43188N49943M41144L21977J98742P7749
59629D1163577l5266j34766k15563k74289l10052l23069l13624k83249k35508
59620C9038191j73892r9533j2490Q5241J89819K98541M11107N27526O45905P62573
59610D1672988Q73377R74315J061004J127519J165699J166418J122278J028931
59602E0192529Q84073O87132M41568J57063j51224m65012p64708j032002j253933
$$ plain form
59593 48695486 47270529 45726069 44112608 42477556 40861344 39295047 37801379 36396019
59585 36396019 35086661 33871816 32741820 31680542 30665878 29670721 28666830 27630579
59577 27630579 26547862 25417003 24249096 23064533 21886521 20735502 19627266 18573243
59569 18573243 17580665 16652966 15791355 14996148 14266451 13599435 12990866 12436188 11930931
59560 11930931 11470859 11052359 10672236 10326946 10012881 9727686 9470198 9238394 9028442
59551 9028442 8836454 8660188 8498119 8347785 8206106 8070558 7938924 7808461 7676453
59542 7676453 7541308 7402294 7258655 7109983 6957309 6803067 6650069 6500849 6357324
59533 6357324 6220270 6089392 5964661 5847396 5739569 5642387 5556056 5480560 5415985 5362238
$$ packed form
59593D8695486j424957j544460j613461j635052j616212j566297j493668j405360
59585C6396019j309358j214845j129996j061278j014664r95157j003891j036251
59577B7630579j082717j130859j167907j184563j178012j151019j108236j054023
59569A8573243r92578r27699q61611p95207p29697o67016o08569n54678n05257
59560A1930931m60072m18500l80123l45290l14065k85195k57488k31804k09952
59551I028442j91988j76266j62069j50334j41679j35548j31634j30463j32008
59542G676453j35145j39014j43639j48672j52674j54242j52998j49220j43525
59533F357324j37054j30878j24731j17265j07827r7182q6331p5496o4575n3747
$$ plain form
59523 5362238 5318950 5285609 5261575 5246118 5238559 5238252 5244635 5257711 5278103 5305799 5339157 5376251
59511 5376251 5417127 5463339 5515118 5570464 5627578 5686848 5749829 5817581 5890830 5970735 6058605
59500 6058605 6155683 6263645 6384218 6517791 6663673 6822444 6996765 7189047 7399661 7628315
59490 7628315 7875772 8143012 8430006 8736576 9063235 9409721 9773592 10151513 10540807
59481 10540807 10938378 11339246 11737806 12129700 12510875 12875643 13217495 13531322 13813447
59472 13813447 14060421 14269901 14442582 14581502 14689493 14768734 14822416 14855023 14870926 14874276
59462 14874276 14870471 14866216 14867885 14881096 14911952 14966974 15050866 15164954 15307916 15476669 15665513
59451 15665513 15864805 16061321 16240375 16388201 16493018 16544323 16531776 16445953 16281025 16036549
$$ packed form
59523E362238m3288l3341k4034j5457p559l07O383J3076K0392K7696L3358L7094
59511E376251M0876M6212N1779N5346N7114N9270O2981O7752P3249P9905Q7870
59500F058605R7078J07962J20573J33573J45882J58771J74321J92282K10614K28654
59490G628315K47457K67240K86994L06570L26659L46486L63871L77921L89294
59481A0540807L97571M00868L98560L91894L81175L64768L41852L13827K82125
59472A3813447K46974K09480J72681J38920J07991P9241N3682L2607J5903L350
59462A4874276l805m255J669J3211L0856N5022Q3892J14088J42962J68753J88844
59451A5665513J99292J96516J79054J47826J04817N1305j2547q5823j64928k44476
$$ plain form
59441 16036549 15716623 15328298 14881325 14388225 13862994 13319471 12770866 12229507 11705608
59432 11705608 11206371 10736743 10300317 9899062 9533374 9203489 8909943 8651732 8425424
59423 8425424 8227833 8058842 7920030 7811149 7729683 7673506 7642362 7636917 7657815 7705576 7780205
59412 7780205 7880983 8007520 8160444 8339818 8543595 8769094 9015319 9281927 9566074
59403 9566074 9862080 10164051 10466867 10763978 11045635 11300045 11515764 11683387 11796306
59394 11796306 11850361 11842501 11770490 11634866 11440471 11194751 10905163 10579472 10227393 9859335
59384 9859335 9483308 9104628 8728420 8360360 8004818 7664207 7340526 7035902 6751272
59375 6751272 6486193 6240289 6013430 5804408 5611278 5433379 5271284 5124428 4990745
$$ packed form
59441A6036549l19926l88325m46973m93100n25231n43523n48605n41359n23899
59432A1705608m99237m69628m36426m01255l65688l29885k93546k58211k26308
59423H425424j97591j68991j38812j08881q1466n6177l1144n445K0898M7761P4629
59412G780205J00778J26537J52924J79374K03777K25499K46225K66608K84147
59403I566074K96006L01971L02816K97111K81657K54410K15719J67623J12919
59394A1796306N4055p860p2011j35624j94395k45720k89588l25691l52079l68058
59384I859335l76027l78680l76208l68060l55542l40611l23681l04624k84630
59375F751272k65079k45904k26859k09022j93130j77899j62095j46856j33683
$$ plain form
59366 4990745 4869210 4760784 4665892 4582858 4509980 4447509 4396189 4355225 4323231 4300231 4287184
59355 4287184 4284033 4289367 4301676 4320152 4344771 4376252 4415122 4459726 4505519 4547330 4582586 4612300
59343 4612300 4639705 4668661 4702970 4746155 4801121 4869561 4951337 5044565 5146647 5255159 5367666
59332 5367666 5481755 5596792 5715875 5845069 5990369 6155696 6343227 6554329 6789958
59323 6789958 7051261 7340251 7659401 8010694 8395907 8817715 9279460 9783743 10331981
59314 10331981 10925029 11562976 12244186 12965329 13721916 14507236 15310785 16119306 16919696
59305 16919696 17699884 18447579 19150928 19801672 20396235 20933070 21410716 21829554 22193466
59296 22193466 22507461 22773911 22992156 23160855 23278877 23343768 23350761 23293988 23168497 22971243
$$ packed form
59366D990745j21535j08426r4892q3034p2878o2471n1320m0964l1994k3000j3047
59355D287184l151N334J2309J8476K4619L1481L8870M4604M5793M1811L5256K9714
59343D612300K7405K8956L4309M3185N4966O8440Q1776R3228J02082J08512J12507
59332E367666J14089J15037J19083J29194J45300J65327J87531K11102K35629
59323F789958K61303K88990L19150L51293L85213M21808M61745N04283N48238
59314A0331981N93048O37947O81210P21143P56587P85320Q03549Q08521Q00390
59305A6919696P80188P47695P03349O50744N94563N36835M77646M18838L63912
59296B2193466L13995K66450K18245J68699J18022O4891O993n6773j25491j97254
$$ plain form
59286 22971243 22701060 22358622 21947009 21472133 20941771 20363460 19743548 19088469 18405982
59277 18405982 17704142 16989738 16268923 15548803 14836859 14139069 13460168 12805542 12181040
59268 12181040 11590572 11035384 10515956 10032980 9586128 9173582 8793612 8445440 8128118
59259 8128118 7839975 7579646 7346230 7137833 6951453 6785022 6638228 6510723 6401120
59250 6401120 6308507 6233188 6174737 6130793 6099145 6079777 6073598 6080433 6099634 6131444 6176091 6232435
59238 6232435 6299218 6377012 6467221 6569622 6682622 6805907 6941142 7089568 7249966 7419471
59228 7419471 7595755 7778097 7966620 8160612 8357476 8553598 8746420 8935404 9120942
59219 9120942 9302923 9480531 9652554 9817368 9973367 10120072 10258236 10388271 10509045
$$ packed form
59286B2971243k70183l42438m11613m74876n30362n78311o19912o55079o82487
59277A8405982p01840p14404p20815p20120p11944o97790o78901o54626o24502
59268A2181040n90468n55188n19428m82976m46852m12546l79970l48172l17322
59259H128118k88143k60329k33416k08397j86380j66431j46794j27505j09603
59250F401120r2613p5319n8451m3944l1648j9368o179O835J9201L1810M4647N6344
59238F232435O6783P7794R0209J02401J13000J23285J35235J48426J60398J69505
59228G419471J76284J82342J88523J93992J96864J96122J92822J88984J85538
59219I120942J81981J77608J72023J64814J55999J46705J38164J30035J20774
$$ plain form
59210 10509045 10618593 10715060 10796117 10858192 10897529 10911913 10900561 10862437 10795656 10698982 10573725
59199 10573725 10424000 10255219 10072322 9879448 9681093 9482810 9290170 9107310 8937171
59190 8937171 8782651 8646404 8529599 8432039 8353783 8295769 8258685 8242161 8245419 8268022 8309717
59179 8309717 8370090 8448287 8542378 8649272 8766254 8892452 9027793 9170934 9319605 9472815
59169 9472815 9631198 9795260 9964987 10141305 10326248 10521516 10728787 10951796 11195939
59160 11195939 11464827 11758754 12076992 12419383 12784348 13166938 13559775 13953960 14337556
59151 14337556 14694997 15009998 15268327 15456922 15562472 15573572 15484217 15294239 15007422 14630871
59141 14630871 14175494 13655418 13086686 12486612 11872585 11259360 10657315 10073713 9514586
$$ packed form
59210A0509045J09548R6467Q1057O2075L9337J4384j1352l8124o6781r6674j25257
59199A0573725j49725j68781j82897j92874j98355j98283j92640j82860j70139
59190H937171j54520j36247j16805r7560p8256n8014l7084j6524L258K2603M1695
59179H309717O0373P8197R4091J06894J16982J26198J35341J43141J48671J53210
59169I472815J58383J64062J69727J76318J84943J95268K07271K23009K44143
59160A1195939K68888K93927L18238L42391L64965L82590L92837L94185L83596
59151A4337556L57441L15001K58329J88595J05550J1100q9355j89978k86817l76551
59141A4630871m55377n20076n68732o00074o14027o13225o02045n83602n59127
$$ plain form
59132 9514586 8984620 8486580 8022362 7593726 7200696 6840253 6508339 6202808 5923350
59123 5923350 5669253 5438582 5228878 5037353 4860976 4697723 4547446 4410451 4285731
59114 4285731 4171578 4067222 3972623 3887154 3809672 3739464 3676096 3618804 3567067 3521484 3483227
59103 3483227 3453037 3431187 3417402 3410008 3406327 3405196 3408346 3418321 3435912 3460581 3492154 3530533
59091 3530533 3574675 3623496 3677327 3737201 3803366 3875745 3954943 4041305 4133722 4230984 4333803
59080 4333803 4443928 4561673 4685798 4815541 4951404 5094093 5243683 5399362 5559099
59071 5559099 5720378 5882340 6046183 6212183 6377352 6537600 6691069 6837462 6975218
59062 6975218 7101891 7217016 7322283 7418862 7506622 7586147 7659686 7729734 7798242 7867426 7940015
$$ packed form
59132I514586n29966m98040m64218m28636l93030l60443l31914l05531k79458
59123E923350k54097k30671k09704j91525j76377j63253j50277j36995j24720
59114D285731j14153j04356r4599q5469p7482p0208o3368n7292n1737m5583l8257
59103C483227l0190k1850j3785p394l681j131L150R975J7591K4669L1573L8379
59091C530533M4142M8821N3831N9874O6165P2379P9198Q6362R2417R7262J02819
59080D333803J10125J17745J24125J29743J35863J42689J49590J55679J59737
59071E559099J61279J61962J63843J66000J65169J60248J53469J46393J37756
59062F975218J26673J15125J05267R6579Q7760P9525P3539P0048O8508O9184P2589
$$ plain form
59051 7940015 8018523 8105269 8202741 8312566 8434611 8568741 8716956 8881734 9062268 9254198
59041 9254198 9452888 9654651 9854388 10044386 10216474 10363784 10479679 10556983 10590052 10576954
59031 10576954 10518922 10418728 10280665 10111283 9918743 9711148 9495700 9278970 9067224
59022 9067224 8865915 8678450 8505445 8345775 8198661 8064004 7940184 7822699 7706237
59013 7706237 7587647 7465992 7340505 7209790 7072371 6926639 6770778 6604307 6429409
59004 6429409 6249267 6065305 5877424 5686598 5495497 5306532 5120771 4938861 4761612
58995 4761612 4589512 4422920 4262863 4110482 3965724 3827652 3695869 3570515 3451284
58986 3451284 3337955 3231603 3133530 3042970 2957474 2875723 2798344 2725796 2657158 2591511 2529089
$$ packed form
59051G940015P8508Q6746R7472J09825J22045J34130J48215J64778J80534J91930
59041I254198J98690K01763J99737J89998J72088J47310J15895P7304L3069j3098
59031A0576954n8032j00194j38063j69382j92540k07595k15448k16730k11746
59022I067224k01309j87465j73005j59670j47114j34657j23820j17485j16462
59013G706237j18590j21655j25487j30715j37419j45732j55861j66471j74898
59004F429409j80142j83962j87881j90826j91101j88965j85761j81910j77249
58995D761612j72100j66592j60057j52381j44758j38072j31783j25354j19231
58986C451284j13329j06352r8073r0560q5496q1751p7379p2548o8638o5647o2422
$$ plain form
58975 2529089 2470519 2416074 2366050 2320769 2279955 2243241 2211438 2186013 2167052 2152856 2141725
58964 2141725 2132839 2125229 2117359 2108374 2098834 2089847 2082154 2076035 2071022 2065724 2059074 2051762 2045458 2040845
58950 2040845 2037640 2036159 2037104 2039857 2042776 2045460 2049112 2054374 2060466 2066812 2073798 2081306 2088185 2093941
58936 2093941 2099509 2105510 2111102 2115523 2119663 2125185 2132882 2142601 2154039 2166936 2181037 2196248 2212352
58923 2212352 2228657 2244780 2261713 2280941 2302449 2324742 2346924 2369529 2393181 2417765 2443189
58912 2443189 2469715 2497175 2525094 2553940 2585135 2619507 2656687 2695982 2736610 2777259 2817095
58901 2817095 2857384 2900412 2946434 2993306 3039634 3086606 3136072 3188512 3243740 3302277 3365061
58890 3365061 3432822 3506210 3585360 3669030 3755717 3846168 3943234 4048621 4161421 4280578 4407010
$$ packed form
58975B529089n8570n4445n0024m5281m0814l6714l1803k5425j8961j4196j1131
58964B141725q886p610p870q985r540q987p693o119n013n298o650p312o304m613
58950B040845l205j481R45K753K919K684L652N262O092O346O986P508O879N756
58936B093941N568O001N592M421M140N522P697R719J1438J2897J4101J5211J6104
58923B212352J6305J6123J6933J9228K1508K2293K2182K2605K3652K4584K5424
58912B443189K6526K7460K7919K8846L1195L4372L7180L9295M0628M0649L9836
58901B817095M0289M3028M6022M6872M6328M6972M9466N2440N5228N8537O2784
58890C365061O7761P3388P9150Q3670Q6687R0451R7066J05387J12800J19157J26432
$$ plain form
58879 4407010 4542240 4686540 4839768 5002633 5175769 5358863 5552276 5758606 5981192
58870 5981192 6221639 6479918 6756119 7050879 7364917 7699717 8058537 8445513 8863745
58861 8863745 9314826 9799947 10320684 10878919 11476699 12116190 12799456 13528356 14304439
58852 14304439 15128051 15997015 16906551 17850484 18821600 19810269 20803167 21783571 22732091
58843 22732091 23626574 24442062 25152266 25732448 26162395 26428207 26522176 26441840 26190462 25778984
58833 25778984 25226019 24553944 23784716 22939587 22040782 21110536 20168057 19228896 18306793
58824 18306793 17413894 16558716 15745649 14976970 14254124 13577236 12945279 12357131 11811056
58815 11811056 11303237 10828856 10385075 9971252 9586006 9226028 8888139 8570556 8271675
$$ packed form
58879D407010J35230J44300J53228J62865J73136J83094J93413K06330K22586
58870E981192K40447K58279K76201K94760L14038L34800L58820L86976M18232
58861H863745M51081M85121N20737N58235N97780O39491O83266P28900P76083
58852A4304439Q23612Q68964R09536R43933R71116R88669R92898R80404R48520
58843B2732091Q94483Q15488P10204N80182M29947K65812R3969q0336k51378m11478
58833B5778984n52965o72075p69228q45129q98805r30246r42479r39161r22103
58824A8306793q92899q55178q13067p68679p22846o76888o31957n88148n46075
58815A1811056n07819m74381m43781m13823l85246l59978l37889l17583k98881
$$ plain form
58806 8271675 7989739 7724437 7476834 7246887 7032808 6833511 6649629 6481210 6326506
58797 6326506 6184124 6054458 5937797 5832958 5739119 5657201 5587831 5529392 5479681 5438286
58787 5438286 5406086 5383565 5370976 5369178 5379102 5401029 5434887 5480216 5535527 5599357 5672519 5757572
58775 5757572 5855391 5964158 6082554 6211915 6354256 6510325 6680927 6867980 7072517 7293536
58765 7293536 7530599 7785908 8062106 8359805 8679249 9022854 9393973 9794451 10225538
58756 10225538 10690136 11191957 11733103 12314333 12937007 13603034 14313406 15068235 15867424
58747 15867424 16709468 17589664 18500203 19431047 20369513 21299709 22203295 23059758 23845111
58738 23845111 24532218 25094846 25511871 25767994 25853043 25763099 25501831 25079607 24512065 23820017
$$ packed form
58806H271675k81936k65302k47603k29947k14079j99297j83882j68419j54704
58797F326506j42382j29666j16661j04839r3839q1918o9370n8439m9711m1395
58787E438286l2200k2521j2589j798R924K1927L3858M5329N5311O3830P3162Q5053
58775E757572R7819J08767J18396J29361J42341J56069J70602J87053K04537K21019
58765G293536K37063K55309K76198K97699L19444L43605L71119M00478M31087
58756A0225538M64598N01821N41146N81230O22674O66027P10372P54829P99189
58747A5867424Q42044Q80196R10539R30844R38466R30196R03586Q56463P85353
58738B3845111O87107N62628M17025K56123Q5049q9944k61268m22224n67542o92048
$$ plain form
58728 23820017 23028307 22162027 21243610 20293565 19331604 18374877 17436127 16524909 15649098
58719 15649098 14813697 14020001 13268196 12559637 11895075 11272475 10689036 10143902 9636362
58710 9636362 9162659 8717512 8298317 7905297 7537996 7194160 6871959 6570983 6290790
58701 6290790 6030125 5787477 5560900 5347708 5146043 4956401 4780053 4616400 4463427
58692 4463427 4320181 4186986 4063665 3949325 3843616 3746584 3657583 3575706 3500669 3431757
58682 3431757 3366703 3303523 3242948 3187150 3136386 3088740 3042817 2998823 2957225 2918207 2882470
58671 2882470 2850762 2822310 2794982 2767136 2738369 2708780 2678616 2648357 2618045 2586832 2553960
58660 2553960 2519412 2482819 2442955 2399692 2355251 2311782 2268646 2223711 2176482 2128207 2079939
$$ packed form
58728B3820017p91710q66280r18417r50045r61961r56727r38750r11218q75811
58719A5649098q35401p93696p51805p08559o64562o22600n83439n45134n07540
58710I636362m73703m45147m19195l93020l67301l43836l22201l00976k80193
58701F290790k60665k42648k26577k13192k01665j89642j76348j63653j52973
58692D463427j43246j33195j23321j14340j05709r7032q9001q1877p5037o8912
58682C431757o5054o3180o0575n5798n0764m7646m5923m3994m1598l9018l5737
58671B882470l1708k8452k7328k7846k8767k9589l0164l0259l0312l1213l2872
58660B553960l4548l6593l9864m3263m4441m3469m3136m4935m7229m8275m8268
$$ plain form
58649 2079939 2032433 1987187 1945439 1906586 1869399 1834204 1802027 1772325 1743589 1715690 1689602
58638 1689602 1665166 1641067 1616602 1591657 1565506 1537755 1510074 1484770 1461712 1438712 1414995
58627 1414995 1392357 1372636 1355720 1340275 1325113 1309738 1294647 1281040 1269502 1259612 1251533 1246611
58615 1246611 1245073 1244750 1244008 1244565 1249117 1257307 1266451 1275167 1283612 1291023 1296126 1299760 1304183 1309705 1314477
58600 1314477 1317457 1318947 1318232 1313675 1305805 1297779 1291894 1287685 1284204 1282163 1282879 1286551 1292485 1300027
58586 1300027 1308890 1319411 1332479 1348447 1366610 1386660 1409670 1436226 1464783 1493706 1523942
58575 1523942 1557636 1595097 1635419 1679074 1727188 1779003 1833008 1890204 1953347 2023175 2098364
58564 2098364 2179216 2268176 2366180 2471442 2582845 2702225 2832472 2975428 3132334 3304371
$$ packed form
58649B079939m7506m5246m1748l8853l7187l5195l2177k9702k8736k7899k6088
58638A689602k4436k4099k4465k4945k6151k7751k7681k5304k3058k3000k3717
58627A414995k2638j9721j6916j5445j5162j5375j5091j3607j1538r890q079m922
58615A246611j538l23p42N57M552Q190R144Q716Q445P411N103L634M423N522M772
58600A314477K980J490p15m557p870q026n885m209l481k041P16L672N934P542
58586A300027Q863J0521J3068J5968J8163K0050K3010K6556K8557K8923L0236
58575A523942L3694L7461M0322M3655M8114N1815N4005N7196O3143O9828P5189
58564B098364Q0852Q8960R8004J05262J11403J19380J30247J42956J56906J72037
$$ plain form
58554 3304371 3492074 3695737 3916481 4155066 4409566 4676126 4951808 5234389 5519230
58545 5519230 5798638 6064394 6308535 6521532 6692618 6813187 6878525 6886406 6836523 6732025
58535 6732025 6579704 6388172 6167110 5927323 5678354 5425460 5171210 4920143 4679059
58526 4679059 4452256 4239330 4038706 3850978 3677857 3520109 3377644 3249863 3135038
58517 3135038 3031038 2937207 2853924 2780179 2713593 2653007 2598850 2550708 2506865 2466547 2430175
58506 2430175 2396873 2364276 2331506 2299866 2269736 2239219 2207057 2174739 2144459 2116579 2090041
58495 2090041 2063721 2036672 2008432 1979639 1950976 1921531 1889763 1855875 1821202 1785605 1747982
58484 1747982 1709399 1672939 1639952 1608929 1578529 1549246 1521556 1494965 1469651 1446699 1425904
$$ packed form
58554C304371J87703K03663K20744K38585K54500K66560K75682K82581K84841
58545E519230K79408K65756K44141K12997J71086J20569O5338P881m9883j04498
58535F732025j52321j91532k21062k39787k48969k52894k54250k51067k41084
58526D679059k26803k12926k00624j87728j73121j57748j42465j27781j14825
58517C135038j04000r3831q3283p3745o6586o0586n4157m8142m3843m0318l6372
58506B430175l3302l2597l2770l1640l0130l0517l2162l2318l0280k7880k6538
58495B090041k6320k7049k8240k8793k8663k9445l1768l3888l4673l5597l7623
58484A747982l8583l6460l2987l1023l0400k9283k7690k6591k5314k2952k0795
$$ plain form
58473 1425904 1405521 1384839 1364961 1346504 1328794 1311828 1296752 1283712 1271299 1258647 1246120
58462 1246120 1233706 1220840 1207984 1196130 1184708 1172395 1159953 1149615 1141661 1134460 1128051 1124563
58450 1124563 1124542 1125842 1126871 1128261 1130762 1134067 1138186 1143476 1149072 1153761 1158162 1163220 1167094 1166979 1163502
58435 1163502 1159415 1154401 1145906 1135206 1127266 1123416 1119207 1111309 1101741 1093121 1084370 1073853 1062723
58422 1062723 1052191 1041043 1028778 1018060 1011110 1006248 1000626 994013 987532 981002 973794 966441 959709
58409 959709 953885 949891 948680 948724 946975 943032 939110 935199 928267 917697 907526 901377 898637 897288
58395 897288 896836 896719 895649 894524 896390 901711 907447 912383 919068 928490 937522 944338 951873 962733
58381 962733 974744 984834 993632 1002944 1012208 1020728 1030097 1041257 1052222 1061437 1069962 1077671 1081158
$$ packed form
58473A425904k0383k0682j9878j8457j7710j6966j5076j3040j2413j2652j2527
58462A246120j2414j2866j2856j1854j1422j2313j2442j0338p954p201o409l488
58450A124563k1J300J029J390K501L305M119N290N596M689M401N058L874j15l477
58435A163502m087n014q495j0700p940l850m209p898r568q620q751j0517j1130
58422A062723j0532j1148j2265j0718o950m862n622o613o481o530p208p353o732
58409I59709n824l994j211M4j749l943l922l911o932j0570j0171o149k740j349
58395H97288m52j17j070j125J866N321N736M936O685R422R032O816P535J0860
58381I62733J2011J0090Q798R312R264Q520R369J1160J0965R215Q525P709L487
$$ plain form
58368 1081158 1078649 1073349 1068710 1063936 1057279 1049941 1043207 1035347 1024984 1014160 1004687 995102 984672
58355 984672 976582 973269 972223 970246 968235 967901 967610 965869 965281 968517 973688 978103 983111 990681 998805
58340 998805 1005295 1012726 1024258 1037548 1048263 1056977 1067047 1078120 1087453 1095750 1106085 1118310
58328 1118310 1129739 1140358 1152725 1167708 1184418 1202999 1223450 1243096 1259094 1271898 1282862
58317 1282862 1290663 1294035 1295702 1299264 1304091 1307275 1308581 1309444 1309399 1307712 1306365 1307190 1308196 1306909 1305166
58302 1305166 1306362 1310144 1313974 1317690 1322388 1327159 1331134 1336397 1344732 1353807 1360484 1365192 1369286 1371379
58288 1371379 1370684 1370596 1374173 1379139 1381897 1383260 1385594 1388025 1389501 1392836 1400370 1409356 1417039 1426232 1439852
58273 1439852 1454122 1463858 1470870 1480277 1492023 1503182 1515297 1531807 1550778 1567533 1582226 1598020
$$ packed form
58368A081158k509n300m639m774o657p338o734p860j0363j0824r473r585j0430
58355I84672q090l313j046j977k011l34k91j741n88L236N171M415N008P570Q124
58340I98805O490P431J1532J3290J0715Q714J0070J1073R333Q297J0335J2225
58328A118310J1429J0619J2367J4983J6710J8581K0451J9646J5998J2804J0964
58317A282862P801L372J667L562M827L184J306Q63m5j687j347Q25J006j287j743
58302A305166J196L782L830L716M698M771L975N263Q335R075O677M708M094K093
58288A371379o95q8L577M966K758J363K334K431J476L335P534Q986P683R193J3620
58273A439852J4270R736P012R407J1746J1159J2115J6510J8971J6755J4693J5794
$$ plain form
58261 1598020 1614491 1629962 1647440 1670707 1696935 1720613 1742261 1765804 1790184 1811725 1832314
58250 1832314 1856676 1883391 1907053 1927969 1951517 1979121 2007660 2036439 2066885 2096804 2122857
58239 2122857 2147481 2175810 2207288 2237930 2268873 2304545 2344057 2382624 2420004 2459614 2501159
58228 2501159 2542194 2584965 2633404 2685413 2736308 2787416 2842776 2900268 2955194 3009720 3069142
58217 3069142 3131736 3192382 3253395 3321110 3394369 3467327 3541024 3620763 3704375 3785042 3863911
58206 3863911 3948028 4037612 4127456 4219045 4318807 4426031 4535220 4648712 4773775 4908832
58196 4908832 5046250 5187431 5341001 5507053 5677603 5852023 6037587 6235432 6440889
58187 6440889 6657232 6893836 7150855 7420878 7705365 8013984 8348355 8702700 9080004
$$ packed form
58261A598020J6471J5471J7478K3267K6228K3678K1648K3543K4380K1541K0589
58250A832314K4362K6715K3662K0916K3548K7604K8539K8779L0446K9919K6053
58239B122857K4624K8329L1478L0642L0943L5672L9512L8567L7380L9610M1545
58228B501159M1035M2771M8439N2009N0895N1108N5360N7492N4926N4526N9422
58217C069142O2594O0646O1013O7715P3259P2958P3697P9739Q3612Q0667P8869
58206C863911Q4117Q9584Q9844R1589R9762J07224J09189J13492J25063J35057
58196D908832J37418J41181J53570J66052J70550J74420J85564J97845K05457
58187F440889K16343K36604K57019K70023K84487L08619L34371L54345L77304
$$ plain form
58178 9080004 9490867 9936993 10413054 10923937 11481788 12086527 12728222 13408007 14136724
58169 14136724 14913425 15726080 16573190 17463000 18392205 19349566 20341739 21391925 22512573
58160 22512573 23704106 24979916 26364349 27864118 29470105 31189601 33048020 35058146
58152 35058146 37219900 39552608 42093858 44864907 47873902 51155868 54771317 58765630
58144 58765630 63176584 68087671 73626711 79905667 87010579 95053529 104179942 114529702
58136 114529702 126267460 139658192 155027048 172623983 192601264 215116231 240364696
58129 240364696 268595791 300325945 336392870 376994994 419829105 459147858 487472443
58122 487472443 499190455 493171372 472485351 442097166 406720691 369917982 334047793
$$ packed form
58178I080004M10863M46126M76061N10883N57851O04739O41695O79785P28717
58169A4136724P76701Q12655Q47110Q89810R29205R57361R92173J050186J120648
58160B2512573J191533J275810J384433J499769J605987J719496J858419K010126
58152C5058146K161754K332708K541250K771049L008995L281966L615449L994313
58144E8765630M410954M911087N539040O278956P104912Q042950R126413J0349760
58136A14529702J1737758J3390732J5368856J7596935J9977281K2514967K5248465
58129B40364696K8231095L1730154L6066925M0602124M2834111L9318753K8324585
58122D87472443J1718012o019083k0686021l0388185l5376475l6802709l5870189
$$ plain form
58115 334047793 300455187 269761977 242206919 217841374 196542481 178035188 162004765
58108 162004765 148171844 136273216 126055831 117325759 109957598 103836120 98821736
58101 98821736 94765818 91498069 88784509 86359038 84040354 81802161 79712864 77813039
58093 77813039 76027655 74143551 71866112 68958615 65380155 61297313 56967942 52626812
58085 52626812 48453018 44572005 41043513 37864602 35007628 32448411 30158038 28096786
58077 28096786 26233658 24556005 23049973 21688819 20449470 19322590 18296602 17348686
58069 17348686 16461371 15632593 14860567 14133849 13444873 12798312 12197018 11633076 11100661
58060 11100661 10604077 10144792 9713389 9302431 8915307 8554830 8214907 7890867 7586422
$$ packed form
58115C34047793l3592606l0693210k7555058k4365545k1298893j8507293j6030423
58108A62004765j3832921j1898628j0217385q730072p368161o121478n014384
58101I8821736m055918l267749k713560k425471k318684k238193k089297j899825
58093G7813039j785384j884104k277439k907497l578460m082842m329371m341130
58085E2626812m173794l881013l528492l178911k856974k559217k290373k061252
58077B8096786j863128j677653j506032j361154j239349j126880j025988r47916
58069A7348686q87315q28778p72026p26718o88976o46561o01294n63942n32415
58060A1100661m96584m59285m31403m10958l87124l60477l39923l24040l04445
$$ plain form
58051 7586422 7302812 7032030 6768074 6514597 6274495 6042215 5813351 5592165 5382723
58042 5382723 5181589 4985550 4797637 4619546 4446900 4277792 4117327 3968190 3825361
58033 3825361 3685527 3552884 3430047 3311960 3194705 3082051 2977483 2877797 2780357 2688795
58023 2688795 2605543 2526020 2446111 2368548 2296570 2228069 2161266 2099368 2044402 1992891 1942476
58012 1942476 1896303 1856134 1817770 1778110 1740176 1706482 1674095 1641043 1610925 1586124 1562941
58001 1562941 1538589 1516731 1500679 1487046 1471385 1454625 1438960 1422924 1405561 1390043 1378224
57990 1378224 1366683 1352744 1339150 1328396 1317875 1305178 1292685 1282297 1271237 1257936 1246447
57979 1246447 1239855 1234656 1227014 1219365 1215311 1212946 1209054 1205378 1204850 1205567 1204115 1201161 1198469 1194041
$$ packed form
58051G586422k83610k70782k63956k53477k40102k32280k28864k21186k09442
58042E382723k01134j96039j87913j78091j72646j69108j60465j49137j42829
58033C825361j39834j32643j22837j18087j17255j12654j04568r9686r7440r1562
58023B688795q3252p9523p9909p7563p1978o8501o6803o1898n4966n1511n0415
58012A942476m6173m0169l8364l9660l7934l3694l2387l3052l0118k4801k3183
58001A562941k4352k1858j6052j3633j5661j6760j5665j6036j7363j5518j1819
57990A378224j1541j3939j3594j0754j0521j2697j2493j0388j1060j3301j1489
57979A246447o592n199p642p649m054k365l892l676n28P17j452k954k692m428
$$ plain form
57965 1194041 1185524 1175040 1165664 1156520 1146153 1137054 1131616 1126937 1118913 1108549 1099206 1090451 1079713
57952 1079713 1067520 1056155 1045275 1033340 1021346 1010923 1000835 989303 977668 968132 960066 951922
57940 951922 944331 937962 931056 922556 914874 910067 906029 899982 892851 886750 881156 875233 870904 869765
57926 869765 869843 869198 869801 873929 879645 883952 887611 892661 897796 900523 901594 903159 904695 904685 904074 904116
57910 904116 903057 898823 892806 887238 881191 873085 864584 857857 851349 842614 833136 825814 819660 811624
57896 811624 802072 793923 787622 781294 774796 769555 765334 760905 756894 754467 752424 749049 745415 743381
57882 743381 741904 739110 736518 737209 740910 744694 747458 749989 751701 751245 749712 749555 750721 750823 748459
57867 748459 743537 735649 725221 715106 707771 702067 695768 689804 686619 685842 685307 685073 686682 689450
$$ packed form
57965A194041q517j0484r376r144j0367r099n438m679q024j0364r343q755j0738
57952A079713j2193j1365j0880j1935j1994j0423j0088j1532j1635r536q066q144
57940I51922p591o369o906q500p682m807m038o047p131o101n594n923m329j139
57926H69765P8o45O03M128N716M307L659N050N135K727J071J565J536j0o11M2
57910I04116j059m234o017n568o047q106q501o727o508q735r478p322o154q036
57896H11624r552q149o301o328o498n241m221m429m011k427k043l375l634k034
57882G43381j477k794k592O91L701L784K764K531J712m56j533j57J166J02k364
57867G48459m922p888j0428j0115p335n704o299n964l185p77n35k34J609K768
$$ plain form
57853 689450 691354 692788 695857 700687 705939 712186 721052 731525 740776 748375 756375 765416 773745 779773
57839 779773 782949 782834 780099 777487 776876 776431 773600 769489 766805 764898 760843 754547 748594 743551 737532
57824 737532 730279 723644 717855 711009 702668 694526 687167 679401 671171 664089 658715 654197 650836 650172
57810 650172 652283 655611 659566 664708 670439 675299 679641 685436 693355 702345 711769 721511 730507 737824
57796 737824 744619 752244 759106 762513 762990 763383 764072 762600 757960 751681 744461 735218 723894 711937
57782 711937 699527 685520 670681 657783 647740 638634 629369 621368 615767 611558 607540 603684 599699
57769 599699 594478 587744 580272 571998 561999 550677 539898 530597 522218 514595 508123 501985 494476 485454
57755 485454 476504 468658 461888 456480 452625 448969 444026 438742 435283 433809 433049 433360 436020 439996 442924
$$ packed form
57853F89450J904J434L069M830N252O247Q866J0473R251P599Q000R041Q329O028
57839G79773L176j15k735k612o11m45k831m111k684j907m055o296n953n043o019
57824G37532p253o635n789o846q341q142p359p766q230p082n374m518l361o64
57810F50172K111L328L955N142N731M860M342N795P919Q990R424R742Q996P317
57796G37824O795P625O862L407M77L93O89j472m640o279p220r243j1324j1957
57782G11937j2410j4007j4839j2898j0043r106r265q001n601m209m018l856l985
57769E99699n221o734p472q274r999j1322j0779r301q379p623o472o138p509r022
57755D85454q950p846o770n408l855l656m943n284l459j474p60L11K660L976K928
$$ plain form
57740 442924 445198 449466 455822 461182 464089 466543 470097 473426 474964 474978 473928 471547 468664 467262 467590
57725 467590 467693 466698 466025 466544 467146 467125 467484 468833 470256 470970 470910 469301 465229 459955 455824 452436 447073
57708 447073 439625 433671 431505 431205 429963 427388 424201 420781 418570 420028 425366 431740 437049 441971
57694 441971 447044 450909 453244 456406 461886 467706 471602 474455 478247 482749 486590 489783 492967 495732
57680 495732 497773 500254 504139 508491 512007 514906 517866 520671 523383 527201 532600 538087 542269 545808
57666 545808 550144 555845 563191 572473 582511 590929 597250 603830 612460 622294 632546 644683 659854
57653 659854 676366 692101 707640 724595 742423 759455 776041 794326 815472 838900 863705
57642 863705 889455 916360 945758 979441 1017518 1058101 1099957 1143952 1191034 1240781 1293180
$$ packed form
57740D42924K274M268O356N360K907K454L554L329J538J4j050k381k883j402L28
57725D67590J03r95o73N19O02k1L59J349J423P14o0j609m072n274m131l388n363
57708D47073p448n954k166l00j242k575l187l420k211J458N338O374N309M922
57694D41971N073L865K335L162N480N820L896K853L792M502L841L193L184K765
57680D95732K041K481L885M352L516K899K960K805K712L818N399N487M182L539
57666E45808M336N701P346R282J0038Q418O321O580Q630R834J0252J2137J5171
57653F59854J6512J5735J5539J6955J7828J7032J6586J8285K1146K3428K4805
57642H63705K5750K6905K9398L3683L8077M0583M1856M3995M7082M9747N2399
$$ plain form
57631 1293180 1349887 1412117 1479030 1549843 1626018 1709840 1802444 1904657 2018053 2143628 2281165
57620 2281165 2431361 2596715 2778779 2976618 3189685 3419864 3668335 3932454 4208101
57611 4208101 4493033 4784885 5077000 5358732 5618596 5844592 6022890 6139790 6185810 6157291
57601 6157291 6055995 5889901 5673450 5424005 5157020 4884471 4615576 4356549 4110577
57592 4110577 3879948 3667316 3473599 3296626 3134121 2986552 2854908 2737621 2632528
57583 2632528 2540192 2461924 2395552 2336627 2283501 2238203 2202424 2175387 2155612 2142158 2134084
57572 2134084 2131042 2134416 2145820 2164742 2189735 2221423 2261767 2310651 2365925 2427116 2496722 2577432
57560 2577432 2670052 2774310 2889811 3015982 3152836 3301707 3463354 3635375 3813239 3993452
$$ packed form
57631A293180N6707O2230O6913P0813P6175Q3822R2604J02213J13396J25575J37537
57620B281165J50196J65354J82064J97839K13067K30179K48471K64119K75647
57611D208101K84932K91852K92115K81732K59864K25996J78298J16900M6020k8519
57601F157291j01296j66094k16451k49445k66985k72549k68895k59027k45972
57592D110577k30629k12632j93717j76973j62505j47569j31644j17287j05093
57583B632528r2336p8268o6372n8925n3126m5298l5779k7037j9775j3454q074
57572B134084l042L374J1404J8922K4993L1688M0344M8884N5274O1191O9606Q0710
57560B577432R2620J04258J15501J26171J36854J48871J61647J72021J77864J80213
$$ plain form
57550 3993452 4173533 4348882 4511870 4654201 4768428 4847696 4886838 4884604 4843149 4765168
57540 4765168 4653308 4512321 4349363 4171326 3983375 3790190 3596543 3405916 3220146
57531 3220146 3041050 2871075 2711958 2564022 2427068 2300760 2184140 2076148 1976574 1885255
57521 1885255 1800688 1721002 1645981 1576383 1511709 1450769 1394297 1344546 1301827 1263487 1226920
57510 1226920 1191855 1159306 1130052 1104626 1082970 1063491 1044080 1024721 1007690 994676 985034
57499 985034 977154 970068 963302 956641 950676 946533 944842 945779 949785 956787 965218 973657 983161 996035
57485 996035 1012414 1030148 1048030 1066829 1087082 1108455 1131824 1159530 1192684 1230324 1271837
57474 1271837 1317905 1368234 1420864 1475047 1532683 1595631 1663649 1736431 1815671 1903362 1999605
$$ packed form
57550C993452J80081J75349J62988J42331J14227P9268L9142k234m1455p7981
57540D765168j11860j40987j62958j78037j87951j93185j93647j90627j85770
57531C220146j79096j69975j59117j47936j36954j26308j16620j07992r9574r1319
57521A885255q4567p9686p5021o9598o4674o0940n6472m9751m2719l8340l6567
57510A226920l5065l2549k9254k5426k1656j9479j9411j9359j7031j3014r642
57499I85034p880p086o766o661n965m143j691R37M006P002Q431Q439R504J2874
57485I96035J6379J7734J7882J8799K0253K1373K3369K7706L3154L7640M1513
57474A271837M6068N0329N2630N4183N7636O2948O8018P2782P9240Q7691R6243
$$ plain form
57463 1999605 2103724 2216069 2337059 2465679 2600511 2741196 2887170 3035550 3181423
57454 3181423 3319564 3444945 3552488 3637387 3695295 3722130 3715285 3675853 3608283 3517161 3405823
57443 3405823 3278683 3142422 3002932 2862615 2722461 2585344 2455258 2334429 2223231
57434 2223231 2122070 2031222 1949364 1874305 1805087 1741916 1684616 1632911 1587865 1551016 1521989
57423 1521989 1498647 1479835 1466406 1459128 1457057 1458702 1463783 1473161 1487678 1507694 1533349 1564895
57411 1564895 1602935 1648339 1701527 1761814 1827820 1898650 1974520 2056314 2144800 2240074 2341471
57400 2341471 2448129 2559757 2676570 2798178 2922780 3047630 3169721 3285351 3389128
57391 3389128 3474148 3533727 3563268 3560869 3526636 3461947 3369688 3254848 3123912 2982839 2835642
$$ packed form
57463A999605J04119J12345J20990J28620J34832J40685J45974J48380J45873
57454C181423J38141J25381J07543Q4899N7908K6835o845l9432o7570r1122j11338
57443C405823j27140j36261j39490j40317j40154j37117j30086j20829j11198
57434B223231j01161r0848q1858p5059o9218o3171n7300n1705m5046l6849k9027
57423A521989k3342j8812j3429p278k071J645N081R378J4517K0016K5655L1546
57411A564895L8040M5404N3188O0287O6006P0830P5870Q1794Q8486R5274J01397
57400B341471J06658J11628J16813J21608J24602J24850J22091J15630J03777
57391C389128Q5020N9579K9541k399l4233o4689r2259j14840j30936j41073j47197
$$ plain form
57380 2835642 2684953 2533382 2383851 2239137 2101641 1972923 1852882 1740198 1634541
57371 1634541 1537504 1450302 1371571 1299055 1232610 1173446 1120898 1072344 1026481 984372 946733
57360 946733 912271 879512 848445 819565 792992 769243 749079 731614 714336 696095 678472
57349 678472 663145 649603 636722 624857 614658 605295 595680 586429 578759 572170 564968 556619 548158
57336 548158 540683 534678 530339 527222 523910 519203 513539 508424 504929 503462 504296 507228 511098 514599
57322 514599 517324 519481 521184 522676 524622 527468 531000 534878 538833 542141 544249 546436 551316 559795
57308 559795 569979 580054 590587 602610 615192 626761 637473 648248 658557 667398 675678 685325
57296 685325 696372 707010 716362 725307 734599 743954 753139 762470 772131 782253 793499 806320 819955
$$ packed form
57380B835642j50689j51571j49531j44714j37496j28718j20041j12684j05657
57371A634541r7037q7202p8731p2516o6445n9164n2548m8554m5863m2109l7639
57360I46733l4462l2759l1067k8880k6573k3749k0164j7465j7278j8241j7623
57349F78472j5327j3542j2881j1865j0199r363r615r251p670o589p202q349q461
57336E48158p475o005m339l117l312m707n664n115l495j467Q34K932L870L501
57322E14599K725K157J703J492J946K846L532L878L955L308K108K187M880Q479
57308E59795J0184J0075J0533J2023J2582J1569J0712J0775J0309Q841Q280R647
57296F85325J1047J0638R352Q945R292R355R185R331R661J0122J1246J2821J3635
$$ plain form
57283 819955 833561 847864 864037 881226 897025 910373 922283 933686 944404 954455 964608
57272 964608 975138 985569 996185 1008317 1022483 1037502 1052181 1066758 1082000 1097865 1113906
57261 1113906 1130382 1148164 1167777 1188870 1210391 1231308 1251444 1271519 1292118 1313114 1334561
57250 1334561 1357439 1382509 1408894 1434770 1459062 1481608 1502332 1521580 1540874 1561922 1585026
57239 1585026 1609517 1635220 1662187 1689643 1716974 1745435 1776920 1811150 1846173 1881843 1920581
57228 1920581 1963924 2010231 2056878 2103166 2150017 2198154 2247899 2299796 2354069 2409816 2465592
57217 2465592 2520564 2574595 2627687 2679813 2731015 2781321 2830695 2878904 2924952 2966909 3003034
57206 3003034 3032913 3056824 3074456 3085278 3089726 3088757 3082597 3071373 3056946 3042386 3029343 3017365
$$ packed form
57283H19955J3606J4303J6173J7189J5799J3348J1910J1403J0718J0051J0153
57272I64608J0530J0431J0616J2132J4166J5019J4679J4577J5242J5865J6041
57261A113906J6476J7782J9613K1093K1521K0917K0136K0075K0599K0996K1447
57250A334561K2878K5070K6385K5876K4292K2546K0724J9248J9294K1048K3104
57239A585026K4491K5703K6967K7456K7331K8461L1485L4230L5023L5670L8738
57228A920581M3343M6307M6647M6288M6851M8137M9745N1897N4273N5747N5776
57217B465592N4972N4031N3092N2126N1202N0306M9374M8209M6048M1957L6125
57206C003034K9879K3911J7632J0822M448r69o160j1224j4427j4560j3043j1978
$$ plain form
57194 3017365 3006075 2996579 2990250 2987484 2988059 2991582 2997350 3005070 3015833 3030850 3048974 3067187 3083903
57181 3083903 3099909 3115519 3129108 3139690 3148984 3159178 3170156 3180682 3191102 3203012 3217061
57170 3217061 3233003 3251455 3273788 3300245 3329608 3361014 3395107 3433186 3475912 3523072 3574157
57159 3574157 3628945 3687519 3749521 3813436 3877083 3938799 3997694 4053059 4104506 4152543 4197629
57148 4197629 4238373 4272061 4297550 4316434 4330808 4341251 4347838 4351685 4354136 4355330 4354859 4353330 4352218
57135 4352218 4352571 4354641 4358231 4362669 4367000 4371005 4375614 4381792 4389569 4398653 4409273 4421881 4436756
57122 4436756 4454349 4475138 4498513 4522671 4546147 4568499 4588935 4605463 4616371 4621590 4621649 4616049
57110 4616049 4603528 4583032 4553529 4513779 4463523 4404645 4340461 4274079 4207420 4140670 4072195
$$ packed form
57194C017365j1290r496o329k766N75L523N768P720J0763J5017J8124J8213J6716
57181C083903J6006J5610J3589J0582R294J0194J0978J0526J0420J1910J4049
57170C217061J5942J8452K2333K6457K9363L1406L4093L8079M2726M7160N1085
57159C574157N4788N8574O2002O3915O3647O1716N8895N5365N1447M8037M5086
57148D197629M0744L3688K5489J8884J4374J0443O587L847K451J194m71j529j112
57135D352218L53K070L590M438M331M005M609O178P777R084J0620J2608J4875
57122D436756J7593K0789K3375K4158K3476K2352K0436J6528J0908N219N9n600
57110D616049j2521k0496k9503l9750n0256n8878o4184o6382o6659o6750o8475
$$ plain form
57099 4072195 3999934 3923265 3842518 3756661 3663195 3560812 3450261 3331853 3204213 3066637
57089 3066637 2920533 2766892 2604204 2430732 2247264 2055671 1856106 1647465 1429269
57080 1429269 1201074 961274 708553 443583 167516 -120148 -420482 -733262 -1058518
57071 -1058518 -1399130 -1760259 -2147414 -2566783 -3025829 -3531007 -4085572 -4691358 -5351546
57062 -5351546 -6070193 -6851157 -7699883 -8624561 -9633122 -10731194 -11925892 -13229868 -14659016
57053 -14659016 -16228720 -17955807 -19861700 -21969539 -24300716 -26879311 -29738438 -32917563
57045 -32917563 -36455712 -40393328 -44780359 -49678364 -55157928 -61302526 -68216691 -76027015
57037 -76027015 -84878331 -94935585 -106385063 -119419965 -134217161 -150926247 -169670353
$$ packed form
57099D072195p2261p6669q0747q5857r3466j02383j10551j18408j27640j37576
57089C066637j46104j53641j62688j73472j83468j91593j99565k08641k18196
57080A429269k28195k39800k52721k64970A67516a20148l00334l12780l25256
57071a058518l40612l61129l87155m19369m59046n05178n54565o05786o60188
57062e351546p18647p80964q48726r24678j008561j098072j194698j303976j429148
57053a4659016j569704j727087j905893k107839k331177k578595k859127l179125
57045c2917563l538149l937616m387031m898005n479564o144598o914165p810324
57037g6027015q851316j0057254j1449478j3034902j4797196j6709086j8744106
$$ plain form
57030 -169670353 -190539058 -213566709 -238697396 -265727799 -294255351 -323736252 -353716897
57023 -353716897 -384072851 -414927827 -446144832 -476747423 -504805988 -527950382 -544135852
57016 -544135852 -552155465 -551713567 -543226805 -527584099 -505960436 -479670873 -450041342
57009 -450041342 -418299692 -385507400 -352547885 -320155889 -288940473 -259371351 -231754271
57002 -231754271 -206241346 -182878587 -161651269 -142503109 -125342363 -110051201 -96495379
56995 -96495379 -84529102 -74000854 -64762779 -56675969 -49608999 -43437894 -38050758 -33349332
56987 -33349332 -29244044 -25650511 -22492496 -19705319 -17234845 -15036072 -13074038 -11322379
56979 -11322379 -9757494 -8354702 -7090439 -5945410 -4904148 -3954076 -3086835 -2298088
$$ packed form
57030a69670353k0868705k3027651k5130687k7030403k8527552k9480901k9980645
57023c53716897l0355954l0854976l1217005l0602591k8058565k3144394j6185470
57016e44135852q019613M41898Q486762J5642706K1623663K6289563K9629531
57009d50041342L1741650L2792292L2959515L2391996L1215416K9569122K7617080
57002b31754271K5512925K3362759K1227318J9148160J7160746J5291162J3555822
56995i6495379J1966277J0528248R238075Q086810P066970O171105N387136M701426
56987c3349332M105288L593533L158015K787177K470474K198773J962034J751659
56979a1322379J564885J402792J264263J145029J041262R50072Q67241P88747
$$ plain form
56971 -2298088 -1583361 -934805 -342972 200182 701386 1166692 1599580 1999385 2363528
56962 2363528 2690745 2981149 3234767 3452296 3637045 3794847 3932270 4055323 4168499
56953 4168499 4273503 4369505 4455815 4534115 4607818 4680655 4756946 4841598 4937337 5041354 5145566
56942 5145566 5240640 5320347 5383406 5431595 5464561 5475050 5450040 5378239 5257093 5093229 4897971
56931 4897971 4683218 4459063 4231734 4002535 3769466 3530101 3283039 3028107 2766871
56922 2766871 2502578 2238269 1975059 1713298 1455213 1205234 967789 745575 539726
56913 539726 350493 177681 21296 -117997 -239509 -343413 -430569 -501677 -557257 -598277
56903 -598277 -626249 -642829 -649522 -647234 -635773 -614708 -585535 -552433 -520083 -491427 -468203 -452454
$$ packed form
56971b298088P14727O48556c42972B00182N01204M65306M32888L99805L64143
56962B363528L27217K90404K53618K17529J84749J57802J37423J23053J13176
56953D168499J05004R6002Q6310P8300P3703P2837P6291Q4652R5739J04017J04212
56942E145566R5074P9707O3059M8189L2966J0489k5010p1801j21146j63864j95258
56931D897971k14753k24155k27329k29199k33069k39365k47062k54932k61236
56922B766871k64293k64309k63210k61761k58085k49979k37445k22214k05849
56913E39726j89233j72812B1296a17997j21512j03904q7156p1108n5580m1020
56903e98277k7972j6580o693K288J1461K1065K9173L3102L2350K8656K3224J5749
$$ plain form
56891 -452454 -445781 -447454 -454641 -464463 -474975 -484802 -493444 -501754 -510637 -519121 -524916 -526912 -525785 -522060
56877 -522060 -515056 -504202 -490106 -473524 -454079 -430674 -402700 -370700 -336722 -304538 -278747 -262787
56865 -262787 -257521 -261486 -272033 -286480 -302954 -320426 -337771 -353084 -364474 -371199 -373510 -371946
56853 -371946 -367636 -362600 -358447 -354996 -351372 -348047 -346273 -345706 -344372 -341329 -337701 -334602 -331542 -327561
56839 -327561 -322495 -316287 -308320 -298305 -286778 -273868 -258698 -240898 -221634 -202000 -181168 -157235
56827 -157235 -129223 -97349 -62206 -25072 11412 44200 71412 92341 106341 113097 114072 112586
56815 112586 111845 113215 116405 120739 125821 131381 137206 143808 153114 167731 188822 214952 243783
56802 243783 274744 309194 348128 390672 434725 477504 514932 541938 554797 553055 539013 516278
$$ packed form
56891d52454O673j673p187r822j0512r827q642q310q883q484n795j996J127L725
56877e22060P004J0854J4096J6582J9445K3405K7974L2000L3978L2184K5791J5960
56865b62787N266l965j0547j4447j6474j7472j7345j5313j1390o725k311J564
56853c71946M310N036M153L451L624L325J774N67J334L043L628L099L060L981
56839c27561N066O208P967J0015J1527J2910J5170J7800J9264J9634K0832K3933
56827a57235K8012L1874L5143b5072A1412L2788K7212K0929J4000O756R75j486
56815A12586p41J370L190M334N082N560N825O602R306J4617K1091K6130K8831
56802B43783L0961L4450L8934M2544M4053M2779L7428K7006J2859j742j4042k2735
$$ plain form
56790 516278 489255 462662 439968 422343 409752 402501 401017 404838 412988 425411 443360 468444
56778 468444 501576 542557 590303 643797 702968 767884 836378 902700 958870 997409 1013500
56767 1013500 1006292 979067 937497 887052 832359 778439 730370 690554 657714 629928 607635
56756 607635 592403 584072 581019 582731 590299 604559 625293 652213 685225 723371 764366 805052
56744 805052 841316 867873 879719 874553 853607 820430 779454 734973 689933 645477 602338 562372
56732 562372 527768 499238 476284 459002 448113 443200 442543 445186 451939 463695 479782 498705
56720 498705 519640 542354 565737 586787 601092 604911 597714 582778 564489 544962 523810 500835
56708 500835 477592 455962 436277 417563 399120 381366 365406 352112 341375 332235 323863 316220
$$ packed form
56790E16278k7023k6593k2694j7625j2591p251j484L821Q150J2423J7949K5084
56778D68444L3132M0981M7746N3494N9171O4916O8494O6322N6170L8539J6091
56767A013500p208k7225m1570n0445n4693n3920m8069l9816l2840k7786k2293
56756F07635j5232q331l053J712P568J4260K0734K6920L3012L8146M0995M0686
56744H05052L6264K6557J1846n166k0946l3177m0976m4481m5040m4456m3139l9966
56732E62372l4604k8530k2954j7282j0889m913o57K643O753J1756J6087J8923
56720D98705K0935K2714K3383K1050J4305L819p197j4936j8289j9527k1152k2975
56708E00835k3243k1630j9685j8714j8443j7754j5960j3294j0737r140q372p643
$$ plain form
56696 316220 309437 303018 296380 289730 283577 277647 271307 264951 259870 256595 254268 251769 248689 245238
56682 245238 242194 240913 242186 244760 246103 245160 243488 243221 244713 246623 247492 246674 244488 242091 240720
56667 240720 240451 240105 238733 236702 234960 233790 232840 231833 230626 228832 226035 222392 218653 215560 213424
56652 213424 212224 211806 211838 211643 210389 207825 204824 202759 202098 201981 201382 200147 198608 196820 194771 192830
56636 192830 191303 189900 188255 186559 185078 183582 181888 180306 178745 176150 171932 167324 163900 161252
56622 161252 157631 152740 148311 145847 145254 145908 147644 150258 153259 156610 160694 165192 169042 171844 174251
56607 174251 176553 178107 178780 179865 182567 186171 188633 188792 187545 186993 188721 192678 197516 201975 205734
56592 205734 208904 211412 213483 216064 219823 224115 227808 230771 233685 236985 241006 246573 254084 262287
$$ packed form
56696C16220o783o419o638o650o153n930o340o356n081l275k327k499l080l451
56682B45238l044j281J273K574J343r43j672k67J492J910Q69q18k186k397j371
56667B40720k69l46j372k031j742j170r50j007j207j794k797l643l739l093k136
56652B13424j200m18L2j95j254k564l001k065o61j17n99j235j539j788k049j941
56636A92830j527j403j645j696j481j496j694j582j561k595m218m608l424k648
56622A61252l621m891m429k464n93O54J736K614L001L351M084M498L850K802K407
56607A74251K302J554O73J085K702L604K462J59j247n52J728L957M838M459L759
56592B05734L170K508K071K581L759M292L693K963K914L300M021N567P511Q203
$$ plain form
56578 262287 269194 273853 276108 275421 271714 266943 263827 263057 263280 263449 263166 261172 256166 249560 244911
56563 244911 243778 244173 243843 242914 242325 241712 240227 237940 235356 232907 231679 232881 235620 236999 235539
56548 235539 233027 231951 232848 235202 238899 243179 245875 245678 244087 243462 244235 245468 246976 249140 251449
56533 251449 252976 253839 254916 256511 258230 259574 260031 259547 259512 261938 266821 271749 275006 277493 280518
56518 280518 283654 286315 289512 293958 298022 299980 301196 304571 310550 317031 322826 328998 336798 346272
56504 346272 357027 368682 380366 391177 401371 412139 424243 437646 452129 467310 482390
56493 482390 496695 510086 522289 532639 541223 549261 557496 565299 572224 578969 585461 589429 588652
56480 588652 583703 576946 569831 562614 555460 547950 538542 526441 513185 500625 488321 474866 460694
$$ packed form
56578B62287O907M659K255o87l707m771l116p70K23J69k83j994n006o606m649
56563B44911j133L95l30r29n89o13j485k287k584k449j228J202K739J379j460
56548B35539k512j076Q97K354L697M280K696j97j591o25P73J233J508K164K309
56533B51449J527Q63J077J595J719J344M57m84l5K426M883M928L257K487L025
56518B80518L136K661L197M446M064J958J216L375N979O481N795O172P800R474
56504C46272J0755J1655J1684J0811J0194J0768J2104J3403J4483J5181J5080
56493D82390J4305J3391J2203J0350Q584Q038Q235P803O925O745O492L968p77
56480E88652m949o757p115p217p154p510r408j2101j3256j2560j2304j3455j4172
$$ plain form
56467 460694 447433 435321 423610 412814 404243 397804 392465 388309 385732 383127 378044 370698 363887
56454 363887 359278 355956 352698 349442 346235 342896 340137 339116 339500 339651 338875 337761 336356 333982 331018
56439 331018 328816 327578 326267 324838 324466 325157 325282 324230 323635 325020 327721 330029 331164 331490 331846 333142
56423 333142 335692 338722 341342 343685 345988 347247 346570 345311 345730 347646 348747 348401 348854 352070 357470
56408 357470 363493 369484 375329 380916 386743 393506 400533 406225 410537 415396 422100 429901 437649 445047
56394 445047 451738 456941 460888 465077 470292 475702 480435 484522 487812 489737 490839 492750 495743 497928
56380 497928 497867 496446 495089 493667 491376 488455 485624 482647 478701 473682 468347 463490 459336 455292 450224
56365 450224 443773 437371 432997 430975 430006 429195 428711 428532 428061 427081 425699 423301 419019 413284 407498 402328
$$ packed form
56467D60694j3261j2112j1711j0796q571o439n339m156k577k605n083p346o811
56454C63887m609l322l258l256l207l339k759j021L84J51p76j114j405k374k964
56439C31018k202j238j311j429l72O91J25j052n95J385K701K308J135L26L56J296
56423C33142K550L030K620K343K303J259o77j259M19J916J101l46M53L216N400
56408C57470O023N991N845N587N827O763P027N692M312M859O704P801P748P398
56394D45047O691N203L947M189N215N410M733M087L290J925J102J911K993K185
56380D97928o1j421j357j422k291k921k831k977l946n019n335m857m154m044n068
56365D50224o451o402m374k022r69q11m84j79m71r80j382k398m282n735n786n170
$$ plain form
56349 402328 397883 395209 395485 397725 399415 399654 399536 399310 397582 393911 389865 386696 384055 381695 380296
56334 380296 379786 378957 377621 377108 377797 378274 377880 377805 378576 378735 377458 376428 377415 379630 380984 380675 379388
56317 379388 378355 379146 382721 387668 391093 392285 393762 397736 403520 409557 415840 422814 429811 436275
56303 436275 442758 449064 453180 453974 453513 454804 458307 462274 465367 467333 468206 468501 469439 471708 474696
56288 474696 477720 480932 484228 486824 488955 492464 498393 505310 511171 515510 518747 520922 522420 524574
56274 524574 528183 532527 536816 541257 545912 550171 554317 559809 566928 574033 580351 587525 596984 607682
56260 607682 618029 628175 638746 649200 659242 670161 682831 695858 707537 718335 729771
56249 729771 742267 755729 770704 787212 803744 819068 833720 848254 861624 872919 883190
$$ packed form
56349D02328m445k674K76K240J690K39j18k26j728l671m046l169k641k360j399
56334C80296n10q29j336n13O89M77l94p5P71J59j277j030R87K215J354l09j287
56317C79388j033P91L575M947L425J192J477L974N784O037O283O974O997O464
56303D36275O483O306M116P94m61J291L503L967L093J966Q73K95R38K269K988
56288D74696L024L212L296K596K131L509N929O917N861M339L237K175J498K154
56274E24574L609M344M289M441M655M259M146N492P119P105O318P174R459J0698
56260F07682J0347J0146J0571J0454J0042J0919J2670J3027J1679J0798J1436
56249G29771J2496J3462J4975J6508J6532J5324J4652J4534J3370J1295J0271
$$ plain form
56238 883190 893916 905084 916219 927599 938854 948176 954746 960370 967053 974690 982764 992271 1004009
56225 1004009 1016928 1030301 1045612 1064059 1084176 1104431 1126530 1153387 1185136 1219650 1255991
56214 1255991 1294996 1337520 1384215 1436061 1493226 1554514 1619555 1690196 1768141 1853022 1944476
56203 1944476 2044051 2153086 2270937 2397565 2535600 2687215 2851106 3025431 3211602 3412031
56193 3412031 3625957 3850770 4085656 4330392 4581763 4834660 5085759 5332927 5571874
56184 5571874 5796419 6001305 6182160 6333995 6452896 6538383 6591512 6611987 6599960 6559022
56174 6559022 6493970 6406786 6298160 6171792 6033576 5887358 5734849 5578760 5422291 5266046
56164 5266046 5108848 4951148 4794479 4638257 4480454 4320913 4160945 4000649 3840037
$$ packed form
56238H83190J0726J1168J1135J1380J1255R322O570N624O683P637Q074R507J1738
56225A004009J2919J3373J5311J8447K0117K0255K2099K6857L1749L4514L6341
56214A255991L9005M2524M6695N1846N7165O1288O5041P0641P7945Q4881R1454
56203A944476R9575J09035J17851J26628J38035J51615J63891J74325J86171K00429
56193C412031K13926K24813K34886K44736K51371K52897K51099K47168K38947
56184E571874K24545K04886J80855J51835J18901Q5487N3129K0475j2027m0938
56174F559022o5052q7184j08626j26368j38216j46218j52509j56089j56469j56245
56164E266046j57198j57700j56669j56222j57803j59541j59968j60296j60612
$$ plain form
56155 3840037 3681860 3529471 3382485 3238200 3096721 2960769 2830962 2705574 2585014
56146 2585014 2472304 2368491 2271295 2179023 2092398 2011810 1936102 1865030 1800101 1742043 1689697
56135 1689697 1641786 1597613 1556109 1516629 1480556 1449648 1423124 1398842 1376673 1357800 1341327
56124 1341327 1324856 1308152 1293125 1280371 1268815 1258540 1250897 1246068 1243440 1243916 1248657 1255975 1262833
56111 1262833 1269113 1277140 1287481 1298804 1311555 1327928 1348042 1369688 1392029 1416090 1441419 1465711
56099 1465711 1488136 1510035 1532203 1554341 1576975 1600840 1624656 1646525 1667033 1687900 1708509
56088 1708509 1727348 1745974 1767650 1792863 1820334 1851603 1889994 1935403 1984917 2038609 2100020
56077 2100020 2170700 2249028 2334973 2431301 2538851 2654558 2774995 2898195 3021368 3140566
$$ packed form
56155C840037j58177j52389j46986j44285j41479j35952j29807j25388j20560
56146B585014j12710j03813r7196r2272q6625q0588p5708p1072o4929n8058n2346
56135A689697m7911m4173m1504l9480l6073l0908k6524k4282k2169j8873j6473
56124A341327j6471j6704j5027j2754j1556j0275p643m829k628M76M741P318O858
56111A262833O280Q027J0341J1323J2751J6373K0114K1646K2341K4061K5329K4292
56099A465711K2425K1899K2168K2138K2634K3865K3816K1869K0508K0867K0609
56088A708509J8839J8626K1676K5213K7471L1269L8391M5409M9514N3692O1411
56077B100020P0680P8328Q5945R6328J07550J15707J20437J23200J23173J19198
$$ plain form
56067 3140566 3253366 3358999 3456157 3544083 3625034 3701478 3771283 3829789 3875786 3910765 3933280
56056 3933280 3939558 3929502 3906673 3872408 3825500 3767559 3702521 3630092 3545569 3447356 3339389
56045 3339389 3225496 3107184 2987956 2873713 2767003 2666117 2571364 2487000 2415520 2355213
56035 2355213 2304748 2264905 2234358 2209123 2187858 2172683 2163396 2156086 2148789 2143278 2139887 2135827
56023 2135827 2129951 2123909 2117421 2107990 2096567 2087925 2084008 2082283 2081673 2084330 2090610 2098340 2108112 2123097
56009 2123097 2142607 2162307 2181741 2204754 2231403 2256788 2279428 2303324 2330084 2356633 2382529
55998 2382529 2411545 2443768 2474265 2502215 2533303 2570199 2608806 2646874 2687910 2733037 2777452
55987 2777452 2819110 2863032 2912923 2966121 3020547 3078667 3140634 3201593 3260079 3321208 3387487
$$ packed form
56067C140566J12800J05633R7158Q7926Q0951P6444O9805N8506M5997L4979K2515
56056C933280O278j0056k2829l4265m6908n7941o5038p2429q4523r8213j07967
56045C339389j13893j18312j19228j14243j06710j00886r4753q4364p1480o0307
56035B355213n0465l9843l0547k5235k1265j5175r287p310p297n511l391m060
56023B135827n876o042o488r431j1423q642l917j725o10K657O280P730R772J4985
56009B123097J9510J9700J9434K3013K6649K5385K2640K3896K6760K6549K5896
55998B382529K9016L2223L0497K7950L1088L6896L8607L8068M1036M5127M4415
55987B777452M1658M3922M9891N3198N4426N8120O1967O0959N8486O1129O6279
$$ plain form
55976 3387487 3454599 3520481 3590140 3666704 3745796 3823626 3902785 3985558 4069408 4153412 4241068
55965 4241068 4332640 4423319 4513091 4609544 4716924 4831770 4953249 5087356 5236108 5392982
55955 5392982 5554107 5723549 5902786 6086317 6273046 6470326 6681234 6900002 7125906
55946 7125906 7368599 7633096 7912929 8205399 8519642 8861455 9224438 9605310 10013986
55937 10013986 10458960 10936929 11446815 11999337 12601699 13246865 13928835 14654191 15427692
55928 15427692 16241535 17089799 17977781 18906317 19864967 20853763 21894139 23005453 24189563
55919 24189563 25451803 26815238 28297292 29893158 31600294 33438846 35430832 37582559
55911 37582559 39907109 42440042 45212398 48234396 51528627 55152874 59168725 63621548
$$ packed form
55976C387487O7112O5882O9659P6564P9092P7830P9159Q2773Q3850Q4004Q7656
55965D241068R1572R0679Q9772R6453J07380J14846J21479J34107J48752J56874
55955E392982J61125J69442J79237J83531J86729J97280K10908K18768K25904
55946G125906K42693K64497K79833K92470L14243L41813L62983L80872M08676
55937A0013986M44974M77969N09886N52522O02362O45166O81970P25356P73501
55928A5427692Q13843Q48264Q87982R28536R58650R88796J040376J111314J184110
55919B4189563J262240J363435J482054J595866J707136J838552J991986K151727
55911C7582559K324550K532933K772356L021998L294231L624247M015851M452823
$$ plain form
55903 63621548 68580790 74167778 80513422 87722835 95911331 105232816 115839205 127866956
55895 127866956 141515206 157091067 174939527 195406218 218926803 246043476 277218964
55888 277218964 312700602 352548617 396286780 441755905 484083166 516442713 532853046
55881 532853046 530996996 512822402 482839198 445914306 406038410 366074229 327865150
55874 327865150 292439349 260301555 231668922 206526927 184632321 165614416 149100550
55867 149100550 134743635 122205391 111189447 101476708 92892410 85263542 78438955
55860 78438955 72319466 66829855 61880855 57386451 53294722 49571465 46171885 43053480
55852 43053480 40196838 37587540 35193566 32982733 30945242 29076821 27355571 25756749
$$ packed form
55903F3621548M959242N586988O345644P209413Q188496R321485J0606389J2027751
55895A27866956J3648250J5575861J7848460K0466691K3520585K7116673L1175488
55888B77218964L5481638L9848015M3738163M5469125M2327261L2359547J6410333
55881E32853046j856050j8174594k9983204l6924892l9875896l9964181l8209079
55874C27865150l5425801l2137794k8632633k5141995k1894606j9017905j6513866
55867A49100550j4356915j2538244j1015944r712739q584298p628868o824587
55860G8438955o119489n489611m949000m494404m091729l723257l399580l118405
55852D3053480k856642k609298k393974k210833k037491j868421j721250j598822
$$ plain form
55844 25756749 24275068 22911266 21650492 20474036 19379320 18368639 17430039 16548016
55836 16548016 15722062 14956871 14244699 13574431 12947727 12369224 11830006 11316854 10829144
55827 10829144 10371387 9937851 9519801 9119987 8745283 8392481 8055026 7735913 7439824
55818 7439824 7159900 6886380 6621770 6374088 6141570 5917464 5703872 5507342 5325712
55809 5325712 5152054 4987013 4834995 4692390 4551428 4411971 4278589 4149729 4020268
55800 4020268 3891021 3765716 3642466 3517915 3395720 3281289 3172061 3062249 2952853
55791 2952853 2847639 2743792 2636497 2528730 2426643 2329070 2231435 2136400 2050511 1973278
55781 1973278 1899542 1830181 1770671 1721000 1676290 1635818 1602637 1575724 1550888 1528159 1510429
$$ packed form
55844B5756749j481681j363802j260774j176456j094716j010681r38600q82023
55836A6548016q25954p65191p12172o70268o26704n78503n39218n13152m87710
55827A0829144m57757m33536m18050l99814l74704l52802l37455l19113k96089
55818G439824k79924k73520k64610k47682k32518k24106k13592j96530j81630
55809E325712j73658j65041j52018j42605j40962j39457j33382j28860j29461
55800D020268j29247j25305j23250j24551j22195j14431j09228j09812j09396
55791B952853j05214j03847j07295j07767j02087r7573r7635r5035q5889p7233
55781A973278p3736o9361n9510m9671m4710m0472l3181k6913k4836k2729j7730
$$ plain form
55770 1510429 1496185 1481114 1465461 1452613 1441891 1429673 1415848 1402271 1386756 1365519 1339857
55759 1339857 1313896 1287751 1259376 1230675 1204893 1180227 1152995 1124930 1100289 1077905 1053435
55748 1053435 1027717 1005513 987361 969725 951996 936444 922411 907445 893363 884609 881243 879568
55736 879568 878618 879992 882465 883015 882203 882500 882357 878060 870364 863247 857042 848948 839421 831813 826212
55721 826212 819452 810737 801718 791908 779712 767123 757543 749558 738471 723272 706438 687921 665538
55708 665538 640940 619026 601364 585613 571194 559835 550640 540210 527865 515702 503703 490014
55696 490014 475811 464335 455007 443676 428823 412512 395446 376466 357080 341240 330160 321947
55684 321947 316224 314060 313520 310668 305406 301275 299138 296035 290780 285734 282454 280289 279655 281891 285265
$$ packed form
55770A510429j4244j5071j5653j2848j0722j2218j3825j3577j5515k1237k5662
55759A339857k5961k6145k8375k8701k5782k4666k7232k8065k4641k2384k4470
55748A053435k5718k2204j8152j7636j7729j5552j4033j4966j4082q754l366j675
55736H79568r50J374K473N50q12K97j43m297p696p117o205q094r527p608n601
55721H26212o760q715r019r810j2196j2589r580p985j1087j5199j6834j8517k2383
55708F65538k4598k1914j7662j5751j4419j1359r195j0430j2345j2163j1999j3689
55696D90014j4203j1476r328j1331j4853j6311j7066j8980j9386j5840j1080q213
55684C21947n723k164n40k852n262m131k137l103n255n046l280k165o34K236L374
$$ plain form
55669 285265 285880 283305 280939 280262 279059 275790 271248 265469 257546 249141 243777 241811 240051 236762 233157
55654 233157 229857 226158 222989 222246 222939 222204 220162 219408 219932 219393 218383 220136 224649 228428 230645 234138
55638 234138 239303 242486 241890 239975 238449 235966 232603 231533 233995 237125 239018 241701 246858 252822
55624 252822 258293 265231 275506 287936 300734 313648 325757 334603 339615 343351 347402 350060 349785
55611 349785 347867 345708 342417 337168 331473 327340 325265 325081 326482 327969 328008 327756 329629 332886 334283
55596 334283 333597 334299 337636 340445 340587 340356 342300 345511 348457 351770 355437 356448 352366 344916 337551
55581 337551 331507 326234 321283 315618 307348 296361 285379 276569 268974 260711 251673 242567 233432 224591
55567 224591 217112 210981 204689 197538 190342 183287 175707 168553 164030 161792 158663 153341 148191 145119
$$ packed form
55669B85265O15k575k366o77j203l269m542n779p923q405n364j966j760l289l605
55654B33157l300l699l169p43O93p35k042p54N24n39j010J753M513L779K217L493
55638B34138N165L183n96j915j526k483l363j070K462L130J893K683N157N964
55624B52822N471O938J0275J2430J2798J2914J2109Q846N012L736M051K658k75
55611C49785j918k159l291n249n695m133k075j84J401J487L9k52J873L257J397
55596C34283o86P02L337K809J42k31J944L211K946L313L667J011m082p450p365
55581C37551o044n273m951n665q270j0987j0982q810p595q263r038r106r135q841
55567B24591p479o131o292p151p196p055p580p154m523k238l129n322n150l072
$$ plain form
55553 145119 143028 140867 139612 139115 136452 129971 122205 116337 112424 109474 108463 110408 113608 115499
55539 115499 115637 114783 112993 110753 109880 110924 111400 108850 104131 99760 96691 94604 93623 93656 93551 92752
55523 92752 92338 92852 92820 91115 89014 88143 88001 87306 86157 85160 83996 82585 82176 83589 85669 86909 87306
55506 87306 87423 87225 86999 87700 89201 89990 89710 90016 91747 93420 93770 93485 93030 91252 87897 85152 84661
55489 84661 84996 83943 81321 77879 73685 69558 67792 69155 71135 71370 70864 71642 73263 74179 74724 76091
55473 76091 77831 78951 80258 83177 87246 90989 94265 97821 101625 105538 110398 116446 121847 124697
55459 124697 125507 126066 127133 128884 132071 136772 141291 144125 145659 146306 144788 140372 134980 130613 126163
55444 126163 119456 111127 103673 97611 91436 84881 79550 76411 74851 74042 73234 70894 65518 57546 49182
$$ packed form
55553A45119k091k161j255m97k663o481p766n868l913k950j011J945L200J891
55539A15499J38q54j790k240q73J044M76k550m719m371l069k087r81L3j05p99
55523I2752m14N14l2j705k101q71j42o95j149r97j164j411m09J413K080J240L97
55506H7306J17j98k26P01J501P89k80L06J731J673L50k85m55j778l355k745m91
55489H4661L35j053k622l442m194m127j766J363J980K35n06P78J621R16N45J367
55473G6091J740J120J307K919M069L743L276L556L804L913M860O048N401K850
55459A24697Q10N59J067J751L187M701M519K834J534O47j518m416n392m367m450
55444A26163o707q329p454o062o175o555n331l139j560q09q08k340n376p972q364
$$ plain form
55429 49182 42401 37978 35732 34543 32856 30357 28400 27786 27238 25292 22492 20249 18686 17088 15426
55414 15426 13925 12124 9852 8108 7595 7387 6366 4844 3450 1783 -374 -1962 -2401 -3029 -5061 -7408
55398 -7408 -8336 -7994 -7440 -6435 -4329 -2135 -1626 -2983 -4946 -6539 -7206 -6311 -4144 -2436 -2288 -2612 -1917
55381 -1917 -427 942 2094 2690 1408 -1724 -4076 -3756 -2597 -3267 -4948 -4823 -2775 -1471 -2207 -3545
55365 -3545 -3943 -3291 -1709 990 4368 7506 10153 12470 14029 14337 13890 13525 13368 13369 13851 14589 14786 14981
55347 14981 17031 20709 22684 21018 18371 17985 18643 17021 13383 11090 11262 11679 10834 9622 8867 8246
55331 8246 8046 9272 11506 12918 12674 11337 8884 4650 -610 -4670 -6166 -5379 -2973 224 2545 2529
55315 2529 668 -1439 -3113 -4152 -3488 -576 2712 4040 3913 4518 5962 6322 5035 3353 1686 -628
$$ packed form
55429D9182o781m423k246j189j687k499j957o14n48j946k800k243j563j598j662
55414A5426j501j801k272j744n13k08j021j522j394j667c74j588m39o28k032k347
55398g408r28L42N54J005K106b135N09j357j963j593o67Q95K167J708J48l24O95
55381a917d27I42J152N96j282a724k352L20J159o70j681J25K048J304p36j338
55365c545l98O52J582I90L378L138K647K317J559L08m47l65j57JM82P38J97J95
55347A4981K050L678J975j666k647l86O58j622l638k293J72M17q45j212p55o21
55331H246k00J226K234J412k44j337k453m234f10m060j496P87K406B24K321j6
55315B529F68a439j674j039O64e76B712J328j27O05J444L60j287j682j667f28
$$ plain form
55298 -2985 -3909 -3976 -5450 -8601 -11105 -11687 -11612 -11906 -11704 -10395 -9047 -8555 -8218 -7230 -5960 -4892 -3665
55281 -3665 -1946 -106 1398 2364 2627 2504 3029 4422 5064 3620 1359 390 528 278 2 1155 2943 3108
55263 3108 2007 2467 5048 6722 5350 2585 1107 1468 2797 4366 5209 4271 2091 674 896 1764
55247 1764 2654 4111 5815 6129 4569 2649 1433 405 -513 -203 1238 1607 -493 -3649 -5702 -6164 -5671
55230 -5671 -4877 -4798 -6322 -8409 -8692 -6814 -5106 -5066 -5461 -5051 -4627 -4744 -3878 -986 2126 3304 3361 4548
55212 4548 6981 9005 10246 11943 14469 16474 16583 14713 11763 9008 7684 8299 10370 12984 15164
55197 15164 15726 13935 10699 7998 6651 5804 4918 4757 5839 7495 9313 11872 14989 16773 15834 13311
55181 13311 11418 10839 10677 10008 8415 5891 3357 2451 3753 5820 6825 6501 5823 5745 6922 9639
$$ packed form
55298b985r24o7j474l151k504n82P5k94K02J309J348M92L37R88J270J068J227
55281c665J719a06A398R66K63j23N25J393O42j444A359C90J38k50BJ153J788J65
55263C108j101M60K581J674j372B585A107L61J329J569Q43r38B091F74K22Q68
55247A764Q90J457J704L14j560j920j216D05e13b03A238L69d93l156k053m62M93
55230e671P94P9j524k087k83J878J708M0l95M10M24j17Q66i86B126J178N7J187
55212D548K433K024J241J697K526K005J09j870k950k755j324O15K071K614K180
55197A5164N62j791l236k701j347q47q86j61J082J656J818K559L117J784r39k523
55181A3311j893n79j62o69j593k524k534r06J302K067J005l24o78p8J177K717
$$ plain form
55165 9639 12988 14969 14388 12123 9966 8998 9532 11353 13212 13249 11089 8637 7827 8384 8749 8413 8217
55148 8217 8915 10379 11920 12701 12245 10956 9766 9098 8932 9824 12630 16830 20492 22577 24185 26764
55132 26764 30127 32909 33985 32690 28749 22972 17269 13178 10901 10132 10870 12878 15279 17369 19095
55117 19095 20372 20864 20779 20814 20984 20639 19954 19974 20661 20422 18408 15899 14555 14515 15181 16583 18865 21280
55099 21280 22761 22849 21594 19436 17626 17481 18599 19048 17941 16503 15993 16104 16264 16926 18398 19794
55083 19794 20314 20356 20316 19637 18271 17629 18569 19687 19252 17861 17529 18886 20855 22510 23765 24581 24890
55066 24890 25093 25635 26282 26627 26805 26980 26734 25818 24890 24674 24900 24912 24778 25146 26478 28887 32017 34703
55048 34703 35736 35570 36268 39041 42775 45573 46694 46388 45206 44432 45824 49545 53207 54235 52602
$$ packed form
55165I639L349J981n81k265k157r68N34J821J859L7k160k452q10N57L65l36j96
55148H217O98J464J541P81m56j289j190o68j66Q92K806M200L662K085J608K579
55132B6764L363K782J076j295l941n777n703m091k277p69P38K008K401K090J726
55117A9095J277M92q5L5J70l45o85K0O87k39k014k509j344m0O66J402K282K415
55099B1280J481Q8j255k158j810j45J118M49j107j438n10J11J60O62J472J396
55083A9794N20M2m0o79j366o42R40J118m35j391l32J357J969J655J255Q16L09
55066B4890K03N42O47L45J78J75k46r16r28k16K26J2j34L68J332K409L130K686
55048C4703J033j66O98K773L734K798J121l06j182p74J392L721L662J028j633
$$ plain form
55033 52602 50248 48539 47320 45992 44642 44221 45743 48764 50906 50215 47937 47219 48879 50525 50466 50207
55017 50207 51851 55178 58755 62002 64463 64909 63252 61933 63393 67130 70896 73523 74860 74333 71784
55002 71784 68831 67255 66664 65548 63827 62438 61165 58995 56275 54506 54037 53556 51873 49089 46200
54987 46200 44492 44749 46191 46990 46677 46760 47929 48375 46635 44531 44930 47596 49629 49441 48110 47235 47440
54970 47440 48623 49830 49364 46903 45002 46499 50857 55014 57306 58471 59364 60128 61492 64346 67701
54955 67701 69183 67925 65219 62283 59468 57794 58915 62743 66997 70014 72516 75798 79553 82424
54941 82424 83738 83900 83669 83497 83172 82200 80933 80703 81952 83043 82326 80732 80582 82221 83728 83903 83569
54924 83569 83633 83645 82904 81627 80458 79824 80011 80856 81305 80392 78663 77448 76805 75622 73780 72677 73223
$$ packed form
55033E2602k354j709j219j328j350m21J522L021K142o91k278p18J660J646n9k59
55017E0207J644L327L577L247K461M46j657j319J460L737L766K627J337n27k549
55002G1784k953j576n91j116j721j389j273k170k720j769m69m81j683k784k889
54987D6200j708K57J442P99l13Q3J169M46j740k104L99K666K033j88j331q75K05
54970D7440J183J207m66k461j901J497M358M157K292J165Q93P64J364K854L355
54955F7701J482j258k706k936k815j674J121L828M254L017K502L282L755K871
54941H2424J314J62k31j72l25r72j267k30J249J091p17j594j50J639J507J75l34
54924H3569O4J2p41j277j169o34J87Q45M49r13j729j215o43j183j842j103N46
$$ plain form
54907 73223 74652 75822 76595 77523 79016 81240 84176 87563 91189 94986 98385 100297 100598 100840 102300
54892 102300 104160 105132 106140 109480 115702 123098 130160 136826 143588 151180 161114 174559 190511 206788
54878 206788 222910 240222 258978 277193 292712 304661 312368 314612 310775 301666 288812 274016
54866 274016 259479 246777 235458 223947 211817 199763 187660 174778 162045 151899 145276 140685
54854 140685 136861 134335 133468 132794 130587 126855 122962 120444 120723 124497 130587 136645 141704 146857 153098
54839 153098 160170 168212 178686 192343 207546 221852 234425 246058 257674 269447 280323 287711
54827 287711 288760 282827 272018 258934 244856 230311 215971 202266 189291 177604 167948 159782
54815 159782 151561 143015 135614 130014 124785 118717 112860 108909 106717 104751 102133 99053 95935 93277
$$ packed form
54907G3223J429J170P73R28J493K224K936L387L626L797L399J912L01K42J460
54892A02300J860R72J008L340O222P396P062O666O762P592R934J3445J5952J6277
54878B06788J6122J7312J8756J8215J5519J1949P707K244l837r109j2854j4796
54866B74016j4537j2702j1319j1511j2130j2054j2103j2882j2733j0146o623m591
54854A40685l824k526q67o74k207l732l893k518K79L774O090O058N059N153O241
54839A53098P072Q042J0474J3657J5203J4306J2573J1633J1616J1773J0876P388
54827B87711J049n933j0809j3084j4078j4545j4340j3705j2975j1687r656q166
54815A59782q221q546p401n600n229o068n857l951k192j966k618l080l118k658
$$ plain form
54801 93277 91723 91382 91528 91505 91283 90821 89865 88813 88713 89915 91746 93778 95980 97265 95781 91593
54785 91593 87332 84927 83175 79975 75557 71885 69929 69174 69039 69185 68947 67855 66343 64945 63417
54770 63417 61595 60254 59889 59455 57745 55428 54276 54846 56305 58234 61097 64917 68795 71977 74424
54755 74424 76131 76743 76141 74889 73892 73837 74927 76897 79238 81447 83047 83758 84210 86062 90372 96000
54739 96000 100810 104428 108282 112780 116426 118599 121336 126895 134956 143881 153627 165497 179580 194359
54725 194359 208854 223661 239640 256615 273584 289291 302473 312207 318233 320693 319670 315289
54713 315289 307935 298117 286513 274372 263202 253561 244713 235898 227379 219817 213323 207709 203071
54700 203071 199535 196968 195405 195119 195820 196429 196164 195274 194464 194425 196263 201240 209330 218905 228562 238450
$$ packed form
54801I3277j554l41J46k3k22m62r56j052j00J202J831K032K202J285j484m188
54785I1593m261k405j752l200m418l672j956p55j35J46k38j092j512j398j528
54770F3417j822j341l65m34j710k317j152N70J459J929K863L820L878L182K447
54755G4424J707O12o02j252r97n5J090J970K341K209J600P11M52J852M310N628
54739I6000M810L618L854M498L646K173K737N559Q061Q925R746J1870J4083J4779
54725A94359J4495J4807J5979J6975J6969J5707J3182R734O026K460j023m381
54713C15289p354r818j1604j2141j1170r641q848q815q519p562o494n614m638
54700B03071l536k567j563k86P01O09k65q90q10l9J838M977Q090R575R657R888
$$ plain form
54684 238450 249243 260852 273048 286367 301357 317558 334063 350413 366043 379556 389444 395047
54672 395047 396200 392690 384830 373787 360554 345252 328051 309934 291822 273886 256531 241058
54660 241058 228379 217983 208996 201346 194894 188613 181885 175675 171097 167561 163682 159336 155481 152438
54646 152438 149618 146542 143195 139842 137272 136399 136769 136549 135039 133972 134968 137002 138138 138618 140070
54631 140070 142415 143840 143602 142743 142055 141321 140732 141187 142752 144277 144900 144799 144422 144182 144797 146526 148133
54614 148133 148116 147032 147100 149284 152224 154373 155816 157504 159894 162841 165939 168663 170977 173842 178176
54599 178176 183440 188316 192639 197346 202596 207507 211848 216341 220808 223693 224314 224307 225711 228419 230332
54584 230332 229565 225983 221188 217547 216648 218229 220840 223617 226887 231190 236626 243260 251285 260509 270415
$$ packed form
54684B38450J0793J1609J2196J3319J4990J6201J6505J6350J5630J3513R888N603
54672C95047J153l510p860j1043j3233j5302j7201j8117j8112j7936j7355j5473
54660B41058j2679j0396q987p650o452o281o728o210m578l536l879m346l855l043
54646A52438k820l076l347l353k570q73L70k20j510j067R96K034J136M80J452
54631A40070K345J425k38q59o88p34n89M55J565J525O23j01l77k40O15J729J607
54614A48133j7j084O8K184K940K149J443J688K390K947L098K724K314K865M334
54599A78176N264M876M323M707N250M911M341M493M467K885O21pJ404K708J913
54584B30332p67l582m795l641q99J581K611K777L270M303N436O634Q025R224R906
$$ plain form
54569 270415 280753 291341 301428 310321 318522 326854 334421 339085 340454 340603 340824 339218 333085 322622
54555 322622 310644 299314 288877 279310 271257 264749 258415 251031 243252 236932 233004 230647 228415
54542 228415 225589 222363 219349 217204 216265 215986 214953 212071 207782 203597 200344 197431 193998 190173 186738
54527 186738 183966 181188 177365 171900 165176 158363 152352 146930 141504 136461 132920 131080 129901 128599
54513 128599 127286 125787 123337 120232 118302 118538 119451 119100 117665 116568 116089 115587 115193 115266 114693 111931
54497 111931 107723 104786 104409 105038 104545 102397 99222 95781 93042 91939 92253 92589 91963 90704 89596 89124
54481 89124 89840 92379 96576 101289 105424 108493 110171 110317 109637 109305 109582 109645 108999 108161 107760 108046 109604
54464 109604 113361 119241 125750 131520 136602 141709 147013 152347 157897 163858 169670 174185 176532 176588 174794
$$ packed form
54569B70415J0338J0588J0087Q893Q201Q332P567M664J369J49K21j606o133j0463
54555C22622j1978j1330j0437r567q053o508o334p384p779o320l928k357k232
54542B28415k826l226l014k145r39k79j033k882m289m185l253k913l433l825l435
54527A86738k772k778l823n465o724o813o011n422n426n043l541j840j179j302
54513A28599j313j499k450l105j930K36R13l51j435j097m79n02l94P3n73k762
54497A11931m208k937l77O29m93k148l175l441k739j103L14L36o26j259j108m72
54481H9124P16K539M197M713M135L069J678J46o80l32K77O3o46q38m01K86J558
54464A09604L757N880O509N770N082N107N304N334N550N961N812M515K347N6j794
$$ plain form
54449 174794 171678 167429 161944 155431 148671 142448 137165 133380 131873 132275 132374 130165 126263 122923 120829
54434 120829 118395 114355 109579 105835 103912 103479 103811 104228 104539 105272 106760 108201 108695 108949 110448 112889
54418 112889 114162 113296 111747 111128 111340 111850 113224 115956 118913 120386 120166 119509 119592 120899 123444 126532
54402 126532 128749 129260 128963 129600 131832 134688 136659 136903 135691 134171 133536 134084 135144 135859 135693 134409
54386 134409 132328 130587 130276 131082 131517 130494 127982 124316 120102 116750 115601 116052 115866 113868 111122
54371 111122 109006 107628 106854 107248 108726 109571 108197 105184 102396 100877 100606 101475 103190 104871 105940
54356 105940 106968 108614 110303 111053 111045 111295 112230 113601 115343 117408 119248 120615 122452 125842 130333 134407
54340 134407 137288 139283 140865 142685 146077 152001 159482 166544 172735 179237 186297 192227 195764 198036
$$ packed form
54449A74794l116m249n485o513o760o223n283l785j507M02R9k209l902l340k094
54434A20829k434m040m776l744j923m33L32M17L11P33J488J441M94K54J499K441
54418A12889J273q66j549o19K12N10J374K732K957J473k20o57Q3J307K545L088
54402A26532K217N11k97O37K232K856J971K44j212j520o35N48J060P15j66j284
54386A34409k081j741l11Q06M35j023k512l666m214l352j149M51j86j998k746
54371A11122k116j378p74L94J478Q45j374l013k788j519k71Q69J715J681J069
54356A05940J028J646J689P50qK50R35J371J742K065J840J367J837L390M491M074
54340A34407K881J995J582J820L392N924P481P062O191O502P060N930L537K272
$$ plain form
54326 198036 201150 205733 210912 215885 220160 222611 221840 217911 212716 207907 203109 197013 189878 183791
54312 183791 180235 178403 176640 174699 173392 172453 170245 165901 160610 156166 153100 150777 148587 146308
54298 146308 143861 141418 139452 138223 137466 136887 136493 136302 136349 137209 139560 142747 144783 144612 143531 143475 144663
54281 144663 146053 147462 149881 153800 158380 162398 165319 167590 170516 175411 182007 188119 191909 194080
54267 194080 196556 199345 200374 198523 195062 191436 187241 181553 175032 169270 164738 160773 157152 154144
54253 154144 151054 146358 139889 133604 129251 126137 122304 117303 112538 109083 106507 104031 101575 99132
54239 99132 96207 92705 89501 87192 84995 81943 78705 77082 77969 80731 84201 87187 88355 87159 85049
54224 85049 84428 85971 87959 88561 87706 86483 85756 85943 87111 88647 89478 89089 87919 86777 86575 88322
$$ packed form
54326A98036L114M583N179M973M275K451p71l929n195m809m798o096p135o087
54312A83791l556j832j763j941j307r39k208m344n291m444l066k323k190k279
54298A46308k447k443j966j229p57n79l94j91M7Q60K351L187K036j71j081n6J188
54281A44663J390J409K419L919M580M018K921K271K926M895O596O112L790K171
54267A94080K476K789J029j851l461l626m195n688o521n762m532l965l621l008
54253A54144l090m696o469o285m353l114l833n001m765l455k576k476k456k443
54239I9132k925l502l204k309k197l052l238j623Q87K762L470K986J168j196k110
54224H5049o21J543J988O02q55j223p27J87J168J536Q31l89j170j142k02J747
$$ plain form
54208 88322 92061 95831 97336 96932 97311 99707 102308 103312 103596 104821 106575 107297 106892 106426 105979 104732
54192 104732 102788 101117 99943 98761 97793 97865 98804 99385 98983 98060 97049 95918 94833 93987 92713 90092
54176 90092 86757 84977 86534 91243 97506 103307 106719 106852 104811 102708 101284 99502 96850 94772 94939
54161 94939 97111 99781 102288 105002 107652 108835 107640 104956 102534 101183 100553 100427 101374 103777 106862
54146 106862 109264 110240 109875 108532 106873 106059 106856 108472 109234 108569 107406 106551 105778 104758 103586 101956
54130 101956 99218 96014 94365 94976 95808 94753 92681 92077 93379 94513 93795 91559 88837 86051 83429
54115 83429 81556 80913 81389 82425 83294 83549 83685 84768 86725 87813 86922 85560 85972 87800 88430 86646
54099 86646 84164 83249 84382 86724 89417 91716 93013 93480 93880 94261 93700 91786 89466 87894 87171 86688
$$ packed form
54208H8322L739L770J505m04L79K396K601J004K84J225J754P22m05m66m47j247
54192A04732j944j671j174j182r68P2R39N81m02r23j011j131j085q46j274k621
54176I0092l335j780J557M709O263N801L412J33k041k103j424j782k652k078J67
54161I4939K172K670K507K714K650J183j195k684k422j351o30j26R47K403L085
54146A06862K402R76l65j343j659q14P97J616P62o65j163q55p73j020j172j630
54130A01956k738l204j649O11Q32j055k072o04J302J134p18k236k722k786k622
54115H3429j873o43M76J036Q69K55J36J083J957J088q91j362M12J828O30j784
54099H6646k482r15J133K342K693K299J297M67M00L81n61j914k320j572p23m83
$$ plain form
54083 86688 85964 84756 83020 81233 80165 79967 80064 80131 80466 81114 81439 80997 80220 79744 79567 79224 78402 77148
54065 77148 75905 75413 76001 76868 76733 75342 73721 72809 72568 72585 72679 72662 72320 72003 72521 74044 75777 77079
54047 77079 78214 79498 80469 80512 79821 79177 79175 80045 81748 83689 84721 84012 81894 79621 78495 79230 81545
54030 81545 84017 84839 83382 80943 79586 80223 82045 83689 84698 85717 87299 88890 89386 88718 88197 88967
54014 88967 90710 92420 93731 94603 94313 92092 88722 86299 86155 87810 90009 91834 92747 92663 92386 93089
53998 93089 94972 97166 99094 100995 102838 103898 104039 104416 106015 108253 109883 110767 111909 114075 117212
53983 117212 121082 125735 131166 136917 142119 145961 148386 150451 153683 158769 165023 171268 177031 182723
53969 182723 188872 195385 201628 207312 213229 220649 229723 238928 246458 251718 255126 257340 259521 263405
$$ packed form
54083H6688p24j208j736j787j068j98R7O7L35O48L25m42p77m76j77l43q22j254
54065G7148j243m92N88Q67j35j391j621r12k41J7R4j7l42l17N18J523J733J302
54047G7079J135J284R71M3o91o44kQ70J703J941J032p09k118k273j126P35K315
54030H1545K472Q22j457k439j357O37J822J644J009J019J582J591M96o68n21P70
54014H8967J743J710J311Q72k90k221l370k423j44J655K199J825R13q4k77P03
53998I3089J883K194J928J901J843J060J41L77J599K238J630Q84J142K166L137
53983A17212L870M653N431N751N202L842K425K065L232N086O254O245N763N692
53969A82723O149O513O243N684N917P420R074R205P530N260L408K214K181L884
$$ plain form
53955 263405 269596 276166 280510 282587 284777 288473 292508 295337 297086 298540 299603 299985 300395 301685 303301
53940 303301 303681 301955 298641 295032 292442 291497 291450 290548 287682 283374 278659 273510 267015 258923 250442
53925 250442 243463 239185 237260 236181 234622 232283 229204 224886 219086 213161 209288 208110 208279 208469 208521
53910 208521 208235 206670 203673 200818 199621 199641 199550 199336 200166 202447 205225 207488 209244 211298 214338 218086
53894 218086 221170 222361 222243 222945 225779 229932 233924 237290 240027 241561 241599 241480 243223 247412 252895
53879 252895 258343 263203 267411 271208 275160 279532 283679 286801 289290 292671 298127 305435 313202 319803
53865 319803 324447 327763 331061 334669 337499 338586 338451 338403 339127 340574 342493 344412 345738 346688 348539
53850 348539 352164 357036 362403 368550 375791 383079 388993 393497 397396 400681 403007 405254 408690 412622
$$ packed form
53955B63405O191O570M344K077K190L696M035K829J749J454J063L82M10J290J616
53940C03301L80j726l314l609k590r45m7r02k866m308m715n149o495q092q481
53925B50442o979m278j925j079j559k339l079m318n800n925l873j178J69J90N2
53910B08521k86j565k997k855j197K0r1k14Q30K281K778K263J756K054L040L748
53894B18086L084J191j18P02K834M153L992L366K737J534L8j19J743M189N483
53879B52895N448M860M208L797L952M372M147L122K489L381N456P308P767O601
53865C19803M644L316L298L608K830J087j35m8P24J447J919J919J326R50J851
53850C48539L625M872N367O147P241P288N914M504L899L285K326K247L436L932
$$ plain form
53836 412622 414764 414196 412144 409401 404863 397669 389375 382693 378862 377172 376263 374741 371079 364247 354654
53821 354654 343969 333837 324970 317161 309784 302440 295396 289237 284026 279049 273616 267853 262443 257759
53807 257759 253432 248772 243617 238731 235118 232738 230184 226077 220570 215046 210539 207063 204271 201955
53793 201955 199664 196546 192066 186652 181393 177195 174231 171968 169661 167052 164629 163054 162447 162328 162067
53778 162067 161191 159585 157683 156152 155037 153599 151436 149251 147904 147163 146216 145121 144797 145653 147047
53763 147047 148179 148769 148961 149320 150858 154086 157955 160607 161389 161270 161149 160844 160157 159789 160428 161745 163192
53746 163192 165067 167814 170783 172986 175031 179035 186017 194148 200442 203839 205899 208591 212345 216684
53732 216684 221858 228740 237285 246187 254311 261539 267852 272627 275595 277668 279835 281854 283018 283663
$$ packed form
53836D12622K142n68k052k743m538p194q294o682l831j690r09j522l662o832r593
53821C54654j0685j0132q867p809p377p344p044o159n211m977n433n763n410m684
53807B57759m327m660n155m886l613k380k554m107n507n524m507l476k792k316
53793B01955k291l118m480n414n259m198k964k263k307k609k423j575o07j19k61
53778A62067q76j606j902j531j115j438k163k185j347p41r47j095l24Q56J394
53763A47047J132N90J92L59J538L228L869K652P82j19j21l05o87l68O39J317J447
53746A63192J875K747K969K203K045M004O982Q131O294L397K060K692L754M339
53732B16684N174O882Q545Q902Q124P228O313M775K968K073K167K019J164O45
$$ plain form
53718 283663 284740 286219 287139 286994 285833 283157 278243 271817 265988 261990 259127 256298 253253 249796 245262
53703 245262 239841 235293 233057 232475 232046 231673 232244 233453 233586 231548 227962 224072 220576 217743 215753
53688 215753 214502 213646 213175 213513 214864 216786 218545 219681 220377 221583 224478 229222 234488 238887 242564
53673 242564 246515 250586 253497 255042 256893 260554 265633 270959 276191 281076 284098 283711 280677 277534
53659 277534 275511 273476 270385 267197 265427 264980 264708 264338 264461 264908 264489 262550 259843 257647 256812 257809
53643 257809 260789 264968 268468 269526 268002 265590 264491 265703 268350 270807 272561 274619 277805 281333
53629 281333 283955 286043 289306 294366 299897 304583 308838 313806 319511 324953 329561 333603 337319 340471
53615 340471 342951 345376 348732 353411 358641 363086 366168 368470 370516 371698 371193 369465 367599 365370
$$ packed form
53718B83663J077J479R20j45j161k676m914o426n829l998k863k829l045l457m534
53703B45262n421m548k236n82m29l73N71J209J33k038l586l890l496k833j990
53688B15753j251q56m71L38J351J922J759J136O96J206K895M744N266M399L677
53673B42564L951M071K911J545J851L661N079N326N232M885L022l87l034l143
53659B77534k023k035l091l188j770m47k72l70J23M47m19j939k707k196q35R97
53643B57809K980M179L500J058j524k412j099J212K647K457J754K058L186L528
53629B81333K622K088L263N060N531M686M255M968N705N442M608M042L716L152
53615C40471K480K425L356M679N230M445L082K302K046J182n05j728j866k229
$$ plain form
53601 365370 361542 356285 351600 348579 345809 341645 336756 332984 330671 328613 326033 323175 320392 317993
53587 317993 316524 315887 314571 311177 306493 302662 300548 299355 298642 298981 300397 301778 302383 302674 303169 303615
53571 303615 303863 304531 306150 308413 310762 313090 315561 318359 321679 325246 328006 329415 330979 335077 341937
53556 341937 349156 354625 358462 361525 363770 365308 367675 372449 379256 386354 392518 397386 400904 403897
53542 403897 408528 416431 426474 435698 442458 447524 452261 457170 462371 468061 473849 478606 481770 484214
53528 484214 487285 491440 496138 500579 504130 506495 507951 509222 510899 513204 516248 519871 522976 523828
53514 523828 521816 518606 516804 517479 519562 521513 522886 524113 525541 527192 529103 531413 534260 537810
53500 537810 542015 546012 548297 548268 547361 547805 550334 553967 558037 563166 569735 576586 582272 586889 591513
$$ packed form
53601C65370l828n257m685l021k770m164m889l772k313k058k580k858k783k399
53587C17993j469o37j316l394m684l831k114j193p13L39J416J381O05K91M95M46
53571C03615K48O68J619K263K349K328K471K798L320L567K760J409J564M098O860
53556C41937P219N469L837L063K245J538K367M774O807P098O164M868L518K993
53542D03897M631P903J0043R224O760N066M737M909N201N690N788M757L164K444
53528D84214L071M155M698M441L551K365J456J271J677K305L044L623L105Q52
53514E23828k012l210j802O75K083J951J373J227J428J651J911K310K847L550
53500E37810M205L997K285k9r07M44K529L633M070N129O569O851N686M617M624
$$ plain form
53485 591513 596394 601006 605726 612091 621050 631887 643295 654684 666081 677532 689148 701280
53473 701280 714127 727530 741413 756021 771316 786517 800661 813534 825833 838616 852678
53462 852678 868134 884405 900764 917055 933779 951501 970385 990245 1010799 1032034 1054614
53451 1054614 1079625 1107275 1136084 1164217 1191707 1220493 1252041 1285761 1320146 1354654 1389750
53440 1389750 1425734 1462410 1499842 1538735 1579773 1622698 1666196 1708985 1751221 1794476 1839769
53429 1839769 1885838 1930138 1971455 2010678 2049101 2087195 2125435 2165008 2206700 2249696 2292333
53418 2292333 2333523 2372842 2410034 2445493 2480705 2517130 2554683 2592042 2628155 2662616 2694886
53407 2694886 2724249 2750561 2774124 2794693 2811497 2824476 2834628 2842732 2848337 2850386 2848324 2842214
$$ packed form
53485E91513M881M612M720O365Q959J0837J1408J1389J1397J1451J1616J2132
53473G01280J2847J3403J3883J4608J5295J5201J4144J2873J2299J2783J4062
53462H52678J5456J6271J6359J6291J6724J7722J8884J9860K0554K1235K2580
53451A054614K5011K7650K8809K8133K7490K8786L1548L3720L4385L4508L5096
53440A389750L5984L6676L7432L8893M1038M2925M3498M2789M2236M3255M5293
53429A839769M6069M4300M1317L9223L8423L8094L8240L9573M1692M2996M2637
53418B292333M1190L9319L7192L5459L5212L6425L7553L7359L6113L4461L2270
53407B694886K9363K6312K3563K0569J6804J2979J0152Q104N605K049k062o110
$$ plain form
53395 2842214 2832308 2819030 2802989 2784537 2763529 2740009 2714896 2689375 2663661 2636883 2608391
53384 2608391 2578605 2548211 2517004 2484148 2449466 2413773 2377810 2341573 2305195 2269882 2237155
53373 2237155 2207251 2178992 2151265 2124040 2097851 2073007 2049746 2028668 2010358 1994645 1980573
53362 1980573 1967226 1954635 1943982 1936761 1933388 1932626 1932899 1934247 1938490 1947243 1960256 1975927 1992833
53349 1992833 2010370 2028490 2047642 2068834 2093090 2120808 2151974 2186835 2225722 2268154 2312726
53338 2312726 2358262 2404877 2453670 2505525 2560476 2618105 2678198 2740849 2806124 2873899 2944023
53327 2944023 3016403 3090815 3166857 3244164 3322465 3401249 3479664 3557172 3634256 3712065 3791169
53316 3791169 3870688 3948611 4022873 4092381 4157281 4218263 4275570 4328821 4377670 4422033 4461361
$$ packed form
53395B842214r906j3278j6041j8452k1008k3520k5113k5521k5714k6778k8492
53384B608391k9786l0394l1207l2856l4682l5693l5963l6237l6378l5313l2727
53373B237155k9904k8259k7727k7225k6189k4844k3261k1078j8310j5713j4072
53362A980573j3347j2591j0653p221l373p62K73J348M243Q753J3013J5671J6906
53349A992833J7537J8120J9152K1192K4256K7718L1166L4861L8887M2432M4572
53338B312726M5536M6615M8793N1855N4951N7629O0093O2651O5275O7775P0124
53327B944023P2380P4412P6042P7307P8301P8784P8415P7508P7084P7809P9104
53316C791169P9519P7923P4262O9508O4900O0982N7307N3251M8849M4363L9328
$$ plain form
53305 4461361 4494258 4519398 4536416 4545451 4546328 4538948 4524171 4503360 4477187 4445549 4408390 4365734
53293 4365734 4317117 4262162 4201926 4138728 4074311 4008803 3941579 3872322 3801127 3728409 3655021
53282 3655021 3581802 3508894 3436226 3364573 3295148 3228114 3162702 3098961 3038027 2980226 2924324
53271 2924324 2869354 2815835 2764200 2713324 2662037 2611316 2563639 2520509 2481637 2446043 2412953
53260 2412953 2381912 2352988 2326590 2302353 2278706 2254453 2230313 2207859 2187289 2167374 2147375
53249 2147375 2127957 2110262 2095189 2083577 2075985 2071813 2069383 2067298 2065412 2064406 2064947 2067362 2071764
53236 2071764 2078359 2087767 2100753 2117316 2136353 2156652 2177950 2200604 2224784 2250815 2279953 2313709
53224 2313709 2352073 2393032 2434069 2473928 2512997 2552442 2592933 2633859 2673815 2712025 2748857
$$ packed form
53305D461361L2897K5140J7018R035Q77p380j4777k0811k6173l1638l7159m2656
53293D365734m8617n4955o0236o3198o4417o5508o7224o9257p1195p2718p3388
53282C655021p3219p2908p2668p1653o9425o7034o5412o3741o0934n7801n5902
53271B924324n4970n3519n1635n0876n1287n0721m7677m3130l8872l5594l3090
53260B412953l1041k8924k6398k4237k3647k4253k4140k2454k0570j9915j9999
53249B147375j9418j7695j5073j1612p592m172k430k085j886j006N41K415M402
53236B071764O595R408J2986J6563J9037K0299K1298K2654K4180K6031K9138L3756
53224B313709L8364M0959M1037L9859L9069L9445M0491M0926L9956L8210L6832
$$ plain form
53213 2748857 2784539 2817899 2847120 2871434 2891324 2907376 2919848 2929175 2935749 2938959 2937429 2930621
53201 2930621 2919554 2905516 2888749 2868921 2846290 2821545 2794621 2764522 2730704 2694232 2657050
53190 2657050 2620212 2583361 2545893 2507929 2469649 2430497 2389964 2348785 2308167 2267919 2226698
53179 2226698 2184461 2143433 2105960 2072346 2041304 2011443 1981556 1950749 1919552 1890152 1864287
53168 1864287 1841433 1820065 1799825 1781106 1763238 1745021 1726979 1711346 1699371 1689902 1681051 1672210
53156 1672210 1663895 1656445 1649430 1641902 1633020 1622796 1612233 1602247 1592633 1582659 1572304 1561955 1551119
53143 1551119 1538584 1524076 1508790 1494045 1480152 1466715 1453189 1439000 1424068 1409497 1396841
53132 1396841 1386114 1375205 1361795 1345441 1327459 1309269 1291297 1273125 1254202 1234443 1214257
$$ packed form
53213B748857L5682L3360K9221K4314J9890J6052J2472R327O574L210j530o808
53201B930621j1067j4038j6767j9828k2631k4745k6924l0099l3818l6472l7182
53190B657050l6838l6851l7468l7964l8280l9152m0533m1179m0618m0248m1221
53179B226698m2237m1028l7473l3614l1042k9861k9887l0807l1197k9400k5865
53168A864287k2854k1368k0240j8719j7868j8217j8042j5633j1975r469q851q841
53156A672210q315p450p015p528q882j0224j0563r986r614r974j0355j0349j0836
53143A551119j2535j4508j5286j4745j3893j3437j3526j4189j4932j4571j2656
53132A396841j0727j0909j3410j6354j7982j8190j7972j8172j8923j9759k0186
$$ plain form
53121 1214257 1194010 1173622 1152850 1131699 1110231 1088334 1066177 1044552 1024099 1004366 984287
53110 984287 963444 942310 921462 901230 881868 863358 845227 827215 809912 794024 779254
53099 779254 764583 749256 732767 714561 694943 675876 659409 645470 632444 619663 607726
53088 607726 596478 584575 571571 558743 547173 536463 526019 516176 507171 498396 489711 482238
53076 482238 476636 471675 465935 460058 455745 452967 449787 444979 439474 434793 430989 426780 421345 415400
53062 415400 410320 406289 401765 395211 387103 379529 373847 369614 365973 362995 361070 359757 358018 355104
53048 355104 350724 344922 338458 332786 328915 326433 324163 321544 318947 316936 315683 314960 314461 314272 314977
53033 314977 316841 318950 320017 320218 321295 324345 328441 332079 335061 337960 340504 341860 342330 343483 346315
$$ packed form
53121A214257k0247k0388k0772k1151k1468k1897k2157k1625k0453j9733k0079
53110I84287k0843k1134k0848k0232j9362j8510j8131j8012j7303j5888j4770
53099G79254j4671j5327j6489j8206j9618j9067j6467j3939j3026j2781j1937
53088F07726j1248j1903j3004j2828j1570j0710j0444r843r005q775q685p473
53076D82238n602m961n740n877m313k778l180m808n505m681l804m209n435n945
53062D15400n080m031m524o554q108p574n682m233l641k978j925j313j739k914
53048C55104m380n802o464n672l871k482k270k619k597k011j253p23m99j89P05
53033C14977J864K109J067K01J077L050M096L638K982K899K544J356M70J153K832
$$ plain form
53018 346315 350042 352985 353995 352795 349584 344880 339508 334159 328838 323095 317069 311979 308968 307455
53004 307455 305419 301690 297167 293126 289254 284557 279539 275848 273876 272422 270863 269801 268883 265973
52990 265973 259966 253075 248534 246691 244986 241486 236951 233294 231294 230327 229582 228948 228861 229528 230428 230861
52974 230861 230962 231583 232859 233491 231997 228356 223993 220504 218741 218653 219398 219852 219436 218351 216840 214717
52958 214717 211868 208700 205764 203313 201503 200428 199739 198859 197840 197309 197286 197023 196439 196599 197968 199229
52942 199229 198926 197518 196618 196717 196955 196808 196828 197735 199745 202792 206502 209808 211407 210941 209434 208449 208880
52925 208880 210318 211449 211392 210717 210617 211149 211314 211081 211913 214528 217464 219066 219713 220694 221876 222239 222081
52908 222081 222844 224937 227431 229892 232819 236142 238911 240893 243012 245791 248584 250894 253242 256159
$$ packed form
53018C46315L727K943J010j200l211m704n372n349n321n743o026n090l011j513
53004C07455k036l729m523m041l872m697n018l691j972j454j559j062r18k910
52990B65973o007o891m541j843j705l500m535l657k000r67p45o34q7O67R00M33
52974B30861J01O21J276O32j494l641m363l489j763q8P45M54m16j085j511k123
52958B14717k849l168k936k451j810j075o89q80j019n31k3k63n84J60J369J261
52942A99229l03j408r00R9K38j47K0R07K010L047L710L306J599m66j507r85M31
52925B08880J438J131n7o75j00N32J65k33Q32K615K936J602O47R81J182L63j58
52908B22081P63K093K494K461K927L323K769J982K119K779K793K310K348K917
$$ plain form
52894 256159 259364 262563 266082 270037 273640 276044 277285 277942 278523 279706 282502 287484 294235 302012 310553
52879 310553 319751 328922 336900 342802 346617 349345 352550 357128 362244 365913 366952 366022 364651 363669 362739
52864 362739 360893 357215 351548 345008 339529 336488 335738 336001 336035 335438 334676 334348 334217 333122 330309 326654
52848 326654 323891 322526 321208 318439 314343 310371 307714 306439 305969 305930 306383 307357 308414 309037 309440 310461
52832 310461 312290 313844 313966 312733 310888 308567 305679 303217 302830 304812 307734 310376 312916 315729 318178
52817 318178 319576 320553 322380 325158 327527 328139 326875 324671 322574 320907 319120 316524 313383 311136 311276
52802 311276 314056 318219 321688 322547 320073 315313 310446 307183 305775 305548 305929 306690 307648 308726 310236
52787 310236 312586 315576 318279 319873 320531 321188 322312 323193 322940 322054 322264 324498 327771 330664 333181 336198
$$ packed form
52894B56159L205L199L519L955L603K404J241O57N81J183K796M982O751P777Q541
52879C10553R198R171P978N902L815K728L205M578N116L669J039r30j371r82r30
52864C62739j846l678n667o540n479l041p50K63L4n97p62l28j31j095k813l655
52848C26654k763j365j318k769m096l972k657j275m70l9M53R74J057O23M03J021
52832C10461J829J554J22j233j845k321k888k462l87J982K922K642K540K813K449
52817C18178J398R77J827K778K369O12j264k204k097j667j787k596l141k247J40
52802C11276K780M163L469Q59k474m760m867l263j408k27L81P61R58J078J510
52787C10236K350K990K703J594O58O57J124Q81k53q86K10K234L273K893K517L017
$$ plain form
52771 336198 339639 342503 344543 346513 348494 349371 348688 347913 348824 351311 353797 355454 356973 359165 361745
52756 361745 363871 365382 367042 369512 372235 373596 372473 369454 366209 363687 361494 358994 356223 353342
52742 353342 349936 345541 340510 335674 331379 327412 323760 320778 318507 316245 313032 308431 302788 296887
52728 296887 291270 285850 280238 274536 269529 265873 263305 260933 258146 254947 251564 248185 245054 242411
52714 242411 240130 237712 234844 231713 228536 225059 221001 216975 214265 213333 213127 212550 212154 213212 215018
52699 215018 214467 209300 201041 193618 189459 187951 187368 186905 186431 185551 183820 181316 178370 175133 171989
52684 171989 169872 169286 169178 167537 163403 157886 153060 150148 148791 147638 145425 141888 138130 135979 136543
52669 136543 139214 142277 144417 145319 144920 142982 139821 136705 134601 132936 130605 127941 126436 126492 126828
$$ packed form
52771C36198L441K864K040J970J981Q77o83p75R11K487K486J657J519K192K580
52756C61745K126J511J660K470K723J361j123l019l245k522k193k500k771k881
52742C53342l406m395n031m836m295l967l652k982k271k262l213m601n643n901
52728B96887n617n420n612n702n007l656k568k372k787l199l383l379l131k643
52714B42411k281k418k868l131l177l477m058m026k710r32k06n77l96J058J806
52699B15018n51n167q259p423m159j508n83m63m74q80j731k504k946l237l144
52684A71989k117n86j08j641m134n517m826k912j357j153k213l537l758k151N64
52669A36543K671L063K140R02l99j938l161l116k104j665k331k664j505N6L36
$$ plain form
52654 126828 126479 126022 126183 126621 127042 128131 130015 130979 129487 126734 125242 125283 124752 122656 120618 120300 121149
52637 121149 121772 122252 123786 126664 129608 130902 129692 126549 123085 120665 119395 118796 119198 121398 124948
52622 124948 128141 130152 131968 134481 136899 138094 138593 140076 143411 148210 153864 159946 165769 170591
52608 170591 174364 177681 180849 183487 185064 185637 185975 186921 188364 189045 187976 185995 184972 185399 185815 184993
52592 184993 183410 181816 179686 176357 172735 170250 168580 166039 162185 158585 156702 156184 155606 153944 150899
52577 150899 146634 141870 137737 135068 133926 133884 134348 134633 134278 133566 133320 133966 135055 135755 135477 134053 131823
52560 131823 129676 128534 128586 129351 130488 131976 133411 133873 133019 131849 131769 133105 134970 136327 136620 135616
52544 135616 133416 130819 129030 128656 129366 130689 132520 134479 135480 134714 132713 130688 129176 128211 128384
$$ packed form
52654A26828l49m57J61M38M21J089J884R64j492k753j492M1n31k096k038l18Q49
52637A21149O23M80J534K878K944J294j210l143l464k420j270n99M02K200L550
52622A24948L193K011J816K513K418J195M99J483L335M799N654O082N823M822
52608A70591L773L317L168K638J577N73L38R46J443O81j069j981j023M27M16q22
52592A84993j583j594k130l329l622k485j670k541l854l600j883n18n78j662l045
52577A50899m265m764m133k669j142m2M64K85l55p12k46O46J089P00k78j424k230
52560A31823k147j142N2P65J137J488J435M62q54j170q0J336J865J357K93j004
52544A35616k200k597j789l74P10J323J831J959J001p66k001k025j512r65J73
$$ plain form
52529 128384 130293 132911 134140 133643 133646 135859 138941 140468 140408 140843 142832 145411 147570 149348 150783 151457
52513 151457 151644 152549 154815 157850 160919 163656 165232 164614 162408 160974 161729 163570 164925 166082 168191
52498 168191 171018 173229 174340 174942 175393 175477 175179 174733 174149 173622 174126 176539 180300 183825 186206 187829
52482 187829 189547 192016 195493 199445 202533 203811 203873 204134 205234 206758 208210 209466 210609 212127 214908
52467 214908 219123 223455 226472 228529 231219 235086 239011 241796 243174 243259 242281 241171 241136 242058 242279 240648
52451 240648 238051 236317 236260 237376 238894 240419 241789 242959 243932 244552 244459 243457 241815 240158 239203 239505
52435 239505 241099 243348 245408 246960 248294 249707 250998 251489 250437 247779 244660 242713 242456 242918 243343
52420 243343 244435 247016 250132 251922 252045 251810 251882 251418 249801 247733 246025 244695 244102 245552 249365 253315
$$ packed form
52529A28384J909K618J229m97LK213L082J527o0M35J989K579K159J778J435O74
52513A51457J87R05K266L035L069K737J576o18k206j434P55J841J355J157K109
52498A68191K827K211J111O02M51Q4k98m46n84n27N04K413L761L525K381J623
52482A87829J718K469L477L952L088J278O2K61J100J524J452J256J143J518K781
52467B14908M215M332L017K057K690L867L925K785J378Q5r78j110l5R22K21j631
52451B40648k597j734n7J116J518J525J370J170R73O20r3j002j642j657r55L02
52435B39505J594K249K060J552J334J413J291M91j052k658l119j947k57M62M25
52420B43343J092K581L116J790J23k35P2m64j617k068j708j330n93J450L813L950
$$ plain form
52404 253315 254623 253209 251608 251818 253530 255474 257065 258108 258090 256836 255393 255297 257061 260087 263877
52389 263877 268490 273511 277377 278467 276698 273628 271114 270247 271234 273572 276311 278812 281389 284618 287892
52374 287892 289483 288530 286193 284310 283497 283311 283621 284723 286250 287101 286737 285924 285967 287588 290561 293883
52358 293883 296159 296393 294785 292675 291627 292412 294470 296134 295856 293739 291645 291338 292862 295056 297118
52343 297118 298898 300242 301107 302128 304021 306370 307975 308557 309252 311123 314011 317130 320161 323368 327073
52328 327073 331311 335643 339317 341997 344278 347005 350229 353475 356793 360665 364869 368420 370794 372394
52314 372394 373610 374318 374519 374564 374394 373468 371937 371013 371497 372632 373079 372486 371465 370508 369673 369146 369528 371476
52296 371476 375111 379494 382713 383162 381087 378565 377781 379640 383829 389333 394780 399253 403221 407923 413493
$$ packed form
52404B53315J308j414j601K10J712J944J591J043j8j254j443r6J764L026L790
52389B63877M613N021L866J090j769l070k514q67R87K338K739K501K577L229L274
52374B87892J591r53k337j883q13j86L10J102J527Q51l64q13M3J621K973L322
52358B93883K276K34j608k110j048P85K058J664k78k117k094l07J524K194K062
52343B97118J780J344Q65J021J893K349J605N82O95J871K888L119L031L207L705
52328C27073M238M332L674K680K281K727L224L246L318L872M204L551K374J600
52314C72394J216P08K01M5j70r26j531r24M84J135M47n93j021r57q35n27L82J948
52296C71476L635M383L219M49k075k522p84J859M189N504N447M473L968M702N570
$$ plain form
52281 413493 418579 422316 425723 430410 436689 443749 450890 457697 463624 468537 473280 478723 484560 490001
52267 490001 495343 501677 509026 515969 521561 526759 533440 542423 552935 563760 574511 585737 598075
52254 598075 611552 625924 641397 658417 676590 694499 711154 727284 744662 764416 786346
52243 786346 809575 833309 857266 881938 908275 936528 965512 993557 1020161 1046227 1072722
52232 1072722 1099599 1126187 1152298 1178694 1206463 1235854 1265756 1294592 1321726 1347565 1372232
52221 1372232 1394827 1414458 1431354 1446423 1460227 1473065 1485472 1497701 1509030 1518499 1526294 1533493
52209 1533493 1540548 1546899 1552128 1556470 1559974 1562096 1562668 1562570 1562920 1564015 1565484 1567032 1568642 1570493 1573171
52194 1573171 1577585 1584157 1592267 1601030 1610555 1622042 1636574 1654004 1672961 1691755 1709388 1726027
$$ packed form
52281D13493N086L737L407M687O279P060P141O807N927M913M743N443N837N441
52267D90001N342O334P349O943N592N198O681Q983J0512J0825J0751J1226J2338
52254E98075J3477J4372J5473J7020J8173J7909J6655J6130J7378J9754K1930
52243G86346K3229K3734K3957K4672K6337K8253K8984K8045K6604K6066K6495
52232A072722K6877K6588K6111K6396K7769K9391K9902K8836K7134K5839K4667
52221A372232K2595J9631J6896J5069J3804J2838J2407J2229J1329R469P795P199
52209A533493P055O351N229M342L504K122N72r8L50J095J469J548J610J851K678
52194A573171M414O572Q110Q763R525J1487J4532J7430J8957J8794J7633J6639
$$ plain form
52182 1726027 1742659 1760233 1779077 1799071 1820110 1842198 1865152 1888385 1911107 1932693 1952877
52171 1952877 1971687 1989272 2005798 2021418 2036187 2049911 2062037 2071765 2078445 2082078 2083548 2084006
52159 2084006 2083609 2080979 2074418 2063761 2050586 2036462 2021639 2005739 1989065 1972464 1956223 1939885
52147 1939885 1923028 1905536 1887196 1867896 1848431 1830292 1814172 1799217 1784206 1769064 1754701
52136 1754701 1741765 1730197 1719836 1710735 1702666 1694865 1686714 1678587 1671641 1666606 1662869 1658936 1653953
52123 1653953 1648562 1644043 1640635 1637126 1632224 1626030 1619880 1615029 1611778 1609604 1607564 1604738 1600803 1596310
52109 1596310 1591976 1587658 1582526 1576333 1569792 1563274 1555802 1546246 1535247 1525104 1517589 1512417 1508042
52096 1508042 1503347 1498293 1493380 1488943 1484881 1480910 1477038 1473519 1469937 1464774 1456906 1447656 1440280 1436716
$$ packed form
52182A726027J6632J7574J8844J9994K1039K2088K2954K3233K2722K1586K0184
52171A952877J8810J7585J6526J5620J4769J3724J2126R728O680L633J470M58
52159B084006l97k630o561j0657j3175j4124j4823j5900j6674j6601j6241j6338
52147A939885j6857j7492j8340j9300j9465j8139j6120j4955j5011j5142j4363
52136A754701j2936j1568j0361r101q069p801q151q127o946n035l737l933m983
52123A653953n391m519l408l509m902o194o150m851l251k174k040k826l935m493
52109A596310m334m318n132o193o541o518p472r556j0999j0143p515n172m375
52096A508042m695n054m913m437m062l971l872l519l582n163p868r250p376l564
$$ plain form
52082 1436716 1435615 1434216 1431354 1427601 1423233 1417767 1411586 1406505 1403886 1402921 1401450 1398069 1392998 1387454
52068 1387454 1382746 1379686 1378252 1377818 1378000 1379130 1381649 1385180 1388606 1391100 1392902 1395077 1398702 1404311
52054 1404311 1411842 1420829 1430620 1440747 1451431 1463557 1477722 1493371 1509459 1526135 1545034 1567424
52042 1567424 1592650 1618928 1645189 1671431 1697854 1724675 1752630 1782678 1814961 1848593 1882316
52031 1882316 1914827 1944963 1972721 1999907 2028487 2058100 2086362 2111794 2134991 2156388 2174492
52020 2174492 2187679 2196766 2204369 2212005 2218975 2223892 2226192 2226029 2223563 2218786 2211764 2202928 2193145 2183304
52006 2183304 2173593 2163396 2152116 2139845 2127140 2114686 2103347 2093910 2086259 2079288 2072267 2065852
51994 2065852 2061234 2058586 2057010 2055827 2055381 2056592 2060079 2065635 2072376 2079514 2087048 2095378 2104320 2113172
$$ packed form
52082A436716j101j399k862l753m368n466o181n081k619r65j471l381n071n544
52068A387454m708l060j434m34J82J130K519L531L426K494J802K175L625N609
52054A404311P531Q987R791J0127J0684J2126J4165J5649J6088J6676J8899K2390
52042A567424K5226K6278K6261K6242K6423K6821K7955L0048L2283L3632L3723
52031A882316L2511L0136K7758K7186K8580K9613K8262K5432K3197K1397J8104
52020B174492J3187R087P603P636O970M917K300j63k466m777p022q836r783r841
52006B183304r711j0197j1280j2271j2705j2454j1339r437p651o971p021o415
51994B065852m618k648j576j183m46J211L487N556O741P138P534Q330Q942Q852
$$ plain form
51980 2113172 2121817 2130855 2140244 2148795 2155692 2161612 2167473 2172830 2176537 2178343 2178644 2177143 2173041 2166366
51966 2166366 2157915 2147990 2136487 2124194 2112505 2101368 2088764 2072959 2054410 2034706 2014421 1992859
51954 1992859 1969492 1944740 1919408 1893969 1868378 1842112 1814375 1784689 1753521 1722085 1691333
51943 1691333 1661116 1630459 1598686 1566019 1533000 1499633 1465617 1431324 1397840 1365761 1334583
51932 1334583 1303712 1273520 1244693 1216807 1188361 1158316 1127109 1096037 1065914 1036468 1006998
51921 1006998 977659 949793 924447 900656 876165 850300 825152 803164 784289 766513 748474
51910 748474 730364 712683 695601 679586 665323 652638 640470 628278 616653 606282 597178 589229
51898 589229 582586 576918 571008 563840 555856 548683 543751 541226 539894 537939 534333 529691 525507 522478
$$ packed form
51980B113172Q645R038R389Q551O897N920N861N357L707J806L01j501m102o675
51966B166366q451r925j1503j2293j1689j1137j2604j5805j8549j9704k0285k1562
51954A992859k3367k4752k5332k5439k5591k6266k7737k9686l1168l1436l0752
51943A691333l0217l0657l1773l2667l3019l3367l4016l4293l3484l2079l1178
51932A334583l0871l0192k8827k7886k8446l0045l1207l1072l0123k9446k9470
51921A006998k9339k7866k5346k3791k4491k5865k5148k1988j8875j7776j8039
51910G48474j8110j7681j7082j6015j4263j2685j2168j2192j1625j0371r104p949
51898E89229o643n668n910p168p984p173m932k525j332j955l606m642m184l029
$$ plain form
51884 522478 519910 516608 511813 505436 498222 491697 486997 483446 479124 473168 466672 460976 456101 451562
51870 451562 447716 445254 443893 442632 440917 438670 435512 431140 426337 422383 419186 415075 408992 402014
51856 402014 395982 391304 387010 382647 378971 376574 374711 372022 368016 363373 359096 355764 353342 351131
51842 351131 348117 343899 339289 335479 332736 330431 328135 325769 322748 318284 313018 309150 307981 308126
51828 308126 307197 304562 301403 298743 296793 295852 296215 297037 296683 294604 291932 290001 289245 289631 290909 292175
51812 292175 292511 292593 294359 298322 302462 304701 305297 305610 305682 304686 303051 302300 302850 303634 304038 304699 305990
51795 305990 307155 307648 308170 309487 311165 312524 314209 317616 323008 329223 335172 340621 345399 348896 350862
51780 350862 352015 353166 354168 354291 353387 352139 351306 351181 351616 352120 352034 351121 349893 348898 347779 345611 342176
$$ packed form
51884E22478k568l302m795o377p214o525m700l551m322n956o496n696m875m539
51870D51562l846k462j361j261j715k247l158m372m803l954l197m111o083o978
51856D02014o032m678m294m363l676k397j863k689m006m643m277l332k422k211
51842C51131l014m218m610l810k743k305k296k366l021m464n266l868j169J45
51828C08126r29k635l159k660j950r41L63Q22l54k079k672j931p56L86J278J266
51812B92175L36Q2J766L963M140K239N96L13P2r96j635p51N50P84M04O61J291
51795C05990J165M93N22J317J678J359J685L407N392O215N949N449M778L497J966
51780C50862J153J151J002J23r04j248q33j25M35N04q6r13j228r95j119k168l435
$$ plain form
51763 342176 338304 334953 332538 331141 330526 329773 327881 325198 323418 323518 324453 324638 324025 323770 324325 324885
51747 324885 324608 323496 322071 320908 320493 321025 322342 324351 327189 330508 333123 334068 333615 332550 330960
51732 330960 328684 326371 324808 323460 321111 317949 315553 314578 313896 312594 311456 311601 312788 314179 315984
51717 315984 319120 323543 327981 331295 333337 334352 334271 333037 331422 331003 332943 336831 341120 344757 347785
51702 347785 350095 350632 348917 346700 346663 349473 353392 356847 360055 363781 367893 371826 375383 378294 379924
51687 379924 380246 380434 381720 384187 387262 390704 394489 398460 402826 408392 415505 423259 430513 437287 444442
51672 444442 452422 461026 470086 479657 489769 500544 512232 524680 537144 549089 560627 571574
51660 571574 580782 587342 592018 596453 601039 604467 605418 603981 601362 598824 596972 595518 593672 591089
$$ packed form
51763C42176l872l351k415j397o15p53j892k683j780J00R35J85o13k55N55N60
51747C24885k77j112j425j163m15N32J317K009K838L319K615R45m53j065j590
51732C30960k276k313j563j348k349l162k396r75o82j302j138J45J187J391J805
51717C15984L136M423M438L314K042J015q1j234j615m19J940L888M289L637L028
51702C47785K310N37j715k217l7K810L919L455L208L726M112L933L557K911J630
51687C79924L22J88J286K467L075L442L785L971M366N566P113P754P254O774P155
51672D44442P980Q604R060R571J0112J0775J1688J2448J2464J1945J1538J0947
51660E71574R208O560M676M435M586L428R51j437k619k538j852j454j846k583
$$ plain form
51646 591089 588495 587129 587669 589867 592864 595473 596489 595379 592730 589817 587846 587673 589643 593114 596422
51631 596422 597980 597481 595950 594912 595694 598923 604032 609410 613536 616113 618179 621468 627431 635965 644853
51616 644853 651388 655017 657425 659500 659547 655678 648890 642146 636990 632736 628740 625656 624169 624107 625377
51601 625377 628404 632866 637089 639656 640932 642126 643488 644370 644615 644676 644287 641993 636632 628875 620725
51586 620725 613579 607143 600208 591982 582446 571846 560459 548851 537815 527865 518990 510857 502969
51573 502969 494795 486359 478601 472513 467757 462886 457091 451023 445666 441238 437554 434537 431731 428127
51559 428127 423274 417979 413255 409195 405527 402558 400646 399322 397790 395861 393607 390720 387135 383616
51545 383616 380631 377308 372863 368556 366612 367165 367877 366934 365173 364678 366203 368565 370033 370014 369755 371338
$$ packed form
51646E91089k594j366N40K198K997K609J016j110k649k913j971j73J970L471L308
51631E96422J558m99j531j038P82L229N109N378M126K577K066L289N963Q534Q888
51616F44853O535L629K408K075M7l869o788o744n156m254l996l084j487o2J270
51601F25377L027M462M223K567J276J194J362Q82K45O1l89k294n361p757q150
51586F20725p146o436o935q226r536j0600j1387j1608j1036r950q875q133p888
51573E02969q174q436p758o088m756m871n795o068n357m428l684l017k806l604
51559D28127m853n295m724m060l668k969j912j324j532j929k254k887l585l519
51545C83616k985l323m445m307j944N53P12r43j761m95J525K362J468j9k59J583
$$ plain form
51529 371338 375442 380308 383600 384954 385862 387478 389843 393110 397924 404297 411427 419118 428135 438538
51515 438538 448942 458234 466995 476242 485532 493401 499194 503440 506536 507920 506620 502243 495440 487668
51501 487668 480323 473879 467935 462184 457041 453246 451006 449647 448023 445468 442632 441072 441589 443383
51487 443383 445371 447732 451155 455135 458483 461504 466090 473217 481675 489865 497566 505307 513196 521264
51473 521264 529790 538178 544463 547213 547359 546981 546722 545585 542905 539236 535347 531455 527646 524190 521183
51458 521183 518453 516012 514144 513104 513166 514775 518045 522253 526546 531154 537079 544427 551677 556964 559682
51443 559682 560736 561750 564198 568635 574094 578491 580141 578984 576158 572599 568352 563048 556526 548857
51429 548857 540283 531422 523205 516099 509492 502368 494739 488079 484152 483554 485324 487564 488484 487606 486281
$$ packed form
51529C71338M104M866L292J354R08J616K365L267M814O373P130P691R017J0403
51515D38538J0404R292Q761R247R290P869N793M246L096J384j300m377o803p772
51501D87668p345o444n944n751n143l795k240j359j624k555k836j560N17J794
51487D43383J988K361L423L980L348L021M586P127Q458Q190P701P741P889Q068
51473E21264Q526Q388O285K750J46l78k59j137k680l669l889l892l809l456l007
51458E21183k730k441j868j040O2J609L270M208M293M608N925P348P250N287K718
51443E59682J054J014K448M437N459M397J650j157k826l559m247n304o522p669
51429E48857q574q861q217p106o607p124p629o660l927n98J770K240R20q78j325
$$ plain form
51414 486281 486475 488662 491488 493883 496577 500702 505779 510445 514675 519732 526040 532696 539427 547381
51400 547381 557203 567696 577383 586409 595781 605564 615016 624041 633289 643012 652837 662573 672277 681443
51386 681443 689014 694451 698185 700742 701956 701393 699254 696549 694381 693046 691753 689336 685510 681376
51372 681376 678496 677513 677866 678838 680584 683898 688986 694727 699509 702922 706318 711352 718194 725510 731868
51357 731868 736548 739164 739403 737378 733632 728472 721779 713628 704598 695334 686258 677776 670003 662234
51343 662234 653536 644268 636142 630279 625963 621823 617454 613130 608740 603984 599215 595221 592407 590811
51329 590811 590392 590564 589855 586996 582268 577219 573287 571227 571226 572690 574357 575607 577275 580260 583776 586186
51313 586186 587115 587138 585487 579961 569784 557070 544514 532746 520862 508491 496072 483722 471088
$$ packed form
51414D86281J94K187K826K395K694M125N077M666M230N057O308O656O731P954
51400E47381R822J0493R687R026R372R783R452R025R248R723R825R736R704R166
51386F81443P571N437L734K557J214n63k139k705k168j335j293k417l826m134
51372F81376k880r83L53R72J746L314N088N741M782L413L396N034O842P316O358
51357G31868M680K616K39k025l746n160o693q151r030r264r076q482p773p769
51343F62234q698r268q126n863m316m140m369m324m390m756m769l994k814j596
51329E90811m19J72p09k859m728n049l932k060jJ464J667J250J668K985L516K410
51313E86186R29K3j651n526j0177j2714j2556j1768j1884j2371j2419j2350j2634
$$ plain form
51300 471088 458187 445396 432757 420091 407737 396369 385981 375772 365311 355402 347555 342810
51288 342810 340907 340232 338663 335050 330106 325560 322461 320606 319419 318571 317503 315144 310830 305247 299853
51273 299853 295458 291858 288659 285866 283540 281445 279304 277154 275237 273819 273140 273185 273380 273040 272401 272760
51257 272760 275129 278973 282726 285347 286945 288129 289332 290849 293086 296487 301307 307402 314258 321462
51243 321462 329139 337494 345834 352877 358522 364517 372397 381353 389257 395343 400524 405196 408351 409307
51229 409307 408903 408190 406973 404421 400249 394564 387364 379098 371053 364238 358298 352224 345612 338492 330678
51214 330678 322376 314945 309731 306217 302478 297571 292384 287821 283243 277503 270950 265419 262152 260265
51200 260265 257679 253376 248275 243739 239872 235988 232318 230063 229551 229529 228889 228113 228152 228818 229291 229479 229593
$$ packed form
51300D71088j2901j2791j2639j2666j2354j1368j0388j0209j0461r909p847m745
51288C42810j903o75j569l613m944m546l099j855j187q48j068k359m314n583n394
51273B99853m395l600l199k793k326k095k141k150j917j418o79M5J95l40o39L59
51257B72760K369L844L753K621J598J184J203J517K237L401M820O095O856P204
51243C21462P677Q355Q340P043N645N995P880Q956P904O086N181M672L155R56
51229D09307m04p13j217k552m172n685p200q266q045o815n940o074o612p120p814
51214C30678q302p431n214l514l739m907n187m563m578n740o553n531l267j887
51200B60265k586m303n101m536l867l884l670k255n12k2o40p76L9O66M73J88J14
$$ plain form
51183 229593 228965 226803 224023 222815 224097 226680 229347 232540 237117 242256 245631 245577 242632 239062 237076
51168 237076 237267 238573 239769 240838 242532 244836 246642 247112 246744 246746 247718 249136 249754 248468 245318 241933
51152 241933 240448 241564 243961 245788 246326 245890 244701 242530 239417 236238 234390 234917 237787 241792 245351
51137 245351 247651 249067 250438 252193 254235 256374 258407 259828 259940 258540 256320 254231 252472 250445
51123 250445 247862 245499 244403 244552 244874 244521 243477 241837 239422 236594 234690 234684 235778 236149 235010 233123
51107 233123 231294 229247 226346 222847 219918 218538 218665 219481 220374 221607 223852 227088 230360 232816 234523
51092 234523 235845 236517 235933 234113 231762 229513 227639 226249 225118 223566 221314 219293 218702 219202 218861
51077 218861 216105 211102 205245 200151 197332 197718 200798 204752 207976 210114 211453 212054 211985 211704 211509 211054
$$ packed form
51183B29593o28k162k780j208J282K583K667L193M577N139L375n4k945l570j986
51168B37076J91J306J196J069J694K304J806M70l68KR72J418O18j286l150l385
51152B41933j485J116K397J827N38m36j189k171l113l179j848N27K870M005L559
51137B45351K300J416J371J755K042K139K033J421J12j400k220k089j759k027
51123B50445k583k363j096J49L22l53j044j640k415k828j904oJ094L71j139j887
51107B33123j829k047k901l499k929j380J27Q16Q93J233K245L236L272K456J707
51092B34523J322O72n84j820k351k249j874j390j131j552k252k021n91N00l41
51077B18861k756n003n857n094k819L86L080L954L224K138J339O01o9k81j95m55
$$ plain form
51061 211054 210111 209513 210615 213925 218717 223836 228345 231566 233174 233480 233350 233629 234760 236839 239709
51046 239709 242950 245948 248166 249448 250074 250445 250565 249966 248364 246307 244713 243766 242787 241427 240460 240942
51030 240942 242818 244867 245931 245855 245191 244385 243467 242386 241498 241527 242948 245407 247883 249517 250256 250714 251493
51013 251493 252618 253622 254208 254846 256476 259453 263034 266188 268684 271009 273392 275432 276696 277178 277032
50998 277032 276311 275181 274033 273136 272297 270949 268497 264743 260311 256546 254616 254763 256650 260090 264705
50983 264705 269114 271492 271343 270043 269267 269455 270152 271202 273003 275948 279995 284473 288085 289703 289693 289987
$$ packed form
51061B11054r43n98J102L310M792N119M509L221J608L06j30K79J131K079K870
51046B39709L241K998K218J282O26L71J20n99j602k057j594r47r79j360r67M82
51030B40942J876K049J064p6o64q06r18j081q88K9J421K459K476J634P39M58P79
51013B51493J125J004N86O38J630K977L581L154K496K325K383K040J264M82j46
50998B77032p21j130j148q97q39j348k452l754m432l765j930J47J887L440M615
50983B64705M409K378j49j300p76J88O97J050J801K945M047M478L612J618j0K94
$$ [...]
##END NTUPLES=NMR SPECTRUM
##END=
