
##TITLE=AC1147_Santa_5874710_RRjeiLJZGs
##JCAMPDX= 6.0         $$ Bruker NMR JCAMP-DX V2.0
##DATA TYPE= NMR SPECTRUM
##DATA CLASS= NTUPLES
##ORIGIN= BRUKER
##OWNER= Administrator
$$ 1.72 TOPSPIN		Version 2.1
$$ 2012-03-31 17:33:47.078 -0500  Administrator@TOPSPIN
$$ Compression mode = diff/dup
##.OBSERVE FREQUENCY= 400.13188235
##.OBSERVE NUCLEUS= ^1H
##.ACQUISITION MODE= SIMULTANEOUS (DQD)
##.ACQUISITION SCHEME= undefined
##.AVERAGES= 8
##.DIGITISER RES= 22
##SPECTROMETER/DATA SYSTEM= spect
##.PULSE SEQUENCE= zg30
##.SOLVENT NAME= COFFEE_meoh
##.SHIFT REFERENCE= INTERNAL, COFFEE_meoh, 1, 14.98061
##AUDIT TRAIL= $$ (NUMBER, WHEN, WHO, WHERE, PROCESS, VERSION, WHAT)
$$ ##TITLE= Audit trail, TOPSPIN		Version 2.1
$$ ##JCAMPDX= 5.01
$$ ##ORIGIN= Bruker BioSpin GmbH
$$ ##OWNER= Administrator
$$ $$ C:\Bruker\TOPSPIN/data/COFFEE/nmr/AC1147_Santa_5874710_RRjeiLJZGs/10/pdata/1/auditp.txt
$$ ##AUDIT TRAIL=  $$ (NUMBER, WHEN, WHO, WHERE, PROCESS, VERSION, WHAT)
(   1,<2012-03-31 17:33:39.203 -0500>,<Administrator>,<TOPSPIN>,<go>,<TOPSPIN 2.1>,
      <created by zg
	started at 2012-03-31 17:32:32.437 -0500,
	POWCHK enabled, PULCHK disabled,
       configuration hash MD5:
       1A 1E CE 29 27 FD 77 03 67 4E F0 E3 C4 B2 CB 90
       data hash MD5: 64K
       F8 78 7F EE 6B 46 6A 90 48 65 96 D5 0C 9C 51 FA>)
(   2,<2012-03-31 17:33:41.921 -0500>,<Administrator>,<TOPSPIN>,<proc1d>,<TOPSPIN 2.1>,
      <Start of raw data processing
       efp LB = 0 FT_mod = 6 PKNL = 1 PHC0 = 0 PHC1 = 0 SI = 32K 
       data hash MD5: 32K
       40 CF 11 C2 AA C2 83 B5 AC 0E 35 94 A3 0F 54 F8>)
(   3,<2012-03-31 17:33:42.750 -0500>,<Administrator>,<TOPSPIN>,<proc1d>,<TOPSPIN 2.1>,
      <pk PHC0 = 215.4364 PHC1 = 0 
       data hash MD5: 32K
       A9 C8 BF 79 C0 7E F1 94 16 DE 7B FF 55 E0 C7 B0>)
(   4,<2012-03-31 17:33:42.843 -0500>,<Administrator>,<TOPSPIN>,<proc1d>,<TOPSPIN 2.1>,
      <abs ABSG = 1 
       data hash MD5: 32K
       A5 F3 92 53 38 18 E0 0C 27 22 02 B1 DE 36 7A 99>)
(   5,<2012-03-31 17:33:42.875 -0500>,<Administrator>,<TOPSPIN>,<proc1d>,<TOPSPIN 2.1>,
      <abs ABSG = 2 
       data hash MD5: 32K
       1A 44 B2 4A 42 7C B3 F3 22 C4 3A 2E F4 49 96 D6>)
(   6,<2012-03-31 17:33:42.921 -0500>,<Administrator>,<TOPSPIN>,<proc1d>,<TOPSPIN 2.1>,
      <abs ABSG = 3 
       data hash MD5: 32K
       47 20 40 A9 E1 66 FF E4 D0 2A 95 02 50 7B F2 59>)
(   7,<2012-03-31 17:33:42.953 -0500>,<Administrator>,<TOPSPIN>,<proc1d>,<TOPSPIN 2.1>,
      <abs ABSG = 4 
       data hash MD5: 32K
       39 9D 6A 39 6B B0 D0 AD 14 4F 34 B5 52 47 4C 9A>)
(   8,<2012-03-31 17:33:42.984 -0500>,<Administrator>,<TOPSPIN>,<proc1d>,<TOPSPIN 2.1>,
      <abs ABSG = 5 
       data hash MD5: 32K
       17 3B A7 2C CD D7 52 96 CC 84 D9 A2 12 F8 0B A3>)
$$ ##END=
$$ 
$$ $$ hash MD5
$$ $$ B7 14 E3 CF E2 0B EC E4 F1 65 4F EA FE 6D 58 0E
##$RELAX= 
##$RELAX= 
##$RELAX= 
##$RELAX= 
##$RELAX= 
##$RELAX= 
##$RELAX= 
$$ Bruker specific parameters
$$ --------------------------
$$ [...]
##$TP= (0..7)
150 150 150 150 150 150 150 150
##$TP07= 0
##$TPNAME0= <>
##$TPNAME1= <>
##$TPNAME2= <>
##$TPNAME3= <>
##$TPNAME4= <>
##$TPNAME5= <>
##$TPNAME6= <>
##$TPNAME7= <>
##$TPOAL= (0..7)
0.5 0.5 0.5 0.5 0.5 0.5 0.5 0.5
##$TPOFFS= (0..7)
0 0 0 0 0 0 0 0
##$TUNHIN= 0
##$TUNHOUT= 0
##$TUNXOUT= 0
##$USERA1= <user>
##$USERA2= <user>
##$USERA3= <user>
##$USERA4= <user>
##$USERA5= <user>
##$V9= 5
##$VALIST= <valist>
##$VCLIST= <CCCCCCCCCCCCCCC>
##$VD= 0
##$VDLIST= <DDDDDDDDDDDDDDD>
##$VPLIST= <PPPPPPPPPPPPPPP>
##$VTLIST= <TTTTTTTTTTTTTTT>
##$WBST= 2048
##$WBSW= 25
##$XGAIN= (0..3)
0 0 0 0
##$XL= 0
##$YL= 0
##$YMAX_a= 536688
##$YMIN_a= -641690
##$ZGOPTNS= <>
##$ZL1= 120
##$ZL2= 120
##$ZL3= 120
##$ZL4= 120
##$ABSF1= 14.98061
##$ABSF2= -5.57192
##$ABSG= 5
##$ABSL= 3
##$ALPHA= 0
##$AQORDER= 0
##$ASSFAC= 0
##$ASSFACI= 0
##$ASSFACX= 0
##$ASSWID= 0
##$AUNMP= <proc_prof1d_extract_pilot.lims>
##$AXLEFT= 0
##$AXNAME= <>
##$AXNUC= <1H>
##$AXRIGHT= 0
##$AXTYPE= 0
##$AXUNIT= <>
##$AZFE= 0.1
##$AZFW= 0.1
##$BCFW= 0
##$BC_mod= 0
##$BYTORDP= 0
##$COROFFS= 0
##$CY= 15
##$DATMOD= 1
##$DC= 0
##$DFILT= <>
##$DTYPP= 0
##$F1P= 0
##$F2P= 0
##$FCOR= 0.5
##$FTSIZE= 32768
##$FT_mod= 6
##$GAMMA= 0
##$GB= 0
##$INTBC= 1
##$INTSCL= 1
##$ISEN= 128
##$LB= 0
##$LEV0= 0
##$LPBIN= 0
##$MAXI= 10000
##$MC2= 0
##$MEAN= 0
##$ME_mod= 0
##$MI= 0
##$NCOEF= 0
##$NC_proc= -8
##$NLEV= 6
##$NOISF1= 0
##$NOISF2= 0
##$NSP= 0
##$NTH_PI= 0
##$NZP= 0
##$OFFSET= 14.98061
##$PC= 1
##$PHC0= 215.4364
##$PHC1= 0
##$PH_mod= 1
##$PKNL= yes
##$PPARMOD= 0
##$PPDIAG= 0
##$PPIPTYP= 0
##$PPMPNUM= 2147483647
##$PPRESOL= 1
##$PSCAL= 4
##$PSIGN= 0
##$PYNMP= <proc.py>
##$REVERSE= no
##$SF= 400.13
##$SI= 32768
##$SIGF1= 0
##$SIGF2= 0
##$SINO= 400
##$SIOLD= 32768
##$SPECTYP= <>
##$SREGLST= <1H.CDCl3>
##$SSB= 0
##$STSI= 32768
##$STSR= 0
##$SW_p= 8223.68421052632
##$SYMM= 0
##$S_DEV= 0
##$TDeff= 65536
##$TDoff= 0
##$TI= <>
##$TILT= no
##$TM1= 0
##$TM2= 0
##$TOPLEV= 0
##$USERP1= <user>
##$USERP2= <user>
##$USERP3= <user>
##$USERP4= <user>
##$USERP5= <user>
##$WDW= 1
##$XDIM= 32768
##$YMAX_p= 479785937
##$YMIN_p= -654630
##$CURPLOT= <Network HP LaserJet P1505>
##$CURPRIN= <$Network HP LaserJet P1505>
##$DFORMAT= <normdp>
##$LAYOUT= <+/1D_H.xwp>
##$LFORMAT= <normlp>
##$PFORMAT= <normpl>
##$SURQMSG= 1
$$ End of Bruker specific parameters
$$ ---------------------------------
##NTUPLES= NMR SPECTRUM
##VAR_NAME=  FREQUENCY,     SPECTRUM/REAL,   SPECTRUM/IMAG
##SYMBOL=    X,             R,               I
##VAR_TYPE=  INDEPENDENT,   DEPENDENT,       DEPENDENT
##VAR_FORM=  AFFN,          ASDF,            ASDF
##VAR_DIM=   32768,         32768,           32768
##UNITS=     HZ,            ARBITRARY UNITS, ARBITRARY UNITS
##FACTOR=    0.250966925370066, 1,           1
##FIRST=     8223.43324360095, -99889,       -2146
##LAST=      0,             -279011,         -8403
##MIN=       0,             -654630,         0
##MAX=       8223.43324360095, 479785937,    0
$$ Real data points
##PAGE= N=1
##DATA TABLE= (X++(R..R)), XYDATA
$$ [...]
$$ plain form
19452 -94432 -72621 61178 -289659 133643 31602 -126396 -163943 -248018 -39972 -160787 -15297
19440 67811 175746 201297 -176346 -32030 -111179 113464 -16982 -198650 -20437 82090 -20388
19428 55009 -48920 -85170 -215554 198880 -369359 -146782 -120219 -152109 220991 231367 189489
19417 189489 -134028 -104254 -211676 40368 -56547 -241676 -135604 -56626 -63626 -196878 -83398
19405 270220 -82525 -222082 155051 -221863 -16415 -168295 -362035 -235609 250910 -240374
19394 83440 -69346 30806 -90917 -15935 200032 -353706 -126642 -120883 105888 5213 -16271
19382 -445524 -223309 -52904 56763 3902 111720 -209511 12358 30128 -26974 32671 -120300
19370 -65957 -186506 -75950 131064 83486 3883 49245 -92133 143422 73495 95246 298367
$$ packed form
19452i4432K1811F1178b89659A33643C1602a26396l7547q4075c9972j20815a5297
19440F7811J07935K5551a76346c2030p9149A13464a6982j81668b0437H2090b0388
19428E5009d8920l6250j30384A98880c69359a46782K6563l1890B20991J0376m1878
19417A89489a34028K9774j07422D0368e6547j85129J06072e6626p000j33252h3398
19405B70220h2525j39557A55051b21863a6415j51880j93740J26426B50910b40374
19394H3440f9346C0806i0917a5935B00032c53706a26642N759A05888E213a6271
19382d45524K22215e2904E6763C902J07818b09511A2358J7770b6974C2671a20300
19370f5957j20549g5950A31064m7578C883M5362i2133A43422o9927K1751K03121
$$ plain form
19359 298367 3436 152098 -4356 14928 152489 -90460 24384 -215032 -136381 199537 49860
19347 49141 -33940 -384336 272845 -256514 10032 -180259 -144563 -2653 -68831 23362 169201
19336 169201 -243730 -104190 -265488 163842 131154 168593 53793 -188774 -47084 -34442
19326 -34442 -152870 115983 -197983 350275 -168658 -507475 -253083 88720 74405 -39595
19315 -86635 -178288 -97076 119675 -137626 108173 -168782 3210 185691 -282048 86374 60725
19304 60725 121357 -39361 -325921 -12496 -145183 -182370 -167676 35664 -11822 -294609 -183534
19293 -183534 -88779 -132865 78005 47483 -162530 -61169 -114261 207479 -38996 -274386 -41178
19281 -188280 -151961 -92675 29672 249078 -50796 -219237 -194297 -147604 -23530 -68660 69674
$$ packed form
19359B98367C436J48662d356A4928J37561i0460B4384b15032P8651A99537D9860
19347D9141c3940l50396B72845b56514A0032a80259L5696b653o6178B3362J45839
19336A69201b43730a04190j61298A63842l2688L7439E3793a88774d7084J2642
19326c4442j18428A15983a97983C50275a68658l38817b53083H8720j4315c9595
19315h6635r1653Q1212A19675a37626A08173a68782C210J82481b82048H6374k5649
19304F0725O0632c9361k86560a2496j32687l7187J4694C5664a1822k82787J11075
19293a83534h8779m4086G8005l0522a62530f1169n3092B07479c8996k35390d1178
19281a88280L6319N9286B9672K19406e0796j68441K4940M6693b3530m5130F9674
$$ plain form
19269 -232025 -172476 -286734 63109 -255486 147655 -263939 -187525 -51740 -51362 -136899 -9010
19257 126329 -65793 -273665 -172319 105321 -339991 161476 160569 -150204 -273752 -194524
19247 -194524 -101514 -324382 -291902 123718 14253 -35930 -229968 -158614 65257 -193182 -505825
19236 -505825 -87883 55628 127798 -186788 22614 -133286 -148324 -235326 -53766 -242400 -97094
19224 -216572 164025 135763 -35196 -327256 -161648 33531 28493 -114926 -194304 20146 -242131
19212 87908 23490 -160899 -115949 -26846 218095 -14934 81364 -42996 -22606 -18981 88106
19200 -160719 38470 138008 -25997 126362 -154142 -62164 271952 -367387 232603 181361
19190 181361 62804 43599 -85143 -23911 94703 94770 -381463 164705 122251 104881 3178 -214518
$$ packed form
19269b32025N9549j14258F3109b55486A47655b63939P6414e1740L78q5537i010
19257A26329f5793k07872J01346A05321c39991A61476r07a50204j23548P9228
19247a94524R3010k22868L2480A23718A4253c5930j94038P1354F5257a93182l12643
19236e05825h7883E5628P2170a86788B2614a33286j5038q7002e3766j88634i7094
19224b16572A64025k8262c5196k92060a61648C3531n038a14926p9378B0146b42131
19212H7908B3490a60899M4950b6846B18095a4934H1364d2996K0390L625H8106
19200a60719C8470R9538b5997A26362a54142f2164B71952c67387B32603n1242
19190A81361F2804j9205h5143b3911I4703O7c81463A64705m2454j7370C178b14518
$$ plain form
19177 198427 -354324 -109711 -258797 -157025 66823 -158365 -209719 32714 -425174 190423
19166 -146001 -86089 -187133 49899 200520 1136 -10247 -90796 -233 -12992 -243435 -438438
19155 -438438 -357819 -333225 -172425 304968 -427312 -202072 -74792 -184418 22804 -202231
19144 -191012 -149150 -61530 -834 129803 -142255 -268114 201329 113215 -156537 -145654 -98897
19133 -98897 -23890 382477 -179 -155728 54865 -110998 -71870 157626 -150275 -125525 64787
19121 -29199 103569 237241 -470464 -339036 39724 -38313 -183236 19166 105217 17050 -260499
19109 189027 -48410 97107 215673 -93429 33829 101000 -71230 -40456 -534487 -141279 8136
19097 -369728 -20717 432783 -52896 -16668 27124 192025 -135537 159620 129361 -26059 -301652
$$ packed form
19177A98427c54324a09711j49086J01772F6823a58365n1354C2714d25174A90423
19166a46001N9912j01044D9899J50621A136a0247q0549b33j2759k30443j95003
19155d38438Q0619K4594J60800C04968d27312b02072g4792j09626B2804b02231
19144a91012M1862f1530h34A29803a42255j25859B01329q8114a56537J0883M6757
19133i8897b3890C82477a79j55549E4865a10998L9128A57626a50275K4750F4787
19121b9199A03569J33672d70464J31428C9724c8313j44923A9166Q6051A7050b60499
19109A89027d8410I7107J18566i3429C3829O7171g1230L0774m94031a41279H136
19097c69728b0717D32783e2896a6668B7124J64901a35537A59620l0259b6059k75593
$$ plain form
19086 -301652 195524 91522 -293789 -194651 106988 -51782 -308305 -260352 -60324 -85293 149832
19074 -107688 17875 16780 -208930 -319189 -21869 32156 -174594 -450483 -202415 -187063 -250437
19063 -250437 145441 4230 22652 -59047 66316 17159 169985 27817 286512 -66382 173793
19051 -117184 128147 48428 -81035 -263382 109047 308603 -109659 -83872 112110 106254
19041 106254 -249435 -34950 -113509 -59219 -30220 -117101 128135 -108582 223055 71224 -490300
19029 -223104 -144314 -31736 70384 141281 -154021 11342 -209254 -174569 124582 -132575 74385
19017 81551 18920 -148393 83652 52064 81785 159 171871 245475 -175100 177205 263007
19006 263007 -59341 106720 -279181 -64684 -339110 1450 20836 -175301 -73364 -285007 -42254
$$ packed form
19086c01652A95524I1522b93789R9138A06988e1782k56523M7953f0324k4969A49832
19074a07688A7875j095b08930j10259b1869C2156a74594k75889b02415J5352o3374
19063b50437A45441D230J8422e9047F6316A7159J52826B7817K58695f6382A73793
19051a17184A28147D8428h1035j82347A09047J99556a09659K5787A12110n856
19041A06254b49435c4950p8559N4290K8999q6881A28135a08582B23055G1224d90300
19029b23104P8790c1736G0384P0897a54021A1342b09254L4685A24582a32575G4385
19017H1551A8920a48393H3652l1588K9721A59J71712P3604a75100A77205Q5802
19006B63007e9341A06720b79181f4684k74426A450J9386a75301g3364k11643d2254
$$ plain form
18994 -360253 -159016 23544 -52526 35585 -106738 -117076 287110 133633 -296053 -430581
18984 -430581 8827 -168263 199933 -75329 -76717 -63297 231131 -117200 -286540 -254091 134226
18972 4330 -198772 -193706 4185 -111187 -43526 -2346 8232 258475 46850 163344 -150023 34159
18959 12273 11043 518505 292833 282996 422727 71239 126701 170058 -118831 -409539 -79850
18947 216812 -117909 147931 -136851 196990 137843 -83460 232981 55379 -297330 -339680
18937 -339680 152131 -74476 235231 -237542 -9705 -59753 -463854 107348 175088 -58324 22013
18925 74866 -2877 -90646 -1324 -169896 -27537 -2366 52601 111786 -165307 -207735 -24264 -175233
18913 -175233 27551 -364615 285645 354727 222059 3713 212359 167549 -287894 204767
$$ packed form
18994c60253a59016B3544e2526C5585a06738j0338B87110A33633b96053j34528
18984d30581H827a68263A99933g5329j388J3420B31131a17200j69340L2449A34226
18972D330a98772N066D185a11187d3526b346H232K50243D6850J16494a50023C4159
18959A2273j230N07462k25672r837J39731G1239N5462M3357a18831k90708g9850
18947B16812a17909A47931a36851A96990n9147h3460B32981E5379b97330m2350
18937c39680A52131g4476B35231b37542i705n0048m04101A07348O7740e8324B2013
18925G4866b877q7769a324j68572b7537b366E2601N9185a65307m2428b4264j50969
18913a75233B7551c64615B85645O9082j32668C713K08646m4810b87894B04767
$$ plain form
18902 -129583 -72619 212125 132121 11910 -153612 -43337 103602 217393 471973 435286
18892 435286 346509 39359 160407 -24719 -265651 -314 -227290 -61676 83769 -335648 -261805
18881 -261805 -166111 406569 -146945 -5310 226445 -99668 -106541 19093 104853 45247 77147
18870 77147 -100814 77826 62733 -215137 -117238 -76163 -22973 -241382 -96541 -208032 -280958
18859 -280958 -142884 18473 -140411 38514 -90789 -12501 -208235 39377 -38490 -121287 -197801
18848 -197801 -244453 -216714 62141 65131 -80211 -254152 -438841 281315 75248 312202 -85170
18836 -239390 299700 148877 -7939 91727 -156822 178101 -66688 -167763 -121013 34857 88263
18825 88263 -20826 48721 -144592 221313 295790 -455372 14314 -93079 -72393 176597 61891
$$ packed form
18902a29583N6964B12125q0004A1910a53612d3337A03602J13791K54580l6687
18892D35286q8777C9359J21048b4719k40932c14k26976f1676H3769c35648P3843
18881b61805R5694D06569a46945e310B26445i9668o873A9093Q5760D5247L1900
18870G7147a00814G7826j5093b15137R7899M1075b2973k18409i6541j11491p2926
18859b80958J38074A8473a40411C8514i0789a2501j95734C9377c8490q2797p6514
18848a97801m6652K7739F2141K990h0211j73941j84689B81315G5248K36954h5170
18836b39390B99700A48877g939I1727a56822A78101f6688j01075M6750C4857N3406
18825H8263b0826D8721a44592B21313P4477d55372A4314i3079K0686A76597F1891
$$ plain form
18813 -76159 -213773 29 125587 169940 -219270 -31197 33534 -65949 174755 -36620 78016
18801 -31178 88860 -250518 -154542 138311 -152595 -271422 66926 -177517 346779 -14505
18790 216847 23627 131845 -216795 -187785 -254825 -66388 -223325 -270004 47627 185518 -31273
18778 -127510 14318 -162761 -390071 -31185 -286525 149305 128796 -218689 140970 156303
18768 156303 -482499 508 -25124 -54483 47160 -197080 -30266 101728 82393 -68589 513 -161188
18755 -46241 -128917 -113040 -164866 -392001 -120325 25528 -216170 22055 -44469 -62369 -66557
18744 -66557 -313587 -101573 -100299 -106308 -269244 -41724 -108414 -205718 268566 -60664 -46674
18733 -46674 73690 35714 -233548 -33637 -305346 36512 -28460 -57330 -101682 -338392 -225933
$$ packed form
18813g6159j37614B9J25558M4353b19270c1197C3534f5949A74755c6620G8016
18801c1178H8860b50518R5976A38311a52595j18827F6926a77517C46779a4505
18790B16847B3627J08218b16795K9010o7040f6388j56937m6679D7627J37891c1273
18778a27510A4318a62761k27310c1185k55340A49305k0509b18689A40970J5333
18768A56303d82499E08b5124k9359D7160a97080c0266A01728j9335f8589E13a61188
18755d6241q2676J5877n1826k27135a20325B5528b16170B2055d4469j7900m188
18744f6557k47030a01573J274o009j62936d1724o6690r7304B68566f0664J3990
18733d6674G3690C5714b33548c3637k71709C6512b8460k8870m4352k36710J12459
$$ plain form
18722 -225933 -517644 -246015 73078 -109563 -229341 -178827 363920 -17822 357229 35230
18711 -18459 -34871 -105645 215486 187336 159396 -260609 -167917 62739 -392133 -39069 153891
18699 -94069 -127597 69495 80587 129818 -205610 152670 113810 -3779 -53189 -250685 -348459
18688 -348459 197839 62389 112936 -202116 -100376 1779 -84583 26468 -187002 -85224 72106
18676 -211757 -58658 -123270 -60322 36659 -84861 -182532 -156650 91178 110761 -116666 27371
18664 -169020 -33271 -140520 100152 228651 -53522 333047 -149913 122057 -49331 -63981
18654 -63981 -84680 46571 -150919 -206366 62088 -74296 -108226 -32069 -262107 -129000 37958
18642 -116866 -158314 27293 -92499 6336 -340258 -285450 -95673 -242863 -36491 -112328 143496
$$ packed form
18722b25933k91711b46015G3078a09563j19778N0514C63920a7822C57229C5230
18711a8459j6412p0774B15486k8150k7940b60609R2692F2739c92133c9069A53891
18699i4069l3528F9495J1092M9231b05610A52670l8860c779m9410j97496r7774
18688c48459A97839F2389N0547b02116a00376A779h4583B6468a87002h5224G2106
18676b11757e8658o4612f0322C6659h4861r7671K5882I1178J9583a16666B7371
18664a69020c3271j07249A00152J28499e3522C33047a49913A22057d9331j4650
18654f3981k0699D6571a50919n5447F2088g4296l3930c2069k30038a29000C7958
18642a16866m1448B7293i2499F336c40258N4808i5673j47190c6491p5837A43496
$$ plain form
18630 -24563 -136905 16351 -185207 -209632 63379 -325326 -381368 -138319 -216039 -163038 -412760
18619 -412760 -135799 -7578 -249382 -160724 -291580 -144974 -154285 -29078 249559 -3525 28499
18607 -55969 73469 -110435 -337114 -286609 -125888 200036 -117280 10596 71080 -946 -71039
18596 -71039 76134 77770 -71083 -132908 -147394 14168 -225951 -47252 -234018 -282144 161548
18584 24364 -85834 -10726 254845 -45145 244397 84020 -186903 -133155 -39373 -138079 10639
18572 88893 222033 -12971 260171 -77339 74077 645 -165255 -96663 15986 -34261 -201192
18561 -201192 -124597 -150419 68746 99266 39623 418864 -191521 -96687 -188793 -324225 -9359
18549 -108808 -232358 -186468 95230 52973 -219545 -55478 85805 -404016 -378819 -59012 -111019
$$ packed form
18630b4563j12342A6351a85207k4425F3379c25326n6042a38319p7720N3001k49722
18619d12760a35799g578k41804Q8658j30856a44974r311b9078B49559c525B8499
18607e5969G3469a10435k26679N0505a25888B00036a17280A0596O0484i46p0093
18596g1039G6134J636g1083o1825j4486A4168b25951d7252j86766m8126A61548
18584B4364h5834a0726B54845d5145B44397H4020a86903N3748c9373r8706A0639
18572H8893J33140a2971B60171g7339G4077F45a65255O8592A5986c4261j66931
18561b01192P6595k5822F8746L0520C9623L79241a91521R4834r2106j35432i359
18549a08808j23550M5890I5230m2257b19545e5478H5805d04016K5197e9012n2007
$$ plain form
18538 -111019 -299105 -196751 -23877 49905 82197 -21078 -187435 -181405 -51180 53605 -164535
18526 -109926 132795 -18157 109954 -291141 -118759 -10854 247280 -301037 12428 189706
18516 189706 246868 -2999 -72064 5066 5015 -196803 73731 -94542 27387 -194973 -122219 -173215
18504 -173215 149445 -416680 -119255 -336213 -99707 -183890 -155266 82758 -357779 49524
18493 138748 51476 -271629 2501 120797 36807 215415 -126202 -69014 -21930 -17453 -52399
18482 -52399 -397641 -107414 -47069 -80291 22244 -186533 108526 45734 -220600 -32700 -238370
18471 -238370 -481545 65244 46050 -99594 -235180 -210033 -11166 -428716 -219090 -87500 -236145
18460 -236145 -153888 122724 -126952 -118661 96037 -274835 -216654 -84644 51626 219565 102747
$$ packed form
18538a11019j88086J02354b3877D9905L2292b1078j66357O030e1180E3605a64535
18526a09926A32795a8157A09954b91141a18759a0854B47280c01037A2428J77278
18516A89706N7162b999o9065E066n1a96803G3731i4542B7387a94973P2754n0996
18504a73215A49445d16680a19255k16958i9707q4183K8624H2758c57779D9524
18493A38748E1476b71629B501J18296C6807J78608a26202N7188b1930M477l4946
18482e2399l45242a07414d7069l3222B2244a86533A08526D5734b20600c2700k05670
18471b38370k43175F5244j9194i9594j35586K5147a1166m17550K09626h7500j48645
18460b36145Q2257A22724a26952Q291I6037b74835N8181h4644E1626J67939A02747
$$ plain form
18448 249996 -124619 -114396 -135338 -62907 -177913 -382105 -34364 332104 -156777 -28610
18437 115575 274137 114738 8285 -46289 208672 -100871 314049 496067 -90663 -205135
18427 -205135 89412 126465 157797 -73788 -94634 -59963 -318935 247940 -70494 -115767 -12478
18415 -100277 -103894 -195636 78395 -42623 -347496 93989 227761 38328 144340 -205164 -124523
18404 -124523 -158687 -40580 44823 -292105 -184699 -287693 102167 -203068 -365101 -68100
18393 87289 140367 268970 62556 2396 -18433 17464 313269 256332 -250229 112072 -242607
18381 257680 -71295 163893 33750 -68530 -168228 31933 34185 -118046 19481 134704 122498
18370 122498 -340455 314609 -175775 -51547 -383892 155700 41199 -312590 -64422 50795
$$ packed form
18448B49996a24619J0223k0942f2907j15006k04192c4364C32104a56777b8610
18437A15575J58562A14738H285d6289B08672a00871C14049J82018i0663j14472
18427b05135H9412L7053L1332g3788k0846L4671k58972B47940g0494m5273a2478
18415a00277l617r1742G8395d2623l04873I3989J33772C8328J06012b05164Q0641
18404a24523l4164d0580D4823b92105J07406j02994A02167b03068j62033f8100
18393H7289N3078J28603F2556B396a8433A7464K95805n6937b50229A12072b42607
18381B57680g1295A63893C3750f8530r9698C1933K252a18046A9481J15223j2206
18370A22498c40455C14609a75775e1547l32345A55700D1199c12590f4422E0795
$$ plain form
18359 -22827 -289668 117404 -378902 83120 54891 -115549 -21413 110596 63328 142248 -172792
18347 176458 77214 79902 -33970 -238148 173802 -150157 -71187 1638 -166263 305411 -2525
18335 39478 -30591 143763 202876 -69781 -300642 25691 49438 -528102 -379765 -432578 -225514
18324 -225514 61016 -128304 112657 -96838 -62598 -360482 -256098 -28 245960 -179455 248632
18312 89175 184794 43745 93702 -68046 -28317 183516 127667 -76024 -434508 -270715 -126955
18300 130625 42354 -175715 -82339 164971 67370 -103526 -78941 -38844 -266122 99932 40663
18288 -191828 81243 -113743 -166106 92306 -11827 -50219 76296 -171098 -54309 -95205 40664
18276 -101039 -179030 -195859 -27356 -39823 -370433 -10109 -370919 -30885 279864 -373175 59399
$$ packed form
18359b2827k66841A17404c78902H3120k8229a15549b1413A10596m7268P8920a72792
18347A76458G7214K688c3970k04178A73802a50157g1187A638a66263C05411b525
18335C9478c0591A43763N9113f9781k30861B5691K3747e28102J48337n2813K07064
18324b25514F1016a28304A12657i6838L4240k97884J04384b8B45960a79455B48632
18312H9175R5619D3745M9957f8046b8317A83516n5849g6024l58484J63793a26955
18300A30625D2354a75715h2339A64971F7370a03526K4585c8844k27278I9932D0663
18288a91828H1243a13743n2363I2306a1827l8392G6296a71098e4309m0896D0664
18276a01039p7991j6829b7356j2467l30610a0109l60810c0885B79864c73175E9399
$$ plain form
18264 132972 122229 -3146 -152732 -118114 -450811 14526 103936 -246155 -121117 73439 -341651
18252 126788 -266747 244615 -128692 -171774 97212 161334 -267561 -291568 -56868 -108192 -2230
18240 -175876 -33187 -39065 -198267 -58336 44157 101772 67889 -376042 134586 -192537 159907
18228 161096 17776 -249809 217742 -59462 3998 -102719 -294562 -217093 -110481 68225 -171668
18216 278657 19578 316123 -90749 -65954 -9012 36846 157913 -270616 -177540 57016 108283
18205 108283 157269 -306278 -145317 -12092 308872 -38595 69165 94914 131553 -133928 -43267
18193 -83363 -81209 49499 -78606 58288 123740 22439 219843 -22524 18101 -141960 -62429
18181 -389581 207963 -139972 166535 -13184 128917 112520 57410 -31845 150946 -329684
$$ packed form
18264A32972j0743c146j49586L4618l32697A4526Q9410b46155a21117G3439c41651
18252A26788b66747B44615a28692m3082I7212O4122b67561k4007e6868n1324b230
18240a75876c3187n878j59202e8336D4157N7615l3883c76042A34586a92537A59907
18228A61096A7776b49809B17742e9462C998a02719j91843P7469J06612F8225a71668
18216B78657A9578K96545i0749K4795i012C6846J21067b70616R3076E7016N1267
18205A08283M8986c06278a45317a2092C08872c8595F9165K5749L6639a33928d3267
18193h3363K154D9499g8606E8288O5452B2439J97404b2524A8101a41960f2429
18181c89581B07963a39972A66535a3184A28917j6397n5110c1845A50946c29684
$$ plain form
18170 -1824 116447 341950 225890 147597 644 -130138 -18035 -177129 -113656 273489 -125192
18158 -132284 -161026 -265579 114902 188495 -222223 -214129 -85956 -227099 -17267 -35160 65155
18146 232081 214662 177318 38809 16742 45279 103074 15021 -35534 261372 109009 182128
18135 182128 331775 -152800 170469 -73657 -193052 -112976 -7160 112251 65642 -139348
18124 39732 -159327 27223 -318190 -70492 -59516 21148 16397 75215 158623 -24160 205011
18112 10270 -178791 -300665 -77269 442432 -46204 -146921 61106 -11238 115267 -234781
18101 287085 -58403 62864 -105010 302385 -403323 186007 152980 -339914 390822 -144972
18090 -80034 23235 -114080 2705 -110529 -1521 -42675 -54538 -11394 -333868 -261741 -103157
$$ packed form
18170a824A16447K25503j16060p8293F44a30138a8035j59094O3473B73489a25192
18158a32284k8742j04553A14902P3593b22223Q094h5956j41143a7267j7893F5155
18146B32081j7419l7344C8809A6742K8537N7795A5021c5534B61372A09009P3119
18135A82128J49647a52800A70469g3657j19395Q0076g160A12251m6609a39348
18124C9732a59327B7223c18190g0492J0976B1148m751N8818Q3408b4160B05011
18112A0270a78791j21874g7269D42432d6204j00717F1106a1238A15267b34781
18101B87085e8403F2864a05010C02385d03323A86007l3027c39914C90822a44972
18090h0034B3235a14080B705a10529a521m1154j1863a1394l22474P2127a03157
$$ plain form
18078 -32991 -266972 45958 -136802 73412 11236 -154587 67630 -117115 -179478 111480 203516
18067 203516 -192468 416793 218160 41894 -101467 -151731 91315 -94423 156881 -291234
18056 -604 95684 -106221 -60741 -69290 -204555 -228600 -171968 87387 170460 148542 -33649 -86362
18044 -86362 -22498 264943 124143 -240545 -132211 -291539 -41268 -217786 50891 -172744
18033 376833 -351801 376376 107628 191840 120981 248299 88456 -79714 -129473 107650
18022 -65386 284206 208825 57622 122338 -25685 147561 214032 -10219 -465662 184246 -6338
18010 -132874 141569 -22928 22364 -174391 -148986 -224932 -18228 -159190 -287071 -192493 -262367
17999 -262367 -166634 -59347 201617 998 -108480 -377688 125949 255287 -58618 -102818 -91765
$$ packed form
18078c2991k33981D5958a36802G3412A1236a54587F7630a17115o2363A11480R2036
18067B03516a92468D16793j98633D1894a01467n0264I1315i4423A56881b91234
18056f04I5684a06221M5480q549j35265k4045N6632H7387Q3073k1918c3649n2713
18044h6362b2498B64943A24143b40545J08334j59328d1268j76518E0891a72744
18033C76833c51801C76376A07628Q4212p0859J27318H8456g9714m9759A07650
18022f5386B84206p5381E7622O4716b5685A47561O6471a0219m55443A84246f338
18010a32874A41569b2928B2364a74391K5405p5946a8228j40962j27881R4578o9874
17999b62367R5733e9347B01617I98a08480k69208A25949J29338e8618m4200J1053
$$ plain form
17988 -91765 249180 90639 195673 215838 -15246 268166 52442 -28207 24340 -53774 -330886
17977 -330886 175122 -133203 -356867 -5197 60221 -294481 214712 292219 131064 110610
17967 110610 -516529 -271715 -136229 107758 -80738 368584 -236685 -135840 -98693 -28845
17956 -12514 -48080 -169795 -95450 -118128 -333899 207547 103854 -237704 96641 -145791
17945 -210707 -353020 104928 70655 53255 276186 60993 -309110 -437796 373620 -207450
17934 -75281 173207 -175104 -406466 -71082 649 77742 6870 28006 72487 23483 205695
17923 205695 -210721 -8539 62180 158133 -16266 -37663 125648 120613 255098 -219530 -66331
17911 -95818 43654 251354 -404963 233567 -134529 417926 -76279 5055 -71339 259769 -160651
$$ packed form
17988i1765B49180I0639J05034K0165a5246B68166E2442b8207B4340e3774k77112
17977c30886A75122a33203k23664e197F0221b94481B14712P7507A31064k0454
17967A10610e16529K44814J35486A07758h0738C68584b36685J00845L7147b8845
17956a2514l5566j21715P4345k2678k15771B07547j03693b37704I6641a45791
17945b10707j42313A04928l4273j7400K22931F0993c09110j28686C73620b07450
17934g5281A73207a75104k31362g1082F49P7093F870K1136M4481B3483J82212
17923B05695b10721h539F2180R5953a6266k1397A25648n035J34485b19530f6331
17911i5818D3654K07700d04963B33567a34529D17926g6279E055g1339B59769a60651
$$ plain form
17899 -281920 -14911 -255863 -217020 69378 139680 -109257 198853 -498020 -128021 4277 -29921
17887 -119337 -14224 -67056 79616 -94696 276359 -38823 -271030 -109981 111967 244802
17877 244802 107101 -219622 -160410 -154887 -73851 248063 -373770 367975 -126016 -105874
17867 -105874 144214 3746 365950 -175677 -76890 -138352 292009 -207915 132506 112415
17857 112415 -20592 -199679 257887 379798 97344 8395 199895 -173390 259105 35853
17846 288194 13581 312272 -233507 -38764 68692 262517 -197414 -50483 117018 16680
17835 -212392 60146 -417104 94828 -42585 164067 141672 223038 155399 -127862 275908 237769
17824 237769 80659 359640 92771 -215469 -35 3342 166276 -50133 -21108 10412 -157456
$$ packed form
17899b81920a4911k40952L8843F9378P0302a09257A98853d98020a28021D277b9921
17887a19337a4224n2832G9616i4696B76359c8823k32207a09981A11967J32835
17877B44802A07101b19622N9212N523g3851B48063c73770C67975a26016K0142
17867a05874A44214C746L62204a75677g6890o1462B92009b07915A32506k0091
17857A12415b0592j79087B57887J21911I7344H395J91500a73390B59105C5853
17846B88194A3581K98691b33507c8764F8692J93825a97414e0483A17018A6680
17835b12392F0146d17104I4828d2585A64067k2395Q1366o7639a27862B75908l8139
17824B37769H0659K78981I2771b15469c5C342J62934e0133b1108A0412a57456
$$ plain form
17812 394343 8747 -252992 -33619 -63072 2526 42939 112891 29425 100441 193435 -167429
17800 134639 -236005 184209 -158019 -279404 -162858 -251986 94782 -130849 275603 -37929
17789 -148124 -176155 -75424 34669 212601 188942 100532 163565 4485 51309 159781 160622 237487
17777 237487 173909 -250804 29032 355776 -75505 195336 460599 94123 -188467 139897
17766 30715 149972 -166073 272640 159298 90500 291160 -139912 -48703 138268 -105644
17755 162618 -235434 -201830 -273344 -3819 123152 148890 143090 428928 166636 -137232 330633
17743 174794 -193591 62606 83034 -55238 77572 165900 -71060 -20714 -239159 -121971 -74670
17732 -74670 135870 294066 270529 205870 432331 126669 -122136 -60330 136954 42344
$$ packed form
17812C94343H747b52992c3619k9453B526M0413O9952B9425P1016R2994a67429
17800A34639b36005A84209a58019j21385J16546q9128I4782a30849B75603c7929
17789a48124k8031g5424C4669J77932k3659q8410O3033D485M6824J08472Q41P6865
17777B37487o3578b50804B9032L26744g5505A95336K65263I4123a88467A39897
17766C0715J19257a66073B72640j13342o8798K00660a39912d8703A38268a05644
17755A62618b35434L3604p1514c819A23152K5738n800K85838A66636a37232C30633
17743A74794a93591F2606K0428e5238G7572Q8328g1060b0714k18445J17188M7301
17732g4670A35870J58196k3537o4659K26461A26669a22136f0330A36954D2344
$$ plain form
17721 -50887 229922 -43690 12335 160798 292922 -219454 142397 -287157 144585 -263615
17710 -151167 -48316 70845 -58889 -229566 209986 -13310 164888 -104632 128558 11376
17699 220755 79116 51090 -48546 621582 -71980 73359 324474 402889 -28441 173319 239831
17688 239831 180875 -59706 157282 57091 160740 145168 300888 35255 37089 11684 37482
17677 37482 -176548 222565 -100933 -211492 -20586 38089 33222 72255 154438 -122591 136
17665 -167115 159786 332692 282754 60925 130234 -54402 84541 158147 376073 299162 43951
17653 -46477 54961 4969 232078 50846 100202 -34614 361398 379644 165712 314238 224162
17642 224162 120025 13151 58660 219320 97123 -5450 185163 226133 256528 354471 198403
$$ packed form
17721e0887B29922d3690A2335J48463J32124b19454A42397b87157A44585b63615
17710a51167d8316G0845e8889j70677B09986a3310A64888a04632A28558A1376
17699B20755G9116k8026d8546F21582g1980G3359K51115P8415b8441A73319O6512
17688B39831n8956e9706A57282E7091J03649j5572J55720C5255J834A1684K5798
17677C7482a76548B22565a00933j10559b0586C8089m867L9033Q2183a22591A36
17665a67115A59786J72906m9938F0925O9309e4402H4541P3606K17926p6911D3951
17653d6477E4961D969K27109E0846M9356c4614C61398J8246A65712J48526r0076
17642B24162j04137A3151M5509J60660I7123e450A85163M0970L0395R7943j56068
$$ plain form
17631 198403 -560521 6626 153326 88418 147144 158234 38199 152271 -25617 37363 120185
17620 120185 -328740 294924 -39633 -49711 418054 179040 1726 115171 187723 505314
17610 505314 115753 33987 244576 45569 43285 85611 105118 -7260 277485 48454 183682
17599 183682 -123709 -92279 93630 -163623 -50155 315110 217776 237587 9428 -37456 201283
17587 152348 233713 -181161 -112679 385418 -294238 156021 81458 120546 458848 -219259
17576 -296129 216322 -140305 4980 99155 -139833 407610 230185 125259 368596 373274
17566 373274 25922 -109144 127733 226486 109027 88988 -34582 75101 30851 2491 417833
17555 417833 276295 110240 557126 7421 480447 138547 107819 116062 120334 67964 19636
$$ packed form
17631A98403e60521F626J46700o4908N8726J1090C8199J14072b5617C7363Q2822
17620A20185c28740B94924c9633j0078D18054A79040A726J13445P2552L17591
17610E05314A15753C3987K10589D5569k284M2326J9507g260B77485D8454J35228
17599A83682a23709L1430I3630a63623e0155C15110r7334J9811I428c7456B01283
17587A52348Q1365a81161O8482C85418b94238A56021p4563L9088L38302b19259
17576b96129B16322a40305D980R4175a39833D07610j77425j04926K43337M678
17566C73274B5922a09144A27733R8753A09027k0039c4582G5101C0851B491M15342
17555D17833j41538A10240M46886G421M73026A38547l0728Q243M272n2370A9636
$$ plain form
17543 63487 195954 269897 221059 160624 -112901 -27893 18316 -37225 157742 48634 343873
17532 343873 465370 291811 -77135 66262 252263 416825 23923 219198 387866 343430
17522 343430 230173 188142 156181 380489 147428 277319 400764 351795 657043 349477
17512 349477 724714 438048 1025321 953077 714709 587872 470582 303621 405971 484808
17502 484808 424277 385876 447242 335112 219846 581953 532143 666722 689366 890302
17492 890302 607909 441058 466356 590887 15890 709836 293233 194258 62182 435277
17482 435277 244994 -94065 252396 98967 361932 382068 186118 400022 286668 -1280
17471 98039 318081 54655 363342 16795 259918 197695 116147 198735 287316 246603 -25555
$$ packed form
17543F3487J32467P3943m8838o0435a12901b7893A8316c7225A57742D8634K95239
17532C43873J21497j73559g7135F6262J86001J64562B3923J95275J68668m4436
17522C43430j13257m2031l1961K24308A47428J29891J23445m8969L05248l07566
17512C49477L75237k86666N87273p2244k38368j26837j17290j66961J02350P8837
17502D84808o0531l8401O1366j12130j15266L62107m9810J34579K2644K00936
17492H90302k82393j66851K5298J24531A5890O93946B93233r8975F2182L73095
17482D35277j90283i4065B52396I8967K62965K0136A86118K13904j13354a280
17471I8039K20042E4655L08687A6795K43123o2223q1548Q2588Q8581m0713b5555
$$ plain form
17459 285602 312585 291659 333127 169681 254841 463921 157974 113851 -38241 282822 301085
17448 301085 505895 445711 239919 507090 43648 318719 -95586 248687 227574 255540
17438 255540 490469 269511 653194 303713 272335 279771 274437 804789 401310 168350
17427 401615 300228 42628 379475 219462 410577 478916 203061 383735 301331 119858
17416 552449 365771 396670 221155 469336 169631 244632 231558 710697 164565 280379
17406 280379 424836 355697 178622 209197 329430 234614 275164 273578 102053 80959 147094
17395 147094 261518 561804 233781 30874 186225 4490 113754 334970 300919 314593
17385 314593 433415 133199 302565 206452 -117622 196327 91391 221659 266680 258147
$$ packed form
17459B85602K6983k0926M1468j63446Q5160K09080A57974m4123c8241B82822J8263
17448C01085K04810o0184k05792K67171D3648K75071i5586B48687k1113K7966
17438B55540K34929k20958L83683C03713l1378P436n334N30352D01310A68350
17427D01615j01387D2628L36847j60013J91115O8339B03061J80674q2404A19858
17416E52449j86678L0899j75515K48181A69631P5001j3074M79139A64565J15814
17406B80379J44457o9139j77075L0575J20233r4816M0550j586A02053k1094O6135
17395A47094J14424L00286B33781C0874J55351D490J09264K21216l4051J3674
17385C14593J18822A33199J69366r6113a17622A96327I1391J30268M5021q533
$$ plain form
17375 258147 318116 430648 84355 243606 181051 252166 246405 224417 201603 292967 243468
17364 243468 310796 -39777 204393 262065 370034 114463 429255 352230 237239 377925
17354 377925 -113760 183747 295275 604817 272220 287984 181655 320843 255545 168184
17344 168184 36815 150883 339578 580524 -63667 112844 137833 237790 287352 11585 60894
17333 60894 219962 158231 101741 102022 -12463 313267 222092 29845 57109 514455 312186
17322 312186 538894 261585 447884 277533 215897 -250317 650188 424966 98742 245453
17312 245453 330878 533658 678435 238805 254037 304533 30865 -38226 275701 203430 262765
17301 262765 524744 438033 -23354 439422 280545 199423 522968 223044 642655 267698
$$ packed form
17375B58147N9969J12532H4355J59251o2555P1115n761k1988k2814R1364m9499
17364B43468O7328c9777B04393N7672J07969A14463L14792p7025j14991J40686
17354C77925a13760A83747J11528L09542B72220J5764j06329J39188o5298q7361
17344A68184C6815J14068J88695K40946f3667A12844K4989R9957M9562A1585M9309
17333F0894J59068o1731n6490K81a2463C13267r1175B9845K7264M57346k02269
17322C12186K26708B61585J86299j70351o1636b50317F50188k25222I8742J46711
17312B45453Q5425K02780J44777B38805J5232N0496C0865c8226B75701p2271N9335
17301B62765K61979q6711b3354D39422j58877q1122L23545B23044M19611B67698
$$ plain form
17290 380113 59897 203012 344737 436239 258912 308202 313642 272872 385021 399462 326380
17279 326380 415951 90617 228369 482355 530262 483386 -26197 187436 294034 823643
17269 823643 657467 297825 211619 292501 179468 -56192 175254 288134 342339 431187
17259 431187 144055 216202 412739 178249 194011 332608 278680 180040 342647 253636
17249 253636 205884 222985 304022 210445 244675 381905 278849 181957 217565 388569 365572
17238 365572 424154 143934 515871 510170 250421 147566 201279 211441 341506 222044
17228 222044 468577 394829 129280 420131 611391 229297 128095 224467 313683 65047
17217 504687 229981 388601 426650 520224 384980 187691 435647 284331 216732 317348
$$ packed form
17290C80113E9897J43115J41725R1502j77327M9290N440m0770J12149J4441p3082
17279C26380Q9571I0617J37752K53986M7907m6876b6197A87436J06598N29609
17269H23643j66176B97825q6206Q0882j13033e6192A75254J12880N4205Q8848
17259D31187A44055P2147J96537A78249J5762J38597n3928r8640J62607q9011
17249B53636m7752J7101Q1037r3577L4230J37230j03056r6892L5608J71004k2997
17238C65572N8582A43934L71937n701B50421j02855N3713J0162J30065j19462
17228B22044K46533p3748A29280K90851J91260B29297j01202R6372Q9216F5047
17217E04687B29981J58620L8049R3574j35244A87691K47956j51316o7599J00616
$$ plain form
17207 317348 766662 104222 -3998 524279 376943 583377 190325 405976 212640 642942
17197 642942 299196 250947 392121 409953 232598 550253 645378 749977 216747 297566
17187 297566 348644 202238 290660 749195 442264 473840 226205 281559 299103 330210 335478
17176 335478 701985 161175 574234 445412 361403 476687 357729 273406 306802 235472
17166 235472 199602 420852 357657 271011 341164 88732 423347 590844 326307 475296
17156 475296 428573 371677 784680 374092 658680 736151 472217 647378 643828 441138
17146 441138 387137 286404 566168 715233 317529 456413 514923 543748 129285 604668
17136 604668 691796 685900 664928 582119 456417 499122 276806 639412 490239 638103 351795
$$ packed form
17207C17348M49314A04222c998E24279j47336K06434A90325K15651j93336M30302
17197F42942B99196m8249J41174J7832j77355L17655R5125J04599B16747Q0819
17187B97566N1078j46406Q8422M58535l06931L1576B26205N5354J7544L1107N268
17176C35478L66507A61175M13059j28822q4009J15284j18958q4323L3396p1330
17166B35472l5870K21250o3195q6646P0153H8732L34615J67497k64537J48989
17156D75296m6723n6896M13003C74092K84588P7471k63934J75161l550k02690
17146D41138n4001j00733K79764J49065C17529J38884N8510K8825A29285M75383
17136F04668Q7128n896k0972q2809j25702M2705k22316L62606j49173J47864k86308
$$ plain form
17125 351795 554057 258114 507158 988108 605377 437316 659766 21044 139473 619635
17115 619635 481594 790038 569270 570159 618580 345334 465144 510365 318496 673090
17105 673090 733034 852003 908245 394025 619286 715074 332112 577024 609709 592137
17095 592137 348586 890782 199662 490144 784217 647259 844549 571010 925590 872261
17085 872261 615625 687845 448949 677713 535092 794208 561060 1041021 473163 849537
17075 849537 699703 513319 495154 644860 707169 474904 635316 1017958 597896 663602
17065 663602 610650 604718 459844 796784 647390 970625 836421 711201 809190 646754
17055 646754 609108 686812 716724 718567 459248 525438 772151 948920 656717 623623 623288
$$ packed form
17125C51795K02262B58114K49044M80950l82731j68061K22450B1044J18429M80162
17115F19635j38041L08444k20768Q89M8421k73246J19810M5221j91869L54594
17105F73090N9944J18969N6242C94025K25261R5788C32112K44912L2685j7572
17095E92137k43551N42196A99662K90482K94073j36958J97290k73539L54580n3329
17085H72261k56636P2220k38896K28764j42621K59116k33148M79961D73163L76374
17075H49537j49834j86384j8165J49706O2309k32265J60412L82642m20062O5706
17065F63602n2952n932j44874L36940j49394L23235j34204j25220R7989j62436
17055F46754l7646P7704K9912J843k59319O6190K46713J76769k92203l3094l35
$$ plain form
17044 623288 625179 838961 612687 1178731 1018435 607027 840529 1160157 645868 1000701
17034 1000701 778416 846082 941066 1336089 1048691 897495 1115663 1193903 742019 788247
17024 788247 1178227 943384 919169 966309 728529 1046241 830236 1049485 1257246 1034373
17014 1034373 868494 1069053 1017608 986548 1050584 1219406 836771 1191054 770060 960724
17004 960724 1055274 988147 988651 1052098 1112732 1030387 837794 807907 837152 942330 1285554
16993 1285554 975149 1008575 1234160 1074872 1288596 1164661 1159740 969427 989878 1131151
16983 1131151 1152420 993246 1233471 1150133 1466319 1163335 1299608 1024592 1418838 1180631
16973 1180631 1249296 1361557 1211762 1439349 1159627 1375324 1438540 1460859 753549 1510642
$$ packed form
17044F23288J891K13782k26274N66044j60296m11408K33502L19628n14289L54833
17034A000701k22285O7666R4984L95023k87398j51196K18168P8240m51884M6228
17024G88247L89980k34843k4215M7140k37780L17712k16005K19249K07761k22873
17014A034373j65879K00559n1445l1060O4036J68822l82635L54283m20994J90664
17004I60724R4550o7127N04O3447O0634q2345j92593k9887K9245J05178L43224
16993A285554l10405L3426K25585j59288K13724j23935m921j90313K0451J41273
16983A131151K1269j59174K40225q3338L16186l02984J36273k75016L94246k38207
16973A180631O8665J12261j49795K27587k79722K15697O3216K2319p07310P57093
$$ plain form
16963 1510642 1420177 1535024 1749620 1624060 1407023 1439341 1280124 1311319 1413534 1332136
16953 1332136 1467039 1186106 1675795 1779169 1634484 1354604 1938305 1897458 1621139 1402145
16943 1402145 1722367 1788534 1919573 1383956 1864623 1492170 1381992 1545164 1927582 2040459
16933 2040459 1785808 1544335 2216865 1963725 1969986 1687920 1666626 1698535 1792676 1902131
16923 1902131 1857473 1621082 1977760 2075666 1886069 1955118 1781719 2319399 1945069 2177312
16913 2177312 2023942 2252764 2508414 2161687 2304954 2320105 2287507 2512904 2168371 2038470
16903 2038470 2271287 2210649 2313455 2700405 2415942 2318522 2357472 2461627 2679904 2571775
16893 2571775 2589806 2499343 2520662 2716040 2946075 2656241 2654927 2543211 2688882 2934029
$$ packed form
16963A510642r0465J14847K14596j25560k17037L2318j59217L1195J02215q1398
16953A332136J34903k80933M89689J03374j44685k79880N83701m0847k76319k18994
16943A402145L20222O6167J31039n35617M80667l72453j10178J63172L82418J12877
16933B040459k54651k41473O72530k53140O261k82066k1294L1909R4141J09455
16923A902131m4658k36391L56678R7906j89597O9049j73399N37680l74330K32243
16913B177312j53370K28822K55650l46727J43267J5151l2598K25397l44533j29901
16903B038470K32817o0638J02806L86950k84463r7420L8950J04155K18277j08129
16893B571775J8031r0463K1319J95378K30035k89834j314j11716J45671K45147
$$ plain form
16883 2934029 2670553 2914756 2895382 2938795 2820723 3119811 3000010 3143247 3204322 3107862
16873 3107862 3218538 3582836 3240230 3196788 3474628 3413236 3290176 3437850 3561075 3246756
16863 3246756 3472404 3541112 3869978 3524871 3861961 3389179 4108963 3953459 4060483 3570929
16853 3570929 4012365 3707804 4054856 4504682 4238996 4453457 4334879 4621349 4694876 4335895
16843 4335895 4752755 4872807 4685084 4962845 5171323 5193089 5073367 5333055 5443601 5530991
16833 5530991 5264092 5465581 5390405 5549310 5809064 5667451 5985965 5637394 5832036 6052562
16823 6052562 6496737 6638614 6511884 6658188 6616844 6911128 6720965 7089211 7049099 7280681
16813 7280681 7240253 7569919 7764632 7584895 7892063 8115271 8508265 8414614 8765944 8643651
$$ packed form
16883B934029k63476K44203j9374M3413j18072K99088j19801J43237O1075r6460
16873C107862J10676L64298l42606m3442K77840o1392j23060J47674J23225l14319
16863C246756K25648O8708L28866l45107L37090m72782P19784j55504J07024m89554
16853C570929M41436l04561L47052M49826k65686K14461j18578K86470P3527l58981
16843D335895M16860J20052j87723K77761K08478K1766j19722K59688J10546Q7390
16833E530991k66899K01489p5176J58905K59754j41613L18514l48571J94642K20526
16823F052562M44175J41877j26730J46304m1344K94284j90163L68246m0112K31582
16813G280681m0428L29666J94713j79737L07168K23208L92994r3651L51330j22293
$$ plain form
16803 8643651 8720702 9290839 9166273 9507536 10079594 9762835 10065221 9982838 10335086 10624606
16793 10624606 10997914 11144948 11548398 11894719 12220756 12269889 12363609 13027601 13503349 13357856
16783 13357856 13839478 13987627 14550830 14781891 15240830 15611598 16171372 16679339 16939902
16774 16939902 17402185 17846565 18285672 18938613 19153448 20170030 20281568 21041393 21431984
16765 21431984 22481487 22721607 23363581 24398081 24776022 25552776 26592064 27593555 28259395
16756 28259395 29401997 30399606 31216937 32548971 33334532 34424981 35990163 36850031 38409074
16747 38409074 39366695 41021693 42922688 44280292 45928873 47844494 49444008 51388283
16739 51388283 53862468 55492674 57397712 59875831 62331361 64672392 67350765 70324453
$$ packed form
16803H643651P7051N70137j24566L41263N72058l16759L02386q2383L52248K89520
16793A0624606L73308J47034M03450L46321L26037M9133R3720O63992M75748j45493
16783A3357856M81622J48149N63203K31061M58939L70768N59774N07967K60563
16774A6939902M62283M44380M39107O52941K14835J016582J11538P59825L90591
16765B1431984J049503K40120O41974J034500L77941P76754J039288J001491O65840
16756B8259395J142602R97609Q17331J332034P85561J090449J565182Q59868J559043
16747C8409074R57621J654998J900995J357604J648581J915621J599514J944275
16739E1388283K474185J630206J905038K478119K455530K341031K678373K973688
$$ plain form
16731 70324453 72791524 75863009 78763229 81779107 84882465 88328724 91707442 94877298
16723 94877298 98066071 101591465 104860778 108607935 111731328 114900615 118356682 121313367
16715 121313367 124094113 126537265 129183198 130871973 132520660 133761236 134832435 135531737
16707 135531737 135613140 135472800 134994174 133984280 132084904 130497129 128675282 126342783
16699 126342783 123823717 120755774 117506135 114507290 111485910 108077004 104384929 100876257
16691 100876257 97531643 94000080 90382755 87052255 83842538 80885706 77579850 74355425
16683 74355425 71558270 69116567 66141649 63561427 60905194 58596939 56459461 53670996
16675 53670996 51972064 49867199 48157025 46106345 44726295 42546441 41129893 39236866
$$ packed form
16731G0324453K467071L071485K900220L015878L103358L446259L378718L169856
16723I4877298L188773L525394L269313L747157L123393L169287L456067K956685
16715A21313367K780746K443152K645933J688775J648687J240576J071199O99302
16707A35531737Q1403j40340m78626j009894j899376j587775j821847k332499
16699A26342783k519066l067943l249639k998845l021380l408906l692075l508672
16691A00876257l344614l531563l617325l330500l209717k956832l305856l224425
16683G4355425k797155k441703k974918k580222k656233k308255k137478k788465
16675E3670996j698932k104865j710174k050680j380050k179854j416548j893027
$$ plain form
16667 39236866 37968013 36839670 34997648 34361200 33092096 31884912 30899720 30056480
16659 30056480 28915552 27923978 27000022 26024051 25319240 24581883 23837716 23025201 21858497
16650 21858497 21371623 21073567 20386811 19533716 18982254 18662549 18433906 17592553 17128396
16641 17128396 16648732 16228398 16109211 15419171 15191947 14774405 13868298 13867578 13580082 13425970
16631 13425970 12807805 12672261 12511265 11893754 11436848 11684656 11118131 10991445 10762678
16622 10762678 10500772 10302088 9980761 9757784 9298442 9068686 9192695 9286711 9072708
16613 9072708 8560347 8311284 8192480 7792641 8217574 7604659 7712176 7361533 6988183
16604 6988183 7508420 6954810 7174683 6887888 6642076 6588241 6692141 6680084 6291533 6232442
$$ packed form
16667C9236866j268853j128343j842022o36448j269104j207184r85192q43240
16659C0056480j140928r91574r23956r75971p04811p37357p44167q12515j166704
16650B1858497m86874k98056o86756q53095n51462l19705k28643q41353m64157
16641A7128396m79664m20334j19187o90040k27224m17542r06107p20k87496j54112
16631A3425970o18165j35544j60996o17511m56906K47808n66525j26686k28767
16622A0762678k61906j98684l21327k22977m59342k29756J24009R4016k14003
16613I072708n12361k49063j18804l99839M24933o12915J07517l50643l73350
16604F988183N20237n53610K19873k86795k45812n3835J03900j2057l88551n9091
$$ plain form
16594 6232442 6440114 6046956 6026927 5576867 5731237 5653835 5547931 5366013 5364121 4924276
16584 4924276 5000069 5153621 4987986 4743421 4873221 4468012 4617408 4267249 4337268 4534720
16574 4534720 3991818 3907119 4159706 4253518 4330737 4255556 3935984 4116269 3996720 3881830
16564 3881830 3623709 3764831 3839829 3792746 3647702 3803570 3403344 3273150 3488738 3503559
16554 3503559 2855693 3229343 3099073 3123310 3106456 3094941 2911676 2917661 3031493 2885518
16544 2885518 2868270 3218565 2998695 2710629 2578086 2498363 2943829 2908705 2673979 2598550
16534 2598550 2448221 2644652 2517425 2354759 2397535 2319865 2572334 2533266 2070005 2369320
16524 2369320 2253316 2420843 2039921 2514702 2261562 2086288 1977381 2069114 2169518 2085637
$$ packed form
16594F232442K07672l93158k0029m50060J54370p7402j05904j81918j892m39845
16584D924276P5793J53552j65635k44565J29800m05209J49396l50159P0019J97452
16574D534720n42902q4699K52587R3812P7219p5181l19572J80285j19549j14890
16564C881830k58121J41122P4998m7083j45044J55868m00226j30194K15588J4821
16554C503559o47866L73650j30270K4237j6854j1515j83265N985J13832j45975
16544B885518j7248L50295k19870k88066j32543p9723M45466l5124k34726p5429
16534B598550j50329J96431j27227j62666M2776p7670K52469l9068m63261K99315
16524B369320j16004J67527l80922M74781k53140j75274j08907R1733J00404q3881
$$ plain form
16514 2085637 2041692 2397574 2035551 2240909 2335621 2110522 1678944 2163046 1722654 1911912
16504 1911912 1925808 2080092 1814032 1943070 2047078 1977072 1706932 1773402 1736111 2026215
16494 2026215 1380192 1741786 1654653 1558174 2028302 1470492 1760607 1702495 1777793 1701305
16484 1701305 1583613 1482312 1489488 1518669 1417384 1589928 1365505 1316957 1467440 1409410
16474 1409410 1433573 1330190 1701769 1535787 1289238 1272407 1558189 1431986 1422729 1367707
16464 1367707 1435277 1110658 1481889 1270173 1466797 1355515 1234739 1169169 1396296 1260358
16454 1260358 1195076 1137950 1371982 1132925 1129436 1143717 1065645 1071589 1226396 1055636 1377400
16443 1377400 1109274 1207343 898375 841335 1094407 1162164 923157 1269472 838775 1100368
$$ packed form
16514B085637m3945L55882l62023K05358R4712k25099m31578M84102m40392J89258
16504A911912J3896J54284k66060J29038J04008p0006k70140O6470l7291K90104
16494B026215o46023L61594q7133r6479M70128n57810K90115n8112P5298p6488
16484A701305j17692j01301P176K9181j01285J72544k24423m8548J50483n8030
16474A409410K4163j03383L71579j65982k46549j6831K85782j26203r257n5022
16464A367707O7570l24619L71231k11716J96624j11282j20776o5570K27127j35938
16454A260358o5282n7126K34032k39057l489J4281p8072N944J54807j70760L21764
16443A377400k68126R8069l08968n7040K53072O7757k39007L46315m30697K61593
$$ plain form
16433 1100368 1092343 1018356 959746 1228472 851038 849864 971101 1089901 955916 894612 1079550
16422 1079550 974449 963770 1023126 807207 692969 845824 735347 1226754 626017 775375
16412 775375 896278 898881 1028767 978203 852215 1044706 913001 877957 838204 589903
16402 589903 1108029 777880 718339 651780 788603 1104036 978790 506564 719193 842640
16392 842640 943040 625056 525944 711257 704214 870808 1069883 869074 1022589 824387
16382 824387 679861 654014 509912 685064 573396 678015 322928 556529 629864 804288
16372 804288 1039957 715551 594880 541243 788137 750393 836676 664566 661299 514915
16362 514915 649535 426212 454703 594350 479784 632463 837069 820245 547434 408767
$$ packed form
16433A100368q025p3987n8610K68726l77434j174J21237J18800j33985o1304J84938
16422A079550j05101j0679N9356k15919j14238J52855j10477M91407o00737J49358
16412G75375J20903K603J29886n0564j25988J92491j31705l5044l9753k48301
16402E89903N18126l30149n9541o6559J36823L15433j25246m72226K12629J23447
16392H42640J00400l17984r9112J85313p043J66594J99075k00809J53515j98202
16382H24387j44526k5847j44102J75152j11668J04619C22928K33601P3335J74424
16372H04288K35669l24406j20671n3637K46894l7744Q6283j72110l267j46384
16362E14915J34620k23323K8491J39647j14566J52679K04606j6824k72811j38667
$$ plain form
16352 408767 820668 794379 661224 680610 389542 614576 395098 321811 772912 648903
16342 648903 630290 784893 870393 164655 562992 326152 504816 232058 591476 338180
16332 338180 433065 916876 396817 528153 559851 487196 595136 533701 454176 865481
16322 865481 383132 219460 315450 378782 763641 612804 530297 578740 355476 550656
16312 550656 466598 434913 139869 592700 221296 350073 233966 565963 389537 588191
16302 588191 299667 831170 344787 646281 329562 580880 191860 394825 227309 738061
16292 738061 440117 600602 473342 173212 155854 255086 549734 668808 404615 856953
16282 856953 428484 470528 586805 221666 372905 487487 247767 556888 495838 268102
$$ packed form
16352D08767M11901k6289j33155J9386k91068K25034k19478p3287M51101j24009
16342F48903j8613J54603Q5500A64655L98337k36840J78664B32058L59418k53296
16332C38180R4885M83811C96817J31336L1698p2655J07940o1435p9525M11305
16322H65481C83132j63672R5990O3332L84859j50837q2507M8443k23264J95180
16312E50656q4058l1685A39869M52831B21296J28777j16107L31997j76426J98654
16302E88191k88524N31503C44787L01494l16719K51318A91860K02965j67516N10752
16292G38061k97944J60485j27260A73212j7358R9232K94648J19074k64193M52338
16282H56953m28469M2044J16277B21666J51239J14582k39720L09121o1050k27736
$$ plain form
16272 268102 102756 387272 104248 518697 578540 197932 709000 470722 139165 74495
16262 74495 424447 303987 410662 350361 461736 260013 356039 -75854 62678 473062
16252 473062 392030 283366 642339 332852 237342 144626 215093 781255 388374 379234 180014
16240 124393 344382 372138 423502 738985 160963 126629 275460 351924 91658 267195
16230 267195 365653 340771 226915 -3356 448524 95610 402788 386681 193642 290065 642713
16219 642713 293898 140713 797296 210723 201261 265961 25347 95987 73021 469348 318710
16208 318710 138179 112623 -207691 65571 465775 256999 405109 371942 250226 338023
16198 338023 30420 300911 360984 423924 336041 319204 34487 150020 84389 248634 234343
$$ packed form
16272B68102A02756K84516A04248M14449N9843A97932N11068k38278A39165o4670
16262G4495L49952j20460J06675o0301J11375k01723R6026g5854F2678M10384
16252D73062q1032j08664L58973l09487r5510r2716P0467N66162C88374r140A80014
16240A24393K19989K7756N1364L15483A60963l4334J48831P6464I1658J75537
16230B67195R8458k4882j13856c356D48524I5610L07178j6107j93039R6423L52648
16219F42713B93898A40713O56583B10723r462O4700B5347P0640k2966L96327j50638
16208C18710A38179k5556b07691F5571M00204k08776J48110l3167j21716Q7797
16198C38023C0420K70491O0073O2940q7883j6837C4487J15533o5631J64245j4291
$$ plain form
16187 234343 253704 317698 146617 95092 168336 166814 233977 55873 19937 333995 408425
16176 408425 39854 51096 201204 206728 267204 317337 395996 201597 39170 256035 241942
16165 241942 179377 308521 121316 77937 393556 -149121 142086 25954 147490 408499
16155 408499 9491 308926 169763 225199 366237 5442 2553 -114042 231761 278283 128441
16143 -88822 137247 367735 587793 75713 500587 132268 115442 359568 147937 -115676
16132 263068 223038 235831 286751 195543 208005 64367 352007 267481 331663 277970 26972
16120 293711 244207 118096 -76296 182148 24764 13317 183159 203488 298086 -46155 114659
16108 -3375 64601 101614 2509 213550 -6513 167004 278319 4113 109196 417252 -17353
$$ packed form
16187B34343J9361O3994A46617n1525P3244j522O7163E5873A9937L14058P4430
16176D08425C9854J1242J50108N524O0476N0133P8659j94399C9170K16865j4093
16165B41942o2565J29144A21316m3379L15619a49121A42086B5954J21536K61009
16155D08499I491K99435j39163N5436J41038E442B553a14042B31761M6522A28441
16143h8822A37247K30488K20058G5713M24874A32268j6826K44126A47937a15676
16132B63068m0030J2793N0920r1208J2462F4367K87640q4526O4182n3693B6972
16120B93711m9504A18096g6296A82148B4764j1447J69842K0329R4598d6155A14659
16108c375F4601L7013B509K11041f513A67004J11315D113J05083L08056a7353
$$ plain form
16096 -186369 -71665 239058 381061 101999 -61263 62135 -64088 166831 233198 295324 -93357
16084 -19364 123941 52321 -27726 -50353 149773 276536 315042 -145905 178175 246750 -197281
16072 398709 178767 11789 -80632 11554 9689 18959 204101 165777 238740 165126 -115203
16060 46388 239841 -463375 112857 134229 312004 -344926 128547 132726 142138 7564 -222520
16048 71649 49868 -136373 -65913 67804 13678 77345 44317 86374 141101 -55712 84950
16036 -26364 571269 272173 -68279 -217554 100033 -161967 -133479 162480 40130 41055 -134555
16024 12521 -143143 -267352 -125157 69578 -5326 -381656 -54894 282788 -266319 -66042 357971
16012 173133 337627 66837 -110651 41186 -162409 301101 112505 -66510 85941 159422
$$ packed form
16096a86369g1665B39058J42003A01999f1263F2135f4088A66831O6367O2126i3357
16084a9364A23941E2321b7726k2627A49773J26763L8506a45905A78175O8575a97281
16072C98709A78767A1789h0632A1554j865R270J85142l8324P2963p3614a15203
16060D6388J93453d63375A12857K1372J77775c44926A28547M179R412G564b22520
16048G1649k1781a36373f5913F7804A3678O3667l3028M2057N4727e5712H4950
16036b6364E71269B72173f8279j49275A00033a61967K8488A62480D0130R25a34555
16024A2521a43143j24209a25157F9578e326l76330e4894B82788b66319f6042C57971
16012A73133J64494F6837a10651D1186a62409C01101A12505f6510H5941P3481
$$ plain form
16002 159422 126229 -340594 -187315 120237 -101151 200660 -181263 312631 339548 78897
15991 -138359 -253998 -61728 274110 -6979 271878 -73541 161088 111818 183569 325107 149589
15979 278636 -23721 257860 197688 122754 129905 262492 438483 366855 739187 980766 1164288
15968 1164288 1330287 901007 708347 471806 114154 216578 269556 -31758 102377 18028
15957 54964 204715 292600 -17883 49184 262608 -26845 -95299 -136090 -150328 87183 -155030
15945 268092 41846 -170580 -218858 -121707 134861 -2204 149671 -226542 18651 -8824 27385
15933 -77349 169444 -250265 96218 -148734 -14104 -147519 -87635 149192 -42471 31754 -40649
15921 68294 -6327 309504 37271 214172 -119765 181299 -166821 -254800 26973 -34302 -201113
$$ packed form
16002A59422l3193c40594J53279A20237a01151B00660a81263C12631K6917G8897
15991a38359j15639f1728B74110f979B71878g3541A61088m9270P1751J41538A49589
15979B78636b3721B57860o0172p4934P151J32587J75991p1628L72332K41579J83522
15968A164288J65999m29280j92660k36541A14154J02424N2978c1758A02377A8028
15957E4964J49751Q7885a7883D9184K13424b6845o8454m0791j4238H7183a55030
15945B68092D1846a70580m8278R7151A34861b204A49671b26542A8651h824B7385
15933g7349A69444b50265I6218a48734a4104j33415N9884A49192d2471C1754d0649
15921F8294f327C09504C7271J76901a19765A81299a66821q7979B6973c4302j66811
$$ plain form
15910 -201113 -248470 -60435 -7063 -143806 134355 117407 -333002 127026 363 107705 116582
15899 116582 -63170 -140553 -205169 391035 156799 230428 -266137 -49963 82970 72008 -87130
15887 221047 707 -76020 230732 97465 -30168 74966 -176639 -54267 -181171 -16027 -91184
15876 -91184 62497 -128072 -118934 242521 -361130 -81451 -93850 50127 -56507 230882 -372493
15864 -217833 -65441 -174097 -121274 -94225 100204 77398 -120695 -134492 140365 -151943
15853 -166081 98461 198502 -28964 -178278 42922 55373 -92145 -177589 -47835 -153144 -57576
15841 -238262 45080 173724 50393 -114905 41460 -321509 198099 115633 -280231 154388
15830 156679 -310423 255144 32478 -144401 137301 -325310 -127619 39329 2064 -71736
$$ packed form
15910b01113m7357f0435g063j36743A34355j6948c33002A27026C63J07342Q877
15899A16582f3170p7383o4616C91035A56799P3629b66137d9963H2970j0962h7130
15887B21047G07g6020B30732I7465c0168G4966a76639e4267j26904a6027p5157
15876i1184F2497a28072R138B42521c61130h1451j2399E0127e6507B30882c72493
15864b17833f5441j08656N2823K7049A00204k2806a20695j3797A40365a51943
15853a66081I8461J00041b8964j49314D2922J2451i2145q5444d7835j05309e7576
15841b38262D5080J28644E0393a14905D1460c21509A98099q2466b80231A54388
15830A56679c10423B55144C2478a44401A37301c25310a27619C9329B064g1736
$$ plain form
15819 -80914 -57736 -287105 99112 -242382 -244469 -471032 306269 -117588 -30433 -349474 200805
15807 -42967 -63493 -8672 52530 -131447 -19685 285184 -159740 80662 152697 -32092 -64081
15796 -64081 -12583 -270879 113100 -56925 140482 100368 274231 25509 -156334 173156
15785 -337940 295675 -10566 70110 -219215 143735 -14810 165340 -253558 25176 84940
15775 84940 -281805 44720 -24199 -166722 99590 267235 52538 108250 30981 -170025 96510
15763 38191 244423 -263908 8376 -44361 -218536 3070 221049 256114 142372 -22734 -38574
15752 -38574 -151860 -188575 -128902 39883 247379 211885 165342 60739 -61756 44718 -57738
15740 262419 367361 -172480 306704 126250 -21310 -168401 -78886 78120 43143 -186935
$$ packed form
15819h0914K3178k29369I9112b42382k087k26563C06269a17588c0433l19041B00805
15807d2967k0526h672E2530a31447a9685B85184a59740H0662P2035c2092l1989
15796f4081a2583k58296A13100e6925A40482m0114J73863B5509a56334A73156
15785c37940B95675a0566G0110b19215A43735a4810A65340b53558B5176N9764
15775H4940b81805D4720b4199j42523I9590J67645E2538N5712C0981a70025I6510
15763C8191K06232b63908H376d4361j74175C070K17979L5065j13742b2734j5840
15752c8574j13286l6715N9673C9883K07496l5494m6543F0739f1756D4718e7738
15740B62419J04942a72480C06704A26250b1310j47091g8886G8120l4977a86935
$$ plain form
15729 145947 -258479 -14495 108053 219051 188990 305302 552422 211696 180065 -5701
15718 47333 -176775 -395794 116835 87014 227398 -145164 -69661 116793 -130888 -172592
15708 -172592 -132279 -95947 -80726 37412 -49006 18557 257110 -12388 -134269 69500 62966
15697 62966 -238378 -46204 180399 108770 -421996 14168 204678 -153218 39448 -95659 -88708
15686 -88708 -370796 -427152 -150171 -76768 210081 -98539 280582 289763 -100295 69853 222982
15675 222982 258241 75414 -53770 -105123 70640 -135129 84154 -315328 -272204 -79434 158903
15663 -293527 169924 -78463 -67051 -53747 -355889 102837 262838 7048 -91607 -76916 160410
15651 -337871 157506 -134388 176816 -72545 64424 -315245 -247986 -221291 -31273 -327056
$$ packed form
15729A45947b58479a4495A08053J10998l0061J16312K47120B11696l1631e701
15718D7333a76775k19019A16835k9821J40384a45164f9661A16793a30888m1704
15708a72592M0313L6332J5221C7412d9006A8557K38553a2388j21881F9500o534
15697F2966b38378d6204A80399p1629d21996A4168J90510a53218C9448i5659O951
15686h8708k82088n6356a50171P3403B10081i8539B80582R181a00295F9853J53129
15675B22982L5259G5414e3770n1353G0640a35129H4154c15328M3124g9434A58903
15663b93527A69924g8463J1412J3304l02142A02837J60001G048i1607J4691A60410
15651c37871A57506a34388A76816g2545F4424c15245O7259K6695c1273k95783
$$ plain form
15641 -327056 -342689 7041 -212469 -185153 285868 -243216 79743 -169013 185112 -50516 188329
15629 -242380 131249 324751 199131 153375 -78070 -17954 102411 -146486 150634 -93048
15618 125227 -168711 148999 -326494 2194 -82380 123535 -192783 -411645 161346 -94546
15607 -164271 -70421 -66150 210829 -322336 -46788 -59031 91387 -43101 84505 -88110 70489
15595 -68347 35690 -328847 47115 -136860 34079 -74148 430540 27412 -188566 276829 -201612
15583 -16546 -186106 -137083 -65383 -124942 -177164 36721 -22369 183281 165914 -195160 153695
15571 59444 119479 188529 552 -226737 5967 125202 -308807 272924 -147565 -58268 173834
15559 -204214 -34226 -113642 55881 -229427 -307297 207074 -500526 -204888 -112335 65626 218442
$$ packed form
15641c27056j5633G041b12469K7316B85868b43216G9743a69013A85112e0516A88329
15629b42380A31249J93502j25620m5756g8070a7954A02411a46486A50634i3048
15618A25227a68711A48999c26494B194h2380A23535a92783k18862A61346i4546
15607a64271g0421M271B10829c22336d6788j2243I1387d3101H4505h8110G0489
15595f8347C5690c28847D7115a36860C4079g4148D30540B7412a88566B76829b01612
15583a6546j69560M9023f5383n9559n2222C6721b2369A83281j7367a95160A53695
15571E9444O0035O9050E52b26737E967J19235c08807B72924a47565e8268A73834
15559b04214c4226p9416E5881b29427p7870B07074e00526b04888R2553F5626J52816
$$ plain form
15548 218442 133241 139261 -353166 91133 16275 52881 -57025 -13665 174142 -106126 -73944
15537 -73944 -2366 127144 55030 185194 47178 -149745 86972 -221749 -83281 178202 142620
15526 142620 331790 -29747 -76020 35625 -209029 -82853 71390 -175201 121801 53241 181037
15515 181037 -16439 -16648 -25412 131859 -86327 -8518 111758 -209810 145733 25286 -232448
15503 -95042 -27454 7526 -214094 144750 15599 -82022 117796 -123278 17709 113061 178540
15492 178540 488254 469392 69612 130914 52383 -92297 448227 -80587 322964 -103772 343102
15480 140032 22733 112600 -232941 312440 172134 154813 561646 61997 283819 -142471
15469 188116 100107 193871 147631 25640 -34027 209874 15950 263956 -130168 216625 332995
$$ packed form
15548B18442q5201O020c53166I1133A6275L6606e7025a3665A74142a06126L2182
15537g3944b366A27144E5030J30164D7178a49745H6972b21749h3281A78202l5582
15526A42620J89170b9747m6273C5625b09029h2853G1390a75201A21801E3241J27796
15515A81037a6439k09q764A31859h6327h518A11758b09810A45733B5286b32448
15503i5042b7454G526b14094A44750A5599h2022A17796a23278A7709R5352O5479
15492A78540L09714j8862F9612O1302E2383i2297D48227h0587C22964a03772C43102
15480A40032B2733Q9867b32941C12440j40306j7321M06833F1997K21822a42471
15469A88116q8009R3764m6240B5640c4027B09874A5950K48006a30168B16625J16370
$$ plain form
15458 332995 401964 243609 310570 607445 356343 47925 431474 153051 248134 97743
15447 300709 263165 9131 -214506 131952 -20025 -65168 -211051 -309407 -72028 173146 -242425
15435 -175434 49957 35835 180548 164779 239703 312347 3661 224145 499578 631247 939913
15424 939913 1041485 451682 430844 -25170 317018 -17094 191662 293770 343562 276207
15414 276207 320535 56316 160522 -414418 -20414 -214902 -57952 51976 576036 -133911
15403 -118556 214578 105101 42156 -82894 -223283 -313082 78384 92900 -5699 -116953 -32049
15391 -256443 28905 -328415 129654 100994 -24105 10185 168303 40117 366983 24051 19296
15380 19296 166199 -199771 -115099 414246 -139920 -106896 153438 213070 -14978 232519
$$ packed form
15458C32995O8969j58355O6961K96875k51102D7925L83549A53051R5083I7743
15447C00709l7544I131b14506A31952b0025m5143j45883r8356g2028A73146b42425
15435a75434D9957j4122J44713j5769P4924P2644C661K20484K75433J31669L08666
15424I39913J01572D51682k0838b5170C17018a7094A91662J02108M9792o7355
15414B76207M4328E6316J04206d14418b0414j94488e7952E1976N24060a33911
15403a18556B14578A05101D2156h2894j40389q9799G8384J4516e699j11254c2049
15391b56443B8905c28415A29654k8660b4105A0185J58118D0117L26866B4051m755
15380A9296J46903a99771Q4672D14246a39920L3024A53438N9632a4978B32519
$$ plain form
15369 258321 -137818 286619 108620 -205802 41950 80419 -24222 150827 -52377 268548
15358 104076 681104 304130 105397 272286 -68865 -70853 -298143 175658 -156093 31794
15347 -177910 103349 238043 400876 146870 120511 192572 178016 -61333 306248 155655
15337 155655 130519 326803 319212 35851 -141280 133423 404045 313257 177936 -71792 292846
15325 232562 165783 253678 123976 124911 90579 49477 -115171 -43353 285159 298644 205059
15314 205059 -41859 26790 81366 96249 342406 8612 -90374 -189892 76295 324579 -144540
15302 258569 -353058 267935 -136440 -125932 -40238 201991 -72358 447970 339541 30919
15291 289857 31012 -28212 -258144 -54451 -89021 270953 -60857 12966 141726 145826 49575
$$ packed form
15369B58321a37818B86619A08620b05802D1950L8469b4222A50827e2377B68548
15358A04076N77028C04130A05397J66889f8865j988k27290A75658a56093C1794
15347a77910A03349J34694J62833A46870k6359P2061j4556f1333C06248j50593
15337A55655k5136J96284p591C5851a41280A33423K70622r0788j35321g1792B92846
15325B32562o6779Q7895A23976R35l4332m1102a15171d3353B85159J3485r3585
15314B05059d1859B6790N4576J4883K46157H612i0374r9518G6295K48284a44540
15302B58569c53058B67935a36440J0508d0238B01991g2358D47970j08429C0919
15291B89857C1012b8212k29932e4451l4570B70953f0857A2966J28760M100D9575
$$ plain form
15279 -93245 297883 371984 -91306 -192184 -47956 213871 186181 418724 169485 -117187
15268 -4672 328903 224366 342380 12960 -25442 -217694 281499 277595 18299 161050 335477
15257 335477 -225256 104721 -180456 152429 217565 186184 271632 -815 -69477 -213463 226111
15245 251993 -259422 21390 31260 -151948 -60788 -6444 -138827 97664 60205 191372 125780
15234 125780 128199 149353 142139 212642 234174 622764 973501 1323755 1323156 1459094 1611551
15223 1611551 946226 750157 241590 248509 215974 63224 -99467 131450 407131 -34435
15212 -154273 204744 -69161 -125834 288640 -327392 202321 -79809 74683 384425 137233
15201 -26373 -185643 354785 54877 57666 209000 -14308 -58829 51816 -87858 -190072 210079
$$ packed form
15279i3245B97883P4101i1306j00878d7956B13871k7690K32543A69485a17187
15268d672C28903j04537J18014A2960b5442j92252B81499l904A8299J42751J74427
15257C35477b25256A04721a80456A52429O5136l1381Q5448h15o8662j43986B26111
15245B51993b59422B1390R870a51948f0788f444j32383I7664l7459J31167o5592
15234A25780K419K1154p214P0503K1532L88590L50737L50254n99J35938J52457
15223A611551o65325j96069B41590O919l2535F3224i9467A31450K75681c4435
15212a54273B04744f9161n6673B88640c27392B02321g9809G4683L09742A37233
15201b6373j59270C54785E4877K789J51334a4308m4521E1816h7858j02214B10079
$$ plain form
15189 151288 45704 91927 -5295 -172703 112931 -19911 -32879 31166 59636 -47146 240492
15177 250186 12296 238418 -352871 -168940 102951 114727 173204 -6557 51880 139365 279792
15166 279792 307152 258421 -206537 67563 -44052 101807 -55435 259210 -228510 178517
15155 109566 29351 269654 19413 -96100 184922 -108153 293370 152516 -43619 162375
15144 222698 191538 335244 -72653 -102838 39158 206943 198765 236576 92666 -81719 347307
15132 121576 -142795 210727 -54623 99909 213174 71953 432328 61061 244802 151867
15122 151867 104981 29860 341307 -19863 175864 -146515 426023 -413991 56244 -206639
15111 275136 101589 210062 335222 275503 225489 220315 284724 553147 169602 105028 -139527
$$ packed form
15189A51288D5704M6223e295j67408A12931a9911j2968C1166K8470d7146B40492
15177B50186A2296K26122c52871a68940A02951J1776N8477f557E1880Q7485J40427
15166B79792K7360m8731b06537F7563d4052A01807e5435B59210b28510A78517
15155A09566B9351K40303A9413i6100A84922a08153B93370j40854d3619A62375
15144B22698l1160J43706g2653l0185C9158J67785q178L7811I2666h1719C47307
15132A21576a42795B10727e4623I9909J13265G1953L60375F1061J83741r2935
15122A51867m6886B9860L11447a9863A75864a46515D26023d13991E6244b06639
15111B75136A01589J08473J25160n9719n0014n174O4409K68423A69602o4574a39527
$$ plain form
15099 281012 -142254 160318 154548 -57055 96577 -5942 89844 -237015 -33597 707 93964 144604
15087 144604 135046 255684 -76212 -65802 505081 206804 173472 -61699 97492 294334 235737
15076 235737 226552 -35789 -15373 245735 -54671 286476 495353 55196 91804 53896 -108890
15064 8924 296506 -160878 -226748 -93874 15777 125616 -72484 140136 56628 415353 317930
15053 317930 61691 240027 393930 257580 -110662 159027 84710 58158 386814 197801
15043 197801 110716 304547 70055 186576 256590 196776 241395 93847 176439 237939 508754
15032 508754 499023 331082 53807 361313 -147927 501642 203052 126305 444771 164177
15021 293653 202398 154293 387423 385822 407627 154896 794448 780055 419492 761637 601634
$$ packed form
15099B81012a42254A60318n770e7055I6577e942H9844b37015c3597G07R3257N0640
15087A44604r558J20638g6212J0410E05081B06804l3332f1699I7492J96842n8597
15076B35737r185c5789a5373B45735e4671B86476K08877E5196L6608l7908a08890
15064H924K87582a60878o5870i3874A5777J09839g2484A40136E6628L58725r7423
15053C17930F1691J78336J53903j36350a10662A59027p4317k6552L28656j89013
15043A97801q7085J93831G0055J16521P0014n9814M4619I3847Q2592O1500K70815
15032E08754r731j67941E3807L07506a47927E01642B03052p6747L18466A64177
15021B93653r1255m8105K33130j601K1805A54896O39552j4393l60563L42145j60003
$$ plain form
15010 601634 453178 689676 446393 373985 628806 475189 596433 768085 522192 409093
15000 409093 363052 242958 -19398 236284 280604 140412 126317 215378 328761 228510
14990 228510 205082 915869 197648 458365 371374 301313 588241 516656 466986 496813 655010
14979 655010 147716 435228 400531 297077 459441 236002 383886 663363 602741 303969
14969 303969 349473 764869 688834 632467 745634 821020 1075930 763132 278022 164937
14959 164937 521580 609503 379423 683789 419980 784290 445715 400562 449347 486685
14949 486685 187191 337218 381263 288643 373384 292523 135325 348619 269878 240646 355800
14938 355800 498810 536951 232817 591449 371643 459218 300116 66547 535603 547147
$$ packed form
15010F01634j48456K36498k43283p2408K54821j53617J21244J71652k45893j13099
15000D09093m6041j20094a9398B36284M4320j40192j4095Q9061J13383j00251
14990B28510k3428P10787A97648K60717q6991p0061K86928p1585m9670K9827J58197
14979F55010A47716K87512l4697j03454J62364k23439J47884K79477o0622k98772
14969C03969M5504M15396p6035n6367J13167P5386K54910l12798B78022j13085
14959A64937L56643Q7923k30080L04366k63809L64310l38575m5153M8785L7338
14949D86685A87191J50027M4045r2620Q4741q0861A35325K13294p8741k9232J15154
14938C55800J43010L8141B32817L58632k19806Q7575j59102F6547M69056J1544
$$ plain form
14928 547147 545787 695153 735128 720756 387316 692077 126963 137060 391804 469128 822658
14917 822658 903342 677670 778426 670997 802902 1078458 1362740 1252388 1313811 1347299
14907 1347299 1484649 1258804 1235945 1404250 1402190 1453373 1807453 1814576 1848408 1323200 1310466
14896 1310466 1299324 1063358 565219 757010 341709 458271 474011 694615 476521 348748
14886 348748 422658 329186 345891 182618 157696 649289 406409 78131 476779 384545 209407
14875 209407 383006 476761 407970 196444 881121 587124 887414 481998 1079243 628421
14865 628421 921061 564271 610002 695123 667949 810701 796960 451492 436388 703557
14855 703557 734691 595592 589818 758853 871391 578436 752157 460063 540034 97641
$$ packed form
14928E47147j360J49366L9975j4372l33440L04761A26963J0097K54744P7324L53530
14917H22658Q0684k25672J00756j07429J31905K75556K84282j10352O1423L3488
14907A347299J37350k25845k2859J68305k060N1183L54080P123L3832n25208j2734
14896A310466j1142k35966m98139J91791C41709J16562J5740K20604k18094j27773
14886C48748P3910r3472J6705j63273k4922M91593k42880G8131L98648r2234j75138
14875B09407J73599R3755o8791A96444O84677k93997L00290m05416N97245m50822
14865F28421K92640l56790M5731Q5121k7174J42752j3741l45468j5104K67169
14855G03557L1134j39099n774J69035J12538k92955J73721k92094P9971I7641
$$ plain form
14844 785643 628133 376520 506449 309440 92898 173546 792201 417847 452829 547282
14834 547282 564572 605324 848986 707760 639891 684451 908087 729808 1025272 1172270
14824 1172270 862044 986009 1116226 775277 897105 974398 406784 437326 732714 647897
14814 647897 430096 469640 728065 508441 610197 398920 495313 446811 654691 690854
14804 690854 836396 472121 727780 529367 667625 812253 652113 635025 572701 711980
14794 711980 772867 494228 971830 476363 831227 1180513 987566 575889 1026643 721683
14784 721683 699286 737378 682621 727222 602375 518233 454390 714066 259103 558266 730775
14773 730775 655910 412429 768786 979886 751065 775819 534845 836831 805160 766902
$$ packed form
14844G85643j57510k51613J29929j97009I2898Q0648O18655l74354L4982R4453
14834E47282J7290M0752K43662j41226o7869M4560K23636j78279K95464J46998
14824A172270l10226J23965J30217l40949J21828P7293D06784L0542K95388q4817
14814F47897k17801L9544K58425k19624J01756k11277R6393m8502K07880L6163
14804F90854J45542l64275K55659j98413J38258J44628j60140j7088o2324J39279
14794G11980O0887k78639M77602D76363L54864L49286j92947m11677M50754l04960
14784G21683k2397L8092n4757M4601j24847q4142o3843K59676B59103K99163J72509
14773G30775p4865k43481L56357K11100k28821K4754k40974L01986l1671l8258
$$ plain form
14763 766902 901710 873349 508784 848808 748405 899664 748414 743750 1051293 832235
14753 832235 483368 773601 525720 428704 772021 321035 729171 575465 507458 536434
14743 536434 546882 644665 1184233 434762 366577 743410 594999 475653 774932 730978
14733 730978 708492 559356 614388 489806 1012906 402765 833761 823783 546239 947363
14723 947363 816336 964481 827753 660387 889408 771644 538859 1038537 1148833 1211232
14713 1211232 1141547 1487491 1599498 1624059 1348337 1314108 1201993 1357982 1236486 953455
14703 953455 853081 748967 775477 1046068 601302 1127907 866632 975485 816366 815440
14693 815440 1255984 1037680 790588 941696 1164213 1069590 1315107 1695082 1587134 1593039
$$ packed form
14763G66902J34808k8361l64565L40024j00403J51259j51250m664L07543k19058
14753H32235l48867K90233k47881r7016L43317C21035M08136j53706o8007K8976
14743E36434J0448R7783N39568D34762o8185L76833j48411j19346K99279m3954
14733G30978k2486j49136N5032j24582N23100D02765M30996r978k77544M01124
14723I47363j31027J48145j36728j67366K29021j17764k32785M99678J10296O2399
14713A211232o9685L45944J12007K4561k75722l4229j12115J55989j21496k83031
14703I53455j00374j04114K6510K70591m44766N26605k61275J08853j59119r26
14693H15440M40544k18304k47092J51108K22517r4623K45517L79975j07948N905
$$ plain form
14683 1593039 1587335 1623330 1111260 1002778 1053663 1268745 989940 980663 1278459 1189695 760680
14672 760680 883612 959363 1043445 569963 830715 860152 773795 783441 937184 659616 859542
14661 859542 1071016 868277 993574 939280 730891 917522 1009810 972363 1179538 987307
14651 987307 1226665 1097180 975971 1242123 1267482 1314316 1177278 1193790 1060798 1126921
14641 1126921 854585 1068926 1168398 1458355 1230123 1241092 1466286 1340597 1210107 1031570
14631 1031570 1393572 1234230 1010148 1416266 1051636 1241407 1151492 1265465 1464136 1293792
14621 1293792 1037040 1256670 1277176 1322366 1275731 1228577 1149726 1637565 1310841 1507205
14611 1507205 1458220 1476031 1201171 1247493 1497744 1442067 1318610 1355774 1247396 1647708
$$ packed form
14683A593039n704L5995n12070j08482N0885K15082k78805r277K97796q8764m29015
14672G60680J22932P5751Q4082m73482K60752K9437q6357R646J53743k77568J99926
14661H59542K11474k02739J25297n4294k08389J86631R2288l7447K07175j92231
14651I87307K39358j29485j21209K66152K5359M6834j37038J6512j32992O6123
14641A126921k72336K14341R9472K89957k28232J0969K25194j25689j30490j78537
14631A031570L62002j59342k24082M06118l64630J89771q9915J13973J98671j70344
14621A293792k56752K19630K0506M5190m6635m7154p8851M87839l26724J96364
14611A507205m8985J7811k74860M6322K50251n5677j23457L7164j08378M00312
$$ plain form
14601 1647708 1527626 1351546 1602056 1435604 1468068 1499296 1394153 1376090 1354799 1563252
14591 1563252 1532418 1553384 1472839 1585249 1663172 1574582 1946297 1336012 1349492 1550555
14581 1550555 1521442 1850366 1813770 1710213 1941743 1769361 1960214 1771442 1744925 1907168
14571 1907168 1693883 1590280 2048462 2072537 1967122 1897922 2218001 1843807 1856986 1869668
14561 1869668 1704606 2245101 2152872 2067353 2028189 2447548 2151244 2279664 2264609 2520281
14551 2520281 2291413 2447079 2353716 2669252 2572603 2496436 2757123 2699561 2864011 3035981
14541 3035981 3552632 3867572 4069387 4963949 5133067 6137503 7458601 9790960 14055799
14532 14055799 21060850 32081071 32591931 18503943 10335217 6776353 5089588 4154653
$$ packed form
14601A647708j20082j76080K50510j66452L2464L1228j05143j8063k1291K08453
14591A563252l0834K0966q0545J12410P7923q8590L71715o10285J3480K01063
14581A550555k9113L28924l6596j03557K31530j72382J90853j88772k6517J62243
14571A907168k13285j03603M58182K4075j05415o9200L20079l74194J3179J2682
14561A869668j65062N40495r2229q5519l9164M19359k96304J28420j5055K55672
14551B520281k28868J55666r3363L15536r6649p6167K60687n7562J64450J71970
14541C035981N16651L14940K01815Q94562J69118J004436J321098K332359M264839
14532A4055799P005051J1020221N10860j4087988q168726l558864j686765r34935
$$ plain form
14524 4154653 4234059 4878382 5497223 4111624 3102236 2510889 2211805 2639883 2279249
14515 2279249 2258774 2280428 2623042 2311144 2448415 2342309 1944532 2367222 2464183 2568315
14505 2568315 2453345 2572816 2390173 2551897 2398920 2531320 2564443 2691772 2602641 2670806
14495 2670806 2722928 2798667 2854369 2987021 2780127 3068518 3136278 3263395 3043479 3181646
14485 3181646 3397602 3106631 3489032 3147194 3512109 3227215 3080656 3201183 3639039
14476 3639039 3411879 3606711 3482299 3596886 3440651 3543518 3770116 3576349 4037973
14467 4037973 3959239 3608543 4032834 3933329 3948122 3532107 4289185 3951872 3931029 4484264
14457 4484264 4373530 3862948 4428748 4302785 4484591 4466262 4443334 4479822 4463739 4717132
$$ packed form
14524D154653P9406O44323O18841j385599j009388n91347k99084M28078l60634
14515B279249k0475K1654L42614l11898J37271j06106l97777M22690R6961J04132
14505B568315j14970J19471j82643J61724j52977J32400L3123J27329q9131O8165
14495B670806N2122P5739N5702J32652k06894K88391O7760J27117k19916J38167
14485C181646K15956k90971L82401l41838L64915k84894j46559J20527M37856
14476C639039k27160J94832j24412J14587j56235J02867K26598j93767M61624
14467D037973p8734l50696M24291r9505J4793m16015P57078l37313k0843N53235
14457D484264j10734n10582N65800j25963J81806j8329k2928L6488j6083K53393
$$ plain form
14447 4717132 5103782 4924935 5026109 4791050 5175050 4911174 4926759 5512372 5112128 5304100
14437 5304100 5260102 5239724 5363661 5371203 5704838 5424868 5962707 5642839 5729708 5828152
14427 5828152 6042817 6257415 6142228 6153041 6005857 6488681 6306006 6513422 6845064 6794424
14417 6794424 6883808 7225674 7278912 7195987 7161542 7512550 7653752 7541729 7670047 7762923
14407 7762923 7867358 8425788 8102296 8652843 8635217 8678387 8675454 8919530 9165559 9080454
14397 9080454 9115932 9301806 9359976 9386679 9630968 9996514 9911266 9902612 10618121 10585679 10706717
14386 10706717 11178902 10864873 11039204 11116053 11104702 11539460 11652641 11794625 12215111 12060314
14376 12060314 12590731 12574117 13155301 13077537 13432684 13427390 13924255 14044984 14417575 14441279
$$ packed form
14447D717132L86650j78847J01174k35059L84000k63876J5585N85613m00244J91972
14437E304100m3998k0378J23937P542L33635k79970N37839l19868Q6869R8444
14427E828152K14665K14598j15187J0813j47184M82824j82675K07416L31642n0640
14417F794424Q9384L41866N3238q2925l4445L51008J41202j12023J28318R2876
14407G762923J04435N58430l23492N50547j7626M3170k933K44076K46029q5105
14397I080454L5478J85874N8170K6703K44289L65546q5248q654P15509l2442J21038
14386A0706717M72185l14029J74331P6849j1351M34758J13181J41984M20486j54797
14376A2060314N30417j6614N81184p7764L55147n294M96865J20729L72591K3704
$$ plain form
14366 14441279 14771191 15261943 15692391 15888460 16519595 16216124 16370448 16673431 17125982
14357 17125982 17583651 17848828 18477204 18544748 19105671 19272277 19860331 20225643 20647419
14348 20647419 21327615 21603265 21719323 22478960 22881311 23480857 23778568 24640558 25332088
14339 25332088 25575271 26163514 26675270 27462606 28544137 28994044 29576906 30618678 30900379
14330 30900379 32014010 32666125 33548715 34907814 35773824 36637484 37703160 38804333 39876127
14321 39876127 41137892 42451898 43601496 45050510 46420819 47865627 49233659 50838714
14313 50838714 52565554 54193693 56106358 58105097 59803485 62109908 64172921 66630702
14305 66630702 68751209 71498040 74388142 77049352 79976584 82921213 86191068 89730875
$$ packed form
14366A4441279L29912M90752M30448J96069O31135l03471J54324L02983M52551
14357A7125982M57669K65177O28376O7544N60923J66606N88054L65312M21776
14348B0647419O80196K75650J16058P59637M02351N99546K97711Q61990O91530
14339B5332088K43183N88243N11756P87336J081531M49907N82862J041772K81701
14330C0900379J113631O52115Q82590J359099Q66010Q63660J065676J101173J071794
14321C9876127J261765J314006J149598J449014J370309J444808J368032J605055
14313E0838714J726840J628139J912665J998739J698388K306423K063013K457781
14305F6630702K120507K746831K890102K661210K927232K944629L269855L539807
$$ plain form
14297 89730875 93382923 97252656 101114572 105783710 110673376 115451578 120701021 126111973
14289 126111973 132084317 138307893 144948886 151879145 159602053 167373875 175751672 184532810
14281 184532810 193870409 203782970 214196913 225350987 236735864 249475452 262587103
14274 262587103 275844223 289436859 303592809 318022724 332646225 347638008 362706893
14267 362706893 377830252 392732500 407228282 420248661 432291020 443157502 452479118
14260 452479118 460977986 468929956 473497677 475916698 477517386 479785937 478497100 471087747
14252 471087747 464288854 455522938 444894190 433073136 421357843 408312209 394300530
14245 394300530 380298238 366002823 351639780 336496960 322300514 308244490 294407727
$$ packed form
14297H9730875L652048L869733L861916M669138M889666M778202N249443N410952
14289A26111973N972344O223576O640993O930259P722908P771822Q377797Q781138
14281A84532810R337599R912561J0413943J1154074J1384877J2739588J3111651
14274B62587103J3257120J3592636J4155950J4429915J4623501J4991783J5068885
14267C62706893J5123359J4902248J4495782J3020379J2042359J0866482R321616
14260D52479118Q498868P951970M567721K419021J600688K268551j288837p409353
14252D71087747o798893q765916j0628748j1821054j1715293j3045634j4011679
14245C94300530j4002292j4295415j4363043j5142820j4196446j4056024j3836763
$$ plain form
14238 294407727 281023048 268147218 255372579 242599447 229690288 218272742 207291343
14231 207291343 195982929 186100124 176666701 167898331 159748743 152109866 144643464 137728227
14223 137728227 132010878 126231706 120251928 114726958 109805725 105297513 100764828 96944296
14215 96944296 93011315 89255000 85265117 82225099 79069157 76184993 72838617 70399480
14207 70399480 68105353 65727397 63673210 61283005 59385888 57255309 55190294 53651525
14199 53651525 52064788 50593815 49092053 47541720 46176136 44709386 43668386 42968388
14191 42968388 41418103 39935393 38966277 37701416 37135208 36120766 35224912 34198858
14183 34198858 33262084 32039576 31766389 30924296 29946228 29537561 28561018 27938425 27221704
$$ packed form
14238B94407727j3384679j2875830j2774639j2773132j2909159j1417546j0981399
14231B07291343j1308414r882805r433423q768370q149588p638877p466402o915237
14223A37728227n717349n779172n979778n524970m921233m508212m532685l820532
14215I6944296l932981l756315l989883l040018l155942k884164l346376k439137
14207G0399480k294127k377956k054187k390205j897117k130579k065015j538769
14199E3651525j586737j470973j501762j550333j365584j466750j041000o99998
14191D2968388j550285j482710r69116j264861n66208j014442q95854j026054
14183C4198858r36774j222508k73187q42093r78068m08667r76543o22593p16721
$$ plain form
14174 27221704 26840776 25868006 25664795 24709688 24144218 23727834 23117827 22603035 21946325
14165 21946325 21904012 21400765 20450379 20503594 19738275 19555958 19257954 18654228 18412112 17856885
14155 17856885 17835927 17486232 17088343 16656820 16108364 16022986 15458858 15599515 14955867 14794888
14145 14794888 14928804 14220013 14236757 13761591 13615480 13329364 13129997 13022817 12522478
14136 12522478 12416713 12435280 12065255 11931031 12007766 11675881 11113229 11027885 11397876 11063321
14126 11063321 10654280 10670925 10157640 10190031 9936698 9936533 9963502 9765469 9250055 9487158
14116 9487158 8893225 8960422 9005243 9052042 8675982 8303531 8335136 8664496 8222402 8576533
14106 8576533 7937323 7781061 7637224 7574411 7871591 7426306 7311968 7450456 7347415 7098511
$$ packed form
14174B7221704l80928r72770k03211r55107n65470m16384o10007n14792o56710
14165B1946325m2313n03247r50386N3215p65319j82317k98004o03726k42116n55227
14155A7856885k0958l49695l97889m31523n48456q5378n64128J40657o43648j60979
14145A4794888J33916p08791J6744m75166j46111k86116j99367j07180n00339
14136A2522478j05765J8567l70025j34224P6735l31885n62652q5344L69991l34555
14126A1063321m09041J6645n13285L2391k53333j65K6969j98033n15414K37103
14116I487158n93933O7197M4821M6799l76060l72451L1605L29360m42094L54131
14106H576533o39210j56262j43837o2813K97180m45285j14338J38488j03041k48904
$$ plain form
14096 7098511 7128359 7002369 6736008 6807476 6659908 6520078 6600096 6481546 6371171 6188255
14086 6188255 6240109 6385722 5969072 6208533 5985066 6009127 5882520 5840147 5671154 5699382
14076 5699382 5820873 5631271 5610537 5218855 5289251 5108271 4889190 5360672 4945751 5021124
14066 5021124 4993768 4869198 4848114 4834839 4782314 4692701 4630221 4275541 4672293 4546276
14056 4546276 4613206 4731152 4387459 4481309 4242186 4552209 4201563 3900911 4710130 4023188
14046 4023188 4222593 4293591 4255196 4257068 3822787 4232640 3702787 3952615 4120724 3786312
14036 3786312 3768615 3588460 3867789 3835094 3607652 3636567 3346220 3268620 3587165 3886430
14026 3886430 3601680 3547612 3236087 3391839 3082687 3455908 3114517 3114554 3011218 3230860
$$ packed form
14096G098511K9848j25990k66361P1468j47568j39830Q0018j18550j10375j82916
14086F188255N1854J45613m16650K39461k23467K4061j26607m2373j68993K8228
14076E699382J21491j89602k0734l91682P0396j80980k19081M71482m14921P5373
14066E021124k7356j24570k1084j3275n2525q9613o2480l54680L96752j26017
14056D546276O6930J17946l43693R3850k39123L10023l50646l00652Q09219o86942
14046D023188J99405P0998l8395J872m34281M09853n29853K49828J68109l34412
14036C786312j7697j80155K79329l2695k27442K8915k90347p7600L18545K99265
14026C886430k84750n4068l11525J55752l09152L73221l41391L7j03336K19642
$$ plain form
14016 3230860 3249221 3257004 3222277 2827498 3041982 3213557 3233377 2795161 2801944 2672403 2632454
14005 2632454 2883638 2409836 2568590 2694076 2644582 2612813 2797073 2570938 2291607 2509733
13995 2509733 2451133 2549418 2620938 2293950 2310787 2439914 2362054 2201407 2574348 2146583
13985 2146583 2218805 2209469 2710312 2367044 2598703 2355986 2750038 3101752 3279297 3805703
13975 3805703 4474469 6378130 9496914 15777344 27216358 34986734 22644061 14729556
13967 14729556 9928004 7362092 6261277 4965240 4316885 4381327 3581644 3381370 3355835
13958 3355835 2925222 3182983 2808604 2739754 2373427 2660084 2243064 2412705 2648582 2280443
13948 2280443 2332801 2195564 2360970 2268745 2474953 2195933 2208630 2407987 1989624 2143142
$$ packed form
14016C230860J8361P783l4727l94779K14484J71575J9820m38216O783j29541l9949
14005B632454K51184m73802J58754J25486m9494l1769J84260k26135k79331K18126
13995B509733n8600R8285P1520l26988J6837J29127p7860j60647L72941m27765
13985B146583P2222r336N00843l43268K31659k42717L94052L51714J77545N26406
13975C805703O68766J903661L118784O280430J1439014P770376j2342673p914505
13967A4729556m801552k565912j100815j296037o48355O4442p99683k00274k5535
13958C355835m30613K57761l74379o8850l66327K86657m17020J69641K35877l68139
13948B280443N2358j37237J65406r2225K06208k79020J2697J99357m18363J53518
$$ plain form
13938 2143142 2282527 1669813 1825556 2080654 1896081 2217455 1839068 1887948 1873460 1853439
13928 1853439 2064561 1805014 2085214 1637804 1743885 1714218 1576887 1613777 1545844 1735779
13918 1735779 1642654 1611587 1736099 1399595 1806533 1982327 1438131 1873135 1782507 1780176
13908 1780176 1362907 1414226 1860088 1404619 1470611 1539147 1567195 1465443 1297315 1808970
13898 1808970 1579717 1382265 1265948 1249390 1388986 1227689 1626680 1233694 1354468 1656814
13888 1656814 1326466 1159504 1259165 1662434 1333263 1236635 1213375 1422182 1212793 1370509
13878 1370509 1531701 1529337 1015827 1242650 1148634 1268495 1064816 1090748 970470 1388782
13868 1388782 1111447 1211271 1353870 1221963 1203680 1631881 1217848 1280396 744378 1099652
$$ packed form
13938B143142J39385o12714J55743K55098j84573L21374l78387M8880j4488k0021
13928A853439K11122k59547K80200m47410J06081k9667j37331L6890o7933J89935
13918A735779r3125l1067J24512l36504M06938J75794n44196M35004r0628k331
13908A780176m17269N1319M45862m55469O5992O8536K8048j01752j68128N11655
13898A808970k29253j97452j16317j6558J39596j61297L98991l92986J20774L02346
13888A656814l30348j66962R9661M03269l29171r6628k3260K08807k09389J57716
13878A370509J61192k364n13510K26823r4016J19861k03679K5932j20278M18312
13868A388782k77335R9824J42599j31907j8283M28201m14033O2548n36018L55274
$$ plain form
13858 1099652 1333156 1155992 1335346 1176401 992737 937242 1323067 1159607 1165969 840460
13848 840460 1099372 1109780 1116238 1090449 724606 946647 920714 1141026 1335060 970268
13838 970268 786511 1055035 1139204 1047228 652607 902304 1184956 979513 1261153 1093050
13828 1093050 1201801 1275265 1068070 982992 1176736 710100 1138086 882187 978915 870942
13818 870942 1135539 532244 995188 677309 918515 654129 747817 779079 1083108 833871
13808 833871 1017651 628275 901115 637167 941317 955782 1116397 612395 773882 908411
13798 908411 735016 1292752 926185 856846 908963 935025 472760 513348 830216 1049516
13788 1049516 768911 837700 726017 961871 811661 921241 694997 788412 944023 1059863
$$ packed form
13858A099652K33504j77164J79354j58945j83664n5495L85825j63460O362l25509
13848H40460K58912J0408O458k5789l65843K22041k5933K20312J94034l64792
13838I70268j83757K68524Q4169r1976l94621K49697K82652k05443K81640j68103
13828A093050J08751P3464k07195q5078J93744m66636M27986k55899R6728j07973
13818H70942K64597E32244M62944l17879K41206k64386R3688L1262L04029k49237
13808H33871J83780l89376K72840k63948L04150J4465J60615n04002J61487J34529
13798I08411j73395N57736l66567o9339N2117K6062m62265M0588L16868K19300
13788A049516k80605O8789j11683K35854j50210J09580k26244R3415J55611J15840
$$ plain form
13778 1059863 787344 968855 673972 863419 939719 818466 538308 940888 1053197 813044
13768 813044 899163 567471 740920 533797 848259 538316 1029970 690222 801887 1037769
13758 1037769 771319 665522 616494 449092 974196 843414 650719 563915 686213 458590
13748 458590 634048 785437 181280 799100 916248 434241 511973 642307 895362 779920
13738 779920 838864 328366 429296 722728 723435 710876 595163 252793 871719 589354
13728 589354 503409 628939 353969 521925 713825 541290 646111 784230 535134 681670
13718 681670 782932 675960 470288 582013 726891 654475 547961 612737 373984 1034685
13708 1034685 632815 826633 566587 720859 656612 470751 876831 543273 352956 408061
$$ packed form
13778A059863k72519J81511k94883J89447P6300j21253k80158M02580J12309k40153
13768H13044Q6119l31692J73449k07123L14462l09943M91654l39748J11665K35882
13758A037769k66450j05797m9028j67402N25104j30782j92695q6804J22298k27623
13748D58590J75458J51389A81280O17820J17148D34241P7732J30334K53055j15442
13738G79920N8944C28366J00930K93432P07j2559j15713B52793O18926k82365
13728E89354q5945J25530k74970J67956J91900j72535J04821J38119k49096J46536
13718F81670J01262j06972k05672J11725J44878p2416j06514O4776k38753O60701
13708A034685m01870J93818k60046J54272o4247j85861M06080l33558j90317N5105
$$ plain form
13698 408061 564936 586763 709847 497120 394720 640323 361212 580393 228929 567493
13688 567493 573236 471234 498228 540745 595030 1035063 377195 489052 617977 473915
13678 473915 417720 632315 371332 336319 598006 577953 587417 492703 516132 482377 353027
13667 353027 641731 148325 557541 417634 547504 414615 377546 300726 570624 377163
13657 377163 775686 472542 645248 758074 600104 206942 540350 554789 562634 -39500
13646 790321 627336 557288 401107 455576 885504 235584 720429 430250 546024 542259
13636 542259 403906 237641 320651 261778 325970 531504 563742 303905 579063 245987
13625 664509 198747 227004 562240 494887 526723 359487 527498 397554 397359 155446 468084
$$ packed form
13698D08061J56875K1827J23084k12727j02400K45603k79111K19181B28929L38564
13688E67493N743j02002K6994M2517N4285M40033C77195J11857J28925j44062
13678D73915n6195K14595k60983l5013K61687k0053R464r4714K3429l3755j29350
13667C53027K88704A48325M09216j39907J29870j32889l7069p6820K69898j93461
13657C77163L98523l03144J72706J12826j57970B06942L33408J4439P845c9500
13646G90321j62985p0048j56181N4469M29928B35584M84845k90179J15774l765
13636E42259j38353j66265Q3010n8873O4192K05534L2238k59837K75158B45987
13625F64509A98747K8257L35236o7353L1836j67236J68011j29944j95A55446L12638
$$ plain form
13614 468084 527558 263083 351539 243603 125499 500312 790930 395167 232552 415702
13604 415702 342720 117400 557921 109942 144196 486049 417545 537466 375097 326972
13594 326972 586801 102858 200260 331160 512460 529679 593505 298250 488534 126759
13583 272853 378011 460054 169747 518970 -89484 638436 353237 136615 346246 369530
13573 369530 135303 346623 403331 396015 674877 595707 617351 179233 333022 55445 207132
13562 207132 334764 97663 351777 299155 211467 144840 349903 325790 345624 368625 126929
13550 172361 422414 419835 281632 287730 402750 657902 530448 297132 532008 237937
13539 390594 139169 273653 498994 201831 311353 217797 123122 253573 184129 416748
$$ packed form
13614D68084N9474B63083Q8456j07936j18104L74813K90618C95167j62615J83150
13604D15702p2982A17400M40521A09942L4254L41853o8504J19921j62369m8125
13594C26972K59829A02858R7402J30900J81300J7219O3826k95255J90284A26759
13583B72853J05158Q2043A69747L49223h9484F38436k85199A36615K09631K3284
13573C69530A35303K11320N6708p316K78862p9170K1644A79233J53789E5445J51687
13562B07132J27632I7663K54114n2622q7688o6627K05063k4113J9834K3001A26929
13550A72361K50053k579j38203O098J15020K55152j27454k33316K34876B37937
13539C90594A39169J34484K25341B01831J09522r3556r4675J30451o9444K32619
$$ plain form
13529 416748 315920 350782 268305 433773 413768 -70136 -149048 77486 234221 576041 -56277
13517 312222 92153 47559 338219 189709 382598 140075 225974 265595 157878 329670
13507 329670 520763 62556 626033 506924 54615 160974 242951 378343 104656 193713
13497 193713 16178 278946 125414 414966 227068 248264 108342 283742 325570 328982
13487 328982 14663 92802 521679 71258 479954 449447 352403 307261 211498 278252 353127
13476 353127 243125 171786 406409 529439 399947 233851 362118 197889 124089 497780
13466 497780 85306 376675 463927 51203 467385 -28957 394018 186989 264455 225086 233562
13455 233562 428607 434497 231659 401627 271026 426131 137009 371431 -66226 315911
$$ packed form
13529D16748j00828L4862q2477J65468k0005g0136p8912G7486J56735L41820e6277
13517C12222I2153m4594K90660j48510J92889A40075Q5899L9621j07717J71792
13507C29670J91093F2556N63477j19109E4615J06359Q1977J35392A04656Q9057
13497A93713A6178K62768A25414K89552j87898K1196A08342J75400M1828L412
13487C28982A4663P8139M28877G1258M08696l0507r7044m5142r5763O6754P4875
13476C53127j10002p1339K34623J23030j29492j66096J28267j64229p3800L73691
13466D97780H5306K91369Q7252E1203M16182b8957C94018A86989P7466l9369Q476
13455B33562J95045N890k02838J69968j30601J55105A37009K34422f6226C15911
$$ plain form
13444 198262 -194756 160427 -52498 163360 298014 187360 140852 13862 -124842 305453
13433 277137 426246 119481 -26960 -38218 231832 357974 20872 -67155 74663 115024 -65794
13421 -63315 -101660 267592 585559 352295 268366 546923 -306417 127276 411540 289962
13411 289962 195079 218488 237454 289193 298739 538080 -110625 -62966 388471 75986 70595
13400 70595 -101098 214827 -105307 299767 123430 293945 103356 -31973 448754 454186
13390 454186 103442 243150 272496 -18562 277682 419816 -240686 40010 131538 196368
13380 196368 369738 128948 250209 -15777 276181 -202406 427008 103539 79154 214026
13370 214026 286042 124548 176606 196934 100450 45249 355883 258123 -114939 42560 -90456
$$ packed form
13444A98262a94756A60427e2498A63360J34654j10654m6508A3862a24842C05453
13433B77137J49109A19481b6960j1258B31832J26142B0872f7155G4663M0361f5794
13421f3315l8345B67592L17967k33264q3929K78557c06417A27276K84264j21578
13411B89962r4883K3409J8966N1739R546K39341a10625M7659C88471G5986n391
13400G0595a01098B14827a05307B99767A23430J70515A03356c1973D48754N432
13390D54186A03442J39708K9346a8562B77682J42134b40686D0010R1528O4830
13380A96368J73370A28948J21261a5777B76181b02406D27008A03539k4385J34872
13370B14026P2016A24548N2058K0328r6484D5249L10634r7760a14939D2560i0456
$$ plain form
13358 21063 297026 350694 423891 373087 231458 568293 129197 -8483 289530 101380 352116
13347 352116 142038 178042 148597 198932 524774 60416 193146 368913 329030 189294
13337 189294 141323 338226 627316 92052 130768 288002 348367 190628 350037 323032
13327 323032 74354 214802 173382 416911 32828 351537 256625 68850 273556 140090
13317 140090 286953 284971 482288 266098 91295 -238783 126118 231734 163403 100002
13307 100002 178989 160083 47282 360291 333892 -32417 261014 -38813 254257 253056 174685
13296 174685 99339 218487 527646 229725 13415 456226 473074 513870 98952 397982
13286 397982 62416 164246 -68878 94278 417971 -104230 8156 365761 242178 357263
$$ packed form
13358B1063K75963N3668P3197n0804j41629L36835A29197h483B89530A01380K50736
13347C52116A42038L6004k9445N0335L25842F0416J32730J75767l9883j39736
13337A89294m7971J96903K89090I2052L8716J57234O0365j57739J59409k7005
13327C23032G4354J40448m1420K43529C2828L18709r4912F8850K04706j33466
13317A40090J46863j982J97317k16190I1295b38783A26118J05616o8331o3401
13307A00002P8987j8906D7282L13009k6399c2417B61014c8813B54257j201p8371
13296A74685p5346J19148L09159B29725A3415M42811J6848M0796I8952K99030
13286C97982F2416J01830f8878I4278L23693a04230H156L57605j23583J15085
$$ plain form
13276 357263 55678 190906 -50822 158192 2031 292504 -39355 288662 -91347 373513 -170618
13264 254001 -129776 100702 276993 265462 104800 101802 12521 83598 268433 26819 190174
13253 190174 233420 227340 198153 278127 -141385 235778 -40636 -43051 483716 -41737 190184
13241 135264 80301 513851 382910 247246 347571 -69988 395490 -214441 -4189 31628
13230 95933 -17770 -188294 153334 -89358 -139208 19633 141581 77972 -383642 381042 180490
13218 72491 -27895 118248 376519 -44922 336772 339721 48483 -6710 -27585 -79680 -25089
13206 -59398 377520 172775 24574 -215768 198579 118605 -150266 438323 100379 93612
13196 93612 145458 -126396 -141318 250308 -36265 144920 54009 418736 -68742 -185742 -12888
$$ packed form
13276C57263E5678J35228e0822A58192B031K90473c9355B88662i1347C73513a70618
13264B54001a29776A00702J76291j1531A04800k998A2521P1077J84835B6819J63355
13253A90174M3246o080k9187P9974a41385B35778d0636k415D83716d1737A90184
13241A35264n4963M33550j30941j35664J00325f9988C95490b14441d189C1628
13230I5933a7770j70524A53334h9358m9850A9633J21948o3609c83642C81042A80490
13218G2491b7895A18248K58271d4922C36772K949D8483f710k0875n2095b5089
13206e9398C77520A72775B4574b15768A98579p9974a50266D38323A00379o767
13196I3612N1846a26396j4922B50308c6265A44920E4009L64727f8742j17000a2888
$$ plain form
13184 301239 -33472 27236 170403 -144014 325712 -173922 -171411 -234645 165631 -122910
13173 135017 161873 65795 75068 49309 393198 64114 339015 280103 -269765 343514 -130895
13161 135931 -278454 43058 107570 158459 -101196 77047 54739 -25155 -183403 192846 346833
13150 346833 99795 283111 -157437 392326 -186375 -97693 268971 192917 -65275 185590
13139 -71143 4243 -173098 100252 -38297 -108281 243521 -70139 -142991 -67230 49517 -31663
13127 255050 124803 102331 -302738 -82847 413215 182080 98618 26297 -398539 232394
13116 101212 318146 85113 173195 -174343 -157388 123446 -384344 261122 209823 -267140
13105 104398 26210 -10060 -65252 -130698 49283 -370439 -46145 74861 243556 170466 116425
$$ packed form
13184C01239c3472B7236J43167a44014C25712a73922K511o3234A65631a22910
13173A35017K6856F5795R273k5759L43889F4114K74901n8912b69765C43514a30895
13161A35931b78454D3058O4512N0889a01196G7047k2308b5155j58248A92846J53987
13150C46833I9795J83316a57437C92326a86375Q8682B68971p6054f5275A85590
13139g1143D243a73098A00252c8297o9984B43521g0139p2852f7230D9517c1663
13127B55050A24803k2472c02738h2847D13215A82080q3462B6297c98539B32394
13116A01212K16934H5113Q8082a74343J6955A23446c84344B61122n1299b67140
13105A04398B6210a0060n5192o5446D9283c70439d6145G4861J68695p3090n4041
$$ plain form
13094 116425 -10205 416393 399989 220166 -15738 222069 13363 -6743 403351 -163035 277413
13082 -55980 36782 118700 -389178 -189989 328820 -18530 187320 -126549 -355382 251177
13071 -197483 50704 -148946 189024 107500 -423441 216886 233821 -263961 44804 45458 313363
13060 313363 253073 137398 52757 179121 115381 443532 157340 -154670 266046 16770
13049 294938 90029 108546 84381 242140 413500 1128 -125549 -49748 -90706 -65625 152342
13037 -61115 241277 -303559 20279 323820 -256937 65706 -103260 -158900 79005 -19659 198916
13025 58879 -128123 455168 -19953 -399978 -223642 206249 -23156 347650 246713 36807
13014 -256934 207065 12975 191836 -132954 236455 309461 -274037 26374 -49722 -6971 48196
$$ packed form
13094A16425a0205D16393j6404j79823a5738B22069A3363f743D03351a63035B77413
13082e5980C6782Q1918c89178a89989C28820a8530A87320a26549k28833B51177
13071a97483E0704a48946A89024q1524d23441B16886J6935b63961D4804O54K67905
13060C13363o0290j15675E2757J26364o3740L28151A57340a54670B66046A6770
13049B94938I0029J8517k4165J57759J71360A128a25549d9748m0958K5081A52342
13037f1115B41277c03559B0279L03541b56937F5706a03260n5640G9005a9659A98916
13025E8879a28123D55168a9953l80025J76336B06249b3156C47650j00937C6807
13014b56934B07065A2975J78861a32954B36455P3006b74037B6374d9722f971D8196
$$ plain form
13002 433090 285603 145181 -74642 74373 495600 48477 259807 200181 5406 168677 -16844
12990 131236 245410 172553 47740 345118 61573 1766 86616 16704 133865 573121 241300
12978 110897 -35915 441223 149834 207931 76597 -259678 40669 -9249 56996 58084 33997
12967 33997 -250502 -102365 122056 165760 -38364 -78306 -11443 281470 -24716 -151279 -239821
12956 -239821 270603 -17921 -132768 68267 -300371 -18856 -164205 380631 149107 19701
12945 4753 -213621 -333778 270978 -6555 134115 -1529 122513 203696 -295521 -186163 -41445
12933 2999 -23922 244798 34344 -248718 202441 84052 22123 -233377 -30149 189640 -117725
12921 24362 183732 106743 169023 22650 -113802 334761 113229 30471 71899 232802 -77784
$$ packed form
13002D33090j47487j40422g4642G4373M21227D8477K11330n9626E406J63271a6844
12990A31236J14174p2857D7740K97378F1573A766Q4850A6704J17161M39256B41300
12978A10897c5915D41223A49834N8097G6597b59678D0669i249E6996J088k4087
12967C3997b50502a02365A22056M3704c8364l9942a1443B81470b4716j26563q8542
12956b39821B70603a7921j14847F8267c00371a8856j45349C80631A49107A9701
12945D753b13621j20157B70978f555A34115a529A22513Q1183b95521J09358d1445
12933B999b3922B44798C4344b48718B02441H4052B2123b33377c0149A89640a17725
12921B4362J59370p6989O2280B2650a13802C34761A13229C0471M1428J60903g7784
$$ plain form
12909 249173 164939 374129 -237522 7270 -45561 -59632 -207777 173371 51443 102295 -31635
12897 54052 -74409 -131457 29913 -8828 129976 48652 89183 -128175 -183716 -138053 277953
12885 -67572 153527 -245914 -72190 128754 136001 51576 37730 194169 200355 -216942 234984
12873 -6392 -52880 49500 240467 46941 57786 -195456 33143 158866 158140 91117 -65065 12710
12860 -89599 -47999 -105186 -177422 175272 10882 394428 -317371 116140 -52283 203051 -40724
12848 -221181 123009 136615 -124224 124681 221777 -291663 44008 25979 107571 195603 -467671
12836 -221435 -16354 -7635 87873 -33575 -75200 298618 -80054 121667 -110264 16934 208172
12825 208172 236446 -212544 65684 -194461 -57909 -49287 11968 56907 47917 1575 41373 49135
$$ packed form
12909B49173q4234K09190b37522G270d5561j4071j48145A73371E1443N0852c1635
12897E4052g4409n7048B9913h828A29976D8652M0531a28175n5541M5663B77953
12885f7572A53527b45914g2190A28754P247E1576j3846J56439O186b16942B34984
12873f392m6488D9500J90967D6941J0845a95456C3143J25723p26o7023f5065A2710
12860h9599M1600n7187p2236A75272A0882L83546c17371A16140e2283B03051d0724
12848b21181A23009J3606a24224A24681R7096b91663D4008j8029Q1592Q8032d67671
12836b21435a6354g635H7873c3575m1625B98618h0054A21667a10264A6934J91238
12825B08172K8274b12544F5684a94461e7909Q622A1968M4939q990A575L9798P762
$$ plain form
12813 49135 -139983 -11155 316536 -241966 184090 -149994 313734 90788 193618 -3308
12802 -118209 -98334 -210636 83619 179538 18396 8151 259018 -58643 -52726 160652 -35022
12790 28734 -180477 -255220 -50324 26496 -210021 -134953 -253883 -84635 27997 -73945 -116267
12779 -116267 91235 116527 -47970 -145882 90827 250844 -125878 223859 -73485 301442 106908
12767 -345115 -55084 -174782 -92933 49905 -61477 43314 101922 -254591 -16725 165246 -87796
12755 -425407 -195844 47416 -296736 -89845 72749 -83636 -246856 -171947 -114282 25990 143284
12744 143284 -66641 137647 -195680 155851 254299 -9160 171298 -127292 -149995 167026
12733 7283 -63678 33697 73829 -135277 262022 117841 102006 170625 178810 -45995 84618
$$ packed form
12813D9135a39983a1155C16536b41966A84090a49994C13734I0788J02830c308
12802a18209J9875j12302H3619R5919A8396H151K50867e8643N917A60652c5022
12790B8734a80477p4743e0324B6496b10021P5068j18930h4635B7997g3945m2322
12779a16267I1235K5292d7970r7912I0827J60017a25878B23859g3485C01442A06908
12767c45115e5084j19698Q1849D9905f1477D3314N8608b54591a6725A65246h7796
12755d25407a95844D7416b96736h9845G2749h3636j63220P4909N7665B5990J17294
12744A43284f6641A37647a95680A55851R8448i160A71298a27292k2703A67026
12733G283f3678C3697M0132a35277B62022A17841j5835O8619Q185d5995H4618
$$ plain form
12721 59869 74618 -160112 231970 176854 109261 58967 166691 -49729 -28189 -136539 -201951
12710 -201951 217827 -356092 -204588 6286 -31665 -92257 -10409 60682 -268371 -5063 -79400
12699 -79400 148331 58772 229733 142173 -3137 110808 181825 644786 67887 444088 -37000
12687 -22252 -147524 83070 446674 199868 -465419 337118 8184 53953 351083 -190006
12676 -92459 437070 -123585 -79915 102620 156333 176245 44510 46652 363053 -24518 36372
12664 408637 391005 -81417 354506 435558 68740 -101627 -389403 -36038 415414 -129860
12653 57573 -234368 112205 362879 241098 1407 346529 254466 -144301 159383 61557
12642 85100 -20640 95698 -252707 -47898 154685 -255285 83012 210506 -22539 52925 -174172
$$ packed form
12721E9869J4749a60112B31970n5116o7593n0294J07724d9729K1540j08350o5412
12710b01951B17827c56092J51504F286c1665o0592a0409F0682b68371e063p4337
12699g9400A48331E8772J70961q7560c137A10808P1017M62961F7887L76201c7000
12687b2252j25272H3070L63604A99868d65419C37118H184M5769K97130a90006
12676i2459D37070a23585M3670A02620N3713J9912D4510K142L16401b4518C6372
12664D08637j7632h1417C54506Q1052F8740a01627k87776c6038D15414a29860
12653E7573b34368A12205K50674j21781A407L45122r2063a44301A59383F1557
12642H5100b0640I5698b52707d7898A54685b55285H3012J27494b2539E2925a74172
$$ plain form
12630 -105157 -136368 -196135 45033 239718 -193407 -78987 116199 -150919 316111 129821
12619 -63840 311760 94163 6676 163012 -119189 55437 65987 84279 -114064 -71764 172719
12607 -80169 -238336 32389 -100011 192392 74056 74927 125979 106971 64024 120462 -466443
12595 216273 -63018 -101905 153444 -198101 -395033 -13860 87902 -179706 25724 298920
12585 298920 -257261 258100 183564 189170 110008 -173631 271332 209407 94083 98649 -71068
12573 -51383 -263981 -114223 105601 314155 -239133 -225586 105895 -289445 136233 -27361
12562 2683 185712 265002 -73717 94971 122484 251930 70584 161869 -172593 147806 -280836
12550 -328896 -30573 129779 193455 -50879 37974 6734 165504 69002 156224 9509 558505
$$ packed form
12630a05157l1211n9767D5033J94685a93407g8987A16199a50919C16111A29821
12619f3840C11760I4163F676J56336a19189E5437J0550J8292a14064M2300A72719
12607h0169j58167C2389a00011A92392G4056Q71N1052j9008m2947N6438d66443
12595B16273f3018l8887A53444a98101j96932a3860H7902a79706B5724K73196
12585B98920b57261B58100p4536N606p9162a73631B71332o1925I4083M566g1068
12573e1383k12598a14223A05601K08554b39133J3547A05895b89445A36233b7361
12562B683J83029P9290g3717I4971K7513J29446G0584R1285a72593A47806b80836
12550c28896c0573A29779O3676e0879C7974F734J58770F9002Q7222I509N48996
$$ plain form
12539 558505 -35086 -12947 -1174 -62997 14474 -40159 -105343 238259 -134746 -27457 -158786
12528 -158786 -235388 -5958 73570 84826 -60485 175985 -83294 135163 160757 46758 -134421
12516 -176966 96113 174341 -13152 45357 141012 25 65787 199927 -470355 -181847 188161
12504 -139030 -388584 -112252 133080 80193 133667 11712 -60949 -620158 -40398 -58962 96007
12492 294082 225519 65329 -84143 90198 58357 73920 -47995 110462 -32473 35866 186236
12481 186236 175903 302510 -129277 -174334 -138242 14756 -33949 18062 3310 -97556 -205206
12470 -205206 -65392 -272937 3802 228864 76007 231992 289497 48014 62846 -151519 185699
12458 -135701 -324266 23208 7145 -111528 165302 -35006 -63156 239947 2375 -82524 482211
$$ packed form
12539E58505c5086a2947a174o1823A4474d0159o5184B38259a34746b7457j31329
12528a58786p6602e958G3570J1256f0485A75985h3294A35163K5594D6758a34421
12516a76966I6113P8228a3152D5357R5655B5O5762J34140d70355a81847A88161
12504a39030k49554a12252A33080n2887N3474A1712f0949n59209d0398j8564I6007
12492B94082o8563F5329h4143I0198l1841J5563d7995A10462c2473C5866J50370
12481A86236j0333J26607a29277m5057L6092A4756c3949A8062C310i7556j07650
12470b05206f5392k07545C802K25062G6007J55985N7505D8014J4832a51519A85699
12458a35701j88565B3208G145a11528A65302c5006k8150B39947B375h2524D82211
$$ plain form
12446 152708 -120195 65663 -162482 441559 126480 -138418 -127751 -17510 127657 84350
12436 84350 112321 -133046 -223720 91038 -97427 432185 -41502 -17484 -8480 12431 94210
12425 94210 61817 123039 -205978 -23038 -279344 -160977 -349922 -204419 -30845 -231416
12415 -231416 10803 -112394 -182749 24760 330377 -147332 298328 -111377 -62387 88910
12404 102262 301085 134524 33992 154520 -98695 -211063 -55026 22998 2444 -434567 -186745
12392 -52968 225509 851 -18751 27952 -8175 384080 104575 -241176 62801 -395223 -375556
12381 -375556 -47621 125691 -123610 25596 -87471 152752 -26258 212897 71387 268910
12371 268910 177500 -3163 420133 16713 -196287 -122215 122612 34828 91442 -132545 340677
$$ packed form
12446A52708a20195F5663a62482D41559A26480a38418J0667a7510A27657m3307
12436H4350K7971a33046r0674I1038i7427D32185d1502a7484h480A2431Q1779
12425I4210l2393O1222b05978b3038k56306J18367j88945J45503c0845k00571
12415b31416A0803a12394p0355B4760L05617a47332B98328a11377M8990H8910
12404A02262J98823A34524C3992J20528i8695j12368e5026B2998B444d34567a86745
12392e2968B25509H51a8751B7952h175C84080A04575b41176F2801c95223J9667
12381c75556d7621A25691a23610B5596h7471A52752b6258B12897G1387J97523
12371B68910r1410c163D20133A6713a96287P4072A22612C4828N6614a32545C40677
$$ plain form
12359 98281 164541 153509 -133554 -156262 40391 82486 31483 -42260 302235 -317937 -8125
12347 124388 -213679 -174049 -218757 227371 -328177 -107044 -34941 -154906 247541 -53917
12336 -140093 -284655 -13313 119001 45847 -48813 306250 -2728 -113843 241450 -160331
12325 195612 52406 7838 228452 -95227 42939 39118 252852 173530 -279513 -50706 66062
12313 223242 -238482 31732 165257 103032 311989 -70529 164418 107712 175682 445838
12303 445838 6589 238103 359074 303641 318619 318122 182433 431967 -8724 211297 -87350
12291 387678 -12933 -23029 24373 177668 390812 6262 -277504 420516 20545 376289 59186
12279 83059 -26599 188741 -278947 117373 -114185 46800 66453 -243293 -176138 264272
$$ packed form
12359I8281O6260j1032a33554k2708D0391M2095C1483d2260C02235c17937h125
12347A24388b13679L9630m4708B27371c28177a07044c4941j19965B47541e3917
12336a40093j44562a3313A19001D5847d8813C06250b728j11115B41450a60331
12325A95612E2406G838K20614i5227D2939l821K13734p9322b79513e0706F6062
12313B23242b38482C1732J33525o2225K08957g0529A64418n6706O7970K70156
12303D45838F589K31514J20971n5433J4978m97j35689K49534h724B11297h7350
12291C87678a2933j0096B4373J53295K13144F262b77504D20516B0545L55744E9186
12279H3059b6599A88741b78947A17373a14185D6800J9653b43293O7155B64272
$$ plain form
12268 91267 488072 -153470 186358 248500 -46525 308640 105768 -125958 -12149 -266949
12258 -266949 493593 76183 201872 154989 309638 170821 56091 349327 269646 286595
12248 286595 19017 -69116 339373 518072 99780 563592 459383 137286 -156807 229816
12237 259344 -47065 59638 205413 31724 174978 -47807 161074 307846 97440 61349 -184572
12225 -42671 -80064 85093 172811 15090 141721 130776 266091 42604 275478 108215 301733
12214 301733 379750 352969 240288 16238 167236 -45493 -146482 268678 130334 425918
12204 425918 111344 57265 196607 223014 133886 -91391 249575 224551 -134352 44519 256419
12193 256419 -297873 416271 188419 339042 254021 321961 149045 101103 167183 92598
$$ packed form
12268I1267L96805a53470A86358O2142d6525C08640A05768a25958a2149k54800
12258b66949D93593G6183J25689m6883J54649j38817E6091K93236p9681J6949
12248B86595A9017f9116C39373J78699I9780M63812j04209A37286a56807B29816
12237B59344d7065E9638J45775C1724J43254d7807A61074J46772I7440l6091a84572
12225d2671l7393H5093Q7718A5090J26631j0945J35315D2604K32874A08215J93518
12214C01733P8017k6781j12681A6238J50998d5493j00989B68678A30334K95584
12204D25918A11344n4079J39342K6407q9128i1391B49575k5024a34352D4519K11900
12193B56419b97873D16271A88419J50623q5021O7940A49045m7942O6080p4585
$$ plain form
12183 92598 -32798 38089 255241 277411 -95345 238039 218789 151013 153190 136431 190858
12172 190858 -34971 295886 25542 149875 -61602 -199578 -2359 253655 -109875 5430 204487
12161 204487 -78408 149538 -126455 158089 -49028 417812 146035 289352 349120 155936
12150 -76560 313836 92907 -39997 360162 -63248 59154 242711 29249 337778 58236 191352
12139 191352 277008 155870 -134236 -28094 222602 73380 168662 316306 106726 90752
12129 90752 -163710 -86375 110014 -49223 172882 185173 -137295 -908 -34558 -276023 161894
12117 103951 118998 -25860 266400 8780 23756 -342319 30795 720 189808 -260620 124124
12105 141064 490698 135253 258773 -106405 9592 96188 132601 220252 -126797 329483
$$ packed form
12183I2598c2798C8089K17152K2170i5345B38039j9250o7776K177j6759N4427
12172A90858c4971B95886B5542J24333f1602j37976b359B53655a09875E430J99057
12161B04487g8408A49538a26455A58089d9028D17812A46035J43317N9768A55936
12150g6560C13836I2907c9997C60162f3248E9154J83557B9249L08529E8236J33116
12139A91352Q5656j21138a34236b8094B22602G3380R5282J47644A06726j5974
12129I0752a63710P7335A10014d9223A72882J2291a37295i08l3650k41465A61894
12117A03951J5047b5860B66400H780J4976c42319C0795G20J89088b60620A24124
12105A41064L49634A35253J23520a06405I592Q6596L6413Q7651a26797C29483
$$ plain form
12094 249353 303311 -2354 220860 150625 82994 188549 78959 174425 74022 -125919 -209270
12083 -209270 46326 -345364 134546 -50487 -9185 119755 -365237 173980 1851 318019 41190
12071 209951 131942 236816 157822 326629 -323645 135994 134599 -143468 227199 -35585
12060 -315080 241722 373362 62957 104084 -189680 129300 83238 222174 271694 97469
12049 172397 -57440 350761 361932 247405 292733 297390 371806 202452 41766 299940 182465
12038 182465 -14813 229730 -124616 29603 35787 -232977 -215311 -59858 86962 -62616 -146162
12027 -146162 45339 -22862 -29907 -192619 129768 -113230 -107331 -38504 -174120 109412 58961
12016 58961 -55387 -151008 205603 -113683 59960 -175318 -115788 -247366 53256 10288 -27063
$$ packed form
12094B49353N3958b354B20860p0235o7631J05555G8959R5466G4022a25919q3351
12083b09270D6326c45364A34546e0487i185A19755c65237A73980A851L16168D1190
12071B09951p8009J04874p8994J68807c23645A35994j395a43468B27199c5585
12060c15080B41722J31640F2957M1127a89680A29300m6062J38936M9520I7469
12049A72397e7440C50761J1171j14527M5328M657P4416j69354D1766K58174j17475
12038A82465a4813B29730a24616B9603O184b32977J7666e9858H6962f2616q3546
12027a46162D5339b2862p045j62712A29768a13230N899c8504j35616A09412n0451
12016E8961e5387r5621B05603a13683E9960a75318N9530j31578E3256A0288b7063
$$ plain form
12004 319204 11068 40423 56495 -115492 -154440 335444 91091 201022 206460 218591 141664
11993 141664 136370 198664 -358877 290875 154675 411908 94998 171675 268890 72946 -209084
11981 -352474 56300 -68761 18129 -155699 -45482 -21178 98599 -166706 152826 -168028 -137210
11970 -137210 -21406 318657 38954 -73132 163146 -87782 87548 -55813 -102051 -201398 -8502
11958 127469 125354 -91941 79204 -247229 -106617 109223 -347115 123793 122136 148490 38599
11946 234303 72039 212377 -211242 -17909 -79051 197956 -206117 294244 -229336 -6320
11935 215405 -36295 -74909 -93108 107452 172712 -26080 -279830 -43586 -171656 -221943 -71301
11923 -81564 -5426 -41074 -75728 113304 -262450 -15995 144276 -186122 187834 -127222 -214506
$$ packed form
12004C19204A1068K9355J6072a15492l8948C35444I1091J09931N438J2131p6927
11993A41664n294O2294c58877B90875j36200K57233I4998P6677R7215G2946b09084
11981c52474E6300f8761A8129a55699d5482b1178I8599a66706A52826a68028L0818
11970a37210b1406C18657C8954g3132A63146h7782H7548e5813m6238r9347h502
11958A27469k115i1941G9204b47229a06617A09223c47115A23793j657K6354C8599
11946B34303G2039J40338b11242a7909o1142A97956b06117B94244b29336f320
11935B15405c6295l8614j8199A07452O5260b6080k53750d3586j28070n0287g1301
11923h1564e426l5648l4654A13304b62450a5995A44276a86122A87834a27222q7284
$$ plain form
11912 -214506 -252893 11272 389034 -190134 501717 -42111 91154 162262 233938 -162936 58712
11900 40556 -216819 160041 215196 -342376 38072 -21949 -59430 -183766 -125753 197451 -274860
11888 265887 -342934 172509 179081 -137765 -15455 210374 126550 -91259 98832 6772 -21027
11876 82164 13578 -112530 -275874 81416 191733 34916 75140 -138671 42012 119719 -27056
11864 -135432 -134863 -281587 -48621 -62044 -173384 45634 -166987 171607 -31073 -95058 -344352
11853 -344352 -52851 -143877 141327 -321761 -41724 -159730 -281734 170299 -150001 22511
11842 -245154 -159074 160107 -423366 -45187 36211 -242663 -17959 218710 -299783 -115947
11831 -320718 -48514 134973 262153 77796 -21709 56026 125346 28090 -32708 49124 -237764
$$ packed form
11912b14506l8387A1272L77762a90134E01717d2111I1154P1108P1676a62936E8712
11900D0556b16819A60041N5155c42376C8072b1949l7481j24336N8013A97451b74860
11888B65887c42934A72509O572a37765a5455B10374q3824i1259I8832F772b1027
11876H2164A3578a12530j63344H1416J10317C4916M0224a38671D2012P7707b7056
11864a35432N69j46724d8621j3423j11340D5634a66987A71607c1073o3985k49294
11853c44352e2851r1026A41327c21761d1724j18006j22004A70299a50001B2511
11842b45154Q6080A60107d23366d5187C6211b42663a7959B18710b99783a15947
11831c20718d8514A34973J27180G7796b1709E6026O9320B8090c2708D9124b37764
$$ plain form
11819 -135479 13806 -203529 -55660 159020 85149 -99088 -131062 116501 -35346 -303574 -209185
11808 -209185 -133242 11475 58859 -135352 -290156 35322 432054 91887 184954 73337 242664
11797 242664 193851 142425 -196711 1422 -271864 235328 130323 -82254 -47052 -331328 -58434
11785 82999 -152522 66174 41574 383441 38715 42242 -195199 86149 -170873 -265323 -44797
11773 -229785 -63637 -72609 240460 65666 -241259 -106890 -16643 13335 90768 384702 -42524
11761 -22836 -207295 -14301 19423 -238544 -165502 -74748 294349 -106825 -98598 -34062 -64768
11750 -64768 -151909 22239 328292 84610 -510981 -2470 89523 9430 408309 116551 -1944
11738 253864 65383 -220949 23084 -280075 116457 -35040 26098 -105010 -36989 -30405 487247
$$ packed form
11819a35479A3806b03529e5660A59020p3871i9088l1974A16501c5346k68228R4389
11808b09185P5943A1475M7384a35352j54804C5322L96732I1887R3067G3337J69327
11797B42664m8813n1426a96711A422b71864B35328j05005h2254L5202k84276e8434
11785H2999a52522F6174k4600L41867C8715L527a95199H6149a70873r4450d4797
11773b29785f3637q972B40460F5666b41259a06890a6643A3335P7433K93934d2524
11761b2836j84459a4301A9423b38544P3042g4748B94349a06825Q227c4062l0706
11750f4768q7141B2239L06053H4610e10981b470H9523I430L98879A16551a944
11738B53864F5383b20949B3084b80075A16457c5040B6098a05010c6989O584D87247
$$ plain form
11726 229577 123618 91166 81213 73069 65126 74453 -72439 -30086 -232513 -39549 284845 143287
11714 143287 -100470 -274718 121316 -40639 261323 219680 23219 -126490 297187 15592
11703 41154 4974 224594 273612 240106 -319244 -2896 22010 -117238 -258774 242227 269059
11692 269059 -116903 148956 -258920 54953 -123287 31877 -80959 -21302 47730 -112444
11681 -138785 125420 -95024 -234395 388830 -45556 53548 181656 -77788 37477 29945 226151
11670 226151 180148 -95565 28956 -159034 -147971 74816 292418 129833 267445 346806 -34950
11658 4210 147420 43185 -69904 159813 173900 95707 55710 73833 -262187 -13527 -132852
11647 -132852 -127120 -286906 27031 -203148 128274 -150190 169324 -218653 114241 -94864
$$ packed form
11726B29577j05959l2452r953q144p943R327g2439c0086k02427c9549B84845j41558
11714A43287a00470j74248A21316d0639B61323m1643B3219a26490B97187A5592
11703D1154D974K19620M9018l3506c19244b896B2010a17238j41536B42227K6832
11692B69059a16903A48956b58920E4953a23287C1877h0959b1302D7730a12444
11681a38785A25420i5024j39371C88830d5556E3548J28108g7788C7477p532J96206
11670B26151m6003i5565B8956a59034J1063G4816K17602A29833J37612P9361c4950
11658D210J43210D3185f9904A59813J4087p8193l9997J8123b62187a3527j19325
11647a32852N732j59786B7031b03148A28274a50190A69324b18653A14241i4864
$$ plain form
11636 -10562 48312 -195807 269237 -128510 295883 -391330 -160885 183791 341082 -341051
11625 -162860 150856 -132552 297696 -186078 -256774 60568 215549 -251703 77389 -31448
11614 -21049 -37100 -281188 -164719 5171 305692 276306 -222452 -187516 -14962 -271623 37242
11602 182391 -104282 -279000 11444 95938 -187151 76703 36855 194694 -96607 -117292 49240
11590 -203449 153710 -27230 199791 -143946 132723 32445 -168682 330388 -324855 23131
11579 -195645 270525 51464 165571 142318 -294247 -83643 80502 -64613 346690 166820
11568 61450 -5070 215598 44344 448110 78505 238541 9660 36129 226174 -100028 222189
11556 -64070 -18105 364263 416107 45050 9619 370740 305310 285267 -218971 -93325 28901
$$ packed form
11636a0562D8312a95807B69237a28510B95883c91330a60885A83791J57291c41051
11625a62860A50856a32552B97696a86078p0696F0568J54981b51703G7389c1448
11614b1049j6051k44088J16469E171L00521k9386b22452L4936a4962k56661C7242
11602A82391a04282j74718A1444Q4494a87151G6703C6855J57839i6607k0685D9240
11590b03449A53710b7230A99791a43946A32723C2445a68682C30388c24855B3131
11579a95645B70525E1464J14107k3253b94247h3643H0502f4613C46690A66820
11568F1450e070B15598D4344M03766G8505J60036I660K6469J90045a00028B22189
11556f4070a8105C64263N1844D5050I619L61121o5430k0043b18971i3325B8901
$$ plain form
11544 131539 96721 204084 -384596 -40514 226715 -28867 -63241 59635 41078 -35363 150697
11532 -335129 -132488 -198475 36537 34881 322407 28653 -5651 4248 216372 -33089 101403
11520 154999 241779 -129407 -113970 -17709 380465 50518 34055 -197175 -193292 -214807 299170
11508 145210 247087 259598 -194367 379293 42147 279734 230599 184755 -135768 74041
11497 190105 81333 152225 289359 -74458 183594 -66444 -58257 161726 128502 -329835 -106147
11485 290255 158634 202263 -114010 148267 177388 -174056 -52531 -292104 55912 30776
11475 30776 263667 115070 -5486 206299 314249 -213395 126150 34197 93832 35028 -203647
11463 145174 229445 -67145 97398 38198 167661 291085 170542 80066 120423 335594 -207491
$$ packed form
11544A31539l4818J07363c84596d0514B26715b8867l4374E9635j8557c5363A50697
11532c35129a32488o5987C6537j656K87526B8653e651D248K12124c3089A01403
11520A54999Q6780a29407J5437a7709C80465E0518j6463a97175L883k1515B99170
11508A45210J01877J2511a94367C79293D2147K37587m9135m5844a35768G4041
11497A90105H1333P0892J37134g4458A83594f6444Q187A61726l3224c29835a06147
11485B90255j31621M3629a14010A48267K9121a74056e2531k39573E5912k5136
11475C0776K32891A15070e486B06299J07950b13395A26150C4197N9635C5028b03647
11463A45174Q4271f7145I7398C8198J29463J23424j20543H0066M0357K15171b07491
$$ plain form
11451 231692 225720 172676 219238 -88688 -48887 20977 124730 -81636 247254 67156 254233
11440 254233 250292 341146 182892 -32895 43403 242107 113034 370976 -142649 119695
11429 251978 82274 -116683 -153855 282410 -33230 -87144 -14306 288309 -31032 335099 -181403
11417 141540 78323 349435 114283 213320 -23567 -289319 220216 -70202 -189741 201636
11406 -48487 -190116 -234452 -186838 30049 -220680 -118137 -84819 -295180 -4316 -301403 16488
11394 -120143 -113128 304436 258467 -87157 89463 309903 -38032 -179336 -385402 28084 333231
11383 333231 -162086 368289 -18300 -163129 -161934 33484 203197 -94192 -86397 58621 -54592
11371 159591 -48526 -88387 -207046 -257699 -90529 -89237 -220445 -85453 -242254 62653 -108432
$$ packed form
11451B31692n972n3044M6562h8688L9801B0977J03753h1636B47254F7156J87077
11440B54233l941R0854j58254c2895D3403J98704A13034K57942a42649A19695
11429B51978H2274a16683l7172B82410c3230n3914a4306B88309c1032C35099a81403
11417A41540o3217K71112A14283R9037b3567k65752B20216g0202j19539B01636
11406d8487j41629m4336M7614C0049b20680J02543L3318k10361d316k97087A6488
11394a20143P015C04436m5969h7157H9463K20440c8032j41304k06066B8084L05147
11383C33231a62086C68289a8300j44829J195C3484J69713i4192P795E8621e4592
11371A59591d8526l9861j18659n0653i0529J292j31208h5453j56801F2653a08432
$$ plain form
11359 -110668 27097 38540 -16854 98428 199678 16427 -224257 185068 192270 -300112 152455
11347 141588 190740 -103447 99002 -44492 61616 -230091 -21388 39343 111319 -182004 -271078
11336 -271078 -56293 -156601 121450 -52727 -276265 169821 138173 168974 -269971 -172706
11326 -172706 13678 76976 261148 167922 165167 149134 153158 -280661 -40047 -179570 -2711
11314 -204232 26428 178905 85478 -179550 -157706 -42022 -239280 -170308 -318784 403727
11303 213762 222438 -184055 -45611 -161725 -5515 254342 -50782 264584 -153869 -222791 -26143
11291 -30242 72797 -234945 254705 -209550 16335 54391 155592 -44782 -80034 30897 192786
11280 192786 -99291 -77111 -261583 170270 -122329 -202341 -183254 -63083 415118 29870 299892
$$ packed form
11359a10668B7097J1443a6854I8428J01250A6427b24257A85068P202c00112A52455
11347A41588M9152a03447I9002d4492F1616b30091b1388C9343P1976a82004q9074
11336b71078e6293j00308A21450e2727k23538A69821l1648L0801b69971R7265
11326a72706A3678O3298J84172r3226k755j6033M024b80661d0047j39523b711
11314b04232B6428J52477H5478a79550K1844d2022j97258O8972j48476D03727
11303B13762Q676a84055d5611j16114e515B54342e0782B64584a53869o8922b6143
11291c0242G2797b34945B54705b09550A6335L8056J01201d4782l5252C0897J61889
11280A92786i9291K2180j84472A70270a22329q0012J9087f3083D15118B9870K70022
$$ plain form
11269 299892 -40742 -227856 -130223 -23291 148830 -138516 4894 -258499 131760 -37444 -346506
11258 -346506 61873 -264968 -202754 160325 -21170 -31421 -91370 9110 -110550 -325787 -278537
11247 -278537 13584 -140578 128282 100375 -185176 198121 -44933 -140250 -88982 183200
11236 56205 22498 -13697 331738 49958 -12562 -381752 13753 11412 60 272078 -18035 -106828
11224 -106828 -169410 -97596 -185226 59714 8262 -241520 -176786 -94082 41780 -391444 -57966
11212 -94740 57985 -149695 -194137 -41633 -17178 -236858 17419 140574 192623 -18512 -38577
11201 -38577 -290375 -13656 -386293 -275015 28393 -235687 -103359 237941 26041 -7769 -292183
11190 -292183 -119028 -193329 -117112 -91377 -282307 41514 111870 9081 -431149 -134009 279280
$$ packed form
11269B99892d0742j87114R7633b3291A48830a38516D894b58499A31760c7444l09062
11258c46506F1873b64968O2214A60325b1170j0251n9949I110a10550k15237M7250
11247b78537A3584a40578A28282k7907a85176A98121d4933r5317N1268A83200
11236E6205B2498a3697C31738D9958a2562l69190A3753k341F0K72018a8035q8793
11224a06828o2582P1814q7630E9714H262b41520O4734Q2704D1780c91444e7966
11212i4740E7985a49695m4442d1633a7178k19680A7419J23155N2049a8512k0065
11201c8577k51798a3656l72637J11278B8393b35687a03359B37941B6041g769k84414
11190b92183a19028p4301P6217K5735j90930D1514P0356I081d31149a34009B79280
$$ plain form
11178 -153735 -282055 -24164 -106474 -13068 -304480 50248 128882 -136302 -259106 -177660 -128632
11167 -128632 144104 220660 -139087 -259771 66200 -94254 -190949 180886 -359579 -139844
11156 105649 -234636 -123151 -217866 112174 510207 17579 -30771 -65396 -92875 -39490 42642
11144 -69473 77773 272473 -144480 -225691 -147493 108712 -218786 162164 37354 -70430 83521
11132 61425 316922 3971 -50375 -228643 237847 119830 -67576 -215429 68157 -118131 -82929
11121 -82929 -229855 -395615 73541 442545 -75081 225596 70655 63662 20850 -104116 169969
11109 -7286 -21456 197600 77756 -138712 -102083 220595 -20133 -128638 -21355 56728 268783
11098 268783 49349 47306 97091 29199 -120707 13506 130786 367366 -108975 -54895 424393
$$ packed form
11178a53735j28320b4164q2310a3068k91412E0248P8634a36302j22804Q1446M9028
11167a28632A44104P6556a39087j20684F6200i4254r6695A80886c59579a39844
11156A05649b34636J11485r4715A12174L98033A7579c0771l4625k7479c9490D2642
11144f9473G7773J94700a44480q1211P8198A08712b18786A62164C7354g0430H3521
11132F1425K55497C971e0375j78268B37847j18017f7576j47853F8157a18131L5202
11121h2929j46926j65760G3541L69004g5081B25596G0655o993B0850a04116A69969
11109g286j4170A97600G7756a38712L6629B20595b0133j08505b1355E6728K12055
11098B68783D9349k043M9785B9199a20707A3506J17280K36580a08975N4080D24393
$$ plain form
11086 254203 174609 102169 247276 -111092 246819 317285 -198220 -117126 99292 -285788
11075 235977 450643 458466 25464 193150 -274274 118305 156725 215084 183369 -20589 162696
11063 23571 9863 -311169 -22241 397201 150702 329496 126182 246098 -41375 446777
11052 392367 207593 49157 118501 386156 3571 322373 189599 573555 156454 275918
11042 275918 202247 544061 513954 353368 714504 488395 603660 205981 340632 274959
11032 274959 574916 581731 595653 638919 733958 557198 822541 409227 393936 586803 399057
11021 399057 412322 474494 367777 470014 740422 360125 582610 420328 565044 324527
11011 324527 527621 459921 502546 626969 460590 573579 728986 473794 669663 1050894
$$ packed form
11086B54203p9594p2440J45107a11092B46819P0466a98220Q1094I9292b85788
11075B35977K14666P823B5464J67686b74274A18305L8420N8359l1715b0589A62696
11063B3571I863c11169b2241C97201A50702J78794A26182J19916d1375D46777
11052C92367j84774D9157O9344K67655C571L18802j32774L83956A56454J19464
11042B75918p3671L41814l0107j60586L61136k26109J15265B05981J34651o5673
11032B74959K99957O815J3922M3266R5039j76760K65343D09227j5291J92867j87746
11021C99057J3265O2172j06717J02237K70408C60125K22485j62282J44716k40517
11011C24527K03094o7700M2625J24423j66379J12989J55407k55192J95869L81231
$$ plain form
11001 1050894 480362 623532 475646 682273 558084 633459 408243 800821 350729 539702
10991 539702 601231 448419 683452 274101 403693 623136 524326 437041 556225 314834
10981 314834 615116 564187 582828 559972 513501 592640 445287 547307 656862 689439 762347
10970 762347 781085 515494 410375 881439 783445 1100783 993970 942622 711956 1030347
10960 1030347 1085479 1064131 1296464 1271405 1731327 1567453 1802864 2158943 1931663 2176579
10950 2176579 1855200 1806601 1797697 1805155 1765885 1397189 1643041 1674005 1534851 1712289 1356643
10939 1356643 1180627 1310319 1723598 1511367 1763707 1406295 1406527 1492717 1025735 925578
10929 925578 641365 534115 267179 288895 536555 321666 124873 47298 318696 -90730
$$ packed form
11001A050894D80362J43170j47886K06627j24189P5375k25216L92578C50729J88973
10991E39702O1529j52812K35033B74101J29592K19443r8810q7285J19184k41391
10981C14834L00282n0929J8641k2856m6471P9139j47353J02020J09555L2577P2908
10970G62347J8738k65591j05119M71064r7994L17338j06813n1348k30666L18391
10960A030347N5132k1348K32333k5059M59922j63874K35411L56079k27280K44916
10950B176579l21379m8599q904P458l9270l68696K45852L0964j39154J77438l55646
10939A356643j76016J29692M13279k12231K52340l57412K32Q6190m66982j00157
10929I25578k84213j07250k66936K1716K47660k14889A24873D7298K71398i0730
$$ plain form
10918 31920 -29553 -105950 184180 38034 -211878 140816 337679 -105887 7174 -314951 38232
10906 77324 -16439 57606 332455 226230 -424093 -24768 85017 734 60323 196435 235962
10895 235962 88087 486 -105030 -16695 3158 -22459 -32824 208318 -111513 -45771 98989
10883 42943 -132842 94724 291733 19800 -93898 181180 8969 28266 -94102 240312 -215712
10871 -164107 -226138 177889 -90269 -29564 112852 36163 -21497 127245 -8440 -92517 -108793
10860 -108793 91370 -27464 -92367 -171873 -293115 -177280 -102270 46579 -159854 150526 -387243
10848 -102977 289322 -238303 135099 13592 -23843 -11722 189597 69666 71209 -172504 157943
10836 305423 -54876 115783 123494 328697 39769 -232825 -261036 -325916 -570133 -49927 -3144
$$ packed form
10918C1920b9553p6397A84180C8034b11878A40816J96863a05887G174c14951C8232
10906G7324a6439E7606K74849j06225d24093b4768H5017G34N9589J36112L9527
10895B35962H8087D86a05030a6695C158b2459j0365B08318a11513d5771I8989
10883D2943a32842I4724J97009A9800i3898A81180H969J9297i4102B40312b15712
10871a64107o2031A77889i0269b9564A12852C6163b1497A27245h440q4077j6276
10860a08793I1370b7464o4903p9506j21242J15835P5010D6579a59854A50526c87243
10848a02977B89322b38303A35099A3592b3843a1722A89597F9666J543a72504A57943
10836C05423e4876A15783P711K05203C9769b32825k8211o4880k44217d9927c144
$$ plain form
10824 58279 -71624 -339200 138049 -204336 179927 85214 -302688 15818 -97053 -296722
10814 -296722 -165284 161330 -223060 -77128 64658 -32355 -24599 -87364 36487 -96242 -53001
10803 -53001 -381883 86455 206049 -174156 174787 -53549 189190 53430 -179653 -278315
10793 -278315 132189 -207332 -129078 -184254 237703 -432696 -70105 -64121 561 -140767 -145976
10782 -145976 284812 -279737 -173637 133037 -194537 -30448 -42882 -155406 296121 -149151
10771 -59969 -218559 -347423 258785 82325 -285801 -314337 124825 -107854 -131570 -239441
10761 -239441 -147632 47527 104808 -89313 9108 152885 -58167 13265 -132409 -330476 327867
10749 149510 -3372 53149 52933 116691 -104402 -113980 -1731 43752 -513526 146178 -71470 -964
$$ packed form
10824E8279g1624k67576A38049b04336A79927H5214c02688A5818i7053j99669
10814b96722J31438A61330b23060g7128F4658c2355P756o2765C6487i6242M3241
10803e3001l28882H6455J19594a74156A74787e3549A89190E3430a79653r8662
10793b78315A32189b07332P8254n5176B37703d32696g0105N984E61a40767n209
10782a45976B84812b79737J06100A33037a94537c0448j2434j12524B96121a49151
10771e9969j58590j28864B58785H2325b85801k8536A24825a07854k3716j07871
10761b39441R1809D7527N7281h9313I108J43777e8167A3265a32409j98067C27867
10749A49510c372E3149k16O3758a04402r578a731D3752e13526A46178g1470i64
$$ plain form
10736 150617 -147313 -286634 -192789 -130314 -118027 145445 -64886 31906 207204 -10267 360322
10724 229388 -1984 83018 111958 134935 2604 -312291 84009 71274 -72733 -163507 257507
10712 -370599 -204735 -261481 -249441 -120166 -159473 -142722 -181210 -23692 98683 -87314 -23859
10700 143111 -324756 85158 -137985 58495 49203 -303344 139743 -93156 170465 -36013 -78819
10689 -78819 37719 -231384 -235595 -259276 -216036 100101 -356086 -181615 267815 129251 56549
10677 -318758 -80585 -8786 -109573 -39456 -134706 -128603 -278342 -303109 -184299 202667 23400
10665 -125965 -24541 -212176 225469 -163484 -105289 247532 -9364 -123367 -213892 -24202 44018
10653 -338577 -66461 -87019 -81368 -196553 -216334 -116909 -167852 -90195 -513766 22401 34341
$$ packed form
10736A50617a47313j39321R3845O2475J2287A45445f4886C1906J75298a0267C60322
10724B29388a984H3018K8940K2977B604c12291H4009j2735g2733r0774B57507
10712c70599J65864n6746J2040a20166l9307J6751l8488b3692I8683h7314b3859
10700A43111c24756H5158a37985E8495r292c03344A39743i3156A70465c6013m2806
10689g8819C7719b31384m211k3681M3240A00101c56086J74471B67815A29251E6549
10677c18758h0585h786j00787c9456r5250O103j49739k4767J18810B02667B3400
10665a25965b4541j87635B25469a63484N8195B47532i364j14003r0525b4202D4018
10653c38577f6461k0558N651j15185j9781R9425n0943P7657m23571B2401J1940
$$ plain form
10642 34341 -90513 -128744 -25877 -122072 -100206 -57873 -19870 179104 64402 -94159 -72099
10631 -72099 31457 -59272 -157147 15968 155221 -42665 -365023 -79403 -157925 -187624 72723
10619 102784 -292416 -67092 -25368 -622376 -106909 -71266 8987 118440 -49197 -135034 -132410
10608 -132410 6005 230936 -237517 -74061 -6975 73598 -407187 -112823 -128845 -42007 -259401
10597 -259401 -66925 56748 -321695 -151557 -49893 -8737 -160262 -57027 -214289 -315672 -309991
10586 -309991 -163262 -392594 97724 -148730 -319364 -165102 132916 150419 42180 -48378
10575 -123702 -166150 46259 96726 -27209 115641 41211 -135533 -260637 100581 -112819
10564 -120512 -93309 -384857 -84011 -60143 422793 -80186 7004 15865 15583 -105418 -82503 97130
$$ packed form
10642C4341i0513l8231b5877r6195K1866M2333a9870A79104F4402i4159K2060
10631g2099C1457e9272r7875A5968J39253d2665l22358g9403p8522k9699G2723
10619A02784b92416f7092b5368n97008a06909L5643H987J09453d9197q5837K624
10608a32410F005K24931b37517g4061f975G3598d07187a12823j6022d2007k17394
10597b59401f6925E6748c21695a51557d9893h737j51525e7027j57262j01383N681
10586c09991J46729k29332I7724a48730j70634J54262A32916J7503D2180d8378
10575a23702m2448D6259N0467b7209A15641D1211a35533j25104A00581a12819
10564a20512K7203k91548h4011K3868D22793h0186G004Q861k82a05418K2915I7130
$$ plain form
10551 -486367 59534 125556 60439 18202 109964 -15891 62927 -35279 129151 85285 -115620
10539 187614 -123414 -84677 -145199 -458876 119751 172017 -123410 135337 -131714 -353759
10529 -353759 -82826 -132331 281714 -52930 34803 99181 -93943 -255046 312732 -357057 455934
10517 11319 19156 32168 -11428 323204 6934 -44003 78510 -51894 -93234 -27011 234662 89434
10504 -219139 52958 100834 -207340 169079 130088 -332765 -70847 -343809 435408 57432
10493 41484 -275193 -1537 -169992 236629 -216621 81907 -184946 -160226 -169198 -114104 -294258
10482 -294258 -2919 -402091 -74708 -217194 -80280 244962 -246329 -153763 -178999 -5423 -281507
10471 -281507 -74742 363190 207005 141552 263841 121895 -424414 251788 -33711 75249
$$ packed form
10551d86367E9534O6022F0439A8202R1762a5891F2927c5279A29151m3866a15620
10539A87614a23414L8737o0522l13677A19751N2266a23410A35337a31714k22045
10529c53759h2826m9505B81714e2930C4803O4378i3943j61103C12732c57057D55934
10517A1319P837J3012a1428C23204F934d4003G8510e1894m1340b7011B34662H9434
10504b19139E2958M7876b07340A69079l8991c32765g0847k72962D35408E7432
10493D1484b75193a537j68455B36629b16621H1907a84946K4720q972N5094j80154
10482b94258b919l99172g4708j42486h0280B44962b46329R2566k5236e423k76084
10471b81507g4742C63190j56185o5453J22289A21895d24414B51788c3711G5249
$$ plain form
10460 -4747 240330 649106 454540 308145 250864 404203 61150 -211272 149881 152300 -58256
10448 -169800 311158 -53194 213194 -217642 -223675 47821 -275274 -299583 -215510 221844 -188670
10436 41070 49662 -287848 -136152 -167863 -52224 53235 -83116 -241371 82138 -165201 289766
10424 133275 -207547 6558 -3129 200540 30886 -136454 -251903 -121488 -116558 -422405 -57578
10412 -80474 229319 84166 -304496 194750 -113348 110619 146702 -288663 6247 -136983
10401 -213780 260022 -66061 -352964 -112309 -31004 -168484 31157 -230980 -232493 137527
10390 -290620 -301569 -269259 -76430 2319 85848 72462 315248 -52794 -306861 -96795 -418779
10379 -418779 -145179 -204306 92302 -287067 138910 -43745 134379 161429 -301486 175138
$$ packed form
10460d747B40330M08776j94566j46395n7281J53339F1150b11272A49881K419e8256
10448a69800C11158e3194B13194b17642o033D7821b75274k4309Q4073B21844a88670
10436D1070Q592b87848a36152l1711e2224E3235h3116j58255H2138a65201B89766
10424A33275b07547F558c129B00540C0886a36454j15449a21488M930l05847e7578
10412h0474B29319H4166c04496A94750a13348A10619L6083b88663F247a36983
10401b13780B60022f6061k86903a12309c1004j37480C1157b30980j513A37527
10390b90620j0949L2310g6430B319Q3529j3386K42786e2794k54067i6795l21984
10379d18779a45179n9127I2302b87067A38910d3745A34379K7050c01486A75138
$$ plain form
10368 96922 -128879 -73464 54420 326598 -19751 61499 451246 51480 323436 195399 37501
10356 466554 173822 450648 445985 -49624 109001 222230 151285 747498 678332 -198763
10345 232402 84248 343732 197767 118589 -4223 407063 201368 -70446 26907 264896 390225
10334 390225 314035 705632 493538 -97389 490973 382410 90084 349590 323860 181714
10324 181714 119726 441517 46699 98003 99007 48451 116072 112209 263140 110023 -86082
10312 179705 150043 88239 296080 -25414 330139 -238188 44223 -229122 247195 54471
10301 -214916 -35324 24055 232300 91055 -79777 -90297 -11221 164458 -39764 -126914 225364
10289 -231473 182682 -251799 35204 -44365 228572 41686 -378771 153438 -111673 106600
$$ packed form
10368I6922a28879N5415E4420K72178a9751F1499L89747E1480K71956j28037C7501
10356D66554A73822K76826m663d9624A09001J13229p0945N96213o9166a98763
10345B32402H4248K59484j45965p9178d223D07063B01368g0446B6907K37989J25329
10334C90225p6190L91597k12094i7389D90973j08563I0084K59506k5730j42146
10324A81714o1988L21791D6699N1304J004D8451O7621l863J50931A10023h6082
10312A79705k9662o1804K07841b5414C30139b38188D4223b29122B47195E4471
10301b14916c5324B4055K08245I1055g9777j0520a1221A64458c9764q7150B25364
10289b31473A82682b51799C5204d4365B28572D1686c78771A53438a11673A06600
$$ plain form
10278 -16570 53749 10734 -42679 -18627 -242273 84476 -265923 80231 -50730 136083 -229293
10266 267317 -253822 11628 -329350 46014 -46524 -79827 -40016 183295 94151 25162 133948
10255 133948 -112793 -39649 362507 -179879 -224604 -71556 -74539 -165168 -245659 139732 420673
10244 420673 -52171 85473 156492 283777 141935 367397 98575 -236017 228764 107756
10233 115651 73147 233004 -84649 -118762 68892 201018 -75453 28036 -152476 17955 26396
10222 26396 74981 -82488 -151756 170876 153537 -250904 83592 -262761 -111009 10409 -9262
10210 436957 -345722 -185903 200718 66976 -172939 -187131 107389 -4030 -420706 -15686
10199 49617 -167302 376868 -246644 -143124 -194885 67631 -133231 -238050 -254955 -346785
$$ packed form
10278a6570E3749A0734d2679a8627k23646H4476b65923H0231e0730A36083b29293
10266B67317b53822A1628c29350D6014d6524l3303L9811A83295q9144B5162J08786
10255A33948a12793c9649C62507a79879m4725g1556k983r0629q0491A39732K80941
10244D20673e2171H5473P1019J27285j41842K25462I8575b36017B28764A07756
10233A15651m2504J59857h4649l4113F8892J32126g5453B8036a52476A7955Q441
10222B6396M8585h2488o9268A70876j7339b50904H3592b62761a11009A0409i262
10210D36957c45722J59819B00718F6976a72939j4192A07389d030m16676a5686
10199D9617a67302C76868b46644J03520n1761F7631a33231j04819j6905r1830
$$ plain form
10189 -346785 -328927 189936 -249830 -222628 19282 133290 -33575 -67842 -333709 348099
10178 -24244 181672 -463793 172600 -95930 129413 -84003 -18605 -130480 -234291 240711
10167 -38291 -111525 -28320 -267101 375013 -111459 -229261 -262692 -355346 107448 -373147
10156 33464 10891 -210766 -402271 -221650 207194 -98711 273555 29916 -131859 -85662
10146 -85662 -33359 159209 -109112 -349680 -103859 250170 -324065 -269061 -79705 76034
10135 65095 -350198 -58112 -55157 -35856 -81818 -123737 68413 403409 270066 70057 2270
10123 124625 -288701 -148642 126556 -147121 -155483 -25018 -17922 -340703 -119484 10505 -252065
10111 -284149 -472606 55126 161285 -168770 -24819 53784 -96660 253548 -114697 -15658
$$ packed form
10189c46785J7858A89936b49830K7202A9282J14008c3575l4267k65867C48099
10178b4244A81672d63793A72600i5930A29413h4003a8605j11875j03811B40711
10167c8291p3234b8320k38781C75013a11459j17802l3431r2654A07448c73147
10156C3464A0891b10766j91505J80621B07194i8711B73555B9916a31859M6197
10146h5662c3359A59209a09112k40568a03859B50170c24065N5004g9705G6034
10135F5095c50198e8112K955J9301m5962m1919F8413L34996j33343G0057B270
10123A24625b88701J40059A26556a47121q362b5018P096l22781a19484A0505b52065
10111b84149j88457E5126J06159a68770b4819E3784i6660B53548a14697a5658
$$ plain form
10100 70902 -108235 253128 -226453 -206763 -110744 -386729 -255935 -108426 -368380 202745
10089 -295309 -69771 -173461 -391677 -165346 -10128 -15637 89356 8967 152394 25058 -33054
10077 56511 140022 106082 -134853 -7455 -260698 372 179255 107993 -77381 -186901 -126958
10066 -126958 370620 430830 72566 107486 356028 -65404 -36908 -135955 -159193 101482 -242303
10054 -148790 -57585 -84485 -47409 71481 -5999 29225 54738 -135340 -74757 -116011 -269733
10043 -269733 -279574 6801 -107864 94912 269959 46426 -157162 -103376 332279 189080 -72101
10031 -125378 -319405 -256169 451975 -61068 -213016 56707 11572 149554 -115948 -406678
10021 -406678 -112474 -404017 -114669 37219 -14000 2855 -126681 -202967 -193700 -7854 -118400
$$ packed form
10100G0902a08235B53128b26453J9690R6019k75985J30794a08426k59954B02745
10089b95309f9771j03690k18216a65346a0128n509H9356H967J43427B5058c3054
10077E6511Q3511l3940a34853g455k53243C72J78883p1262g7381j09520N9943
10066a26958C70620O0210G2566L4920K48542f5404K8496r9047k3238A01482b42303
10054a48790e7585k6900L7076G1481e999B9225K5513a35340O0583m1254j53722
10043b69733r841F801a07864I4912J75047D6426a57162N3786C32279j43199g2101
10031a25378j94027O3236D51975f1068j51948E6707A1572J37982a15948k90730
10021d06678a12474k91543a14669C7219a4000B855a26681p6286R267g854j10546
$$ plain form
10010 -118400 60563 -105538 -74524 -134427 -156876 -114661 -84750 -222639 -3604 179582 81370
9998 -37533 -193669 -118144 -213290 -213576 282426 390947 -314805 -326442 178876 -378206 126071
9986 -194658 -23087 44494 -285898 -56134 -127014 379412 -35955 -112802 -190025 -21853 -406358
9975 -406358 -94826 -282382 -283665 -22014 -184641 172579 158396 19433 53585 177135 -87045
9963 -199386 145190 27920 -222464 121122 -172769 -153607 -298311 84947 25712 72013 -242328
9951 -183215 53945 -276456 -288160 466943 -221907 -89564 -38050 -81872 121239 151961 -92639
9939 -36340 -168004 30869 56138 -434797 48811 -76904 25534 -167103 -24882 -66027 12792
9927 91727 -32234 242197 -178736 -87170 62684 450992 -44872 -2608 13233 -195831 327333
$$ packed form
10010a18400F0563a05538L1014n9903k2449M2215K9911j37889c604A79582H1370
9998c7533j56136P5525r5146k86B82426J08521c14805j1637A78876c78206A26071
9986a94658b3087D4494b85898e6134p0880C79412c5955p6847p7223b1853l84505
9975d06358i4826j87556j283b2014j62627A72579j4183A9433L4152J23550h7045
9963a99386A45190B7920b22464A21122a72769J9162j44704H4947B5712M6301b42328
9951a83215E3945b76456j1704D66943b21907h9564c8050m3822A21239L0722i2639
9939c6340j31664C0869K5269d34797D8811g6904B5534a67103b4882m1145A2792
9927I1727c2234B42197a78736h7170F2684L88308d4872b608A3233a95831C27333
$$ plain form
9915 217786 -52482 -128384 -66765 -152189 -248548 -374359 -138799 112038 -61524 -233423 40739
9903 -396844 17603 13485 -209587 211113 -317459 -236658 -26831 51151 -352878 -91660 -128334
9892 -128334 13238 -80257 -239721 -89415 -176513 -75957 -172077 -114465 136784 -43737 119849
9880 349243 -259006 -143946 140208 -63418 143907 110935 -94572 123090 -10525 -167865
9870 -167865 -214227 -261867 98042 -56976 -484936 -347516 56225 -124527 -138848 6126 -21256
9858 -256848 -215677 -43029 33224 205148 -2705 -15076 -367229 120068 -48175 -397769 -248154
9847 -248154 291294 -193235 135777 253063 -161047 239088 -236339 283555 71336 79607
9837 79607 -48837 -64233 -143823 -124355 -52047 -21668 44792 -314645 -89988 -141276 240830
$$ packed form
9915B17786e2482p5902O1619q5424r6359j25811a38799A12038f1524j71899D0739
9903c96844A7603m118b09587B11113c17459Q0801b6831E1151c52878i1660l6674
9892a28334A3238h0257j59464h9415q7098g5957r6120N7612A36784d3737A19849
9880C49243b59006J15060A40208f3418A43907l2972i4572A23090a0525j57340
9870a67865m6362m7640I8042e6976m27960J37420E6225a24527j4321F126b1256
9858b56848M1171d3029C3224J71924b705j2371l52153A20068d8175l49594J49615
9847b48154B91294a93235A35777J17286a61047B39088b36339B83555G1336Q271
9837G9607d8837j5396p9590J9468e2047b1668D4792c14645h9988n1288B40830
$$ plain form
9825 -37186 124351 -4099 -31876 18329 -84431 11752 -173083 -33513 -143229 -123805 199529
9813 -18692 90489 -415541 -333568 -169321 -109950 -290719 256566 -218747 -322358 137593
9802 108820 -417967 -119402 -324597 -74095 -78479 -42639 -163753 103552 58103 -472672 -46877
9790 -68072 293017 -155663 -196614 -117547 157049 416 8960 23117 -138461 -71708 90685 -287970
9777 -76364 -184769 -57165 14076 57490 -205773 47012 -128288 -110160 154957 -180257 -12022
9765 -159159 88659 -111120 -205273 -54447 -197761 -129158 61458 120295 248136 -281026 117139
9753 -149455 153724 28470 -98877 -122582 -49227 -35627 -106924 114220 86684 -278113 -463377
9742 -463377 75876 9907 -289574 287339 -199841 -218533 -165314 -101553 140353 -60141 -240966
$$ packed form
9825c7186A24351d099k7777A8329h4431A1752a73083c3513j09716J9424A99529
9813a8692I0489d15541Q1973J64247N9371j80769B56566b18747j03611A37593
9802A08820d17967a19402k05195g4095m384L5840j21114A03552m5449d72672d6877
9790f8072B93017a55663m0951P9067A57049D16Q544J4157a38461O6753I0685b87970
9777g6364j08405e7165A4076M3414b05773D7012a28288J8128A54957a80257a2022
9765a59159H8659a11120r4153e4447j43314O8603F1458N8837J27841b81026A17139
9753a49455A53724B8470i8877k3705d9227J3600p1297A14220k7536b78113j85264
9742d63377G5876I907b89574B87339a99841j8692N3219O3761A40353f0141j80825
$$ plain form
9731 -240966 -433886 28511 73228 -246208 -382757 106200 -60980 -79727 -70057 -286589 -72773
9719 54748 -90595 15296 -3471 375851 -139943 11547 102817 -263320 -110672 -79881 -357378
9708 -357378 -122609 -296582 3710 116343 75736 -97999 -187136 158875 207187 -198194 179138
9696 -369344 -194893 102528 69674 -4654 -184592 95452 213590 130235 -177085 36307 58783
9685 58783 -209886 131334 -148144 -119894 -12056 -247361 -451701 -315393 -451338 -219935
9674 131650 -62829 -22307 -170947 165364 -422401 21805 -41542 -299662 -220340 -129433 -212073
9663 -212073 -39163 -212145 -49549 179153 -32715 8020 42409 145524 -231535 -24132 -207123
9652 -207123 -125085 -150855 -140394 -255550 162156 -192767 -123569 -131352 150386 -72500 -157371
$$ packed form
9731b40966j92920B8511M4717b46208j36549A06200f0980j8747R670k16532g2773
9719E4748i0595A5296c471C75851a39943A1547R1270b63320a10672L0791k77497
9708c57378a22609j73973C710J12633m0607i7999q9137A58875M8312a98194A79138
9696c69344J74451A02528l2854d654j79938I5452J18138q3355a77085C6307K2476
9685E8783b09886A31334a48144K8250a2056k35305k04340J36308j35945b19935
9674A31650f2829b2307j48640A65364d22401B1805d1542k58120P9322R0907q2640
9663b12073c9163j72982d9549A79153c2715H020L4389J03115b31535b4132j82991
9652b07123Q2038k5770J0461j15156A62156a92767O9198p783A50386g2500q4871
$$ plain form
9641 -157371 -160908 -32627 300871 -22184 -74564 5486 -199044 -202185 -146848 113862 3521 -41625
9628 -188551 -100615 67400 -42450 -108561 -187141 -66534 -290991 -194049 132978 198986 -139203
9616 -78127 132163 -178831 -215408 -325787 -144089 -259894 -40034 23837 -245377 -149231 -217104
9605 -217104 129621 -18365 -18863 -60229 -368396 55771 101973 -139244 -230348 138962 131340
9594 131340 30533 82807 -54118 18039 2945 -293151 -116662 150306 -30520 174297 228402
9583 228402 136293 -232877 26532 -263923 -438880 -172855 -172847 58893 -57146 -35442 -362996
9572 -362996 2960 32871 145125 -175992 -124232 43732 -130616 -286920 -227289 20089 -92093
9560 -38210 -93653 -90280 27650 -323652 -19512 19586 62868 -114266 -155879 -123290 -331096
$$ packed form
9641a57371l537c2627C00871b2184n2380E486a99044l141N5337A13862C521d1625
9628a88551Q7936F7400d2450o6111p8580f6534k24457R6942A32978O6008a39203
9616g8127A32163a78831l6577j10379a44089j15805d0034B3837b45377R6146o7873
9605b17104A29621a8365m98m1366l08167E5771M6202a39244r1104A38962p622
9594A31340C0533N2274e4118A8039B945b93151a16662A50306c0520A74297N4105
9583B28402r2109b32877B6532b63923j74957a72855QE8893e7146K1704l27554
9572c62996B960K9911J12254a75992N1760D3732a30616j56304N9631B0089i2093
9560c8210n5443L373B7650c23652a9512A9586M3282a14266m1613L2589k07806
$$ plain form
9549 -331096 12547 35072 -104333 -287141 -55946 -211433 -266310 -397731 -988 -255731 -222090
9538 -222090 -52389 151731 -93895 -187292 14770 -351654 160041 63374 22560 186394 -55689
9526 56926 210124 -98311 -162721 -344208 -172431 -163968 -65761 146193 382393 495 74078
9515 74078 247779 -124231 -74119 -123284 -175196 -126696 -134185 259994 69045 233102 179636
9504 179636 -241800 -332910 114682 -22483 -86260 -249042 -154257 -240176 -57819 -466765 -79112
9492 -165935 -218656 -269705 534614 -15016 -101028 158193 15365 -221343 -101310 224325 142744
9481 142744 -223908 -334255 41830 37231 121943 -39437 -1863 -30588 -143934 23794 -435985
9469 9429 -129699 -246509 225194 -134032 13991 -78614 -76472 -76354 65533 -92173 -102213 -104859
$$ packed form
9549c31096A2547K2525a04333j82808e5946j55487n4877j31421i88k54743L3641
9538b22090e2389A51731i3895r3397A4770c51654A60041F3374B2560J63834e5689
9526E6926J53198i8311o4410j81487J71777Q463f5761A46193K36200D95P3583
9515G4078J73701a24231N0112m9165n1912M8500p489B59994F9045J64057n3466
9504A79636b41800r1110A14682b2483o3777j62782R4785q5919e7819m08946g9112
9492a65935n2721n1049E34614a5016q6012A58193A5365b21343a01310B24325q1581
9481A42744b23908j10347D1830m599Q4712c9437a863k8725j13346B3794d35985
9469I429a29699j16810B25194a34032A3991g8614K142J18F5533i2173j0040k646
$$ plain form
9457 -104859 291645 102032 -59820 -203939 150999 120034 124205 107304 205658 -91168 3506
9445 -315305 -82938 -230390 49761 -145572 -180291 -2079 -156157 -70572 52149 113632 116548
9434 116548 -210649 -236804 -378073 195238 -114648 -56837 -2543 -168759 -117221 -32970 -81932
9423 -81932 -381688 -193175 -29170 -377856 -213894 -272531 -277224 -36613 -145595 -159447 -107757
9412 -107757 -319207 -229375 -17348 53029 22511 44966 -94609 -26962 -448333 -283975 -161161
9401 -161161 -85411 -132089 -160305 -182231 -65802 -106483 105579 -224190 -142202 -60523 84084
9389 88307 157224 -43280 -179141 -149999 -52405 -69591 -238071 -179020 195359 73083 -216329
9377 234645 68381 -61624 82847 104943 -222117 85579 -130276 -45039 -77309 135297 131086
$$ packed form
9457a04859B91645A02032e9820j44119A50999l0965M171j6901R8354i1168C506
9445c15305h2938j47452D9761a45572l4719b079j54078g0572E2149O1483K916
9434A16548b10649k6155j41269A95238a14648e6837b543j66216N1538c2970m8962
9423h1932k99756J88513b9170l48686J63962n8637m693c6613j08982j3852N1690
9412a07757k11450Q9832a7348E3029B2511K2455i4609b6962m21371J64358J22814
9401a61161P5750m6678k8216k1926f5802m0681A05579b24190Q1988f0523H4084
9389H8307O8917d3280j35861K9142e2405j7186j68480N9051A95359G3083b16329
9377B34645F8381f1624H2847K2096b22117H5579a30276d5039l2270A35297m211
$$ plain form
9366 131086 192998 -8743 -117488 -196758 31977 68355 150899 -423915 158771 28459 -359717
9354 -205791 73428 -225116 -285470 119633 -253322 -192139 -265994 -211369 65807 17336 45974
9343 45974 254230 -165621 194415 24561 -119656 318610 28737 -287362 -188908 -64428 -95249
9332 -95249 213790 31536 -27411 -109433 -227787 13405 -120981 -98803 -34607 82613 -102345
9320 17961 -274611 -262034 170602 -91625 -94528 -193518 -269047 130737 -38341 245642 -28199
9308 57732 -56023 53941 193367 90554 -240609 -40870 -113374 -171 403208 -24588 166225
9296 -294197 57004 51656 -44951 -84287 -31464 -185491 -27224 -43548 -228750 -191964 -381835
9285 -381835 -94734 -45480 -371605 128365 -261623 -222484 -150899 193756 26761 -110414 298086
$$ packed form
9366A31086O1912h743j08745p9270C1977L6378Q2544d23915A58771B8459c59717
9354b05791G3428b25116o0354A19633b53322O1183p3855N4625F5807A7336K8638
9343D5974K08256a65621A94415B4561a19656C18610B8737b87362R8454f4428l0821
9332i5249B13790C1536b7411q2022j18354A3405a20981K2178c4607H2613a02345
9320A7961b74611J2577A70602i1625k903r8990p5529A30737c8341B45642b8199
9308E7732e6023E3941J39426I0554b40609d0870p2504a71D03208b4588A66225
9296b94197E7004n348d4951l9336c1464j54027b7224j6324j85202L6786j89871
9285c81835i4734d5480l26125A28365b61623L9139P1585A93756B6761a10414B98086
$$ plain form
9273 -213134 -107360 -40894 -44716 -17343 64197 -74607 143561 -184205 -22802 -98487 -170884
9262 -170884 -330839 148959 -159098 134097 -184646 -126061 105924 -243549 62820 124074
9252 124074 -121673 -218900 -181858 -81897 143821 126611 86732 -39167 31547 -139648 -289774
9241 -289774 58141 231184 86562 98304 -129498 -227664 -343302 283330 18042 139230 -62967
9229 -95612 -108673 -120821 175105 301853 -95404 99397 -83572 -352643 115118 96483 129100
9218 129100 -374032 -9524 271385 34617 -224732 170638 -161545 -204842 -116195 113576 -342205
9206 -212462 -50057 -127931 -118134 -10717 31931 84790 -147574 128053 -69262 705 99292 -28291
9193 711 -107993 -367084 164863 -150340 213034 -239489 -149793 220828 -17797 -141609 73111
$$ packed form
9273b13134J05774d0894l822a7343F4197g4607A43561a84205b2802p5685p2397
9262a70884j59955A48959a59098A34097a84646N8585A05924b43549F2820O1254
9252A24074a21673r7227L7042h1897A43821j7210l9879c9167C1547a39648j50126
9241b89774E8141J73043H6562J1742a29498r8166j15638B83330A8042J21188f2967
9229i5612j3061j2148A75105J26748i5404I9397h3572k69071A15118j8635L2617
9218A29100c74032i524B71385C4617b24732A70638a61545m3297Q8647A13576c42205
9206b12462e0057p7874R797a0717C1931N2859a47574A28053f9262G05R8587b8291
9193G11a07993k59091A64863a50340B13034b39489Q9696B20828a7797j23812G3111
$$ plain form
9181 74870 7751 156410 -194309 -48604 -171975 113552 -87823 -383809 -201028 -56262 52536
9169 9129 -86033 247065 -122953 -41293 -112412 353037 -94163 -109737 -131119 11146 45668
9158 45668 88661 -268924 -131901 14504 -407654 158126 68501 -220053 -267505 150969 -227949
9146 223425 -1958 -46112 -197631 -28455 -184655 156531 -325669 -267384 -164741 -241007 28959
9134 10153 200543 150745 159634 -28617 156370 222001 -332500 -72082 -101188 295359 -402406
9122 -346803 -132881 78699 107944 72950 35924 -47162 -313538 -88946 -284488 187926 -235576
9110 251291 -311861 -67789 321339 -409867 31156 147975 -196322 -79025 -138339 -27365 -65192
9099 -65192 25426 123742 -196971 -129176 -210675 -196651 61052 -142776 75687 -430462 -209749
$$ packed form
9181G4870G751J48659a94309d8604j23371A13552h7823k95986J82781e6262E2536
9169I129h6033B47065a22953d1293p1119C53037i4163j5574k1382A1146L4522
9158D5668M2993b68924a31901A4504d07654A58126F8501b20053m7452A50969b27949
9146B23425a958m4154j51519b8455j56200A56531c25669N8285J02643p6266B8959
9134A0153J90390m9798Q889b8617A56370O5631c32500g2082k9106B95359d02406
9122c46803a32881G8699K9245l4994C5924d7162k66376h8946j95542A87926b35576
9110B51291c11861f7789C21339d09867C1156J16819a96322g9025n9314b7365l7827
9099f5192B5426R8316a96971O7795q1499J4024F1052a42776G5687d30462b09749
$$ plain form
9087 -16860 -92372 -526021 9559 -41681 -255040 175984 28085 55028 71221 -272485 -48671
9075 123778 -293995 150414 -154097 -123827 75724 19124 -22398 187836 -116896 -111183 -75427
9064 -75427 -48267 -154266 -54076 285847 -63885 -27687 -339201 5641 -189925 147405 25353
9052 7162 -174363 -258882 -119770 -17136 145268 75931 -2578 -100991 61452 -51939 -227059
9041 -227059 -235806 243756 19349 258780 -29622 -57106 -34728 -145185 -141866 14564 -200603
9029 23445 -145557 41520 -229756 -22819 203683 -79141 18442 -131922 -249725 -314323 39423
9017 -11265 -305651 -6102 -244838 157100 -407859 -72034 -19742 132830 -287003 -40232 195893
9005 91256 -193605 -6194 -53596 131941 -38376 103528 -95248 119615 -360792 331144 -155652
$$ packed form
9087a6860p5512m33649I559d1681k13359A75984B8085K6943J6193b72485d8671
9075A23778b93995A50414a54097L0270G5724A9124b2398A87836a16896N713L5756
9064g5427K7160j05999e4076B85847f3885b7687l11514E641a89925A47405B5353
9052G162a74363q4519a19770a7136A45268o9337b578r8413F1452e1939j75120
9041b27059q747B43756A9349K39431b9622k7484K2378j10457L319A4564b00603
9029B3445a45557D1520b29756b2819B03683g9141A8442a31922j17803o4598C9423
9017a1265k94386f102k38736A57100d07859g2034a9742A32830b87003d0232A95893
9005I1256a93605f194m7402A31941c8376A03528i5248A19615c60792C31144a55652
$$ plain form
8993 -239451 124924 -68388 -359019 -74085 -163079 -36398 197495 259638 -160175 -16256 170006
8981 87664 157608 -143428 -79987 -61037 -264654 163319 459285 -373906 -257606 7950 4348
8970 4348 -266458 -133428 194763 251269 -452136 -321589 -112438 -85379 -166692 -52675 100267
8958 -132178 185097 -148783 -1282 -90792 117258 -191308 244912 -54958 -32273 -142982 -127178
8947 -127178 -239044 -126148 81067 -49240 -54056 -487352 31588 118900 -73917 -160280 -205282
8936 -205282 179816 -48781 124490 -190161 -73599 14845 -195391 -174888 -261462 -212919 -58169
8924 -68720 -158053 -137075 275665 -239625 -134577 61036 -76355 179909 24685 148704 -202141
8912 330955 -333386 195546 347143 375555 653514 874204 1502408 2129126 4343023 9209404
$$ packed form
8993b39451A24924f8388k90631g4085q8994c6398A97495O2143a60175a6256A70006
8981H7664O9944a43428O3441J8950k03617A63319K95966c73906J16300G950l602
8970D348b66458J33030A94763N6506d52136J30547a12438K7059q1313e2675A00267
8958a32178A85097a48783a282q9510A17258a91308B44912e4958K2685j10709J5804
8947a27178j11866J12896H1067d9240m816m33296C1588Q7312g3917q6363m5002
8936b05282A79816d8781A24490a90161g3599A4845a95391K0503q6574M8543e8169
8924f8720q9333K0978B75665b39625J05048F1036g6355A79909B4685J24019b02141
8912C30955c33386A95546J51597K8412K77959K20690O28204O26718K213897M866381
$$ plain form
8902 9209404 4481223 2275580 1162694 825388 568810 379180 379243 312671 -40973 -336374
8892 -336374 -60559 557 -40986 188398 -87628 -144907 78956 281269 -193557 44026 -179070
8880 -32284 86007 -4389 -239839 45176 -111940 22088 -100240 106299 90092 -106941 -100123
8869 -100123 3233 158755 31603 222179 92105 -60578 220211 136786 -151740 -155827 -64347
8857 -164606 252091 148349 -334755 156788 -77968 475628 -98736 -160431 -51205 139282
$$ packed form
8902I209404D481223k205643j112886l37306k56578j89630O3o6572d0973k95401
8892c36374f0559E57d0986A88398h7628n7279G8956K02313a93557D4026a79070
8880c2284H6007d389k35450D5176a11940B2088a00240A06299j6207a06941O818
8869a00123C233J55522C1603J90576I2105f0578B20211q3425a51740m087f4347
8857a64606B52091j03742c34755A56788g7968D75628i8736o1695e1205A39282
$$ [...]
##END NTUPLES=NMR SPECTRUM
##END=
