
##TITLE=AC1147_Santa_5874710_RRjeiLJZGs
##JCAMPDX= 6.0         $$ Bruker NMR JCAMP-DX V2.0
##DATA TYPE= NMR SPECTRUM
##DATA CLASS= NTUPLES
##ORIGIN= BRUKER
##OWNER= Administrator
$$ 1.72 TOPSPIN		Version 2.1
$$ 2012-03-31 17:47:23.937 -0500  Administrator@TOPSPIN
$$ Compression mode = diff/dup
##.OBSERVE FREQUENCY= 400.13188235
##.OBSERVE NUCLEUS= ^1H
##.ACQUISITION MODE= SIMULTANEOUS (DQD)
##.ACQUISITION SCHEME= undefined
##.AVERAGES= 64
##.DIGITISER RES= 22
##SPECTROMETER/DATA SYSTEM= spect
##.PULSE SEQUENCE= noesygpps1d.comp
##.SOLVENT NAME= COFFEE_meoh
##.SHIFT REFERENCE= INTERNAL, COFFEE_meoh, 1, 14.96843
##AUDIT TRAIL= $$ (NUMBER, WHEN, WHO, WHERE, PROCESS, VERSION, WHAT)
$$ ##TITLE= Audit trail, TOPSPIN		Version 2.1
$$ ##JCAMPDX= 5.01
$$ ##ORIGIN= Bruker BioSpin GmbH
$$ ##OWNER= Administrator
$$ $$ C:\Bruker\TOPSPIN/data/COFFEE/nmr/AC1147_Santa_5874710_RRjeiLJZGs/12/pdata/1/auditp.txt
$$ ##AUDIT TRAIL=  $$ (NUMBER, WHEN, WHO, WHERE, PROCESS, VERSION, WHAT)
(   1,<2012-03-31 17:47:18.718 -0500>,<Administrator>,<TOPSPIN>,<go>,<TOPSPIN 2.1>,
      <created by zg
	started at 2012-03-31 17:35:47.015 -0500,
	POWCHK enabled, PULCHK disabled,
       configuration hash MD5:
       1A 1E CE 29 27 FD 77 03 67 4E F0 E3 C4 B2 CB 90
       data hash MD5: 64K
       78 10 88 66 66 72 65 3C DC 54 6B B3 0C 68 DD DA>)
(   2,<2012-03-31 17:47:21.687 -0500>,<Administrator>,<TOPSPIN>,<proc1d>,<TOPSPIN 2.1>,
      <Start of raw data processing
       efp LB = 0.3 FT_mod = 6 PKNL = 1 PHC0 = 0 PHC1 = 0 SI = 128K 
       data hash MD5: 128K
       3B 24 C3 EB B7 C0 70 69 C0 5B 65 59 1F E2 5C 65>)
(   3,<2012-03-31 17:47:23.078 -0500>,<Administrator>,<TOPSPIN>,<proc1d>,<TOPSPIN 2.1>,
      <pk PHC0 = 36.89209 PHC1 = 0 
       data hash MD5: 128K
       49 2D 9F 38 0C F4 9E D1 13 75 1A 41 CF 37 64 D2>)
(   4,<2012-03-31 17:47:23.343 -0500>,<Administrator>,<TOPSPIN>,<proc1d>,<TOPSPIN 2.1>,
      <abs ABSG = 1 
       data hash MD5: 128K
       39 49 57 5F FC 02 DE 32 8F 99 8C 00 F9 D6 F2 E9>)
(   5,<2012-03-31 17:47:23.421 -0500>,<Administrator>,<TOPSPIN>,<proc1d>,<TOPSPIN 2.1>,
      <abs ABSG = 2 
       data hash MD5: 128K
       FF 21 05 7C A4 A2 A8 CD BE E3 3A 47 8B B5 9F 6D>)
(   6,<2012-03-31 17:47:23.578 -0500>,<Administrator>,<TOPSPIN>,<proc1d>,<TOPSPIN 2.1>,
      <abs ABSG = 3 
       data hash MD5: 128K
       A4 D7 62 02 31 0F C5 33 85 A9 BB DE DA 8F 92 4E>)
(   7,<2012-03-31 17:47:23.781 -0500>,<Administrator>,<TOPSPIN>,<proc1d>,<TOPSPIN 2.1>,
      <abs ABSG = 4 
       data hash MD5: 128K
       97 F6 37 29 E6 11 6F AD 55 61 11 C2 97 AC 78 21>)
(   8,<2012-03-31 17:47:23.843 -0500>,<Administrator>,<TOPSPIN>,<proc1d>,<TOPSPIN 2.1>,
      <abs ABSG = 5 
       data hash MD5: 128K
       61 E5 1C D8 1A D5 5C FE 87 46 E7 D9 1F EC EC 61>)
$$ ##END=
$$ 
$$ $$ hash MD5
$$ $$ 29 CD EF 4C D8 82 89 1C 09 A1 6E C0 B2 CA 93 15
##$RELAX= 
##$RELAX= 
##$RELAX= 
##$RELAX= 
##$RELAX= 
##$RELAX= 
##$RELAX= 
##$RELAX= 
$$ Bruker specific parameters
$$ [...]
##$TP07= 0
##$TPNAME0= <>
##$TPNAME1= <>
##$TPNAME2= <>
##$TPNAME3= <>
##$TPNAME4= <>
##$TPNAME5= <>
##$TPNAME6= <>
##$TPNAME7= <>
##$TPOAL= (0..7)
0.5 0.5 0.5 0.5 0.5 0.5 0.5 0.5
##$TPOFFS= (0..7)
0 0 0 0 0 0 0 0
##$TUNHIN= 0
##$TUNHOUT= 0
##$TUNXOUT= 0
##$USERA1= <user>
##$USERA2= <user>
##$USERA3= <user>
##$USERA4= <user>
##$USERA5= <user>
##$V9= 5
##$VALIST= <valist>
##$VCLIST= <CCCCCCCCCCCCCCC>
##$VD= 0
##$VDLIST= <DDDDDDDDDDDDDDD>
##$VPLIST= <PPPPPPPPPPPPPPP>
##$VTLIST= <TTTTTTTTTTTTTTT>
##$WBST= 2048
##$WBSW= 25
##$XGAIN= (0..3)
0 0 0 0
##$XL= 0
##$YL= 0
##$YMAX_a= 12588405
##$YMIN_a= -6719425
##$ZGOPTNS= <>
##$ZL1= 120
##$ZL2= 120
##$ZL3= 120
##$ZL4= 120
##$ABSF1= 14.96843
##$ABSF2= -5.584101
##$ABSG= 5
##$ABSL= 3
##$ALPHA= 0
##$AQORDER= 0
##$ASSFAC= 0
##$ASSFACI= 0
##$ASSFACX= 0
##$ASSWID= 0
##$AUNMP= <proc_prof1d_extract.lims>
##$AXLEFT= 0
##$AXNAME= <>
##$AXNUC= <1H>
##$AXRIGHT= 0
##$AXTYPE= 0
##$AXUNIT= <>
##$AZFE= 0.1
##$AZFW= 0.1
##$BCFW= 0
##$BC_mod= 0
##$BYTORDP= 0
##$COROFFS= 0
##$CY= 15
##$DATMOD= 1
##$DC= 0
##$DFILT= <>
##$DTYPP= 0
##$F1P= 0
##$F2P= 0
##$FCOR= 0.5
##$FTSIZE= 131072
##$FT_mod= 6
##$GAMMA= 0
##$GB= 0
##$INTBC= 1
##$INTSCL= 1
##$ISEN= 128
##$LB= 0.3
##$LEV0= 0
##$LPBIN= 0
##$MAXI= 10000
##$MC2= 0
##$MEAN= 0
##$ME_mod= 0
##$MI= 0
##$NCOEF= 0
##$NC_proc= -2
##$NLEV= 6
##$NOISF1= 0
##$NOISF2= 0
##$NSP= 0
##$NTH_PI= 0
##$NZP= 0
##$OFFSET= 14.96843
##$PC= 1
##$PHC0= 36.89209
##$PHC1= 0
##$PH_mod= 1
##$PKNL= yes
##$PPARMOD= 0
##$PPDIAG= 0
##$PPIPTYP= 0
##$PPMPNUM= 2147483647
##$PPRESOL= 1
##$PSCAL= 4
##$PSIGN= 0
##$PYNMP= <proc.py>
##$REVERSE= no
##$SF= 400.130004873388
##$SI= 131072
##$SIGF1= 0
##$SIGF2= 0
##$SINO= 400
##$SIOLD= 131072
##$SPECTYP= <>
##$SREGLST= <1H.CDCl3>
##$SSB= 0
##$STSI= 131072
##$STSR= 0
##$SW_p= 8223.68421052632
##$SYMM= 0
##$S_DEV= 0
##$TDeff= 65536
##$TDoff= 0
##$TI= <>
##$TILT= no
##$TM1= 0
##$TM2= 0
##$TOPLEV= 0
##$USERP1= <user>
##$USERP2= <user>
##$USERP3= <user>
##$USERP4= <user>
##$USERP5= <user>
##$WDW= 1
##$XDIM= 131072
##$YMAX_p= 263126371
##$YMIN_p= -305845885
##$CURPLOT= <Network HP LaserJet P1505>
##$CURPRIN= <$Network HP LaserJet P1505>
##$DFORMAT= <normdp>
##$LAYOUT= <+/1D_H.xwp>
##$LFORMAT= <normlp>
##$PFORMAT= <normpl>
##$SURQMSG= 1
$$ End of Bruker specific parameters
$$ ---------------------------------
##NTUPLES= NMR SPECTRUM
##VAR_NAME=  FREQUENCY,     SPECTRUM/REAL,   SPECTRUM/IMAG
##SYMBOL=    X,             R,               I
##VAR_TYPE=  INDEPENDENT,   DEPENDENT,       DEPENDENT
##VAR_FORM=  AFFN,          ASDF,            ASDF
##VAR_DIM=   131072,        131072,          131072
##UNITS=     HZ,            ARBITRARY UNITS, ARBITRARY UNITS
##FACTOR=    0.0627417313425165, 1,          1
##FIRST=     8223.62146879498, -3418,        -44600
##LAST=      0,             -2206,           -45256
##MIN=       0,             -305845885,      0
##MAX=       8223.62146879498, 263126371,    0
$$ Real data points
##PAGE= N=1
##DATA TABLE= (X++(R..R)), XYDATA
$$ [...]
62023A686622L2296L2520L3336L4280L4486L3862L3170L2839L2449L1695L1163
62012B048718L1547L2577L3501L4326L5700L7683L9452M0422M0985M1706M2319
62001B458936M1921L9987L6872L3472L0493K8036K5772K3602K1901K0918K0062
61990B781972J8319J5393J2028R209P428O759P074Q000R114J0424J2211J4244
61978B912175J5686J6166J6441J7516J9384K1177K2310K2905K3181K2989K2107
61967C132037K0687J9197J8077J7434J6911J5943J4244J2105J0083Q426O934N327
61955C297405L590J888K89j349l114m746n772o024n890n887o105o311o451o704
61941C244819p035p072o537n549m380l226k290j734j372p82L3M66J03n79p62l62
$$ y = [1686622, 1718918, 1751438, 1784774, 1819054, 1853540, 1887402, 1920572, 1953411, 1985860, 2017555, 2048718, 2080265, 2112842, 2146343, 2180669, 2216369, 2254052, 2293504, 2333926, 2374911, 2416617, 2458936, 2500857, 2540844, 2577716, 2611188, 2641681, 2669717, 2695489, 2719091, 2740992, 2761910, 2781972, 2800291, 2815684, 2827712, 2836921, 2844349, 2851108, 2858182, 2866182, 2875296, 2885720, 2897931, 2912175, 2927861, 2944027, 2960468, 2977984, 2997368, 3018545, 3040855, 3063760, 3086941, 3109930, 3132037, 3152724, 3171921, 3189998, 3207432, 3224343, 3240286, 3254530, 3266635, 3276718, 3285144, 3292078, 3297405, 3300995, 3302883, 3303172, 3301823, 3298709, 3293963, 3288191, 3282167, 3276277, 3270390, 3264285, 3257974, 3251523, 3244819, 3237784, 3230712, 3224175, 3218626, 3214246, 3211020, 3208730, 3206996, 3205624, 3204842, 3204875, 3205341, 3205444, 3204865, 3204103, 3203741]
61925C203741l0j23j29O07J951L069L362K986K450J924J153j04j737l306m319
61910C211495m590m633n525p854j0814j2924j3759j4331j5465j6636j7083j7240
61898C070641j8060j9393k0319k0767k1579k2829k3427k2771k1649k0947k0443
61887B838457j9608j8690j8164j7812j7107j6032j4798j3199j1050q798p011n579
61875B670609m098k619j227O58L583O901R330J0728J2364J5287J9183K3091K6583
61862B790373K9914L3506L7676M2517M7816N3278N8920O5087P2077Q0021Q8991
61851C400176R9007J10096J22639J37370J54489J73149J92428K12683K35113K60025
61841E097175K86340L12904L39324L65080L88556M07440M19292M20953M07988
$$ y = [3203741, 3203711, 3203588, 3203459, 3204066, 3206017, 3209086, 3212448, 3215434, 3217884, 3219808, 3220961, 3220857, 3219120, 3215814, 3211495, 3206905, 3202272, 3196747, 3188893, 3178079, 3165155, 3151396, 3137065, 3121600, 3104964, 3087881, 3070641, 3052581, 3033188, 3012869, 2992102, 2970523, 2947694, 2924267, 2901496, 2879847, 2858900, 2838457, 2818849, 2800159, 2781995, 2764183, 2747076, 2731044, 2716246, 2703047, 2691997, 2683199, 2676188, 2670609, 2666511, 2663892, 2662665, 2663323, 2666906, 2673807, 2683137, 2693865, 2706229, 2721516, 2740699, 2763790, 2790373, 2820287, 2853793, 2891469, 2933986, 2981802, 3035080, 3094000, 3159087, 3231164, 3311185, 3400176, 3499183, 3609279, 3731918, 3869288, 4023777, 4196926, 4389354, 4602037, 4837150, 5097175, 5383515, 5696419, 6035743, 6400823, 6789379, 7196819, 7616111, 8037064, 8445052]
61832H445052L75936L22491K48304J56344N1660n8029j63061k54761l28308l82811
61822H412817m19178m38763m43875m38049m24682m05642l81936l55410l28666
61813D776616l03270k79105k55917k34460k15432j98126j81263j64840j50066
61804B794137j37479j26164j15079j04379r4962q7162q0382p3890o7600o2031
61794A845009n7493n3433m8898m3783l9134l5776l3080k9780k5735k2040j9470
61783A436387j7762j6579j6151j6421j6328j4819j2129r367p176n439m084l307
61771A296825k937k348j270k10L10N55J176K310L472M214M470M353M137M527O310
61756A325894R297J2100J3474J3808J4600J6598J9132K1416K3741K6858L0668
$$ y = [8445052, 8820988, 9143479, 9391783, 9548127, 9599787, 9541758, 9378697, 9123936, 8795628, 8412817, 7993639, 7554876, 7111001, 6672952, 6248270, 5842628, 5460692, 5105282, 4776616, 4473346, 4194241, 3938324, 3703864, 3488432, 3290306, 3109043, 2944203, 2794137, 2656658, 2530494, 2415415, 2311036, 2216074, 2128912, 2048530, 1974640, 1907040, 1845009, 1787516, 1734083, 1685185, 1641402, 1602268, 1566492, 1533412, 1503632, 1477897, 1455857, 1436387, 1418625, 1402046, 1385895, 1369474, 1353146, 1338327, 1326198, 1316831, 1309655, 1304216, 1300132, 1296825, 1293888, 1291540, 1290270, 1290060, 1290370, 1290925, 1292101, 1294411, 1297883, 1302097, 1306567, 1310920, 1315057, 1319584, 1325894, 1335191, 1347291, 1360765, 1374573, 1389173, 1405771, 1424903, 1446319, 1470060, 1496918, 1527586]
61745A527586L4214L6874L9037M1552M4857M8777N2946N7250O1821O6694P1737
61734B083345P7020Q3023R0065R7695J05224J12774J21131J30529J40439J50805
61724C192050J62550J76343J91716K08186K26478K47660K71667K97801L26357
61715E300808L58434L94174M32363M72121N13963N58664O05688O53052O98101
61706I987368P37861P68833P86641P85638P58878O99296O02029M66687K98637
61697A5891868J08955q7292k74397m39347n73530o72933p37974p72760p82934
61688A1659656p73502p48677p13095o71647o27741n82703n37341m93204m51801
61679F059945m13478l77850l44863l14711k87283k62310k39795k19659k01289
$$ y = [1527586, 1561800, 1598674, 1637711, 1679263, 1724120, 1772897, 1825843, 1883093, 1944914, 2011608, 2083345, 2160365, 2243388, 2333453, 2431148, 2536372, 2649146, 2770277, 2900806, 3041245, 3192050, 3354600, 3530943, 3722659, 3930845, 4157323, 4404983, 4676650, 4974451, 5300808, 5659242, 6053416, 6485779, 6957900, 7471863, 8030527, 8636215, 9289267, 9987368, 10725229, 11494062, 12280703, 13066341, 13825219, 14524515, 15126544, 15593231, 15891868, 16000823, 15913531, 15639134, 15199787, 14626257, 13953324, 13215350, 12442590, 11659656, 10886154, 10137477, 9424382, 8752735, 8124994, 7542291, 7004950, 6511746, 6059945, 5646467, 5268617, 4923754, 4609043, 4321760, 4059450, 3819655, 3599996, 3398707]
61670C398707j84051j68016j53599j40709j28836j17887j08233r9867r2083q4281
61660B121145p6695p0015o4480n9686n5248n1248m7754m4195l9813l4821l0542
61649A546648k8006k6786k5670k4095k2364k0796j9443j8503j8207j8225j7931
61638A306622j7376j7292j7975j8795j9080j8812j8298j7723j7316j7351j7712
61627A108892j7945j7951j8026j8060j7396j5841j4090j2769j1778j0906j0388
61616I43742j0236r740q320o469n174m773m855m866m351l066j441m93o70j251
61602H78037j418j381j730k192j974j044j94J22J86K81K77L3m08j097k076k984
61586H62438l252k852k378k370k837l466l898l814l101k018j005l30j65o47j576
$$ y = [3398707, 3214656, 3046640, 2893041, 2752332, 2623496, 2505609, 2397376, 2297509, 2205426, 2121145, 2044450, 1974435, 1909955, 1850269, 1795021, 1743773, 1696019, 1651824, 1612011, 1577190, 1546648, 1518642, 1491856, 1466186, 1442091, 1419727, 1398931, 1379488, 1360985, 1342778, 1324553, 1306622, 1289246, 1271954, 1253979, 1235184, 1216104, 1197292, 1178994, 1161271, 1143955, 1126604, 1108892, 1090947, 1072996, 1054970, 1036910, 1019514, 1003673, 989583, 976814, 965036, 954130, 943742, 933506, 923766, 915446, 908977, 903803, 899030, 894175, 889309, 884958, 881892, 880451, 879958, 879288, 878037, 876619, 875238, 873508, 871316, 869342, 868298, 868104, 868226, 868412, 868693, 868970, 869003, 868595, 867498, 865422, 862438, 859186, 856334, 853956, 851586, 848749, 845283, 841385, 837571, 834470, 832452, 831447, 831117, 830952, 830305, 828729]
61571H28729k210j883p52M25J160J531J752J867J845J688J474J482K075L194M163
61556H46540M366L937L498L350L285K942K077P01p60j652j778j582j441j234r41
61541H61308j050j858k857l563m315n460o302n992n073m883n472n480m236k683
61527H02084j769j172l00N04P32R39K070L915N270N565N566O365Q278J0853J3454
61512H62354J5580J7044J8082J9141K0367K1469K2197K2819K3814K5167K6141
61501A094175K6024K4934K3674K2828K2243K1410K0076J8393J6756J5605J5063
61490A321181J4547J3126J0568P753N700M396K973Q38j805m414o635q363r623
61477A350242j0426j0607r924q529p106o194n611m842l822k828j817l36J863M540
$$ y = [828729, 826519, 824636, 823884, 824309, 825469, 827000, 828752, 830619, 832464, 834152, 835626, 837108, 839183, 842377, 846540, 850906, 854843, 858341, 861691, 864976, 867918, 869995, 870696, 869936, 868284, 866506, 864924, 863483, 862249, 861308, 860258, 858400, 855543, 851980, 847665, 842205, 835903, 829911, 824838, 819955, 814483, 809003, 804767, 802084, 800315, 799143, 798843, 799347, 800079, 801018, 803088, 807003, 812273, 817838, 823404, 829769, 838047, 848900, 862354, 877934, 894978, 913060, 932201, 952568, 974037, 996234, 1019053, 1042867, 1068034, 1094175, 1120199, 1145133, 1168807, 1191635, 1213878, 1235288, 1255364, 1273757, 1290513, 1306118, 1321181, 1335728, 1348854, 1359422, 1367175, 1372875, 1377271, 1380244, 1381082, 1379277, 1374863, 1368228, 1359865, 1350242, 1339816, 1329209, 1319285, 1310756, 1303650, 1297456, 1291845, 1287003, 1283181, 1280353, 1278536, 1278200, 1280063, 1284603]
61463A284603P249R686J1858J4208J7393K1614K6340L0959L5419L9894M4249M8522
61451A591994N3429N9675O6877P4101Q1304Q9374R8671J08417J17786J26821J35851
61440B604300J44657J52559J58756J62298J62157J57688J48624J34504J14737
61431C940280Q9705O1257L1680K506k5271n0347p1223q7201r8717j06553j11070
61420C575046j12295j10563j06689j01454r5146q7870q0159p2736o5589n7842
61410B684703m8900l9305l0032k1467j3557o393Q6O531J3341J9705K4526K8086
61398B617324L1683L5684L9055M1024M1949M2291M1850M0611L9239L8073L6594
61387C045377L4607L3000L2509L2491L1916L0932L0339K9983K8864K6764K4652
$$ y = [1284603, 1291852, 1301538, 1313396, 1327604, 1344997, 1366611, 1392951, 1423910, 1459329, 1499223, 1543472, 1591994, 1645423, 1705098, 1771975, 1846076, 1927380, 2016754, 2115425, 2223842, 2341628, 2468449, 2604300, 2748957, 2901516, 3060272, 3222570, 3384727, 3542415, 3691039, 3825543, 3940280, 4029985, 4091242, 4122922, 4125428, 4100157, 4049810, 3978587, 3891386, 3792669, 3686116, 3575046, 3462751, 3352188, 3245499, 3144045, 3048899, 2961029, 2880870, 2808134, 2742545, 2684703, 2635803, 2596498, 2566466, 2544999, 2531442, 2525049, 2525135, 2531666, 2545007, 2564712, 2589238, 2617324, 2649007, 2684691, 2723746, 2764770, 2806719, 2849010, 2890860, 2931471, 2970710, 3008783, 3045377, 3079984, 3112984, 3145493, 3177984, 3209900, 3240832, 3271171, 3301154, 3330018, 3356782, 3381434]
61376C381434K3287K2198K0358J7386J3812J0415P513M775J723j613m791p652
61364C488845j0550j3592j6229j7912j8795j9313j9416j8737j7314j5675j4268
61353C307044j3162j2122j0762q828o607m802l770l233l014l506m976o854q370
61340C217038r576j0953j2278j2548j1145q433n088j312L187Q822J5897K4421
61328C198032L4055M4374N5229O6661P8568R0682J02837J15021J27150J38916
61318D051525J49870J59521J67383J72894J75222J73234J65967J53189J35242
61309E504047J12413Q5024N4293K2529p917l5692o0463q2491j02344j20427j36337
61298E232635j49174j58736j65749j70578j72521j71033j66885j61363j54926
$$ y = [3381434, 3404721, 3426919, 3447277, 3464663, 3478475, 3488890, 3496403, 3501178, 3502901, 3501288, 3496497, 3488845, 3478295, 3464703, 3448474, 3430562, 3411767, 3392454, 3373038, 3354301, 3336987, 3321312, 3307044, 3293882, 3281760, 3270998, 3262170, 3255563, 3250761, 3246991, 3243758, 3240744, 3237238, 3232262, 3225408, 3217038, 3207462, 3196509, 3184231, 3171683, 3160538, 3152105, 3147017, 3145705, 3148892, 3157714, 3173611, 3198032, 3232087, 3276461, 3331690, 3398351, 3476919, 3567601, 3670438, 3785459, 3912609, 4051525, 4201395, 4360916, 4528299, 4701193, 4876415, 5049649, 5215616, 5368805, 5504047, 5616460, 5701484, 5755777, 5778306, 5770389, 5734697, 5674234, 5591743, 5489399, 5368972, 5232635, 5083461, 4924725, 4758976, 4588398, 4415877, 4244844, 4077959, 3916596, 3761670]
61289C761670j47610j40015j32752j25189j16106j05619r5280q6117p7566o8708
61279B666708n9586n0789m2416l4117k5761j7681j0348l990J623O994J2300J7053
61267B459990K0792K3858K7004L0342L3240L5190L6148L6020L4571L2034K9187
61256B798376K6605K4278K2092K0109J8243J6178J3777J1145Q173M619P58k690
61244B961663n508q342j1759j5511j8941k1699k3756k5320k6977k9401l2427l4984
61232B707038l6291l6733l7055l7291l6984l6032l4627l2648k9883k6685k3803
61221B339006k1495j9384j7217j5286j3939j3119j2571j2268j2373j2900j3535
61210B174919j3820j3574j3033j2554j2101j1194r430o813l551J69L976P290R895
$$ y = [3761670, 3614060, 3474045, 3341293, 3216104, 3099998, 2994379, 2899099, 2812982, 2735416, 2666708, 2607122, 2556333, 2513917, 2479800, 2454039, 2436358, 2426010, 2422020, 2423643, 2430637, 2442937, 2459990, 2480782, 2504640, 2531644, 2561986, 2595226, 2630416, 2666564, 2702584, 2737155, 2769189, 2798376, 2824981, 2849259, 2871351, 2891460, 2909703, 2925881, 2939658, 2950803, 2958976, 2963595, 2964353, 2961663, 2956155, 2947813, 2936054, 2920543, 2901602, 2879903, 2856147, 2830827, 2803850, 2774449, 2742022, 2707038, 2670747, 2634014, 2596959, 2559668, 2522684, 2486652, 2452025, 2419377, 2389494, 2362809, 2339006, 2317511, 2298127, 2280910, 2265624, 2251685, 2238566, 2225995, 2213727, 2201354, 2188454, 2174919, 2161099, 2147525, 2134492, 2121938, 2109837, 2098643, 2089213, 2082400, 2078849, 2079018, 2082994, 2090284, 2100179]
61197B100179J2456J5970K0717K6085L1523L7218M3563N0221N6254O1278O5962
61186B521426P1005P5754P8390P7534P3175O5781N5164M0830K3113L265j7420
61175C068017l7900n6896p2994q5513r4605j00316j02324j00954r7735r4179r0403
61164B134198q5615p9608p3143o6995o1320n5962n0920m6267m2028l8191l4687
61153A499462l1347k8006k4670k1442j8397j5643j3201j0799p996m822j864N39
61141A321814K768N168P215Q142Q145Q182Q592Q740Q110P012N933M799L344J700
61127A409664J80j235k739m290n723p141q771j0605j2379j3772j4473j4283j3533
61114A300900j3058j3369j3984j4069j3573j3231j3500j4084j4583j5043j5589
$$ y = [2100179, 2112635, 2128605, 2149322, 2175407, 2206930, 2244148, 2287711, 2337932, 2394186, 2455464, 2521426, 2592431, 2668185, 2746575, 2824109, 2897284, 2963065, 3018229, 3059059, 3082172, 3085437, 3068017, 3030117, 2973221, 2900227, 2814714, 2720109, 2619793, 2517469, 2416515, 2318780, 2224601, 2134198, 2048583, 1968975, 1895832, 1828837, 1767517, 1711555, 1660635, 1614368, 1572340, 1534149, 1499462, 1468115, 1440109, 1415439, 1393997, 1375600, 1359957, 1346756, 1335957, 1327961, 1323139, 1321275, 1321814, 1324582, 1329750, 1336965, 1345107, 1353252, 1361434, 1370026, 1378766, 1386876, 1393888, 1399821, 1404620, 1407964, 1409664, 1409844, 1408609, 1405870, 1401580, 1395857, 1388716, 1379945, 1369340, 1356961, 1343189, 1328716, 1314433, 1300900, 1287842, 1274473, 1260489, 1246420, 1232847, 1219616, 1206116, 1192032, 1177449, 1162406, 1146817]
61103A146817j6078j6433j6950j7799j8567j8764j8532j8343j8206j7737j6987
61092I52421j6526j6613j6849j6903j7116j7904j8924j9320j8684j7440j6293
61081G59849j5597j5170j4531j3283j1488r613q014o576n006l338j915r31k45
61068F54142M53J376K458L311L531L232L038L325L803M112M513N449O641P364
61054G06748P479P566P907Q082P821P561P731P993P719O877N954N214M572L982
61040H03206L535L225L008L059L484L916L793L134K580K524K591K172J197O9r70
61025H40523k000l033l797m108m250m721n614o434o655o296n852n693n684n410
61011G70976m698l848l304l157l033k645k312k645l634m434m272l311k295j622
$$ y = [1146817, 1130739, 1114306, 1097356, 1079557, 1060990, 1042226, 1023694, 1005351, 987145, 969408, 952421, 935895, 919282, 902433, 885530, 868414, 850510, 831586, 812266, 793582, 776142, 759849, 744252, 729082, 714551, 701268, 689780, 680167, 672153, 665577, 660571, 657233, 655318, 654387, 654142, 654595, 655971, 658429, 661740, 665271, 668503, 671541, 674866, 678669, 682781, 687294, 692743, 699384, 706748, 714227, 721793, 729700, 737782, 745603, 753164, 760895, 768888, 776607, 783484, 789438, 794652, 799224, 803206, 806741, 809966, 812974, 816033, 819517, 823433, 827226, 830360, 832940, 835464, 838055, 840227, 841424, 841493, 840523, 838523, 835490, 831693, 827585, 823335, 818614, 813000, 806566, 799911, 793615, 787763, 782070, 776386, 770976, 766278, 762430, 759126, 755969, 752936, 750291, 747979, 745334, 741700, 737266, 732994, 729683, 727388, 725766]
60997G25766j197j000j196j692j997j748j027j01Q25J548J953K238K759L519M135
60982G32785M386M504M865N644O766P900Q615Q928R548J0996J2723J3781J4281
60969H45722J5186J6634J7655J7861J8264J9700K1564K2987K4231K5879K7456
60958A073139K8168K8462K9545L1711L4336L7209M0509M3736M6118M8133N1267
60947A492333N6066O1588O7047P2608P8365Q3862Q9161R5096J01838J08427J14479
60936B420870J21195J29869J40413J52255J65593J80772J97313K14822K34194
60927C957296K56947K84087L16498L55484M01644M54215N12955N79949O58144
60918G777219P49258Q54667R76517J114905J265535J423483J584861J732497J815087
$$ y = [725766, 724569, 723569, 722373, 720681, 718684, 716936, 715909, 715808, 716633, 718181, 720134, 722372, 725131, 728650, 732785, 737171, 741675, 746540, 752184, 758950, 766850, 775465, 784393, 793941, 804937, 817660, 831441, 845722, 860908, 877542, 895197, 913058, 931322, 951022, 972586, 995573, 1019804, 1045683, 1073139, 1101307, 1129769, 1159314, 1191025, 1225361, 1262570, 1303079, 1346815, 1392933, 1441066, 1492333, 1548399, 1609987, 1677034, 1749642, 1828007, 1911869, 2001030, 2096126, 2197964, 2306391, 2420870, 2542065, 2671934, 2812347, 2964602, 3130195, 3310967, 3508280, 3723102, 3957296, 4214243, 4498330, 4814828, 5170312, 5571956, 6026171, 6539126, 7119075, 7777219, 8526477, 9381144, 10357661, 11472566, 12738101, 14161584, 15746445, 17478942, 19294029]
60909A9294029J754826J499309J078341O04502K07801l5827j20995q1003L6500
60900B4237483J60802J92886M4264l00514p61305j208720j538497j712149j746333
60891A7367917j680971j557178j408798j258467j116596r85900q67585p62951
60883G729471o71442n90718n19122m56493m02605l56482l17399k85128k58774
60874C871308k36596k17309k00617j86119j72731j59689j47275j36075j26070
60865B288827j17042j09140j02569r7039r2068q7467q3161p8823p4166o9422o5149
60854A312781o1526n8005n3746m8521m3207l9072l6334l3804l0489k7120k5216
60843H55741k4877k4589k3305k1616k0380j9301j7643j5584j3943j3046j2601
$$ y = [19294029, 21048855, 22548164, 23626505, 24231007, 24438808, 24402981, 24281986, 24200983, 24237483, 24398285, 24591171, 24635435, 24334921, 23573616, 22364896, 20826399, 19114250, 17367917, 15686946, 14129768, 12720970, 11462503, 10345907, 9360007, 8492422, 7729471, 7058029, 6467311, 5948189, 5491696, 5089091, 4732609, 4415210, 4130082, 3871308, 3634712, 3417403, 3216786, 3030667, 2857936, 2698247, 2550972, 2414897, 2288827, 2171785, 2062645, 1960076, 1863037, 1770969, 1683502, 1600341, 1521518, 1447352, 1377930, 1312781, 1251255, 1193250, 1139504, 1090983, 1047776, 1008704, 972370, 938566, 908077, 880957, 855741, 830864, 806275, 782970, 761354, 740974, 721673, 704030, 688446, 674503, 661457, 648856]
60832F48856j2268j1643j0176p893n902n290n712n861n146m055l058k151j473
60819E68228j390j654j336j2J703L074M063M840N237N142M956N038N121M813M293
60804F12116M032M054L919L317K261R46k51q99j004j141j723k408k654k510k346
60789F15709k092j401l92M48J020J586K063K146K206L110M843O120N986N062M525
60774F50939M395L830K825K545L734N586O602O206N187M751N422O655P416P259
60760G23352O836P118Q141Q883Q507P342O406O229O416O229N295L894K707K223
60746H09578K186J793N79j121k708m011n110n804n920o017p106r374j1717j2908
60732G42340j2927j2720j2858j2917j2181j0616q901p779p454p536p391o551m957
$$ y = [648856, 636588, 624945, 614769, 606876, 600974, 595684, 589972, 584111, 578965, 574910, 571852, 569701, 568228, 566838, 565184, 563848, 563836, 565539, 568613, 572676, 577516, 582753, 587895, 592851, 597889, 603010, 607823, 612116, 616148, 620202, 624121, 627438, 629699, 630645, 630394, 629495, 628491, 627350, 625627, 623219, 620565, 618055, 615709, 613617, 612216, 611824, 612272, 613292, 614878, 616941, 619087, 621293, 624403, 629246, 635366, 641352, 646414, 650939, 655334, 659164, 661989, 664534, 668268, 673854, 680456, 686662, 691849, 696600, 702022, 708677, 716093, 723352, 730188, 737306, 745447, 754330, 762837, 770179, 776585, 782814, 789230, 795459, 800754, 804648, 807355, 809578, 811764, 813557, 814136, 813015, 810307, 806296, 801186, 795382, 789462, 783445, 776339, 766965, 755248, 742340, 729413, 716693, 703835, 690918, 678737, 668121, 659220, 651441, 643987, 636451, 629060, 622509, 617552]
60719F17552k927r76M72J331J890K528L271L819M069M552N969Q240J0311J1204
60705F71305J1106J1027J1414J1579J0750R213P917P232O720O095N653N613N595
60692G81219N281N097N658O833P821Q097P774P232O823O826P180P263O461M995
60678H74560L730L095K646J796N10r00k177l077l348l073k790l042l952n289o616
60663H52073p418p418p034p023p557q000p832p308o896o605o247n928n793n587
60649G55427n033m354m004l969l904l807m028m641n250n416n021m231l409k940
60635F95420k826k579j815q31j56L00J136K517L813M335M062L488K992K536J869
60620G14261R02j04q89j699l124n202p063p894p976q256r069r860j0123r973r672
$$ y = [617552, 614625, 613649, 614121, 615452, 617342, 619870, 623141, 626960, 631029, 635581, 641550, 649790, 660101, 671305, 682411, 693438, 704852, 716431, 727181, 736394, 744311, 751543, 758263, 764358, 770011, 775624, 781219, 786500, 791597, 797255, 804088, 811909, 820006, 827780, 835012, 841835, 848661, 855841, 863104, 869565, 874560, 878290, 881385, 884031, 885827, 886337, 885437, 883260, 880183, 876835, 873762, 870972, 867930, 863978, 858689, 852073, 844655, 837237, 830203, 823180, 815623, 807623, 799791, 792483, 785587, 778982, 772735, 766807, 761014, 755427, 750394, 746040, 742036, 738067, 734163, 730356, 726328, 721687, 716437, 711021, 706000, 701769, 698360, 695420, 692594, 690015, 688200, 687369, 687213, 687513, 688649, 691166, 694979, 699314, 703376, 706864, 709856, 712392, 714261, 715163, 715059, 714170, 712471, 709347, 704145, 697082, 689188, 681212, 672956, 663887, 654027, 643904, 633931, 624259]
60605F24259r170q386p527o826o154n218m024k986k539k702l026l066k897k952
60591E56786l303l450k997k150j274l79N13R46O05o0l79m11n95p49k94O26J178
60574E44613J088R73J231J529J693K209L344M518N140N465O057O874P561Q211
60560F00506R196J0495J1684J2480J2952J3370J4161J5590J7190J7916J7336J6326
60548G69202J6074J6682J7220J6863J5437J3087J0117P058M307J640j484n073
60536H81130q531j1334j3355j4495j4579j3787j2770j2016j1359j0361q965p536
60524G42042o340n307m324l594l439l767l986l628k965k737l274m110m525m216
60510F85830l376k436j777j529j392q49L16J805L090L759L671L142K952L791N516
$$ y = [624259, 615089, 606703, 599176, 592350, 586196, 580978, 576954, 573968, 571429, 568727, 565701, 562635, 559738, 556786, 553483, 550033, 547036, 544886, 543612, 543233, 543746, 544692, 545297, 545237, 544858, 544447, 543852, 543103, 542809, 543435, 544613, 545701, 546674, 547905, 549434, 551127, 553336, 556680, 561198, 566338, 571803, 577860, 584734, 592295, 600506, 609702, 620197, 631881, 644361, 657313, 670683, 684844, 700434, 717624, 735540, 752876, 769202, 785276, 801958, 819178, 836041, 851478, 864565, 874682, 881740, 886047, 887687, 886203, 881130, 872599, 861265, 847910, 833415, 818836, 805049, 792279, 780263, 768904, 758543, 749578, 742042, 735702, 730395, 726071, 722477, 719038, 715271, 711285, 707657, 704692, 701955, 698681, 694571, 690046, 685830, 682454, 680018, 678241, 676712, 675320, 674471, 674787, 676592, 679682, 683441, 687112, 690254, 693206, 696997, 702513]
60495G02513P304Q562R360R938J0363J0769J1423J2269J2989J3719J5087J7101
60483H41397J8848J9806K0824K2907K5607K7657K8865L0174L1820L2493L0681
60472A131079K6128J9746J2669N726q11p200j3533j8938k2082k2675k1782k0312
60460A068015j8024j4518j0462o926l931o18L305P202J0529J3343J5599J6908
60448A080422J7523J8727K1495K5173K8383L0990L4282L9137M4949N0784N6904
60437A448769O4450P3973Q4911R6365J07798J19004J29921J40689J51537J62409
60427B579826J72917J82787J92068K00561K06879K07966J99793J79089J44976
60418D266862R9157M4677j5054p5847j32369j79321k13404k33885k41745k39030
$$ y = [702513, 709817, 718379, 727739, 737677, 748040, 758809, 770232, 782501, 795490, 809209, 824296, 841397, 860245, 880051, 900875, 923782, 949389, 977046, 1005911, 1036085, 1067905, 1100398, 1131079, 1157207, 1176953, 1189622, 1195348, 1194537, 1187337, 1173804, 1154866, 1132784, 1110109, 1088327, 1068015, 1049991, 1035473, 1025011, 1018085, 1014154, 1013536, 1016841, 1024043, 1034572, 1047915, 1063514, 1080422, 1097945, 1116672, 1138167, 1163340, 1191723, 1222713, 1256995, 1296132, 1341081, 1391865, 1448769, 1513219, 1587192, 1672103, 1768468, 1876266, 1995270, 2125191, 2265880, 2417417, 2579826, 2752743, 2935530, 3127598, 3328159, 3535038, 3743004, 3942797, 4121886, 4266862, 4366019, 4410696, 4395642, 4319795, 4187426, 4008105, 3794701, 3560816, 3319071, 3080041]
60408C080041k28845k14699j99068j82864j66431j50452j35626j22131j09826
60399A570099r8704q8782p9933p2013o4961n8575n2655m7377m3029l9316l5573
60388H89181l1829k8841k6865k5234k3554k2275k1544k0459j8387j6167j4938
60377F39088j4427j3549j2204j1201j0698j0001q921q119p889p601o641n174l745
60364E18918k827k843l846m950m898l531j957j028l63O96J899K499K402K271K622
60349E05064L254L545L117K181J375J136J289J426J517J841K425L013L565M271
60335E39019N034N359N017M374L960M012M422M830M724L903K862K289K175J905
60321E93885J272P44N73L39k80q72r11n97n35q46j098r92o79m17k71j61OK65N63
$$ y = [3080041, 2851196, 2636497, 2437429, 2254565, 2088134, 1937682, 1802056, 1679925, 1570099, 1471395, 1382613, 1302680, 1230667, 1165706, 1107131, 1054476, 1007099, 964070, 924754, 889181, 857352, 828511, 801646, 776412, 752858, 730583, 709039, 688580, 670193, 654026, 639088, 624661, 611112, 598908, 587707, 577009, 567008, 558087, 549968, 542079, 534478, 527837, 522663, 518918, 516091, 513248, 509402, 504452, 499554, 496023, 494066, 493038, 492675, 493371, 495270, 497769, 500171, 502442, 505064, 508318, 511863, 514980, 517161, 518536, 519672, 520961, 522387, 523904, 525745, 528170, 531183, 534748, 539019, 544053, 549412, 554429, 558803, 562763, 566775, 571197, 576027, 580751, 584654, 587516, 589805, 591980, 593885, 595157, 595901, 596474, 596813, 596533, 595661, 594750, 594153, 593618, 592772, 591674, 590682, 590003, 589586, 589315, 589154, 589160, 589425, 589988]
60302E89988P89R62J309J978K711K991K627K116K270L327M621N317N390N489N908
60287F37793O267O327O456O821O740N572L891K957L196L864M126L745K798J458
60273G02011K87rO96J825K843L605M063M178M223M599N163N294M682L614K391
60258G49465J047k74j271j983k736l493l842l744l650l710l603l393l778n024
60244G10011o321o667n912m541k971j510n43k11k28l63p08j166j262q25m21n75
60228F75787j020j151q14j54Q73K191L243L535L400L561M139M590M575M385M525
60213G11665N201O212P125P631P908Q452R396J0345J1085J1985J3373J4901J6023
60200H41302J6814J7878J9588K1829K4290K6627K8547L0113L1904L4491L7854
$$ y = [589988, 590777, 591739, 593048, 595026, 597737, 600728, 603355, 605471, 607741, 611068, 615689, 621006, 626396, 631885, 637793, 644060, 650387, 656843, 663664, 670404, 675976, 679867, 682824, 686020, 689884, 694010, 697755, 700553, 702011, 702298, 702289, 702985, 704810, 707653, 711258, 715321, 719499, 723722, 728321, 733484, 738778, 743460, 747074, 749465, 750512, 750238, 748967, 746984, 744248, 740755, 736913, 733169, 729519, 725809, 722206, 718813, 715035, 710011, 703690, 697023, 691111, 686570, 683599, 682089, 681546, 681335, 681107, 680744, 680036, 678870, 677608, 676783, 676362, 675787, 674767, 673616, 672802, 672648, 673521, 675712, 678955, 682490, 685890, 689451, 693590, 698180, 702755, 707140, 711665, 716866, 723078, 730203, 737834, 745742, 754194, 763590, 773935, 785020, 797005, 810378, 825279, 841302, 858116, 875994, 895582, 917411, 941701, 968328, 996875, 1026988, 1058892, 1093383, 1131237]
60189A131237M1530M5183M8765N2333N5964N9742O3599O7354P1003P4680P8238
60178A789628Q1223Q3398Q4847Q5385Q4415Q1679P7537P2239O5552N7621M9416
60167B612940M1653L3843K5236J6145P523l35p602j3771j7855j9702k0048j9203
60155B638824j6745j2716q099l635J079O758J3404K0581K8156L6101M3956N1117
60143B798781N7516O3581O9521P4986P9310Q1840Q2149Q0204P6373P1051O4220
60132C599532N5516M4825L2774K0514Q847k376j3814k5534l6580m5745n2475n6853
60120C528631n9026n9040n7045n3292m7987m1483l4300k6654j8210q849O20R227
60108C132592J7176K5577L4661M3121M9499N3574N5887N6550N5187N1685M6370
$$ y = [1131237, 1172767, 1217950, 1266715, 1319048, 1375012, 1434754, 1498353, 1565707, 1636710, 1711390, 1789628, 1870851, 1954249, 2039096, 2124481, 2208896, 2290575, 2368112, 2440351, 2505903, 2563524, 2612940, 2654593, 2688436, 2713672, 2729817, 2737340, 2737005, 2729403, 2715632, 2697777, 2678075, 2658027, 2638824, 2622079, 2609363, 2601264, 2597629, 2598708, 2605466, 2618870, 2639451, 2667607, 2703708, 2747664, 2798781, 2856297, 2919878, 2989399, 3064385, 3143695, 3225535, 3307684, 3387888, 3464261, 3535312, 3599532, 3655048, 3699873, 3732647, 3753161, 3762008, 3759632, 3745818, 3720284, 3683704, 3637959, 3585484, 3528631, 3469605, 3410565, 3353520, 3300228, 3252241, 3210758, 3176458, 3149804, 3131594, 3122745, 3123365, 3132592, 3149768, 3175345, 3210006, 3253127, 3302626, 3356200, 3412087, 3468637, 3523824, 3575509, 3621879]
60097C621879L9692L2256K4901J8123J1594M850j588o452r076r773q742n408O79
60084C712935Q945J8392K8690M0067N2460O5510P9199R3786J09087J24532J39946
60073D473549J55707J72019J88664K05501K22367K38266K51570K61451K68404
60064F437498K72773K73586K69542K60465K46960K29304K07643J82731J55325
60055H535827J25189R1805N5850J8907j8080n4833r0369j22971j51639j76338
60045H213348j96567k10997k19027k21447k19128k12157k00819j86269j69449
60036F377488j50345j29070j06780q4672o2952m1564k1163k532J4180K8735M0180
60025E861505M7846N2191N3692N1617M5107L4927K2918J0098l559j7872l2102
$$ y = [3621879, 3661571, 3693827, 3718728, 3736851, 3748445, 3753295, 3751707, 3745255, 3736179, 3726406, 3717664, 3712256, 3712935, 3721880, 3740272, 3768962, 3809029, 3861489, 3926999, 4006198, 4099984, 4209071, 4333603, 4473549, 4629256, 4801275, 4989939, 5195440, 5417807, 5656073, 5907643, 6169094, 6437498, 6710271, 6983857, 7253399, 7513864, 7760824, 7990128, 8197771, 8380502, 8535827, 8661016, 8752821, 8808671, 8827578, 8809498, 8754665, 8664296, 8541325, 8389686, 8213348, 8016781, 7805784, 7586757, 7365310, 7146182, 6934025, 6733206, 6546937, 6377488, 6227143, 6098073, 5991293, 5906621, 5843669, 5802105, 5780942, 5778410, 5792590, 5821325, 5861505, 5909351, 5961542, 6015234, 6066851, 6111958, 6146885, 6169803, 6179901, 6176342, 6158470, 6126368]
60014F126368m5708n8447o9969q0148q9602r8814j07119j13461j17900j21143
60004E224057j22888j22016j18456j13581j08433j02575r5045q5536p4371o2137
59994D219019m9648l7530k5582j3141j73J2635K4873L6684M7932N7992O6516P3679
59982D413256P9308Q2529Q2567P9346P3064O3846N2031L8305K3268P280r210k5556
59970D960034m1196n5621o8226p8709q7442r4690r9698j01381r9846r6263r1223
59959D045739q4258p5120o4529n3370m1923l0263j8582o773N475J8010L0327M2574
59947C767307N5412O8636Q0925R1449J00793J09578J17052J21769J22990J20709
59937D756620J14922J05698R3619P9505O3880M7127K9692J1810o510k4825m2114
$$ y = [6126368, 6080660, 6022213, 5952244, 5872096, 5782494, 5683680, 5576561, 5463100, 5345200, 5224057, 5101169, 4979153, 4860697, 4747116, 4638683, 4536108, 4441063, 4355527, 4281156, 4219019, 4169371, 4131841, 4106259, 4093118, 4092945, 4105580, 4130453, 4167137, 4215069, 4273061, 4339577, 4413256, 4492564, 4575093, 4657660, 4737006, 4810070, 4873916, 4925947, 4964252, 4987520, 4994800, 4985590, 4960034, 4918838, 4863217, 4794991, 4716282, 4628840, 4534150, 4434452, 4333071, 4233225, 4136962, 4045739, 3961481, 3886361, 3821832, 3768462, 3726539, 3696276, 3677694, 3670921, 3676396, 3694406, 3724733, 3767307, 3822719, 3891355, 3972280, 4063729, 4164522, 4274100, 4391152, 4512921, 4635911, 4756620, 4871542, 4977240, 5070859, 5150364, 5214244, 5261371, 5291063, 5302873, 5296363, 5271538, 5229424]
59926E229424n7651p1454q3380r2469r7851r9723r8779r5132q8578p9566o9161
59915D295680n8177m6898l5420k3649j1215K036J5538K8412M0271N1196O1084
59904D318858O9445P5795P9969Q2122Q2709Q2186Q0567P7399P2389O5836N8424
59893E145699N0977M4429L9432L5758L2716L0459L0212L2823L7838M4538N3185
59882E578066O4486P8409R4413J12357J32247J53317J74357J94860K14972K34292
59872G031776K51487K65188K74493K78397K75389K63931K43013K12192J71739
59863I267605J23062O8636J1333m6039j00671j49859j91566k24746k49075k64697
59853H243983k72261k72768k67097k55926k40246k21543k01150j79614j57052
$$ y = [5229424, 5171773, 5100319, 5016939, 4924470, 4826619, 4726896, 4628117, 4532985, 4444407, 4364841, 4295680, 4237503, 4190605, 4155185, 4131536, 4120321, 4122357, 4137895, 4166307, 4206578, 4257774, 4318858, 4388303, 4464098, 4544067, 4626189, 4708898, 4791084, 4871651, 4949050, 5021439, 5087275, 5145699, 5196676, 5241105, 5280537, 5316295, 5349011, 5379470, 5409682, 5442505, 5480343, 5524881, 5578066, 5642552, 5720961, 5815374, 5927731, 6059978, 6213295, 6387652, 6582512, 6797484, 7031776, 7283263, 7548451, 7822944, 8101341, 8376730, 8640661, 8883674, 9095866, 9267605, 9390667, 9459303, 9470636, 9424597, 9323926, 9174067, 8982501, 8757755, 8508680, 8243983, 7971722, 7698954, 7431857, 7175931, 6935685, 6714142, 6512992, 6333378, 6176326]
59844F176326j33882j10799q8049o5239m2106j9189K592K2826M1701N9258P4883
59833E918322Q7633R6688J01318J00851R4976Q3873O7750M6552K0483r417m1563
59822F567466p4450j06529j35880j60685j80190j94692k04622k10148k11579k09554
59812D879137k04646j97230j87744j76715j64497j51498j38540j26414j15078
59803C416775j03914r2792q2215p2412o3060n4114m6153l9641l4466l0433k7644
59792B769931k6099k5522k5673k6222k6295k5018k2710k0593j9077j7323j4938
59781B520461j2971j2589j3721j5699j8306k1348k4102k6188k8202l0465l1922
59770B284948l1452k9633k7848k6050k2809j7576j1541o130j664K147N429Q211
$$ y = [6176326, 6042444, 5931645, 5843596, 5778357, 5736251, 5717062, 5719654, 5742480, 5784181, 5843439, 5918322, 6005955, 6102643, 6203961, 6304812, 6399788, 6483661, 6551411, 6597963, 6618446, 6609029, 6567466, 6493016, 6386487, 6250607, 6089922, 5909732, 5715040, 5510418, 5300270, 5088691, 4879137, 4674491, 4477261, 4289517, 4112802, 3948305, 3796807, 3658267, 3531853, 3416775, 3312861, 3220069, 3137854, 3065442, 3002382, 2948268, 2902115, 2862474, 2828008, 2797575, 2769931, 2743832, 2718310, 2692637, 2666415, 2640120, 2615102, 2592392, 2571799, 2552722, 2535399, 2520461, 2507490, 2494901, 2481180, 2465481, 2447175, 2425827, 2401725, 2375537, 2347335, 2316870, 2284948, 2253496, 2223863, 2196015, 2169965, 2147156, 2129580, 2118039, 2111909, 2110245, 2112392, 2117821, 2126032]
59758B126032J0620J2724J4591J6656J9525K3285K7491L1758L5914L9534M1999
59747B400129M3100M3171M2528M1161L9000L6121L2675K8921K5277K2022J9108
59736B773213J6554J4785J4158J4426J5192J6582J8972K2346K6626L2311L9969
59725C005134M9171N8802O8524P9124R1241J04505J18239J32452J47645J64025
59715D018862J81232J98572K15229K30373K42981K51226K51906K40904K14758
59706F046043J72452J16455N2676j1092o7793j13188j45946j66346j75396j74882
59696E532983j67278j55104j40262j23846j06296q7861o9158n1147l4326j8251
59686D579454k299J3406K8309M2441N6425P0605Q4811R8998J13445J28297J43484
$$ y = [2126032, 2136652, 2149376, 2163967, 2180623, 2200148, 2223433, 2250924, 2282682, 2318596, 2358130, 2400129, 2443229, 2486400, 2528928, 2570089, 2609089, 2645210, 2677885, 2706806, 2732083, 2754105, 2773213, 2789767, 2804552, 2818710, 2833136, 2848328, 2864910, 2883882, 2906228, 2932854, 2965165, 3005134, 3054305, 3113107, 3181631, 3260755, 3351996, 3456501, 3574740, 3707192, 3854837, 4018862, 4200094, 4398666, 4613895, 4844268, 5087249, 5338475, 5590381, 5831285, 6046043, 6218495, 6334950, 6387626, 6376534, 6308741, 6195553, 6049607, 5883261, 5707865, 5532983, 5365705, 5210601, 5070339, 4946493, 4840197, 4752336, 4683178, 4632031, 4597705, 4579454, 4577155, 4590561, 4618870, 4661311, 4717736, 4788341, 4873152, 4972150, 5085595, 5213892, 5357376]
59675E357376J59206J75891J93495K11509K29926K49672K71649K95636L20520
59666G464880L45458L70492L96136M22537M49020M74257M96850N15787N30403
59657A1465820N39965N43384N39440N27678N09461M88030M66978M48485M33285
59648A5962526M22105M16131M15847M20211M27413M35572M42107M43450M36462
59639A9821824M19799L93147L55869L07700K50414J87597J22738N8586j820n4930
59629B1860924r7970j29590j49080j55913j50501j34501j09667p6874l6559J0260
59619B0830529O1920J16812J74033K33511K95241L58078M19393M76402N27334
59610B3493253N70490O02403O17989O12601N82959N26363M40734L26499J87886
$$ y = [5357376, 5516582, 5692473, 5885968, 6097477, 6327403, 6577075, 6848724, 7144360, 7464880, 7810338, 8180830, 8576966, 8999503, 9448523, 9922780, 10419630, 10935417, 11465820, 12005785, 12549169, 13088609, 13616287, 14125748, 14613778, 15080756, 15529241, 15962526, 16384631, 16800762, 17216609, 17636820, 18064233, 18499805, 18941912, 19385362, 19821824, 20241623, 20634770, 20990639, 21298339, 21548753, 21736350, 21859088, 21917674, 21915854, 21860924, 21762954, 21633364, 21484284, 21328371, 21177870, 21043369, 20933702, 20856828, 20820269, 20830529, 20892449, 21009261, 21183294, 21416805, 21712046, 22070124, 22489517, 22965919, 23493253, 24063743, 24666146, 25284135, 25896736, 26479695, 27006058, 27446792, 27773291, 27961177]
59601B7961177L1971j32777k96819m50057n83767o92391p73465q26621q53347
59592B3383904q56970q41771q11960p71739p25744o78681o34764n97997n72511
59583A6891767n61506n65489n81680o04861o28546o46298o53554o49067o34360
59574A1366406o11674n82705n49130n13232m77190m42011m07737l74602l43362
59565G064763l14447k87469k62021k38473k17392j98412j80481j63234j47364
59556E055470j33465j21205j10011r9875r0956q3060p6229p1297o8932o8473o8653
59545D063314o9224p0901p3714p6472p8118p8727p8809p8386p7246p5452p3105
59534C233160o9951o5770o0882n5946n1317m6780m1774l5869k9222k2570j6621
$$ y = [27961177, 27993148, 27860371, 27563552, 27113495, 26529728, 25837337, 25063872, 24237251, 23383904, 22526934, 21685163, 20873203, 20101464, 19375720, 18697039, 18062275, 17464278, 16891767, 16330261, 15764772, 15183092, 14578231, 13949685, 13303387, 12649833, 12000766, 11366406, 10754732, 10172027, 9622897, 9109665, 8632475, 8190464, 7782727, 7408125, 7064763, 6750316, 6462847, 6200826, 5962353, 5744961, 5546549, 5366068, 5202834, 5055470, 4922005, 4800800, 4690789, 4590914, 4499958, 4416898, 4340669, 4269372, 4200440, 4131967, 4063314, 3994090, 3923189, 3849475, 3773003, 3694885, 3616158, 3537349, 3458963, 3381717, 3306265, 3233160, 3163209, 3097439, 3036557, 2980611, 2929294, 2882514, 2840740, 2804871, 2775649, 2753079, 2736458]
59523B736458j1534p098l168N08M457Q904J3210J6562J9082K1572K4271K6632
59511B849856K8306K9532L0543L1400L2628L5116L9045M3679M8480N3761N9844
59500C282190O6329P2722P9231Q6401R4448J03309J12936J23078J33215J43191
59490D297050J53550J64814J76551J87553J96834K04325K10681K16356K20695
59481F028409K22054K19305K13097K05102J96077J85383J72345J57239J40767
59472G739778J23467J06065Q9647P4934O1943N0787M2196L6708L3914L3181L4740
59461H427360L9330M6939N6281O5487P2961P7550P8182P3433O1792M2747J7474
59450I059536j2098m4849q0562j18563j57011j93693k26756k54541k75645k89609
$$ y = [2736458, 2724924, 2717826, 2714658, 2715166, 2719623, 2728527, 2741737, 2758299, 2777381, 2798953, 2823224, 2849856, 2878162, 2907694, 2938237, 2969637, 3002265, 3037381, 3076426, 3120105, 3168585, 3222346, 3282190, 3348519, 3421241, 3500472, 3586873, 3681321, 3784630, 3897566, 4020644, 4153859, 4297050, 4450600, 4615414, 4791965, 4979518, 5176352, 5380677, 5591358, 5807714, 6028409, 6250463, 6469768, 6682865, 6887967, 7084044, 7269427, 7441772, 7599011, 7739778, 7863245, 7969310, 8058957, 8133891, 8195834, 8246621, 8288817, 8325525, 8359439, 8392620, 8427360, 8466690, 8513629, 8569910, 8635397, 8708358, 8785908, 8864090, 8937523, 8999315, 9042062, 9059536, 9047438, 9002589, 8922027, 8803464, 8646453, 8452760, 8226004, 7971463, 7695818, 7406209]
59440G406209k96979k98338k93988k84755k72214k57535k40830k22237k02916
59431E036417j84248j66610j49568j32890j16686j00957q5666p1023n7231m4192
59421C927346l1706j9606p414N510J9080L2325M4672N6745O9397Q2445R5088J07085
59409D380967J18813J30358J41188J50576J57879J62532J64079J62021J55506
59400E723919J43679J26498J04747P8957M9103J5786j9072n3334q5744j15345
59390E969194j40713j60789j75986j87449j95457j99442j99362j96149j90840
59381D323007j83958j75712j66285j55919j45137j34638j24655j14745j04690
59372C017268r5148q6827p9428p2081o4574n7458n1093m5163l9098l2583k5875
$$ y = [7406209, 7109230, 6810892, 6516904, 6232149, 5959935, 5702400, 5461570, 5239333, 5036417, 4852169, 4685559, 4535991, 4403101, 4286415, 4185458, 4099792, 4028769, 3971538, 3927346, 3895640, 3876034, 3868620, 3874130, 3893210, 3925535, 3970207, 4026952, 4096349, 4178794, 4273882, 4380967, 4499780, 4630138, 4771326, 4921902, 5079781, 5242313, 5406392, 5568413, 5723919, 5867598, 5994096, 6098843, 6177800, 6226903, 6242689, 6223617, 6170283, 6084539, 5969194, 5828481, 5667692, 5491706, 5304257, 5108800, 4909358, 4709996, 4513847, 4323007, 4139049, 3963337, 3797052, 3641133, 3495996, 3361358, 3236703, 3121958, 3017268, 2922120, 2835293, 2755865, 2683784, 2619210, 2561752, 2510659, 2465496, 2426398, 2393815, 2367940]
59361B367940j9803j5064j1265p249k672J595N090Q730J3284J7914K1475K4419
59349B404394K7798L0801L1165K8242K4289K2306K3616K7802L3785M0436M7022
59338B741656N3777O1435O9758P7131Q2131Q5107Q7938R2514R9749J09617J21646
59327C682459J35360J50446J66699J84067K02888K23638K46175K69508K92671
59318E553911L15493L38106L60130L80675L98630M12355M19672M19151M11121
59309I009244L96701L76336L50268L20114K88628K57733K27683J98185J69377
59300A1594269J41510J14598Q8586O3059L6614P526k4502n7950r1152j23646j55493
59289A1593419j85957k13469k36584k54712k68323k78722k87249k94510l00607
$$ y = [2367940, 2348137, 2333073, 2321808, 2314559, 2311887, 2313482, 2318572, 2327302, 2340586, 2358500, 2379975, 2404394, 2432192, 2462993, 2494158, 2522400, 2546689, 2568995, 2592611, 2620413, 2654198, 2694634, 2741656, 2795433, 2856868, 2926626, 3003757, 3085888, 3170995, 3258933, 3351447, 3451196, 3560813, 3682459, 3817819, 3968265, 4134964, 4319031, 4521919, 4745557, 4991732, 5261240, 5553911, 5869404, 6207510, 6567640, 6948315, 7346945, 7759300, 8178972, 8598123, 9009244, 9405945, 9782281, 10132549, 10452663, 10741291, 10999024, 11226707, 11424892, 11594269, 11735779, 11850377, 11938963, 12002022, 12038636, 12046162, 12021660, 11963710, 11872558, 11748912, 11593419, 11407462, 11193993, 10957409, 10702697, 10434374, 10155652, 9868403, 9573893, 9273286]
59280I273286l05964l11295l16645l21107l23669l23803l21183l15532l07045
59271F427043k96361k83859k69525k53711k37377k21225k05214j89270j73858
59262D296643j59375j45543j31915j18624j06140r4564q3710p3573o4285n5727
59252C263187m7604l9761l2139k4596j7043r680k795L571R557J5267K0876K6775
59240C165615L3271M0101M6556N2159N7145O2188O7660P3317P8730Q3931Q9300
59229C849973R4780R9582J02957J04956J05996J05963J04352J01219R7406R3564
59219D860748Q9519Q5007Q0578P7177P4945P2919P0141O6621O2887N8774N3154
59208E652470M4942L3890K0165L714j5268l5458n4719p1451q5106r5460j02181
$$ y = [9273286, 8967322, 8656027, 8339382, 8018275, 7694606, 7370803, 7049620, 6734088, 6427043, 6130682, 5846823, 5577298, 5323587, 5086210, 4864985, 4659771, 4470501, 4296643, 4137268, 3991725, 3859810, 3741186, 3635046, 3540482, 3456772, 3383199, 3318914, 3263187, 3215583, 3175822, 3143683, 3119087, 3102044, 3092364, 3089569, 3093140, 3102697, 3117964, 3138840, 3165615, 3198886, 3238987, 3285543, 3337702, 3394847, 3457035, 3524695, 3598012, 3676742, 3760673, 3849973, 3944753, 4044335, 4147292, 4252248, 4358244, 4464207, 4568559, 4669778, 4767184, 4860748, 4950267, 5035274, 5115852, 5193029, 5267974, 5340893, 5411034, 5477655, 5540542, 5599316, 5652470, 5697412, 5731302, 5751467, 5755181, 5739913, 5704455, 5649736, 5578285, 5493179, 5397719, 5295538]
59197E295538j05294j05429j03179r8731r2376q4713p6028o6130n5141m3784l2443
59186D432290k0666q204M168J5549K6009L6080M5782N4929O3877P2920Q1400Q8363
59174D892497R3969R9338J05189J11320J17242J22649J27576J32738J39387J48078
59164F089983J57972J68042J78341J89053J98870K05468K07308K03761J93877
59155G792675J76449J51241J18895P9702L3865j6931o9649j21815j72010k18267
59145G754155k57581k87874l09302l22959l29280l28509l21787l10798k96780
59136D989285k80552k63044k45087k27045k09128j91855j75848j61364j48255
59127C087107j36154j24706j13959j04412r6259q8746q0975p3121o6157o0462
$$ y = [5295538, 5190244, 5084815, 4981636, 4882905, 4790529, 4705816, 4629788, 4563658, 4508517, 4464733, 4432290, 4411624, 4403420, 4407588, 4423137, 4449146, 4485226, 4531008, 4585937, 4649814, 4722734, 4804134, 4892497, 4986466, 5085804, 5190993, 5302313, 5419555, 5542204, 5669780, 5802518, 5941905, 6089983, 6247955, 6415997, 6594338, 6783391, 6982261, 7187729, 7395037, 7598798, 7792675, 7969124, 8120365, 8239260, 8318962, 8352827, 8335896, 8266247, 8144432, 7972422, 7754155, 7496574, 7208700, 6899398, 6576439, 6247159, 5918650, 5596863, 5286065, 4989285, 4708733, 4445689, 4200602, 3973557, 3764429, 3572574, 3396726, 3235362, 3087107, 2950953, 2826247, 2712288, 2607876, 2511617, 2422871, 2341896, 2268775, 2202618, 2142156]
59117B142156n5506n0854m6522m2448l8459l4824l1885k9086k5411k0949j6971
59106A749241j4282j2435j0648q457n382j240L019O066Q113J0725J4354J7665
59094A756739J9961K2573K6715L1368L4751L6836L8976M1788M4844M7921N1191
59083B153663N4386N7074N9583O2724O6648P0743P4572P8145Q1396Q4111Q6225
59072B929270Q7788Q8731Q9127Q9286Q9108Q7741Q4538P9961P5059P0322O5645
59061C836576O1016N6700N2954N0049M8301M7713M8019M9396N2533N7571O3585
59050D424413O9749P6233Q3350R0437R6492J01257J04617J05412J01890R3260
59040E347110P9852O2054M0178J5383j0329l5290n8661p9637r7000j09780j17906
$$ y = [2142156, 2086650, 2035796, 1989274, 1946826, 1908367, 1873543, 1841658, 1812572, 1787161, 1766212, 1749241, 1734959, 1722524, 1711876, 1703419, 1698037, 1696797, 1699816, 1705882, 1713995, 1724720, 1739074, 1756739, 1776700, 1799273, 1825988, 1857356, 1892107, 1928943, 1967919, 2009707, 2054551, 2102472, 2153663, 2208049, 2265123, 2324706, 2387430, 2454078, 2524821, 2599393, 2677538, 2758934, 2843045, 2929270, 3017058, 3105789, 3194916, 3284202, 3373310, 3461051, 3545589, 3625550, 3700609, 3770931, 3836576, 3897592, 3954292, 4007246, 4057295, 4105596, 4153309, 4201328, 4250724, 4303257, 4360828, 4424413, 4494162, 4570395, 4653745, 4744182, 4840674, 4941931, 5046548, 5151960, 5253850, 5347110, 5426962, 5489016, 5529194, 5544577, 5534248, 5498958, 5440297, 5360660, 5263660, 5153880, 5035974]
59029E035974j21910j22391j19872j14888j07985r9777r0973q2182p3756o5991
59019D036249n9252n3764m9568m6933m6407m8046n1062n4698n9130o4813p1294
59008C431282p7392q2530q7131r1591r5510r8174r9291r8998r7530r5214r2547
58997B415374q9885q7035q3475p9161p4901p1560o8907o5720o1360n6760n3257
58986A623353n0799m8178m4919m1912l9904l8255l5856l2652k9559k7246k5548
58975A208525k3924k2054j9979j7963j6122j4173j1803r298p431o612o470o364
58963A046332n925n035l799k652k034j814j459q03k11N4Q1j7j10K55J378K679
58947A026920L219K977K763K902L049L307M255N614O223N810N430N646N708N274
$$ y = [5035974, 4914064, 4791673, 4671801, 4556913, 4448928, 4349151, 4258178, 4175996, 4102240, 4036249, 3976997, 3923233, 3873665, 3826732, 3780325, 3732279, 3681217, 3626519, 3567389, 3502576, 3431282, 3353890, 3271360, 3184229, 3092638, 2997128, 2898954, 2799663, 2700665, 2603135, 2507921, 2415374, 2325489, 2238454, 2154979, 2075818, 2000917, 1929357, 1860450, 1794730, 1733370, 1676610, 1623353, 1572554, 1524376, 1479457, 1437545, 1397641, 1359386, 1323530, 1290878, 1261319, 1234073, 1208525, 1184601, 1162547, 1142568, 1124605, 1108483, 1094310, 1082507, 1073209, 1065778, 1059166, 1052696, 1046332, 1040407, 1035372, 1031573, 1028921, 1026887, 1025073, 1023614, 1022811, 1022600, 1022654, 1022735, 1022718, 1022608, 1022863, 1024241, 1026920, 1030139, 1033116, 1035879, 1038781, 1041830, 1045137, 1049392, 1055006, 1061229, 1067039, 1072469, 1078115, 1083823, 1089097]
58933A089097N481P077Q852R390R333J0282J2134J3198J2813J2201J2567J3597
58921A216022J4248J4158J3898J4174J5049J5877J6159J6333J7168J8335J8604
58910A390025J7826J7600J9202K1817K3760K4635K5198K5901K6734K7975K9785
58899A650458L1401L1975L1961L2598L4170L5850L7178L8643M0735M3325M6153
58888B054447M9211N2578N6322O0531O5046O9473P3778P8492Q3900Q9651R5656
58877B829085J02619J10870J19447J27321J34921J43428J53147J63651J75055
58868D059544J87900K02135K17353K33764K51772K70951K90514L10673L32323
58859F356929L55538L79479M03612M27835M51545M73687M93686N11081N24223
$$ y = [1089097, 1094578, 1101655, 1110507, 1119897, 1129230, 1139512, 1151646, 1164844, 1177657, 1189858, 1202425, 1216022, 1230270, 1244428, 1258326, 1272500, 1287549, 1303426, 1319585, 1335918, 1353086, 1371421, 1390025, 1407851, 1425451, 1444653, 1466470, 1490230, 1514865, 1540063, 1565964, 1592698, 1620673, 1650458, 1681859, 1713834, 1745795, 1778393, 1812563, 1848413, 1885591, 1924234, 1964969, 2008294, 2054447, 2103658, 2156236, 2212558, 2273089, 2338135, 2407608, 2481386, 2559878, 2643778, 2733429, 2829085, 2931704, 3042574, 3162021, 3289342, 3424263, 3567691, 3720838, 3884489, 4059544, 4247444, 4449579, 4666932, 4900696, 5152468, 5423419, 5713933, 6024606, 6356929, 6712467, 7091946, 7495558, 7923393, 8374938, 8848625, 9342311, 9853392, 10377615]
58850A0377615N30509N28006N15714M92242M55571M04627L40114K63664J77286
58841A4085348Q4083j1599j05390j93761k73619l42137l97762m40771m72261m92959
58831A1439172n03312n04239m97279m84229m66781m46287m23665l99688l75262
58822G338430l51219l27985l05734k84674k64858k46053k28255k11994j97637
58813D920021j84724j72544j61010j50402j40620j31363j22649j14457j06277
58804C635975r7760q9476q2143p5518o8835o2051n5738n0018m4570l9410l4739
58793B935717l0113k4830j9000j3420q369l422J672O717J1658J6697K1938K7517
58781B922762L3758M0583M7191N3099N9093O6131P3868Q1283Q8393R6082J04544
$$ y = [10377615, 10908124, 11436130, 11951844, 12444086, 12899657, 13304284, 13644398, 13908062, 14085348, 14169431, 14157832, 14052442, 13858681, 13585062, 13242925, 12845163, 12404392, 11932131, 11439172, 10935860, 10431621, 9934342, 9450113, 8983332, 8537045, 8113380, 7713692, 7338430, 6987211, 6659226, 6353492, 6068818, 5803960, 5557907, 5329652, 5117658, 4920021, 4735297, 4562753, 4401743, 4251341, 4110721, 3979358, 3856709, 3742252, 3635975, 3538215, 3448739, 3366596, 3291078, 3222243, 3160192, 3104454, 3054436, 3009866, 2970456, 2935717, 2905604, 2880774, 2861774, 2848354, 2839985, 2836563, 2838235, 2844952, 2856610, 2873307, 2895245, 2922762, 2956520, 2997103, 3044294, 3097393, 3156486, 3222617, 3296485, 3377768, 3466161, 3562243, 3666787]
58770C666787J13203J22087J31945J42959J54424J65866J77558J89964K03472
58761E068265K18570K35360K53201K71644K91378L13228L36618L60272L83916
58752G732452M07979M31939M54320M74025M90162N00852N03787M97760M82025
58743A1975301M54426M12188L54907K84987K05089J16947K3113p2117j64222k49554
58733A3341065l24663l86668m35052m71502m97153n11576n15153n10555n00580
58724I188163m86109m67440m46132m23983m01218l77396l53265l30289l08836
58715E593495k88235k68370k49985k33546k18745k05095j92327j80292j69010
58706C587890j58686j49296j40353j31408j22586j14385j07207j01105r5652r0023
$$ y = [3666787, 3779990, 3902077, 4034022, 4176981, 4331405, 4497271, 4674829, 4864793, 5068265, 5286835, 5522195, 5775396, 6047040, 6338418, 6651646, 6988264, 7348536, 7732452, 8140431, 8572370, 9026690, 9500715, 9990877, 10491729, 10995516, 11493276, 11975301, 12429727, 12841915, 13196822, 13481809, 13686898, 13803845, 13826958, 13754841, 13590619, 13341065, 13016402, 12629734, 12194682, 11723180, 11226027, 10714451, 10199298, 9688743, 9188163, 8702054, 8234614, 7788482, 7364499, 6963281, 6585885, 6232620, 5902331, 5593495, 5305260, 5036890, 4786905, 4553359, 4334614, 4129519, 3937192, 3756900, 3587890, 3429204, 3279908, 3139555, 3008147, 2885561, 2771176, 2663969, 2562864, 2467212, 2377189]
58696B377189q3695p7078p0954o5454o0201n5305n1232m7798m4232m0370l6872
58685A743998l4156l1978l0161k8766k7538k6057k4611k3827k3558k3042k2221
58674A448083k1658k1218k0135j8537j7474j7189j6794j6013j5798j6676j7876
58663A248715j8710j9526k0636k1485k1615k1365k1035k0397j9621j9504k0153
58652A024668k0498j9812j8621j7550j6379j4953j3894j3610j3533j3061j2428
58641H50329j1995j1582j1056j0696j0444r709q487p688p863q459q841r062r197
58628G25250q915q212p627p331o908o258n655m791l090j082jK57J062K595L323
58613F72617K570J695J750J827Q50n86j405j632j712j552j331j823k850k863j195
$$ y = [2377189, 2293494, 2216416, 2145462, 2080008, 2019807, 1964502, 1913270, 1865472, 1821240, 1780870, 1743998, 1709842, 1677864, 1647703, 1618937, 1591399, 1565342, 1540731, 1516904, 1493346, 1470304, 1448083, 1426425, 1405207, 1385072, 1366535, 1349061, 1331872, 1315078, 1299065, 1283267, 1266591, 1248715, 1230005, 1210479, 1189843, 1168358, 1146743, 1125378, 1104343, 1083946, 1064325, 1044821, 1024668, 1004170, 984358, 965737, 948187, 931808, 916855, 902961, 889351, 875818, 862757, 850329, 838334, 826752, 815696, 805000, 794556, 784847, 776360, 768672, 760809, 752350, 743509, 734447, 725250, 716335, 708123, 700496, 693165, 686257, 679999, 674344, 669553, 666463, 665381, 665380, 665637, 666699, 669294, 672617, 675187, 676882, 678632, 680459, 681309, 680723, 679318, 677686, 675974, 674422, 673091, 671268, 668418, 665555, 664360]
58598F64360O73J275J112J221J451J473K058L654N072N223M998N791P284Q429
58584G14074R523J1535J4166J6295J7720J8969K0102K1046K2430K4658K6971K8646
58572I46135L0321L2772L5379L7317L9331M2691M7232N1979N6911O2494O8243
58561A450805P3488P8941Q5769R3676J01554J09475J18296J27702J36444J44075
58551B520225J50708J55265J55799J51548J43043J30174J11791Q7555N8879K7714
58541C692701m426l5954o4808q9155j08106j21689j30609j35868j38104j37368
58531B726614j33821j28178j21207j13337j05127r7395r0477q4026p7883p2239
58521A702924o6687o0379n3506m7266m1907l6406l0736k6611k4900k4132k2883
$$ y = [664360, 665033, 666308, 667420, 668641, 670092, 671565, 673623, 677277, 682349, 687572, 692570, 698361, 705645, 714074, 723597, 735132, 749298, 765593, 783313, 802282, 822384, 843430, 865860, 890518, 917489, 946135, 976456, 1009228, 1044607, 1081924, 1121255, 1163946, 1211178, 1263157, 1320068, 1382562, 1450805, 1524293, 1603234, 1689003, 1782679, 1884233, 1993708, 2112004, 2239706, 2376150, 2520225, 2670933, 2826198, 2981997, 3133545, 3276588, 3406762, 3518553, 3606108, 3664987, 3692701, 3688275, 3652321, 3587513, 3498358, 3390252, 3268563, 3137954, 3002086, 2863982, 2726614, 2592793, 2464615, 2343408, 2230071, 2124944, 2027549, 1937072, 1853046, 1775163, 1702924, 1636237, 1575858, 1522352, 1475086, 1433179, 1396773, 1366037, 1339426, 1314526, 1290394, 1267511]
58510A267511k1784k1631k1284j9430j6898j5245j4330j3316j2782j3550j4530
58499A082731j4053j2697j2496j3922j5760j7435j9323k1030k1536k0981k0512
58488H92986k0408j9923j8783j7412j5958j4475j3606j3679j3672j2566j1105
58477G21399j0655j0989j0817r921r094q546p993p793q255q494p586o233n631
58464F09392n481m849m203m532n197m761l428k556k272j624p18m99o90j25J030
58449E69487J470J018P69R99R01L74J95M75M96R5l34r19j896k590k499k689m268
58432E61084o063n968m154k855l193m209m889n108m755l738k757k472k273j456
58418E07194q43j413k155j475L9N77Q8r3L4o07j675j828j325j572k435k581k270
$$ y = [1267511, 1245727, 1224096, 1202812, 1183382, 1166484, 1151239, 1136909, 1123593, 1110811, 1097261, 1082731, 1068678, 1055981, 1043485, 1029563, 1013803, 996368, 977045, 956015, 934479, 913498, 892986, 872578, 852655, 833872, 816460, 800502, 786027, 772421, 758742, 745070, 732504, 721399, 710744, 699755, 688938, 679017, 669923, 661377, 653384, 645591, 637336, 628842, 621256, 615023, 609392, 603911, 599062, 594859, 590327, 585130, 580369, 576941, 574385, 572113, 570489, 569771, 569272, 568582, 568457, 569487, 570957, 571975, 572744, 573743, 574644, 575018, 575213, 575688, 576184, 576279, 575945, 575026, 573130, 570540, 568041, 565352, 561084, 555021, 549053, 544899, 542044, 538851, 534642, 529753, 524645, 519890, 516152, 513395, 510923, 508650, 507194, 506351, 504938, 502783, 501308, 501347, 501924, 502012, 501919, 501953, 501346, 499671, 497843, 496518, 494946, 492511, 489930, 487660]
58401D87660k907m030l644j664k13k39m99j46K83O76J617K611K506J839K284L710
58385D89844M514M710N764P236O921M790L525M206M602K954O29m60o15j032j785
58370E35803k456l104l604l469l004l099l594l510l020l232l964l844k718j773
58356D91412j223j54J256J745J320J261J700J655J403K218L743M383M238M754
58342E19711N564M846L017K628M201N459N325N296O111O411N741N644O673P370
58328E93997P212P573Q706Q821P273N760N186M345K763J898K299K404J390M98
58314F60125M77L73j57j68J88n18j972k026l92P15M21L77J233J473Q07J128K816
58297F64900L606K568J736K334K823K216J924K715L109K397K045K708L038K751
$$ y = [487660, 484753, 480723, 477079, 475415, 475202, 474963, 474464, 474318, 474601, 475277, 476894, 479505, 482011, 483850, 486134, 489844, 494358, 499068, 504832, 512068, 518989, 523779, 527304, 531510, 536112, 539066, 539695, 539235, 538620, 537588, 535803, 533347, 530243, 526639, 523170, 520166, 517067, 513473, 509963, 506943, 503711, 499747, 495903, 493185, 491412, 490189, 490035, 491291, 493036, 494356, 495617, 497317, 498972, 500375, 502593, 506336, 510719, 514957, 519711, 525275, 530121, 533138, 535766, 539967, 545426, 550751, 556047, 562158, 568569, 574310, 579954, 586627, 593997, 601209, 608782, 617488, 626309, 633582, 639342, 644528, 648873, 651636, 653534, 655833, 658237, 659627, 660125, 660602, 660975, 660818, 660650, 660838, 660320, 658348, 656322, 655930, 656645, 657066, 657443, 658676, 660149, 660956, 662084, 664900, 668506, 671074, 672810, 675144, 677967, 680183, 682107, 684822, 687931, 690328, 692373, 695081, 698119, 700870]
58283G00870L459N183N636M346L829N190O308N919N762O972Q081Q220Q565R186
58269G87526Q276O058N367O870P871P373P777R910J1110J0343J0351J2426J3819
58256I05077J2873J1945J2599J2658J0840R607J0519J1343J0708J0931J3215J4869
58244A047184J4418J4638J7187J9079J8033J6583J7237J8258J7863J8001K0200
58233A238681K2222K2478K3132K5391K6592K5452K5174K7589K9538K8852K8488
58222A523589L0619L2280L1294L0846L3444L5978L5691L5528L8399M1635M2349
58211A911652M2902M5843M8813M9772N1680N6701O1422O3162O5198P0234P4893
58200B542272P6353P8000Q2602Q6572Q7264Q9029R5271J01639J04180J07014J14452
$$ y = [700870, 704329, 709512, 715148, 719494, 723323, 728513, 734821, 740740, 746502, 753474, 761555, 769775, 778340, 787526, 795802, 801860, 807227, 814097, 821968, 829341, 837118, 847028, 858138, 868481, 878832, 891258, 905077, 917950, 929895, 942494, 955152, 965992, 975599, 986118, 997461, 1008169, 1019100, 1032315, 1047184, 1061602, 1076240, 1093427, 1112506, 1130539, 1147122, 1164359, 1182617, 1200480, 1218481, 1238681, 1260903, 1283381, 1306513, 1331904, 1358496, 1383948, 1409122, 1436711, 1466249, 1495101, 1523589, 1554208, 1586488, 1617782, 1648628, 1682072, 1718050, 1753741, 1789269, 1827668, 1869303, 1911652, 1954554, 2000397, 2049210, 2098982, 2150662, 2207363, 2268785, 2331947, 2397145, 2467379, 2542272, 2618625, 2696625, 2779227, 2865799, 2953063, 3042092, 3137363, 3239002, 3343182, 3450196, 3564648]
58189C564648J22683J27342J32004J40868J50169J55564J60779J70120J79658
58180D903835J85055J90774K02105K15513K26413K38584K55946K73309K85829
58171F977363K99133L19180L41057L59352L80169M10284M43993M73870N04824
58162A0509225N43719N85240O22842O63390P15494P73956Q31701Q95661R73671
58153A7114899J057872J139327J226108J327532J434972J540009J656576J802031
58145B8299326J972988K165508K400717K701030L059909L466781L940359M502198
58137E2508816N143232N858428O684259P648759Q713828R827677J1006053J2308188
58129A19699240J3797399J5596180J7800985K0013757K0936993J8871482J3070696
$$ y = [3564648, 3687331, 3814673, 3946677, 4087545, 4237714, 4393278, 4554057, 4724177, 4903835, 5088890, 5279664, 5481769, 5697282, 5923695, 6162279, 6418225, 6691534, 6977363, 7276496, 7595676, 7936733, 8296085, 8676254, 9086538, 9530531, 10004401, 10509225, 11052944, 11638184, 12261026, 12924416, 13639910, 14413866, 15245567, 16141228, 17114899, 18172771, 19312098, 20538206, 21865738, 23300710, 24840719, 26497295, 28299326, 30272314, 32437822, 34838539, 37539569, 40599478, 44066259, 48006618, 52508816, 57652048, 63510476, 70194735, 77843494, 86557322, 96384999, 107391052, 119699240, 133496639, 149092819, 166893804, 186907561, 207844554, 226716036, 239786732]
58122B39786732M656290l989978j0804537j5052331j7089422j7585877j7094745
58115A62826132j6034289j4711024j3291859j1855491j0481581r241545q140462
58108G9069881p141992o237417n440100m735757m093106l508556k993235k530654
58100D2389064k091148j674350j295898r46121o00795k53771J03647N05137R34606
58091C7070371J226596J125819N06760m80322j503844k276788k693125k801782
58083C0173685k709879k513193k274771k030487j800396j594360j413370j254415
58075A4582814j116618r99736q99058q08197p25964o54580n92931n37961m90612
58066G757157m53089m22059l91790l62313l37389l16286k95041k74023k56577
$$ y = [239786732, 244443022, 240453044, 229648507, 214596176, 197506754, 179920877, 162826132, 146791843, 132080819, 118788960, 106933469, 96451888, 87210343, 79069881, 71927889, 65690472, 60250372, 55514615, 51421509, 47912953, 44919718, 42389064, 40297916, 38623566, 37327668, 36381547, 35780752, 35526981, 35630628, 36135765, 37070371, 38296967, 39422786, 39929546, 39449224, 37945380, 35668592, 32975467, 30173685, 27463806, 24950613, 22675842, 20645355, 18844959, 17250599, 15837229, 14582814, 13466196, 12466460, 11567402, 10759205, 10033241, 9378661, 8785730, 8247769, 7757157, 7304068, 6882009, 6490219, 6127906, 5790517, 5474231, 5179190, 4905167, 4648590]
58057D648590k41628k25197k08034j94328j83916j73009j61730j53694j48863
58048B958191j43620j37291j32029j27052j19541j10566j03784r8923r2627q5071
58038A807687p9577p6266p2074o6554o2042n8595n4239m9547m6622m4418m0371
58027A157382l5679l3497l3008l0865k7478k6131k6735k6193k4333k3781k4394
58016H45288k3497k1334k0721k1516k0759j8252j6795j6847j6045j4038j2921
58005F42563j2796j1637r564q706q890p991o341o225p282p004n598n679p245p608
57991E29997o286n450n495m720l379l484m551m091k447k567m650n608m281k818
57977D70170k329j521j95O7o37l60Q78R53k62n98J95l1j664k601k310k626l909
$$ y = [4648590, 4406962, 4181765, 3973731, 3779403, 3595487, 3422478, 3260748, 3107054, 2958191, 2814571, 2677280, 2545251, 2418199, 2298658, 2188092, 2084308, 1985385, 1892758, 1807687, 1728110, 1651844, 1579770, 1513216, 1451174, 1392579, 1338340, 1288793, 1242171, 1197753, 1157382, 1121703, 1088206, 1055198, 1024333, 996855, 970724, 943989, 917796, 893463, 869682, 845288, 821791, 800457, 779736, 758220, 737461, 719209, 702414, 685567, 669522, 655484, 642563, 629767, 618130, 608566, 599860, 590970, 582979, 576638, 570413, 563131, 556127, 550529, 544850, 537605, 529997, 523711, 518261, 512766, 508046, 504667, 501183, 496632, 492541, 490094, 487527, 482877, 477269, 472988, 470170, 467841, 466320, 466125, 466192, 465555, 465195, 466073, 467026, 466764, 466166, 466361, 466330, 464666, 462065, 459755, 457129, 453220]
57960D53220m218l133k623l344l748l472m003n268n347m298m522o468p631o905
57946C88240o219o783p141o226n098m461l489k198k008k945l201k315j863k275
57932C32018k012o95J75L46J470L698M881M245L631L983L787K351J442K142K902
57917C64364K365J498J351J104m1j256j739k102k885l533l776m198m743m613m051
57902C37745m182m742m291k958k402k816k653j760j797k977l412k551k210l153
57888B95841l680k784j866j922j771n63N15N13L30O90P86K58K43J133J503N53
57872B89779n57r43j379k318k778k454k688m036n006m493l352k454j308J63P17
57857B56893l5n83J12J212J948K861L966M017K871K340L389M621M815M707M924
$$ y = [453220, 449002, 445869, 443246, 439902, 436154, 432682, 428679, 423411, 418064, 413766, 409244, 402776, 395145, 388240, 382021, 375238, 368097, 361871, 356773, 352312, 348823, 346625, 344617, 341672, 338471, 336156, 334293, 332018, 330006, 329311, 329486, 329832, 331302, 335000, 339881, 344126, 347757, 351740, 355527, 357878, 359320, 361462, 364364, 366729, 368227, 369578, 370682, 370641, 369385, 367646, 365544, 362659, 359126, 355350, 351152, 346409, 341796, 337745, 333563, 328821, 324530, 321572, 319170, 316354, 313701, 311941, 310144, 307167, 303755, 301204, 298994, 295841, 292161, 289377, 287511, 285589, 283818, 283255, 283770, 284283, 284613, 285303, 286089, 286347, 286590, 287723, 289226, 289779, 289222, 288279, 286900, 284582, 281804, 279350, 276662, 272626, 267620, 263127, 259775, 257321, 256013, 256176, 256893, 256858, 256275, 256387, 257599, 259547, 262408, 266374, 270391, 273262, 275602, 278991, 283612, 288427, 293134, 298058]
57842B98058M493K964J761J767J681L85j025j268r89j169j322r37r71k208l753
57827B97467m604n145n667n231l557k220k442l260l337k876k431j569k06M94P7
57812B55493j22P94J725J755J883K984L984L827L412L711L845K881J874K087K682
57797B92815K274J281Q14N77j78q89q15p37j690l139m038m571n227n474m964m716
57781B61323n425o011n475m784n102n621n016l668k615j791j117j717l940n682
57767B03359n085l501l365m438m732m104m088m841n031m428m111m275m062l467
57753A43831l342l640l517l000k738k410j256Q1K13o86j017k58M53L22p9O1Q97
57736A23915K248L761M800N138N404N939N846M321K240J136J163J368J331J176
$$ y = [298058, 302551, 305515, 307276, 309043, 310724, 311109, 310084, 308816, 307827, 306658, 305336, 304399, 303428, 301220, 297467, 292863, 287718, 282051, 276820, 273263, 271043, 268601, 265341, 262004, 259128, 256697, 255128, 254922, 255416, 255493, 255371, 256165, 257890, 259645, 261528, 264512, 268496, 272323, 275735, 279446, 283291, 286172, 288046, 290133, 292815, 295089, 296370, 297184, 297761, 297583, 296694, 295879, 295142, 293452, 290313, 286275, 281704, 276477, 271003, 266039, 261323, 255898, 249887, 244412, 239628, 234526, 228905, 223889, 220221, 217606, 215815, 214698, 212981, 209041, 203359, 198274, 194773, 191408, 186970, 182238, 178134, 174046, 169205, 164174, 159746, 155635, 151360, 147298, 143831, 140489, 136849, 133332, 130332, 127594, 125184, 123928, 124009, 124222, 123536, 122519, 122261, 122714, 123036, 122957, 123018, 123915, 126163, 129924, 134724, 139862, 145266, 151205, 157051, 161372, 163612, 164748, 165911, 167279, 168610, 169786]
57722A69786O01o31j758j960j720j870k022j427p42j238k651l435k956j967j143
57707A44867n57l28n22o03j65K25m2m05q2N21O86R26K035L280L221K054J399J946
57689A58456K767K962K583K038J666J788K241K211J403P67J081J697J797J888
57675A85345K697L537L383K779K910L529L570L165L275L859M176M394N120N850
57661B37589N717N328N936P221P781P568P780Q634R220R454J0116J1037J1306
57648C44687J1288J2407J4699J6572J7320J7995J9344K0729K1674K2796K4538
57637E44049K6410K8102L0171L3079L6558M0215M3859M7188N0230N3979N9433
57626I93273O6124P2787P9317Q6640R4857J03048J10860J18741J26537J33266
$$ y = [169786, 170387, 169756, 167998, 166038, 164318, 162448, 160426, 158999, 158257, 157019, 154368, 150933, 147977, 146010, 144867, 144310, 143982, 143460, 142857, 142692, 142917, 142875, 142470, 142388, 142909, 143595, 144521, 146556, 149836, 153057, 155111, 156510, 158456, 161223, 164185, 166768, 168806, 170472, 172260, 174501, 176712, 178115, 178882, 179963, 181660, 183457, 185345, 188042, 191579, 194962, 197741, 200651, 204180, 207750, 210915, 214190, 218049, 222225, 226619, 231739, 237589, 243306, 248634, 254570, 261791, 269572, 277140, 284920, 293554, 302774, 312228, 322344, 333381, 344687, 355975, 368382, 383081, 399653, 416973, 434968, 454312, 475041, 496715, 519511, 544049, 570459, 598561, 628732, 661811, 698369, 738584, 782443, 829631, 879861, 933840, 993273, 1059397, 1132184, 1211501, 1298141, 1392998, 1496046, 1606906, 1725647, 1852184, 1985450]
57616A985450J38302J41426J41777J38258J30892J20383J06506Q8651O7815M6123
57606C105583K4105J65k6883n6046q4903j10509j29646j40250j43115j40956j35654
57595B161891j27790j18451j09236j00328r0623q0203p0659o2566n4803m6976
57585A300256m0367l5607l1390k6641k2062j8391j4755j0162n213j052K347N705
57573A102668R224J2832J6756K1049K5387K9855L4981M0585M5750N0458N5884
57562A445429O2475O9145P5053Q0812Q6913R2294R5580R6607R5642R2020Q4601
57551B376571P2962N7375L8276J6554o300k8829m9835o7914q1790r1551r8382
57540B137137j02779j04241j03068j00891r8661r5557r0758q4971p9223p3418
$$ y = [1985450, 2123752, 2265178, 2406955, 2545213, 2676105, 2796488, 2902994, 2991645, 3059460, 3105583, 3129688, 3129853, 3102970, 3046924, 2962021, 2851512, 2721866, 2581616, 2438501, 2297545, 2161891, 2034101, 1915650, 1806414, 1706086, 1615463, 1535260, 1464601, 1402035, 1347232, 1300256, 1259889, 1224282, 1192892, 1166251, 1144189, 1125798, 1111043, 1100881, 1095668, 1094616, 1096963, 1102668, 1111892, 1124724, 1141480, 1162529, 1187916, 1217771, 1252752, 1293337, 1339087, 1389545, 1445429, 1507904, 1577049, 1652102, 1732914, 1819827, 1912121, 2007701, 2104308, 2199950, 2291970, 2376571, 2449533, 2506908, 2545184, 2561738, 2555438, 2526609, 2476774, 2408860, 2327070, 2235519, 2137137, 2034358, 1930117, 1827049, 1726158, 1627497, 1531940, 1441182, 1356211, 1276988, 1203570]
57530A203570o7263o1555n7206n3767n0088m5884m1762l8220l5423l3370l1641
57519F87391k9554k7104k5031k3517k1723j9202j6789j5346j4539j3610j2520
57508D68456j1529j0424q995p638o782o222n613m912m007k629j104k79k20N8J142
57493C99302K464L536M816O682Q576R940J1029J2119J2892J3351J4327J6191J8096
57480E33321J9333K0576K2823K5964K9223L2226L4812L6651L8034M0237M4093
57469H77293M8860N3320N7326O1476O5895P0210P4085P7051P8450P8169P6690
57458A618825P3701O7511N6794M2219K5708Q690q141k4138l8654n1191o1030o7456
57446A642838p0790p2374p2965p2106o9598o6451o3466o0061n5521n0427m5749
$$ y = [1203570, 1136307, 1074752, 1017546, 963779, 913691, 867807, 826045, 787825, 752402, 719032, 687391, 657837, 630733, 605702, 582185, 560462, 541260, 524471, 509125, 494586, 480976, 468456, 456927, 446503, 437508, 429870, 423088, 416866, 411253, 406341, 402334, 399705, 398601, 398322, 398102, 398160, 399302, 401766, 405302, 410118, 416800, 425376, 435316, 446345, 458464, 471356, 484707, 499034, 515225, 533321, 552654, 573230, 596053, 622017, 651240, 683466, 718278, 754929, 792963, 833200, 877293, 926153, 979473, 1036799, 1098275, 1164170, 1234380, 1308465, 1385516, 1463966, 1542135, 1618825, 1692526, 1760037, 1816831, 1859050, 1884758, 1893448, 1885307, 1861169, 1822515, 1771324, 1710294, 1642838, 1572048, 1499674, 1426709, 1354603, 1285005, 1218554, 1155088, 1095027, 1039506, 989079, 943330]
57435I43330m1410l6856l2301k8377k5164k2441k0178j8010j5079j1300p836n469
57423F78909l490j094J213K828M452O944R733J1897J3934J6951K0721K4141K7093
57410H14232L0324L3904L7322M0858M5368N0783N6111O0809O4985O8358P0077
57399A373131O9636O6970O1812N3781M2984K9783J4321k947k0634l7147n1650
57388A600040o3685p2513p7831q0561q1868q1881q0214p7201p3549o9340o4564
57377G76833o0026n6499n3373m9402m4553l9981l6463l3872l1899l0154k7931
57366C12680k4911k1886j9780j8372j6923j5583j4944j4678j3901j2635j1694
57355A27373j1291j0958j0625j0545j0369r516q325p737p861p951p704p482p298
$$ y = [943330, 901920, 865064, 832763, 804386, 779222, 756781, 736603, 718593, 703514, 692214, 684378, 678909, 675419, 674325, 675538, 678366, 682818, 689762, 699495, 711392, 725326, 742277, 762998, 787139, 814232, 844556, 878460, 915782, 956640, 1002008, 1052791, 1108902, 1169711, 1234696, 1303054, 1373131, 1442767, 1509737, 1571549, 1625330, 1668314, 1698097, 1712418, 1709471, 1688837, 1651690, 1600040, 1536355, 1463842, 1386011, 1305450, 1223582, 1141701, 1061487, 984286, 910737, 841397, 776833, 716807, 660308, 606935, 557533, 512980, 472999, 436536, 402664, 370765, 340611, 312680, 287769, 265883, 246103, 227731, 210808, 195225, 180281, 165603, 151702, 139067, 127373, 116082, 105124, 94499, 83954, 73585, 64069, 55744, 48007, 40146, 32195, 24491, 17009, 9711]
57342I711C028b615m827m580m658m735m583l977l113k755l273l969m079l908m049
57327e5121m269m155m194m921n579n105l966l557m041m263l652k799k153j496
57313a09271p80k74J05O20J003R31R07J527K252K162J618J713K376K508J941J651
57297h9011K037K452K666L270M368N189N411N672O438P335P906Q113P917P228
57283a3009O332a162C259K625O85l88m99k41L11J390K461K669K191J934K038K011
57267B0446J980K418K949K899K722L256L903L387K080J648K348K764K347K138
57253E7285K535K522J754J475K471L798M484M853N325N364M690M186M618N512
57239A10872O145O609P192P703Q079Q716R600J0117J0160J0430J1224J1982J2411
$$ y = [9711, 3028, -2615, -7442, -12022, -16680, -21415, -25998, -29975, -33088, -35843, -39116, -43085, -47164, -51072, -55121, -59390, -63545, -67739, -72660, -78239, -83344, -87310, -90867, -94908, -99171, -102823, -105622, -107775, -109271, -110051, -110325, -110220, -109600, -108597, -107666, -106759, -105232, -102980, -100818, -99200, -97487, -95111, -92603, -90662, -89011, -86974, -84522, -81856, -78586, -74218, -69029, -63618, -57946, -51508, -44173, -36267, -28154, -20237, -13009, -6677, -1162, 3259, 5884, 6569, 6181, 5682, 5441, 5752, 7142, 9603, 12272, 14463, 16397, 18435, 20446, 22426, 24844, 27793, 30692, 33414, 36670, 40573, 43960, 46040, 47688, 50036, 52800, 55147, 57285, 59820, 62342, 64096, 65571, 68042, 71840, 76324, 81177, 86502, 91866, 96556, 100742, 105360, 110872, 117017, 123626, 130818, 138521, 146600, 155316, 164916, 175033, 185193, 195623, 206847, 218829, 231240]
57226B31240J2888J3418J3453J3113J3306J4239J5075J5411J5719J6012J5615
57215C89489J4676J4333J4697J4234J1906Q488N060J724j549m343o931j0362j4483
57202D36939j7446j8252j8249j8961j9854j9622j8356j7022j5844j4531j3243
57191B45559j2184j1016r647q623p889o363l708j366n99n92J97J820L358M737
57177A93684O590Q806J0540J1396J1656J1769J2294J3720J5646J6818J6715J6334
57165C45968J6843J8329K0470K3346K6694K9429L0807L1256L1336L0932L0195
57154F35605K9993L0456L0259K8468K6054K4446K3695K3148K2866K3059K3088
57143I21137K2323K1266K0757K0795K1131K2022K3414K4467K4964K6020K8237
$$ y = [231240, 244128, 257546, 270999, 284112, 297418, 311657, 326732, 342143, 357862, 373874, 389489, 404165, 418498, 433195, 447429, 459335, 467823, 472883, 474607, 473058, 468715, 461784, 451422, 436939, 419493, 401241, 382992, 364031, 344177, 324555, 306199, 289177, 273333, 258802, 245559, 233375, 222359, 212712, 204089, 196200, 189837, 186129, 184763, 184164, 183572, 183769, 185589, 188947, 193684, 200274, 209080, 219620, 231016, 242672, 254441, 266735, 280455, 296101, 312919, 329634, 345968, 362811, 381140, 401610, 424956, 451650, 481079, 511886, 543142, 574478, 605410, 635605, 665598, 696054, 726313, 754781, 780835, 805281, 828976, 852124, 874990, 898049, 921137, 943460, 964726, 985483, 1006278, 1027409, 1049431, 1072845, 1097312, 1122276, 1148296, 1176533]
57132A176533L0241L0508K9441K8201K6635K4048K1136J9292J8508J7634J6348
57121A438525J5341J4912J4757J4761J4789J4052J1913R020O616N193M670N173
57109A569722O558P830Q201Q064P975P448N986M434L945M170L701J803j308n296
57095A633233r801j4422j9453k5862l3700m1665m9118n7224o6952p7296q6901
57084A150839r6041j05479j14581j22365j29357j36761j44695A48743a2855j71443
57074a84298j81666j92033k03940k18341k33818k48557k63040k78778k95845l13773
57064b614089l33539l56302l81430m08259m38676m75351n18381n66262o19275
57055f711564o79298p47312q23869r11318j012834j129856j262899j413906j585194
$$ y = [1176533, 1206774, 1237282, 1266723, 1294924, 1321559, 1345607, 1366743, 1386035, 1404543, 1422177, 1438525, 1453866, 1468778, 1483535, 1498296, 1513085, 1527137, 1539050, 1548070, 1554686, 1559879, 1564549, 1569722, 1576280, 1584110, 1592311, 1600375, 1608350, 1615798, 1621784, 1626218, 1630163, 1634333, 1638034, 1639837, 1638529, 1633233, 1623432, 1609010, 1589557, 1563695, 1529995, 1488330, 1439212, 1381988, 1315036, 1237740, 1150839, 1054798, 949319, 834738, 712373, 583016, 446255, 301560, 148743, -12855, -184298, -365964, -557997, -761937, -980278, -1214096, -1462653, -1725693, -2004471, -2300316, -2614089, -2947628, -3303930, -3685360, -4093619, -4532295, -5007646, -5526027, -6092289, -6711564, -7390862, -8138174, -8962043, -9873361, -10886195, -12016051, -13278950, -14692856, -16278050]
57046a6278050j777216j990307k227818k495029k796547l138146l529956l984455
57038c8217524m512027n120437n815296o596651p458073q393822r402301j0472687
57030i5988818j1567839j2629279j3605179j4478040j5276515j6065659j6897724
57023a96509053j7718518j8290561j8231534j7183702j4994645j1769660p784015
57016c02481688l364197J170167N512034R377296J2542668J4888313J6414739
57009b45940668J7222352J7463951J7295432J6847514J6219396J5479029J4662932
57002a30750062J3783363J2845505J1861900J0853710R844343Q855681P907222
56995e4798338P013945O184729N424558M737420M125576L587371L118008K711977
$$ y = [-16278050, -18055266, -20045573, -22273391, -24768420, -27564967, -30703113, -34233069, -38217524, -42729551, -47849988, -53665284, -60261935, -67720008, -76113830, -85516131, -95988818, -107556657, -120185936, -133791115, -148269155, -163545670, -179611329, -196509053, -214227571, -232518132, -250749666, -267933368, -282928013, -294697673, -302481688, -305845885, -304675718, -299163684, -289786388, -277243720, -262355407, -245940668, -228718316, -211254365, -193958933, -177111419, -160892023, -145412994, -130750062, -116966699, -104121194, -92259294, -81405584, -71561241, -62705560, -54798338, -47784393, -41599664, -36175106, -31437686, -27312110, -23724739, -20606731, -17894754]
56987a7894754K363372K064860J808428J587357J396636J231963J089439R65920
56979e386779Q58667P64762O81675O08111N43627M87539M38723L96175b48548
56969G7065K94215K63145K31918K01155J71955J45286J21722J01496Q4538P0401
56959A762896N8457M8371M0116L3448K7574K1512J4505O025m148j5596k7478l9090
56947A926592m9868n8963o5726p0455p3454p3249o7398n5603m0296k3385n017
56936A343178J2254K0263J0402j7441n3404q5627j07897j19672j22213j17174
56926G62669j07305r5763q4248p3000o2531n4202m8907m5984m3972m2051m0322
56915F4384B5499a1683l4628l1479k8618k6292k3724k0174j5828j1342p008k844
$$ y = [-17894754, -15531382, -13466522, -11658094, -10070737, -8674101, -7442138, -6352699, -5386779, -4528112, -3763350, -3081675, -2473564, -1929937, -1442398, -1003675, -607500, -248548, 77065, 371280, 634425, 866343, 1067498, 1239453, 1384739, 1506461, 1607957, 1692495, 1762896, 1821353, 1869724, 1909840, 1943288, 1970862, 1992374, 2006879, 2012904, 2008756, 1993160, 1965682, 1926592, 1876724, 1817761, 1752035, 1681580, 1608126, 1534877, 1467479, 1411876, 1371580, 1348195, 1343178, 1355432, 1375695, 1386097, 1368656, 1315252, 1229625, 1121728, 1002056, 879843, 762669, 655364, 559601, 475353, 402353, 339822, 285620, 236713, 190729, 146757, 104706, 64384, 25499, -11683, -46311, -77790, -106408, -132700, -156424, -176598, -192426, -203768, -210776, -213620]
56903b13620J038M691Q548J2821J6949K0265K2755K4583K5204K3810K0479a6198
56890c949D846O005L916K504J637J114O51J17j35M24J651K774L547M623O332P966
56874D7972Q919R843J1736J4361J6368J6608J4669J0667N304k47n248r763j3554
56861A27635j5417j4613j2290j0334r231q186o847n697m933m243l647l405l218
56848B5574k574j800j665j988j801r03j15J82N79J527K739L969N343O612P096
56833D2775O803O757P726R369J1007J2527J4068J5417J6146J5923J4417J1508
56821A84443P803M440K077M98o91j474j749j554q25N37K107L085L323L721N170
56806B10911P533R986J2042J3822J5600J7440J9229K0781K1707K1192J8133J2057
$$ y = [-213620, -212582, -207891, -199343, -186522, -169573, -149308, -126553, -101970, -76766, -52956, -32477, -16198, -3949, 4846, 10851, 14767, 17271, 18908, 20022, 20673, 20790, 20655, 21079, 22730, 25504, 29051, 33674, 40006, 47972, 56891, 66734, 78470, 92831, 109199, 125807, 140476, 151143, 156447, 156200, 150952, 141189, 127635, 112218, 97605, 85315, 74981, 65750, 57564, 50717, 45020, 40087, 35844, 32197, 28792, 25574, 23000, 21200, 19535, 17547, 15746, 14843, 14728, 14910, 15489, 17016, 19755, 23724, 29067, 35679, 42775, 49578, 56335, 64061, 73430, 84437, 96964, 111032, 126449, 142595, 158518, 172935, 184443, 192246, 196686, 198763, 199261, 198570, 197096, 195347, 193793, 192968, 193505, 195612, 198697, 202020, 205741, 210911, 218444, 228430, 240472, 254294, 269894, 287334, 306563, 327344, 349051, 370243, 388376, 400433]
56794D00433M122l249q216j0826j2104j2416j1370r011o182l668j579L48K420
56781C28702M983Q180J1670J5045J8438K2180K5942K8928L0820L1770L1263K7793
56769E85714K0228R255k752j3137k0254k3875k4764k3845k1712j8805j5624j2496
56757D37933r403o344l632j469N49L072O317R991J3688J7078J9940K2146K3155
56744E33021K1474J5499N539n658j4974k1108k4321k5095k4065k2405k0961j9276
56732C97670j6647j3668j1528j0079q108n448l293k137p76J994N731R006J0895
56719C53612J1199R848O770K193l265q648j2811j5043j5604j5323j4621j3337
56707B84970j1440r417p872p066o784o485n790n106n255o172o621n800m494l790
$$ y = [400433, 404555, 401306, 393090, 382264, 370160, 357744, 346374, 337363, 331181, 327513, 325934, 326282, 328702, 333685, 341865, 353535, 368580, 387018, 409198, 435140, 464068, 494888, 526658, 557921, 585714, 605942, 615197, 612445, 599308, 579054, 555179, 530415, 506570, 484858, 466053, 450429, 437933, 428530, 422186, 418554, 417085, 417634, 420706, 427023, 437014, 450702, 467780, 487720, 509866, 533021, 554495, 569994, 575533, 569875, 554901, 533793, 509472, 484377, 460312, 437907, 416946, 397670, 381023, 367355, 355827, 345748, 337640, 332192, 328899, 326762, 325986, 327980, 333711, 342717, 353612, 364811, 374659, 381429, 383622, 380357, 371709, 358898, 343855, 328251, 312928, 298307, 284970, 273530, 264113, 256241, 249175, 242391, 235906, 230116, 225010, 219755, 213583, 206962, 201162, 196668, 192878]
56693A92878l396k413j169q29j409j702j245r97j741k923l523l211k321j441j233
56678A63325j871k532k221j130l78m58q75j258j741k147j936j282j064j435j490
56663A41507p70j39m80j414j951j761j185n65r5R5J50M81J176J732J640R42J66
56646A39529l6P37K176L225L025J858P68M29Q01J596K392K659K362K264K856L455
56630A70096L219K557K432K674K366J589J356J829K053J594J056P58K40n67r74
56615A92278p07l54l09l40m58j008j654j498n96j35o93j504j767j564j027Q2J512
56598A80258K336K203J689J062n6j388j803j047l55n86r73n91J66M16J60j66n80
56581A80745j124j316q69k74j8O6J71N1l50o57q44j276j671j179oL79o51j873
$$ y = [192878, 189482, 187069, 185900, 185071, 183662, 181960, 180715, 179718, 177977, 175054, 171531, 168320, 165999, 164558, 163325, 161454, 158922, 156701, 155571, 155193, 154735, 153860, 152602, 150861, 148714, 146778, 145496, 144432, 142997, 141507, 140737, 140598, 140118, 138704, 136753, 134992, 133807, 133242, 133147, 133242, 133392, 133873, 135049, 136781, 138421, 139363, 139529, 139493, 140230, 142406, 145631, 148656, 150514, 151282, 151711, 152512, 154108, 156500, 159159, 161521, 163785, 166641, 170096, 173315, 175872, 178304, 180978, 183344, 184933, 186289, 188118, 190171, 191765, 192821, 193579, 193819, 193252, 192278, 191571, 191217, 190908, 190568, 190110, 189102, 187448, 185950, 185354, 185219, 184526, 183022, 181255, 179691, 178664, 178746, 180258, 182594, 184797, 186486, 187548, 187492, 186104, 184301, 183254, 182899, 182313, 181340, 180749, 180915, 181331, 181491, 181325, 180745, 179621, 178305, 177436, 177162, 177144, 177210, 177381, 177432, 177082, 176425, 175581, 174305, 172634, 171455, 171449, 171828, 171177, 169304]
56563A69304k113j830j888k097k008k041k566k900k405j708j607j629r69p6k3
56548A43444p63j287j122o60l02j85m40r51j152o99LM57P12R34J027J096J464
56531A41576J849J463M87K71J402K705L003K648K399J979R99K12M33J084J088
56516A63598O27O61J332K055K672L402M009M126M001M111M468N022O014P169P436
56501B20703O489N577N889O926P601P954Q495Q787Q145P075O583O566O268N684
56487C18742N219M477K856Q45n63j375k202k949l277l758n056o459o808o506o914
56472B86272q030q513p949p328p100o498n195m134m103m615m774m338l525k572
56458B07598j804j529j656j905k338l030l475l153k514k498l105l403k919k225
$$ y = [169304, 167191, 165361, 163473, 161376, 159368, 157327, 154761, 151861, 149456, 147748, 146141, 144512, 143543, 143467, 143444, 142681, 141394, 140272, 139612, 139310, 139125, 138685, 137734, 136582, 135883, 135886, 136343, 137055, 137989, 139016, 140112, 141576, 143425, 144888, 145375, 145646, 147048, 149753, 152756, 155404, 157803, 159782, 160781, 160993, 161426, 162510, 163598, 164225, 164886, 166218, 168273, 170945, 174347, 178356, 182482, 186483, 190594, 195062, 200084, 206098, 213267, 220703, 227192, 232769, 238658, 245584, 253185, 261139, 269634, 278421, 286566, 293641, 300224, 306790, 313058, 318742, 323961, 328438, 331294, 332139, 331576, 330201, 327999, 325050, 321773, 318015, 312959, 306500, 299692, 293186, 286272, 278242, 269729, 261780, 254452, 247352, 240854, 235659, 231525, 227422, 222807, 218033, 213695, 210170, 207598, 205794, 204265, 202609, 200704, 198366, 195336, 191861, 188708, 186194, 183696, 180591, 177188, 174269, 172044]
56444A72044k028k398k940l158k747j950j452j473j375o70J41M38N02Q87J361
56429A55182J461J508K009K539K315J509R54Q65Q75R38J172J167N76N8M81J531
56413A75140K153K101J917J725J251Q17J044J701J954J738J764K215K560K599
56399B00679K665K801K667K336K290K624K927K953K734K251J607J217J184R18
56385B31853P4p47q91o66o32o20l85m11j038j557j313r61j358k022k080j873k167
56368B13206k467j850q51p91j605k059j806j539j365p98j32j72p01p92n32p88
56352A94958j464j626j273j281j667j562q97m56k66L97J361J601J034O46P28O29
56336A90862L21N17J080J035L73J61N74N12m39j310j382j048o36J07R54J103N50
$$ y = [172044, 170016, 167618, 164678, 161520, 158773, 156823, 155371, 153898, 152523, 151853, 151994, 152432, 152934, 153821, 155182, 156643, 158151, 160160, 162699, 165014, 166523, 167477, 168342, 169217, 170155, 171327, 172494, 173070, 173128, 173609, 175140, 177293, 179394, 181311, 183036, 184287, 185104, 186148, 187849, 189803, 191541, 193305, 195520, 198080, 200679, 203344, 206145, 208812, 211148, 213438, 216062, 218989, 221942, 224676, 226927, 228534, 229751, 230935, 231853, 231927, 231180, 230289, 229623, 228991, 228371, 227986, 227575, 226537, 224980, 223667, 222706, 221348, 219326, 217246, 215373, 213206, 210739, 208889, 208038, 207247, 205642, 203583, 201777, 200238, 198873, 198075, 197943, 197771, 197070, 196278, 195746, 194958, 193494, 191868, 190595, 189314, 187647, 186085, 185188, 184732, 184466, 184863, 186224, 187825, 188859, 189505, 190233, 190862, 191183, 191700, 192780, 193815, 194188, 194349, 194923, 195435, 194996, 193686, 192304, 191256, 190620, 190727, 191681, 192784, 193334]
56319A93334J64J43j36m85K42K075L352K848J237j60q46q42j30J000J948K541
56303B06285K956K979K342J736K089K919K769J403J13k45q7J37N46R75R80Q45
56287B28742J163J487Q72k23l32O62J422J561K152L440M100L453K656K780L354
56272B57289L578L567L610L529L429L843M630M910M579M449M692M536L894L767
56258C14302M489N105N034M948N494O392P251P971Q100P129N656M924N071N268
56244C97134N425O071O678O098M732M213M723M820M138L965M632M756L846L372
56230D64603M267N453N906O166O909P812Q785J0497J2767J4313J4851J5680J7389
56217E95398J8994K0081K1685K4136K6188K7352K9009L2008L5188L7536L9874
$$ y = [193334, 193498, 193641, 193505, 193020, 193262, 195337, 198689, 201537, 202774, 202614, 201768, 200926, 200796, 201796, 203744, 206285, 209241, 212220, 214562, 216298, 218387, 221306, 224075, 225478, 225591, 225346, 225259, 225396, 225942, 226917, 227897, 228742, 229905, 231392, 232264, 232041, 231709, 232371, 233793, 235354, 237506, 240946, 245046, 248499, 251155, 253935, 257289, 260867, 264434, 268044, 271573, 275002, 278845, 283475, 288385, 292964, 297413, 302105, 306641, 310535, 314302, 318791, 323896, 328930, 333878, 339372, 345764, 353015, 360986, 369086, 376215, 381871, 386795, 391866, 397134, 402559, 408630, 415308, 421406, 426138, 430351, 435074, 439894, 444032, 447997, 452629, 457385, 461231, 464603, 468870, 474323, 480229, 486395, 493304, 501116, 509901, 520398, 533165, 547478, 562329, 578009, 595398, 614392, 634473, 656158, 680294, 706482, 733834, 762843, 794851, 830039, 867575, 907449]
56206I07449M3141M6857N0529N4831O0135O5615P0946P7082Q4287R1246R7290
56195A649408J03506J10445J16718J21223J24798J28183J30206J29475J26164
56186B740126J20765J12726J01795Q9005P5085N9480M2162K4653Q083p850k2826
56175C343204l5027m3683n0502n6951o2193o5312o7423o9744p1566p2116p2614
56164B676073p4426p6840p8526p9759q1269q2445q2554q2375q2837q3355q3064
56153A788623q2292q1293p9090p5212p1025o7747o4615o0550n6113n2188m8394
56142A050104m4375m0991l8615l5976l2314k8995k7244k5988k3721k0912j8752
56131G12221j7066j5211j3577j2570j1592j0408r918j0202r715p794n995n403
$$ y = [907449, 950590, 997447, 1047976, 1102807, 1162942, 1228557, 1299503, 1376585, 1460872, 1552118, 1649408, 1752914, 1863359, 1980077, 2101300, 2226098, 2354281, 2484487, 2613962, 2740126, 2860891, 2973617, 3075412, 3164417, 3239502, 3298982, 3341144, 3365797, 3373880, 3366030, 3343204, 3308177, 3264494, 3213992, 3157041, 3094848, 3029536, 2962113, 2892369, 2820803, 2748687, 2676073, 2601647, 2524807, 2446281, 2366522, 2285253, 2202808, 2120254, 2037879, 1955042, 1871687, 1788623, 1706331, 1625038, 1545948, 1470736, 1399711, 1331964, 1267349, 1206799, 1150686, 1098498, 1050104, 1005729, 964738, 926123, 890147, 857833, 828838, 801594, 775606, 751885, 730973, 712221, 695155, 679944, 666367, 653797, 642205, 631797, 621879, 611677, 601962, 594168, 588173, 582770]
56119E82770m805l103j337n50P5J240K013K045K866M960O201N351M470N463O918
56104F14577O995O834Q078R480R193Q325Q905J0129R915Q607Q017Q128P781P364
56090G32328Q043R456J0565J1635J3155J4434J5339J7454K1317K4733K6336K8386
56078I33181L3243L9470M4558M9152N5102O1393O5627O7783O8964O8078O3511
56067A550062N6722N0665M5758M0589L5360L1319K7808K2979J6524R278J419o472
56055A882011j2403j5558j8105k1932k5903k8994l3408m1123m9842n5929n9128
56044A519686o0879o0523n6998n2144m8248m4321l8521l2156k7408k3388j8442
56033A056658j4070j2319j1644r658p775q503j0358j0198q644q384q961q006n943
$$ y = [582770, 577965, 574862, 573525, 572975, 573050, 574290, 576303, 578348, 581214, 586174, 592375, 597726, 602196, 607659, 614577, 621572, 628406, 636484, 645964, 655157, 663482, 672387, 682516, 692431, 701038, 709055, 717183, 724964, 732328, 740371, 749827, 760392, 772027, 785182, 799616, 814955, 832409, 853726, 878459, 904795, 933181, 966424, 1005894, 1050452, 1099604, 1154706, 1216099, 1281726, 1349509, 1418473, 1486551, 1550062, 1606784, 1657449, 1703207, 1743796, 1779156, 1810475, 1838283, 1861262, 1877786, 1887064, 1888483, 1882011, 1869608, 1854050, 1835945, 1814013, 1788110, 1759116, 1725708, 1684585, 1634743, 1578814, 1519686, 1458807, 1398284, 1341286, 1289142, 1240894, 1196573, 1158052, 1125896, 1098488, 1075100, 1056658, 1042588, 1030269, 1018625, 1008967, 1001192, 992689, 982331, 972133, 963489, 955105, 946144, 938138, 932195]
56020I32195m774l917j794K37J42n25P87K904L396L438N295P501P651P510R849
56005I69895J2700J2565J0949J1612J3649J3590J2279J3097J5243J5394J4417
55994A115390J5766J8701J9723J9335K0729K3193K3503K2485K3543K6077K7023
55983A355468K7262K9640L2416L1918K9956L1111L4411L5408L4791L6771M0490
55972A719642M1563M0879M3227M8102N0620N0784N3170N8060O1542O3803O8528
55961B299920P4725P7967P9018Q2433Q7554R0040R1117R5695J02499J06065J07443
55950C294476J12494J20627J26114J29549J36725J46845J53490J56794J62837
55941D539951J71525J77293J81348J90538K04392K16227K26561K41950K61092
$$ y = [932195, 927421, 923504, 921710, 921947, 922089, 921564, 922351, 925255, 928651, 932089, 937384, 944885, 952536, 960046, 969895, 982595, 995160, 1006109, 1017721, 1031370, 1044960, 1057239, 1070336, 1085579, 1100973, 1115390, 1131156, 1149857, 1169580, 1188915, 1209644, 1232837, 1256340, 1278825, 1302368, 1328445, 1355468, 1382730, 1412370, 1444786, 1476704, 1506660, 1537771, 1572182, 1607590, 1642381, 1679152, 1719642, 1761205, 1802084, 1845311, 1893413, 1944033, 1994817, 2047987, 2106047, 2167589, 2231392, 2299920, 2374645, 2452612, 2531630, 2614063, 2701617, 2791657, 2882774, 2978469, 3080968, 3187033, 3294476, 3406970, 3527597, 3653711, 3783260, 3919985, 4066830, 4220320, 4377114, 4539951, 4711476, 4888769, 5070117, 5260655, 5465047, 5681274, 5907835, 6149785, 6410877]
55932F410877K76395K88931L06957L29863L49361L66480L90933M23285M54738
55923I597820M84949N22183N65344O04884O42623O90961P51114Q12563Q75111
55914A5547552R49659J035728J121602J208526J310178J426433J544512J668407
55906B5812597J818667K000908K206266K446181K751685L133057L576012M081096
55898D7826469M665803N325645O044295O850051P807066Q941891J0240469J1720885
55890A09422574J3424111J5321505J7331568J9402104K1315878K2250643K0797823
55883B39266206J5898532P961633j095988r059556j4678713j7896673j9243225
55876B01152216j9277392j8453858j7145367j5608271j3981898j2368392j0868202
$$ y = [6410877, 6687272, 6976203, 7283160, 7613023, 7962384, 8328864, 8719797, 9143082, 9597820, 10082769, 10604952, 11170296, 11775180, 12417803, 13108764, 13859878, 14672441, 15547552, 16497211, 17532939, 18654541, 19863067, 21173245, 22599678, 24144190, 25812597, 27631264, 29632172, 31838438, 34284619, 37036304, 40169361, 43745373, 47826469, 52492272, 57817917, 63862212, 70712263, 78519329, 87461220, 97701689, 109422574, 122846685, 138168190, 155499758, 174901862, 196217740, 218468383, 239266206, 255164738, 263126371, 262030383, 252970827, 238292114, 220395441, 201152216, 181874824, 163420966, 146275599, 130667328, 116685430, 104317038, 93448836]
55869I3448836r532840q350647p303776o397572n626898m962133m383872l894791
55861D2996307l487068l132411k813611k535036k294403k073847j866572j684582
55853B3108777j532163j396742j272444j168108j084813j008461r31948q63753
55845A3850345q07734p54437o99141o49544o08763n68360n24588m84981m52779
55836H300018m20844l86776l58551l39302l21221l00264k82768k71798k60603
55827E357891k45428k31833k22659k12049j97054j83525j74957j66569j55588
55818C568229j46667j42062j36764j28296j21462j18805j15890j10371j06152
55809B441760j04461j00280r1880q4738q1718p8356p1958o6470o4120o0914n4689
$$ y = [93448836, 83915996, 75565349, 68261573, 61864001, 56237103, 51274970, 46891098, 42996307, 39509239, 36376828, 33563217, 31028181, 28733778, 26659931, 24793359, 23108777, 21576614, 20179872, 18907428, 17739320, 16654507, 15646046, 14714098, 13850345, 13042611, 12288174, 11589033, 10939489, 10330726, 9762366, 9237778, 8752797, 8300018, 7879174, 7492398, 7133847, 6794545, 6473324, 6173060, 5890292, 5618494, 5357891, 5112463, 4880630, 4657971, 4445922, 4248868, 4065343, 3890386, 3723817, 3568229, 3421562, 3279500, 3142736, 3014440, 2892978, 2774173, 2658283, 2547912, 2441760, 2337299, 2237019, 2145139, 2060401, 1978683, 1900327, 1828369, 1761899, 1697779, 1636865, 1582176]
55798A582176m9288m6696m3142l7042l2664l1993l0871k7266k5434k7749l0123
55787A199908k9681k9463l1301l1448k7677k3673k2187k0565j7067j4771j5167
55776I36908j4629j1296q900r728j0428q837q291j0937j3256j2642j2144j4185
55764H01635j5767j4456j3190j4443j5444j3851j2568j4135j5740j4650j3425
55753F43966j4751j6021j4056j0747r179q362o416m854n167n177l133j559k729
55740E41815m211l184j288j055j248k3R24l75k159k323k433m436o622o836o412
55725E00134p124p508o066m834n779o865n659l770l674m226l401k596m054o561
55711D28017p692p984r052j0042r597q999r674j0000q210o064o012o995o715n783
$$ y = [1582176, 1532888, 1486192, 1443050, 1406008, 1373344, 1341351, 1310480, 1283214, 1257780, 1230031, 1199908, 1170227, 1140764, 1109463, 1078015, 1050338, 1026665, 1004478, 983913, 966846, 952075, 936908, 922279, 910983, 902083, 892355, 881927, 873090, 864799, 853862, 840606, 827964, 815820, 801635, 785868, 771412, 758222, 743779, 728335, 714484, 701916, 687781, 672041, 657391, 643966, 629215, 613194, 599138, 588391, 579212, 570850, 564434, 559580, 554413, 549236, 546103, 544544, 541815, 537604, 534420, 533132, 532077, 530829, 530806, 531730, 531355, 529196, 526873, 524440, 520004, 513382, 506546, 500134, 493010, 485502, 479436, 474602, 468823, 461958, 456299, 452529, 448855, 444629, 441228, 438632, 434578, 428017, 420325, 412341, 403289, 393247, 383650, 374651, 364977, 354977, 346767, 340703, 334691, 327696, 320981, 315198]
55697C15198n980o548n875m873n181n867n359m651n223n782m486k541k174k818
55683B47840k679k265l018m056l686k644k622l024k376j409j646k303j687m19
55669B14006k88j059j305j129j462j818j349q42j331k076k180k502l695m228k911
55654A85831j454j767k650j982l87K56K90J189K434K565J968J804J457r0j653
55639A87811j480k19L54L14O32P09k54q68M99K607L126K369K324L049L098K598
55623B06669K901L853M128L693L432L085K012J073J301J641N46j184j712j351
55609B30087j703k541k312j105m18m92l97j70m56o31L57J784K075J362R54R75
55593B27369P36O10J263J803J010k79l94L18J63j040k055k574l259m026m416m946
$$ y = [315198, 309218, 302670, 296795, 291922, 286741, 280874, 275515, 270864, 265641, 259859, 255373, 252832, 250658, 247840, 245161, 242896, 239878, 235822, 232136, 229492, 226870, 223846, 221470, 220061, 218415, 216112, 214425, 214006, 213718, 212659, 211354, 210225, 208763, 206945, 205596, 204754, 203423, 201347, 199167, 196665, 192970, 188742, 185831, 184377, 182610, 179960, 177978, 177591, 177847, 178137, 179326, 181760, 184325, 186293, 188097, 189554, 189464, 187811, 186331, 186112, 186466, 186780, 187412, 188121, 187867, 186999, 187498, 190105, 193231, 195600, 197924, 200973, 204071, 206669, 209570, 213423, 217551, 221244, 224676, 227761, 229773, 230846, 232147, 233788, 234334, 233150, 231438, 230087, 228384, 225843, 223531, 222426, 222008, 221516, 221119, 220949, 220493, 219862, 220219, 222003, 224078, 225440, 226394, 227369, 228105, 228715, 229978, 231781, 232791, 232512, 232118, 232436, 232599, 231559, 229504, 226930, 223671, 219645, 215229, 210283]
55577B10283o098o768n838m390m217n046n441n428n861o209n450m291m023m096
55563A37127l289k343k676l418k641q32k13j057j596j332j506k347k604j915j221
55548A08137p27J53R03M03p98r58K6N32k4n65n30n31p43o04k28l15p10o81n21
55529A02219j062j953k052j293m79J88P55N29p79j816j398o46j191k320k274j366
55513H5062j144j348n55P84Q79k42q90o86p25j063q27m25r40j668j110k7l83j615
55495G3077j261P19J734R14K85R33J384P18J45M20M69j98m07K65N34j5J54J807
55477H1677L409L588K993K496J682L82k00O79J943K336K056J794J546J244J220
55462A08845J382J189Q25R42J139L04j358k459k672k895l095k281r52j035k798
$$ y = [210283, 204185, 197417, 191579, 187189, 182972, 177926, 172485, 167057, 161196, 154987, 149537, 145246, 141223, 137127, 133838, 131495, 128819, 125401, 122760, 121928, 121715, 120658, 119062, 117730, 116224, 113877, 111273, 109358, 108137, 107410, 107563, 108466, 108869, 108071, 107113, 107139, 107671, 107647, 107082, 106552, 106021, 105278, 104674, 104446, 104131, 103421, 102740, 102219, 101157, 99204, 97152, 95859, 95380, 95568, 96323, 96852, 96073, 94257, 92859, 92213, 91022, 88702, 86428, 85062, 83918, 82570, 82015, 82799, 83678, 83436, 82546, 81860, 81135, 80072, 79245, 78820, 77880, 76212, 75102, 75075, 74692, 73077, 71816, 72535, 74269, 75183, 75468, 76401, 77785, 78503, 78648, 79068, 79537, 79339, 78932, 79197, 79731, 79716, 79870, 81677, 85086, 88674, 91667, 94163, 95845, 96227, 96027, 96706, 98649, 100985, 103041, 104835, 106381, 107625, 108845, 110227, 111416, 112241, 113183, 114322, 114626, 113268, 110809, 108137, 105242, 102147, 99866, 98914, 97879, 95081]
55447I5081m185m019l483l522l247k141j557k516l935m399m072l596k730j373
55433E0306m14l46m26j60j85p66r54k52M58N56O75J091Q30n16j629j385n09j51
55415D6223j59k2j10p55j219q75l63m67q03o65k41oJ70N04O35L43K7l6m5K8M56
55394D2620P82J24j191j734j175p69j119j207l81L79K74J02O77J228P13m13j000
55377C7910q82o77o49o88p60p47m79k74n69q45j32J236J816J257O86N75P9r19
55359C5938j056K30J518J595J146J116J025K56n07n33l60n68m92M85J535J625
55343D2953J095P06K87m95j032p55k19j39k74k81n52j100q92M88J642J214j00
55326D2546p57n73l78m13m50o94j181j115m3J052J110O13N47O39M1r16j203q04
$$ y = [95081, 90896, 86877, 83394, 79872, 76625, 74484, 72927, 70411, 66476, 62077, 58005, 54409, 51679, 50306, 49892, 49546, 49120, 48960, 48775, 48009, 47055, 46803, 47261, 47817, 48492, 49583, 50413, 49897, 48268, 46883, 46374, 46223, 46064, 46042, 45932, 45177, 43958, 43083, 42720, 42253, 41450, 40785, 40544, 40538, 40708, 41212, 41847, 42190, 42217, 42181, 42136, 42164, 42620, 43402, 43526, 42335, 40601, 39426, 38657, 37538, 36331, 35950, 36329, 36603, 36705, 37382, 38610, 39323, 38910, 37910, 37028, 36351, 35702, 35014, 34254, 33507, 33028, 32754, 32185, 31340, 31208, 32444, 34260, 35517, 36203, 36778, 36857, 35938, 34882, 35112, 36630, 38225, 39371, 40487, 41512, 41768, 41261, 40728, 40368, 39800, 39308, 39793, 41328, 42953, 44048, 44754, 45041, 44546, 43514, 42759, 42540, 42401, 42127, 41846, 41294, 40194, 39302, 39790, 41432, 42646, 42546, 41789, 41216, 40838, 40425, 39975, 39281, 38100, 36985, 36942, 37994, 39104, 39717, 40264, 40903, 40944, 40028, 38825, 38021]
55308C8021n26m92k13J77m0r67j936k382k179j429n63k02l19j97K73K31n23p65
55290B5969K50J279Q36n06j094p36o37j166j347n85M72R96R19O62N68P13P68K63
55272B7624o57j187r30n24o84j224j562j492r22L49J928K660K006Q82L85M22L52
55255B7426K67O01J076J070O49L68L58L54K17j00p24j430j562r05j09J77N5j40
55237B7648l31l80k8M54M07KK25J281K112K012J522J105L70o85j037l01L54M3
55219C4773l91j9M14j41j044r57l4M95K95j8k56o73r89p12j30J11O4J12P1l75
55199C0596q19p01k75o7P8N30J000J019P55N47K50k45n45n29p01j128j006p0O45
55180B9334M54J09L13L94k38p10j97M62K39j71K94R24M33o20o85J80N92K70J70
$$ y = [38021, 37495, 37003, 36790, 36967, 36927, 35960, 34024, 31642, 29463, 28034, 27471, 27269, 26950, 26753, 27026, 27257, 26734, 25969, 26219, 27498, 28334, 27828, 26734, 25998, 25361, 24195, 22848, 22263, 22735, 23731, 24650, 25312, 25880, 26593, 27361, 27624, 26967, 25780, 24850, 24326, 23642, 22418, 20856, 19364, 18442, 18791, 20719, 23379, 25385, 26267, 26652, 27074, 27426, 27693, 28294, 29370, 30440, 31089, 31457, 31815, 32169, 32386, 32286, 31562, 30132, 28570, 27665, 27556, 27733, 27788, 27648, 27317, 26937, 26909, 27363, 27770, 27772, 27997, 29278, 31390, 33402, 34924, 36029, 36399, 35714, 34677, 34376, 34730, 34773, 34382, 34363, 34777, 34636, 33592, 32635, 32601, 33096, 33391, 33373, 33117, 32444, 31455, 30743, 30613, 30724, 30788, 30900, 30971, 30596, 29777, 29076, 28801, 28734, 28812, 29342, 30342, 31361, 32116, 32663, 32913, 32668, 32123, 31594, 30893, 29765, 28759, 28689, 29334, 29788, 29897, 30210, 30604, 30366, 29656, 29459, 29921, 30160, 29989, 30283, 31207, 31640, 31020, 30335, 30515, 31107, 31377, 31547]
55161C1547M45K50m71p56k75K92N32O24O16M48N15R86J076K57n10j27P36O96m1
55142C6840k04K62L54J7M7K65j90r31o96L83Q76N15N16J304J822J501J058Q49
55124D4588K03j034j922k013k017k291k099j015K26Q84J105J144Q06J50k91l80
55108C6044n48q20p37l85l62n60j83P44J208Q14L14K36J28l18o36n62n68r07j094
55089C1808p60k28J22K25p1q53j513j263m22o9k77N9J310K371K264J439Q80Q80
55071C5902J177J480J435P93r7o17p99j086j313q76M8N76N16M93O64M58j12k97
55053C8345M1J32k38k55M84J240J394J304J352J190N30j92m84l35J34P68R32J26
55035D6468q25m93R15J448J16j630j936q29M12J134J492J578J344R97P17M22J42
$$ y = [31547, 31992, 32242, 31771, 31015, 30740, 31032, 31564, 32188, 32804, 33252, 33767, 34753, 35829, 36086, 35576, 35449, 36185, 36881, 36840, 36636, 36898, 37252, 37269, 37316, 37581, 37391, 36460, 35764, 36147, 37023, 37538, 38054, 39358, 41180, 42681, 43739, 44588, 44791, 43757, 41835, 39822, 37805, 35514, 33415, 32400, 32626, 33510, 34615, 35759, 36565, 36715, 36424, 36044, 35496, 34676, 33939, 33554, 33192, 32632, 32449, 33193, 34401, 35215, 35529, 35765, 35893, 35575, 34939, 34377, 33809, 32902, 31808, 31048, 30820, 30942, 31167, 31096, 30243, 28730, 27467, 27045, 26976, 26699, 26758, 28068, 30439, 32703, 34142, 35022, 35902, 37079, 38559, 39994, 40787, 40690, 40073, 39274, 38188, 36875, 35999, 36047, 36623, 37139, 37632, 38296, 38754, 38642, 38345, 38386, 38518, 38280, 38025, 38509, 39749, 41143, 42447, 43799, 44989, 45519, 45327, 44843, 44508, 44642, 45410, 46342, 46468, 45643, 45150, 46065, 47513, 47629, 45999, 44063, 43234, 43646, 44780, 46272, 47850, 49194, 50191, 50908, 51330, 51472]
55018E1472J54M15N58N76Q08J039N92m18r75o51j76j22j54k9j81o92p91j40M28
54999E1713K49j24m3No87j701k037j471n65K01N54K27n75j011n71J82L67j03p06
54980D3904j034q78j42Q12J288J157J091J469J751J401P88N46O87Q75J057J178
54964E5950R27L13pL80R37R32M06j14m08n26m50k35j43j83j3L97N21J61r7K38
54944E8986P73Q46M81J32QP3L03M73J36p18j396j318p21j91Q3K20J99p0n56j212
54924E6531j907k220j726p24j9M4j58l17m50l01N03J500J545M61m05R0J395K142
54906E5984J845J096N92O48J223J904K197K133K184K416K407K089J985K223K276
54891H3202K027K217L276M509N090N210N510O042O488O915P616Q449Q857Q309
$$ y = [51472, 51626, 52041, 52599, 53175, 53983, 55022, 55614, 55196, 54221, 53570, 53394, 53272, 53118, 53089, 52908, 52216, 51425, 51285, 51713, 51962, 51838, 51795, 51800, 51113, 49412, 47375, 45904, 45339, 45540, 46094, 46321, 45746, 44735, 44164, 44346, 44713, 44610, 43904, 42870, 41992, 41850, 42662, 43950, 45107, 46198, 47667, 49418, 50819, 51607, 52153, 52840, 53715, 54772, 55950, 56877, 57190, 57183, 57563, 58500, 59432, 59838, 59724, 59316, 58790, 58340, 58105, 57962, 57779, 57766, 58163, 58684, 58845, 58748, 58986, 59759, 60605, 61086, 61218, 61226, 61299, 61602, 62075, 62211, 61493, 60097, 58779, 58058, 57867, 57950, 58170, 58369, 58299, 57743, 56531, 54624, 52404, 50678, 49954, 49935, 49979, 49821, 49504, 49054, 48753, 49256, 50756, 52301, 52762, 52357, 52447, 53842, 55984, 57829, 58925, 59517, 60165, 61388, 63292, 65489, 67622, 69806, 72222, 74629, 76718, 78703, 80926, 83202, 85229, 87446, 90722, 95231, 100321, 105531, 111041, 117083, 123571, 130486, 138102, 146551, 155408, 163717]
54877A63717O576L937J202r25k587m265n726o301o170o222o591o547o044n989
54863A18065o535o543n406m009l128k285j116m51q71j389q90J51P42J154K123
54848H9612L114K981J932J355J934L186M609N989O887O994O906P365P897P289
54834A58050N344L122J408o3j767l723n765p721r086r227q139o609n517n201n364
54819I9742n387m887m198l937l978l513k380j495j437j489q74j64l34j122j440
54804F3107j093q18q56o32J16Q22J008Q31O35M55K15m5l05o00r54j426j995k342
54786E6123k052j325r36j207j559j447j092q14l79L67Q18L81n06q89n27J01O11
54769D5668R62J141J222J363J395Q42j95q11m98P8J56K0L39R94J438J621J740
$$ y = [163717, 170293, 174230, 175432, 174507, 171920, 167655, 161929, 155628, 149458, 143236, 136645, 130098, 124054, 118065, 111530, 104987, 99581, 95572, 92444, 90159, 89043, 88592, 87721, 86332, 85442, 85593, 86335, 87489, 89612, 92726, 95707, 97639, 98994, 100928, 104114, 108723, 114712, 121599, 128593, 135499, 142864, 150761, 158050, 163394, 166516, 167924, 167861, 166094, 162371, 156606, 148885, 139799, 130572, 122433, 115824, 110307, 105106, 99742, 94355, 89468, 85270, 81333, 77355, 73842, 71462, 69967, 68530, 67041, 66167, 66003, 65669, 64547, 63107, 62014, 61196, 60340, 59708, 59824, 60646, 61654, 62485, 63120, 63575, 63790, 63745, 63440, 62840, 61886, 60460, 58465, 56123, 54071, 52746, 51810, 50603, 49044, 47597, 46505, 45691, 45312, 45679, 46497, 46878, 46372, 45483, 44956, 45057, 45668, 46630, 47771, 48993, 50356, 51751, 52593, 52398, 51587, 51089, 51167, 51323, 51343, 51682, 52676, 54114, 55735, 57475]
54752E7475J540P91J8j56J10L32O13J215J732J657J340J507K161K797L303L781
54736H0216L977L782L820M615N594N938N975O662P978Q979R153Q728P840O444
54722A69701M855L396J685p42l343n057n662n726n540n061m669m778m932m344
54708A29783l178k296j896j519j152j183j377j130o56p03j066p25M51J345J245
54693A15943P62P91J609L150N164O810P157O489O214P061Q230Q668Q343P735O866
54678B00992N449L472J195j168l407n272o617p408p635p508p526p915q209p846
54664A40597o967o120n440m774m217l914l664l343l299l572l339k089p73o44j386
54649H7056j675j233q67p03%J195J778J320O52L37r3q49j095k62Q89J295R98P76
$$ y = [57475, 59015, 59806, 59824, 59668, 59778, 60110, 60723, 61938, 63670, 65327, 66667, 68174, 70335, 73132, 76435, 80216, 84193, 87975, 91795, 96410, 102004, 107942, 113917, 120579, 128557, 137536, 146689, 155417, 163257, 169701, 174556, 177952, 179637, 178895, 175552, 170495, 164833, 159107, 153567, 148506, 143837, 139059, 134127, 129783, 126605, 124309, 122413, 120894, 119742, 118559, 117182, 116052, 115396, 114693, 113627, 112902, 113353, 114698, 115943, 116705, 117496, 119105, 122255, 127419, 134229, 141386, 147875, 154089, 161150, 169380, 178048, 186391, 194126, 200992, 206441, 209913, 211108, 209940, 206533, 201261, 194644, 187236, 179601, 172093, 164567, 156652, 148443, 140597, 133630, 127510, 122070, 117296, 113079, 109165, 105501, 102158, 98859, 95287, 91948, 89859, 89086, 88442, 87056, 85381, 84148, 83281, 82578, 82578, 83773, 85551, 86871, 87523, 87860, 87767, 86918, 85823, 85561, 86450, 87745, 88743, 89519]
54631H9519R31J071P50J4n67l56M38O72l29j571j530k35Q77J047Q66P69L09o36
54613I2039j160n33P70J825K280K214J738J161R37J128J477K057L025L792L446
54598A16196K269J683K332L248L343K768K241K006J998K236K432K003R75J59l5
54583A45854j36n58q60o18j23K92Q56J674K240K271K324K848L378L348L083L222
54567A69095L709M025L942L384K109J89j654k857l774m916n948o097n276m147
54553A51784l259k728k577k787l028k832k001p67L87R46P10Q9k06J22P31J171
54537A35755J234Q58Q8p79j457k038k684l083k869k450k586l148l235k648k364
54522A08594l117m304m807m260l120k022j456j608k151k528k539k310j826j104
$$ y = [89519, 90450, 91521, 92271, 92285, 91718, 91362, 91800, 92472, 92143, 90572, 89042, 88807, 89684, 90731, 91597, 92366, 92675, 92039, 90879, 90346, 91116, 92941, 95221, 97435, 99173, 100334, 101271, 102399, 103876, 105933, 108958, 112750, 116196, 118465, 120148, 122480, 125728, 129071, 131839, 134080, 136086, 138084, 140320, 142752, 144755, 145730, 145889, 145854, 145718, 145160, 144300, 143682, 143559, 143851, 144707, 146381, 148621, 150892, 153216, 156064, 159442, 162790, 165873, 169095, 172804, 176829, 180771, 184155, 186264, 186453, 184799, 181942, 178168, 173252, 167304, 161207, 155931, 151784, 148525, 145797, 143220, 140433, 137405, 134573, 132572, 131805, 132192, 133138, 133848, 133937, 133731, 133853, 134584, 135755, 136989, 137847, 137935, 137156, 135699, 133661, 130977, 127894, 125025, 122575, 119989, 116841, 113606, 110958, 108594, 105477, 101173, 96366, 92106, 88986, 86964, 85508, 83900, 81749, 79221, 76682, 74372, 72546, 71442]
54508G1442o22p63r73m51M40N82n1k93K68O57K66j41M7J13o35j425j101J06R50
54489F8416Q74L64L2N2L13M92L13L9K04O64N33m77j474j581r54j17Q30J733J948
54470G2204J234M25M16J053J656K042K317K309J957J787K245K944L216K978K508
54455A01291J854J040L46j76q89j796k241j940j604j878k334k245j764j534j683
54440H4447j981k425k956l030k286j167l73m4m8m09q98q25O4J107J723K095K273
54423G5267J554k72j954k242j594j238j214o67L05O28K3m64J04J456K646K984
54407G5322K439J603J238J472J734J736J835K014J420k21j624j511n02j36n91
54392H6228p43k10J58j85p90j216j599j907j672q40j38k12r35j676j862j272k45
$$ y = [71442, 70820, 70057, 69084, 68633, 69073, 69655, 69604, 69311, 69579, 70236, 70502, 70361, 70408, 70521, 69886, 68461, 67360, 67466, 68416, 69290, 69654, 69686, 69738, 70051, 70543, 70856, 70895, 71099, 71763, 72296, 71819, 70345, 68764, 67810, 67693, 68523, 70256, 72204, 73438, 73863, 74279, 75332, 76988, 79030, 81347, 83656, 85613, 87400, 89645, 92589, 95805, 98783, 101291, 103145, 104185, 104531, 104355, 103466, 101670, 99429, 97489, 95885, 94007, 91673, 89428, 87664, 86130, 84447, 82466, 80041, 77085, 74055, 71769, 70602, 70229, 70185, 70137, 69728, 68830, 68005, 68069, 69176, 70899, 72994, 75267, 76821, 76549, 74595, 72353, 70759, 69521, 68307, 67640, 67945, 68573, 68596, 68132, 68236, 69692, 72338, 75322, 77761, 79364, 80602, 82074, 83808, 85544, 87379, 89393, 90813, 90592, 88968, 87457, 86955, 86819, 86228, 85485, 85275, 85433, 85248, 84458, 83242, 81643, 79736, 78064, 77224, 77086, 76874, 75939, 74263, 72401, 71129, 70884]
54375G0884N16P67J013J535J642O49q30j569j355r62p00j61O94J183R61M76K44
54358G4987K52L19L84L83L16L92P25J048J196J518K259K892K818K346K130K025
54342I5990J488Q14Q79J742K539K786K875L163L478L622L589L245K517J818J605
54327A32150J640J424J156J300J496R35k34j069j393j966k972l501k930j805r28
54312A23303n56p38j499k341k508k131k179k864l157k397j461j485k293k789k414
54297I2491j470m90L4k36r98j334p63P4L03O8J69P65J176R56N29N28J002J544
54279I4348J944K325K721K826K438J891J798K305K951L275L213K835K086J007
54265A27963j20j054j679j791j390j176j992l456m095l342k432k592l294l359
$$ y = [70884, 71400, 72167, 73180, 74715, 76357, 77006, 76176, 74607, 73252, 72290, 71590, 71429, 72123, 73306, 74267, 74743, 74987, 75239, 75558, 75942, 76325, 76641, 77033, 77758, 78806, 80002, 81520, 83779, 86671, 89489, 91835, 93965, 95990, 97478, 98292, 99171, 100913, 103452, 106238, 109113, 112276, 115754, 119376, 122965, 126210, 128727, 130545, 132150, 133790, 135214, 136370, 137670, 139166, 140101, 139867, 138798, 137405, 135439, 132467, 128966, 126036, 124231, 123303, 122747, 122009, 120510, 118169, 115661, 113530, 111351, 108487, 105330, 102933, 101472, 99987, 97694, 94905, 92491, 91021, 90531, 90565, 90329, 89331, 87997, 87234, 87308, 87611, 87679, 87848, 88613, 89789, 90745, 91274, 91802, 92804, 94348, 96292, 98617, 101338, 104164, 106602, 108493, 110291, 112596, 115547, 118822, 122035, 124870, 126956, 127963, 127843, 126789, 125110, 123319, 121929, 120753, 118761, 115305, 111210, 107868, 105436, 102844, 99550, 96191]
54251I6191k895k828l095k805j911j338j480j794j955k189k395k077j310q27q92
54236F6400j008q09m44mN07O91J61n51n87j64l04j108j552j162o46n62n26j93
54218E8139N3j20m61p36j008j020l21P81J397J396J508J796J381J11q31o59l5
54201F1371L26Q58J935K658K033N41n50q10o00j46L96M79k50j268j862j975j811
54184F1325j218k58L39J76n2K47L40o34j879j745j34J341J597J282J438J988K136
54167F6289J492M33l71m91p1L03K61J09L33Q40J103Q99M62J4l80n99n13k39J1
54148F9885K59N80P33M13j94n13k90Q4J01k63n84n20k54k65o32p55j04R58J520
54129G0159J200M29l40j014j444j324p76l61k68j67o3m82j342j653j016n61j380
$$ y = [96191, 93296, 90468, 87373, 84568, 82657, 81319, 79839, 78045, 76090, 73901, 71506, 69429, 68119, 67292, 66400, 65392, 64583, 64139, 64135, 64642, 65333, 65494, 64943, 64356, 64192, 63888, 62780, 61228, 60066, 59420, 58858, 58332, 58139, 58192, 58072, 57611, 56875, 55867, 54847, 54526, 55307, 56704, 58100, 59608, 61404, 62785, 62896, 62065, 61406, 61371, 61697, 62555, 64490, 67148, 69181, 69722, 69172, 68362, 67762, 67616, 68012, 68491, 68241, 66973, 65111, 63136, 61325, 60107, 59849, 60188, 60364, 60312, 60559, 60899, 60265, 58386, 56641, 56507, 57848, 59445, 60727, 62165, 64153, 66289, 67781, 68214, 67843, 67352, 67281, 67584, 67845, 67954, 68287, 69127, 70230, 71129, 71591, 71605, 71225, 70626, 70113, 69874, 69885, 70144, 70724, 71457, 71870, 71676, 71163, 70873, 70957, 71058, 70795, 70211, 69691, 69437, 69172, 68540, 67785, 67681, 68639, 70159, 71359, 71788, 71448, 70434, 68990, 67666, 66890, 66529, 66261, 66094, 66031, 65549, 64207, 62554, 61538, 60977, 59597]
54112E9597k715k877j611l23M8J47Q66J896K184J373J66n61n75k65n7k3l5j17
54094E7118l51n52m25r6o2l88m70Q8P62P23q7r18j121p14j81M2p1j27K03O12N09
54073E4494n2k85K29R03R91N12j43r11j723j943j068K24O54J0n46r5Q75J220O26
54054E3972j75m33j29K50L86L97M57M63J79l27o28l66L51R58Q32j54j276j477
54036E3280n42N13O47R0j85no1n20o07M9O88O16K60L19N29K22m35n80M6P59Q41
54015E5924K20o43j119p74J84R55R91N86L12K01n0l61m02k29k22m04l68Q4O81
53996E5566J116J317J316J153R43P76N80L01J29L07P80J296J692J890J769J362
53980G2293J096J381K033K402K152J685J605K030K490K578K451K573L008L273
$$ y = [59597, 56882, 54005, 52394, 52071, 52119, 52266, 53132, 55028, 57212, 58585, 58751, 58190, 57615, 57350, 57293, 57270, 57235, 57118, 56767, 56215, 55790, 55694, 55632, 55244, 54774, 54862, 55624, 56347, 56260, 55342, 54221, 53507, 53326, 53368, 53297, 53170, 53373, 53985, 54494, 54442, 54157, 54386, 55289, 56280, 56792, 56649, 55738, 54015, 52072, 51004, 51228, 51882, 51892, 51346, 51251, 52126, 53346, 53972, 53797, 53364, 53235, 53485, 53871, 54268, 54725, 55188, 55367, 55040, 54412, 54046, 54397, 55355, 56187, 56033, 54757, 53280, 52738, 53251, 53898, 53988, 53803, 53798, 53737, 53217, 52610, 52659, 53347, 53963, 54223, 54542, 55071, 55293, 54858, 54278, 54324, 55083, 55924, 56144, 55501, 54382, 53608, 53792, 54747, 55738, 56324, 56636, 56837, 56787, 56426, 56024, 55795, 55573, 55169, 54801, 54885, 55566, 56682, 57999, 59315, 60468, 61411, 62187, 62767, 63068, 63197, 63504, 64284, 65580, 67272, 69162, 70931, 72293, 73389, 74770, 76803, 79205, 81357, 83042, 84647, 86677, 89167, 91745, 94196, 96769, 99777, 103050]
53966A03050L082K886L248L968M399M450M644N103N196M415L053J750Q77N07N39
53951A51167O46N53N31J032J788J911J137K02k93o02j037j238q86m38m88q60j009
53934A52116r06r32j173j355j248p83r8K98j34j174j914j955j870k182k556k524
53918A31610k281k139j910j408r88r57j040j066j398k057k211j407m88l34n05
53903A11421k09J93k5l54K60J467J892J312Q74J064R69K8q76o72M73J628K249
53886A21694K378K280K339K792L321L330K807K379K446K769L008L089L032K924
53872A60588L121L834M527M417L613L088L349L812L697K856J553K0j444k396k611
53857A92024k175j215O5J162J583J483J481J787K057K066J965J852J686J723K311
$$ y = [103050, 106132, 109018, 112266, 116234, 120633, 125083, 129727, 134830, 140026, 144441, 147494, 149244, 150121, 150628, 151167, 151813, 152366, 152897, 153929, 155717, 157628, 158765, 158967, 158674, 158072, 157035, 155797, 154911, 154473, 153985, 153125, 152116, 151210, 150278, 149105, 147750, 146502, 145719, 145621, 145919, 145785, 144611, 142697, 140742, 138872, 136690, 134134, 131610, 129329, 127190, 125280, 123872, 122884, 121927, 120887, 119821, 118423, 116366, 114155, 112748, 112260, 111926, 111421, 111212, 111405, 111380, 111026, 111286, 112753, 114645, 115957, 116831, 117895, 118864, 118892, 118016, 117344, 117817, 119445, 121694, 124072, 126352, 128691, 131483, 134804, 138134, 140941, 143320, 145766, 148535, 151543, 154632, 157664, 160588, 163709, 167543, 172070, 176487, 180100, 183188, 186537, 190349, 194046, 196902, 198455, 198475, 197031, 194635, 192024, 189849, 188634, 188699, 189861, 191444, 192927, 194408, 196195, 198252, 200318, 202283, 204135, 205821, 207544, 209855]
53842B09855L137L301K474J395Q87Q96P85K89k37k92J90O35K85r41k256k943l211
53825B14249l617l977l630k687k133k588l604m386m603m380m004l848m060m221
53811A62511l806l010k583k773l073l091l003k986k836k524k443k787l079k804
53797A21713k160j764j819j884j501q31n55j065j911k338k320k528l090l174k233
53782I2540r52j85K49P36O28q38k716l074j572O8M40n2m22n48o90o56k59J48K60
53763H3105K79L31L3p40j362j241n79J54Q89J600J964J881J785J918J814J114
53747I2945L33K47R11J829K652L123K865J896R91Q63J224J312J160J577K818M002
53731A20748M073L071K120K181L008L488K961J947J308J165J071R39J050J291
$$ y = [209855, 212992, 216293, 218767, 220162, 221049, 221945, 222730, 223019, 222782, 222490, 222680, 223315, 223600, 222659, 220403, 217460, 214249, 210632, 206655, 203025, 200338, 198205, 195617, 192013, 187627, 183024, 178644, 174640, 170792, 166732, 162511, 158705, 155695, 153112, 150339, 147266, 144175, 141172, 138186, 135350, 132826, 130383, 127596, 124517, 121713, 119553, 117789, 115970, 114086, 112585, 111754, 111199, 110134, 108223, 105885, 103565, 101037, 97947, 94773, 92540, 91588, 91403, 91652, 92388, 93016, 92178, 89462, 86388, 84816, 84884, 85324, 85272, 84850, 84302, 83612, 82956, 82697, 82845, 83105, 83384, 83715, 83748, 83008, 81646, 80405, 79826, 79980, 80869, 82469, 84433, 86314, 88099, 90017, 91831, 92945, 93278, 93525, 94436, 96265, 98917, 102040, 104905, 106801, 107792, 108655, 109879, 111191, 112351, 113928, 116746, 120748, 124821, 127892, 130012, 132193, 135201, 138689, 141650, 143597, 144905, 146070, 147141, 148080, 149130, 150421]
53717A50421J195P75N41N75M02j07n11p52j348k290k683k058j193r64j132j042
53701A39829q92j333k286k988l035k684k229j740j250p66k58Q2j59r22j469j282
53685A16618p76o12p33p10o04p36r08o71k31k79q78j251p98K01J080J522J678
53668A11912J841K179K557K605K208J764J701J842J681J197J004J527K361K683
53654A39062K161J205M61J61J38K82O59J057Q42l04j696k291j933j374j036n30
53638A36864M11J207J236P79N47O15M95J02n5L05P84R16Q89J288K176K866K703
53621A54128J915J328J300J389J206J012J147J347J253J153J506K014K005J545
53607A74248J336J565J702J462J119P94L37K5L54J025J086L96j28n4j78j135k303
$$ y = [150421, 151616, 152391, 152932, 153507, 153909, 153802, 153291, 152539, 151191, 148901, 146218, 144160, 142967, 142003, 140871, 139829, 138937, 137604, 135318, 132330, 129295, 126611, 124382, 122642, 121392, 120626, 120368, 120450, 120291, 119369, 117900, 116618, 115842, 115230, 114497, 113787, 113183, 112447, 111539, 110868, 110637, 110358, 109480, 108229, 107431, 107632, 108712, 110234, 111912, 113753, 115932, 118489, 121094, 123302, 125066, 126767, 128609, 130290, 131487, 132491, 134018, 136379, 139062, 141223, 142428, 142889, 143050, 143188, 143470, 144129, 145186, 146028, 145724, 144028, 141737, 139804, 138430, 137394, 136864, 137275, 138482, 139718, 140497, 141044, 141659, 142154, 142256, 142201, 142506, 143290, 144206, 145095, 146383, 148559, 151425, 154128, 156043, 157371, 158671, 160060, 161266, 162278, 163425, 164772, 166025, 167178, 168684, 170698, 172703, 174248, 175584, 177149, 178851, 180313, 181432, 182226, 182563, 182588, 182942, 183967, 185053, 185449, 185321, 185267, 185089, 183954, 181651]
53590A81651k726k372j723j004m57n66j266j691j450j308j792k042j141J90N31
53575A62834j52o36l62N6J22J01K44L67M10O45J149J678K079K290K047J190J99
53558A74261j90J46P35J259J675J828J606J376J607K131K428K515K847L435L706
53543B01365L336K572J763J138J011J531K208K319J887J697K230L167L963M346
53529B34533M191L423K303J345Q11O21P19J113J495J366P18J76K49P34J013P41
53513B55551J37k62j22L58O92O78N59M78K48j14p1P38J832K451K520K513K573
53496B70759K368J775J149R13J188J839K517K853K853K972L432L820L697L297
53482C05432L127L251L482L961M839N717O048N938N902O003N934N792N988O452
$$ y = [181651, 178925, 176553, 174830, 173826, 173369, 172803, 171537, 169846, 168396, 167088, 165296, 163254, 162113, 162303, 162834, 162682, 162046, 161684, 161740, 161862, 161963, 162207, 162574, 162984, 163629, 164778, 166456, 168535, 170825, 172872, 174062, 174261, 174071, 174217, 174952, 176211, 177886, 179714, 181320, 182696, 184303, 186434, 188862, 191377, 194224, 197659, 201365, 204701, 207273, 209036, 210174, 211185, 212716, 214924, 217243, 219130, 220827, 223057, 226224, 230187, 234533, 238724, 242147, 244450, 245795, 246606, 247227, 247946, 249059, 250554, 251920, 252638, 252814, 253063, 253797, 254810, 255551, 255688, 255426, 255304, 255662, 256354, 257032, 257591, 258069, 258317, 258203, 258132, 258870, 260702, 263153, 265673, 268186, 270759, 273127, 274902, 276051, 276964, 278152, 279991, 282508, 285361, 288214, 291186, 294618, 298438, 302135, 305432, 308559, 311810, 315292, 319253, 324092, 329809, 335857, 341795, 347697, 353700, 359634, 365426, 371414, 377866]
53468C77866O660O497O428O699P020P128P182P457Q010Q705R238R309R080R252
53454D86531J0169J1192J1498J1211J1021J1075J1018J0987J1544J2626J3539
53443F12411J4056J4696J5716J6739J7526J8368J9309J9742J9288J8528J8404
53432H04783J9131J9973J9942J8665J6888J5994J6670J8134J9035J8966J8479
53421A006660J8027J7623J7409J7638J8028J7989J7534J7191J6980J6332J5173
53410A196584J4180J3708J3358J2833J2330J1762J0585Q804P226O243N226L659
53398A316498J977O08r56l245n626o998p283p348p760q439r204r943j0325j0136
53384A231820r832j0216j1472j3028j4256j4955j5215j5239j5272j5350j5228
$$ y = [377866, 384526, 391023, 397451, 404150, 411170, 418298, 425480, 432937, 440947, 449652, 458890, 468199, 477279, 486531, 496700, 507892, 519390, 530601, 541622, 552697, 563715, 574702, 586246, 598872, 612411, 626467, 641163, 656879, 673618, 691144, 709512, 728821, 748563, 767851, 786379, 804783, 823914, 843887, 863829, 882494, 899382, 915376, 932046, 950180, 969215, 988181, 1006660, 1024687, 1042310, 1059719, 1077357, 1095385, 1113374, 1130908, 1148099, 1165079, 1181411, 1196584, 1210764, 1224472, 1237830, 1250663, 1262993, 1274755, 1285340, 1294144, 1301370, 1307613, 1312839, 1316498, 1318475, 1319083, 1318127, 1314882, 1309256, 1302258, 1294975, 1287627, 1279867, 1271428, 1262224, 1252281, 1241956, 1231820, 1221988, 1211772, 1200300, 1187272, 1173016, 1158061, 1142846, 1127607, 1112335, 1096985, 1081757]
53373A081757j4797j4378j4212j3890j2787j1003r397q623q409p963o852n391
53361I54055m258l795l706l486l000k431j742o23R24K388L344L923M462M999N453
53346I56507N998O952Q447J0383J2524J4385J5363J5418J5379J6148J7691J9225
53334A114420K0344K1414K2807K4231K5207K5853K6775K8179K9605L0616L1364
53323A400815L2215L3112L3710L4001L4268L4465L4186L3353L2391L1584L0748
53312A764848K9808K9011K8275K6894K4595K2162K0316J8501J5713J2126Q847
53301B001096O248L684Q14j936m417p178j0409j3481j5983j8426k1292k4076k5923
53288A868721k6806k7396k8115k8791k9074k8819k8239k7799k7776k7832k7399
$$ y = [1081757, 1066960, 1052582, 1038370, 1024480, 1011693, 1000690, 991293, 982670, 974261, 966298, 959446, 954055, 949797, 946002, 942296, 938810, 935810, 933379, 931637, 931014, 931938, 934326, 937670, 941593, 946055, 951054, 956507, 962505, 969457, 977904, 988287, 1000811, 1015196, 1030559, 1045977, 1061356, 1077504, 1095195, 1114420, 1134764, 1156178, 1178985, 1203216, 1228423, 1254276, 1281051, 1309230, 1338835, 1369451, 1400815, 1433030, 1466142, 1499852, 1533853, 1568121, 1602586, 1636772, 1670125, 1702516, 1734100, 1764848, 1794656, 1823667, 1851942, 1878836, 1903431, 1925593, 1945909, 1964410, 1980123, 1992249, 2001096, 2007344, 2011028, 2011842, 2009906, 2005489, 1998311, 1987902, 1974421, 1958438, 1940012, 1918720, 1894644, 1868721, 1841915, 1814519, 1786404, 1757613, 1728539, 1699720, 1671481, 1643682, 1615906, 1588074, 1560675]
53277A560675k6498k5670k5006k4007k2644k1849k2316k3408k3820k3053k1660
53266A300744k0266j8930j7392j5590j3852j2709j2360j2298j1734j0461r043
53255A146109q136p912q252q916r449r392q883q559q662q726q316p623o948o174
53241A030161n169m259l762l374k540j186L03J663K888L906M553M932N552O988
53227A040656R253J1503J2662J2616J2524J3470J5055J6007J5945J5748J6067
53216A191506J6551J6703J6614J6410J5758J4514J3098J1760J0133Q110O429N714
53204A343300N468M760L442J916J33k321n294p933r594j0362j0756j1226j1908
53191A289625j2620j3187j3781j4591j5218j5026j4298j4236j5370j6667j6855
$$ y = [1560675, 1534177, 1508507, 1483501, 1459494, 1436850, 1415001, 1392685, 1369277, 1345457, 1322404, 1300744, 1280478, 1261548, 1244156, 1228566, 1214714, 1202005, 1189645, 1177347, 1165613, 1155152, 1146109, 1137973, 1130061, 1121809, 1112893, 1103444, 1094052, 1085169, 1076610, 1067948, 1059222, 1050906, 1043283, 1036335, 1030161, 1024992, 1020733, 1016971, 1013597, 1011057, 1009871, 1010174, 1011837, 1014725, 1018631, 1023184, 1028116, 1033668, 1040656, 1049909, 1061412, 1074074, 1086690, 1099214, 1112684, 1127739, 1143746, 1159691, 1175439, 1191506, 1208057, 1224760, 1241374, 1257784, 1273542, 1288056, 1301154, 1312914, 1323047, 1331157, 1337586, 1343300, 1348768, 1353528, 1356970, 1358886, 1359019, 1356698, 1351404, 1343471, 1333877, 1323515, 1312759, 1301533, 1289625, 1277005, 1263818, 1250037, 1235446, 1220228, 1205202, 1190904, 1176668, 1161298, 1144631, 1127776]
53180A127776j6031j5245j4981j4821j4325j3487j2489j1546j0809j0142r207
53169I84693q091p375p266p261p099p280q021q470p816o530n550m781l510j926
53155H93717j055j312k138k975l667m003l853l759m511o004p355q085q459q641
53141H27900q539q474q988r781r847q914p919p666p882p979p999q265q786r470
53127G07391j0410j1436j1981j1809j1456j1530j1960j2381j2748j3093j3062
53116E75525j2290j1065j0097r757r846j0036j0098r931r586r386r578r981j0119
53103D43755r786r282r100r373r684r430q508p572p417q033q532q129p092o481
53089C25336o911p785p920o922n674n269n658n795n015l821l144l301l970m649
$$ y = [1127776, 1111745, 1096500, 1081519, 1066698, 1052373, 1038886, 1026397, 1014851, 1004042, 993900, 984693, 976602, 969227, 961961, 954700, 947601, 940321, 932300, 923830, 916014, 909484, 903934, 899153, 895643, 893717, 892662, 891350, 889212, 886237, 882570, 878567, 874714, 870955, 866444, 860440, 853085, 845000, 836541, 827900, 819361, 810887, 801899, 792118, 782271, 773357, 765438, 757772, 749890, 741911, 733912, 725647, 716861, 707391, 696981, 685545, 673564, 661755, 650299, 638769, 626809, 614428, 601680, 588587, 575525, 563235, 552170, 542073, 532316, 522470, 512434, 502336, 492405, 482819, 473433, 463855, 453874, 443755, 433969, 424687, 415587, 406214, 396530, 387100, 378592, 371020, 363603, 355570, 347038, 338909, 331817, 325336, 318425, 310640, 302720, 295798, 290124, 284855, 279197, 273402, 268387, 264566, 261422, 258121, 254151, 249502]
53075B49502m848m235l106k367k509k936k858k497k583k958k618j290j8J33o76
53060B14136j572k139k557k947l118k894k280j391m15L82Q63J105J156Q23j09
53045A99043j359k143j794m17J177K192K499K463K331J971J244L42l16m41l6N42
53029B07298P08P8j095k157k759l038l158l077k932l062l465l664l428l163l234
53014A69852l454l600l888m348m276l088j395m91q56j819k536k647k116j143k90
52999A33905j20o31j366j998k385k268j535o25j25k2Q9J52k88j153j650j229j85
52982A18566P49J097P99J85k07j11J28k9n51r48r93q70p00n09n26r08j207p61
52964A13204K65Q87N73j13l65j25J21J47J66L94P19Q18N67K87L96P58P19J6q33
$$ y = [249502, 244654, 240419, 237313, 234946, 232437, 229501, 226643, 224146, 221563, 218605, 215987, 214697, 214679, 214812, 214136, 212564, 210425, 207868, 204921, 201803, 198909, 196629, 195238, 194823, 195205, 196068, 197173, 198329, 199152, 199043, 197684, 195541, 193747, 193330, 194507, 196699, 199198, 201661, 203992, 205963, 207207, 207549, 207233, 206792, 206756, 207298, 208006, 208084, 206989, 204832, 202073, 199035, 195877, 192800, 189868, 186806, 183341, 179677, 176249, 173086, 169852, 166398, 162798, 158910, 154562, 150286, 147198, 145803, 145312, 144456, 142637, 140101, 137454, 135338, 134195, 133905, 133785, 133154, 131788, 129790, 127405, 125137, 123602, 122977, 122852, 122830, 122919, 123071, 122783, 121630, 119980, 118751, 118566, 119315, 120412, 121211, 121396, 121189, 121078, 121206, 121177, 120626, 119678, 118685, 117815, 117115, 116606, 116080, 115172, 113965, 113204, 113469, 114356, 114929, 114816, 114451, 114326, 114447, 114594, 114760, 115154, 115873, 116691, 117258, 117545, 117941, 118699, 119418, 119434, 118601]
52945A18601j344j709k083j831l76J535K490K132J363R25P88Q28J052R84j1j450
52929A21894j850o27J066J834J602J107O65J94j38n1L05M99K91k78r68j256o59
52912A23630N76J536J736J610J730K086K401K615K642K253J631J518K295L363
52898A51622L883L780L568L609L996M704N369N308M320L115K498K473K575K619
52884B03439K602K244J385N33L21N28K92p12j889k527k492k051j461r52p71j022
52868A97467j532j988k160k008j605j054m83j63l65r62j358j162o96m79m28j59
52852A80865J42m5n08m42J83L46l95j021m99O14R47J82p88j210j089o04J77Q78
52834A77733Q47o4j155j584j205o15m52o85o22K33J350J620P70j92k65L27O24
$$ y = [118601, 117257, 115548, 113465, 111634, 111258, 112793, 115283, 117415, 118778, 119703, 120491, 121319, 122371, 123355, 123344, 121894, 120044, 119417, 120483, 122317, 123919, 125026, 125691, 125885, 125747, 125696, 126001, 126500, 126791, 126513, 125545, 124289, 123630, 124206, 125742, 127478, 129088, 130818, 132904, 135305, 137920, 140562, 142815, 144446, 145964, 148259, 151622, 155505, 159285, 162853, 166462, 170458, 175162, 180531, 185839, 190159, 193274, 195772, 198245, 200820, 203439, 206041, 208285, 209670, 210203, 210524, 211052, 211344, 210632, 208743, 206216, 203724, 201673, 200212, 199260, 198489, 197467, 195935, 193947, 191787, 189779, 188174, 187120, 186637, 186474, 186109, 185147, 183789, 182627, 181931, 181452, 181024, 180865, 181007, 180962, 180454, 180012, 180195, 180541, 180146, 179125, 178626, 179240, 180187, 180369, 179581, 178371, 177282, 176678, 176855, 177733, 178580, 178516, 177361, 175777, 174572, 173957, 173505, 172820, 172198, 172431, 173781, 175401, 176171, 175979, 175714, 176041, 176665]
52817A76665K42l87p75p53k62N84J279J217L90n09p36j13Q71J406J031J58l14
52800A79994j00J70j7k36J61R19J214Q26K87K2RK64R04J628J810J313O98M00K26
52781A90492l2j5P24J945K887L117K865K556K383K435K873L673M308M050K728
52766B26989J007k83q84j035q69l40K78L12o15k051l112l305k876k494k568k843
52750B05311k717k072j595j958k915l593l537k987k282j686j669k553l770m248
52736A67729l711k911k394j945j449j330j585j456p41n16j557k913l088k161j407
52721A38565j267j025l66L0k33o06o12o27j098j682j783j456j243j325j335r24
52705A23013j64N27P17K41o11j255j300q69m17k31j51O8J97l61j733l195l944
$$ y = [176665, 176907, 176520, 175745, 174992, 174730, 175314, 176593, 177810, 178200, 177691, 176955, 176842, 177713, 179119, 180150, 180308, 179994, 179894, 180064, 180047, 179811, 179972, 180891, 182105, 182931, 183218, 183240, 183249, 183513, 184417, 186045, 187855, 189168, 189866, 190266, 190492, 190460, 190445, 191169, 193114, 196001, 199118, 201983, 204539, 206922, 209357, 212230, 215903, 220211, 224261, 226989, 227996, 227713, 226829, 225794, 224925, 224585, 224863, 225175, 224560, 222509, 219397, 216092, 213216, 210722, 208154, 205311, 202594, 200522, 198927, 196969, 194054, 190461, 186924, 183937, 181655, 179969, 178300, 175747, 171977, 167729, 164018, 161107, 158713, 156768, 155319, 153989, 152404, 150948, 150207, 149691, 148134, 145221, 142133, 139972, 138565, 137298, 136273, 135907, 135937, 135704, 135098, 134486, 133859, 132761, 131079, 129296, 127840, 126597, 125272, 123937, 123013, 122849, 123376, 124093, 124334, 123723, 122468, 121168, 120299, 119882, 119651, 119500, 119568, 119765, 119404, 117671, 114476, 110532]
52688A10532l997l797l325k314j208q07r55o73J18J91j031k320k324j419q13o73
52672H5185m22j78m64q23l07Q03J091L3j305j843j650j250p33p2M45N73L36k19
52654G9200r98j497j201m57j38l78m41k7K47l2l61k64j25m40q28n75L00J080J265
52635G4330J006P82R03J223J277R78J013K014L365L643K445R98O07J205J948K473
52619A00210K893L070K704J933J217O82J26n45j216j802k207k210j732j105q20
52604A01198j026j478j795j694j219q36j007j588k034k221k540l029l037k221
52590G5473j218q40j015j093q25m13%L28K12n14j240j103j26P74R23N51K19J10
52572G0203M8r8k91l46p9M25P62O60L63K34J22l75j115j357p35J99N84J39o66
$$ y = [110532, 106535, 102738, 99413, 97099, 95891, 95084, 94129, 93456, 93574, 93765, 92734, 90414, 88090, 86671, 85858, 85185, 84763, 84585, 84121, 83298, 82991, 83794, 84885, 84918, 83613, 81770, 80120, 78870, 78137, 78065, 78510, 79083, 79419, 79200, 78202, 76705, 75504, 75047, 74909, 74531, 74090, 74063, 74310, 74278, 73917, 73653, 73528, 73088, 72260, 71685, 71985, 73065, 74330, 75336, 76118, 77021, 78244, 79521, 80499, 81512, 83526, 86891, 90534, 92979, 93977, 94584, 95789, 97737, 100210, 103103, 106173, 108877, 110810, 112027, 112709, 112835, 112290, 111074, 109272, 107065, 104855, 103123, 102018, 101198, 100172, 98694, 96899, 95205, 93986, 93150, 92143, 90555, 88521, 86300, 83760, 80731, 77694, 75473, 74255, 73415, 72400, 71307, 70482, 70069, 70069, 70397, 70609, 70095, 68855, 67752, 67626, 68400, 69323, 69874, 70093, 70203, 70251, 70153, 69862, 69516, 69437, 69862, 70624, 71284, 71647, 71881, 72003, 71628, 70513, 69156, 68421, 68620, 69204, 69343, 68677]
52553F8677j139r22k50L02L94K92L76M95K50k16k99N5J41l35n50L14J690K188
52535G1463J334M7o32n51p9N17R81R44L98o3Q2O19J032J260J538J760J545Q90
52517H3085K06k20l20J01J164K299K527J601L80k28j70J39N33R27R76N15N0J97
52499I3762P93J131R63O84O03N75M62L87L86K36j12k23K94J183J705J442P08J15
52481A05094j24k83n10m51K42J194J567J110M93L36M41L13K5K5L56P06J039J681
52463A13254K621L308L221K437J438O13K6m48q30r11n16J41O03Q03J089J514J567
52446A29930R46J32k99n03q74j123o54K94P29K58l60k38N76J329J398O99l85j260
52428A30595j542j351j059p91m69j66o0p8N5M14Q64J347J827K021J597O29m60
$$ y = [68677, 67538, 66616, 66366, 66668, 67062, 67354, 67730, 68225, 68475, 68259, 67960, 68015, 68156, 67821, 67271, 67585, 69275, 71463, 72797, 72844, 72212, 71661, 71582, 72099, 73080, 74024, 74422, 74359, 74441, 75060, 76092, 77352, 78890, 80650, 82195, 83085, 83291, 83071, 82751, 82852, 84016, 86315, 88842, 90443, 90823, 90595, 90425, 90564, 91097, 92024, 93000, 93515, 93565, 93762, 94555, 95686, 96649, 97333, 97936, 98511, 98973, 99360, 99746, 99982, 99870, 99647, 99941, 101124, 102829, 104271, 104979, 105094, 104970, 104687, 104177, 103726, 103968, 105162, 106729, 107839, 108332, 108668, 109109, 109422, 109447, 109472, 109828, 110534, 111573, 113254, 115875, 119183, 122404, 124841, 126279, 126892, 126918, 126470, 125640, 124729, 124213, 124354, 124957, 125760, 126849, 128363, 129930, 130876, 131008, 130709, 130206, 129332, 128209, 127555, 127849, 128578, 128836, 128476, 128238, 128814, 130143, 131541, 132240, 131855, 130595, 129053, 127702, 126643, 125852, 125383, 125217, 125157, 125079, 125134, 125548, 126412, 127759, 129586, 131607, 133204, 133833, 133373]
52411A33373j339j817j652p89L38J134J382J168N95j6m7O26J178Q89K98L68R28
52394A36617J025O44P18J374J545P30j68k93k1O9K67R16J410J013J30k82o2K26
52376A45858M12Q13J396J671J404Q90M54J97J46K64L44K11k1q8J47P27J517J983
52358A58325J472P8j178j418q83m61o00r86j053m70N88J423J396P30L71P96J419
52341A59549J480J007M95J90J37M85J168J727J893K030K537L202L550L443K892
52326A85785J804M43l61j70L70M07M6o9Q6J0l56n96n64m44k39R9K40j31o87r31
52306A84742j007j259j291n25N31P23J01J03J523L277L795K825J256j38j017j052
52290A92587q3J361K293K214J532J035J109J566K106K734L567M321M476M033L682
$$ y = [133373, 132034, 130217, 128565, 127776, 128114, 129248, 130630, 131798, 132393, 132377, 132330, 132956, 134134, 135023, 135321, 135689, 136617, 137642, 138286, 139004, 140378, 141923, 142653, 142485, 142192, 142171, 142240, 142507, 143423, 144833, 145846, 145976, 145694, 145632, 145858, 146270, 147083, 148479, 150150, 151554, 152444, 152898, 153095, 153241, 153505, 153849, 154060, 154039, 153951, 154098, 154825, 156342, 158325, 159797, 159875, 158697, 157279, 156396, 155935, 155335, 154349, 153296, 152826, 153414, 154837, 156233, 156963, 157334, 158130, 159549, 161029, 162036, 162531, 162721, 162858, 163343, 164511, 166238, 168131, 170161, 172698, 175900, 179450, 182893, 185785, 187589, 188032, 187671, 187501, 187871, 188278, 188324, 188255, 188341, 188351, 187995, 187399, 186835, 186391, 186152, 186251, 186491, 186360, 185673, 184742, 183735, 182476, 181185, 180660, 181191, 181914, 182015, 182118, 183641, 186918, 190713, 193538, 194794, 194656, 193639, 192587, 192504, 193865, 196158, 198372, 199904, 200939, 202048, 203614, 205720, 208454, 212021, 216342, 220818, 224851, 228533]
52275B28533L806L868L262K399K159K577K915K915L022L390L551L397L469L972
52261B73235M287M026L788M261N157N796O173O689P151O995O391O276P152Q434
52247C55811R309R621R684R594R230Q797Q894R926J1581J3084J3937J4317J4712
52234D98497J5332J5991J6486J6858J7170J7261J6911J6250J5794J5995J6747
52223F79292J7388J7318J6620J5968J5843J5995J5785J5000J4045J3389J3070
52212H49713J2730J1994J0729R149P744O905O531O161N524M832M385M059L428
52199I43884K298R29k64j039j313j095o37m59q43j297q87P19K764M200M768M997
52183I56725N380N974O766P903R372J0780J1699J2081J2279J2771J3856J5348
$$ y = [228533, 232339, 236207, 239469, 241868, 244027, 246604, 249519, 252434, 255456, 258846, 262397, 265794, 269263, 273235, 277522, 281548, 285336, 289597, 294754, 300550, 306723, 313412, 320563, 327558, 333949, 340225, 347377, 355811, 365120, 374741, 384425, 394019, 403249, 412046, 420940, 430866, 442447, 455531, 469468, 483785, 498497, 513829, 529820, 546306, 563164, 580334, 597595, 614506, 630756, 646550, 662545, 679292, 696680, 713998, 730618, 746586, 762429, 778424, 794209, 809209, 823254, 836643, 849713, 862443, 874437, 885166, 894315, 902059, 908964, 915495, 921656, 927180, 932012, 936397, 940456, 943884, 946182, 947111, 946847, 945808, 944495, 943400, 942763, 942304, 941461, 940164, 939277, 939996, 942760, 946960, 951728, 956725, 962105, 968079, 974845, 982748, 992120, 1002900, 1014599, 1026680, 1038959, 1051730, 1065586, 1080934]
52171A080934J6557J6865J6307J5327J4092J2490J0738R389Q547P657O333M844
52159A220080L497K016O6k123m045n574o855p850q526r222j0366j1917j3425j4526
52145A131230j5110j5213j5084j5097j5319j5369j4950j4212j3340j2291j1297
52134I73948j1014j1590j2053j1380r819q369p299o092m701l853l942m444m689
52121H74703m594m398m216m131m248m433m350l906l356k878k506k463l038l959
52107H22227m377l744k514j761k203l626n029n461m907m271m264m550m388l760
52093G67372l266l135l074l001l136l338l084k308j600j375j482j778k370k990
52079G31435k955k152j494j723k297k125j124l59o86j754k433j965o18N78P58
$$ y = [1080934, 1097491, 1114356, 1130663, 1145990, 1160082, 1172572, 1183310, 1192699, 1201246, 1208903, 1215236, 1220080, 1223577, 1225593, 1225659, 1223536, 1219491, 1213917, 1207062, 1199212, 1190686, 1181464, 1171098, 1159181, 1145756, 1131230, 1116120, 1100907, 1085823, 1070726, 1055407, 1040038, 1025088, 1010876, 997536, 985245, 973948, 962934, 951344, 939291, 927911, 918092, 909723, 902424, 896332, 891631, 887778, 883836, 879392, 874703, 870109, 865711, 861495, 857364, 853116, 848683, 844333, 840427, 837071, 834193, 831687, 829224, 826186, 822227, 817850, 814106, 811592, 809831, 807628, 804002, 798973, 793512, 788605, 784334, 780070, 775520, 771132, 767372, 764106, 760971, 757897, 754896, 751760, 748422, 745338, 743030, 741430, 740055, 738573, 736795, 734425, 731435, 728480, 726328, 724834, 723111, 720814, 718689, 717565, 717206, 716520, 714766, 712333, 710368, 709750, 710328, 711086]
52064G11086l1r48j154m49P36J726K052J837J731K223L082L723M000M258M732
52049G38604N340O001O682P184P387P696Q562R681J0271J0295J0616J1716J3066
52036H53101J4112J5156J6686J8397J9558K0023K0311K0916K1871K2783K3003
52025A065917K2103K0486J9164J8596J8173J7189J5799J4520J3282J1663R778
52014A246670Q169O920N581L920K149M23j374l174m591n420n943o590p522q657
52000A230561r774j0534j0654j0261r825r595r253q339o887n473m597m176l740
51987A127453l033k236j544p75L63J676K576K791K751L117M040N087N732N819
51973A153817N585N358N213M970M534M129M002M044L899L395K567J416o2j574
$$ y = [711086, 711055, 710107, 708953, 708504, 709240, 710966, 713018, 714855, 716586, 718809, 721891, 725614, 729614, 733872, 738604, 743944, 749945, 756627, 763811, 771198, 778894, 787456, 797137, 807408, 817703, 828319, 840035, 853101, 867213, 882369, 899055, 917452, 937010, 957033, 977344, 998260, 1020131, 1042914, 1065917, 1088020, 1108506, 1127670, 1146266, 1164439, 1181628, 1197427, 1211947, 1225229, 1236892, 1246670, 1254839, 1261759, 1267340, 1271260, 1273409, 1273832, 1272458, 1269284, 1264693, 1259273, 1253330, 1246740, 1239218, 1230561, 1220787, 1210253, 1199599, 1189338, 1179513, 1169918, 1160665, 1152326, 1145439, 1139966, 1135369, 1131193, 1127453, 1124420, 1122184, 1120640, 1119865, 1120228, 1121904, 1124480, 1127271, 1130022, 1133139, 1137179, 1142266, 1147998, 1153817, 1159402, 1164760, 1169973, 1174943, 1179477, 1183606, 1187608, 1191652, 1195551, 1198946, 1201513, 1202929, 1202867, 1201293]
51959A201293k732l583m570n903p342q640r777j0658j1145j1599j2827j5008j7126
51946A080383j8076j8068j8335j9484k0748k1117k0662k0365k0782k1416k1540
51935H59790k1280k1364k1965k2304k1698k0466j9377j8647j8074j7812j8187
51924F38616j8826j8824j7934j6859j6124j5427j4435j3567j3367j3639j3723
51913D65891j3348j2650j1692j0452r173q283p978q117q377q367p793o734n629
51900C47298m839m454m516n004n512n365m411l264k538k258k250k548l068l384
51886B93887l328l344l779m229m207l955l964m022l581k776k342k533k894l069
51872B45864l163l215k996k523k208k200k110j601r46p10j107j887k565k678k060
$$ y = [1201293, 1198561, 1194978, 1190408, 1184505, 1177163, 1168523, 1158746, 1148088, 1136943, 1125344, 1112517, 1097509, 1080383, 1062307, 1044239, 1025904, 1006420, 985672, 964555, 943893, 923528, 902746, 881330, 859790, 838510, 817146, 795181, 772877, 751179, 730713, 711336, 692689, 674615, 656803, 638616, 619790, 600966, 583032, 566173, 550049, 534622, 520187, 506620, 493253, 479614, 465891, 452543, 439893, 428201, 417749, 408576, 400293, 392315, 384198, 375821, 367454, 359661, 352927, 347298, 342459, 338005, 333489, 328485, 322973, 317608, 313197, 309933, 307395, 305137, 302887, 300339, 297271, 293887, 290559, 287215, 283436, 279207, 275000, 271045, 267081, 263059, 259478, 256702, 254360, 251827, 248933, 245864, 242701, 239486, 236490, 233967, 231759, 229559, 227449, 225848, 224902, 224192, 223085, 221198, 218633, 215955, 213895]
51857B13895j095n11p40j538k297k562k280j648r52m46l76q97j836k560k453j666
51841A90038j081j297j939k293k236k119j995j632j116q57q92q62p27r32j539
51826A68521j886j522r59r19j138o75N97J558J173k45j467j745j293o56j06L10
51810A59548O07R01J274J468J056J47m71k25N46J094J207J208J293J352J316J187
51794A73508R00N59O06J243J850J673R38N70Q51J161J116J046J142J070P28N71
51778A89532P27O52K26K61J187J990J427j97j413j492j005o86n73m03j09K21L97
51761A90742J58m70j007j050q99j132j723k066j817j217o35j83J71M73P89J041
51745A81175J058R11R54J237J243O20j78m90m01m40o20n13j17M5k34n77o46n18
$$ y = [213895, 212800, 212289, 211549, 210011, 207714, 205152, 202872, 201224, 200272, 199826, 199450, 198553, 196717, 194157, 191704, 190038, 188957, 187660, 185721, 183428, 181192, 179073, 177078, 175446, 174330, 173473, 172581, 171719, 170992, 170060, 168521, 166635, 165113, 164154, 163235, 162097, 161422, 162019, 163577, 164750, 164505, 163038, 161293, 160000, 159344, 159238, 159548, 160155, 161056, 162330, 163798, 164854, 165001, 164530, 164305, 164851, 165945, 167152, 168360, 169653, 171005, 172321, 173508, 174408, 174967, 175573, 176816, 178666, 180339, 181277, 181847, 182698, 183859, 184975, 186021, 187163, 188233, 188961, 189532, 190259, 190911, 191137, 191398, 192585, 194575, 196002, 195805, 194392, 192900, 191895, 191209, 190636, 190233, 190124, 190345, 190742, 190900, 190430, 189423, 188373, 187474, 186342, 184619, 182553, 180736, 179519, 178884, 178701, 178872, 179345, 180134, 181175, 182233, 183144, 184098, 185335, 186578, 187198, 187020, 186530, 186129, 185689, 185069, 184556, 184439, 184484, 184250, 183673, 183027, 182509]
51727A82509l21l2J95J8n57j010q88l31J55K80K37N02J313K277K609J965Q46N2
51709A89819j15R0K86K58N6L6N34J266J495J024N65P52J278J475J244R19P12Q15
51691B02509J470K333K434J495O92J109K113K351J830J659K085K276K014K049
51677B28419K597K849K449K164K586L284L762M184M592M480L804L496M125M948
51663B77739N044M662M591M842M873M580M197L603K639J814J824K485K881K488
51649C28262J578N81k80p57o32j09K50J20l34p77j022j051r89j020j149j144q66
51632C20661n12l10j99n5K1j27l87m90l58m1M80J165J726J922J885J870J710Q85
51614C29846p49k587l761l877l185k197j366j027j294j839j981j435p83p40j029
$$ y = [182509, 182188, 182156, 182351, 182369, 181812, 180802, 179914, 179583, 179738, 180018, 180255, 180757, 182070, 184347, 186956, 188921, 189767, 189819, 189704, 189794, 190080, 190338, 190394, 190430, 190964, 192230, 193725, 194749, 195314, 196066, 197344, 198819, 200063, 200982, 201694, 202509, 203979, 206312, 208746, 210241, 210933, 212042, 214155, 216506, 218336, 219995, 222080, 224356, 226370, 228419, 231016, 233865, 236314, 238478, 241064, 244348, 248110, 252294, 256886, 261366, 265170, 268666, 272791, 277739, 282783, 287445, 292036, 296878, 301751, 306331, 310528, 314131, 316770, 318584, 320408, 322893, 325774, 328262, 329840, 330421, 330141, 329384, 328752, 328643, 328893, 329013, 328679, 327902, 326880, 325829, 324840, 323820, 322671, 321527, 320661, 320149, 319839, 319640, 319585, 319606, 319479, 319092, 318602, 318244, 318203, 318683, 319848, 321574, 323496, 325381, 327251, 328961, 329846, 329097, 326510, 322749, 318872, 315687, 313490, 312124, 311097, 309803, 307964, 305983, 304548, 303765, 303025, 301996]
51599C01996n98P58J806J386J2q28n56J17M81N89O27M27j44q53j428j789j917
51582C00086j875k018k651l528m117m380m651m859m599m019l853m336m791m601
51568B45808l943l305k844k512k347k343k387k431k395k018j329j074j802k789
51554B12289k864k234k152k732k576j118K21O6j000j590j448j156q34m21m23j135
51538A90893j679j102J8L47j82m30J12P64R29P98O70N47N32Q18J215J349J352
51521A96951J624K050K164K020K091K397K572K680L160L920M350M304M250M365
51507B38898M296L912L462K909J882M90o37j297j908k614k958k771k586k794l088
51492B35196l103k962k816k459j774j047m76P0N01L88k14m58K79J564K604L202
$$ y = [301996, 301398, 302156, 303962, 305348, 305360, 304532, 303976, 304093, 304574, 305163, 305790, 306217, 306073, 305220, 303792, 302003, 300086, 298211, 296193, 293542, 290014, 285897, 281517, 276866, 272007, 267408, 263389, 259536, 255200, 250409, 245808, 241865, 238560, 235716, 233204, 230857, 228514, 226127, 223696, 221301, 219283, 217954, 216880, 215078, 212289, 209425, 207191, 205039, 202307, 199731, 198613, 198834, 198900, 197900, 196310, 194862, 193706, 192872, 192451, 192028, 190893, 189214, 188112, 188130, 188477, 188295, 187865, 187977, 188741, 189670, 190468, 191138, 191685, 192217, 193035, 194250, 195599, 196951, 198575, 200625, 202789, 204809, 206900, 209297, 211869, 214549, 217709, 221629, 225979, 230283, 234533, 238898, 243194, 247106, 250568, 253477, 255359, 255849, 255212, 253915, 252007, 249393, 246435, 243664, 241078, 238284, 235196, 232093, 229131, 226315, 223856, 222082, 221035, 220559, 220629, 221130, 221518, 221304, 220846, 221125, 222689, 225293, 228495]
51476B28495L538L548L200K983L356L876L674K730K034K305L096L326K510J166
51462B69837K31J40N12O06P4q85j886k614k768k164j053m6M62N74N35M87O21J140
51444B63803J785J920J368Q49J150K114K924L086K665J830P24k55o36m89m18q26
51428B81594j503k062k427k661k643k273j804j656j852j896j361m61J06r7p79
51413B58225j228r99k61M78Q32Q17P76J091J757K299K310K102K475L650M744M729
51397B83797L799L269M013N449O331O229N767N586N627N511N137M624M006L356
51383C52501K951K880K665J760L99n42o19k67r0j29j88l89r34j594j891j748j529
51366C53236j497j506j285p21Q4Q40J218J150R30Q20P21M83L06M08N00Q1p60j383
$$ y = [228495, 232033, 235581, 238781, 241764, 245120, 248996, 252670, 255400, 257434, 259739, 262835, 266161, 268671, 269837, 270068, 270208, 270720, 271326, 271400, 270515, 268629, 266015, 263247, 261083, 260030, 259984, 260446, 261020, 261555, 262042, 262663, 263803, 265588, 267508, 268876, 269725, 270875, 272989, 275913, 278999, 281664, 283494, 284218, 283963, 283327, 282838, 282420, 281594, 280091, 278029, 275602, 272941, 270298, 268025, 266221, 264565, 262713, 260817, 259456, 258995, 259101, 259004, 258225, 256997, 255998, 255737, 256215, 257047, 257864, 258640, 259731, 261488, 263787, 266097, 268199, 270674, 274324, 279068, 283797, 287596, 290865, 294878, 300327, 306658, 312887, 318654, 324240, 329867, 335378, 340515, 345139, 349145, 352501, 355452, 358332, 360997, 362757, 363156, 362614, 361995, 361728, 361638, 361509, 361321, 360932, 359998, 358404, 356513, 354765, 353236, 351739, 350233, 348948, 348227, 348311, 349151, 350369, 351519, 352449, 353269, 353990, 354473, 354779, 355187, 355687, 355768, 355008, 353625]
51348C53625j528j705k437l545m456m908n006m883m643m504m629m869m896m590
51334B97026m080l466k786k238k142k546l031l092k629j958j379r72p65q59j190
51319B63893j332q33K36J205J416P81j93p97o22J24P53P04O5p29j602k838m320
51302B55911n279n185m554m390n013n823o141n908n475n149n059n205n416n353
51288A81961m711l515k256j554j587j844j719j320j336k019k779l000k792k523
51274A49006k117j391p53q19j433j753j379p81n18n78p00p84p78n67k83l42q49
51257A33181j290j073k59N58R19Q42O25N63Q09J300J769J978J873J556J180R10
51241A45441R21J350K192L195L903M024L793L740L984M039L637L340L780M513
$$ y = [353625, 352097, 350392, 347955, 344410, 339954, 335046, 330040, 325157, 320514, 316010, 311381, 306512, 301616, 297026, 292946, 289480, 286694, 284456, 282314, 279768, 276737, 273645, 271016, 269058, 267679, 266707, 265942, 265083, 263893, 262561, 261728, 261964, 263169, 264585, 265366, 265173, 264376, 263754, 263878, 264631, 265335, 265400, 264671, 263069, 260231, 255911, 250632, 245447, 240893, 236503, 231490, 225667, 219526, 213618, 208143, 202994, 197935, 192730, 187314, 181961, 177250, 173735, 171479, 169925, 168338, 166494, 164775, 163455, 162119, 160100, 157321, 154321, 151529, 149006, 146889, 145498, 144745, 143926, 142493, 140740, 139361, 138580, 138062, 137484, 136784, 136000, 135222, 134655, 134372, 134030, 133181, 131891, 130818, 130559, 131117, 132036, 132878, 133503, 134066, 134875, 136175, 137944, 139922, 141795, 143351, 144531, 145441, 146362, 147712, 149904, 153099, 157002, 161026, 164819, 168559, 172543, 176582, 180219, 183559, 187339, 191852]
51227A91852M343K839Q56o04j481k235k910l170l008k880l148l733m300m596m573
51212A63252m356m063l653l068k495k224k202k083j848j984k689l326l090k031
51198A24140q84r4M62Q25O91rp85j167j221j154q28q8O59P74J72o28j160j280
51180A18425q77J10J250J811J600J145R06Q11Q08J177J807J884R63j38m13j46
51164A31123l65j080j277o03J24L24M26Q09J011O79L27M90P76O45M16O73J117
51147A35615R32K0r02j276j107o02l7K17J12J67P54J452J667J540J504J364O12
51130A42032m99j131j045q16q48r35q43o59m71k74k62o51j219j512j428j066l22
51113A28051O80J079J46j391j963j173k04k6k81k67o5j08l81n50l95J78J008J339
$$ y = [191852, 196195, 199034, 199890, 199286, 197805, 195570, 192660, 189490, 186482, 183602, 180454, 176721, 172421, 167825, 163252, 158896, 154833, 151180, 148112, 145617, 143393, 141191, 139108, 137260, 135276, 132587, 129261, 126171, 124140, 123256, 123162, 123624, 124449, 125140, 125131, 124346, 123179, 121958, 120804, 119976, 119888, 120547, 121321, 121493, 120865, 119705, 118425, 117548, 117658, 118908, 120719, 122319, 123464, 124370, 125181, 125989, 127166, 128973, 130857, 131820, 131682, 131269, 131123, 130758, 129678, 128401, 127798, 127922, 128246, 128672, 129481, 130492, 131171, 131498, 131988, 132764, 133409, 133825, 134498, 135615, 136547, 136567, 135665, 134389, 133282, 132680, 132643, 132860, 132972, 133139, 133893, 135345, 137012, 138552, 140056, 141420, 142032, 141533, 140402, 139357, 138541, 137693, 136758, 135915, 135256, 134785, 134511, 134249, 133598, 132379, 130867, 129439, 128373, 128051, 128731, 129810, 129956, 128565, 126602, 125429, 125225, 125199, 124918, 124651, 124586, 124478, 124097, 123547, 123152, 123330, 124338, 125677]
51095A25677M11j317k322j797n75J97M60P85J230J370J012K33q54j877k201j718
51079A18714j153j090j150p57k19k73q90j301j080n71k80l63o71q71n89J95R65
51062A08616J185R05N80M44L55J26k18m26j82N58J331J570J302J067J194J523
51046A19930J857K143K171J761J338J559K259K572K283K143K422K318J343K50
51032A46349k57o92j616k291j755n76q6l34k39M58Q85O80N37Q52J104Q55M27J33
51014A44434j56l61%Q84J471J201N07L0j46o8M92J483K180J980J184M60p2o71
50996A54832j280j555j464j314j255j184j027q60p44o64n54k75K79R42J310J180
50980A46367P19J56m14q00o08K49J249J789J900K055K415K650K499K152J914J883
$$ y = [125677, 126088, 124771, 122449, 120652, 120077, 120274, 120734, 121519, 122749, 124119, 125131, 125364, 124510, 122633, 120432, 118714, 117561, 116471, 115321, 114564, 114345, 114072, 113182, 111881, 110801, 110230, 109950, 109587, 108916, 108045, 107456, 107651, 108616, 109801, 110706, 111286, 111730, 112085, 112211, 111993, 111567, 111385, 111943, 113274, 114844, 116146, 117213, 118407, 119930, 121787, 123930, 126101, 127862, 129200, 130759, 133018, 135590, 137873, 140016, 142438, 144756, 146099, 146349, 146092, 145400, 143784, 141493, 139738, 139162, 139076, 138742, 138503, 138961, 139846, 140526, 141063, 141915, 143019, 143874, 144301, 144434, 144278, 143917, 143917, 144801, 146272, 147473, 147980, 148010, 147864, 147796, 148288, 149771, 151951, 153931, 155115, 155575, 155503, 154832, 153552, 151997, 150533, 149219, 147964, 146780, 145753, 144893, 144149, 143485, 142931, 142656, 142935, 143877, 145187, 146367, 147086, 147242, 146828, 146028, 145420, 145669, 146918, 148707, 150607, 152662, 155077, 157727, 160226, 162378, 164292, 166175]
50964A66175K087K659L458L769K871J094j80N3J251K054J961J695J895K181J880
50949A94903J101N76P61J565K712L784M191L649K703K291K723L480L991M174M290
50934B36894M638N459O687P787Q190P988P828Q126Q744R528J0646J2151J3592
50921C48258J4453J4769J5072J5824J7024J8352J9573K0829K2519K4756K7099
50910E58528K9038L0699L2820L5934L9834M3822M7297N0069N2365N4586N6905
50899A031897N9051O0639O1652O2347O2639O1921N9596N5671N0714M5335L9817
50888A651279L4112K8053K1539J4580P349L15n775j0446j3993j7092j9798k1412
50876A668711k1535k0841k0357k0415k0759k1302k2144k3088k3899k4898k6746
$$ y = [166175, 168262, 170921, 174379, 178148, 181019, 182113, 181933, 181986, 183237, 185291, 187252, 188947, 190842, 193023, 194903, 196004, 196580, 197341, 198906, 201618, 205402, 209593, 213242, 215945, 218236, 220959, 224439, 228430, 232604, 236894, 241532, 246991, 253678, 261465, 269655, 277643, 285471, 293597, 302341, 311869, 322515, 334666, 348258, 362711, 377480, 392552, 408376, 425400, 443752, 463325, 484154, 506673, 531429, 558528, 587566, 618265, 651085, 687019, 726853, 770675, 817972, 868041, 920406, 974992, 1031897, 1090948, 1151587, 1213239, 1275586, 1338225, 1400146, 1459742, 1515413, 1566127, 1611462, 1651279, 1685391, 1713444, 1734983, 1749563, 1756912, 1757227, 1751452, 1741006, 1727013, 1709921, 1690123, 1668711, 1647176, 1626335, 1605978, 1585563, 1564804, 1543502, 1521358, 1498270, 1474371, 1449473, 1422727]
50865A422727k9534l2636l5398l7556l9082m0194m1457m3208m4880m5443m4598
50854I88741m3013m1353l9700l7982l6222l4205l1581k8526k5728k3474k1378
50843F25579j9289j7635j6559j5372j3461j1151r140p607o431n705n377m848l693
50830D89311k425j724j286k25J473K853L420L770M552N506N989O005O268P372
50816E30859R232J1176J2510J3104J3457J4084J4941J5687J6369J7362J8737K0188
50804G07706K1710K3756K6532K9564L2301L4746L7223L9964M3252M7462N2494
50793A096710N7600O2403O7650P4241Q1841Q9371R6650J04357J12312J19122J24066
50782B086323J28114J32262J35922J38018J38647J38165J35286J28005J16377
$$ y = [1422727, 1393193, 1360557, 1325159, 1287603, 1248521, 1208327, 1166870, 1123662, 1078782, 1033339, 988741, 945728, 904375, 864675, 826693, 790471, 756266, 724685, 696159, 670431, 646957, 625579, 606290, 588655, 572096, 556724, 543263, 532112, 522972, 515365, 508934, 503229, 497852, 493004, 489311, 486886, 485162, 483876, 483651, 485124, 487977, 491397, 495167, 499719, 505225, 511214, 517219, 523487, 530859, 540091, 551267, 563777, 576881, 590338, 604422, 619363, 635050, 651419, 668781, 687518, 707706, 729416, 753172, 779704, 809268, 841569, 876315, 913538, 953502, 996754, 1044216, 1096710, 1154310, 1216713, 1284363, 1358604, 1440445, 1529816, 1626466, 1730823, 1843135, 1962257, 2086323, 2214437, 2346699, 2482621, 2620639, 2759286, 2897451, 3032737, 3160742, 3277119]
50773C277119J02619Q8161P2243N4150L5132J7061L83j5231k9206m0527m9179
50762C512725n5689n9614o0034n7411n3567m9692m5737m1932l9550l9498m1346
50751B968655m4411m8938n5381o3179p1079p8270q4582q9946r4345r8024j01088
50740B139412j03023j03124j01274r7923r3514q8357q2974p7968p3407o8753o3563
50729A185532n8064n2842m8125m3609l8986l4442l0453k7181k4350k1734j9435
50718G86311j7534j5832j4232j3005j2254j1442j0037q402p439p323p310o784
50706F54717n876m907l854k642j511p93o43r95j403j024O48K942M616N414O251
50691F50940P654Q956R508R892J1179J3534J6236J8676K0733K2451K4069K6084
$$ y = [3277119, 3379738, 3467899, 3540142, 3594292, 3629424, 3646485, 3646868, 3631637, 3602431, 3561904, 3512725, 3457036, 3397422, 3337388, 3279977, 3226410, 3176718, 3130981, 3089049, 3049499, 3010001, 2968655, 2924244, 2875306, 2819925, 2756746, 2685667, 2607397, 2522815, 2432869, 2338524, 2240500, 2139412, 2036389, 1933265, 1831991, 1734068, 1640554, 1552197, 1469223, 1391255, 1317848, 1249095, 1185532, 1127468, 1074626, 1026501, 982892, 943906, 909464, 879011, 851830, 827480, 805746, 786311, 768777, 752945, 738713, 725708, 713454, 702012, 691975, 683573, 676134, 668811, 661501, 654717, 648841, 643934, 640080, 637438, 635927, 635134, 634491, 633496, 632093, 631069, 631717, 634659, 639275, 644689, 650940, 658594, 667550, 677058, 686950, 698129, 711663, 727899, 746575, 767308, 789759, 813828, 839912]
50679H39912K8734L1575L4037L6215L8706M1859M5578M9610N3679N7648O1834
50668A319387O6746P2097P6583P9211Q0369Q0977Q1085Q0110P7952P4847P0365
$$ y = [839912, 868646, 900221, 934258, 970473, 1009179, 1051038, 1096616, 1146226, 1199905, 1257553, 1319387, 1386133, 1458230, 1534813, 1614024, 1694393, 1775370, 1856455, 1936565, 2014517, 2089364, 2159729]
$$ [...]
##END NTUPLES=NMR SPECTRUM
##END=
