
##TITLE=AC1149_Santander_5874516_JumfjW18IU
##JCAMPDX= 6.0         $$ Bruker NMR JCAMP-DX V2.0
##DATA TYPE= NMR SPECTRUM
##DATA CLASS= NTUPLES
##ORIGIN= BRUKER
##OWNER= Administrator
$$ 1.72 TOPSPIN		Version 2.1
$$ 2012-03-31 15:49:57.390 -0500  Administrator@TOPSPIN
$$ Compression mode = diff/dup
##.OBSERVE FREQUENCY= 400.13188235
##.OBSERVE NUCLEUS= ^1H
##.ACQUISITION MODE= SIMULTANEOUS (DQD)
##.ACQUISITION SCHEME= undefined
##.AVERAGES= 64
##.DIGITISER RES= 22
##SPECTROMETER/DATA SYSTEM= spect
##.PULSE SEQUENCE= noesygpps1d.comp
##.SOLVENT NAME= COFFEE_meoh
##.SHIFT REFERENCE= INTERNAL, COFFEE_meoh, 1, 14.96845
##AUDIT TRAIL= $$ (NUMBER, WHEN, WHO, WHERE, PROCESS, VERSION, WHAT)
$$ ##TITLE= Audit trail, TOPSPIN		Version 2.1
$$ ##JCAMPDX= 5.01
$$ ##ORIGIN= Bruker BioSpin GmbH
$$ ##OWNER= Administrator
$$ $$ C:\Bruker\TOPSPIN/data/COFFEE/nmr/AC1149_Santander_5874516_JumfjW18IU/12/pdata/1/auditp.txt
$$ ##AUDIT TRAIL=  $$ (NUMBER, WHEN, WHO, WHERE, PROCESS, VERSION, WHAT)
(   1,<2012-03-31 15:49:50.406 -0500>,<Administrator>,<TOPSPIN>,<go>,<TOPSPIN 2.1>,
      <created by zg
	started at 2012-03-31 15:38:18.718 -0500,
	POWCHK enabled, PULCHK disabled,
       configuration hash MD5:
       1A 1E CE 29 27 FD 77 03 67 4E F0 E3 C4 B2 CB 90
       data hash MD5: 64K
       0D 37 A7 61 BC 9E D7 0C 6E B7 51 DD 99 E9 8B 75>)
(   2,<2012-03-31 15:49:54.906 -0500>,<Administrator>,<TOPSPIN>,<proc1d>,<TOPSPIN 2.1>,
      <Start of raw data processing
       efp LB = 0.3 FT_mod = 6 PKNL = 1 PHC0 = 0 PHC1 = 0 SI = 128K 
       data hash MD5: 128K
       7F 69 B9 07 8A 68 09 97 44 B2 5F F4 6F 20 0A 7D>)
(   3,<2012-03-31 15:49:56.328 -0500>,<Administrator>,<TOPSPIN>,<proc1d>,<TOPSPIN 2.1>,
      <pk PHC0 = 38.96301 PHC1 = 0 
       data hash MD5: 128K
       27 46 90 81 4A B9 81 6A 93 CE 3C EB 0D C1 2B 17>)
(   4,<2012-03-31 15:49:56.906 -0500>,<Administrator>,<TOPSPIN>,<proc1d>,<TOPSPIN 2.1>,
      <abs ABSG = 1 
       data hash MD5: 128K
       15 B1 4C AF B9 67 FD 18 1F 22 A2 7F DA E1 9E B9>)
(   5,<2012-03-31 15:49:56.984 -0500>,<Administrator>,<TOPSPIN>,<proc1d>,<TOPSPIN 2.1>,
      <abs ABSG = 2 
       data hash MD5: 128K
       31 60 05 CA 1D 40 D6 B9 04 B3 21 CD 12 D3 D1 68>)
(   6,<2012-03-31 15:49:57.062 -0500>,<Administrator>,<TOPSPIN>,<proc1d>,<TOPSPIN 2.1>,
      <abs ABSG = 3 
       data hash MD5: 128K
       AD 60 E0 7B 8D 66 E8 E9 33 5E 30 C0 99 C5 B8 EB>)
(   7,<2012-03-31 15:49:57.140 -0500>,<Administrator>,<TOPSPIN>,<proc1d>,<TOPSPIN 2.1>,
      <abs ABSG = 4 
       data hash MD5: 128K
       CA 73 8F B3 50 62 51 A7 1C AF 7C 18 37 4A EF AD>)
(   8,<2012-03-31 15:49:57.203 -0500>,<Administrator>,<TOPSPIN>,<proc1d>,<TOPSPIN 2.1>,
      <abs ABSG = 5 
       data hash MD5: 128K
       99 F6 00 07 EA B8 7B BA 11 4A 49 27 21 95 F8 3E>)
$$ ##END=
$$ 
$$ $$ hash MD5
$$ $$ C0 4F AA 6F 86 0B A6 B0 72 2A 3C 45 6F EF A0 AE
##$RELAX= 
##$RELAX= 
##$RELAX= 
##$RELAX= 
##$RELAX= 
##$RELAX= 
##$RELAX= 
##$RELAX= 
$$ Bruker specific parameters
$$ [...]
##$TP07= 0
##$TPNAME0= <>
##$TPNAME1= <>
##$TPNAME2= <>
##$TPNAME3= <>
##$TPNAME4= <>
##$TPNAME5= <>
##$TPNAME6= <>
##$TPNAME7= <>
##$TPOAL= (0..7)
0.5 0.5 0.5 0.5 0.5 0.5 0.5 0.5
##$TPOFFS= (0..7)
0 0 0 0 0 0 0 0
##$TUNHIN= 0
##$TUNHOUT= 0
##$TUNXOUT= 0
##$USERA1= <user>
##$USERA2= <user>
##$USERA3= <user>
##$USERA4= <user>
##$USERA5= <user>
##$V9= 5
##$VALIST= <valist>
##$VCLIST= <CCCCCCCCCCCCCCC>
##$VD= 0
##$VDLIST= <DDDDDDDDDDDDDDD>
##$VPLIST= <PPPPPPPPPPPPPPP>
##$VTLIST= <TTTTTTTTTTTTTTT>
##$WBST= 2048
##$WBSW= 25
##$XGAIN= (0..3)
0 0 0 0
##$XL= 0
##$YL= 0
##$YMAX_a= 11089977
##$YMIN_a= -11120202
##$ZGOPTNS= <>
##$ZL1= 120
##$ZL2= 120
##$ZL3= 120
##$ZL4= 120
##$ABSF1= 14.96845
##$ABSF2= -5.584081
##$ABSG= 5
##$ABSL= 3
##$ALPHA= 0
##$AQORDER= 0
##$ASSFAC= 0
##$ASSFACI= 0
##$ASSFACX= 0
##$ASSWID= 0
##$AUNMP= <proc_prof1d_extract.lims>
##$AXLEFT= 0
##$AXNAME= <>
##$AXNUC= <1H>
##$AXRIGHT= 0
##$AXTYPE= 0
##$AXUNIT= <>
##$AZFE= 0.1
##$AZFW= 0.1
##$BCFW= 0
##$BC_mod= 0
##$BYTORDP= 0
##$COROFFS= 0
##$CY= 15
##$DATMOD= 1
##$DC= 0
##$DFILT= <>
##$DTYPP= 0
##$F1P= 0
##$F2P= 0
##$FCOR= 0.5
##$FTSIZE= 131072
##$FT_mod= 6
##$GAMMA= 0
##$GB= 0
##$INTBC= 1
##$INTSCL= 1
##$ISEN= 128
##$LB= 0.3
##$LEV0= 0
##$LPBIN= 0
##$MAXI= 10000
##$MC2= 0
##$MEAN= 0
##$ME_mod= 0
##$MI= 0
##$NCOEF= 0
##$NC_proc= -1
##$NLEV= 6
##$NOISF1= 0
##$NOISF2= 0
##$NSP= 0
##$NTH_PI= 0
##$NZP= 0
##$OFFSET= 14.96845
##$PC= 1
##$PHC0= 38.96301
##$PHC1= 0
##$PH_mod= 1
##$PKNL= yes
##$PPARMOD= 0
##$PPDIAG= 0
##$PPIPTYP= 0
##$PPMPNUM= 2147483647
##$PPRESOL= 1
##$PSCAL= 4
##$PSIGN= 0
##$PYNMP= <proc.py>
##$REVERSE= no
##$SF= 400.130004865056
##$SI= 131072
##$SIGF1= 0
##$SIGF2= 0
##$SINO= 400
##$SIOLD= 131072
##$SPECTYP= <>
##$SREGLST= <1H.CDCl3>
##$SSB= 0
##$STSI= 131072
##$STSR= 0
##$SW_p= 8223.68421052632
##$SYMM= 0
##$S_DEV= 0
##$TDeff= 65536
##$TDoff= 0
##$TI= <>
##$TILT= no
##$TM1= 0
##$TM2= 0
##$TOPLEV= 0
##$USERP1= <user>
##$USERP2= <user>
##$USERP3= <user>
##$USERP4= <user>
##$USERP5= <user>
##$WDW= 1
##$XDIM= 131072
##$YMAX_p= 122642068
##$YMIN_p= -473999827
##$CURPLOT= <Network HP LaserJet P1505>
##$CURPRIN= <$Network HP LaserJet P1505>
##$DFORMAT= <normdp>
##$LAYOUT= <+/1D_H.xwp>
##$LFORMAT= <normlp>
##$PFORMAT= <normpl>
##$SURQMSG= 1
$$ End of Bruker specific parameters
$$ ---------------------------------
##NTUPLES= NMR SPECTRUM
##VAR_NAME=  FREQUENCY,     SPECTRUM/REAL,   SPECTRUM/IMAG
##SYMBOL=    X,             R,               I
##VAR_TYPE=  INDEPENDENT,   DEPENDENT,       DEPENDENT
##VAR_FORM=  AFFN,          ASDF,            ASDF
##VAR_DIM=   131072,        131072,          131072
##UNITS=     HZ,            ARBITRARY UNITS, ARBITRARY UNITS
##FACTOR=    0.0627417313425165, 1,          1
##FIRST=     8223.62146879498, 558,          -16272
##LAST=      0,             894,             -16255
##MIN=       0,             -473999827,      0
##MAX=       8223.62146879498, 122642068,    0
$$ Real data points
##PAGE= N=1
##DATA TABLE= (X++(R..R)), XYDATA
$$ [...]
62262B96995q697q175p308o376n693n201m598l824l102k576k147j702j286r71
62248B35339p90p60q55r63j025j112j237j262j133j069j259j508j502j264j049
62233B18551q90o20k56L0L14Q51J556J955J823J563J687K239K852L228L329L291
62217B41503L327L640M273N090N920O663P218P520P686Q005Q643R460J0203J0782
62203C39933J1308J1925J2692J3562J4465J5363J6284J7227J8056J8514J8346
62192E07675J7408J5732J3523J1025Q326N401K325o78l489o183q795j1124j2962
62179E38184j4351j5457j6289j6782j6974j6943j6639j6022j5192j4201j2924
62168C66410j1359r865q790p983p065n999n079m382l683k896k220j749j374j072
$$ plain form
62262 296995 288298 280123 272815 266439 260746 255545 250947 247123 244021 241445 239298 237596 236310 235339
62248 235339 234549 233789 232934 231971 230946 229834 228597 227335 226202 225133 223874 222366 220864 219600 218551
62233 218551 217661 217041 216785 216815 217129 217980 219536 221491 223314 224877 226564 228803 231655 234883 238212 241503
62217 241503 244830 248470 252743 257833 263753 270416 277634 285154 292840 300845 309488 318948 329151 339933
62203 339933 351241 363166 375858 389420 403885 419248 435532 452759 470815 489329 507675
62192 507675 525083 540815 554338 565363 573689 579090 581415 580737 577248 571065 562270 551146 538184
62179 538184 523833 508376 492087 475305 458331 441388 424749 408727 393535 379334 366410
62168 366410 355051 345186 336396 328413 321348 315349 310270 305888 302205 299309 297089 295340 293966 292894
62154B92894r72j027r80p90p16q74r81p93m01qL71P69J100J343J639K053K423
62137B95050K653K911L376L965M487M920N359N826O274O654O868O847O741O798
62123C68729O981O964O648O386O465O678O690O549O574O889P449Q326R593J1037
62109D71958J2289J3235J3999J4617J5057J5422J5777J5839J5162J3683J1780
62098F28818R768P672N570L735K270Q84p29k518m193n578o606p216p445p513p598
62083F09321p599p315o760o156n665n296n049m907m742m424m060l899l918l758
62069E35773l142k277j568j105o24L8O94J103J343J747K478L343L991M313M518
62054E50625M891N488O161O834P601Q490R252R606R668R892J0499J1205J1667
$$ plain form
62154 292894 291922 290895 289915 289125 288409 287535 286554 285761 285360 285352 285723 286492 287592 288935 290574 292627 295050
62137 295050 297703 300614 303990 307955 312442 317362 322721 328547 334821 341475 348343 355190 361931 368729
62123 368729 375710 382674 389322 395708 402173 408851 415541 422090 428664 435553 443002 451328 460921 471958
62109 471958 484247 497482 511481 526098 541155 556577 572354 588193 603355 617038 628818
62098 628818 638586 646258 651828 655563 657833 658717 657988 655470 651277 645699 639093 631877 624432 616919 609321
62083 609321 601722 594407 587647 581491 575826 570530 565481 560574 555832 551408 547348 543449 539531 535773
62069 535773 532631 530354 528786 527681 527057 527095 527789 528892 530235 531982 534460 537803 541794 546107 550625
62054 550625 555516 561004 567165 573999 581600 590090 599342 608948 618616 628508 639007 650212 661879
62041F61879J1950J2379J3042J3760J4485J5398J6510J7475J7980J8214J8657
62030H31729J9488K0327K0658K0378J9850J9505J9491J9724K0123K0685K1309
62019A053267K1725K1703K1213K0401J9429J8490J7845J7669J7884J8221J8554
62008A266401J8994J9691K0583K1408K1921K2058K1931K1643K1153K0313J9077
61997A495173J7610J6159J4883J3828J2935J2015J0865R543Q408P728P383P094
61985A633624O848O816O962P045P047P287P966Q868R621J0082J0346J0549J0758
61972A743819J0958J0993J0698J0134R573R082Q374P252N984N014M353L613K598
61959A842445J568Q05J61p38j930l011l602l753l816l992m148m066l738l302k827
$$ plain form
62041 661879 673829 686208 699250 713010 727495 742893 759403 776878 794858 813072 831729
62030 831729 851217 871544 892202 912580 932430 951935 971426 991150 1011273 1031958 1053267
62019 1053267 1074992 1096695 1117908 1138309 1157738 1176228 1194073 1211742 1229626 1247847 1266401
62008 1266401 1285395 1305086 1325669 1347077 1368998 1391056 1412987 1434630 1455783 1476096 1495173
61997 1495173 1512783 1528942 1543825 1557653 1570588 1582603 1593468 1603011 1611419 1619147 1626530 1633624
61985 1633624 1640472 1647288 1654250 1661295 1668342 1675629 1683595 1692463 1702084 1712166 1722512 1733061 1743819
61972 1743819 1754777 1765770 1776468 1786602 1796175 1805257 1813631 1820883 1826867 1831881 1836234 1839847 1842445
61959 1842445 1844013 1844818 1844979 1844241 1842311 1839300 1835698 1831945 1828129 1824137 1819989 1815923 1812185 1808883 1806056
61944A806056k328j930j798j824j581p88K51R01R06O85P85J230J572J526J286
61929A804949J116R23M95k5k51j47j51n73j168j541j711j970k380k763l123l727
61913A787953m683n762o679p387q025q747r613j0527j1270j1766j2242j2902j3523
61900A664827j3720j3573j3621j4078j4505j4440j4045j3788j3740j3539j2965
61889A512813j2174j1430j0819j0287r772r257q770q279p596o512n124l838k867
61876A406088j928o73P67J916K646L376M535O089P715R241J0770J2423J4191J6034
61862A493190J8021K0296K2852K5474K7992L0620L3861L8012M2858M8024N3526
61851A854726N9764O7047P5275Q4234R3943J04649J16453J29155J42462J56288
$$ plain form
61944 1806056 1803728 1801798 1800000 1798176 1796595 1795807 1796058 1796959 1797865 1798550 1799335 1800565 1802137 1803663 1804949
61929 1804949 1806065 1806988 1807483 1807458 1807207 1807060 1806909 1806336 1805168 1803627 1801916 1799946 1797566 1794803 1791680 1787953
61913 1787953 1783270 1777508 1770829 1763442 1755417 1746670 1737057 1726530 1715260 1703494 1691252 1678350 1664827
61900 1664827 1651107 1637534 1623913 1609835 1595330 1580890 1566845 1553057 1539317 1525778 1512813
61889 1512813 1500639 1489209 1478390 1468103 1458331 1449074 1440304 1432025 1424429 1417917 1412793 1408955 1406088
61876 1406088 1404160 1403487 1404254 1406170 1408816 1412192 1416727 1422816 1430531 1439772 1450542 1462965 1477156 1493190
61862 1493190 1511211 1531507 1554359 1579833 1607825 1638445 1672306 1710318 1753176 1801200 1854726
61851 1854726 1914490 1981537 2056812 2141046 2234989 2339638 2456091 2585246 2727708 2883996
61841B883996J70687J85460J99992K13415K24790K32847K35630K30646K15545
61832D793008J88747J49850J00054M2569j7731p5657j27099j69597k02068k24474
61822D457602k37638k42940k41927k36070k26753k15232k02479j89098j75414
61813B490051j61696j48347j35867j24538j14195j04460r5242q6780p9198p2246
61803A367482o5655n9515n4052m9256m4931m0975l7363l4063l1176k8919k7215
61792H94362k5454k3153k0636j8645j7273j5894j4138j2400j1141j0201r146p943
61780G08338o871o038n329m715m215l664k873j936j155o86m37k77o9L96J150J827
61764F73446J981J718J681K291L323M298N069N765O456P116P841Q784R910J1002
$$ plain form
61841 2883996 3054683 3240143 3440135 3653550 3878340 4111187 4346817 4577463 4793008
61832 4793008 4981755 5131605 5231659 5274228 5256497 5180840 5053741 4884144 4682076 4457602
61822 4457602 4219964 3977024 3735097 3499027 3272274 3057042 2854563 2665465 2490051
61813 2490051 2328355 2180008 2044141 1919603 1805408 1700948 1605706 1518926 1439728 1367482
61803 1367482 1301827 1242312 1188260 1139004 1094073 1053098 1015735 981672 950496 921577 894362
61792 894362 868908 845755 825119 806474 789201 773307 759169 746769 735628 725427 716281 708338
61780 708338 701467 695429 690100 685385 681170 677506 674633 672697 671542 670856 670419 670142 670073 670469 671619 673446
61764 673446 675427 677145 678826 681117 684440 688738 693807 699572 706028 713144 720985 729769 739679 750681
61750G50681J1971J2961J4149J5562J7157J8940K0946K3139K5378K7486K9364
61739I67734L1136L3132L5630L8613M1824M5093M8467N2037N5761N9587O3702
61728A472716O8508P4299Q1022Q8349R6013J04074J12893J22882J34286J47199
61718B502241J61664J77729J95365K14506K35138K57281K80793L05256L30099
61709D660072L54790L78750M00984M19643M31903M34198M22654L93571L44132
61700H240697K73496J83962Q1283k6345j30180k22659k98606l55802l94803m17833
61690F933210m27464m26052m15962l99674l79374l56605l32465l07914k83796
61681C603904k60728k39117k19069k00286j82389j65503j50187j36658j24458
$$ plain form
61750 750681 762652 775613 789762 805324 822481 841421 862367 885506 910884 938370 967734
61739 967734 998870 1032002 1067632 1106245 1148069 1193162 1241629 1293666 1349427 1409014 1472716
61728 1472716 1541224 1615523 1696545 1784894 1880907 1984981 2097874 2220756 2355042 2502241
61718 2502241 2663905 2841634 3036999 3251505 3486643 3743924 4024717 4329973 4660072
61709 4660072 5014862 5393612 5794596 6214239 6646142 7080340 7502994 7896565 8240697
61700 8240697 8514193 8698155 8779438 8753093 8622913 8400254 8101648 7745846 7351043 6933210
61690 6933210 6505746 6079694 5663732 5264058 4884684 4528079 4195614 3887700 3603904
61681 3603904 3343176 3104059 2884990 2684704 2502315 2336812 2186625 2049967 1925509
61672A925509j13167j03005r4293q6662p9377p2291o5846o0202n4996n0046m5716
61661A099908m2340l9693l7250l4678l1880k8944k6172k3938k2260k0746j9118
61650G72889j7541j6277j5280j4303j3281j2356j1700j1384j1322j1236j0914
61639F27295j0491j0282j0289j0162r783r496r599r859r858r571r284r150r039
61626E00432q841q591q361q144p846p340o649o054n832n807n451m563l580l018
61612D10355k851k639k092j314o39m44q31j408j563j205r03j110j540j687j599
61597C88530j695j975k011j630j171r71j004j110j263j485j732j958k122k075
61583C66328j652r09j78J87O7l49o78o46l51j22k3K08O70J011R52P74R14J292
$$ plain form
61672 1925509 1812342 1709337 1615044 1528382 1449005 1376714 1310868 1250666 1195670 1145624 1099908
61661 1099908 1057568 1017875 980625 945947 914067 885123 858951 835013 812753 792007 772889
61650 772889 755348 739071 723791 709488 696207 683851 672151 660767 649445 638209 627295
61639 627295 616804 606522 596233 586071 576288 566792 557193 547334 537476 527905 518621 509471 500432
61626 500432 491591 483000 474639 466495 458649 451309 444660 438606 432774 426967 421516 416953 413373 410355
61612 410355 407504 404865 402773 401459 400820 400376 399545 398137 396574 395369 394466 393356 391816 390129 388530
61597 388530 386835 384860 382849 381219 380048 379077 378073 376963 375700 374215 372483 370525 368403 366328
61583 366328 364676 363767 363589 363776 363843 363494 362816 362170 361819 361697 361674 361882 362552 363563 364515 365289 366203 367495
61565C67495J484J403J353J451J509J452J460J553J511J312J263J505J722J530
61551C88003R11J43n27r42j055j026j109j328j465j437j458j698j979k016j796
61536C71221j579j621j965k369k438j932j072l60n6P1M00J033J780K385K705K795
61520C68998K923L364M135N019N871O713P550Q258Q771R225R802J0575J1501J2474
61506D75179J3320J3854J4050J4006J3843J3670J3626J3696J3533J2781J1595
61495F23153J0575J0072R826R410Q734P937P032N931M659L324J985P18l19j074
61481G01963j765k617l525m182m491m637m744m650m178l440k777k386k095j484
61467F54992k64J408L029M175M934N905P656J0110J2546J4355J5704J7335J9712
$$ plain form
61565 367495 368979 370382 371735 373186 374695 376147 377607 379160 380671 381983 383246 384751 386473 388003
61551 388003 388914 389057 388530 387588 386533 385507 384398 383070 381605 380168 378710 377012 375033 373017 371221
61536 371221 369642 368021 366056 363687 361249 359317 358245 357885 357829 357900 358300 359333 361113 363498 366203 368998
61520 368998 371921 375285 379420 384439 390310 397023 404573 412831 421602 430827 440629 451204 462705 475179
61506 475179 488499 502353 516403 530409 544252 557922 571548 585244 598777 611558 623153
61495 623153 633728 643800 653626 663036 671770 679707 686739 692670 697329 700653 702638 703356 703037 701963
61481 701963 700198 697581 694056 689874 685383 680746 676002 671352 667174 663734 660957 658571 656476 654992
61467 654992 654728 656136 659165 663340 668274 674179 681835 691945 704491 718846 734550 751885 771597
61454G71597K2617K5627K8674L1944L5465L9141M3056M7412N2177N7080O1980
61443A216770O6992P2162P7215Q1726Q5419Q8207Q9941R0070Q7583Q1495P1636
61432B109216N8880M4429K9073J3285k211j6469k8884l9352m7821n4130n8351
61421B007665o0874o1978o1567n9564n6314n2417m8303m4111l9811l5316l0600
61410A456810k5771k0957j6159j1386o881k956M27L619O838J0024J3128J6146
61398A422882J8823K0698K1624K1972K2194K2414K2594K2701K2564K1903K0729
61387A661098J9501J8642J8121J7696J7281J6866J6357J5729J5194J4904J4653
61376A846042J4068J2932J1252R195P158N535M276K883J070q94k674m374o213
$$ plain form
61454 771597 794214 819841 848515 880459 915924 955065 998121 1045533 1097710 1154790 1216770
61443 1216770 1283762 1355924 1433139 1514865 1600284 1688491 1778432 1868502 1956085 2037580 2109216
61432 2109216 2168096 2212525 2241598 2254883 2252672 2236203 2207319 2167967 2120146 2066016 2007665
61421 2007665 1946791 1884813 1823246 1763682 1707368 1654951 1606648 1562537 1522726 1487410 1456810
61410 1456810 1431039 1410082 1393923 1382537 1375656 1372700 1373127 1376746 1383584 1393608 1406736 1422882
61398 1422882 1441705 1462403 1484027 1505999 1528193 1550607 1573201 1595902 1618466 1640369 1661098
61387 1661098 1680599 1699241 1717362 1735058 1752339 1769205 1785562 1801291 1816485 1831389 1846042
61376 1846042 1860110 1873042 1884294 1893489 1900647 1906182 1910458 1913341 1914411 1913517 1910843 1906469 1900256
61363A900256q055r609j0792j1569j1674j1004j0037r371q984q399p505o646n936
61350A780675n045l804k558j740j415j480j951k821l843m710n317n714n890n708
61336A728679n044l846k096K44L279P095J1581J6379K1164K5999L1273L7289M3968
61323A915964N0951N7911O4729P1438P7957Q3958Q9062R3063R5802R6831R5469
61312B793135R1218Q3925P3449N9682M3172K5369P871q459k3470l7090m9208n9905
61300B999689o9318p7356q3841q8918r2809r5337r6097r5137r2998r0080q6424
61289B031374q2154p7603p2852o7648o2024n6581n1785m7365m2730l7700l2477
61278A400455k7210k2034j7324j3402r985o393k351J682N133P914J0278J2354
$$ plain form
61363 1900256 1892201 1882592 1871800 1860231 1848557 1837553 1827516 1818145 1809161 1800762 1793257 1786611 1780675
61350 1780675 1775630 1771826 1769268 1767528 1766113 1764633 1762682 1759861 1756018 1751308 1745991 1740277 1734387 1728679
61336 1728679 1723635 1719789 1717693 1717937 1721216 1728311 1739892 1756271 1777435 1803434 1834707 1871996 1915964
61323 1915964 1966915 2024826 2089555 2160993 2238950 2322908 2411970 2505033 2600835 2697666 2793135
61312 2793135 2884353 2968278 3041727 3101409 3144581 3169950 3177821 3169362 3145892 3108802 3059594 2999689
61300 2999689 2930371 2853015 2769174 2680256 2587447 2492110 2396013 2300876 2207878 2117798 2031374
61289 2031374 1949220 1871617 1798765 1731117 1669093 1612512 1560727 1513362 1470632 1432932 1400455
61278 1400455 1373245 1351211 1333887 1320485 1310500 1304107 1301756 1303438 1308571 1316485 1326763 1339117
61266A339117J4093J5513J6742J7817J8590J8922J8806J8306J7447J6257J4834
61255A526444J3286J1688J0121Q724P538O381N010L445J965P38l68j598l081m875
61241A585418p034r439j1721j3571j5030j6322j7504j8477j9275k0034k0683k0951
61229A395377k0716k0165j9527j8823j7962j6894j5599j4054j2316j0603r139
61218A219579p976p040o279n805n769o146o584o679o445o381o869p578p707o803
61204A125518n155l349j626J16J992L942N895P895J0065J2506J5259J8275K1442
61191A212775K4651K7892L1209L4530L7539L9798M1022M1180M0268L8042L4067
61180A602973K8054K0021J0220q95j2528k3618l3288m1180m7308n1683n4293n5302
$$ plain form
61266 1339117 1353210 1368723 1385465 1403282 1421872 1440794 1459600 1477906 1495353 1511610 1526444
61255 1526444 1539730 1551418 1561539 1570263 1577801 1584182 1589192 1592637 1594602 1595340 1594972 1593374 1590293 1585418
61241 1585418 1578384 1568945 1557224 1543653 1528623 1512301 1494797 1476320 1457045 1437011 1416328 1395377
61229 1395377 1374661 1354496 1334969 1316146 1298184 1281290 1265691 1251637 1239321 1228718 1219579
61218 1219579 1211603 1204563 1198284 1192479 1186710 1180564 1173980 1167301 1160856 1154475 1147606 1140028 1132321 1125518
61204 1125518 1120363 1117014 1115388 1115504 1117496 1121438 1127333 1135228 1145293 1157799 1173058 1191333 1212775
61191 1212775 1237426 1265318 1296527 1331057 1368596 1408394 1449416 1490596 1530864 1568906 1602973
61180 1602973 1631027 1651048 1661268 1660373 1647845 1624227 1590939 1549759 1502451 1450768 1396475 1341173
61168A341173n5075n3954n2163m9898m7341m4583m1629l8524l5394l2368k9503
61157H60741k6771k4071k1365j8811j6717j5163j3836j2333j0605q894p319n764
61145F79092m173k710j535n41N41J815L109M142M763N041N130N095M863M375L661
61130G12668K762J686N19m98j190j711k429l532m802n810o331o526o769p208p617
61115F63212p728p633p709q060q326q171p741p517p811q590r621j0600j1222j1391
61101E41092j1331j1353j1484j1495j1227j0754j0271r920r716r502r057q357
61089D16625p669p301p315p579p947q248q259p915p418o940o346n473m526l919
61075C19770l696l485l047k545k167j776j138l10M28R57J414J903K273K321K117
$$ plain form
61168 1341173 1286098 1232144 1179981 1130083 1082742 1038159 996530 958006 922612 890244 860741
61157 860741 833970 809899 788534 769723 753006 737843 724007 711674 701069 692175 684856 679092
61145 679092 674919 672209 670674 670133 670674 672489 675598 679740 684503 689544 694674 699769 704632 709007 712668
61130 712668 715430 717116 717635 717137 715947 714236 711807 708275 703473 697663 691332 684806 678037 670829 663212
61115 663212 655484 647851 640142 632082 623756 615585 607844 600327 592516 583926 574305 563705 552483 541092
61101 541092 529761 518408 506924 495429 484202 473448 463177 453257 443541 434039 424982 416625
61089 416625 408956 401655 394340 386761 378814 370566 362307 354392 346974 340034 333688 328215 323689 319770
61075 319770 316074 312589 309542 306997 304830 303054 301916 301606 302034 302991 304405 306308 308581 310902 313019
61060C13019J992K144K419K593K757L156L717M066M048L954M038M204M300M445
61046C60852M702M766M316L543K903K486J970J209M69J4j98l46m72m81l27j13
61030C85293j07n26j215j716j816j845k176k652k825k633k462k569k798k898k805
61015C54250k600k444k510k757k827k448j861j557j641j772j712j519j288j052
61001C26262r52j132j408j422j122p98n69k78J23M48O18P56Q37P01N21P79J548
60984C24912K276K505K460K543K712K740K798L267M066M683M855M868N131N727
60970C75543O474P163P668P959Q169Q536R176R957J0666J1293J2025J2905J3673
60957E01207J4065J4229J4612J5431J6477J7527J8676K0103K1713K3283K4818
$$ plain form
61060 313019 315011 317155 319574 322167 324924 328080 331797 335863 339911 343865 347903 352107 356407 360852
61046 360852 365554 370320 374636 378179 381082 383568 385538 386747 387216 387230 387032 386686 386214 385733 385406 385293
61030 385293 385186 384660 383445 381729 379913 378068 375892 373240 370415 367782 365320 362751 359953 357055 354250
61015 354250 351650 349206 346696 343939 341112 338664 336803 335246 333605 331833 330121 328602 327314 326262
61001 326262 325310 324178 322770 321348 320226 319428 318859 318581 318704 319152 319770 320526 321363 322064 322585 323364 324912
60984 324912 327188 329693 332153 334696 337408 340148 342946 346213 350279 354962 359817 364685 369816 375543
60970 375543 382017 389180 396848 404807 412976 421512 430688 440645 451311 462604 474629 487534 501207
60957 501207 515272 529501 544113 559544 576021 593548 612224 632327 654040 677323 702141
60946G02141K6560K8694L1251L4096L6946L9539M1929M4436M7173M9947N2813
60935A135525N6352O1071O6851P3342Q0529Q8528R7130J06096J15730J26804J40166
60924B148124J56767J77544K02721K31542K63130K97208L33750L73066M17073
60915D600925M69394N32716O06699O88782P72969Q42110Q62755P98360O38790
60906A0813500M19001K03455M7438k9161l6766L019O3735J07103Q6324k8691k24852
60895A1424105m48168o36842p55558q03429p98133p58716p00186o34536n70091
60886E318446n10249m55353m05606l61192l21108k84016k50028k20252j94871
60877B315771j72932j53756j37324j23430j11536j01427r3091q5967p9215p2643
$$ plain form
60946 702141 728701 757395 788646 822742 859688 899227 941156 985592 1032765 1082712 1135525
60935 1135525 1191877 1252948 1319799 1393141 1473670 1562198 1659328 1765424 1881154 2007958 2148124
60924 2148124 2304891 2482435 2685156 2916698 3179828 3477036 3810786 4183852 4600925
60915 4600925 5070319 5603035 6209734 6898516 7671485 8513595 9376350 10174710 10813500
60906 10813500 11232501 11435956 11483394 11454233 11417467 11420486 11484221 11591324 11677648 11648957 11424105
60895 11424105 10975937 10339095 9583537 8780108 7981975 7223259 6523073 5888537 5318446
60886 5318446 4808197 4352844 3947238 3586046 3264938 2980922 2730894 2510642 2315771
60877 2315771 2142839 1989083 1851759 1728329 1616793 1515366 1422275 1336308 1257093 1184450
60867A184450o6603o1119n5923n1229m7555m4841m2480m0276l8492l7031l5338
60856F63563l3181l0830k8384k5714k3084k1044j9604j8203j6606j5148j3958
60845D17807j2730j1430j0570j0363j0287r762q861p995p348o876o514o130n591
60832C03350m972m503m193l839l397k986k608k160j738j480j201o60l4L08M50
60817B70337P40J077R84M40n5k69m08m43m1O58R69O27J69J9j04n41j050j277j333
60798B70499j426j412j150r09r92j256j349j131n87K63J067J258Q58O97J338K281
60782B68049K718K672K754L088L214K957K685K690K790K761K695K823L176L544
60768C08616L626L266K673K309K384K590K531K265K156K279K370K252K003J706
$$ plain form
60867 1184450 1117847 1056728 1000805 949576 902021 857180 814700 774424 735932 698901 663563
60856 663563 630382 599552 571168 545454 522370 501326 481722 463519 446913 431765 417807
60845 417807 405077 393647 383077 372714 362427 352665 343804 335809 328461 321585 315071 308941 303350
60832 303350 298378 293875 289682 285843 282446 279460 276852 274692 272954 271474 270273 269613 269579 269887 270337
60817 270337 271077 272154 273138 273578 273523 273254 272846 272403 272362 273020 273989 274616 274785 274804 274700 274159 273109 271832 270499
60798 270499 269073 267661 266511 265602 264610 263354 262005 260874 260287 260550 261617 262875 263733 264430 265768 268049
60782 268049 270767 273439 276193 279281 282495 285452 288137 290827 293617 296378 299073 301896 305072 308616
60768 308616 312242 315508 318181 320490 322874 325464 327995 330260 332416 334695 337065 339317 341320 343026
60754C43026J313Q83O72P81Q77M85m59j483k074k239k365k629k765k589k415k725
60738C26294l483m196m549m655m658m480m074l611l270l037k810k469j873j043
60724B78086l46j51k91k52J25M89O93J050J736K365K582K618K899L429L987M566
60708C03585N245N791N920N746N564N276M573L597K972L043L458L663L503L192
60694C65128K898K568K134J705J499J615J879J986J834J583J434J403J365J177
60680C90208P28M6o01q73p35n77p59j236j696k009k345k852l406l710l656l467
60664C63060l467l690l819l575l029k411j828j322j046j056j073q21m41k85l58
60649C34839l72l35n55j010j243j025p03o86r46j244j478j599j501j235j048r90
$$ plain form
60754 343026 344339 345222 345894 346675 347552 348037 347578 346095 344021 341782 339417 336788 334023 331434 329019 326294
60738 326294 322811 318615 314066 309411 304753 300273 296199 292588 289318 286281 283471 281002 279129 278086
60724 278086 277740 277589 277298 277046 277171 277660 278353 279403 281139 283504 286086 288704 291603 295032 299019 303585
60708 303585 308830 314621 320541 326287 331851 337127 341700 345297 348269 351312 354770 358433 361936 365128
60694 365128 368026 370594 372728 374433 375932 377547 379426 381412 383246 384829 386263 387666 389031 390208
60680 390208 390936 390982 390381 389508 388773 388196 387437 386201 384505 382496 380151 377299 373893 370183 366527 363060
60664 363060 359593 355903 352084 348509 345480 343069 341241 339919 338873 337817 336744 335923 335482 335197 334839
60649 334839 334467 334132 333577 332567 331324 330299 329596 328910 327964 326720 325242 323643 322142 320907 319859 318869
60633C18869p82k69L09O79Q86J029J011P70M75K55n0n62j134j648k224k913l495
60616C11206l854m217m681m890m581m100l903l878l605l050k515k064j561j117
60602B63190r98j115j084p75m09j15J66L61K85M0L4M18Q72R96P21K82oJ06N74
60583B63543R59Q01J60m40o39n87o03p00n87n7P18J289J364J154J178J670K371
60566B71594K982L538M101M420M298M035M137M593M972N143N504O348P362P991
60552C41018Q034P754P533P506P470P102O295N282M320L371K233Q64o00k068l457
60537D02657m591n310n702n956o087o019n847n696n405m659l512k479j961j861
60523C37572j810j599j286r99p77n70l38j90l13p00j059j124r32o76l90k1L31
$$ plain form
60633 318869 318087 317818 318127 318806 319692 320721 321732 322502 322977 323232 323182 322620 321486 319838 317614 314701 311206
60616 311206 307352 303135 298454 293564 288983 284883 280980 277102 273497 270447 267932 265868 264307 263190
60602 263190 262192 261077 259993 259218 258809 258694 258860 259221 259506 259546 259580 259998 260870 261866 262587 262869 262863 262969 263543
60583 263543 264502 265303 265463 265023 264384 263797 263194 262494 261907 261850 262568 263857 265221 266375 267553 269223 271594
60566 271594 274576 278114 282215 286635 290933 294968 299105 303698 308670 313813 319317 325665 333027 341018
60552 341018 349052 356806 364339 371845 379315 386417 392712 397994 402314 405685 407918 408782 408182 406114 402657
60537 402657 398066 392756 387054 381098 375011 368992 363145 357449 352044 347385 343873 341394 339433 337572
60523 337572 335762 334163 332877 331878 331101 330531 330193 330003 329690 328990 327931 326807 325875 325199 324809 324788 325119
60506C25119N07N62O87R51J306J809K471L014L105K874K857L348M067M613M938
60491C62228N202N457N619N715N912O361P090Q000Q860R457R800J0206J1027J2330
60477D73264J3817J5072J5817J5928J5227J3443J0523O885L155l44l616o534q639
60464E63998r608r617r096q286p255o072m754l157j230Q08K645M174N418O388
60450E24356P199Q109R202J0290J1283J2438J3938J5627J7444J9777K2894K6374
60438F98931K9670L3025L7139M2133M7489N3017N9059O5614P1968P7574Q2763
60427A298382Q8255R4318J00693J06923J12286J15557J15078J09041R5926P5208
60417B311667M8004J6705j6136m8308p7430j00845j16805j25520j28545j27271
$$ plain form
60506 325119 325626 326188 326875 327826 329132 330941 333412 336426 339531 342405 345262 348610 352677 357290 362228
60491 362228 367430 372887 378506 384221 390133 396494 403584 411584 420444 429901 439701 449907 460934 473264
60477 473264 487081 502153 517970 533898 549125 562568 573091 579976 583131 582787 579171 572637 563998
60464 563998 554390 544773 535677 527391 520136 514064 509310 506153 504923 505731 508376 512550 517968 524356
60450 524356 531555 539664 548866 559156 570439 582877 596815 612442 629886 649663 672557 698931
60438 698931 728601 761626 798765 840898 888387 941404 1000463 1066077 1138045 1215619 1298382
60427 1298382 1386637 1480955 1581648 1688571 1800857 1916414 2031492 2140533 2236459 2311667
60417 2311667 2359671 2376376 2360240 2311932 2234502 2133657 2016852 1891332 1762787 1635516
60407A635516j22453j14943j06144r7390q9249q1636p4371o7479o1037n5033m9414
60396G16367m4195l9481l5339l1716k8476k5537k2883k0499j8330j6399j4783
60385D18729j3534j2588j1800j1031j0248r565r103q753q206p341o425n811n532
60372B98792n380n255n163m978m520l872l305k919k562k154j833j671j534j318
60358B52328j149j144j171r69m73P1L35K49J18L47R33J416J422J109Q92Q79R35
60341B56128J068J430J904K115J941J689J669J888K187K446K538K339J922J533
60327B82797J278J051Q12O77P00P48P27O69N46K37k62p73j178j476j613j475j136
60310B82329q46p25o51n18l46j43J10K97K94K70N44J059J397J401J413J742K250
$$ plain form
60407 1635516 1513063 1398120 1291976 1194586 1105337 1023701 949330 881851 820814 765781 716367
60396 716367 672172 632691 597352 565636 537160 511623 488740 468241 449911 433512 418729
60385 418729 405195 392607 380807 369776 359528 349963 340860 332107 323901 316560 310135 304324 298792
60372 298792 293412 288157 282994 278016 273496 269624 266319 263400 260838 258684 256851 255180 253646 252328
60358 252328 251179 250035 248864 247895 247422 247493 247828 248077 248195 248542 249475 250891 252313 253422 254314 255193 256128
60341 256128 257196 258626 260530 262645 264586 266275 267944 269832 272019 274465 277003 279342 281264 282797
60327 282797 284075 285126 285938 286615 287315 288063 288790 289459 290005 290242 289980 289207 288029 286553 284940 283465 282329
60310 282329 281483 280758 280107 279589 279243 279100 279210 279507 279801 280071 280615 281674 283071 284472 285885 287627 289877
60293B89877K689L064L396L485L203K807K694K943L327L554L401K806K052J563
60279C30861J363J030M24O3M27J158J395Q40O4j85L06J163J814J935J677J496
60263C45831J625J846J819J484R70L45l48r59j401j753k035k087j881j722j820
60248C39914j895j575j008o79p02p36o21o07q60j114j031o73l41j61LK58N14O11
60230C29297N32M51N70Q79J215J505J836K234K545K671K784L075L427L559L458
60215C60038L387L471L568L536L507L685M095M578M970N229N432N766O405P390
60201D25057Q573R738J0690J1324J1709J2117J2892J4192J5884J7697J9393K0866
60189E90132K2168K3554K5387K7845L0697L3459L5873L8075M0306M2525M4460
$$ plain form
60293 289877 292566 295630 299026 302511 305714 308521 311215 314158 317485 321039 324440 327246 329298 330861
60279 330861 332224 333254 333678 333741 334168 335326 336721 337561 337625 337440 337746 338909 340723 342658 344335 345831
60263 345831 347456 349302 351121 352605 353575 353920 353572 352613 351212 349459 347424 345337 343456 341734 339914
60248 339914 338019 336444 335436 334757 334055 333319 332698 332091 331231 330117 329086 328413 328072 327911 327914 328172 328686 329297
60230 329297 329829 330280 330850 331729 332944 334449 336285 338519 341064 343735 346519 349594 353021 356580 360038
60215 360038 363425 366896 370464 374000 377507 381192 385287 389865 394835 400064 405496 411262 417667 425057
60201 425057 433630 443368 454058 465382 477091 489208 502100 516292 532176 549873 569266 590132
60189 590132 612300 635854 661241 689086 719783 753242 789115 827190 867496 910021 954481
60178I54481M5973M7143M7930M8044M7207M5447M2965L9887L6272L2224K7828
60167A415401K3084J8097J3192Q627M336J63l736o996r436j1107j1971j1848j0737
60154A417069q893o577l925j039K038N433R273J3403J7535K1650K5916L0224L4168
60141A556275L7598M0724M3539M5529M6162M5404M3443M0264L5820L0438K4630
60130A989826J8618J2293N644j032p396j3353j8958k4104k8418l1511l3275l3856
60118A834478l3301l1482k8481k4788k0832j6504j1517o067p38M232R134J4176
60106A688310J9097K3473K7040K9574L0865L0927K9951K8004K5066K1438J7642
60095A971387J3859R888N793K106p32k665l581l133j298J402M585Q461J3304J8901
$$ plain form
60178 954481 1000454 1047597 1095527 1143571 1190778 1236225 1279190 1319077 1355349 1387573 1415401
60167 1415401 1438485 1456582 1469774 1478401 1482737 1482900 1479164 1472168 1462732 1451625 1439654 1427806 1417069
60154 1417069 1408176 1401599 1397674 1396635 1398673 1404106 1413379 1426782 1444317 1465967 1491883 1522107 1556275
60141 1556275 1593873 1634597 1678136 1723665 1769827 1815231 1858674 1898938 1934758 1965196 1989826
60130 1989826 2008444 2020737 2026381 2025349 2017953 2004600 1985642 1961538 1933120 1901609 1868334 1834478
60118 1834478 1801177 1769695 1741214 1716426 1695594 1679090 1667573 1661506 1660768 1665000 1674134 1688310
60106 1688310 1707407 1730880 1757920 1787494 1818359 1849286 1879237 1907241 1932307 1953745 1971387
60095 1971387 1985246 1995134 2000927 2003033 2002301 1999636 1996055 1992922 1991624 1993026 1997611 2006072 2019376 2038277
60081B038277K4930L1458L8621M6182N3807O1574O9785P8553Q7834R7491J07121
60070B735633J16162J24512J32503J39987J45986J49775J51655J52015J50201
60061C998429J45157J36856J26192J13699R9241Q2823O4866M5621K5106L722j7722
60050D823990l8694n8953p7865r4332j07615j17668j24519j27924j27869j24863
60040C823688j19509j12123j03001r2616q1356o9389n6978m4527l2308k0426r154
60029C082301J112J0215J8082K4216K7894K9005K8110K5517K0974J4549P177j42
60017C289010p232j4376k1495k8200l4363m0111m5415n0112n4230n7908o1083
60006B874485o3554o5246o6131o6036o4815o2592n9570n5675n0774m5095l9110
$$ plain form
60081 2038277 2063207 2094665 2133286 2179468 2233275 2294849 2364634 2443187 2531021 2628512 2735633
60070 2735633 2851795 2976307 3108810 3248797 3394783 3544558 3696213 3848228 3998429
60061 3998429 4143586 4280442 4406634 4520333 4619574 4702397 4767263 4812884 4837990 4841712 4823990
60050 4823990 4785296 4726343 4648478 4554146 4446531 4328863 4204344 4076420 3948551 3823688
60040 3823688 3704179 3592056 3489055 3396439 3315083 3245694 3188716 3144189 3111881 3091455 3082301
60029 3082301 3083413 3093628 3111710 3135926 3163820 3192825 3220935 3246452 3267426 3281975 3289152 3289010
60017 3289010 3281778 3267402 3245907 3217707 3183344 3143233 3097818 3047706 2993476 2935568 2874485
60006 2874485 2810931 2745685 2679554 2613518 2548703 2486111 2426541 2370866 2320092 2274997 2235887
59995B235887l2992k6533j9624j2520n513J353Q131J4782K1213K7367L3104L8106
59983B282761M2052M4775M6130M5853M3768M0109L5363K9730K2966J4947O177
59972B654631k536j0879j9135k7488l5494m2383m7661n1315n3576n4685n4665
59961B254814n3268n0255m5856m0753l5425k9770k3567j7019j0554m258K137Q800
59949A955026J5647K2546K9423L6150M2613M8788N4582N9657O3649O6416O7835
59938B462332O7508O5028O0468N4234M6608L7744K8095J8318Q690j030j1018k0945
59926B816032l0198l8281m4912m9910n3157n4528n3908n1424m7556m2799l7280
59915B312079l0966k4113j7171j0294l266M052J1477J8665K5257L0907L5535L9472
$$ plain form
59995 2235887 2202895 2176362 2156738 2144218 2138705 2140058 2148189 2162971 2184184 2211551 2244655 2282761
59983 2282761 2324813 2369588 2415718 2461571 2505339 2545448 2580811 2610541 2633507 2648454 2654631
59972 2654631 2652095 2641216 2622081 2594593 2559099 2516716 2469055 2417740 2364164 2309479 2254814
59961 2254814 2201546 2151291 2105435 2064682 2029257 1999487 1975920 1958901 1948347 1944089 1946226 1955026
59949 1955026 1970673 1993219 2022642 2058792 2101405 2150193 2204775 2264432 2328081 2394497 2462332
59938 2462332 2529840 2594868 2655336 2709570 2756178 2793922 2822017 2840335 2849025 2847995 2836977 2816032
59926 2816032 2785834 2747553 2702641 2652731 2599574 2545046 2491138 2439714 2392158 2349359 2312079
59915 2312079 2281113 2257000 2239829 2229535 2226269 2230321 2241798 2260463 2285720 2316627 2352162 2391634
59903B391634M3014M5857M7395M7540M6778M5399M3192M0054L6414L2820K9478
59892B849575K6410K3733K1562J9920J9012J9292K1001K3939K7874L2968L9545
59881C124831M7607N6869O7059P7978Q9386J01025J12647J23909J34258J43024
59871D078593J49502J52976J52757J48293J39085J24627J04714P9847N1179K0067
59861E201640j2018m3303p1929r6579j16689j32031j42500j48377j50344j48955
59851D138915j44429j37141j27904j17477j06072r3659q0544o7306n4345m1698
59841C168340k9244j6875m599P312J8389K8314L7019M4434N0249N4079N5578N4304
59829C467300M9810M2012L1263J7916K171j5405l3595n1155o7474q2323r5116
$$ plain form
59903 2391634 2434648 2480505 2527900 2575440 2622218 2667617 2710809 2750863 2787277 2820097 2849575
59892 2849575 2875985 2899718 2921280 2941200 2960212 2979504 3000505 3024444 3052318 3085286 3124831
59881 3124831 3172438 3229307 3296366 3374344 3463730 3564755 3677402 3801311 3935569 4078593
59871 4078593 4228095 4381071 4533828 4682121 4821206 4945833 5050547 5130394 5181573 5201640
59861 5201640 5189622 5146319 5074390 4977811 4861122 4729091 4586591 4438214 4287870 4138915
59851 4138915 3994486 3857345 3729441 3611964 3505892 3412233 3331689 3264383 3210038 3168340
59841 3168340 3139096 3122221 3117622 3124934 3143323 3171637 3208656 3253090 3303339 3357418 3412996 3467300
59829 3467300 3517110 3559122 3590385 3608301 3610472 3595067 3561472 3510317 3442843 3360520 3265404
59818C265404j04996j11578j15293j16857j16721j15016j11798j07221j01585
59809B264339r5303q8720q1943p4941o7809o0876n4510m8768m3337l7860l2410
59798A577862k7476k3419k0125j7380j5376j4455j4408j4468j4120j3573j3239
59787A389823j3079j2664j1674j0111q275o702n938o132o941q005r332j1093j3158
59774A266719j5074j6402j6993j6921j6340j5348j3992j2405j0761r035o941m320
59762A112187j507R36K810M330N712P043Q465J0120J1891J3644J5671J8344K1366
59749A231012K3830K5163K5578K5401K4566K3041K1221J9510J7870J6100J4193
59738A467485J2192J0032P893O328N741O021O952Q608J1013J3812J6763K0177
$$ plain form
59818 3265404 3160408 3048830 2933537 2816680 2699959 2584943 2473145 2365924 2264339
59809 2264339 2169036 2080316 1998373 1923432 1855623 1794747 1740237 1691469 1648132 1610272 1577862
59798 1577862 1550386 1526967 1506842 1489462 1474086 1459631 1445223 1430755 1416635 1403062 1389823
59787 1389823 1376744 1364080 1352406 1342295 1334020 1327318 1321380 1315248 1308307 1300302 1290970 1279877 1266719
59774 1266719 1251645 1235243 1218250 1201329 1184989 1169641 1155649 1143244 1132483 1123448 1116507 1112187
59762 1112187 1110680 1111616 1114426 1118756 1124468 1131511 1139976 1150096 1161987 1175631 1191302 1209646 1231012
59749 1231012 1254842 1280005 1305583 1330984 1355550 1378591 1399812 1419322 1437192 1453292 1467485
59738 1467485 1479677 1489709 1497602 1503930 1509671 1515692 1522644 1531252 1542265 1556077 1572840 1593017
59726A593017K4467K9477L4820M0562M7066N4317O1924O9754P8057Q6944R6191
59715B216596J05534J14861J24010J32522J39440J43036J40878J30659J11334
59706C358870Q3667N0089J4239j9816m8722p0689q5434r3552r6086r4325q9536
59695B908705q2754p4818o6361n7555m8173l8190k8154j8627r595p50P859J5956
59683B507543K3623L1363L9518M8017N6627O5179P3588Q2021R0918J00602J10898
59672C229897J21400J32059J43191J55060J67725J81220J95519K10351K25288
59663D761710K39974K54024K66889K78091K87394K94401K98167K97723K92992
59654G271365K84873K74531K63035K51609K41659K34295K29974K28666K30051
$$ plain form
59726 1593017 1617484 1646961 1681781 1722343 1769409 1823726 1885650 1955404 2033461 2120405 2216596
59715 2216596 2322130 2436991 2561001 2693523 2832963 2975999 3116877 3247536 3358870
59706 3358870 3442537 3492626 3506865 3487049 3438327 3367638 3282204 3188652 3092566 2998241 2908705
59695 2908705 2825951 2751133 2684772 2627217 2579044 2540854 2512700 2494073 2484478 2483728 2491587 2507543
59683 2507543 2531166 2562529 2602047 2650064 2706691 2771870 2845458 2927479 3018397 3118999 3229897
59672 3229897 3351297 3483356 3626547 3781607 3949332 4130552 4326071 4536422 4761710
59663 4761710 5001684 5255708 5522597 5800688 6088082 6382483 6680650 6978373 7271365
59654 7271365 7556238 7830769 8093804 8345413 8587072 8821367 9051341 9280007 9510058
59645I510058K33494K38025K42393K45077K44407K39042K28293K11852J89452
59636A1582093J61239J28368R2823N6624K1537j0620l8001n9318p4139q2493q4462
59625A1693651q0201p0083n4698l4864j1556J4505M3111P4152J07004J40704J74676
59614A1996401K08711K42098K73246L00321L21799L36107L41056L34097L13026
59605A4666862K76377K23627J55607P4917j4183j06305j95593k76579l45167l99165
59595A4060398m37950m61836m71865m69969m58727m40753m18317l93534l68708
59586A0138739l46306l28700l17931l15306l20658l31711l44539l55189l61112
59577G117287l61330l55724l44747l29607l12056k93508k74577k55457k36478
$$ plain form
59645 9510058 9743552 9981577 10223970 10469047 10713454 10952496 11180789 11392641 11582093
59636 11582093 11743332 11871700 11964523 12021147 12042684 12032064 11994063 11934745 11860606 11778113 11693651
59625 11693651 11613450 11543367 11488669 11453805 11442249 11456754 11499865 11574017 11681021 11821725 11996401
59614 11996401 12205112 12447210 12720456 13020777 13342576 13678683 14019739 14353836 14666862
59605 14666862 14943239 15166866 15322473 15397390 15383207 15276902 15081309 14804730 14459563 14060398
59595 14060398 13622448 13160612 12688747 12218778 11760051 11319298 10900981 10507447 10138739
59586 10138739 9792433 9463733 9145802 8830496 8509838 8178127 7833588 7478399 7117287
59577 7117287 6755957 6400233 6055486 5725879 5413823 5120315 4845738 4590281 4353803
59568D353803k18052k00412j83690j68032j53458j39793j26978j15195j04521
59559B943672r4692q5461p6927o9230o2267n5932n0438m5942m2223l9092l6933
59548B284535l6215l6660l7396l7952l8621l9753m1179m2465m3330m3651m3329
59537A843984m2345m0808l8835l6511l3962l1296k8497k5552k2592j9734j6857
59526A506995j3798j0676p779n143k528K02K913N388P517R274J0720J2000J3199
59513A528284J4258J5130J5944J6818J7733J8722J9973K1589K3467K5599K8252
59502A745769L1506L4981L8364M1949M6172N0861N5481O0036O5068P0794P6786
59491B317767Q2651Q8537R4721J01067J07045J12150J16099J18844J20447J20881
$$ plain form
59568 4353803 4135751 3935339 3751649 3583617 3430159 3290366 3163388 3048193 2943672
59559 2943672 2848980 2763519 2686592 2617362 2555095 2499163 2448725 2402783 2360560 2321468 2284535
59548 2284535 2248320 2211660 2174264 2136312 2097691 2057938 2016759 1974294 1930964 1887313 1843984
59537 1843984 1801639 1760831 1721996 1685485 1651523 1620227 1591730 1566178 1543586 1523852 1506995
59526 1506995 1493197 1482521 1474742 1469599 1467071 1467273 1470186 1475574 1483091 1492365 1503085 1515085 1528284
59513 1528284 1542542 1557672 1573616 1590434 1608167 1626889 1646862 1668451 1691918 1717517 1745769
59502 1745769 1777275 1812256 1850620 1892569 1938741 1989602 2045083 2105119 2170187 2240981 2317767
59491 2317767 2400418 2488955 2583676 2684743 2791788 2903938 3020037 3138881 3259328 3380209
59481C380209J19938J17457J13524J08375J02221R5350Q8062Q0315P1697O2132
59471D339280N2364M3355L5460K8592K2891J8736J6269J5428J6299J8949K2994
59460D630617K7846L3195L8694M3338M5780M5242M1541L4408K3452Q844q608k8168
59448D936181m9309p1156r2413j12046j29486j44048j54893j61718j65002j65265
59438C690845j62661j57407j50109j41392j31688j21487j11299j01125r0606p9891
59428B443180o9810o0854n2564m4270l5989k8141k0772j3557o293R34Q005J4914
59416B134783K1802K8920L6343M3796N0980N8012O5082P1824P7560Q2181Q6103
59405B757386Q9280R0883R0175Q7036Q1426P2995O1620M7767L1961J4453m277
$$ plain form
59481 3380209 3500147 3617604 3731128 3839503 3941724 4037074 4125136 4205451 4277148 4339280
59471 4339280 4391644 4434999 4470459 4499051 4521942 4540678 4556947 4572375 4588674 4607623 4630617
59460 4630617 4658463 4691658 4730352 4773690 4819470 4864712 4906253 4940661 4964113 4972957 4964349 4936181
59448 4936181 4886872 4815716 4723303 4611257 4481771 4337723 4182830 4021112 3856110 3690845
59438 3690845 3528184 3370777 3220668 3079276 2947588 2826101 2714802 2613677 2523071 2443180
59428 2443180 2373370 2312516 2259952 2215682 2179693 2151552 2130780 2117223 2110930 2111864 2119869 2134783
59416 2134783 2156585 2185505 2221848 2265644 2316624 2374636 2439718 2511542 2589102 2671283 2757386
59405 2757386 2846666 2937549 3027724 3114760 3196186 3269181 3330801 3378568 3410529 3424982 3420705
59394C420705k3207m1394n8373p3672q6511r6458j03850j09089j11991j12386
59384B603774j10814j08109j04603j00286r5352r0058q4342p8185p2034o6401
59374A693590o1202n6053n0912m6019m1420l7003l2832k8979k5266k1563j8081
59363A274260j4974j1939q721n677l319j532K35K162M070N991Q157J0473J2633
59350A271819J4643J6645J8195J8440J7193J5431J4445J4834J6421J8809K1764
59339A458639K5280K9496L4397L9532M4051M7211M8945N0128N2207N6300O2440
59328A948626O9817P7838Q6652R6553J07293J18339J29541J41125J53240J65817
59318C094841J78793J92004K04888K16548K26077K32696K35724K34750K29743
$$ plain form
59394 3420705 3397498 3356104 3297731 3224059 3137548 3041090 2937240 2828151 2716160 2603774
59384 2603774 2492960 2384851 2280248 2179962 2084610 1994552 1910210 1832025 1759991 1693590
59374 1693590 1632388 1576335 1525423 1479404 1437984 1400981 1368149 1339170 1313904 1292341 1274260
59363 1274260 1259286 1247347 1238626 1232949 1229630 1228098 1228333 1230495 1234565 1240556 1248713 1259186 1271819
59350 1271819 1286462 1303107 1321302 1339742 1356935 1372366 1386811 1401645 1418066 1436875 1458639
59339 1458639 1483919 1513415 1547812 1587344 1631395 1678606 1727551 1777679 1829886 1886186 1948626
59328 1948626 2018443 2096281 2182933 2279486 2386779 2505118 2634659 2775784 2929024 3094841
59318 3094841 3273634 3465638 3670526 3887074 4113151 4345847 4581571 4816321 5046064
59309E046064K20859K08388J93073J76185J58897J41685J24600J07927R2099P7116
59299F546893O2474M7693L2535J6754rj7957l6944n6587p6340r5405j12793j27660
59287F182654j39637j48957j56313j62428j67685j72166j75975j79292j82072
59278D698129j84026j84951j84761j83169j79766j74643j68477j61737j54217
59269C122382j45640j36346j26896j17414j07831r8491q9902q2042p4411o6787
59259B076622n9453n2698m6504m0718l5207k9847k4671j9951j5879j2198q476
59248A731020m596p10L153P052J0801J4164J7360K0919K4936K8854L2159L5021
59236A920133L8014M1389M4849M7921N0389N2355N3950N5093N5582N5322N4366
$$ plain form
59309 5046064 5266923 5475311 5668384 5844569 6003466 6145151 6269751 6377678 6469777 6546893
59299 6546893 6609367 6657060 6689595 6706349 6706340 6688383 6651439 6594852 6518512 6423107 6310314 6182654
59287 6182654 6043017 5894060 5737747 5575319 5407634 5235468 5059493 4880201 4698129
59278 4698129 4514103 4329152 4144391 3961222 3781456 3606813 3438336 3276599 3122382
59269 3122382 2976742 2840396 2713500 2596086 2488255 2389764 2299862 2217820 2143409 2076622
59259 2076622 2017169 1964471 1917967 1877249 1842042 1812195 1787524 1767573 1751694 1739496 1731020
59248 1731020 1726424 1725714 1728867 1735919 1746720 1760884 1778244 1799163 1824099 1852953 1885112 1920133
59236 1920133 1958147 1999536 2044385 2092306 2142695 2195050 2249000 2304093 2359675 2414997 2469363
59225B469363N2787N0676M8256M5743M3125M0327L7601L5419L3882L2661L1571
59214B921411L0817L0424K9870K8585K6474K3606J9611J3816N899l716j3988k3725
59202C089084l2155l9232m5183m9755n2319n2783n1869n0252m7921m4593m0273
59191B582749l5090k9098k2583j6115r882l473L266R704J5216K0042K4760K9379
59179B568875L3543L7223M0559M3312M5268M6857M8729N0895N2904N4738N6906
59168C079809N9833O3697O8708P4908Q1831Q8879R5871J02682J08602J12599J14052
59157D051471J12543J07210R7082Q2042O2789L9952J3865j4728m4458p3849j01589
59146D332330j26344j46960j62937j74258j80905j83038j81439j77130j70596
$$ plain form
59225 2469363 2522150 2572826 2621082 2666825 2709950 2750277 2787878 2823297 2857179 2889840 2921411
59214 2921411 2952228 2982652 3012522 3041107 3067581 3091187 3110798 3124614 3130513 3126797 3112809 3089084
59202 3089084 3056929 3017697 2972514 2922759 2870440 2817657 2765788 2715536 2667615 2623022 2582749
59191 2582749 2547659 2518561 2495978 2479863 2469981 2466508 2469774 2479478 2494694 2514736 2539496 2568875
59179 2568875 2602418 2639641 2680200 2723512 2768780 2815637 2864366 2915261 2968165 3022903 3079809
59168 3079809 3139642 3203339 3272047 3346955 3428786 3517665 3613536 3716218 3824820 3937419 4051471
59157 4051471 4164014 4271224 4368306 4450348 4513137 4553089 4566954 4552226 4507768 4433919 4332330
59146 4332330 4205986 4059026 3896089 3721831 3540926 3357888 3176449 2999319 2828723
59137B828723j62076j52398j42673j33193j23451j13376j03738r5131q7298p9801
59127A635588p2667o6117o0149n4750n0014m5791m1723l7768l4269l1301k8443
59116A112596k5434k2558k0157j8202j6510j4984j3466j1741r864q073o291m152
59104I41164j697M60J908K997M373O262Q427J0543J2398J3977J5489J7141J8890
59091A052332K0618K2431K4468K6513K8222K9731L1510L3632L5670L7355L8897
59080A381379M0573M2413M4360M6286M7857M8808M9351M9826N0002M9266M7532
59069A897653M5333M2938M0034L6446L2608K9061K5947K3219K0945J9176J7922
59058B231282J7415J7962J9535K1806K4714K8437L2833L7396M1902M6522N1244
$$ plain form
59137 2828723 2666647 2514249 2371576 2238383 2114932 2001556 1897818 1802687 1715389 1635588
59127 1635588 1562921 1496804 1436655 1381905 1331891 1286100 1244377 1206609 1172340 1141039 1112596
59116 1112596 1087162 1064604 1044447 1026245 1009735 994751 981285 969544 959680 951607 945316 941164
59104 941164 939467 939927 941835 944832 949205 955467 963894 974437 986835 1000812 1016301 1033442 1052332
59091 1052332 1072950 1095381 1119849 1146362 1174584 1204315 1235825 1269457 1305127 1342482 1381379
59080 1381379 1421952 1464365 1508725 1555011 1602868 1651676 1701027 1750853 1800855 1850121 1897653
59069 1897653 1942986 1985924 2025958 2062404 2095012 2124073 2150020 2173239 2194184 2213360 2231282
59058 2231282 2248697 2266659 2286194 2308000 2332714 2361151 2393984 2431380 2473282 2519804 2571048
59047B571048N5706N9666O2967O4936O4429O0775N4182M5071L3655K0360O065
59036C098860q368k2302l4908m5238n2981n8562o2251o3808o3251o1282n8553
59025B567356n5106n0994m6780m2985l9565l6461l4148l3099l3167l3977l5526
59014B125548l7881m0686m3526m6449m9594n2633n5061n6805n8028n8623n8338
59003A567924n7278n5871n4382n2827n1169m9353m7252m4902m2536m0268l7940
58992A034146l5497l3209l1280k9542k7793k6113k4633k3280k2015k0987k0190
58981G39607j9286j8077j6831j5850j5019j4046j2908j1755j0606r474q483p613
58969E79659o562n162l712k634j992j585j243r29o90o78r55j243j195r26q46r43
$$ plain form
59047 2571048 2626754 2686420 2749387 2814323 2878752 2939527 2993709 3038780 3072435 3092795 3098860
59036 3098860 3090492 3068190 3033282 2988044 2935063 2876501 2814250 2750442 2687191 2625909 2567356
59025 2567356 2512250 2461256 2414476 2371491 2331926 2295465 2261317 2228218 2195051 2161074 2125548
59014 2125548 2087667 2046981 2003455 1957006 1907412 1854779 1799718 1742913 1684885 1626262 1567924
59003 1567924 1510646 1454775 1400393 1347566 1296397 1247044 1199792 1154890 1112354 1072086 1034146
58992 1034146 998649 965440 934160 904618 876825 850712 826079 802799 780784 759797 739607
58981 739607 720321 702244 685413 669563 654544 640498 627590 615835 605229 595755 587272 579659
58969 579659 573097 567935 564223 561589 559597 558012 556769 555840 555150 554472 553517 552274 551079 550153 549307 548364
58953E48364p87l24m6j54j65L17R83J379J530J660J758J836K102K504K556K082
58937E65595J622J665J946K031K081K507L169L655L946M275M552M552M484M787
58923F10867N491O291P021P625P871P665P483P903Q795R464R622R708J0216J1150
58909G27172J2204J3099J3690J3956J4069J4284J4734J5403J6182J6906J7447
58898H89146J7885J8437J9148J9845K0471K1198K2153K3300K4660K6369K8377
58887A130989L0414L2331L4213L6177L8339M1023M4454M8288N1940N5421N9253
58876A602842O3514O7732P1857P6566Q2220Q8344R4543J01201J08723J16812J25122
58865B599476J34006J43948J54810J66243J78391J91419K04861K18118K31278
$$ plain form
58953 548364 547577 547253 547207 547053 546888 547205 548188 549567 551097 552757 554515 556351 558453 560957 563513 565595
58937 565595 567217 568882 570828 572859 574940 577447 580616 584271 588217 592492 597044 601596 606080 610867
58923 610867 616358 622649 629670 637295 645166 652831 660314 668217 677012 686476 696098 705806 716022 727172
58909 727172 739376 752475 766165 780121 794190 808474 823208 838611 854793 871699 889146
58898 889146 907031 925468 944616 964461 984932 1006130 1028283 1051583 1076243 1102612 1130989
58887 1130989 1161403 1193734 1227947 1264124 1302463 1343486 1387940 1436228 1488168 1543589 1602842
58876 1602842 1666356 1734088 1805945 1882511 1964731 2053075 2147618 2248819 2357542 2474354 2599476
58865 2599476 2733482 2877430 3032240 3198483 3376874 3568293 3773154 3991272 4222550
58856D222550K44662K57911K70151K80755K89229K94556K95417K90912K80496
58847F726639K63361K38600K05948J65970J19709O8752J5442l7571q8096j34481
58837G544273j75253k09251k36020k55783k69086k76712k79602k78407k73420
58828E290739k65210k54900k43420k30886k17212k02942j88952j75684j63189
58819C348344j51632j41114j31333j22013j13414j05882r9170r2757q6572q0830
58809B223627p5434p0155o5108o0520n6192n1809m7494m3542l9859l6217l2771
58798A644526k9737k6805k3568k0211j7195j4463j1601q549n542k536O10L642
58786A488571O220Q565J1215J4286J7540K0981K4703K8449L1940L5420L9233M3128
$$ plain form
58856 4222550 4467212 4725123 4995274 5276029 5565258 5859814 6155231 6446143 6726639
58847 6726639 6990000 7228600 7434548 7600518 7720227 7788979 7804421 7766850 7678754 7544273
58837 7544273 7369020 7159769 6923749 6667966 6398880 6122168 5842566 5564159 5290739
58828 5290739 5025529 4770629 4527209 4296323 4079111 3876169 3687217 3511533 3348344
58819 3348344 3196712 3055598 2924265 2802252 2688838 2582956 2483786 2391029 2304457 2223627
58809 2223627 2148193 2078038 2012930 1952410 1896218 1844409 1796915 1753373 1713514 1677297 1644526
58798 1644526 1614789 1587984 1564416 1544205 1527010 1512547 1500946 1492397 1486855 1484319 1484929 1488571
58786 1488571 1494791 1503356 1514571 1528857 1546397 1567378 1592081 1620530 1652470 1687890 1727123 1770251
58774A770251M6762N0550N5206O0567O5781P0615P5734Q1614Q8000R4570J01473
58763B561123J08985J17215J26236J36075J46509J57293J68581J80683J93505
58754C896205K06671K20000K33404K46396K58207K68215K75774K79836K79259
58745F163967K73316K61369K42405K15557J80940J39485R2310M0988j1965o3765
58735G534607j12460j56753j95164k26345k50144k67412k78786k84454k85026
58726E478063k81715k75494k66800k56083k44000k31026k17567k04303j91809
58717C309266j79878j68028j56461j45784j35942j26429j17415j09633j03100
58708B066596r6939r0704q4859p9777p5077p0366o5791o1578n7653n3956n0581
$$ plain form
58774 1770251 1817013 1867563 1922769 1983336 2049117 2119732 2195466 2277080 2365080 2459650 2561123
58763 2561123 2670108 2787323 2913559 3049634 3196143 3353436 3522017 3702700 3896205
58754 3896205 4102876 4322876 4556280 4802676 5060883 5329098 5604872 5884708 6163967
58745 6163967 6437283 6698652 6941057 7156614 7337554 7477039 7569349 7610337 7598372 7534607
58735 7534607 7422147 7265394 7070230 6843885 6593741 6326329 6047543 5763089 5478063
58726 5478063 5196348 4920854 4654054 4397971 4153971 3922945 3705378 3501075 3309266
58717 3309266 3129388 2961360 2804899 2659115 2523173 2396744 2279329 2169696 2066596
58708 2066596 1969657 1878953 1794094 1714317 1639240 1568874 1503083 1441505 1383852 1329896 1279315
58697A279315m7349m3907m0332l7065l4173l1317k8487k6061k4085k2186k0337
58686I24016j8936j8022j7104j5973j4919j4082j3241j2399j1851j1529j1027
58675G64933j0376j0094j0274j0381j0135r895r948j0106j0184j0261j0258r938
58663F43083r488r464r993j0626j1059j1404j1666j1677j1587j1702j1818j1430
58651E11169j0644j0045r660q944p933p374p533p749p500p049o731o435o111n981
58637D01480n931n484m671m158m223m399m418m596m963m881m055l116k677k483
58623C41425k059j474j015o13j02M32R14J409J770J655J138P23N74L34j10m23
58607C44578n10o79r35q68m74l13n65p35n44k96j13K94Q77J106J004J322K266
$$ plain form
58697 1279315 1231966 1188059 1147727 1110662 1076489 1045172 1016685 990624 966539 944353 924016
58686 924016 905080 887058 869954 853981 839062 824980 811739 799340 787489 775960 764933
58675 764933 754557 744463 734189 723808 713673 703778 693830 683724 673540 663279 653021 643083
58663 643083 633595 624131 614138 603512 592453 581049 569383 557706 546119 534417 522599 511169
58651 511169 500525 490480 480820 471876 463943 456569 449036 441287 433787 426738 420007 413572 407461 401480
58637 401480 395549 390065 385394 381236 377013 372614 368196 363600 358637 353756 349701 346585 343908 341425
58623 341425 339366 337892 336877 336264 336162 336594 337508 338917 340687 342342 343480 344203 344777 345111 345001 344578
58607 344578 344068 343389 342454 341586 341112 340799 340234 339499 338955 338659 338546 338840 339717 340823 341827 343149 345415
58590C45415K999K947K702L058L953M931N897O830P504Q014Q937J0375J1607J2153
58576D37322J2505J3244J4231J5205J6440J8071J9581K0650K1922K4119K6958
58565F40248K9716L2373L5444L9002M2642M6190M9904N4050N8695O3692O8702
58554A160658P3368P7665Q1646Q4842Q6376Q5755Q2950P7636O9086N7035M2077
58543A979094K5074O885j1261k7948m2405n4525o4042p0505p4186p5980p6269
58532A513932p4875p2234o9436o6767o3421n9079n4582n0567m6576m2163l7818
58521H76414l4038l0557k7101k4022k1516j9161j6811j5024j3982j3020j1824
58510F49358j1051j1108j1328j1144j0974j1170j1162j0468r613r196q942q533
$$ plain form
58590 345415 348414 351361 354063 357121 361074 366005 371902 378732 386236 394250 403187 413562 425169 437322
58576 437322 449827 463071 477302 492507 508947 527018 546599 567249 589171 613290 640248
58565 640248 669964 702337 737781 776783 819425 865615 915519 969569 1028264 1091956 1160658
58554 1160658 1234026 1311691 1393337 1478179 1564555 1650310 1733260 1810896 1879982 1937017 1979094
58543 1979094 2004168 2011053 1999792 1971844 1929439 1874914 1810872 1740367 1666181 1590201 1513932
58532 1513932 1439057 1366823 1297387 1230620 1167199 1108120 1053538 1002971 956395 914232 876414
58521 876414 842376 811819 784718 760696 739180 720019 703208 688184 674202 661182 649358
58510 649358 638307 627199 615871 604727 593753 582583 571421 560953 551340 542144 533202 524669
58498E24669q395q833r335r587j0162j1329j2155j1817j0876j0258r886r274q623
58485C94139q260p827p008o255n905n435m563m079m512m972m504l623l334l422
58471C20440l091k499k338k480k347k084k200k474k351j974j787j688j435j335
58457B90357j597j722j429j395k042k532k079j369j427j926j924j588j734k247
58443B65346k358j989j637j362j064j128j707k030j532r51j101j422j102o69j014
58428B44280j603j381p25p98j483j709j399j349j499j072k40l2n62r53r14r72
58412B27589j176r84m61k79n16n97l66j88r6O4j5n68r66n69R3J62JN54J656K331
58392B25669K407K471K582K435K354K757L034K335J122M46J77n53j559j928j775
$$ plain form
58498 524669 516274 507441 498106 488519 478357 467028 454873 443056 432180 421922 412036 402762 394139
58485 394139 385879 378052 371044 364789 358884 353449 348886 344807 340295 335323 330819 327196 323862 320440
58471 320440 317349 314850 312512 310032 307685 305601 303401 300927 298576 296602 294815 293127 291692 290357
58457 290357 288760 287038 285609 284214 282172 279640 277561 276192 274765 272839 270915 269327 267593 265346
58443 265346 262988 260999 259362 258000 256936 255808 254101 252071 250539 249588 248487 247065 245963 245294 244280
58428 244280 242677 241296 240571 239773 238290 236581 235182 233833 232334 231262 231022 230990 230428 229475 228561 227589
58412 227589 226413 225429 224968 224689 224173 223576 223210 223022 222926 222990 222975 222407 221441 220872 220965 221127 221128 221682 223338 225669
58392 225669 228076 230547 233129 235564 237918 240675 243709 246044 247166 247612 247789 247236 245677 243749 241974
58377B41974k015k621k714k301k268k738k953k742k606k446j703o71k74n50p59
58362B12613p94j123j527j318o59k31J20R69J835J743J012Q99J630K288K522K789
58346B22768L081K959K713K991L460L312K771K677K912K858K900L711M527M029
58332B67669K639J976K258K259J647J294J331R10M2l70l91j035k291k996k795
58317B72147k422k012r99L20R76J117J702K522K468J708J562K185K460K195K334
58302B88263K907K873K189J935K238K108J454J238J493J292P59R87J849K034J388
58287C15007J044J216J022N79R12J758J803J194J385K366K608J930J801K595L064
58272C40284K885L083L630L343K505K846M460N496N407N659O703P051O116N227
$$ plain form
58377 241974 239959 237338 234624 232323 230055 227317 224364 221622 219016 216570 214867 214196 213922 213372 212613
58362 212613 211819 210696 209169 207851 207192 206961 207081 208050 209885 211628 212640 213539 215169 217457 219979 222768
58346 222768 225849 228808 231521 234512 237972 241284 244055 246732 249644 252502 255402 259113 263640 267669
58332 267669 270308 272284 274542 276801 278448 279742 281073 281983 282025 281655 281264 280229 277938 274942 272147
58317 272147 269725 267713 266714 267034 268010 269127 270829 273351 275819 277527 279089 281274 283734 285929 288263
58302 288263 291170 294043 296232 298167 300405 302513 303967 305205 306698 307990 308749 309736 311585 313619 315007
58287 315007 316051 317267 318289 318868 319780 321538 323341 324535 325920 328286 330894 332824 334625 337220 340284
58272 340284 343169 346252 349882 353225 355730 358576 363036 368532 373939 379598 386301 393352 399468 404695
58258D04695N068M779M209M415N281N376M726M992O367P154O917P058P739P403
58244D86179O042N632O577P006O382O498P929Q919Q845R333J0871J1727J1373
58231E93313J1574J2841J3387J2734J2792J4045J4386J3174J2667J3903J4859
58220G39675J4424J4371J5639J6425J5863J5808J7156J8025J7594J7937K0048
58209I22965K1839K2105K2712K4735K6306K6430K7096K9445L1665L2743L4441
58198A222482L7460L9711M0461M1981M5156M7738M9030N1611N6305O0311O2508
58187A754754O5583P0522P4389P6177P9247Q5159R0750R4352R9016J06357J13295
58176B709601J18277J24571J33745J42244J48285J55555J66132J76618J85397
$$ plain form
58258 404695 409763 414542 418751 423166 428447 433823 438549 443541 449908 457062 463979 471037 478776 486179
58244 486179 492221 497853 504430 511436 517818 524316 532245 541164 550009 559342 570213 581940 593313
58231 593313 604887 617728 631115 643849 656641 670686 685072 698246 710913 724816 739675
58220 739675 754099 768470 784109 800534 816397 832205 849361 867386 884980 902917 922965
58209 922965 944804 966909 989621 1014356 1040662 1067092 1094188 1123633 1155298 1188041 1222482
58198 1222482 1259942 1299653 1340114 1382095 1427251 1474989 1524019 1575630 1631935 1692246 1754754
58187 1754754 1820337 1890859 1965248 2041425 2120672 2205831 2296581 2390933 2489949 2596306 2709601
58176 2709601 2827878 2952449 3086194 3228438 3376723 3532278 3698410 3875028 4060425
58167D060425J96509K11836K26924K39349K53529K72319K91871L10092L31527
58158F394381L58284L85306M10639M40666M78609N18186N55847N98326O50296
58149A0790540P06415P64250Q32473R16827J011567J115295J240630J396781J578723
58140B0353501J786131K034424K332306K669162L041261L465600L946593M457739
58132D4086717M984075N554892O211361O988710P953150R133020J0250754J0564388
58124A05727067R229700O019289J666012k594234n826558p780232q673306q824178
58116H8943560q499112p916421p234214o531156n843508n206891m642148m134333
58108C8935777l660053l219228k819882k453741k109721j793506j512787j258886
$$ plain form
58167 4060425 4256934 4468770 4695694 4935043 5188572 5460891 5752762 6062854 6394381
58158 6394381 6752665 7137971 7548610 7989276 8467885 8986071 9541918 10140244 10790540
58149 10790540 11496955 12261205 13093678 14010505 15022072 16137367 17377997 18774778 20353501
58140 20353501 22139632 24174056 26506362 29175524 32216785 35682385 39628978 44086717
58132 44086717 49070792 54625684 60837045 67825755 75778905 84911925 95162679 105727067
58124 105727067 114956767 120976056 122642068 120047834 114221276 106441044 97767738 88943560
58116 88943560 80444448 72528027 65293813 58762657 52919149 47712258 43070110 38935777
58108 38935777 35275724 32056496 29236614 26782873 24673152 22879646 21366859 20107973
58100B0107973j021786q07742o23174m55274k86188j11914O8597K59903M34488
58091A7564883N04775L74158L2496m15144q22813j098122j230143j254270j210403
58082A2445417j126451j020976r09348q04845p14754o38514n72357n14355m63407
58073E680410m16728l72211l31186k95573k64566k37038k14353j97372j83488
58064C167895j70177j58715j50789j44260j36128j27048j19040j11311j02349
58055A948078r3786q8054q4158p9623p4768p1394o8982o5878o2554o0310n8255
58044A140316n4839n0837m7753m4922m1143l7483l5428l3954l1450k8819k7642
58033G06046k7003k5196k2964k1930k1398j9807j7915j7383j7541j6644j5078
$$ plain form
58100 20107973 19086187 18278445 17655271 17199997 16913809 16801895 16870492 17130395 17564883
58091 17564883 18069658 18443816 18476312 18061168 17238355 16140233 14910090 13655820 12445417
58082 12445417 11318966 10297990 9388642 8583797 7869043 7230529 6658172 6143817 5680410
58073 5680410 5263682 4891471 4560285 4264712 4000146 3763108 3548755 3351383 3167895
58064 3167895 2997718 2839003 2688214 2543954 2407826 2280778 2161738 2050427 1948078
58055 1948078 1854292 1766238 1682080 1602457 1527689 1456295 1387313 1321435 1258881 1198571 1140316
58044 1140316 1085477 1034640 986887 941965 900822 863339 827911 793957 762507 733688 706046
58033 706046 679043 653847 630883 608953 587555 567748 549833 532450 514909 498265 483187
58022D83187j4391j4220j3226j1927j1696j1905j0939r176q268q191p681o749
58010C54818o311o076n235m442m769n511n328m621m571m751m067l062k978l361
57996B89735l045k559l105m049l878k970k893l579l652l037k839l071k835k387
57982B45836k710l352k952j674r76j183j323j135j265j609j403q48q39j261j242
57967B22064q46q67j241j294j209j624k167k036j606j782k236k037j527j748k427
57952A97417k411j768j614k063k246k110k397k968k929k326k067k193j907j243
57938A67175j037j291j149n05q0J8L59Q12O93J61jQ6l88j296j662j356j156j141
57920A58242o38J97L18m68j201j377j513j849j854j377j015j098j292j455j785
$$ plain form
58022 483187 468796 454576 441350 429423 417727 405822 394883 385707 377439 369248 361567 354818
58010 354818 348507 342431 337196 332754 327985 322474 317146 312525 307954 303203 299136 296074 293096 289735
57996 289735 286690 284131 281026 276977 273099 270129 267236 263657 260005 256968 254129 251058 248223 245836
57982 245836 243126 239774 236822 235148 234172 232989 231666 230531 229266 227657 226254 225406 224567 223306 222064
57967 222064 221218 220351 219110 217816 216607 214983 212816 210780 209174 207392 205156 203119 201592 199844 197417
57952 197417 195006 193238 191624 189561 187315 185205 182808 179840 176911 174585 172518 170325 168418 167175
57938 167175 166138 164847 163698 163193 163113 163131 163490 164302 164995 165156 165155 165241 164853 163557 161895 160539 159383 158242
57920 158242 157604 157801 158119 157651 156450 155073 153560 151711 149857 148480 147465 146367 145075 143620 141835
57905A41835k060j803j241j081j345j434j291j396j689j609j242j262j782k232
57891A20368k380k419k188j381m34p8j65QM19M95L41N70J013R61N12M15O56N14
57873A17227o8m55o62j261k053k167j646j456j813j923j515j277j455j413r14
57858I7149n23m48j78L84O80O94J088J867K100J497R72J121J350J080P16P79R82
57841A11310R08P03N81L69O8P7M43N64J13n08r21j271j640j739j530j427j603
57824A04497j763j834k096k414k208j437q19p86r94j122j300j501j342q30m95
57809H3556m74k50M02J018J282J456J673J635J361J343J653J696J206P27O46O05
57793I9535K56j51m00p37j257j566j511j549j966k428k646k788k844k389j479
$$ plain form
57905 141835 139775 137972 136731 135650 134305 132871 131580 130184 128495 126886 125644 124382 122600 120368
57891 120368 117988 115569 113381 112000 111566 111488 111323 111331 111750 112245 112586 113156 114169 115130 115642 116057 116713 117227
57873 117227 117159 116704 116042 114781 112728 110561 108915 107459 105646 103723 102208 100931 99476 98063 97149
57858 97149 96626 96178 96000 96384 97064 97758 98846 100713 102813 104310 105282 106403 107753 108833 109549 110328 111310
57841 111310 112218 112921 113502 113871 113939 114016 114459 115023 115136 114628 113707 112436 110796 109057 107527 106100 104497
57824 104497 102734 100900 98804 96390 94182 92745 91926 91140 90146 89024 87724 86223 84881 84051 83556
57809 83556 83082 82832 83234 84252 85534 86990 88663 90298 91659 93002 94655 96351 97557 98284 98930 99535
57793 99535 99791 99640 99240 98503 97246 95680 94169 92620 90654 88226 85580 82792 79948 77559 76080
57778G6080r92j455k230k429k074j740j573j380j200j227j391j498j535j554j516
57763E2286j520j751k090k143j856j608j577j575j582j810k077j850j158p41r38
57748B8010j201j033o95n16k74J96M79K20k33l69k34p7K02P72J328J487J342J213
57730C0617J115Q86N71L42K40K79N48R43J137R90O88L78J7k83k49O2K27P7j43
57711C8442l08n66q45q25n64n36q13q86n72l73n88p51l48M19J018J267J216R54
57693C5341P80J099J814K309K312K167K032J576Q17M37P79J188J016N46L77M53
57677E5043M27M04O42R59J061J144J483J837J836J691J875K393K841L011K986
57662G9633K892K951L418M147M599M635M782N393O038O278O403O845P345P466
$$ plain form
57778 76080 75088 73633 71403 68974 66900 65160 63587 62207 61007 59780 58389 56891 55356 53802 52286
57763 52286 50766 49015 46925 44782 42926 41318 39741 38166 36584 34774 32697 30847 29689 28948 28010
57748 28010 26809 25776 25081 24565 24291 24487 24966 25186 24953 24584 24350 24273 24475 25247 26575 28062 29404 30617
57730 30617 31732 32618 33189 33531 33771 34050 34598 35541 36678 37668 38356 38734 38751 38468 38219 38281 38508 38585 38442
57711 38442 38134 37568 36723 35898 35334 34798 33985 33099 32527 32154 31566 30815 30467 30886 31904 33171 34387 35341
57693 35341 36121 37220 39034 41343 43655 45822 47854 49430 50247 50684 51463 52651 53667 54213 54590 55043
57677 55043 55470 55874 56516 57475 58536 59680 61163 63000 64836 66527 68402 70795 73636 76647 79633
57662 79633 82525 85476 88894 93041 97640 102275 107057 112450 118488 124766 131169 138014 145359 152825
57648A52825P412P657Q060Q205Q287Q918J0160J1446J2447J3376J4477J5745J7134
57635B96149J8625K0101K1557K3257K5376K7695L0011L2558L5690L9360M3268
57624F13647M7259N1230N5024N8760O2889O7407P1454P4140P5336P5104P2871
57613A325121O7966O0585N1521M1243L0051J8809Q488j140j1447k3429l6683m9872
57601A481213o1495p0181p5061p6259p4696p1311o6734o1574n6427n1462m6507
57590G69506m1596l7032l2911k9021k5311k1955j8942j5992j3028j0290p900n654
57578E09874l356j052J156L260N291P358R679J2316J4964J7341J9662K2385K5545
57565F44423K8795L2005L5352L8841M2249M5507M8680N1475N3291N3868N3376
$$ plain form
57648 152825 160237 167894 175954 184159 192446 201364 211524 222970 235417 248793 263270 279015 296149
57635 296149 314774 334875 356432 379689 405065 432760 462771 495329 531019 570379 613647
57624 613647 660906 712136 767160 825920 888809 956216 1027670 1101810 1177146 1252250 1325121
57613 1325121 1393087 1453672 1505193 1546436 1576487 1595296 1603784 1602644 1591197 1567768 1531085 1481213
57601 1481213 1419718 1349537 1274476 1198217 1123521 1052210 985476 923902 867475 816013 769506
57590 769506 727910 690878 657967 628946 603635 581680 562738 546746 533718 523428 515528 509874
57578 509874 506518 505466 506622 509882 515173 522531 532210 544526 559490 576831 596493 618878 644423
57565 644423 673218 705223 740575 779416 821665 867172 915852 967327 1020618 1074486 1127862
57554A127862N1688M8046M1730L2779K1833R612l212j5865k7560l7685m5805n1717
57542A151706n5550n7728n8629n8359n6939n4634n1963m9393m7036m4634m1934
57531E74907l9006l6092l3198l0215k7379k5147k3407k1419j8930j6791j5813
57520B87510j5476j4570j2902j1408j0608r951q926p919p463p308o852o029n200
57507A62898m458l636k805k247j955j596j020m71j76jL35R01J475J836K039K366
57491A53485K996L782M427M874N357O038O777P367P867Q578R701J1079J2321J3201
57477B57850J3921J4984J6656J8666K0522K2137K3911K6233K8999L1753L4187
57466E09819L6337L8370M0304M1981M3231M3852M3469M1506L7522L1502K3735
$$ plain form
57554 1127862 1179550 1227596 1269326 1302105 1323938 1333550 1330338 1314473 1286913 1249228 1203423 1151706
57542 1151706 1096156 1038428 979799 921440 864501 809867 757904 708511 661475 616841 574907
57531 574907 535901 499809 466611 436396 409017 383870 360463 339044 320114 303323 287510
57520 287510 272034 257464 244562 233154 222546 212595 203669 195750 188287 180979 174127 168098 162898
57507 162898 158440 154804 151999 149752 147797 146201 145181 144710 144534 144533 144868 145769 147244 149080 151119 153485
57491 153485 156481 160263 164690 169564 174921 180959 187736 195103 202970 211548 221249 232328 244649 257850
57477 257850 271771 286755 303411 322077 342599 364736 388647 414880 443879 475632 509819
57466 509819 546156 584526 624830 666811 710042 753894 797363 838869 876391 907893 931628
57455I31628J4518M233o403j6431k5151l2296l7780m1571m3922m5283m5774m5075
57443F10693m3104m0475l7921l5511l2860k9890k6969k4319k1789j9198j6603
57432B82054j4138j1883r911q261o802n357l950k695j543l17J010K321L599M926
57418B29053O229P368Q456R827J1631J3727J5927J8154K0348K2495K4796K7467
57406D15478L0307L2832L4888L6820L8817M0342M0547L9053L6074L1782K5906
57395H02846J8048Q375k162j2359k1501k9496l6340m1682m5099m6668m6983m6627
57383E00352m5787m4409m2505m0280l8009l5822l3553l0942k8136k5719k4072
57372A11118k2833k1332j9386j7415A4382e0j3295j2368j1562j0726r927r392
$$ plain form
57455 931628 946146 950379 943976 927545 902394 870098 832318 790747 746825 701542 655768 610693
57443 610693 567589 527114 489193 453682 420822 390932 363963 339644 317855 298657 282054
57432 282054 267916 256033 246122 237861 231059 225702 221752 219057 217514 217197 218207 220528 224127 229053
57418 229053 235282 242650 251106 260933 272564 286291 302218 320372 340720 363215 388011 415478
57406 415478 445785 478617 513505 550325 589142 629484 670031 709084 745158 776940 802846
57395 802846 820894 829269 827107 814748 793247 763751 727411 685729 640630 593962 546979 500352
57383 500352 454565 410156 367651 327371 289362 253540 219987 189045 160909 135190 111118
57372 111118 88285 66953 47567 30152 14382 -50 -13345 -25713 -37275 -48001 -57928 -67320
57360f7320r057q540p684o829o273n843n239m515l951l654l556l636l814l823
57346a43734l478k996k739k760k829k814k763k686k558k529k748l032k985k593
57332a83244k316k487k894l133l148l183l344l526l663l823m015m105l986l724
57318b30591l461l327l422l724l986l870l346k793k621k767k829k562k144j850
57304b73293j712j583j405j262j215j231j235j133q03k19M16P94Q07N79K49j23
57288b82369m13m17j85j13m85j028j237j079j030j338j665j582j141o33o3P32
57272b94046J566J971J824J550J568J809J936J812J576J414J382J382J232Q63
57258b72161M89L75M51L41n4l47j83K30M16K65J00J62L20L41K66L43O94J141J376
$$ plain form
57360 -67320 -76377 -84917 -92601 -99430 -105703 -111546 -116785 -121300 -125251 -128905 -132461 -136097 -139911 -143734
57346 -143734 -147212 -150208 -152947 -155707 -158536 -161350 -164113 -166799 -169357 -171886 -174634 -177666 -180651 -183244
57332 -183244 -185560 -188047 -190941 -194074 -197222 -200405 -203749 -207275 -210938 -214761 -218776 -222881 -226867 -230591
57318 -230591 -234052 -237379 -240801 -244525 -248511 -252381 -255727 -258520 -261141 -263908 -266737 -269299 -271443 -273293
57304 -273293 -275005 -276588 -277993 -279255 -280470 -281701 -282936 -284069 -284872 -285091 -284675 -283881 -283074 -282495 -282246 -282369
57288 -282369 -282782 -283199 -283384 -283497 -283982 -285010 -286247 -287326 -288356 -289694 -291359 -292941 -294082 -294715 -294778 -294046
57272 -294046 -292480 -290509 -288685 -287135 -285567 -283758 -281822 -280010 -278434 -277020 -275638 -274256 -273024 -272161
57258 -272161 -271672 -271297 -270846 -270505 -270559 -270906 -271089 -270859 -270443 -270178 -270078 -269916 -269596 -269255 -268989 -268646 -267952 -266811 -265435
57239b65435J354J401J861K692L560M252M853N467O115O855P749Q674R442J0181
57225a90979J1214J2475J3445J3837J3916J3889J3449J2312J0724R056P190M858
57213e4614K241k29k487m769p109r402j1761j4256j6464j7785j8209j8246j8241
57200a91331j8214j8269j8535j8674j8060j6634j5118j4191j3826j3513j2867
57189c69232j1833j0664r714r099q554p862p233o947o844o578o260o294o654o871
57175d80639o767o663o731o672o196n446m791m451m449m646m741m527m116l777
57161e54612l612l567l671l885m028m066m282m759n037m744m230m104m395m696
57147f13688m865m986m962m775m834n374n867n730n305n291n560n554n518o264
$$ plain form
57239 -265435 -264081 -262680 -260819 -258127 -254567 -250315 -245462 -239995 -233880 -227025 -219276 -210602 -201160 -190979
57225 -190979 -179765 -167290 -153845 -140008 -126092 -112203 -98754 -86442 -75718 -66662 -59472 -54614
57213 -54614 -52373 -52602 -55089 -59858 -66967 -76369 -88130 -102386 -118850 -136635 -154844 -173090 -191331
57200 -191331 -209545 -227814 -246349 -265023 -283083 -299717 -314835 -329026 -342852 -356365 -369232
57189 -369232 -381065 -391729 -401443 -410542 -419096 -426958 -434191 -441138 -447982 -454560 -460820 -467114 -473768 -480639
57175 -480639 -487406 -494069 -500800 -507472 -513668 -519114 -523905 -528356 -532805 -537451 -542192 -546719 -550835 -554612
57161 -554612 -558224 -561791 -565462 -569347 -573375 -577441 -581723 -586482 -591519 -596263 -600493 -604597 -608992 -613688
57147 -613688 -618553 -623539 -628501 -633276 -638110 -643484 -649351 -655081 -660386 -665677 -671237 -676791 -682309 -688573
57133f88573p851r546j1068j2781j4674j6244j7471j8849k0382k1578k2480k3666
57121h85163k5005k5611k5251k4706k4469k4143k3434k2724k2303k1962k1710
57110a146481k1999k2953k4203k5687k7767l0363l2948l5455l8255m1191m3715
57099a491017m6008m8776n1908n4546n6567n8619o0735o2311o3636o5816o8981
57088b128920p2098p4910p8421q3134q8500r4538j02263j11950j22590j33617
57078c090941j45516j58319j71209j84190j98324k13791k29594k45682k63465
57069d901031k83636l05496l28960l55034l83717m13763m45275m80145n19225
57060h416282n61591o07389o58743p16874p81224q52348r32794j024114j126276
$$ plain form
57133 -688573 -696424 -705970 -717038 -729819 -744493 -760737 -778208 -797057 -817439 -839017 -861497 -885163
57121 -885163 -910168 -935779 -961030 -985736 -1010205 -1034348 -1057782 -1080506 -1102809 -1124771 -1146481
57110 -1146481 -1168480 -1191433 -1215636 -1241323 -1269090 -1299453 -1332401 -1367856 -1406111 -1447302 -1491017
57099 -1491017 -1537025 -1585801 -1637709 -1692255 -1748822 -1807441 -1868176 -1930487 -1994123 -2059939 -2128920
57088 -2128920 -2201018 -2275928 -2354349 -2437483 -2525983 -2620521 -2722784 -2834734 -2957324 -3090941
57078 -3090941 -3236457 -3394776 -3565985 -3750175 -3948499 -4162290 -4391884 -4637566 -4901031
57069 -4901031 -5184667 -5490163 -5819123 -6174157 -6557874 -6971637 -7416912 -7897057 -8416282
57060 -8416282 -8977873 -9585262 -10244005 -10960879 -11742103 -12594451 -13527245 -14551359 -15677635
57051a5677635j241208j373577j526870j702417j903672k137621k410660k727659
57043c0701319l096885l531276m043174m643250n346563o173218p139810q255765
57035g2931260r529001j0964750j2553870j4273125j6104359j8041024k0062494
57028a74459883k2109190k4094231k5929833k7526548k8773246k9529405k9615927
57021c62038263k8779830k6688676k3048921j7820276j1347987m275874K694583
57014d71305244R015668J4371593J8652882K1892627K4197776K5694226K6502315
57007c30978157K6734666K6491116K5847856K4860390K3581539K2071851K0394177
57000a60996562J8609075J6779130J4968974J3234643J1615540J0137141Q814671
$$ plain form
57051 -15677635 -16918843 -18292420 -19819290 -21521707 -23425379 -25563000 -27973660 -30701319
57043 -30701319 -33798204 -37329480 -41372654 -46015904 -51362467 -57535685 -64675495 -72931260
57035 -72931260 -82460261 -93425011 -105978881 -120252006 -136356365 -154397389 -174459883
57028 -174459883 -196569073 -220663304 -246593137 -274119685 -302892931 -332422336 -362038263
57021 -362038263 -390818093 -417506769 -440555690 -458375966 -469723953 -473999827 -471305244
57014 -471305244 -462289576 -447917983 -429265101 -407372474 -383174698 -357480472 -330978157
57007 -330978157 -304243491 -277752375 -251904519 -227044129 -203462590 -181390739 -160996562
57000 -160996562 -142387487 -125608357 -110639383 -97404740 -85789200 -75652059 -66837388
56993f6837388P651005O636849N757900N000275M349171L788341L304452K888937
56985b7460458K533850K229632J968604J746481J558233J396061J253536J128406
56977a3645655J019179R22295Q34823P56727O88145O27030N71588N22328M79549
56968g223991M41324M05971L74140L46444L21347K97426K75532K56648K39626
56959d265533K22985K07073J92559J78573J64282J50589J38475J27176J15773
56950b768048J05035R5949Q7818P9449P0934O2832N4852M6869L9891L4582K9948
56939b059889K4841J9700J5781J3969J5297K0943L0201L9808M6699N0444N2042
56928a730164N1917N0376M8528M7086M5384M2840M0230L8272L6278L3511L0652
$$ plain form
56993 -66837388 -59186383 -52549534 -46791634 -41791359 -37442188 -33653847 -30349395 -27460458
56985 -27460458 -24926608 -22696976 -20728372 -18981891 -17423658 -16027597 -14774061 -13645655
56977 -13645655 -12626476 -11704181 -10869358 -10112631 -9424486 -8797456 -8225868 -7703540 -7223991
56968 -7223991 -6782667 -6376696 -6002556 -5656112 -5334765 -5037339 -4761807 -4505159 -4265533
56959 -4265533 -4042548 -3835475 -3642916 -3464343 -3300061 -3149472 -3010997 -2883821 -2768048
56950 -2768048 -2663013 -2567064 -2479246 -2399797 -2328863 -2266031 -2211179 -2164310 -2124419 -2089837 -2059889
56939 -2059889 -2035048 -2015348 -1999567 -1985598 -1970301 -1949358 -1919157 -1879349 -1832650 -1782206 -1730164
56928 -1730164 -1678247 -1627871 -1579343 -1532257 -1486873 -1444033 -1403803 -1365531 -1329253 -1295742 -1265090
56917a265090K8504K6540K4105K1881K0600J9523J7674J5611J4384J3799J3188
56906a049281J2942J3722J4991J5829J6490J7649J8882J9346J9321J9613K0051
56895h60445J9909J9275J8695J8076J7140J6370J6261J6199J5398J4295J3786
56884f75041J3680J3202J2471J2183J2257J2084J1703J1561J1499J1105J0701
56873e42595J0875J1453J1923J2350J2894J2982J2056J0678R728R093Q197P279
56861d13087O921O899O625O307O443O655O212N342M797M529L992L377L283L473
56847c38232L201K542K218K281K156J823J816K176K476K785L528M511N113N351
56833b96255N842O783P859Q995J0318J1654J2862J4422J6721J9086K0431K0575
$$ plain form
56917 -1265090 -1236586 -1210046 -1185941 -1164060 -1143460 -1123937 -1106263 -1090652 -1076268 -1062469 -1049281
56906 -1049281 -1036339 -1022617 -1007626 -991797 -975307 -957658 -938776 -919430 -900109 -880496 -860445
56895 -860445 -840536 -821261 -802566 -784490 -767350 -750980 -734719 -718520 -703122 -688827 -675041
56884 -675041 -661361 -648159 -635688 -623505 -611248 -599164 -587461 -575900 -564401 -553296 -542595
56873 -542595 -531720 -520267 -508344 -495994 -483100 -470118 -458062 -447384 -437656 -428563 -420366 -413087
56861 -413087 -406166 -399267 -392642 -386335 -379892 -373237 -367025 -361683 -356886 -352357 -348365 -344988 -341705 -338232
56847 -338232 -335031 -332489 -330271 -327990 -325834 -324011 -322195 -320019 -317543 -314758 -311230 -306719 -301606 -296255
56833 -296255 -290413 -283630 -275771 -266776 -256458 -244804 -231942 -217520 -200799 -181713 -161282 -140707
56821a40707J9977J8632J6345J3727J1729J0302Q685O833N424M591L840L166L093
56808a4363L558L848c215D95M037M555N368O682Q032Q541Q038O978N380K900n6
56793F0950k355l451l762l709l248k476j761j134k92P38J650K553L788N129O039
56778E8659O640P536Q781R913J0909J2060J2898J2297R851O271K346j532m782
56765A51847o670p198p125o891o316n442m726m232l464k246j020m7R23K041L130
56750A02564M195N453O787P815Q470Q740Q023N643K062j396m034o118p732q438
56736A32034q223p705p164o322n267m595m390l985l078k084j176N5J629K879L539
56721H6147M196N177N883N655M554K829N16k040l999m916n184n204m911m396m230
$$ plain form
56821 -140707 -120730 -102098 -85753 -72026 -60297 -49995 -41310 -34477 -29053 -24462 -20622 -17456 -14363
56808 -14363 -10805 -6957 -3215 495 4532 9087 14455 21137 29169 37710 45748 52726 58106 61006 60950
56793 60950 58595 55144 51382 47673 44425 41949 40188 39054 38762 39500 41150 43703 47491 52620 58659
56778 58659 65299 72835 81616 91529 102438 114498 127396 139693 149544 155815 158161 156629 151847
56765 151847 145177 137979 130854 123963 117647 112205 107479 103247 99783 97537 96517 96470 97393 99434 102564
56750 102564 106759 112212 118999 126814 135284 144024 152047 157690 159752 158356 154322 148204 140472 132034
56736 132034 123811 116106 108942 102620 97353 92758 88368 84383 81305 79221 78045 78100 79729 82608 86147
56721 86147 90343 95520 101403 107058 111612 114441 114957 112917 108918 104002 98818 93614 88703 84307 80077
56706H0077m593m888m614m052l611l228k746k300j930j438r18p29p31l40M23Q28
56690D5210O87P27J276J623J281Q64J039J397J274Q63P02O79M18R0P0J61j8k80
56672E8063k07P5J21r9l19n21p84q95o77m61p01j286j673j594j262j022j051j253
56654D4454j271r00m62m46p44p61l96j98l90m96k09Q6P2L4K19K91Rk20k4K52J41
56633C9041j73k42r8qP7K94M86N18O09Q94J073R25P81R61J226J217J069J056J067
56614E0773R25Q30R93J168J071Q99J006J338J620J814J995K080K015J949J930
56599G2406J789J546J451J466J219P01M19N08M14j97q55j113j271j747k347k701
56583G1688k855k873k476j629q74n04n4P84J444J430J250J603K213K394K231K273
$$ plain form
56706 80077 75484 70596 65982 61930 58319 55091 52345 50045 48115 46677 45759 45030 44299 43959 44382 45210
56690 45210 45897 46624 47900 49523 50804 51668 52707 54104 55378 56241 56943 57622 58040 58130 58200 58361 58343 58063
56672 58063 57856 57931 58052 57953 57634 57113 56329 55434 54757 54296 53595 52309 50636 49042 47780 46758 45707 44454
56654 44454 43183 42283 41821 41375 40631 39870 39474 39276 38886 38390 38181 38267 38339 38373 38592 38883 38892 38672 38648 38900 39041
56633 39041 38868 38626 38528 38520 38597 38891 39377 39895 40504 41398 42471 43396 44177 45138 46364 47581 48650 49706 50773
56614 50773 51698 52528 53521 54689 55760 56659 57665 59003 60623 62437 64432 66512 68527 70476 72406
56599 72406 74195 75741 77192 78658 79877 80578 80997 81505 81919 81722 80867 79754 78483 76736 74389 71688
56583 71688 68833 65960 63484 61855 60981 60477 60423 61207 62651 64081 65331 66934 69147 71541 73772 76045
56567G6045K436K223J724J478J539J526J398J396J342Q60J51j95r1l3k95o71r88
56550H9845j263j415j293j015q10p01o18o11o96p11o93r54j462j660j306r47j039
56533G2651j184q78m13k98l12M2N83P67O57P09Q92Q61P34R11J289J430J333J304
56515H1078J275J002O82P13R94J122J082J099J092R83J144J825K451K312J664
56500A00518J285J268J173J084J446K026K087J570J174J217J292J128R32P71M13
56485A19384j02m21m95o25q87j058j114j182j121p74m47n09p27o88o42j097j772
56468A05723j885j358q44o38m45j81j03j66n3J25J0k13o5K68J40m07o41l65j41
56449I8761k50l48k89l79o15n84k90k60n95p70n69l96m57m31k27k31n76q53p92
$$ plain form
56567 76045 78481 80704 82428 83906 85445 86971 88369 89765 91107 91967 92118 91923 91832 91799 91504 90833 89845
56550 89845 88582 87167 85874 84859 84049 83348 82730 82119 81423 80712 80019 79065 77603 75943 74637 73690 72651
56533 72651 71467 70589 70176 69878 69566 69608 70191 70958 71615 72324 73216 74077 74811 75722 77011 78441 79774 81078
56515 81078 82353 83355 84037 84750 85744 86866 87948 89047 90139 91122 92266 94091 96542 98854 100518
56500 100518 101803 103071 104244 105328 106774 108800 110887 112457 113631 114848 116140 117268 118200 118971 119384
56485 119384 119282 118861 118366 117741 116854 115796 114682 113500 112379 111605 111158 110649 109922 109234 108592 107495 105723
56468 105723 103838 102480 101636 100998 100553 100372 100269 100103 100050 100175 100185 99972 99907 100175 100315 99908 99267 98902 98761
56449 98761 98511 98163 97874 97495 96880 96296 96006 95746 95151 94381 93812 93416 92959 92528 92301 92070 91494 90641 89849
56430H9849n76l10J06M82M57K15L01O50O43K25P0M83R63J159J312J544J523J200
56412A00296J055J281J416J146P78O61P71J063J598K135K273K138K217K479K418
56397A23725K025J846J975J924J587J435J524J331P46L42L46L11J00J91P39J217
56381A41364J314J287J134M36o51j329j395j554k124k490k288k009j942j643j013
56366A27097p81j269j680j400r83j102j438j408j154j037r02o16n77r65j242j035
56350A09508p91r09j029q48q01j204j508j200p07o17p39o40m32l21j01K23J24
56333I8008m41o05O6O73L20m40n67r2K29K35K70L27K48L25P79J184J120R61J193
56314A03793J549J606J584J753J728J227Q39J081J350Q55j5l38j29n8j79l0L09
$$ plain form
56430 89849 89273 88963 89069 89551 90008 90223 90524 91174 91817 92042 92112 92595 93558 94717 96029 97573 99096 100296
56412 100296 101351 102632 104048 105194 105972 106633 107404 108467 110065 112200 114473 116611 118828 121307 123725
56397 123725 125750 127596 129571 131495 133082 134517 136041 137372 138118 138460 138806 139117 139217 139408 140147 141364
56381 141364 142678 143965 145099 145535 144884 143555 142160 140606 138482 135992 133704 131695 129753 128110 127097
56366 127097 126316 125047 123367 121967 120984 119882 118444 117036 115882 114845 113943 113327 112750 111785 110543 109508
56350 109508 108717 107808 106779 105931 105130 103926 102418 101218 100511 99894 99155 98515 98083 97762 97661 97884 98008
56333 98008 97567 96962 97028 97701 98021 97581 97014 96922 97151 97386 97656 97983 98231 98556 99335 100519 101639 102600 103793
56314 103793 105342 106948 108532 110285 112013 113240 114079 115160 116510 117365 117350 117012 116883 116825 116646 116616 116925
56297A16925L85K58L03M03K45Q9L50P30P03M60N20P16N63K49L27P02Q37O96O29
56278A26090O34N36N86J071J642J852J924K216K410K109J752J934K346K301J947
56263A51350J882K056K063K109K592L152L188K961L089L353L136K695K745L129
56249A89500L137K859L008L512L558K953K235J557O81l5Q8Q00J119Q27O57R05
56233B17361J097J084J337J955K422K629L061L789M229M173M191M713N485O150
56219B63676O692P118P344P508P874Q452R218J0437J2146J3687J4493J5002J5982
56206C99629J7357J8599J9886K1787K4180K6539K8959L1852L4868L7390L9748
56195G00794M2724M6071M8843N0954N3078N5143N6324N6523N6383N5756N3597
$$ plain form
56297 116925 117310 117568 117871 118274 118519 118608 118958 119688 120391 120851 121371 122087 122650 122899 123226 123928 124765 125461 126090
56278 126090 126724 127260 127846 128917 130559 132411 134335 136551 138961 141070 142822 144756 147102 149403 151350
56263 151350 153232 155288 157351 159460 162052 165204 168392 171353 174442 177795 180931 183626 186371 189500
56249 189500 192637 195496 198504 202016 205574 208527 210762 212319 213000 212965 213053 213853 214972 215799 216456 217361
56233 217361 218458 219542 220879 222834 225256 227885 230946 234735 238964 243137 247328 252041 257526 263676
56219 263676 270368 277486 284830 292338 300212 308664 317882 328319 340465 354152 368645 383647 399629
56206 399629 416986 435585 455471 477258 501438 527977 556936 588788 623656 661046 700794
56195 700794 743518 789589 838432 889386 942464 997607 1053931 1110454 1166837 1222593 1276190
56184A276190M9603M4632L9216L2946K5648J8003J0597L448l311r245j4327j8876
56172A454524k2692k5262k6832k8209k9457l0036l0153l0712l1769l2403l2392
56161A134607l2617l3559l4623l5326l5920l6459l6466l5923l5508l5401l4925
56150G47880l3736l2311l0938k9319k7468k5935k4795k3449k1734k0210j9026
56139D58959j7648j5971j4583j3656j2645j1403j0477r979r280q152p203o778
56127C21184o455n912n311m659l793l110l154l421k811j407m31k78k2Q62J731
56112B83013K123K474L000L190K941K888L257L494L442L613M041M111L890M140
56098C29617M756M673L688K872K739K526J816J320J463J677J700K116L057L770
$$ plain form
56184 1276190 1325793 1370425 1409641 1442587 1468235 1486238 1496835 1500283 1496972 1487727 1473400 1454524
56172 1454524 1431832 1406570 1379738 1351529 1322072 1292036 1261883 1231171 1199402 1166999 1134607
56161 1134607 1101990 1068431 1033808 998482 962562 926103 889637 853714 818206 782805 747880
56150 747880 714144 681833 650895 621576 594108 568173 543378 519929 498195 477985 458959
56139 458959 441311 425340 410757 397101 384456 373053 362576 352597 343317 335165 327962 321184
56127 321184 314729 308817 303506 298847 295054 291944 288790 285369 282558 281151 280720 280442 280420 281282 283013
56112 283013 285136 287610 290610 293800 296741 299629 302886 306380 309822 313435 317476 321587 325477 329617
56098 329617 334373 339046 342734 345606 348345 350871 352687 354007 355470 357147 358847 360963 364020 367790
56084C67790M055M716O033P288Q305R926J2394J4837J6927J9454K2601K5360K7307
56071E46993K9309L1696L3388L3667L3139L2192L0175K7038K4120K2308K0915
56060H64940J9166J7225J4930J1334O476J877j634m882q288j0772j1855j2957
56048H85560j5300j8234k0823k3370k6065k7848k8019k7455k6950k5867k3655
56037F21974k1093j8849j6411j3602j1497j0574r680q073o758o523o419n571m730
56024D82194m639m579l905l324l291k921j792j009j149j047M5J119J491K140L561
56009D62894M508M374M526N667O286N485M851N630O478O102N689O503P480P484
55995E43957P647R037J0349J0303J0071J0914J1719J1394J1275J2556J3713J3233
$$ plain form
56084 367790 371845 376561 382594 389882 398187 408113 420507 435344 452271 471725 494326 519686 546993
56071 546993 576302 607998 641386 675053 708192 740384 770559 797597 821717 844025 864940
56060 864940 884106 901331 916261 927595 934071 935948 934314 929432 921144 910372 898517 885560
56048 885560 870260 852026 831203 807833 781768 753920 725901 698446 671496 645629 621974
56037 621974 600881 582032 565621 552019 540522 529948 520268 512195 505437 498914 492495 486924 482194
56024 482194 477555 472976 469071 465747 462456 459535 457743 456734 455585 454538 454583 455702 457193 459333 462894
56009 462894 467402 471776 476302 481969 488255 493740 498591 504221 510699 516801 522490 528993 536473 543957
55995 543957 551604 560641 570990 581293 591364 602278 613997 625391 636666 649222 662935 676168
55983F76168J2531J3269J4201J3656J2812J3423J4504J4472J4320J5518J6914
55972H31788J6994J7002J8552K0355K0654K0683K2270K4292K4962K5413K7384
55961A070349K9674L0565L1395L4005L6944L8097L8715M0912M3634M5108M6744
55950A486142N0374N4258N6111N7536O0970O5019O7428O9816P4629Q0280Q4371
55939B206934Q8636R5444J02649J07467J12175J20001J28746J34826J40265J48946
55929C386089J59277J67646J75871J87756K01481K13179K24833K40650K58826
55920E215608K75339K92392L14345L38899L61684L85815M16924M52635M87647
55911H541288N25056N71270O24071O78246P38549Q13689R02165R98949J111272
$$ plain form
55983 676168 688699 701968 716169 729825 742637 756060 770564 785036 799356 814874 831788
55972 831788 848782 865784 884336 904691 925345 946028 968298 992590 1017552 1042965 1070349
55961 1070349 1100023 1130588 1161983 1195988 1232932 1271029 1309744 1350656 1394290 1439398 1486142
55950 1486142 1536516 1590774 1646885 1704421 1765391 1830410 1897838 1967654 2042283 2122563 2206934
55939 2206934 2295570 2391014 2493663 2601130 2713305 2833306 2962052 3096878 3237143 3386089
55929 3386089 3545366 3713012 3888883 4076639 4278120 4491299 4716132 4956782 5215608
55920 5215608 5490947 5783339 6097684 6436583 6798267 7184082 7601006 8053641 8541288
55911 8541288 9066344 9637614 10261685 10939931 11678480 12492169 13394334 14393283 15504555
55902A5504555J251796J421493J616983J848420K129010K452476K804228L189403
55894C2218364L624894M112649M653147N275976O016649O870366P808463Q795779
55886G9376287R662232R926535Q919475O293649K454478j601754m925751p103262
55878A03001889q224554q568724q395221p915415p293283o623088n944333n287980
55870D4749291m686185m148510l663815l227521k844940k511536k213121j945099
55862A9508564j712900j514649j340458j187461j059679r53733q59110p72216
55854A0108358o97278o33885n75799n21761m76187m39315m06692l77872l55801
55845E623768l38154l18614k96431k76005k57740k37897k16897j99140j84801
$$ plain form
55902 15504555 16756351 18177844 19794827 21643247 23772257 26224733 29028961 32218364
55894 32218364 35843258 39955907 44609054 49885030 55901679 62772045 70580508 79376287
55886 79376287 89038519 98965054 107884529 114178178 116632656 115030902 110105151 103001889
55878 103001889 94777335 86208611 77813390 69897975 62604692 55981604 50037271 44749291
55870 44749291 40063106 35914596 32250781 29023260 26178320 23666784 21453663 19508564
55862 19508564 17795664 16281015 14940557 13753096 12693417 11739684 10880574 10108358
55854 10108358 9411080 8777195 8201396 7679635 7203448 6764133 6357441 5979569 5623768
55845 5623768 5285614 4967000 4670569 4394564 4136824 3898927 3682030 3482890 3298089
55836C298089j69841j54108j41571j32525j23106j12745j04875r9916r4490q8030
55826B076882q3582q1505p8693p4578p1886p0856o8549o4528o1589o0250n7875
55815A302991n3961n1071m9866m8137m5393m3613m2832m0730l7170l4592l3360
55804H22266l1243k8017k6019k5536k4093k1111j8868j8083j6741j4234j2604
55793E85717j2665j2780j2363j2895j4545j5357j4775j4446j4791j4209j2434
55782D34457j1215j0887r685p278n568n150m338k617j752k439l070k842k981l891
55768C60744m178l567l787n383o577o434o355p203p736p125o478o530o314n348
55754B77729m778n175n389m726m102m077l797k928k466k703k494j403n65n21l05
$$ plain form
55836 3298089 3128248 2974140 2832569 2700044 2576938 2464193 2359318 2259402 2164912 2076882
55826 2076882 1993300 1911795 1833102 1758524 1686638 1615782 1547233 1482705 1421116 1360866 1302991
55815 1302991 1249030 1197959 1148093 1099956 1054563 1010950 968118 927388 890218 855626 822266
55804 822266 791023 763006 736987 711451 687358 666247 647379 629296 612555 598321 585717
55793 585717 573052 560272 547909 535014 520469 505112 490337 475891 461100 446891 434457
55782 434457 423242 412355 402670 395392 389824 384674 380336 377719 375967 373528 370458 367616 364635 360744
55768 360744 356566 352999 349212 343829 337252 330818 324463 317260 309524 302399 295921 289391 283077 277729
55754 277729 272951 267776 262387 257661 253559 249482 245685 242757 240291 237588 235094 233691 233126 232605 232300
55739B32300M75P52M6o00n89p24j400j812j725k068l015l472l186l319m196m568
55723B02899l888l269l331l226k555k222k468k181j103o30j447k392k654l076
55709A68457m126m676m013l197l190l330k891k406k351k106j376j006j312j272
55695A31205m35Mq19j975k398k428k592k469j926j921k870l643l368k811k800
55680I8754k766k086j448j582j896j637j218j183j075m78n3l54p37n39l10p22
55664H0670j330j442j256j178r97o07n22q71r41n06m10j006j356p98j03o6k44
55647F7037m3J89J47L93J151J562J118O34P52P73N9o28m58K8N6K9N81J201J139
55628G5720P54P63J020J128J366J900K022J262L71J29J43j79m58k18K1l22q28
$$ plain form
55739 232300 232775 233527 233573 232973 232384 231660 230260 228448 226723 224655 221640 218168 214982 211663 207467 202899
55723 202899 199011 195742 192411 189185 186630 184408 181940 179759 178656 178026 176579 174187 171533 168457
55709 168457 164331 159655 155642 152445 149255 145925 143034 140628 138277 136171 134795 133789 132477 131205
55695 131205 130770 130774 129955 127980 125582 123154 120562 118093 116167 114246 111376 107733 104365 101554 98754
55680 98754 95988 93902 92454 90872 88976 87339 86121 84938 83863 83385 83332 82978 82241 81702 81392 80670
55664 80670 79340 77898 76642 75464 74467 73860 73338 72467 71526 71020 70610 69604 68248 67450 67347 67281 67037
55647 67037 66994 67183 67330 67723 68874 70436 71554 72188 72940 73713 73772 73144 72686 72714 72770 72799 73380 74581 75720
55628 75720 76474 77237 78257 79385 80751 82651 84673 85935 86306 86435 86578 86399 85941 85723 85744 85422 84594
55611H4594r77j117j513j482o28J66J02k15l6J43k55n03J85J047R39K46N8K85
55593H1039J70o9K71Q33O96j7m60n49p86j053r30q14j348k134k261j757j367j247
55575F8217j105j115j581k049j940j615j747k088j981j572j404j318r66p96j312
55560D5628j860j512o47l24n66n96l91n31q56o99k49k67o31n57r7l2m15m99j51
55541C4748K7n7J43N93N65q6o49o63m18k09k9J5j91k78Q1M21Q5n99p51l09K9M7
55519C2515J39L10J80r3L6M46M98J75J02M26O56O44P30Q96P59L98L48O41P68N66
55499D1140L16P5l10o33o05n32q67j289j178p41o83r55r43o54o08o74l06K13M2
55480C0808o44p23Q8Q02P89N80O68P25M65K83M67O27M35J53P0R2J42K83K95j64
$$ plain form
55611 84594 83617 82500 80987 79505 78877 79043 79145 78930 78894 79037 78782 78279 78464 79511 80450 80696 80754 81039
55593 81039 81209 81140 81411 82244 82940 82923 82463 81914 81128 80075 79145 78331 76983 74849 72588 70831 69464 68217
55575 68217 67112 65997 64416 62367 60427 58812 57065 54977 52996 51424 50020 48702 47736 46940 45628
55560 45628 43768 42256 41609 41285 40719 40123 39732 39201 38345 37646 37397 37130 36499 35942 35845 35813 35398 34899 34748
55541 34748 34775 34718 34861 35454 36019 35933 35284 34621 34203 33994 33965 33980 33789 33511 33592 34013 34098 33499 32748 32439 32468 32515
55519 32515 32654 32964 33144 33051 33087 33533 34031 34206 34308 34734 35390 36034 36764 37660 38419 38817 39165 39806 40574 41140
55499 41140 41456 41531 41221 40588 39983 39451 38584 37295 36117 35376 34693 33738 32795 32141 31533 30859 30553 30766 30808
55480 30808 30164 29441 29529 30331 31120 31700 32368 33093 33558 33841 34308 34935 35370 35523 35593 35685 35827 36110 36405 36241
55460C6241p94q38k24L18M00L75M39K45k70n46k90O3R8p4k96o72j075j074o63
55441C1363m29o63r62r53q15q01q52q78r25q91o07k76k41l67k66j25m90j217j513
55422A8092j149p41o67o00l37k49n01o54m19j12j9J7J09O9r2oM13P60Q31Q35P55
55401A6335K47n79j035q31m92m86o12n75n05n32m45j42J07J37J10P0j56m27l14
55382I875J24K97Qk85l51n26q39o74K24J072J027L20j97j49J74L71K59j13m45
55363A0172m27j49N5J60L98O58N21L3k54j13R8J50K22L64L43K31M14Q23R06N85
55343A5190M17N52M31j75o70o58n85q33r95o32q7J41J68K87L65K27J61M07O16
55324A4327L95n9l59m87n20k89J55K91j63p27q42n79k38K25P88R74M71k51n55
$$ plain form
55460 36241 35447 34609 34385 34703 35103 35478 35917 36162 35892 35346 35056 35119 35217 35143 34847 34175 33100 32026 31363
55441 31363 30934 30271 29309 28356 27541 26740 25888 25010 24085 23194 22587 22311 22070 21703 21437 21312 20822 19605 18092
55422 18092 16943 16202 15535 14935 14598 14349 13848 13194 12775 12663 12644 12661 12770 12839 12747 12741 13154 13914 14745 15580 16335
55401 16335 16582 16003 14968 14137 13645 13159 12547 11972 11467 10935 10490 10348 10455 10592 10702 10772 10616 10189 9875
55382 9875 9999 10296 10304 10019 9668 9142 8303 7629 7853 8925 9952 10272 10075 9926 10100 10471 10730 10617 10172
55363 10172 9745 9596 9651 9811 10209 10867 11388 11421 11167 11054 11152 11302 11524 11888 12231 12462 12876 13699 14605 15190
55343 15190 15607 16159 16590 16415 15745 15087 14502 13669 12674 12042 11955 12096 12264 12551 12916 13143 13304 13711 14327
55324 14327 14722 14663 14304 13817 13297 13008 13163 13454 13291 12564 11722 11143 10905 11130 11918 12892 13363 13112 12557
55305A2557m76m45n24n17m52m13k24K12N72N58L69K73J50j38l13j42J14J12nK0
55285A1288O4p3k62l51n09p64p53l44m2k32m96l26Qj8k23r0K61K88l5k13q9jj44
55262F944l57n11n72l64J95P48Q23M45K9j90k18j2L84O50N75M37N57O87L55l53
55242A0252q81r43o83k51K63O17O04L91K41O5l12o29m67N1M12M75N44P51Q43O92
55222A2035M91L59J75j31m41o54p36n59m4N32O92L10k63o42p21n51j93K33N10
55203A0402M78J23l68o39m11K13P52Q29M94M2k65k61M9L61L13jj31J2j5m12o84
55182A0881l48K94N99M57K38J25J6j06j55k20m28o05m72j09J09j5l31n93n95k37
55162H505L29O84N75J98r8k40l35l31j07K57N14N24L19J5k11k22j03p5j47j05
$$ plain form
55305 12557 12081 11636 11112 10595 10143 9730 9506 9718 10290 10848 11217 11490 11640 11502 11189 11047 11161 11273 11268 11288
55285 11288 11352 11279 11017 10666 10157 9393 8640 8296 8254 8022 7526 7200 7208 7190 6967 6877 7138 7426 7391 7178 7089 7088 6944
55262 6944 6587 6076 5504 5140 5335 6083 6906 7351 7380 7190 6972 6960 7344 7994 8569 9006 9563 10250 10605 10252
55242 10252 9371 8428 7745 7494 7757 8374 8978 9369 9610 9675 9363 8734 8267 8318 8730 9205 9749 10500 11343 12035
55222 12035 12526 12885 13060 12929 12488 11834 11098 10539 10495 11027 11719 12029 11766 11124 10403 9852 9659 9892 10402
55203 10402 10880 11003 10635 9996 9585 9798 10550 11379 11873 11915 11650 11389 11438 11799 12112 12111 11980 11992 11977 11565 10881
55182 10881 10533 10827 11426 11883 12121 12246 12262 12156 12001 11781 11353 10748 10276 10167 10276 10261 9930 9337 8742 8505
55162 8505 8834 9518 10093 10291 10193 9953 9618 9287 9180 9437 9951 10475 10794 10809 10598 10376 10273 10198 10051 9946
55142I946R8K66K90K44J19j66l77j41L86N43R0m71o97p10o81m37j3J16j96l67
55122G842K0N50P04O67P66P47L21j05l3K39J74m3Q0L69K94mJ9K70J91j57j37K73
55100A3047L44k30q20p87k91J22J86j7k85m05l38k90l36j77L43P63N88J15PK35
55080A1774K04j53k12K95Q15Q02L74r5m99q04p88l18L74Q93J013P63L57R2Q2J39
55060A5108J05J23L06M37K77J3m0M2K3K3K78O11O58M89M46N14L82N1j66j62p4
55039A9444Q4K89K46k49p41o27n4K85J82P8K24L89M33M55L72l9n69o76k48K88
55019A9566O37Q48Q51M63p8k61p1n6m66r16j018p53j74O62J331J271N74m5j82
55000B2183j27j95k92l00k97k39LK14K3l71l57J10L71J25j60j01L6j2l3J36K11
$$ plain form
55142 9946 10044 10310 10600 10844 10963 10797 10420 10279 10665 11208 11298 10827 10130 9420 8739 8302 8289 8405 8209 7842
55122 7842 7862 8412 9116 9783 10549 11296 11617 11512 11479 11718 11892 11849 11929 12298 12592 12588 12607 12877 13068 12911 12774 13047
55100 13047 13391 13161 12341 11554 11263 11385 11571 11554 11269 10864 10526 10236 9900 9723 10066 10829 11417 11532 11539 11774
55080 11774 11978 11825 11613 11908 12723 13525 13899 13804 13305 12501 11713 11395 11769 12662 13675 14438 14795 14887 14969 15108
55060 15108 15213 15336 15642 16079 16356 16369 16329 16371 16394 16417 16695 17306 17964 18453 18899 19413 19795 19846 19680 19518 19444
55039 19444 19528 19817 20063 19814 19073 18446 18392 18677 18859 18937 19161 19550 19983 20438 20810 20771 20202 19526 19278 19566
55019 19566 20203 21051 21902 22365 22287 22026 21955 21899 21433 20517 19499 18746 18572 19234 20565 21836 22410 22365 22183
55000 22183 22056 21861 21569 21269 20972 20733 20736 20950 20973 20602 20245 20355 20726 20851 20691 20590 20626 20614 20581 20717 20928
54979B0928N6K0K95N08L31Lj76l42o06o36k01L02M03K13J13J23Q0N9J85K96K15
54958B2169O6j0j62m78o22k60L89Q12Q27O11L52J76K07M13N24L83J71R3R6K3j20
54937B5660k77m18m03n5M35N94K97k0lJ41O0k04m20n68p19p81o54m30k00N5K85
54916B2375L48L49N42Q44P71J72m42n92l96j90RL10N62N92N25N72P05Q61J104
54897B9021J362J348J018P76R01J163J299J470J842K158K193K274K823L646M209
54882E7503M383M441M430M112L432K621J814R14j75j395k611l585m037l898l476
54867F4473l146l003k925k817k643k375k083j866j636j237q20p19q59p18j17M59
54851C7968O00N44O73Q89R50J044J456J954K091J918J919K289K803L261L613L684
$$ plain form
54979 20928 20984 21004 21299 21807 22138 22141 21965 21623 21017 20381 20180 20482 20885 21098 21211 21334 21414 21473 21658 21954 22169
54958 22169 22235 22225 22063 21585 20963 20703 21092 21904 22731 23342 23694 23870 24077 24490 25014 25397 25568 25661 25757 25780 25660
54937 25660 25383 24965 24562 24507 24942 25536 25833 25813 25810 25951 26011 25807 25387 24819 24100 23319 22665 22235 22035 22090 22375
54916 22375 22723 23072 23614 24458 25229 25401 24959 24367 23971 23781 23790 24100 24662 25254 25779 26351 27056 27917 29021
54897 29021 30383 31731 32749 33525 34426 35589 36888 38358 40200 42358 44551 46825 49648 53294 57503
54882 57503 61886 66327 70757 74869 78301 80922 82736 83650 83475 82080 79469 75884 71847 67949 64473
54867 64473 61327 58324 55399 52582 49939 47564 45481 43615 41979 40742 39922 39203 38344 37626 37509 37968
54851 37968 38568 39112 39785 40674 41624 42668 44124 46078 48169 50087 52006 54295 57098 60359 63972 67656
54835F7656L236K371J474P10j19j134k104k713k955l123l421l700l646l227k811
54820D6494k641k489k092j743j905k338k253j440o01l33m22m10l11l17k99j12
54804B6788L9k6r4J5N5j91m25l13r1j45l59l71k21j90k47j97j46l06m98m21k30
54783B2426l52p84j085j003o95l58j00n0k05k74k0L48M59L29K14J55kk14k83j75
54763A8331J8K70M80L82n6l47o3N58R77J062J021Q95O18M12N21P20O18L03J88
54744B6908L39N07P01J151J741K048J978J838J777J674J537J600J921K352K864
54729E0936L544M228M634M765M793M580L788K482J142J19n81r80j105j223j620
54714G9502k154k444k500k620k754k519j931j504j494j567j376j025p31m78j89
$$ plain form
54835 67656 70892 73263 74737 75447 75328 74194 72090 69377 66422 63299 59878 56178 52532 49305 46494
54820 46494 43853 41364 39272 37529 35624 33286 31033 29593 28992 28659 28237 27827 27516 27199 26900 26788
54804 26788 26827 26801 26707 26722 26777 26586 26161 25848 25757 25612 25253 24882 24661 24471 24224 24027 23881 23575 23077 22656 22426
54783 22426 22074 21290 20205 19202 18507 18149 18049 17999 17794 17520 17500 17848 18307 18636 18850 19005 19003 18789 18506 18331
54763 18331 18349 18619 19099 19481 19425 19078 19015 19573 20550 21612 22633 23528 24146 24558 25079 25799 26417 26720 26908
54744 26908 27247 27754 28455 29606 31347 33395 35373 37211 38988 40662 42199 43799 45720 48072 50936
54729 50936 54480 58708 63342 68107 72900 77480 81268 83750 84892 85011 84430 83450 82345 81122 79502
54714 79502 77348 74904 72404 69784 67030 64511 62580 61076 59582 58015 56639 55614 54883 54405 54216
54699E4216N1K12L97O30P86Q30Q91J024J217J568K154K730K983L063L428M107
54683H0287M585M525M147L788L467L038K405J444O8j515k868l745m203m345m273
54668H6805m270m516m699m336l571l087l120l121k631j945j609j668j761j620
54654D4851j211o73l28m48q24r09n36j28J9J48M70O05J43o06r38o65k14M9J67
54635C8972K23O6m14r58j117o79J27Q21J057Q46M65J48n9k22l80m86m36k08P4
54616C7840K17K20K69M56O36P19Q00Q89P55L70J69M87R70J004O11L74N59Q67J048
54597D9260J239J485J515J158O43K38k7j23J41P53J272J269Q07L26K01N13J081
54580F1751J578J756J647J478J363J328J505K087K946L651L843L502K837K162
$$ plain form
54699 54216 54267 54479 54876 55506 56292 57122 58013 59037 60254 61822 63976 66706 69689 72752 76180 80287
54683 80287 84872 89397 93544 97332 100799 103837 106242 107686 107754 106239 103371 99626 95423 91078 86805
54668 86805 82535 78019 73320 68984 65413 62326 59206 56085 53454 51509 49900 48232 46471 44851
54654 44851 43640 42967 42639 42191 41367 40458 39922 39794 39813 39961 40431 41036 41179 40573 39635 38970 38756 38805 38972
54635 38972 39195 39261 38847 37889 36772 36093 36220 37041 38098 38944 39409 39557 39498 39276 38896 38410 37974 37766 37840
54616 37840 38057 38277 38546 39002 39638 40357 41157 42046 42801 43171 43340 43827 44797 45801 46412 46786 47345 48212 49260
54597 49260 50499 51984 53499 54657 55300 55538 55511 55388 55529 56282 57554 58823 59630 59956 60157 60670 61751
54580 61751 63329 65085 66732 68210 69573 70901 72406 74493 77439 81090 84933 88435 91272 93434
54566I3434J801J823J828J289J34j265k568l618m224m256l938l646l388k900k248
54551F8258j872j901j927j606j110p76o64o48o42n59l34j02j10m00p52r89j054
54534E2812q88n70m71q82j479j680j432j170j041q27n92p04j102j258j070j056
54518C6590j402j545j127o10m77m75j75K26L28J96R2o3l89n88m40l31o73j095
54500B8042r46l04J69K33K11K30O7k31k46J28M58M16K21J51J05j51n13o34l66
54481B7040O8L57M36N12P65J038J003O13K31K04M85Q01R98J059J013R78J114J375
54463D0090J497J410J422J733K039J887J268N90J64l9k22n76j168j803k149k122
54447D4021j993j972j876j508j068r15j052j144r93p03m68l89m55n29m19j26R5
$$ plain form
54566 93434 95235 97058 98886 100175 100309 99044 96476 92858 88634 84378 80440 76794 73406 70506 68258
54551 68258 66386 64485 62558 60952 59842 59066 58402 57754 57112 56553 56219 56117 56007 55607 54855 53866 52812
54534 52812 51924 51354 50883 50001 48522 46842 45410 44240 43199 42372 41780 41076 39974 38716 37646 36590
54518 36590 35188 33643 32516 31906 31429 30954 30779 31005 31333 31529 31621 31558 31169 30581 30141 29810 29137 28042
54500 28042 27096 26792 26961 27194 27405 27635 27702 27471 27225 27353 27811 28227 28448 28599 28704 28553 28040 27406 27040
54481 27040 27108 27465 27901 28413 29178 30216 31219 31832 32063 32267 32752 33553 34551 35610 36623 37601 38715 40090
54463 40090 41587 42997 44419 46152 48191 50078 51346 51936 52100 52061 51839 51263 50095 48292 46143 44021
54447 44021 42028 40056 38180 36672 35604 34689 33637 32493 31500 30797 30329 29940 29485 28956 28537 28411 28506
54430B8506O7p9j33j15j54k57l04k12P9N53R34Q35K60k91m07k16k8J57M55P13
54410C0363O87M39K15P1j02k37j77L6J87K31K84L66L64K07m8k91l92l18k52m01
54390C1232o27n70k66j93m97o29j91L50K65l59q03p69o16o02n75m50m25n20m17
54371B3338qL19K33j6J0K75L19l5m23m13n5K31J95j1j39j37m2J84N28P33O23M39
54349B6148N05O91N69J91J21O11J204J405J244R89P02M27L80N95P38O29N87R20
54331C8656J409J678J759J834J788J482J127R42P12K04k86l84l36o62j277j616
54315D7030j506j280j092p81m18l61o61r32r29q02p32p01p02p33n99j23M22N59
54297C5659K93J03J81J99m6l02l40k99l18k19J29N07O34N54M91N00N22N58O54
$$ plain form
54430 28506 28573 28494 28361 28246 28092 27835 27531 27319 27398 27951 28885 29720 29980 29689 29282 29066 29038 29195 29650 30363
54410 30363 31050 31489 31704 31775 31673 31436 31259 31295 31482 31713 31997 32363 32727 32934 32886 32595 32203 31885 31633 31232
54390 31232 30605 30035 29769 29576 29079 28450 28259 28609 28874 28515 27712 26943 26327 25725 25150 24700 24275 23755 23338
54371 23338 23330 23649 23882 23866 23876 24151 24470 24435 24012 23599 23544 23775 23970 23959 23820 23683 23641 23825 24353 25086 25709 26148
54349 26148 26653 27344 27913 28104 28225 28836 30040 31445 32689 33678 34380 34807 35187 35782 36520 37149 37736 38656
54331 38656 40065 41743 43502 45336 47124 48606 49733 50675 51387 51591 51305 50921 50585 49923 48646 47030
54315 47030 45524 44244 43152 42371 41953 41592 40931 39999 39070 38268 37536 36835 36133 35400 34801 34678 35100 35659
54297 35659 35952 36055 36236 36435 36389 36087 35747 35448 35130 34911 35040 35547 36181 36735 37226 37726 38248 38806 39460
54278C9460P89R04R30P91N02L06M35P58Q82O25K22j2k3K6m3l02o54q93r39r44
54258D2820j036j097r76q21q93j190j504j738j840j604r04p6L21J44k54n42o77
54241B8133o72n29l83m12n48n55m44m37n58n58l44j22m7j5R9K45L25L21K54J47
54221B3900M5o7k77n27n74l43j15j28k14j52j27l77o66n74j65J36J99K00J40r1
54201B0223k84j34J74J79o2m2L48O36N42L01J34nq0P3K90K19m0pL44N00K99J80
54179B3788L26K84j85o03n21j77N1K69O22P75L77l14p92r32q80o44k56L1R4J61
54159B1474L58M01J58NK41N29M84L39M59O08L22k45n31m07k19j05P2K35J46n7
54139B4267K6L77N24K55q6j50j4R2J04M4j05k66k75j38r4l05o26p57n39p4L87
$$ plain form
54278 39460 40249 41153 42083 42874 43376 43682 44117 44875 45757 46382 46604 46592 46569 46595 46552 46250 45596 44703 43764 42820
54258 42820 41784 40687 39711 38890 37997 36807 35303 33565 31725 30121 29217 29141 29462 29606 29352 28810 28133
54241 28133 27461 26932 26549 26137 25589 25034 24590 24153 23595 23037 22693 22571 22524 22509 22608 22853 23178 23499 23753 23900
54221 23900 23945 23878 23601 23074 22500 22157 22042 21914 21700 21548 21421 21044 20378 19804 19639 19775 19974 20174 20314 20223
54201 20223 19939 19805 19979 20158 20096 20054 20402 21038 21580 21881 22015 22010 21930 22003 22293 22512 22472 22465 22809 23309 23608 23788
54179 23788 24114 24398 24213 23610 23089 22912 22963 23232 23854 24629 25006 24692 23900 22968 22088 21444 21188 21219 21313 21474
54159 21474 21832 22233 22391 22396 22637 23166 23650 23989 24448 25056 25378 25133 24602 24195 23976 23871 23943 24178 24324 24267
54139 24267 24293 24670 25194 25449 25363 25213 25199 25291 25395 25439 25334 25068 24793 24655 24561 24256 23630 22873 22334 22260 22647
54118B2647O08N67M25L06J35k16o87j026r73m65K20N55K64k92m49o9L33L34J38
54099B2355J39L24L79J97o1k15j76N4K75K26l3j39PK5l35p11o03r9L00L57K17
54078B2483L4j48k31j43l0m9q0M6K02J11k06m54m67l34j93j40k19l25k38L1J43
54057A9793m7k16q5O8j11l44p1N73Q19K96m57p21l79J62N05M90K15KJ15M68O91
54036B1766N98L61J77L9j17k38k40j29L2J56J56J1j61k19j13J44N19Q13O83P5
54016B4313n29n61n9L66K51k66o64n52J4N46N58R6k41rN19P75O39M40L39J66j04
53995B6037k02M3M48P30P93O76M65L38M39O67P62O48M86L71K24M1oK08N98J007
53975C4773J350J537J502J321J238J383J663J898J988J917J742J566J464J413
$$ plain form
54118 22647 23255 23822 24247 24553 24688 24472 23785 22759 21786 21321 21541 22096 22360 22068 21619 21550 21883 22217 22355
54099 22355 22494 22818 23197 23394 23333 23118 22942 22996 23271 23497 23464 23325 23332 23357 23022 22311 21708 21609 21909 22266 22483
54078 22483 22517 22369 22138 21995 21965 21916 21836 21882 22084 22195 21989 21535 21068 20734 20541 20401 20182 19857 19619 19650 19793
54057 19793 19746 19530 19445 19513 19402 19058 18987 19560 20379 20675 20218 19497 19118 19280 19785 20275 20490 20492 20607 21075 21766
54036 21766 22364 22725 22902 22941 22824 22586 22346 22217 22249 22405 22561 22572 22411 22192 22079 22223 22742 23555 24238 24313
54016 24313 23784 23223 23164 23530 23781 23515 22851 22299 22313 22859 23417 23513 23272 23263 23782 24557 25196 25636 25975 26141 26037
53995 26037 25835 25878 26326 27056 27849 28525 28990 29328 29767 30434 31196 31844 32330 32701 32925 32966 32960 33168 33766 34773
53975 34773 36123 37660 39162 40483 41721 43104 44767 46665 48653 50570 52312 53878 55342 56755
53961E6755J413J513J683J723J533J315J297J347J170P79M71L50K41O4lJ24K38
53944G2013J24j88n73r75j307j349r95m60j03l5j01j83l92q46j378j617j442j181
53926E9012j214j424j377r77o03n35n64m61l64m72o30o14n68p00p76m23J87M58
53908D7955J51l65o71o40k90K54O21M66J2j25K43O15N58K92K57M52N66N24N48
53889E1423P46R32Q72N81K91K20L93O60R07J122J253J181R80R74J317J671J617
53872F7140J243R73R88J153J383J645J677J202M84J14J88J97j27l66q0N77J161
53855G9552J492J616J547J383J351J465J422J102Q88J142J642J902J833J744J787
53840A01868J803J632J284Q12K43l45q10j046r85p18n71q56j437j808j728j484
$$ plain form
53961 56755 58168 59681 61364 63087 64620 65935 67232 68579 69749 70528 70999 71349 71590 71654 71651 71775 72013
53944 72013 72137 71949 71376 70401 69094 67745 66750 66290 66187 66152 66051 65868 65476 64630 63252 61635 60193 59012
53926 59012 57798 56374 54997 54020 53417 52882 52318 51857 51493 51021 50391 49777 49209 48509 47733 47310 47497 47955
53908 47955 48106 47741 47070 46430 46140 46394 47015 47481 47493 47368 47611 48226 48784 49076 49333 49785 50351 50875 51423
53889 51423 52169 53101 53973 54554 54845 55065 55458 56118 57025 58147 59400 60581 61561 62535 63852 65523 67140
53872 67140 68383 69356 70344 71497 72880 74525 76202 77404 77888 78002 78190 78387 78260 77894 77814 78391 79552
53855 79552 81044 82660 84207 85590 86941 88406 89828 90930 91818 92960 94602 96504 98337 100081 101868
53840 101868 103671 105303 106587 107399 107642 107297 106487 105441 104456 103738 103167 102311 100874 99066 97338 95854
53824I5854j403j432j459j642k077k408k298j991j976k214k252j977j756j786
53810F9183j822j629j326j082r23r17j256j865k288k221j874j599j394j054o20
53795D7313l44k81k42j47j27k96n48o93o43m80l98n68r20j110r14n39m07n68o26
53776C7462l01J54L40K44J56K05K58K28J81J26k0k01k37j14l6j07j72j20j21l29
53756C7596n53m64k2N04Q42R14Q08O84O78P51P27O12O62R96J320J287R94Q24R04
53737E0064J030J086J232J601K061K348K267J769J008L48Q0J49K84L69N20P94
53721F7010J078J217J109P06J20l25m20l47m17n88n77l74l06n20p82q69q49q45
53703F4021q38p76p20p00o61o12n80m87k45p6k96q13j131j010p12n20l85k65l46
$$ plain form
53824 95854 94451 93019 91560 89918 87841 85433 83135 81144 79168 76954 74702 72725 70969 69183
53810 69183 67361 65732 64406 63324 62401 61484 60228 58363 56075 53854 51980 50381 48987 47933 47313
53795 47313 46969 46688 46446 46299 46172 45876 45328 44635 43992 43512 43114 42546 41626 40516 39602 39063 38656 38088 37462
53776 37462 37161 37315 37655 37899 38055 38260 38518 38746 38927 39053 39033 38832 38595 38481 38445 38338 38166 38046 37925 37596
53756 37596 37043 36579 36557 37061 37903 38817 39625 40309 40987 41738 42465 43077 43739 44735 46055 47342 48336 49160 50064
53737 50064 51094 52180 53412 55013 57074 59422 61689 63458 64466 64814 64894 65043 65327 65696 66216 67010
53721 67010 68088 69305 70414 71120 71240 70915 70495 70148 69731 69143 68566 68192 67886 67366 66584 65715 64866 64021
53703 64021 63183 62407 61687 60987 60326 59714 59134 58647 58402 58326 58030 57217 56086 55076 54364 53844 53459 53194 52848
53684E2848o01n93m7O13P63L93M8L9J67J87J59K66N33Q25R57Q28N22L15L62M84
53664E9068L32j72p19q93n41O0L81J01n07p94m31K65P90R72R33P62M75K04J08
53645F0394J58J99J84J68J05q8l14l03K0M40O89P44P90R27J018Q70N36K94K93
53626F7124L42K22J09L82J009J446J285P52M06M97Q22J036R76P37N43N31N76M74
53608G9269K66J77K30J46k11n97p08n60l57j96r7r6j80k32k51l93o85q84q35p06
53588G3100o57n56k89p2j00j46P3L54K74q7k38NL35N28P09R04Q53M57Q6R9L51
53567G5983M76M38N19Q35J133J099O91J80n6J84P48J248J419J322J201J152J070
53550H9642Q40N85N74R29J398J541J227Q49R08J435J963K086J882J660J536J397
$$ plain form
53684 52848 52247 51654 51607 52220 52983 53376 53424 53463 53630 53817 53976 54242 54775 55600 56557 57385 57907 58222 58584 59068
53664 59068 59400 59228 58509 57616 57075 57135 57516 57617 57110 56316 55885 56150 56940 57912 58845 59607 60082 60286 60394
53645 60394 60552 60751 60935 61103 61208 61120 60806 60503 60523 60963 61652 62396 63186 64113 65131 66001 66537 66831 67124
53626 67124 67466 67688 67797 68179 69188 70634 71919 72671 73077 73574 74396 75432 76408 77145 77688 78219 78795 79269
53608 79269 79535 79712 79942 80088 79877 79280 78572 78012 77655 77459 77362 77266 77086 76854 76603 76210 75525 74641 73806 73100
53588 73100 72443 71887 71598 71526 71426 71280 71353 71707 71981 71894 71656 71661 71996 72524 73233 74137 74990 75447 75533 75632 75983
53567 75983 76459 76897 77416 78251 79384 80483 81174 81354 81298 81482 82230 83478 84897 86219 87420 88572 89642
53550 89642 90482 91067 91641 92570 93968 95509 96736 97585 98493 99928 101891 103977 105859 107519 109055 110452
53534A10452J261J315J622J895J841J511J199J028Q92P65P92R74J036P84L80J13
53518A27860M0R2L41Q03J144J009N30K22L00M61L84Q6k60n54o79m94p2L45O63
53499A32221R55J125R73O81P69J309J672J376Q25P31J155J564J659J615J628J664
53483A51922J675J716J820J991K282K664K912K911K909L186L554L567L192K888
53469A89189K988L302L459L333L057K815K749K944L392L975M513M799M725M447
53455B39687M318M543N016N512N931O221O314O293O385O648O865O981P299P972
53441C25985Q625Q836Q809R027R506R800R752R650R663R586R296R017R002R176
53427D55730R281R170Q879Q574Q421Q378Q208P861P711Q053Q539Q549Q047P552
$$ plain form
53534 110452 111713 113028 114650 116545 118386 119897 121096 122124 123016 123781 124573 125547 126583 127367 127747 127860
53518 127860 127900 127992 128333 129136 130280 131289 131819 132041 132341 132802 133186 133272 133012 132458 131779 131285 131213 131558 132221
53499 132221 133176 134301 135274 135955 136724 138033 139705 141081 141906 142637 143792 145356 147015 148630 150258 151922
53483 151922 153597 155313 157133 159124 161406 164070 166982 169893 172802 175988 179542 183109 186301 189189
53469 189189 192177 195479 198938 202271 205328 208143 210892 213836 217228 221203 225716 230515 235240 239687
53455 239687 244005 248548 253564 259076 265007 271228 277542 283835 290220 296868 303733 310714 318013 325985
53441 325985 334610 343446 352255 361282 370788 380588 390340 399990 409653 419239 428535 437552 446554 455730
53427 455730 465011 474181 483060 491634 500055 508433 516641 524502 532213 540266 548805 557354 565401 572953
53413E72953P307O974O339N761N628N742N596N005M195L417K769K294J993J770
53399F37743J478J010L18n92j643k756l851m720n042m806m563m909n724o327o438
53384E89178o507o933p437p535p333p361p814q295q386q114p808p652p512p146
53370D83345o498n753n145m714m314l816l252k779k553k523k350j743r22n22p85
53355D35676j098o83M38J538K128K399K689L086L587M291N142N826O151O294O568
53340D84032P061P702Q423R160R822J0368J0819J1163J1454J1920J2717J3630
53328F08271J4308J4771J5339J6040J6495J6512J6349J6275J6259J6298J6608
53317G83525J7149J7383J6852J5823J4936J4441J4084J3577J2889J2106J1309
$$ plain form
53413 572953 580260 587234 593573 599334 604962 610704 616300 621305 625500 628917 631686 633980 635973 637743
53399 637743 639221 640231 640549 639957 638314 635558 631707 626987 621945 617139 612576 607667 601943 595616 589178
53384 589178 582671 575738 568301 560766 553433 546072 538258 529963 521577 513463 505655 498003 490491 483345
53370 483345 476847 471094 465949 461235 456921 453105 449853 447074 444521 441998 439648 437905 436983 436461 435676
53355 435676 434578 433895 434333 435871 437999 440398 443087 446173 449760 454051 459193 465019 471170 477464 484032
53340 484032 491093 498795 507218 516378 526200 536568 547387 558550 570004 581924 594641 608271
53328 608271 622579 637350 652689 668729 685224 701736 718085 734360 750619 766917 783525
53317 783525 800674 818057 834909 850732 865668 880109 894193 907770 920659 932765 944074
53306I44074J0478R424P945O185M587L329K077N19j110k448l659n228p154q861
53292I60158j0005j0892j1974j3186j4067j4362j4277j4158j4094j3976j3815
53281H15352j3831j4141j4469j4418j3925j3264j2629j2006j1496j1377j1671
53270F72125j1938j1731j1096j0394r830r370q948q554q157p730p249o602n640
53257E54886m496l633l363l480l576l546l580l768l988m087m007l753l449l262
53243E02898l182k962k462j832j230n84J33O79Q93J069J594K356K928L269L757
53228E07324M569N428O067O521O861O993O965P115P675Q391Q757Q564Q055P613
53214F06898P422P405P338P036O505N836N049M114L090K110J229L95l54q82j164
$$ plain form
53306 944074 954552 963976 971921 978106 982693 986022 988099 988618 987508 985060 981401 976173 969019 960158
53292 960158 950153 939261 927287 914101 900034 885672 871395 857237 843143 829167 815352
53281 815352 801521 787380 772911 758493 744568 731304 718675 706669 695173 683796 672125
53270 672125 660187 648456 637360 626966 617136 607766 598818 590264 582107 574377 567128 560526 554886
53257 554886 550390 546757 543394 539914 536338 532792 529212 525444 521456 517369 513362 509609 506160 502898
53243 502898 499716 496754 494292 492460 491230 490646 490779 491458 492351 493420 495014 497370 500298 503567 507324
53228 507324 511893 517321 523388 529909 536770 543763 550728 557843 565518 573909 582666 591230 599285 606898
53214 606898 614320 621725 629063 636099 642604 648440 653489 657603 660693 662803 664032 664427 664073 663191 662027
53199F62027j435j996k888l799m350m480m573n090o049o970p401p409p397p549
53185E90641p717p770p763p726p568p292p099p099p050o660o042n632n635n754
53171D93834n567n038m474m104l851l562l214k884k597k402k409k644k875k814
53157D45399k458k094j942j981k091k235k418k680l112l745m402m799m875m842
53143D01725m898n051n238n391n382n149m892m880n016m926m602m505m867n273
53129C31655n329n285n627o272o667o593o329o136o004n967o153o457o492o115
53115B46229n650n471n584n743n796n720n490n093m622m262m194m453m811m866
53101A74474m397l647l086k894k892k898k959l155l406l560l537l334l011k712
$$ plain form
53199 662027 660592 658596 655708 651909 647559 643079 638506 633416 627367 620397 612996 605587 598190 590641
53185 590641 582924 575154 567391 559665 552097 544805 537706 530607 523557 516897 510855 505223 499588 493834
53171 493834 488267 483229 478755 474651 470800 467238 464024 461140 458543 456141 453732 451088 448213 445399
53157 445399 442941 440847 438905 436924 434833 432598 430180 427500 424388 420643 416241 411442 406567 401725
53143 401725 396827 391776 386538 381147 375765 370616 365724 360844 355828 350902 346300 341795 336928 331655
53129 331655 326326 321041 315414 309142 302475 295882 289553 283417 277413 271446 265293 258836 252344 246229
53115 246229 240579 235108 229524 223781 217985 212265 206775 201682 197060 192798 188604 184151 179340 174474
53101 174474 170077 166430 163344 160450 157558 154660 151701 148546 145140 141580 138043 134709 131698 128986
53087A28986k545k459k343k213k163k138j940j567j267j215j321j378j323j183
53073A03931r80p56n94n58o56q79j140j228r91o47o35j086j605j709j325p38k25
53056H8179M9j4l74p11o78k97N1N4j91l89m08l45k46J8M94R21R69P11N58O85P42
53035H9778L77j82m22k87k38n41r02r69q28p71q29q28p55p68r03j072j238j410
53017G7212j514j476j423j515j633j489j084p91q62j074j082q95p74p77p17n33
53001E9573m37n77p58o63k87O2J23m7k44l87n37p10q02p03m35j16J31K12Q1j87
52981E3292l96l84j95j4O9J12J62J82J79K08J99m1m67o66l59J33K74M8q6K4nl27
52959E1942m67JP27J043Q37N27L05K3k70k33J80M94L53l1k58k41j43m0O4R9Jj52
$$ plain form
53087 128986 126441 123982 121639 119426 117263 115125 113185 111618 110351 109136 107815 106437 105114 103931
53073 103931 102951 102195 101601 101043 100387 99508 98368 97140 96149 95502 94867 93781 92176 90467 89142 88404 88179
53056 88179 88228 88214 87840 87129 86451 86154 86205 86259 86068 85679 85271 84926 84680 84698 85192 86113 87082 87793 88351 89036 89778
53035 89778 90155 89973 89551 89264 89026 88485 87583 86614 85786 85015 84186 83358 82603 81835 80932 79860 78622 77212
53017 77212 75698 74222 72799 71284 69651 68162 67078 66287 65425 64351 63269 62374 61600 60823 60106 59573
53001 59573 59136 58559 57801 57138 56851 56913 57036 56989 56745 56358 55821 55111 54309 53606 53171 53055 53186 53398 53479 53292
52981 53292 52896 52512 52317 52303 52372 52484 52646 52828 53007 53215 53414 53373 52906 52240 51881 52014 52288 52336 52250 52274 52269 51942
52959 51942 51475 51476 52203 53246 54083 54610 54915 54938 54668 54435 54615 55109 55462 55431 55173 54932 54789 54749 54813 54912 54913 54761
52937E4761k72l92n59o71n97l44k7K17K76J74R8J61J76q8m35m25n9J34j17m08
52917E1603k32K79O07N54L58K88M68R37J530J832J530Q29K47R3L01O46R20R99
52899F3789J002J175J513J639J372J081J197J597J851J899J987K063J790J165
52885H5120O42N15N56M34J33j71l63m12l41k90l63m34l33k10m10r25j343j405
52867H0400j285j201j070p66l92j06J33L84N35M57K25jj89l61m77n23n68n86m30
52848G4179j01J37J21L9J21K41J37j25k33j51j87m11m60n8M78O14K75r5j97k03
52828G4121l43m76l01J71O42R36J071J002O26J35l4K43N23L35k13n40k77M01R76
52809G8998J028N51n3l31k48j35j49m7L27P08P45N03K79J36l8j79r7J76M39O39
$$ plain form
52937 54761 54489 54097 53538 52867 52270 51926 51899 52116 52392 52566 52664 52825 53001 52913 52478 52053 51994 52128 52011 51603
52917 51603 51371 51650 52257 52811 53169 53457 53925 54862 56392 58224 59754 60583 60830 60923 61224 61870 62790 63789
52899 63789 64791 65966 67479 69118 70490 71571 72768 74365 76216 78115 80102 82165 83955 85120
52885 85120 85762 86277 86833 87267 87400 87229 86866 86454 86113 85823 85460 85026 84693 84483 84073 83148 81805 80400
52867 80400 79115 77914 76844 76078 75686 75580 75713 76097 76632 77089 77314 77313 77124 76763 76286 75763 75195 74609 74179
52848 74179 74078 74215 74336 74375 74496 74737 74874 74749 74516 74365 74178 73767 73307 73249 73727 74341 74616 74521 74324 74121
52828 74121 73778 73302 73001 73172 73814 74750 75821 76823 77449 77584 77550 77793 78316 78651 78438 77898 77621 78022 78998
52809 78998 80026 80577 80524 80193 79945 79810 79661 79614 79941 80649 81394 81897 82176 82312 82274 82095 81998 82174 82613 83252
52789H3252Q37R23P53M90M50O31P17O15N99Q41J182J392J443J364J143Q69P42
52772I8243Q32R78J018R36P47M30N4k28l12k35p0O4k0l90q50j112j147j161j276
52753I6501j485j736j924j868j569j323j330j346j075p09o47q26q59p38q18j110
52737G7138j197r45p23p21o51l44j37l04n63n26l29l97p82j106j031o09k14k27
52719F6332o27r47q09m46l53n26n43l71m39p75q22l77o9m23j016j124p42l55j06
52700E5462J64L14J5n80r06p54n22n97r06j102r39m49M7J28l25r10j145j003p92
52681D5200o61m97k39K0J93K41Q8k87o90q80q65q55r58j076j062q65n38k48j33
52662C5888j31m6J58K81K15Q5kj05k84m38n21n94o07m02n3J05%l9J50K56N9j32
$$ plain form
52789 83252 84089 85012 85765 86255 86705 87336 88053 88668 89267 90108 91290 92682 94125 95489 96632 97501 98243
52772 98243 99075 100053 101071 102007 102754 103184 103238 103010 102698 102463 102393 102457 102437 102047 101197 100085 98938 97777 96501
52753 96501 95016 93280 91356 89488 87919 86596 85266 83920 82845 82136 81489 80663 79804 79066 78248 77138
52737 77138 75941 74996 74273 73552 72901 72557 72420 72116 71553 71027 70698 70301 69519 68413 67382 66773 66559 66332
52719 66332 65705 64758 63949 63503 63150 62624 62081 61710 61271 60496 59674 59297 59228 58805 57789 56665 55923 55568 55462
52700 55462 55626 55940 55955 55375 54469 53715 53193 52596 51690 50588 49649 49200 49247 49375 49050 48140 46995 45992 45200
52681 45200 44539 44042 43803 43823 44016 44257 44345 44058 43368 42488 41623 40768 39810 38734 37672 36807 36269 36021 35888
52662 35888 35757 35711 35869 36150 36365 36450 36448 36343 36059 35621 35100 34506 33899 33497 33444 33549 33549 33510 33660 33916 33975 33843
52640C3843kK18J62l1LK09K75J97K52M62O39P26P39N46J72O5N32J129J175P59
52620D2070N68Q46J192J308J321J219P41l9o10o94n62m81m22m25p48j332j735
52603D2217j797j885k158k136j459n85j85k01j22J24J08l05p21q12p05o35n49
52586B8194k97N2K91L28K60K11K37L05L27K19l5l36n42n83m67k49L2K85L79K76
52566B8887J20N4j2k54n50n51k28m2l23p27o75j67K17J24j82k83j22P2J37N6j15
52545B5436k84k97n7L65P22P56M20l8k78k17m3J08L18O06P49N92K95Q6o3k22j77
52524B8777K77Q82J143R81P69P44P44N51K09j00k19m4L61O78O34L51J83K37L36
52505C7494M08N48O64M92P7j58M9M36N79M02J41L9J59L34K83q6m34l21K26P18
$$ plain form
52640 33843 33841 34059 34221 34190 34193 34402 34677 34874 35126 35588 36227 36953 37692 38238 38410 38475 39007 40136 41311 42070
52620 42070 42638 43484 44676 45984 47305 48524 49265 49226 48616 47922 47360 46879 46457 46032 45284 43952 42217
52603 42217 40420 38535 36377 34241 32782 32197 32012 31811 31689 31813 31921 31616 30895 30083 29378 28743 28194
52586 28194 27897 27949 28240 28568 28828 29039 29276 29581 29908 30127 30092 29756 29214 28631 28164 27915 27947 28232 28611 28887
52566 28887 29007 29061 29049 28795 28245 27694 27466 27424 27101 26374 25699 25532 25749 25873 25691 25408 25286 25358 25495 25551 25436
52545 25436 25152 24855 24798 25163 25885 26641 27061 27023 26745 26528 26485 26593 26911 27517 28266 28858 29153 29239 29176 28954 28777
52524 28777 29054 29936 31079 32060 32829 33573 34317 34868 35077 34977 34758 34714 35075 35753 36387 36738 36921 37158 37494
52505 37494 37902 38450 39114 39606 39683 39525 39574 40010 40589 40991 41132 41171 41330 41664 41947 41861 41427 41106 41332 42050
52485D2050Q00O00M28L75L70L57L13K35K21L68N84O51N09L07J91K23M77R35J326
52466E1320J340J005N87K13j48l78l21j74k84n45m87k7L64L69K30K35K86K56K80
52447E4121M04L66L8l00m30n45p80p82k42M90Q10O36L62J76o6m09p02q75r55q51
52427E0466m80l3J92J91J89K57L01M03O98R62P17o3p63p90k54K42K98J9k55l25
52407E1972k29p2Q2J96K05J06O2K74O63Q90P44M09K25K79M24N42O21O64O36N52
52387E9245M79M83N82P31Q07P06M64K10Nj44j30J07L21J39l77o57l44J98L80J54
52367F3359o5o7m3j68l11k83j12J2p3l39n18l11K38O46M93l6l51j71K08L73K97
52346F2778K39L63O08Q13Q56O99M24K04J75L25N42P71J019J204J110O29kl83m05
$$ plain form
52485 42050 42850 43450 43878 44253 44623 44980 45293 45528 45749 46117 46701 47352 47861 48168 48359 48582 49059 49994 51320
52466 51320 52660 53665 54252 54465 54317 53939 53618 53444 53160 52615 52128 52101 52465 52834 53064 53299 53585 53841 54121
52447 54121 54525 54891 54929 54629 54199 53654 52874 52092 51850 52340 53150 53786 54148 54324 54258 53849 53147 52272 51317 50466
52427 50466 49986 49953 50145 50336 50525 50782 51083 51486 52184 53146 53863 53800 53037 52247 51993 52235 52533 52552 52297 51972
52407 51972 51743 51671 51753 51949 52154 52260 52322 52596 53259 54149 54893 55302 55527 55806 56230 56772 57393 58057 58693 59245
52387 59245 59724 60207 60789 61520 62327 63033 63497 63707 63712 63568 63438 63545 63866 64005 63628 62971 62627 62825 63205 63359
52367 63359 63294 63227 63184 63016 62705 62422 62310 62322 62249 61910 61392 61081 61319 61965 62458 62422 62071 61900 62108 62481 62778
52346 62778 63017 63380 63988 64801 65657 66356 66780 66984 67159 67484 68026 68797 69816 71020 72130 72759 72757 72374 71969
52327G1969l63n21p68q29o39k94J88P50J059P94J65k61k46j00p4L1L98P43O80
52308G2682K87kN3L13N58O81O17L43k8k64j76K47Q11J209J261J116J072J177J182
52289H3139R66P42P24Q25Q68R12J148J560J893J929J650J234R63J032J326J523
52273A02434J465J336J330J356J218R22O93P35J081J564J895J927J870K062K481
52258A24369K739K654K506K571K725K750K768L033L498L858L979L995M089M316
52244A69850M638M944N141N288N522N784N871N841O051O609P146P333P362P588
52230B54968P972Q229Q281Q205P974P609P407P613P970Q027P770P543P445P222
52216C64235O750O202N692N120M460L888L523L291L096K940K766K412J808J101
$$ plain form
52327 71969 71606 71085 70317 69488 68849 68555 68743 69493 70552 71346 71511 71250 71004 70904 70830 70861 71259 72002 72682
52308 72682 72969 72967 73020 73333 73891 74572 75189 75532 75504 75240 75064 75311 76122 77331 78592 79708 80780 81957 83139
52289 83139 84105 84847 85571 86396 87264 88176 89324 90884 92777 94706 96356 97590 98553 99585 100911 102434
52273 102434 103899 105235 106565 107921 109139 110061 110754 111489 112570 114134 116029 117956 119826 121888 124369
52258 124369 127108 129762 132268 134839 137564 140314 143082 146115 149613 153471 157450 161445 165534 169850
52244 169850 174488 179432 184573 189861 195383 201167 207038 212879 218930 225539 232685 240018 247380 254968
52230 254968 262940 271169 279450 287655 295629 303238 310645 318258 326228 334255 342025 349568 357013 364235
52216 364235 370985 377187 382879 387999 392459 396347 399870 403161 406257 409197 411963 414375 416183 417284
52202D17284N31K46K02J64p7m41n87l29J05L70M10L99M68P13J226J933K528K822
52184D27967L015L396L954M463M808M952M871M724M852N324N724N734N583N554
52170D94921N432M932M320L984L701L044K262J976K063J704O64l45p88j039j598
52155E25233k307k821l301m087n001n562n647n576n604n695n730n702n748o020
52141D56432o427o534n983n050m442m453m655m563m198l841l579l394l322l277
52127C92714k973k317j694j509j724j981k065j936j580j096p89q46j086j191j150
52112C68777j132j123r73p67q33j306j899k190k049j730j556j623j772j886k023
52097C45915k212k231j861j259q28p31p88q38q79r00q46q71j185j615j650j128
$$ plain form
52202 417284 417815 418061 418263 418427 418350 417909 417322 416993 417098 417468 417878 418277 418745 419458 420684 422617 425145 427967
52184 427967 430982 434378 438332 442795 447603 452555 457426 462150 467002 472326 478050 483784 489367 494921
52170 494921 500353 505285 509605 513589 517290 520334 522596 524572 526635 528339 529003 528658 527870 526831 525233
52155 525233 522926 520105 516804 512717 507716 502154 496507 490931 485327 479632 473902 468200 462452 456432
52141 456432 450005 443471 437488 432438 427996 423543 418888 414325 410127 406286 402707 399313 395991 392714
52127 392714 389741 387424 385730 384221 382497 380516 378451 376515 374935 373839 373050 372204 371118 369927 368777
52112 368777 367645 366522 365549 364782 363949 362643 360744 358554 356505 354775 353219 351596 349824 347938 345915
52097 345915 343703 341472 339611 338352 337524 336793 336005 335167 334288 333388 332542 331671 330486 328871 327221 326093
52081C26093n03k57l70n89q28j030r80o18k73k52l65k33J21L55L58K96K45J15
52063C21285m2nK65N15N11L05J69L12P18J135J322J323J394J625J819J913K206
52046C36770K944L844M393M508M569M886N424O052O691P202P466P646Q082Q821
52032D19298R500R818R913J0045J0159R990R477Q838Q236P641P059O658O553O555
52018E39740O285N574M611L718L001K304J431M03n43j189j612k102k782l385l593
52003E51861l501l561l954m341m327l974l635l478l399l283l096k763k274j807
51989E04468j508j239p83k26J35K97O24J323K180K846L119K942K415J904J861
51974E20358K353K939L141K895K448K051J808J611J195M25m04q22p78p43j091
$$ plain form
52081 326093 325590 325333 324963 324374 323546 322516 321536 320918 320645 320393 320028 319795 319916 320271 320629 320925 321170 321285
52063 321285 321243 321238 321503 322018 322529 322834 323003 323315 324033 325168 326490 327813 329207 330832 332651 334564 336770
52046 336770 339714 343558 347951 352459 357028 361914 367338 373390 380081 387283 394749 402395 410477 419298
52032 419298 428798 438616 448529 458574 468733 478723 488200 497038 505274 512915 519974 526632 533185 539740
52018 539740 546025 551599 556210 559928 562929 565233 566664 567067 566524 565335 563723 561621 558839 555454 551861
52003 551861 548360 544799 540845 536504 532177 528203 524568 521090 517691 514408 511312 508549 506275 504468
51989 504468 502960 501721 500938 500712 500847 501144 501768 503091 505271 508117 511236 514178 516593 518497 520358
51974 520358 522711 525650 528791 531686 534134 536185 537993 539604 540799 541224 540820 539998 539220 538477 537386
51959E37386j746k458l178l919m529m872n090n441n980o545o972p239p474p881
51945D64062q497r028r116q801q535q652r095r631j0054j0128r704r021q586q577
51931C36637q654q521q352q411q596q625q437q108p649p114o739o691o816o875
51917B27049o823o705o469o110n766n467n027m398l900l779l818l680l405l254
51903A58448l211l064k790k552k383k215k106k129k091j754j220q68q70j093j416
51888A28686j835k247k414k229j836j459j229j190j331j576j826j976j912j589
51874A04037j166q78p38n59l47l54o02p49n85l89m61o53o46m43k41p0N5q8n65
51855I4558r32p36k23m3l38o06m99k55k60n26p98q75p74o96q44j135j169p46k46
$$ plain form
51959 537386 535640 533182 530004 526085 521556 516684 511594 506153 500173 493628 486656 479417 471943 464062
51945 464062 455565 446537 437421 428620 420085 411433 402338 392707 382653 372525 362821 353800 345214 336637
51931 336637 327983 319462 311110 302699 294103 285478 277041 268933 261284 254170 247431 240740 233924 227049
51917 227049 220226 213521 207052 200942 195176 189709 184682 180284 176384 172605 168787 165107 161702 158448
51903 158448 155237 152173 149383 146831 144448 142233 140127 137998 135907 134153 132933 132065 131195 130102 128686
51888 128686 126851 124604 122190 119961 118125 116666 115437 114247 112916 111340 109514 107538 105626 104037
51874 104037 102871 101993 101255 100696 100349 99995 99393 98644 98059 97670 97209 96556 95910 95467 95226 95156 95211 95123 94558
51855 94558 93626 92890 92667 92624 92286 91680 91181 90926 90666 90140 89342 88467 87693 86997 86153 85018 83849 83103 82857
51836H2857k07o13r21p42k07K88M28J20l80o11l74K6K25K48K22k4n83r83o83J04
51816G8190O38O89O57P57P21M62L22M49N06K57n2j66j75j75qL18M37K01K0K75
51796H4323P04Q39P11O91Q34Q45O10L44K57L25L98L73K49J68K96N86P75P27N89
51777I4644N20M26J87j06k85l67m34m56l51j98j44k29l64m55l99j60J08J45r1
51758I1991l31l36j88p9qJ19K48K60J55kk08m29m69j70L06O07O16N45O02P23P02
51737I4654M77J78p0k43l24j94J95N88N80J19l49m12j90o4r2j8K44M83N72O14
51717I6748O67O72P01R53J350J454J011L09j48j66J30N47R23J109J085R52P62
51700A09059M73J68N4J64K83L36N40R73J268J092P14P34J244J684J520Q91M20
$$ plain form
51836 82857 82650 82037 81116 80374 80167 80455 80883 81003 80623 80012 79638 79664 79889 80137 80359 80335 79752 78769 78086 78190
51816 78190 78828 79517 80174 80931 81652 82114 82436 82885 83391 83648 83596 83430 83255 83080 83072 83390 83827 84028 84048 84323
51796 84323 85027 85866 86577 87268 88102 88947 89557 89901 90158 90483 90881 91254 91503 91671 91967 92553 93328 94055 94644
51777 94644 95164 95590 95777 95671 95386 95019 94585 94129 93778 93580 93436 93207 92843 92388 91989 91829 91937 92082 91991
51758 91991 91660 91324 91136 91057 91049 91168 91416 91676 91831 91829 91621 91192 90723 90553 90859 91466 92082 92627 93229 93952 94654
51737 94654 95131 95309 95239 94996 94672 94478 94673 95261 95841 95960 95611 95199 95009 94945 94853 94835 95079 95562 96134 96748
51717 96748 97415 98087 98788 99741 101091 102545 103556 103865 103717 103551 103681 104228 105151 106260 107345 108297 109059
51700 109059 109532 109700 109754 109918 110201 110537 111077 112050 113318 114410 115124 115858 117102 118786 120306 121197 121617
51683A21617N58J206J922K360K464K345K087J758J497J410J442J482J595J934
51669A45677K443K854K987K909K739K533K335K169J918J465R51O48N60L82l2m88
51653A72050q42j204j617j817j579j119q59r62j272j559j641j431j022o93o39
51638A53794p67q65q32o73m49k44j11L8K84M66L58R8R5M48P61O98M01J86K01N03
51618A54390J122J778J898J224J36q61j639k217k425k214j923j841j745j352r24
51603A43407r00j127j054n78j09J22K87M50M27K28J56K92K92n2n30q83j180j542
51585A37706j823j859j804j912k160k294k196j945j619j250r37q34r89j246j399
51570A13439j373j298j369j619j887j986j869j597j235q40m90k20l4%k15n69p18
$$ plain form
51683 121617 122175 123381 125303 127663 130127 132472 134559 136317 137814 139224 140666 142148 143743 145677
51669 145677 148120 150974 153961 156870 159609 162142 164477 166646 168564 170029 170980 171628 172188 172570 172538 172050
51653 172050 171208 170004 168387 166570 164991 163872 163013 162051 160779 159220 157579 156148 155126 154433 153794
51638 153794 153027 152162 151330 150657 150208 149964 149853 149891 150175 150641 150999 151097 151192 151640 152401 153099 153500 153686 153887 154390
51618 154390 155512 157290 159188 160412 160548 159687 158048 155831 153406 151192 149269 147428 145683 144331 143407
51603 143407 142507 141380 140326 139748 139639 139761 140048 140498 140925 141153 141309 141601 141893 141841 141311 140428 139248 137706
51585 137706 135883 134024 132220 130308 128148 125854 123658 121713 120094 118844 117907 117073 116084 114838 113439
51570 113439 112066 110768 109399 107780 105893 103907 102038 100441 99206 98366 97876 97656 97622 97622 97407 96838 96120
51553I6120m59qK51J97k2k94n99q11p54m81k74l06m50m98m07k72j64q6n7j26k91
51532I0209l84j67L50P69O79J81j52M8N70R56R70O38J54o0L99J401K229K359K030
51513A03179J757J600J310R54Q25R23R57Q14N60J18n96j235j303r04o87r36j238
51496A06098j198r66q31p34m83j31J63L86N60N95M91M43N52O72P20Q86J273J637
51478A10133J710J604J584J626J511J211R11P47P38Q81J067J011N28j79p31j019
51462A23333j164j163q51k82J80K91K20K89N47P85Q63Q59Q28P04M64K80L35N38
51444A27056O54O71P74R11P39J68l68m85m28o41r96r66n54l55o04p78m47J5J1
51425A24377m17p89r55j094j116p32n9L80L99M01O92J017J004P68O94Q89J143
$$ plain form
51553 96120 95661 95653 95904 96101 96079 95785 95186 94375 93621 93140 92866 92560 92110 91612 91205 90933 90769 90683 90626 90500 90209
51532 90209 89825 89658 90008 90777 91456 91637 91485 91533 92103 93059 94029 94667 94821 94761 95160 96561 98790 101149 103179
51513 103179 104936 106536 107846 108800 109625 110548 111505 112319 112879 112997 112401 111166 109863 108959 108272 107336 106098
51496 106098 104900 103934 103103 102369 101886 101755 101918 102304 102864 103459 103950 104393 104945 105617 106337 107223 108496 110133
51478 110133 111843 113447 115031 116657 118168 119379 120290 121037 121775 122656 123723 124734 125262 125083 124352 123333
51462 123333 122169 121006 120155 119873 120053 120344 120564 120853 121400 122185 123048 123907 124735 125439 125903 126183 126518 127056
51444 127056 127710 128381 129155 130066 130805 130973 130605 130120 129692 129051 128055 127089 126535 126180 125576 124798 124351 124366 124377
51425 124377 123960 123171 122216 121122 120006 119274 119215 119595 119994 120395 121087 122104 123108 123876 124570 125459 126602
51408A26602J302J384J396J325J267J344J501J586J646J841K132K262K194K227
51394A50009K532K798K614K046J558J411J429J378J217R49N20K1k70k59k36n03
51378A67214r28j138j078j055j249j432j298q50l40Q8N00R49J231J019K81n28
51362A61386q67o64l12j23o0l8k09p08j359j877k223k480k573k414k189k168k331
51345A38791k458k486k460k224j622r65q01j180j560j593j498j523j484j169p83
51330A14985o31o12m57k17j38j75k7L38O00N64M33N05P52Q24M55k04o72o84n70
51311A15069r00j704k375k503k431k670l038k916k224j610j558j817j912j864
51297H5547k018k395k575k261j637j126r59j045j171j214j184j139j081r38o72
$$ plain form
51408 126602 127904 129288 130684 132009 133276 134620 136121 137707 139353 141194 143326 145588 147782 150009
51394 150009 152541 155339 157953 159999 161557 162968 164397 165775 166992 167941 168461 168482 168212 167953 167717 167214
51378 167214 166286 165148 164070 163015 161766 160334 159036 158186 157846 157934 158434 159383 160614 161633 161914 161386
51362 161386 160519 159855 159543 159420 159360 159322 159113 158405 157046 155169 152946 150466 147893 145479 143290 141122 138791
51345 138791 136333 133847 131387 129163 127541 126576 125775 124595 123035 121442 119944 118421 116937 115768 114985
51330 114985 114354 113742 113285 113068 112930 112755 112728 113066 113666 114230 114663 115168 115920 116744 117199 116995 116323 115639 115069
51311 115069 114169 112465 110090 107587 105156 102486 99448 96532 94308 92698 91140 89323 87411 85547
51297 85547 83529 81134 78559 76298 74661 73535 72576 71531 70360 69146 67962 66823 65742 64804 64132
51282F4132l88l00n65j067j436j326p52j08K03J64R4K30M44M44J83p7j00O7K16
51263F0058K55K49K46K21J60P9n8k38k60Q5O16Q73P02M95O50J003J145J048R97
51244F8326J072J075R77R87J139J190J053R60J055J129R94P82O62N16J57l05n98
51227H1171o86p79j025j354j621j733j668j518j397j327j258j237j368j550j497
51212F1153j143q14p93r60j028r21p21m48j52m5k26m63n18n25o88p94n09J6K71
51193E0692J65J51M64O92L97k58p40p79m84n5L24M61L17J49K18M75O88P50P11
51174E4338N80L61K21L43N50M25j23o40o54k44J25J96J25J41K56L75M78N73N71
51155E7997L67L5j93j70rM2j17l04k41R0L96L91J83J17L09M98M59L16K97L34J88
$$ plain form
51282 64132 63744 63444 62879 61812 60376 59050 58298 58190 58393 58557 58651 58881 59325 59769 59952 59875 59775 59842 60058
51263 60058 60313 60562 60808 61029 61189 61268 61210 60972 60712 60797 61413 62286 62988 63483 64133 65136 66281 67329 68326
51244 68326 69398 70473 71450 72437 73576 74766 75819 76779 77834 78963 79957 80739 81401 81917 82074 81769 81171
51227 81171 80485 79706 78681 77327 75706 73973 72305 70787 69390 68063 66805 65568 64200 62650 61153
51212 61153 60010 59196 58403 57443 56415 55494 54773 54325 54173 54128 53902 53439 52921 52396 51708 50914 50405 50421 50692
51193 50692 50857 51008 51472 52164 52561 52303 51563 50784 50300 50245 50569 51030 51347 51496 51714 52189 52877 53627 54338
51174 54338 54918 55279 55500 55843 56393 56818 56695 56055 55401 55157 55282 55478 55603 55744 56000 56375 56853 57426 57997
51155 57997 58364 58399 58206 58036 58027 58069 57952 57648 57407 57497 57893 58284 58467 58584 58893 59391 59850 60166 60463 60797 60985
51134F0985j31l26k45q4p6j94k55j95j09j19k86n58p54p18m86k34m6J33K71K00
51114E6773j07m08m52k64m5O5L1j13k45j87N6K29J32j05k12j67j94m07o14n41
51094E3225j43L19N15L16q5m19o04p39q14o83l55r6q3j93k64l66n65o48m24j35
51074D7759j88n04n49r1M28M85J19j97j69J09M11O14O92O90P22Q82J127J300J244
51055E4884R16M18k6j61O3M14N96N73N61O62O40K40l75p17n76k99k86m35l35Q2
51035E6839M26M31L06L16L21L4m01m58R3Q20J101Q06L72K15K70J70j92n07m98
51016F0464l38l44m35k06M07R40J004P95P15P64O23K17j59k73k09j94l39n91p81
50997F2060p49n59m57n40n29j58L36M99L18K90O54J025R16M07j0m0J79L97N15
$$ plain form
51134 60985 60854 60528 60283 60199 60123 59929 59674 59479 59370 59251 58965 58407 57653 56935 56449 56215 56169 56302 56573 56773
51114 56773 56666 56258 55806 55542 55497 55562 55593 55480 55235 55048 55104 55333 55465 55360 55148 54981 54787 54380 53766 53225
51094 53225 53082 53401 53916 54232 54147 53728 53124 52385 51571 50888 50533 50437 50354 50161 49897 49531 48966 48318 47894 47759
51074 47759 47571 47067 46518 46427 46855 47340 47459 47262 47093 47202 47613 48227 48919 49609 50331 51213 52340 53640 54884
51055 54884 55800 56218 56192 56031 56094 56508 57104 57677 58238 58900 59540 59780 59405 58688 58112 57813 57527 57092 56757 56839
51035 56839 57265 57696 58002 58318 58639 58673 58272 57814 57907 58727 59828 60634 61006 61221 61491 61661 61469 60962 60464
51016 60464 60126 59782 59347 59141 59548 60488 61492 62287 63002 63766 64389 64606 64447 64174 63965 63771 63432 62841 62060
50997 62060 61311 60752 60295 59755 59226 59068 59404 59903 60221 60511 61165 62190 63106 63513 63503 63463 63642 64039 64554
50978F4554N75O53P60Q17P26N35M69O80J043J283J248J025Q27Q74J286J892K216
50961H1463J839Q92k0l96k47J21N29R37J191J078O27J47o5O5N02J125J612J591
50943I2991J101P05Q43J324J636J635J574J622J736J974K484L147L653L965M310
50928A24700M671M774M659M781N246N511N247M964N292N999O419O572P129Q327
50914B04291R635J0627J1538J2678J3836J4686J5447J6650J8385K0122K1346K2085
50902C91326K2763K3675K4720K5662K6481K7325K8124K8499K8175K7256K5928
50891F79934K4114K1645J8690J5623J2607R569O536L676J013j573m051o197p880
50878G73706r131r957j0313j0299j0124r854r505r313r618j0402j1274j1981j2617
$$ plain form
50978 64554 65129 65782 66542 67359 68085 68620 69089 69769 70812 72095 73343 74368 75195 76069 77355 79247 81463
50961 81463 83302 84194 84174 83778 83531 83652 84181 85118 86309 87387 88014 88161 88096 88161 88663 89788 91400 92991
50943 92991 94092 94797 95640 96964 98600 100235 101809 103431 105167 107141 109625 112772 116425 120390 124700
50928 124700 129371 134145 138804 143585 148831 154342 159589 164553 169845 175844 182263 188835 195964 204291
50914 204291 213926 224553 236091 248769 262605 277291 292738 309388 327773 347895 369241 391326
50902 391326 414089 437764 462484 488146 514627 541952 570076 598575 626750 654006 679934
50891 679934 704048 725693 744383 760006 772613 782182 788718 792394 793407 791834 787783 781586 773706
50878 773706 764575 754618 744305 734006 723882 714028 704523 695210 685592 675190 663916 651935 639318
50865F39318j3320j4088j4941j5929j6896j7558j7986j8568j9370j9936j9949
50854D50777j9669j9379j8835j7694j6187j4872j3869j2811j1515j0269r376q778
50842B77523q197p438o473n430m539l927l456k900k260j745j456j199p22MP57
50827B28542J310J628J856K061K087J783J377J353J920K751L367L614L680L825
50813B61154M267N125O236P144P557P688Q027Q768R698J0542J1242J1913J2679
50800C72040J3612J4704J5913J7276J8933K0966K3316K5875K8586L1340L4039
50789F16600L6779L9807M3114M6353M9334N2331N5583N8672O0867O1950O2333
50778A183723O2357O1840O0367N7666N3580M8036M1219L3585K5553J7348R166
$$ plain form
50865 639318 625998 611910 596969 581040 564144 546586 528600 510032 490662 470726 450777
50854 450777 431108 411729 392894 375200 359013 344141 330272 317461 305946 295677 286301 277523
50842 277523 269326 261888 255415 249985 245446 241519 238063 235163 232903 231158 229702 228503 227781 227785 228542
50827 228542 229852 231480 233336 235397 237484 239267 240644 241997 243917 246668 250035 253649 257329 261154
50813 261154 265421 270546 276782 283926 291483 299171 307198 315966 325664 336206 347448 359361 372040
50800 372040 385652 400356 416269 433545 452478 473444 496760 522635 551221 582561 616600
50789 616600 653379 693186 736300 782653 831987 884318 939901 998573 1059440 1121390 1183723
50778 1183723 1246080 1307920 1368287 1425953 1479533 1527569 1568788 1602373 1627926 1645274 1654440
50767A654440J330n861j2197j7420k1268k3756k5236k5977k5920k5001k3518k1966
50755A427650k0616j9552j8962j9198k0403k2395k4884k7723l0807l3952l6933
50744A152225l9647m2101m4223m5785m6549m6475m5713m4450m2783m0829l8735
50733F74935l6506l3897l0753k7441k4720k2933k1551j9718j7213j4686j2861
50722D12656j1770j0873r779q570p486o516n526m572l920l696l695l596l265k784
50708C26608k266j766j359j170j250j443j470j190p54m41l46k88n2L64Q36J348
50692C15361J972K664L292L865M588N561O614P525Q301R079R896J0741J1739J3068
50678D14266J4702J6379J7846J9034K0022K1042K2521K4844K7908L1040L3512
$$ plain form
50767 1654440 1655770 1649909 1637712 1620292 1599024 1575268 1550032 1524055 1498135 1473134 1449616 1427650
50755 1427650 1407034 1387482 1368520 1349322 1328919 1306524 1281640 1253917 1223110 1189158 1152225
50744 1152225 1112578 1070477 1026254 980469 933920 887445 841732 797282 754499 713670 674935
50733 674935 638429 604532 573779 546338 521618 498685 477134 457416 440203 425517 412656
50722 412656 400886 390013 380234 371664 364178 357662 352136 347564 343644 339948 336253 332657 329392 326608
50708 326608 324342 322576 321217 320047 318797 317354 315884 314694 313940 313499 313153 312865 312813 313177 314013 315361
50692 315361 317333 319997 323289 327154 331742 337303 343917 351442 359743 368822 378718 389459 401198 414266
50678 414266 428968 445347 463193 482227 502249 523291 545812 570656 598564 629604 663116
50667F63116L5153L6299L7273L8054L8430L8250L7469L6076L4083L1502K8247
50656A053952K4091J8899J2862O473K85n319j0189j4389j8045k1065k3013k3483
50644A001059k2605k1047j9398j7760j6049j4427j3186j2379j1906j1877j2548
50633H27877j3914j5655j7593j9820k2312k4634k6269k7058k7177k6848k6262
50622E80335k5561k4723k3528k1875k0020j8323j6841j5338j3684j1997j0483
50611C77962r225q163p062n654l936k334j365j034p44Q2J413K698L453L729L944
50596C53764M411N087N737O249O700P191P793Q586R585J0607J1432J2106J2928
50583D62176J3982J4961J5579J6058J6903J8287J9861K1168K2014K2456K2601
$$ plain form
50667 663116 698269 734568 771841 809895 848325 886575 924044 960120 994203 1025705 1053952
50656 1053952 1078043 1096942 1109804 1116277 1116562 1111243 1101054 1086665 1068620 1047555 1024542 1001059
50644 1001059 978454 957407 938009 920249 904200 889773 876587 864208 852302 840425 827877
50633 827877 813963 798308 780715 760895 738583 713949 687680 660622 633445 606597 580335
50622 580335 554774 530051 506523 484648 464628 446305 429464 414126 400442 388445 377962
50611 377962 368737 360574 353512 347858 343922 341588 340223 339189 338445 338527 339940 342638 346091 349820 353764
50596 353764 358175 363262 368999 375248 381948 389139 396932 405518 415103 425710 437142 449248 462176
50583 462176 476158 491119 506698 522756 539659 557946 577807 598975 620989 643445 666046
50572F66046K2530K2326K2032K1566K0743J9445J7817J6209J4769J3175J1013
50561H67671Q395N900L882K112L47j156k053k524l033l569l588k795j569m49M49
50546H68020J305K133K687K725K197J179k25j958m023o407r029j1786j4592j7320
50532H14906j9735k1629k2991k3941k4552k4815k4766k4464k3872k2975k1926
50521E59240k0941k0016j8913j7481j5852j4285j2930j1781j0677r455q165p113
50509C91631o416n687m433k788j434p19j96P17J959L002L564L855M224M859N729
50494C97867O648P386P923Q522R372J0236J0692J0681J0545J0589J0822J1186
50482E12469J1723J2389J2975J3359J3728J4338J5108J5715J6058J6456J7322
$$ plain form
50572 666046 688576 710902 732934 754500 775243 794688 812505 828714 843483 856658 867671
50561 867671 876066 881966 885848 887960 888307 887151 885098 882574 879541 875972 872384 869589 868020 867571 868020
50546 868020 869325 871458 874145 876870 879067 880246 880021 878063 874040 867633 858604 846818 832226 814906
50532 814906 795171 773542 750551 726610 702058 677243 652477 628013 604141 581166 559240
50521 559240 538299 518283 499370 481889 466037 451752 438822 427041 416364 406909 398744 391631
50509 391631 385215 379528 375095 372307 370873 370154 369958 370675 372634 375636 379200 383055 387279 392138 397867
50494 397867 404515 411901 419824 428346 437718 447954 458646 469327 479872 490461 501283 512469
50482 512469 524192 536581 549556 562915 576643 590981 606089 621804 637862 654318 671640
50471F71640J8728K0413K2130K3850K5682K7691K9855L2167L4609L7102L9463
50460I83330M1490M3012M3927M4251M4096M3561M2569M0881L8277L4718L0351
50449A430463K5384J9990J4245Q132J692m852j1185j7110k2545k7262l0811l2920
50437A353221l3827l3938l3187l1061k7424k2966j8577j4481j0332o062k127J064
50425A120303L512N183N657M589K227r17m786r636j5314k1076k6229l0528l3905
50412I99080l6232l7546l8140l8259l7916l7145l6105l4774l2938l0667k8467
50401F10891k6606k4697k2317j9733j7542j5789j3995j1926r837p985o376n042
50389D29046m052l206k110p53M34J181J794K688L850M967N843O486O978P461Q092
$$ plain form
50471 671640 690368 710781 732911 756761 782443 810134 839989 872156 906765 943867 983330
50460 983330 1024820 1067832 1111759 1156010 1200106 1243667 1286236 1327117 1365394 1400112 1430463
50449 1430463 1455847 1475837 1490082 1498214 1499906 1495054 1483869 1466759 1444214 1416952 1386141 1353221
50437 1353221 1319394 1285456 1252269 1221208 1193784 1170818 1152241 1137760 1127428 1121366 1119239 1120303
50425 1120303 1123815 1128998 1134655 1139244 1141471 1140554 1135768 1126132 1110818 1089742 1063513 1032985 999080
50412 999080 962848 925302 887162 848903 810987 773842 737737 702963 670025 639358 610891
50401 610891 584285 559588 537271 517538 499996 484207 470212 458286 448449 440464 434088 429046
50389 429046 424994 421788 419678 418925 419359 420540 422334 425022 428872 433839 439682 446168 453146 460607 468699
50374D68699Q891R674J0254J0571J0631J0501J0375J0446J0623J0619J0317R874
50362E91475R397Q840Q239P782P467P049O483O099O127O410O752P314Q289R516
50348F97239J0732J1970J3331J4581J5375J5822J6315J6868J6995J6383J5277
50337H60888J4119J3010J1689R863P430M535J459j669n029q866j3061j7092k0462
50324H56814k2992k4730k5766k6175k5975k5092k3504k1411j9159j6905j4537
50313F10568j1919r108o249l455q88J182K493K956K633J661J91j634l706n919
50299E78806q124j0174j1991j3523j4648j5230j5319j5136j4863j4564j4268j3980
50287D16986j3546j2722j1495j0219r276q682q157p487o680n808m944m223l785
$$ plain form
50374 468699 477590 487264 497518 508089 518720 529221 539596 550042 560665 571284 581601 591475
50362 591475 600872 609712 617951 625733 633200 640249 646732 652831 658958 665368 672120 679434 687723 697239
50348 697239 707971 719941 733272 747853 763228 779050 795365 812233 829228 845611 860888
50337 860888 875007 888017 899706 909569 916999 921534 922993 921324 916295 907429 894368 877276 856814
50324 856814 833822 809092 783326 757151 731176 706084 682580 661169 642010 625105 610568
50313 610568 598649 589541 583292 579837 578949 580131 582624 585580 588213 589874 590065 588431 584725 578806
50299 578806 570682 560508 548517 534994 520346 505116 489797 474661 459798 445234 430966 416986
50287 416986 403440 390718 379223 369004 359728 351046 342889 335402 328722 322914 317970 313747 309962
50274C09962l564l250k607j751j012n13n7N70J328K014K556L062L600M087M429
50259C18854M635M747M795M882N204N770O267O355O112N931O001O109O043N897
50245C97602N809N635N166M522M020L663L087K117J089M19J35k5k31n36j047j791
50229D29634k453k654k486k476k895l480l943m407n039n575n655n471n555n984
$$ plain form
50274 309962 306398 303148 300541 298790 297778 297265 297208 297778 299106 301120 303676 306738 310338 314425 318854
50259 318854 323489 328236 333031 337913 343117 348887 355154 361509 367621 373552 379553 385662 391705 397602
50245 397602 403411 409046 414212 418734 422754 426417 429504 431621 432710 433129 433264 433239 433008 432472 431425 429634
50229 429634 427181 424527 422041 419565 416670 413190 409247 404840 399801 394226 388571 383100 377545 371561
$$ [...]
##END NTUPLES=NMR SPECTRUM
##END=
