
##TITLE=AC1150_Santander_5874980_3X255EQHRe
##JCAMPDX= 6.0         $$ Bruker NMR JCAMP-DX V2.0
##DATA TYPE= NMR SPECTRUM
##DATA CLASS= NTUPLES
##ORIGIN= BRUKER
##OWNER= Administrator
$$ 1.72 TOPSPIN		Version 2.1
$$ 2012-03-31 20:10:40.187 -0500  Administrator@TOPSPIN
$$ Compression mode = diff/dup
##.OBSERVE FREQUENCY= 400.13188235
##.OBSERVE NUCLEUS= ^1H
##.ACQUISITION MODE= SIMULTANEOUS (DQD)
##.ACQUISITION SCHEME= undefined
##.AVERAGES= 8
##.DIGITISER RES= 22
##SPECTROMETER/DATA SYSTEM= spect
##.PULSE SEQUENCE= zg30
##.SOLVENT NAME= COFFEE_meoh
##.SHIFT REFERENCE= INTERNAL, COFFEE_meoh, 1, 14.98061
##AUDIT TRAIL= $$ (NUMBER, WHEN, WHO, WHERE, PROCESS, VERSION, WHAT)
$$ ##TITLE= Audit trail, TOPSPIN		Version 2.1
$$ ##JCAMPDX= 5.01
$$ ##ORIGIN= Bruker BioSpin GmbH
$$ ##OWNER= Administrator
$$ $$ C:\Bruker\TOPSPIN/data/COFFEE/nmr/AC1150_Santander_5874980_3X255EQHRe/10/pdata/1/auditp.txt
$$ ##AUDIT TRAIL=  $$ (NUMBER, WHEN, WHO, WHERE, PROCESS, VERSION, WHAT)
(   1,<2012-03-31 20:10:31.640 -0500>,<Administrator>,<TOPSPIN>,<go>,<TOPSPIN 2.1>,
      <created by zg
	started at 2012-03-31 20:09:24.984 -0500,
	POWCHK enabled, PULCHK disabled,
       configuration hash MD5:
       1A 1E CE 29 27 FD 77 03 67 4E F0 E3 C4 B2 CB 90
       data hash MD5: 64K
       64 61 79 75 2E 45 EA 41 6F D6 89 13 2F 10 6B 43>)
(   2,<2012-03-31 20:10:35.234 -0500>,<Administrator>,<TOPSPIN>,<proc1d>,<TOPSPIN 2.1>,
      <Start of raw data processing
       efp LB = 0 FT_mod = 6 PKNL = 1 PHC0 = 0 PHC1 = 0 SI = 32K 
       data hash MD5: 32K
       B8 00 F2 E0 11 73 FF 1F 98 0B FF 39 B3 A4 40 B6>)
(   3,<2012-03-31 20:10:35.593 -0500>,<Administrator>,<TOPSPIN>,<proc1d>,<TOPSPIN 2.1>,
      <pk PHC0 = 213.3765 PHC1 = 0 
       data hash MD5: 32K
       22 3D 07 80 42 8F E9 38 18 DA 82 6A F8 0B D6 D0>)
(   4,<2012-03-31 20:10:35.671 -0500>,<Administrator>,<TOPSPIN>,<proc1d>,<TOPSPIN 2.1>,
      <abs ABSG = 1 
       data hash MD5: 32K
       20 D7 FA 96 25 DE 03 14 C4 93 74 5B D0 95 0A FE>)
(   5,<2012-03-31 20:10:35.703 -0500>,<Administrator>,<TOPSPIN>,<proc1d>,<TOPSPIN 2.1>,
      <abs ABSG = 2 
       data hash MD5: 32K
       E4 03 01 72 80 55 E3 35 67 FE CA 60 0D 97 5B C4>)
(   6,<2012-03-31 20:10:35.734 -0500>,<Administrator>,<TOPSPIN>,<proc1d>,<TOPSPIN 2.1>,
      <abs ABSG = 3 
       data hash MD5: 32K
       1E 9C 15 91 61 13 4D B9 7B 60 B8 78 DE 82 B8 B2>)
(   7,<2012-03-31 20:10:35.781 -0500>,<Administrator>,<TOPSPIN>,<proc1d>,<TOPSPIN 2.1>,
      <abs ABSG = 4 
       data hash MD5: 32K
       D5 6D 5E 16 4B D9 B0 AC 5F 4B DB A7 9B 9B 53 B3>)
(   8,<2012-03-31 20:10:35.812 -0500>,<Administrator>,<TOPSPIN>,<proc1d>,<TOPSPIN 2.1>,
      <abs ABSG = 5 
       data hash MD5: 32K
       A7 25 F0 FF 00 2B EC F6 BF 3A 2D 98 3C 89 DD 7D>)
$$ ##END=
$$ 
$$ $$ hash MD5
$$ $$ AE 20 7E 8F 6F 84 43 4E 49 3F 40 71 1E FB 57 1C
##$RELAX= 
##$RELAX= 
##$RELAX= 
##$RELAX= 
##$RELAX= 
##$RELAX= 
##$RELAX= 
$$ Bruker specific parameters
$$ --------------------------
$$ [...]
##$TP= (0..7)
150 150 150 150 150 150 150 150
##$TP07= 0
##$TPNAME0= <>
##$TPNAME1= <>
##$TPNAME2= <>
##$TPNAME3= <>
##$TPNAME4= <>
##$TPNAME5= <>
##$TPNAME6= <>
##$TPNAME7= <>
##$TPOAL= (0..7)
0.5 0.5 0.5 0.5 0.5 0.5 0.5 0.5
##$TPOFFS= (0..7)
0 0 0 0 0 0 0 0
##$TUNHIN= 0
##$TUNHOUT= 0
##$TUNXOUT= 0
##$USERA1= <user>
##$USERA2= <user>
##$USERA3= <user>
##$USERA4= <user>
##$USERA5= <user>
##$V9= 5
##$VALIST= <valist>
##$VCLIST= <CCCCCCCCCCCCCCC>
##$VD= 0
##$VDLIST= <DDDDDDDDDDDDDDD>
##$VPLIST= <PPPPPPPPPPPPPPP>
##$VTLIST= <TTTTTTTTTTTTTTT>
##$WBST= 2048
##$WBSW= 25
##$XGAIN= (0..3)
0 0 0 0
##$XL= 0
##$YL= 0
##$YMAX_a= 527762
##$YMIN_a= -638213
##$ZGOPTNS= <>
##$ZL1= 120
##$ZL2= 120
##$ZL3= 120
##$ZL4= 120
##$ABSF1= 14.98061
##$ABSF2= -5.57192
##$ABSG= 5
##$ABSL= 3
##$ALPHA= 0
##$AQORDER= 0
##$ASSFAC= 0
##$ASSFACI= 0
##$ASSFACX= 0
##$ASSWID= 0
##$AUNMP= <proc_prof1d_extract_pilot.lims>
##$AXLEFT= 0
##$AXNAME= <>
##$AXNUC= <1H>
##$AXRIGHT= 0
##$AXTYPE= 0
##$AXUNIT= <>
##$AZFE= 0.1
##$AZFW= 0.1
##$BCFW= 0
##$BC_mod= 0
##$BYTORDP= 0
##$COROFFS= 0
##$CY= 15
##$DATMOD= 1
##$DC= 0
##$DFILT= <>
##$DTYPP= 0
##$F1P= 0
##$F2P= 0
##$FCOR= 0.5
##$FTSIZE= 32768
##$FT_mod= 6
##$GAMMA= 0
##$GB= 0
##$INTBC= 1
##$INTSCL= 1
##$ISEN= 128
##$LB= 0
##$LEV0= 0
##$LPBIN= 0
##$MAXI= 10000
##$MC2= 0
##$MEAN= 0
##$ME_mod= 0
##$MI= 0
##$NCOEF= 0
##$NC_proc= -8
##$NLEV= 6
##$NOISF1= 0
##$NOISF2= 0
##$NSP= 0
##$NTH_PI= 0
##$NZP= 0
##$OFFSET= 14.98061
##$PC= 1
##$PHC0= 213.3765
##$PHC1= 0
##$PH_mod= 1
##$PKNL= yes
##$PPARMOD= 0
##$PPDIAG= 0
##$PPIPTYP= 0
##$PPMPNUM= 2147483647
##$PPRESOL= 1
##$PSCAL= 4
##$PSIGN= 0
##$PYNMP= <proc.py>
##$REVERSE= no
##$SF= 400.13
##$SI= 32768
##$SIGF1= 0
##$SIGF2= 0
##$SINO= 400
##$SIOLD= 32768
##$SPECTYP= <>
##$SREGLST= <1H.CDCl3>
##$SSB= 0
##$STSI= 32768
##$STSR= 0
##$SW_p= 8223.68421052632
##$SYMM= 0
##$S_DEV= 0
##$TDeff= 65536
##$TDoff= 0
##$TI= <>
##$TILT= no
##$TM1= 0
##$TM2= 0
##$TOPLEV= 0
##$USERP1= <user>
##$USERP2= <user>
##$USERP3= <user>
##$USERP4= <user>
##$USERP5= <user>
##$WDW= 1
##$XDIM= 32768
##$YMAX_p= 470690510
##$YMIN_p= -705964
##$CURPLOT= <Network HP LaserJet P1505>
##$CURPRIN= <$Network HP LaserJet P1505>
##$DFORMAT= <normdp>
##$LAYOUT= <+/1D_H.xwp>
##$LFORMAT= <normlp>
##$PFORMAT= <normpl>
##$SURQMSG= 1
$$ End of Bruker specific parameters
$$ ---------------------------------
##NTUPLES= NMR SPECTRUM
##VAR_NAME=  FREQUENCY,     SPECTRUM/REAL,   SPECTRUM/IMAG
##SYMBOL=    X,             R,               I
##VAR_TYPE=  INDEPENDENT,   DEPENDENT,       DEPENDENT
##VAR_FORM=  AFFN,          ASDF,            ASDF
##VAR_DIM=   32768,         32768,           32768
##UNITS=     HZ,            ARBITRARY UNITS, ARBITRARY UNITS
##FACTOR=    0.250966925370066, 1,           1
##FIRST=     8223.43324360095, -107321,      -344508
##LAST=      0,             155049,          99750
##MIN=       0,             -705964,         0
##MAX=       8223.43324360095, 470690510,    0
$$ Real data points
##PAGE= N=1
##DATA TABLE= (X++(R..R)), XYDATA
$$ [...]
19465a34519M8629B4931a26001d1526J2407j62332e7828k803k83308a27605C877
19453H8765b11611j3491g4355m9897B13436i7111B63233a25100k74546J49390
19443b50256A88492a15302n791O127C8566F625f6811l22267a53384A34713a52146
19431a46802k73801a54125L2149j10554N7531n7850c5575j12076J2740A52467
19420a65036G6613h9451A20309g1890h8n4795q9329B38980I0334K17330a33407
19408b20313h1320o7o9494B3395c11442j57682a74665b3001f966l70051A60215
19396a14028k30283J19646G659a97480n5155p6369b8972I20i950l73819a16104
19384A71273c066I409K6257b22956b3493C9574b39938k8795R9046E9066a25649
$$ plain form
19465 -134519 -85890 24931 -126001 -41526 -29119 -191451 -57828 -60631 -343939 -127605 3877
19453 88765 -211611 -225102 -74355 -124252 213436 -97111 263233 -125100 -399646 -250256
19443 -250256 188492 -115302 -121093 -114966 38566 6625 -66811 -389078 -153384 134713 -152146
19431 -146802 -420603 -154125 -121976 -232530 -174999 -232849 -35575 -147651 -134911 152467
19420 -165036 76613 -89451 120309 -71890 -88 -54883 -144212 238980 90334 307664 -133407
19408 -220313 -81320 -81387 -150881 23395 -311442 -469124 -174665 -23001 -6966 -377017 160215
19396 -114028 -344311 -224665 7659 -197480 -252635 -329004 -28972 920 -9950 -383769 -116104
19384 171273 -3066 9409 35666 -222956 -23493 39574 -239938 -268733 -169687 59066 -125649
19372B5961b11392f5971j40595K1265h0333j30405p0674i2936l61349a23477C3501
19360e5056K135j8268j51669A14432M5273a16182p1228d7169P801l88917E6202
19348E549c70310b248l43555B64969j13870c3819B49243j24026a44839M545K5776
19337a14518l6993e0037j49917e9818p1501o6187B588c02288J28523e6375j3215
19326f9590A08617l5987A6504r32a89226N4831L2754j16687E3846f2795k03594
19315b66389d8766A36875K37026G2571d7973r4102A28784a42648c4509m5784r6570
19304a76863a4533k11426j36469d9030p3727B53101b47160K8368l9466F2224c34912
19292H3361e947j72500B9971a39081F1316b29516p1530B32905i4447l18849b4169
$$ plain form
19372 25961 -211392 -65971 -206566 -185301 -80333 -210738 -281412 -92936 -454285 -123477 33501
19360 -55056 -52921 -71189 -222858 114432 159705 -116182 -187410 -47169 -39368 -428285 56202
19348 5549 -370310 -2248 -345803 264969 151099 -33819 249243 125217 -144839 -140294 -114518
19337 -114518 -151511 -50037 -199954 -59818 -131319 -197506 2588 -302288 -173765 -56375 -69590
19326 -69590 108617 72630 16504 15572 -189226 -134395 -101641 -218328 53846 -62795 -266389
19315 -266389 -48766 136875 373901 72571 -47973 -142075 128784 -142648 -34509 -80293 -176863
19304 -176863 -14533 -225959 -362428 -49030 -122757 253101 -247160 -218792 -258258 62224 -334912
19292 83361 -5947 -178447 29971 -139081 61316 -229516 -301046 232905 -94447 -413296 -24169
19280B11077a63792j3025A0579h4443M380A49122J40290H7609C1545a65786A9612
19268e3801J6520j40934F1961c8819j12038C45845B1604c99503a0990A7571M06318
19257D23889A13938a33889B02097a34359K8246B04631q3983N4217f4473D932J1553
19246A6485J75574b40297B4303J27556a75337L749C15909a63533r784k1850p4469
19235b69636e5396A24490b52678D1960e0612B00482J07449a76460E9118b27690
19224e03582d3251a2038j07963L9858j35044A72876a19055n2610e4262j32742
19214a87004d5993B4343Q4952C6785h6884m5538k10532Q5998D9340b48972Q1194
19203a67778q5943j14259a503p8445A57059d7170a4838j31364f8211k13236l1089
$$ plain form
19280 211077 -163792 -176817 10579 -84443 -80063 149122 289412 87609 31545 -165786 19612
19268 -53801 -37281 -178215 61961 -38819 -150857 345845 21604 -399503 -10990 17571 423889
19257 423889 113938 -133889 202097 -134359 -106113 204631 120648 174865 -64473 4932 16485
19246 16485 192059 -240297 24303 151859 -175337 -171588 315909 -163533 -173317 -195167 -269636
19235 -269636 -55396 124490 -252678 41960 -50612 200482 307931 -176460 59118 -227690
19224 -503582 -43251 -12038 -120001 -80143 -215187 172876 -119055 -171665 -54262 -187004
19214 -187004 -45993 24343 109295 36785 -86884 -132422 -342954 -256956 49340 -248972 -167778
19203 -167778 -253721 -367980 -1503 -79948 157059 -47170 -14838 -146202 -68211 -281447 -312536
19192c12536G3577J11628c10864a43440A3853J0772i7214C34890H2917a11567
19181A43861g1241C17132H4768a37396A91177K97874c1303J0523k13022j52637
19171c86439B4149J7803a95419Q2732B87367j14819h8905k01575R3384F4242g1197
19159a07310j34290K4164A17007b05458j64968A10146b0122A53087b6518D8272
19148A45352J11550b29461k9004J1284Q0316n2061o0385g1351L4202k31422B12195
19136A07071b50385g9709A09949A9551a04702o4124k99034B69896j17921b9504
19125g6555l5821l3784B3954J35438o9799C8455f5809j75072A00022a81791f9717
19113c36635a52971K7410k64826g401A07393P263d91385b05652j48302N4059B8425
$$ plain form
19192 -312536 73577 185205 -310864 -143440 13853 24625 -97214 334890 82917 -111567
19181 143861 -71241 317132 84768 -137396 191177 489051 -31303 -20780 -233802 -386439
19171 -386439 24149 41952 -195419 -112687 287367 172548 -88905 -290480 -197096 64242 -71197
19159 -107310 -241600 -217436 117007 -205458 -370426 110146 -20122 153087 -26518 48272
19148 145352 256902 -229461 -258465 -247181 -166865 -218926 -279311 -71351 -37149 -268571 212195
19136 107071 -250385 -79709 109949 19551 -104702 -168826 -467860 269896 151975 -29504
19125 -76555 -112376 -146160 23954 159392 89593 38455 -65809 -240881 100022 -181791 -69717
19113 -336635 -152971 -125561 -390387 -7401 107393 114656 -491385 -205652 -353954 -299895 28425
19101e0197p0311j88852C8259d72587J44730J60438k19080f8868m62B37734f3778
19089c15437g7145k0768k467H8723a62579A13951b52993K5657l62717A71998o0509
19078A11489B3754c30743P8432C80402g8000k64421J52698B9172b30348a10674
19067A27221a28811b9786o277B09642G6231M0671a3540B4780J19395a37685N7329
19056h0356m8714p8278D4936a22636I5994J26748b09858p6478C4811f0596B64064
19044h0800I8342e3139j37942g0716f97o9412K0234A22924i9430d3601H0235b42363
19031b24004j00025B7342N1854A8085d4358G3875a46343l06749h1109j42050d7516
19019b72303D1958A9422c22871C8014h0576K3638K2085E1991c10786a27303A62668
$$ plain form
19101 -50197 -120508 -309360 38259 -472587 -327857 -167419 -386499 -68868 -69330 237734 -63778
19089 -315437 -77145 -97913 -100380 88723 -162579 113951 -252993 -227336 -590053 171998 111489
19078 111489 23754 -330743 -252311 380402 -78000 -342421 -189723 29172 -230348 -110674
19067 127221 -128811 -29786 -36063 209642 76231 116902 -13540 24780 144175 -137685 -80356
19056 -80356 -129070 -207348 44936 -122636 95994 222742 -209858 -286336 34811 -60596 264064
19044 -80800 98342 -53139 -191081 -70716 -697 -70109 -49875 122924 -99430 -43601 80235 -242363
19031 -224004 -324029 27342 79196 18085 -44358 73875 -146343 -453092 -81109 -223159 -47516
19019 -272303 41958 19422 -322871 38014 -80576 -56938 -34853 51991 -310786 -127303 162668
19007a42645M7218A27317C8482d1745C1408a49942j62040A25174a84948j93973
18997c78921a67111G0827J73250j19962C9970b28636O645B7205a19884b2094q8556
18986a10650C44866h928k27420A75599H3085P7815g7104A83233h1612I5005J14522
18975B09527a17675A5426J49332g4978b0477k06841c4187m05205h4946k3759c6391
18963c8697D0532d7118A97854r7358J57938J01098n430K0204j29993n248H3108
18951A2389J14573j7986a17672d3270j84938B29771G6154K62402J1082c14804
18940a04730k72325b2212o8561l9954A96082b15593A462d3829j76651d3918i565
18928B0081a63513k1567o873A20055a8147H9093f1457j09896h1828M540n9411
$$ plain form
19007 -142645 -95427 127317 38482 -41745 31408 -149942 -311982 125174 -184948 -378921
18997 -378921 -167111 70827 244077 124115 39970 -228636 -221991 27205 -119884 -22094 -110650
18986 -110650 344866 -8928 -236348 175599 83085 160900 -77104 183233 -81612 95005 209527
18975 209527 -117675 15426 164758 -74978 -20477 -227318 -34187 -439392 -84946 -108705 -36391
18963 -38697 40532 -47118 197854 100496 258434 359532 354102 374306 244313 239065 83108
18951 12389 126962 108976 -117672 -43270 -228208 229771 76154 338556 349638 -314804
18940 -104730 -377055 -22212 -90773 -130727 196082 -215593 1462 -43829 -220480 -43918 -9565
18928 20081 -163513 -185080 -191953 120055 -18147 89093 -61457 -171353 -81828 -77288 -136699
18917a36699A76373b03074B06987I4789O855B1876H529i3887j3118B06675e2456
18905c40677c4875k38059a8447l11866d4253D3606b55640F991K20452q5497l0087
18894A11859L23651B03121c4523I0214O6621l8807Q3197i9134c8534q3569A86237
18882c3214q3374e5296j06403O758l44151K13177B9582K3315a70523k25049E9098
18870a80208P3119L640j56978G2235a54366p5069n7535I6413a13653B44675I779
18858C22542b25778e0055A27577N7553G0437K99952a51583A29029c73270a40997
18847b89231I4544j0560c29945G8046J73858f773F4803b23331B75176g1522l40904
18836d12426B01878B07M157J81015j1298a33355C6100a87709f6973E6719E301
$$ plain form
18917 -136699 176373 -203074 206987 94789 101644 21876 8529 -93887 -107005 206675 -52456
18905 -340677 -34875 -272934 -18447 -330313 -44253 43606 -255640 6991 227443 141946 111859
18894 111859 435510 203121 -34523 90214 156835 118028 201225 -99134 -38534 -122103 186237
18882 -33214 -116588 -55296 -161699 -154941 -499092 -285915 29582 52897 -170523 -395572 59098
18870 -180208 -107089 -103449 -260427 72235 -154366 -229435 -286970 96413 -113653 244675 9779
18858 322542 -225778 -50055 127577 185130 70437 370389 -151583 129029 -373270 -140997
18847 -289231 94544 83984 -329945 78046 251904 -6773 64803 -223331 275176 -71522 -412426
18836 -412426 201878 207 4364 185379 174081 -133355 36100 -187709 -66973 56719 5301
18824A6505g7345C67867a87889A30848a83871f8503G3111R9613G6656d6220B81883
18812b535l29292A28J17274d06523A07909h907j14741A0652K03612l3858c13557
18800a19861P491A93397F256J537K42405q288b0952m2672k8219B94326O010F2796
18787b35586e0456B42355f6547A66163j1321b5654l57952f9520K2128E416K4553
18776B9969a15514I5350d9198A56885a17432B16901b94288j38233a47186H7597
18765i4734M4078o5495A59906e29592g6286A70183c33457I2732d04614a74676
18754G04J82142J0531C6998h3439C3266d7035l3748k05143h4081q498B28527F3114
18741h6433q4408A77424a92627r5789a7754D1095b20577a04147A55892b00233
$$ plain form
18824 16505 -77345 367867 -187889 130848 -183871 -68503 73111 172724 76656 -46220 281883
18812 -2535 -331827 128 117402 -406523 107909 -8907 -123648 10652 214264 180406 -313557
18800 -119861 -112370 193397 6256 7793 250198 241910 -20952 -63624 -91843 294326 300336 62796
18787 -235586 -50456 242355 -66547 166163 154842 -25654 -383606 -69520 -47392 5416 29969
18776 29969 -115514 95350 -49198 156885 -117432 216901 -294288 -432521 -147186 87597
18765 -94734 -50656 -116151 159906 -529592 -76286 170183 -333457 92732 -404614 -174676
18754 704 182846 193377 36998 -83439 33266 -47035 -80783 -285926 -84081 -92579 228527 63114
18741 -86433 -170841 177424 -192627 -288416 -17754 41095 -220577 -104147 155892 -200233
18730c63802L7408a32257A8914M645N1013J95462a49021C4564b53089e5891j55264
18719b11155a384j75607d2442j55292k4249j04505Q6107J06572P661c8718j26970
18708a65688h0090J2617k40815J01091c1052A08750a36778l7549j03850B17483
18697c0579j04894r5846B10740P6385I4595i3298F8037N0975a95183a9753k03679
18686b23432L3500O0810c6431H4459M1800m5176J64537e57573h734C93718D0213
18674a1492p9470F3370g5581l985j02944b493E7152J55398H0847i0679j5694c9486
18661A06458d8176r7031O7044q9600B93414A33211b55297A22793h0991B51830
18650I3586a45118k62539H135f4628I4276d67292e903j32276j8072j28423R6454
$$ plain form
18730 -363802 -326394 -132257 18914 23559 74572 270034 -149021 34564 -253089 -55891 -211155
18719 -211155 -1384 -176991 -42442 -197734 -221983 -326488 -240381 -133809 -126148 -38718 -165688
18708 -165688 -80090 -67473 -308288 -207197 -31052 108750 -136778 -174327 -278177 217483
18697 -30579 -135473 -231319 210740 287125 94595 -93298 68037 119012 -195183 -19753 -223432
18686 -223432 -189932 -129122 -36431 84459 126259 81083 245620 -557573 -8734 393718 40213
18674 -11492 -90962 63370 -75581 -79566 -182510 -2493 57152 212550 80847 -90679 -106373 -39486
18661 106458 -48176 -145207 -78163 -167763 293414 133211 -255297 122793 -80991 251830
18650 93586 -145118 -407657 8135 -64628 94276 -467292 -5903 -138179 -156251 -284674 -188220
18639a88220l2955a02240j93647f1625A24933c3489l86122a22846A83433A9947
18628A24473b0614F0112a86196A64389D8545e08736D7869d07998i6928g300l71339
18617c78639e6962l9032E659b29913B41158p9040h7004p1788j52839g178k1962
18606b9140D649J7834h4706j4103J5569q5713k75337a09939M1408l6447G540a07476
18593D6574i4334k1266A70368a22164I082b44197f8162b8191k25071H331a45630
18581A4608D565j734a67168k8397q2413g2247k89905B65496j09393c14651n0138
18570c64789d5602k25845R1758c7263l70236A79981n8254c43283d7835k7576L5909
18559c9502k52218i0459E9192g9079A45380c85921A14511a0080k23563d267j46550
$$ plain form
18639 -188220 -221175 -102240 -295887 -61625 124933 -33489 -419611 -122846 183433 19947
18628 124473 -20614 60112 -186196 164389 48545 -508736 47869 -407998 -96928 -7300 -378639
18617 -378639 -56962 -95994 5659 -229913 241158 162118 -87004 -158792 -311631 -7178 -29140
18606 -29140 4649 22483 -84706 -98809 -83240 -168953 -444290 -109939 -68531 -104978 7540 -107476
18593 46574 -94334 -115600 170368 -122164 9082 -244197 -68162 -28191 -253262 8331 -145630
18581 14608 4565 2831 -167168 -195565 -277978 -72247 -362152 265496 156103 -314651 -364789
18570 -364789 -45602 -271447 -179689 -37263 -407499 179981 121727 -343283 -47835 -75411 -39502
18559 -39502 -291720 -90459 59192 -79079 145380 -385921 114511 -10080 -233643 -4267 -150817
18548a50817g0626B7177i7961l08057A35628d0463H7493b58958k44965b30115
18537a31339k9628j65895A88588a93674Q5390A10530h3112j00395d1306A08970
18526H0707c06074d7407j13097j4774K2811j71883c9142A45270d5316A13436a78234
18514d4654j42218B30265G4775d8441j4330I2286h4233l6639A0296P6291J82721
18503B69308d4154A84828j3752F0396J39001a5299j39022n667l9407D72a19768
18491A69506i7019J8701E76144a26367B3933i9672D6057K17327J04518A74863
18480h367k71904L3586A62179a43688p7596B77821a38525o4268n9808a00794j43825
18469b44619b4694j49753A42950c23548f723q9757b7933H9701J91722l7695b50332
$$ plain form
18548 -150817 -70626 27177 -97961 -406018 135628 -40463 87493 -258958 -503923 -230115
18537 -131339 -160967 -326862 188588 -193674 -108284 110530 -83112 -183507 -41306 108970
18526 80707 -306074 -47407 -160504 -175278 -152467 -324350 -39142 145270 -45316 113436 -178234
18514 -44654 -186872 230265 74775 -48441 -62771 92286 -84233 -120872 10296 86587 269308
18503 269308 -44154 184828 171076 60396 199397 -15299 -154321 -159988 -199395 472 -119768
18491 169506 -97019 -78318 576144 -126367 23933 -99672 46057 263384 367902 174863
18480 -8367 -280271 -246685 162179 -143688 -221284 277821 -138525 -202793 -262601 -100794 -244619
18469 -244619 -24694 -174447 142950 -323548 -6723 -96480 -27933 89701 281423 243728 -250332
18457h7987K181F0149i1824k4654A4850a42121p6249Q430k9856A17626E7422R0684
18445A48106F6983a02340A41539F1066a5946B34848A06654D5753g6475B38358
18434e9177H0428f9634m41342B23381J5590a06605A03238l9811L9255j2396m0711
18423D9575a70640L4326B18099F862P0486d47279a60471H6301K3566b4633n0068
18412g4701A38077a21094e6529o5840e2028B47831b06091H7946e35320A68473
18401C6507L0017f2283j46971Q3337I5118k5844e6527A15457d1337o5920c3270
18389a388j04764a1394p2509A10575L03754b53622K4502f7172p5592a0930j29246
18378a40176N7271B0474b218m8720A61758a07870D2466a86888H1185e2714l1303
$$ plain form
18457 -87987 -85806 60149 -91824 -116478 14850 -142121 -218370 -209940 -239796 117626 57422 148106
18445 148106 66983 -102340 141539 61066 -15946 234848 106654 45753 -76475 238358
18434 -59177 80428 -69634 -510976 223381 238971 -106605 103238 63427 102682 90286 49575
18423 49575 -170640 -136314 218099 6862 77348 -447279 -160471 86301 109867 -24633 -74701
18412 -74701 138077 -121094 -56529 -122369 -52028 247831 -206091 87946 -535320 168473
18401 36507 66524 -62283 -209254 -125917 95118 69274 -56527 115457 -41337 -107257 -33270
18389 -1388 -106152 -11394 -83903 110575 414329 -253622 -229120 -67172 -142764 -10930 -140176
18378 -140176 -82905 20474 -2218 -50938 161758 -107870 42466 -186888 81185 -52714 -84017
18367h4017k18759A68178b45888j8636i0822j45709a7314G0231e3854r9958B603
18355B71867h8155b9709k00701B25997b52810m1614B9935h1802h245B25388b31456
18343A38740f0833j44939C0235c75070n4501D3097a03344C10525i5904m1546A39228
18331b3953j64966A16461b29632e4359q2359d5083A88749a14118l92255a10707
18320a29010j00033B08720h6522I6027a33757l36598d9699n4981M5086k88438
18310c48032F3467b09422A7431b35773F3005i3165k14031A81395K8020b31072
18299a85874c9536k67065A52696a72885I7208A7519J92298f6042a8686H4147J1964
18288I6111q081a91207A86573a05848A21959Q4875c6415J5380j24847k40655a27866
$$ plain form
18367 -84017 -302776 168178 -245888 -264524 -90822 -236531 -17314 70231 -53854 -153812 2603
18355 271867 -88155 -29709 -230410 225997 -252810 -294424 29935 -81802 -8245 225388 -231456
18343 138740 -60833 -205772 30235 -375070 -429571 43097 -103344 310525 -95904 -137450 139228
18331 -23953 -188919 116461 -229632 -54359 -136718 -45083 188749 -114118 -506373 -110707
18320 -129010 -229043 208720 -86522 96027 -133757 -470355 -49699 -104680 -59594 -348032
18310 -348032 63467 -209422 17431 -235773 63005 -93165 -307196 181395 209415 -231072
18299 -185874 -39536 -306601 152696 -172885 97208 17519 209817 -66042 -18686 84147 96111
18288 96111 88030 -191207 186573 -105848 121959 206834 -36415 -21035 -145882 -386537 -127866
18276A33034A5472B91N238J53967a50779I750C407a71452D1163b20270C4184O7071
18264A01255C3606i1762a6578j4939j10205k51102J78805A9662a18971r5445B04500
18252b21915h5831d1212M831k7070A86504b6127r2208B56626a85962g4782l045
18241g7827G3215d74666B49813a40034A52131d00345i1989k65116E8235b89114
18230C34270a1140B21803g3054j19171B0120a57949A12962M984B8233R9558Q7264
18219B15055o2672a47338N0242C2908L3150a82428C31898g1514B9744b18160H9778
18207f0259q0083m9803e3250F9655J82191d757A91275L7227n5888n3441c06102
18195A56136e0228n5019K2102k22275g9515B20127a77694p8567F6125K1656J40255
$$ plain form
18276 133034 15472 291 5529 159496 -150779 9750 3407 -171452 41163 -220270 34184 101255
18264 101255 33606 -91762 -16578 -31517 -141722 -392824 -214019 19662 -118971 -214416 204500
18252 -221915 -85831 -41212 -36381 -63451 186504 -26127 -118335 256626 -185962 -74782 -77827
18241 -77827 73215 -474666 249813 -140034 152131 -400345 -91989 -357105 58235 -289114
18230 334270 -11140 221803 -73054 -192225 20120 -157949 112962 117946 28233 127791 215055
18219 215055 152383 -147338 -97096 32908 66058 -182428 331898 -71514 29744 -218160 89778
18207 -60259 -140342 -190145 -53250 69655 251846 -4757 191275 228502 172614 119173 -306102
18195 156136 -50228 -105247 -83145 -305420 -79515 220127 -177694 -256261 66125 87781 228036
18184B28036b46077b4802n189H013k033g3945o1890k15897d453b40A06870c40401
18171a44471c5226k28562m5630f7311B20671f6367A3717Q8454C9960M13076d3980
18159A18934K6021a08314M2939B45685b14831G750b95318A52929B5257J08868
18149A34125j3787b29249e0815B5328h1602B8774c24220i1404B0215J5563K5753
18138F1531f3826G8489k8776k2926c96233h3k22719Q8670d6535A31709F365e7441
18125E9348g5784b6297B08511B8208a72027B30961L0540a40786a5979D892R5159
18114A00051k2870a05008E9841k5268f1476C6345q446J43641c3520a0409A48896
18102b2909A87397J00640a21444A09236a61607e4928k55794N3529A19339m7970
$$ plain form
18184 228036 -246077 -24802 -29991 8013 5980 -73945 -135835 -351732 -4453 -240 106870 -340401
18171 -144471 -35226 -263788 -309418 -67311 220671 -66367 13717 102171 39960 453036 -43980
18159 118934 144955 -108314 -65375 245685 -214831 7750 -295318 152929 25257 134125
18149 134125 120338 -229249 -50815 25328 -81602 28774 -324220 -91404 20215 35778 61531
18138 61531 -63826 78489 49713 26787 -396233 -83 -222802 -134132 -46535 131709 6365 -57441
18125 59348 -75784 -26297 208511 28208 -172027 230961 261501 -140786 -15979 4892 100051
18114 100051 77181 -105008 59841 34573 -61476 36345 27899 171540 -33520 -10409 148896
18102 -22909 187397 288037 -121444 109236 -161607 -54928 -310722 -257193 119339 71369
18092G1369a60779J9542H9342b89200g056F2431d6790q2880j388A24864J22310
18081B47174Q7204b22425B7092j2100L03177a196j28851N8530j52077f7343A07794
18069a12639D7537g1877k54173A34642J44536a64704B45710b69339c8357j30449
18059a68806l9901j02514k960b2894C6761L50425A02183a7893j09271c5712q7582
18048a23294L0353j65519M08D019a24449j36530A58025A4721b49947r4967B76643
18036b16377J00520n881q2811G5307c5534A45405a99739C34731a35219k82574
18026d17793a56764K7455e4654H7515f4224k08171O3438A10348k6574f2205D50976
18014a35811H958c5107A02849J40044r8512a3468j50836k80229J89322k0245F6793
$$ plain form
18092 71369 -160779 -141237 89342 -289200 -7056 62431 -46790 -129670 -131058 124864 247174
18081 247174 334378 -222425 27092 14992 318169 -1196 -130047 -71517 -223594 -67343 107794
18069 -112639 47537 -71877 -326050 134642 279178 -164704 245710 -269339 -38357 -168806
18059 -168806 -208707 -311221 -314181 -22894 36761 387186 102183 -17893 -127164 -35712 -123294
18048 -123294 -92941 -258460 -258052 4019 -124449 -260979 158025 14721 -249947 -344914 276643
18036 -216377 -115857 -121738 -204549 75307 -35534 145405 -199739 334731 -135219 -417793
18026 -417793 -156764 -129309 -54654 87515 -64224 -272395 -208957 110348 83774 -62205 450976
18014 -135811 8958 -35107 102849 242893 144381 -13468 -164304 -444533 -255211 -275456 66793
18002C5194b06289h4896q693C63485B5516i3018b2038k50165B37240C0533g0337
17990b4962j95925F5472J75819F8299a00002A12720A50a62295B22957a98447R4586
17979a03861A76908L8208a24256A01381a51899C58160a89428f9976A295a25245
17968a20060A0721a72554k79969a81455l9508A85203J5438f5234C31503M4509
17958C76012j03030d8384k20280B22493J13324K6316k6429E835J05018K13491
17948C24344o5245h2866j26581B38090G8615A5980b5492F7681J95773b2295B66258
17936a87419k7878g7207j49936Q3319B16460a78708p6049A93350b99095A10827
17925B31875D706b24579B0824M5001O517A8118J73645G2263b55742E3875e3162
$$ plain form
18002 35194 -206289 -84896 -93589 363485 25516 -93018 -22038 -272203 237240 30533 -70337
17990 -24962 -220887 65472 241291 68299 -100002 112720 150 -162295 222957 -198447 -103861
17979 -103861 176908 215116 -124256 101381 -151899 358160 -189428 -69976 1295 -125245
17968 -120060 10721 -172554 -452523 -181455 -220963 185203 200641 -65234 331503 376012
17958 376012 272982 -48384 -268664 222493 335817 362133 335704 5835 110853 324344
17948 324344 259099 -82866 -209447 238090 78615 15980 -25492 67681 263454 -22295 266258
17936 -187419 -215297 -77207 -227143 -143824 216460 -178708 -254757 193350 -299095 110827
17925 231875 4706 -224579 20824 65825 72342 18118 191763 72263 -255742 53875 -53162
17913f6133A2382b35427h6897F9372Q8070l8857f7049b0530B79021A28351c001
17901B01632F3970J4521a0847k2966l2729l25258d040p3265g640j93403B00010
17889A04829b49658D37684A45618C8815J15895k8006g9096j2248j77117b7433
17878A79016c48l64156A06978a6191p4777A54208b5241m4346k65398Q2306F3553
17866A29023i8971A09722b9538k0464k3416C6607d39259J94621J4921o4949A73502
17854f7443j7362e439j88958o9553a26166A32483i46A27717J10468m0441l2825
17843A64919a55069D33355q9099A54484b10199E2189O7046a08356B64584b26931
17832C98708a46519E5448f9606H0706a79257j04658O9035d3207l4512D4850A2836
$$ plain form
17913 -66133 12382 -235427 -86897 69372 157442 118585 -67049 -20530 279021 128351 -3001
17901 201632 63970 78491 -10847 -33813 -66542 -391800 -4040 -77305 -7640 -201043 200010
17889 104829 -249658 437684 145618 38815 154710 126704 -79096 -91344 -268461 -27433
17878 179016 -348 -364504 106978 -16191 -90968 154208 -25241 -69587 -334985 -252679 63553
17866 129023 -98971 109722 -29538 -50002 -73418 36607 -439259 -244638 -229717 -294666 173502
17854 -67443 -84805 -5439 -194397 -263950 -126166 132483 -946 127717 238185 197744 164919
17843 164919 -155069 433355 344256 154484 -210199 52189 119235 -108356 264584 -226931
17832 398708 -146519 55448 -69606 80706 -179257 -283915 -214880 -43207 -77719 44850 12836
17820B61323G4635A0670M8970J4496a33739C23883a14933C63509a96225g9541
17809b74427e5404E4070j8232L451c16365B88380C6938M7893l741P9173p6397
17798H3866K77417a44267k447n9609E6875a85676O6670l7564B90003L7198A07652
17786a30780A09897P374a4917A89114I4244c22340A7293J50911d66250e4289C59643
17774d983C03172I9666c44162P2330h1248A47548b14390O5935n3880H3924P3549
17763A57473J71984e5511k64016J25157Q0340J583j2806G4973d57598A8497M7140
17752F5637c0555H2352a66892I9700J53195j26294K2453D5925f2574o5539A9060
17740c955p3708b8690A54147P6257A3934J58943e5412F9302j4194K53290i480
$$ plain form
17820 261323 74635 10670 59640 74136 -133739 323883 -114933 363509 -196225 -79541
17809 -274427 -55404 54070 35838 39289 -316365 288380 36938 84831 81090 160263 83866
17798 83866 361283 -144267 -146714 -206323 56875 -185676 -119006 -156570 290003 327201 107652
17786 -130780 109897 117271 -14917 189114 94244 -322340 17293 168204 -466250 -54289 359643
17774 -4983 303172 99666 -344162 -271832 -81248 147548 -214390 -148455 -202335 83924 157473
17763 157473 329457 -55511 -319527 -194370 -114030 -112447 -125253 74973 -457598 18497 65637
17752 65637 -30555 82352 -166892 99700 252895 126601 149054 45925 -62574 -128113 19060
17740 -3955 -77663 -28690 154147 230404 13934 172877 -55412 69302 55108 308398 -9480
17728A11311R4611c01813F2152a14336B1270a65117d2186i098B21410A4441J67007
17717A81448C7206J28873N1350i4478l6032B6065e098I2843J9119l3764h8150
17705c2379B86891a20119F5969e0322I7587b20947B5506c95837B8528L0628K16917
17694B76073E7466N7797K15261B7659J69711k2331l597b72508g1066o3801n3790
17683a88657L9060f6751j5584B3357M0308e7696j14810B24443E8631d6563a1603
17671B92381F0057a93383A46382b10442A46718l003K8530o3009I426J44931o7809
17660H6548K80013a98713p392C25958h5241B74826l6249a36718A46588f6743A98145
17648a14752B42919o1786a4424A85971a36849l7149A80405J17857P3307j44377
$$ plain form
17728 111311 205922 -301813 62152 -114336 21270 -165117 -42186 -9098 221410 14441 181448
17717 181448 37206 166079 217429 -94478 -130510 26065 -5098 92843 111962 78198 -88150
17705 -32379 286891 -120119 65969 -50322 97587 -220947 25506 -395837 28528 59156 276073
17694 276073 57466 115263 330524 27659 197370 175039 171442 -272508 -71066 -134867 -188657
17683 -188657 -149597 -66751 -82335 23357 63665 -57696 -172506 224443 58631 -46563 -11603
17671 292381 60057 -193383 146382 -210442 146718 143715 172245 109236 9426 154357 86548
17660 86548 366561 -198713 -206105 325958 -85241 274826 238577 -136718 146588 -66743 198145
17648 -114752 242919 181133 -14424 185971 -136849 -173998 180405 298262 371569 227192
17638B27192n7409P1942m4102g3797l9372j47492A99148a33278b4270H2628B1343
17626a09408D01547b5497E14378l3126A11622K3564B3650J23416b21185B37039
17615E2125J66765q8331J30806D8219J55762K87170A34108J13823d01630A05496
17604C50128D3913a42465C95343A89272e9241A17365M3553a06320D31033H9159
17593I1984K70077A77961a17491A54141g50B27531G0459J52238C732K39322a00632
17581H6045D485e0754A55484P313L918Q9817A3568P0524J2399J99045d3674j8728
17569f2402l0028A63719F7154N7493a06647k6126A72214n5536K0084c0630A92028
17557B49571D949A091J7530L52728c07100C52949D2317e2562K5470A47722h3412
$$ plain form
17638 227192 169783 241725 197623 -73797 -113169 -260661 199148 -133278 -24270 82628 21343
17626 -109408 401547 -25497 514378 481252 111622 135186 23650 147066 -221185 237039
17615 52125 218890 130559 261365 48219 203981 491151 134108 247931 -401630 105496
17604 350128 43913 -142465 395343 189272 -59241 117365 160918 -106320 431033 89159
17593 91984 362061 177961 -117491 154141 -750 227531 70459 222697 3732 243054 -100632
17581 86045 4485 -50754 155484 162797 166715 256532 13568 84092 96491 295536 -43674 -62402
17569 -62402 -92430 163719 67154 124647 -106647 -132773 172214 116678 136762 -30630 192028
17557 249571 4949 1091 18621 371349 -307100 352949 42317 -52562 -27092 147722 -83412
17545A43376K45809K9451b49754C4615J27971K51663G5234R509J25847m9470K23123
17534C84243A72617J29851e5994B67902K08909j72802n753c7886C04311r0986
17524B13325j7071K63941j05884N0325j40923K51260C8918c8728A4441N60350
17514E74791A32164K95616M53642l54733R8155K27352J37735j85729j79972j11490
17504E12740j79773j61550j1620L4006K83594k08685J21015o3716L15418j01215
17494E40214L41788j4290j84750O5368j49105B52897q1604J72339j21841L4289
17484B56080l2427J1628J93263A70695N4983J9222L30392E6816K51848J82050
17474D90714B43534c2337D22908j01597k3257j36465B4410J27897M07189B37385
$$ plain form
17545 143376 389185 418636 -249754 34615 162586 414249 75234 84743 210590 161120 384243
17534 384243 172617 302468 -55994 267902 476811 304009 298256 -37886 304311 213325
17524 213325 196254 460195 354311 404636 263713 514973 38918 -38728 14441 574791
17514 574791 132164 427780 881422 526689 624844 852196 989931 804202 624230 512740
17504 512740 332967 171417 159797 193803 477397 268712 389727 326011 641429 540214
17494 540214 882002 867712 682962 748330 599225 252897 171293 343632 221791 256080
17484 256080 223653 235281 428544 170695 225678 244900 575292 56816 308664 490714
17474 490714 243534 -32337 422908 321311 298054 161589 24410 152307 559496 237385
17463C9235P13749G4441B6962K11083j08172K85691B6033K49165A30176C1595
17452D40816H9951J13832J10553J39224j40312A36984J14648M2691m8344M3858
17442B89837F847J8836J39370J28929L78792B02000M04209A98509l5245K71755
17432D35019j11664j25050L86571A89595Q579K12940k9731K1312A8177L77497
17422C95674j46470L1177J1914P5463j0198r4867J3800C9090N64274A01444M16525
17411E17969k30584n2661E1074J82333L34551F2983K78572r6457J44451j15408
17401B74141p6351K63040A59687K31734K17596A37105L68445B27859j7873L9910
17391B49896a52309C57488A37018J27176e1626A41179P7730A09352J24459N0358
$$ plain form
17463 39235 752984 74441 26962 238045 129873 415564 26033 275198 130176 31595
17452 440816 89951 203783 314336 453560 313248 136984 251632 294323 245979 289837
17442 289837 6847 25683 165053 293982 672774 202000 606209 198509 163264 435019
17432 435019 323355 198305 584876 189595 198174 411114 381383 402695 18177 395674
17422 395674 249204 280381 292295 367758 357560 262693 276493 39090 603364 101444 517969
17411 517969 287385 234724 51074 233407 567958 62983 341555 245098 389549 274141
17401 274141 197790 460830 159687 391421 609017 137105 505550 227859 209986 249896
17391 249896 -152309 357488 137018 264194 -51626 141179 218909 109352 233811 284169
17381B84169C585L16755A4740L06888j06025E8592J28683q2306K3824k7861Q9765
17370A90697J33693q4496I9649N70722F8752G758O3036k3J52815K4469e504C90026
17357B65380h4622L5845A34944J61554J14510A2002L19308p0693N7915j51239
17347A67293d6451C00365j33114L61158A47743g8860L0794B42549Q7389K26903
17337E56841B51170J51952E8669M28301k20815a1935D3485J83252K11778A90314
17326A59510J33359p9418q6896C3985e5332J365C40318a04431D45941j26910a00233
17314B60168O151h77B22009j03642J00179I3966i074A59877J90934J43770j00793
17303C93788q1955A41321M2522R1205K41888q4468F4469J36329D1223L04266a1395
$$ plain form
17381 284169 3585 320340 14740 321628 215603 58592 187275 104969 128793 100932 190697
17370 190697 324390 239894 99649 670371 68752 7758 70794 70771 223586 248055 -5504 390026
17357 265380 -84622 -48777 134944 296498 411008 12002 331310 260617 318532 167293
17347 167293 -46451 300365 167251 528409 147743 -78860 -48066 242549 329938 556841
17337 556841 251170 403122 58669 486970 266155 -11935 43485 226737 438515 190314
17326 159510 292869 213451 126555 33985 -55332 -53967 340318 -104431 445941 319031 -100233
17314 260168 266319 -877 222009 118367 218546 93966 -9074 159877 350811 494581 393788
17303 393788 311833 141321 183843 275048 516936 432468 64469 200798 41223 345489 -11395
17291i0989C43263J68914j23787R4044B35893B0180P37189l65585N7709c2693
17280B50312r9770J72145j47252L3499I1263K34556L17661A20247K27587E6239
17269B12702q1130J58777A29703J39073L19365k88399E4084K64443E6177K09526
17259B65703r3063R2449M1994r9812r477L55067J13001k23302j36209k0587d5794
17247B98933J38547j54934k3270L0053J16945a7620E29545B54138c43364e8685
17236C34475M0951D092K34591I372J01411J68230J01195J91379B4146M97539j55135
17225C66550J56055A35147M71057k63837A03891l1694M47478A9126M40242l6768
17215D22600k07180J36655J93664j82375A60625p5523K51001N4622J80328j79743
$$ plain form
17291 -90989 343263 512177 388390 482434 235893 20180 757369 391784 449493 -32693
17280 250312 150542 322687 175435 208934 91263 325819 643480 120247 347834 56239
17269 212702 131572 290349 129703 268776 588141 299742 54084 318527 56177 265703
17259 265703 172640 265089 307083 207271 197794 552861 665862 442560 306351 285764 -45794
17247 298933 437480 282546 259276 289329 406274 -17620 529545 254138 -343364 -58685
17236 334475 375426 4092 238683 9372 110783 279013 380208 571587 24146 521685 366550
17225 366550 522605 135147 606204 342367 103891 72197 519675 19126 459368 422600
17215 422600 215420 352075 545739 363364 160625 85102 336103 390725 571053 391310
17205C91310j53506K24181k05161j03774M00465K1640p6492k43919A10412L50366
17195D60778j39628q1186O44470m06493A00034J76108M19947k72092A27728L93560
17185E21288A17530K78440L6292R2461Q3220j99840A36677P9936a23331D20376
17174D92084j09899A28732O08866A66442j9262L69351k56275Q0902A33587J70326
17164C03913J71013j6570o145D6486O29084l10418K5265J99294j78435n4052J46156
17153E03380l2810K55447C23858J6222j10121J97183O5492R9859A63599M72908
17143F36507m2435n7667j50278P6946P093F2069N14065O500j82380L36355C37331
17131C30687J72165j17802K32817R091k3262k36369J29180k233l2384J03022B23411
$$ plain form
17205 391310 237804 461985 256824 153050 553515 575155 498663 254744 110412 460778
17195 460778 321150 239964 884434 477941 100034 276142 696089 423997 127728 521288
17185 521288 117530 395970 432262 524723 607943 408103 136677 216613 -123331 420376
17174 492084 382185 128732 737598 166442 147180 516531 260256 341158 133587 303913
17164 303913 474926 458356 452211 46486 675570 365152 390417 589711 411276 357224 503380
17153 503380 470570 726017 323858 340080 229959 427142 492634 592493 163599 636507
17143 636507 594072 536405 386127 463073 470166 62069 576134 582634 400254 736609 337331
17131 330687 502852 385050 617867 626958 603696 367327 496507 494274 461890 564912 223411
17119G31842m7019B04702L19010k37131L56954k34404K2934J57526r548j05867
17109D74176A77702L98030A99756L01144J70789k88062I4559L37831K30633K07567
17099H70590l88280K96851l21102K04418k5817B89582L34846j86400P0221M69987
17089I78236j57770C80422L25641j98276k40261K96652l0547K72653k64638N3671
17079E95317k71873k3900M25886k04177K71223l47801K7168N20543l49604J42723
17069G85505j87147L7651k0376M4307j19385K17072k49177J16119J72765j81512
17059F15822R9764C25991M57572j38759O3407C11745L15868o7600K37655l6396
17049G61272j06298q9115K0127J01362K25639J03809k53987N5158l00049J06496
$$ plain form
17119 731842 684823 204702 523712 286581 643535 409131 432065 589591 580043 474176
17109 474176 177702 575732 199756 500900 671689 383627 94559 432390 663023 870590
17099 870590 482310 779161 458059 662477 636660 289582 624428 438028 508249 978236
17089 978236 820466 380422 706063 507787 267526 564178 533631 806284 541646 595317
17079 595317 323444 299544 725430 521253 792476 444675 471843 992386 642782 785505
17069 785505 598358 636009 615633 659940 540555 757627 508450 624569 797334 615822
17059 615822 715586 325991 783563 644804 708211 311745 627613 560013 797668 761272
17049 761272 654974 565859 585986 687348 912987 1016796 762809 817967 517918 624414
17039F24414L46225j70507l17911M26709j70317l8520j68366R4927M7747p4994
17029E99407J85162J69333C45269L75743N54745l84651r4386j3827C42973K12660
17019E55633P00671l87077K5342J32725j71994q8919K34494q2546q0731l40435
17009D97163M34193L0078J6621m09051M71436l45523K27698M0996Q546Q2090J7666
16998A071913j28732J20501j73286j81282J61307J12241j441p0775J30485L50361
16988A391292m91118m7582J84111J68032j25027Q6266k02660J70750k622j34842
16978I96600K39883m89591J51725M38270j07641j39871j50475J51959k42075L45246
16968A194030J03361r5992k74222J98518n2453J8757L5198K63032n29746M67369
$$ plain form
17039 624414 970639 800132 482221 908930 738613 700093 531727 626654 674401 599407
17029 599407 784569 953902 345269 721012 1275757 891106 796720 782893 342973 555633
17019 555633 1256304 869227 894569 1027294 855300 766381 1000875 918329 837598 497163
17009 497163 931356 961434 978055 569004 1040440 694917 922615 963611 972157 1054247 1071913
16998 1071913 943181 1063682 890396 709114 870421 982662 981221 910446 1040931 1391292
16988 1391292 900174 852592 1036703 1204735 1079708 1165974 963314 1134064 1131442 996600
16978 996600 1236483 746892 898617 1336887 1229246 1089375 938900 1090859 848784 1194030
16968 1194030 1297391 1201399 927177 1125695 1073242 1091999 1127197 1390229 860483 1327852
16958A327852k52817K91158J53844m28182K65408j90700J94943l03034L32825
16949A391297P6212N4858k53512J08035K33518m78018L60697m4655k73755K51379
16939A426056q2715P27J23248l854j24141M5794Q2168K60237k26735K57875j20689
16928A637971r240o7387q6744J47947R9296m1352j65566J46938N2106M5728k65391
16917A494306O53151n73871R5852l2052K42823N5377o0900Q5357j64025j97978
16907A598040L66360J37211m86651L94995J25338R4320J70750l75691P3815j54728
16897A943759K69915j69752j27895M97032j82653J8032j16000N3206L87251P1222
16887B644117k40491k4032m3409J23664L9625J56598l02972L22963j67133J15261
$$ plain form
16958 1327852 1075035 1366193 1520037 1091855 1357263 1166563 1361506 1058472 1391297
16949 1391297 1467509 1522367 1268855 1376890 1610408 1132390 1493087 1448432 1174677 1426056
16939 1426056 1343341 1344068 1467316 1463462 1339321 1385115 1467283 1727520 1500785 1758660 1637971
16928 1637971 1628731 1561344 1474600 1622547 1721843 1680491 1514925 1661863 1713969 1759697 1494306
16917 1494306 2147457 1573586 1669438 1637386 1880209 1935586 1874686 1960043 1796018 1598040
16907 1598040 1964400 2101611 1614960 2009955 2135293 2229613 2400363 2024672 2098487 1943759
16897 1943759 2213674 2043922 1916027 2413059 2230406 2248438 2132438 2185644 2572895 2644117
16887 2644117 2403626 2379594 2336185 2459849 2499474 2656072 2353100 2676063 2508930 2624191
16877B624191k0389J44885K00426k28981L04700j73702j27468K67121R6771O6970
16867C154524m17382K08474K34024L425k64631L39419k38269M08777l7223k16439
16857C174699K50267n1151K52228J34853j03022q350k12670K14421J53333K09966
16847D014574p7887J55540J53776k82612K79668l85731L27857n4025j65675M84813
16837D450298j50297M1979L55858J5976K62572q5274k58020K11705k19490N79627
16827E204934O5011Q1960K859J55840K64963l94581M93009k04974K44331K14073
16817F127425j10612K3965M60906J3832r7570K97716p3517K63071M90766l55780
16807G040202n1066N08891j54899J07556L84263K81024k11459M28722M08100O1278
$$ plain form
16877 2624191 2603802 2748687 2949113 2720132 3024832 2851130 2723662 2990783 3087554 3154524
16867 3154524 2737142 2945616 3179640 3183065 2918434 3257853 3019584 3428361 3391138 3174699
16857 3174699 3424966 3373815 3626043 3760896 3657874 3649524 3436854 3651275 3804608 4014574
16847 4014574 3936687 4092227 4246003 3963391 4243059 3857328 4185185 4131160 3965485 4450298
16837 4450298 4300001 4341980 4697838 4713814 4976386 4891112 4633092 4844797 4625307 5204934
16827 5204934 5269945 5351905 5354764 5510604 5775567 5380986 5873995 5669021 5913352 6127425
16817 6127425 6016813 6040778 6501684 6515516 6417946 6715662 6642145 6905216 7395982 7040202
16807 7040202 6989136 7498027 7343128 7450684 7834947 8115971 7904512 8333234 8741334 8802612
16797H802612J36439J18646J05139K90846j17349P09717L8752L48853P8523J97242
16787A0709420K09622K50336K9524M60056M62993J92620M99016P4073L12780K15932
16777A3416372O61491Q7433N50063L52405J01485M70649N86786L07278O24974
16768A7158936K13959P68256O39550K48155O87884P27885P01698K28883R15216
16759B2290422R19642O42303N39300Q60210Q63893P49339J016086J269321N37168
16750B9687684J367638Q19294J477981J201873R79343J333271J316172J754485
16742C9937741J482272J568417J724041K011224J857831J849125K513857J872875
16734E4817383K119265K559317K480983K588044K745842K981152L396233K636217
$$ plain form
16797 8802612 8939051 9057697 9162836 9453682 9336333 10046050 10084802 10433655 10512178 10709420
16787 10709420 10919042 11169378 11198902 11658958 12121951 12314571 12813587 12887660 13200440 13416372
16777 13416372 14077863 14165296 14715359 15067764 15169249 15639898 16226684 16533962 17158936
16768 17158936 17372895 18141151 18780701 19028856 19716740 20444625 21146323 21375206 22290422
16759 22290422 23210064 23852367 24391667 25251877 26115770 26865109 27881195 29150516 29687684
16750 29687684 31055322 31874616 33352597 34554470 35533813 36867084 38183256 39937741
16742 39937741 41420013 42988430 44712471 46723695 48581526 50430651 52944508 54817383
16734 54817383 56936648 59495965 61976948 64564992 67310834 70291986 73688219 76324436
16726G6324436L484241L255785L681152L346004L609851L755317M193037L629958
16718A05279781M117225L145579M012908L309511L860446L411272K943111K848711
16710A32928544K271622K490172J563916J504690O81534Q10945j56859o82577
16702A41411987q87034j762049j655016k586861k564434k793067l167482l502635
16694A22493409l540420l974340l766147m043698l668182l981102l863177l698888
16686I1957455l688451l709912l710233k976552l490348k965519l086059k927900
16678F5402481k597601k740543k451465k592112k199760k038165k359612j787570
16670D6635653j733709k036400j526591j564416j777102j543212j284923j113602
$$ plain form
16726 76324436 79808677 83064462 86745614 90091618 93701469 97456786 101649823 105279781
16718 105279781 109397006 112542585 116555493 119865004 123725450 127136722 130079833 132928544
16710 132928544 135200166 137690338 139254254 140758944 141440478 142251423 142094564 141411987
16702 141411987 140524953 138762904 137107888 134521027 131956593 129163526 125996044 122493409
16694 122493409 118952989 114978649 111212502 107168804 103500622 99519520 95656343 91957455
16686 91957455 88269004 84559092 80848859 77872307 74381959 71416440 68330381 65402481
16678 65402481 62804880 60064337 57612872 55020760 52821000 50782835 48423223 46635653
16670 46635653 44901944 42865544 41338953 39774537 37997435 36454223 35169300 34055698
16662C4055698j083919j380285j436719r14355j164647j007689n38388q21873
16654B5707823j222356l17290j303154m40289q89961k57012r64841l81964q15767
16645A9115189n15569l51929p99829p10653l64552k26177q65022l8026k55771
16636A4987661o05974m89926m21307j00314m50722m68741k42826j07382l74527
16627A1725942n28811k96604Q1960j73272m19788M4125m79141m74396M23940o86517
16617I217438k89382J25761k35415o28886J49044j34665m08378J89841k90206
16608G695152l03729l55682L09123J10011k67266n46440J1065J63117j99797k62286
16598F353268k97217M75689m35120p0912K7986m67349j16649J77626k9494k95664
$$ plain form
16662 34055698 32971779 31591494 30154775 29240420 28075773 27068084 26529696 25707823
16654 25707823 24485467 24168177 22865023 22424734 21534773 21277761 20312920 19930956 19115189
16645 19115189 18599620 18247691 17447862 16737209 16372657 16146480 15281458 15243432 14987661
16636 14987661 14381687 13891761 13470454 13370140 12919418 12450677 12207851 12100469 11725942
16627 11725942 11197131 10900527 10982487 10809215 10389427 10433552 9954411 9480015 9903955 9217438
16617 9217438 8928056 9053817 8818402 8189516 8338560 8203895 7795517 7985358 7695152
16608 7695152 7391423 7035741 7344864 7454875 7187609 6641169 6652234 6815351 6615554 6353268
16598 6353268 6056051 6531740 6096620 6025708 6053694 5586345 5469696 5647322 5617828 5322164
16588E322164j33248r1267J87767n36768K10007n8268l25205Q4008L5830j33660
16578D561360j27969L2769l16874j58198K52226j00945J65809l51785k30456K70368
16568C996305O7533n56953K97380j52338J9501j20479k53727L71714l01408P7592
16558C445120j87356J46811k69358J20903o1086q9835j78109J16118O3405k05121
16548B901492m1016n0167j24517M7032p7234K29191j06167N7323P4825r3339n28815
16537B288608K01237j05227j23078P9051J49429k4079j99711J01253O1811j19507
16527B309787k1140l93002L52349R9602n3071k78433j1738P4550R721Q8940j01705
16516B075860j21768k05551k2304N44435m97663L17197j48147K19734l4275k27748
$$ plain form
16588 5322164 5188916 5097649 5285416 4748648 4958655 4900387 4575182 4659190 4695020 4561360
16578 4561360 4433391 4466160 4149286 3991088 4243314 4142369 4308178 3956393 3725937 3996305
16568 3996305 4063838 3506885 3804265 3651927 3671428 3550949 3297222 3668936 3367528 3445120
16558 3445120 3257764 3404575 3135217 3256120 3195034 3105199 2927090 3043208 3106613 2901492
16548 2901492 2860476 2810309 2685792 2732824 2655590 2884781 2778614 2835937 2910762 2817423 2288608
16537 2288608 2489845 2384618 2261540 2340591 2490020 2465941 2266230 2367483 2429294 2309787
16527 2309787 2288647 1895645 2247994 2347596 2294525 2016092 2004354 2078904 2088625 2177565 2075860
16516 2075860 1954092 1748541 1726237 2270672 1773009 2090206 1942059 2161793 2127518 1899770
16506A899770l57950o149N361J34556J10642M8133J141N2492l25291J58837O358
16495A727900j68867k51830L93383k19382k92263K48958K262J75485j78236N7654
16485A495064J46887o38435P94068m37819J15220n8580n6070K24965J33912k27962
16475A491250k34002k7546r0332J97955K17910p24894L56045j1445P9450J92532
16465A446923P1642k99595J9734j44110K91494k6407l82579K83292l77011K34417
16455A117800j1663j37660J46053j21848L98609l3536l47856M41090l58959J62660
16445A254690o5335j10745j5567J18765l26490L94850l18016M13775m70329q469
16435H67129J79743L68702m30512m657n4409J05284k18778P69698p00479M9298
$$ plain form
16506 1899770 1541820 1535671 1541032 1675588 1786230 1834363 1835504 1887996 1562705 1721542 1727900
16495 1727900 1559033 1307203 1700586 1481204 1188941 1437899 1440161 1615646 1437410 1495064
16485 1495064 1641951 1003516 1797584 1359765 1474985 1416405 1360335 1585300 1719212 1491250
16475 1491250 1257248 1229702 1139370 1337325 1555235 830341 1186386 1174941 1254391 1446923
16465 1446923 1518565 1218970 1238704 1094594 1386088 1359681 977102 1260394 883383 1117800
16455 1117800 1106137 968477 1114530 992682 1391291 1357755 1009899 1450989 1092030 1254690
16445 1254690 1189355 1078610 1063043 1181808 855318 1250168 932152 1345927 875598 867129
16435 867129 1046872 1415574 985062 980405 925996 1031280 812502 1582200 881721 931019
16425I31019j88351O42839j26535n05975J45940K59890q2669l30167j05117N23254
16415A164128Q6424r2639k41453R2484k05183L53491l05977Q5775j06160l676
16405H27214J9425P3422k18139K59886j81615k30695n6013J93760j33016J99796
16395G54025K93606l54272m6911M6259j59172J80344L05977q6541m35227J49712
16385F47800o0599J48667j6132j7546M3687j55080k7119k3858L27315l53119o5265
16374D48751K14385L77877j97831j56485j99662Q8356J81984K45156l77014j28057
16364D97460K30518r5190K25557l35385R7145j69444K08410m507k4006L1897r6156
16353E66299L88732k35847L66204l06379j93445q9017L35106j66759J46824J263
$$ plain form
16425 931019 742668 1385507 1258972 752997 898937 1158827 1076158 745991 640874 1164128
16415 1164128 1250552 1157913 916460 1008944 803761 1157252 851275 937050 830890 827214
16405 827214 846639 920061 701922 961808 780193 549498 493485 687245 554229 754025
16395 754025 1047631 693359 646448 692707 533535 713879 1019856 933315 498088 647800
16385 647800 587201 735868 719736 702190 745877 590797 563678 539820 867135 514016 448751
16374 448751 663136 1041013 843182 686697 487035 575391 757375 1002531 625517 497460
16364 497460 727978 632788 858345 522960 620105 450661 659071 654564 630558 662455 566299
16353 566299 955031 719184 1085388 779009 585564 496547 831653 664894 811718 812981
16343H12981L2363A46624M34550J40157j94586k28215N66787k10266J47591l51069
16333D51573L6683J39026k80056K65587J85872j61341k02483J35025J10146B59314
16322E89742J26554k21760j86693K38969j87591M9262K6223R1328k31563L47875
16312F42346B77627K60199B35053L0637M36056l03167L22889q9095l2809j47439
16302D52125L33608j67039o4469k12887J04174N1957B23186J90392j60207N3188
16292C06559Q6163j64441q1847L47114j16797N936J63184j37372K59012k90985
16282C76526K54036j67127p3024R1973M2660H0728L94695p4504M3752J9793L286
16271D67750p2047n8778N4348q613j35517m2251K59955k14089R7947J33134k12042
$$ plain form
16343 812981 845344 146624 581174 721331 526745 298530 865317 655051 802642 451573
16333 451573 488256 627282 347226 612813 798685 637344 434861 569886 680032 259314
16322 589742 716296 494536 307843 546812 359221 408483 434706 526034 294471 642346
16312 642346 277627 537826 235053 265690 701746 398579 721468 632373 599564 452125
16302 452125 785733 618694 554225 341338 445512 497469 223186 413578 253371 306559
16292 306559 392722 228281 146434 493548 376751 382687 545871 408499 667511 376526
16282 376526 630562 463435 390411 482384 525044 80728 475423 400919 444671 464464 467750
16271 467750 395703 336925 391273 382660 247143 204892 464847 250758 348705 481839 269797
16260B69797r0725N2935J82913N2922j5615I3166n563N1680K06407J6513J40281
16249E02484A01877M45335A63120O8394M25845B78059L04163r3589J03535j81158
16239D11010j10861L33830l1330H8189g2508D49881j59800Q0545m5916j39186
16229A85524L88512j98232J72036k14486m5829l5680n4169J20623J43897j49617
16219C12579N4085C192L56630H4122J34054J5169K77504J00073m7539A41661K96527
16208D38188e3657C47053A62046K84009J628A03607J5833L60107k18988N54412
16198H14971C00296A45624J20959a58368b0154q5403A36110L83419k14496K58718
16188E63751k1809A20186N51073C6566a22915D1365K74085j2542A19303M26551
$$ plain form
16260 269797 179072 232007 414920 467842 452227 93166 87603 139283 345690 362203 502484
16249 502484 101877 547212 163120 231514 657359 278059 582222 488633 592168 411010
16239 411010 300149 633979 602649 88189 -72508 449881 290081 370626 324710 185524
16229 185524 574036 375804 547840 333354 287525 251845 197676 318299 462196 312579
16219 312579 366664 3192 359822 84122 218176 233345 510849 610922 563383 141661 438188
16208 438188 -53657 347053 162046 446055 447683 103607 119440 479547 260559 814971
16198 814971 300296 145624 266583 -158368 -20154 -105557 136110 519529 305033 563751
16188 563751 541942 120186 671259 36566 -122915 41365 315450 302908 119303 545854
16178E45854C2219p756a75949B77966M8459A0988J30461E7602J42220a20499A50003
16166C03503j00827L92291j91968b05705C57138M145m9075E0034K67638a08581
16155C0467M3467R8348m4584K9135D4072K03007J6243J75230k01420M4655e4077
16143C32610j44886m4487F4997L00406j35322o6904a33443A45180Q6678j9152
16133B12706G9051K65450j39683J80946G2704a0803B04370K20514m6953j18314
16123B59617b19072A72680m3045O0191F4554Q3744g4404C06898g0106E2108J26517
16112A78625f3537q2652B67357n2719L192A0462R321Q7607B6109c15579B21160
16100A2380K35360I1756K58578G2685J09124E3143J23921n5140J774M7573J12090
$$ plain form
16178 545854 32219 24463 -175949 277966 326425 10988 141449 57602 199822 -120499 150003
16166 303503 202676 594967 402999 -205705 357138 361283 312208 50034 317672 -108581
16155 30467 73934 172282 127698 156833 44072 247079 263322 438552 237132 281787 -54077
16143 332610 187724 143237 64997 365403 230081 163177 -133443 145180 231858 212706
16133 212706 79051 344501 204818 385764 72704 -10803 204370 424884 377931 259617
16123 259617 -219072 172680 129635 189826 64554 148298 -74404 306898 -70106 52108 178625
16112 178625 -63537 -146189 267357 214638 217830 10462 19783 107390 26109 -315579 221160
16100 12380 247740 91756 350334 72685 181809 53143 177064 121924 123698 171271 283361
16089B83361e8893m7772c2475A42212a47010J2064C04291A10222m5804K23070
16079B87488r2853c2838D9587d1957q9082A27170D8847O5275R5781L2291P8038
16068C20232C1963K14945C3061b68637a03316I6657a48598G9094i968D79969A35624
16056i1099r4402M3148B00440l2212C7984K7024i9352G0456P7600O9910c20930
16044b8125j12746c9340j150k8696B26127J30900D0056c37598h0976r0891B41440
16032b44804A11096h3776A61756J15258i4333D0038Q1214K36860a22881A04495
16021c4240Q549B87433a54271H0863b305B19244a3609k77954G6313a51121A59760
16009C22832q8758a39993B10181O380c0986I4007b67644B4740P4652b1981l31385
$$ plain form
16089 283361 -58893 -106665 -32475 142212 -147010 -134946 304291 110222 64418 287488
16079 287488 194635 -32838 49587 -41957 -131039 127170 48847 114122 209903 242194 320232
16068 320232 31963 246908 33061 -268637 -103316 96657 -148598 79094 -9968 479969 135624
16056 -91099 -185501 -142353 200440 168228 37984 65008 -99352 70456 148056 217966 -320930
16044 -28125 -140871 -39340 -40490 -69186 226127 357027 40056 -337598 -80976 -171867 241440
16032 -244804 111096 -83776 161756 277014 -94333 40038 121252 358112 -122881 104495
16021 -34240 -25691 287433 -154271 80863 -2305 219244 -13609 -291563 76313 -151121 159760
16009 322832 234074 -139993 210181 216561 -30986 94007 -267644 24740 99392 -21981 -353366
15998c53366A05069J50587l2514K25617I555M3025B1339c01965A29437a0434j2240
15987b2674C38066a51191M4624F9913b97752J33947A81060h0686J411C56359H7224
15975i2103B39193J72631p8048M17990j26620J64088J62706o8038l4900e3675
15964F85573I1800L0316A8266J95990a72768D38311P3046a22602N9059k92074
15954c55617p3598b01253N6067c473j51286j5693B56213a72221j5761H1639O6072
15943A47711E410J24792i9526d8084k23497B50430b45030B98737g9988q0628e0402
15931B38961a22079A62049b22812C74876a42400d0868E0803J0272R1414J0193
15921A62682a6533p5589A70598K5687C8613c3702r0688E428a19017j32922a020
$$ plain form
15998 -353366 105069 255656 223142 448759 9555 52580 21339 -301965 129437 -10434 -22674
15987 -22674 338066 -151191 -106567 69913 -297752 -163805 181060 -80686 -79275 356359 87224
15975 -92103 239193 411824 333776 751766 625146 789234 951940 883902 849002 -53675
15964 685573 91800 122116 18266 214256 -172768 438311 511357 -122602 -63543 -355617
15954 -355617 -429215 -201253 -145186 -3473 -154759 -170452 256213 -172221 -187982 81639 147711
15943 147711 5410 130202 -99526 -48084 -271581 250430 -245030 298737 -79988 -160616 -50402
15931 238961 -122079 162049 -222812 374876 -142400 -40868 50803 61075 152489 162682
15921 162682 -16533 -92122 170598 196285 38613 -33702 -124390 5428 -119017 -251939 -1020
15909A44590a35900b0330q7748A06386b71711E5711g43j29847a2995B4836a66445
15897A9680b45856r0077a47515O9313E6284b24206b5474A1388a46169n0761b5946
15885I6754Q8203a06638J0871r5704b2489k25379A49773C0143f3905a2049A96386
15873B9724N5178b6316E6554b8680p8129b4974B75121d409A43606d5369A60037
15861C24439j16028a16711e4139A64077J35246a22922r9586a1075k03022b9085
15850B62222H9580a02125l2306E3717d9032q578j57590q6080g2203D1069e348
15838h0907C95406a49485j9842j62000J2315g9517B1272K87132a63638l35593
15828d99231A11068j5569K08403b32794d2893A75497H6284b48494q5183A76502
$$ plain form
15909 144590 -135900 -20330 -108078 106386 -271711 55711 -743 -130590 -12995 24836 -166445
15897 19680 -245856 -335933 -147515 -78202 56284 -224206 -25474 11388 -146169 -196930 -25946
15885 96754 184957 -106638 -95767 -191471 -22489 -247868 149773 30143 -63905 -12049 196386
15873 29724 84902 -26316 56554 -28680 -106809 -24974 275121 -4409 143606 -45369 160037
15861 324439 208411 -116711 -54139 164077 299323 -122922 -222508 -11075 -214097 -29085
15850 262222 89580 -102125 -134431 53717 -49032 -57610 -215200 -301280 -72203 41069 -5348
15838 -80907 395406 -149485 -169327 -331327 -319012 -79517 21272 308404 -163638 -499231
15828 -499231 111068 95499 303902 -232794 -42893 175497 86284 -248494 -333677 176502
15817C36748a42600O4254r7453A54195B839J25622D1115a56490p4217R3902k48401
15806c85206D5665J36656C002c8207o2519A84825Q6085c60331J53214I1186f2482
15794d2922D9273J26329I592R3340M738a76995N1578F2767a932A09989h6529g376
15781A57587b10107Q0132a3542B21219c18372i7262C94114d543H4070m1351g1390
15769A97580f1904l9262j55159A42389e4305j23841B19122d7757l2441A22929
15758d8303j08043L0981B13607c33685c3789B79855c0009A640b44906B49870B543
15746B10051i5298A04131N2141c22627A27598n6030a06005E756J55221a44122
15735B02657G7011J7666b45193A84079C7725K01078G1499J31562D1114O6444a41588
$$ plain form
15817 336748 -142600 -78346 -175799 154195 2839 128461 41115 -156490 -230707 -136805 -385206
15806 -385206 45665 182321 3002 -38207 -100726 184825 270910 -360331 -207117 91186 -62482
15794 -42922 49273 175602 9592 102932 107670 -176995 -125417 62767 -1932 109989 -86529 -7376
15781 157587 -210107 -129975 -13542 221219 -318372 -97262 394114 -4543 84070 42719 -71390
15769 197580 -61904 -101166 -256325 142389 -54305 -178146 219122 -47757 -80198 122929
15758 -48303 -156346 -125365 213607 -333685 -33789 279855 -30009 1640 -244906 249870 2543
15746 210051 -95298 104131 156272 -322627 127598 71568 -106005 5756 160977 -144122
15735 202657 77011 94677 -245193 184079 37725 238803 71499 203061 41114 107558 -141588
15723B96244f4134A06219c24517q4835J15875a46499H2637b54106a25315j43294
15713b68609J00861E6230M2221f1999C08885b16944B64418c45875J62442j77258
15703c60691h5448L4110a3665q132C806P9684c05826a9206A23858a16859N2920
15692f3939m7482L9975E6431L646d0315n3468A28352e5616A71143c11970l07148
15681f19118h2657k37941J19365A80966J569O8701J9808a95600f1886j33942A34650
15669b74321A98362d9374j2312k49371Q0835A56732O8843H0968e5185J7866m3517
15658h0836B1476c74545C9779e2485A03775a04364d5968D0933b02962E3857g7056
15646C37512c83901a40087q6805A10861k1379e6890k40263c9236j08818A66037
$$ plain form
15723 296244 -64134 106219 -324517 -409352 -293477 -146499 82637 -254106 -125315 -268609
15713 -268609 -167748 56230 98451 -61999 308885 -216944 264418 -345875 -183433 -360691
15703 -360691 -85448 -51338 -13665 -21797 3806 83490 -305826 -19206 123858 -116859 -63939
15692 -63939 -111421 -71446 56431 60077 -40315 -93783 128352 -55616 171143 -311970 -619118
15681 -619118 -82657 -320598 -201233 180966 182535 251236 271044 -195600 -61886 -195828 134650
15669 -274321 198362 -49374 -61686 -311057 -230222 156732 225575 80968 -55185 -37319 -80836
15658 -80836 21476 -374545 39779 -52485 103775 -104364 -45968 40933 -202962 53857 -77056
15646 337512 -383901 -140087 -226892 110861 89482 -56890 -297153 -39236 -148054 166037
15635B48393N5727G7415f3519k46108b2860m3782A48515m1996d40534a70287A14203
15623C9973J02854P0389d92123b16152f9225q75D713c69589J79196B68710J349
15612B70059h3250O113I3560a37157J8825B616L25826G8299N469e2606p2062C6971
15599C6570b08505M372L5538r6409D7971L3829c97995q9978A73008C2619f8965
15587c04963h0381I7916K3290C6609K30645B8845A456g1955C372K05367B248K00152
15575B02400b82573a18048C49430A29708Q6557a00917A70047e1609A7733b71871
15564b61893B41997A00917b33437K2209D36701D0816b12693B1715a80354c5525
15553b0598B50283g067k11218D178J04166a92818e8185k7015p6170h876E3321
$$ plain form
15635 248393 304120 77415 -63519 -309627 -22860 -66642 148515 106519 -440534 -170287 114203
15623 39973 142827 213216 -492123 -216152 -69225 -70100 4713 -369589 -190393 268710 270059
15612 270059 -83250 -77137 93560 -137157 -118332 2616 328442 78299 83768 -52606 -124668 36971
15599 36570 -208505 -204133 -168595 -265004 47971 81800 -397995 -487973 173008 32619 -68965
15587 -304963 -80381 97916 121206 36609 267254 28845 1456 -71955 3372 208739 2248 202400
15575 202400 -282573 -118048 349430 129708 216265 -100917 170047 -51609 17733 -271871
15564 -261893 241997 100917 -233437 -211228 436701 40816 -212693 21715 -180354 -35525
15553 -20598 250283 -7067 -218285 4178 108344 -192818 -58185 -85200 -161370 -8876 53321
15541b0620l59287f6429o7176f3928m1574F2853a80961p1545B11108a68146G5817
15529A73726q5199a39509k81291f1650j00906C31233p9604a22012K3192A79844
15518b34891Q4747j66278L5432B30397a28588B90776m6975E7599A7231P3728a05031
15506A36289m1K11496B0837F43h1750E1897J39650G3863J60541n7392G1435K83728
15494C55163g9286c8204A96846l2152R464D1336h3984C34024f7850B11344R5829
15483C07173b73338C73564A65736A939R9237K69829a68877A83927P4628A03485
15472A74585p9125B868K11455c15948A93989C5908c9328D2421a22209A57488J995
15461A59483J02188J36223J18708j34746J08639k13073J38341D0662J729R9057
$$ plain form
15541 -20620 -379907 -66429 -133605 -63928 -105502 62853 -180961 -252506 211108 -168146 75817
15529 173726 88527 -139509 -420800 -61650 -162556 331233 251629 -122012 -98820 179844
15518 -234891 -150144 -316422 -280990 230397 -128588 290776 243801 57599 17231 90959 -105031
15506 136289 136248 347744 20837 643 -81750 51897 191547 73863 234404 177012 71435 355163
15494 355163 -79286 -38204 196846 164694 174158 41336 -83984 334024 -67850 211344 307173
15483 307173 -273338 373564 165736 1939 101176 371005 -168877 183927 258555 103485
15472 174585 95460 2868 214323 -315948 193989 35908 -39328 42421 -122209 157488 159483
15461 159483 261671 397894 516602 381856 490495 277422 415763 40662 42391 141448
15451A41448L8169B7468b69905A02012D5280K05813b32263G119e1836F7326f5991
15439C8478g6185K9156p002G7979K03301a92362a8323A91795E2249L96361C4949
15427A18562K32550O25481l89066L10379k01150B77759L34756k27230j12035e4659
15416B84105C6544L25121r473A17888I538a99344d9678B78286a00398G117L49392
15405C56509C6118a7553j12483l3364d78A01439a52041B18226b29276n1326q9109
15394c69711a51521C260b05287k30975a7742l03331g8325J5614a522I0024D329
15382c02865B10099a02643j43941b7960p1332A25458f0088C94192b1044k1745
15372d2789A31352a22909B73265b6413A24209K4304a83312k6259a44l6104j61802
$$ plain form
15451 141448 179617 27468 -269905 102012 45280 251093 -232263 7119 -51836 67326 -65991
15439 38478 -76185 -47029 -54031 77979 281280 -192362 -18323 191795 52249 448610 34949
15427 118562 351112 976593 587527 897906 696756 277759 612515 385285 273250 -54659
15416 284105 36544 361665 352192 117888 9538 -199344 -49678 278286 -100398 7117 356509
15405 356509 36118 -17553 -130036 -163400 -478 101439 -152041 218226 -229276 -280602 -369711
15394 -369711 -151521 3260 -205287 -436262 -17742 -321073 -78325 -62711 -1522 90024 4329
15382 -302865 210099 -102643 -246584 -27960 -99292 125458 -60088 394192 -21044 -42789
15372 -42789 131352 -122909 273265 -26413 124209 148513 -183312 -209571 -144 -36248 -198050
15361a98050e2566j26638C91868r9022J19687D5743h7742K104B50079R5325p1252
15350B74152b319C61355i366j88429e1638D13986n4873P2871I5998M4277F3815
15338h947B33920K60323B15291a50010A74980a24064j84231A33036C598J26246
15328A29844L70656j98770j46958N9368j6363j9836J30998A0120L42293b06266
15317a92577A0453J70879f0737B40157r2651b5365A97044G8669J04368a0004l6091
15306d6095a6050B45036a5786j34066N4441B38420K30528F2043a13907B3348b19512
15294A85135f6418A86258l1149d443k02065j46368C87102E1152J49283l970J74364
15283C70829b9046C23652j15849o2756e3586C20870A42869c11372a33295B31091
$$ plain form
15361 -198050 -52566 -179204 391868 292846 412533 45743 -87742 -85638 250079 345404 274152
15350 274152 -2319 361355 -9366 -197795 -51638 413986 359113 431984 95998 140275 63815
15338 -8947 233920 494243 215291 -150010 174980 -124064 -308295 133036 3598 129844
15328 129844 500500 301730 154772 214140 197777 177941 308939 10120 352413 -206266
15317 -192577 10453 181332 -60737 240157 147506 -25365 197044 78669 183037 -10004 -46095
15306 -46095 -16050 245036 -15786 -149852 -95411 238420 468948 62043 -113907 23348 -219512
15294 185135 -66418 186258 155109 -4443 -206508 -352876 387102 51152 200435 196465 370829
15283 370829 -29046 323652 207803 145047 -53586 320870 142869 -311372 -133295 231091
15272C3190a00631A85635a79602a6409A89028J00733G5290g2705j04092E6687
15261C57416j22542c4721j95555A87302P8029q3086C1055i0971A33220L2845p8772
15250H7293c4667B43222H8338O2354m7253f2022A66745a01540D02772E9205J05718
15239A64923H449L16262A55585a39086A88374I1647K51880A62532J12045N89151
15229H63728K66393K41835n7920k77079j11608m00042B55829D0402B348c0214
15218B77336h981l43686O7586i9254r216B02944b19266O1752A97224O9387A08556
15206G8915C6985J36047J87588A07117C9321J27485a84202I5722d9622J7848F3882
15194a41963A05210K9838K20611A28305J43654a22572B7847d842C19202A05804
$$ plain form
15272 33190 -100631 185635 -179602 -16409 189028 289761 75290 -72705 -176797 56687
15261 357416 234874 -34721 -230276 187302 265331 182245 31055 -90971 133220 166065 87293
15250 87293 -34667 243222 88338 150692 103439 -62022 166745 -101540 402772 59205 164923
15239 164923 8449 324711 155585 -139086 188374 91647 343527 162532 274577 863728
15229 863728 1130121 1371956 1314036 1036957 925349 525307 255829 40402 2348 -30214
15218 277336 -8981 -352667 -285081 -99254 -108470 202944 -219266 -157514 197224 266611 108556
15206 78915 36985 173032 360620 107117 39321 166806 -184202 95722 -49622 -31774 63882
15194 -141963 105210 135048 355659 128305 271959 -122572 27847 -4842 319202 105804
15183a26959A14093C3169K14767c7705A26568J05517a29747I0470b15794A30245
15172B61179b09486A98117a96630e332A27738a68601A77038a6561A75554F893
15161A24206B2636a43413k5600B2124L5153Q7543o8833G190g6022C59109a0023
15149A57482N3904K9109B8761N40845A44853C8662J45823q530p3558c1767j07756
15138a39523B16640K4542D4952K03493a34923j63012B2958C287g3159B68580G0799
15126b112I7745K8229l6734i9592B69483N9418h7880B52143r8195O7103N85l6791
15114A84845o7342C7798d0237G0174K6935O9386G6655f2374E3136J86392K60872
15103E00400E5138J7365B5368K36471q5681J1430O1240j7923k474J4101j6502
$$ plain form
15183 -126959 114093 33169 247936 -37705 126568 232085 -129747 90470 -215794 130245
15172 261179 -209486 198117 -196630 -5332 127738 -168601 177038 -16561 175554 6893
15161 124206 22636 -143413 -169013 22124 57277 144820 75987 7190 -76022 359109 -10023
15149 157482 211386 240495 28761 569606 144853 38662 184485 175955 102397 -31767 -139523
15138 -139523 216640 241182 44952 248445 -134923 -297935 22958 3287 -73159 268580 70799
15126 -2112 97745 125974 89240 -99592 269483 328901 -87880 252143 153948 221051 221636 184845
15114 184845 117503 37798 -40237 70174 97109 166495 76655 -62374 53136 239528 500400
15103 500400 55138 72503 25368 261839 176158 187588 248828 230905 228431 242532 226030
15092B26030B9748P9367Q2202m8971Q2734i1220j5358A15570k5634m972J325O7419
15080A53708l0290J81969C60R6432g5416k3739A95252G4409J16258J41981n7857
15069B74791E6861K89944a23934l62e4783G8388K63481A27396f3245A39685K02997
15058C42682a42164b115H745L96320c107B19053L5777J98020A83684K35679A12012
15046D1328J84889o6568g9139A57461K57466A9420J96716l0446M7518G2343L33313
15035D05656l4583j17813q6285M3298A7450M62556j84097J03228j43130I4319
15024B59135K84427R3556G0288L29651A51978K02982R59M6855P7699l0742K41876
15013F91607j97976M64903k20475K8296k56552k02354k6954L62928n5896j218
$$ plain form
15092 226030 29748 109115 191317 142346 225080 -91220 -106578 115570 89936 84964 86289 153708
15080 153708 123418 305387 360 96792 -75416 -99155 195252 74409 190667 332648 274791
15069 274791 56861 346805 -123934 -124296 -54783 78388 341869 127396 -63245 139685 342682
15058 342682 -142164 -2115 8745 405065 -3107 219053 254830 452850 183684 419363 112012
15046 41328 226217 159649 -79139 157461 414927 19420 216136 185690 233208 72343 405656
15035 405656 371073 253260 166975 210273 17450 480006 295909 399137 256007 94319
15024 259135 543562 637118 70288 399939 151978 354960 355919 402774 480473 449731 691607
15013 691607 493631 958534 738059 766355 509803 307449 280495 643423 587527 586309
15003E86309k36497E6908K55306M9794L105j12377j12036M96206j45225L4193
14993E25874j76515p9953K40709r3448M8742O4902k53632A18692M91841k48342
14983C62191j14336L16521k19961J47234o8486k7676j55796m3706J75791o9995
14973C01781J85885R7583k34268J47926j79220M3019L11506K6157o4978q1849
14963E53542J35760k38338j52473K66313q2849j96245o709K4838L25491k04162
14953D25168m3027P8853j35922J65304B32112P3858j30067K06120A46865J34262
14943B81127n6373J93192A15320Q1098P8202b2958D46028j22691K60335B12895
14932A10171J65054L09804J06262k61434L99911k91644P6446J33665l8822j13858
$$ plain form
15003 586309 349812 56908 312214 362008 365113 252736 140700 636906 491681 525874
14993 525874 349359 269406 510115 416667 465409 530311 276679 118692 610533 362191
14983 362191 247855 564376 344415 491649 423163 395487 239691 195985 371776 301781
14973 301781 487666 585249 350981 498907 319687 362706 674212 700369 635391 553542
14963 553542 689302 450964 298491 564804 481955 285710 279001 303839 629330 425168
14953 425168 382141 460994 325072 490376 232112 305970 175903 382023 146865 281127
14943 281127 224754 417946 115320 196418 274620 -22958 446028 323337 583672 212895
14932 110171 275225 585029 691291 429857 829768 538124 614570 748235 709413 595555
14922E95555J26013C45708j05J75766j37270N50820k37020J52367J05466Q4393
14912A040125j7463J81962J35436J54471l7273m1046J54066l22629j0851M26175
14902A662973P6090J11770j30961J8141j94687j69780n04674J46415L1235j05437
14892I41085l37555q8935O9024k63649J24853K56120B35472K07056j61298K57185
14882E38415M0443B13467K13546q1364K26023p4042A76841j3930M11690K5118
14872E99719B66790K05295M42913n3526C98003J41862L34564l47866M01942j81383
14862G47122j84389l7353K21691r9210J14183l18761q3662p7837K66051j05518
14852D42317A45217L39262J66389r0028J25413j3720K65267k53492j5466o3461
$$ plain form
14922 595555 721568 345708 345603 521369 384099 934919 697899 850266 955732 1040125
14912 1040125 1022662 1204624 1340060 1494531 1457258 1416212 1570278 1247649 1236798 1662973
14902 1662973 1739063 1850833 1719872 1738013 1543326 1373546 868872 1015287 1046522 941085
14892 941085 603530 514595 583619 319970 444823 700943 235472 442528 281230 538415
14882 538415 578858 213467 427013 345649 571672 497630 176841 162911 574601 599719
14872 599719 266790 472085 914998 861472 398003 539865 874429 526563 928505 747122
14862 747122 562733 525380 747071 647861 762044 443283 359621 281784 547835 442317
14852 442317 145217 484479 650868 560840 686253 672533 937800 684308 668842 605381
14842F05381j34019L96593k90688q198k26804L84752p3205M8990q9114j26346
14832D87342B23046M0826K55746K24031k99683K41005L57433l96370M15603K32355
14822A293992j3005m01314k93747j06884N01973k09548r0289B46502J51114Q8170
14812D85786j58896K77498K29220l19804O3629o2675j8968A13226O31949k08447
14802E36728K77904k33862K83905j27303l01646L38435l53148L08476j7642k46541
14792D65306J19516J8921J55331L5468L01864k99369J24648C81595M54449l50362
14782D85682K15242j59713L43596l25746P3004N62114C90545j11430O9160K90865
14772F39140n6127k33517L23395R4203j73541k70067N57296l44897J24010J3890
$$ plain form
14842 605381 471362 867955 577267 569069 342265 727017 653812 702802 613688 487342
14832 487342 223046 263872 519618 743649 443966 684971 1042404 646034 1061637 1293992
14822 1293992 1280987 879673 585926 479042 981015 771467 681178 246502 397616 485786
14812 485786 326890 604388 833608 513804 577433 514758 495790 113226 745175 536728
14802 536728 814632 580770 864675 737372 435726 774161 421013 729489 711847 465306
14792 465306 584822 603743 759074 794542 1096406 797037 921685 381595 836044 485682
14782 485682 700924 541211 884807 559061 632065 1194179 390545 279115 348275 639140
14772 639140 583013 349496 672891 767094 593553 323486 880782 535885 659895 673785
14762F73785k6334J22245n0385J04871j65279P9527K39860k41584k3820J14407
14752H27293J46022k82847P1234k66312o4560L7905J00112J97480J38335l46933
14742E57729M9990R522l00121J30760K79060j11286q0206L30915l70855Q5458
14732E80966O6539J31131l8265n2592J26052J29607l1621p5936r7476J1982K35761
14721I86148m55663L26482j81188J28087Q5185j40242L17702J83755l75103K75083
14711A150246K37013M28603m57716j15930O1035J27944J39985o24987O2126q8845
14701I19474K9078k52331j61518L15252K25285m19497J16861K88869j10833j72180
14691G78460j92644P75601k62528k02847L90436l50612P60002j86672J65555K49858
$$ plain form
14762 673785 647451 769696 719311 824182 658903 738430 978290 736706 712886 827293
14752 827293 973315 690468 761702 495390 430830 468735 568847 766327 904662 557729
14742 557729 607719 617241 317120 447880 726940 615654 535448 866363 495508 580966
14732 580966 647505 778636 740371 687779 813831 943438 911817 835881 738405 750387 986148
14721 986148 530485 856967 675779 803866 889051 748809 1066511 1250266 875163 1150246
14711 1150246 1387259 1815862 1358146 1242216 1303251 1431195 1571180 946193 1008319 919474
14701 919474 948552 696221 534703 849955 1075240 655743 772604 1061473 950640 778460
14691 778460 585816 1361417 1098889 896042 1286478 935866 1695868 1509196 1674751 1924609
14681A924609n71915k37957j52953K89471m3874r9854l1630k6085k36157Q6096
14671H99751j81397o4304J76522J22173j51114l73207P00997k24536R5791q9039
14661I11637J9071j9903J04559o2184j68053J44466M13958n13583N6054p8777
14651H07245J81899k84799N14565k35697j16343O0810J61376K4382K23605l09956
14641A027087M3553n8358l3836O8088q0986P9579L69879Q9116l44209M9157J56594
14630A365664j78955p9393J60494l59749R43K48912J6856M5642N3099K3304K07127
14619A503944n33909J9555J55126J34739Q6467j44821p0491L20675j3182r1126
14609A366977K39618l23908J18088k63799M16038k29435M0884R944j42198n9343
$$ plain form
14681 1924609 1352694 1114737 961784 1251255 1207381 1107527 1075897 1049812 813655 899751
14671 899751 718354 654050 830572 952745 801631 428424 1129421 904885 1000676 911637
14661 911637 930708 910805 1015364 953180 785127 929593 1343551 829968 886022 807245
14651 807245 989144 704345 1218910 983213 866870 927680 1089056 1113438 1337043 1027087
14641 1027087 1070640 1012282 978446 1046534 965548 1045127 1415006 1504122 1159913 1209070 1365664
14630 1365664 1186709 1107316 1267810 908061 909004 1157916 1174772 1220414 1273513 1296817 1503944
14619 1503944 970035 989590 1144716 1279455 1365922 1221101 1150610 1471285 1458103 1366977
14609 1366977 1606595 1282687 1400775 1136976 1553014 1323579 1364463 1374407 1232209 1172866
14599A172866K88113R0516k30870J32512K50833m32405K39649J58459k41824q0605
14589A347244J13981p7282K08705k60004J84382k28545J99416K41763J16877k65197
14579A581340k09506L28540M1645L7847l9560q0073Q98J47078J2418j36387j8874
14568A665366l7304J59453J95439j7281L70944k83252J41784k94602j54670N2365
14558A798242L52716K9545k02609K54061K26084l35074K06123J72609k41965J98056
14548B457788n0309L87374M9842j34406J72540L12515m6868K71032L48488K85530
14538D053526P89075N45206Q76049J361425K783279L746459O412616R346776O13098
14529C0527509j3289045p175226l257032j202843q92697P88945j623244n81663
$$ plain form
14599 1172866 1460979 1551495 1320625 1453137 1703970 1271565 1511214 1669673 1427849 1347244
14589 1347244 1461225 1383943 1592648 1332644 1517026 1288481 1487897 1729660 1846537 1581340
14579 1581340 1371834 1700374 1742019 1779866 1740306 1660233 1661131 1808209 1820627 1684240 1665366
14568 1665366 1628062 1787515 1982954 1965673 2336617 2053365 2195149 1900547 1745877 1798242
14558 1798242 2150958 2180503 1977894 2231955 2458039 2122965 2329088 2501697 2259732 2457788
14548 2457788 2407479 2794853 2844695 2710289 2882829 3195344 3148476 3419508 3767996 4053526
14538 4053526 4842601 5387807 6263856 7625281 10408560 14155019 20567635 29914411 30527509
14529 30527509 17238464 10063238 6806206 5603363 4710666 5499611 3876367 3294704
14521C294704n16887k09020l84494L08069j88499J44161n9234N2435J7928k15603
14511B243560J34161j63247K23028j365n7848K94548j59348J29110k22892n0874
14501B368833J8056M22629R4963m06681N4724J08325o4120J99255J30989j53700
14491B773273L33796N5927k34906K8285o5149o5196L48635j50332J81043K9725
14481C235101k66009L04818J16686m5119j66411K83793l58828N58253j95463P3338
14471C540159J34560L0263j96063M19386l79335m930q1698L72096J04477N3664
14461C992579L28382m26190l4727J00675R003K20151k61653L90814n6776n5074
14451D207184K3833J60191L12545m2777J79201j10871l9137M05297P474l15244
$$ plain form
14521 3294704 2777817 2568797 2184303 2492372 2303873 2448034 2388800 2441235 2459163 2243560
14511 2243560 2377721 2214474 2437502 2436137 2378289 2672837 2513489 2642599 2419707 2368833
14501 2368833 2386889 2809518 2904481 2497800 2552524 2660849 2596729 2795984 2926973 2773273
14491 2773273 3107069 3162996 2928090 2956375 2891226 2826030 3174665 3024333 3205376 3235101
14481 3235101 2969092 3273910 3390596 3345477 3179066 3462859 3104031 3662284 3466821 3540159
14471 3540159 3674719 3704982 3508919 3928305 3548970 3544040 3462342 3834438 3938915 3992579
14461 3992579 4320961 3894771 3860044 3960719 3969722 4189873 3928220 4319034 4262258 4207184
14451 4207184 4231017 4391208 4703753 4660976 4840177 4729306 4690169 5095466 5102940 4787696
14441D787696L42310l84219J74914K13082j91426J75259Q6749M71858l27360L09502
14431E658365k39448K19042J79955K36091q6146L2078M16820l11361K11916l52409
14421E964903N84804P420L86654k01772J95642j70003j35866K29494M73174l02906
14411G031544K63883j0328L06302k75951M89707K53389N8343q7619O33632p1911
14401H590991K52137R6157k95363j5435K35932k06513M96328k5702M67563R7259
14391I693354m3243J17780K06524K76505N02255l16176K52583M19336l32141M22259
14381A1199036N3930M50987R4541k70589M86963L81609L19006p8091j51161K84121
14371A2770352N24418J09340Q3539P80871K73459n0612L32305J65724N57498L43745
$$ plain form
14441 4787696 5130006 4745787 4920701 5133783 4942357 5117616 5204365 5676223 5348863 5658365
14431 5658365 5418917 5637959 5817914 6054005 5967859 5999937 6416757 6105396 6317312 5964903
14421 5964903 6549707 6557127 6943781 6742009 6937651 6767648 6631782 6861276 7334450 7031544
14411 7031544 7295427 7285099 7591401 7315450 7805157 8058546 8116889 8029270 8662902 8590991
14401 8590991 8843128 8939285 8643922 8628487 8864419 8657906 9154234 9128532 9596095 9693354
14391 9693354 9650111 9767891 9974415 10250920 10753175 10436999 10689582 11108918 10776777 11199036
14381 11199036 11252966 11703953 11798494 11527905 12014868 12396477 12715483 12637392 12486231 12770352
14371 12770352 13294770 13404110 13487649 14268520 14541979 14491367 14823672 14989396 15546894 15890639
14361A5890639L95539J62275K89470L8796L63204N92149J60198M27582L63987
14352A8683839L67422Q65444J16153O62455L87742P03894j48851Q00870J96493
14343B2635461M29437O97478N22881N45774N69782P21854N23932P91840P11237
14334B8149676N83795Q77669Q56414M31505J019483J315033J80015J078442R31297
14325C5423329J206943O89959J217285J304663J279629Q31308J546422J470482
14317D4970020J384206J380563J418004J673885J741711J725284J927922J580299
14309E7801894K159127K334217K160113K384489K360262K463745K928674K716300
14301G7308821L038618K836376L423922L678120L627933M081503M208245M442888
$$ plain form
14361 15890639 16286178 16448453 16737923 16776719 17139923 17732072 17892270 18319852 18683839
14352 18683839 19051261 19916705 20032858 20695313 21083055 21786949 21638098 22438968 22635461
14343 22635461 23064898 23762376 24285257 24831031 25400813 26122667 26646599 27438439 28149676
14334 28149676 28733471 29611140 30467554 30899059 31918542 33233575 33413590 34492032 35423329
14325 35423329 36630272 37320231 38537516 39842179 41121808 41953116 43499538 44970020
14317 44970020 46354226 47734789 49152793 50826678 52568389 54293673 56221595 57801894
14309 57801894 59961021 62295238 64455351 66839840 69200102 71663847 74592521 77308821
14301 77308821 80347439 83183815 86607737 90285857 93913790 97995293 102203538 106646426
14293A06646426M708032N302221N315127N587351O147427O227587O802658P219580
14285A53956409P729419Q033561Q730718Q902921R902940R852413J0590392J0716951
14277B28415724J1599249J1657563J2707468J3059321J3752444J4579133J4844223
14270C20615125J5244218J5130234J5519319J5211272J4003882J2682113J1537910
14263D19944073R993329Q870878Q175289Q112276P302089M342160J609161R58075
14255D69307330J383180l249939m124927q892694j0034829r229937j3231621j3222300
14247D08704263j4871341j3989445j4320895j4921963j5313006j3921276j4524450
14240C06841887j4178656j3505376j3697289j2692976j1827814j1361372j0685166
$$ plain form
14293 106646426 111354458 116656679 121971806 127559157 133706584 139934171 146736829 153956409
14285 153956409 161685828 169719389 178450107 187353028 197255968 207108381 217698773 228415724
14277 228415724 240014973 251672536 264380004 277439325 291191769 305770902 320615125
14270 320615125 335859343 350989577 366508896 381720168 395724050 408406163 419944073
14263 419944073 429937402 438808280 446983569 455095845 462397934 466740094 468349255 469307330
14255 469307330 470690510 467440571 463315644 454422950 444388121 435158184 421926563 408704263
14247 408704263 393832922 379843477 365522582 350600619 335287613 321366337 306841887
14240 306841887 292663231 279157855 265460566 252767590 240939776 229578404 218893238
14233B18893238j1114568r980009r652051r622724q707702q526004p741126p579041
14225A45970013o799078o406239o295409n719797n263622m993868m755071m475038
14217A01261891m176321l999931l785064l618518l255880l203351k908394l039571
14209G3274861k558874k646248k379111k215254k202012k027748j767306k142117
14201E5336191j643096j497565j628910j411967j614204j392124j786834j124806
14193D3236685r09730r64835j249774j111774j575845p87042n66630j026162j066908
14184C3977985q04464n95773j365898p26776o45168q38449o81210n9335j184243
14175B7076669p99305o30891m09681m26139r04829n16392n28502l67913n62335
$$ plain form
14233 218893238 207778670 197798661 188146610 178523886 169816184 161290180 153549054 145970013
14225 145970013 139170935 132764696 126469287 120749490 115485868 110492000 105736929 101261891
14217 101261891 97085570 93085639 89300575 85682057 82426177 79222826 76314432 73274861
14209 73274861 70715987 68069739 65690628 63475374 61273362 59245614 57478308 55336191
14201 55336191 53693095 52195530 50566620 49154653 47540449 46148325 44361491 43236685
14193 43236685 42326955 41362120 40112346 39000572 37424727 36637685 36071055 35044893 33977985
14184 33977985 33173521 32577748 31211850 30485074 29839906 29001457 28320247 28260912 27076669
14175 27076669 26277364 25646473 25236792 24810653 23905824 23389432 22860930 22493017 21930682
14166B1930682l95840n85380l66551n38905J75279r93648l45350j98546m45751
14157A8235990n02746m23206M1026m16371m12281l16304j12820m51767j82498
14148A5459023l09000m22071m40662J69034k56380m69190j32979o1517n72849
14139A2963409K2777k00192n31361m7748k2749n07198J80867k64467m21470j8856
14129A1153012N5911p51097K04610k24817P622k29647k18273l19176K43747m85828
14119I436064K73616l11030k02948m18479j09932L18002K2289o34794K33958m76913
14109H129833k17584L45367l96559M9817k6332j40878k20243j35513l1115k9575
14099G327218l8683k82030J14323n2230k00702l8756k06678q7299j41290j35466
$$ plain form
14166 21930682 21534842 20949462 20582911 20044006 20219285 19225637 18880287 18681741 18235990
14157 18235990 17733244 17310038 17351064 16934693 16522412 16206108 16093288 15641521 15459023
14148 15459023 15150023 14727952 14287290 14456324 14199944 13730754 13597775 13536258 12963409
14139 12963409 12986186 12785994 12254633 12206885 12184136 11676938 11857805 11593338 11171868 11153012
14129 11153012 11208923 10457826 10662436 10437619 10445241 10215594 9997321 9678145 9921892 9436064
14119 9436064 9709680 9398650 9195702 8777223 8667291 8985293 9007582 8372788 8606746 8129833
14109 8129833 7912249 8257616 7861057 7910874 7884542 7743664 7523421 7387908 7356793 7327218
14099 7327218 7288535 7006505 7120828 7068598 6867896 6829140 6622462 6535163 6393873 6258407
14089F258407O4309J1696j13569j67112r9685K25926m48374J20949K39129l64090
14079E727586j08081P7207j31763K16232k90604j23803J4514o735l7915n47567
14069D789071N0498j56924K85187J60071l61439j07883J33522k39308P9817J11207
14059D743819m28322Q9609J06718L77351n90441N20645m96781p1657R6385m38050
14049C909276J86832o2582m6989L44917l14874J41392r5964j62256K41145l31718
14039C809179k06701J61992l57481K10458o9965J68870k74539n6536K04569l12471
14029C277375J37772P6812j30719o9890o0585K34056l08705L21465j71585k95977
14019C010019J42415k70952L34440j97502j19299J41214J83157j44887j40766
$$ plain form
14089 6258407 6322716 6334412 6220843 6053731 5954046 6179972 5731598 5852547 6091676 5727586
14079 5727586 5619505 5696712 5564949 5781181 5490577 5366774 5381288 5374553 5336638 4789071
14069 4789071 4839569 4682645 4967832 5127903 4766464 4658581 4792103 4552795 4632612 4743819
14059 4743819 4315497 4405106 4511824 4889175 4298734 4819379 4322598 4250941 4347326 3909276
14049 3909276 4096108 4033526 3986537 4331454 4016580 4157972 4062008 3899752 4140897 3809179
14039 3809179 3602478 3764470 3406989 3617447 3547482 3716352 3441813 3385277 3589846 3277375
14029 3277375 3415147 3491959 3361240 3291350 3230765 3464821 3156116 3477581 3305996 3010019
14019 3010019 3152434 2881482 3215922 3018420 2899121 3040335 3223492 3078605 2937839
14010B937839j07672j68688O52610m92402j21948M0614k79254P4092J09851J97246
14000B842288k87435R6554q2689j25646K192K4825j18150L19398m08390J65617
13990B428564M3220k14012o1501L55900k83829L8667K74575m75222l2692L92560
13980B466230K62366K93688J17525M57189O21122J027565J358236L645486N830802
13971A6080209R770493O081767j0550547q034773l707039k484607q65915j388036
13963D901552o23002k81578m62008l12138J90276j00280m85725K4194l33679j0467
13953B507145Q8813R0919l79363L72907k07707k85254n9027M1599J22836k64257
13943B028611J54318q0262q2405J72267j5928Q3804m29534K46945j76072l5611
$$ plain form
14010 2937839 2830167 2661479 3314089 2821687 2699739 2740353 2461099 2535191 2645042 2842288
14000 2842288 2554853 2651407 2568718 2443072 2445264 2470089 2351939 2671337 2262947 2428564
13990 2428564 2471784 2257772 2196271 2552171 2268342 2307009 2581584 2106362 2073670 2466230
13980 2466230 2728596 3022284 3139809 3596998 4218120 5245685 6603921 10249407 16080209
13971 16080209 25850702 31932469 21381922 13347149 9640110 7155503 6289588 4901552
13963 4901552 4278550 3996972 3534964 3222826 3413102 3312822 2827097 2851291 2517612 2507145
13953 2507145 2595958 2686877 2307514 2680421 2472714 2187460 2128433 2170032 2292868 2028611
13943 2028611 2182929 2102667 2020262 2192529 2176601 2260405 1830871 2077816 1901744 1866133
13933A866133J15433j25276m18132N61015j61726j6590J65537k38161J71546l19514
13923A600265J59288P50K7227P1493m8267M8592K0407j73302j92163L91908l84215
13912A521983J2839L31721l61120j29241L79790m49956L94454q3947M0490l324
13902A653689J47347j88020R5635k6004K0008k42261j63046O9071m5121N23446
13892A844744l06855L8717m19573L17334m3553j64890k14401K81882Q496O3313
13882A405214P3991j88100J66192k07434J62023j71266j12289J27331K60422l60147
13872A155937n1272L21034k26762K0476r8164L97302j47527l70389M82476l95287
13862A087824j08719M34889j72440K92573n45803M65938l76708K32334k12093
$$ plain form
13933 1866133 1981566 1856290 1438158 1999173 1837447 1820857 1986394 1748233 1919779 1600265
13923 1600265 1759553 1760303 1787530 1859023 1810756 1859348 1879755 1706453 1514290 1906198 1521983
13912 1521983 1534822 1866543 1505423 1376182 1755972 1306016 1700470 1616523 1657013 1653689
13902 1653689 1801036 1613016 1708651 1682647 1702655 1460394 1297348 1366419 1321298 1844744
13892 1844744 1537889 1576606 1157033 1474367 1430814 1265924 1051523 1333405 1341901 1405214
13882 1405214 1479205 1291105 1457297 1249863 1411886 1240620 1128331 1255662 1516084 1155937
13872 1155937 1104665 1425699 1198937 1219413 1121249 1518551 1371024 1000635 1483111 1087824
13862 1087824 979105 1413994 1241554 1534127 988324 1454262 1077554 1309888 1097795
13853A097795K21673j52736Q0037j07317n5696j99294L19753j95236J65140n43396
13843F30723N76152k47744J99729J52464l88707L97178l14257K3677J10183k66472
13833H72926L19719m04520L64285J53032m11874K48694j62728J35651j98198m3368
13823H73619J89366k30358K87914p2823J55989m11645K13087o1163k3104J3832
13813I34714K192K37488m96847M14262l47957K86763J60710m94318N9216J65386
13803I21609l08785P0930l5786K25860k48847M95833k85754k38057J22975N4465
13793G74443L28131m1839l64512n6921L37193l42263K71595J41565j88036j15479
13783G43877K24404l5469K99492n68830j5792J68520k3000k8762O7896j88794
$$ plain form
13853 1097795 1319468 1166732 1246769 1139452 1083756 884462 1204215 1008979 1174119 630723
13843 630723 1206875 959131 1158860 1311324 922617 1319795 1005538 1029215 1139398 872926
13833 872926 1192645 788125 1152410 1305442 893568 1142262 979534 1115185 916987 873619
13823 873619 1062985 832627 1120541 1047718 1203707 792062 1005149 943986 920882 934714
13813 934714 936906 1174394 677547 1091809 743852 1030615 1191325 697007 756223 921609
13803 921609 612824 683754 647968 873828 624981 1120814 835060 597003 719978 774443
13793 774443 1102574 1060735 696223 639302 976495 634232 905827 1047392 859356 743877
13783 743877 968281 932812 1232304 663474 647682 816202 793202 764440 832336 643542
13773F43542K61053M0928j80303r574N2903K46659D74827J70798J06140k6914
13763G24851J20804L9903k62830M91549l33142J05889l04495J14025j10533K60716
13753H46737j42057J11952o9181o0268N2775K9568j80462M1315Q2292j48833j44083
13742D19755M55208j90932k94056K16009J83411l08338M35382j82793n2523J14429
13732G95552k32150k03089K35726Q1646k27155L44897p8246J29708J2969L8929
13722H98787l46846j58194M70291k41861J65857j55986J99318L317k49919K2719
13712F07483o9929k0313J01882j23111n1737M2469J28208L1514j16847N5991m8643
13701E36967j37229L76067l70194J4119M3359j51948M03939O9378j08566j25018
$$ plain form
13773 643542 904595 945523 765220 755646 808549 1055208 474827 645625 751765 724851
13763 724851 845655 885558 622728 1114277 781135 887024 582529 696554 586021 846737
13753 846737 704680 816632 747451 687183 739958 769526 589064 630379 712671 563838 419755
13742 419755 874963 684031 389975 605984 789395 481057 916439 733646 681123 795552
13732 795552 563402 360313 596039 677685 450530 795427 717181 846889 859858 898787
13722 898787 551941 393747 864038 622177 788034 632048 831366 834683 584764 607483
13712 607483 537554 517241 619123 496012 444275 486744 614952 646466 529619 585610 536967
13701 536967 399738 775805 405611 419730 463089 311141 715080 784458 675892 550874
13691E50874j89034R5350k0636L56384C90481N9705J21888j55030J57080j38128
13681D35996R2600O0389j17914K75158C23035J53189J59951B92717M47655j71804
13671E68568J0326A25771K73625L57172j78333k76662r877M68013k73866J53039
13661F38882A33636K34415j3326K75323K68386A75312L52121j8482Q0309B29825
13650D35082L63633o5040k91703J87728m4569k21391M99401j86964J82060B59711
13639F12017M141A80614J02603J44O3406L3092L53126l21193j8951J27268B48229
13627D73921B06657K45767j04224K76653B43855J98730j71964L91796l07118A73866
13616B79233a14227C92989J52714j28612M22746C88000q6036R6351J57073j87461
$$ plain form
13691 550874 361840 457190 436554 792938 390481 450186 572074 417044 574124 435996
13681 435996 528596 588985 471071 746229 323035 476224 636175 292717 740372 568568
13671 568568 578894 125771 399396 756568 578235 301573 291696 759709 485843 638882
13661 638882 133636 368051 354725 630048 898434 175312 527433 508951 589260 229825
13650 435082 798715 733675 441972 629700 585131 363740 863141 676177 858237 259711
13639 612017 616158 180614 283217 283361 346767 379859 732985 411792 392841 520109 248229
13627 473921 206657 452424 348200 624853 243855 442585 270621 662417 355299 173866
13616 279233 -114227 392989 545703 417091 839837 388000 301964 398315 555388 367927
13606C67927p0592J10846j521j00377j36907L31755k43535L9332J39606k48r1140
13595C45146J54573B45001K09813R6651L9970B77469o6206K61215l7122C4270
13584B09803M30727C04268j12220m6466N14043B82910j06717J46063m3349K28887
13574E07794A73159K99832j16378J39247k01094q6922J29375l8147J99553l1950
13564D66675k20485p209k3814K43905J08530A66687K03130L21656j21766B03271
13553g9978D20620K4798J08935l9259N7830H0082K75729l2311J92236A06062M0986
13542A47048J50208K77039k59483r5947A08397K45116A30887J87383K8450k0455
13532C26265m1677A02600J67023A00726M71670A92297J0071K24996N9095H5659
$$ plain form
13606 367927 297335 408181 406660 306283 169376 501131 257596 296928 436534 436286 345146
13595 345146 499719 245001 454814 551465 591435 277469 211263 472478 435356 34270
13584 209803 640530 304268 192048 145582 659625 282910 176193 322256 278907 507794
13574 507794 173159 472991 356613 495860 294766 207844 337219 299072 498625 466675
13564 466675 246190 238981 215167 459072 567602 166687 369817 691473 569707 203271
13553 -79978 420620 445418 554353 515094 572924 80082 355811 323500 515736 106062 147048
13542 147048 297256 574295 314812 218865 108397 353513 130887 318270 346720 326265
13532 326265 284588 102600 269623 100726 572396 192297 202368 427364 486459 85659
13521C98884j51530M9346L2899P5641B9686L31643j31585k8264J91862j62646
13511B30696K91524j83438H3376J38176J36178K39084p5149g7097B98437r982
13501B88455o4702p0655J7418J13118j07268M39438j79944A26938Q2526p7262
13491A32202B528M14235j64728J00763A15197e2350A79026K49270j53095J98885
13481D74086j86571m9125Q1099B4431K94308J5745L49702C4886L48474l3620j06587
13470B43153R8232n8958F5503K56847A11223K78763A40216k4639N9387J85471
13460C60435A36276l0787P2117K06883A44434N64676a7121A49261L62775B09308
13449B89767M8563r5990k0761e6845A0608K59071A29304K3121o777C7682J18514
$$ plain form
13521 398884 247354 296700 329599 405240 29686 361329 229744 201480 393342 230696
13511 230696 522220 338782 83376 221552 357730 596814 521665 -77097 298437 288455
13501 288455 223753 153098 170516 283634 176366 615804 435860 126938 209464 132202
13491 132202 2528 416763 252035 352798 115197 -52350 179026 428296 275201 474086
13481 474086 287515 238390 319489 24431 318739 334484 684186 34886 383360 349740 243153
13470 243153 341385 282427 65503 322350 111223 389986 140216 115577 174964 360435
13460 360435 136276 105489 177606 384489 144434 709110 -17121 149261 512036 209308
13449 289767 338330 242340 221579 -56845 10608 269679 129304 152425 145648 37682 156196
13438A56196n2503K56026j19569a82244B75532A32561L58697A29567K86258m7586
13428C68239j26378n6696N8585L61081k85124j12905K12763K08396j94264A74801
13417A44105J16917K45454b96720B4571M84881j13938f085A24305C401K83862
13407B87263J53937b5733D08236E5411K3028a37663A57996K15439E6207L66782
13397D22989G6384L50819B4575L14042K49752d428B04616Q1401R4787J3800q0671
13386C13933j48085C4448K7358k5327J47605L05533A83556O1483J74899J65654
13376E85592B55421J3553I7752c6044B87816d5524j44539A28662Q1075C8285d3765
13364D19038k00754H8425K71836m707j08460Q0695a43244E044P8271J94491K10041
$$ plain form
13438 156196 103693 359719 240150 -182244 275532 132561 491258 129567 415825 368239
13428 368239 241861 185165 243750 604831 319707 206802 419565 627961 433697 174801
13417 144105 261022 506476 -296720 24571 509452 395514 -6085 124305 3401 287263
13407 287263 441200 -25733 408236 55411 78439 -137663 157996 373435 56207 422989
13397 422989 76384 427203 24575 338617 588369 -4428 204616 286017 380804 394604 313933
13386 313933 165848 34448 61806 36479 184084 489617 183556 245039 419938 585592
13376 585592 255421 268974 97752 -36044 287816 -45524 -190063 128662 209737 38285 -43765
13364 419038 218284 88425 360261 355554 247094 327789 -143244 5044 83315 277806 487847
13353D87847R5591k38938A32998P844J55961G4642d1172C09108r1561F1214J44684
13342B05898H8597O6190k2111k012N3107J85780d3976D45725b12706B25209K24918
13331D50127H1423K12774b92100B46844a64020A44383P319J00736r1307k0972
13321A40159K90095D5949r169J39477J06949N6642j7145E2919N4754G73i3643
13309D02953A55558A9449L00775o0549H9598L78610A53418r185J45359J04852
13299C94444j83074o1325K5928A6602Q1430J7510L1156j7959J8500L183j364K0857
13287A69915j1509a7717B71284c425F5526j1081q574R4845h1468B32197q4655
13276A47542a8047J10C74903a32846A98309i4694b7888A19657K55106f7208A36635
$$ plain form
13353 487847 583438 344500 132998 140842 296803 74642 -41172 309108 217547 61214 205898
13342 205898 88597 154787 132676 130664 183771 369551 -43976 445725 -212706 225209 450127
13331 450127 81423 294197 -292100 246844 -164020 144383 151702 252438 161131 140159
13321 140159 430254 45949 36780 176257 283206 339848 322703 52919 107673 773 -93643
13309 402953 155558 19449 320224 259675 89598 468208 153418 144233 289592 394444
13299 394444 211370 150045 175973 16602 98032 115542 146698 128739 147239 150422 149058 169915
13287 169915 158406 -17717 271284 -3425 65526 54445 45871 140716 -81468 232197 147542
13276 147542 -18047 -17937 374903 -132846 198309 -94694 -27888 119657 374763 -67208 136635
13264A79510L21455a9205k7627I5747C185K81289j17799J44261j35181O641J52726
13253C35122A21052l5923L34626j37353m583k8530b8216B03897a73818b4863A79337
13241e6632J6048j4321E7545K30860p1588G6905J13982l8250j8846N9951a50546
13229B77882I458e7315A53655O5304q5497o4473K58815j57304d3779A06231J3542
13218A19773b1003C35709A24587a59615f3310p279o9269A17815E093b1703I3009
13206I6689d176G2211K32776f8199b7081B45671L7393g1439D15305a54699I8518
13194a97259D1394R9096k2981d5272C52900J26380a95544A00201a09054L307A08166
13182A66428c886A95969c05818G9393e6199l177B7574c1523A6351c198A3432N6638
$$ plain form
13264 179510 500965 -19205 -46832 95747 3185 284474 166675 310936 175755 182396 335122
13253 335122 121052 85129 419755 282402 277819 249289 -28216 203897 -173818 -24863 179337
13241 -56632 -40584 -54905 57545 288405 216817 76905 190887 152637 133791 193742 -150546
13229 277882 9458 -57315 153655 218959 133462 68989 327804 170500 -43779 106231 119773
13218 119773 -21003 335709 124587 -159615 -63310 -70589 -139858 117815 5093 -21703 93009
13206 96689 -4176 72211 304987 -68199 -27081 245671 283064 -71439 415305 -154699 98518
13194 -197259 41394 140490 117509 -45272 352900 479280 -195544 100201 -109054 -105747 108166
13182 166428 -3886 195969 -305818 79393 -56199 -59376 27574 -31523 16351 -3198 13432 70070
13170G0070M40053F8630e1949C18325e816A04103L22101d5222B18617L11Q6696
13159C05624L1106b3266h910m9929G1822K34486j08351m9371B4063a37710A38744
13147a40974K0267p935o9680R5727A1410K49962M9449h8725B19115L3877c1806
13135B13340B1398R2781d6339k6265B24954O6328r5023K39067j72346J16493j81880
13124A97593H0684k773K55963e3728M354K965j39766j64578i0345A57435R738
13113A67173E8457a17492B22064J04420b68417C2745L0973a76468A41779R4888
13103B36667M2710n7822J5904E8691L66680j4121A32047L91246B00624a75792
13092F923M7167h9317k755q704c360q2713A43403l1488G107g1733a7885k22905
$$ plain form
13170 70070 510123 68630 -51949 318325 -5816 104103 426204 -45222 218617 218928 305624
13159 305624 336730 -23266 -8910 -58839 71822 306308 197957 148586 24063 -137710 138744
13147 -140974 -120707 -128642 -198322 -102595 11410 261372 310821 -88725 219115 252992 -31806
13135 213340 21398 114179 -46339 -72604 224954 291282 196259 435326 262980 379473 197593
13124 197593 80684 77911 333874 -53728 -49374 -46409 -186175 -350753 -90345 157435 167173
13113 167173 58457 -117492 222064 326484 -268417 32745 63718 -176468 141779 236667
13103 236667 279377 221555 237459 58691 425371 411250 132047 523293 200624 -175792
13092 6923 54090 -89317 -92072 -100776 -3360 -86073 143403 111915 7107 -71733 -17885 -240790
13080b40790H2110P3319Q2751b32287g5164A45780m7979m8148J95875r0812d3048
13068B92741C8196J08363a79776h1120C73503a91093d5650A85505a11121E3438
13057A87635m5181e7860A7512e6364a169k62933E8383k2593O574K6205A9405J03908
13045A23313a1072r9206B13152L8542a63338B18828r9040f6059a8296B5886d6542
13033B95500G463i8055A48208f8805A02032m1187R5696K23091b89897A29722K2220
13022A51942J25242d8498C09181j04385G7264a24508j2190B02055E3243M9770
13012A03013M9257l897D1626c22044J55808B45499a3070E4342h4733j2946B91776
13000A88730E3578J0154J45687c32230A92018B5810Q853e6043B20494K49724h5627
$$ plain form
13080 -240790 82110 155429 238180 -232287 -75164 145780 97801 49653 245528 154716 -43048
13068 292741 38196 146559 -179776 -81120 373503 -191093 -45650 185505 -111121 53438
13057 187635 142454 -57860 17512 -56364 -1169 -264102 58383 35790 42364 68569 19405 123313
13045 123313 -11072 -110278 213152 251694 -163338 218828 119788 -66059 -18296 25886 -46542
13033 295500 7463 -98055 148208 -68805 102032 60845 156541 379632 -289897 129722 151942
13022 151942 277184 -48498 309181 204796 77264 -124508 -136698 202055 53243 103013
13012 103013 152270 148373 41626 -322044 -166236 245499 -13070 54342 -84733 -97679 291776
13000 188730 53578 63732 209419 -332230 192018 25810 34663 -56043 220494 470218 -85627
12988B85463b59084B19456F0361N5112k9420J46274I5196J27665B4710N8566a08439
12976a79516f2247C53624r7797h1383j4909A32636K1592a04524F3326K06150b06389
12964A27471Q7702A0508J68153a94213B8522g4891A35902a9229C3032b17989d27
12952b79439L8384J07622N4119D2409b02783A58513K082n7329i5309j43734A57666
12940D2084b31303g075j7721I8172B527a19282b3386k50805B16876L67382A46634
12928A19295B2769K12774a0497A30910j6734M22320A38493F8170C492N6628J15796
12917A75916l8171J15110i3986j30664e0909A14453m8093M63c403k8971j64457
12906a96831C9002K7794K00044A32254e8209C45882f2558A03626c9708B5441b6286
$$ plain form
12988 285463 -259084 219456 60361 115473 86053 232327 95196 222861 24710 83276 -108439
12976 -179516 -62247 353624 255827 -81383 -96292 132636 154228 -104524 63326 269476 -206389
12964 127471 215173 10508 178661 -194213 28522 -74891 135902 -19229 33032 -217989 -427
12952 -279439 -241055 -133433 -79314 42409 -202783 158513 160595 103266 -95309 -239043 157666
12940 42084 -231303 -7075 -24796 98172 2527 -119282 -23386 -274191 216876 584258 146634
12928 119295 22769 235543 -10497 130910 114176 536496 138493 68170 3492 60120 175916
12917 175916 137745 252855 -93986 -224650 -50909 114453 66360 66823 -3403 -32374 -196831
12906 -196831 39002 66796 266840 132254 -58209 345882 -62558 103626 -39708 25441 -26286
12894a76799B50141a971H3072g1894o1823j01593H9365b54803A31070a02515B3092
12882f8002B11464I5073K0369a96398A65804m5172k5961a61207H4904a69886H0369
12870a82920d2312D4604Q5406c87900A32182L71083E6990g5381A84495i8568I996
12858e2128b5145m0922A44473e0452q9096b9560p1734n4255d9248C51709c68153
12846a42472B32275b46664B39285a54572e376p4229f308k49054A95486E9425h1658
12834c6513F3787a72691l1218H4204K69172a9459A57575D2494A2423c0220A41111
12822a58390j39117B05107b58670a11421q3550H1572L7417e9134B33550A14092
12811C12124j49082a72150B92835a2208I1056C650c5745A29511R7931f1842l81717
$$ plain form
12894 -176799 250141 -1971 83072 -71894 -133717 -235310 89365 -254803 131070 -102515 23092
12882 -68002 211464 95073 115442 -196398 165804 120632 94671 -161207 84904 -169886 80369
12870 -182920 -42312 44604 130010 -387900 132182 503265 56990 -75381 184495 -98568 9996
12858 -52128 -25145 -66067 144473 -50452 -139548 -29560 -101294 -155549 -49248 351709 -368153
12846 -142472 232275 -246664 239285 -154572 -5376 -79605 -6308 -255362 195486 59425 -81658
12834 -36513 63787 -172691 -203909 84204 353376 -19459 157575 42494 12423 -30220 141111
12822 -158390 -297507 205107 -258670 -111421 -194971 81572 118989 -59134 233550 114092
12811 312124 163042 -172150 292835 -12208 91056 3650 -35745 129511 227442 -61842 -443559
12800d43559A00688f8098j08211H286g7698B15505a56821d7569j30709C6004K72800
12789C08804j10357d8587G4270L0623b05513i2209C68216d6228I0775F168J80752
12778A86920p1182b22363B34129H75K59203a26317K2407K8242m4696m92b826H5567
12765D37122A21931a17580A3977g0886n02648A97807h6610B77596H3661a95464
12754A06815h7821M901I8671a50851B4004M6833a15226k89799a10824A0041a94058
12742B14664a05057A58816N3348J4152k4272o1338C6301L17870e9527A23165g2969
12730d7365C1020J93986A7745Q8526J92531l2343o9710a3656H9919J02918a03080
12718A29668c7224P050E3361b7346A43066a73212A45729h3297L8702J2538G0505
$$ plain form
12800 -443559 100688 -68098 -176309 8286 -77698 215505 -156821 -47569 -178278 36004 308804
12789 308804 198447 -48587 74270 104893 -205513 -92209 368216 -46228 90775 6168 186920
12778 186920 115738 -222363 234129 875 260078 -126317 -103910 -75668 -120364 -120856 -2826 85567
12765 437122 121931 -117580 13977 -70886 -573534 197807 -86610 277596 83661 -195464
12754 106815 -87821 -82920 98671 -150851 24004 70837 -115226 -405025 -110824 10041 -194058
12742 214664 -105057 158816 212164 226316 202044 140706 36301 354171 -59527 123165 -72969
12730 -47365 31020 225006 17745 106271 298802 266459 196749 -13656 89919 192837 -103080
12718 129668 -37224 -30174 53361 -27346 143066 -173212 145729 -83297 -44595 -32057 70505
12706B22685a95873M1537p6137B47987j12585b49181B6668K73320N054O2462j9428
12695C48076A8581b11044B61436a39367D37579o9447j03305F361K28178K5193
12685B59732c9585p2894j59185C7946O7978L32d984D8847K07877h3023g981q1533
12673h9514A66003b91281f0197A12865e7628B3816K87595n9151m6197n4477k6066
12662A25520J460b4834B25599a2469H9183b6481A67328i6039B50295C2671b9772
12650A32842b08847k03244C9558J97846a57104B82040I8848Q9350h2975A89589
12639B14425J85487d634D3913A8636a5498H977L40924b09836A90129l8360m4538
12628A07231a66666g8428j49253A0175a69134J2740q8237j04863J72224d8051
$$ plain form
12706 222685 -195873 -154336 -230473 247987 135402 -249181 26668 299988 305042 367504 348076
12695 348076 18581 -211044 261436 -139367 437579 368132 264827 6361 234539 259732
12685 259732 -39585 -112479 -271664 37946 105924 106256 -4984 48847 256724 -83023 -7981 -89514
12673 -89514 166003 -291281 -60197 112865 -57628 23816 311411 252260 206063 151586 125520
12662 125520 126980 -24834 225599 -12469 89183 -26481 167328 -96039 250295 32671 -29772
12650 132842 -208847 -412091 39558 237404 -157104 282040 98848 188198 -82975 189589
12639 214425 399912 -4634 43913 18636 -15498 8977 349901 -209836 190129 151769 107231
12628 107231 -166666 -78428 -227681 10175 -169134 -156394 -244631 -349494 -177270 -48051
12617A37210c306A72719c7550A7105a45667A19935g418B92773r1372J28094a47059
12605a97942F7482M42790a71571B58818K14202e4253A60136M5530I5588K3060
12595A18648c81m5793B26469n3493C7590J51456a8301r9505B98852m6754a11543
12583A64069a05366D23912d6851j62871M5381A016c66577a127A0710a97914a3279
12571a16206a2163I3662f5901n9782N3884B09247G0726a05929b2462o2255h640
12559b0051j42118A63346n0635a6115o5333B29120n535a25199C4709c6116P410
12548b8706k42149R1297B86047b76566O1937b0393m0964b8048l8214a6582o055
12537b2637j2893p6390A79893h571l77533a60066A63656b5173H9016a77484P289
$$ plain form
12617 137210 -3306 172719 -37550 17105 -145667 119935 -7418 292773 201401 329495 -147059
12605 -197942 67482 510272 -171571 258818 473020 -54253 160136 205666 95588 118648
12595 118648 -381 -46174 226469 172976 37590 189046 -18301 -117806 298852 252098 -111543
12583 164069 -105366 423912 -46851 -209722 -164341 1016 -366577 -1127 10710 -197914 -13279
12571 -116206 -12163 93662 -65901 -125683 -71799 209247 70726 -105929 -22462 -84717 -8640
12559 -20051 -162169 163346 112711 -16115 -81448 229120 223585 -125199 34709 -36116 -28706
12548 -28706 -270855 -179558 286047 -276566 -214629 -20393 -61357 -28048 -66262 -16582 -22637
12537 -22637 -35530 -111920 179893 -8571 -386104 -160066 163656 -25173 89016 -177484 -170195
12526a70195A0576J91513H1490b84021A40516C5906e2029p5267j57003A87447
12515d169A49021b44899P6022A09366c9678A59192c21216g7355j33860B7990K6886
12504E4876J3126a36245O4652j32755H6317B7697L2992b6579F5271c10167c3502
12492B5624K24378a29031B43925n0115J94135G3018b38561o0742C26089c80562
12481b93881A39302O9186Q1547c6750A69243F0037a55158O2522H1034N9536a60441
12469B35065c46235H2393a14705N3985B5823a15186a3513N564j70693L7054B13265
12457B32414G2284k4823c28836g4761c1872k10976b3864k2775B11412a4938B69058
12445a43456A52494a60402A39767a44198A06239a82386e3743j3110a006B67195
$$ plain form
12526 -170195 10576 202089 81490 -284021 140516 35906 -52029 -127296 -284299 187447
12515 -4169 149021 -244899 -168877 109366 -39678 159192 -321216 -77355 -211215 27990 54876
12504 54876 68002 -136245 -71593 -204348 86317 27697 60689 -26579 65271 -310167 -33502
12492 25624 250002 -129031 243925 193810 387945 73018 -238561 -299303 326089 -380562
12481 -293881 139302 208488 290035 -36750 169243 60037 -155158 -92636 81034 140570 -160441
12469 235065 -346235 82393 -114705 -60720 25823 -115186 -13513 -7949 -178642 -141588 213265
12457 232414 72284 47461 -328836 -74761 -31872 -242848 -23864 -46639 211412 -14938 269058
12445 -143456 152494 -160402 139767 -144198 106239 -182386 -53743 -66853 -1006 267195
12434A85079L9005D6892a06661I0287A1103a93468q5317J12930N1964p4369a9071
12422B15032b72736h5353A4414g1217l2615k0994j63934a03340C1204O8795a69772
12410a26439B35996d7357j7525l9104j3570l092B73897G3371e5577k70129B39467
12398B55184b85569D03317a72206A18318b01893D0635f4352k21607B2440J79336
12388B01776a39423n4909B7548c8943k3191j9845B16678a15081q0048B54038r9241
12377A54797a99120h6905M0388E43596D1403d0655A30824a63082I5646N89647
12367F85293a00243R375k53960A68633J80141g8914A66569a02006r694A55799
12356A46961M89441a12330k37920H59c3490B53974g9470D85059D4181g432A22800
$$ plain form
12434 185079 224084 46892 -106661 90287 11103 -193468 -278785 -165855 -113891 -188260 -19071
12422 215032 -272736 -85353 14414 -71217 -103832 -124826 -288760 -103340 31204 99999 -169772
12410 -126439 235996 -47357 -64882 -103986 -117556 -120648 273897 73371 -55577 -325706 239467
12398 255184 -285569 403317 -172206 118318 -201893 40635 -64352 -285959 22440 201776
12388 201776 -139423 -194332 27548 -38943 -62134 -81979 216678 -115081 -195129 254038 154797
12377 154797 -199120 -86905 -46517 543596 41403 -40655 130824 -163082 95646 685293
12367 685293 -100243 -90868 -344828 168633 348774 -78914 166569 -102006 -111700 155799
12356 146961 636402 -112330 -350250 859 -33490 253974 -79470 485059 44181 -7432 122800
12344g7726A86318o6695k2519C4120a8724j80503A1034J28870a04475D44671a93086
12332A36862C6842L9622b19313B02764o1314K4568A5900a08365k29257A14853
12321a12766j78524H6598B304N531K5602K9188a5621D77758B21030a09254A47489
12309B46544m0248j01879P3980K79240i6972A10332K0297J55440l4385b4661B18323
12297C26310a46973j51159g7180E68899k17251D3554K41922a6951A08933K54568
12287C63501d1001j04890a7173A0735J03674R6655l6139a70001A59645N032E9124
12275A84478k5700a2780j15232l0609B2946J93935h4511D6748J24159a432C77136
12263F53594G0952J35787N674k7855G2964A3743M93949A28167J94980A18177d6507
$$ plain form
12344 -77726 186318 119623 97104 34120 -18724 -199227 11034 139904 -104475 444671 -193086
12332 136862 36842 76464 -219313 202764 141450 166018 15900 -108365 -337622 114853
12321 -112766 -291290 86598 2304 7835 33437 62625 -15621 477758 221030 -109254 147489
12309 246544 206296 104417 178397 457637 -96972 110332 130629 286069 251684 -24661 218323
12297 326310 -146973 -298132 -77180 568899 351648 43554 285476 -16951 108933 363501
12287 363501 -41001 -145891 -17173 10735 114409 211064 174925 -170001 159645 164677 59124
12275 184478 158778 -12780 -128012 -158621 22946 216881 -84511 46748 170907 -1432 377136
12263 653594 70952 206739 212413 184558 72964 13743 507692 128167 323147 118177 -46507
12251H9647N5444K19060A30920c1790A86627J9748g7968E6226c6066F0365k9690
12240C0675P5648D1410J18676K3807i4254C17015P2893A32221a35748B5377a23387
12228B8460K2989L234J21873M3699a1255C94945f4738j17204A03966l3115C4843
12216B38020G0294a49B6015a34120H3810R7790o190b95859C34261b60237B00755
12204c8965A71662J32346g2568A87469K69437b3381F03334F5366P7913b74593
12193B51773i7395I6443J03244a37555A50730C1149J19971n9428i0530H5786J69888
12182B55674I0339K09786j33899h948B00833L4843A8507b383A59884k6201o0487
12171G3196B9378A3996d14884B95070M3877D1981d8360B28415J520B6148K68095
$$ plain form
12251 89647 145091 364151 130920 -31790 186627 206375 -77968 56226 -36066 60365 30675
12240 30675 106323 41410 160086 183893 -94254 317015 389908 132221 -135748 25377 -123387
12228 28460 51449 54683 176556 220255 -11255 394945 -64738 -181942 103966 70851 34843
12216 238020 70294 -149 26015 -134120 83810 181600 175410 -295859 334261 -260237 200755
12204 -38965 171662 304008 -72568 187469 456906 -23381 603334 65366 143279 -274593
12193 251773 -97395 96443 199687 -137555 150730 31149 151120 91692 -90530 85786 255674
12182 255674 90339 300125 166226 -8948 200833 235676 18507 -2383 159884 133683 73196
12171 73196 29378 13996 -414884 295070 338947 41981 -48360 228415 229935 26148 294243
12160B94243A07773J02024d3433B68057L8281d5078E9350J8579b2840B06902f6683
12148B94105E77L46628j33218J46461a57339A07110K0536h4306p6989d6639F6390
12136A59341K48285F0435J77150O3121B226h6615B19328C4907a8932j18139A1399
12124B18119f7688D9823f585A11269M2210F7377M4058J16192j08704f8291A68203
12112D5541c79034A4288a52052A48582a40974B03260n9044b32939C65780j77763
12102A88017a38561B51771j06467Q2527L1477b3029A19847h1567l7336F3305K96704
12091C60009F0560f2848C21175R0169d8464A00496J89023J6133A34746j7516L07551
12080D24781g7729B14511J27425a20350G9665J18086C7259A3474J14708n016C1756
$$ plain form
12160 294243 107773 209797 -43433 268057 306338 -45078 59350 77929 -22840 206902 -66683
12148 294105 577 347205 213987 360448 -157339 107110 127646 -84306 -161295 -46639 66390
12136 159341 407626 60435 237585 300706 2226 -86615 219328 34907 -18932 -137071 11399
12124 218119 -67688 49823 -6585 111269 153479 67377 111435 227627 118923 -68291 168203
12112 45541 -379034 14288 -152052 148582 -140974 203260 144216 -232939 365780 188017
12102 188017 -138561 251771 145304 227831 259308 -23029 119847 -81567 -118903 63305 360009
12091 360009 60560 -62848 321175 411344 -48464 100496 289519 305652 134746 117230 424781
12080 424781 -77729 214511 341936 -120350 79665 197751 37259 13474 128182 123166 31756
12068b4553B73649E86N2151J90474K47986B35367M7712H1864b23706C19805L45393
12057F65198B51214h1597K0508F4476J9372Q69K76650A41119j094E1758e153D04303
12044A50290j6587L2726a51897H9448h2202I2832b66168A05329B1107f65j18565
12033a19230b161k29165C3414R3669a539r1323j92236C02500e0613A795a28955
12021i1351A00896k8364N7986L182a14077C3626h4195Q993G2135a55281B41762
12009A35431A7771a85446E7560J82638a25250C16756a80090A45995o0603a1650
11998a1056C2528J06728J53603M7552A66090e8799B65847A2739P8400l8562O9015
11987A21592b31997A77237h8647a5389B53556n6037b4760A25430n5243J65557
$$ plain form
12068 -24553 273649 586 52737 243211 491197 235367 283079 81864 -223706 319805 665198
12057 665198 251214 -81597 -61089 64476 83848 84717 361367 141119 140025 51758 -5153 404303
12044 150290 133703 166429 -151897 89448 -82202 92832 -266168 105329 21107 -665 -119230
12033 -119230 -2161 -231326 33414 127083 -1539 -92862 -285098 302500 -50613 1795 -128955
12021 -91351 100896 72532 130518 133700 -114077 33626 -84195 -75202 72135 -155281 241762
12009 135431 17771 -185446 57560 240198 -125250 316756 -180090 145995 85392 -11650
11998 -11056 32528 139256 292859 340411 166090 -58799 265847 12739 91139 52577 121592
11987 121592 -231997 177237 -88647 -15389 253556 197519 -24760 125430 70187 235744
11977B35744k5460n4556a82572A27899n7627J13585a0557B66587a11408N0636
11967f0772B5290g462B91832E9109P6246O209a71953g0011k9503A29467e1634
11955c24065D12082a61639g0162B60064G2483f7703J4395r8970I7683A3344L416
11944A6760b72772d1241J4156B26674J26083C6425f8545A29290b05997a7815j05509
11933a23324m7061B21380D9332B641b94033J28067j62546d6903E6351K1758C0149
11921B35820a9070A60298e8842j07159A66683d4989A47548b5317A88595D990b85204
11909a64436E6858K68559b29884A31640h1523A56816J8674b85500A85772M8170
11899B33942a76428j39814D6837J33387a23650j4168A2720L2787N3845J20480
$$ plain form
11977 235744 210284 155728 -182572 127899 70272 183857 -10557 266587 -111408 -60772
11967 -60772 25290 -7462 291832 59109 135355 141564 -171953 -70011 -99514 129467 -51634
11955 -324065 412082 -161639 -70162 260064 72483 -67703 -53308 -152278 97683 13344 16760
11944 16760 -272772 -41241 -27085 226674 352757 36425 -68545 129290 -205997 -17815 -123324
11933 -123324 -170385 221380 49332 2641 -294033 -165966 -328512 -46903 56351 78109 30149
11921 235820 -19070 160298 -58842 -166001 166683 -44989 147548 -25317 188595 4990 -285204
11909 -164436 56858 325417 -229884 131640 -81523 156816 175490 -285500 185772 233942
11899 233942 -176428 -316242 46837 180224 -123650 -137818 12720 45507 99352 219832
11889B19832a63390d4277j01407A14780j9701C6466J61428c31260E7431J7868
11879G5299K2759c45511E9454a29604F3054M172b87652G4303a78192p7714E5898
11867C5250c3963j57370A9878R9609L4279a70875d4829A78295g0341D7486K49523
11856B97009H4323b0707k18437I6344j9098c35387C3510a15603j23025m3684B49929
11844a05241f724m7571j03081c5329A1653b9595k19378A46217f7102k63191a0967
11832b72975Q1544c5410l01403H8679a08390o7679K2776b9955D9226b46884B6465
11820H3183a90464j59628a22658E3246K69633a47515o363J0672A6716b09339A69614
11808D5531a17772L3782k296a2000p5288B38992a60858A08017A2297g0616H2766
$$ plain form
11889 219832 -163390 -44277 -145684 114780 95079 36466 197894 -331260 57431 75299
11879 75299 98058 -345511 59454 -129604 63054 67226 -287652 74303 -178192 -255906 55898
11867 35250 -33963 -191333 19878 119487 153766 -170875 -44829 178295 -70341 47486 297009
11856 297009 84323 -20707 -239144 96344 77246 -335387 33510 -115603 -238628 -282312 249929
11844 -105241 -6724 -54295 -157376 -35329 11653 -29595 -248973 146217 -67102 -330293 -10967
11832 -272975 -191431 -35410 -336813 88679 -108390 -176069 -153293 -29955 49226 -246884 26465
11820 83183 -190464 -350092 -122658 53246 322879 -147515 -153878 -143206 16716 -209339 169614
11808 45531 -117772 -83990 -86286 -12000 -87288 238992 -160858 108017 12297 -70616 82766
11796d05292a13575j94366d1961B52308j9870a53204K1828j74576J52051A34378
11785A63831J87943H5301b07786E1182f1366a9729F6819c44670A35943b7601A82458
11773c17050C977b66430Q7651B19549m1282a00937D9590j6323J09966a54422A26441
11761b07180b432k83695A59807a12024j20641B3535N8599b26106m4297f2194D3545
11749C0556b83107L6556K1889C2217b30687O8700D1080G177J32578K03781g2931
11737I2211o123J97067C316K46819D1686J82679l0401q8423J453b41036G402a33432
11724h118A98832J7260C3421M9045R29a37205A0819a45328L6515A0255b949E5115
11711a40924r7670J00480p3520D4499h3741b3551m4205k21346a34953j03545B49048
$$ plain form
11796 -405292 -113575 -307941 -41961 252308 232438 -153204 -131376 -305952 -153901 134378
11785 163831 351774 85301 -207786 51182 -61366 -19729 66819 -344670 135943 -27601 182458
11773 -317050 3977 -266430 -178779 219549 178267 -100937 49590 33267 143233 -154422 126441
11761 -207180 -2432 -286127 159807 -112024 -232665 23535 82134 -226106 -270403 -62194 43545
11749 30556 -283107 -246551 -224662 32217 -230687 -161987 41080 7177 139755 343536 -72931
11737 92211 86088 283155 3316 250135 41686 224365 193964 105541 106994 -241036 7402 -133432
11724 -8118 198832 216092 33421 82466 83395 -137205 10819 -145328 -108813 10255 -2949 55115
11711 -140924 -238594 -138114 -211634 44499 -83741 -23551 -67756 -289102 -134953 -238498 249048
11699H408b028A08272A0994K54825H6382a1802p1572j8909A80915e1165H6604
11687a50501H4700k361e7474A9593i4952I9983O9811p2587f7476a7249A33868
11675D60803k23369D9136R6731b46484G3349c6324I6740J74254A12402d0381j24682
11664a65063M1899A60818a87294C036g5713j80859J23994C6859b30862D1852J4402
11653E6254c1412j22838B33332c278l45584E6725a50740j4286B15271l2210i5889
11641b33297D5829a40921a9945G3995a92962H7164a58495B5998K0875a10474B67912
11629i2529m0719A25875J88350a99239M5639k4152E8557L09553b02620f3686D31057
11617h4840G4472J83188P7342F1767K0260b87550J21137A7365b16465A28281j1950
$$ plain form
11699 8408 -2028 108272 10994 265819 86382 -11802 -83374 -102283 180915 -51165 86604
11687 -150501 84700 82339 -57474 19593 -94952 99983 169794 97207 -67476 -17249 133868
11675 460803 237434 49136 145867 -246484 73349 -36324 96740 270994 112402 -40381 -165063
11664 -165063 -123164 160818 -187294 3036 -75713 -256572 -132578 36859 -230862 41852 56254
11653 56254 -31412 -154250 233332 -3278 -348862 56725 -150740 -165026 215271 183061 -95889
11641 -233297 45829 -140921 -19945 73995 -192962 87164 -158495 25998 46873 -110474 267912
11629 -92529 -133248 125875 314225 -199239 -153600 -177752 58557 368110 -202620 -63686 431057
11617 -84840 74472 257660 335002 61767 82027 -287550 -166413 17365 -216465 128281 116331
11606A16331H98a0792B08981a89967j34742f5830c1085B58852a1656j31114d8670
11594i032B2300P0975J59656G5530P5842j2502c8951o5189E0973a34586k9058
11583a63644j02925G9386C6981A0760L86162A40516g8439o1420A51887n9458c02536
11571a30851B41846j02507N4177M5352E9941J54941B3594R1335K09197C2766N4064
11560H6830a89655j01758E5792b52984k25180A05272J19858O9877e9748A00909
11549F2018a4622G711a8836B90501M9962a5176A90632c21696H0396B1260O128
11538B7388J58091j3621h3323I2495B5802c66524H7489C0098R5350a79620P8331
11527a01289k9587C16493j26165l5613K49791g4743E9410K93963j6780c68131
$$ plain form
11606 116331 898 -10792 208981 -189967 -324709 -65830 -31085 258852 -11656 -142770 -48670
11594 -9032 22300 93275 252931 75530 151372 138870 -38951 -104140 50973 -134586 -163644
11583 -163644 -266569 79386 36981 10760 396922 140516 -78439 -139859 151887 92429 -302536
11571 -130851 241846 139339 193516 238868 59941 214882 23594 114929 324126 32766 86830
11560 86830 -189655 -291413 55792 -252984 -478164 105272 225130 295007 -59748 100909
11549 62018 -14622 7711 -18836 290501 340463 -15176 190632 -321696 80396 21260 27388
11538 27388 185479 171858 -83323 92495 25802 -366524 87489 30098 125448 -179620 -101289
11527 -101289 -130876 316493 190328 154715 404506 -74743 59410 353373 336593 -368131
11516A46649A8255L28398j31731e642B28226D7831i6420A14540a88085C7395J69573
11505B06968J16085E4535a37975G0428a38814A7051J56077m1229g5768l02972
11495c78740B36326o8676c24520A84312k3161c9683I2653a74810g2732b4885A96466
11483b3395B7280b1198I5092g1739B31434o3483K4198a17870A36820K16327P4538
11472D27685a01268C02371E6631a16783E66293B31591m7810N3115j11704f3264
11461C41494G2905A9677a18631c8316D24818A18099d4852j44832A18435M3711
11451A62146p8665K8260J89758j11017m444k9899K13888I6598g3949A50634f7268
11439B94506b9221A17249a18983H8547a8159g486l84324c4720C9645a59704I5807
$$ plain form
11516 146649 18255 346653 214922 -5642 228226 47831 -96420 114540 -188085 37395 206968
11505 206968 323053 54535 -137975 70428 -138814 17051 173128 131899 -75768 -378740
11495 -378740 236326 167650 -324520 184312 161151 -39683 92653 -174810 -72732 -24885 196466
11483 -23395 27280 -21198 95092 -71739 231434 167951 192149 -117870 136820 353147 427685
11472 427685 -101268 302371 56631 -116783 566293 231591 183781 236896 125192 -63264
11461 341494 72905 19677 -118631 -38316 424818 118099 -44852 -189684 118435 162146
11451 162146 83481 111741 301499 190482 186038 156139 370027 96598 -73949 150634 -67268
11439 294506 -29221 117249 -118983 88547 -18159 -7486 -391810 -34720 39645 -159704 95807
11427C6240N5310K07394A45147a39414k74341B09900c35043h2424p6305c4990
11416e8074k2530D8661J19245H2283k7613a52154J3851b9363k18135C06301a15099
11404a13842l7788H669J19380M6351H3123D732b57625J14995F4099J27741q1073
11393A10767a2112B13590j02835C0842b41947J15560E438a38758C02760D0747
11382g638G261b56887A30191b51486A17465f3903C01273H310a12760L1341A42658
11370d7373A34004B7834L48665i0715G080b24454J00469f614D1263J87009I0408
11358a00996p4676J5647c0650B02371b34872J08335B2851P368J33689C7847a99170
11346a60367B33189G4579a26328M247j7569N4945o552M3408B63404A9973K12917
$$ plain form
11427 36240 91550 298944 145147 -139414 -413755 209900 -335043 -82424 -158729 -34990
11416 -58074 -80604 48661 167906 82283 54670 -152154 -138303 -29363 -247498 306301 -115099
11404 -113842 -151630 8669 128049 174400 83123 4732 -257625 -142630 64099 191840 110767
11393 110767 -12112 213590 110755 30842 -241947 -126387 5438 -138758 302760 40747
11382 -7638 7261 -256887 130191 -251486 117465 -63903 301273 8310 -112760 -81419 142658
11370 -47373 134004 27834 376499 -90715 7080 -224454 -123985 -6614 41263 228272 90408
11358 -100996 -175672 -160025 -30650 202371 -234872 -126537 22851 30219 163908 37847 -199170
11346 -160367 233189 74579 -126328 -122081 -139650 -84705 -91257 -47849 263404 19973 232890
11335B32890j09239O4334D9285K27232H0875b03982A04718d2253F780a19606j15063
11324b34669B08602I166d8896R216k7012C35692A40494R3341G1149L0693h1573
11312d52548O4207a71966C04422e5547A69532c22865a29807j98305D2997f4437
11301A07109L0396c2962k38072b5984l23742a63660k78744i8697A12357a93116
11290G2390a54245D127J4827b96077B14587b3284B27195b54696B38983c65296
11279C7014a49540k17607R9894A15540a20582j45902f882j47530b5680n3703H7477
11267B664J83179a96445R6396B02041c17088D5610J12029m4145C8340A4652L27810
11256C42462h254A0756a25431J5805j35086f2692J8859C1395J88279a45092A06096
$$ plain form
11335 232890 123651 187985 49285 276517 80875 -203982 104718 -42253 6780 -119606 -234669
11324 -234669 208602 9166 -48896 -39680 -66692 335692 140494 233835 71149 101842 -81573
11312 -452548 -388341 -171966 304422 -55547 169532 -322865 -129807 -328112 42997 -64437
11301 107109 137505 -32962 -271034 -25984 -349726 -163660 -442404 -98697 112357 -193116
11290 72390 -154245 4127 18954 -296077 214587 -23284 227195 -254696 238983 -365296
11279 37014 -149540 -367147 -267253 115540 -120582 -266484 -6882 -154412 -25680 -79383 87477
11267 2664 185843 -196445 -100049 202041 -317088 45610 157639 113494 38340 14652 342462
11256 342462 -8254 10756 -125431 -109626 -244712 -62692 -43833 31395 219674 -145092 106096
11244a84463N9310B937R1482a09688l20578a66380A9014E157a05253F8250C188
11232a37591E6170c06918i9951l44546a56286g6618B12522b37753B86418a7984
11221b21823a2330r9023q6528A23695a6909A8976K7120J7286A2782a97772i6377
11209G5722j8472a72363H1401J79768i7294a8367j26987p4944d4335B8394c0750
11197b16587g6728k44142e9756C1547a5134j77019O4497j8115A66132b0848p0127
11186i0975I613K29881b06251C3631a35763j66492g7092L1563A16081C4126J26755
11175A60881b44223B01496l4099C3766N3711g536D572a96619g0025q9275P186
11164a52114k08379a28242l5556E1543d5056B7863H553R7142a40742a6833F308
$$ plain form
11244 -184463 -125153 2937 94419 -109688 -430266 -166380 19014 5157 -105253 68250 3188
11232 -137591 56170 -306918 -99951 -444497 -156286 -76618 212522 -237753 286418 -17984
11221 -221823 -12330 -111353 -197881 123695 -16909 18976 46096 63382 12782 -197772 -96377
11209 75722 57250 -172363 81401 261169 -97294 -18367 -145354 -220298 -44335 28394 -30750
11197 -216587 -76728 -320870 -59756 31547 -15134 -192153 -127656 -145771 166132 -20848 -90975
11186 -90975 9613 239494 -206251 33631 -135763 -302255 -77092 -45529 116081 34126 160881
11175 160881 -244223 201496 167397 33766 87477 -7536 4572 -196619 -70025 -159300 -152114
11164 -152114 -360493 -128242 -163798 51543 -45056 27863 8553 105695 -140742 -16833 6308
11152b34258I415a74604o5505E825g7213E4607e4469B11114b3609j67301n6796
11141b47706A87817a69120a9869A02714h8904B16559c86315i9769A31226f2727
11130G4194b8879A09602c77681C27313H9806D4824h3225c9724j50782C61181e9715
11118a95733C12711p5523f5121E4397b50357C61537j45695J19262E4333N7846
11108A12179B9789f3193p2231j60155f5017B3125J22503E8310M6126g5294A49025
11096c11227i3794L4592E0040i3882N970A02412J74935A06417K38792a84966A85265
11084A12928P3445a06266A20214J91708m8698m727r7057F6022K62952j51869a60701
11072A08382J64323K6496B186b74878I8041L1624g3616E33022a76777C55867I6300
$$ plain form
11152 -234258 9415 -174604 -240109 5825 -77213 54607 -54469 211114 -23609 -190910 -247706
11141 -247706 187817 -169120 -19869 102714 -88904 216559 -386315 -99769 131226 -62727
11130 74194 -28879 109602 -377681 327313 89806 44824 -83225 -39724 -190506 361181 -59715
11118 -195733 312711 237188 -65121 54397 -250357 361537 215842 335104 54333 112179
11108 112179 29789 -63193 -135424 -295579 -65017 23125 145628 58310 104436 -75294 149025
11096 -311227 -93794 -59202 50040 -93882 -87912 102412 277347 106417 345209 -184966 185265
11084 112928 186373 -106266 120214 311922 263224 258497 161440 66022 328974 177105 -160701
11072 108382 272705 299201 2186 -274878 98041 129665 -73616 533022 -176777 355867 96300
11060C91029A37351j3063N42378B00025J71395j41937I9594D4213K49420j12044
11050A81589j8238j3062J53770M2343J51252k10536J91696A83915L17781A80339
11039C62851O9102j28050n9911K73240j6730L10224k43320J72026j04193m4853
11029E90386k6040j15334O5419K80990k31684n9746J91480k03209P5233j8474
11019E49021q4522j7448j49304L92436k68655J84935n1819J69972k33037J49541
11009F41120k15227L10060M5118j38299R5041B20280n0463K82140N0416M8735
10999E51108q6221P1989j5814H7678K85428A47824J22180j6571J93131Q9693j52557
10988C83700o8015P23002l14815l0447j11560B28846K31195m9925j95206J01421
$$ plain form
11060 391029 137351 124288 666666 200025 371420 229483 99594 44213 293633 181589
11050 181589 163351 150289 304059 346402 497654 287118 478814 183915 501696 180339
11039 362851 431953 303903 243992 517232 500502 810726 567406 739432 635239 590386
11029 590386 564346 449012 514431 795421 563737 503991 695471 492262 567495 549021
11019 549021 464499 447051 297747 690183 421528 606463 554644 724616 491579 641120
11009 641120 425893 735953 781071 642772 737813 220280 169817 451957 502373 551108
10999 551108 464887 536876 521062 87678 373106 147824 270004 253433 446564 536257 383700
10988 383700 315685 1038687 723872 693425 581865 228846 460041 410116 214910 316331
10978C16331J24630J08987n5425K15828C23535M01279P1496l37349n2351J92872
10968E99482M1437K24202K6583o8107r6968K34817j07216J22995J88657J03178
10958A269060Q7384M2250L45429N2711L74467k88611J97624m8028m40276O9268
10948A661278J43509k39427L430j89463j79725J89728L09539o80498p615L51641
10938A362397r4629J31248j99208j0578j39642J26950E85266O1468J52948C65380
10927D96500G688f5752E52624A65306N32328c6926I3221C9008g7445n0805B4874
10915A80071j2035J07132b14673J3649j10997H9510P3119h9650j50879A62774
10904c2213C9226K3719j6130K38015G3705d7405A27394n7366Q0061J69276b1356
$$ plain form
10978 316331 440961 549948 494523 710351 323535 724814 796310 458961 406610 599482
10968 599482 640919 865121 891704 823597 726629 961446 854230 977225 1165882 1269060
10958 1269060 1356444 1398694 1744123 1796834 2171301 1882690 2080314 2032286 1592010 1661278
10948 1661278 1804787 1565360 1568790 1379327 1199602 1389330 1698869 1018371 1010756 1362397
10938 1362397 1267768 1399016 1199808 1189230 1049588 1176538 585266 646734 799682 365380
10927 496500 7688 -65752 552624 165306 697634 -36926 93221 39008 -77445 -128250 24874
10915 180071 168036 275168 -214673 -201024 -312021 89510 162629 -89650 -240529 162774
10904 -32213 39226 62945 46815 284830 73705 -47405 127394 70028 150089 319365 -21356
10892a52620B52581i1423d4594n6614H121a18910k43164c1740B94114A8263c1061
10880d534j78780d88C27616d3444j60333H1043M0013b25948j24284B93409b61660
10868C62121d63173h2432E4400J38043o8554i107C97998A70527b66481n2983B75771
10856B22133b01158h5844r9505n3378B5922N291a95102H905O6531A0706c16014
10844b10359A19548a24619A59596b178j65142G6754b61474B22670c15600A85897
10833d5505B63535b00629P1178D4566j1221O655R896g3912B53899a73767k826
10822a76593N4697b1126m85297f9802k04122h6007l23126i0826G0446M7289a55591
10810f563A03748J32361a27862j7049N8093C5014b22049A76123a28167j6147b1695
$$ plain form
10892 -152620 252581 -91423 -44594 -101208 8121 -118910 -362074 -31740 294114 18263 -31061
10880 -4534 -183314 -488 327616 -43444 -203777 81043 121056 -225948 -350232 293409 -261660
10868 362121 -463173 -82432 54400 192443 123889 -9107 397998 170527 -266481 -319464 275771
10856 222133 -201158 -85844 -185349 -238727 25922 31213 -195102 8905 75436 10706 -316014
10844 -210359 119548 -124619 159596 -2178 -167320 76754 -261474 222670 -315600 185897
10833 -45505 263535 -200629 -129451 44566 33345 40000 49896 -73912 253899 -173767 -176593
10822 -176593 -121896 -21126 -506423 -69802 -273924 -86007 -409133 -90826 70446 117735 -155591
10810 -6563 103748 236109 -127862 -144911 -86818 35014 -222049 176123 -128167 -144314 -21695
10798A50941b30691O5640c4019l0290B97477A4869p325J26449J77640d64185a37962
10786a41159b2456k32209a9253p437q1871r1781B5068J09737D0109A1923a44420
10774H7148J85173h4760m8979I8425O5052b29952N5166g0193j22302E9193a50198
10762d56622a15892o9738M3535k60356A71734a95539D6763P578a03838A64567
10751i1076c4032B883b06198p3361E8616a61812c02E9684B0553g2517L1142p4382
10739a15757k4922K8382G5855g30n1942H46b56431O4162B25750r6350b52003b0750
10726G1426b87129A34058a23605N9159n115G680J98273i9050c0733l47779C788
10714b37926c684k57197A17462J00182b95559c2109A85035a77149a5881p9469
$$ plain form
10798 150941 -230691 -165051 -34019 -64309 297477 14869 7544 133993 311633 -464185 -137962
10786 -141159 -22456 -254665 -19253 -26690 -108561 -200342 25068 134805 40109 11923 -144420
10774 87148 272321 -84760 -133739 98425 163477 -229952 -174786 -70193 -192495 59193 -150198
10762 -456622 -115892 -185630 -142095 -402451 171734 -195539 46763 54341 -103838 164567
10751 -91076 -34032 2883 -206198 -279559 58616 -161812 -302 59684 20553 -72517 -41375 -115757
10739 -115757 -140679 -112297 75855 -730 -52672 846 -256431 -192269 225750 129400 -252003 -20750
10726 71426 -287129 134058 -123605 -64446 -69561 7680 205953 -99050 -30733 -378512 3788
10714 -237926 -3684 -260881 117462 217644 -295559 -32109 185035 -177149 -15881 -95350
10704i5350B70972a50947A02527J02247b45445c3848j36288j0924c6481m1251
10694g7732k0995A08454r718c28139H7228J76560j24891N7878B8495J82043d9105
10682F648b11417J00734C0427b98453Q8451A39e5037j08051c2022A6673J5202
10671C1875h804B32945c37859B0456b30295N5439f4199p1607G6071a19614G5007
10659c81743i5018k4704J5698A44856k355P8347B0007a17767b9314n9512G5723
10647a96075h8666A22532b09719l3126P6437N9935n7575q7407A52929a9624k91885
10636c11509E8419f7880o2026A74883a15227j48759a7570j18982A4836a16558
10625a72671c9328A01817h0128A58155b55834j91260H8534a10682A56321J2148
$$ plain form
10704 -95350 270972 -150947 102527 204774 -245445 -33848 -170136 -181060 -36481 -77732
10694 -77732 -98727 108454 98736 -328139 87228 263788 138897 196775 28495 210538 -49105
10682 6648 -211417 -110683 30427 -298453 -210002 139 -55037 -163088 -32022 16673 31875
10671 31875 -8804 232945 -337859 20456 -230295 -174856 -64199 -135806 76071 -119614 75007
10659 -381743 -95018 -119722 -104024 144856 142501 220848 20007 -117767 -29314 -88826 75723
10647 -196075 -88666 122532 -209719 -242845 -166408 -106473 -164048 -251455 152929 -19624 -311509
10636 -311509 58419 -67880 -129906 174883 -115227 -263986 -17570 -136552 14836 -116558
10625 -172671 -39328 101817 -80128 158155 -255834 -447094 88534 -110682 156321 168469
10615A68469a19685a5524j54875o1608A09834b4259j07555e0124F6861d96075
10604c0887C4846a11910j5986r4166l7814c8937l04583J35972P7999C7291a93196
10592B62572d53472P6029a81163N4223A75615a26110H8963b37166q8519R4907
10582b30778a8273r8280A1108K70239D2095R5416b0364I8343b13140h7120l09163
10571c96283N7657d6825G9612c314k0202k92669A4379a38861D2188e8269d589
10559a64445l3994A91977a28664q4187A00561R5389a02038q4349A08769c3713
10548d0819j79574k16700J91308C89694b98992B67956g1089C759N3953J09030
10538A66742P0718i7317A0183c9046H8680J11956E5118a18383e6778k59668O5179
$$ plain form
10615 168469 -119685 -15524 -170399 -232007 109834 -24259 -131814 -50124 66861 -496075
10604 -30887 34846 -111910 -127896 -222062 -259876 -38937 -343520 -207548 -129549 37291 -193196
10592 262572 -453472 -377443 -181163 -126940 175615 -126110 88963 -237166 -325685 -230778
10582 -230778 -18273 -116553 11108 281347 42095 137511 -20364 98343 -213140 -87120 -396283
10571 -396283 -338626 -46825 79612 -3314 -23516 -316185 14379 -138861 42188 -58269 -4589
10559 -164445 -198439 191977 -128664 -212851 100561 195950 -102038 -186387 108769 -33713
10548 -40819 -220393 -437093 -245785 389694 -298992 267956 -71089 3759 57712 166742
10538 166742 237460 -97317 10183 -39046 88680 200636 55118 -118383 -56778 -316446 -251267
10527b51267A90789b67765B11691O7631b1025l7415j62694B38796C9308r679J17875
10516A47504K47485c27240C7101e1792B30930e8375A18133f6032A16204n1756
10506F4448b01531A65463h4353A1121b46762A20358G509N9356b31891A75862K03014
10495C78876i0589B23068b18941a00976A84502c595j00152A85754g5318J6273
10485e9045B11816o0411a8474F9741P978a37757m5565h1471B13079f7138m14304
10474d81442E59752b44661j4072C4789J27843d0023k92965h6274D02574r835a8837
10462C66647K4900j33890M1059F3915L30901j88707K5405a53269D02349A17771
10451E9216a1212j34350M2569L2006A33675n8114a16181p0822O628e6194H434
$$ plain form
10527 -251267 190789 -267765 211691 279322 -21025 -58440 -221134 238796 39308 29629 147504
10516 147504 394989 -327240 37101 -51792 230930 -58375 118133 -66032 116204 64448
10506 64448 -201531 165463 -84353 11121 -246762 120358 7509 66865 -231891 175862 378876
10495 378876 -90589 223068 -218941 -100976 184502 -3595 -103747 185754 -75318 -59045
10485 -59045 211816 151405 -18474 69741 77719 -137757 -183322 -81471 213079 -67138 -481442
10474 -481442 559752 -244661 -258733 34789 162632 -40023 -332988 -86274 402574 392739 -18837
10462 366647 391547 257657 298716 63915 394816 206109 231514 -153269 402349 117771
10451 59216 -11212 -145562 -102993 -70987 133675 75561 -116181 -187003 -180375 -56194 8434
10439f2700J9238j17434L6850d0980E2900b70819c3722j67483f3924m0847C5013
10427E9128N0867E2949d42305B49279b67598A1304b34692F5854c48169a57891
10416A71541b85460K6758f5040J3474B9147h240A910K65008A22032d05285A06312
10404i7077m2495F2163B6996A2285M0439b50006O2892A09089b45388h2816C66546
10392c4546B10292q9080a50670E6869a81599c85k09699l17911E0759c77796B51870
10380A5468K47374e34590c0470B45368k2042A00419J87757l7796K9402j14304
10370A65478J07526A29789K14037j54598E275J18042n7433M23206A2596M62650
10360D75246i7424j4724e5160A39013m5572M24543j28878e8278A74027J47717
$$ plain form
10439 -62700 -43462 -160896 -124046 -40980 52900 -270819 -33722 -201205 -63924 -104771 35013
10427 59128 109995 52949 -442305 249279 -267598 11304 -234692 65854 -348169 -157891
10416 171541 -285460 -258702 -65040 -51566 29147 -8240 1910 266918 122032 -405285 106312
10404 -97077 -139572 62163 26996 12285 52724 -250006 -187114 109089 -245388 -82816 366546
10392 -34546 210292 121212 -150670 56869 -181599 -385 -210084 -527995 50759 -377796 251870
10380 15468 262842 -534590 -30470 245368 223326 100419 288176 250380 279782 165478
10370 165478 273004 129789 343826 189228 5275 123317 65884 489090 12596 475246
10360 475246 -97424 -112148 -55160 139013 93441 517984 389106 -58278 174027 321744
10350C21744q2994k7638K36547B07376a51102C24918k5189f285C83194b0251I5933
10338G3846l1590J41223a05390D43452A92523o5975J81051E2203M7777J30637
10328B30617G1651N8005E7193L06300a79334A56426a85903B32506C0702J6053
10318D6755k1023K2556M32522A76985q0816P5339B760J4323J80169I0423g9371
10306C45752B974J69459d5589B86444i1203b1941J0058C84737d102m9704A53996
10294a57696A41274k6073E962K03177R1816i0896p3979D7689b13753J06767c9272
10282b513B53787e8760p3460I7961L392k5115b9579G6943J3388C837R1319d30472
10269D8125B523b87937C23322H7883K45940b81257a37129A82922a29782k7229
$$ plain form
10350 321744 238750 211112 447659 207376 -151102 324918 299729 -6285 383194 -20251 95933
10338 73846 42256 183479 -105390 443452 192523 126548 307599 52203 99980 230617
10328 230617 71651 129656 57193 363493 -179334 156426 -185903 232506 30702 46755
10318 46755 25732 48288 480810 176985 96169 171508 2760 17083 197252 90423 -79371
10306 345752 2974 172433 -45589 286444 -91203 -21941 -11883 384737 -4102 -53806 153996
10294 -157696 141274 115201 5962 209139 300955 -90896 -164875 47689 -213753 -106986 -39272
10282 -2513 253787 -58760 -132220 97961 101353 76238 -29579 76943 90331 3837 95156 -430472
10269 48125 2523 -287937 323322 87883 333823 -281257 -137129 182922 -129782 -157011
10259a57011N3514A13093C5251d5160c914j14076n8648f531D6503O3063f2524
10247c5011j16238C4892a37217n2533A9050b62731J02660c9356C83969E6241K05830
10236B62071C1634K4079J09407m8895l3390J01251a93791D1766d4000k24385C19201
10224A89233r4065o587a48919C2545c64496a14645O895A75831N1928a20329B05161
10212A87301c02172A14691a56720B57402J8490h207A53698a14993q548b880j28527
10201a31407A04909c37877D13277a17432C09028p9686h8949j64329J15086N3031
10191h5161G6907d7355k6752k75755B14486c46571d1954I160c705A20073a64185
10179C38d4719j95330i9433A73334D318b48067c220j71988r4536e0434j53191
$$ plain form
10259 -157011 -103497 113093 35251 -45160 -3914 -117990 -176638 -6531 46503 109566 -62524
10247 -35011 -151249 34892 -137217 -189750 19050 -262731 -160071 -39356 383969 56241 262071
10236 262071 31634 55713 165120 116225 82835 184086 -193791 41766 -44000 -268385 319201
10224 189233 95168 88581 -148919 32545 -364496 -114645 -107750 175831 227759 -120329 205161
10212 187301 -302172 114691 -156720 257402 275892 -8207 153698 -114993 -123541 -2880 -131407
10201 -131407 104909 -337877 413277 -117432 309028 229342 -88949 -253278 -138192 -85161
10191 -85161 76907 -47355 -74107 -349862 214486 -346571 -41954 9160 -3705 120073 -164185
10179 338 -44719 -240049 -99433 173334 4318 -248067 -3220 -175208 -269744 -50434 -203625
10168b03625A67546b58507R3498k03091J33067B5775a01632j01851M3387O3268
10158i6828l16935f0281k02183A9441a66592j8757J7665e446E6559b64073i9552
10146B62487a34762K3641l0054A47128h2886l48788i1970C1234c36997a43398
10135C75297r2613b24536p2269B63048b98778j29755a0862j38681r1277j35679
10125c76499E5145J7006d57865a80460d0j12938D83047B30568o3643C4725J00609
10114A35334j1238a78270I0993h847E5458a31720B02902c3643A64294a38529l4144
10103a72673j34684P4838d0833A3315O0717c8989j21931k14130c2559B2669b02024
10091a30528f2840C3153c32464A42392b156l7563j08177a0562A57745c660j20329
$$ plain form
10168 -203625 167546 -258507 -165009 -368100 -235033 25775 -101632 -203483 -160096 -96828
10158 -96828 -413763 -60281 -262464 19441 -166592 -185349 -167684 -5446 56559 -264073 -99552
10146 262487 -134762 -111121 -141175 147128 -82886 -431674 -91970 31234 -336997 -143398
10135 375297 282684 -224536 -296805 263048 -298778 -428533 -10862 -149543 -240820 -376499
10125 -376499 55145 72151 -457865 -180460 -40 -112978 483047 230568 166925 34725 135334
10114 135334 124096 -178270 90993 -8847 55458 -131720 202902 -33643 164294 -138529 -172673
10103 -172673 -307357 -232519 -40833 13315 74032 -38989 -160920 -375050 -32559 22669 -202024
10091 -130528 -62840 33153 -332464 142392 -2156 -39719 -147896 -10562 157745 -3660 -123989
10080a23989A07144b25434A62352a05835a3689j52174B58712C4595Q1638J38452
10070B54685B7484g9943A148b31225B29006b37946d9325D5351a98708E7482a63281
10058c18066J30208h7938A8390K11623J460R5392I2410A3548c3150A89696K5805
10047B15501c8247B11269f9225J2757C28215e2132j66053i9401j63950j6552P8635
10036b01268Q635I2293a2024o1926A81923d7407b494j51216I6813c09681J30917
10025a78764j03774a21474j76095A52547G88a67020p6364g1849I2724d16817A5640
10013h1379j13090R1436m45629b107k05093A67070h1169j2030j1370b4155j53832
10002a77987B95335d8265k34301a0201l71686J64286N2007c3666a1490l79104
$$ plain form
10080 -123989 107144 -225434 162352 -105835 -13689 -165863 258712 34595 116233 254685
10070 254685 27484 -79943 1148 -231225 229006 -237946 -49325 45351 -198708 57482 -163281
10058 -318066 -187858 -87938 18390 230013 231473 326865 92410 13548 -33150 189696 215501
10047 215501 -38247 211269 -69225 -56468 328215 -52132 -218185 -99401 -263351 -279903 -201268
10036 -201268 -192633 92293 -12024 -73950 181923 -47407 -2494 -153710 96813 -309681 -178764
10025 -178764 -282538 -121474 -297569 152547 788 -167020 -243384 -71849 92724 -416817 15640
10013 -81379 -194469 -103033 -548662 -2107 -207200 167070 -81169 -93199 -104569 -24155 -177987
10002 -177987 295335 -48265 -282566 -10201 -381887 -217601 -165594 -33666 -11490 -390594
9992c90594J68890A572d8454K3659F0267i8369A07826c6281a0294A64389J14627
9981B79016d7455E7305a39651l7488J6874f9817B76355b72841B4355a45781d767
9969C0965e2794A547K46304D4753P1401b70186a4123B86731A33529C237b52902
9957b87058a15821B56223a27708K210l0057k6399A42404D5488b424j68954I1045
9945B29803b92782N1955j17215P5594Q8358d8178j48836b8410B49685b98660a31523
9933H5399e0314G5313b41284D1779c96785f6898K4540j8357l09121a35697m29775
9922e65472H9002J68105D9553L0712b70601A03780h3804j18022l63440a69324
9911e3691k82410B8468b39700q0918D1258K6555A9287o839N1390f3282G2953K938
$$ plain form
9992 -390594 -221704 1572 -48454 -24795 60267 -98369 107826 -36281 -10294 164389 279016
9981 279016 -47455 57305 -139651 -177139 -160265 -69817 276355 -272841 24355 -145781 -4767
9969 30965 -52794 1547 247851 44753 116154 -270186 -14123 286731 133529 3237 -252902
9957 -287058 -115821 256223 -127708 -125498 -155555 -181954 142404 45488 -2424 -171378 91045
9945 229803 -292782 -240827 -358042 -282448 -194090 -48178 -197014 -28410 249685 -298660 -131523
9933 85399 -50314 75313 -241284 41779 -396785 -66898 -42358 -60715 -369836 -135697 -565472
9922 -565472 89002 257107 49553 80265 -270601 103780 -83804 -201826 -565266 -169324
9911 -53691 -336101 28468 -239700 -320618 41258 67813 19287 12448 63838 -63282 72953 75891
9899G5891b04486K9834a6065G9843C453e3730k14758J30428M7453j25274j1277
9888b27158O2861M2908j08732F9486a86702f633o2433l84033F6642a17708j73842
9877b91550a16354J1888p7222k12376a21660A7597a24588c4246G8369b51031D51216
9865d9024j69582D14077H6636L8492b40833J04818A94223L1888E3974b34221D0847
9853a70446D5889b66171M0939g3975l3322e3053K2503F6178a57126c2810j30003
9842a62813l21944A41305c1708B7895a32297O0202j18989A863b91708C0310a36985
9830i0595n3797g1j48788A41094a22020B49308j23682b39925A44477a1539j09513
9819a21052A24301E1868N2939a11171D3091b32574m5614A46649b32222C3794a9838
$$ plain form
9899 75891 -204486 -174652 -16065 79843 3453 -53730 -268488 -138060 -90607 -215881 -227158
9888 -227158 -164297 -121389 -230121 69486 -186702 -6633 -69066 -453099 66642 -117708 -291550
9877 -291550 -116354 -104466 -181688 -394064 -121660 17597 -124588 -34246 78369 -251031 451216
9865 -49024 -218606 414077 86636 125128 -240833 -136015 194223 226111 53974 -234221 40847
9853 -170446 45889 -266171 -225232 -73975 -107297 -53053 -30550 66178 -157126 -32810 -162813
9842 -162813 -484757 141305 -31708 27895 -132297 -72095 -191084 1863 -291708 30310 -136985
9830 -90595 -144392 -71 -148859 141094 -122020 249308 125626 -239925 144477 -11539 -121052
9819 -121052 124301 51868 104807 -111171 43091 -232574 -278188 146649 -232222 33794 -19838
9807G360c09270B2261J00556R42K5659f6451E4860Q21J02343f098o9081A04460
9794A24379I721a32633n6274A13664h2663k36811B9612K00135e971F8984P9733
9783A48717A9150a36657r2241l23557a04033k7424A23310m82f6956A48878p236
9772A41642J25475q2725d95983b4237m4348K4027A61898e3173j49869B14975m5043
9761A69932o4949a05039j02081B21151B8391b14623F3126a51340G6222b64699
9750a74095c0810R208k73574g4004K845A2042c74061O0274n1739i6902m3233b8712
9737G3135a1339k50085J25807F8458A1247a71679k3514n8786J23414B82361c0442
9725a57004j21290g9493k0787J0067k14912a22375D7236e8326J1797j04466n1129
$$ plain form
9807 7360 -309270 22261 122817 123759 149418 -66451 54860 55681 158024 -6098 -75179 104460
9794 124379 9721 -132633 -188907 113664 -82663 -319474 29612 229747 -5971 68984 148717
9783 148717 19150 -136657 -228898 -552455 -104033 -131457 123310 122828 -66956 148878 141642
9772 141642 267117 184392 -495983 -24237 -68585 -44558 161898 -53173 -203042 214975 169932
9761 169932 104983 -105039 -207120 221151 28391 -214623 63126 -151340 76222 -264699
9750 -174095 -30810 -21602 -295176 -74004 -71159 12042 -374061 -313787 -365526 -96902 -140135 -28712
9737 73135 -11339 -261424 -135617 68458 11247 -171679 -195193 -253979 -130565 282361 -30442
9725 -157004 -278294 -79493 -100280 -90213 -305125 -122375 47236 -58326 -46529 -150995 -202124
9714b02124h4095r4944h1565B17614a05218C01484e8643A89201f2513j27449i0300
9702C05994I8377b46167J07827O7517k36882i0293A0913O269a01281k09449a26605
9690b55998g4876k52205b1513j10942B23925a32085n7491A89733E2244c12221
9679B10348K5072G7941a21329j05552B38515a0306F9022A5130L0147Q5327b81998
9667b68851a6196o9694m7875I0509b70969J29002m6475o5869k954a20092d2644
9655A52607h4442L2860r983m17875i4675d1307A55717D1584D591J25936i8730
9643A07563A5674b6329j018B19687p4697a12830k11717a47881B0377a14955j05836
9632b20791J00344j81388B35391b93240B66429j28858b6708A53398J7736l8906
$$ plain form
9714 -202124 -84095 -179039 -81565 217614 -105218 301484 -58643 189201 -62513 -189962 -90300
9702 305994 98377 -246167 -138340 -70823 -307705 -90293 10913 17182 -101281 -310730 -126605
9690 -255998 -74876 -327081 -21513 -132455 223925 -132085 -189576 189733 52244 -312221
9679 210348 235420 77941 -121329 -226881 238515 -10306 69022 15130 45277 130604 -281998
9667 -268851 -16196 -85890 -133765 90509 -270969 -141967 -188442 -254311 -257265 -120092 -42644
9655 152607 -84442 -51582 -61565 -479440 -94675 -41307 155717 41584 4591 130527 -98730
9643 107563 15674 -26329 -27347 219687 144990 -112830 -324547 -147881 20377 -114955 -220791
9632 -220791 -120447 -301835 235391 -293240 266429 137571 -26708 153398 171134 132228
9622A32228a72932k53140B39993b26824f3854k01205k37178A22809i8717a7964
9611A03602m4196k1032J52837a41815A52075a7886j29817L3861B88876C9730l141
9600C6589M9534q821a83427Q7512b7869m5094g01A10780j1001a45565B18014a29535
9587b51497c0765A37415o7005a71875A06495f7114q7787M1196k2090q7971O2517
9576a61249A33584a06032b5679j24707K2384C01807b16073A5828c20755a31123
9565I9524a88377B9122c43473J21681N6508A68847g4505j84051e6471A04509b15004
9553a10416J563A06662b66548A89057q9968c53764e2667A33067b01635j6999H0774
9541H6205d58408J57616C75160c5474A16380M0691E0542K6971B1383a19656A72721
$$ plain form
9622 132228 -172932 -426072 239993 -226824 -63854 -265059 -502237 122809 -98717 -17964
9611 103602 59406 38374 191211 -141815 152075 -17886 -147703 -113842 288876 39730 36589
9600 36589 86123 77302 -183427 -95915 -27869 -72963 -701 110780 99779 -145565 218014 -129535
9587 -251497 -30765 137415 70410 -171875 106495 -67114 -154901 -113705 -135795 -223766 -161249
9576 -161249 133584 -106032 -25679 -150386 -128002 301807 -216073 15828 -320755 -131123
9565 99524 -188377 29122 -343473 -221792 -165284 168847 -74505 -258556 -56471 104509 -215004
9553 -110416 -108853 106662 -266548 189057 99089 -353764 -52667 133067 -201635 -218634 80774
9541 86205 -458408 -300792 375160 -35474 116380 157071 50542 77513 21383 -119656 172721
9529c8398j81954R4736j87860b0063H0724a80746j20664F2556e95656a17960E5505
9517B37363b93699c8934A75169a36870C13767e3574C22607j55767c7503k0272
9507e7775B9N3869A2337e9374B10972h3649j24670a3037j24332J2280A24126b96730
9494b18628h4030j36938a3951D34249h1085m4488p5139d108j78030B80483d22966
9482A7180J3439a45278b6049B9474b096l0097A23020b17142A15858J10095b24432
9470a85820G2922c87789A33823c4847C623f6468h286m39349A12762b53868B5340
9458A41634n5684k7997a73653B0589a74153j33794J30587k04565A02946b25897
9447B9035c31376B12885G5966a47581B80503j30896K4719N1656a08126B4058d946
$$ plain form
9529 -38398 -220352 -125616 -313476 -20063 80724 -180746 -301410 62556 -595656 -117960 55505
9517 237363 -293699 -38934 175169 -136870 313767 -53574 322607 166840 -37503 -57775
9507 -57775 29 53898 12337 -59374 210972 -83649 -208319 -13037 -137369 -125089 124126 -296730
9494 -218628 -84030 -220968 -13951 434249 -81085 -125573 -200712 -4108 -182138 280483 -422966
9482 17180 30619 -145278 -26049 29474 -2096 -32193 123020 -217142 115858 225953 -224432
9470 -185820 72922 -387789 133823 -34847 3623 -66468 -8286 -447635 112762 -253868 25340
9458 141634 85950 57953 -173653 20589 -174153 -307947 -177360 -381925 102946 -225897
9447 29035 -331376 212885 75966 -147581 280503 149607 174326 225982 -108126 24058 -4946
9435b75745a14667A69050j9927E7363h0008j66431A28369J435N0377H5880b46077
9423b33855K1012Q5978j70201M4247k99962a47538l7987p7167g223A05885a75480
9411a19370l12479a50250A48032a23380n9842f4057j24067A7652N1301b96296
9400b45746l7797a3733n7103j46578M7701A37419J16296B3477J5339R4487a14739
9388A4705b01152D9224g5254E8039A1471J88734a44036b7927F5066b9110i722
9376d9846d538j15862C92120b12774E8835j8610c17519k2044B0984R5629a03832
9364a3015p3257q2037l3336A82506b29658n1148J18728j28171p6571H0729f1668
9352A18470a53516P5913F8828b31340B11924b2202k38703P8956p0375n6378K7085
$$ plain form
9435 -275745 -114667 169050 149123 57363 -80008 -246439 128369 129804 180181 85880 -246077
9423 -233855 -212843 -126865 -297066 -252819 -552781 -147538 -185525 -262692 -7223 105885 -175480
9411 -119370 -431849 -150250 148032 -123380 -183222 -64057 -188124 17652 68953 -296296
9400 -245746 -283543 -13733 -70836 -217414 -169713 137419 253715 23477 38816 133303 -114739
9388 14705 -201152 49224 -75254 58039 11471 200205 -144036 -27927 65066 -29110 -9722
9376 -49846 -4538 -120400 392120 -212774 58835 40225 -317519 -339563 20984 116613 -103832
9364 -13015 -86272 -168309 -201645 182506 -229658 -280806 -162078 -290249 -366820 80729 -61668
9352 118470 -153516 -77603 68828 -231340 211924 -22202 -260905 -181949 -252324 -308702 -281617
9341b81617b509C52137B9473a56169F9690Q5350j868c847j08850A15732i7891
9329f1521A6166K02793h8342j47629P50A71498b78912O5494i8013B02620g8985
9317b41067f0355j81549D9650b01998j11280a54875P6321B08791i2446j35535
9307b27981I640K09968b46347g8888A8406d25001a31778j6032f6720j78317a19575
9295e3169n6358h161k69496B82018c31699R0204i4275D5624K88436m5944a37838
9283E4953g3529j1568B48415j21624d633F7623m04k195b74253O1948Q9797J8157
9271a04351d360o417l48393a35767B25944f0494m8258j15500B376c03933D6880
9259B51027D9590d93167C1647f1197p1662a9517n1200k92891e6370j849m2386
$$ plain form
9341 -281617 -2509 352137 29473 -156169 69690 155040 153172 -3847 -112697 115732 -97891
9329 -61521 16166 218959 -88342 -235971 -235221 171498 -278912 -213418 -98013 202620 -78985
9317 -241067 -60355 -241904 49650 -201998 -313278 -154875 -78554 208791 -92446 -227981
9307 -227981 9640 219608 -246347 -78888 18406 -425001 -131778 -147810 -66720 -245037 -119575
9295 -53169 -109527 -8161 -277657 282018 -331699 -241495 -94275 45624 334060 288116 -137838
9283 54953 -73529 -85097 248415 126791 -4633 67623 67219 65024 -274253 -212305 -122508 -104351
9271 -104351 -4360 -10777 -359170 -135767 225944 -60494 -108752 -224252 2376 -303933 46880
9259 251027 49590 -493167 31647 -61197 -132859 -19517 -70717 -363608 -56370 -58219 -100605
9248a00605N401k51849A50947A084b17453k25651J3041K05429f1120q1222e5415
9236A41557K16213I7444h7762k5961L8541F1704a61152C6720j5027a99935B64521
9224B76153g4087D55825b3817c042A41362D0542K4623a60693j37677r3741B9831
9212a64552B59004a56521O3217j77565a07763G6574f7692m9316A3544J93539G056
9200b45350C0416O2399C6975a89739j19461N9494O5816l8800j39676G4150P8781
9189A52931O604i3794l7233n4920M3052j53190A84997o1858E3073b38127E8779
9177D2726O67K00301G0466a22505j76262H1335a50201e2211l2015m04162b40567
9165a00721p963k43513b161A31942b47870e1708k5442b7475a0800j23069k293
$$ plain form
9248 -100605 -95204 -347053 150947 1084 -217453 -443104 -430063 -224634 -61120 -142342 -55415
9236 141557 357770 97444 -87762 -113723 -75182 61704 -161152 36720 21693 -199935 264521
9224 276153 -74087 455825 -23817 -3042 141362 40542 65165 -160693 -298370 -392111 29831
9212 -164552 259004 -156521 -93304 -270869 -107763 76574 -67692 -117008 13544 207083 7056
9200 -245350 30416 92815 36975 -189739 -309200 -249706 -183890 -222690 -362366 74150 152931
9189 152931 159535 -93794 -131027 -185947 -142895 -296085 184997 123139 53073 -238127 58779
9177 42726 43393 243694 70466 -122505 -298767 81335 -150201 -52211 -84226 -488388 -240567
9165 -100721 -108684 -352197 -2161 131942 -247870 -51708 -77150 -27475 -10800 -133869 -136162
9154a36162A93120L9804e9723F0859h9B0092h5132j14357g4694n8369k16764A99215
9141A5536J36162k3277c24715D82f5688j7195K9167P167A76144c25210c8679A13402
9128a88693a0944k0597B18657a30757B78211r0109C2888N3844C6308L520r735
9117C0093f3923j61224f3566j04896G0820K05364b62752H0638k7137J02186p436
9106A48251J88728c17952l1290i6467A0717d0189j5765F6518b30877J00578f478
9094a51224j44726d5967m1298L8215l242a8647A1294a39464k5456m3186j00573
9083c08679A2801d3648l4184A65522D1512g0321l88703K00897k2652a392p2940
9072g4332A06778f1108j34311A00153A4791J26212a63127l5683b2055G7321a40091
$$ plain form
9154 -136162 193120 232924 -59723 60859 -89 20092 -85132 -199489 -74694 -133063 -349827 199215
9141 15536 151698 128421 -324715 482 -65688 -82883 -53716 -46549 176144 -325210 -38679 113402
9128 -188693 -10944 -31541 218657 -130757 278211 188102 32888 86732 36308 39828 30093
9117 30093 -63923 -225147 -63566 -168462 70820 276184 -262752 80638 53501 155687 148251
9106 148251 336979 -317952 -349242 -96467 10717 -40189 -55954 66518 -230877 -130299 -6478
9094 -151224 -295950 -45967 -87265 -49050 -52292 -18647 11294 -139464 -164920 -208106 -308679
9083 -308679 12801 -43648 -77832 165522 41512 -70321 -459024 -258127 -280779 -1392 -74332
9072 -74332 106778 -61108 -195419 100153 14791 141003 -163127 -198810 -22055 77321 -140091
9060b81636Q2621k30644A09501f8373q9858j54707a32787l9279L757I1814l189
9049H8625a52742e5368G6182K18266B7625M942f0943q703k24409g0572E449P7663
9037H3112i9360m4707J9095d7744D3962b55034j34338C2441f8108B06249q8979
9026A17270b45148F3154B3094b52686B4538b5270A14185a71089e1611A27746J027
9015A28773a61425k00485B62482J2328a83265B22901G0191R9579b48110j3073
9005b61183E1592M1868a71563j0360B436a86848L3352B8356K03046b27974h7183
8993b4097j7103F8629a55617g7772j07521l2018J2035k0445A789J79845f8154
8981A04298N377J4275A3744J90019b83507h6199r7845c9169A09522c90351a27536
$$ plain form
9060 -281636 -199015 -429659 109501 -68373 -158231 -312938 -132787 -172066 -168309 91814 88625
9049 88625 -152742 -55368 76182 294448 27625 32567 -60943 -69646 -294055 -70572 5449 83112
9037 83112 -99360 -144067 -124972 -47744 43962 -255034 -389372 32441 -68108 206249 117270
9026 117270 -245148 63154 23094 -252686 24538 -25270 114185 -171089 -51611 127746 128773
9015 128773 -161425 -361910 262482 274810 -183265 222901 70191 169770 -248110 -261183
9005 -261183 51592 93460 -171563 -181923 2436 -186848 -153496 28356 231402 -227974 -87183
8993 -24097 -41200 68629 -155617 -77772 -185293 -217311 -205276 -225721 1789 181634 -68154
8981 104298 109675 123950 13744 203763 -283507 -86199 -184044 -39169 109522 -390351 -127536
8969a30702K9830k33831a57808j25058B08614a95727m26698h9388b0509k6347
8959d6856j94359F7307c49853a3342m3226j64797r7586M3872g9235j00473c319
8947e4543k04417A45019c28865j11210G8580J00692a7020G3343b72064A10322
8936d5791D3691R6781b85626q5800B07623f3304k5296G8491a92346b9533A70767
8924i8612C03296i6246c0743B79845j37553b9082j8786C81074b2081B56164O6509
8913C22673A13549L19777j12956n6741I8243L15440Q12331L71956J442179L016122
8903F056271J932835C322127A529290l84396E04883R8938L8362a1977A77708J14986
8893B92694P7117H8110A9986g5446H6687g330n8052j05521M7004a8117q6126d9900
$$ plain form
8969 -130702 -100872 -334703 -157808 -282866 208614 -195727 -622425 -89388 -20509 -46856
8959 -46856 -241215 67307 -349853 -13342 -56568 -221365 -318951 -275079 -79235 -179708 -3319
8947 -54543 -258960 145019 -328865 -440075 78580 179272 -17020 73343 -272064 110322
8936 -45791 43691 140472 -285626 -371426 207623 -63304 -88600 78491 -192346 -29533 170767
8924 -98612 303296 -96246 -30743 279845 142292 -29082 -47868 381074 -22081 256164 322673
8913 322673 113549 433326 320370 263629 98243 413683 1226014 1597970 3040149 6056271
8903 6056271 7989106 3322127 1529290 1144894 504883 603821 642183 -11977 177708 292694
8893 292694 369811 88110 19986 -75446 86687 -7330 -65382 -170903 -123899 -18117 -104243 -49900
8880b16666A04757o940e9213A19423a59412G5845J798K53442b73928e2719A58863
8868A94562a86066l3454A65634f0260k4852J8192B0796b226j90027J2200D87496
8856a5429j92679A067b31501j81271b7781j24713A63217d59307J44805J44764
8846a69738g2591L0810D3185j6743c36004A71397a93125P5339j37121C5960f7919
$$ plain form
8880 -216666 104757 97817 -59213 119423 -159412 75845 77643 331085 -273928 -52719 158863
8868 194562 -186066 -219520 165634 -60260 -85112 -66920 20796 -2226 -192253 -180053 487496
8856 -15429 -208108 1067 -231501 -412772 -27781 -152494 163217 -459307 -314502 -169738
8846 -169738 -72591 -41781 43185 26442 -336004 171397 -193125 -117786 -254907 35960 -67919
$$ [...]
##END NTUPLES=NMR SPECTRUM
##END=
