
##TITLE=AC1152_Cauca-timbio_5874778_GOnV9PsAyT
##JCAMPDX= 6.0         $$ Bruker NMR JCAMP-DX V2.0
##DATA TYPE= NMR SPECTRUM
##DATA CLASS= NTUPLES
##ORIGIN= BRUKER
##OWNER= Administrator
$$ 1.72 TOPSPIN		Version 2.1
$$ 2012-03-31 18:52:04.781 -0500  Administrator@TOPSPIN
$$ Compression mode = diff/dup
##.OBSERVE FREQUENCY= 400.13188235
##.OBSERVE NUCLEUS= ^1H
##.ACQUISITION MODE= SIMULTANEOUS (DQD)
##.ACQUISITION SCHEME= undefined
##.AVERAGES= 8
##.DIGITISER RES= 22
##SPECTROMETER/DATA SYSTEM= spect
##.PULSE SEQUENCE= zg30
##.SOLVENT NAME= COFFEE_meoh
##.SHIFT REFERENCE= INTERNAL, COFFEE_meoh, 1, 14.98061
##AUDIT TRAIL= $$ (NUMBER, WHEN, WHO, WHERE, PROCESS, VERSION, WHAT)
$$ ##TITLE= Audit trail, TOPSPIN		Version 2.1
$$ ##JCAMPDX= 5.01
$$ ##ORIGIN= Bruker BioSpin GmbH
$$ ##OWNER= Administrator
$$ $$ C:\Bruker\TOPSPIN/data/COFFEE/nmr/AC1152_Cauca-timbio_5874778_GOnV9PsAyT/10/pdata/1/auditp.txt
$$ ##AUDIT TRAIL=  $$ (NUMBER, WHEN, WHO, WHERE, PROCESS, VERSION, WHAT)
(   1,<2012-03-31 18:51:56.437 -0500>,<Administrator>,<TOPSPIN>,<go>,<TOPSPIN 2.1>,
      <created by zg
	started at 2012-03-31 18:50:49.453 -0500,
	POWCHK enabled, PULCHK disabled,
       configuration hash MD5:
       1A 1E CE 29 27 FD 77 03 67 4E F0 E3 C4 B2 CB 90
       data hash MD5: 64K
       41 E3 A9 C1 DD A3 98 75 2D FB 5F C1 59 D3 88 FE>)
(   2,<2012-03-31 18:51:59.250 -0500>,<Administrator>,<TOPSPIN>,<proc1d>,<TOPSPIN 2.1>,
      <Start of raw data processing
       efp LB = 0 FT_mod = 6 PKNL = 1 PHC0 = 0 PHC1 = 0 SI = 32K 
       data hash MD5: 32K
       BD CE 16 EF 76 BD 4E A9 63 A0 9E C2 94 42 08 74>)
(   3,<2012-03-31 18:51:59.718 -0500>,<Administrator>,<TOPSPIN>,<proc1d>,<TOPSPIN 2.1>,
      <pk PHC0 = 217.8094 PHC1 = 0 
       data hash MD5: 32K
       50 F4 D8 29 FB B9 3C 0C BD 0E D0 B6 30 CE 4C 04>)
(   4,<2012-03-31 18:51:59.859 -0500>,<Administrator>,<TOPSPIN>,<proc1d>,<TOPSPIN 2.1>,
      <abs ABSG = 1 
       data hash MD5: 32K
       0E 69 7F D3 44 6D E6 8B BF C4 06 DF A2 AE 9F 3B>)
(   5,<2012-03-31 18:51:59.890 -0500>,<Administrator>,<TOPSPIN>,<proc1d>,<TOPSPIN 2.1>,
      <abs ABSG = 2 
       data hash MD5: 32K
       FA F9 6F 4B F0 4D F0 85 72 4D 18 9A 23 C9 05 4E>)
(   6,<2012-03-31 18:51:59.937 -0500>,<Administrator>,<TOPSPIN>,<proc1d>,<TOPSPIN 2.1>,
      <abs ABSG = 3 
       data hash MD5: 32K
       CB 0C A2 C6 26 24 49 1D 6C 36 88 F8 6A F0 61 A6>)
(   7,<2012-03-31 18:51:59.968 -0500>,<Administrator>,<TOPSPIN>,<proc1d>,<TOPSPIN 2.1>,
      <abs ABSG = 4 
       data hash MD5: 32K
       67 7D 18 57 C9 FB 04 FD 21 34 9E 5A E5 1D F2 76>)
(   8,<2012-03-31 18:52:00.000 -0500>,<Administrator>,<TOPSPIN>,<proc1d>,<TOPSPIN 2.1>,
      <abs ABSG = 5 
       data hash MD5: 32K
       92 23 80 2D DA AD 40 41 15 06 A0 72 80 36 A1 38>)
$$ ##END=
$$ 
$$ $$ hash MD5
$$ $$ 88 61 6B 92 4F 87 63 47 9C 8B B6 5C 8F 1C 14 AB
##$RELAX= 
##$RELAX= 
##$RELAX= 
##$RELAX= 
##$RELAX= 
##$RELAX= 
##$RELAX= 
$$ Bruker specific parameters
$$ --------------------------
$$ [...]
150 150 150 150 150 150 150 150
##$TP07= 0
##$TPNAME0= <>
##$TPNAME1= <>
##$TPNAME2= <>
##$TPNAME3= <>
##$TPNAME4= <>
##$TPNAME5= <>
##$TPNAME6= <>
##$TPNAME7= <>
##$TPOAL= (0..7)
0.5 0.5 0.5 0.5 0.5 0.5 0.5 0.5
##$TPOFFS= (0..7)
0 0 0 0 0 0 0 0
##$TUNHIN= 0
##$TUNHOUT= 0
##$TUNXOUT= 0
##$USERA1= <user>
##$USERA2= <user>
##$USERA3= <user>
##$USERA4= <user>
##$USERA5= <user>
##$V9= 5
##$VALIST= <valist>
##$VCLIST= <CCCCCCCCCCCCCCC>
##$VD= 0
##$VDLIST= <DDDDDDDDDDDDDDD>
##$VPLIST= <PPPPPPPPPPPPPPP>
##$VTLIST= <TTTTTTTTTTTTTTT>
##$WBST= 2048
##$WBSW= 25
##$XGAIN= (0..3)
0 0 0 0
##$XL= 0
##$YL= 0
##$YMAX_a= 533431
##$YMIN_a= -630703
##$ZGOPTNS= <>
##$ZL1= 120
##$ZL2= 120
##$ZL3= 120
##$ZL4= 120
##$ABSF1= 14.98061
##$ABSF2= -5.57192
##$ABSG= 5
##$ABSL= 3
##$ALPHA= 0
##$AQORDER= 0
##$ASSFAC= 0
##$ASSFACI= 0
##$ASSFACX= 0
##$ASSWID= 0
##$AUNMP= <proc_prof1d_extract_pilot.lims>
##$AXLEFT= 0
##$AXNAME= <>
##$AXNUC= <1H>
##$AXRIGHT= 0
##$AXTYPE= 0
##$AXUNIT= <>
##$AZFE= 0.1
##$AZFW= 0.1
##$BCFW= 0
##$BC_mod= 0
##$BYTORDP= 0
##$COROFFS= 0
##$CY= 15
##$DATMOD= 1
##$DC= 0
##$DFILT= <>
##$DTYPP= 0
##$F1P= 0
##$F2P= 0
##$FCOR= 0.5
##$FTSIZE= 32768
##$FT_mod= 6
##$GAMMA= 0
##$GB= 0
##$INTBC= 1
##$INTSCL= 1
##$ISEN= 128
##$LB= 0
##$LEV0= 0
##$LPBIN= 0
##$MAXI= 10000
##$MC2= 0
##$MEAN= 0
##$ME_mod= 0
##$MI= 0
##$NCOEF= 0
##$NC_proc= -8
##$NLEV= 6
##$NOISF1= 0
##$NOISF2= 0
##$NSP= 0
##$NTH_PI= 0
##$NZP= 0
##$OFFSET= 14.98061
##$PC= 1
##$PHC0= 217.8094
##$PHC1= 0
##$PH_mod= 1
##$PKNL= yes
##$PPARMOD= 0
##$PPDIAG= 0
##$PPIPTYP= 0
##$PPMPNUM= 2147483647
##$PPRESOL= 1
##$PSCAL= 4
##$PSIGN= 0
##$PYNMP= <proc.py>
##$REVERSE= no
##$SF= 400.13
##$SI= 32768
##$SIGF1= 0
##$SIGF2= 0
##$SINO= 400
##$SIOLD= 32768
##$SPECTYP= <>
##$SREGLST= <1H.CDCl3>
##$SSB= 0
##$STSI= 32768
##$STSR= 0
##$SW_p= 8223.68421052632
##$SYMM= 0
##$S_DEV= 0
##$TDeff= 65536
##$TDoff= 0
##$TI= <>
##$TILT= no
##$TM1= 0
##$TM2= 0
##$TOPLEV= 0
##$USERP1= <user>
##$USERP2= <user>
##$USERP3= <user>
##$USERP4= <user>
##$USERP5= <user>
##$WDW= 1
##$XDIM= 32768
##$YMAX_p= 478671169
##$YMIN_p= -713975
##$CURPLOT= <Network HP LaserJet P1505>
##$CURPRIN= <$Network HP LaserJet P1505>
##$DFORMAT= <normdp>
##$LAYOUT= <+/1D_H.xwp>
##$LFORMAT= <normlp>
##$PFORMAT= <normpl>
##$SURQMSG= 1
$$ End of Bruker specific parameters
$$ ---------------------------------
##NTUPLES= NMR SPECTRUM
##VAR_NAME=  FREQUENCY,     SPECTRUM/REAL,   SPECTRUM/IMAG
##SYMBOL=    X,             R,               I
##VAR_TYPE=  INDEPENDENT,   DEPENDENT,       DEPENDENT
##VAR_FORM=  AFFN,          ASDF,            ASDF
##VAR_DIM=   32768,         32768,           32768
##UNITS=     HZ,            ARBITRARY UNITS, ARBITRARY UNITS
##FACTOR=    0.250966925370066, 1,           1
##FIRST=     8223.43324360095, -226353,      132860
##LAST=      0,             111119,          -127744
##MIN=       0,             -713975,         0
##MAX=       8223.43324360095, 478671169,    0
$$ Real data points
##PAGE= N=1
##DATA TABLE= (X++(R..R)), XYDATA
$$ [...]
23747 38435 -61839 240766 -270043 -157035 167262 -92684 172742 -135015 7598 266615
23737 266615 -48648 -24587 -3971 -133755 -51276 58596 -80911 -438856 -99695 -76753 360124
23725 114386 -226412 42266 -60911 76951 -285360 -146576 -92481 46988 66583 -82355 -251969
23714 -251969 -45493 156054 204965 -228091 -180739 -184471 61078 -218585 477608 20442 278060
23703 278060 -112735 -284657 166142 -61379 -122918 -172491 -16380 -87739 216193 -180469
23692 -208642 11116 104553 162246 87306 48154 -223312 -310302 -183046 -204008 -160420 9653
23680 26864 -356016 -110018 45593 -132614 68088 -200695 -96059 197134 84934 -105285
23669 -121026 -92551 139239 -125871 146218 39524 -59621 208716 273676 -47852 196302
23658 -113394 96400 -320123 12261 -378520 93573 -137513 -269666 159793 -137980 116233
23647 144712 76493 -880 -15236 116762 -163488 64586 -81139 240571 76967 7872 3684 -87413
23634 -458530 211753 -25300 106486 46404 -230703 -173738 -303313 219833 25633 23790 -222964
23622 146127 196704 -84559 -39547 -150869 -150406 -142322 220552 162530 170746 -113345 360314
23610 -38197 -29872 -271441 97987 -55466 67815 43247 -163339 57890 37724 168594 -101647
23598 88129 -58230 20101 132183 -14572 150698 198279 159005 -144617 254697 -20271 -128205
23587 -128205 -112015 352061 398232 -52762 143564 402031 235676 110167 218952 361638
23577 361638 203308 306038 -5094 111471 203976 313472 129185 205118 -14635 190150
23566 -82503 -254139 16766 -240709 4996 210756 236021 -36108 -78637 -265331 232690 -376423
23554 -56345 -135656 -247543 -110393 7653 -273345 -67082 -64341 88839 26594 -407115 43348
23542 -22508 -71649 210074 -220897 -145753 -19967 -94451 -134718 108318 235325 -140912 38309
23530 73977 199741 154587 31813 -131433 -180126 -88935 -219184 -104953 -119167 29501 -170048
23518 202016 -154911 -235982 -148674 197228 415980 246742 -150549 -32710 -91810 200135
23507 -3920 -55485 -268599 -131915 -406748 -319962 142434 3564 122162 863 114001 -102617
23495 -232129 -25347 -77929 105008 476453 -82155 107414 188023 -48895 -150840 -243998 -34689
23483 -56669 -50267 291064 -527664 -155575 -329051 -213326 -201089 222563 -3344 54905 -98350
23471 -209809 19219 189817 -156690 -209827 -331410 339046 183251 -333126 95980 -209930
23460 50297 -12547 -111143 -74452 79206 109415 -17290 -228795 -99786 150367 -77153 -90949
23449 -90949 63769 -338995 -189177 65488 -46516 262736 -146473 266938 -76109 -296000
23439 -296000 -93199 116900 280427 -146540 21867 -47275 -319081 185674 -199557 273709
23428 -77180 -164752 -13256 238624 282903 -85134 -64381 135690 192234 185253 115876 237783
23417 237783 -94119 93222 -104788 -308579 179980 106229 -220023 -211060 -199843 -162199 247641
23405 240711 -41680 -235930 -255509 40083 217204 81846 60533 -87693 46978 117572 75660
23394 75660 -250282 -94250 -22357 116779 67105 128724 18025 -194022 -67388 -89117 -147330
23383 -147330 -5048 52116 136906 -90819 111473 71860 -216713 48408 2759 -155906 44530
23371 -27567 -10987 3291 -250434 -124183 -95320 8672 156252 -123944 116533 -135046 -227018
23360 -227018 -243036 225947 -92368 -305015 168975 29955 371912 -22707 4166 -121216 97815
23348 -248071 -168891 -79578 124915 -96024 -108041 82869 335429 -10365 239451 -34057 -80522
23337 -80522 -66961 30922 68328 -232570 192109 -42047 -184507 -364117 -551985 100140
23326 70746 -125336 161576 -27265 239770 -70275 -100243 71731 -14421 -110870 99430 12978
23314 -7334 -52491 69741 28880 142565 -195855 -93504 -148838 5513 64616 -145735 11694
23302 -60790 -255534 85194 115950 222410 1152 -20040 22695 -8648 15368 85046 116768 -99
23289 117885 -60400 273807 -39382 -136518 1808 204254 -24901 -106251 -17621 23161 -191162
23277 -134774 -93522 -4639 24648 -67014 373320 -20371 92250 21557 -366624 -180654 188768
23265 -90942 -160827 36282 -216824 -10392 170220 -128847 70541 -66984 68189 61741 -45129
23253 -167381 -39443 -22809 -233966 -30903 -51852 -365452 -106701 83918 -230720 -87567 -128196
23242 -128196 41209 -62299 -214979 134669 -47279 -24861 266594 -61122 -177678 -29711 -95788
23231 -95788 60114 -277963 310615 -480396 -261450 -102053 -109246 175815 60694 208137
23221 208137 -59973 -54092 142473 612745 79534 193612 373239 102955 -89482 -193598
23211 -193598 47454 121888 225156 135454 7118 38517 -227385 177990 -243600 72700 84985
23200 84985 -90034 -156401 -232992 -36330 -127537 145937 24095 216207 -264271 -72954 -276869
23189 -276869 -153770 -367313 105757 117689 321900 138289 433966 -264593 110863 -317785
23178 -134629 -14711 -344677 44674 -103131 39417 -404541 8529 -44815 49169 -224979 247771
23166 48865 48629 -30206 -179306 -122983 -59003 37451 -232482 -1800 -15150 115079 -113220
23154 -306638 -456886 233569 -68005 261585 108025 -305583 -87011 167687 -258396 26380
23143 166893 -44796 -37342 -77015 -88481 62266 172453 176993 -328837 9338 -232427 5259 -128186
23130 -101551 -61273 -254487 -168684 -194823 -32842 -186540 5138 -143687 -42419 277243 -25680
23118 2327 18757 253516 218334 232619 86212 41838 252444 273612 -6467 216330 278989
23107 278989 60897 -59895 432906 197210 -45954 52759 59382 23404 195902 -375550 -330996
23096 -330996 141127 -26873 -62556 127736 -96712 -55928 205147 230015 172251 140178 136618
23085 136618 -184568 239129 385823 240249 -177569 -6761 22397 142731 18419 -83074
23074 -10181 201943 -25861 52005 -49841 -136737 -33451 137538 14234 -63737 -60253 319 26780
23062 26780 69324 -53833 -1768 -146110 -360797 -208247 -155632 -88881 -147975 221844 387786
23051 387786 -332689 -143132 -169288 -185461 37148 281957 136297 198932 159575 -7266 14834
23039 106418 120864 -70675 261560 177677 -13781 471978 -22560 139655 -259439 185286
23028 74998 -108229 59037 191075 -311764 259469 -164626 -54572 149126 -72658 -42763
23018 -42763 20474 4759 -30895 189241 -277883 -263875 13237 -24506 354557 -89011 -144786
23007 -144786 -191973 -435124 -50356 -225668 26169 -183470 -175584 104379 57165 -22072 -135455
22996 -135455 -343426 12818 91449 -120159 230023 480322 -208891 -70061 134382 -79790
22985 61710 -23107 5826 7528 -211650 -156660 232531 92609 -208613 162650 -151212 -133026
22974 -133026 -176989 20649 144826 57026 -120981 233039 -80037 -14982 -131845 -181716 -1162
22962 -83505 29349 -294088 -61038 266422 -74362 -97501 -69427 -216279 153049 57230 -333088
22950 178696 -15309 178292 179639 43701 -145673 -323115 124145 -139483 112303 -321758
22939 -194979 350994 -19768 -128861 501067 62391 -38374 244529 -249418 -343228 -45950
22928 -21380 -115946 97958 38808 195576 92496 236908 -96132 119346 -155333 -191716 -200360
22917 -200360 135569 68003 57060 120791 -187166 222224 -268834 -402223 73375 193642
22907 193642 -112426 -129495 54412 -578 22785 203187 -143139 18288 -233874 77704 -411512
22895 -315993 -37776 -94814 -217852 -93172 -136838 -101920 -483430 -18924 133313 60841 -77921
22883 40738 58767 -52698 -165964 173135 212621 -50314 117068 118616 85889 157826 108672
22872 108672 -1127 -125401 -12206 168912 84746 -113773 131725 -166816 20859 862 -384594
22860 -187365 306911 -33718 19138 -203110 -200161 -181566 -113698 346820 -167072 58161 -50907
22848 -209299 95700 155272 37814 -294460 -187808 -140246 -200566 -177005 -69878 254935 83559
22836 50691 84517 -121777 232174 55165 -316498 -199274 -276131 -160170 -80609 48947 -39312
22824 -185080 321223 248795 169995 248160 -77407 -616939 140198 -295859 -228776 -124091
22814 -124091 -22593 -204516 -161506 -260288 -261199 -213346 551813 -119890 343677 80996 77410
22803 77410 -52741 -1020 -192161 44462 -115114 -124456 355314 -278337 36289 -150717 103838
22791 -119712 148415 -103734 -65723 -32665 -195820 -155482 -10885 33110 103694 -226120 -210986
22780 -210986 -187719 -419342 232446 -241190 -8330 303845 -373992 -369597 16834 96917 -275131
22768 -110751 -130699 -144121 231503 -202855 -73022 -76389 -133937 -240563 27332 -151194 -44964
22756 295716 -94517 -47028 -29779 97553 80260 362109 39781 172611 51731 -219507 -198920
22745 -198920 -119576 -43618 -231597 152614 -14065 -265367 27785 -469126 258356 192059
22735 192059 -109268 -93638 -99049 44866 -285291 -236812 103179 -145897 -253703 209620
22724 -221308 -58884 -56425 -202792 115849 -25213 21879 -356200 69356 71392 -329247 186192
22712 197124 3695 -44403 -239130 -268530 -269791 155611 -126482 -342809 67045 30166 30943
22701 30943 -269505 74674 -215880 29882 -139430 -120700 -64658 46769 222199 -307485 -424354
22690 -424354 94080 -50225 -232133 79150 101616 180277 171863 -54647 -113500 54502 -81008
22678 -11459 -11922 -37570 57188 -129979 428943 -411671 -295901 -386231 141321 122054 148397
22667 148397 -384040 -208021 -307687 117353 -206441 -124708 -204466 -145384 -7604 279274 16792
22655 -25411 -44570 -504612 31699 -83413 105242 -82842 166937 -6947 359546 298152 104798
22643 -40575 -155946 -12082 -139678 93148 -353331 194957 -144866 -54587 151710 121495
22633 121495 -267366 -295367 362577 -93264 199437 255394 85597 -192139 -35395 -109227 87839
22621 39613 -148650 543 51484 -419448 -64287 60075 32909 71674 257204 -9101 -174696
22610 -174696 -104029 20665 -197613 -60555 170512 161386 142949 -425217 -177695 -244678 1012
22598 -56189 -162945 122315 -156019 -361638 -139320 34558 122229 348814 -75307 -98754
22588 -98754 -57510 57951 -76697 20590 1603 -126614 10066 -436233 177642 89068 -99437
22576 -164200 122766 269231 -41917 -187028 199780 202513 131263 -269069 32966 -270667
22565 -136989 -111698 -107765 -40062 40517 -141072 -150113 -93712 -88227 198660 -416422 218445
22553 284576 303835 116608 -298129 -29911 -200979 159687 -287833 -119951 151320 40350
22542 -49223 -280188 -404020 -118825 -55971 -30256 108197 22345 -200381 -26961 -161825
22532 -161825 -36471 259561 -161795 -200902 -19435 121814 -135800 -11354 45517 -116128
22521 138421 137469 -351265 -70767 -2962 -179558 -207591 -1325 -97911 -79881 61888 -28823 -70942
22509 -70942 250118 78707 -515274 -30719 -134634 -154625 -179250 -433631 77369 147479 -68979
22497 -120204 -61884 -56468 -520106 -35796 38304 -59608 -14401 -275158 -10114 -62497 -86529
22486 -86529 167004 -69027 105185 93707 -7572 -69589 228678 101919 -68780 156645 156462
22475 156462 111767 -142014 -119129 90867 -375730 -455645 -54274 83847 83828 92162 260611 109836
22462 268195 272962 105821 -420853 88055 -222987 -127914 -212979 158169 -336352 189395
22451 345135 183002 26585 -327389 414618 267718 -76142 220858 38344 -79175 -46964
22441 -46964 5844 -481076 -93457 -304438 -159287 -391447 92728 -151188 -27663 67964 -105807
22429 267111 -115479 134977 203619 331923 -47114 -148851 -29127 -434300 -89562 -27252
22418 -165690 -124392 -158300 76370 -297098 -209061 -234086 21183 -252177 87486 -74282 83388
22406 -77610 -108749 162673 290359 -319919 -24915 25059 -294267 20703 13296 -104740 189544
22394 156650 -159091 -233565 56439 -34603 121177 273345 -221201 246165 -279870 -123602
22383 -227742 -209934 126609 -233547 37572 -51000 -468180 117873 -311245 -238387 118999
22372 -29177 307860 -65852 -434723 16219 -266848 -187060 -124637 32026 -12766 95493 -215105
22360 -215205 -66663 -379488 -338861 272045 65573 -184591 194780 -3356 -247490 -97409 -135223
22349 -135223 -117231 17324 146187 -117718 -318875 49461 -2256 -157608 -13127 -49660 -22179
22337 223536 51137 -67365 -439773 193964 -117605 57296 -102786 -219945 -75243 -12226
22326 -269620 -295206 211065 -51659 -270370 -177969 61427 -44990 19284 -203385 -7498 6361
22314 91651 -357692 -137394 30378 -74304 68512 313094 -341214 -87385 59373 64883 -72960
22302 192313 -13679 -406799 -301557 -212631 155418 -334902 -229812 287288 -193995 -92486
22291 3994 -214887 -225826 -49257 189204 399478 -312421 139024 -196701 -12934 -149985
22281 -149985 -31506 -263088 -324929 -165022 233860 -49779 -182755 19339 -161517 -55740
22270 -9393 -137436 -192019 -609 -71810 -173699 -74662 -47119 -174489 -364389 -5815 36534 394333
22258 394333 -180099 -90575 -21814 33444 467496 -49698 -44270 146246 -157889 -77776 -5955
22246 109306 -75504 264202 -81434 -241820 70321 -22218 -171875 -52477 -10185 -335332 87412
22234 -119987 -131704 -35322 -304575 -368490 -1383 87617 -264935 -200785 194534 -30977 946
22222 -245565 -223634 -64284 -41439 58569 60800 60956 -92887 -131487 -62623 -17290 -230077 -179236
22210 -179236 -219928 295318 116623 52341 -76348 -405004 9255 -74848 -196471 242379 -158692
22198 84153 125587 -47401 15190 220309 -168294 -257268 74890 -191660 119907 -300139 -103939
22186 -315106 390473 -102389 -206248 -148627 -107177 27599 67145 -112439 300542 83341
22175 14294 -31382 -79896 -141150 247530 -27885 184921 148203 6334 29858 -25828 146629
22163 -195679 -136148 -287017 -390505 -172947 -25255 -362465 -279839 66659 101207 167019 -20997
22151 -179780 -431200 -315890 18577 -279808 277050 155562 66292 -287573 244572 -201117
22140 -158141 -136981 10063 70419 -26274 -212353 -165783 -125503 49786 -39466 -125365 -3756
22128 -148017 -182796 250048 93615 -123830 -67680 127361 148460 33148 -260754 195745
22117 -205552 -262134 -292794 100344 102577 -37561 -336091 -48403 -8815 -16732 -367548 -151397
22105 281468 -60534 -61418 -52597 178096 497286 -62540 71760 -234335 -124175 -159945 3402
22093 -29687 2998 523111 -390441 20241 62462 -92176 177488 43964 54481 195135 -242660
22081 409439 293607 28903 117338 171538 -83961 -63809 -147349 54354 -105141 -121761 -374387
22070 -374387 -502863 18083 209668 -86332 239388 -204514 -189800 235363 74715 -50625
22059 -291167 5333 -316076 -101822 -92203 126779 -337369 -72430 42652 32868 -121357 -145868
22048 -145868 117740 -105961 -239459 13633 -59008 -277746 114830 35496 -216070 19082
22037 16796 -188226 -176876 176604 154506 -143112 2217 -20583 80756 32213 398599 2657
22025 -15241 -123224 71654 -36424 28119 -47243 106596 -139260 265974 -405949 -63142 -320804
22014 -320804 -94850 130729 123197 -79269 -42298 -269626 -117767 -130249 -350968 67868 -356070
22002 60669 131701 -47096 -54355 -89278 -158344 -54582 -97543 -103708 -36349 32128 -201285 -148544
21990 -148544 -48359 -497072 -464785 163664 92087 -46039 208224 -147573 -211413 32720 238500
21979 238500 -37427 -215854 -182840 -161994 36619 -37072 79548 -61672 -231231 -38795 -118351
21968 -118351 -260198 -14001 -245630 254200 -211788 34353 -218897 -321078 -184306 21151
21957 -8409 -96844 118120 -87465 369653 -52449 -77781 -234367 -233343 245091 -162599 11633
21945 132165 -18831 -145269 121795 17827 -293939 225534 58729 132336 -109930 -181104
21935 -181104 -81507 -368031 -24125 133523 -53936 -38084 -158373 -4027 62074 -156583 -148285
21924 -148285 115499 -19309 -37554 133751 181279 302453 -224650 127118 335561 -191049
21913 -1601 34130 -33595 143617 16695 -182643 290054 109753 -135359 -5420 -76301 -112610
21902 -112610 -169223 -125587 -111341 -207832 23309 -174463 -431159 70894 -89857 -141235 -82640
21891 -82640 -47462 -188225 186759 -21560 77203 -966 -407870 157707 -8641 4648 436411
21880 436411 -84086 22613 195379 99969 405819 76462 -26706 53098 -208492 -212805 -167920
21869 -167920 -249558 -107324 -236567 190983 -34552 138039 -362087 80878 216967 -41325
21858 5255 34810 -213186 38633 -160572 -252787 56268 9843 60576 54366 287934 28385 58159
21846 58159 119702 23004 16862 -18890 -118862 219158 329 -7506 -207912 140411 -43963 52591
21833 52683 152566 -192268 -10799 -11843 -5577 79757 20913 -144287 57074 366748 -152059
21821 -370334 -135347 72427 -109380 169144 -149251 105343 82532 -210657 -309683 -310586 -178283
21810 -178283 114045 -276051 -11789 4104 -218346 -95207 116325 280429 321557 92410 96631
21799 96631 -298752 -303061 -264983 -200405 -251409 -167604 4660 -175115 386926 -88716 278001
21787 -82430 -89586 -104989 -4523 -3590 70618 -118212 265522 60322 212632 -202866 26777 214025
21775 214025 -276542 65926 239076 -73892 -38584 -102411 -185395 -278229 396792 256188 -85101
21763 261143 21917 -6542 -181111 13441 -45616 -266794 138658 187214 342226 41705 -56144
21751 -111857 351791 -443462 -279605 112362 -84747 -1173 -117174 -169360 3810 9313 12465
21740 12465 197232 24002 70601 -1594 146538 -293327 -273397 41418 166965 -143301 49520
21728 -138891 -264215 -8544 -155235 130813 -61751 90389 734 94713 271963 73068 150234
21717 150234 89553 23026 124854 -334318 -16996 -366881 -206154 300424 228582 -120211
21706 43090 -486077 -33816 -55778 -235079 173733 -63024 75815 6115 -139185 -34613 97338
21694 -30166 -47676 -204479 -174241 243744 -130122 -71246 -342083 1472 223027 -328494 -311779
21683 -311779 -269055 -128061 -211167 -181198 -131745 111531 -291584 -141343 -73587 -16795 48832
21671 -72773 -221489 126243 -150233 -217540 -160094 -284704 -303816 -135175 -170161 150646
21660 236652 -227642 374559 481377 -228246 -226000 -67486 -98573 -137440 38102 -273149 88201
21648 -104685 -201832 -70490 -245772 -522331 176267 -218028 135200 143020 98883 -220040
21637 -226869 -9905 -149372 -104759 2031 156047 -108035 -546 -298375 198407 100856 21712
21625 -143596 -8853 113372 -72496 -354252 79090 13383 -280427 -127062 -24000 -47343 -64710
21614 -64710 -117247 -223412 -6429 158857 14166 148056 71608 -285013 -167431 104768 -100448
21602 410581 -38821 -437623 -78608 47757 -161811 -174309 -122261 -60586 -107881 -56171 12215
21590 42088 257583 127289 114932 -163827 -242901 -62709 139495 -352255 -192766 -68124
21579 -137590 -21834 -178747 157870 -84915 -184390 1274 40146 -91347 -287507 16365 -319633
21567 -8818 -105861 281739 -117780 -4584 -207843 31371 190500 78636 -193834 227150 -57512
21555 -238261 -137101 -60674 -283435 126665 -266433 -164666 74491 -131480 -17092 47243
21544 44364 -340996 152318 127471 -49012 -198890 107444 -106573 -237968 -3501 -89095 397012
21532 415180 -33139 74732 208644 -125143 213243 -195113 -153714 72670 8078 -188607 41503
21520 4027 193488 103905 -93231 -36535 68199 27068 -15884 105101 -178184 -55914 -20275
21508 11516 -257867 -45237 45467 -224920 -16582 -103852 -338893 65082 115528 -277921 -28804
21496 70683 -94523 173500 -131443 -38505 -170582 -84212 -217628 327039 -64179 -25006 -110493
21485 -110493 211264 -345385 -456493 11520 -178730 -75431 13299 -92208 168528 80374
21474 149294 -141515 -6652 127755 -24641 -179844 -211903 -60045 -51699 -22165 44221 -99989
21462 167959 -291549 -56158 47606 127299 244075 -390676 -150458 38608 -53017 36500 242557
21451 242557 -124228 74398 97304 -43139 -192470 14042 -118280 17111 -334975 -9487 59734
21439 -66823 -95233 -205076 -9329 92865 -30435 -45276 45347 -40818 -99418 -83755 -5526 164834
21426 79340 299078 16143 171476 384282 325052 243892 74686 259158 130216 114994 322385
21415 322385 -415866 -186230 -346061 -343954 -334456 367639 62550 -89995 18812 -127818 -877
21403 -281410 -189805 -71333 -101122 -468033 40047 48804 -112408 42187 -124150 -99536 -30323
21391 -25727 226879 -44773 -155884 -107764 -371522 -58512 11389 -194511 98462 323811 -104892
21379 53486 -105644 121136 51263 -227389 37620 -144667 -96443 81804 78673 -262914 -154771
21368 -154771 -48089 27527 36456 -63809 11927 85937 -130365 -96491 -510598 133542 3310
21356 -225618 -66644 -307186 -16935 36562 29018 328633 -53055 128588 -90718 -148578 -143426
21345 -143426 287992 117479 15931 229659 -91892 -127733 20527 -166470 116348 10735
21334 40166 -181033 -131293 -214407 114657 155627 -97814 154833 -1175 -48448 32579 130487
21323 130487 12512 79698 -118530 -82852 -70756 -43016 -126458 211908 57476 20488 -170160
21311 -96982 97604 -136942 -199671 -199058 -214249 -41304 -220458 -173151 -4655 136653 -142865
21299 38415 1473 -46740 -186664 150227 153642 -108248 41969 -140142 -16241 196035 290884
21288 290884 53757 -407972 -39264 -18566 -560146 -69298 -18282 419784 214746 -418017
21277 283964 72817 36062 -111376 253383 -178286 -57643 200940 -399412 -173935 -294290
21267 -294290 253879 -465248 -152844 -116195 -313424 -195472 -130728 300088 -99824 214887
21256 -22323 -244254 -251042 15369 -307252 -431779 -261702 149005 -210854 167441 -119639
21245 -117128 -304854 -83974 55494 -290006 207523 -472016 285569 -249776 94673 194078
21235 194078 -167538 -81253 68855 -252303 -66360 216845 107597 76921 31705 -18719 82006
21223 -173536 -131986 -159543 -212967 -227020 -429275 -23312 -138838 -195708 -336630 15351 44953
21212 44953 -145504 127856 116468 4883 346064 32515 103065 -155000 -8432 32139 290913
21201 290913 -117966 -194169 70596 -187061 157174 -170842 -24143 -180143 84433 217644
21191 217644 -281433 268369 -27265 -171848 -152023 -12571 -320080 -294371 -149456 9511 -265232
21179 -275646 -124313 55563 80366 -240305 106426 -134717 389349 154544 61515 338466
21169 338466 -53192 4580 -105659 -114325 -98779 -150744 -64301 85541 -287346 -208080 -228213
21158 -228213 14856 -145113 59281 58520 -162081 -47866 167251 13777 164 -7577 115572 -266808
21145 181980 -42086 67394 36247 -48596 -223389 -158100 -59559 65363 70776 -240503 67724
21133 -9062 37904 -119932 14710 -456392 -113951 -150556 47872 98920 -220999 120403 -83552
21121 -42889 -69671 303256 153856 85315 69208 -226569 294165 -104290 38228 -244857
21110 -70289 -210101 29402 274278 -70910 -148964 304967 -278341 315890 -333920 53960
21099 -66058 67378 -337343 99253 -122322 53940 -7753 -246310 137015 -70891 -69204 77611
21087 -89889 68847 4275 -280989 -149636 -17847 7021 284516 -74510 165496 -290319 -158741
21076 -158741 340028 -191838 10837 26684 264900 -86608 53801 74138 -198688 113276
21065 374413 117108 341011 -201754 44308 -302790 -271381 -46402 137247 -89792 -5654 -387307
21054 -387307 -236862 -172564 -311439 86496 -129096 -109034 67065 338404 -208854 -119968
21044 -119968 39000 -127264 107047 -205097 51494 -133197 373958 -34820 33868 122009
21034 122009 -400072 -27809 -16732 269136 354761 76910 -92746 455356 -8993 -39680 60979
21022 -131030 184066 50923 381429 -140086 37456 -340174 64299 -136300 -69479 69426
21011 -346540 265023 16909 -12893 -102282 -165276 70677 -158549 -246374 -138380 -354060 61398
20999 -275156 228 -257910 -154048 -158356 43837 241125 -115438 151223 294095 225515 2947
20987 235848 -37151 194923 128823 -118166 112707 -99293 87590 -355343 75644 275513
20977 275513 -122244 -6807 41158 -155124 -80367 -201785 -320256 124287 -94525 95730 -64270
20965 146384 130616 -238729 -141008 -110792 202719 102957 -119939 54141 27249 -5538 -26959
20954 -26959 105037 -53379 -4161 -165875 -70568 -40476 -200357 -17123 -112672 -24610 -67269
20943 -67269 28187 116795 -235695 209351 -65550 22051 -108763 -288199 -53535 252327 -13599
20931 318672 229510 194382 374764 86832 77263 -192879 344007 -324283 170031 142703 -226511
20919 -345972 138116 -239995 227792 -176822 53373 -83109 -298423 -233164 104358 7384
20908 -235264 -55722 -250835 -97991 271944 -217892 150024 -196904 201150 111143 -85228
20897 -215182 103783 -32072 -273023 -18173 -173000 -198479 257605 57559 -60019 96852 -158482
20885 62531 -60028 279259 -441672 -162156 -266126 2488 47641 -450527 -186885 98428 54845
20874 54845 -388596 143243 -80472 -105484 200333 -138651 -135272 -11348 -97688 169713 -143102
20862 -24962 -411773 -336412 -373664 -326622 -55986 182676 -141422 -323361 -36144 -116231 -218057
20851 -218057 -106122 -58451 -91656 -122915 89803 -346930 -167249 -130090 -106506 -112411 -121646
20840 -121646 -208300 27647 14234 202068 -16668 -226056 -122752 -219451 -198721 246705 -28470
20828 -246550 -20741 -159687 98818 -135376 121947 6142 17604 -211316 -201612 -284576 -372097
20817 -372097 -261469 87306 -159748 143852 25815 36518 85256 121846 -186654 -171550 -163251
20806 -163251 -3613 -219244 -237623 71107 248228 -174705 354848 -136729 -495476 66699
20795 288331 98135 -23204 -242818 -329330 -99932 -68278 -210240 394468 166174 -8991 -290279
20784 -290279 -4792 120850 50768 -251585 129770 -76357 -82684 221471 122279 -247388 -146226
20773 -146226 -163222 22088 -77536 156457 -117739 128674 -175582 -64806 209062 7835 -42207
20761 -80294 72538 -112726 -4690 -341015 194525 -290531 -86507 107083 -242001 -4562 -261377
20750 -261377 387018 -6911 -154106 -275863 63166 -161784 83951 -175053 96845 211617
20740 211617 -190139 -36815 -43929 73820 247422 -44213 63533 -74922 9470 14120 -25138 -273207
20728 -273207 -152094 228052 201092 -145621 86143 -180768 14926 128756 -5928 89159 155168
20717 155168 218720 -153225 -4748 -195723 79759 219317 85078 -76486 -79086 -318827 -65604
20705 -322018 -41408 7698 14132 151651 -301023 64146 189335 65681 -983 36292 53281 -99705
20692 -275720 -274987 225409 -133862 -184545 -51136 -327979 -64990 153138 22535 -254728 133480
20680 416504 -205054 -43129 -73446 11803 -142273 6580 -296589 -108478 -206020 -54383 -42941
20669 -42941 88432 -87547 -368644 -80776 -277659 56214 -262580 -35782 -108419 -221164 62071
20657 -2659 -34727 -330096 -351268 -63739 -184450 -150336 -330632 -161055 -332682 -337898 -116674
20645 -155418 157572 -88411 -334880 -201903 37974 -181632 -239150 -243366 -169684 -88457 -39992
20633 -138789 -148536 -239968 -105862 -52002 -166224 -65876 -88254 -41248 -137213 307672 170910
20622 170910 226451 97124 -170336 8603 -322348 -150776 -189940 -201670 -107801 154193 34401
20610 -179245 27084 122701 -192287 16855 176174 -43563 213895 21622 363126 89610 209100
20599 209100 -15607 173463 -257323 -234605 -89120 117581 -350731 -23843 -218733 -230597
20589 -230597 193331 -412986 -324511 -351569 -74561 -54201 66147 -216385 -267810 106066 -330828
20577 -447828 3539 -119555 -90993 166778 322546 196443 255854 -19578 48538 -111896 170344
20565 140162 36884 120364 389672 69015 207498 -230000 203372 -378948 -34428 -88160
20555 -88160 -60556 -149722 -90880 -354958 223777 -67286 -158964 -163577 40211 -448799 -249826
20544 -249826 91968 -428174 -159452 -12694 236346 227171 -203488 -15888 -47904 316250 -151440
20532 -282425 228182 110299 244014 -317854 -412715 -140588 -24808 -76628 84237 -98062
20521 77523 31657 289675 -82692 -11008 229604 -122532 -196134 -216911 -265327 146956 -84353
20509 -168123 48810 -57441 283835 -14904 -285811 -325938 133497 -91046 -26715 -404612 -154056
20497 -234578 -389788 -25465 86698 -242455 -107919 20804 317307 45800 -8910 -127325 -155041
20486 -155041 16072 -401693 -168732 -115492 -16004 445753 -54279 -193881 241582 -57015
20475 48026 351199 11403 -147178 83982 116000 103594 114535 -60852 -181918 36251 76323
20464 76323 -187908 -83924 -158686 -115587 8572 -124301 -198634 48479 93894 -51715 459055
20452 -198298 44601 288727 -605252 136465 -264088 -13981 -49292 67202 133899 -78525 -274134
20441 -274134 -103737 -155988 -185360 -142048 2901 664 131800 310154 -214504 -45943 -217180
20430 -217180 -47115 -256058 119333 -48354 39932 -24195 -210655 52296 -135184 131905
20419 -7301 -126954 -114281 -139355 -93903 209899 98260 182975 -172167 -73564 -125572 71763
20407 -539165 -177195 130163 -9196 -71356 -59173 -142639 -127282 -218760 85066 116507 -254982
20395 -161480 -211539 -24516 92968 68074 -174153 109964 -236290 -363563 -260105 -204002
20385 -204002 -198103 99164 -39685 42784 -413939 -71594 194512 28131 -106792 -63471 123434
20373 -261823 89260 77503 134691 -301748 -162209 139849 -61233 38840 147770 -38785 -84919
20362 -84919 -277921 -63109 -186969 182214 -312804 -184202 -95261 -74833 -124909 -75123 51530
20350 6864 -183372 -78161 82307 198679 209539 304462 -226599 -245038 -48848 108071 75590
20339 75590 -226778 -290088 -89875 79353 -311899 4574 -211749 -91280 -160793 89116 38573
20327 -164492 -105734 -87916 -257986 -67432 -149930 -89594 -206905 153397 -147745 -40956 9927
20315 18005 -187714 -42590 -103280 -71097 83304 -103269 91701 -40486 194022 42422 -37268
20303 59777 328111 -58145 -138638 -82882 78588 134725 -50517 -216737 133122 77562 -38898
20291 90870 -346955 -312415 351129 82311 -66510 -206100 232715 149424 -166394 -253778 -28490
20279 65870 -46772 -301563 256250 -34943 35732 -90943 -158799 140944 -115396 -224269 -248141
20268 -248141 -133815 -72030 -197803 54939 -328743 -552151 -18736 -101226 -360851 -131596
20257 -158548 -140259 159992 -92307 -101827 -22347 -70671 65324 -25838 -164904 -127413 -52250
20245 109980 -274653 66455 -37335 -346671 -481248 105351 46223 -69844 -162607 -133614 -135484
20234 -135484 12293 -133459 -68784 -163671 174893 17562 227696 -38594 -290898 225516
20223 -67791 -232321 50289 -100970 -31491 -217239 45892 -110278 -282614 -394444 6423 266133
20212 266133 60788 28358 -263003 -230809 381246 -86955 -90794 38207 13441 -65126 -154226
20201 -154226 -346285 -421413 29265 -31653 -230266 207133 27176 -180704 -408630 -50805
20190 -37963 168116 -10927 -241949 -2341 -326645 52781 -170189 123455 -109481 -288387
20180 -288387 178122 -355282 219150 -131605 -307290 -70485 147368 -124732 -95110 208653
20169 395086 223361 -39045 -93508 169375 59865 209207 81300 -307477 -6445 63094 259584
20158 259584 -141139 199126 -158670 -124036 -76906 48478 -296257 -111035 67281 41216
20148 41216 1446 54726 -105383 -86599 36888 -91547 -12429 30091 116706 208642 304490 68020
20135 301054 478541 66122 62339 234812 290838 191593 317620 249005 204491 284253 234097
20124 234097 354922 357844 287386 173270 -94958 176036 -93230 121479 -92015 -123920 68434
20112 -80652 -7107 -318238 -129635 22538 -109633 -46591 -401590 -192969 -249682 -325190 -274886
20101 -274886 -66546 44306 -158562 -284302 160585 185972 -104382 -230459 4591 110327
20091 110327 -482461 -31444 -72009 -233684 129508 -195991 26856 80047 -44465 -59838 85240
20079 -99540 -499607 4443 78642 -188826 -7563 153115 -10160 -127609 -270956 -183403 -78855
20067 -137862 -151045 -107754 -104010 -105696 217819 9699 34221 -203372 19219 -23539 -150809
20056 -150809 -171632 -17269 101700 -49789 -57241 -435642 185042 -152192 -138953 242191 -66228
20044 -108368 -53511 -168389 -87585 54661 -154818 106988 73290 160581 -53416 -268828 130643
20032 111077 -7120 -198981 -445763 -100447 -123140 222331 -194503 161962 -200721 -10421
20021 15120 74316 61128 49610 50237 -36713 -196167 -134651 -26165 -63996 -35436 -125579 -10238
20008 -188825 99520 -86286 -191168 177797 -48869 21033 27222 107772 226158 -100952 -391342
19997 -391342 91102 18693 -107514 -104676 196550 -35378 -65270 242803 -209227 -117440 -151267
19986 -151267 367753 -5395 -88574 -95984 573765 39860 66007 266473 -38531 252082 -24305
19974 -160400 9762 166437 425723 109651 590852 -258341 -468426 91611 -16403 228508
19963 357900 163688 -115473 -171228 55658 61284 -429669 41829 159156 -18491 92004 423508
19952 423508 264224 -201451 118375 104448 611974 71232 153445 -38642 -295761 -3610 46487
19940 236982 180984 132550 86079 139343 143200 -62793 164878 -351867 -18602 -179652 -220397
19929 -220397 -182599 31152 -58097 -119663 -127596 -19842 -124802 -94626 25052 -496431 -67272
19917 -234579 -36954 10610 -22613 -228786 61745 -234246 -137057 398761 -243035 -70661 138358
19905 178223 190052 -96618 372977 -158779 -180701 -386122 118169 37051 42056 -46295 -173147
19894 -173147 45453 -119360 -557762 -168801 19865 -408102 -290342 2179 86304 -10035 -295137
19883 -295137 -348015 -320022 -3253 223527 132364 254890 -463455 -483280 152658 -169110 -355737
19872 -355737 98864 -103767 108819 -205096 54614 -153942 -66591 -249326 -75020 24318
19861 -44762 -186828 -77942 -98022 40412 -96076 65319 -163017 -266355 -221718 -144530 -223299
19850 -223299 -100355 -282963 30325 -87497 -4923 -143926 -292420 -227811 172821 -309891
19839 -92673 -1942 -33356 310754 -318710 124412 -79849 -90489 -37433 174888 -250371 254579
19827 60457 352880 25064 -106008 52887 -130653 -469116 -72233 30033 -68648 52336 199443
19816 199443 99402 95299 -330018 -171428 -185513 9251 -265984 302220 222720 -185546 -58854
19804 -81880 8963 2989 -252118 339665 -134115 20156 -431084 91200 -258480 -357163 -157950
19792 -82032 -285745 -65137 -83400 -198594 148293 -107932 96210 -84704 229344 121262
19782 121262 291682 213213 -83968 -476233 -111510 -111464 -50783 -249721 -8423 13229 -34430
19770 -188034 -26085 28346 18237 120110 142298 -91738 -243286 -344220 -82971 -655 94705
19758 -131462 -70066 5953 -30095 -4993 137239 -4577 17203 125069 -119188 401004 -388168
19746 -44160 91479 -54685 -56635 -57686 12618 -159141 -14300 54570 -102594 70160 36621 -63212
19733 -77723 -36366 -103123 -6789 225286 -86254 -372527 -310943 -232018 31904 230433 45299
19721 -139297 -107091 306443 410710 29975 -17140 223676 363108 528707 393378 570242
19711 570242 312077 293589 66975 141758 -128356 228153 -218327 -59011 -234851 310669
19700 -113434 -103556 -252055 -264485 -1958 -19360 -122552 133669 148244 101960 47447 -101363
19688 -39505 164186 246455 225618 -64718 182293 224231 344834 250562 197996 -96442 -86528
19677 -86528 -47962 -272908 72596 110164 -245258 156499 -335917 -12380 75831 114123 199394
19666 199394 212511 -49567 -176563 68454 -146919 -272989 -10171 306061 36422 41348 -66127
19654 2522 -340080 -14343 -56167 -308719 -75348 50308 98633 125933 -94874 -70232 -118525
19643 -118525 -160097 76881 111147 29034 -112168 85575 80795 -28084 69231 -126469 -14026
19631 -299103 -57501 -118737 46937 37992 -268913 22884 -106881 5561 48963 37025 -185006
19619 -20465 -302481 -93171 -47404 55273 -40759 -308345 -114872 -9285 -190254 -212411 -159941
19608 -159941 -402037 117307 -309464 127106 -335159 118777 255108 -175372 333530 -342455
19597 -52018 -83259 -26085 -77814 114389 -471829 44927 -309599 -103555 162939 -240657
19586 -122791 -282329 219915 -199360 46407 108962 -227282 307749 -181401 -223749 -11842
19575 -211393 16293 214491 -112534 -25994 -204649 -152004 253734 -152488 65546 -298238
19564 -208708 159920 -347503 163541 -121911 -186747 -52950 -127980 -223682 83034 -310407
19553 256633 152232 73345 -257669 -93118 -87072 -82069 -153390 -347169 47674 -79743 136498
19541 -154224 -109690 -548853 -43757 172298 -10889 48179 -111463 -41293 142432 29604 -103788
19529 -49270 -245702 -455319 -293371 -283753 -251433 -125074 62821 -340827 -114115 -172385 146259
19517 28641 349957 -214371 -293402 -180277 59672 -210455 -226661 -262848 -84181 19415 -126465
19505 -193546 -102172 -60353 -406546 113088 -120154 163816 -183006 305505 61263 -246622
19494 37009 22579 246444 -141711 77817 -188883 -109308 -80141 -79678 128193 209066 -245690
19482 -311083 274070 -216235 -78734 -267576 25164 -44930 50335 24583 -107818 72202 52288
19471 52288 -6285 -159071 22139 -245555 -400453 -197301 21387 -154573 -274723 11180 -378994
19459 -136552 -121300 -68785 -63355 -12782 12029 -69375 -231318 -297 69963 144932 -57535 -366806
19447 -366806 -243305 -28084 -119927 -212866 -193671 218667 -218165 47396 -169269 -48623 191166
19435 -120113 -100481 119169 -51020 -61891 -31294 41815 -46761 -147674 -153588 310 -266358
19423 -448559 -255689 -107239 133640 -442592 -136370 -215259 -93154 289044 490150 18950
19412 -229886 86389 -219948 68047 -276274 -125622 -329884 -166894 -205497 53724 41371
19402 41371 -292485 107972 -85828 -205772 -124075 -1045 -226747 215504 -448400 -287742
19392 -287742 -4629 -260483 243751 -190143 -63663 -288012 -127333 -100311 -175214 -210127 -25621
19380 -290169 380850 -277340 -249120 107116 66353 48891 -81871 -107406 -19203 -114666 -31493
19368 -121309 64120 -195926 -506724 -308997 119194 83209 240434 106851 46308 -128843
19357 196965 -412087 364875 -380750 -113746 -287031 83830 200173 -84062 50947 11673
19346 -69893 -223634 125970 -23410 -26993 152548 -71765 -361065 -221580 -68903 379336 -22616
19334 7181 -168077 -146300 -120613 136360 -180607 160672 -154603 -139114 52987 -396735 -49875
19322 471610 81734 -229498 -275232 -86476 -159013 -55419 -308694 -77563 -32468 206377 -235999
19310 65177 256418 -50851 65813 -2175 15257 -148567 -152001 -159460 -411563 -116791 60481
19298 -192251 94223 47281 -237666 -234527 19501 -427010 -435767 -149435 -92581 -150732 -17158
19286 -19817 -52479 -243857 276358 17837 -16493 125709 5220 -179529 145037 -325699 -105695
19274 -182808 -474057 -122574 -248966 -46764 -236739 18890 -294690 -213291 -253042 75502
19263 -241702 162070 -31373 -96590 -22739 -330112 -273142 91390 -247564 -41137 -157260 -274690
19252 -274690 14870 260981 -90855 -266452 -182408 -281985 80997 -169398 93011 -500390 105070
19240 -198457 17362 230399 -247779 177477 -233048 5917 -325434 -206130 42872 -73675
19229 98920 -89819 -144008 -276221 -38547 -201143 132323 25973 -148083 -29077 -67811 10576
19217 -160340 72494 -65207 39476 -177494 43095 -157495 -160304 -99037 -337228 -7516 -164017
19206 -164017 -13873 119062 -116447 -259480 -114895 -284199 -151415 -171397 -33199 -79441
19196 -79441 170535 216412 -299635 -115979 139939 -160634 -140169 -109278 -378196 -359612
19186 -359612 42120 -199713 93353 -1620 -51740 -314062 124050 23394 -16427 -172910 -132344
19175 -132344 -35217 235616 115063 50080 24551 -180295 -352724 -196349 -466906 -29162
19164 122927 -255554 -242517 -177380 320963 -144092 -3411 236314 94937 -15962 131161 301001
19153 301001 -164446 -73862 12230 279384 297475 -373036 -241634 53765 68303 325946
19143 325946 -86997 -98476 -82109 -51318 170452 -179947 -211642 -211970 -234248 -198617 24157
19131 178061 -201420 205675 145360 -93874 -89330 -39581 143947 -70078 -108218 -42896 -333074
19120 -333074 -163953 16639 73406 11305 134538 -228309 -213302 -505298 217457 114632
19110 114632 -166604 -6157 -210611 -26559 -44872 -125498 -15378 -218704 -117839 -176987 -80892
19098 157696 -255721 -257364 -104006 150654 -143213 -235428 85073 -181970 -4004 183331 -301102
19086 -242950 -257908 2544 68609 -131999 -252109 -127214 -18514 -201742 -277390 -267147 21645
19074 -270048 122447 42024 -24210 -316522 151778 -77538 -206705 80638 -95308 60501 -166310
19062 -341671 -52652 -60088 -149805 -85028 -118546 172718 35259 -395876 -6853 79673 112673
19051 112673 88283 92462 -126955 -139604 62860 -106538 -7482 -151521 -222844 -239631 303726
19039 -3224 -249382 116670 15232 123276 -505028 62426 -143243 -5141 -259098 122212 -221687
19027 129081 296749 -244954 -146970 -80683 6114 1298 -713975 -43504 -143088 41917 -93187
19015 -4650 -104337 -343774 189679 -67106 256350 -74017 -34562 -34081 -21198 -95096 130743
19003 22810 11951 104700 21575 -246508 16385 198757 58298 13416 98896 -20809 -16943
18992 -16943 -335890 -314679 14270 -80080 137671 117350 -142839 -79536 -68068 91880 243737
18981 243737 19667 352805 53827 118052 -114553 8880 46121 36482 115044 -62154 -129864
18970 -129864 85018 306275 -142284 -66063 57713 -105042 43887 64103 -17472 314992 60071
18958 475098 364430 279188 321792 84333 -91872 20955 87057 -295028 -118358 -152522 23866
18946 211892 246710 -86471 8820 -109664 -296273 -370295 -61978 104730 -312458 153895 -304378
18934 156008 -148211 139824 34605 -187179 112130 -1221 8613 -58040 -225503 -17365 214600
18922 -170421 195660 -120730 249597 11083 -41055 122140 -162974 -4889 -75289 -104223 -174410
18911 -174410 33686 41189 120948 -229833 12023 -26642 -81119 310276 -79630 -44330 72068
18899 -55021 -358 -67982 9173 283757 504673 332153 440448 501037 369357 -137755 -6554
18887 218087 -77221 -348139 116761 -107953 1475 592246 1565 125940 -154258 -132552 64653
18875 -144744 40716 -44771 309117 162754 -222668 133113 -370687 -209043 -377925 86300
18864 -217782 -20680 -208948 -231647 -8128 -77802 -152217 -436836 -176116 -12768 134364 -85145
18852 -307205 -35845 -87321 -160292 -22231 -230183 -160929 -255713 -107279 -11907 -90658 44535
18840 -228989 168398 90617 -334725 -531923 -389839 -59979 229849 172885 182802 -235709
18829 -207855 -169373 117186 156995 -220977 262314 -251879 -22603 -31828 36805 -67961 -123935
18818 -123935 -305236 8420 114324 -237813 -3168 156208 -328878 -69277 131666 -104040
18807 12377 -273901 -428949 -47589 -152047 130811 68341 -42088 229962 -135883 274625
18796 -101768 -40002 270620 72947 26383 235906 148435 92004 -237801 24084 -310168 185748
18784 25755 -336308 19021 -8130 -337592 -261830 -71832 -364633 -35456 -183397 -61541 -145776
18773 -145776 -126893 -83840 -200569 -230708 7793 -371327 -36169 21716 19556 19285 130073 234890
18761 234890 -225763 -57665 -21468 -124633 75994 41497 66946 -257752 167117 -45324 -110433
18750 -110433 97692 7626 20594 -238245 -376220 -270075 -15960 209347 -426596 100130
18739 45952 -173403 -116877 -88182 105132 47293 -119684 -186034 -130339 -199022 225746 -220057
18727 64213 -390757 -211872 258071 -315322 -46462 211462 -187741 -87461 -183813 -42873
18716 77214 -40642 90096 -32829 -146781 73270 -138131 -164409 93280 173927 116284 -134571
18704 -282527 -12548 -219578 -233357 1519 75611 414845 -142898 -185120 74452 -134120 229411
18692 -53757 -103449 -121753 -89927 -225355 122512 -175665 -226311 -212816 31849 134812 -1766
18680 -34983 -65393 -333847 -239756 -517745 11568 -57205 -565021 -64482 -119783 -129774 -104252
18669 -104252 -64392 46068 -239119 -249592 56094 -332651 -149788 -121564 -77480 339714 -222526
18657 -122961 11568 36036 -8252 74740 144531 -186760 -341113 -108961 -37597 -291170 -183420
18646 -183420 -32424 -302673 -158612 -172758 -166569 -256265 364064 -27577 112445 -123995 -158997
18635 -158997 48411 -19041 118440 24471 141758 47001 113132 170486 110659 -363266 -194646
18624 -194646 91687 -232699 -408549 281596 91891 -207484 -1998 56282 -312245 32816 -40065
18612 -120427 -116064 155154 -43563 25299 -60948 -74381 19496 169958 -51125 -335025 -194971
18601 -194971 148428 -448451 -199025 204 -137470 -2127 -64462 98639 -90960 14429 6050
18589 153120 -56657 -396822 -87740 -218992 -229208 109082 -374319 -162015 107385 31437
18578 -360934 264759 14226 40507 -229058 -65363 126223 -119491 407709 90431 124149
18568 124149 168064 -329397 188298 28736 32536 -129215 -7230 -160750 51570 111387 -165949
18556 313766 222556 -91187 35331 72921 -375012 81963 -341877 -116847 -80737 167512 -32964
18544 -132764 -146839 -251946 192803 -158800 -59761 -10725 -304657 -336318 49248 -173275
18533 -227083 247803 385889 -193056 93945 -48501 39426 175800 184617 -203194 -75953 -137616
18522 -137616 -48380 -46222 -242994 -223594 -243538 -129600 -141596 -68483 172458 -14121 -210765
18511 -210765 -102916 -160023 -69660 23557 127655 352665 -91 -159735 26109 -235605 -197587
18500 -197587 -7826 -37296 210641 -21184 -127337 -21143 23245 -75592 78505 35617 -221926
18488 -118603 -130667 -39544 -16478 58964 37683 -346835 11150 319437 62960 -224679 58152
18476 79291 22041 67412 -4590 -184355 -139537 144517 225262 -117918 -438602 231757 74605
18464 135627 118143 250754 -326374 -137324 -559925 -333313 -52413 -61456 26694 -41031 -238313
18453 -238313 209123 -82463 54286 43412 76634 37276 -45337 -108607 320076 65405 -88839
18441 218718 12610 60864 21502 102057 -181162 -229793 -168723 -125266 -12655 -41665 -268870
18430 -268870 -41772 200952 -16593 38389 -116614 -297750 -24221 30200 -224831 -283403 -104223
18418 -20341 54287 -57351 -83323 -76721 -31952 113791 -466746 -47539 63259 -260882 -314011
18407 -314011 194730 173215 -130229 118630 -50609 119815 -341101 -31855 -126773 43111
18396 146395 226921 127993 -235686 -42440 -2720 25479 -94023 -56600 -97945 148610 299182
18385 299182 -78175 -166442 304285 -49787 -73357 77461 -166652 -352233 42175 123409 -3540
18373 -25179 -137540 -273344 -38707 224015 -284125 -248578 -107904 235545 -230457 -79228
18362 -250208 -56207 157454 210021 96896 -139337 -153404 169895 -98187 -5025 41310 146075
18351 146075 -106955 -22944 253927 -102031 -140280 -120874 -165172 -213628 156276 -209094
18340 76034 -135501 -36098 63876 -240721 72130 -47422 111385 -5990 -327839 -12992 -137175
18329 -137175 392901 -28303 23194 -154631 -214617 -188929 -93354 216000 -218361 224401
18318 -132949 -45887 235242 168398 -5078 69921 -209996 -175998 150988 -192320 -186483 229034
18306 310479 -5750 -131992 -63957 -32515 -69363 -54869 -278754 26814 -45245 -189667 226636
18294 195669 295895 -244274 29200 -11081 279659 190231 184786 9251 -31075 -270661 264880
18282 -245537 -31913 645990 33271 -64066 41691 56436 41638 -54733 -221314 -281286 188258
18270 -267355 402681 237600 32837 173189 320 -149404 176579 -83399 118710 231765
18260 231765 30120 110165 17136 -305885 288866 -34451 -160975 -49812 -28748 -129137 -8369
18248 -84270 15599 -119565 -193190 -279433 -192870 25733 -230628 -11894 -171469 8809 91129
18237 91129 -211023 149192 -44630 19236 157853 118600 -30480 -118481 -37422 117268 -351565
18225 86928 -29161 42471 -76947 96797 -257100 -150365 106801 -72256 86862 39972 -139126
18213 2646 -41165 6911 -90525 4014 -83985 -109929 -133034 72498 74261 -221784 70702 -28543
18200 -184451 -278630 124754 129238 -196378 209690 389843 -341770 -7840 -66440 -69852 -113323
18189 -113323 221268 -94447 4835 333120 -236693 520783 -44504 104030 -232545 -66147
18178 123471 -40597 50168 -78640 1782 179949 58941 20934 96590 13191 282625 117779
18166 -302033 42381 94248 -152857 -75038 206193 71971 -296244 138570 37373 40104 166391
18155 166391 -32325 -413869 -274459 46641 -345305 30069 148319 -173923 -50179 -255249
18145 -255249 -29659 -192771 9872 392964 45065 -13027 182640 139382 -442799 -183327 118284
18133 19515 -25597 146332 -66568 -67219 -40828 -81377 -278152 -312448 263237 -206793 -285566
18122 -285566 -246483 119456 -75712 -159067 2467 150676 -213427 -181397 263320 36259 -193384
18110 46401 -62747 -132784 -37595 -77341 97010 -300436 172290 209890 51122 40702 -267038
18098 -275680 183274 174271 -200067 32800 -129328 -27772 66516 -17462 -61665 -9566 -252627
18087 -252627 28866 240254 47458 74136 -124072 108016 -25799 -103008 -191874 300158 27236
18075 89675 -97412 -327549 -51611 -117555 -155762 285275 -5170 19733 134350 -11181 -311011
18064 -311011 42747 -324751 118870 122863 40322 241250 -69069 -73083 -32510 -13569 -183267
18053 -183267 145237 -169022 413678 70870 61519 -147331 -53931 -239248 -362451 81704
18042 54241 147865 29116 114613 74511 -213856 186933 109936 82296 30526 65878 -193527
18030 -142869 -62330 321603 294872 -35962 -408680 -43285 62316 76306 40111 -151318 224535
18018 142271 50996 -295255 -68498 86235 -331537 161782 -87482 45577 -408858 -164190
18007 22929 -34163 3497 107076 -170158 -241262 305867 -12897 92344 -195234 -110323 29570
17995 104619 8301 71152 -33546 215816 124232 -142564 44391 355691 306071 264808 -16320
17983 -217771 3516 -34900 60303 43996 -108849 140884 -42538 -99287 -88264 -55754 -196541
17972 -196541 -138129 123940 26011 -58679 -193706 -309200 204329 -83740 -59993 -51216 49911
17960 162224 -91106 138127 -54438 -144998 -18709 -79119 55188 -120459 230078 18958 41880
17949 41880 63736 -38660 29132 40530 -151536 53984 -281892 -47751 -33767 -108798 126453
17937 -112501 273303 207553 -14712 -97297 -34999 136887 -88550 -24105 -144342 -276494 -223768
17926 -223768 84430 17703 140206 177032 89891 -163938 -55970 17423 -119958 150678 -433100
17914 -169060 244869 -266161 134165 -4723 -40953 93217 -78097 48325 77769 269245 -336269
17902 196615 411536 259506 115031 76865 319875 129289 286996 8894 103316 245336
17892 245336 485381 231926 128442 37376 70357 266948 27288 -374475 -32844 -233146
17882 -233146 -433 -147416 49285 59072 102953 -114233 391803 17998 28994 191299 -219661
17870 -44552 -71262 62929 1458 101440 104391 101269 171268 -60027 -59890 -185267 -15714 -6512 -48902
17857 -48902 -117753 333694 174192 -114864 -330031 214202 59739 -228378 331569 -1393
17846 -139931 -4095 -301653 -253366 306272 -78526 -86330 156752 -111877 75029 169318 -186765
17834 79017 -67640 367447 -192272 260352 -115623 -210285 -241502 -347808 -41358 61536 329054
17823 329054 -110321 139172 -142349 131619 109858 61480 25745 51941 -204381 -289173
17813 -289173 -10674 -13947 20647 -33997 275042 42933 76542 -10597 75939 -237031 -28506
17801 -2128 175231 -70084 -22703 -58289 113262 -166540 171626 -79792 -52890 257602 71311
17789 -89798 -78176 225826 -302385 169286 244220 -12322 72219 -39171 68106 87858 49054
17778 49054 -26132 -22133 298985 -57601 -157017 117994 86103 173424 274404 24519 132477
17767 132477 12537 10993 90795 31173 33972 111399 -5185 -116382 56133 100454 238423 8455
17754 197563 252489 82553 -136236 229900 147988 28328 20908 -53705 39992 292508 134856
17742 215431 56070 -194830 117698 -194875 269423 -83693 118921 97522 139797 -207412
17731 -536 232059 310321 -87073 -38619 253580 306647 164008 -180079 -204474 -40275 35326
17719 345131 92661 360102 107317 338454 102113 19405 614998 7057 -40189 -63005 381192
17707 220851 242807 8390 -21185 211349 257884 -188303 -297183 9326 164783 192652 -1911
17695 -14603 104820 99679 99225 447921 284526 51827 90208 -55761 352296 -114701 138013
17683 140664 24104 133063 71142 171475 -211 258607 115480 -97849 178025 73997 165553
17672 165553 12495 1006 332116 -194270 -112581 16030 149728 42121 -33724 209169 170552
17661 170552 96875 -12468 290501 271598 -161972 -150156 94895 172650 163572 341543 -113283
17649 56800 -32827 174397 7443 51748 -13742 135589 -117775 -110100 237210 8041 -116677
17637 138903 276707 245709 292749 148586 -87464 231083 62266 92427 29995 -158972 -2204
17625 46586 -231001 62591 131285 -86199 218646 309642 194661 -151962 4451 30699 313982
17614 313982 24201 4051 -38933 170542 153536 226059 225415 368205 25000 367143 268574
17603 268574 -17684 60585 19568 255265 339312 318346 375882 94995 -80821 140216 -39225
17591 322810 -159683 61883 43351 -26497 16545 338039 278148 324672 -75900 -125489 356871
17579 355809 103803 85732 332894 229125 -102677 -24874 118494 -6250 19118 -30472 -18898
17568 -18898 -120528 -13819 428741 167858 201550 70084 -112680 -4685 336833 8395 -201064
17556 336938 264574 194681 -61474 295041 -43615 364333 -11430 675780 96709 -206428 28110
17544 80045 309129 281609 336721 -40410 116109 159675 393853 196946 555341 351635
17534 351635 -139595 246905 417339 524665 352835 65874 241907 36007 21178 209282
17524 209282 339607 160653 44434 189806 286132 -22132 374161 47474 215558 489680
17514 489680 480588 351901 501233 689376 1344209 1100672 1085279 932104 786157 540421
17504 540421 529184 701634 357482 609921 391511 507451 652286 443780 687669 895664
17494 895664 1185386 1268051 880406 611174 677670 530053 333616 655489 476781 189415
17483 344739 350055 452302 278457 75780 20515 280968 518650 6356 115083 179401 105634
17472 105634 104660 171144 108606 308945 50745 91894 -58215 -6637 326139 341371 186818
17461 186818 64584 273476 528033 430058 330047 252265 108649 318715 178001 218194
17451 218194 10926 190779 212660 346062 29992 590719 197208 -106589 256313 156388
17441 156388 238555 24961 444417 498634 125661 449369 437358 513905 306735 140109
17430 165517 651297 282333 146042 -55746 274392 351777 301762 710923 288620 445858
17420 445858 255302 172529 371983 234395 272962 395297 459789 386677 146894 531080
17410 531080 -209254 124828 299662 474911 509380 442079 309265 293826 260994 259959 551167
17399 551167 414448 139580 132270 78250 235508 414791 436500 581238 665368 269568
17388 340016 175573 101498 152366 412470 223643 305024 -20653 -104121 93797 406763 278569
17377 278569 314450 28226 43236 261132 136169 -38194 235899 446254 211639 295378
17367 295378 528198 548666 196318 361941 220782 648735 -125093 -98196 -70071 531429
17356 123350 306080 670802 520339 187377 -198011 428809 513053 170782 -90798 297172
17345 571280 76275 277647 325296 127715 341492 523504 73900 258828 225043 464170
17335 464170 -107949 148631 152522 198957 297731 104554 472476 131121 47890 173263
17325 173263 83392 433160 491801 203935 750312 381192 535769 230580 41912 326259
17315 326259 210970 226198 244905 4383 567905 376006 131620 299585 79787 -69406 359102
17303 163927 444929 212213 547828 211343 213305 -175418 190465 141112 117267 442134
17293 442134 360937 184048 491137 74498 171938 -38425 261454 218121 163927 685961 61948
17281 330339 405342 501594 243041 371720 178005 357859 365298 443695 630893 27076 118285
17270 118285 -74677 277579 408514 -15838 441925 187548 70798 380346 491797 282999
17260 282999 301430 436486 433836 194094 125972 285723 269463 282270 375938 283567 307480
17249 307480 63012 426022 449244 382448 314296 594647 420431 399618 351843 287680 451539
17238 451539 317934 626965 335037 400157 274595 171796 167807 394539 495314 160708
17227 127437 414589 211102 319552 555921 394993 474729 323512 632314 343851 611993
17217 611993 156592 322061 356479 392576 643163 317363 258873 221979 404486 343027
17207 343027 -86632 100937 527844 600861 453903 77840 274741 319422 54432 179295
17197 179295 382028 321959 406253 326563 629888 619640 507492 161893 525748 412438
17187 412438 451788 403334 312153 224076 399372 112294 452105 543106 445687 622876 234467
17175 413725 495367 140841 339976 310412 620806 265017 644894 404335 324094 536297
17165 536297 525487 498306 394512 229769 573245 858628 352303 350206 658284 487349
17155 487349 98842 522796 392061 399122 663379 408164 472755 626715 339537 759900
17145 759900 405006 431563 761397 410842 634189 624794 289412 234914 633694 486375
17135 486375 361891 464419 777263 362731 327634 545332 200028 282750 491432 177302
17124 229784 747188 481662 567570 511503 548961 152019 577152 724674 527061 732097
17114 732097 1061883 440917 452902 711415 413073 473834 480379 731826 358350 548842
17104 548842 455163 269110 503059 518376 706471 440200 749650 831436 579575 477201
17094 477201 718356 484044 458872 715545 728438 738103 603443 723700 845595 724630
17084 724630 776832 407656 569490 800414 638132 880937 726870 278299 477945 790982
17074 790982 569782 691521 773801 666096 842266 514339 712465 693787 578648 507494
17064 507494 594195 885044 668867 507180 690520 922462 952539 638762 878983 631410
17054 631410 997818 746708 881211 907450 833547 1066257 817539 867404 779180 960302
17044 960302 835878 839246 780798 727475 809224 769275 814809 695079 563180 824492 904724
17033 904724 1060647 996509 859183 779260 552041 1002890 823608 811842 1195761 945739
17023 945739 825919 838383 1104605 753203 963537 1006430 895775 801539 925077 920248
17013 920248 1257648 1017610 972409 1048298 1324194 915622 1087708 983061 1097710 994725
17003 994725 829960 767171 633288 1128960 1106888 951254 1067685 1293142 1360072 1183360
16993 1183360 1322447 1050324 1465455 810480 967527 907930 1057939 999353 779564 1235019
16983 1235019 1209523 1369870 1322367 1224686 1145941 989059 1001682 921663 737658 1517785
16973 1517785 1389467 915203 1131526 1361216 1281288 1166806 1313260 1152699 1603809 1242099
16963 1242099 1102477 1203051 1219511 1743371 1251347 1450079 1377475 1195328 1577687 1222732
16953 1222732 1678753 1651108 1305189 1471309 1546352 1328618 1400053 1548967 1722610 1745590
16943 1745590 1524562 1527542 1659319 1573311 1379675 1538565 1273325 1969615 1575227 1759319
16933 1759319 1770510 1514094 1906481 1656354 1514037 2144748 1725896 1876749 1744466 2024265
16923 2024265 2092958 1766803 1820909 2081911 1948286 2173521 1916425 2033644 1966982 2149793
16913 2149793 2189140 2126410 1979064 1875148 2180036 2019315 2356903 2074732 2137051 2092635
16903 2092635 2247297 2258039 2476974 2091598 2498583 2363632 2614511 2544993 2665107 2526157
16893 2526157 2354108 2521434 2701341 2697587 2573152 2636613 2718913 2492159 2956293 2881663
16883 2881663 2852829 2962824 3105803 2762333 2960914 3210403 2845474 3144835 3198964 3010382
16873 3010382 3143692 3060666 3327001 3377266 3163466 3000187 3236495 3725056 3409989 3519751
16863 3519751 3514783 3530193 3628965 3726060 3660980 3782560 3873478 3717817 3726286 4165790 3743249
16852 3743249 4319953 4276242 3934670 4050204 4430923 4337774 4385202 4476150 4271075 4567852
16842 4567852 4689339 4639937 4983346 5072461 4958721 5029834 5330083 5098961 5314228 5221154
16832 5221154 5495582 5569725 5409438 5522325 5973142 5827816 6120815 6136140 6223421 6377091
16822 6377091 6559275 6767871 6503285 6754112 6909807 6848359 6837092 6915647 7120326 6926411
16812 6926411 7562218 7469824 7812266 7812374 8162439 8042688 8436158 8240861 8494413 9132964
16802 9132964 9019717 9178279 9455286 9498975 9712376 9932186 9955479 10520024 10467052 11144271
16792 11144271 10931003 11281674 11577444 11933895 12031040 12141163 12657341 12882327 13055216
16783 13055216 13741129 13770859 14066506 14478751 14764163 15820406 15749509 16162609 16525319
16774 16525319 16953530 17088298 18012967 18403158 19020433 19213335 19982772 20398558 21059501
16765 21059501 21828737 22530322 22930017 23830691 24497970 25036244 26390296 27066739 27723726
16756 27723726 28406578 29655635 30623363 31583136 32603338 33767612 34917401 36301873
16748 36301873 37719733 38746696 40075594 41639095 43386452 44929462 46300089 48249460
16740 48249460 50249379 52219925 54408508 56195027 58502706 60834029 63339358 65882938
16732 65882938 67989401 71039702 73900754 76806108 79527081 82682862 86060228 88844082
16724 88844082 92233275 95701016 99255945 102480013 105857887 109065400 112446183 115480728
16716 115480728 118462867 121320769 123799064 126293529 128437731 130119398 131786199 132974066
16708 132974066 133652792 134055679 134029001 133318029 132869021 131853153 130017129 128090103 125880162
16699 125880162 123468291 120657236 118247733 114803080 111593527 108472135 104943548 101621855
16691 101621855 97886850 94920386 91408830 88133309 84595666 81708549 78562434 75638748
16683 75638748 72333028 69812123 66728708 64345950 61719165 59043744 57323482 55048636
16675 55048636 52709871 50528958 48821006 46786124 45273443 43691497 41817735 40259426
16667 40259426 38608576 37339775 35995091 35128108 33676162 32714607 31111784 30468360
16659 30468360 29469538 28580832 27940602 26473997 25840916 25079328 24113002 23305013 22598821
16650 22598821 21980680 21218969 20996253 20377805 19651116 19069489 18328548 17903217 17822783
16641 17822783 16975637 16561353 15808569 15761650 15444277 14833682 14486915 14157820 13910796
16632 13910796 13629679 13444573 12911983 12768246 12128375 12053708 11968220 11628300 11331577 10909444
16622 10909444 10669172 10396318 10128320 10309600 9822911 9430527 9723258 9505177 9403503
16613 9403503 9043302 8572316 8324899 8279057 8198176 7943221 7753277 7692434 7276286 7243273
16603 7243273 7149211 6908413 6943000 7042447 6832594 6361221 6796500 6406041 6377691 6293109
16593 6293109 6048785 6192231 5936506 5783340 5428014 5570543 5734790 5310948 5242579 5145438
16583 5145438 5088736 4807694 4622730 4825719 4957467 4641706 4708721 4710911 4709329 4337419
16573 4337419 4565112 4730157 4301954 4308235 4407910 4230272 4333648 3833628 3605870 4040177
16563 4040177 3905276 3954945 3649857 3867018 3406613 3503166 3621930 3660172 3354199 3214997
16553 3214997 3505293 3132393 3411362 3416961 3158341 3348901 3126306 3215476 3007350 3250708
16543 3250708 3118116 2974296 2856062 2733936 2717070 3081459 2302870 2636143 2563400 2513722
16533 2513722 2449251 2693500 2458197 2604045 2473601 2377735 2411213 2428543 2341352 2545299
16523 2545299 2364461 2408638 2510313 2697822 2106683 2293830 2686265 2181455 2202211 2075192
16513 2075192 2218882 1979962 2304824 2210866 1959163 1976069 2000040 1769475 2126126 1925189
16503 1925189 1753814 2035747 1728879 1990767 1762304 2217758 1937084 2096341 1850995
16494 1850995 1710888 1590609 1882038 1656790 2127035 1469899 1508932 1785747 1554667 1608062
16484 1608062 1787188 1355628 1740601 1373615 1530109 1672762 1591563 1533095 1374099 1246177
16474 1246177 1885182 1499988 1424884 1270056 1450792 1417954 1548416 1600047 1331702 1453802
16464 1453802 1453740 1402508 1294951 1406385 1464482 1329743 1462075 1328024 1422767 999686 1100566
16453 1100566 1314753 1290793 1458519 1336089 1028872 1302242 1314354 1339704 1342151 797160
16443 797160 1017878 1166845 1095900 1276673 1495952 1119709 941534 1206725 979203 1376420
16433 1376420 809687 934788 766642 1211880 1186821 1144029 886165 1131043 772785 1335911
16423 1335911 909970 1092632 1121467 1016409 996950 1112092 767734 1020427 583349 908967
16413 908967 1158155 1055451 787608 787220 1446738 717833 910480 923765 1080871 760031
16403 760031 441587 1024892 1230775 870002 1035669 731118 746476 1118361 661216 842900
16393 842900 608979 1105286 718470 915332 913058 865119 1104726 938782 924858 905009
16383 905009 583299 617558 995915 818741 800766 653891 799733 739995 855372 1130440
16373 1130440 675482 827503 356195 685883 765224 718093 762517 787917 619309 704130
16363 704130 951705 712994 744216 737371 819785 570325 623570 1067351 512605 813552
16353 813552 576122 632933 565912 449467 547519 643099 440166 476457 761415 503824
16343 503824 659577 676794 583040 844569 837003 342088 410889 706300 610733 802600 642042
16332 642042 419884 553789 521650 622736 590263 475712 239293 569648 578490 634237
16322 634237 710278 126473 458008 558846 853884 613995 710020 462929 748474 493102
16312 493102 354589 553448 334040 435456 650304 576704 709608 246743 323215 252551
16302 252551 708971 637266 604604 689241 311722 563724 457977 492854 669966 436187
16292 436187 141062 429307 390002 657340 416552 558951 465743 253353 792481 586864
16282 586864 360678 376270 461443 390743 311393 139777 348159 390882 133046 107724 386118
16271 386118 689905 394626 198053 626129 624217 649610 201082 732727 275665 407724
16261 407724 339905 315877 439233 533660 659193 633055 503554 342649 396947 214243
16251 214243 667525 740938 479470 292247 269924 716201 567607 321743 403554 764349
16241 764349 552011 477766 37495 90527 704300 212001 507136 245130 401701 -2139
16230 -95904 344862 375093 224706 376824 418985 151057 206036 98562 150047 129739 257479
16219 257479 404006 160075 475450 225861 169981 184653 262926 244765 448677 469435
16209 469435 -86285 425997 362244 97561 347555 332947 453743 175104 148596 -158366
16198 251593 100648 195873 2683 73752 -109134 -7563 228294 -66888 546260 275418 275464
16187 275464 295511 302596 119136 57766 335511 419052 391662 -99430 243359 670113 276896
16175 52532 391203 383745 150737 -54161 243666 196681 231144 337872 266785 228357 469311
16164 469311 454791 -77939 251410 138864 22095 215757 34104 87684 96559 280510 331207
16153 331207 275092 174550 149898 -37675 212066 195212 118511 135600 122300 437281 134432
16141 21539 317101 94420 206405 152419 353239 -66084 -140925 289292 263299 -136949 44868
16129 95326 5405 -120810 37863 166415 135747 -120646 342356 -116218 290999 294360 197097
16118 197097 57729 155785 282602 17340 23347 -22096 241214 96071 255179 114937 93526
16107 93526 205100 520154 363026 394166 99810 170218 148407 -161443 37005 185193 96008
16096 96008 443638 258146 8633 177959 -7628 259308 350422 -212138 197661 113738 -42926
16084 -122314 13445 200103 138621 -223881 -70097 519095 -245554 -73041 -371578 -129304
16073 78036 100594 190853 324990 280824 -107310 136225 218494 23436 -406312 29958 -81837
16061 325319 -199912 146202 128898 205606 170703 202896 35069 -37036 263129 -175086 -146250
16050 -146250 -11271 327753 55912 165286 -318128 -130611 35064 178630 232799 172008
16040 172008 -19999 22787 31350 -126787 380629 -124782 162149 -125337 219745 69335
16029 5559 179146 132192 212264 41992 33809 268208 235661 7202 144206 279045 184519
16018 184519 -85381 179045 113029 -86664 210676 -44724 -125472 -223463 -113392 194217 202371
16007 202371 -165360 314534 -87767 76268 217321 -248128 -149419 73500 73413 42021 -25103
15995 -33997 170423 -127737 22107 179739 -242670 150796 -75431 100808 26051 195695
15985 195695 -277485 417569 -53296 -298073 -335339 326583 58320 -27069 -42174 94690 54575
15974 54575 412691 411938 925625 1017673 982201 1226037 1175937 935095 283623 473579 137441
15962 236586 311745 269573 -131434 -97277 188849 -28834 203839 39311 -109209 -91166 416652
15950 -284546 94286 193309 -144762 -133547 -76947 86282 -78929 -92528 -251915 -382899 82290
15938 24921 383440 -429241 -193863 48308 371019 273603 2745 167030 -119520 -95639 -2223
15926 87174 -324354 30249 -156790 45464 71733 126703 -164696 -77562 141171 19255 -100642
15914 -297338 177681 -1887 159053 -127367 -14243 84938 158034 -242137 49707 73328 196864
15903 196864 -29837 -230716 -380689 -268062 53594 260480 -4125 -184692 -95693 22601 -31873
15891 -263413 15255 -140313 155800 -10820 185001 339817 243968 -231689 -243343 -207177
15881 -207177 -23720 162437 -83093 -218910 248957 79263 -170303 -107955 -163917 -95444 -119455
15870 -119455 247718 70236 -102080 163295 89164 116348 -225521 2249 -298337 -166755
15860 -166755 -378554 22717 -257649 -112099 -179063 4988 -5926 -163379 92292 95659 -242177
15848 -207827 232491 -47350 -269906 -334386 -108110 -50395 -208798 -91320 82830 9528 167074
15837 167074 140056 -109081 -132225 -237850 102579 -113968 95335 -227702 -15021 5707 123904
15826 123904 -68447 -356285 -131814 -162043 114271 -36410 47415 -311025 -179117 209768
15815 -67846 228849 78614 -288974 -208085 22374 119077 -231534 21523 -181581 78840 -145533
15803 152684 -58685 -21529 -164442 -121112 -26432 -149412 -318511 145715 -89204 -171449 -111239
15792 -111239 -203373 188336 25708 -51623 171878 119123 -23755 138714 231681 -103356 164
15780 212385 34160 -36863 376776 -32615 66969 156411 54146 21023 -136791 -170749 -550284
15769 -550284 -164325 -378768 -159583 -87059 -104633 81167 73734 -27766 -356070 210423 -1765
15757 -253194 -302844 -13615 -97621 -89314 -223197 -89019 -116071 284408 243193 35221 -43606
15745 106794 170231 113854 262103 49928 157851 36527 584877 -41926 77293 -79186 62117
15733 140293 9132 -28869 -17645 107674 -227744 -74915 138775 77061 64223 -281609 -272840
15722 -272840 36630 -101859 71569 215525 65027 24996 -60929 -66173 -258479 -28121 78718
15710 -67273 36585 -135831 -405719 -206715 -26737 7988 -13899 -51364 72067 69985 186494
15699 186494 -176492 -310925 151990 -197594 -43923 -364519 -47351 -569885 -81528 148739
15688 134117 -270755 26922 242692 288285 32542 42398 -125077 34304 -165100 -23772 29273
15676 -54306 -167352 -45242 4040 -96137 41517 -21612 125648 104358 -63262 -264639 142436
15664 -108915 99531 -312628 321627 175715 174140 -99935 98128 146401 44027 -37999 108486
15652 -229183 -34455 -524365 -151884 -181061 152507 -99825 87083 248365 -293567 -17354
15641 -127878 -126569 28288 -308399 -177515 -211662 -529 144443 -473516 -170283 130713 216108
15630 216108 160287 91205 -318329 -115269 -154690 -4662 -16477 105932 -18068 178919 48572
15618 -151310 -294141 -99256 -349079 312175 7329 211101 -103588 -255160 10412 -19281
15607 140795 -157089 -149554 -54465 8966 88659 -157192 -226849 139748 -322648 -179433 -91030
15596 -91030 21728 -479389 250862 256935 -273204 -77536 -146339 -218361 240757 -66005 196612
15584 -44957 137843 51061 -234469 -49604 297065 119134 -94509 -135488 -100199 92607 -552966
15572 361707 -220527 -423526 66420 -375525 -286477 -220482 340586 -382266 -217399 -71123
15561 -98972 63291 104452 -36954 24663 -246558 -102363 45106 50485 -123773 20560 12524
15550 12524 216095 72298 71937 370793 -205580 94807 207249 153988 -80717 -63392 153990
15538 27947 166569 256043 -94745 -140887 171240 -68509 -337415 -730 118880 -112986 -113622
15527 -113622 81048 33497 228374 105116 -177895 -75782 18352 -143103 83924 -166388
15516 249183 -261171 -142906 146605 47379 74063 -164294 157510 -218530 357307 13202
15505 -89441 -103582 316616 220311 171214 323423 111835 44868 91918 161757 173586 342949
15494 342949 -109701 -5941 7070 240023 -12217 -22016 227735 144431 -212049 -133710 -141891
15483 -141891 -268947 195712 436202 -5586 169240 163937 447224 240770 -39908 -186939
15473 -186939 100705 50081 568557 301252 78601 158057 165223 -26529 5300 550143 131134
15461 478516 50382 775577 787364 859340 428430 262498 40570 91853 248265 259221 -138098
15449 353616 26963 329923 59608 -160919 -26966 46801 -319399 105369 -37420 125737
15438 -246379 -97183 -26719 81411 153610 -266573 -21951 228185 134367 350490 332212 485248
15427 485248 727763 893619 1318383 1069741 789697 328752 399247 64536 148282 257547
15417 257547 174452 403369 94129 -46307 -80645 -10153 -30804 313085 10128 -227420 -73408
15405 8089 -59971 29486 -45966 191029 -83423 -213033 -50814 55559 -24519 23463 -41199
15393 21141 -280374 148185 -194488 -12385 -13534 -120062 -371597 -91712 -384123 -288882 -193860
15382 -193860 -179054 112435 384117 -127740 -241624 -23694 -56955 -122287 -123536 85157 131891
15371 131891 72941 -28922 -95023 -15712 241843 -51135 73224 -108126 -127166 -130008 -36285
15359 66337 222695 181611 116940 73006 220744 327551 60140 -20530 122019 46271 280911
15348 280911 40498 -99329 86628 112043 313080 -3278 470809 282352 249833 306563 272121
15337 272121 564847 56795 251983 141874 68670 338489 316048 194335 278042 355156
15327 355156 327363 609781 392319 142928 308235 333744 150755 -30076 338392 -24592
15316 147924 -112137 25348 63372 85097 352760 -85326 285027 -33509 176496 91725 234753
15305 234753 200242 204607 368719 26333 85937 138949 231136 312964 187062 47276 458383
15294 458383 -177788 295391 207679 -177333 148354 207732 -56892 -62155 409003 -69271 49046
15282 311326 331989 78739 -19166 221950 -183304 -242757 176900 -19206 27021 260745 196584
15271 196584 -263027 28865 -134070 -25883 -146970 -29716 -36151 -52898 -92592 -14616 154075
15259 93996 -27216 -104374 -70370 -236388 68781 244160 157053 -19581 360618 274532 -188513
15247 215612 -93000 11294 105048 -112755 -23976 129278 74555 310241 5328 182567 -76392
15235 315087 33432 367490 247654 138554 488017 419836 616418 1040092 1319823 1241798
15225 1241798 1301706 755316 427675 361523 100001 285812 -67045 286702 -15593 -257684
15215 -257684 -164682 312325 159489 189095 -89814 90662 -232547 529 -180656 -15467 -52052
15204 -52052 233318 -2693 217183 12145 -268482 258698 -17234 -112251 -255730 182435 -89885
15192 -221002 4538 -32638 65947 -26259 252950 47873 -249188 209496 95636 228442 -6463
15180 -38839 -54531 -4467 119533 119709 334949 -189759 -47277 -122866 -208463 159781 -288353
15168 -236858 306448 337748 134164 266467 155613 171028 37014 -172082 207 -248564 179993
15156 121807 -215647 108893 68201 -537610 -312475 -137539 478418 -462774 -166006 130557
15145 -163733 133322 281153 21645 261111 -92582 521422 41432 316474 22862 -113689
15134 28158 97998 -21685 148472 -71351 134775 -184909 297902 -82606 -133821 246838 59815
15122 37709 -208008 121207 85946 3821 526679 96931 448603 -118862 110690 -50039 85775
15110 70818 -77830 242581 126981 303340 285293 273288 321105 318946 150164 159218 282431
15099 282431 138791 174266 10549 7551 51165 494864 -42052 -104644 353243 53364 1755
15087 545523 -111007 316475 258941 201941 -23649 219393 115743 409063 109174 -54697
15076 61926 346921 30708 311674 -62865 91570 12394 115112 183957 42826 -239938 55767
15064 133168 301753 276276 -39245 163130 39306 -26666 275162 204482 385936 113183
15053 528889 59142 -18583 -50745 417408 230306 348022 -48423 226700 61497 281743
15043 281743 267388 516827 93882 391653 276936 353095 277188 -5568 306017 304314 395942
15032 395942 242669 162679 263173 334541 316842 416679 420284 423799 157114 334492 149166
15020 108029 518727 458614 459032 365370 135625 639332 538468 535540 985733 1006344 842063
15009 842063 374176 714669 535417 607184 423340 419658 263484 669840 309449 154530
14998 435650 596148 533035 515060 676971 257479 511723 563443 263807 647585 375235
14988 375235 125253 303400 655260 384592 625480 393444 291061 55876 562220 541882
14978 541882 778786 421261 622923 211879 537430 299213 704001 314793 697552 352057
14968 352057 741232 782556 742574 894975 824414 674078 689627 527239 431150 501088 571048
14957 571048 734583 782615 649962 552973 609065 196189 533230 352056 566020 665864
14947 665864 342340 628092 467676 110852 76915 47162 165301 53782 116797 200260
14937 200260 368369 407095 266084 255441 700678 548340 358532 330988 938803 897463
14927 897463 862738 627794 451198 473206 654362 549653 721999 597256 589604 719467
14917 719467 911846 957158 1299612 1520248 1326580 1610817 1162500 1802846 1956982 1686672
14907 1686672 1990240 1561345 1776782 1642399 1815058 1868055 2224444 2490339 1825516 1431085
14897 1431085 1532890 1382630 882944 757675 797403 503122 801179 469211 329736 445146
14887 445146 799238 393541 179847 387726 232048 681888 366612 551212 428478 670428
14877 670428 96528 533859 550963 495305 411860 461271 656176 286701 605711 647492 916886
14866 916886 946344 1107677 752371 818772 283845 973210 808050 675923 487038 547329
14856 547329 840564 801838 732698 534455 893624 521934 929659 1280604 622572 528113
14846 528113 1061685 314093 620864 700275 586433 386569 249973 556459 572258 559427
14836 559427 707605 435468 489111 746075 365800 982745 845354 893496 902619 959708
14826 959708 882221 1089943 933522 1280055 1156222 766332 755848 818336 555976 576675
14816 576675 509509 441207 452517 528092 826142 544237 848034 258798 485540 258649
14806 258649 672656 936855 567860 847717 961066 892196 824610 1003618 453614 719055
14796 719055 915590 352512 674464 659482 660562 649496 877765 1055114 941603 732037
14786 732037 865284 861702 866706 809803 448479 920554 754253 718403 592408 592866 576054
14775 576054 479272 496782 754283 623761 772268 741550 714802 612877 697535 857795
14765 857795 580677 628081 697992 576531 985840 1192855 941473 878577 817463 960266
14755 960266 928583 999980 517732 836316 784217 675524 511362 641694 365539 777298
14745 777298 644585 354879 513492 812557 382247 515098 792112 363606 816882 364786
14734 791967 638979 735532 569969 600113 304277 711173 722447 879215 532239 663217
14724 663217 1189913 1025548 790609 773558 938531 575901 706461 780292 1027762 1177658
14714 1177658 1257913 1405380 1558269 2071977 1732922 1560178 1536653 1354759 999073 771661
14704 771661 807346 958602 785757 1130376 727979 980087 963745 485501 525147 729058
14694 729058 904962 1093685 898083 1220901 979161 1391327 1280971 1629415 1674408 1780145
14684 1780145 1835094 1814601 1395100 1247837 1107947 1359993 942313 894588 833116 959144
14674 959144 663154 1181805 884668 1033872 1045615 977340 793872 741621 799134 918025
14664 918025 922058 1126260 599593 943881 1115280 1211080 994927 952341 898938 983200 985760
14653 985760 888613 812263 997835 798515 989860 1230968 692230 1039233 1169430 576924
14642 1034638 1131979 948968 1071763 1179084 1289815 1312467 1321503 1453947 1165412 1276367
14632 1276367 1082388 1343446 1405226 1286011 1546065 1249771 1251867 1434959 1006450 976824
14622 976824 1307440 1219266 949213 1166332 1137308 1474122 1158235 996090 976659 1101607
14612 1101607 1189085 1125336 1305367 1290090 1290410 1440382 1365631 1377814 1310681 1733819 1461387
14601 1461387 1401910 1322955 1634016 1425018 1419573 1654901 1449242 1349049 1716863 1432581
14591 1432581 1157102 1179659 1525275 1410556 1465551 1411801 1595878 1598078 1491736 1649398
14581 1649398 1530604 1801054 1263310 1373622 2061691 2001469 1372948 1716708 1806993 1824190
14571 1824190 1396333 1605448 1937878 1741331 1892901 1753380 1967084 1850147 1765245 2064314
14561 2064314 2055190 1935541 2216698 1649834 2236542 1844361 2123173 2298379 2498872 1852065
14551 1852065 2512820 2260121 2465615 2612649 2305538 2715320 2996672 2447150 2901822
14542 2901822 3164269 3639401 3877787 3891914 4474545 5018534 5838061 7384341 10285598
14533 10285598 14364076 20974983 31586977 33468750 17970407 9919591 6577329 4616716
14525 4616716 4147148 4134097 4817068 4236896 2887202 2334052 2456925 2262797 2181615 1899680
14515 1899680 1903510 2181980 2207105 2335661 2201605 2020243 2205537 2271853 2479743 2466294
14505 2466294 2675263 2432324 2399023 2402197 2365818 2474378 2669660 2470792 2558133 2440223
14495 2440223 2719787 2608058 2628008 3028490 2739519 2672664 3011006 2728343 2995978 3076710
14485 3076710 2854307 3225564 3021423 3114942 3118879 3402258 3141783 3119157 3013716 3459031
14475 3459031 3073762 3375199 3603108 3144050 3477625 3656107 3594577 3783832 3652680 3442975
14465 3442975 3653692 3743022 3787818 3821577 3836681 4377824 4077797 4031757 4161774 4196027
14455 4196027 3869246 4340953 3904574 4471751 4563580 4235890 4620231 4795534 4607940 4662236
14445 4662236 4835251 4809138 4826130 4944273 5125262 5023690 5141473 5132047 5113931 5532827
14435 5532827 5479092 5391855 5196929 5888268 5696335 5545424 5765690 5983538 5961838 5889035
14425 5889035 5880171 6168929 6128855 6144229 6287661 6615779 6316928 6447954 6529560 6632053
14415 6632053 6948134 7014259 6841722 7226316 7259177 7209550 7232522 7970000 7709384 7920423
14405 7920423 8054465 8448563 8072349 8587463 8905342 8852228 9143800 8731512 8564992 8528241
14395 8528241 9000246 9113568 9148931 9554372 9812724 9907225 9739868 10424635 10703021 10576956
14385 10576956 10521351 10877602 10827574 10819202 11209927 11495552 11610129 11705786 12131985 12112239
14375 12112239 12546848 12706519 12643053 13067632 13343072 13626032 14057929 13775653 14345978
14366 14345978 14571453 15101573 14967131 15531822 15617131 15927355 16266427 16576701 16803598
14357 16803598 16902183 17658478 17947664 18061342 18765209 18752460 19463437 20018971 20465555 20899083
14347 20899083 21059143 21666410 21821278 22440103 22888918 23669990 23722405 24579090 25173663
14338 25173663 25647544 26264163 26987673 27712301 28221870 29178125 29777120 30324067 31256921
14329 31256921 32110286 32914342 33932789 34828183 36302873 37112779 38374403 39364011 40583664
14320 40583664 41516989 42999151 43967468 45289319 47009216 48647989 49794163 51621526
14312 51621526 53485394 55173446 56735104 58783246 60799374 63024184 65378674 67889172
14304 67889172 70401118 72924732 75762238 78489751 81394455 84451873 87829620 91310046
14296 91310046 95296308 98970933 103457688 107864289 112663437 117417657 123088454 128810369
14288 128810369 134527249 141022680 147953671 155125099 162472876 170651233 179158542 188302368
14280 188302368 197620561 207854375 218182422 229672916 241247240 254052449 267300441
14273 267300441 280844297 295385305 310083247 325232813 340407407 355689179 370592845
14266 370592845 384472808 397818786 410978420 423661938 435455914 446671264 457055385
14259 457055385 465698173 469718606 472018005 474710779 477706870 478671169 474542220 467726554
14251 467726554 459289326 450540463 441198209 428419244 414724689 401371538 386129362
14244 386129362 370529695 355423810 341114454 326228796 311816852 298142268 284791194
14237 284791194 271159376 257796623 244584327 232851618 221468118 209810182 199242605
14230 199242605 188875894 179696542 170645742 162371502 154746362 147488581 140458678 134293686
14222 134293686 128272512 122151156 116915001 111779961 107206927 102732773 98936595 94821868
14214 94821868 91020359 87232679 83890762 80565758 77403549 74887840 71838520 69407975
14206 69407975 67079047 64880618 62415343 60171909 58480890 56579349 54951111 53203334
14198 53203334 51750763 50124168 48426880 46983955 45403187 44349451 43574088 42152366
14190 42152366 41251329 39804140 38674433 37792987 36750556 35988855 34986663 34147227 33163051
14181 33163051 32415973 31418019 30444344 29727553 28979334 28152889 27964450 27245162 26800748
14172 26800748 25960647 25184839 24825074 23931313 23428458 23245192 22407976 22361734 21399278
14163 21399278 21116334 20530995 20614921 19801333 19984724 19018109 18799179 18473348 18215341
14154 18215341 17813227 17635887 17127908 16518627 16627788 16163352 15908494 15792704 15278786
14145 15278786 15103616 14792875 14774225 14329655 13986320 13822281 13589554 13530137 13157271 13089751
14135 13089751 12996404 12552053 12237450 12097988 12051877 11844006 11228765 11341558 11272711 10987541
14125 10987541 10952031 10641457 10502471 10295714 10372337 9920918 9919054 9881923 9940868 9365747
14115 9365747 9199461 9019609 8959027 9284882 8932799 8721785 8584826 8680978 8456154 8286570
14105 8286570 8096439 7784832 8084442 7775856 7703109 7840190 7451674 7419972 7750404 7161278
14095 7161278 7316152 7020297 6868445 6907103 6978445 6542163 6791495 6676111 6399340 6231286
14085 6231286 6406638 6299348 6071038 6207251 5912541 5998581 5998681 6061248 5786706 5742605
14075 5742605 5744712 5652978 5503327 5697385 5032371 5126652 5339578 5129221 5245086 5437956
14065 5437956 5020015 5239302 4704882 5116816 4897973 4912728 4562940 4522129 4807146 4643378
14055 4643378 4348168 4774919 4517893 4745107 4406606 4452664 4526065 4251609 4990212 4712093
14045 4712093 4595905 4316864 4517623 4170652 4202654 4200362 4140144 3770529 3693021 3996025
14035 3996025 3876079 3849140 3955834 3957134 3568420 3797643 3437383 3430138 3521258 3480890 3502756
14024 3502756 3158674 3343966 3468796 3464854 3335528 3372271 3353715 3401890 3057950 3503939
14014 3503939 3368096 3168302 3056818 3046807 2952348 2823022 3026499 3131782 2843096 2736086
14004 2736086 3002807 2571422 2837531 2696062 2790856 2825931 2411045 2335917 2824002 2398097
13994 2398097 2728866 2580611 2618832 2477025 2771536 2467235 2562201 2258131 2206499 2806929
13984 2806929 2192317 2496142 2845302 2896336 2710349 2871103 3024467 3212180 3708490 4935222
13974 4935222 6601295 10434548 16310286 27010476 36017945 23272880 14344464 9698982
13966 9698982 7428638 5950754 5135519 4732275 3938147 3552646 3769167 3333983 2867078
13957 2867078 3298431 3015215 2898626 2690020 2780991 2852283 2611625 2508200 2297014 2559880
13947 2559880 2279850 2155665 2065101 2391632 2212539 2170278 2519078 2485423 2107978 2009146
13937 2009146 2041228 2279503 1889691 2315011 2108114 1838223 2021723 2173326 1544652 1955673
13927 1955673 2170027 1802616 2325119 2142863 1821596 1627840 2132136 1588001 1659502 1789501
13917 1789501 1608460 1571670 1592900 1734598 1720372 1680404 1667987 1639787 1638325 1806802 1493020
13906 1493020 1635496 1706768 1655576 1700363 1451125 1567474 1773538 1711708 1500461 1477323
13896 1477323 1355609 1565111 1433853 1580965 1777067 1403501 1515299 1239080 1435913
13887 1435913 1496899 1663219 1757647 1336272 1581758 1461730 1256316 1605880 1362126 1269794
13877 1269794 1572937 1750599 1382223 1338614 1059570 1506629 1158078 1521308 948202 1491004
13867 1491004 1364013 1213054 1363862 1302906 1584729 1137667 1082559 1475277 1291363 1344466
13857 1344466 1277848 1100038 1115420 1232200 1198205 1018601 1444448 1361395 1174771 1346349
13847 1346349 1167985 1014263 1245547 1257203 1095663 931151 1187207 978404 1251953 1033509
13837 1033509 1241708 1304490 1400226 1116074 1204336 1168326 1339425 1053053 1011863 1018446 1052732
13826 1052732 1098742 1099309 1133643 825031 1215056 1013333 890409 1173510 951105 1000500
13816 1000500 896116 1437871 1152948 1242878 759468 807030 1088726 1091897 1416281 876955
13806 876955 726971 782714 1232058 1077212 751328 863399 756279 838553 639163 1357997
13796 1357997 1139249 850150 973316 1058940 1012533 1091183 691037 863793 845026 964907
13786 964907 800777 802120 891071 818066 1067665 970177 988714 818535 753268 1172980 668278
13775 668278 799109 598287 897336 678267 827108 610567 540474 607619 1084029 837366
13765 837366 1009392 715738 621462 997248 381507 854080 519351 723298 666313 865225
13755 865225 546679 837009 935249 904577 590731 801685 617454 1055041 853935 601793
13745 601793 611352 942870 544514 829516 507670 650474 694869 671627 502836 635874
13735 635874 956948 709260 812578 697889 520955 388974 689281 653920 545301 947165
13725 947165 428125 719884 678260 713718 323433 714807 663515 719407 767554 678883 698970
13714 698970 262742 633975 366609 509176 859039 838406 642264 633920 579103 436108
13704 436108 371934 646389 654849 471005 634818 448055 853915 691548 465818 521309
13694 521309 603463 475482 668308 720166 693336 389811 518937 550515 331444 473408
13684 473408 603753 722232 549892 447720 581363 653716 589655 673377 189468 538380
13674 538380 274521 533192 598638 748091 746101 561459 454123 531363 728616 911560
13664 911560 881528 205864 637518 587436 294453 227627 371530 497805 191669 629907
13654 629907 605596 621203 702078 369221 543881 624789 579368 680684 518604 283797
13644 283797 436469 393504 559200 666356 372353 682264 134645 166839 626230 736281
13634 736281 490941 86491 400032 480189 393255 602466 589980 289715 469819 449775
13624 449775 495143 255756 728422 185598 655851 72195 456357 305039 654366 537184
13614 537184 369866 487217 674284 523723 295876 599602 202976 805124 752789 547855
13604 547855 320006 710691 607006 522701 409102 787630 219526 212599 394533 267720
13594 267720 311768 511200 227627 487548 374316 521897 337627 465131 346603 98969
13583 574650 430447 682025 603152 537900 284985 374060 122303 472979 206818 310811
13573 310811 572991 338800 490830 565806 445985 383992 260076 343319 298769 387771
13563 387771 366749 581976 321912 325644 411518 311588 489682 252454 349674 399510 298462
13552 298462 417156 567673 237554 522283 382723 109378 116071 522384 417465 283661
13542 283661 296220 376957 830206 -26935 -42038 406289 453641 290990 478104 126267
13531 199389 651668 -60354 483827 727348 243985 576287 397954 328399 214429 272896
13521 272896 277094 358516 436566 -140211 252206 320629 55018 263205 164067 456872 478917
13510 478917 261813 521785 350495 496097 173565 54900 351028 424792 433556 374698
13500 374698 436513 65611 299659 348446 377009 373661 271127 364314 129888 233635 222601
13489 222601 451652 628621 206924 425630 239112 348265 327781 455298 296404 487698
13479 487698 159234 347146 469570 118700 78789 170577 314616 167741 -79006 600682
13468 426011 530261 442454 293701 32315 18965 388871 152774 111340 119892 352644 -90466
13456 452840 -76897 -108450 446012 294283 598965 9890 -46 91585 490920 -88639 84349
13444 272441 39005 300783 -6857 255796 202140 49229 130004 468592 653115 114420 212323
13433 212323 146661 367123 -195641 90881 151433 80162 355690 461059 16339 461551
13423 461551 597858 414406 -4440 439967 220362 310184 321631 251738 149095 460997
13413 460997 416544 391316 347856 68470 337491 553814 -20353 38148 -129156 -30570 342073
13401 442287 486262 300095 22928 99979 -5222 358701 47904 453586 268194 -2101 156281
13389 266931 45317 14600 365870 390739 285295 125211 317313 258701 471120 213174
13378 129821 165587 65057 12586 21162 20268 93429 482028 -15491 266408 24699 -58418 -32314
13366 -32314 142418 251200 271731 89402 -55109 47961 268049 300966 199877 427362 342603
13355 342603 227862 -153829 375686 236395 263743 189117 212679 187293 123095 256115
13345 256115 -3682 326778 174220 94198 84329 319202 191383 89582 299320 300209 312905
13334 312905 450894 181528 319480 360232 273608 260932 561301 -28577 65483 460647
13324 460647 -97991 298012 444427 197787 100541 -12067 177988 118838 131220 186949 385283
13313 385283 508675 60988 32348 194566 17330 182971 246742 -28919 211529 26103 550660
13302 550660 521167 296083 -369278 393318 528035 410632 298108 -93446 -169042 10980
13291 186158 54242 87675 31257 239759 46091 -118471 30188 291917 223378 -136385 36550
13279 -45742 208391 181283 344020 314054 473075 157125 134119 -133354 265791 57554
13268 130452 805028 -104390 140931 -237996 90389 -22768 -196049 176781 196528 31890
13257 307592 124699 243707 248241 267907 108390 78063 -76442 278180 186119 199671 242506
13246 242506 214156 231875 40247 -7239 318632 272099 -72939 211281 266326 310367 116080
13234 245366 212534 434032 -28046 281794 170088 330524 394673 -446717 344944 317674
13224 317674 -186517 366308 337743 49554 187349 139692 215785 74654 172319 62909 175695
13213 175695 78687 -10781 122056 182388 -223336 415895 57529 324082 368431 170890
13202 408028 -92067 79917 -201493 112159 141351 158209 459476 -119395 27060 257641
13192 257641 142315 -8091 -51194 140776 292600 54592 133156 20294 372541 275421 503455
13181 503455 -313022 214641 -169301 -22840 14015 47247 -8917 238716 312612 276172 47953
13169 -87881 83069 -170361 401118 -38761 263740 118513 358589 420631 -31750 215133
13158 105369 337735 -44613 234024 12378 401546 145589 -43113 350743 -181815 91589
13147 210527 -246334 147092 -154196 152344 58991 73161 362489 27453 111753 93117
13137 93117 26608 303726 156407 -10360 -193777 -115034 83151 425402 83057 146262 -5499
13125 51647 -88280 100144 162239 283427 -156724 178590 102782 46277 134849 293891 207244
13114 207244 100562 213324 -79432 55334 -243707 34092 296753 188226 -79280 37136
13103 105638 101072 245797 -45406 -131172 217855 384573 179291 291678 173914 498600
13093 498600 363924 -171845 -11724 253484 -164945 40018 -409094 280626 122612 -126301
13082 -53718 -6592 204270 12114 110984 -88972 14291 99188 -187001 135350 241011 143382
13071 143382 -86926 -566 49620 262498 -260094 -217069 13457 -55492 271672 130018 -149694
13059 173368 248024 279172 -109422 35340 264457 89404 311513 -175344 83603 160341 131516
13048 131516 63080 -74961 -44459 -283133 172452 285564 338695 -74949 14879 -36700 -223368
13037 -223368 11294 318760 182637 -141739 190543 306741 95118 -224332 106599 -379221
13026 128628 -25402 -294692 137754 219287 215025 437921 81028 312151 275725 378320 327420
13015 327420 110085 216543 84159 -308425 135147 56481 -130383 25841 -12867 249102
13004 387159 148287 225451 192433 178012 -40538 173203 -193563 252236 334937 -11195 221199
12992 295717 43254 115308 96790 321320 17606 25743 265994 71701 -68088 55818 -102229
12980 123693 -180434 103700 -63341 230628 -13114 -88855 -79160 139882 -210700 187360
12969 102850 2661 -191485 260406 240006 486736 -55798 -23026 -88041 11741 -89977 48651
12957 -69939 21059 344628 187585 101959 73799 -64725 246316 48635 66095 135374 202731
12946 202731 -244709 -5855 232405 160501 149101 185588 53541 68189 85141 -133625 423697
12934 183126 -37855 14820 530875 82687 -169628 -97839 181041 -417131 95072 -96284 -81785
12923 -81785 120663 116256 125782 -218250 -123920 -91419 193479 363356 32647 78138 284706
12912 284706 -25498 -208553 108228 10356 112657 -31176 -171245 13527 48195 87671 -78804
12900 220063 121782 -7597 -127889 103679 34759 151661 135308 -133784 -170763 -5433 285477
12888 253243 294845 -212952 -187111 3912 258846 -5817 155108 47209 -149109 149310 217905
12877 217905 112609 308096 -171843 38879 -66514 -140107 -54557 481257 -21012 136664
12866 7582 97547 85233 242465 74810 97202 -29989 -197171 167034 -29898 169284 -44815
12854 117821 410265 -214568 113723 -130882 -245495 90361 86326 -271364 -16272 38812
12843 208214 154116 115740 119475 -155273 -174689 54216 221919 -144851 219407 66127 35061
12832 35061 231624 56908 -195404 -16579 5399 -46061 46751 260712 -33289 83884 -170002
12820 -235057 216153 192774 -135937 266891 334104 -109223 180971 441908 228757 -201414
12809 232860 -204532 129504 279239 85863 202727 -90488 -33745 182196 -121675 -157778
12799 -157778 -43881 -32544 -65351 -149351 -78849 -159942 173485 -109066 135271 96375 -25833
12787 -9569 43096 415 20400 -229249 -174553 -366593 329224 -66614 287061 459399 -3628
12775 27944 -34162 -329551 -108662 -132127 129522 -8925 -73316 8813 213450 174217 257757
12764 257757 166915 -113807 -226112 -86804 -125775 -156034 206372 -110334 -71971 211399
12753 -55229 -89025 -72356 -89337 138923 -172546 -138476 -12682 16844 276728 -78950 -145788
12742 -145788 167311 -177442 -17140 16393 177035 42228 8263 134825 143781 -116629 -35472
12730 -243640 120442 74637 55187 42003 251382 -362388 -154607 193634 81687 188696
12720 188696 13688 75046 -202950 169273 326319 -95797 124007 42386 30427 61561 -133438
12708 66149 -238501 99920 4582 -58701 90577 126204 -191298 33059 44162 87452 -144487
12696 -45472 -147766 264320 161519 158856 147332 -15752 386656 235642 260451 209349 306138
12685 306138 -152700 48798 249795 -76171 -22909 269826 -142991 273457 182172 16525
12674 172970 226678 -42864 -29507 486727 193825 -261961 -43668 245545 -13419 324020
12663 332751 35537 59577 110991 -27142 120582 146662 -133789 80944 -52998 -6207 105201
12651 12812 59781 -142718 16798 44917 -3971 25659 161027 42079 -96071 -162528 350778
12639 206951 -282746 -81322 201025 362788 199542 188508 155646 -139065 -108220 238579
12628 -21484 148105 125115 -336121 -332117 61691 -112106 -252433 -100776 -10521 155887 -58628
12616 -15849 274653 348415 216737 210415 165630 176351 162208 188278 388217 344726 -197865
12604 53843 15845 51841 15116 199605 148201 65947 -16408 346190 79100 82969 53080
12593 53080 185131 -125033 -56385 -37819 186447 221 37336 110449 139494 -95781 248567
12581 105192 19395 -200388 -259476 -110480 219986 -47772 20036 -137044 54273 115811 -71876
12569 -133036 136085 33601 22361 194094 406428 -69106 87343 149596 -256285 88581 101135
12558 101135 -39706 -12294 -134513 -167750 14165 106056 141008 -19941 430220 -112947 -171692
12547 -171692 -143490 -251016 -255936 -188595 339673 19624 108646 -78164 -74228 215726 -162846
12535 218382 188067 -68638 154152 22225 252515 -125081 -140855 -81544 -18282 130969 118803
12524 118803 -7337 36202 -6144 -141712 -352300 -73439 -85918 106322 115614 85516 -54955
12512 191140 -195609 206938 159412 -25181 325335 142024 -101750 -405052 166817 164866
12502 164866 -82498 -275488 -99830 20695 136846 4275 -102302 308219 429071 -303680
12491 -131983 164841 25329 -196944 -2482 112412 -70354 -144358 -8855 -12139 59606 -7963 100266
12478 130371 175474 -265877 12898 -100067 285479 -160646 -105179 -11272 -189671 319267
12467 202824 -94017 43988 -212843 -136731 234006 101830 69115 -289782 -86063 8230 -344017
12455 89017 -32351 131852 3566 -95391 -326017 -138205 -127747 53090 -234708 103052 -37428
12443 -56167 -97457 -299342 272476 86227 -119304 230132 -211477 -68702 -54210 140952
12432 -150786 101566 -177053 -41603 -125817 -380171 114694 -131189 44409 4155 50741 132510
12421 132510 105055 -24020 52872 -247717 148332 -117549 -214115 -75969 214278 237774 124424
12410 124424 111052 254178 40116 -292346 47907 -155486 98023 261042 -25051 146774
12399 -60986 -120562 -335128 26613 -15805 -6778 7055 57583 6274 23206 -267173 -22538 10207
12386 123164 -82435 -40147 165501 14328 -107936 -49380 -265943 -212829 -68758 203299 -352812
12374 -163620 -154449 191759 -88852 162908 34379 -131861 496163 51708 193310 -149991
12363 -80565 -192872 38353 185130 79998 1364 11141 277472 68288 -110881 13577 80573
12352 80573 489411 -137338 -102173 1553 -207000 -254401 4130 -146593 165970 -310832 204806
12340 240824 119 166247 -234071 364608 40523 239218 182884 23028 268794 103646 136294
12329 136294 199956 -35818 52767 -41131 276385 185967 9521 513258 92547 171848 351716
12318 351716 -14503 78005 311059 117709 286540 37795 287044 267633 50191 223337
12308 223337 151124 342547 412348 231260 226030 505001 135393 20169 221321 -140372
12297 217193 223119 232629 84850 -62323 199865 165605 182398 233795 303333 397555 37025 40023
12285 40023 133754 280190 -85910 -48518 303091 108685 166878 -156499 178633 -55701 354071
12273 6739 238438 176093 340177 -102851 187831 139855 56034 384515 -54596 179953 -154550
12261 146595 164537 -84822 -224901 75442 245237 -70036 477968 -296805 30674 -31821 113093
12249 163417 80658 457994 92769 265656 342817 60579 46109 330969 -166268 123512
12238 314153 -78639 95970 126321 29435 163427 97992 637673 -170997 -62793 14610 -159340
12226 -66922 72657 17057 69085 95211 159195 11316 -207170 -70586 -249647 84439 -56583
12214 294894 -83797 218791 66972 92980 101059 6469 178454 359152 56933 42755 99422
12203 99422 407792 -29109 -167578 403667 170086 -305299 -27556 -8843 421534 -609 251603
12191 -17157 -52731 78240 64914 240008 176323 370842 -6208 -114587 -52872 232055 130178
12180 130178 84726 -12590 385104 236203 101284 -120401 -8364 1325 261544 -109669 5605
12168 -88121 59130 229197 35354 14926 36553 207106 -3054 -46086 402775 140890 266798
12157 266798 -188310 523788 380225 141190 95044 137253 -189777 346593 462473 466790
12147 466790 100181 278811 517870 311666 491914 453004 -102282 -30305 133906 170802
12137 170802 -633043 118850 -65773 175292 -234559 176128 -68713 32148 213490 -19780
12126 -290008 -26051 60585 485911 142573 134255 31251 287591 -113742 -232191 100725
12115 162839 -282157 303567 154246 -196863 45350 155275 127081 -47679 189967 329383
12105 329383 174699 245160 426816 48694 -41718 49796 380256 64281 112571 241354 58543
12093 371129 -60621 231816 625474 -148216 187063 -142625 -142201 217628 40653 196638
12083 196638 267374 -11937 133100 -68622 91207 -11560 279244 -218643 233932 53538 222785
12072 222785 -249037 124214 123211 85929 255656 510907 -63302 205724 216240 17767 327859
12061 327859 168918 165929 1808 19735 114027 273988 -25549 -238340 17838 189088 182968
12050 182968 -264685 88233 186261 56722 -2054 -64176 -20664 318962 -168896 7542 150549
12039 150549 61760 77234 129641 125463 208643 -57792 96917 103021 -109413 326463 -6020 105556
12026 -97043 144960 -171878 -342515 -72469 -201291 56442 81665 -200008 202569 62407
12015 241874 -62434 -135541 49101 -238446 44545 235589 59447 37805 -87524 136612 -164652
12003 305028 71691 254965 318115 118199 39926 82169 3297 98357 258703 -218446 20543
11991 79886 92621 -144952 11801 2179 43422 -37993 210567 41628 -179100 150111 96177
11980 96177 70081 -22897 -210453 -104836 -21593 -85435 -234522 208507 30723 72081 -177466
11968 204122 -28206 6731 -63422 -228598 -64916 24272 -99721 67775 -124775 -3058 -373068
11957 -373068 17243 351319 476092 101647 113322 -164027 -181519 -56598 24371 -7622 -199993
11946 -199993 119520 31352 142223 230823 -266540 131566 -89088 286082 741 195027 80304
11934 10106 189754 106006 -168814 -91077 -3124 -182525 19446 -134527 363604 -223413 -109263
11922 176019 95661 132601 -26510 -352442 -120021 -227427 204643 80103 83260 201374 -52312
11910 196084 26768 124927 19043 -56349 193349 95613 -199322 66443 -51577 -112612 188656
11898 -95226 134458 -15782 85621 237592 -71734 34648 154892 110543 227454 -65423 -337683
11887 -337683 242593 -60765 227127 46238 -11089 -104566 94159 -172593 248484 -171726
11876 717 -81850 87052 -52050 -180796 224672 151935 -130274 -23234 -61793 -47652 265542
11864 153686 -117588 223716 148056 162455 77009 88540 -159294 -102550 7292 67332 -107030
11852 -192916 -28128 142434 128285 -68930 80864 -232283 197333 -229441 -480370 59315
11841 -310815 -75617 -5438 -382358 -162068 147584 -88034 -227715 -37111 129703 153590 -3979
11829 -150559 -65582 -242589 -168744 875 -63061 -68142 -53908 -221718 2968 -30513 -83628 -360930
11817 -360930 -195811 -184918 301428 128649 -199767 -12249 -100380 -83040 -3246 -332183 -120730
11805 -150824 78724 -95517 -214626 95117 -244252 62248 62597 -58972 -65217 11682 -22332 -237598
11793 -237598 144913 58163 -165155 161630 -14813 -199780 41471 104827 196113 44988 -147137
11781 -115359 25645 -100521 -134965 -15096 159133 114886 63828 225476 19516 -22770 -144001
11770 -144001 -76475 74315 -152216 -49855 -9621 -146676 186802 -132743 305284 20236 33664
11759 33664 28907 -190444 -300266 -281944 158623 132948 6630 -121337 76798 127937 72800
11748 72800 -281563 109237 -223738 81672 -420736 -120129 103147 -67200 200419 -16625
11737 21389 -47497 -46243 222277 228150 177500 -273818 172340 97666 -208211 109479 -148252
11725 -117084 -249988 -52449 -211212 -239727 -219888 -195734 556684 -66589 183715 -326809
11714 105748 -85251 101443 5117 92495 -40163 -78447 -109316 -226795 43540 -134386 35827
11702 -84983 37280 95893 244509 -52557 318397 -12099 -102245 -460990 -112810 -104001 3371
11690 87318 -93545 -26967 -28360 74570 -177807 20498 -179357 285520 356488 4118 99834
11679 99834 99782 38916 225151 -4505 95877 138655 209172 -132941 273403 -112992 154160
11667 139931 152595 173331 212489 249700 295653 450026 251157 -115416 -2492 203026 48508
11655 39429 -289896 92155 70148 -31690 -26999 -6019 330227 -29050 -37546 -223739 141663
11643 103557 66455 -383797 44452 -17190 -45644 -33039 95247 207711 263554 4847 -67994
11631 -244669 117257 222636 10449 -248485 137692 -53999 98465 163079 79949 -129287
11620 -139179 114793 -244526 49958 -376028 83531 -30608 146618 81425 171134 -159964
11609 144150 -139221 222770 9654 165410 -146865 -63018 -79152 111440 172508 45005 -116212
11597 -162038 64062 147039 -117582 -18559 76742 68912 28875 189182 63426 2866 155117
11586 155117 -52311 -58833 -171751 -184617 7198 153288 -39050 -180900 220792 -264656 115482
11574 -42738 -208020 -154142 -37675 381818 354186 -17185 120044 270521 -206494 220783
11563 -74782 -154293 61244 -16337 126617 34893 -206025 -232033 -299168 43511 520368 205253
11551 173960 146655 169122 169369 44234 39990 112266 -5131 -112696 -117320 -56599 213564 107175
11539 107175 85108 -30215 -295401 295366 102898 248129 -232364 192578 293210 401109
11529 401109 -2558 65959 -61575 50927 -112668 -86552 64047 134234 -26676 409543 368320
11518 368320 -4815 37070 229443 -40034 349999 245741 -228914 -26328 235291 94599 -459601
11506 60854 -23699 174793 -97717 -69253 297997 143670 -61499 46826 13270 38956 -11055
11494 -22540 127459 369195 37871 135140 144009 64548 117438 64771 -109688 -79271 -126004
11483 -126004 117052 199451 270492 204114 12764 246726 147647 68869 -7624 -58609 -17786
11471 23016 25471 231148 -124594 184088 -190424 -155462 129245 132908 -424091 108892 251420
11460 251420 176678 254779 181323 -80583 120629 -51888 -60868 23582 112436 -17949 253803
11448 -374648 80756 251867 446904 -14259 191509 3453 67095 258073 77700 371035 65462
11436 236822 332553 258860 235368 -105093 -195185 305114 -26033 256450 50431 -205525 469371
11424 -90790 308921 167186 -60519 -213449 344876 48314 236505 262699 200160 265354 334043
11413 334043 171404 -208353 -106970 66091 -354721 31895 43094 -202992 -91853 -67860
11403 -67860 -67290 411574 -99964 15410 -59143 -24216 53477 -85426 267049 -79902 -5472 32751
11390 219661 -152417 -22469 201302 11791 -123701 323249 295915 219317 -405346 25739
11379 419659 -156399 106743 59209 -41994 1967 -16938 134221 -115874 159708 196779 38514
11367 -204799 -29724 59623 122572 36291 -136603 -215097 -65519 170561 -104177 69829 -238317
11355 163583 5942 -128260 -90265 286171 43354 -4143 -252417 174960 -36752 -23293 -196280
11344 -196280 271561 -203693 -124269 -29749 -73288 -309349 -56949 -52688 69944 -40511 152173
11332 -64445 114109 216391 377269 152224 -48076 -154214 -27907 -53030 14901 -30290 44588
11320 -161903 -85045 50752 256751 -98187 -46880 228839 -209293 175964 262924 -76309 -100416
11309 -100416 -85436 284404 -235480 76761 -111102 -258628 -210317 -199675 -13669 209325
11298 -216105 -88682 4941 83562 52334 -141597 -109644 1624 -27280 165325 177242 -180977
11286 -19513 -172972 -25108 -347356 -14511 -477232 16399 -178242 -244849 -29772 -72240 -295462
11275 -295462 -284785 98825 -27013 -265353 33393 -221386 11637 133589 -45731 209520 -250755
11263 66394 -45212 -170553 254583 -80799 -395534 -432994 51118 105775 70254 24228 -141068
11251 381984 -110892 358510 106064 126527 -391928 16684 215099 -156792 390411 -341982
11240 -179173 -116103 -26107 -13743 -167515 -8230 94268 -117232 41618 -40630 -221478 36180
11228 91629 132870 248037 71077 78231 336625 -110063 -184489 -321539 -193110 276655 -381217
11216 -68384 -91457 -121871 109718 150787 122761 20827 341349 150055 57634 220440 -41726
11204 -333532 354248 44828 -58361 -93288 210131 -332795 79704 -345337 -261751 -38591 29425
11192 635 22338 -132448 36959 -214716 -46450 93660 65858 -46379 -159807 -67870 106073
11180 -239039 199146 52281 53060 -61914 112253 -27788 -106811 -32464 -178104 -150163 -65717
11168 -293966 -82235 -101200 343582 148754 -582020 -197841 304408 -54510 -342219 -113386
11157 -79583 -107004 19563 -253122 -483333 -163437 -266504 -167437 -99116 -196995 47281 47540
11146 47540 -272178 -59365 -148712 52231 -244009 168916 -14512 57972 -393479 -232228 81870
11134 9864 274082 -294257 4017 -399163 126981 162247 -161157 -84406 -157481 -207768 -63567
11122 -20715 263879 -48111 292743 -176807 -61811 -158487 -64894 49637 -92302 -133861 212470
11110 -103396 -205770 -141425 342071 -58543 -43440 110454 33100 190256 -235598 -211149
11100 -211149 -171951 -99013 173865 -69337 -87349 -198794 360332 103543 -207658 -117667
11090 -117667 -148251 13579 197791 -249026 49566 13861 255904 447712 139474 109900
11080 109900 104051 21356 206626 60855 146971 247800 338592 -350689 431307 -33791 -87862
11069 -87862 136943 -60794 81476 188190 241188 -4925 214473 300209 98682 288310 278878
11058 278878 360913 357273 309125 264289 -7847 160441 299118 238249 21200 250456 764301
11047 764301 186108 63690 426745 327736 176406 416289 562228 474287 533694 554925
11037 554925 246158 163377 571957 308749 576637 352196 529889 633724 520128 624443
11027 624443 301900 838309 883660 479925 514293 729888 369372 488736 776069 758575
11017 758575 680823 674028 -48026 536019 576420 646444 613959 821892 392451 487310 613680
11006 613680 317250 854163 304564 844840 324962 291652 652355 309228 72763 572421
10996 572421 322967 583732 553801 251465 307383 446154 327643 375934 456610 198793
10985 728141 519949 234283 593683 517557 548343 396147 487209 533588 756043 301901
10974 451695 220954 772661 908242 862906 602517 662650 964508 926923 999856 717719
10964 717719 1061699 726978 669261 999343 660323 1052252 1225910 1724198 1584119 1967922
10954 1967922 1866463 1781223 1634281 2238869 1996666 1536569 1686485 1622594 1419067 1548229
10944 1548229 1452986 1240211 1125254 1250113 1393993 1086022 1712753 1536480 1377789 1005142
10934 1005142 1268805 1355074 936857 1019343 763558 289729 351238 251825 105743 521706
10924 521706 551418 86703 212329 32129 -132235 419419 290251 273188 196757 -26777 98102
10912 -90334 -24508 325823 163858 -225913 -171577 -205714 -192050 179280 -372827 -26862 -87213
10901 -87213 12552 -192681 252369 68562 -253639 -91414 -16382 157493 -39136 -122227 -125670
10890 -125670 65299 303566 -231251 -109170 118929 114550 -74509 55710 -76950 -19811 76579
10878 -123731 89300 -179922 83955 601618 -199645 -224025 -74344 -213748 336908 242647
10868 242647 278821 -255768 54608 -105808 117848 137936 -340075 91998 -85981 -74473 -47658
10857 -47658 -103041 -132577 -42420 -130648 137731 41429 92112 41446 -160643 424329 122356
10845 -49949 -31802 65640 -83539 -335353 49743 -180159 -126964 50783 -76047 -424207 269066
10833 -74568 29060 -516648 -255479 18572 3444 -71778 -92744 -54606 -100410 47231 -120242
10821 178915 174283 158069 10989 -11912 -363334 -21181 -129884 17381 -301225 253663 -157054
10809 -226830 225802 -123289 -215701 -72076 -320727 136863 -108025 -246734 43095 -159051
10798 -145392 27436 -111450 63823 91302 -153732 135169 -212622 -136174 -130427 -280647 352969
10786 -16019 -14435 17189 -61678 -444542 -113210 -218693 -14057 67998 86185 -74972 -77297
10775 -77297 363377 49193 -63555 68330 -320226 237043 -61458 22090 -69006 -26053 -368730
10764 -368730 29800 114310 -226734 -40750 -98747 -46740 75339 81690 22346 25045 52410 -322131
10751 38308 -39976 -429388 -115128 -183522 -1438 114993 103831 -83153 -279844 -129890 103909
10739 -57818 -131650 -243038 -57173 -251970 53867 -147142 20500 -17853 -98199 44983 -464877
10727 13326 -420227 -212199 -37422 -325270 -268704 52172 -232442 45545 -26099 -171367 -44381
10715 -104355 -224752 300747 280827 158167 -320413 6291 37420 325172 147078 -103904
10704 -88300 -34364 -474127 179813 -322334 250494 -88526 -221955 -42710 -32783 -73832 -274599
10693 -274599 21370 -308454 77130 -119412 36360 -58177 108192 -50396 190352 -407303
10682 -145771 242052 122604 132977 -159290 327167 -157918 91043 109958 187333 -56076
10671 102401 -215083 -26805 -209259 -239869 -70065 -329408 -75863 -120418 -140020 -44737 93931
10659 138114 -340730 -71793 -41258 25924 169143 70036 290818 -146153 188948 -97890
10648 -163051 -57924 -195191 209779 37752 -64609 -243285 72692 100053 90419 34882 182422
10637 182422 147624 -313371 63695 -92314 -827 149507 63984 -121257 -12107 -158162 9386
10625 -172173 212025 46721 -42306 -139392 19344 315609 108903 115172 186100 -79239 -38628
10613 -364219 -161821 144141 44588 -147188 -17412 -293979 -40383 10669 -201097 115048
10602 -119093 -28100 106264 -17379 180361 -118613 -8471 -265418 -96670 -82584 -190347 -200097
10591 -200097 89381 -131729 -175637 -27959 -110534 -249259 -250414 207029 -93956 -102573 127774
10579 -68498 -59892 163900 77742 -153605 -246155 -14709 -296911 -56143 189243 -174324 144385
10567 44533 81420 99590 40754 -239066 106625 157708 -178046 -112688 -339617 -43712 -147649
10556 -147649 -160810 117429 84104 144016 64145 -190332 -26501 -47337 31353 3650 46163
10545 46163 -395104 67374 -85498 -99013 -93348 333598 -246551 -27882 30545 -192713 15303
10533 -7316 106329 -22299 203003 73595 146821 107809 -143618 -255948 -49938 -142583 65523
10521 -101099 -75919 179612 60007 -138551 -92129 -7871 167664 -203345 75353 -191071 241529
10509 -379786 -157498 215675 -198210 102935 86653 -184275 -109521 -73953 -151977 100228
10498 128287 155607 -136720 -108907 -56213 -170128 288959 -89579 -723 -238942 224292 127100
10487 127100 -168007 -78332 -27976 -26257 -199204 -174753 -300389 -317259 225430 94183 -358766
10475 -271404 231673 42831 -123901 -53620 167137 127606 -47768 -74453 -4049 146851 145979
10464 145979 101779 234140 300776 463354 401586 511533 237472 155473 530381 67425
10453 225730 206874 220697 -413432 111107 -16621 -192046 -169718 -285798 103337 242104
10443 242104 -36780 -169633 -117220 224826 91669 139804 -43988 89024 72053 237188 152887
10432 152887 -182519 28528 -74286 -50157 -22701 -125409 -232909 -163241 28498 -171161 123602
10420 32144 41244 -36514 14300 -103503 -221642 -66910 68822 -27350 -192517 37063 163591
10409 163591 44910 -65108 179958 -171182 -51450 -7947 -171800 60556 -136159 -180028 -259378
10398 -259378 -95603 -105810 -107983 -70445 96613 165682 -336382 -290719 75516 176339 39611
10386 -139460 -143729 52376 129743 -102205 -54420 8028 119868 -263166 350897 -166841 -112619
10375 -112619 -92453 -164543 -201476 -97508 144818 100499 234976 33911 -158670 28266 131162
10364 131162 161196 267774 189726 167966 85532 132563 161127 290199 165234 568361 222304
10352 -7763 225474 277986 501367 197972 -42340 327180 13786 227713 289526 331129 -68429
10340 219519 283242 291561 206231 95138 353327 337680 269453 139302 466275 266261 228565
10329 228565 275119 393869 440083 417043 376560 311325 79366 260555 -178131 148715 260054
10318 260054 -160776 237624 75047 134031 -17623 65386 46110 9556 58491 -81812 322025
10306 94342 -9165 -109112 112854 -30291 331723 126034 -98500 -20877 49649 -26934 212485
10294 -261766 314307 -890 52448 74577 -84588 -29286 -234888 214791 -155826 -199046 123501
10282 414902 54393 258101 -177476 24903 -157971 85435 261327 -124473 -126523 -172050 191826
10270 44927 -234169 45351 -189939 -91449 -111792 -307107 94821 -49378 -329776 -6522 -111459
10259 -111459 -26329 -265608 61181 -198457 -43236 -4473 -102329 -181307 245649 141352 1889
10247 -87632 -199105 36459 -150115 -21149 2993 -86019 28213 -56355 8477 -125304 78832
10235 254395 129096 178451 283342 -68246 -32919 173667 -129799 25300 313236 54580
10224 -136202 -147067 213469 -117219 -13472 30060 28236 -128286 -127525 164471 -5625 -223588
10213 -223588 114791 -14042 176272 70931 127822 15471 -35806 171003 -356019 -46415 101941
10201 81507 89380 124647 17138 14457 -72036 -3961 -262177 -38516 -430511 -281304 37787 97702
10189 97702 -141639 188965 -72518 -193145 150380 18689 290932 -261660 -4086 -147733
10179 -147733 274805 112059 -23732 -60211 -86206 -233005 -4847 -85258 -226697 -385728 153814
10167 -377261 -226343 -378156 -54352 8709 172390 -118920 -59465 -266972 -450353 80790
10156 -216591 -321821 -253133 -87217 -35614 -49464 -154209 14558 76499 -147100 95559 -21650
10144 31103 -147543 291615 -60570 -79487 -96886 -287486 74907 -110634 121365 159705 -234679
10132 -225255 -17408 -170171 227794 -329607 305024 -142430 82015 18376 -248923 83123
10121 -7566 58570 67581 -110310 210009 170060 249782 -351132 -494975 -87994 -17515 -67416
10110 -67416 -224688 -254945 -3236 81217 388713 -133921 -229547 -177774 170411 -194817 7499
10098 -73060 -335324 79824 -240407 114595 239526 35400 -245470 299170 -29488 -331315
10088 -331315 -89010 -332 316258 -33985 -200716 -143384 -342913 -295459 -106038 -248761 -186004
10077 -186004 350328 -98418 106844 -21154 -204541 172747 95121 -7799 -386411 -222278
10067 -222278 195156 3037 -140151 -172514 188154 76903 -85622 -225609 24904 133039 -49149
10055 -31476 -224939 108786 -73257 -172548 -245271 -40158 240749 -41756 -90621 -106281 46249
10043 -81329 -57027 -139537 -219533 61044 -185396 -191758 -27504 -6788 50429 -68058 -57400 -167876
10031 -167876 -336992 -289825 -192157 37370 -60217 -125584 109874 -135399 3903 -312028 -244171
10020 -244171 -264543 -242063 119863 -104029 -161943 -176716 -219449 -103632 -103297 -74461 -10052
10008 -81076 27071 -115137 -108941 -202000 54060 -73598 5512 32882 -201539 213954 -145783
9996 -71956 143148 -63357 433979 124083 -104549 -161721 -261389 -21587 -98389 -155363 -48331
9984 52431 -106601 -97266 -150745 -51702 -94022 -64407 -223580 -14951 376796 -69108 -383338
9973 -383338 -76270 -78 -136579 -200994 -261053 -23858 -82487 -129000 141773 246705 48808 -79634
9960 -206371 -86262 14182 106548 -59176 54413 50229 -419604 212359 -23921 -14144 72063 29550
9947 51763 -210414 68610 252124 -140675 -318192 -325681 28353 51044 109672 -120363 -371587
9936 -371587 -200438 51949 -82928 -4850 132864 20111 -165380 -337397 -122719 -143763 -134498
9925 -134498 -149442 -293463 8939 157261 72427 223979 382065 -294401 -174026 105572
9914 1589 -242937 372258 -307968 -95845 49905 -22858 -8151 -14038 188140 -210896 51535
9902 -106392 -243629 89711 115986 -179849 -67793 -238952 -25314 115309 -151735 -309707
9892 -309707 -266258 59221 -62676 -46570 26882 -144085 -2917 129837 -200751 -156243 -18377
9880 -244809 -69294 -197167 145634 -112110 -214198 -162601 8074 -319797 -184165 196596
9869 -137434 -171402 233497 -268411 -310518 16927 -140127 14317 -160284 -167243 -211514 384467
9857 -263598 -42521 -420033 -242782 -23701 -304093 -180865 145689 -133912 -11352 -307914
9847 -307914 14115 -1180 53757 54146 -85533 -126997 -97104 -210936 123328 71379 313575 -228296
9834 -266555 -10914 187224 262782 -114820 10179 180524 -254905 -78565 195558 -363450
9823 8693 -114897 -105077 -181819 -222768 295511 -19777 -128152 29103 -192514 -38433 -13510
9811 -246078 -120776 8715 -185452 -4575 -94332 289977 -109913 -247570 -59076 -64958 200355
9799 129011 52580 -198822 150180 106168 -2996 -102353 88215 1986 155734 -489379 -312987
9788 -312987 63156 -69953 -470488 -119467 -226481 -268289 20636 -39773 -70065 -60125 -212098
9777 -212098 -97505 -90697 -123283 -91813 -81326 -52520 186653 45577 -112230 -373382 168468
9765 -122247 106898 38393 -70139 132750 -353389 -421375 132525 569917 63274 -403160
9754 -163673 43066 -39620 45750 91948 -45164 -204010 183199 -208523 106535 -140878 99507
9742 -265110 -150331 79805 -285437 161691 -38711 -254939 96213 -232340 -88530 92281 -163831
9730 35662 -261974 78206 -149248 -164608 82998 -330977 33842 104503 -27742 99288 -353329
9718 -110646 -29599 -146323 -260845 9842 155246 182890 27111 -215092 97115 289141 -129992
9706 -32708 48876 -239303 14598 193364 91792 -94484 -112849 -199444 -233020 -77309 -194081
9695 -194081 -53497 20279 -459571 -91506 -146438 -112873 -14511 -190080 -77390 182792 -43769
9683 -288876 -169163 93807 -272680 158469 -392431 65786 46826 -15257 259906 -324340
9672 47550 -1543 87185 3823 -706 -136610 -83485 -35731 -64850 -40850 -175067 -94087 -77990
9660 -77990 1133 -128339 -8177 91291 -70213 -94458 92192 -52398 -167591 -4927 136640 -117523
9647 -161225 -37929 -270090 -190192 -50332 92813 63796 -263517 123972 246106 22290 -166311
9635 -68249 131777 192235 -106219 -237950 -373219 -105930 -39549 -202979 -206865 88722 -35820
9623 -227525 -63147 81 41213 -84724 -120182 291207 -270064 -31976 -96162 -73319 282999 42575
9610 -91815 -38775 249145 -124107 -92445 138217 62672 -49751 128369 -35830 -264718 -185982
9599 -185982 123897 -192467 -9066 -90717 -710941 -45658 1247 -48676 -477995 -19430 2169
9587 -116085 54871 50390 -5272 362279 211040 -23671 51084 293826 -185788 -57312 -170480
9576 -170480 -73539 9813 293053 -101019 -326639 -189331 21274 -319294 -87793 3641 -179463
9564 -198310 -140534 -33146 -206019 -185644 -106723 76657 -165547 -181753 -482016 -400091 186824
9552 -362651 -365955 -193317 -86091 76198 255788 -38412 -420738 -160054 -142219 -27013 199673
9540 -164371 -362992 233121 45967 -245042 -311406 -167068 -451394 -155122 -143816 -309404
9530 -309404 39697 -182972 -45697 -71004 -395427 -255389 -265491 279335 294737 -134975 -14693
9518 220567 165439 -159026 177567 91752 -32062 177617 -111721 -261864 124146 184223
9508 184223 -126398 -163510 214607 -201025 25943 -107620 -288352 30883 -113867 112087
9497 -308456 -23853 -179150 -44772 -252422 5804 -358754 -156292 -291244 -170950 104261
9486 -45324 -6214 -230889 -283750 24796 27846 -163803 -2646 -271350 -53755 92248 292690 -41559
9473 -2921 -160964 -56669 35622 13138 -7728 -38953 -278416 83119 -72042 -143975 54409 106148
9461 106148 137651 49320 -245823 -103962 -68095 249991 39754 -151966 52604 -225483 -151592
9450 -151592 -184578 -38788 -88758 82446 -38148 -421721 -57443 -27137 207328 -57802 73340
9438 -122916 -283810 -5971 -118748 -129813 68573 -63037 -86708 -228618 140524 -12220 -219845
9427 -219845 -238971 -218745 -140023 6649 -68377 -191445 -180924 -155850 -119291 110156 218482
9416 218482 -70221 91656 30768 -50502 -554863 -347007 242098 146686 -123613 236602 -338251
9404 70994 -310858 87617 116824 -58458 270879 -128000 -227314 20400 41185 -84070 -103562
9393 -103562 12449 -214524 38473 -216047 78786 -57531 -239346 -77964 107665 296000 -174934
9381 -365939 10805 -182277 107414 -82272 -399364 137735 54745 -37894 62869 43710 47458
9370 47458 -115618 -37928 -85789 -10435 -164688 65692 -95746 -122485 103283 -44405 -241833
9359 -241833 188580 -74116 -308347 92476 65088 163844 206635 -38505 369621 -10296 -34474
9348 -34474 162984 -15989 -32460 15958 107469 -200345 253272 -36083 -373919 -145558 41762
9336 -89208 -351514 -23707 -141411 8000 -54730 -86629 -141354 -432495 205959 -83381 -90044
9325 -90044 130755 12266 131331 -216692 -95704 -140688 -157331 -149454 -141261 -210586 -290545 87088
9312 66994 -300264 -218541 -461363 -218166 -79540 4387 113451 179452 184725 -22151 260914
9300 273652 -123260 -186890 -213485 -7732 -69006 -19515 -174527 -204263 -360936 12661 -42028
9288 -306883 104118 -2472 128447 -552948 41026 24649 -37124 163756 3978 -12720 -16761
9277 -16761 44867 -27744 -7335 -292371 -58235 123434 -308034 -222035 -110797 240935 171409
9266 171409 -127936 312332 32357 53214 -208578 3660 185243 -125964 -24346 -241824 -26266
9254 -265977 -17760 -12857 -196928 46831 187829 -377102 -118305 -251088 -33291 14099 -321697
9242 96956 -179643 -118636 -130936 -153294 -278224 -416032 207680 211719 -325843 -127664 -121991
9231 -121991 30536 50430 -301971 -175795 -79957 -14701 -456259 264112 -337904 -146044
9220 -178014 -203358 -225385 227645 19183 -99046 -181625 -67301 37388 57423 168845 -200707
9208 177312 -12672 110074 206821 -291557 -116837 -118956 -237042 310985 68526 -115664 8617
9196 -122156 50236 363003 -264893 82335 162736 -261156 -383647 -177048 248135 75782
9185 -169182 -189667 -230918 -330666 355660 -14367 93033 -30356 -112352 60256 -93523 -187283
9174 -187283 -554486 -168019 -138597 -136837 -32216 -39184 53879 285484 182886 -14328 26514
9162 -112139 279118 -33529 10547 -34954 44737 -461889 -3873 -244447 -55375 -101996 159226
9150 211226 -56478 60596 210529 175929 293875 -201768 -106858 -30628 -129740 -269908 -65217
9138 31742 -159132 180332 228557 -106828 138208 72991 6761 -238875 167804 -46143 113708
9126 -111200 -57573 142040 -34776 -245236 17898 -214880 -151753 -205077 -36930 336886 412416
9115 412416 124252 -226948 -246281 271212 17511 82990 -36651 -201669 97693 -196393 71484
9103 164227 17619 36215 17143 -5857 -235814 11919 100108 34211 -235866 -85912 38383
9091 -170225 -75002 -71075 184380 -174596 -276635 110490 49340 177363 -156337 5398 -37357
9079 -288519 125067 6105 86789 -179085 -142111 46772 -127579 -59559 -51706 132268 27011
9067 -33036 -5296 -39536 197168 -45208 -225095 103628 -211373 -107793 -241084 124783 -14552
9055 -128162 -229301 235555 -87644 -30018 -184443 -264548 -283009 53523 -93746 -160589 -3672
9043 -156283 -188039 58707 4555 -139041 -265510 -188210 11022 -191056 -223649 166930 178291
9032 178291 186542 -281127 -53711 -73975 115018 1873 42577 52599 -148425 -112017 -62898
9021 -62898 -393651 -322932 40152 -258386 64431 364490 30847 4618 -214952 149992 -141073
9009 87080 113663 -101276 29460 -46341 152966 141465 -149024 -149878 -240954 -222457 199794
8997 -148080 -240541 -182094 168394 211379 123520 -142176 -83977 -131534 -422158 -452786 -233794
8986 -233794 -326055 -144791 128304 2532 -198639 29881 -96513 27645 169863 9531 -108967
8974 66539 55546 -338075 -332567 -233447 520126 -26885 -143677 67720 -95840 101922 -300824
8962 -313344 -52716 -201484 71613 -57375 -335559 -94848 29051 281337 -1860 -127014 -122808
8951 -122808 -74111 -72806 398421 -176438 161675 -209925 11690 -308764 -95087 45918 224204
8940 224204 31509 141882 -48972 -225223 -76766 27779 169815 -83763 96864 -92437 -291303
8929 -291303 53099 -262597 -18172 -317485 248331 165506 236744 -86452 -337667 -47590 126576
8917 349189 84283 172941 106673 205930 -80107 421733 -116087 58157 283267 453476 862384
8906 862384 1020163 2238304 3935524 7885546 5047078 2264485 1090531 612764 599088
8897 599088 228376 135804 237507 142563 -4385 -91720 101386 143234 96325 505670 79404
8885 220698 3353 601956 53422 169701 38336 -214085 -171687 -184303 72913 -28212 -127660
8874 -127660 -277354 -325879 218393 -366315 -25469 -256016 21422 12820 -155021 28346 -213259
8862 -23246 -116020 -259456 -90461 -78851 135046 -71919 -17790 144566 -7356 73592 -167389
8850 -92066 -109211 292250 2780 375352 -338643 32997 -338300 -50659 398778 -253471 -233632
8839 -233632 -235705 -28378 48131 -51477 -83496 -56232 -113811 51058 -307475 -109363 -70955
8828 -70955 -280209 -70947 -12844 -439423 68846 -294149 87348 -24150 -229334 -13954 219352
8816 -125683 -227901 20920 -327599 -162197 30188 -275924 114483 -155566 23625 -291927
8805 45405 -51707 -107837 -15802 -44048 -296996 -108803 19897 -69303 -326194 -141165 -70602
8794 -70602 -86321 -81284 57072 360695 -147051 -7172 55577 -387510 -41553 -36110 -209343 -168071
8782 -168071 233181 10538 160248 -216872 -399014 -105248 -66846 -133133 32217 -93012 51285
8770 51717 10953 59163 -163434 -242790 186721 -13239 -207445 318149 170604 66243 70958
8759 70958 83582 -252671 -218189 -195575 -140833 10985 -199656 -140855 -45255 -361434 -80773
8747 172525 263465 -15945 -3062 395746 -19009 -48373 -120660 160061 -69772 -326817 -8868
8735 -225214 43249 106821 193362 -168689 87237 44861 -264678 -49617 123477 171067 111030
8724 111030 -134472 -240649 -233142 110962 -39503 -72107 -122714 158196 61987 7839 -330506
8712 -10259 153031 -53518 -288412 -105032 41424 20032 -55730 -131240 -79879 29625 143558
8701 143558 182717 73887 -26566 -36517 -504711 -76563 -59440 -55481 -74080 -67319 -7189 287622
8688 -17887 440565 -103353 -134502 118031 -182439 -165862 -124149 102009 -38674 -141143 13442
8676 99243 34165 -120267 -114676 214481 -189480 -171971 -91224 -96847 138289 -557127 -73404
8664 -126441 349372 -46162 -15981 110647 174170 -87510 -158619 -204168 -145289 11021 -207398
8652 -20778 -62131 -302335 -177062 105615 82024 221982 -55614 212864 -318803 -137475
8641 71322 -155216 -5035 -58243 16504 -177628 276702 -59946 -258375 45424 -73916 -77802
8630 -77802 33204 -136094 -133995 -211044 -320807 57892 -124165 151089 64704 123630 -48131
8618 -95226 -124591 68314 -132351 39003 -17241 -138116 -32473 -502610 -209835 35352 -305605
8606 26605 -10570 1518 -92609 111770 -96762 -65651 -206768 -235320 149752 -60296 -191569
8595 -191569 -104934 63995 -46017 119519 -200239 -170805 50384 -219773 -82775 10977 -77613
8583 -63369 -218656 -72681 -430244 -336698 -345811 235980 10710 -311201 -156303 260664 159156
8572 159156 -119848 125937 -69549 218172 119247 -96402 59759 162960 -48748 -253854 137737
8560 -287770 -92111 232784 51327 32800 264 178116 113083 -61423 52799 -23171 -39097 -208075
8548 -208075 60812 -429243 -176526 1320 -468887 157039 -90973 -225053 142756 -256562
8537 -37348 -264770 1175 -169874 112734 17288 -241314 180091 -121945 228647 -8589 13602
8525 -254667 117679 -77117 298035 -126295 -152809 -82553 -146453 -316528 -137704 328311
8514 -259989 166227 -76216 -145209 -218054 35767 235484 -299711 -14770 -124988 -3921 54142
8502 -65425 181638 -138510 115675 -344270 115267 34347 -129994 295370 -55959 -150318
8492 -150318 -42031 -141827 -248719 -198424 -19507 40026 -174521 -237385 74595 -85158 -97422
8481 -97422 48878 -7299 184929 -7641 -72630 142209 114272 110328 -343871 -202869 -244530 -213764
8469 -213764 2757 -175838 -121057 -75952 -343369 -155788 -469142 113210 36081 119938 -103365
8457 -96178 -126643 155106 146695 83248 92496 -70966 -60356 51303 -46392 -94595 -19757 -331564
8445 -331564 114262 69758 34950 205328 -286083 -397847 112842 17066 -158402 -80602
8435 -80602 -256465 93093 -33637 -263068 -230938 -75424 50938 -523198 115991 94271 -237949
8423 162026 288549 73574 -224512 -226180 -89094 -54810 72877 183903 16418 55008 246106
8412 246106 -80154 -175018 -164527 -8443 -151454 -363476 -208119 164231 -15590 -97649 199738
8400 -269854 -81882 -374708 181691 3996 -113712 119189 71001 23702 -69237 -98087 -376169
8389 -376169 -201175 164028 -391730 10561 18454 -175570 103798 194282 -116860 -154473 -212492
8378 -212492 -55730 59334 156450 230128 8854 303240 -194013 -249593 131093 118375 66476
8367 66476 -40432 -97637 -141015 -110395 -23537 -242435 245902 -176372 -166533 -168681 96185 -251616
8354 -14422 -74076 75031 -227743 62820 144481 -358413 -29795 37952 -20956 -174285 120732
8342 164508 107102 -18253 21891 320137 -139127 -48823 95627 -172151 -158145 -124125 -238113
8331 -238113 -126090 -163386 -135795 114908 203703 286385 310493 152873 13134 -145032 -114728
8320 -114728 -30490 -28461 290602 109492 124366 -33077 -102533 36493 -4625 37071 -69573 25561
8307 127429 26537 -27595 -127354 -181035 12409 103569 165941 -122707 -162280 -65296 -93910
8296 -93910 -338828 63523 -129693 -171052 296005 33515 -13958 -14702 282490 -20038 83979
8284 19694 -20857 -372667 46360 26583 -139906 -60946 199086 307647 -250619 -448347 -320283
8273 -320283 -74572 -11407 172366 56658 89781 -266179 -149629 -79887 -85381 -192202 -329311
8262 -329311 58410 -67018 -166812 -240617 -204932 -136047 -196058 35902 -119736 124478 53315
8250 -488985 -111969 -17315 97783 -351771 112155 -15302 12564 -297512 62015 63752 -274112
8238 -104710 105536 -471049 14298 64145 -28915 -48323 -153430 -246147 49344 19413 -267554
8226 -72931 217093 -4178 146434 -29646 -96416 -226235 -49837 -208184 -101974 -86879 -163356
8215 -163356 -138626 -94173 -32508 85174 -304438 122417 238826 -128010 170486 -150405
8204 -136974 -142243 -157138 -137901 -37451 183410 96076 113427 -52404 262140 -350350 -9202
8192 -127098 -16608 -271717 124827 -7781 -70284 -74950 170696 147527 -38504 188935 -47019
8180 -37711 180080 -18968 -117252 -34714 -224903 302699 63324 -78740 24251 322417 -175754
8168 -56365 -349472 21594 -71986 -27193 -72102 68545 -25994 228949 -212226 -92824 -140119
8157 -140119 -217646 -211146 -122525 -79881 30850 64155 -199831 -87311 -144757 233302 -192754
8145 -162036 195830 -18719 158828 -153178 118753 -196080 62145 -359487 -130321 -175543
8135 -175543 27936 -148067 75814 -148667 16771 210942 -56982 59728 216562 -81593 111208
8123 503331 -62012 33369 35987 -234374 171342 129093 -244186 -201022 -58507 -67793 -97621
8112 -97621 303882 405044 -58622 105423 -64304 -110085 -133992 -109901 -147486 -35669 41378
8100 35740 63435 -29013 -118800 -122728 -69882 12296 117351 272463 -92190 -23907 -14091 -62757
8088 -62757 -353511 -137879 -88692 226834 -86381 96303 153761 1699 10306 -84520 -237867
8077 -237867 21814 -278000 129364 -142953 40230 -176849 -134537 -327298 -15467 20460 372283
8066 372283 -136857 -56352 -7501 107739 -298796 -102710 66179 -94646 -208338 21107 -345011
8054 -247020 -70464 -94352 -80235 31160 167580 -168285 -95654 104820 -2229 -87326 -63970
8043 -63970 -298158 -37874 156413 70848 34883 -45866 -10251 -91542 -70567 -179521 -283157
8032 -283157 -34022 88585 9506 284274 167899 7729 39976 -116549 -203070 151509 -278242
8020 -54963 34878 -157756 -316389 -210636 -123356 -42220 -87203 -153934 -85031 158185 -188819
8008 255683 -129497 51623 -48083 190012 143280 174009 -81806 -190785 -331367 -170656 -11138
7996 27209 -62089 149553 -261901 -526463 59958 282279 -475162 130667 -384233 -12666
7985 -127680 -234284 -318102 292253 -16254 -83926 -222556 -148716 -91461 -242147 199758 151527
7974 151527 91583 7229 24181 -6740 63107 -245023 -51701 -149903 234923 -277450 141553
7962 -52883 -92921 -337725 282798 -45722 -44309 -43301 -141731 44515 52327 -47517 -282466 269559
7949 300055 -174915 34086 168190 -453201 -197356 29345 -50779 -135993 195119 -253348
7938 -89845 -173784 -237423 -269885 101667 -215874 -26887 -63675 274082 -348451 -79090 79361
7926 -137064 -26338 224732 212574 164843 -237051 -452587 119687 233849 245403 189953 190106
7915 190106 47845 4158 48175 -121414 -133759 -222262 329728 197172 92426 -46956 -9615
7903 -73809 -76362 -204398 -260563 -337697 44066 111729 -137507 148102 -248291 31587 -115642
7891 28795 33319 71379 107364 -131873 -9665 -236424 -243319 8250 227394 674560 -211665 -457646
7879 -457646 -155614 533 -330772 -316041 -71434 -320103 -4981 72091 -141552 26723 10965
7867 -130057 156245 75538 -135852 -101921 -66429 -210946 -361756 -403696 -46454 -12174 148423
7855 -77095 -82686 -3823 -55481 278530 -37959 -336317 -107705 -403988 -240477 -168753 -307666
7844 -307666 272184 -338179 -262305 -75038 -313876 20414 -28654 -343584 132894 -212627
7833 -109849 36676 33664 35328 -134313 -276335 -347551 -254673 -136241 -126718 78911 -143006
7821 -13670 113178 225025 149631 -7949 -56411 -181905 -266790 -219059 -230891 -46797 -236845
7810 -236845 28358 -79776 102264 168066 -168734 -885 -25914 24233 -83087 177144 284047
7799 284047 172333 -242414 32714 -20092 -58759 113207 -79887 87840 308390 -330091 -141749
7787 -67551 -74373 -160705 -95666 67335 -192514 103152 18469 -107793 1306 47466 -150387
7775 67446 61079 -126500 -116 -117181 -239690 -44245 -279566 215686 120629 -360105 238918
7763 -293506 210030 159951 -206135 -137467 70073 -155687 93806 -115070 -39555 6458 312922
7752 312922 92728 -136785 -108367 344262 274036 -94979 -90066 235351 -43248 -115717 -151071
7741 -151071 -167757 -144257 71741 293874 -65324 -23127 -132472 339762 -251037 -118897 15268
7729 282921 251393 -233367 -163145 -451300 -170033 186512 -87031 -126243 -159016 101080 -6269
7717 -332564 202960 35193 -55671 -6667 -47697 -159538 -37716 -197347 113454 -285393 107948
7705 -329012 -282402 -230146 -7251 -221532 -109499 -81708 -36028 66804 -43702 111669 29952
7693 -213859 -261327 -254860 47609 260030 -37151 -459978 52231 -274959 -242789 20813 105504
7682 105504 -238500 -203798 -299158 -116776 79113 -66217 -142874 -163157 94167 -72772 -160202
7671 -160202 -158684 -88572 29667 -22695 -162107 -90466 37601 -87333 72259 -266743 -180308
7660 -180308 -269450 334246 121358 242455 138333 -73856 16873 -250080 43580 -26780 -99329
7649 -99329 57303 101253 -40450 -79141 -207941 257593 -220461 -201619 -139737 -6652 -46724
7638 -46724 -131953 50105 159047 -76156 -318797 155753 -20022 95831 -59327 90488 -188073
7626 99039 -112446 -81045 21554 140108 141043 104209 144626 -444325 -208417 343542 -11503
7614 100265 117808 210189 -62102 -214606 48699 81669 -53722 -119100 -138817 -13396 -6130 -67366
7602 -67366 194187 84550 29882 -207057 -14237 -114077 221655 -20564 97292 -314716 -154097
7590 -69313 516 -74093 208796 173390 -99987 -50305 155440 39707 -44586 -267076 390917
7578 -128215 -189985 199175 -228219 19508 255536 12783 -46249 28233 -29926 -250582 222399
7566 -117080 -688017 -300518 18348 88666 58974 53806 118374 53955 -87683 47593 -232583
7554 -405780 -7929 -63546 191224 161245 3323 262637 8776 25062 -141820 -199549 -299303 36888
7541 360932 161258 -131337 -46658 177179 -64695 255610 -21938 124785 -92697 -427572
7531 -427572 -42739 -283599 -4744 -181499 212501 132721 -90773 2818 -139610 -345061 -250618
7520 -250618 221753 -62702 -259002 -119101 144460 -131758 170337 -94655 -190614 13950
7509 -14684 -187804 -257656 -103385 -209346 -12522 -321226 -45491 217523 -195223 -66061 100558
7497 -187570 -87811 281586 42000 -66149 -496726 -256600 156689 50691 -208170 -21299 -141683
7486 -141683 -248144 -113020 -125928 63904 44624 -159213 -124311 -221298 311337 -132886 310379
7474 74604 -9206 -263724 -84882 -21194 -312773 87614 107854 -29746 -101188 -412459 32282
7462 -196118 -286085 76779 -31593 -212940 189953 -255124 -96787 54058 45186 218244 -188153
7450 63526 193557 167531 -113751 -226025 -61555 -98589 -145292 -207248 295320 -248389 4421
7438 120750 190210 -133729 71169 153855 -176147 -172671 178123 -27567 196266 91191 -37721
7426 7271 26167 -131263 -83558 -171195 -91818 -31192 -52253 278705 147568 -157243 -88027
7415 -88027 156061 126485 -72741 -382126 -428376 19525 -54226 -372506 137551 -183536 -91417
7403 26421 -69924 -191680 -356656 -63813 167624 -126132 185238 16982 60546 281167 -7809
7391 -121848 34879 53035 -405076 31950 47884 -31902 -184426 14996 101228 -2935 -174573
7380 -174573 -220189 -350818 112176 149835 -104227 104416 -56926 180621 216727 -91985 -75651
7369 -75651 219151 31125 16423 -270474 124864 -148950 -100301 -550317 -142601 -146892 -78074
7358 -78074 -203973 -229674 -7074 -28950 -297888 -76394 -32967 -312817 134626 -240591 106223
7346 -265164 -394013 -11302 8704 -81206 -78323 40941 -335984 198590 60767 -242173 -211058
7335 -211058 -72201 -71302 -148551 163297 -384545 -368392 123909 -411541 201936 154707 -45605
7323 -246978 25736 17039 76838 113132 96357 180872 76064 52892 274866 -51077 -83194 -60362
7311 -60362 48500 333046 -266169 -22993 -107430 216891 -214461 -36579 36724 -169542 112972
7299 -93806 -63338 -27729 -273182 248958 13924 -195966 -168367 110472 -51257 95214 21672
7287 -65263 195254 -239087 -86889 1138 -197915 42827 240652 -203560 22697 52857 -29967
7275 -286385 -289915 -201047 -52003 -297189 -145267 -236114 -87369 -6047 -195209 41764 -45889
7263 212080 -3827 -88850 247910 -39720 56334 144985 -140146 234626 37377 -243316 149548
7251 -28728 -59785 -252256 248766 73166 -174111 110669 113389 28871 152296 -1896 -128155
7240 -128155 -112465 334551 129339 134545 -354166 34228 382 94134 282000 -60659 -32283
7229 -32283 -180929 -126400 127498 -496543 193824 -133499 -128841 -247199 -3389 78399 -239731
7217 107909 -37692 161505 158857 233553 -65149 -368565 -81051 -248904 77971 17276 -88626
7205 -292012 -126346 -93660 -136409 -159266 9031 -213753 78439 -142952 -37417 -196689 20299
7193 -271024 -43951 -393317 117417 -117731 35455 -228619 80224 44589 -84083 -278354 -62889
7181 -233797 29219 95487 -100427 -254176 -83808 223129 -177094 -52759 57373 -181879 -205881
7170 -205881 36993 52253 -298640 -32746 47703 64143 -45097 -122583 204985 -162600 91595
7158 -174966 -232270 108986 127473 -191328 268684 284840 -194131 -133176 49366 10217 -37280
7146 -66549 -183962 -89316 -39287 113155 88321 83888 -311174 -179214 -133858 -112059 -53508
7134 -313999 5627 -109371 222663 6624 251647 114972 361963 -41719 230776 327089 -92396
7122 -88926 251759 -78490 -248230 -86484 -41566 87322 -81559 115184 97852 -17446 -202322
7111 -202322 -58770 172637 19603 -181752 -96766 -55434 141975 118291 -98978 39497 -2212
7099 -5601 -14002 289194 -29671 279087 -150297 -329587 -43281 171546 -62727 154231 -162798
7087 -9010 34208 -83047 204762 -46941 -109983 3241 193073 -68843 57015 44042 75667 47278
7075 47278 250417 -194947 -30271 -65118 30134 124042 126716 -73734 -68997 32393 -275775 -470995
7063 -470995 89585 82879 -151334 40192 178155 -105714 -386 52530 -74259 79671 -64244 57
7050 129501 6231 85772 -162733 25401 18384 230679 -84501 20174 -145011 122317 359137
7039 359137 153090 57215 -49681 -127730 174298 -439760 130124 15633 -358110 164162
7028 -299587 -164698 -141623 139754 -243514 246344 -41217 -180709 -100525 -293685 402102
7017 -11995 -169645 -333880 -347908 -164106 19049 102314 206232 -68617 298468 96021 4522
7005 63986 -84558 -216630 -104515 138573 128558 401192 -209494 -203776 88409 -247119 204370
6993 -253710 163979 -34905 -194850 -384133 -73951 86526 -64328 -4206 67732 93942 -90721
6981 -84125 -234511 -266626 182608 -27239 -124251 -142616 49945 126696 -311838 215132 -48697
6969 219815 -7354 -52538 159301 199360 -157320 128202 -259437 -93875 -379320 165336 10993
6957 -57307 22994 -543793 -19214 -155380 87535 -8962 68673 -118611 -124895 -50967 -191229
6946 -191229 57622 65973 -193310 -71309 105271 -72580 17882 -206136 34008 -156973 -363013
6935 -363013 -175139 112130 -128813 -124435 -137837 -146043 -245174 -145074 -116785 186828 125183
6924 125183 -115017 -182281 -168011 -59045 349567 169560 25308 -70362 46386 44979 -165044
6912 -223700 -275525 -63272 -70425 -83022 -155970 217254 118655 -85674 30051 136562 125574
6901 125574 -253902 266387 71981 108433 90462 14565 122085 -206265 140863 -118504
6890 -168355 -105000 -363984 -109036 -286189 -152573 -308670 -104930 69768 -138328 -54429
6879 -82071 230401 29677 -117020 -173031 -158549 -100977 -296428 172842 -50289 -407697 81965
6867 4863 14993 169624 -411765 38222 -48635 -249868 -318202 138589 -283919 -352582 -206024
6856 -206024 12274 190991 82788 -15129 -93286 -177110 162089 -92776 178748 -24425 -134621
6845 -134621 162314 -22261 -183072 207457 -30864 169501 -25084 228123 198946 -223392
6834 -268584 -66920 -57813 150906 248158 -133490 -113010 100137 46660 209518 332922 98044
6822 -2440 88365 -135602 -115682 134535 -45435 -84783 -14433 -38177 -264352 -164120 -285445
6811 -285445 -472477 -45815 -74628 364609 177099 10168 -283385 31364 -159545 147803
6800 355360 64413 82035 -138594 -392061 128924 -216622 -105113 333165 17904 112782
6790 112782 -224454 196702 -290879 -259292 -166926 -395 -399201 6186 -263540 298175 -101559
6778 -140103 -47234 -173772 1704 -336716 93270 258276 -99103 161032 -136528 -247936 178010
6766 -165453 141453 -14661 -30202 -67144 -117769 -83270 -278119 330843 90431 23610 284031
6755 284031 14129 514162 -53661 119422 -212848 -120520 53464 -103712 263435 -143008
6744 -167652 295486 -242001 -27680 -115606 68712 -10911 40176 -194824 302734 146764 -189339
6732 -22441 -289692 131862 -146295 -255780 241939 385998 -199059 -128327 -75554 -473580
6722 -473580 -49257 145589 -184397 5360 -31644 -169691 -137386 -284733 118330 -92272 236843
6710 -178714 21916 -15305 247379 -11977 -406059 -286332 -48687 -234256 87859 256707 19067
6698 -170152 -95068 204549 -147724 89950 92735 -217895 -138873 -107101 -128179 252478 109220
6686 -121288 5130 39214 302021 -142342 132581 -140586 -17624 -273783 -293004 30515 -182614
6674 -47900 -190268 13182 95988 -12151 82077 -399514 127369 -192873 339492 -56567 -185277
6663 -185277 -60074 -34816 -282089 77744 130201 -323494 67049 466881 -219566 -14399 1303
6651 -227971 193413 148966 -64701 48250 61599 185119 -311863 -46036 -179406 -143061 96869
6639 -242816 -111174 -98517 -122941 72123 134639 -163982 -468288 -123811 -377325 -180969
6628 -31811 -212085 30077 130394 16327 -90067 163686 -164164 -194524 172966 147283 -74826
6616 -14477 79144 -230874 108986 -245798 -46437 184284 -315287 -248609 113353 35869 90097
6605 90097 -196145 12565 93209 327789 -71708 17812 68565 -63350 -226147 196794 -411160
6593 59149 -330726 -75079 51093 54278 22100 18475 -186937 78244 128387 -105871 -21840 -363172
6581 -363172 -329936 64084 -86946 -80172 -3888 251526 -430041 -81736 -301865 -71068 -22747
6569 -208632 -84168 -8968 -37588 179916 67730 222950 -260091 -151187 116261 -338967 140324
6557 86961 -60258 153177 -154798 -67986 103007 -137802 136553 147032 74399 -210695 -143290
6546 -143290 119506 149058 3425 -170381 -323205 -453479 61367 -5517 148233 -259473 47276
6534 -113602 160809 241012 25622 -206190 162414 -76981 -71679 250291 27651 -529 -13971
6523 -13971 70046 -165503 -353230 162095 -169312 178986 -216520 -239322 204399 -71849
6512 -49582 -262429 44671 -29075 -314578 -177716 -152411 -205111 -33833 -292837 -388774 238636
6500 59217 204178 -44382 114987 -35426 -271845 -26847 -35756 69511 -154820 -106088 -20603
6488 -113819 37131 -47308 185706 -368053 184749 180923 -165955 35992 -195056 69955 170578
6477 170578 -176146 -180924 -475369 -95113 212883 -37051 56239 38125 -353847 341472 -193794
6465 -5915 -48104 -66689 -214978 178685 31047 -101041 -504633 168730 134450 217224 -35746
6453 -132444 -264947 61097 93690 198229 -41963 200003 187979 88604 -304556 -62583 -463163
6442 -463163 -270101 7092 1800 152299 118843 -1103 43997 271819 -155294 78527 51182
6431 51182 51063 -97965 -80708 184763 -74189 -101249 -121548 185781 -67748 251981 150690
6420 150690 172091 -385441 -73204 217530 -60407 -180660 -22662 3546 -249698 52800 -155608
6408 -74720 165517 -39733 108560 -72817 151617 -70360 -398099 -130756 475740 -28919 47501
6396 107526 -48737 29988 -88029 303386 -69306 6511 136077 -235833 4352 -14409 -329537
6385 -329537 182072 -164842 -264707 -47798 -156583 -427782 194388 -11384 33822 55858 -95001
6373 -6597 104322 5379 169219 69756 -437467 122703 -102285 -20714 -52178 140026 -75610
6361 -110542 72669 62462 167536 39773 -3932 -14149 141678 2721 -75210 146372 -46772
6349 106654 10559 -408621 -40545 -88359 -154230 137130 133003 35959 37969 75866 -441186
6337 -116548 109250 -329319 272270 -89039 211708 13283 -174164 -19619 -27521 133747 63073
6325 274224 3172 72567 -77917 14300 -564656 152770 -55153 -391571 -225884 -331210 328086
6313 -60306 -224983 73834 51570 -87606 35400 240656 144926 41305 301715 -24511 302538
6301 -100038 -168889 -176330 -110210 -40912 -141174 50076 242922 -34611 -203950 35958 -448155
6289 263726 -158176 -29205 -233740 -90505 95537 116653 51279 77719 -122683 82465 104333
6278 104333 57346 -66330 -399744 242268 -55715 176978 -50139 -20230 226571 -470210 15577
6266 361050 58351 -70577 272268 -318681 -75025 -366125 210769 188291 53838 -107339 256058
6254 -234032 111916 204383 -67490 26527 -45241 57410 254281 -156322 -249631 -118883 101720
6242 -250478 -172673 93331 -309280 21144 21013 -130556 -114313 71927 391987 -22733 -78758
6231 -78758 -134387 -28348 -67339 -196855 7421 229986 49782 -180716 -91923 -172291 108249
6219 -368631 -35578 15210 -139969 122772 -163890 87946 164123 -165442 -128008 -219105 -226282
6208 -226282 -25579 190600 6697 234489 191996 200204 -479738 87397 -8801 -314912 239124
6196 -98064 140261 -249458 92947 -34402 83921 -298624 71024 -10643 -195197 -171926 143038
6184 -162219 -339984 -58564 85402 50985 60083 112100 201763 62973 -488316 -68617 240807
6172 303284 -29476 88788 -114824 93029 112549 -55748 -75128 69097 212698 -260965 152689
6160 -414103 -123108 273488 -423900 163943 168261 99752 53521 33011 -25580 92181 -173325
6148 -56984 273679 101701 -140170 -59381 -83156 -308764 -165545 196273 -45698 4049 138084
6137 138084 -43301 -270245 -142384 55384 2721 -150480 -34805 142567 108647 225296 137744
6126 137744 -41913 -215061 31621 -227139 264837 146665 -320864 15714 29260 -86716 -7022
6114 409481 205281 -61363 -124839 -139870 34440 -69187 -298874 1794 -160824 -225595 76034
6102 28723 -154042 -222534 310389 -6562 -25377 61966 174571 105940 -85036 -357453 -203867
6091 -203867 143732 -169877 63570 176187 -79467 -367429 -208011 105679 -231322 193249
6080 -12724 29981 -64025 18170 -303934 -38731 124939 1248 -6266 -208855 72736 -136049
6068 -135238 92539 -61131 -53953 70347 -37425 216616 -237922 -135217 -62312 -113406 -106753
6057 -106753 -125474 210661 99370 -137520 -368324 72738 205441 -52135 413623 -252481
6046 -97403 -11018 -64567 66489 101336 52179 -282601 37324 -30831 107817 -106182 65736
6034 22820 -42021 -5897 -148647 168771 -21334 107831 -114041 151816 -90064 139235 -174679
6022 11063 -81605 64951 191005 -188860 -249534 -201857 60317 -254714 159973 -39194 217135
6010 84161 100867 -127062 -342273 372330 -111288 16743 212643 -181031 -77431 423036
5999 -17219 258754 294886 -107057 175405 137556 400509 51576 -131466 246179 -305470
5988 125150 280486 -180770 45555 124664 -142221 90335 171521 201213 129148 -259986 -174868
5977 -174868 57790 363508 -26294 272514 55062 23102 -133922 -178163 -68551 -12655 -13737
5966 -13737 -88175 292502 -165925 -34607 -241057 -38094 -103974 11858 817 -244375 -118776
5954 17313 -459944 69911 88735 -88407 -222194 -195286 -12073 159 171180 -147437 -167793
5943 -167793 -190806 -72964 94273 104059 337276 -135875 -126878 182080 -4971 -179465 363945
5931 -28956 290854 -88398 -188547 63056 -98258 373979 -125185 -53835 357204 66111 171411
5920 171411 181334 32031 166829 67851 159471 -254096 4673 87064 -384114 -53826 -110736
5909 -110736 75273 220556 30192 294438 147839 -41108 -52078 -4700 -300400 145212 136456
5898 136456 -57372 -87314 164272 -315954 -210487 -325628 -73240 117667 -116600 147883
5887 -67972 26275 -318842 -114368 187767 -148637 -43019 -188096 65689 -152332 -13802 -99554
5876 -99554 -98823 -44075 10107 150912 77950 -295328 167262 301651 -54419 176319 -322987
5864 107867 45122 -245399 11930 63635 140175 158747 105867 -546399 352038 -28803 -158089
5853 -158089 -135359 180096 -292 317213 76544 -490027 -104874 93608 215829 296523 -98571
5841 198343 -8220 -103208 188197 -241063 -43822 -11075 -44801 187798 119602 138142 -215020
5829 315938 -53810 -176199 -64111 129770 -93038 -235242 131485 46198 -255412 159001
5818 -196506 24447 -200102 42463 -36828 155724 -55592 -156856 136232 -151209 -76664 -38017
5806 222798 -112507 -193170 37115 119389 -225016 29043 -112860 136641 27251 -251455 -156986
5795 -156986 51197 20978 -455558 -81179 -94363 -216093 -69642 90616 157402 -128727 64172
5783 -31890 -321807 -81837 45187 2752 142779 -170149 -378376 -94948 227665 -229275 -71369
5771 66522 71961 61889 -21511 284434 -7007 -68228 -252834 -141843 144368 98845 92771 -317452
5758 209305 23159 -114145 -18401 -73239 -128042 181928 172666 -329641 56462 -98819 -38400
5746 -119689 -136067 48062 25001 24198 168974 68270 281420 310203 56391 81973 -15749 -25868
5734 -25868 -106624 -177604 -103433 213506 35256 -35169 -21668 328714 -259844 -82851 -49972
5723 -49972 467682 195633 180158 45742 52203 30580 33132 -151148 -106499 32238 -335221
5711 140398 48946 220115 196882 -63362 5022 -68959 -132880 -235935 -51503 10095 -182836
5699 400737 -30558 9262 -277095 -23737 504206 -37206 -100284 -138284 4048 -423731 -49093
5687 -2484 143220 260499 -155149 22505 188651 -111266 112946 2413 185755 -274978 215265
5675 100034 -12978 179589 100926 -31522 381187 826 -270668 150999 -210032 -34529 167163
5663 -107075 106082 43171 -91061 -18582 -16687 -32558 -30379 -249377 -142137 35968 249306
5652 249306 -51195 -250373 -110014 32592 -321328 -94215 -344932 -97799 549 -190695 -51089
5640 209677 -201982 152611 -168816 143064 14123 -5316 270861 65470 -175766 -50901 -74696
5629 -74696 -213057 -18164 -247632 277859 161831 134237 -201405 -120439 -3537 -259129 19974
5617 -157236 225778 -397375 -114633 -121405 -59623 111454 -13546 136211 165730 -5481 -53185
5606 -53185 -97502 109324 -105842 97335 218605 -55009 -4782 29950 -104375 113815 -133361
5594 68252 -181424 142161 184824 299552 92255 -80209 76369 -103291 269391 -109008 -68489
5583 -68489 -59187 -116329 73134 60947 -36246 -214386 17291 -72451 293578 -222539 46599
5571 68191 -27947 45768 240696 -121570 339793 1455 253625 -135744 261470 22535 112919
5560 112919 66249 201371 -417591 36445 -8013 -127876 160433 183153 -11228 -160541 151738
5548 -80115 11341 -533612 -12352 23290 17032 3598 -13538 -459984 -219441 156243 -117733
5536 -231536 67790 308306 184524 117886 318722 -316432 -124258 -432982 -132819 -166336
5526 -166336 45607 -105975 -18065 174153 249122 19960 -256654 -31688 -10038 163265 -162765
5514 -18282 238761 -369964 339169 121958 -339060 -6003 -13627 -121204 102997 -202986 -218376
5503 -218376 180897 136473 -27510 75135 -141532 79733 -19714 69172 -22961 -202421 336912
5491 -385937 -199717 62616 -225524 -177280 -293730 253873 7073 51254 174127 -130256 -38724
5479 28939 179708 77097 -72040 -22081 181694 50585 165707 -139879 143946 -45577 72709
5467 87948 149602 318908 73584 -57750 -182639 270301 -78778 173384 -188480 -168402 -69799
5455 -33749 293869 -3946 -132725 -12603 -51393 5260 93061 -234149 -69804 139594 -402844
5443 -8003 -106350 84703 -229936 -337057 -20759 147545 108610 -150820 28409 -71655 -228671
5432 -228671 -37137 217864 -214821 235703 -167001 74414 -19616 162149 121591 -69823 38321
5420 185517 108128 346564 44313 214043 218014 264167 -209879 -171598 40813 208267 -146648
5408 184548 371731 93347 27358 347142 -88157 -173590 134799 -4464 105126 68378 64141
5397 64141 -175875 -69073 14845 354656 340811 -146086 160593 47156 -150848 117047 -28690
5385 -150275 4717 -122966 46810 -220389 -150273 284298 -157146 -69974 124581 -99802 167778
5373 141002 -64734 -157882 4136 -300172 101386 -264365 64094 -450155 -241968 25399 -264219
5361 -82415 101302 199435 153224 -257150 -158829 284099 -27757 159407 -161399 -20706 136792
5349 -109144 146616 168559 -126607 33114 -247144 66903 398609 -240391 -131854 -117662
5339 -117662 255745 -86818 161205 -184953 7424 -96202 49436 -28767 -183460 13429 -137657
5327 209700 -75032 16858 137168 195035 -138167 51236 -139549 60624 -110225 -218580 -44329
5315 265660 -194804 43904 149062 206338 -160724 -205438 176995 -14152 10853 232047 11467
5303 -56309 115056 -115057 -42970 126713 116631 -180204 170703 -23309 90825 -40096 -179912
5292 -179912 -84593 -214276 265994 232149 108865 19474 -179722 185347 250075 69921 -46134
5280 215820 77742 206308 79735 -331284 -158667 -327638 127969 -89334 42624 46174 368919
5269 368919 -206063 138671 95821 163254 -219860 -210149 103055 -122713 121819 -49513 35269
5257 -210937 -133387 -58103 129207 294442 197144 113954 178870 626 -48482 353410 -368143
5245 1204 -172780 14812 15201 -380045 -6076 139262 39063 89531 88447 -193189 -155975 106850
5232 -192855 166874 161411 61023 189751 92010 -2124 -238176 92108 250622 -318643 -65918
5220 92854 -58695 -195439 -41794 -161216 89401 -86370 -51054 98409 34193 -4261 -123101
5209 -123101 6322 -214152 218850 -95639 8854 296643 -140533 -242633 30892 -79143 364318
5197 125932 -162372 111417 -394522 304035 207966 -38593 -50560 181196 -43301 64045 33519
5186 33519 -189688 -60354 -194763 249946 347748 109417 148216 170613 -50021 273834 243714
5175 243714 258911 197188 252910 -96077 112938 -129871 -118178 -198303 373254 31163 -402016
5163 206884 -386867 4171 -245427 196827 -240122 -444089 -13921 155140 125415 13328 -152750
5151 -278846 209237 45061 39222 -357394 -8129 359625 70748 -236384 -77742 191815 -210954
5139 133218 182745 -164969 -50283 293204 169104 -144502 -98066 8899 283540 5771 116808
5128 116808 171561 39627 260766 -118266 -34209 -141905 -391644 274144 153526 58897
5117 245329 95871 110122 69811 134899 -100053 -182868 307396 -114437 -139244 -158249 122979
5105 78244 13862 -26759 307278 116734 95507 -22097 -335563 10437 60115 36263 208472
5094 208472 292410 -61987 32972 97805 188590 28577 154414 -40220 167404 -171317 -9005
5082 -70960 -76068 37662 -108797 -83105 -86284 -19612 -54811 -127454 283341 258906 45573 289196
5070 289196 -129039 -370057 179592 79570 82888 -175960 -40995 -31531 -28146 87759 -7623 -188097
5058 -188097 29919 -253653 -1186 32603 15160 133216 -230575 -59685 -7198 -61338 249709
5046 671 67323 -154403 43094 -53057 54886 -503 89643 -25242 -117040 -188346 38120 247121
5034 247121 82172 -109875 452671 74927 255430 -108394 -219939 208930 -334592 -173002
5024 -173002 142868 296847 107522 -55878 87890 -200546 163178 -86990 -466185 -120589
5013 -14115 -52066 19678 216371 248334 128697 333167 154796 -87460 11659 6538 105848
5002 105848 62641 -103092 -35073 -271865 248518 334857 166235 -4880 202564 150167 -83432
4990 -177640 417116 -430219 -139761 75142 215422 -12551 -42786 -293298 -40485 356808
4979 7762 -60750 -134131 313075 396588 135706 62140 50834 -61150 116301 -282187 73298
4967 -110058 206974 73756 -2150 106361 -94405 19487 -269093 -161822 21383 48586 -23204
4955 -15509 43745 -346042 -47282 -18637 282220 -72033 -111733 169689 -181868 180186 56652
4943 -172613 596105 -142536 -126331 -291335 20173 -11358 40072 -110583 2911 111081 206194
4932 206194 102241 -897 49869 -40428 -37042 134910 -94094 68023 263618 20248 -223532
4920 147391 -94688 29394 152859 -33049 182454 -86325 -44221 -35409 -283053 263047 -79891
4908 -200360 -174368 -13381 -254782 -320289 -25868 -261002 -3102 187684 -70779 -82291 -289021
4897 -289021 -237687 -413714 -183848 -131268 -182164 19302 104472 -47755 -134958 -276860 62905
4885 -247241 -322330 -60614 -39036 -34844 104022 170105 137106 219529 221765 170918 44281 -102840
4872 124497 -13543 -84951 -144651 -35232 26573 31108 50249 -192367 29113 -271372 -212468
4861 -212468 -181005 39888 163386 -144728 -244871 -8267 9196 -240226 -21385 172359 109159
4850 109159 -79747 79177 -103720 153928 77460 -212289 -41415 156719 152237 332267 44188
4838 -211438 29024 109609 300464 -44931 -289159 235964 106658 -167510 -48129 -55682 119874
4826 -123391 288596 -159792 -134868 231720 160848 233964 -5854 -121692 2300 262969 -144075
4814 83921 -109202 -21647 -138211 167534 -181485 -328200 81142 -199003 -189526 -16178 -112781
4803 -112781 -38643 -25230 125752 -164535 -38001 58093 163345 -152631 -131466 460329 -24590
4791 -84301 -159028 -161850 76375 154 106341 50789 298368 -88679 161712 -197444 -141774 -197164
4779 -197164 103058 -25554 -71834 50104 221455 180832 -37158 -76935 -85801 -51850 215761
4767 75881 113897 -71227 43088 3176 32548 -79245 -90236 -32576 123255 245241 175872 89006
4755 89006 359286 -95291 128246 -62268 -403913 286426 193788 133214 42193 -231871 -92404
4743 -21738 -272972 119528 156611 155640 22788 187086 -26044 -78194 71112 -231311 -164078
4732 -164078 -74787 -43877 188425 -139335 -36243 16841 -14314 -90833 -95052 -444021 -417040
4721 -417040 -84939 151937 -44152 171432 -58205 86884 349760 -39895 59608 -9945 -81619
4710 -81619 30998 87997 71596 -96585 91135 -30845 128311 302204 -95055 -61982 -170144
4699 -170144 -147648 -172764 70953 -97153 -383025 100435 -182488 -83677 -220423 106739 149970
4688 149970 257236 75639 102289 150552 244000 6487 -34455 25927 169965 154524 116193
4677 116193 -243880 382158 5776 -167664 332176 -162787 -165264 144473 450782 -109878
4666 -111985 18099 -313568 -36512 -34580 49461 245127 44751 -60470 178627 -357409 -98379
4654 149965 73968 -36669 -88633 48819 -260004 -199044 -61411 18421 68344 -411428 -3479
4642 77726 212845 23783 -452831 -67688 149476 134603 -125402 9524 -132013 -269235 274653
4630 223709 1642 -64124 265210 -89823 44728 63999 255303 -151254 -198408 -23087 273509
4618 8717 -87843 289227 128835 -27695 219795 117581 427301 98378 -208486 111087 204177
4607 204177 -179636 -80323 -192312 -40325 106459 145925 -46975 227438 -349757 -131585
4596 122908 -9662 -57117 144018 -8601 238776 -71730 -335005 192013 51142 -180706 195845
4584 -138760 56366 -102080 -114023 161360 -36304 -20 191182 168020 231805 164474 223286 23363
4571 176707 -170712 141824 7087 -248043 243514 -48579 86467 16931 -346496 -249913 -88873
4559 -201982 3033 -289032 -36339 -165968 -160846 39667 -106282 182854 173658 -63346 9130 -15779
4546 -201810 -219473 368268 243800 57315 152172 -147485 -4221 -278751 311532 -303275 -369138
4535 -369138 274193 -205467 128973 58045 101451 48186 -142477 -83921 -123638 113937 61194
4524 61194 100870 7146 139780 -173603 144801 -102933 256073 -176545 293009 156308
4514 156308 217752 -31531 219821 147603 -228638 -186574 67883 50031 -132933 230117 45760
4502 12541 214540 102404 -190557 2526 3733 110738 -597323 -136446 -78992 68688 -148048
4490 327470 162356 -44200 -196271 435191 178495 317163 -104208 143196 -166240 112514
$$ [...]
##END NTUPLES=NMR SPECTRUM
##END=
