
##TITLE=AC1157_Cauca-san_5874560_4fybGGggIW
##JCAMPDX= 6.0         $$ Bruker NMR JCAMP-DX V2.0
##DATA TYPE= NMR SPECTRUM
##DATA CLASS= NTUPLES
##ORIGIN= BRUKER
##OWNER= Administrator
$$ 1.72 TOPSPIN		Version 2.1
$$ 2012-03-31 16:15:20.968 -0500  Administrator@TOPSPIN
$$ Compression mode = diff/dup
##.OBSERVE FREQUENCY= 400.13188235
##.OBSERVE NUCLEUS= ^1H
##.ACQUISITION MODE= SIMULTANEOUS (DQD)
##.ACQUISITION SCHEME= undefined
##.AVERAGES= 8
##.DIGITISER RES= 22
##SPECTROMETER/DATA SYSTEM= spect
##.PULSE SEQUENCE= zg30
##.SOLVENT NAME= COFFEE_meoh
##.SHIFT REFERENCE= INTERNAL, COFFEE_meoh, 1, 14.98061
##AUDIT TRAIL= $$ (NUMBER, WHEN, WHO, WHERE, PROCESS, VERSION, WHAT)
$$ ##TITLE= Audit trail, TOPSPIN		Version 2.1
$$ ##JCAMPDX= 5.01
$$ ##ORIGIN= Bruker BioSpin GmbH
$$ ##OWNER= Administrator
$$ $$ C:\Bruker\TOPSPIN/data/COFFEE/nmr/AC1157_Cauca-san_5874560_4fybGGggIW/10/pdata/1/auditp.txt
$$ ##AUDIT TRAIL=  $$ (NUMBER, WHEN, WHO, WHERE, PROCESS, VERSION, WHAT)
(   1,<2012-03-31 16:15:13.312 -0500>,<Administrator>,<TOPSPIN>,<go>,<TOPSPIN 2.1>,
      <created by zg
	started at 2012-03-31 16:14:05.921 -0500,
	POWCHK enabled, PULCHK disabled,
       configuration hash MD5:
       1A 1E CE 29 27 FD 77 03 67 4E F0 E3 C4 B2 CB 90
       data hash MD5: 64K
       B0 0B 6B 59 3C 90 44 D5 F8 BA 03 80 AD 34 DE AB>)
(   2,<2012-03-31 16:15:16.328 -0500>,<Administrator>,<TOPSPIN>,<proc1d>,<TOPSPIN 2.1>,
      <Start of raw data processing
       efp LB = 0 FT_mod = 6 PKNL = 1 PHC0 = 0 PHC1 = 0 SI = 32K 
       data hash MD5: 32K
       97 9F 86 D7 D3 0C 97 89 28 49 78 FB A0 C3 9A 22>)
(   3,<2012-03-31 16:15:16.687 -0500>,<Administrator>,<TOPSPIN>,<proc1d>,<TOPSPIN 2.1>,
      <pk PHC0 = 215.5353 PHC1 = 0 
       data hash MD5: 32K
       98 7C E8 80 B6 63 DA 03 39 47 5E 04 04 47 5E 9D>)
(   4,<2012-03-31 16:15:16.765 -0500>,<Administrator>,<TOPSPIN>,<proc1d>,<TOPSPIN 2.1>,
      <abs ABSG = 1 
       data hash MD5: 32K
       E7 92 BB BE 1F AD 0F FD 25 4E 3F 08 B8 21 6D 90>)
(   5,<2012-03-31 16:15:16.796 -0500>,<Administrator>,<TOPSPIN>,<proc1d>,<TOPSPIN 2.1>,
      <abs ABSG = 2 
       data hash MD5: 32K
       D3 6E F4 31 AD 97 AC 98 AB E7 B6 E5 08 DD 18 8C>)
(   6,<2012-03-31 16:15:16.828 -0500>,<Administrator>,<TOPSPIN>,<proc1d>,<TOPSPIN 2.1>,
      <abs ABSG = 3 
       data hash MD5: 32K
       85 1C 42 3B 63 53 8F FD 27 29 C5 05 4C 6F 95 A7>)
(   7,<2012-03-31 16:15:16.875 -0500>,<Administrator>,<TOPSPIN>,<proc1d>,<TOPSPIN 2.1>,
      <abs ABSG = 4 
       data hash MD5: 32K
       0A D4 5E 5F CE 1D 87 81 C8 97 C8 6F 86 B7 CA 0F>)
(   8,<2012-03-31 16:15:16.906 -0500>,<Administrator>,<TOPSPIN>,<proc1d>,<TOPSPIN 2.1>,
      <abs ABSG = 5 
       data hash MD5: 32K
       AD 55 12 F7 E8 26 4A 5F 79 91 03 AE F7 82 FD 31>)
$$ ##END=
$$ 
$$ $$ hash MD5
$$ $$ 5D 20 9A 3D 37 1C 0F 92 D0 F9 99 F2 F8 BA CE D4
##$RELAX= 
##$RELAX= 
##$RELAX= 
##$RELAX= 
##$RELAX= 
##$RELAX= 
##$RELAX= 
$$ Bruker specific parameters
$$ --------------------------
$$ [...]
##$TP= (0..7)
150 150 150 150 150 150 150 150
##$TP07= 0
##$TPNAME0= <>
##$TPNAME1= <>
##$TPNAME2= <>
##$TPNAME3= <>
##$TPNAME4= <>
##$TPNAME5= <>
##$TPNAME6= <>
##$TPNAME7= <>
##$TPOAL= (0..7)
0.5 0.5 0.5 0.5 0.5 0.5 0.5 0.5
##$TPOFFS= (0..7)
0 0 0 0 0 0 0 0
##$TUNHIN= 0
##$TUNHOUT= 0
##$TUNXOUT= 0
##$USERA1= <user>
##$USERA2= <user>
##$USERA3= <user>
##$USERA4= <user>
##$USERA5= <user>
##$V9= 5
##$VALIST= <valist>
##$VCLIST= <CCCCCCCCCCCCCCC>
##$VD= 0
##$VDLIST= <DDDDDDDDDDDDDDD>
##$VPLIST= <PPPPPPPPPPPPPPP>
##$VTLIST= <TTTTTTTTTTTTTTT>
##$WBST= 2048
##$WBSW= 25
##$XGAIN= (0..3)
0 0 0 0
##$XL= 0
##$YL= 0
##$YMAX_a= 529866
##$YMIN_a= -635170
##$ZGOPTNS= <>
##$ZL1= 120
##$ZL2= 120
##$ZL3= 120
##$ZL4= 120
##$ABSF1= 14.98061
##$ABSF2= -5.57192
##$ABSG= 5
##$ABSL= 3
##$ALPHA= 0
##$AQORDER= 0
##$ASSFAC= 0
##$ASSFACI= 0
##$ASSFACX= 0
##$ASSWID= 0
##$AUNMP= <proc_prof1d_extract_pilot.lims>
##$AXLEFT= 0
##$AXNAME= <>
##$AXNUC= <1H>
##$AXRIGHT= 0
##$AXTYPE= 0
##$AXUNIT= <>
##$AZFE= 0.1
##$AZFW= 0.1
##$BCFW= 0
##$BC_mod= 0
##$BYTORDP= 0
##$COROFFS= 0
##$CY= 15
##$DATMOD= 1
##$DC= 0
##$DFILT= <>
##$DTYPP= 0
##$F1P= 0
##$F2P= 0
##$FCOR= 0.5
##$FTSIZE= 32768
##$FT_mod= 6
##$GAMMA= 0
##$GB= 0
##$INTBC= 1
##$INTSCL= 1
##$ISEN= 128
##$LB= 0
##$LEV0= 0
##$LPBIN= 0
##$MAXI= 10000
##$MC2= 0
##$MEAN= 0
##$ME_mod= 0
##$MI= 0
##$NCOEF= 0
##$NC_proc= -8
##$NLEV= 6
##$NOISF1= 0
##$NOISF2= 0
##$NSP= 0
##$NTH_PI= 0
##$NZP= 0
##$OFFSET= 14.98061
##$PC= 1
##$PHC0= 215.5353
##$PHC1= 0
##$PH_mod= 1
##$PKNL= yes
##$PPARMOD= 0
##$PPDIAG= 0
##$PPIPTYP= 0
##$PPMPNUM= 2147483647
##$PPRESOL= 1
##$PSCAL= 4
##$PSIGN= 0
##$PYNMP= <proc.py>
##$REVERSE= no
##$SF= 400.13
##$SI= 32768
##$SIGF1= 0
##$SIGF2= 0
##$SINO= 400
##$SIOLD= 32768
##$SPECTYP= <>
##$SREGLST= <1H.CDCl3>
##$SSB= 0
##$STSI= 32768
##$STSR= 0
##$SW_p= 8223.68421052632
##$SYMM= 0
##$S_DEV= 0
##$TDeff= 65536
##$TDoff= 0
##$TI= <>
##$TILT= no
##$TM1= 0
##$TM2= 0
##$TOPLEV= 0
##$USERP1= <user>
##$USERP2= <user>
##$USERP3= <user>
##$USERP4= <user>
##$USERP5= <user>
##$WDW= 1
##$XDIM= 32768
##$YMAX_p= 472070185
##$YMIN_p= -779532
##$CURPLOT= <Network HP LaserJet P1505>
##$CURPRIN= <$Network HP LaserJet P1505>
##$DFORMAT= <normdp>
##$LAYOUT= <+/1D_H.xwp>
##$LFORMAT= <normlp>
##$PFORMAT= <normpl>
##$SURQMSG= 1
$$ End of Bruker specific parameters
$$ ---------------------------------
##NTUPLES= NMR SPECTRUM
##VAR_NAME=  FREQUENCY,     SPECTRUM/REAL,   SPECTRUM/IMAG
##SYMBOL=    X,             R,               I
##VAR_TYPE=  INDEPENDENT,   DEPENDENT,       DEPENDENT
##VAR_FORM=  AFFN,          ASDF,            ASDF
##VAR_DIM=   32768,         32768,           32768
##UNITS=     HZ,            ARBITRARY UNITS, ARBITRARY UNITS
##FACTOR=    0.250966925370066, 1,           1
##FIRST=     8223.43324360095, -106585,      11609
##LAST=      0,             -123228,         -138790
##MIN=       0,             -779532,         0
##MAX=       8223.43324360095, 472070185,    0
$$ Real data points
##PAGE= N=1
##DATA TABLE= (X++(R..R)), XYDATA
$$ [...]
19481a64541j39508k15504E1302b60385a4965n579j49421d0307k29448J04009
19471a65746L3999l25916b9878j66263D7891c15792a56179M8837b7624A45650
19460g9735A6349d3311a4463I7506h6907a7440j42809a0722n2774k54167a19203
19448a61583j3690B8979d8472G4405K68052G7957a80699j5979A25933a29902B9344
19436a7202j02442p0526c6139o6357B13611i0680b2450I3350A6506J8929c4036
19424c23513a21845l3849D5362a19968a2744D4094b75778h8326A05791a80763
19413h4736E1237J12898j7988b5614r479j1250H8348a90756P9321b5712A50504
19401h5451k7624A4271a92561B0971c3349r9090j35717j19140a68909K0003q7875
$$ y = [-164541, -304049, -519553, 51302, -260385, -14965, -20544, -169965, -40307, -269755, -165746, -131747, -457663, -29878, -196141, 47891, -315792, -156179, -107342, -27624, 145650, -79735, 16349, -43311, -14463, 97506, -86907, -17440, -160249, -10722, -63496, -317663, -119203, -161583, -175273, 28979, -48472, 74405, 342457, 77957, -180699, -196678, 125933, -129902, 29344, -17202, -119644, -190170, -36139, -102496, 213611, -90680, -22450, 93350, 16506, 35435, -34036, -323513, -121845, -155694, 45362, -119968, -12744, 44094, -275778, -88326, 105791, -180763, -84736, 51237, 164135, 146147, -25614, -35093, -46343, 88348, -190756, -111435, -25712, 150504, -85451, -113075, 14271, -192561, 20971, -33349, -132439, -268156, -387296, -168909, -148906, -236781]
19390b36781K0134d0040n0958p3721k38455c9494j42508k14703D8945c4036j20788
19379a54824f1319H7656Q3659g418B08312L5859b60363M1206R9894b6168k9584
19368e5752j29982A748a83449A38429A7389j587b22450h1370I9409A3499b06715
19356c36364A20796r514d2626p7849q2054j42100h5276m7234C7897a36275H9025
19344h892B57745a96281M9065B08044a5904l49094G0984e11802A72302g8158B83500
19332B33020A2759a42493j41545d4652a6267o0948K6850E0305c94926a85930K3285
19321a62645A12403D004b32942M1848O6791j35111e6710B05231i1960A22127a19514
19309b14632a02113A23820a50989l098e5871l03080D2907c37454J33002C48917
$$ y = [-236781, -216647, -40040, -90998, -164719, -403174, -39494, -182002, -396705, 48945, -34036, -154824, -61319, 87656, 171315, -7418, 208312, 244171, -260363, -219157, -119263, -26168, -55752, -185734, 1748, -183449, 138429, 17389, 15802, -222450, -81370, 99409, 13499, -206715, -336364, 120796, 111282, -42626, -120475, -202529, -344629, -85276, -132510, 37897, -136275, 89025, -8892, 257745, -196281, -147216, 208044, -15904, -364998, 70984, -511802, 172302, -78158, 283500, 233020, 12759, -142493, -284038, -44652, -16267, -77215, -50365, 50305, -394926, -185930, -162645, 112403, 4004, -232942, -191094, -124303, -259414, -56710, 205231, -91960, 122127, -119514, -214632, -102113, 123820, -150989, -154087, -55871, -358951, 42907, -337454, -204452, 348917]
19298C974b74758d9772Q121j51072B5013a79067l2955c4908n9681p9958r2089
19287b66636K0502R9215A49258e97521a24661j56225H6943B8958c0921a1590A1685
19275c90577o7275A14181a31070l2960f6531j31094A11496a83499h3546E4212
19264D9242a69644l0427B33652b15986G6394l984B5768a45186G1762e0895k17459
19253b68354B44660b03178g0058L1183k0697m7828o642j05401d5213k45730A01965
19241a53108H4384j3373a56329k4090D72951h5344j53378f7374D0031L7164h8047
19229i3419C7947J12803b07011J02240j03919d381o6696n0845f05H3271B402J00786
19217A03188b17313M3457C7475a31736C4471a44598j02110A08275c1107j94723
$$ y = [3974, -274758, -49772, -41651, -192723, 25013, -179067, -212022, -34908, -94589, -174547, -266636, -246134, -146919, 149258, -597521, -124661, -280886, 86943, 28958, -30921, -11590, 11685, -390577, -457852, 114181, -131070, -164030, -66531, -197625, 111496, -183499, -83546, 54212, 49242, -169644, -200071, 233652, -215986, 76394, 72410, 25768, -145186, 71762, -50895, -268354, 244660, -203178, -70058, -38875, -59572, -107400, -114042, -219443, -45213, -290943, 101965, -153108, 84384, 71011, -156329, -180419, 472951, -85344, -238722, -67374, 40031, 77195, -88047, -93419, 37947, 150750, -207011, -104771, -208690, -4381, -71077, -121922, -605, 83271, 2402, 103188, -217313, -173856, 37475, -131736, 34471, -144598, -246708, 108275, -31107, -225830]
19207b25830B9912a05683j16538N5718K4075q9059P358j09052A107b34878j62081
19196c96959c0511r4414o5331N6000n4903G8802a36513A02283a84878k24159A99636
19184E9244b31760d7511j36469c5068A09569a36201K5070A13498b36702j44013
19174c80715N5548B0427J01117b70502E8708b43036f0054H0567A2722J14535c8632
19162B67262D5391a61770j0377B1584K7003J46888B6051d61774J25097a23454
19151A20497m2166a76551B4910Q4894b38919q798A17160a46117F3355b2701B95815
19139A44582a62571c6484J0140A07744O4468a28648Q520J0774B7670b53518A61454
19127A25355E4068a94617j50183i1883j70583d5217l0222K2927E0928J94038d14414
$$ y = [-225830, 29912, -105683, -222221, -166503, -142428, -231487, -224129, -333181, 1107, -234878, -396959, -30511, -124925, -190256, -134256, -189159, 78802, -136513, 102283, -184878, -409037, 199636, 59244, -231760, -47511, -183980, -35068, 109569, -136201, -111131, 113498, -236702, -380715, -325167, 20427, 121544, -270502, 58708, -243036, -60054, 80567, 12722, 127257, -38632, 267262, 45391, -161770, -172147, 21584, 48587, 195475, 26051, -461774, -336677, -123454, 120497, 78331, -176551, 24910, 109804, -238919, -247717, 117160, -146117, 63355, -22701, 295815, 144582, -162571, -36484, -26344, 107744, 172212, -128648, -120128, -109354, 27670, -253518, 161454, 125355, 54068, -194617, -344800, -91883, -262466, -45217, -75439, -52512, 50928, 244966, -414414]
19115d5468o9828A85630g1624k64911e4274B77560p7020o8017E8553J82235a39097
19103b2887k52872J12970O7316k53278G3449a16675k8657M1205A50131o9641a13221
19091B34955a89826H392L28509e1413A5908b17218N4180J7231j63423a24984j85881
19080c10865Q4270h5611c6995p3331A94189M699g2979r5144j2828J6718A54384
19068B33240A8480Q9071B7086a21655A02674a56653B5149e06161K42763p0633
19058c34031B7923b511j54811J9265A08882a13437G741K375a91562k97180G0300
19046e4776n3568L708j53980b7956n7171k37015e795k02827A59663p6171L4399
19035A17891e9803l1437A12822P9580b08814A9893a69711C8128c75618B61998
$$ y = [-45468, -115296, 185630, -71624, -336535, -54274, 277560, 200540, 132523, 58553, 240788, -139097, -22887, -275759, -162789, -95473, -348751, 73449, -116675, -145332, -104127, 150131, 80490, -113221, 234955, -189826, 8392, 336901, -51413, 15908, -217218, -163038, -145807, -309230, -124984, -310865, -226595, -85611, -36995, -110326, 194189, 198888, -72979, -168123, -180951, -164233, 154384, 233240, 18480, 107551, 27086, -121655, 102674, -156653, 25149, -506161, -263398, -334031, 27923, -2511, -157322, -138057, 108882, -113437, 7741, 10116, -191562, -488742, 70300, -54776, -108344, -104636, -258616, -27956, -85127, -322142, -5795, -208622, 159663, 83492, 117891, -59803, -91240, 112822, 192402, -208814, 19893, -169711, 38128, -375618, 261998]
19024C13729e2294C10951a37285K7813C44562A47441c44941A25446b93099A7171
19013e601k14371B09511a36394R063B4460J35642c9412p6637n381c2172o081B6919
19000a43898j64552i9977r5696c178j54366B63789F4421J80608h5609N495E4293
18988f7557k09591q351A0719g3940j03285F5310a49263A95365F055h9644j390
18977i1034C8987J29967e44969J32965e7867G8428O6433m1861B5077a04567j4729
18966a19296l040j71570a22128A99278p1910a32974e4735A65426J00768J38795
18956D04989G3930c6407E8591P4439L35735I7182J7827K8163K34326C3871a5334
18944H3771a23898A9406a92691J9567n5776A54294c05920H696P2237J04947A2367
$$ y = [313729, -52294, 310951, -137285, -109472, 344562, 147441, -344941, 125446, -293099, 17171, -5601, -219972, 209511, -136394, -127331, 24460, 160102, -39412, -116049, -121430, -32172, -38253, 26919, -143898, -308450, -99977, -195673, -3178, -157544, 263789, 64421, 245029, -85609, -80114, 54293, -67557, -277148, -285499, 10719, -73940, -177225, 65310, -149263, 195365, 6055, -89644, -91034, 38987, 168954, -544969, -412004, -57867, 78428, 144861, 103000, 25077, -104567, -119296, -122336, -293906, -122128, 199278, 127368, -132974, -54735, 165426, 266194, 404989, 73930, -36407, 58591, 133030, 468765, 97182, 115009, 143172, 377498, 33871, -15334, 83771, -123898, 19406, -192691, -173124, -228900, 154294, -305920, 8696, 80933, 185880, 12367]
18932a4000A62336b58844H2095c409k07453H4863J09964h56G6770a54584a6068
18920c10270C8844f3658p9365N5205M508l1796B06954f4817l3485j25916f7618
18908h1193J2414H8751K4299a5241r2517C4407J79341a72086F1009a8760B00505
18896b82866C88443q4694L0775m7639m2273a00575I444J6363C645a0063A19010
18884C69275a88915j20548A35642c92861a87547g36k82368B63270a5888A2366
18873A23701L7583a49137k4207G4148d8087A08695i4410j84520O8090p615E1083
18861B00154H955J07297g6240D3277J87300f267A02460b01095G2411E124K5977
18850C1101e7926I7426a79780A26588k1747b42911C7219c00747J11825C28664
$$ y = [-14000, 162336, -258844, 82095, -3409, -210862, 84863, 194827, -856, 76770, -154584, -16068, -310270, 38844, -63658, -143023, -87818, -83310, -115106, 206954, -64817, -98302, -224218, -67618, -81193, -68779, 88751, 113050, -15241, -107758, 34407, 213748, -172086, 61009, -18760, 200505, -282866, 388443, 303749, 334524, 286885, 244612, -100575, 9444, 25807, 3645, -10063, 119010, 369275, -188915, -309463, 135642, -392861, -187547, -736, -283104, 263270, -15888, 12366, 123701, 161284, -149137, -173344, 74148, -48087, 108695, -94410, -278930, -210840, -218455, 51083, 200154, 8955, 116252, -76240, 43277, 230577, -6267, 102460, -201095, 72411, 5124, 31101, -57926, 97426, -179780, 126588, 104841, -242911, 37219, -300747, -188922, 328664]
18839a89534Q3704A402h8316A40232E8789Q0492j5868a8753p2851p7730j36629
18828c05963A35379a10159A57749B3718G515b28308R9333N8598q8193B64755i5279
18816D0258L3017c99429a77493g6127k08164a19541e6536a5707C2272j502P2286
18805A03056J8251K76893F8725c1859l42490b4618j83098e973F4923K51545A56764
18793A97884H2643f4379j15280O7212l449B522a54757D998R1737a35959h828k73359
18781b82187j5756b7067k30666e3034n7410k42356a08662A19834K2995n187i910
18769d6817l2075C5240g8831r4702d8001A32126A3654b17770J1868e134E592c04251
18756I6150a08020A02041i6780c4668A87636o0098b92880F4992M8586b46517k00248
$$ y = [-189534, -105830, 1402, -88316, 140232, 58789, 139281, 123413, -18753, -91604, -169334, -305963, 135379, -110159, 157749, 23718, 7515, -228308, -128975, -70377, -158570, 264755, -95279, 40258, 73275, -399429, -177493, -76127, -284291, -119541, -56536, -15707, 32272, 30770, 103056, 121307, 398200, 68725, -31859, -374349, -24618, -207716, -5973, 64923, 316468, 156764, 197884, 82643, -64379, -179659, -112447, -115896, 2522, -154757, 4998, 96735, -135959, -8828, -282187, -297943, -27067, -257733, -53034, -110444, -352800, -108662, 119834, 142829, 137642, -9910, -46817, -78892, 35240, -78831, -173533, -48001, 132126, 13654, -217770, -205902, -5134, 5592, -304251, 96150, -108020, 102041, -96780, -34668, 187636, 127538, -292880, 64992, 113578, -246517, -446765]
18745d46765a28213D7508b10788A7856M81106E3078a62723L07j51300A31719j198
18734A30521a85082g464j94134p3852H3367C9699a0231B57832c98104M5314c0016
18722D6497a04617A67545a0923F4344a17886I5573h1735A27171i7051j16183r4607
18711c07841b3510N118B0790a06147r9110A56138B4912M12968G2226j6598a21652
18699a20473k24563c8354n10812h517A34271C6090R9407a4558o25B0996b4402
18687b30646D8818d18560b2918H7441f8842f319j67440B20112h0632L4994j5123
18676f0761C9425a70051A17862c08066Q5041P1948J6396j50377H9052A4932a45726
18664a7565l11953A09648e3891A91737d1362A48465f5187E4477c2354D66698b61461
$$ y = [-446765, -128213, 47508, -210788, 17856, 498962, 53078, -162723, -162416, -313716, 131719, 130521, -185082, -7464, -201598, -275450, 83367, 39699, -10231, 257832, -398104, -352790, -30016, 46497, -104617, 167545, -10923, 64344, -117886, 95573, -81735, 127171, -97051, -213234, -307841, -23510, -18392, 20790, -106147, -205257, 156138, 24912, 437880, 72226, 55628, -121652, -120473, -345036, -38354, -549166, -8517, 134271, 36090, 135497, -14558, -15183, 20996, -24402, -230646, 48818, -418560, -22918, 87441, -68842, -6319, -173759, 220112, -80632, -45638, -60761, 39425, -170051, 117862, -308066, -223025, -151077, -134681, -285058, 89052, 14932, -145726, -17565, -329518, 109648, -53891, 191737, -41362, 148465, -65187, 54477, -32354, 466698, -261461]
18652A78193G3044g414p7423F8614d11443K02983A4885b40769A95328a53925K0850
18641a33075k93035a390H5447b5716M229j3995n8908A71552b17947j4148H4689
18629b42867B5114N3106J3775D5136L3548M2537a54143a0264m39257A39702a24547
18617c22514c9028q6498j38791c9992A06214a65261G4955J00099A7232a0754G287
18605C38179E6734K1489K70094I0389k1536a08668H8553c32420A8950e65538A75256
18593b43095D0162a10438J865m6269b9734l056m875P076A29115m0881g4425f16
18580A68420a63455A95791e01849A02405c50251I7758c2066A2315K16608a13587
18569F200b2680j78841A53610g2349m7705B89114a6464A98755b21894J5592R7891
$$ y = [178193, 73044, -7414, -84837, 68614, -411443, -208460, 14885, -240769, 195328, -153925, -133075, -426110, -1390, 85447, -25716, -21487, -35482, -94390, 171552, -217947, -232095, 84689, -242867, 25114, 78220, 91995, 45136, 78684, 121221, -154143, -10264, -449521, 139702, -124547, -322514, -39028, -125526, -264317, -39992, 106214, -165261, 74955, 175054, 17232, -10754, 7287, 338179, 56734, 78223, 348317, 90389, 68853, -108668, 88553, -332420, 18950, -565538, 175256, -243095, 40162, -110438, -108573, -154842, -29734, -32790, -37665, -30589, 129115, 88234, -74425, -616, 168420, -163455, 195791, -501849, 102405, -350251, 97758, -32066, 12315, 228923, -113587, 6200, -22680, -201521, 153610, -72349, -120054, 289114, -16464, 198755, -221894, -206302, -108411]
18558a08411B16562l1514L166a00859G025P0287d2732A87759b53534d3272B9262
18546c62027A19089K0134C096a17643o1353P3162B4689a25761j80237N0473f4362
18534a9274r9276M2529r6875a7184j00316k67516H3764b04557F5639a43499k03498
18523c46997a10957j08562M225A78221p5430C4630c05071d0117k07940A78543
18512A14545m1839c20025J59423J6880B4512c12148A0767J24435b33336F8615
18501a70738j17198f2112B5554e9276k67173c188j29459C9294M2761c9573A03721
18489a2025j18173b1264q3920M6853n2245L1043l4757C4385e2798A33919B4152
18477d08108D5813f56C3114d7452l6471L2117k05859J17435J3435B56779b6895
$$ y = [-108411, 216562, 185048, 188214, -100859, 7025, 77312, -42732, 187759, -253534, -43272, 29262, -362027, 119089, 139223, 3096, -117643, -178996, -105834, 24689, -125761, -305998, -255525, -64362, -19274, -118550, -76021, -172896, -17184, -117500, -385016, 83764, -204557, 65639, -143499, -346997, -110957, -219519, -215294, 178221, 102791, 34630, -305071, -40117, -248057, 178543, 114545, 72706, -320025, -160602, -143722, 24512, -312148, 10767, 135202, -233336, 68615, -170738, -287936, -62112, 25554, -59276, -326449, -3188, -132647, 39294, 82055, -39573, 103721, -12025, -130198, -21264, -105184, -58331, -110576, -79533, -114290, 34385, -52798, 133919, 24152, -408108, 45813, -656, 33114, -47452, -83923, -51806, -257665, -140230, -126795, 256779, -26895]
18465C2676c21874A87924a12212d4792l59480A48972a05285L4487l2898E9512
18454G000b48584P9710k30967J52123d0846p3328A30029d6044C0119i300o1459
18443g0759r372J4682k15903a03489L8908B48878H4608e3492B57028r1855k4700
18432A40473a61177F5207a1113j59526B20908r7212C2433L5640O2664b06903Q9624
18421a17279A56448b26060F4061c00960B00331b81766c7780B02496H2953a16558
18410A9599K94130b19990B16202d9216m2210A16730P6606g3391C1847a8698G2035
18398B14406b5295D7531h0589p6780E6262B6667J47131r133m9479a45326f7498
18386A87671a4127D7389Q954K8376M8287c68539b8001a563j08852Q183l012p3343
$$ y = [32676, -321874, 187924, -112212, -44792, -404272, 148972, -105285, -70798, -103696, 59512, 7000, -248584, -168874, -399841, -247718, -40846, -114174, 130029, -46044, 30119, -9300, -70759, -80131, -65449, -281352, -103489, -64581, 248878, 84608, -53492, 257028, 165173, 140473, -161177, 65207, -11113, -170639, 220908, 123696, 32433, 68073, 130737, -206903, -117279, 156448, -226060, 64061, -300960, 200331, -281766, -37780, 202496, 82953, -116558, 19599, 313729, -219990, 216202, -49216, -91426, 116730, 193336, -73391, 31847, -18698, 72035, 214406, -25295, 47531, -80589, -157369, 56262, 26667, 173798, 164665, 115186, -145326, -67498, 187671, -14127, 47389, 56343, 84719, 133006, -368539, -28001, -1563, -110415, -102232, -105244, -178587]
18374a78587k8319c5975q8455k96059A14660j9797c25298B07944b6353k09386
18364b35739a11425B16317I6302g3597B0638a00219A60561O8609D9404c85803
18353a39636A04655j114J3018a87093g8964b075C5011J97539b57913C1055b43865
18341F0185J8061f601q7090B64000d2806C07800L1164B5767c25793c6183l15782
18330c51965C69079c56468e1593C4780b08735I9101P2198n8344O3900b17091R9367
18319a17724k9492c1586j5162q4389A7846a89683e8932C8147K98458i0067j66221
18308b56288B7569c0129R269j22290N4165B5608J04338J00031i8830g299k38177
18297b45476A40718a76670A95748b34025m03760A76552f9375k05010d9942p304
$$ y = [-178587, -206906, -35975, -124430, -420489, 114660, 94863, -325298, 207944, -26353, -235739, -111425, 216317, 96302, -73597, 20638, -100219, 160561, 229170, 49404, -385803, -139636, 104655, 103541, 116559, -187093, -78964, -2075, 35011, 232550, -257913, 31055, -243865, 60185, 78246, -6601, -93691, 264000, -42806, 307800, 338964, 25767, -325793, -36183, -351965, 369079, -356468, -51593, 34780, -208735, 99101, 171299, 112955, 176855, -217091, -117724, -147216, -31586, -46748, -131137, 17846, -189683, -58932, 38147, 336605, -90067, -256288, 27569, -30129, -20860, -143150, -88985, 25608, 129946, 229977, -98830, -7299, -245476, 140718, -176670, 195748, -234025, -637785, 176552, -69375, -274385, -49942, -57246]
18287e7246D9493e95740B05828l9634N4277j2059B3834J79272h1203F7431b5824
18275A3080f3310k35862E8715Q9938F552i3344q6064B23692b82153g676B02078
18263C66419i9251m1962H4100J50667c66685I6218a5173k78574f5894B64599O9419
18252C34018H7492b64483f8236D7291J18878a69488r71B69328m4736a83561C8206
18240C6258P5767n0351b0341j8815E8461B6554R9358p606B770b1433l03353i3482
18227B1707c59877a5083l75000A81595a34062j09435A7322J01641C3475M8797
18217H2272J5847a43620N5937I4454f4131n9848N3661n5500B96232F3693J80181
18206B43874o1270i4085A97846H3981a31127J4466I1626i7732A9060b29456B9504
$$ y = [-57246, 49493, -595740, 205828, 166194, 220471, 208412, 23834, 203106, -81203, 67431, -25824, 13080, -63310, -299172, 58715, 148653, 6552, -93344, -179408, 223692, -282153, -7676, 202078, 366419, -99251, -141213, 84100, 234767, -366685, 96218, -15173, -293747, -65894, 264599, 334018, 87492, -264483, -68236, 47291, 166169, -169488, -170459, 269328, 224592, -183561, 38206, 36258, 112025, 61674, -20341, -39156, 58461, 26554, 125912, 118306, 2770, -21433, -324786, -93482, 21707, -359877, -15083, -390083, 181595, -134062, -243497, 17322, 118963, 33475, 82272, 98119, -143620, -87683, 94454, -64131, -123979, -70318, -125818, 296232, 63693, 243874, 182604, -94085, 197846, 83981, -131127, -116661, 91626, -97732, 19060, -229456, 29504]
18194I3579D71b77902a9470B2694J55721E2425c43913b1684k49485A79247c7520
18182A02981b43560D4607K47517j14188f2729j21729A59285b0384B28903E0305
18171c184j15609n0977j42975C41232C8813f8190A56133e8363J7411m9850j10835
18160b01637O4272j21889b2754n7890A26096F0027f7139A02502a96277e2938C2648
18148A91523a93486h8652H6235L5559b42612a20063H1204b0541j37755A7624K35661
18137B53285R101b41656a20221n2913c8960j07976A7765K5769a34225f928j87662
18126a94590b3188q0615r9090A0684J31613a39266B07301b5586D6363a84192Q2508
18115a01684l9959F3884K09962b54326P2638a1400A28783d037A76693F9130c2622
$$ y = [93579, 471, -277902, -19470, 22694, 178415, 52425, -343913, -21684, -271169, 179247, -37520, 102981, -243560, 44607, 292124, 177936, -62729, -184458, 159285, -20384, 228903, 50305, -3184, -118793, -169770, -312745, 341232, 38813, -68190, 156133, -58363, -40952, -90802, -201637, -137365, -259254, -22754, -80644, 126096, 60027, -67139, 102502, -196277, -52938, 32648, 191523, -193486, -88652, 86235, 121794, -242612, -120063, 81204, -20541, -158296, 17624, 253285, 262386, -241656, -120221, -173134, -38960, -146936, 17765, 43534, -134225, -6928, -194590, -23188, -103803, -202893, 10684, 142297, -139266, 207301, -25586, 46363, -184192, -101684, -141643, 63884, 273846, -254326, -181688, -11400, 128783, -4037, 176693, 69130, -32622]
18103B89116F2236a66015C5462a42697A75887i8517c5757l8363j09929A24126
18092C02826j22991q3959k0378a34438B87715r6781k9154A0676n032O0957e6492
18080a85111C27173A01705a02054b6490r2607e6613A29070d5209B41710d7158
18069F1078h5418B5422l762R4238J92495a48634E8025E912J1808b02268M4044
18058a58224A04620g574j76554b2228G7242K60560F0470a2738A74579K5899a03077
18046g6435K9417A16408a02697A14418g2701B8050c03349a03743A11909c2098
18035a02314C37965A34035J15841K2819j32992E9708a19787n5561B04206d2639
18024a40626M4524C31007d1610m77164a64317j26694A173b5615A23878j2229d2942
$$ y = [289116, 62236, -166015, 35462, -142697, 175887, -98517, -35757, -74120, -184049, 124126, 302826, 179835, 95876, 75498, -134438, 287715, 190934, 161780, 10676, 5644, 66601, -56492, -185111, 327173, 101705, -102054, -26490, -119097, -56613, 129070, -45209, 241710, -47158, 61078, -85418, 25422, 21660, 115898, 308393, -148634, 58025, 5912, 17720, -202268, -158224, 104620, -7574, -184128, -22228, 77242, 337802, 60470, -12738, 174579, 200478, -103077, -76435, -47018, 116408, -102697, 114418, -72701, 28050, -303349, -103743, 111909, -32098, -102314, 337965, 134035, 249876, 272695, 139703, 59708, -119787, -175348, 204206, -42639, -140626, -96102, 331007, -41610, -518774, -164317, -291011, 1173, -25615, 123878, 111649, -42942]
18012E1491R868a31658B20869J37196a75497A50442O8146D2639L8100J60271B8175
18000A20065a27822B17570J19621g232j15362j88623a32077f3219D3636K48416
17990B92052b74904I3938a98786N9454m6465i0781c9229l976B32272C9617b89115
17978i6479M2149H6253R1283k5393f3008A18441I382J8161J34870K91330a3524
17966F5072N4249D2237J18711J46007A01473d00112B76076E4597a16130a7951
17955B02749H441h3266J0963A04378b1222A85044b1721A44010p0006c18448B05878
17943A97299d326j11133A82968f8178l5850B55982A1195h5024D34393b05342d8160
17931e2707B56383m9358r9044H728Q3738a96403D1815L60274b01179j055C79721
$$ y = [51491, 61359, -131658, 220869, 358065, -175497, 150442, 218588, 42639, 80739, 241010, 28175, 120065, -127822, 217570, 337191, -7232, -122594, -311217, -132077, -63219, 43636, 292052, -274904, 93938, -198786, -139332, -185797, -90781, -39229, -43205, 232272, 39617, -289115, -96479, -54330, 86253, 177536, 152143, -63008, 118441, 9382, 27543, 162413, 453743, -13524, 65072, 119321, 42237, 160948, 306955, 101473, -400112, 276076, 54597, -116130, -17951, 202749, 8441, -83266, -72303, 104378, -21222, 185044, -21721, 144010, 74004, -318448, 205878, 197299, -4326, -115459, 182968, -68178, -104028, 255982, 11195, -85024, 434393, -205342, -48160, -52707, 256383, 207025, 107981, 8728, 92466, -196403, 41815, 402089, -201179, -202234, 379721]
17919C7091R2108K837a7132j01638B80950a53642A03142b49712Q5941A95200G182
17907a70375B86635b46238e7959j84107A29557b87746J42259K7848j22570k8349
17897b68558B45368a61144c0569D8486K78800m9435d14129F5672K41244c940C17627
17885A13893b4087A99754a73061C2130M16614B050L74686a34328G4650j2313b10659
17873a67995B70264B4292O0380J21715i7536D9035A2646f6333b2620k58814g3932
17861C2290a85741d6658C70082A71913J52881I3520K2225g1719B02641p8267b60618
17849a44022j93942h6690a6065n4298j26623a5912j03842k5925l9463L4944M940
17838a45258O1921B8227R5138e8292j33084B93904A0430a79919B9358J38444C2759
$$ y = [37091, 129199, 132036, -17132, -118770, 280950, -153642, 103142, -249712, -163771, 195200, 7182, -170375, 286635, -246238, -57959, -242066, 129557, -287746, -145487, -117639, -240209, -268558, 245368, -161144, -30569, 48486, 327286, 277851, -414129, 65672, 306916, -3940, 317627, 113893, -24087, 199754, -173061, 32130, 448744, 2050, 376736, -134328, 74650, 62337, -210659, -167995, 270264, 24292, 84672, 206387, -97536, 49035, 12646, -66333, -22620, -281434, -73932, 32290, -185741, -46658, 370082, 171913, 324794, 93520, 115745, -71719, 202641, 124374, -260618, -144022, -337964, -86690, -16065, -70363, -196986, -15912, -119754, -145679, -185142, -150198, -145258, -83337, 28227, 123365, -58292, -191376, 293904, 10430, -179919, 29358, 167802, 32759]
17826A00568k9870O2369o6463L27785H3944a02936H4195M3498f9529B66590b41363
17814A46253h5225B41646j20628J20417N2549A18247b07241D2676b29879B1937
17803b38283J12867i514q8189C5560J32267L8024d7644D67725A62971a03486A56792
17791C6186J49019f54j18101B89056a9830D3068c837A55359M03673b5741E6317
17779A8511K45769a91385C96093j93789l5120n6341k7065K23568K884j01249J04082
17768C13063r3745a66853P6841C33249d8247A87378r0113R21f3995B23398o4053
17757A59345K454e2034K4881B3955d6247C24283J07188b3033A07020A9261a58556
17745a22116B55569F4841J31801e1547A24586a79324D25621F4754J68238a88670
$$ y = [100568, 70698, 133067, 66604, 394389, 83944, -102936, 84195, 127693, -69529, 266590, -241363, 146253, -85225, 241646, 121018, 241435, 293984, 118247, -207241, 42676, -229879, 21937, -238283, -125416, -9514, -97703, 35560, 167827, 205851, -47644, 467725, 162971, -103486, 156792, 36186, 185205, -654, -118755, 289056, -19830, 43068, -3837, 155359, 559032, -25741, 56317, 18511, 264280, -191385, 396093, 202304, 167184, 110843, 83778, 307346, 310230, 208981, 313063, 219318, -166853, -90012, 333249, -48247, 187378, 97265, 98186, -63995, 223398, 159345, 161799, -52034, -27153, 23955, -46247, 324283, 431471, -23033, 107020, 19261, -158556, -122116, 255569, 64841, 196642, -51547, 124586, -179324, 425621, 64754, 232992, -188670]
17734E40608p7362A07387A2352a7763I3445L70545o1151a78780k6866I9045J87834
17723B86879A20172A1679a7770Q619l751k0773A09927l0240J63048H7312f6180
17711I9617a14526A51935a22427e855F828J73050B37L83102A31036J941A6635
17699b0342C45396j60924k6722G88J52817J16763b04725F9287J02038R2264A13045
17687C1186K81058a07872F6814i7581a5742k2539A11991k211a46690D869K02917
17676B07786J06029a09887B42043m8131a34367A91064c5262C21448o2810n3647
17666B04991P5399h9555B29993i3510L3865I6734J53662r5888l3049O3641a25789
17654A3746K62418O5829A68524l9028a34115A46397C6281J68467B0894P3113M4220
$$ y = [540608, 463246, 107387, 12352, -17763, 93445, 463990, 402839, -178780, -205646, 99045, 286879, 120172, 11679, -17770, -9151, -12902, -33675, 109927, 79687, 242735, 87312, -66180, 99617, -114526, 151935, -122427, -5855, 6828, 179878, 237, 383339, 131036, 132977, 16635, -20342, 345396, 184472, 157750, 788, 153605, 270368, -204725, 69287, 171325, 263589, 113045, 31186, 312244, -107872, 66814, -97581, -15742, -38281, 111991, 109780, -146690, 4869, 207786, 313815, -109887, 242043, 193912, -134367, 191064, -35262, 321448, 258638, 204991, 280390, -89555, 229993, -93510, -59645, 96734, 250396, 154508, 121459, 185100, -125789, 13746, 276164, 341993, 168524, 129496, -134115, 146397, 36281, 204748, 20894, 94007, 138227]
17643A38227A6415a18465A83588B1810L7518P525b2474j18960I1384d83818A61134
17631G0432a99197G3267O1925b01541B7381J22919J39173F9067b11427A38987
17620d7543B00605a18622A55293J3295a18000E4969d4414A47824J67426A37686
17609B32998H5835J41475I7801J41197n0476k8433L0833A4997f8177A97999b7597
17597a0153j23913B35665k256E1925a77816b1455j0373A35361N1385J99957e1923
17585b1361p4183B93633b3750A9138R4952b6840A87819L9834F8963O553K34617
17574C10133j16422O7075A27724a56641I2769a01345d7010A12942D321Q703K38069
17563B51093J07050e5243k45293B03319m5283M8513k067j01549l2617J90022B8402
$$ y = [138227, 16415, -118465, 183588, 21810, 59328, 66853, -22474, -141434, 91384, -483818, 161134, 70432, -199197, 73267, 135192, -201541, 27381, 150300, 289473, 69067, -211427, 138987, -47543, 200605, -118622, 155293, 168588, -118000, 54969, -44414, 147824, 315250, 137686, 232998, 85835, 227310, 97801, 238998, 188522, 160089, 190922, 14997, -68177, 197999, -27597, -10153, -134066, 235665, 233409, 51925, -177816, -21455, -31828, 135361, 186746, 386703, -51923, -21361, -95544, 293633, -23750, 19138, 114090, -26840, 187819, 227653, 68963, 75516, 310133, 193711, 260786, 127724, -156641, 92769, -101345, -47010, 112942, 4321, 13024, 251093, 358143, -55243, -300536, 203319, 158036, 206549, 204482, 102933, 70316, 260338, 28402]
17551B94651q2463d9531a1968A76668K95213B9143K04905j01527i6955G8819b0472
17539A29699K16626k6324A22308J61461K54598A73381Q1598l6329I1290d9659
17528A11366L11532J75891H7283k9779L58535k07628J01308K09266m1604J46192
17518F23573B00714J7529J86804j55644J02311P5000R4918K26131J94202N99285
17508A541250k90684m30056C61879L71964k85622J52915j95286M7730J48082r584
17498E92078Q4567J24346m899J9633J74412J20334k55947J22361l41532P1233
17488G06586j87875k03192J89675J43263B47746l8845J81994m9132J93277R035
17478E44075j93602Q5383j59260R7068C1068J69333J19376K04002B60937Q3161
$$ y = [294651, 212188, -49531, -11968, 176668, 471881, 29143, 234048, 132521, -96955, 78819, -20472, 129699, 346325, 320001, 122308, 283769, 538367, 173381, 254979, 218650, 91290, -49659, 111366, 422898, 598789, 87283, 57504, 416039, 208411, 309719, 518985, 477381, 623573, 200714, 218243, 405047, 249403, 351714, 426714, 521632, 747763, 941965, 1541250, 1250566, 820510, 361879, 733843, 448221, 601136, 405850, 453580, 601662, 592078, 676645, 800991, 796092, 815725, 990137, 1110471, 854524, 976885, 635353, 706586, 518711, 315519, 505194, 648457, 247746, 208901, 390895, 341763, 535040, 544075, 350473, 435856, 276596, 373664, 31068, 200401, 319777, 523779, 260937, 344098]
17468C44098R8J69144d2451j83461B65073q5325K12028J5450k3780J17431D0183
17456A90854K00028j71095J38033A27977J4256N6043P9241J99492A57048K6891
17446A83939G0871K58067o9693p8237P6036J82523D0406K63641J35469j21875
17436C17641A13841J01133K68196B3086N35858l6209J57206B13288J32002C3828
17425D81317A75886J30660b0314C11622K02383k34636I0865K48419J937R721r3305
17414B57637n8266o7632J31766J13049Q569j80559J90147K1660o9934j31063K80530
17403D95904N4576B02945r8435N44285j80996M40503B20040J81403k4567E8883
17392C22846j18637a27534A70651K53245r5816j4431l1662p1966H6276L14010
$$ y = [344098, 344196, 513340, -42451, -225912, 265073, 179748, 391776, 407226, 383446, 500877, 40183, 190854, 390882, 219787, 357820, 127977, 142233, 198276, 277517, 477009, 157048, 183939, 70871, 328938, 259245, 181008, 257044, 439567, 40406, 304047, 439516, 317641, 113841, 214974, 483170, 23086, 558944, 522735, 679941, 213288, 345290, 33828, 481317, 175886, 306546, -20314, 311622, 514005, 279369, 90865, 339284, 341221, 350942, 257637, 199371, 131739, 263505, 376554, 385123, 204564, 394711, 416371, 346437, 215374, 495904, 550480, 202945, 104510, 648795, 467799, 908302, 220040, 401443, 376876, 58883, 322846, 204209, -127534, 170651, 423896, 328080, 313649, 281987, 210021, 86276, 400286]
17382D00286j80882K51491o8272i5110C45099p8424L00257B51178L0007J83052
17372D64237A84137K86959H4018J15710K61304k11395A24136R012J61106a93359
17361A72447J02484Q0768C3976L63049j63459J41436A61222j0595P0818M205J21265
17350C46915O2010N3904O6582A03759L72560j49255L7908A41114R4744L9608F4466
17338B57393n6922F8590J17569o5787L7008J77257A6995J1713K88257L5461p9185
17327B73241K53m281J29433m1895C2910J62193J23362N9553N0489G8924a960B03111
17314A29414L00153j16915Q9041A25055R4833l3264L32354k42607K99255e1912
17303C72522j46092o7530a77226C31289J4555Q6009j48596j8905C3885j1451J90864
$$ y = [400286, 219404, 470895, 402623, -95110, 345099, 266675, 566932, 251178, 281185, 464237, 184137, 471096, 84018, 199728, 461032, 249637, 124136, 133148, 294254, -193359, 172447, 274931, 355699, 33976, 397025, 233566, 375002, 161222, 150627, 221445, 225650, 346915, 408925, 462829, 529411, 103759, 476319, 327064, 364972, 141114, 235858, 275466, 64466, 257393, 200471, 68590, 186159, 120372, 157380, 334637, 16995, 28708, 316965, 352426, 273241, 273494, 269213, 398646, 356751, 32910, 195103, 318465, 378018, 428507, 78924, -1960, 203111, 129414, 429567, 312652, 401693, 125055, 219888, 186624, 518978, 276371, 575626, -51912, 372522, 226430, 158900, -177226, 331289, 345844, 431853, 283257, 264352, 33885, 22434, 213298]
17292B13298J58586J1063A61315a5446B59862R6392h4866D46389j66115J01448
17282C81722A9676P20816l60561q9160K456K38458j63776k3320J63641A06731
17271B84334A33308P42757k75619k72698j2746r8809N7881j19224k7913K41357
17261C68294j26232J7269l7198Q8985j8616j02971K18003o6927H6186L67076H9290
17249E29129k784j14769C3330L06721K5089K18917j64416j4048o2901r9606j8466
17238B24620J49054p7100O111J06540K05924j44690K476B21577J04879K34257
17228E60713J193B69746R9037A6978N85626A65441J80778J37042A41473K12506
17218C53979A32647J82022L4002J01706j14539J26397J15419q4887r0254A88002
$$ y = [213298, 371884, 382947, 161315, -15446, 259862, 356254, -84866, 446389, 280274, 381722, 19676, 740492, 379931, 290771, 293227, 531685, 367909, 344589, 508230, 106731, 284334, 133308, 876065, 600446, 327748, 315002, 216193, 274074, 154850, 126937, 368294, 242062, 259331, 222133, 311118, 292502, 189531, 407534, 340607, 86186, 453262, 89290, 529129, 526345, 411576, 33330, 340051, 365140, 584057, 419641, 405593, 342692, 243086, 224620, 373674, 296574, 302685, 409225, 615149, 470459, 472935, 221577, 326456, 560713, 561906, 269746, 368783, 16978, 602604, 165441, 346219, 483261, 141473, 353979, 132647, 314669, 348671, 450377, 335838, 462235, 577654, 492767, 402513, 188002]
17207B05415P1856J16021K00864r0681j77206J6985K26512A79585M89915B99381
17196E04165k16125L60217H3037L15504A93080K40745J08586A90555m9772K60040
17186D00823L04084k12627L68059n2691C82812J65689o8244q8539J58513k2000
17176E28231j02991j17624K05318R023j39606b2159F96502B87830J76913L3713
17166D98456L7219j19499j47613K84174k38425L33191n8663k37784k0596K93887
17156F24347R346A64803L62531k00697M46355l73729K00702H5904M33287m2019
17146D77172J67529k87292L07720l14629q1375A32218N97551k19980J0767q3655
17136D36901j36454K10775J64694M1564B54322j9898q6591O50611j70843N671
$$ y = [205415, 277271, 393292, 594156, 503475, 326269, 343254, 569766, 179585, 669500, 299381, 504165, 288040, 648257, 83037, 398541, 193080, 433825, 542411, 190555, 140783, 400823, 704907, 492280, 860339, 807648, 382812, 548501, 480257, 391718, 550231, 528231, 425240, 307616, 512934, 521957, 382351, -22159, 696502, 287830, 464743, 498456, 535675, 416176, 268563, 552737, 314312, 647503, 588840, 351056, 330460, 624347, 633693, 164803, 527334, 326637, 772992, 399263, 599965, 85904, 519191, 477172, 644701, 357409, 665129, 350500, 269125, 132218, 729769, 509789, 520556, 436901, 300447, 511222, 675916, 717480, 254322, 234424, 147833, 798444, 627601, 633272]
17126F33272r9394K89654k88208r0334O38415D63635j61516L82580B96006N08226
17116H04232k41400O4355j04648j75611K61925L3490k05322r9176M52681l26591
17106D63935L86708j71960Q6759j78984j41719n724K27313k77504Q3870M75869
17096I48563D43861N01092D61058P8050m7563M15108j85714j29410j89555M47099
17086H49073J09028l67932j89622O0072q3323K37957o8983L06904R4799k27731
17076G20242j21041K33958j03114p9811M6668j02248R6168L41637k24839k56541
17066E51079L79150l78190J05272J25740l17929j7123R6006M18746k20212L64818
17056A107357l21175r3368j04743K66852k48384J24768J61901l04609K23861L8854
$$ y = [633272, 533878, 823532, 535324, 444990, 1083405, 463635, 302119, 684699, 296006, 804232, 562832, 627187, 522539, 346928, 608853, 642343, 437021, 337845, 790526, 463935, 850643, 678683, 765442, 586458, 444739, 439015, 666328, 388824, 472694, 948563, 443861, 944953, 461058, 539108, 491545, 906653, 720939, 591529, 401974, 849073, 958101, 590169, 400547, 460619, 377296, 615253, 546270, 853174, 947973, 720242, 599201, 833159, 730045, 650234, 696902, 594654, 690822, 1032459, 807620, 551079, 930229, 552039, 657311, 783051, 465122, 447999, 544005, 962751, 742539, 1107357, 786182, 692814, 588071, 854923, 606539, 731307, 893208, 588599, 812460, 851314]
17046H51314l6954J18303M2173o9317J13082j29351j08004R3609j12542Q9683
17036H51996k17686K67010J54646m85877K82698j00318J87355p9509J5122N2603
17026I28040J02414J22535r3033P7637r3793R7094k63607L30424n56698O14474
17016A265487k63037l01945M38527k45709j48441M02638m4767P8507L5124k27008
17006I89376q1845J65215P5746k3295Q5070k30656J47222k84765J04509J2069
16996I58646l4081M46774n85761r765M35024m4294k11441L58409k08638M05293
16986A510166l25646K23046j68133o3135j19688L02934q966k50104J40972L02047
16976A543493m29189J42899K685Q8542J0221N7033J72288o03821J19541J39567
$$ y = [851314, 814360, 932663, 974836, 905519, 1018601, 889250, 781246, 874855, 762313, 851996, 634310, 901320, 1055966, 570089, 852787, 752469, 939824, 860315, 875437, 928040, 1030454, 1152989, 1059956, 1137593, 1043800, 1140894, 877287, 1207711, 651013, 1265487, 1002450, 700505, 1139032, 893323, 744882, 1147520, 1102753, 1181260, 1216384, 989376, 907531, 1072746, 1148492, 1125197, 1210267, 979611, 1126833, 842068, 946577, 958646, 924565, 1371339, 785578, 775813, 1210837, 1166543, 955102, 1313511, 1104873, 1510166, 1184520, 1407566, 1239433, 1176298, 1056610, 1359544, 1350578, 1100474, 1241446, 1543493, 1114304, 1257203, 1259888, 1348430, 1358651, 1415684, 1587972, 984151, 1103692, 1243259]
16966A243259K27190l1898l9571Q3473j07097J97744m56684J71053J10296N1926
16956A449691k73416L86736r9761K601J36587J76774l80086R4720J6899M0892
16946A551637k00392K99246J13025J25442k93647L47196k39394R4497J69089l03720
16936A662979r9771L16912k39150m5451L59447q4111K85472o01179M72302k7679
16926A999771l37883K40156j39961R3110j69100M27220j56264K16462l61193M10139
16916B222457k00457k18042L0636N89855k94835R1305r6189j75847L25033j37913
16906B136003L54500K21084m85102j01189j0044J38336j03588L82621k36612K42209
16896B538218j4870J4030L4439m2392J92917j23334J84226k22000K93694k69184
$$ y = [1243259, 1470449, 1438551, 1398980, 1482453, 1375356, 1573100, 1116416, 1287469, 1397765, 1449691, 1176275, 1563011, 1463250, 1465851, 1602438, 1779212, 1399126, 1493846, 1510745, 1551637, 1351245, 1650491, 1763516, 1888958, 1595311, 1942507, 1703113, 1797610, 1966699, 1662979, 1563208, 1880120, 1640970, 1595519, 1954966, 1870855, 2156327, 1555148, 2027450, 1999771, 1661888, 1902044, 1762083, 1855193, 1686093, 2113313, 1957049, 2173511, 1812318, 2222457, 2022000, 1803958, 1834594, 2424449, 2129614, 2220919, 2124730, 1948883, 2273916, 2136003, 2490503, 2711587, 2226485, 2125296, 2115252, 2253588, 2150000, 2532621, 2296009, 2538218, 2523348, 2537378, 2571817, 2529425, 2722342, 2599008, 2783234, 2561234, 2854928, 2585744]
16886B585744M2095L78829n060j81536J34487j35766K38972J97003r9126j09064
16876C046578j46516K03856J73409J142j23845P0629M42668j27832l70073M65404
16866C635420j7985j41299L72480l31084o0688O10798k61047l4845K66316J56093
16856D194159l48297K34893K39307m28786K23809J86008N4795J40109k60708L71805
16846D607094k38867K83537K84056j58529k64403K91318j59739L70100Q8378K45181
16836E348126j11106K08199J32919k71564O03786k51972L74851k77168N89715
16827F345786m61319L71629p8795N09538j68694N8933Q8554J26731J00579m0758
16817F852184K31662J82489L61395k8307m47347N05334J81366Q7228L07857J56800
$$ y = [2585744, 2627839, 3006668, 3001608, 2820072, 2954559, 2818793, 3057765, 3254768, 3155642, 3046578, 2900062, 3103918, 3277327, 3278469, 3154624, 3225253, 3667921, 3540089, 3170016, 3635420, 3617435, 3476136, 3848616, 3517532, 3456844, 4067642, 3806595, 3771750, 4038066, 4194159, 3845862, 4080755, 4320062, 3891276, 4115085, 4301093, 4355888, 4495997, 4235289, 4607094, 4368227, 4651764, 4935820, 4777291, 4512888, 4804206, 4644467, 5014567, 5102945, 5348126, 5237020, 5445219, 5578138, 5306574, 5910360, 5658388, 6033239, 5756071, 6345786, 5884467, 6256096, 6177301, 6686839, 6518145, 6577078, 6665632, 6792363, 6892942, 6852184, 7083846, 7266335, 7627730, 7599423, 7152076, 7657410, 7838776, 7926004, 8233861, 8390661]
16807H390661J87854r9055J16856L80070J38648J12780O47805l10331R1013N60427
16797A0216728K41455K2844M20412o8741L66913L85065j44884O21387j01161O13182
16787A2573200K28388k0073M29546M14466K71989N00556K60652K10246M21864
16778A5290834P39401K82197J75403N31572M43942M69049N36304N09531L20613
16769A9298846P12757K81914R73097P25649M78141L10943P08929J190033L13967
16760B4994276J045765P27339J205652L54527J139261J217854O74337R76822J286864
16751C3622697J029033R37892J417096J630838J499200J260417J425164J588501
16743D4410838J705703J965775J246940K222025K105214J576069K325474K269029
$$ y = [8390661, 8578515, 8479460, 8596316, 8976386, 9115034, 9227814, 9875619, 9565288, 9656301, 10216728, 10458183, 10481027, 10901439, 10832698, 11199611, 11584676, 11439792, 12061179, 11960018, 12573200, 12801588, 12781515, 13211061, 13625527, 13897516, 14398072, 14658724, 14868970, 15290834, 16030235, 16312432, 16487835, 17019407, 17463349, 17932398, 18468702, 18978233, 19298846, 20011603, 20293517, 21266614, 21992263, 22470404, 22781347, 23490276, 24680309, 24994276, 26040041, 26767380, 27973032, 28327559, 29466820, 30684674, 31359011, 32335833, 33622697, 34651730, 35589622, 37006718, 38637556, 40136756, 41397173, 42822337, 44410838, 46116541, 48082316, 49329256, 51551281, 53656495, 55232564, 57558038, 59827067]
16735E9827067K143702K650865K502524K489958K971944K921887K748070K951200
16727H1207217L179860L080184K992955L052766L231244L216941L131447L761125
16719A06853739K793103L077641K655156K828339K690875J989904K209583J585969
16711A26684309J511200J362438Q68104Q30249j65993n98255m49292j195988j472205
16702A27374567j541855j885602k291501k424545k932257k617617l024640k824246
16694A07832304l488421k978990l596082l098825l506343k872592l271334l274202
16686H1745515l035546k988690k626267l083926k482806k548071k665565k419019
16678E9895625k359644k246770j633756k539979j434526k108316j765188k058182
$$ y = [59827067, 61970769, 64621634, 67124158, 69614116, 72586060, 75507947, 78256017, 81207217, 84387077, 87467261, 90460216, 93512982, 96744226, 99961167, 103092614, 106853739, 109646842, 112724483, 115379639, 118207978, 120898853, 122888757, 125098340, 126684309, 128195509, 129557947, 130426051, 131256300, 131090307, 130492052, 130042760, 128846772, 127374567, 125832712, 123947110, 121655609, 119231064, 116298807, 113681190, 110656550, 107832304, 104343883, 101364893, 97768811, 94669986, 91163643, 88291051, 85019717, 81745515, 78709969, 75721279, 73095012, 70011086, 67528280, 64980209, 62314644, 59895625, 57535981, 55289211, 53655455, 51115476, 49680950, 47572634, 45807446, 43749264]
16670D3749264j268561j485493j905898j069993j257509j194630j770457p87114
16662C3009609j114205j056420p66672j296139r80613p88987q14190r96423o92170
16653B4503790p17377o11230j177396m55217l01283m39046j275748j58158o34035
16644A8734300n69970m09052o28452l67611o23571q1093m23980l98570n35505
16635A4696496j10664n85973k18698m75584l01571j32426q01572L30865p41147
16626A1659726j10364N7714p12197O087l07764m02620j12944k5610k28702k89164
16616I534162o7280m04213j67137l50153K65147l53196k02464l58043k05856L2986
16606G723953r5440m23117L25038k14565n43040m9330k20365r332J16613N2807
$$ y = [43749264, 42480703, 40995210, 39089312, 38019319, 36761810, 35567180, 33796723, 33009609, 31895404, 30838984, 30072312, 28776173, 27795560, 27006573, 26192383, 25195960, 24503790, 23786413, 23175183, 21997787, 21542570, 21241287, 20802241, 19526493, 19368335, 18734300, 18164330, 17755278, 17126826, 16759215, 16135644, 16054551, 15630571, 15232001, 14696496, 14585832, 13999859, 13781161, 13305577, 13004006, 12871580, 12070008, 12400873, 11659726, 11549362, 11607076, 10894879, 10900966, 10593202, 10190582, 10077638, 10052028, 9823326, 9534162, 9466882, 9062669, 8895532, 8545379, 8810526, 8457330, 8254866, 7896823, 7690967, 7723953, 7628513, 7205396, 7530434, 7315869, 6772829, 6723499, 6503134, 6493802, 6610415, 6663222]
16596F663222J62012p29410L5275l85704M30298o7229j24229m24396P0478j17742
16586E512575j25729l4709o08403M56913j33945r8706l56701j7394L73953l89072
16576D578782K868J10807l66438m8556K95695m12835J28232O300j95175k96544
16566C803136K76086P9410m44513m7096K63262j92544k14204K81767l92727L86256
16556C798833k38023O9961m61119M16555n3125m38479K67466k02713l07266K08622
16546C060712n6282J1189j30406J98085l55381N42860l75005q3296p3052J2107
16536B751531M14299k41067m27742j9788J25038j09071k11766L52823k72962K28
16526B361523Q43j17732M19031l35518j43933K97749n09946L57149M54017q67332
$$ y = [6663222, 6825234, 6095824, 6131099, 5745395, 6175693, 6108464, 5984235, 5559839, 5630317, 5512575, 5386846, 5352137, 4743734, 5200647, 5066702, 4967996, 4611295, 4593901, 4967854, 4578782, 4581650, 4692457, 4326019, 4277463, 4573158, 4160323, 4288555, 4294855, 4099680, 3803136, 4079222, 4158632, 3714119, 3667023, 3930285, 3737741, 3523537, 3805304, 3412577, 3798833, 3560810, 3630771, 3169652, 3586207, 3533082, 3094603, 3362069, 3159356, 2852090, 3060712, 3004430, 3015619, 2885213, 3083298, 2727917, 3270777, 2895772, 2812476, 2739424, 2751531, 3165830, 2924763, 2497021, 2477233, 2602271, 2493200, 2281434, 2634257, 2361295, 2361523, 2362366, 2244634, 2663665, 2328147, 2184214, 2481963, 1972017, 2329166, 2783183, 1915851]
16516A915851J28656J52488j93570K44684r2766M0680l26306L91681J24852m57615
16506A928635j83829L1206K23993J40735k36664L7934m2970k21929J88485j42598
16496A722998J85402k43534K24129l64243M54127l78193J23587o6653R7478l24564
16486A430534M74053k35818k23410K03234k26046J6549K73305m12057J98932L50382
16476A849658l53316J99746J02608n84913J36948J93984k25653K73646L3247j33746
16466A492209k57886J39647J42157m55482M77232j43936m0990o6059l50466M55925
16456A392351l72671N7909l22643O66807k64163J99160j26989J36867j83742o3152
16446A119734K2516j08342K29331J88297j85833q6466l94248J72824N87061m37236
$$ y = [1915851, 2044507, 2196995, 2003425, 2248109, 2155343, 2196023, 1869717, 2261398, 2386250, 1928635, 1744806, 1776012, 2000005, 2140740, 1904076, 1942010, 1899040, 1677111, 1865596, 1722998, 1908400, 1664866, 1888995, 1524752, 1978879, 1600686, 1724273, 1657620, 1755098, 1430534, 1904587, 1668769, 1445359, 1648593, 1422547, 1439096, 1712401, 1300344, 1499276, 1849658, 1496342, 1696088, 1798696, 1213783, 1350731, 1544715, 1319062, 1592708, 1625955, 1492209, 1234323, 1373970, 1516127, 1060645, 1537877, 1393941, 1352951, 1286892, 936426, 1392351, 1019680, 1077589, 754946, 1421753, 1157590, 1356750, 1229761, 1366628, 1182886, 1119734, 1142250, 1033908, 1263239, 1451536, 1265703, 1179237, 784989, 957813, 1544874, 1107638]
16436A107638j06741M3186j58156J43498K6551J56484k4215m05305O23870j85500
16426A221310k92542r1523L85748n54872M33946k54934L8821m9143R3163K30414
16416A160388k81366n1757J60100R6061j63391J80083l36335J44901K13520J08490
16406A230694k88376l1440k47557K94785K47463E71153M79150l50832M31468k41232
16396H89707K94897m11409K03062j80878j90177j23030J16560K62548j13515O8
16386G47833J07730J61000l7617m24094j0516J6941M47539p6064r3811k03933
16376F35008o8059m51O6400j0715J69839J1955r5314J28583N8095l16918L10247
16365H88670j54168M146J39275j08934r7513q8186K98930m24899K15397J97916
$$ y = [1107638, 1000897, 1044083, 885927, 1029425, 1055976, 1212460, 1188245, 782940, 1406810, 1221310, 928768, 837245, 1222993, 668121, 1102067, 847133, 885954, 836811, 929974, 1160388, 879022, 827265, 987365, 1083426, 920035, 1100118, 763783, 908684, 1122204, 1230694, 942318, 910878, 663321, 958106, 1205569, 571153, 1050303, 699471, 1130939, 889707, 1184604, 773195, 976257, 795379, 605202, 482172, 598732, 861280, 747765, 747833, 855563, 1016563, 978946, 554852, 544336, 561277, 1008816, 932752, 838941, 635008, 566949, 566498, 632898, 622183, 792022, 803977, 708663, 837246, 895341, 578423, 888670, 734502, 738648, 877923, 768989, 671476, 583290, 882220, 457321, 672718, 870634]
16355H70634J80109E13982j83355K27227k54359N50206l55294L57372k79971N8022
16345F33830n3895J71006K41900j97090j14129k44508O2615n4194K07659O7703
16335G20897J65681l19857j3603L05211k50853k65759J90272J57914J24612D00905
16324E76960J86307j21414r0100K40850p2381p0209Q5743j310A37759J22550j17377
16313A42932J35550L88437j4478k24234n2142K4420L85355C29251M21588j29492
16303F21347B23986L10036K11132j46352A75425L56027j14547q0621N20359B58411
16292E44849J93532k16239n8565j12524N2490J13230q9760O7990j80384J84427
16282D99046k06827O3271L16204J5881A1723L67506J8022j22200O913l2389a46110
$$ y = [870634, 1050743, 513982, 330627, 557854, 303495, 853701, 498407, 855779, 575808, 633830, 579935, 750941, 992841, 795751, 681622, 437114, 499729, 445535, 653194, 720897, 886578, 566721, 553118, 858329, 607476, 341717, 531989, 689903, 814515, 400905, 576960, 763267, 641853, 551753, 792603, 720222, 650013, 735756, 734446, 137759, 260309, 142932, 278482, 666919, 652441, 428207, 376065, 400485, 785840, 329251, 750839, 621347, 223986, 534022, 745154, 598802, 175425, 531452, 416905, 336284, 856643, 258411, 544849, 738381, 522142, 463577, 351053, 403543, 516773, 427013, 495003, 314619, 499046, 292219, 355490, 671694, 687575, 11723, 379229, 397251, 275051, 281964, 249575, -146110]
16270b5562C36723K03093L262k53554K15071B37760K90746j44569l5851k6110
16260C21976A15610M76159k32323Q7468j41459K47015J45158C14258R0108l792
16250D00574j73013A06679J26222n5605F3487M08478K2422q9764P5858N2477k8843
16239E04115k44981C2442J84443B7841J37697N9607J76547J15690H9869N87671
16229F77540l32970j00772J8276J48625A70416G9635K24505I7873K16615p8691
16219B35797K7753q6085J56363l1614B3963Q1316M69570B60711L39878B40918
16208C39150j35797J28949j48010O06763b1343A76052m9422l6377K82481K71670
16198F44404A02239M82861j93568A89319R3771M6524A56821L97292H2437B0933
$$ y = [-25562, 336723, 539816, 543078, 289524, 504595, 237760, 528506, 383937, 348086, 321976, 115610, 591769, 359446, 446914, 305455, 552470, 697628, 314258, 404366, 400574, 227561, 106679, 232901, 177296, 63487, 471965, 494387, 404623, 480481, 532958, 504115, 259134, 32442, 216885, 27841, 165538, 225145, 401692, 517382, 89869, 677540, 344570, 243798, 262074, 410699, 170416, 79635, 304140, 97873, 314488, 235797, 263550, 177465, 333828, 302214, 23963, 105279, 574849, 260711, 600589, 240918, 339150, 203353, 332302, 184292, 791055, -21343, 176052, 126630, 90253, 372734, 644404, 102239, 585100, 391532, 189319, 283090, 329614, 156821, 554113, 82437, 20933]
16187B7640a34148B63847J39497e2572G9504L74243a6438D17495K92745A10194
16176C93866j20342Q0501H3022J90174l2498R0600r2610I9231J07182K1845a59751
16164B69287n9471l2975J02380J19346r5433p9429J82015I5314Q3821O0418B327
16152A37514K66542B8365L9973J03180J36182F6503m181K60881c5828H8042R3421
16141A81463K54378A14405a02925b6121A01679h9708C2233d792B98358j42213
16131A56145d9502B99629J18079e1136B91031A32092N1387A1601L44933m7122
16121C09412j02641J82075j02892f0398A8989K01840a7196B56883j22811J80886
16111C14958a65312B7608K46254I453M03539B0800K86551m2470O5630g0642A77866
$$ y = [27640, -134148, 263847, 403344, -52572, 79504, 453747, -16438, 417495, 710240, 110194, 393866, 273524, 354025, 83022, 273196, 240698, 331298, 238688, 99231, 206413, 228258, -159751, 269287, 209816, 176841, 279221, 398567, 303134, 223705, 405720, 95314, 179135, 239553, 2327, 137514, 404056, 28365, 68338, 171518, 307700, 66503, 62322, 323203, -35828, 88042, 181463, 435841, 114405, -102925, -26121, 101679, -89708, 32233, -4792, 298358, 156145, -49502, 299629, 417708, -51136, 291031, 132092, 183479, 11601, 356534, 309412, 206771, 388846, 285954, -60398, 18989, 220829, -17196, 256883, 134072, 314958, -165312, 27608, 273862, 9453, 412992, 20800, 307351, 264881, 330511, -70642, 177866]
16099D994K35703m663C9015a15170l6211B46997J9893g6042D64980C8700a0563
16087F3636A4420i7544C09547a16283B00398F2504L3998a25463B58859C570K43636
16076B47206I547l881b12567E5864K00032G9556l8082A4535b3605F4056Q8652
16065A52708D6955P7941i1401B21539p8805L8342g2987o326C5156i4752E3001
16053A36713m3047c43215A58920b9174B37127e8594j2p0266b5398q5737B44608
16041c262B05457E0037d0553A31182c3650H3951N287J44024l3620E8475K504K2349
16029H3328B5881c1345A93522q2552A8885K67852j10342g0752A84132p7704K6907
16018A33335d9393D13831j69800I4420B0500d0403A31775c92712F6488L14557
$$ y = [4994, 240697, 236034, 39015, -115170, -151381, 246997, 266890, -76042, 464980, 38700, -10563, 63636, 14420, -97544, 309547, -116283, 200398, 62504, 96502, -125463, 258859, 3570, 247206, 9547, 5666, -212567, 55864, 255896, 79556, 41474, 14535, -23605, 64056, 152708, 46955, 124896, -91401, 221539, 142734, 181076, -72987, -79313, 35156, -94752, 53001, 136713, 93666, -343215, 158920, -29174, 237127, -58594, -58606, -128872, -25398, -111135, 244608, -3262, 205457, 50037, -40553, 131182, -33650, 83951, 89238, 233262, 199642, 58475, 60979, 83328, 25881, -31345, 193522, 110970, 18885, 286737, 176395, -70752, 184132, 106428, 133335, -49393, 413831, 244031, 94420, 20500, -40403, 131775, -392712, 66488, 381045]
16008C81045A02386D4934d4249H1799f1535b2030r0210A47109a17448A75476Q8554
15997B64030j19621e3179l1424A79413c1334a1787C9839P8983Q8282o0297j7370
15986A29437D9434L28628A05027R8769o3085b2036p2842B40030n0998J74289c59627
15974I4247M09735P8591O0315K38602J09202M62252l57786E10711M6897k35940
15964C21668K68068D7381a79963B76101a04614J5725K4253l508j63772C5033j1398
15953B3635J11149b37250D75050A30788m8987b72591B68939l9217b91058I9222
15942A94612B6132P3629K2699a21606j76733A73306d03607h285C9930h0034A21022
15930a2128A71210H2819k7750a89087e837E2447K23378b80566h1461j84962C16763
$$ y = [381045, 102386, 44934, -44249, 81799, -61535, -22030, -112240, 147109, -117448, 175476, 264030, 144409, -53179, -84603, 179413, -31334, -11787, 39839, 118822, 207104, 146807, 129437, 49434, 378062, 105027, 203796, 140711, -22036, -94878, 240030, 189032, 363321, -359627, 94247, 503982, 582573, 642888, 881490, 990692, 1452944, 1095158, 510711, 557608, 321668, 589736, 47381, -179963, 276101, -104614, -88889, -64636, -68144, -231916, 35033, 23635, 134784, -237250, 475050, 130788, 81801, -272591, 268939, 229722, -291058, 99222, 194612, 26132, 99761, 122460, -121606, -298339, 173306, -403607, -8285, 39930, -80034, 121022, -12128, 171210, 82819, 55069, -189087, -5837, 52447, 275825, -280566, -81461, -266423, 316763]
15918a13652j03642C26989I8399b2839A19529h868q4535A21560d28484b9040H296
15906c05358A51049b58752h6531k60051a46243b8983A07468N1594o1068g5628
15895a36317f0940p1532H9818a13993k85536a79344C5135K8004c58489A21782
15884b305k20989R0435I8022d14347i709C02229G5612b58360A35382B4156E763
15872b59567g9522B5802P1985J01370b03517m6599Q6938j56549f6938G2260a4456
15860d37664i457H2141c7081r4236B62436a01933P846D11545j80422G2932e7329
15848a82336l1214a03653I7132K56800b05712B59331A05422k4039J48342c06300
15837a92080M7669F1362O2720f2354B7648J99910b21901A18951a2764n1060G0153
$$ y = [-113652, -217294, 326989, 98399, -22839, 119529, -8868, -93403, 121560, -428484, -29040, 8296, -305358, 151049, -258752, -86531, -346582, -146243, -28983, 107468, 159062, 97994, -75628, -136317, -60940, -132472, 89818, -113993, -399529, -179344, 35135, 63139, -358489, 121782, -2305, -223294, -132859, 98022, -414347, -9709, 302229, 75612, -258360, 135382, 24156, 5763, -259567, -79522, 25802, 97787, 199157, -203517, -250116, -163178, -319727, -66938, 72260, -14456, -437664, -9457, 82141, -37081, -131317, 262436, -101933, -94087, 411545, 231123, 72932, -57329, -182336, -213550, -103653, 97132, 353932, -205712, 259331, 105422, 81383, 229725, -306300, -192080, -144411, 61362, 124082, -62354, 27648, 227558, -221901, 118951, -12764, -63824, 70153]
15825a11777E6687h0716j71830a7142m5754j63524h8233E3004d0467A29259b58672
15813c20039a30886L2009d2815A90843e7944F3910N8263K3065a98299G5691K7989
15802A03680g0683c3952k73144b0375A22198L2879k5874C5468b8629j03412j2546
15791a44587a1730E340b7429J2567A02750m7358a25453B6608J49426b76344b0999
15779a46688H2651a7k33143I2991a67204A30516b6252m60887C06546i6892K1772
15768g5120B69960g6970E9148a82268h0575k35828g6995A95223n9977b27481D9321
15756A29626a02906o88A67496e1605j66625F0011B2754h3091B75549m5908c4551
15744A8729J52846P1796r7803a63049A81840b4220G9925b4384k9818R592H4409
$$ y = [-111777, 56687, -80716, -252546, -17142, -62896, -226420, -88233, 53004, -40467, 129259, -258672, -320039, -130886, -98877, -42815, 190843, -57944, 63910, 122173, 145238, -198299, 75691, 103680, -70683, -33952, -307096, -20375, 122198, 155077, 129203, 35468, -28629, -132041, -144587, -11730, 5340, -27429, -14862, 102750, 55392, -125453, 26608, 176034, -276344, -20999, -146688, 82651, -17, -233160, 92991, -167204, 130516, -26252, -487139, 306546, -96892, -75120, 269960, -76970, 59148, -182268, -80575, -316403, -76995, 195223, 135246, -227481, 49321, 129626, -102906, -103594, 167496, -51605, -218230, 60011, 22754, -83091, 275549, 229641, -34551, 18729, 171575, 243371, 145568, -163049, 181840, -24220, 79925, -24384, -54202, -44610, 84409]
15732a7099B9063d4845l1383A84339a95134F7412N9497f5583B4423a3785D7618
15720a49568f8361A7587a42215k08595A54006C4325c1099h957j43570c6067H3441
15708a50414j8462j5717j9183B04636g7472L3989j44871P0906j16134A73254C1913
15696A02516k9077f7631q5330e8566B20714b45095C73105b02692Q7119j66205
15686b81778H9113b34687a66A5507L02666j14994a01208m0523B43773b6731B33597
15674D3000J7105g3294A64985a60330c2052o5930C7353N3636O3734b71168a16323
15662b32318F6622a55096j04693c3324C83443a81171O3113k16977C52286c05047
15651i1728j03008A79870a49395a2184j34321l5725C47641a4935A80326c1820
$$ y = [-17099, 29063, -44845, -76228, 184339, -195134, 67412, 126909, -65583, 24423, -13785, 47618, -149568, -68361, 17587, -142215, -350810, 154006, 34325, -31099, -8957, -152527, -36067, 83441, -150414, -168876, -184593, -203776, 204636, -77472, -43483, -188354, -117448, -233582, 173254, 31913, 102516, 73439, -67631, -152961, -58566, 220714, -245095, 373105, -202692, -115573, -281778, 89113, -234687, -166, 15507, 318173, 203179, -101208, -141731, 243773, -26731, 233597, 43000, 60105, -73294, 164985, -160330, -32052, -97982, 37353, 90989, 154723, -271168, -116323, -232318, 66622, -155096, -259789, -33324, 383443, -181171, -118058, -335035, 352286, -305047, -91728, -194736, 179870, -149395, -12184, -146505, -182230, 347641, -14935, 180326, -31820]
15640c25930a55653k3994A88798J78632A439J56810b06372g4871l6663A15085
15629A74210a24748A07042a18583C05449j29610P939A1002i6118r5257A08377
15618D4777b05852A8987i2309B0763g2954A91656a74878P7253B50848f3025j61652
15607b24677B45398i1794L4744B83830I3413d9334j42203L8745B6777g6112k84888
15596c61000A13270c4256F9431b25384C2102n041a35187A16398N6538g105n0470
15585e7575j14149r0848A5756c53724B00843c27490I3195a73222H9807a3640l1418
15574d5058H0324a75458A83823c971k46867J7573h5398o0768A03400J59440H9968
15562B50953A18475e2982D6815a66505o7190E0026k3605L0146J5652K06577c03462
$$ y = [-325930, -155653, -179647, 188798, 367430, 1439, 158249, -206372, -74871, -111534, 115085, 174210, -124748, 107042, -118583, 305449, 175839, 183778, 11002, -96118, -191375, 108377, 44777, -205852, 18987, -92309, 20763, -72954, 191656, -174878, -97625, 250848, -63025, -224677, 245398, -91794, -57050, 283830, 93413, -49334, -191537, -152792, 26777, -76112, -361000, 113270, -34256, 69431, -225384, 32102, 27061, -135187, 116398, 172936, -7105, -57575, -171724, -262572, 15756, -353724, 200843, -327490, 93195, -173222, 89807, -13640, -45058, 80324, -175458, 183823, -3971, -250838, -233265, -85398, -146166, 103400, 262840, 89968, 250953, 118475, -52982, 46815, -166505, -233695, 50026, 26421, 56567, 72219, 278796, -303462]
15550C000J88228a33121f0352C45005a10598b3866j05353A6731L50649e3832p2322
15539a26154B8452J46188E3291i2513k59464A8455K13114c1320h814k03326A03646
15527B7763a02065C5829M09836c72891C25209D6483H823g0785C18100H0208c75040
15515d13788J50964A95383b96420f4223B0194J35946c10642A00778b78819C9873
15504I1223P090l3256b5185n9519B0369M6779P8520a95037A53682B2998L02324
15493C25322g8524C29785q0854B4487K87885i1042A87154K86741A91436A7368
15482a65737J5540A10036J78979c1951C37480a24161B74511f0231B23108M42a73381
15470D1030K1618R0579h9327A03308P5737a14455F8712J17131J61520A11316K30818
$$ y = [3000, 191228, -133121, -60352, 345005, -110598, -23866, -129219, 16731, 367380, -53832, -126154, 28452, 174640, 53291, -92513, -351977, 18455, 231569, -31320, -8814, -212140, 103646, 27763, -102065, 35829, 445665, -372891, 325209, 46483, 8823, -70785, 318100, 80208, -375040, -413788, -262824, 195383, -296420, -64223, 20194, 156140, -310642, 100778, -278819, 39873, 91223, 98313, 65057, -25185, -84704, 20369, 67148, 145668, -195037, 153682, 22998, 325322, -78524, 329785, 248931, 24487, 312372, -91042, 187154, 473895, 191436, 17368, -165737, -150197, 110036, 289015, -31951, 337480, -124161, 274511, -60231, 223108, 223550, -173381, 41030, 62648, 153227, -89327, 103308, 179045, -114455, 68712, 185843, 347363, 111316, 342134]
15459C42134O9125J21210J43704k94745L4197A47979n2896a55274E0944L7430
15449H8374h6258A28368J50211b47706A71902Q612a09344l3037D65607C8842c2128
15437B10842M3746B0550K1938Q1862l2127R8978L99036A45950Q4464M74454M6046
15426G50914L88368J12930o6249D96611P9125A68176J10985H6840Q2995b11291
15415B3807P1368a52649A94732a92468R3283B59089j996d0549B08983l7391E2858
15403a29433i17G5096O6988a9203j03201I0020Q7502q8090d4793k3507F3896K82793
15391C46689A19666J58320a00402A0754P012a6827m75891a74037L092I6270b1108
15379d26413B61315B2049J09650l1371L4889a24665k7982D2779i2605H1892j5561
$$ y = [342134, 411259, 532469, 676173, 381428, 415625, 147979, 95083, -155274, 50944, 88374, -86258, 128368, 278579, -247706, 171902, 180514, -109344, -142381, 465607, 38842, -32128, 210842, 254588, 20550, 42488, 124350, 92223, 191201, 590237, 145950, 230414, 704868, 750914, 1139282, 1252212, 1185963, 496611, 575736, 168176, 279161, 86840, 169835, -211291, 23807, 95175, -152649, 194732, -192468, -99185, 259089, 257093, -40549, 208983, 171592, 52858, -129433, -917, 75096, 142084, -19203, -122404, 90020, 177522, 89432, -44793, -68300, 63896, 346689, 119666, 277986, -100402, 10754, 17766, -16827, -492718, -174037, -170945, 96270, -21108, -426413, 261315, 22049, 131699, 100328, 135217, -124665, -152647, 42779, -92605, 81892, 66331]
15368F6331J83038O4381a19834j4635I9434K23213I5877L5851L29419J83238k27616
15357D16769A663M00158E987K09486P580b05241F9993N0166K574a8662A98022
15345B70335G8081R2249K23150j50120k8470J11957A3846K72765q2257o6784D4057
15333a28145B06787j8079J30584K94367B59667P856K92378b4946C7080K41270
15323B78350N2255G8910Q5899L35061B15849I0416K30530F9099K2485a24918A77075
15311a04828C34246j8529n3366R6168R4746h9239B01083J46154j02303e7707q6512
15300a44219f7320q850F0601J15212L72041B73816L5784J05720F8524g1317C45781
15288A64419O9972a00989B8404J62192E1211b12138P802B7640i5318E5884P690
$$ y = [66331, 249369, 313750, -119834, -134469, 99434, 322647, 95877, 131728, 461147, 644385, 416769, 1663, 401821, 5987, 215473, 223053, -205241, 69993, 120159, 122733, -18662, 198022, 270335, 78081, 170330, 393480, 243360, 214890, 326847, 13846, 286611, 204354, 137570, 44057, -128145, 206787, 188708, 319292, 613659, 259667, 267523, 559901, -24946, 37080, 278350, 330605, 78910, 164809, 499870, 215849, 90416, 320946, 69099, 91584, -124918, 177075, -104828, 334246, 315717, 262351, 358519, 453265, -89239, 201083, 347237, 244934, -57707, -144219, -67320, -76170, 60601, 175813, 547854, 273816, 309600, 415320, 68524, -71317, 345781, 164419, 234391, -100989, 28404, 190596, 51211, -212138, -204336, 27640, -95318, 55884, 63574]
15277F3574a17828l7787j31808J36269f4362A23400L1994c27790a08509B08807
15266H0410a10826n526C1798M01176j41495c8799C74797E1069J14502D4188g7367
15254D1717a30025j5981A3945d71887B49629C7181N5449c7288D15431A31776K36000
15243C67776A43696q491o7183c4778A32089k5244a42924C4398J48356E0151K49986
15232C00137q0174J60715J38900L56237L07140K95059m22269O65783p15238B47693
15221D43098b6672D13066A24991K072a3898A45405g0522e911A45568K0238a03468
15209A2418e764l19474J40072E5942M2735a02914J0487C20910A05625d6156B63482
15197G186a3943j07689C2256b11750h5995H0544J27704D8523e8201A94253j8840
$$ y = [63574, -117828, -155615, -287423, -151154, -64362, 123400, 155394, -327790, -108509, 208807, 80410, -110826, -116352, 31798, 432974, 291479, -38799, 374797, 51069, 165571, 44188, -77367, 41717, -130025, -146006, 13945, -471887, 249629, 37181, 92630, -37288, 415431, 131776, 367776, 143696, 135205, 68022, -34778, 132089, 106845, -142924, 34398, 182754, 50151, 300137, 219963, 380678, 519578, 875815, 1182955, 1478014, 1055745, 1721528, 1006290, 247693, 443098, -26672, 413066, 124991, 127063, -13898, 145405, -70522, -5911, 145568, 165806, -103468, 12418, -5764, -325238, -185166, 55942, 98677, -102914, -92427, 320910, 105625, -46156, 263482, 7186, -13943, -121632, 32256, -211750, -85995, 80544, 208248, 48523, -58201, 194253, 175413]
15186A75413L9091j02766j9657p544D795M0023K1794b4309A19515K11063G1882
15174c109k9440D58710q2396j54980O2078a46m1453C68702A23944J80437g7481
15162B36342q4652N8041G8959b85946d3862I6801B3425J69338a76439A15614b196
15150d5236A71765n3463J59933a42703F3356B3920K23279h5573F1003c5467A7492
15138B2462R0864j276a04051A09134R335f691B0402k75b7454F5336a63485I0436
15125B19670a4138G0013K75456C9005J28795f03B25598J10747J80852a14198D18290
15113D22730k03658K42017j72117f5016i121A15102O7525R6474I4830K98402L8737
15102D31969n24K60j81697A00123b8851F8971K32838I8509a1172H3406J47409
$$ y = [175413, 214504, 111738, 92081, 84537, 4795, 44818, 66612, -24309, 119515, 330578, 71882, -3109, -32549, 458710, 376314, 221334, 283412, -146, -41599, 368702, 123944, 304381, -77481, 236342, 151690, 209731, 78959, -285946, -43862, 96801, 23425, 192763, -176439, 115614, -2196, -45236, 171765, 118302, 278235, -142703, 63356, 23920, 247199, -85573, 61003, -35467, 17492, 22462, 113326, 112050, -104051, 109134, 118469, -6691, 20402, 20127, -27454, 65336, -163485, 90436, 219670, -14138, 70013, 345469, 39005, 167800, -603, 225598, 336345, 517197, -114198, 418290, 422730, 219072, 461089, 288972, -65016, -9121, 115102, 182627, 279101, 94830, 393232, 431969, 431445, 431705, 250008, 100123, -28851, 68971, 301809, 98509, -11172, 83406, 230815]
15091B30815H2040B7341N42641k82599m9203J59682H6888J97143J02601I7331
15080A95562J6806a02499H5945L24357B04749a56042C81302g7971j1985B87474
15069C6282L23035j52633l4228J28638r7396c36259B1681M1762a38073B21959
15058c43415b8655p5240B19922l3336l0073Q9989J42653E9533K27670A02922J57264
15047B60186J0889n2965e6532A39674O52305l20978B24428o741I3578L07799j14147
15036B87230G2858J25941a59536E41030A09545R1761N0506I8479K72633O7309
15026D38421N2567k687O1341O380n4162k21251l5744L96236B74322L37365k0443
15015E91244k8149K33264k08363K56005j14904l24894j86801K06656k8685R758
$$ y = [230815, 82040, 27341, 569982, 287383, 238180, 397862, 86888, 284031, 386632, 97331, 195562, 212368, -102499, 85945, 410302, 204749, -156042, 381302, -77971, -89956, 287474, 36282, 359317, 206684, 172456, 301094, 203698, -336259, 21681, 63443, -138073, 221959, -343415, -28655, -103895, 219922, 186586, 156513, 246502, 389155, 59533, 287203, 102922, 260186, 271075, 218110, -56532, 139674, 791979, 471001, 224428, 217687, 93578, 401377, 287230, 72858, 198799, -159536, 541030, 109545, 201306, 251812, 98479, 371112, 438421, 490988, 488301, 549642, 556022, 501860, 280609, 244865, 641101, 274322, 611687, 591244, 563095, 796359, 587996, 844001, 729097, 404203, 217402, 424058, 395373, 405131]
15005D05131J32329N1162J94013l56118l1294J64082j28598A71007L17480k37423
14995B51064K11292O9284j61447l7714N1820m67J20758k0194k20931K44945K59156
14984G67566j48685J36L5405l07325Q7339K71389j74701J30710o6128Q283J92491
14973G96480l88030n1999K07999J29291k22808J02124J87709Q1897Q9632O2581
14963I94876q0199m17197O7592M00j8555I0358L76295K11828j17639J09412k29596
14952D40658j32299N4146l359J63817J28372j75639j39660K34985B81147K3721
14942C04868O0130A47790N29417k67011K6498L0979A39666L45763J76211k45136
14932D16504K07704A60430N26409p203K187L5872P8812l03170R6059k36480K72072
$$ y = [405131, 537460, 588622, 782635, 426517, 395223, 559305, 430707, 171007, 488487, 251064, 462356, 531640, 370193, 332479, 384299, 383832, 504590, 484396, 263465, 508410, 767566, 618881, 619017, 654422, 347097, 434436, 705825, 531124, 661834, 595706, 603989, 796480, 408450, 356451, 564450, 693741, 470933, 573057, 760766, 842663, 932295, 994876, 914677, 497480, 565072, 565472, 546917, 90358, 466653, 678481, 560842, 670254, 440658, 308359, 362505, 359146, 522963, 651335, 475696, 336036, 571021, 281147, 304868, 364998, 147790, 677207, 410196, 436694, 467673, 139666, 485429, 661640, 416504, 624208, 160430, 686839, 679636, 681823, 717695, 796507, 493337, 589396, 352916, 624988]
14921F24988J25766j67558Q167M1876k7710K00414M49995L0090K94360M2510J63471
14910A786369n9108K01582o730j50606j97301l4323j41232P61737j70731M02429
14900B392086j31626l57647k40062l36075j80393j44187k23327j04623N8921p9795
14890F53272r3440L20255m2755k55625j89646q7404M61880C29705K65123o5284
14880E29544n0570K16320j67681l6338l2812j37239N18241B26463L36523J65217
14870G28203m0278n6354L08598m35413J44405J08862J52634P8086k44744J41706
14860H85705m17197J98515j35523j22082K58011q3860j64858j46178M38563O3906
14850G75002L41060k90103k57122J40282p5678k01705m5146J72276p632M2327
$$ y = [624988, 750754, 583196, 591363, 633239, 605529, 805943, 1255938, 1286028, 1580388, 1622898, 1786369, 1727261, 1928843, 1922113, 1771507, 1574206, 1539883, 1398651, 2160388, 1989657, 2392086, 2260460, 1902813, 1662751, 1326676, 1146283, 1002096, 778769, 674146, 733067, 653272, 559832, 880087, 837332, 581707, 392061, 304657, 766537, 329705, 594828, 529544, 478974, 695294, 527613, 491275, 458463, 321224, 839465, 226463, 562986, 728203, 687925, 631571, 940169, 504756, 649161, 758023, 910657, 988743, 743999, 885705, 468508, 667023, 531500, 409418, 667429, 583569, 418711, 272533, 711096, 775002, 1116062, 825959, 568837, 709119, 633441, 431736, 386590, 558866, 551234, 593561]
14840E93561J76387k6432C59484J53790J83840k54959L80594C97417J81142J93237
14830G71796J165K5979L31195m681k66468K5772O15533m99800Q5201E07721L71827
14819H79548k46128J3016L95055D31106J01385L6187p5055l6291L10844k21438
14809E46738n1202R6294R1929k37274J80585J48662K5099o4751k68600M33340
14799I00820N7753k21110j74914L77620j9076P4846Q8800k59432k80508J76802
14789G21601M5037L66391j88579j07185j44239R0599k5244j67033j72151K25415
14779F44612k10980R3619Q7126k78526K05933K39344l69789K25438L03200q7025
14769H52952N0998B48946K13639K87561k45550J09380q1714K53165j52254O04540
$$ y = [593561, 769948, 743516, 359484, 513274, 697114, 442155, 822749, 397417, 578559, 771796, 772961, 798940, 1130135, 1125454, 858986, 884758, 1500291, 1000491, 1085692, 507721, 879548, 633420, 646436, 1041491, 431106, 532491, 568678, 493623, 457332, 768176, 546738, 495536, 591830, 683759, 446485, 627070, 775732, 800831, 736080, 467480, 900820, 958573, 737463, 562549, 940169, 921093, 995939, 1084739, 825307, 544799, 721601, 766638, 1133029, 944450, 837265, 693026, 783625, 758381, 591348, 419197, 644612, 433632, 527251, 614377, 335851, 541784, 781128, 411339, 636777, 939977, 852952, 903950, 248946, 462585, 750146, 504596, 613976, 532262, 785427, 633173, 1237713]
14759A237713m87756K27487r2386q2110j35232J77759j34217L4927k30328L82365
14749H98222q6522o9089C03615N15980L1253j52451k48847j5005p5412L89604
14739G48737l40116M07858l01798J76140k13230M14178l31307j90048M56752j18043
14729G09123j12511J33484k3725m3310p1073K42394N0805J09367k5161j67005
14719H02388m6348J06348p8841K01697j78944N57448L23396m4248R4727J19113
14709A856736k2050m45202j02142p5547j17219J63686l14971j63730M51120l19502
14699I11179k43743J66234R7429o608n872p0176J19024Q4296N673j427K56812
14688A312821k39753O47176R5214J88260p9592q5364l07996m68613L77902m15226
$$ y = [1237713, 749957, 977444, 885058, 802948, 667716, 845475, 711258, 746185, 515857, 898222, 811700, 742611, 303615, 819595, 850848, 698397, 449550, 434545, 359133, 748737, 408621, 816479, 514681, 690821, 477591, 891769, 560462, 370414, 827166, 709123, 596612, 730096, 706371, 663061, 591988, 834382, 885187, 994554, 969393, 802388, 756040, 862388, 783547, 985244, 806300, 1363748, 1687144, 1642896, 1737623, 1856736, 1834686, 1389484, 1287342, 1211795, 1094576, 1258262, 943291, 779561, 1230681, 911179, 667436, 833670, 931099, 924491, 918619, 848443, 967467, 1051763, 1057436, 1056009, 1312821, 1073068, 1720244, 1815458, 2003718, 1924126, 1838762, 1530766, 1062153, 1440055, 1024829]
14678A024829J66561n0759k5658j09158L32192m23275M3974K76208m93842K38409
14668I79481j34927j83149J46258J33800J69476l84140K69103D75337L19354M35616
14658A230307m04390M16425k30818K24792q4809j35614j07449m943N6512L35934
14648A295947n83242K65557M07619n26324L03109q1734J61396J08811J32285l62505
14638A120919K91959j14134k99804J93603L09999k18357k41307j21232L63101
14629A284747r0489J8685J05241o46769M47638J76758O1330m45605J80705J67851
14619A260092J15024k81960J40568N2160q0301K8316q7003n9507L33618m25876
14609I95131O43126l60926J0172j336K78614l66596M55714m39805m433J06844
$$ y = [1024829, 1191390, 1140631, 1114973, 1005815, 1338007, 914732, 958706, 1234914, 741072, 979481, 844554, 661405, 807663, 941463, 1110939, 726799, 995902, 475337, 794691, 1230307, 825917, 1242342, 1011524, 1236316, 1151507, 1015893, 908444, 903501, 960013, 1295947, 712705, 978262, 1385881, 859557, 1162666, 1080932, 1242328, 1351139, 1483424, 1120919, 1412878, 1298744, 998940, 1192543, 1502542, 1284185, 1042878, 921646, 1284747, 1194258, 1212943, 1318184, 671415, 1119053, 1295811, 1357141, 911536, 1092241, 1260092, 1375116, 1093156, 1233724, 1285884, 1205583, 1233899, 1146896, 1087389, 1421007, 995131, 1638257, 1277331, 1287503, 1286167, 1564781, 1198185, 1653899, 1214094, 1209661, 1316505]
14599A316505K86336k29840J06434k3799K54557k13965j41393Q4280j76503K60140
14589A522752p03J63579J01590j77453n75657M76226K94309j83320K58239k35511
14579A644051j34051N89835l04745J46542m891l60307J59624j75042J95914o7606
14569A689324j79531O41644k91548q3713L76978j00262p755k78260J60173J13063
14559B040113k36534M98607r2431k62017N81190l83171J86670L754r7227J94452
14549B433406P6433j64400L02050J06402J85939J48703K75984m3059p2135J19047
14539C368370P67146O65753M01624P17320J479456K623448M358039O814326J1346402
14530C2541884k17086j4461767p436364m536203j261650l63026k6691P45903m12417
$$ y = [1316505, 1602841, 1373001, 1479435, 1455636, 1710193, 1496228, 1354835, 1439115, 1262612, 1522752, 1522049, 1685628, 1787218, 1609765, 1034108, 1510334, 1804643, 1621323, 1879562, 1644051, 1510000, 2099835, 1795090, 1941632, 1936741, 1576434, 1736058, 1561016, 1756930, 1689324, 1509793, 2151437, 1859889, 1776176, 2153154, 2052892, 2045137, 1766877, 1927050, 2040113, 1803579, 2302186, 2209755, 1947738, 2528928, 2145757, 2332427, 2336181, 2238954, 2433406, 2509839, 2345439, 2647489, 2753891, 2939830, 3088533, 3364517, 3321458, 3249323, 3368370, 4135516, 4801269, 5202893, 5920213, 7399669, 10023117, 14381156, 21195482, 32541884, 32324798, 17863031, 10426667, 5890464, 4628814, 4265788, 4239097, 4985000, 4572583]
14521D572583j684515k08375l49748j59838K57918J14372Q2166n70182J89340
14512B243721J83055k76453o1648J02037N05708n85291K32496K60122j63121J92170
14502B632796J15833j05294j84894J04149M98305l82006L9808J38391m8514J29932
14492B938506n4966K0617Q7006k56125M50144k35230J85857j60164L16727j77507
14482C114865J55350J41645m96392N74781l27834k4483L62429K52245k39509k9626
14472C483471M17623m74327L07478j58973K70966j91894k56851K71604L70233
14463D039330p9810N2590J71138m72448L12172Q3729J41649J16402J11985k40037
14453D236700J08022N7225j6467M38129j67049k24375J97587J17988L03456k08371
$$ y = [4572583, 2888068, 2679693, 2329945, 2170107, 2428025, 2542397, 2624563, 2054381, 2243721, 2426776, 2150323, 2088675, 2190712, 2696420, 2111129, 2343625, 2603747, 2440626, 2632796, 2748629, 2643335, 2458441, 2562590, 3060895, 2678889, 2718697, 2857088, 2808574, 2938506, 2883540, 2904157, 2991163, 2735038, 3185182, 2949952, 3135809, 2975645, 3292372, 3114865, 3270215, 3411860, 2915468, 3490249, 3162415, 3137932, 3500361, 3752606, 3513097, 3483471, 3901094, 3426767, 3734245, 3575272, 3846238, 3654344, 3397493, 3669097, 4039330, 3959520, 4012110, 4183248, 3710800, 4022972, 4106701, 4248350, 4364752, 4476737, 4236700, 4344722, 4401947, 4385480, 4823609, 4656560, 4432185, 4629772, 4747760, 5051216, 4842845]
14443D842845p231j11547L50513K26852l87415M25917m6443k95439L1095K33865
14433E263012P71653o09611L63005J71886l51703J83744j44621L57464M5165K68702
14423F318696j68733L87896j59126m6912N5163L38680j67101K01460M22565l35933
14413F846655L13517N52029l94521K0195L79726P9722K00254j02691K25900K94992
14403H415778L58501K47953j40458j82356Q3036m3355K22308N3856L53814J28279
14393I497356k1465L59217k3109L53996L2309M35901R4318M9021J84025J28306
14383A1089875l372q7820L71658K57128o5385R1791N84881J17774N2838N58841
14373A2968209J57996J37283K89764N18837l12193L57302N30844L34018M55670
$$ y = [4842845, 4835614, 4724067, 5074580, 5301432, 4914017, 5339934, 5293491, 4998052, 5029147, 5263012, 6034665, 5425054, 5788059, 5959945, 5608242, 5791986, 5647365, 6004829, 6049994, 6318696, 6149963, 6537859, 6378733, 6331821, 6386984, 6725664, 6558563, 6760023, 7182588, 6846655, 7160172, 7712201, 7317680, 7337875, 7717601, 7797323, 7997577, 7894886, 8120786, 8415778, 8774279, 9022232, 8881774, 8699418, 8782454, 8739099, 8961407, 9015263, 9369077, 9497356, 9475891, 9835108, 9811999, 10165995, 10198304, 10634205, 10728523, 10777544, 10961569, 11089875, 11086503, 10998683, 11370341, 11627469, 11562084, 11653875, 12238756, 12356530, 12409368, 12968209, 13126205, 13263488, 13553252, 14072089, 13759896, 14117198, 14648042, 14982060, 15437730]
14364A5437730k98945R41763l29169O38242P6753K35981K83615Q79213j38311
14355A7726872M47869L16522R20026R7775P32542J83331J36332N55792O89938
14346B1806999j3322P33975L06884P46649M9915J271945Q7283O50773P62561P80221
14336B7183883J63096J129829L76141N98672O89882R53872Q38271P05101J166084
14327C3804831O02956J219786P19743J160527R49197R09978J089876J677233J338353
14318D3472480J241578J140998J445198J349735J734072J699298J265177K327521
14310E5676057J746869J891827J898645K781580K082552K276608K512246K905810
14302G3772194K462684K827341L051644L321176L545473L563003L963199L701705
$$ y = [15437730, 15138785, 16080548, 15751379, 16389621, 16466374, 16702355, 16985970, 17865183, 17726872, 18174741, 18491263, 19411289, 19509064, 20241606, 20424937, 20561269, 21117061, 21806999, 21793677, 22527652, 22834536, 23581185, 23631100, 24903045, 24990328, 25641101, 26403662, 27183883, 27346979, 28476808, 28852949, 29451621, 30141503, 31095375, 31933646, 32638747, 33804831, 34407787, 35627573, 36347316, 37507843, 38457040, 39367018, 40456894, 42134127, 43472480, 44714058, 45855056, 47300254, 48649989, 50384061, 52083359, 53348536, 55676057, 57422926, 59314753, 61213398, 63994978, 66077530, 68354138, 70866384, 73772194, 76234878, 79062219, 82113863, 85435039, 88980512, 92543515, 96506714, 100208419]
14294A00208419M406763M441047N585309N113576N336216N918496O067523O239267
14286A43316616P245695P048117Q555623P843392Q901586R293084R875398J0030581
14278B12110092J1015511J1913527J2122573J2898134J3068620J4287024J4650368
14271C02065849J4427542J4918962J4828716J4795541J4771489J4726582J3969275
14264D04503956J2686807J1475392R730189R324542Q378277P056995L821138J634820
14256D68612116J672015J786054j538483o889724n833050p504907j2002527j2299381
14248D26002113j2191674j3512047j2928181j3586383j5138107j4692641j4664289
14241C29288791j3347549j2668764j4028400j3484039j2904516j1978792j1789478
$$ y = [100208419, 104615182, 109056229, 114641538, 119755114, 125091330, 131009826, 137077349, 143316616, 150562311, 157610428, 166166051, 174009443, 182911029, 192204113, 202079511, 212110092, 223125603, 235039130, 247161703, 260059837, 273128457, 287415481, 302065849, 316493391, 331412353, 346241069, 361036610, 375808099, 390534681, 404503956, 417190763, 428666155, 438396344, 447720886, 456099163, 463156158, 466977296, 468612116, 470284131, 472070185, 470531702, 463641978, 457808928, 450304021, 438301494, 426002113, 413810439, 400298392, 387370211, 373783828, 358645721, 343953080, 329288791, 315941242, 303272478, 289244078, 275760039, 262855523, 250876731, 239087253]
14234B39087253j1836896j1411022j1654045j0684367r731176r071030q747239
14227A65951478p716249p768594p032499o960955o123198n772032n368191n356895
14219A13852865m908404m445104m387584m090637l655615l825239l471951l381959
14211H1686372k988349l058328k616509k912751k295062k438277j676811k429138
14203F1271147k065657k081949j678260j755093j395055j680391j980132j096779
14195D7537831j937942r31533j219401j000251j203684j081259j491437q57752
14187C7814572j171853o71739q58608j276173p91275q73838q67289o53792p50185
14178B9899820q16264m82957r82024q99539l46180m99881m21764p56905o96142
$$ y = [239087253, 227250357, 215839335, 204185290, 193500923, 183769747, 174698717, 165951478, 158235229, 150466635, 143434136, 136473181, 130349983, 124577951, 119209760, 113852865, 108944461, 104499357, 100111773, 96021136, 92365521, 88540282, 85068331, 81686372, 78698023, 75639695, 73023186, 70110435, 67815373, 65377096, 63700285, 61271147, 59205490, 57123541, 55445281, 53690188, 52295133, 50614742, 48634610, 47537831, 45599889, 44668356, 43448955, 42448704, 41245020, 40163761, 38672324, 37814572, 36642719, 35970980, 35112372, 33836199, 33044924, 32171086, 31303797, 30650005, 29899820, 29083556, 28600599, 27618575, 26719036, 26372856, 25872975, 25451211, 24694306, 23998164]
14169B3998164r66927J78610r95511m04930Q4525o42302m46993p80306j40850
14160A9883480p37734m23594m98783N9896j82969q23300M11387n33954m92284
14151A6662145k23402k58259n43765k46730j01438k62374m28091j82452l65907
14142A4049727q2418k53471R4461m23278k88018j28569m96626k76626J2781l9182
14132A2168781m39991j83569k19151p523k19291j19469j28221n0275k44279n50647
14122A0006365j11299N2496Q4995m44338n0915K7092l0811l14907m0578Q592l17477
14111H869215l19202L296o48212L64493J9215m03868j98124K67614j49204l99987
14101G405236r7415J67300L016n05689K06194l64209L56798q3711j73467l20010
$$ y = [23998164, 23031237, 23209847, 22214336, 21809406, 21893931, 21251629, 20804636, 20024330, 19883480, 19145746, 18722152, 18223369, 18283265, 18100296, 17276996, 17688383, 17154429, 16662145, 16438743, 16180484, 15636719, 15389989, 15288551, 15026177, 14598086, 14415634, 14049727, 13967309, 13713838, 13808299, 13385021, 13097003, 12968434, 12471808, 12195182, 12207963, 12168781, 11728790, 11545221, 11326070, 11318547, 11099256, 10979787, 10851566, 10801291, 10557012, 10006365, 9895066, 9947562, 10032557, 9588219, 9537304, 9564396, 9533585, 9218678, 9178100, 9186692, 8869215, 8550013, 8553309, 7905097, 8269590, 8288805, 7884937, 7686813, 7954427, 7805223, 7405236, 7307821, 7475121, 7478137, 6972448, 7178642, 6814433, 7171231, 7087520, 6914053, 6594043]
14091F594043K63131j9736n9013m69680l18856L81666l40452J77768j73670m35758
14081E599443K03061J34724k02903j60521Q5195l04913M20280j32243k82345P2909
14071E432687j2938q3429K03481m82750K82387k83377k16916J86431k2519j42174
14061D860883J33462k62806j78977J32472l17919L74860j70337j94941j06501
14052D270196K24354k10920j66093K8727J38331J15261J03080n57010L48533k42515
14042D051944M30178l13414k74335Q9402j60666K66388L1831j75627l73510J76432
14032C748623L0790o7386p5941k02806j45215r6516M25660j89853j24043o7955
14022C235358L46559m30237P8338M7726K85993n01066M08704n36299M44710k61068
$$ y = [6594043, 6857174, 6837438, 6778425, 6308745, 5989889, 6371555, 6031103, 6208871, 6035201, 5599443, 5802504, 5937228, 5734325, 5573804, 5658999, 5354086, 5774366, 5642123, 5359778, 5432687, 5419749, 5336320, 5539801, 5057051, 5339438, 5056061, 4839145, 5025576, 5003057, 4860883, 4994345, 4731539, 4552562, 4685034, 4367115, 4741975, 4571638, 4376697, 4270196, 4494550, 4283630, 4117537, 4146264, 4284595, 4399856, 4502936, 3945926, 4294459, 4051944, 4482122, 4168708, 3894373, 3983775, 3823109, 4089497, 4121328, 3945701, 3572191, 3748623, 3779413, 3712027, 3636086, 3433280, 3288065, 3191549, 3617209, 3427356, 3303313, 3235358, 3581917, 3151680, 3230018, 3277744, 3563737, 3062671, 3471375, 2935076, 3379786, 3118718]
14012C118718J29925j44458K33597k4153m93032J097J21134N2653P206n4292l31119
14001B617276J08771n5720L9963n3177l13376j5892M10337j23745K25745l65578
13991B474604l85117M72601j58261L7475m9423l64974L12184J68508K60610m26298
13981B341909K70502q6303K02799L79603K60875M59332R66243J517898L524939
13972I837797O303952J1245709P222443j1738476q148024n013881k470812j474080
13964E764628l36727j309030l65726l47455N4212j97376n40998J75055n5556K3290
13954B864317k30339j94344J13454M4395j52934M1643j97350q8933L4249l85161
13944A848997L63047m20882L91022j50883J92454J28450l10776K68616n16279
$$ y = [3118718, 3248643, 3104185, 3337782, 3313629, 2820597, 2821694, 2942828, 2995481, 3002687, 2948395, 2617276, 2726047, 2670327, 2710290, 2657113, 2343737, 2327845, 2738182, 2614437, 2840182, 2474604, 2089487, 2562088, 2403827, 2441302, 2391879, 2026905, 2339089, 2507597, 2768207, 2341909, 2612411, 2526108, 2728907, 3108510, 3369385, 3828717, 4794960, 6312858, 9837797, 16141749, 27387458, 34609901, 22871425, 14723401, 9709520, 7238708, 5764628, 5427901, 4118871, 3753145, 3405690, 3459902, 3262526, 2721528, 2896583, 2841027, 2864317, 2633978, 2439634, 2553088, 2597483, 2444549, 2486192, 2288842, 2199909, 2234158, 1848997, 2212044, 1791162, 2182184, 2031301, 2223755, 2352205, 2041429, 2310045, 1793766]
13935A793766K91233j92109J96329l89748J90212K58568k46165j91194J58058
13926A868950j57290J04051k07401K70070m3779j35693R8069J89039j48257l70602
13916A467157K29292J71736m51386L18324j62860j3310j57117J94204p4231K80975
13906A802784k48530J18326k34793L93897m02189J2879L4299J73210j90019l6623
13896A423241Q670k18074L11946j9513L7176J23431k50537J19198j28847j40940
13886A265751J28324K32053j56248P0878r3532J47081j86789j70464J86573l10533
13876A113094N02224l33499K17081k51457J43243k97355J38345J12062K86995
13867A630733m99298p7963L73080j3632m1179l49840l2775j4660N91659m28798
$$ y = [1793766, 2084999, 1892890, 2089219, 1699471, 1889683, 2148251, 1902086, 1710892, 1868950, 1711660, 1815711, 1608310, 1878380, 1834601, 1698908, 1796977, 1986016, 1837759, 1467157, 1696449, 1868185, 1416799, 1735123, 1572263, 1558953, 1401836, 1596040, 1521809, 1802784, 1554254, 1672580, 1437787, 1831684, 1429495, 1442374, 1476673, 1649883, 1459864, 1423241, 1431911, 1213837, 1525783, 1506270, 1543446, 1666877, 1416340, 1535538, 1406691, 1265751, 1394075, 1626128, 1469880, 1540758, 1447226, 1594307, 1407518, 1237054, 1423627, 1113094, 1615318, 1281819, 1498900, 1247443, 1390686, 1093331, 1231676, 1343738, 1630733, 1131435, 1053472, 1426552, 1412920, 1371741, 1021901, 989126, 974466, 1566125, 1137327]
13857A137327J93168j15161Q2750j60941P061j83589L46583l7376o7190p8154
13847A124478j85595K56897m92454L28076K29917m76915J31915K62133p2985K8039
13837A133506Q6464l05147K83191k21829J42012k75583Q1480R2015J48777k24570
13827I40316k6232L10671p4784j88865J32135k26965L0142K5292J11231j77926
13817H55015L47460k09093R3116k89931L12409k04561J09458N6188N0707r1589
13807A029179j08301K28048j55429m3881m50433M69462r3371J38331k89831L33879
13797A057653p7741m86515J01084L23149k0561r1530j11384J91716Q8882j62339
13787H12414K35345j35567m20154L66575J6597J7513J67670l22801k5819j63180
$$ y = [1137327, 1330495, 1215334, 1298084, 1137143, 1144204, 960615, 1307198, 1269822, 1202632, 1124478, 938883, 1195780, 703326, 1031402, 1261319, 784404, 916319, 1178452, 1105467, 1133506, 1219970, 914823, 1198014, 976185, 1118197, 842614, 924094, 1016109, 1164886, 940316, 914084, 1224755, 1149971, 961106, 1093241, 866276, 896418, 921710, 1032941, 855015, 1202475, 993382, 1086498, 796567, 1108976, 904415, 1013873, 1070061, 1120768, 1029179, 920878, 1148926, 993497, 949616, 499183, 968645, 875274, 1013605, 723774, 1057653, 979912, 493397, 594481, 917630, 897069, 805539, 694155, 885871, 974753, 812414, 1047759, 912192, 492038, 858613, 875210, 892723, 1060393, 737592, 711773, 548593]
13777E48593M66781m16548K25834r1533J09427l56283J23845j1366J34887R014
13767G42651J22109K77502k01579k86579k4394L14755k07574k93782K45488L1069
13757G19666j37089P3329L822O8150K25095k69222L02946k75862p4775q0184k2766
13746E33110J3819n6991J39005J00036R058k97559j14765N43212j05628J19134
13736H82431C97106K30659j84478L12118o5235j33432P9244L5679j50658m0728
13726D80275L19066j29943j57471J62972P4212j64706M74323l11396m3535K5062
13716G28859M4915l40432R310q2858N65282k46144j50299J56523C39934n553N4986
13705C89367J59876l0708K88606J4395C90683J44166K34047l73263k135K38573
$$ y = [548593, 1015374, 598826, 824660, 733127, 842554, 486271, 610116, 598750, 733637, 742651, 864760, 1142262, 940683, 654104, 629710, 944465, 736891, 443109, 688597, 719666, 582577, 655906, 659728, 727878, 952973, 683751, 986697, 710835, 636060, 555876, 533110, 546929, 489938, 628943, 728979, 738037, 440478, 325713, 868925, 763297, 882431, 397106, 627765, 443287, 755405, 690170, 556738, 635982, 671661, 521003, 480275, 799341, 669398, 511927, 674899, 749111, 584405, 1058728, 747332, 703797, 728859, 773774, 433342, 442652, 359794, 925076, 678932, 528633, 685156, 339934, 334381, 389367, 549243, 518535, 807141, 821536, 390683, 534849, 768896, 395633, 393498, 632071]
13695F32071A81814L10132j06565M16486o4455k32401O5877K7023K47192l32639
13685E12464j61068A18184L06039L55211l73059J82707N2494J47175k46113j84558
13675C58080j00290K05985N6962n149L52821l62277J26365j57395P9273m664N1867
13664F01578k87078K33933R6492q0137M6395j06663J26103j67665k1652J12780
13654E54086j27841n8066N73315D08444L16895k89997j28119J03153J87158O8902
13644F66436k68365J21942R402j4930m5574j02458o4155j04306K8345L0961J42699
13633C99997K83983k42815K6081j20880j56370j9864J2066J65911j09328G3998
13622C56753K21924B58329l9833L48506A77619K84501o9544j15968N328L22530
$$ y = [632071, 181814, 491946, 385381, 801867, 737412, 505011, 570888, 597911, 845103, 512464, 351396, 118184, 424223, 779434, 406375, 589082, 641576, 788751, 542638, 358080, 257790, 463775, 520737, 515588, 868409, 506132, 632497, 475102, 554375, 549711, 601578, 314500, 548433, 644925, 564788, 611183, 504520, 630623, 462958, 441306, 554086, 426245, 368179, 941494, 408444, 725339, 435342, 307223, 410376, 597534, 666436, 398071, 520013, 529415, 514485, 468911, 366453, 302298, 197992, 226337, 257298, 399997, 683980, 441165, 467246, 346366, 189996, 170132, 182198, 348109, 238781, 73998, 356753, 578677, 258329, 218496, 567002, 177619, 462120, 392576, 276608, 281936, 604466]
13612F04466B72618J09461N8810A53212N97416l06892J24565j11267k16428J63896
13602D04502B00229N0004J00238p7330K94987L02864B49319J9740M5126K53933
13592E68118k27581n1921L86833B83184J16996K25582k92759K6694A40520j3844
13582A26676M30252m4681j04833R2235m2181J48865r766k32862j15697p2595L27076
13571E02489j53073O470K14177r1135B11151j3105J63421j29905J90221E8756
13560G0467K11444j34945R8631K61119o0365O2B14777J62387A09801L14080A28304
13548D31997L8578j3098j07412m5447E6546J337O33446B77267K36356j02154b99026
13536C63558j75765K76134B01321M92034j62332q2603O199j34119r1210K41756
$$ y = [604466, 272618, 382079, 440889, 153212, 750628, 443736, 568301, 457034, 240606, 404502, 200229, 250233, 350471, 273141, 568128, 870992, 249319, 269059, 314185, 568118, 340537, 288616, 675449, 283184, 400180, 625762, 333003, 359697, 140520, 126676, 556928, 512247, 407414, 499649, 457468, 606333, 596567, 363705, 248008, 175413, 502489, 349416, 355886, 570063, 478928, 211151, 198046, 361467, 231562, 421783, 58756, 70467, 281911, 146966, 245597, 506716, 446351, 446413, 214777, 377164, 109801, 423881, 128304, 431997, 470575, 457477, 350065, 304618, 56546, 57883, 691329, 277267, 513623, 411469, -299026, 363558, 187793, 463927, 201321, 693355, 531023, 448420, 454619, 320500, 229290, 471046]
13526D71046A70369R810J95397B9367M50854P1158J2030A89460r45K08161A21622
13514C18941P8298a5072C08614J82846B37926M3548N9609J49905A09438M04284
13504E13722k36474h1089D51596B0926J30831K11859j11897J13962E5440R1225
13494A46665N866L3983N0453J51549A43160K79679j23718A47837f4091C09253
13483E00984E8105J36624J68854A47533K59262j38214J19732a42317B37177q5058
13473A52119k1645M29784I319J77787R839G0496J15721J93879j63614J04805J05902
13462D27189J2518k02482K48594B03156M7208j20926m3624m1482J95527C4934
13451C80123F1265K12299A24603J74172a23289D5103K73475J05197j44721c7910
$$ y = [471046, 170369, 180179, 375576, 29367, 480221, 551379, 563409, 189460, 188515, 396676, 121622, 318941, 397239, -15072, 308614, 491460, 237926, 281474, 341083, 490988, 109438, 513722, 277248, -81089, 451596, 20926, 151757, 363616, 251719, 365681, 55440, 146665, 152531, 186514, 236967, 388516, 143160, 422839, 299121, 147837, -64091, 309253, 500984, 58105, 194729, 363583, 147533, 406795, 268581, 388313, -142317, 237177, 152119, 130474, 560258, 9319, 187106, 196945, 70496, 186217, 380096, 216482, 321287, 427189, 439707, 237225, 485819, 203156, 250364, 129438, 85814, 44332, 239859, 34934, 380123, 61265, 273564, 124603, 298775, -123289, 45103, 318578, 423775, 279054, -37910]
13440A52195m4760o106a09444C58564C3127J68552K8805j9175O5803J67833j96747
13429B48198J51938J26960D1397J91082m6186R8308l1871a52852C13836j21198
13419A92638k6701M2411J1831a54858A87504k3084H1362a54819N9569A55685J26883
13408B82568A18863K23509j6502O6868C534b7130O234I142k858R679L54065f7819
13395D4157K40756j1232I3435K12959j13219j1902J06952M1448K14961I4723L2460
13384A27183K23069j60251M6415L27129A6300L83537I8258c5148A8021J64901
13374A82922l8678P2327n3089R0463K28324j12036i0803B83063g3281C01682H0250
13362e0458B60890q3152b2844A60420p8986N0548K73318R9124l3086A32426J79684
$$ y = [152195, 107435, 101329, -109444, 358564, 33127, 201679, 230484, 211309, 277112, 444945, 248198, 400136, 527096, 41397, 232479, 186293, 284601, 252730, -152852, 313836, 192638, 165937, 208348, 220179, -154858, 187504, 164420, 81362, -154819, -95250, 155685, 282568, 118863, 342372, 325870, 392738, 3534, -27130, -20896, 9142, 6284, 15963, 370028, -67819, 44157, 284913, 273681, 93435, 306394, 193175, 181273, 288225, 329673, 544634, 94723, 127183, 350252, 190001, 236416, 563545, 16300, 399837, 98258, -35148, 18021, 182922, 144244, 216571, 163482, 253945, 482269, 370233, -90803, 283063, -73281, 301682, 80250, -50458, 260890, 177738, -22844, 160420, 81434, 131982, 405300, 504424, 471338, 132426, 312110]
13351C12110j48207L92392A57860L0537D6629c638C71482A26605i4334A00984
13340A15118M8819a7154r8282B41545A08101J57877j31384m3922K27203A01556
13329E87848A68550J96856K5780N2128J2620r7110M1970k5739D2449A5434M74071
13318D89505A40613K76919A53200J30262c3627B06975J4590D8685J31141J34278
13308C14104A35371K53409Q0618j91578L54739B14805n5033R7038J93528j83465
13298B66873q878K6638B0964M02832D7209P0239J19209a9499C39413a54676C07382
13286D01034j56695q584Q6476J75678j17971J812A78257a97541A38809a01185
13275a25914B46172a57085C13591f7792E1324L75377j49024A33482O6399n1245
$$ y = [312110, 163903, 556295, 157860, 188397, 46629, -3638, 371482, 126605, -94334, 100984, 115118, 163937, -17154, -115436, 241545, 108101, 265978, 134594, 90672, 317875, 101556, 587848, 168550, 365406, 391186, 443314, 455934, 358824, 400794, 375055, 42449, 15434, 489505, 140613, 417532, 153200, 283462, -33627, 206975, 221565, 48685, 179826, 314104, 135371, 388780, 469398, 277820, 632559, 214805, 159772, 256810, 450338, 266873, 257995, 284633, 20964, 423796, 47209, 117448, 236657, -19499, 339413, -154676, 307382, 401034, 244339, 235755, 322231, 497909, 379938, 381750, 178257, -197541, 138809, -101185, -125914, 246172, -157085, 313591, -67792, 51324, 426701, 277677, 133482, 199881, 148636]
13265A48636r768c9381B67052l9484c805j15137B09023K776j03870J3998E6796
13253D02975C0348K74515Q3551d8893j16596B778K40791c02114C23026j10413
13243B12613B0503R2143Q565C5295j2672N6203b45019a06797A23618N0107d4560
13231A73663K53717B01733Q8170H2853K5884K24809A4585L4669L47023a23633
13220D0211N6441l8465A7579K9382a2090H5437J5776M6405F3314A5398K2910P059
13208D5367R6554E5228K14734a09111A79199K77057k10581D7854K21586d7943
13197B96554g0990A12036J36841a34894d0354A23540e2912K6285A69204K7583
13187A96787K05326j82004m1890j6446J65228E5793J61522P8919i6828M5214A38112
$$ y = [148636, 138868, -39381, 267052, 227568, -3805, -118942, 209023, 211799, 107929, 121927, 56796, 402975, 30348, 304863, 388414, -48893, -165489, 2778, 243569, -302114, 323026, 212613, 20503, 112646, 121211, 35295, 22623, 78826, -245019, -106797, 123618, 173725, -44560, 173663, 427380, 201733, 289903, 82853, 108737, 333546, 14585, 49254, 396277, -123633, 40211, 96652, 58187, 17579, 46961, -12090, 85437, 101213, 147618, 63314, 15398, 38308, 45367, 141921, 55228, 269962, -109111, 179199, 456256, 245675, 47854, 269440, -47943, 296554, -70990, 112036, 248877, -134894, -40354, 123540, -52912, -26627, 169204, 196787, 402113, 220109, 178219, 161773, 327001, 55793, 217315, 296234, -96828, -51614, 138112]
13175A10929R2292a47679B43343h0656C65529r067C64O1567a79555F6655K5289
13164I1944i0829K8425E0838b0075A09823a71525F3269J04889a03153C8265L16875
13153C55140F9044L2665c61A9679d8992m3786A74540D6168O2691R0476k5501l9887
13141A33947J9884a75142d0506H1523J9300b53132A00289J13729l8182d787k36860
13130b41647B0440L0706A7461K09859o2997B7201b08644f0905M621B16839a45952
13118B41458j0773I6120N4517L40951e4293k2246C48328o1643A37802e6645A74270
13106B79844a26887d5499B53006a06830D0013a55915M5560d7089D4980j0048d0781
13094C39045a04317J0579A38478J63453K06507E5964J81229f7342p9013A38727
$$ y = [110929, 203221, -147679, 243343, -80656, 365529, 356462, 364, 61931, -179555, 66655, 91944, -90829, -62404, 50838, -20075, 109823, -171525, 63269, 168158, -103153, 38265, 355140, 69044, 101709, -361, 19679, -48992, -92778, 174540, 46168, 108859, 199335, 173834, 133947, 153831, -175142, -40506, 81523, 100823, -253132, 100289, 214018, 175836, -4787, -241647, 20440, 51146, 17461, 227320, 164323, 27201, -208644, -60905, -56284, 216839, -145952, 241458, 230685, 96120, 150637, 491588, -54293, -76539, 348328, 286685, 137802, -56645, 174270, 279844, -126887, -45499, 253006, -106830, 40013, -155915, -110355, -47089, 44980, 34932, -40781, 339045, -104317, -93738, 138478, 301931, 508438, 55964, 237193, -67342, -146355, 138727]
13083f749E3246a86508j36243H5933J58728M6448E7017c03055A39709a7136H9627
13071B51522I934c22A18341o401P0204L8593f7181C15213j44136J5978a37659
13059e7827D12865G7553O7154N6063K4861O6862L7700p1686m3208j6609b0966
13047B2386M4323J22302D6235J74778l0452N4300j3204j0432M1528a67309H9354
13035A00073D715K86555b03648l7033E6350J80003H2245k7137J21442d2189B9557
13023a60472B31407a319A18212g5222A99770k8726a07661B40781q1375c29886
13012B11514D7888P3169J39964A10190M5690k9701C1531M69437b04617C47527
13001A68435J24855a40380l65096I3005k306o865J42324d16725A37998a14600
$$ y = [-6749, 53246, -186508, -322751, 85933, 244661, 291109, 57017, -303055, 139709, -17136, 89627, 251522, 9934, -322, 118341, 111940, 182144, 220737, -67181, 315213, 171077, 187055, -137659, -57827, 412865, 77553, 144707, 200770, 225631, 292493, 330193, 258507, 215299, 198690, -20966, 22386, 66709, 189011, 46235, 221013, 190561, 244861, 231657, 221225, 262753, -167309, 89354, 100073, 4715, 291270, -203648, -240681, 56350, 236353, 82245, 55108, 176550, -42189, 29557, -160472, 231407, -1319, 118212, -75222, 199770, 171044, -107661, 240781, 159406, -329886, 211514, 47888, 121057, 261021, 110190, 155880, 126179, 31531, 500968, -204617, 347527, 168435, 293290, -140380, -505476, 93005, 90699, 83834, 226158, -416725, 137998, -114600]
12990g9762A36991i5086J2335H3273f3994C43272a11731q5019h318B27806G4750
12978G0003K96515g327B51956K180r8121C6647M9382J30224O492r7590J61803
12967B86958A6277K49515E2757g5418B5181j0064c40961h0082a142j49105a8196
12955b22642B90625e7245A06704C1252R7376C2952j1999L35502D8806L15629a99633
12943A98307A1922K7077B953g9266H1981c68374C636h4736B77515b84602i8072
12931a9415A74586e0614m520E33863c24079a58121B13402D5269a07069I1728b41553
12919b77391d7950j930A09400C9181J14211d6473A12431L2239J02594f2729A28645
12907A88995b63843H4956C809K19648D9553k990D168c8724j9752l8680B97029
$$ y = [-79762, 136991, -95086, -82751, 83273, -63994, 343272, -111731, -196750, -8318, 227806, 74750, 70003, 366518, -7327, 251956, 254136, 156015, 36647, 86029, 216253, 222745, 125155, 286958, 16277, 265792, 52757, -75418, 25181, 15117, -340961, -80082, -1142, -150247, -18196, -222642, 290625, -57245, 106704, 31252, 128628, 32952, 20953, 356455, 48806, 364435, -199633, 198307, 11922, 38999, 2953, -79266, 81981, -368374, 3636, -84736, 277515, -284602, -98072, -19415, 174586, -50614, -55134, 533863, -324079, -158121, 213402, 45269, -107069, 91728, -241553, -277391, -47950, -49880, 109400, 39181, 153392, -46473, 112431, 144670, 247264, -62729, 128645, 188995, -263843, 84956, 3809, 223457, 49553, 46563, 4168, -38724, -58476, -97156, 297029]
12895A81928a65557a6464B08006a60543b9819d038j2202l17069A22503b23334
12884G9293l7082k0889f5811b9759j2605K0004k27850A72660k7871O8810n2665
12873A60934b56037a15690B8205K23221A24045L5968J19129J23548D4609J02615
12863A47224b78988G1333j8781J34037g0474H7590J94727F3907J19462c1548B01671
12851a07582M6511C22269F432o56h5950B9465K7630J34753i5512b0009k8467C7649
12838f9143D3731J49923r6293b1038D6646J00134b7174B4548a70361L6998C9743
12826h1507H0335I164L65602e5710k42206i6217J0102G6602L7817M4939h4168
12814B69265l823Q2854I2374b20505A33090a66968D3014A5238c5788l3385j67043
$$ y = [181928, -165557, -16464, 208006, -160543, -29819, -4038, -16240, -333309, 122503, -223334, 79293, 42211, 21322, -65811, -29759, -42364, -22360, -250210, 172660, 144789, 213599, 160934, -256037, -115690, 28205, 251426, 124045, 160013, 279142, 402690, 44609, 147224, -278988, 71333, 52552, 186589, -70474, 87590, 282317, 63907, 183369, -31548, 201671, -107582, -61071, 322269, 6432, 5776, -85950, 29465, 57095, 191848, -95512, -20009, -48476, 37649, -69143, 43731, 193654, 97361, -21038, 46646, 146780, -27174, 24548, -170361, -133363, 39743, -81507, 80335, 9164, 374766, -55710, -297916, -96217, -86115, 76602, 114419, 159358, -84168, 269265, 265442, 348296, 92374, -220505, 133090, -166968, 43014, 15238, -35788, -69173, -236216]
12803b36216A33917b57491E9794N0520a58907b4998R716q6045r7815B44960d27134
12791F9455Q9026A3005d2774I6927K13624d93266J89145A09195E3130A6735b21819
12779F7603K14129a45748A1199h1861L1225C90108a6605j13808j17936p4488L9470
12768b83367g4679j2266k49425J67207r8253B2910J21897i6185m09691H6151M8048
12757A34199m7309l2634e7260C53115d8335e018j60556B1423f093j16458F5674
12745e8390j6440q7610c1239A96198I071J37503k2495E6691O746a28756G7745
12733a33670K4792b3533A19465a97812F1657J85678A16661m3888J19637a10538
12722a82635C34751e84733a15546A50332J805b47487J21357C58664d6934A00767
$$ y = [-236216, 133917, -257491, 59794, 110314, -158907, -24998, -15282, -101327, -199142, 244960, -427134, 69455, 158481, 13005, -42774, 96927, 310551, -493266, -304121, 109195, 53130, 16735, -221819, 67603, 281732, -145748, 11199, -81861, -50636, 390108, -16605, -130413, -248349, -322837, -283367, -74679, -86945, -336370, -169163, -267416, 22910, 144807, -96185, -505876, 86151, 134199, 86890, 54256, -57260, 353115, -48335, -5018, -165574, 21423, -6093, -122551, 65674, -58390, -74830, -162440, -31239, 196198, 9071, 146574, 124079, 56691, 63437, -128756, 77745, -133670, -108878, -23533, 119465, -197812, 61657, 247335, 116661, 72773, 192410, -110538, -182635, 334751, -584733, -115546, 150332, 152137, -247487, -126130, 358664, -46934, 100767]
12711A90381a2582k94681A14784P1714K0928B8887J72194I4260K7233b50802f1951
12699H7390a41302C74965a04986I3219a02572B52880b28117B06908l6874b32316
12688A64091a12817c4293I4762d75719c0968o0310k20978A94098p0473K6205B6933
12676B15849b2242A75391e4259j00951C46252e256A02208R0753q9745d6253E0529
12664E7719a17707C74925A21908P6268I6352d3269A00793J6714E5420L5169R1647
12653A82236P8671I7234c01579i0744A69417a20816L0880D96571k29694b4713
12642E446K12156m3398J11050l9699q5165L2342e9687A79618L213K80275b69101
12630A84e9301m4488C20619I1580A4703K02266K8227A03619O691g7856A73700
$$ y = [190381, -12582, -307263, 114784, 186498, 207426, 28887, 201081, 94260, 121493, -250802, -61951, 87390, -141302, 374965, -104986, 93219, -102572, 252880, -228117, 206908, 170034, -232316, 164091, -112817, -34293, 94762, -475719, -30968, -91278, -312256, 194098, 123625, 149830, 26933, 215849, -22242, 175391, -54259, -155210, 346252, -5256, 102208, 192961, 103216, -46253, 50529, 57719, -117707, 374925, 121908, 198176, 96352, -43269, 100793, 117507, 55420, 90589, 182236, 260907, 97234, -301579, -90744, 169417, -120816, -89936, 496571, 266877, -24713, 5446, 217602, 174204, 285254, 245555, 160390, 192732, -59687, 179618, 182831, 463106, -269101, 184, -59301, -103789, 320619, 91580, 14703, 216969, 245196, 103619, 110310, -77856, 173700]
12618B58462a57004g1863J7413J737d203A76590A1122J28387a7924A45305J56950
12607C02255E5799K27774I2691N6738E9530b2219A77918J7262a1573A97295O4109
12596B61404d1042C3649J99903C8723N4049a41860F624f0137B64054o3952F6245
12584C41059i9901B63273E9958G982K98505j42339N7831c35654a34064o9578q1037
12573b84679A01716L50636D2477h5755A630c5252j04480A58950h0945m890A12784
12561G9483e5290A08449E4033N6312L42111a90945d5664n578k89737A90795b31086
12549A23983a22621A83988p6548k2227R3240b24575j58674B00689e3932k75405
12539c29337P4677k5881i3209j40955N1160D0616e33160A13090b04824d7966F4099
$$ y = [258462, -157004, -71863, -54450, -52713, -4203, 176590, 11122, 139509, -17924, 145305, 302255, 55799, 283573, 92691, 149429, 59530, -22219, 177918, 195180, -11573, 197295, 261404, -41042, 33649, 233552, 38723, 92772, -141860, 6624, -60137, 264054, 200102, 66245, 341059, -99901, 263273, 59958, 7982, 306487, 164148, 221979, -335654, -134064, -203642, -284679, 101716, 452352, 42477, -85755, 1630, -35252, -139732, 158950, -80945, -85835, 112784, 79483, -55290, 108449, 54033, 110345, 452456, -190945, -45664, -51242, -340979, 190795, -231086, 123983, -122621, 183988, 107440, 85213, 178453, -224575, -383249, 200689, -53932, -329337, -254660, -280541, -93209, -234164, -183004, 40616, -533160, 113090, -204824, -47966, 64099]
12527d3826j92903B4823a74508A76669b99795L6083R1140D2758a08687A96353
12516A61714b451A96198b69353a18067G9694a50019n3736B38151E7698a91741
12505A82425q7737A6091f1182D3372J86509c47006H8481k0016b38346a05313o6216
12494a71529p493L5246d2750J0856D46594c56390A38801N548a39873K1208A9022
12482D3580N486g823H9382L1008J38811a48352H4952a55139B05151K00782a18595
12470b89991I4246A3985b0926A48562i3272F838J99210E1760a87462A22797a06359
12458a18412k51277G3248J8271a34048b1393j8922A72602c12961C1523L1029j1281
12447E1271K1342L07751I515L64J32975N5063b8286E5310J39952c1343D089b43619
$$ y = [-43826, -236729, 24823, -174508, 176669, -299795, -263712, -172572, 42758, -108687, 196353, 161714, -2451, 196198, -269353, -118067, 79694, -150019, -203755, 238151, 57698, -191741, 182425, 94688, 16091, -61182, 43372, 229881, -347006, 88481, 68465, -238346, -105313, -171529, -179022, -143776, -42750, -31894, 446594, -356390, 138801, 144349, -139873, -118665, 19022, 43580, 49066, -7823, 89382, 120390, 259201, -148352, 84952, -155139, 205151, 405933, -118595, -289991, 94246, 13985, -20926, 148562, -93272, 6838, 206048, 51760, -187462, 122797, -106359, -118412, -369689, 73248, 91519, -134048, -21393, -40315, 172602, -312961, 31523, 62552, 51271, 72613, 380364, 9515, 9879, 142854, 197917, -28286, 55310, 195262, -31343, 4089, -243619]
12434B627g5406M87j54997m1329a7223l9902A39992c020A32423a04005A01491
12422B09632j01065h4035k87653a44603K6883j48839C226i6860k19314N1318B4331
12410A26536a10291k61818A17031J85677a63238a1633k19576F1685j6930J01967
12400A46722a36600B17584b7873j89269E6740c3807D02840j26623a39406N5513
12390h3893E2672J10100i1086A30376C0061c04433A64796F8439a71961l7687a7401
12378b1289k32220A12849b01554B39363r1437l6360J8800a20439j2695G0211J61544
12367B31755a51896A90607J828b69713a11659C81838j71769R1768o2005c38790
12356a11554B51889R3746G3874b30554C39176p2697G0404b73552E472R9116J36081
$$ y = [2627, -75406, -74919, -229916, -271245, -17223, -57125, 139992, -3020, 132423, -104005, 101491, 209632, 108567, -84035, -371688, -144603, -117720, -266559, 3226, -96860, -316174, -264856, 24331, 126536, -110291, -372109, 117031, 302708, -163238, -11633, -231209, 61685, 44755, 146722, -136600, 217584, -27873, -217142, 56740, -33807, 402840, 276217, -139406, -83893, 52672, 162772, -91086, 130376, 30061, -304433, 164796, 68439, -171961, -209648, -17401, -21289, -253509, 112849, -201554, 239363, 147926, 111566, 130366, -120439, -133134, 70211, 231755, -151896, 190607, 192435, -269713, -111659, 381838, 210069, 301837, 239832, -338790, -111554, 251889, 345635, 73874, -230554, 339176, 266479, 70404, -273552, 5472, 104588, 240669]
12345B40669a90661B26335j06237c2906b166q2295C9174P8651P9197C0602J62591
12334A93193a89916h9124B7926j3172J54093a37328f5456j37108j7547G0305J26836
12323A97141Q7683I259p14J95637D7599b78031A90051j2121c9261E8690J53567
12312B12257L66066B1892J23463J72799a53680a3859C19507G4683J84761H5423
12301D6616J12115c8141a6229q4720B26840l9995B8629J73084I2872J47447H6766
12289B3738d3250A96874r1443l3496i9935A285P0842d2220B29113H9644b6076
12277b7002n1891B21393E0186M4681b14345C12389i550m1626C53222J07637f0969
12265C70343g5992A33006l1316i9453L544D7221a57789A97670L157M0c03562B2402
$$ y = [240669, -190661, 226335, 120098, -32906, -2166, -84461, 39174, 117825, 197022, 30602, 193193, -189916, -89124, 27926, 14754, 168847, -137328, -65456, -202564, -220111, 70305, 197141, 284824, 9259, 8545, 204182, 47599, -278031, 190051, 177930, -39261, 58690, 212257, 578323, 21892, 145355, 318154, -153680, -13859, 319507, 74683, 259444, 85423, 46616, 158731, -38141, -16229, -100949, 226840, 186845, 28629, 201713, 92872, 240319, 86766, 23738, -43250, 196874, 105431, 71935, -99935, 1285, 72127, -42220, 229113, 89644, -26076, -27002, -78893, 221393, 50186, 94867, -214345, 312389, -9550, -51176, 353222, 460859, -60969, 370343, -75992, 133006, 101690, -99453, -95909, 47221, -157789, 197670, 200827, 200867, -303562, 22402]
12252D06371A20894m6219P9449a14709C82291a12670A90588d7803B95534a42593
12241b0772A52650n1583L94701j81079D1617N02972k70674b53067B55092d2678
12230E4208J84481l6015J21634A04024D527a7188A17798j9904g5253A21718J76057
12219B97775J97179D2932J03710J73095J85409A70424N5186j05136K06397O2376
12209C89247j26765I3228K23319j45540N3863J02596k6429c7270A53442J55734
12199C09176j07294m3123d7991D3288P1090a66424A80630b87531E2131F827a38216
12187h585j79864C93915A05954e0244D9200r002J17976l6817L52544E7092k8294
12176B8798J72099J04898A00142e4771q9567B27117J98696j97056c8236N693F1206
$$ y = [406371, 120894, 74675, 154124, -114709, 382291, -112670, 190588, -47803, 295534, -142593, -20772, 152650, 101067, 495768, 314689, 41617, 544589, 273915, -253067, 255092, -42678, 54208, 238689, 202674, 324308, 104024, 4527, -17188, 117798, 97894, -75253, 121718, 297775, 494954, 42932, 146642, 319737, 505146, 170424, 225610, 120474, 326871, 389247, 262482, 93228, 316547, 171007, 224870, 327466, 301037, -37270, 153442, 309176, 201882, 158759, -47991, 43288, 114378, -166424, 180630, -287531, 52131, 6827, -138216, -8585, -188449, 393915, 105954, -50244, 49200, 40198, 158174, 121357, 473901, 57092, 28798, 200897, 305795, 100142, -54771, -144338, 227117, 425813, 228757, -38236, -32543, 61206]
12164e270A16447P4896c31175D60184A47487J54329m4897j06793C1285c7695B0487
12152B06755J04531J00873C1346K45368b8010B20801L68837B90838e3085A95856
12141b43321A49277L7429i0197F9093a13294n1916G5506h3892A09764J54507a88777
12129a35530B34270h8344A94931a77543A54140d3909C0279K2754a89003Q8082
12119a00921B82055f3753l06295B64190a527A29578A8242M30447B4134J95872
12109B20006R1103j08648k5622A8987R7642P1638m9159J16296j27368a51354B00795
12097b73996J08865K1238B08645I6311f3907l65357A77536a87736A00844L65540
12087D66384K55040B42490A08884b49765a8438C14104a75379a6268F2574O3052
$$ y = [-5270, 116447, 191343, -331175, 460184, 147487, 301816, 256919, 150126, 31285, -37695, 20487, 206755, 311286, 412159, 31346, 276714, -28010, 220801, 589638, 290838, -53085, 195856, -243321, 149277, 186706, -90197, 69093, -113294, -165210, 75506, -83892, 109764, 264271, -188777, -135530, 234270, -88344, 194931, -177543, 154140, -43909, 30279, 53033, -189003, -100921, 282055, -63753, -370048, 264190, -1527, 129578, 18242, 448689, 24134, 220006, 311109, 202461, 176839, 18987, 116629, 188267, 139108, 255404, 128036, -151354, 200795, -273996, -165131, -143893, 208645, 96311, -63907, -429264, 177536, -187736, 100844, 466384, 721424, 242490, 108884, -249765, -18438, 314104, -175379, -16268, 62574, 125626]
12077A25626O4244d5739A41813K11915A14168N8975f0692J6531G401K4033J19032
12066A50466B5568c06625d5319C87793K2674j56557m8439G6030A3397a07284A98954
12054B31090j09857d1090B42778E521L8071h6913A90131J8213k4909h9661c6278
12042a25424F0322g4394A11733b96733J46061B0881P9899f937r5794B46471B3919
12030A99041b35504A94981b83465A11716a63866C18041H1574J69000g1401g469
12019A10307Q2572E476J5552d0572o2163c1511b400j13536l4411A4603J1759a78146
12006i2429p1490O2594d966A4265K63894A06293N1596m500l6258b8534I8880a62655
11993D48176j11411a92733H5378C5784b99499e8945A994K1565O9291i9444l5730
$$ y = [125626, 189870, -45739, 141813, 353728, 114168, 173143, -60692, -44161, 7401, 31434, 150466, 25568, -306625, -45319, 387793, 410467, 253910, 205471, 76030, 13397, -107284, 198954, 231090, 121233, -41090, 242778, 5521, 43592, -86913, 190131, 208344, 183435, -89661, -36278, -125424, 60322, -74394, 111733, -296733, -150672, 20881, 100780, -6937, -102731, 246471, 23919, 199041, -235504, 194981, -283465, 111716, -163866, 318041, 81574, 250574, -71401, -7469, 110307, 192879, 5476, 21028, -40572, -102735, -31511, -2400, -115936, -150347, 14603, 26362, -178146, -92429, -163919, -101325, -4966, 14265, 278159, 106293, 157889, 153389, 117131, -28534, 98880, -162655, 448176, 336765, -192733, 85378, 35784, -299499, -58945, 1994, 23559, 92850, -99444, -135174]
11982a35174C20000K19126a21135B72674a1119C530a94319h4612A13807M8267
11972A62074F208d5710C20191A25513a61931D0480L5772N1663J60563A3940O7922
11961H1862o151b4338C42695h1798A06488m4307a09678B85868A33507f5448B02483
11949a31714j17380R0825I2991K64050a30288j34501A48225F6675L8554L6457
11939A41686O3732c8199B52417c05755B19622b69944D4564A0157h9580C4379i0326
11927a84178N2947r0422n2004A13914J21669h2621K6934J0890l9362j63667J19858
11916a27968C02839b13127L5353B00820E7679f3221k81323e1733A61103a17783
11905A83028F4628h4345d1650m77830F0751b0629A35697a94236L4065g6629A5028
$$ y = [-135174, 320000, 539126, -121135, 272674, -11119, 3530, -194319, -84612, 113807, 162074, 6208, -45710, 320191, 125513, -161931, 40480, 76252, 127915, 288478, 13940, 81862, 75711, -24338, 342695, -81798, 106488, 62181, -109678, 285868, 133507, -65448, 202483, -131714, -249094, -158269, 92991, 357041, -130288, -264789, 148225, 66675, 105229, 141686, 205418, -38199, 252417, -305755, 219622, -269944, 44564, 10157, -89580, 34379, -90326, -184178, -131231, -221653, -273657, 113914, 235583, -82621, -55687, -44797, -84159, -247826, -127968, 302839, -213127, -177774, 200820, 57679, -63221, -344544, -51733, 161103, -117783, 183028, 64628, -84345, -41650, -519480, 60751, -20629, 135697, -194236, -160171, -76629, 15028]
11893b59835f2318C5728a11301j37406C36439F2342d5512q3356A93803a17266
11882B25274n6182e4425A80109I826J4254d2983p246C17256f7145C9033Pb43004
11869b28414A01888I74b8281A40838a32461b8213j61860g0277k0020C75777a42067
11857B5548b45513A38409a29665l87887A33883R9768p1054a98194c3511q1097
11847a14608k0560o7467o5804R0288j5382G2879a08538f00l5151D9563a01927
11835G175J04674i2041E7494a53633B27918C9169P3715D3824g6489c5978J5602
11824b0376l15020o4053J37318A02133J64053I7800d1410a7250B73510a85620
11813D3198b50563R5819O7248A58387h9068o940A18581J8917J27825J58278c4047
$$ y = [-259835, -62318, 35728, -111301, -248707, 336439, 62342, -45512, -128868, 193803, -117266, 225274, 169092, -54425, 180109, 9826, 24080, -42983, -50229, 317256, -67145, 39033, 39040, -243004, -228414, 101888, 974, -28281, 140838, -132461, -28213, -190073, -70277, -90297, 375777, -142067, 25548, -245513, 138409, -129665, -517552, 133883, 233651, 162597, -198194, -33511, -114608, -135168, -202635, -268439, -178151, -193533, 72879, -108538, -600, -35751, 49563, -101927, 7175, 111849, -92041, 57494, -153633, 227918, 39169, 112884, 43824, -76489, -35978, -20376, -335396, -399449, -262131, 102133, 266186, 97800, -41410, -17250, 273510, -185620, 43198, -250563, -154744, -87496, 158387, -89068, -96008, 118581, 137498, 265323, 423601, -34047]
11801b06171A40337h1091a5216A54195d8758j43948C21619b20000o1009C9771
11790g0049B9763a20454q1784e5525H6282e1886g020C21560e103G7489a15233
11778A09609L6186g1859j77125L151c9658o1621B06897E0476J28643a35376B0293
11766F9860P1746d1793j71035d5136C65768D6436r063J09815c31826J8192a13190
11754i3925K7056B5500c89500F450a42586J9358c5100j53718h5234mn5659B2378
11741I3540N7852b1732j43062L7523o590C7912a5705B1310c45805A91585e9535
11729H3270k3481a68778f8188o3125E8243N8852f4228H9393J00319n4836c46112
11717A42445N8902a86901b3997B63117q9097G8173R4366a3907A97716d8086A23049
$$ y = [-206171, 140337, -81091, -15216, 154195, -48758, -192706, 321619, -220000, -281009, 39771, -70049, 29763, -120454, -202238, -55525, 86282, -51886, -7020, 321560, -5103, 77489, -115233, 109609, 145795, -71859, -248984, -245833, -39658, -101279, 206897, 50476, 179119, -135376, 20293, 69860, 141606, -41793, -212828, -45136, 365768, 46436, 37373, 147188, -331826, -313634, -113190, -93925, -66869, 25500, -389500, 6450, -142586, -123228, -35100, -188818, -85234, -85238, -140897, 22378, 93540, 151392, -21732, -164794, -127271, -133861, 37912, -15705, 21310, -345805, 191585, -59535, 83270, 59789, -168778, -68188, -131313, 58243, 117095, -64228, 89393, 189712, 134876, -346112, 142445, 201347, -186901, -23997, 263117, 174020, 78173, 172539, -13907, 197716, -48086, 123049]
11705A30797a7939D41850d6764A61838b12564l23036g5789B61259h8811o9880
11695a58691F682L62738A25897a33074I076c8803j41069q496A04319a78663m3491
11684b22154B09945Q2959q729G4030b27331e4943p1394D40612e6366A00710o291
11673I4419I696J20276a8070A58994a9429C18596a29210A39548b65117e1167C5251
11661H4516J12875B0381E244K29298O0132a02296H4280c13851A83655a78446j91841
11650c70287g3839a2454j3097k42844A03743a31332a0535j11127N2319F0183a19080
11638A48514R6877M1154i8897j90296d3404B03908i8254q673A9734e3104r3457
11627a46561D6353b57647J24998k641F3075K4567l4088a32692e4594G0947d3783
$$ y = [130797, -17939, 441850, -46764, 161838, -212564, -535600, -75789, 261259, -88811, -158691, 6682, 369420, 125897, -133074, 9076, -38803, -179872, -188368, 104319, -178663, -222154, 209945, 292904, 284175, 74030, -227331, -54943, -126337, 440612, -56366, 100710, 94419, 9696, 129972, -18070, 158994, -19429, 318596, -129210, 139548, -265117, -51167, 35251, 84516, 197391, 20381, 5244, 234542, 294674, -102296, 84280, -313851, 183655, -178446, -370287, -73839, -12454, -25551, -268395, 103743, -131332, -10535, -121662, -69343, 60183, -119080, 148514, 245391, 286545, -98897, -289193, -43404, 203908, -98254, -106927, 19734, -53104, -146561, 46353, -257647, -132649, -135290, 63075, 87642, 53554, -132692, -54594, 70947, -43783]
11615a61393J8719L1346H7346f3791d280F402J83852a93330A73189g4311l7855
11604a12166b3197k30926a07779b4388G7127a05o9767A84296R002L4168e8340
11592d0194j16318D3228b18091O2849j08534D2985C274R8325j0446a56493A13686
11580B03726d0083C82129A36668D0130b15547c35o876A28620L9063m5355a15116
11568B80849l3451c48200a03419b8131C92521A21770C863i0453J5506A51108e3396
11556b30104D0659O6405h0003A62438L2588M9676j4441G960J22453a35294E7867
11544i8336C02535m9162j08186A5679d8883B22170a27441K9818B13700a7552H1615
11532A76226c38230C35957j46528B4114b57023A06298J74001h2602C11920D3088
$$ y = [-161393, -142674, -111328, 87346, -63791, -4280, 6402, 190254, -193330, 173189, -74311, -112166, -23197, -254123, -107779, -24388, 77127, -105, -69872, 184296, 193298, 227466, -58340, -40194, -156512, 43228, -218091, -155242, -263776, 42985, 3274, 101599, 91153, -156493, 113686, 203726, -40083, 382129, 136668, 40130, -215547, -335, -7211, 128620, 167683, 122328, -115116, 280849, 247398, -348200, -103419, -28131, 392521, 121770, 3863, -90453, -74947, 151108, -53396, -230104, 40659, 107064, -80003, 162438, 195026, 244702, 230261, 7960, 130413, -135294, 57867, -98336, 302535, 253373, 145187, 15679, -48883, 222170, -127441, -97623, 213700, -17552, 81615, 176226, -338230, 335957, 189429, 24114, -257023, 106298, 280299, -82602, 311920, 43088]
11521a24151p9900N7029l0468A89319p7917B38M2129i3413B77735A4931c34708
11509h4884k62238A36153n8242g5543H1647b18871a00500B48514A01111a9942
11498a06580H1928l1384i6519j40607H2448J70020e9018b7871k194j31374m6216
11487b07655B03903Q7780a73231a3821D39679j72582a94814Q3858E7084B2897
11476B06059J05012h0920b5916B18629N0511I9821B0538f5639L327G3149K42279
11465C15428A26515g2523A59999a24542C77200b73158C01840A35274b0693A21416
11454B91264m5563h3414A89275J4557o0267F3931a74389c1223A94078a53501p6543
11443b30044A78729G4047O5438k5731E2766c8594H7730P1261o022n7658K7688
$$ y = [-124151, -204051, -147022, -177490, 189319, 111402, 238, 42367, -93413, 277735, 14931, -334708, -84884, -347122, 136153, 77911, -75543, 81647, -218871, -100500, 248514, 101111, -19942, -106580, 81928, 50544, -96519, -237126, 82448, 252468, -59018, -27871, -30065, -161439, -207655, 203903, 291683, -173231, -13821, 439679, 267097, -194814, -110956, 57084, 22897, 206059, 311071, -80920, -25916, 218629, 269140, 99821, 20538, -65639, -62312, 73149, 315428, 126515, -72523, 159999, -124542, 377200, -273158, 301840, 135274, -20693, 121416, 291264, 245701, -83414, 189275, 203832, 143565, 63931, -174389, -31223, 194078, -153501, -230044, 178729, 74047, 139485, 113754, 52766, -38594, 87730, 158991, 152969, 95311, 122999]
11432A22999J474a39240N0169A38222b6075D2964J76806D9814h386D7512J18599
11421A66111a95020A7623L2762c65599B62958e092B38147c14868O1226i5409j14205
11410b09614B49671E7533f4294k44544C2778Q033i4327D27849A13810C965f6002
11398b36808A19914k1063K49193i837I6773i8443B61190a12550A82336f9862A88700
11386a60240q2400j35576B59881H7251N6919c5282l8031k17117J30581b3581q7592
11375a11173k05766a7762l88071e3439m4899C5122A6343b81153H3390l5260K37846
11364B85976a37661B10397b46597D8833A7804a1442j20682C07820b03427Q1046
11354a22381N6802B15752a71725O3129E2065d8588A6681b46226i8106B3509d1566
$$ y = [122999, 124473, -139240, -89071, 138222, -26075, 42964, 219770, 49814, -8386, 47512, 166111, -195020, 17623, 50385, -365599, 262958, -5092, 238147, -314868, -253642, -95409, -209614, 249671, 57533, -64294, -308838, 32778, 40811, -94327, 427849, 113810, 3965, -66002, -236808, 119914, 98851, 348044, -9837, 96773, -98443, 261190, -112550, 182336, -69862, 188700, -160240, -242640, -378216, 259881, 87251, 144170, -35282, -73313, -290430, -159849, -23581, -111173, -316939, -17762, -405833, -53439, -98338, 35122, 16343, -281153, 83390, 48130, 285976, -137661, 210397, -246597, 48833, 17804, -11442, -132124, 307820, -203427, -122381, -65579, 215752, -171725, -108596, 52065, -48588, 16681, -246226, -98106, 23509, -41566]
11342h761B05106i9572M0928j08582C36449A14666R6247b71294b2416m3035G8717
11330A62761c21001N5497B59023g8446r6469E0154C856h2254A56325N3316L34221
11319E43862d7019A01649a07727A45936f2069n1769A63108b59653A23780k9285
11309I4495b98201A32750N0499E4014M3651b73196d6614A96586b28606i0918k61769
11298c52687j0643F954e5791H092J15048m483a72281A31850b5517k9216q802q4390
11286a47925E2847J02197E0823a47846n5999D9935g6168o185e924A31556c97501
11274A86298a53355L6133j12682o1462A21248i4186F9100J06708k9764n6173A3156
11262B05035m7836a89474A3753g1834p0729M7435j17272O4865f8161j71513A10984
$$ y = [-8761, 205106, -99572, -58644, -167226, 336449, 114666, 210913, -271294, -22416, -65451, 78717, 162761, -321001, -265504, 259023, -78446, -174915, 50154, 3856, -82254, 156325, 209641, 543862, -47019, 101649, -107727, 145936, -62069, -113838, 163108, -259653, 123780, 94495, -298201, 132750, 183249, 54014, 97665, -273196, -46614, 196586, -228606, -90918, -352687, -363330, 6954, -55791, 8092, 123140, 118657, -172281, 131850, -25517, -54733, -63535, -147925, 52847, 155044, 50823, -147846, -203845, 49935, -76168, -82353, -5924, 131556, -397501, 186298, -153355, -117222, -229904, -291366, 121248, -94186, 69100, 175808, 146044, 89871, 13156, 205035, 157199, -189474, 13753, -71834, -142563, -95128, -212400, -147535, -68161, -239674, 110984]
11250g6946C75301A09100b6402D1542J1314J79832G9538K04066c82368g0961l36106
11239d07067a08443p0297I0765b47403c5870j81810H7065J69141b02255l0322
11229b32577J0762l02832a59338j18677f2990J2564p3149E12212c6777j88649
11219b25426A04390c46362A52571b42823a02636A83986J7670a7076g793A06889
11208a81386p8785A71262H0930a15013A05623n0768j8766b38399C9728b0195k98057
11197c18252A57967K4497o3780K4336i7644H8878f4956C5214k584b5936k14812
11186b40748A16103a15122C3401b96227i1753A17638a7253F7692g6638B4772f7962
11174b23516a03914e0804j21744o7947K8642B2597c30505J9898N1184c5394n8851
$$ y = [-76946, 375301, 109100, -26402, 41542, 52856, 232688, 79538, 283604, -382368, -70961, -407067, -108443, -178740, 90765, -247403, -35870, -217680, 87065, 256206, -202255, -232577, -221815, -524647, -159338, -278015, -62990, -50426, -123575, 512212, -36777, -225426, 104390, -346362, 152571, -242823, -102636, 183986, 201656, -17076, -7793, 106889, -181386, -260171, 171262, 80930, -115013, 105623, 54855, 36089, -238399, 39728, -20195, -318252, 157967, 182464, 118684, 143020, -97644, 88878, -64956, 35214, 32630, -25936, -240748, 116103, -115122, 33401, -296227, -91753, 117638, -17253, 67692, -76638, 24772, -67962, -223516, -103914, -50804, -172548, -240495, -211853, 22597, -330505, -310607, -259423, -35394, -94245]
11163i4245k43186B61274a8033k14723c8030A73146a15162C39442d69361F5269
11152a14871i265k67988q9858R2565A66432b87300J22883P5147C1489j3111b75312
11140a05020n9551D32994a92335E4178K79682c4211j90846L9837B1348b20922
11129c059F4823a42399j47522h7278A13012R6827b19414a8882l64192f7953C20934
11117a92115B36897A16318P4786G7163i3443n9392g5913B70773I341a57403K0168
11106a37235e2464m1791D765e7680a5567j97105J8497d6928A61642D6734h1017
11094b71307e3816C0379i9711F08378C3822K9769J7355J06898J15854E85R3326
11083I3911a36683M7922I2930e7898F4286j1695M1974h0057A22940K36745f9636
$$ y = [-94245, -337431, 261274, -18033, -232756, -38030, 173146, -115162, 339442, -469361, 65269, -114871, -9265, -277253, -367111, -274546, 166432, -287300, -164417, -89270, 31489, 18378, -275312, -105020, -164571, 432994, -192335, 54178, 333860, -34211, -225057, -185220, 21348, -220922, -3059, 64823, -142399, -289921, -87278, 113012, 209839, -219414, -18882, -383074, -67953, 320934, -192115, 236897, 116318, 191104, 77163, -93443, -152835, -75913, 270773, 9341, -157403, -137235, -52464, -94255, 4765, -57680, -15567, -212672, -194175, -46928, 161642, 46734, -81017, -271307, -53816, 30379, -99711, 608378, 33822, 63591, 80946, 187844, 303698, 585, 93911, -136683, -88761, 92930, -57898, 64286, 52591, 94565, -80057, 122940, 359685, -69636]
11071A95588M5077E7397P8515J6302f5336E5866M6048P9238L5261a09667A13588
11059C6856R7959J07820j14370h6173A04578R8397o7078L28715B16672l4274J70709
11048C53107j4313j03326J53626b2225H6752L2080N1336O3372r9297M57969k29091
11037C63121K5900J84803B65189L44915j68288N7236L1920m4184K12313M224k06359
11026D96966j13274K96369k37861O8128L45777j79737k22566k03876k7018J64055
11016C86963K29952l00821M04985K16101l44711q8136k16930K39631p6977K58764
11006G08821k69864j54371A32367K98763n0368k9010J07779K09571j75826J10000
10996F03276L6158j76704J49157k96806K47886R3556B16556K89612O4693k13321
$$ y = [195588, 240665, 57397, 135912, 152214, -65336, 55866, 101914, 181152, 216413, -109667, 113588, 36856, 134815, 242635, 128265, -86173, 104578, 202975, 135897, 464612, 216672, 182398, 353107, 338794, 235468, 389094, -22225, 86752, 118832, 170168, 233540, 134243, 592212, 363121, 389021, 573824, 265189, 610104, 441816, 499052, 530972, 486788, 699101, 703325, 496966, 383692, 680061, 442200, 510328, 856105, 676368, 453802, 249926, 222908, 386963, 616915, 316094, 721079, 937180, 592469, 504333, 287403, 527034, 450057, 708821, 438957, 284586, 132367, 431130, 380762, 351752, 459531, 669102, 493276, 603276, 639434, 462730, 611887, 315081, 562967, 656523, 216556, 506168, 570861, 357540]
10986C57540k4990j08751L10793p3159L1827Q2758q2271j31081J82428q852j25509
10975D10733J04040j38593K44703j84472M34376J29179l92443j17837R4728n194
10965E79220J75241j91174R7549p3556O31615j09657K40589j13915K3430M7360
10955A306702M36705K84343p9244j67350M6144k6771K11451k91839j92150J00833
10945A628824l74516l23254M02122o6565j70762j26612J90357Q8091q1980q7338
10935A078367J86155j13342r9592j40188j35923j84100J19425o3995K5228B17770
10924F48603B25735J78482C0348L95980b37671D8139M6613m3749J55794o6442
10914A40355a27899j52145A42555f4420Q615k0050A00658L3363K489J42551g8534
$$ y = [357540, 332550, 223799, 534592, 461433, 493260, 576018, 493747, 362666, 545094, 536242, 410733, 514773, 376180, 620883, 436411, 870787, 999966, 607523, 489686, 584414, 579220, 754461, 563287, 660836, 587280, 1218895, 1109238, 1349827, 1235912, 1259342, 1306702, 1743407, 2027750, 1948506, 1781156, 1827300, 1800529, 2011980, 1720141, 1527991, 1628824, 1254308, 931054, 1333176, 1266611, 1095849, 969237, 1159594, 1247685, 1165705, 1078367, 1264522, 1151180, 1051588, 911400, 775477, 591377, 710802, 646807, 672035, 217770, 648603, 225735, 404217, 30348, 426328, -237671, 48139, 94752, 51003, 206797, 140355, -127899, -280044, 142555, -64420, -55805, -75855, 100658, 134021, 136510, 279061, -78534]
10902A26362n215e0992k49874B82049G5675Q5645J69798A49222b3082j18453A16071
10890B75453a03925f246j20268c256k33501F0143B4105a79200b00r778H448L99651
10878D08099G0195a29570A91598a30018N3141J1023o6865j51973B2586c49479
10867b30092m1688B02395a60430d1676A32357L8887d44590e0633K0689G879R1107
10856I8986B4595c34648d8240K1864m7730K5685j9000j22583L7321A7440F653
10844H3692c16794A41700n5004A2991d54916C2383a02680p6820P1563n7345F6534
10832c67702b6463B60552c02364A11735b49000P5583C6422L7130F871g7257j87601
10821b64858d1733o05B59592A4517i7707C22219c09403J34418a2744A89803R6280
$$ y = [126362, 121147, -50992, -300866, 282049, 75675, 161320, 331118, 149222, -23082, -141535, 116071, 275453, -103925, -6246, -126514, -3256, -236757, 60143, 24105, -179200, -200, -9978, 8448, 408099, 70195, -129570, 191598, -130018, -76877, -65854, -132719, -284692, 22586, -349479, -230092, -271780, 202395, -160430, -41676, 132357, 171244, -444590, -50633, -29944, 7879, 98986, 24595, -334648, -48240, -26376, -74106, -48421, -67421, -190004, -152683, 17440, 6653, 83692, -316794, 141700, 86696, 12991, -454916, 32383, -102680, -179500, -107937, -165282, 66534, -367702, -26463, 260552, -302364, 111735, -249000, -173417, 36422, 73552, 6871, -77257, -264858, -41733, -42338, 259592, 14517, -97707, 322219, -309403, -174985, -12744, 189803, 286083]
10810B86083d49111M0802A76728E954a90342I704a12839j14405j54219B69036
10799a1184F7273b29137f1466F2374B2954c4358o9579F8253a32571C14830A01923
10787c0292n0995j92502A25115M9901a08520D7419L2157g7746J7907q8563E0309
10775h2543a5775p4854k696q1711c8332j85448b478C404b25247h8688r5541B07548
10762A73227c59361a61828B77818q2247j4263c6027l9929A763h6558B33810g3007
10750b52224B45913k6997b90158O9332h042k35832A16559b03042h802o7618E005
10738C1551c04008g7047R331G7693C400J31180b9521A6320d3303k10578e4765
10726h5788J3432o1340N2445p2494f9527k73848i934A56320h4340A62065d03613
$$ y = [286083, -449111, -408309, 176728, 5954, -190342, 9704, -112839, -227244, -381463, 269036, -11184, 67273, -229137, -61466, 62374, 22954, -34358, -103937, 68253, -132571, 314830, 101923, -30292, -81287, -273789, 125115, 175016, -108520, 47419, 79576, -77746, -59839, -148402, 50309, -82543, -15775, -90629, -93325, -175036, -38332, -223780, -2478, 3404, -225247, -88688, -184229, 207548, 173227, -359361, -161828, 277818, 195571, 181308, -36027, -75956, 1763, -86558, 233810, -73007, -252224, 245913, 218916, -290158, -220826, -8042, -243874, 116559, -203042, -8802, -76420, 5005, 31551, -304008, -77047, -67716, 77693, 3400, 134580, -29521, 16320, -43303, -253881, -54765, -85788, -72356, -133696, -81251, -153745, -69527, -343375, -9934, 156320, -84340, 162065, -403613]
10714A06572J73045b48641g7376p021e672k8707j0371q3454k47958J36650a04681
10702B8758h32A8652h0375C7820a56650c7980j14447M8099J0864A51806b65806
10690d3799b651j61715a0500M308o9392B1607a75787D02231f1514F1506b07034
10678a58302Q119F2663J34159a88619b8964E3586B3577Q9342b11655A00349a13114
10666a04787j2325l0097E67486e6802B9919d42894B27113b56657P1207g0143Q599
10655f1544q0085e3734p9685L6150B55270h0536C51975c72007H2147B4678a2068
10643B09499a24619K5383C15401c1200k92440M3584f5410k14176A23256R3246
10633B16502b37774j34133J59860a00227k43105B50087c17733a14542o7023B20042
$$ y = [106572, 279617, -248641, -77376, -84397, -5672, -34379, -44750, -128204, -376162, -239512, -104681, 28758, -832, 18652, -80375, 37820, -156650, -37980, -152427, -104328, -93464, 151806, -265806, -43799, -2651, -164366, -10500, -6192, -75584, 21607, -175787, 402231, -61514, 61506, -207034, -158302, -150183, 62663, 196822, -188619, -28964, 53586, 23577, 112919, -211655, 100349, -113114, -104787, -117112, -147209, 567486, -56802, 29919, -442894, 227113, -256657, -185450, -70143, -61544, -141629, -53734, -133419, -97269, 255270, -80536, 351975, -372007, 82147, 24678, -12068, 209499, -124619, -99236, 315401, -31200, -323640, -280056, -65410, -279586, 123256, 216502, -237774, -371907, -212047, -100227, -343332, 250087, -317733, -114542, -181565, 220042]
10622F7766h566j83644e6978j73302A35317K42497c20811c8910J6402A4954a58245
10610A61469a19564F6430b11055C00343A3257b44282Q764G8440l7815Q5752a54226
10598b19149J05397K815A4942a52241d494k45622b4149I553h4780l7868A14347
10586A79506r237i1406L5086G8697c9713n1384m4569a1810p4691C50952a36824
10574b82335J37602j50924J28123A53020a05561L6643A98814b8258j01129j2787
10564a42174K5697B34825F626b8780a986A47748m3582b59246C8254b11857F714
10552a81173d5996j3556n8741c0485B71221c72282a50893A42211C3023Q038K2657
10541F3718K81345a50495I6329C994a72429A23878g8177A3471a03133A00946M4995
$$ y = [67766, -8566, -192210, -56978, -230280, 135317, 377814, -320811, -38910, -22508, 14954, -158245, 161469, -119564, 66430, -211055, 300343, 13257, -244282, -235518, 78440, 40625, 126377, -154226, -219149, -113752, -110937, 14942, -152241, -4494, -250116, -24149, 9553, -84780, -122648, 114347, 179506, 170269, -91406, -56320, 78697, -39713, -91097, -135666, -11810, -86501, 350952, -136824, -282335, -144733, -295657, -167534, 153020, -105561, -68918, 198814, -28258, -129387, -142174, -116477, 234825, 6626, -28780, -1986, 147748, 104166, -259246, 38254, -211857, 6714, -181173, -45996, -59552, -118293, -30485, 271221, -372282, -150893, 142211, 33023, 41061, 63718, 345063, -150495, 96329, 3994, -172429, 123878, -78177, 13471, -103133, 100946, 145941]
10530A45941a16182j76773e1933q2298M4567M2023A1693h8878A08387J16205b12745
10518a68400c9469a6623k90957B05489f6758B52477d1481j64331N0781c5666D3855
10506a54330m0892A13997a34476l8442b5135B09841a98493K3245j35401J37055
10496a73594A48331b59004B3880K6179a59029o3867f9981j19398K6870Q904d2259
10484D13591j45001D6729a15243j59332J06137r551A65834a14677d5532m4172
10474h9704q1036B6658K54357f39349b40366D10633f657k26223r2972a31912o3940
10463a95852A9278i9559E15829k39688p351r5316K18563O1166r6890E7791g0835
10451B35146p2685l0050J16016h1658B39042a02415M0533A2362a57829e6584j82807
$$ y = [145941, -116182, -292955, -51933, -134231, -89664, -47641, 11693, -88878, 108387, 224592, -212745, -168400, -39469, -16623, -307580, 205489, -66758, 252477, -41481, -205812, -155031, -35666, 43855, -154330, -195222, 113997, -134476, -172918, -25135, 209841, -198493, -175248, -310649, -173594, 148331, -259004, 23880, 50059, -159029, -222896, -69981, -189379, -162509, -153605, -42259, 413591, 268590, 46729, -115243, -274575, -168438, -177989, 165834, -114677, -45532, -89704, -170740, 26658, 281015, -639349, -240366, 410633, -6657, -232880, -325852, -131912, -195852, 19278, -99559, 515829, 276141, 268790, 173474, 392037, 453203, 356313, 57791, -70835, 235146, 162461, 132411, 248427, -81658, 239042, -102415, -61882, 12362, -157829, -56584, -239391]
10440b39391A05995b63559a8687F6702h6744j78524H9734J43569F460e0982l7636
10429h8618M1633j34784m413J9653E4630b69847M9497A70688a33187A60881h7463
10417c11546J05278j91744A39393d96585D803J79706J33785A54557a5301j98538
10407b13839P6731B50552h663l51170J67834C6207a64091A30486l1503D3209e6020
10395b98547A00202a43111j99569h1590J8875j89454c6523m3174A5939a64274
10384c25445a22337E7388k2579J999d68821A53033F3292a59056A58444b01524
10373C17071j4783A17309B9658a649l50597D75203A22109M6678J26607E8469k5361
10362C3108d7412C60078A09977K00687A12721C25J34353R5412a24068B02278R4678
$$ y = [-239391, 105995, -263559, -18687, 66702, -86744, -265268, 89734, 233303, 6460, -50982, -88618, -46985, -181769, -186182, -166529, 54630, -269847, -220350, 170688, -133187, 160881, -87463, -311546, -206268, -398012, 139393, -496585, 4803, 184509, 318294, 154557, -15301, -213839, -137108, 250552, -8663, -359833, -191999, 36207, -164091, 130486, 98983, 43209, -56020, -298547, 100202, -143111, -342680, -81590, -62715, -252169, -36523, -79697, 15939, -164274, -325445, -122337, 57388, 34809, 36808, -468821, 153033, 63292, -159056, 158444, -201524, 317071, 302288, 117309, 29658, -1649, -352246, 475203, 122109, 168787, 295394, 58469, 33108, -47412, 360078, 109977, 310664, 112721, 325, 134678, 230090, -124068, 202278, 296956]
10351B96956C4862a63458D46062A66296k8092O1261P6835K69439k31168k5702
10341B88869j02888i419A56037a02030C07232A53001C4336K20720Q3609j45106
10331A93559N766r8856j6250a4961j56052C36035j44787J14077J70994A25340
10320A28653J80079j46948K01645a70961M4106e1376C7604c7717C07452a4415
10309A28377C3199J11754D6495J93480N0378J71722r5122A6544J32325a85147
10298b16950D22044j82404j8454K66078j70722q6728a24327k90596B4208d7556
10287A70916a62310c1027H7970J29233f3764E5660c30209B18231i2862d3795l0225
10276g4020C3320A3422c8430k14445j5878a19288F2193J15810O1309j18119a56049
$$ y = [296956, 34862, -163458, 446062, 166296, 138204, 199465, 276300, 545739, 314571, 288869, 185981, -9419, 156037, -102030, 307232, 153001, 34336, 255056, 338665, 193559, 199325, 100469, 84219, -14961, -171013, 336035, 191248, 305325, 476319, 125340, 128653, 308732, 161784, 363429, -170961, -126855, -51376, 37604, -37717, 307452, -14415, 128377, 33199, 144953, 46495, 239975, 290353, 462075, 366953, 16544, 148869, -185147, -216950, 422044, 239640, 221186, 487264, 316542, 229814, -124327, -414923, 24208, -47556, 170916, -162310, -31027, 87970, 217203, -63764, 55660, -330209, 218231, -92862, -43795, -74020, 33320, 13422, -38430, -252875, -268753, -119288, 62193, 178003, 239312, 121193, -156049]
10264a78988A97770e4505j00061k46141J42471J05185B88917c28441J29329J5318
10254a83794r0060k6761F2184a13654C2549a52073n8110j60238I46c3309G809
10242b6477j34258I5628a807E2682a3989j1996A73970C2898O4034B3883a32965
10230c11653a51230c3834j24181m1087D1006a66313N5495A73745a62962N9921
10220a03041a9791j4152A96661n2382a09006k38115A34173g5611D7686b56001
10209E1594J6458J87868a66856A18819J46196j2766g7573m0676N3874M685A15391
10197H629a04337A45652C0007J8974c45073a1664j34668A48539h7958l9036e4845
10185B84293i8576I9980b12146j20129A87657D2169c677l95387a95138A15155
$$ y = [-178988, 197770, -54505, -154566, -400707, -258236, -153051, 288917, -328441, -199112, -183794, -273854, -300615, 62184, -113654, 32549, -152073, -210183, -370421, 946, -33309, 7809, -26477, -160735, 95628, -1807, 52682, -13989, -25985, 173970, 32898, 96932, 23883, -132965, -311653, -151230, -33834, -158015, -199102, 41006, -166313, -110818, 173745, -162962, -103041, -19791, -33943, 196661, 144279, -109006, -347121, 134173, -75611, 47686, -256001, 51594, 68052, 255920, -166856, 118819, 265015, 252249, -77573, -118249, -64375, -59690, 115391, 8629, -104337, 145652, 30007, 48981, -345073, -11664, -146332, 148539, -87958, -126994, -54845, 284293, -98576, 99980, -212146, -332275, 187657, 42169, -3677, -399064, -195138, 115155]
10174c72445f2555I338f9664j72645K6833e7637j60031F8348a68424J1066l4569
10163a91927E4981a77332L7064J5116N9032r8373g4907j08578H1977g3899E878
10151A8182g1911p7133P498A17148L0136N202F8556a57961b7242A29658c42943
10139B88874H3721a18641m7180P6716F3723K4344A0342J24935b03926I0589f3869
10127b7669r9265j53617B75958B4486f946j13200G7318b09302k25386C9473J36789
10116A76262B6874b45584q3417F9212b73212K1334Q0796B46546F7100a55065f1823
10104B4551j855Q6308b4424L299j10096k04609L8324a3881m42038A26780m2866
10093H3914b20516j312a09672c6536k11459G8008f5031B7236L2591K0198R8019
$$ y = [-372445, -62555, 9338, -69664, -242309, -215476, -57637, -217668, 68348, -168424, -157358, -191927, 54981, -177332, -140268, -125152, -66120, -164493, -74907, -183485, 81977, -73899, 5878, 18182, -71911, -149044, -141546, 117148, 147284, 152486, 68556, -157961, -27242, 129658, -342943, 288874, 83721, -118641, -165821, -89105, 63723, 88067, 10342, 135277, -203926, 90589, -63869, -27669, -126934, -280551, 275958, 24486, -6946, -120146, 77318, -209302, -434688, 39473, 176262, 26874, -245584, -329001, 69212, -273212, -251878, -171082, 246546, 67100, -155065, -61823, 24551, 22696, 109004, -24424, -21125, -131221, -335830, -297506, -13881, -455919, 126780, 83914, -220516, -221828, -109672, -36536, -247995, 78008, -65031, 27236, 59827, 80025, 178044]
10082A78044i1887E7792g897j82016K6595I57a72908B69999i1057j18724Q8194
10071a21587n3883D3448d03152B34196a28948j42050I5127a08443k31911C1752
10060E3461b90449h6823n7990j54716f3593A06685B6089h5312m11870i2621I730
10048a59916N1212d6184j1387j54591D34532h9353G6263a25564l7897A44754J02227
10037B46981p113i9105C48325b8480l7762k98782A07849D6567K5098J04312E7141
10025b14736c2963A89880B6448b2348A13071e0634H4562i1546m372j5145A31600
10013a81645f9805D2117a2734A66249a26089c6749J704p3704l44583B2784f5654
10001a14019k35746c9880o5540j66224H225J24723J56034k6047b6016k63328a05043
$$ y = [178044, -91887, 57792, -7897, -189913, -163318, 957, -172908, 269999, -91057, -209781, -121587, -175470, 43448, -403152, 234196, -128948, -270998, 95127, -108443, -340354, 31752, 53461, -290449, -86823, -144813, -299529, -63593, 106685, 26089, -85312, -497182, -92621, 9730, -159916, -108704, -46184, -57571, -212162, 434532, -89353, 76263, -125564, -163461, 144754, 246981, 239868, -99105, 348325, -28480, -66242, -365024, 107849, 46567, 71665, 175977, 57141, -214736, -32963, 189880, 26448, -22348, 113071, -50634, 84562, -91546, -95918, -111063, 131600, -181645, -69805, 42117, -12734, 166249, -126089, -36749, -35045, -108749, -453332, 22784, -65654, -114019, -349765, -39880, -105420, -271644, 8225, 132948, 288982, 262935, -26016, -289344, -105043]
9989a16848k3470A8458O268a13104A44696m2952f4741k82875h1340r6932J6671
9978a61601C8697a47455O6670L508B7154a51900I870a41834d2699r08k7898k15849
9966b87354a22250A67796F1749a80606J1659b4445B02926b52273A33340J7242
9956A50582c64470f6514j3926m0741J0305F6292J06491a00170B16385l9456a78456
9944i2631A28601a91524D1795a40412l5709f3482b0804C6782M5216M4865b86531
9932c8650A62605P3410E8407f4548C38395e3442q1512N7384k065m362B37558c40578
9919b590l16343B06585D1419b30466A58469c76016B00196A6634g4238j78724A10829
9907A23267a88114D2047d27997C7084a34316B35805d6207A57229c16077D84649
$$ y = [-116848, -140318, 18458, 24726, -113104, 144696, 101744, -64741, -347616, -81340, -178272, -161601, 38697, -147455, -80785, -77277, 27154, -151900, 9870, -141834, -42699, -43607, -71505, -287354, -122250, 167796, 61749, -180606, -168947, -24445, 202926, -252273, 133340, 150582, -364470, -66514, -80440, -121181, -110876, 66292, 172783, -100170, 216385, 176929, -178456, -92631, 128601, -191524, 41795, -140412, -176121, -63482, -20804, 36782, 81998, 126863, -286531, -38650, 162605, 236015, 58407, -64548, 338395, -53442, -134954, -77570, -79635, -83997, 237558, -340578, -2590, -318933, 206585, 41419, -230466, 158469, -376016, 200196, 16634, -74238, -252962, 110829, 123267, -188114, 42047, -427997, 37084, -134316, 235805, -46207, 157229, -316077, 484649]
9896a59590A076K45250b32696b3960k03926a4030q4422j59527c5287A17166f6838
9884g2257l98981a12015j98303J46530O8470k05805a14710b2513j09004b9729
9873b69696f9748j77017L4788B2071c37714G1967a7327H3299b19063F4247B8500
9861A02904a64818N9634p0762a0304j097j69065k478o167B8047f3553H0436b74479
9848D76604b31768n4057I1726B270e3837g545F4511D542c76842a02802j58186
9837b60988L0016a01982p4561B8179a49723k33065J55497M5232A16697d8048j83620
9826b31668C4106a20612M3954k3636j57575A21258c9527n3434G142a8367m9675
9815f8042G2523h557J353n0666D4768b74792l7482i2427j047C51942b70861a04070
$$ y = [-159590, 1076, 246326, -232696, -23960, -227886, -14030, -98452, -257979, -35287, 117166, -66838, -72257, -471238, -112015, -310318, -163788, -95318, -301123, -114710, -22513, -131517, -29729, -269696, -69748, -246765, -211977, 22071, -337714, 71967, -17327, 83299, -219063, 64247, 28500, 102904, -164818, -105184, -175946, -10304, -11401, -180466, -182944, -189111, 28047, -63553, 80436, -274479, 476604, -231768, -285825, 91726, 2270, -53837, -7545, 64511, 4542, -376842, -102802, -260988, -230972, -101982, -176543, 28179, -149723, -382788, -227291, -182059, 116697, -48048, -231668, 34106, -120612, -76658, -100294, -257869, 121258, -39527, -92961, 7142, -18367, -68042, 72523, -8557, -7204, -57870, 44768, -274792, -312274, -92427, -93474, 351942, -270861, -104070]
9802c6181q0084c9845k13705A60025h7070A70032d55197A01505j4207c0713B15811
9790C59091a35655C9877a03038K1765K9518A25364a50459p3207A4729h2253q3097
9779a65350b8795q9721A30695a17100j93892b6237A28698a54641j46316c7278
9768b08828J3454Q6718M6301j10862k19086A52349E9760K4476i6292H5024h0035
9756b98770J6638a34635j20860l5985a01868p3804H1036g1916a4132A05705a15684
9744A02360b76610B15510c33713J58556d6146j66003M9187B79743a38827I481
9733A28813b81860A6539a30919c7608A091a29481j89078G7914b47577J17887l51300
9722d80990a46449e6304j01057A95470b95291J17849a0934H4816j108e2109m3609
$$ y = [-36181, -116265, -39845, -253550, 160025, -87070, 170032, -455197, 101505, 87298, -30713, 215811, 359091, -135655, 39877, -103038, -81273, -51755, 125364, -150459, -223666, 14729, -82253, -165350, -28795, -118516, 130695, -117100, -310992, -26237, 128698, -154641, -300957, -37278, -208828, -195374, -108656, -62355, -173217, -392303, 152349, 59760, 84236, -96292, 85024, -80035, -298770, -282132, -134635, -255495, -291480, -101868, -175672, 81036, -71916, -14132, 105705, -115684, 102360, -276610, 215510, -333713, -175157, -46146, -212149, -162962, 279743, -138827, 9481, 128813, -281860, 16539, -130919, -37608, 1091, -129481, -318559, 77914, -247577, -129690, -480990, -146449, -56304, -157361, 195470, -295291, -177442, -10934, 84816, 83708, -52109, -95718]
9711i5718j28613b3361k02450A5282f8913j4157j35553B47879h3415l50551D1350
9699b2313l86249A14916a03227j31535a16991C79279b65359C50290A35537b18470
9688a53034C93407E8328J12688l3783L0281a03969E414d73661A1738f5332G9634
9676a53739P3288B27031h3156A70998a44386N5530n3287j33435a7539G1974g4446
9664b45541P5904A50918a72869H1149e1907I5915c104n7372A98558b69709H7026
9652i467q2105A47790d12198M247a70688j5410N9662j04383A4952a61380N9725
9641a01655F4274b11724h3497k66082J56802E1790O352a20824G7375c85694k17528
9630f03222b49247C11817D0432a88270e8124D71335d6545A98835d75244A12243
$$ y = [-95718, -224331, -23361, -225811, 15282, -68913, -83070, -218623, 247879, -83415, -433966, 41350, -22313, -408562, 114916, -103227, -234762, -116991, 379279, -265359, 350290, 135537, -218470, -153034, 393407, 58328, 171016, 137233, 167514, -103969, 5414, -473661, 11738, -65332, 79634, -153739, -80451, 227031, -83156, 170998, -144386, -88856, -142143, -275578, -17539, 71974, -74446, -245541, -169637, 150918, -172869, 81149, -51907, 95915, -3104, -60476, 198558, -269709, 87026, -9467, -91572, 147790, -412198, -407951, -170688, -186098, -126436, -230819, 14952, -161380, -101655, 64274, -211724, -83497, -349579, -192777, 51790, 58142, -120824, 77375, -385694, -603222, -249247, 311817, 40432, -188270, -58124, 471335, -46545, 198835, -475244, 112243]
9619D1093b41281C246J94818a64705M6073B094b9280o0743R702E7717K3285A2292
9606D7675a37669B6666b03078A59780a89750g119A80677E4697R9301a98751i1936
9594d71587K05592B0607g082j92519b828j27929k3390k40015b904p8968L6316
9583d5556A87836b25799a01849A5071K02559a78228d2322A02470m1353b79526
9572b84828f5263b6977A69497a21439L4347o0132k5962o1989B44472c37862f8250
9560B0958a3418k59435C0957K85d16573A5317a8442r3097k28959J25596D6952
9548I6889a07607e2369o2680C4674a23229B10960b8173B45148f9475A7317a00073
9536d1910k69576A63751a51309o1733k51096A12334a83184P8477E1075b52426
$$ y = [41093, -241281, 3246, 198064, -164705, -118632, 2094, -29280, -90023, -80321, 57717, 81002, 12292, 47675, -137669, 26666, -203078, 159780, -189750, -7119, 180677, 54697, 153998, -198751, -91936, -471587, -265995, 20607, -7082, -199601, -2828, -130757, -154147, -394162, -2904, -81872, -45556, 187836, -225799, -101849, 15071, 217630, -178228, -42322, 102470, 61117, -279526, -284828, -65263, -26977, 169497, -121439, -87092, -147224, -173186, -235175, 244472, -337862, -68250, 20958, -13418, -272853, 30957, 31242, -416573, 15317, -18442, -111539, -340498, -214902, 46952, 96889, -107607, -52369, -115049, 34674, -123229, 210960, -28173, 245148, -69475, 17317, -100073, -41910, -311486, 163751, -151309, -213042, -464138, 112334, -183184, -104707, 51075, -252426]
9525D9440J31902b12453r4764a29043r2136h8882A43704J51615i0193j18934i9286
9513B40586b22451G7450O8821a86561j48753o0390a6540k36431d7082j2062A01063
9501f3208j66510q3336a31850f2114j50667j92415A13825a9508I5517h7061L888
9490h3173A23449D7233a38661C43208a36454B24029c24393a9975A31226h6366
9479C1872a41708d3862k31577K8558A3210i0393A23351E1226b4894k79578E2121
9467D5390b45753O0775O0091F9714d6667q413m4602j14799P6726G8047k922a47350
9454c7505B91178c1238j26566j42173a695H5913B1519b79908O0184B44153a66812
9442a75041B24751a49890e7428J9331k6544j3224L5323j39978j1972C21139a63604
$$ y = [49440, 181342, -212453, -307217, -129043, -221179, -88882, 143704, 295319, -90193, -209127, -99286, 240586, -222451, 77450, 146271, -186561, -335314, -395704, -16540, -252971, -47082, -59144, 101063, -63208, -229718, -313054, -131850, -62114, -212781, -405196, 113825, -19508, 95517, -87061, -83173, 123449, 47233, -138661, 343208, -136454, 224029, -324393, -19975, 131226, -86366, 31872, -141708, -43862, -275439, -246881, 13210, -90393, 123351, 51226, -24894, -304472, 52121, 45390, -245753, -184978, -124887, 69714, -46667, -55080, -99682, -214481, -137755, 78047, 75125, -147350, -37505, 291178, -31238, -157804, -299977, -1695, 85913, 21519, -279908, -219724, 244153, -166812, -175041, 224751, -149890, -57428, -38097, -64641, -77865, -42542, -182520, -194492, 321139, -163604]
9430G7883a91002C8511a73777k49100a66802A29384b60598n8033A89022e1045
9419I4287k872b13327C3826a37140d7906o428C3122c32536C19224a29256n6348
9408a85604B89856d61520K18331E9880a42877B05483a26178A59408a1758j83931
9398a95689f0472k3273l9230C19523g6393A60595c6230j13784A4614f4204B53509
9386b55553g5708C71231c2193j80429c4258A4612a52394N3022c4128j91623B2775
9374d53967B9936J73396a77752Q0976H3735a69123K0100A84494K1032g6234j80170
9363b56404l43788C8319a61292P9035r8529A22397A644J09112c88012A26678n190
9352A21488c48791h6474A23421M7835a35173B7690a24960G1522J98193c5984l1701
$$ y = [77883, -191002, 38511, -173777, -422877, -166802, 129384, -260598, -318631, 189022, -51045, 94287, 91415, -213327, 33826, -137140, -47906, -54334, 33122, -332536, 319224, -129256, -185604, 289856, -461520, -243189, 59880, -142877, 205483, -126178, 159408, -11758, -195689, -60472, -83745, -122975, 319523, -76393, 160595, -36230, -150014, 14614, -64204, 253509, -255553, -75708, 371231, -32193, -212622, -34258, 14612, -152394, -99372, -34128, -225751, 22775, -453967, 29936, 203332, -177752, -96776, 83735, -169123, -149023, 184494, 205526, -76234, -256404, -600192, 38319, -161292, -82257, -180786, 122397, 1644, 110756, -388012, 126678, 121488, -348791, -86474, 123421, 171256, -135173, 27690, -124960, 71522, 269715, -35984, -67685]
9341f7685j84789D2946b25693P7391B6150K19432c9834A19701c7585I6709A0560
9329a98907B0903a70543A5623h7051E2214j85d7570p7476f350A07814c067p9210
9317h2277k9924q6606b9843j88039f451A10388b28088j47700H7267a24534c3758
9305A10631i2729b2971l0581k93191b6426j91317J1313B01959c3627k16848e4472
9293i4354b5123A01030K5161L9671b8670j36740K3505A35581e03110e5882A9037
9281e4494n318B19691a64903m2723Q7502k8474B01269C830a87615j81965I295
9269F3771K6991D20a32453l6175e1677J8203l50727E5050B3754h4321j08491K1235
9257a71577I375M1986b07966F0331b25595A42506e21074a71740D7690k565a18242
$$ y = [-67685, -252474, 42946, -225693, -148302, 26150, 245582, -39834, 119701, -37585, 96709, 10560, -198907, 20903, -170543, 15623, -87051, 52214, 52029, -47570, -125046, -6350, 107814, -3067, -82277, -112201, -198807, -29843, -217882, -6451, 110388, -228088, -375788, 87267, -124534, -33758, 110631, -92729, -22971, -53552, -346743, -26426, -217743, -206430, 201959, -33627, -250475, -54472, -94354, -25123, 101030, 126191, 165862, -28670, -165410, -141905, 135581, -503110, -55882, 19037, -54494, -59812, 219691, -164903, -207626, -120124, -148598, 201269, 3830, -187615, -369580, 9295, 63771, 90762, 420, -132453, -168628, -51677, -33474, -384201, 55050, 23754, -84321, -192812, -171577, 9375, 51361, -207966, 60331, -225595, 142506, -521074, -171740, 47690, 45125, -118242]
9245a08002b5824j51913A6107J19504J46314f5061H8813N14B3610c1647B10289
9233a25069a9348j02138j46509K9469G649J33746M0810a84733N2820d6637j75502
9222b22139N6282Q140A39938J9066b21992A8291a54889A47295I026M1566J62619
9211B13211b8233l38364n5914K06307c85F7240c5947A19893c51749O1041F5559
9199a63846C071K63021B4661b2679k01633i4354F9652J34499c14045B3689b64327
9187g5786K1096A42568j3820F1296b35064F6399R0064a85092D14632a42968I3745
9175f5711k08930J21514l2497K4165l8086B23070E613b86686a01874B29373a93934
9163B54520a79334F4690d2375D3187b31672j4219C69183h8512K0751k3890B47342
$$ y = [-108002, -25824, -177737, 16107, 135611, 281925, -65061, 88813, 89327, 23610, -31647, 210289, -125069, -19348, -121486, -267995, -238526, 7649, 141395, 182205, -184733, -131913, -46637, -222139, -165857, -157717, 139938, 159004, -221992, 18291, -154889, 147295, 9026, 50592, 213211, -28233, -366597, -422511, -216204, -385, 67240, -35947, 119893, -351749, -290708, 65559, -163846, 3071, 266092, 24661, -22679, -224312, -94354, 69652, 204151, -314045, 23689, -264327, -75786, -54690, 142568, 128748, 61296, -235064, 66399, 156463, -185092, 414632, -142968, 93745, -65711, -274641, -153127, -185624, -161459, -199545, 223070, 5613, -286686, -101874, 229373, -193934, 254520, -179334, 64690, -42375, 43187, -231672, -245891, 369183, -88512, -67761, -91651, 247342]
9151a72865H1502k2732a6342C6495k658g1177k41799A94246d92373a86563A48957
9139a53896A52771L726k8053J80872i3121l4218I5649l6319e4550B8228O300A4967
9126d12807e3229r240k92044a02888j29315F2224J19663R7600K3287a10902k13846
9115c24748a16796o1380j18478C8324a01994j21808F3191a0772r8107l36478a98476
9103a88304p0136n4359C5707b33356b389l4828k89816B18859J20764E8096b7583
9091A23537b34332k7330g1694o2277f778A19450n2287a59324A85486p6976J34019
9080B42529a85235D4414a5350B80102a29344B17145c6674E882P2623O3504c42901
9068A29272e0982j81670E4952N5418k3018K30242a24953a4362l30589g4239E8853
$$ y = [-172865, 81502, 58770, -16342, 36495, 33837, -71177, -312976, 194246, -492373, -186563, 148957, -153896, 152771, 156497, 128444, 309316, -93121, -127339, 95649, 59330, -54550, 28228, 34528, 14967, -412807, -53229, -62469, -354513, -102888, -232203, 62224, 181887, 279487, 302774, -110902, -324748, -116796, -178176, -296654, 38324, -101994, -223802, 63191, -10772, -108879, -445357, -198476, -188304, -258440, -312799, 35707, -233356, -2389, -37217, -327033, 218859, 339623, 58096, -27583, 123537, -234332, -261662, -71694, -133971, -6778, 119450, 67163, -159324, 185486, 108510, 242529, -185235, 44414, -15350, 280102, -129344, 217145, -36674, 5882, 78505, 142009, -342901, 129272, -50982, -232652, 54952, 110370, 87352, 317594, -124953, -14362, -344951, -74239, 58853]
9056a75032f6813A12499a26407m5162A45635i3779E8172D574a05281j48883O2081
9045a92083A88480a84781O6894j92514a36811a1688D6427a68549f5960A91509
9034g3505A07369f9057j28191D294c5168A60807k4248C0188a55402l8260j38553
9023c32215B62592a81422h5263C4092d71753E8831c76399I3412b40544A49303
9012H8587b96308B2741J10709c47929c1168j74964J9936m5451H1952K09524a3321
9000A3893a25787c3599B63727A14566i2989H6122B606J34602B3130h8769c0997
8988C334c6767q126j11903A83366D5147J66835a20976j12205j29840i9515D31618
8976i5509l0551j59731B16978C0060g269A17648a34195c7558A36967a16658K6658
$$ y = [-175032, -66813, 112499, -126407, -171569, 145635, -93779, 58172, 4574, -105281, -254164, -192083, 188480, -184781, -117887, -310401, -136811, -11688, 46427, -168549, -65960, 191509, -73505, 107369, -69057, -197248, 4294, -35168, 160807, 136559, 30188, -155402, -193662, -332215, 262592, -181422, -85263, 34092, -471753, 58831, -376399, 93412, -240544, 149303, 88587, -296308, 22741, 133450, -347929, -31168, -206132, -186196, -231647, 81952, 291476, -13321, 13893, -125787, -33599, 263727, 114566, -92989, 86122, 2606, 137208, 23130, -88769, -30997, 3334, -36767, -44893, -156796, 183366, 45147, 211982, -120976, -233181, -363021, -99515, 431618, -95509, -126060, -285791, 216978, 30060, -7269, 117648, -134195, -37558, 136967, -116658, -90000]
8965i0000q4539G263a17256A5143a46655p8728m9517B4990a34184A5315a25456
8953a24101B9216f5694A20659a73325P4345b7542B77238J562D5252J8670K58614
8942C22536H0737a92877K6123e6836j27318a215k20914k0319d5945m6483Q184
8931h4244A03924a01032K2059A21250a15992r6532k5392O5512j2874q1471B6757
8919a99120A07562d9165B77184O056B6138J09262A4780j547K8077J83357A06486
8907D33824L403N71805O84972J579706L457235j996430A964400H97728k24289
8898F73439k61898a237k6142q0678o6913A69310b18675A07052B8157a62253e9993
8886H676b27342J09684A04966D6546a1124A3400c22232a03673A20369a89883e203
$$ y = [-90000, -174539, 7263, -117256, 15143, -146655, -225383, -274900, 24990, -134184, 15315, -125456, -124101, 29216, -65694, 120659, -173325, -98980, -27542, 277238, 278800, 45252, 63922, 322536, 80737, -192877, -166754, -56836, -184154, -1215, -222129, -242448, -45945, -92428, -84244, 103924, -101032, -78973, 121250, -115992, -212524, -237916, -172404, -185278, -266749, 26757, -199120, 107562, -49165, 277184, 283240, 26138, 135400, 14780, 13233, 41310, 224667, 106486, 433824, 437227, 1009032, 1694004, 3273710, 6730945, 4734515, 1964400, 897728, 673439, 411541, -1237, -27379, -108057, -174970, 169310, -218675, 107052, 28157, -162253, -59993, 8676, -227342, -117658, 104966, 46546, -11124, 13400, -322232, -103673, 120369, -189883, -5203]
8874a77788E49779a6800B16237a35929q7243Q9910A3784h1387J5729G4513C5035
8862c26021a16330e6473E6048c7197B65245j19078e6384k2611A03702e8385k11011
8851b69396J21983K7425o9313A42659b30218C8313L35157B4169a39737o204F5961
8839d7389J2932q2116A35363O8170a23073d2466r1845N5071B00599I0158r98J27127
$$ y = [-177788, 549779, -16800, 216237, -135929, -223172, -133262, 13784, -81387, -65658, 74513, 35035, -326021, -116330, -56473, 56048, -37197, 265245, 146167, -56384, -78995, 103702, -58385, -269396, -147413, -119988, -189301, 142659, -230218, 38313, 373470, 24169, -139737, -145941, 65961, -47389, -34457, -116573, 135363, 203533, -123073, -42466, -134311, -79240, 200599, 90158, 89160, 216287]
$$ [...]
##END NTUPLES=NMR SPECTRUM
##END=
