
##TITLE=AC1157_Cauca-san_5874560_4fybGGggIW
##JCAMPDX= 6.0         $$ Bruker NMR JCAMP-DX V2.0
##DATA TYPE= NMR SPECTRUM
##DATA CLASS= NTUPLES
##ORIGIN= BRUKER
##OWNER= Administrator
$$ 1.72 TOPSPIN		Version 2.1
$$ 2012-03-31 16:28:56.343 -0500  Administrator@TOPSPIN
$$ Compression mode = diff/dup
##.OBSERVE FREQUENCY= 400.13188235
##.OBSERVE NUCLEUS= ^1H
##.ACQUISITION MODE= SIMULTANEOUS (DQD)
##.ACQUISITION SCHEME= undefined
##.AVERAGES= 64
##.DIGITISER RES= 22
##SPECTROMETER/DATA SYSTEM= spect
##.PULSE SEQUENCE= noesygpps1d.comp
##.SOLVENT NAME= COFFEE_meoh
##.SHIFT REFERENCE= INTERNAL, COFFEE_meoh, 1, 14.96855
##AUDIT TRAIL= $$ (NUMBER, WHEN, WHO, WHERE, PROCESS, VERSION, WHAT)
$$ ##TITLE= Audit trail, TOPSPIN		Version 2.1
$$ ##JCAMPDX= 5.01
$$ ##ORIGIN= Bruker BioSpin GmbH
$$ ##OWNER= Administrator
$$ $$ C:\Bruker\TOPSPIN/data/COFFEE/nmr/AC1157_Cauca-san_5874560_4fybGGggIW/12/pdata/1/auditp.txt
$$ ##AUDIT TRAIL=  $$ (NUMBER, WHEN, WHO, WHERE, PROCESS, VERSION, WHAT)
(   1,<2012-03-31 16:28:51.078 -0500>,<Administrator>,<TOPSPIN>,<go>,<TOPSPIN 2.1>,
      <created by zg
	started at 2012-03-31 16:17:19.203 -0500,
	POWCHK enabled, PULCHK disabled,
       configuration hash MD5:
       1A 1E CE 29 27 FD 77 03 67 4E F0 E3 C4 B2 CB 90
       data hash MD5: 64K
       61 00 9D A8 8E 9D 26 D1 8E 69 C5 34 03 BB 74 29>)
(   2,<2012-03-31 16:28:54.140 -0500>,<Administrator>,<TOPSPIN>,<proc1d>,<TOPSPIN 2.1>,
      <Start of raw data processing
       efp LB = 0.3 FT_mod = 6 PKNL = 1 PHC0 = 0 PHC1 = 0 SI = 128K 
       data hash MD5: 128K
       D8 95 06 96 0E 75 56 28 0E 8B AA 38 B6 D6 C1 7C>)
(   3,<2012-03-31 16:28:55.593 -0500>,<Administrator>,<TOPSPIN>,<proc1d>,<TOPSPIN 2.1>,
      <pk PHC0 = 36.96899 PHC1 = 0 
       data hash MD5: 128K
       C6 C0 67 C2 F4 34 39 19 04 D5 7F 2B 50 E9 01 ED>)
(   4,<2012-03-31 16:28:55.875 -0500>,<Administrator>,<TOPSPIN>,<proc1d>,<TOPSPIN 2.1>,
      <abs ABSG = 1 
       data hash MD5: 128K
       00 F0 81 96 98 DF B9 1D B1 15 0B 60 FA B5 84 35>)
(   5,<2012-03-31 16:28:56.015 -0500>,<Administrator>,<TOPSPIN>,<proc1d>,<TOPSPIN 2.1>,
      <abs ABSG = 2 
       data hash MD5: 128K
       92 CB 94 F7 B8 C1 F2 CF B9 8B D7 FA FB D0 8A 8F>)
(   6,<2012-03-31 16:28:56.062 -0500>,<Administrator>,<TOPSPIN>,<proc1d>,<TOPSPIN 2.1>,
      <abs ABSG = 3 
       data hash MD5: 128K
       CC 23 C3 05 AD C4 B9 B3 A4 0B C7 4B 1D A4 39 4B>)
(   7,<2012-03-31 16:28:56.125 -0500>,<Administrator>,<TOPSPIN>,<proc1d>,<TOPSPIN 2.1>,
      <abs ABSG = 4 
       data hash MD5: 128K
       54 3C 07 0F 22 5F 0E 17 16 4D A1 09 FA DA E4 25>)
(   8,<2012-03-31 16:28:56.187 -0500>,<Administrator>,<TOPSPIN>,<proc1d>,<TOPSPIN 2.1>,
      <abs ABSG = 5 
       data hash MD5: 128K
       CA AF FB 5A 38 4E A1 14 FC 6B 5B 79 1A 7A 36 37>)
$$ ##END=
$$ 
$$ $$ hash MD5
$$ $$ 1D CE EF 47 94 76 62 27 0D B3 74 12 09 8D D9 79
##$RELAX= 
##$RELAX= 
##$RELAX= 
##$RELAX= 
##$RELAX= 
##$RELAX= 
##$RELAX= 
##$RELAX= 
$$ Bruker specific parameters
$$ [...]
##$TP07= 0
##$TPNAME0= <>
##$TPNAME1= <>
##$TPNAME2= <>
##$TPNAME3= <>
##$TPNAME4= <>
##$TPNAME5= <>
##$TPNAME6= <>
##$TPNAME7= <>
##$TPOAL= (0..7)
0.5 0.5 0.5 0.5 0.5 0.5 0.5 0.5
##$TPOFFS= (0..7)
0 0 0 0 0 0 0 0
##$TUNHIN= 0
##$TUNHOUT= 0
##$TUNXOUT= 0
##$USERA1= <user>
##$USERA2= <user>
##$USERA3= <user>
##$USERA4= <user>
##$USERA5= <user>
##$V9= 5
##$VALIST= <valist>
##$VCLIST= <CCCCCCCCCCCCCCC>
##$VD= 0
##$VDLIST= <DDDDDDDDDDDDDDD>
##$VPLIST= <PPPPPPPPPPPPPPP>
##$VTLIST= <TTTTTTTTTTTTTTT>
##$WBST= 2048
##$WBSW= 25
##$XGAIN= (0..3)
0 0 0 0
##$XL= 0
##$YL= 0
##$YMAX_a= 13039606
##$YMIN_a= -6895668
##$ZGOPTNS= <>
##$ZL1= 120
##$ZL2= 120
##$ZL3= 120
##$ZL4= 120
##$ABSF1= 14.96855
##$ABSF2= -5.583981
##$ABSG= 5
##$ABSL= 3
##$ALPHA= 0
##$AQORDER= 0
##$ASSFAC= 0
##$ASSFACI= 0
##$ASSFACX= 0
##$ASSWID= 0
##$AUNMP= <proc_prof1d_extract.lims>
##$AXLEFT= 0
##$AXNAME= <>
##$AXNUC= <1H>
##$AXRIGHT= 0
##$AXTYPE= 0
##$AXUNIT= <>
##$AZFE= 0.1
##$AZFW= 0.1
##$BCFW= 0
##$BC_mod= 0
##$BYTORDP= 0
##$COROFFS= 0
##$CY= 15
##$DATMOD= 1
##$DC= 0
##$DFILT= <>
##$DTYPP= 0
##$F1P= 0
##$F2P= 0
##$FCOR= 0.5
##$FTSIZE= 131072
##$FT_mod= 6
##$GAMMA= 0
##$GB= 0
##$INTBC= 1
##$INTSCL= 1
##$ISEN= 128
##$LB= 0.3
##$LEV0= 0
##$LPBIN= 0
##$MAXI= 10000
##$MC2= 0
##$MEAN= 0
##$ME_mod= 0
##$MI= 0
##$NCOEF= 0
##$NC_proc= -3
##$NLEV= 6
##$NOISF1= 0
##$NOISF2= 0
##$NSP= 0
##$NTH_PI= 0
##$NZP= 0
##$OFFSET= 14.96855
##$PC= 1
##$PHC0= 36.96899
##$PHC1= 0
##$PH_mod= 1
##$PKNL= yes
##$PPARMOD= 0
##$PPDIAG= 0
##$PPIPTYP= 0
##$PPMPNUM= 2147483647
##$PPRESOL= 1
##$PSCAL= 4
##$PSIGN= 0
##$PYNMP= <proc.py>
##$REVERSE= no
##$SF= 400.130004825842
##$SI= 131072
##$SIGF1= 0
##$SIGF2= 0
##$SINO= 400
##$SIOLD= 131072
##$SPECTYP= <>
##$SREGLST= <1H.CDCl3>
##$SSB= 0
##$STSI= 131072
##$STSR= 0
##$SW_p= 8223.68421052632
##$SYMM= 0
##$S_DEV= 0
##$TDeff= 65536
##$TDoff= 0
##$TI= <>
##$TILT= no
##$TM1= 0
##$TM2= 0
##$TOPLEV= 0
##$USERP1= <user>
##$USERP2= <user>
##$USERP3= <user>
##$USERP4= <user>
##$USERP5= <user>
##$WDW= 1
##$XDIM= 131072
##$YMAX_p= 550855000
##$YMIN_p= -573800027
##$CURPLOT= <Network HP LaserJet P1505>
##$CURPRIN= <$Network HP LaserJet P1505>
##$DFORMAT= <normdp>
##$LAYOUT= <+/1D_H.xwp>
##$LFORMAT= <normlp>
##$PFORMAT= <normpl>
##$SURQMSG= 1
$$ End of Bruker specific parameters
$$ ---------------------------------
##NTUPLES= NMR SPECTRUM
##VAR_NAME=  FREQUENCY,     SPECTRUM/REAL,   SPECTRUM/IMAG
##SYMBOL=    X,             R,               I
##VAR_TYPE=  INDEPENDENT,   DEPENDENT,       DEPENDENT
##VAR_FORM=  AFFN,          ASDF,            ASDF
##VAR_DIM=   131072,        131072,          131072
##UNITS=     HZ,            ARBITRARY UNITS, ARBITRARY UNITS
##FACTOR=    0.0627417313425165, 1,          1
##FIRST=     8223.62146879498, 8636,         -81038
##LAST=      0,             10240,           -80353
##MIN=       0,             -573800027,      0
##MAX=       8223.62146879498, 550855000,    0
$$ Real data points
##PAGE= N=1
##DATA TABLE= (X++(R..R)), XYDATA
$$ [...]
$$ plain form
61694 37961156 36058423 34023826 31929814 29835436 27784813 25810278 23936221 22179429
61686 22179429 20547747 19041680 17658387 16393641 15240862 14191005 13234879 12365006
61678 12365006 11574972 10858072 10207160 9615004 9074343 8578552 8122945 7704951 7322467
61669 7322467 6972303 6650403 6353164 6078369 5825177 5593178 5381040 5186156 5006009
61660 5006009 4839471 4686010 4544000 4410976 4285504 4167657 4057509 3954349 3857691 3767829
61650 3767829 3684638 3606602 3531815 3459515 3390172 3324418 3262192 3202556 3144164 3086302 3029500
61639 3029500 2974693 2921958 2870814 2821527 2774948 2730900 2687937 2645159 2603241 2563101 2524516
61628 2524516 2486755 2449752 2413807 2378809 2344563 2311563 2280739 2252670 2227420 2204774 2184277
$$ packed form
61694C7961156j902733k034597k094012k094378k050623j974535j874057j756792
61686B2179429j631682j506067j383293j264746j152779j049857r56126q69873
61678A2365006p90034p16900o50912n92156n40661m95791m55607m17994l82484
61669G322467l50164l21900k97239k74795k53192k31999k12138j94884j80147
61660E006009j66538j53461j42010j33024j25472j17847j10148j03160r6658q9862
61650C767829q3191p8036p4787p2300o9343o5754o2226n9636n8392n7862n6802
61639C029500n4807n2735n1144m9287m6579m4048m2963m2778m1918m0140l8585
61628B524516l7761l7003l5945l4998l4246l3000l0824k8069k5250k2646k0497
$$ plain form
61617 2184277 2165473 2148380 2133154 2119072 2104715 2089726 2075628 2064172 2055430 2048133 2041201 2034108
61605 2034108 2026308 2017394 2007631 1997463 1986600 1974366 1960923 1947414 1934826 1923260 1912424 1902301
61593 1902301 1893146 1885126 1878099 1871641 1865244 1858601 1851547 1843861 1835664 1828118 1822982 1820825 1820150 1818994
61579 1818994 1817151 1816034 1816526 1817943 1819371 1821214 1824734 1830345 1837005 1843384 1849282 1855588 1862942 1870738
61565 1870738 1877637 1882905 1887000 1890851 1894805 1898383 1900850 1901813 1901283 1899254 1895429 1889556 1881996 1873647
61551 1873647 1865125 1856272 1846673 1836376 1825872 1815564 1805485 1795316 1784559 1773174 1762193 1752998
61539 1752998 1745638 1738727 1731621 1725678 1722296 1720658 1718948 1717130 1716758 1718432 1721556 1726670 1735681 1748910
61525 1748910 1763861 1778193 1792530 1809119 1829026 1852031 1878072 1907126 1938326 1970872 2005586
$$ packed form
61617B184277j8804j7093j5226j4082j4357j4989j4098j1456q742p297o932p093
61605B034108p800q914r763j0168j0863j2234j3443j3509j2588j1566j0836j0123
61593A902301r155q020p027o458o397o643p054p686q197p546n136k157o75j156
61579A818994j843j117M92J417J428J843L520N611O660O379N898O306P354P796
61565A870738O899N268M095L851L954L578K467R63n30k029l825n873p560q349
61551A873647q522q853r599j0297j0504j0308j0079j0169j0757j1385j0981r195
61539A752998p360o911p106n943l382j638j710j818l72J674L124N114R011J3229
61525A748910J4951J4332J4337J6589J9907K3005K6041K9054L1200L2546L4714
$$ plain form
61514 2005586 2044269 2087571 2134562 2184183 2236023 2289742 2344825 2401178 2459295 2519662 2582345
61503 2582345 2646953 2712519 2777591 2840956 2902120 2960772 3016318 3068411 3117362 3163419 3206214
61492 3206214 3245659 3282583 3317375 3348443 3373254 3390712 3401471 3406217 3405107 3398911 3389224 3376935
61480 3376935 3361590 3342921 3322145 3301158 3281152 3262705 3246515 3233176 3222529 3214144 3208523 3207237
61468 3207237 3211725 3222399 3239093 3262000 3291761 3328852 3373421 3425840 3486945 3557334 3636893
61457 3636893 3725640 3824870 3936691 4062399 4202223 4356973 4529066 4721215 4934584 5168870
61447 5168870 5423809 5699888 5997769 6317672 6659439 7022828 7407497 7812229 8233330
61438 8233330 8663277 9091273 9505289 9893133 10241725 10537100 10766956 10923703 11005026 11012416
$$ packed form
61514B005586L8683M3302M6991M9621N1840N3719N5083N6353N8117O0367O2683
61503B582345O4608O5566O5072O3365O1164N8652N5546N2093M8951M6057M2795
61492C206214L9445L6924L4792L1068K4811J7458J0759M746j110o196r687j2289
61480C376935j5345j8669k0776k0987k0006j8447j6190j3339j0647q385n621j286
61468C207237M488J0674J6694K2907K9761L7091M4569N2419O1105P0389P9559
61457C636893Q8747R9230J11821J25708J39824J54750J72093J92149K13369K34286
61447E168870K54939K76079K97881L19903L41767L63389L84669M04732M21101
61438H233330M29947M27996M14016L87844L48592K95375K29856J56747Q1323P390
$$ plain form
61428 11012416 10950043 10824475 10644217 10419074 10159937 9878171 9583920 9284889 8987211
61419 8987211 8696955 8419901 8160173 7920130 7701468 7505645 7333568 7185834 7063004
61410 7063004 6964613 6888415 6832116 6795809 6780994 6786882 6809461 6845170 6893923 6957050 7033272
61399 7033272 7118478 7209256 7304985 7406124 7511670 7619153 7726481 7832894 7938123 8041252
61389 8041252 8140878 8236251 8328026 8417816 8507070 8596267 8684903 8772008 8856692 8938248 9015754
61378 9015754 9087963 9153990 9213995 9268594 9317539 9359526 9393350 9418439 9433980 9438555 9431484 9413983
61366 9413983 9388204 9355585 9316782 9272656 9224312 9172591 9118493 9063894 9010852 8960331 8912555
61355 8912555 8868437 8829552 8796764 8769948 8749147 8734704 8725784 8719769 8713731 8705926 8695694 8682860
$$ packed form
61428A1012416o2373j25568j80258k25143k59137k81766k94251k99031k97678
61419H987211k90256k77054k59728k40043k18662j95823j72077j47734j22830
61410G063004r8391p6198n6299l6307j4815N888K2579L5709M8753O3127P6222
61399G033272Q5206R0778R5729J01139J05546J07483J07328J06413J05229J03129
61389H041252R9626R5373R1775Q9790Q9254Q9197Q8636Q7105Q4684Q1556P7506
61378I015754P2209O6027O0005N4599M8945M1987L3824K5089J5541M575p071j7501
61366I413983k5779l2619l8803m4126m8344n1721n4098n4599n3042n0521m7776
61355H912555m4118l8885l2788k6816k0801j4443q920o015o038p805j0232j2834
$$ plain form
61343 8682860 8667764 8651031 8632713 8612282 8590042 8567979 8548664 8534048 8526096 8528063 8544092 8577554
61331 8577554 8630491 8704727 8802923 8928124 9082433 9266359 9479556 9722215 9995576 10300864
61321 10300864 10637805 11004404 11397901 11815228 12252307 12703128 13159380 13610228 14042193
61312 14042193 14440030 14788834 15076030 15292209 15431272 15490681 15471506 15377667 15214697 14988865
61302 14988865 14706987 14376597 14005962 13603521 13176953 12732881 12277619 11817913 11360424
61293 11360424 10910620 10472577 10049782 9645615 9263123 8904859 8572818 8267883 7989335
61284 7989335 7735684 7506240 7301351 7121090 6964494 6830436 6718504 6628550 6559928 6511629
61274 6511629 6482593 6471253 6475212 6492175 6521144 6562228 6615207 6678688 6750640 6829289 6913215
$$ packed form
61343H682860j5096j6733j8318k0431k2240k2063j9315j4616p952J967J6029L3462
61331H577554N2937P4236R8196J25201J54309J83926K13197K42659K73361L05288
61321A0300864L36941L66599L93497M17327M37079M50821M56252M50848M31965
61312A4042193L97837L48804K87196K16179J39063N9409j9175r3839j62970k25832
61302A4988865k81878l30390l70635m02441m26568m44072m55262m59706m57489
61293A1360424m49804m38043m22795m04167l82492l58264l32041l04935k78548
61284G989335k53651k29444k04889j80261j56596j34058j11932q9954o8622m8299
61274F511629k9036j1340L959J6963K8969M1084N2979O3481P1952P8649Q3926
$$ plain form
61263 6913215 7000698 7089369 7176768 7261205 7341828 7417909 7488525 7553095 7611526 7663330 7707173
61252 7707173 7742124 7768993 7789611 7805018 7815122 7819640 7817899 7807819 7786760 7754104 7711856 7662060
61240 7662060 7604740 7539252 7466582 7388993 7307920 7223206 7134134 7040387 6942388 6841660 6740661
61229 6740661 6641495 6544888 6451086 6361401 6277991 6202151 6133592 6071303 6014462 5962636 5915955
61218 5915955 5875072 5840068 5809250 5779845 5750165 5720392 5690996 5661253 5629917 5596785 5562952
61207 5562952 5529931 5499226 5472643 5452265 5439799 5436069 5441183 5455025 5477763 5510202 5553740 5609821
61195 5609821 5679422 5763235 5862222 5977605 6110040 6258870 6422228 6597687 6782593 6973831
61185 6973831 7167434 7358420 7540674 7706701 7847458 7952890 8013547 8022728 7977878 7880280
$$ packed form
61263F913215Q7483Q8671Q7399Q4437Q0623P6081P0616O4570N8431N1804M3843
61252G707173L4951K6869K0618J5407J0104M518j741j0080k1059l2656m2248m9796
61240G662060n7320o5488p2670p7589q1073q4714q9072r3747r7999j00728j00999
61229F740661r9166r6607r3802q9685q3410p5840o8559o2289n6841n1826m6681
61218E915955m0883l5004l0818k9405k9680k9773k9396k9743l1336l3132l3833
61207E562952l3021l0705k6583k0378j2466l730N114J3842K2738L2439M3538N6081
61195E609821O9601Q3813R8987J15383J32435J48830J63358J75459J84906J91238
61185F973831J93603J90986J82254J66027J40757J05432O0657R181m4850r7598
$$ plain form
61175 7880280 7733703 7543628 7317565 7065103 6796513 6520807 6244969 5974407 5713253
61166 5713253 5464269 5229262 5009926 4807677 4622399 4452150 4294844 4150004 4018442
61157 4018442 3900546 3795385 3701232 3616487 3540253 3472452 3413277 3362284 3318300 3280493 3249189
61146 3249189 3225309 3209414 3201566 3201378 3207414 3217108 3228325 3240966 3256355 3275111 3296153 3317350
61134 3317350 3336193 3350126 3357458 3358329 3354165 3345991 3333743 3317002 3295592 3269541 3239354 3206391
61122 3206391 3172146 3137040 3100604 3062662 3023429 2982594 2939646 2895325 2851452 2808842 2766536
61111 2766536 2723662 2680859 2639046 2597751 2555652 2512116 2467344 2421492 2374523 2326612 2278116
61100 2278116 2229506 2181773 2136338 2093870 2053717 2015004 1977681 1941828 1906651 1871170 1835461
$$ packed form
61175G880280j46577j90075k26063k52462k68590k75706k75838k70562k61154
61166E713253k48984k35007k19336k02249j85278j70249j57306j44840j31562
61157D018442j17896j05161r4153q4745p6234o7801n9175n0993m3984l7807l1304
61146C249189k3880j5895p848j88O036R694J1217J2641J5389J8756K1042K1197
61134C317350J8843J3933P332Q71m164q174j2248j6741k1410k6051l0187l2963
61122C206391l4245l5106l6436l7942l9233m0835m2948m4321m3873m2610m2306
61111B766536m2874m2803m1813m1295m2099m3536m4772m5852m6969m7911m8496
61100B278116m8610m7733m5435m2468m0153l8713l7323l5853l5177l5481l5709
$$ plain form
61089 1835461 1800158 1764945 1728593 1690563 1651778 1613725 1577451 1543585 1512688 1485197 1461113
61078 1461113 1439784 1420003 1400817 1382646 1367265 1356137 1348960 1344337 1341550 1340985 1342928 1346783 1351707
61065 1351707 1357482 1364480 1373081 1383442 1395633 1409622 1424957 1440458 1454510 1466121 1475872 1485605
61053 1485605 1496893 1509929 1523877 1538043 1552492 1567655 1583361 1598181 1609964 1617450 1621248 1622880
61041 1622880 1623145 1621988 1619449 1615519 1609219 1599453 1587234 1575552 1566136 1557611 1547905 1537182 1526880
61028 1526880 1516891 1505657 1492653 1478983 1465514 1452134 1439068 1427240 1416786 1406575 1395945
61017 1395945 1385748 1376981 1369443 1362577 1356648 1352022 1348029 1343769 1339649 1337030 1336428 1336963 1337478 1337409 1336625
61002 1336625 1335388 1334574 1335028 1336351 1337081 1336465 1335351 1334886 1335070 1335310 1335843 1337638 1341017 1345187 1349212 1352815
$$ packed form
61089A835461l5303l5213l6352l8030l8785l8053l6274l3866l0897k7491k4084
61078A461113k1329j9781j9186j8171j5381j1128p177m623k787n65J943L855M924
61065A351707N775O998Q601J0361J2191J3989J5335J5501J4052J1611R751R733
61053A485605J1288J3036J3948J4166J4449J5163J5706J4820J1783P486L798J632
61041A622880K65j157k539l930o300r766j2219j1682r416q525r706j0723j0302
61028A526880r989j1234j3004j3670j3469j3380j3066j1828j0454j0211j0630
61017A395945j0197q767p538o866n929m626l993m260m120k619o02N35N15o9p84
61002A336625j237q14M54J323P30o16j114m65J84K40N33J795L379M170M025L603
$$ plain form
60986 1352815 1356302 1360319 1365711 1372975 1381855 1392049 1404165 1419041 1436228 1454285 1472824 1492973
60974 1492973 1515421 1539560 1565437 1594960 1629497 1667342 1705391 1742754 1781008 1821335 1863419
60963 1863419 1907119 1953265 2002335 2053943 2108123 2165670 2226767 2290779 2358085 2430697 2510264
60952 2510264 2596740 2689863 2790783 2901234 3022153 3154190 3298692 3456855 3628159 3810540
60942 3810540 4002122 4202732 4414476 4641280 4887305 5155451 5447869 5767672 6118899
60933 6118899 6504583 6926258 7386050 7888630 8441620 9056148 9747370 10532213 11425384
60924 11425384 12438702 13584083 14874687 16324046 17950474 19786737 21882170 24290527
60916 24290527 27054795 30196117 33688442 37403977 41066881 44289824 46716959 48190492
$$ packed form
60986A352815L487M017N392P264Q880J0194J2116J4876J7187J8057J8539K0149
60974A492973K2448K4139K5877K9523L4537L7845L8049L7363L8254M0327M2084
60963A863419M3700M6146M9070N1608N4180N7547O1097O4012O7306P2612P9567
60952B510264Q6476R3123J00920J10451J20919J32037J44502J58163J71304J82381
60942C810540J91582K00610K11744K26804K46025K68146K92418L19803L51227
60933F118899L85684M21675M59792N02580N52990O14528O91222P84843Q93171
60924A1425384J013318J145381J290604J449359J626428J836263K095433K408357
60916B4290527K764268L141322L492325L715535L662904L222943K427135J473533
$$ plain form
60908 48190492 48816362 48886451 48734305 48628516 48728271 49053485 49448310 49591375 49107970 47744348
60898 47744348 45484785 42531042 39180828 35707869 32307460 29097548 26138512 23453210
60890 23453210 21044535 18906477 17026341 15384370 13956986 12720827 11652836 10728738
60882 10728738 9924329 9218160 8592201 8031566 7525438 7067268 6652073 6273718 5925804
60873 5925804 5604265 5307540 5034544 4783492 4552042 4337224 4135459 3943646 3760213
60864 3760213 3584742 3417234 3258321 3109223 2970433 2840950 2719524 2605905 2500057
60855 2500057 2401162 2308610 2223110 2145274 2073581 2005241 1938969 1875627 1816353 1761484 1711336
60844 1711336 1666437 1626310 1589091 1553098 1518242 1485469 1455381 1427938 1403088 1381090 1362127
$$ packed form
60908D8190492O25870P0089j52146j05789R9755L25214L94825J43065m83405j363622
60898D7744348k259563k953743l350214l472959l400409l209912k959036k685302
60890B3453210k408675k138058j880136j641971j427384j236159j067991r24098
60882A0728738q04409p06169o25959n60635n06128m58170m15195l78355l47914
60873E925804l21539k96725k72996k51052k31450k14818k01765j91813j83433
60864C760213j75471j67508j58913j49098j38790j29483j21426j13619j05848
60855B500057r8895r2552q5500p7836p1693o8340o6272o3342n9274n4869n0148
60844A711336m4899m0127l7219l5993l4856l2773l0088k7443k4850k1998j8963
$$ plain form
60833 1362127 1345728 1330723 1316158 1302527 1291725 1285222 1282433 1281397 1280833 1280860 1281822 1283292 1284464 1284849
60819 1284849 1284282 1282891 1281399 1280864 1281505 1282196 1281741 1280380 1279311 1278801 1277581 1274422 1269666 1264647 1260085
60804 1260085 1255701 1251227 1247047 1243786 1241912 1241809 1243530 1246193 1248393 1249750 1251387 1254238 1257557 1260091
60790 1260091 1262303 1266295 1273525 1283668 1295830 1309784 1325503 1342373 1359622 1377037 1394596 1411722
60778 1411722 1427566 1441960 1455588 1469168 1482719 1495695 1507579 1518251 1527849 1536408 1543846 1550351
60766 1550351 1556614 1563535 1571806 1581744 1593064 1604554 1614523 1622166 1628270 1634108 1639867 1644696 1647981
60753 1647981 1649946 1651101 1651797 1652158 1651852 1650052 1646349 1641539 1636717 1631627 1624752 1615140 1603346 1590469
60739 1590469 1577140 1563777 1551090 1539815 1530259 1522218 1514936 1507335 1499004 1490952 1484686 1480569 1477887
$$ packed form
60833A362127j6399j5005j4565j3631j0802o503k789j036n64K7R62J470J172L85
60819A284849n67j391j492n35O41O91m55j361j069n10j220l159m756n019m562
60804A260085m384m474m180l261j874j03J721K663K200J357J637K851L319K534
60790A260091K212L992P230J0143J2162J3954J5719J6870J7249J7415J7559J7126
60778A411722J5844J4394J3628J3580J3551J2976J1884J0672R598Q559P438O505
60766A550351O263O921Q271R938J1320J1490R969P643O104N838N759M829L285
60753A647981J965J155O96L61l06j800l703m810m822n090o875r612j1794j2877
60739A590469j3329j3363j2687j1275r556q041p282p601q331q052o266m117k682
$$ plain form
60726 1477887 1476405 1476797 1479419 1483887 1490188 1498996 1510234 1522375 1533986 1545283 1557571 1571933 1589038
60713 1589038 1609287 1632172 1656194 1680328 1705032 1730998 1757522 1783266 1808194 1833476 1859445
60702 1859445 1884646 1907154 1926055 1941462 1953852 1963810 1971846 1977880 1981161 1981187 1978738 1975532 1972663
60689 1972663 1969691 1965758 1961332 1958061 1956684 1955907 1953952 1950463 1946070 1940823 1934352 1927212 1920461 1913757
60675 1913757 1905397 1894869 1884140 1875577 1869347 1863598 1856498 1847495 1837172 1826586 1816430 1806568 1796797
60662 1796797 1788066 1781994 1778866 1777079 1775122 1773207 1772411 1773136 1775103 1777951 1781026 1783338 1784500 1784985 1784721
60647 1784721 1782305 1776563 1768109 1758331 1747568 1735405 1722146 1708592 1694723 1680027 1665128 1651828
60635 1651828 1641252 1632798 1625148 1617586 1610161 1603073 1596103 1588441 1579243 1568658 1557894 1547836 1538079
$$ packed form
60726A477887j482L92K622M468O301Q808J1238J2141J1611J1297J2288J4362J7105
60713A589038K0249K2885K4022K4134K4704K5966K6524K5744K4928K5282K5969
60702A859445K5201K2508J8901J5407J2390R958Q036O034L281K6k449l206k869
60689A972663k972l933m426l271j377p77j955l489m393n247o471p140o751o704
60675A913757q360j0528j0729q563o230n749p100r003j0323j0586j0156r862r771
60662A796797q731o072l128j787j957j915p96P25J967K848L075K312J162M85k64
60647A784721k416n742q454r778j0763j2163j3259j3554j3869j4696j4899j3300
60635A651828j0576q454p650p562p425p088o970p662r198j0585j0764j0058r757
$$ plain form
60622 1538079 1527857 1517279 1506789 1495935 1483696 1469908 1455482 1441362 1428030 1415775 1404596
60611 1404596 1393956 1383418 1373266 1363751 1354209 1344115 1334767 1328492 1325852 1324825 1323212 1320908 1319265
60598 1319265 1319101 1320037 1321267 1322259 1322886 1323306 1323674 1323948 1324172 1324771 1326051 1327491 1328209 1328268 1328833 1330856 1334220
60581 1334220 1338371 1343059 1348043 1352810 1357272 1362155 1367946 1373851 1378790 1383307 1389485 1398663 1410076 1422256
60567 1422256 1435101 1449803 1467145 1486755 1507918 1530257 1553575 1577844 1603561 1631283 1660553
60556 1660553 1690228 1720410 1752882 1788574 1825418 1859967 1890638 1918234 1943900 1968152 1991558
60545 1991558 2014398 2035253 2051393 2060997 2063799 2059472 2047181 2027428 2002749 1975668 1947141 1917736
60533 1917736 1888879 1861792 1836331 1811914 1788614 1766577 1745707 1726890 1712000 1701295 1692255
$$ packed form
60622A538079j0222j0578j0490j0854j2239j3788j4426j4120j3332j2255j1179
60611A404596j0640j0538j0152r515r542j0094r348o275k640j027j613k304j643
60598A319265j64R36J230R92O27M20L68K74K24N99J280J440P18N9N65K023L364
60581A334220M151M688M984M767M462M883N791N905M939M517O178R178J1413J2180
60567A422256J2845J4702J7342J9610K1163K2339K3318K4269K5717K7722K9270
60556A660553K9675L0182L2472L5692L6844L4549L0671K7596K5666K4252K3406
60545A991558K2840K0855J6140R604K802m327j2291j9753k4679k7081k8527k9405
60533A917736k8857k7087k5461k4417k3300k2037k0870j8817j4890j0705r040
$$ plain form
60522 1692255 1682605 1673243 1666312 1661656 1657387 1653015 1649419 1646065 1640949 1633634 1626126 1620088 1615076 1610247
60508 1610247 1606144 1603851 1603646 1605309 1608781 1613907 1620420 1628634 1639246 1651995 1665529 1679070 1693364
60495 1693364 1709523 1727785 1747740 1768787 1789894 1809970 1829299 1849822 1873200 1899135 1926301
60484 1926301 1954447 1984775 2018541 2055990 2096723 2140611 2188077 2239516 2294425 2351169 2407542
60473 2407542 2461176 2509221 2548146 2574582 2586405 2582953 2564947 2534966 2497470 2457178 2417203
60462 2417203 2379146 2344412 2314434 2289978 2271537 2260464 2258555 2266266 2282225 2304643 2332281 2363969
60450 2363969 2398439 2435176 2474633 2517214 2562830 2611805 2665389 2725008 2791915 2868035 2956170
60439 2956170 3058483 3175417 3307137 3455732 3625068 3818250 4035807 4276597 4540114
$$ packed form
60522A692255r650r362o931m656m269m372l596l354n116p315p508o038n012m829
60508A610247m103k293k05J663L472N126O513Q214J0612J2749J3534J3541J4294
60495A693364J6159J8262J9955K1047K1107K0076J9329K0523K3378K5935K7166
60484A926301K8146L0328L3766L7449M0733M3888M7466N1439N4909N6744N6373
60473B407542N3634M8045L8925K6436J1823l452j8006k9981l7496m0292l9975
60462B417203l8057l4734k9978k4456j8441j1073j909P711J5959K2418K7638L1688
60450B363969L4470L6737L9457M2581M5616M8975N3584N9619O6907P6120Q8135
60439B956170J02313J16934J31720J48595J69336J93182K17557K40790K63517
$$ plain form
60430 4540114 4827325 5139226 5475235 5833938 6215477 6622342 7057107 7519244 8002965
60421 8002965 8495275 8973896 9408024 9764018 10012672 10133065 10113216 9951263 9657419 9253073
60411 9253073 8766160 8226229 7661405 7096002 6548241 6029784 5547473 5104970 4703245
60402 4703245 4341272 4017304 3729107 3473198 3245254 3041852 2860957 2700544 2557951
60393 2557951 2430960 2318277 2218318 2128668 2047414 1973985 1907886 1847578 1791404 1738755 1689449
60382 1689449 1642686 1597561 1554087 1512914 1474481 1439087 1407232 1379092 1353920 1330585 1308518
60371 1308518 1287811 1268816 1252006 1237762 1225784 1214939 1203947 1191986 1178775 1164803 1151637
60360 1151637 1141202 1134244 1129948 1127054 1124704 1122233 1119269 1116383 1114651 1114196 1114125 1114354 1116223 1120599 1126426
$$ packed form
60430D540114K87211L11901L36009L58703L81539M06865M34765M62137M83721
60421H002965M92310M78621M34128L55994K48654J20393j9849j61953k93844m04346
60411I253073m86913n39931n64824n65403n47761n18457m82311m42503m01725
60402D703245l61973l23968k88197k55909k27944k03402j80895j60413j42593
60393B557951j26991j12683r9959q9650q1254p3429o6099o0308n6174n2649m9306
60382A689449m6763m5125m3474m1173l8433l5394l1855k8140k5172k3335k2067
60371A308518k0707j8995j6810j4244j1978j0845j0992j1961j3211j3972j3166
60360A151637j0435o958m296k894k350k471k964k886j732m55p1K29J869M376N827
$$ plain form
60345 1126426 1132074 1137151 1141980 1146146 1148877 1150464 1152065 1154214 1156565 1159131 1162911 1168924 1177035 1185990
60331 1185990 1194448 1201939 1208824 1215467 1221739 1227477 1232812 1237539 1240770 1242110 1242580 1243113 1242574 1238897 1232209
60316 1232209 1225104 1219617 1215676 1212896 1211816 1212337 1212710 1211476 1209106 1206588 1203874 1201179 1200406 1203345 1209148
60301 1209148 1215215 1220079 1224066 1227836 1231875 1237051 1244163 1253021 1262968 1273885 1285725 1297778 1309677
60288 1309677 1322403 1336731 1351257 1363715 1373937 1383655 1393396 1401498 1406660 1409841 1412865 1416278 1419300
60275 1419300 1421073 1421405 1420908 1420782 1421884 1423824 1425647 1427544 1431190 1438116 1448252 1460040 1471410 1480650
60261 1480650 1487124 1491382 1494147 1495240 1493963 1490309 1485067 1478913 1472220 1465627 1459849 1454852 1450054 1445509
60247 1445509 1442000 1439814 1438268 1436791 1435724 1435694 1436836 1439016 1442235 1446297 1450418 1453691 1455955 1458106
$$ packed form
60345A126426N648N077M829M166K731J587J601K149K351K566L780O013Q111Q955
60331A185990Q458P491O885O643O272N738N335M727L231J340M70N33n39l677o688
60316A232209p105n487l941k780j080N21L73j234k370k518k714k695p73K939N803
60301A209148O067M864L987L770M039N176P112Q858R947J0917J1840J2053J1899
60288A309677J2726J4328J4526J2458J0222R718R741Q102N162L181L024L413L022
60275A419300J773L32m97j26J102J940J823J897L646O926J0136J1788J1370R240
60261A480650O474M258K765J093j277l654n242o154o693o593n778m997m798m545
60247A445509l509k186j546j477j067l0J142K180L219M062M121L273K264K151
$$ plain form
60233 1458106 1461548 1467178 1474626 1482595 1490175 1497619 1505672 1514613 1524441 1535392 1547489 1559960 1572135
60220 1572135 1584790 1599474 1616350 1633689 1649948 1665540 1681950 1699733 1718098 1736325 1755034
60209 1755034 1775937 1800455 1828656 1859532 1892276 1927079 1964664 2005548 2050058 2098601 2151287
60198 2151287 2207485 2266474 2328634 2395594 2469096 2549838 2637248 2730220 2828428 2933241 3046985
60187 3046985 3170941 3304566 3447208 3599906 3764612 3941988 4130916 4329987 4538375
60178 4538375 4755163 4978758 5207227 5438387 5669214 5895846 6114660 6322935 6518157
60169 6518157 6697031 6855726 6991256 7102691 7190997 7257412 7301782 7322945 7321218 7300121 7265014
60158 7265014 7220199 7168005 7110478 7051063 6994405 6945163 6907293 6883918 6877322 6889013 6919920
$$ packed form
60233A458106L442N630P448P969P580P444Q053Q941R828J0951J2097J2471J2175
60220A572135J2655J4684J6876J7339J6259J5592J6410J7783J8365J8227J8709
60209A755034K0903K4518K8201L0876L2744L4803L7585M0884M4510M8543N2686
60198B151287N6198N8989O2160O6960P3502Q0742Q7410R2972R8208J04813J13744
60187C046985J23956J33625J42642J52698J64706J77376J88928J99071K08388
60178D538375K16788K23595K28469K31160K30827K26632K18814K08275J95222
60169F518157J78874J58695J35530J11435Q8306O6415M4370K1163j727k1097l5107
60158G265014m4815n2194n7527n9415n6658m9242l7870k3375o596J1691L0907
$$ plain form
60147 6919920 6970660 7041834 7134161 7248021 7382712 7536481 7707394 7893669 8092890 8301553
60137 8301553 8515788 8731776 8944762 9148410 9336208 9503391 9646930 9764307 9853356 9912827
60127 9912827 9941881 9939175 9903773 9837247 9743914 9628753 9495910 9349403 9194368 9037106
60117 9037106 8884213 8741639 8613825 8503419 8412111 8341680 8293942 8270118 8270967 8297106 8348151
60106 8348151 8421679 8514121 8622698 8745391 8878937 9018070 9157200 9291907 9418406 9532671
60096 9532671 9631023 9711186 9772339 9814683 9839582 9849854 9849509 9843148 9835376 9830217 9831162 9842426 9870035
60083 9870035 9920607 9998550 10105045 10240052 10404619 10600987 10831324 11097104 11399360 11739098
60073 11739098 12117785 12537632 13000752 13507533 14056089 14643466 15266678 15921959 16603506
$$ packed form
60147F919920N0740P1174R2327J13860J34691J53769J70913J86275J99221K08663
60137H301553K14235K15988K12986K03648J87798J67183J43539J17377Q9049N9471
60127I912827K9054k706l5402o6526r3333j15161j32843j46507j55035j57262
60117I037106j52893j42574j27814j10406r1308p0431m7738k3824Q49K6139N1045
60106H348151P3528R2442J08577J22693J33546J39133J39130J34707J26499J14265
60096I532671R8352Q0163O1153M2344K4899J0272l45o361p772n159R45J1264K7609
60083I870035N0572P7943J06495J35007J64567J96368K30337K65780L02256L39738
60073A1739098L78687M19847M63120N06781N48556N87377O23212O55281O81547
$$ plain form
60064 16603506 17303589 18013626 18724442 19425587 20105099 20750452 21349865 21892870 22369959
60055 22369959 22772082 23090883 23319636 23453833 23490883 23429736 23271376 23019548 22680747 22263820
60045 22263820 21780117 21243586 20669738 20074123 19471873 18877953 18306433 17768836 17273489
60036 17273489 16826461 16432638 16095936 15819199 15604021 15450088 15354580 15312841 15319728 15369752
60026 15369752 15455958 15569709 15702028 15844489 15988389 16123837 16240648 16330341 16387239 16408075
60016 16408075 16390965 16334742 16239097 16105192 15935678 15733651 15501663 15242122 14958336 14654500
60006 14654500 14334773 14003089 13663955 13322714 12984820 12655374 12339449 12042109 11767608
59997 11767608 11518787 11297461 11105327 10944465 10817066 10724465 10666366 10641529 10649495 10690869
$$ packed form
60064A6603506P00083P10037P10816P01145O79512O45353N99413N43005M77089
60055B2369959M02123L18801K28753J34197L7050o1147j58360k51828l38801m16927
60045B2263820m83703n36531n73848n95615o02250n93920n71520n37597m95347
60036A7273489m47028l93823l36702k76737k15178j53933r5508m1739O887N0024
60026A5369752Q6206J13751J32319J42461J43900J35448J16811Q9693N6898K0836
60016A6408075j7110n6223r5645j33905j69514k02027k31988k59541k83786l03836
60006A4654500l19727l31684l39134l41241l37894l29446l15925k97340k74501
59997A1767608k48821k21326j92134j60862j27399r2601n8099k4837P966M1374
$$ plain form
59987 10690869 10765326 10870264 11002388 11159618 11339705 11537453 11745220 11956206 12165387
59978 12165387 12366868 12552305 12713012 12842483 12936234 12990838 13004408 12977010 12909279 12801259
59968 12801259 12653706 12470059 12256291 12019421 11766893 11506469 11245210 10988517 10740887
59959 10740887 10507212 10292473 10100472 9933794 9794724 9685222 9606087 9557250 9539241 9553655
59949 9553655 9601992 9684702 9801756 9953422 10139637 10358635 10606804 10880123 11175214 11488321
59939 11488321 11813385 12141755 12463866 12770586 13052996 13302526 13512797 13680816 13805030
59930 13805030 13882579 13909981 13886463 13815027 13699856 13544239 13351804 13128602 12882972 12624192
59920 12624192 12361869 12105547 11863518 11642119 11446541 11281503 11150377 11054287 10993013 10966392
$$ packed form
59987A0690869P4457J04938J32124J57230J80087J97748K07767K10986K09181
59978A2165387K01481J85437J60707J29471R3751N4604J3570k7398o7731j08020
59968A2801259j47553j83647k13768k36870k52528k60424k61259k56693k47630
59959A0740887k33675k14739j92001j66678j39070j09502p9135m8837j8009J4414
59949I553655M8337Q2710J17054J51666J86215K18998K48169K73319K95091L13107
59939A1488321L25064L28370L22111L06720K82410K49530K10271J68019J24214
59930A3805030P7549K7402k3518p1436j15171j55617j92435k23202k45630k58780
59920A2624192k62323k56322k42029k21399j95578j65038j31126r6090o1274k6621
$$ plain form
59910 10966392 10974307 11015896 11089594 11193440 11324588 11478963 11652295 11841271 12043076 12254156
59900 12254156 12470066 12686129 12897576 13099659 13288784 13463516 13623761 13769161 13899061
59891 13899061 14013897 14115634 14206812 14290148 14369381 14449765 14537251 14637716 14757282 14902769
59881 14902769 15080924 15297219 15555884 15861166 16217830 16629725 17097936 17620851 18195978
59872 18195978 18820921 19491938 20201785 20939025 21688490 22431380 23145380 23806213 24390009
59863 24390009 24874513 25239265 25466856 25545638 25471839 25249952 24892259 24417761 23849657 23211926
59853 23211926 22527170 21816309 21098426 20390149 19705705 19057594 18456214 17908601 17418618
59844 17418618 16988879 16621684 16318123 16077907 15900915 15787705 15737546 15746909 15810841 15924857
$$ packed form
59910A0966392P915M1589P3698J03846J31148J54375J73332J88976K01805K11080
59900A2254156K15910K16063K11447K02083J89125J74732J60245J45400J29900
59891A3899061J14836J01737R1178Q3336P9233Q0384Q7486J00465J19566J45487
59881A4902769J78155K16295K58665L05282L56664M11895M68211N22915N75127
59872A8195978O24943O71017P09847P37240P49465P42890P14000O60833N83796
59863B4390009M84504L64752K27591P8782p3799k21887l57693m74498n68104o37731
59853B3211926o84756p10861p17883p08277o84444o48111o01380n47613m89983
59844A7418618m29739l67195l03561k40216j76992j13210n0159R363O3932J14016
$$ plain form
59834 15924857 16084388 16283195 16513511 16766965 17033870 17301849 17556368 17782781 17967215
59825 17967215 18096059 18156175 18136554 18030075 17834528 17552913 17192637 16763618 16276821 15744446
59815 15744446 15180452 14599547 14015143 13438070 12876433 12335964 11820831 11334849 10881783
59806 10881783 10464194 10082526 9735928 9423635 9145006 8898644 8682130 8492406 8326085
59797 8326085 8179780 8050490 7935188 7829853 7729956 7632675 7537945 7446658 7358816 7274399
59787 7274399 7194992 7122786 7058195 6999878 6946905 6899399 6856633 6815632 6772165 6722514 6664179
59776 6664179 6595938 6517935 6431551 6338945 6242937 6147110 6055356 5970889 5895748 5831067 5777466
59765 5777466 5735193 5704123 5683605 5672275 5668525 5671572 5681983 5701167 5730769 5772534 5827699 5895823
$$ packed form
59834A5924857J59531J98807K30316K53454K66905K67979K54519K26413J84434
59825A7967215J28844O0116j9621j06479j95547k81615l60276m29019m86797n32375
59815A5744446n63994n80905n84404n77073n61637n40469n15133m85982m53066
59806A0881783m17589l81668l46598l12293k78629k46362k16514j89724j66321
59797H326085j46305j29290j15302j05335r9897r7281r4730r1287q7842q4417
59787G274399p9407p2206o4591n8317n2973m7506m2766m1001m3467m9651n8335
59776F664179o8241p8003q6384r2606r6008r5827r1754q4467p5141o4681n3601
59765E777466m2273l1070k0518j1330l750L047J0411J9184K9602M1765N5165O8124
$$ plain form
59753 5895823 5974728 6062177 6157108 6258790 6365622 6475677 6587878 6701590 6815301 6926527
59743 6926527 7032850 7132424 7223754 7305712 7377672 7439344 7491055 7534790 7574322 7613578 7655463
59732 7655463 7702906 7760003 7830862 7917846 8022325 8146678 8294213 8467462 8668250 8899430
59722 8899430 9165010 9468176 9810524 10193624 10620077 11092282 11610997 12175414 12783384
59713 12783384 13430075 14105890 14794854 15473172 16108205 16660182 17088613 17361710 17464499
59704 17464499 17401751 17194757 16874128 16472671 16021071 15546156 15070131 14610379 14180171
59695 14180171 13789521 13445231 13150788 12907293 12714694 12571890 12476315 12424692 12414568 12444745
59685 12444745 12514533 12623466 12771806 12960352 13189427 13458652 13767984 14118378 14511175
$$ packed form
59753E895823P8905Q7449R4931J01682J06832J10055J12201J13712J13711J11226
59743F926527J06323R9574R1330Q1958P1960O1672N1711M3735L9532L9256M1885
59732G655463M7443N7097P0859Q6984J04479J24353J47535J73249K00788K31180
59722H899430K65580L03166L42348L83100M26453M72205N18715N64417O07970
59713A2783384O46691O75815O88964O78318O35033N51977M28431K73097J02789
59704A7464499o2748k06994l20629m01457m51600m74915m76025m59752m30208
59695A4180171l90650l44290k94443k43495j92599j42804r5575n1623j0124L0177
59685A2444745O9788J08933J48340J88546K29075K69225L09332L50394L92797
$$ plain form
59676 14511175 14947472 15428594 15956881 16535542 17167779 17856244 18603348 19411917 20285216
59667 20285216 21226041 22235797 23314838 24463476 25681523 26966035 28309739 29702033
59659 29702033 31130849 32582705 34041473 35488683 36906324 38280331 39602752 40872036
59651 40872036 42091900 43269759 44415840 45542763 46664197 47792108 48934093 50091984
59643 50091984 51261123 52429850 53579937 54688245 55728431 56672522 57493814 58170857
59635 58170857 58689743 59043770 59233286 59267373 59164570 58950167 58652530 58301837 57929975
59626 57929975 57568720 57247085 56990622 56822210 56761824 56825666 57026540 57374919 57878756 58542734
59616 58542734 59368563 60355299 61497996 62786067 64203192 65727007 67326353 68958426
$$ packed form
59676A4511175M36297M81122N28287N78661O32237O88465P47104Q08569Q73299
59667B0285216R40825J009756J079041J148638J218047J284512J343704J392294
59659B9702033J428816J451856J458768J447210J417641J374007J322421J269284
59651D0872036J219864J177859J146081J126923J121434J127911J141985J157891
59643E0091984J169139J168727J150087J108308J040186R44091Q21292O77043
59635E8170857N18886L54027J89516L4087j02803k14403k97637l50693l71862
59626E7929975l61255l21635k56463j68412o0386O3842K00874L48379N03837O63978
59616E8542734Q25829R86736J142697J288071J417125J523815J599346J632073
$$ plain form
59608 68958426 70569341 72096738 73471138 74617655 75462202 75940996 76008032 75639017 74834334
59599 74834334 73620608 72047190 70177912 68083408 65836420 63507512 61159893 58845950
59591 58845950 56606697 54471746 52458418 50571429 48803353 47134261 45531896 43956501
59583 43956501 42370224 40745563 39069029 37341700 35578527 33804921 32050103 30340608
59575 30340608 28697130 27134103 25660363 24280685 22997579 21811632 20720701 19720328
59567 19720328 18805583 17971743 17213190 16523212 15895608 15325567 14808631 14340028 13915612
59558 13915612 13532284 13186709 12874461 12591053 12332976 12097124 11879946 11677557 11485911
59549 11485911 11300481 11116707 10931279 10742413 10548851 10349605 10144846 9935856 9723713
$$ packed form
59608F8958426J610915J527397J374400J146517Q44547M78794O7036l69015q04683
59599G4834334j213726j573418j869278k094504k246988k328908k347619k313943
59591E8845950k239253k134951k013328j886989j768076j669092j602365j575395
59583D3956501j586277j624661j676534j727329j763173j773606j754818j709495
59575C0340608j643478j563027j473740j379678j283106j185947j090931j000373
59567A9720328r14745q33840p58553o89978o27604n70041n16936m68603m24416
59558A3915612l83328l45575l12248k83408k58077k35852k17178k02389j91646
59549A1485911j85430j83774j85428j88866j93562j99246k04759k08990k12143
$$ plain form
59540 9723713 9509105 9293695 9080495 8872531 8672320 8482868 8307562 8148181 8004149
59531 8004149 7874473 7759385 7659517 7574719 7504467 7448434 7406006 7376337 7359502 7356386 7366647
59520 7366647 7387965 7418148 7456938 7504948 7561930 7626978 7699302 7777828 7861079 7948648 8042107
59509 8042107 8143647 8254612 8376053 8509661 8657100 8819186 8996554 9190440 9402105
59500 9402105 9632481 9883199 10156930 10455786 10780287 11130639 11507842 11912501 12343827
59491 12343827 12801159 13285417 13797384 14335075 14893925 15468717 16053845 16642423 17227002
59482 17227002 17801233 18359643 18896059 19403720 19877310 20314145 20713281 21073961 21394749
59473 21394749 21673665 21909549 22103931 22261490 22388615 22492163 22579717 22659606 22739497 22825358
$$ packed form
59540I723713k14608k15410k13200k07964k00211j89452j75306j59381j44032
59531H004149j29676j15088r9868q4798p0252n6033m2428k9669j6835l116J0261
59520G366647K1318L0183L8790M8010N6982O5048P2324P8526Q3251Q7569R3459
59509H042107J01540J10965J21441J33608J47439J62086J77368J93886K11665
59500I402105K30376K50718K73731K98856L24501L50352L77203M04659M31326
59491A2343827M57332M84258N11967N37691N58850N74792N85128N88578N84579
59482A7227002N74231N58410N36416N07661M73590M36835L99136L60680L20788
59473B1394749K78916K35884J94382J57559J27125J03548Q7554P9889P9891Q5861
$$ plain form
59463 22825358 22922112 23033950 23162728 23306565 23460417 23616628 23763781 23886509 23968559 23996083
59453 23996083 23957400 23841277 23638101 23343077 22957034 22484460 21932346 21310898 20633602
59444 20633602 19915538 19171645 18415986 17661405 16919501 16201023 15515573 14870080 14268150
59435 14268150 13711848 13203539 12744994 12335484 11972318 11653198 11376954 11142293 10947179
59426 10947179 10789563 10667785 10580360 10526249 10505288 10517719 10563593 10643079 10756475 10902989
59416 10902989 11080690 11289062 11530549 11807521 12118155 12457360 12821419 13209176 13618125
59407 13618125 14041506 14470103 14894828 15305966 15691175 16036082 16326957 16552465 16703701
59398 16703701 16773675 16756997 16650298 16453907 16173631 15820271 15406660 14944991 14446367 13921472
$$ packed form
59463B2825358R6754J11838J28778J43837J53852J56211J47153J22728Q2050K7524
59453B3996083l8683j16123k03176k95024l86043m72574n52114o21448o77296
59444B0633602p18064p43893p55659p54581p41904p18478o85450o45493o01930
59435A4268150n56302n08309m58545m09510l63166l19120k76244k34661j95114
59426A0947179j57616j21778q7425n4111k0961J2431M5874P9486J13396J46514
59416A0902989J77701K08372K41487K76972L10634L39205L64059L87757M08949
59407A3618125M23381M28597M24725M11138L85209L44907K90875K25508J51236
59398A6703701O9974j6678j06699j96391k80276l53360m13611m61669m98624n24895
$$ plain form
59388 13921472 13380789 12834551 12292685 11764023 11254912 10768875 10307822 9873129 9465433
59379 9465433 9084435 8729775 8401831 8101001 7826500 7576554 7349794 7145980 6965219
59370 6965219 6806799 6668969 6549587 6446767 6359094 6285665 6226176 6180667 6148843 6129708
59360 6129708 6122080 6125193 6138388 6160511 6190356 6227614 6272691 6325752 6386950 6457443 6538625 6629440
59348 6629440 6725424 6821288 6914158 7004390 7094892 7190797 7298497 7423048 7566542 7729858
59338 7729858 7915274 8125897 8362543 8622394 8901029 9195573 9506735 9839312 10200894
59329 10200894 10599047 11039173 11524818 12059020 12644357 13282469 13975003 14724845 15534938
59320 15534938 16405388 17332402 18309849 19330524 20385276 21461524 22543141 23611820
$$ packed form
59388A3921472n40683n46238n41866n28662n09111m86037m61053m34693m07696
59379I465433l80998l54660l27944l00830k74501k49946k26760k03814j80761
59370F965219j58420j37830j19382j02820q7673p3429n9489m5509l1824j9135
59360F129708p628L113J3195K2123K9845L7258M5077N3061O1198P0493Q1182R0815
59348F629440R5984R5864R2870R0232R0502R5905J07700J24551J43494J63316
59338G729858J85416K10623K36646K59851K78635K94544L11162L32577L61582
59329A0200894L98153M40126M85645N34202N85337O38112O92534P49842Q10093
59320A5534938Q70450R27014R77447J020675J054752J076248J081617J068679
$$ plain form
59312 23611820 24649170 25638817 26567544 27425139 28204218 28901023 29515885 30051669 30511320
59303 30511320 30896950 31210373 31452996 31624659 31723109 31744909 31686710 31546019 31321577 31013613
59293 31013613 30624194 30158047 29623239 29030365 28390316 27712737 27005922 26276438 25527894
59284 25527894 24761143 23976756 23176615 22362633 21535605 20697273 19853078 19011468 18180894
59275 18180894 17368518 16580841 15823558 15100773 14415615 13771267 13169955 12611219 12092809
59266 12092809 11613301 11172614 10770272 10404770 10074525 9777937 9512537 9275679 9066028
59257 9066028 8882765 8723351 8584028 8462914 8360681 8277503 8211054 8158520 8119172 8093949
59247 8093949 8083624 8088341 8108023 8142212 8190069 8251021 8324660 8409627 8503667 8605380 8715019
$$ packed form
59312B3611820J037350R89647R28727Q57595P79079O96805O14862N35784M59651
59303C0511320L85630L13423K42623J71663R8450K1800n8199j40691k24442l07964
59293C1013613l89419m66147n34808n92874o40049o77579p06815p29484p48544
59284B5527894p66751p84387q00141q13982q27028q38332q44195q41610q30574
59275A8180894q12376p87677p57283p22785o85158o44348o01312n58736n18410
59266A2092809m79508m40687m02342l65502l30245k96588k65400k36858k09651
59257I066028j83263j59414j39323j21114j02233q3178o6449n2534l9348k5223
59247H093949j0325M717J9682L4189M7857O0952P3639Q4967R4040J01713J09639
$$ plain form
59236 8715019 8832914 8957974 9088289 9222252 9358368 9494991 9631293 9767914 9905742
59227 9905742 10044583 10183937 10324696 10469211 10619834 10778022 10944703 11120777 11307003
59218 11307003 11503628 11710159 11925344 12147232 12372889 12597740 12815383 13018510 13199838
59209 13199838 13351782 13465868 13534058 13551607 13518724 13439661 13320686 13168549 12989562 12789269
59199 12789269 12573050 12347102 12118613 11895117 11683859 11491024 11320434 11172965 11048059
59190 11048059 10945864 10867262 10812177 10779202 10767156 10775983 10805494 10853868 10917931 10994732 11082992
59179 11082992 11183685 11299270 11431799 11581710 11748982 11935196 12143724 12378090 12641131
59170 12641131 12935702 13265009 13631640 14036715 14480038 14960350 15475203 16020839 16591561
$$ packed form
59236H715019J17895J25060J30315J33963J36116J36623J36302J36621J37828
59227I905742J38841J39354J40759J44515J50623J58188J66681J76074J86226
59218A1307003J96625K06531K15185K21888K25657K24851K17643K03127J81328
59209A3199838J51944J14086O8190J7549l2883p9063j18975j52137j78987k00293
59199A2789269k16219k25948k28489k23496k11258j92835j70590j47469j24906
59190A1048059j02195p8602n5085l2975j2046Q827K9511M8374O4063P6801Q8260
59179A1082992J00693J15585J32529J49911J67272J86214K08528K34366K63041
59170A2641131K94571L29307L66631M05075M43323M80312N14853N45636N70722
$$ plain form
59161 16591561 17177859 17764806 18333041 18861724 19330507 19719776 20011182 20189212 20242369
59152 20242369 20163436 19950065 19605757 19139914 18566972 17905682 17177920 16405711 15608170
59143 15608170 14801373 14000435 13219771 12470772 11760388 11092545 10469915 9893848 9363799
59134 9363799 8877860 8433577 8027998 7657790 7319885 7011794 6731176 6475582 6242631
59125 6242631 6029874 5834611 5654604 5488920 5337359 5199189 5073235 4958878 4855826
59116 4855826 4762922 4678314 4600938 4530961 4468799 4414596 4368521 4330575 4300284 4277631 4263814
59105 4263814 4259653 4263533 4272615 4286067 4305500 4332319 4366467 4407867 4456880 4512665 4573053 4637038
59093 4637038 4705911 4781107 4862427 4949267 5042147 5141818 5247855 5359003 5474121 5592243
$$ packed form
59161A6591561N86298N86947N68235N28683M68783L89269K91406J78030N3157
59152B0242369p8933k13371l44308m65843n72942o61290p27762p72209p97541
59143A5608170q06797q00938p80664p48999p10384o67843o22630n76067n30049
59134I363799m85939m44283m05579l70208l37905l08091k80618k55594k32951
59125F242631k12757j95263j80007j65684j51561j38170j25954j14357j03052
59116D855826r2904q4608p7376o9977o2162n4203m6075l7946l0291k2653j3817
59105D263814m161L880R082J3452J9433K6819L4148M1400M9013N5785O0388O3985
59093D637038O8873P5196Q1320Q6840R2880R9671J06037J11148J15118J18122
$$ plain form
59083 5592243 5712723 5835786 5961841 6089871 6217605 6343389 6466385 6584820 6696103
59074 6696103 6799332 6895661 6985312 7066338 7137622 7201206 7260196 7316235 7370702 7426456 7486126
59063 7486126 7549929 7617596 7691781 7777419 7878097 7994923 8128580 8280598 8452497 8645174
59053 8645174 8859359 9095582 9353669 9633113 9933764 10255173 10595413 10951198 11318620
59044 11318620 11692660 12066043 12429234 12771251 13079946 13342269 13545728 13680319 13739698
59035 13739698 13721955 13630171 13471368 13253856 12985909 12677139 12339450 11984795 11622050 11256672
59025 11256672 10892411 10532247 10178474 9833277 9498795 9175598 8861861 8555396 8256061
59016 8256061 7964990 7682262 7407060 7139663 6881252 6631573 6388751 6152253 5924534
$$ packed form
59083E592243J20480J23063J26055J28030J27734J25784J22996J18435J11283
59074F696103J03229R6329Q9651Q1026P1284O3584N8990N6039N4467N5754N9670
59063G486126O3803O7667P4185Q5638J00678J16826J33657J52018J71899J92677
59053H645174K14185K36223K58087K79444L00651L21409L40240L55785L67422
59044A1318620L74040L73383L63191L42017L08695K62323K03459J34591N9379
59035A3739698j7743r1784j58803k17512k67947l08770l37689l54655l62745l65378
59025A1256672l64261l60164l53773l45197l34482l23197l13737l06465k99335
59016H256061k91071k82728k75202k67397k58411k49679k42822k36498k27719
$$ plain form
59007 5924534 5708628 5504950 5311563 5127179 4952768 4790045 4639143 4498390 4366286
58998 4366286 4243092 4130127 4027761 3934593 3848440 3767688 3691811 3621149 3556168 3496297 3439457
58987 3439457 3383178 3326066 3267699 3207610 3145450 3081843 3017891 2953931 2890070 2827724 2769082
58976 2769082 2714939 2664665 2618403 2577430 2541955 2510655 2483167 2460938 2444452 2431628 2420538
58965 2420538 2411986 2407598 2406729 2407103 2407446 2407704 2407667 2407267 2407471 2408971 2410576 2410667 2409759 2409829 2411570 2414241 2418080
58948 2418080 2424714 2434616 2445942 2456843 2467933 2481472 2498578 2517962 2537349 2555614 2573250 2590929
58936 2590929 2608420 2625519 2643281 2662958 2683934 2704269 2723499 2743266 2764819 2787705 2811657
58925 2811657 2837843 2866968 2897748 2928803 2960727 2994791 3030855 3068149 3106993 3147950 3190146
$$ packed form
59007E924534k15906k03678j93387j84384j74411j62723j50902j40753j32104
58998D366286j23194j12965j02366r3168q6153q0752p5877p0662o4981n9871n6840
58987C439457n6279n7112n8367o0089o2160o3607o3952o3960o3861o2346n8642
58976B769082n4143n0274m6262m0973l5475l1300k7488k2229j6486j2824j1090
58965B420538q552m388q69L74L43K58l7m00K04J500J605R1r08P0J741K671L839
58948B418080O634R902J1326J0901J1090J3539J7106J9384J9387J8265J7636J7679
58936B590929J7491J7099J7762J9677K0976K0335J9230J9767K1553K2886K3952
58925B811657K6186K9125L0780L1055L1924L4064L6064L7294L8844M0957M2196
$$ plain form
58914 3190146 3232227 3274571 3319143 3367693 3421226 3480301 3544334 3611366 3680039 3751215 3826397
58903 3826397 3905448 3987395 4072523 4161870 4255324 4352051 4452171 4556007 4662150 4768405
58893 4768405 4874804 4984015 5098732 5220054 5348237 5483345 5625129 5773894 5931723
58884 5931723 6101528 6284694 6480863 6690010 6913498 7153016 7409874 7685644 7982387
58875 7982387 8301739 8644369 9010540 9400794 9816455 10260166 10735677 11246435 11794600
58866 11794600 12381825 13010307 13682502 14400778 15168288 15989321 16867684 17805443 18804026
58857 18804026 19865303 20989986 22175693 23417850 24711513 26050312 27423662 28816013
58849 28816013 30207988 31576498 32893970 34128809 35246735 36211755 36988389 37546531
$$ packed form
58914C190146M2081M2344M4572M8550N3533N9075O4033O7032O8673P1176P5182
58903C826397P9051Q1947Q5128Q9347R3454R6727J00120J03836J06143J06255
58893D768405J06399J09211J14717J21322J28183J35108J41784J48765J57829
58884E931723J69805J83166J96169K09147K23488K39518K56858K75770K96743
58875G982387L19352L42630L66171L90254M15661M43711M75511N10758N48165
58866A1794600N87225O28482O72195P18276P67510Q21033Q78363R37759R98583
58857A8804026J061277J124683J185707J242157J293663J338799J373350J392351
58849B8816013J391975J368510J317472J234839J117926R65020P76634N58142
$$ plain form
58841 37546531 37865761 37935745 37754986 37331617 36684453 35840389 34829791 33684376 32437115
58832 32437115 31120542 29764037 28393401 27031953 25699694 24411299 23176412 22001814
58824 22001814 20892203 19849928 18875972 17970819 17132846 16356866 15636566 14967910 14348153
58815 14348153 13772295 13233354 12726236 12249095 11800919 11380127 10985729 10617419 10273885
58806 10273885 9952904 9653483 9376087 9120479 8885124 8669045 8472399 8294758 8134446
58797 8134446 7990058 7861230 7747710 7649050 7565347 7497024 7443955 7405903 7383256 7375876 7382114
58786 7382114 7400922 7434096 7484063 7550190 7630019 7723691 7834012 7962248 8107130 8268484
58776 8268484 8448479 8648237 8866233 9101502 9355944 9632123 9931054 10253468 10601032
$$ packed form
58841C7546531L19230O9984j80759m23369o47164q44064j010598j145415j247261
58832C2437115j316573j356505j370636j361448j332259j288395j234887j174598
58824B2001814j109611j042275r73956r05153q37973p75980p20300o68656o19757
58815A4348153n75858n38941n07118m77141m48176m20792l94398l68310l43534
58806A0273885l20981k99421k77396k55608k35355k16079j96646j77641j60312
58797H134446j44388j28828j13520r8660q3703o8323n3069l8052k2647p380O238
58786G382114J8808L3174M9967O6127P9829R3672J10321J28236J44882J61354
58776H268484J79995J99758K17996K35269K54442K76179K98931L22414L47564
$$ plain form
58767 10601032 10974922 11375388 11804283 12266167 12765333 13303345 13880892 14500448 15165703
58758 15165703 15880060 16647315 17472262 18358764 19307930 20319383 21393146 22528694 23722699
58749 23722699 24968585 26257249 27576663 28910864 30239672 31538447 32777410 33922271
58741 33922271 34937119 35787652 36443195 36878384 37075162 37024047 36724776 36187516 35433487
58732 35433487 34492252 33396616 32179442 30873455 29510793 28120791 26728422 25354501
58724 25354501 24015448 22722272 21481403 20297619 19175527 18118069 17125072 16194055
58716 16194055 15321798 14505139 13741438 13028628 12364131 11743995 11164118 10621806 10114909
58707 10114909 9640200 9194406 8776242 8385390 8019966 7677148 7355802 7056006 6776393
$$ packed form
58767A0601032L73890M00466M28895M61884M99166N38012N77547O19556O65255
58758A5165703P14357P67255Q24947Q86502R49166J011453J073763J135548J194005
58749B3722699J245886J288664J319414J334201J328808J298775J238963J144861
58741C3922271J014848Q50533O55543M35189J96778n1115k99271n37260p54029
58732C5433487r41235j095636j217174j305987j362662j390002j392369j373921
58724B5354501j339053j293176j240869j183784j122092j057458r92997r31017
58716A6194055q72257q16659p63701p12810o64497o20136n79877n42312n06897
58707A0114909m74709m45794m18164l90852l65424l42818l21346k99796k79613
$$ plain form
58698 6776393 6514619 6270188 6043741 5833637 5636505 5451529 5280699 5124025 4978034
58689 4978034 4840244 4711638 4592912 4481546 4374868 4273357 4178483 4089426 4004357 3923242
58679 3923242 3847200 3776403 3710328 3648575 3589921 3532096 3474127 3417514 3363765 3312287 3261837
58668 3261837 3212143 3162727 3112150 3060118 3008543 2958727 2909083 2857191 2802508 2745652 2686977
58657 2686977 2627594 2569915 2515199 2462143 2409659 2359154 2312053 2266942 2221589 2176334 2133151
58646 2133151 2092725 2054877 2020610 1990920 1964316 1938056 1911627 1886885 1864987 1845089 1825898
58635 1825898 1806798 1787550 1768378 1750300 1734246 1720092 1707446 1696772 1688723 1682997 1678921 1676519
58623 1676519 1675954 1676395 1676313 1674397 1669707 1661819 1651483 1640252 1628964 1617593 1606692 1597336 1589102 1579994
$$ packed form
58698F776393k61774k44431k26447k10104j97132j84976j70830j56674j45991
58689D978034j37790j28606j18726j11366j06678j01511r4874q9057q5069q1115
58679C923242p6042p0797o6075o1753n8654n7825n7969n6613n3749n1478n0450
58668C261837m9694m9416n0577n2032n1575m9816m9644n1892n4683n6856n8675
58657B686977n9383n7679n4716n3056n2484n0505m7101m5111m5353m5255m3183
58646B133151m0426l7848l4267k9690k6604k6260k6429k4742k1898j9898j9191
58635A825898j9100j9248j9172j8078j6054j4154j2646j0674q049n726m076k402
58623A676519n65M41q2j916m690p888j0336j1231j1288j1371j0901r356q234r108
$$ plain form
58609 1579994 1569304 1558795 1550016 1542230 1534258 1526628 1520491 1515940 1512745 1511319 1511693 1512993 1515028 1518828
58595 1518828 1524495 1530410 1535889 1542744 1552754 1565508 1580399 1598791 1622163 1649708 1679688 1711751
58583 1711751 1746127 1782124 1819434 1859649 1904527 1953897 2006973 2064439 2127564 2196538 2271407
58572 2271407 2353356 2443344 2540774 2645065 2757183 2878138 3007643 3146026 3295804 3459482
58562 3459482 3637283 3828870 4035714 4259953 4502669 4765315 5051054 5362308 5698259
58553 5698259 6056588 6435811 6833423 7243270 7657065 8066860 8463428 8833603 9162103
58544 9162103 9435247 9641148 9768611 9809794 9764131 9637648 9439145 9178799 8868898 8522794
58534 8522794 8153059 7771730 7390365 7017265 6655925 6308668 5980364 5675905 5395523
$$ packed form
58609A579994j0690j0509q779p786p972p630o137m551l195j426L74J300K035L800
58595A518828N667N915N479O855J0010J2754J4891J8392K3372K7545K9980L2063
58583A711751L4376L5997L7310M0215M4878M9370N3076N7466O3125O8974P4869
58572B271407Q1949Q9988R7430J04291J12118J20955J29505J38383J49778J63678
58562C459482J77801J91587K06844K24239K42716K62646K85739L11254L35951
58553E698259L58329L79223L97612M09847M13795M09795L96568L70175L28500
58544I162103K73144K05901J27463M1183m5663j26483j98503k60346l09901l46104
58534H522794l69735l81329l81365l73100l61340l47257l28304l04459k80382
$$ plain form
58525 5395523 5136092 4896455 4678477 4483255 4309151 4153542 4014130 3888707 3775728
58516 3775728 3674833 3584956 3502495 3423327 3346039 3271522 3200306 3132092 3066734 3003536 2940568
58505 2940568 2876559 2812386 2748890 2684922 2619694 2555235 2493773 2434183 2373835 2312595 2252183
58494 2252183 2192999 2134755 2079001 2027853 1981036 1937121 1896615 1860763 1828360 1797013 1766738
58483 1766738 1739034 1713240 1687161 1660745 1635933 1613409 1592622 1574213 1558899 1544533 1527969
58472 1527969 1509713 1493333 1480289 1468724 1457300 1446658 1436706 1425754 1413133 1400003 1387046
58461 1387046 1373701 1359949 1346641 1333979 1321618 1309808 1298256 1284793 1267817 1249303 1232534
58450 1232534 1217673 1202653 1187568 1174679 1164397 1154794 1145044 1136139 1128336 1121171 1115834 1113985 1114049
$$ packed form
58525E395523k59431k39637k17978j95222j74104j55609j39412j25423j12979
58516C775728j00895q9877q2461p9168p7288p4517p1216o8214o5358o3198o2968
58505B940568o4009o4173o3496o3968o5228o4459o1462n9590o0348o1240o0412
58494B252183n9184n8244n5754n1148m6817m3915m0506l5852l2403l1347l0275
58483A766738k7704k5794k6079k6416k4812k2524k0787j8409j5314j4366j6564
58472A527969j8256j6380j3044j1565j1424j0642r952j0952j2621j3130j2957
58461A387046j3345j3752j3308j2662j2361j1810j1552j3463j6976j8514j6769
58450A232534j4861j5020j5085j2889j0282r603r750q905p803p165n337j849O4
$$ plain form
58437 1114049 1112061 1106652 1100247 1095068 1090964 1087354 1084165 1080355 1074447 1067108 1060704 1055990 1051565 1046698
58423 1046698 1042238 1038748 1035984 1033968 1032370 1029663 1025382 1022207 1022876 1026057 1028483 1030090 1033431 1038884
58409 1038884 1044398 1049430 1055041 1060302 1062662 1061990 1060620 1059502 1058086 1057768 1061191 1067803 1074013 1078307
58395 1078307 1082547 1087920 1093168 1097183 1099917 1100586 1098366 1094774 1091762 1087772 1079619 1068042 1057195 1048601
58381 1048601 1039843 1029364 1018271 1007217 995860 985687 979025 974887 970093 964602 961106 959220 955208
58368 955208 948263 942005 938661 936513 934186 932734 932239 930942 929060 929069 931114 932722 934099 938827 947869
58353 947869 957672 965846 974124 984030 994164 1003615 1013774 1025032 1035787 1046189 1058606 1073003
58341 1073003 1086181 1096962 1107747 1119666 1130730 1140127 1149685 1159738 1168117 1174405 1180323 1185024
$$ packed form
58437A114049j988n409o405n179m104l610l189l810n908p339o404m714m425m867
58423A046698m460l490k764k016j598k707m281l175O69L181K426J607L341N453
58409A038884N514N032N611N261K360o72j370j118j416l18L423O612O210M294
58395A078307M240N373N248M015K734O69k220l592l012l990q153j1577j0847q594
58381A048601q758j0479j1093j1054j1357j0173o662m138m794n491l496j886m012
58368I55208o945o258l344k148k327j452m95j297j882RK045J608J377M728R042
58353I47869R803Q174Q278R906J0134R451J0159J1258J0755J0402J2417J4397
58341A073003J3178J0781J0785J1919J1064R397R558J0053Q379O288N918M701
$$ plain form
58329 1185024 1185559 1183258 1183712 1188549 1193209 1194952 1196894 1201362 1205489 1206976 1208715 1213801 1220596 1226208
58315 1226208 1230467 1233358 1233116 1230107 1228206 1229329 1230810 1230887 1232136 1236608 1242169 1246636 1251042 1256117 1260225
58300 1260225 1263488 1269023 1277179 1283557 1285742 1287064 1290695 1295159 1298783 1303281 1309547 1315056 1318886 1324174
58286 1324174 1332276 1339840 1345186 1351873 1362068 1372012 1378330 1383424 1390231 1397006 1402109 1408833 1420439
58273 1420439 1434823 1448780 1463261 1480040 1497502 1514077 1531592 1551222 1570476 1587938 1606335
58262 1606335 1627280 1647945 1666555 1685834 1707264 1727644 1745502 1765036 1789227 1814781 1838470
58251 1838470 1862571 1889254 1915488 1938532 1960728 1984050 2006028 2026109 2049644 2079908 2112266
58240 2112266 2141832 2170784 2202447 2234597 2264817 2296293 2331958 2368776 2404015 2441138 2483361
$$ packed form
58329A185024N35k301M54M837M660J743J942M468M127J487J739N086O795N612
58315A226208M259K891k42l009j901J123J481P7J249M472N561M467M406N075M108
58300A260225L263N535Q156O378K185J322L631M464L624M498O266N509L830N288
58286A324174Q102P564N346O687J0195R944O318N094O807O775N103O724J1606
58273A420439J4384J3957J4481J6779J7462J6575J7515J9630J9254J7462J8397
58262A606335K0945K0665J8610J9279K1430K0380J7858J9534K4191K5554K3689
58251A838470K4101K6683K6234K3044K2196K3322K1978K0081K3535L0264L2358
58240B112266K9566K8952L1663L2150L0220L1476L5665L6818L5239L7123M2223
$$ plain form
58229 2483361 2527646 2571224 2617547 2669205 2721684 2771002 2821002 2876137 2933726 2990438 3049560
58218 3049560 3114317 3180717 3244646 3309337 3378352 3448278 3516303 3587836 3668327 3754482 3841701
58207 3841701 3932863 4031494 4134119 4238217 4349725 4473260 4602839 4732081 4865743 5011271
58197 5011271 5166977 5328781 5500352 5685803 5880465 6079838 6289586 6515848 6754342
58188 6754342 7000166 7258992 7536565 7826681 8122265 8428843 8753957 9093127 9440057
58179 9440057 9800783 10183595 10585408 11002968 11446692 11927668 12442057 12984764 13566826
58170 13566826 14201503 14884886 15609011 16382320 17217681 18112789 19063744 20085984 21199917
58161 21199917 22408317 23710325 25123160 26663823 28322351 30080195 31942510 33925952
$$ packed form
58229B483361M4285M3578M6323N1658N2479M9318N0000N5135N7589N6712N9122
58218C049560O4757O6400O3929O4691O9015O9926O8025P1533Q0491Q6155Q7219
58207C841701R1162R8631J02625J04098J11508J23535J29579J29242J33662J45528
58197E011271J55706J61804J71571J85451J94662J99373K09748K26262K38494
58188F754342K45824K58826K77573K90116K95584L06578L25114L39170L46930
58179I440057L60726L82812M01813M17560M43724M80976N14389N42707N82062
58170A3566826O34677O83383P24125P73309Q35361Q95108R50955J022240J113933
58161B1199917J208400J302008J412835J540663J658528J757844J862315J983442
$$ plain form
58153 33925952 36031148 38259870 40646317 43238716 46063071 49137385 52504582 56214504
58145 56214504 60292442 64770228 69735924 75312601 81607994 88731716 96838870 106101785
58137 106101785 116661688 128665533 142316483 157813201 175275684 194827414 216735924
58130 216735924 241422266 269455253 301650361 338783792 380319060 422791267 459720694
58123 459720694 484023015 491380763 481925196 459259977 428218493 393161581 357318460
58116 357318460 322707411 290307658 260448086 233233758 208737930 186969503 167841652
58109 167841652 151216095 136923005 124737361 114395954 105657012 98322024 92215434
58102 92215434 87188576 83147170 80040277 77811813 76384451 75701832 75768415 76602361 78074135
$$ packed form
58153C3925952K105196K228722K386447K592399K824355L074314L367197L709922
58145E6214504M077938M477786M965696N576677O295393P123722Q107154R262915
58137A06101785J0559903J2003845J3650950J5496718J7462483J9551730K1908510
58130B16735924K4686342K8032987L2195108L7133431M1535268M2472207L6929427
58123D59720694K4302321P357748r455567k2665219l1041484l5056912l5843121
58116C57318460l4611049l2399753k9859572k7214328k4495828k1768427j9127851
58109A67841652j6625557j4293090j2185644j0341407q738942p334988o106590
58102I2215434n026858m041406l106893k228464j427362o82619O6583Q33946J471774
$$ plain form
58093 78074135 79726186 80775270 80413208 78227909 74387884 69447911 64006234 58510221
58085 58510221 53247359 48379628 43961805 39984601 36431632 33290123 30526596 28090559
58077 28090559 25943084 24056938 22393558 20906835 19567664 18361409 17264543 16247433
58069 16247433 15298078 14420579 13611076 12855288 12147599 11491766 10883272 10309918 9769302
58060 9769302 9267769 8802913 8364446 7951442 7571441 7222816 6894457 6582452 6290762
58051 6290762 6015447 5744412 5473854 5210276 4955659 4705237 4460823 4231925 4021724
58042 4021724 3824540 3638156 3466141 3307087 3154222 3007049 2871594 2747990 2629336
58033 2629336 2513912 2407047 2309644 2216115 2125287 2042676 1970096 1902967 1839381 1782109 1730366
$$ packed form
58093G8074135J652051J049084l62062k185299l840025m939973n441677n496013
58085E8510221n262862m867731m417823l977204l552969l141509k763527k436037
58077B8090559k147475j886146j663380j486723j339171j206255j096866j017110
58069A6247433r49355q77499q09503p55788p07689o55833o08494n73354n40616
58060I769302n01533m64856m38467m13004l80001l48625l28359l12005k91690
58051F290762k75315k71035k70558k63578k54617k50422k44414k28898k10201
58042D021724j97184j86384j72015j59054j52865j47173j35455j23604j18654
58033B629336j15424j06865r7403r3529r0828q2611p2580o7129o3586n7272n1743
$$ plain form
58022 1730366 1679147 1628144 1582125 1541290 1500219 1457372 1416753 1379298 1341525 1303518 1269376
58011 1269376 1238793 1207040 1174240 1145977 1123607 1102591 1081512 1064115 1051138 1038542 1025226
58000 1025226 1014333 1005616 994783 981857 972034 966582 960710 952043 943379 935437 924884 911646 900640
57987 900640 893883 887756 880105 873249 868149 862270 855157 849750 846625 843183 839659 839341 841696 842205 840297
57972 840297 840451 843915 846307 845065 842474 839736 834997 828966 825394 824043 820092 812448 805551 801017
57958 801017 794943 785947 778214 773348 766571 754932 742573 733763 726712 718380 709692 701902 693020 681932
57944 681932 671403 663386 655866 647449 640380 635823 631015 624338 618492 615364 612503 608165 605360 607387
57930 607387 613487 622158 634447 650555 667212 681724 694829 706802 715124 719161 722681 728185 732796
$$ packed form
58022A730366n1219n1003m6019m0835m1071m2847m0619l7455l7773l8007l4142
58011A269376l0583l1753l2800k8263k2370k1016k1079j7397j2977j2596j3316
58000A025226j0893q717j0833j2926r823n452n872q667q664p942j0553j3238j1006
57987I00640o757o127p651o856n100n879p113n407l125l442l524l18K355N09j908
57972H40297J54L464K392j242k591k738m739o031l572j351l951p644o897m534
57958H01017o074q996p733m866o777j1639j2359q810p051q332q688p790q882j1088
57944F81932j0529q017p520q417p069m557m808o677n846l128k861m338k805K027
57930F07387O100Q671J2289J6108J6657J4512J3105J1973Q322M037L520N504M611
$$ plain form
57917 732796 733350 731502 730105 728477 725103 721459 719133 716333 710987 704278 697591 689155 677440 664939
57903 664939 654824 646447 637689 629060 621879 614920 606572 598131 591499 585616 578472 570714 564129 558436
57889 558436 552577 547397 544211 542493 541584 542665 546421 550737 553473 555638 559219 563740 567541 570607
57875 570607 573459 574986 573928 570968 567123 561777 554432 546527 539247 531460 522080 512606 505040 499134
57861 499134 493909 489997 488171 487439 486872 487445 489840 492386 493687 495451 500165 507507 515428 523283 531493
57846 531493 539538 546619 553130 559542 565086 569265 573144 577571 581814 585436 589341 593202 594330 591405
57832 591405 587057 584132 581466 576145 568101 559517 551100 541966 532276 523231 514932 506452 497580 488938
57818 488938 481107 474832 470815 468166 464785 460592 458308 459432 461813 463257 465124 469739 476394 482922
$$ packed form
57917G32796N54j848j397j628l374l644k326k800n346o709o687q436j1715j2501
57903F64939j0115q377q758q629p181o959q348q441o632n883p144p758o585n693
57889E58436n859n180l186j718r09J081L756M316K736K165L581M521L801L066
57875E70607K852J527j058k960l845n346p345p905p280p787r380r474p566n906
57861D99134n225l912j826p32n67N73K395K546J301J764M714P342P921P855Q210
57846E31493Q045P081O511O412N544M179L879M427M243L622L905L861J128k925
57832E91405m348k925k666n321q044q584q417r134r690r045q299q480q872q642
57818D88938p831o275m017k649l381m193k284J124K381J444J867M615O655O528
$$ plain form
57804 482922 489564 498130 508341 517913 525700 532317 538204 543077 546612 547920 545308 538301 528927 519487
57790 519487 510236 500680 491388 482695 473320 462335 450933 440260 429220 416715 404336 394315
57778 394315 386267 378524 371319 365983 361992 357396 351474 344775 337368 329135 320827 312936 304572 295267
57764 295267 286532 279681 273556 266420 258399 249895 239571 226652 213534 203047 194477 185203 174963
57751 174963 165433 156846 148333 140685 135397 131650 127538 123757 122796 124735 127089 128651 130419 132790
57737 132790 135075 138061 143953 153165 163694 174097 184506 194374 202014 207293 212408 218943 225911
57724 225911 231626 235973 239998 244401 248935 252533 254037 253442 251910 249772 245733 239290 232414 226907
57710 226907 221546 214253 205915 199351 195321 192412 190247 189847 191132 193076 196245 202253 210612 219022
$$ packed form
57804D82922O642Q566J0211R572P787O617N887M873L535J308k612p007r374r440
57790E19487r251r556r292q693r375j0985j1402j0673j1040j2505j2379j0021
57778C94315q048p743p205n336l991m596n922o699p407q233q308p891q364r305
57764B95267q735o851o125p136q021q504j0324j2919j3118j0487q570r274j0240
57751A74963r530q587q513p648n288l747m112l781r61J939K354J562J768K371
57737A32790K285K986N892R212J0529J0403J0409R868P640N279N115O535O968
57724B25911N715M347M025M403M534L598J504n95j532k138m039o443o876n507
57710B26907n361p293q338o564m030k909k165m00J285J944L169O008Q359Q410
$$ plain form
57696 219022 227010 236389 247646 258731 268110 276362 283970 290136 294857 299788 305890 312210 318009 324175
57682 324175 331538 339686 348459 358784 370868 383119 394127 404521 415817 428297 440843 452129
57670 452129 461638 470321 480348 493140 507636 521594 534518 547968 563319 580859 600898 623794
57658 623794 648691 674069 699865 727430 757198 788212 820199 854241 890953 929773 970496
57647 970496 1013716 1059215 1105764 1153330 1203937 1259600 1320874 1388037 1462069 1543521 1631736
57636 1631736 1726238 1828021 1938870 2060189 2192812 2337052 2492741 2660256 2841530 3038970
57626 3038970 3253479 3484986 3734691 4004827 4295642 4604203 4926649 5260012 5600894
57617 5600894 5943376 6278852 6597052 6887160 7139362 7346286 7503072 7607021 7658592 7661957
$$ packed form
57696B19022P988R379J1257J1085R379Q252P608O166M721M931O102O320N799O166
57682C24175P363Q148Q773J0325J2084J2251J1008J0394J1296J2480J2546J1286
57670D52129R509Q683J0027J2792J4496J3958J2924J3450J5351J7540K0039K2896
57658F23794K4897K5378K5796K7565K9768L1014L1987L4042L6712L8820M0723
57647I70496M3220M5499M6549M7566N0607N5663O1274O7163P4032Q1452Q8215
57636A631736R4502J01783J10849J21319J32623J44240J55689J67515J81274J97440
57626C038970K14509K31507K49705K70136K90815L08561L22446L33363L40882
57617E600894L42482L35476L18200K90108K52202K06924J56786J03949N1571L365
$$ plain form
57607 7661957 7622083 7540310 7413706 7238830 7015359 6747218 6442855 6114893 5777408 5442293
57597 5442293 5118320 4812303 4528791 4268829 4031488 3817014 3626716 3460076 3314532
57588 3314532 3188315 3080948 2990730 2914611 2851395 2802335 2767395 2743478 2727758 2720538 2723505
57577 2723505 2737320 2762314 2799311 2847962 2906109 2972639 3049588 3139925 3244682 3363623 3497134
57566 3497134 3645830 3809624 3988628 4183651 4394328 4618040 4852018 5094924 5344595
57557 5344595 5595252 5838436 6065590 6268214 6436803 6561796 6635599 6653166 6612198 6514597
57547 6514597 6366900 6177521 5953713 5701933 5429887 5146446 4859837 4576827 4302759
57538 4302759 4040925 3792304 3556986 3335563 3128621 2935891 2756897 2591578 2439409
$$ packed form
57607G661957l9874q1773j26604j74876k23471k68141l04363l27962l37485l35115
57597E442293l23973l06017k83512k59962k37341k14474j90298j66640j45544
57588C314532j26217j07367r0218p6119o3216m9060l4940k3917j5720p220K967
57577B723505J3815K4994L6997M8651N8147O6530P6949R0337J04757J18941J33511
57566C497134J48696J63794J79004J95023K10677K23712K33978K42906K49671
57557E344595K50657K43184K27154K02624J68589J24993P3803J7567m0968r7601
57547F514597j47697j89379k23808k51780k72046k83441k86609k83010k74068
57538D302759k61834k48621k35318k21423k06942j92730j78994j65319j52169
$$ plain form
57529 2439409 2298874 2168874 2049650 1941244 1841960 1749609 1663588 1584628 1513157 1448742
57519 1448742 1390314 1336079 1284320 1235371 1191779 1155219 1124149 1095737 1069191 1045761 1026178
57508 1026178 1009734 995569 983548 973876 966630 961518 957666 954270 951885 952148 955720 961627 969289
57495 969289 979816 994174 1011407 1030052 1050352 1073657 1100479 1130520 1163887 1201019 1241988
57484 1241988 1286988 1336860 1392101 1452235 1517177 1588214 1666472 1751509 1842835 1941792 2050306
57473 2050306 2168597 2295847 2432404 2579535 2737448 2905361 3083226 3271592 3469513
57464 3469513 3673749 3879980 4083588 4279177 4460206 4619221 4748167 4839428 4887804 4891408
57454 4891408 4850426 4766229 4642741 4487450 4309266 4115528 3911815 3703434 3495353 3291207
$$ packed form
57529B439409j40535j30000j19224j08406r9284r2351q6021p8960p1471o4415
57519A448742n8428n4235n1759m8949m3592l6560l1070k8412k6546k3430j9583
57508A026178j6444j4165j2021r672p246n112l852l396k385K63L572N907P662
57495I69289J0527J4358J7233J8645K0300K3305K6822L0041L3367L7132M0969
57484A241988M5000M9872N5241O0134O4942P1037P8258Q5037R1326R8957J08514
57473B050306J18291J27250J36557J47131J57913J67913J77865J88366J97921
57464C469513K04236K06231K03608J95589J81029J59015J28946R1261M8376L604
57454D891408m0982q4197j23488j55291j78184j93738k03713k08381k08081k04146
$$ plain form
57444 3291207 3093896 2906707 2732480 2572057 2424877 2290692 2169535 2060723 1963428 1877816
57434 1877816 1804189 1741436 1687742 1642406 1605605 1576849 1555188 1540645 1533835 1534243 1540164 1550226
57422 1550226 1564076 1582127 1605798 1637273 1677491 1724879 1777542 1836189 1903376 1980489 2067335
57411 2067335 2164328 2272977 2393921 2526015 2667640 2817898 2976500 3143358 3317659 3496022
57401 3496022 3671979 3838337 3989277 4118904 4219197 4281799 4301551 4276783 4207471 4095863
57391 4095863 3948209 3772811 3576056 3362580 3138759 2912662 2689981 2472907 2263676
57382 2263676 2066086 1882156 1710125 1547737 1395608 1255652 1127954 1010965 903400
57373 903400 804312 712345 626449 546548 472508 403420 338821 279441 225644 176148 129379
$$ packed form
57444C291207j97311j87189j74227j60423j47180j34185j21157j08812r7295q5612
57434A877816p3627o2753n3694m5336l6801k8756k1661j4543o810M08N921J0062
57422A550226J3850J8051K3671L1475M0218M7388N2663N8647O7187P7113Q6846
57411B067335R6993J08649J20944J32094J41625J50258J58602J66858J74301J78363
57401C496022J75957J66358J50940J29627J00293O2602J9752k4768o9312j11608
57391D095863j47654j75398j96755k13476k23821k26097k22681k17074k09231
57382B263676j97590j83930j72031j62388j52129j39956j27698j16989j07565
57373I03400r9088r1967q5896p9901p4040o9088o4599n9380n3797m9496m6769
$$ plain form
57362 129379 85084 43564 4288 -33526 -69772 -103916 -135947 -165727 -192189 -214425 -233324 -251134
57350 -251134 -269477 -288298 -306433 -322735 -337071 -350698 -365368 -381707 -398716 -414889 -429304
57339 -429304 -441654 -452096 -461338 -470219 -478884 -486853 -493866 -500080 -505608 -510612 -515569 -520599 -524977 -528501
57325 -528501 -532782 -539541 -547913 -555379 -561356 -567752 -575616 -583481 -589907 -595553 -601389 -606590 -609847 -611723
57311 -611723 -614242 -618749 -625132 -632369 -639003 -643840 -647009 -649751 -652840 -656079 -659557 -663994 -669331 -674473
57297 -674473 -679186 -684719 -691576 -698225 -703251 -707441 -712339 -717929 -723315 -728693 -734856 -741272 -746336 -749517
57283 -749517 -751994 -755098 -759015 -763095 -766762 -770054 -773461 -777167 -780521 -782717 -783758 -783946 -782659 -778995
57269 -778995 -773670 -768830 -765550 -762826 -759342 -754727 -748713 -740781 -731314 -721377 -710638 -697242 -680727
$$ packed form
57362A29379m4295m1520D288c3526l6246l4144l2031k9780k6462k2236j8899j7810
57350b51134j8343j8821j8135j6302j4336j3627j4670j6339j7009j6173j4415
57339d29304j2350j0442r242q881q665p969p013o214n528n004m957n030m378l524
57325e28501m281o759q372p466n977o396p864p865o426n646n836n201l257j876
57311f11723k519m507o383p237o634m837l169k742l089l239l478m437n337n142
57297f74473m713n533o857o649n026m190m898n590n386n378o163o416n064l181
57283g49517k477l104l917m080l667l292l407l706l354k196j041j88J287L664
57269g78995N325M840L280K724L484M615O014P932R467R937J0739J3396J6515
$$ plain form
57256 -680727 -663153 -646313 -629772 -613052 -597673 -585071 -574099 -562708 -550851 -539696 -529026
57245 -529026 -517427 -504188 -489116 -471426 -450911 -429442 -409144 -389456 -368021 -344035 -318757
57234 -318757 -292949 -265931 -237240 -207463 -177189 -146655 -116587 -87945 -60480 -32718 -3600 26626
57221 57019 86513 114019 138898 161115 180185 194377 201903 202492 196819 184875 165926 139821
57209 139821 107452 70279 30105 -11314 -53278 -96206 -140186 -184407 -228620 -273631 -319077
57198 -319077 -362139 -400108 -433151 -462929 -489655 -512493 -531952 -549691 -566299 -581110 -593818
57187 -593818 -604563 -612809 -617903 -620494 -621929 -622684 -622830 -623404 -625578 -629010 -632628 -636439 -640784 -644359 -644801
57172 -644801 -640762 -631784 -616938 -595644 -569310 -540089 -508409 -473660 -436705 -399516 -362743 -325866
$$ packed form
57256f80727J7574J6840J6541J6720J5379J2602J0972J1391J1857J1155J0670
57245e29026J1599J3239J5072J7690K0515K1469K0298J9688K1435K3986K5278
57234c18757K5808K7018K8691K9777L0274L0534L0068K8642K7465K7762c600B6626
57221E7019K9494K7506K4879K2217J9070J4192P526N89n673j1944j8949k6105
57209A39821l2369l7173C0105a1314m1964m2928m3980m4221m4213m5011m5446
57198c19077m3062l7969l3043k9778k6726k2838j9459j7739j6608j4811j2708
57187e93818j0745q246n094k591j435p55j46n74k174l432l618l811m345l575m42
57172f44801M039Q978J4846K1294K6334K9221L1680L4749L6955L7189L6773L6877
$$ plain form
57160 -325866 -289508 -255532 -225123 -198660 -176815 -159494 -144218 -128021 -110539 -92871 -74021
57149 -74021 -51298 -23928 6725 40435 78577 121302 167218 216199 269420 326059 382784 437079
57137 437079 488330 535229 575392 608688 638232 666909 695299 723710 753439 784814 816503
57126 816503 847955 880192 913150 944617 972980 998888 1023269 1045912 1066906 1087241 1106977
57115 1106977 1124846 1140222 1153303 1163044 1167549 1166943 1162969 1155165 1140387 1116720 1084605 1043448
57103 1043448 990656 925232 848923 762691 665689 558987 446376 329651 206950 77816
57092 -53855 -184374 -314247 -445368 -577742 -711738 -850336 -996222 -1149385 -1309941 -1480325
57082 -1480325 -1662381 -1855567 -2060513 -2281142 -2520786 -2779527 -3057794 -3358768 -3684406
$$ packed form
57160c25866L6358L3976L0409K6463K1845J7321J5276J6197J7482J7668J8850
57149g4021K2723b3928F725L3710L8142M2725M5916M8981N3221N6639N6725N4295
57137D37079N1251M6899M0163L3296K9544K8677K8390K8411K9729L1375L1689
57126H16503L1452L2237L2958L1467K8363K5908K4381K2643K0994K0335J9736
57115A106977J7869J5376J3081R741M505o06l974p804j4778k3667l2115m1157
57103A043448n2792o5424p6309q6232r7002j06702j12611j16725j22701G7816
57092e3855j30519j29873j31121j32374j33996j38598j45886j53163j60556j70384
57082a480325j82056j93186k04946k20629k39644k58741k78267l00974l25638
$$ plain form
57073 -3684406 -4032952 -4403697 -4800785 -5229421 -5692126 -6191746 -6733894 -7322986 -7960233
57064 -7960233 -8649531 -9401061 -10225046 -11126380 -12109654 -13184927 -14364027 -15656215 -17073035
57055 -17073035 -18632799 -20354424 -22250904 -24334263 -26622362 -29135359 -31891366 -34913619
57047 -34913619 -38238783 -41912747 -45983611 -50505242 -55541569 -61159975 -67427874 -74426786
57039 -74426786 -82267155 -91084191 -101028126 -112267084 -124987068 -139370828 -155575367
57032 -155575367 -173729802 -193932315 -216224422 -240569339 -266857842 -294913744 -324499297
57025 -324499297 -355395416 -387535944 -420944155 -455264560 -489164362 -520246587 -545762582
57018 -545762582 -563625236 -572938023 -573800027 -566819812 -552824387 -532819903 -507983601
$$ packed form
57073c684406l48546l70745l97088m28636m62705m99620n42148n89092o37247
57064g960233o89298p51530q23985r01334r83274j075273j179100j292188j416820
57055a7073035j559764j721625j896480k083359k288099k512997k756007l022253
57047c4913619l325164l673964m070864m521631n036327n618406o267899o998912
57039g4426786p840369q817036r943935j1238958j2719984j4383760j6204539
57032a55575367j8154435k0202513k2292107k4344917k6288503k8055902k9585553
57025c24499297l0896119l2140528l3408211l4320405l3899802l1082225k5515995
57018e45762582j7862654r312787q62004O980215J3995425K0004484K4836302
$$ plain form
57011 -507983601 -479562446 -448727879 -416463163 -383518105 -350447321 -317710266 -285755637
57004 -285755637 -255029893 -225935871 -198802374 -173874675 -151300701 -131117293 -113261882
56997 -113261882 -97603727 -83967181 -72145016 -61919358 -53085908 -45461742 -38879539
56990 -38879539 -33188208 -28260447 -23991411 -20289067 -17071602 -14271980 -11835913 -9713122
56982 -9713122 -7855049 -6219952 -4773933 -3486803 -2332324 -1292339 -355085 491322
56973 1259853 1959868 2596723 3176325 3705575 4187750 4621181 5002910 5330766 5602917
56964 5602917 5819975 5988238 6117690 6216793 6291931 6350597 6400513 6445029 6482829 6512513 6534534
56953 6534534 6548861 6554325 6550895 6539759 6520865 6492947 6456031 6411236 6358010 6293997 6217734 6129978
$$ packed form
57011e07983601K8421155L0834567L2264716L2945058L3070784L2737055L1954629
57004b85755637L0725744K9094022K7133497K4927699K2573974K0183408J7855411
56997a13261882J5658155J3636546J1822165J0225658Q833450P624166O582203
56990c8879539N691331M927761M269036L702344L217465K799622K436067K122791
56982i713122J858073J635097J446019J287130J154479J039985c55085D91322
56973A259853P00015O36855N79602N29250M82175M33431L81729L27856K72151
56964E602917K17058J68263J29452R9103P5138N8666M9916M4516L7800K9684K2021
56953F534534J4327N464l430j1136j8894k7918l6916m4795n3226o4013p6263q7756
$$ plain form
56941 6129978 6034112 5937959 5852245 5780483 5708661 5609153 5457722 5246516 4983343 4684335
56931 4684335 4368553 4053693 3751402 3466353 3200209 2954506 2729423 2523111 2334229
56922 2334229 2163073 2008867 1868088 1737004 1614142 1499203 1391797 1292674 1204102 1127157
56912 1127157 1060141 1001190 951040 911717 883729 865889 856706 854609 857892 865710 878408 895994
56900 895994 917228 940862 966513 993463 1019913 1044310 1066069 1084007 1095520 1098875 1095403 1088196
56888 1088196 1079286 1069120 1057982 1046705 1036358 1027964 1022162 1018706 1016922 1016896 1019430 1024819 1032932
56875 1032932 1044643 1061565 1083861 1109985 1139126 1171689 1205869 1235706 1254698 1260581 1255073 1240169
56863 1240169 1216823 1186607 1152376 1116815 1081376 1046582 1012381 978507 945499 915110 888758
$$ packed form
56941F129978r5866r6153q5714p1762p1822r9508j51431k11206k63173k99008
56931D684335l15782l14860l02291k85049k66144k45703k25083k06312j88882
56922B334229j71156j54206j40779j31084j22862j14939j07406r9123q8572p6945
56912A127157o7016n8951n0150l9323k7988j7840r183k097L283P818J2698J7586
56900H95994K1234K3634K5651K6950K6450K4397K1759J7938J1513L355l472p207
56888A088196q910j0166j1138j1277j0347q394n802l456j784k6K534N389Q113
56875A032932J1711J6922K2296K6124K9141L2563L4180K9837J8992N883n508j4904
56863A240169k3346l0216l4231l5561l5439l4794l4201l3874l3008l0389k6352
$$ plain form
56852 888758 866004 845613 827611 812917 801079 789901 777772 765366 754496 745955 739023 732885
56840 732885 728008 725800 726852 729960 733530 737758 744530 755189 769453 786633 806389 827646 848401
56827 848401 868081 888968 913573 940997 967262 988920 1004992 1015727 1021299 1022333 1020539 1017893
56815 1017893 1015543 1013743 1012586 1012562 1014695 1020166 1029528 1042281 1057385 1074251 1093328 1115948 1143491
56802 1143491 1176262 1213259 1253472 1296880 1342792 1387023 1422303 1442640 1446872 1437765 1419051 1394202
56790 1394202 1366653 1339388 1314366 1293171 1277561 1268436 1264840 1265223 1269430 1278595 1293543 1314299
56778 1314299 1340857 1373518 1412652 1458737 1512009 1571072 1631994 1689303 1737339 1770459 1783701
56767 1783701 1775230 1747925 1707372 1658628 1605618 1552350 1502586 1458270 1419687 1387142 1361474
$$ packed form
56852H88758k2754k0391j8002j4694j1838j1178j2129j2406j0870q541o932o138
56840G32885m877k208J052L108L570M228O772J0659J4264J7180J9756K1257K0755
56827H48401J9680K0887K4605K7424K6265K1658J6072J0735N572J034j794k646
56815A017893k350j800j157k4K133N471R362J2753J5104J6866J9077K2620K7543
56802A143491L2771L6997M0213M3408M5912M4231L5280K0337M232r107j8714k4849
56790A394202k7549k7265k5022k1195j5610r125l596L83M207R165J4948K0756
56778A314299K6558L2661L9134M6085N3272N9063O0922N7309M8036L3120J3242
56767A783701q471k7305m0553m8744n3010n3268m9764m4316l8583l2545k5668
$$ plain form
56756 1361474 1343192 1332174 1327900 1329246 1334964 1345561 1363629 1390776 1425311 1464752 1508889 1557019
56744 1557019 1602674 1634865 1645784 1635154 1607001 1565522 1515341 1462319 1411106 1363035 1318075
56733 1318075 1277369 1242145 1211667 1184397 1160498 1141527 1128270 1120346 1117371 1119171 1125358 1135867
56721 1135867 1151300 1171480 1193849 1214100 1227867 1231416 1222248 1200784 1170917 1137302 1102230 1066081
56709 1066081 1029906 995759 964678 936157 909963 886982 867765 851323 836167 821820 808748
56698 808748 797204 786678 776411 766177 756656 749069 744295 742248 741983 742210 741792 740151 737451 734245
56684 734245 730971 727983 725697 724091 722249 719312 715840 713319 712216 711467 709944 707317 703450 698449
56670 698449 693764 691582 692159 693021 691809 688730 685219 681671 677960 674920 673408 672592 670960 668620 666957
$$ packed form
56756A361474j8282j1018m274J346N718J0597J8068K7147L4535L9441M4137M8130
56744A557019M5655L2191J0919j0630k8153m1479n0181n3022n1213m8071m4960
56733A318075m0706l5224l0478k7270k3899j8971j3257p924k975J800O187J0509
56721A135867J5433K0180K2369K0251J3767L549r168k1464k9867l3615l5072l6149
56709A066081l6175l4147l1081k8521k6194k2981j9217j6442j5156j4347j3072
56698H08748j1544j0526j0267j0234r521p587m774k047k65K27m18j641k700l206
56684G34245l274k988k286j606j842k937l472k521j103p49j523k627l867n001
56670F98449m685k182N77Q62j212l079l511l548l711l040j512q16j632k340j663
$$ plain form
56655 666957 666312 665596 664062 661892 659127 655637 652290 650639 651046 652314 653550 655205 657832 660938 663714
56640 663714 666194 669072 672829 677401 682373 687257 691875 696475 701243 705866 709886 713083 715096 715285
56626 715285 713754 712042 711869 713424 715706 718090 720520 722505 723227 722731 721910 721225 720347 719055 717517 715644
56610 715644 713216 710739 709160 708524 707816 706256 703818 700361 695389 689058 682404 675935 668764 659663 648466
56595 648466 635984 622983 609596 595373 579686 562426 544479 527305 512210 500193 491868 486737
56583 486737 482926 478797 474821 472915 473892 476477 478897 480489 481622 482981 485139 488073 490914 492847
56569 492847 494208 495903 497953 499699 501326 503815 507158 510038 511826 513628 516560 519933 521987 521847
56555 521847 520249 518925 519677 523226 528366 532813 535383 536938 539032 542298 546352 550363 553369 554897
$$ packed form
56655F66957o45p16j534k170k765l490l347j651M07J268J236J655K627L106K776
56640F63714K480K878L757M572M972M884M618M600M768M623M020L197K013J89
56626G15285j531j712j73J555K282K384K430J985P22m96q21o85q78j292j538j873
56610G15644k428k477j579o36p08j560k438l457m972o331o654o469p171r101j1197
56595F48466j2482j3001j3387j4223j5687j7260j7947j7174j5095j2017q325n131
56583D86737l811m129l976j906R77K585K420J592J133J359K158K934K841J933
56569D92847J361J695K050J746J627K489L343K880J788J802K932L373K054j40
56555E21847j598j324P52L549N140M447K570J555K094L266M054M011L006J528
$$ plain form
56541 554897 555757 557430 560201 562743 564047 564847 566422 568738 570709 571753 572216 572499 572488 571795 570206 568032
56525 568032 566208 565638 566056 565901 563693 559483 554856 551721 550994 552148 554019 556227 559375 563486 567133
56510 567133 569240 571085 574927 580798 586370 590223 593419 597308 601597 605665 610211 616135 622843 629158
56496 629158 635209 641905 648983 655023 659366 662876 666548 670204 672838 673785 673242 671814 669753 666890 663564
56481 663564 661243 661409 663697 665933 666354 665226 664022 663661 663868 663676 662170 659310 656234 654250 653341 652263
56465 652263 650157 647321 644323 641298 638377 635890 633764 631537 629293 627682 626680 625218 622446 618458
56451 618458 613458 607386 600980 596084 593870 593328 592286 589501 585266 580599 576498 573575 571845 570992 570857
56436 570857 571307 571826 571940 571851 571804 571044 568516 564563 560798 558363 557449 558292 561099 565077 569180 573790 579815
$$ packed form
56541E54897Q60J673K771K542J304Q00J575K316J971J044M63K83j1o93j589k174
56525E68032j824n70M18j55k208m210m627l135p27J154J871K208L148M111L647
56510E67133K107J845L842N871N572L853L196L889M289M068M546N924O708O315
56496F29158O051O696P078O040M343L510L672L656K634R47n43j428k061k863l326
56481F63564k321J66K288K236M21j128j204l61K07j92j506k860l076j984r09j078
56465F52263k106k836k998l025k921k487k126k227k244j611j002j462k772l988
56451F18458n000o072o406m896k214n42j042k785m235m667m101k923j730q53j35
56436E70857M50N19J14q9m7p60k528l953l765k435r14Q43K807L978M103M610O025
$$ plain form
56419 579815 586116 590066 591155 591842 594133 597383 600326 603042 605839 608350 610975 615215 621157 626635
56405 626635 630321 633660 638256 643490 648534 654467 662055 669355 674174 677537 682147 688408 694441 699127
56391 699127 702670 704855 705126 704084 702951 701887 700416 698749 697066 694464 690535 686936 685345 684824 683445
56376 683445 681520 680718 680803 680063 678609 678356 679594 680175 678612 675731 672768 669732 666248 662395 658264 653900
56360 653900 649818 646349 642726 638255 634038 631889 631688 631312 628977 624162 616869 607929 599786 594920 593265
56345 593265 592686 591757 590469 588642 585705 582055 578745 575797 572536 569438 567896 568268 569924 572899 577406
56330 577406 581902 584087 584224 585429 590046 597249 604470 609646 611904 611717 610715 610025 608784 605567 601046
56315 601046 597689 597261 600174 606607 616185 626895 636496 644875 653162 661122 667699 673574 680491 688153
$$ packed form
56419E79815O301L950J089O87K291L250K943K716K797K511K625M240N942N478
56405F26635L686L339M596N234N044N933P588P300M819L363M610O261O033M686
56391F99127L543K185K71j042j133j064j471j667j683k602l929l599j591n21j379
56376F83445j925q02Q5p40j454k53J238N81j563k881k963l036l484l853m131m364
56360F53900m082l469l623m471m217k149k01l76k335m815p293q940q143m866j655
56345E93265n79r29j288j827k937l650l310k948l261l098j542L72J656K975M507
56330E77406M496K185J37J205M617P203P221N176K258j87j002o90j241l217m521
56315F01046l357m28K913O433R578J0710R601Q379Q287P960O577N875O917P662
$$ plain form
56301 688153 694542 699238 703697 708146 711129 712442 713575 714699 714245 712368 711932 714844 719821 724858 729458
56286 729458 733426 736065 737979 741430 747423 754280 760244 765573 771011 776290 781317 786885 793008 798454
56272 798454 803099 808804 816757 825841 834830 844305 855074 866579 878201 890323 902715 913669 922272
56259 922272 930045 938914 949008 959839 972113 986709 1002814 1018433 1032052 1043116 1052006 1060232
56247 1060232 1069432 1079501 1088969 1097570 1106733 1116855 1125857 1131398 1133231 1132845 1132391 1134349 1140236 1148880
56233 1148880 1157689 1166207 1176466 1189514 1204074 1219425 1237053 1258187 1282041 1307814 1336134 1367079
56221 1367079 1399086 1431560 1466625 1506496 1550765 1597861 1647540 1700422 1756790 1817519 1884757
56210 1884757 1960105 2043140 2132851 2229215 2332532 2442879 2561270 2689893 2830258 2982546
$$ packed form
56301F88153O389M696M459M449K983J313J133J124m54j877m36K912M977N037M600
56286G29458L968K639J914L451N993O857N964N329N438N279N027N568O123N446
56272G98454M645N705P953R084Q989R475J0769J1505J1622J2122J2392J0954Q603
56259I22272P773Q869J0094J0831J2274J4596J6105J5619J3619J1064Q890Q226
56247A060232R200J0069R468Q601R163J0122R002N541J833l86m54J958N887Q644
56233A148880Q809Q518J0259J3048J4560J5351J7628K1134K3854K5773K8320L0945
56221A367079L2007L2474L5065L9871M4269M7096M9679N2882N6368O0729O7238
56210A884757P5348Q3035Q9711R6364J03317J10347J18391J28623J40365J52288
$$ plain form
56200 2982546 3147229 3325347 3516707 3720157 3936403 4167948 4415172 4674930 4944008
56191 4944008 5221117 5504122 5788176 6068304 6341055 6601781 6843120 7058404 7244234
56182 7244234 7397859 7514989 7592843 7632987 7638563 7610906 7551498 7465007 7357402 7232546 7093169
56171 7093169 6943300 6786880 6625305 6458920 6289599 6119345 5947592 5772364 5593081
56162 5593081 5410146 5223181 5032143 4839269 4647683 4458715 4272229 4088571 3908597
56153 3908597 3732930 3562683 3399708 3244781 3096956 2955849 2822894 2699110 2583720
56144 2583720 2476274 2377807 2288254 2205102 2126529 2053676 1987887 1928007 1872394 1821276 1775020
56133 1775020 1732349 1692358 1655987 1623505 1593149 1564472 1540178 1521940 1507042 1492080 1477537
$$ packed form
56200B982546J64683J78118J91360K03450K16246K31545K47224K59758K69078
56191D944008K77109K83005K84054K80128K72751K60726K41339K15284J85830
56182G244234J53625J17130P7854M0144N576k7657n9408q6491j07605j24856j39377
56171G093169j49869j56420j61575j66385j69321j70254j71753j75228j79283
56162E593081j82935j86965j91038j92874j91586j88968j86486j83658j79974
56153C908597j75667j70247j62975j54927j47825j41107j32955j23784j15390
56144B583720j07446r8467q9553q3152p8573p2853o5789n9880n5613n1118m6256
56133A775020m2671l9991l6371l2482l0356k8677k4294j8238j4898j4962j4543
$$ plain form
56122 1477537 1465815 1457092 1450167 1445231 1442718 1441453 1440778 1442534 1448111 1455660 1462901 1470452 1479683 1489872
56108 1489872 1500455 1513418 1530160 1548468 1565866 1583343 1602291 1620536 1635397 1648314 1662508
56097 1662508 1678248 1694262 1711418 1730830 1750650 1769194 1789303 1815153 1846529 1880650 1917855
56086 1917855 1960810 2009670 2062851 2121657 2189724 2268720 2358572 2460844 2577770 2708843 2852198
56075 2852198 3008274 3178484 3361545 3554674 3756645 3965569 4175177 4377370 4567176
56066 4567176 4741926 4898265 5034911 5156463 5269185 5373633 5465137 5539491 5593577 5622633
56056 5622633 5622851 5596378 5549494 5486694 5410080 5321982 5222877 5108257 4972854 4817230 4646249
56045 4646249 4463479 4272179 4079521 3893735 3718094 3552651 3399987 3263640 3142686
$$ packed form
56122A477537j1722q723o925m936k513j265o75J756N577P549P241P551R231J0189
56108A489872J0583J2963J6742J8308J7398J7477J8948J8245J4861J2917J4194
56097A662508J5740J6014J7156J9412J9820J8544K0109K5850L1376L4121L7205
56086A917855M2955M8860N3181N8806O8067P8996Q9852J02272J16926J31073J43355
56075B852198J56076J70210J83061J93129K01971K08924K09608K02193J89806
56066D567176J74750J56339J36646J21552J12722J04448R1504P4354N4086K9056
56056E622633K18k6473m6884o2800p6614q8098r9105j14620j35403j55624j70981
56045D646249j82770j91300j92658j85786j75641j65443j52664j36347j20954
$$ plain form
56036 3142686 3033807 2937257 2854951 2784367 2720566 2662842 2613234 2569954 2528868 2490208 2457153
56025 2457153 2428866 2401740 2376483 2356942 2342417 2328092 2312701 2299140 2288111 2278065 2270968
56014 2270968 2270948 2277151 2284622 2292113 2302502 2315954 2329489 2342955 2358709 2375959 2392311 2409977
56002 2409977 2433013 2459224 2482610 2503267 2526901 2555055 2584059 2613378 2646368 2682569 2717746
55991 2717746 2752084 2790089 2832039 2873767 2915147 2960372 3009634 3059124 3109327 3164383 3223060
55980 3223060 3279627 3334028 3391901 3454208 3516562 3579144 3647073 3720115 3792279 3862771 3937341
55969 3937341 4018051 4102090 4191340 4291874 4402731 4516556 4632852 4759078 4897008 5039903
55959 5039903 5185332 5338888 5502967 5673864 5852348 6044917 6251907 6466260 6686482
$$ packed form
56036C142686j08879r6550q2306p0584o3801n7724m9608m3280m1086l8660l3055
56025B457153k8287k7126k5257j9541j4525j4325j5391j3561j1029j0046p097
56014B270968k0O203P471P491J0389J3452J3535J3466J5754J7250J6352J7666
56002B409977K3036K6211K3386K0657K3634K8154K9004K9319L2990L6201L5177
55991B717746L4338L8005M1950M1728M1380M5225M9262M9490N0203N5056N8677
55980C223060N6567N4401N7873O2307O2354O2582O7929P3042P2164P0492P4570
55969C937341Q0710Q4039Q9250J00534J10857J13825J16296J26226J37930J42895
55959E039903J45429J53556J64079J70897J78484J92569K06990K14353K20222
$$ plain form
55950 6686482 6918731 7164289 7417892 7680329 7958991 8253802 8556774 8867648 9195238
55941 9195238 9541071 9897541 10265002 10654213 11068626 11501333 11953283 12437002 12958324
55932 12958324 13512670 14103293 14743524 15436016 16170273 16946725 17782525 18687515 19656629
55923 19656629 20693363 21817959 23044025 24369862 25800718 27354553 29035934 30829323
55915 30829323 32728891 34750563 36906973 39200785 41654820 44318896 47234262 50421716
55907 50421716 53915712 57774832 62046650 66764651 72000673 77883171 84548250 92117163
55899 92117163 100737932 110594373 121850610 134644900 149164964 165670396 184432666
55892 184432666 205759289 230120157 258129330 290324838 327044631 368405190 413778136
$$ packed form
55950F686482K32249K45558K53603K62437K78662K94811L02972L10874L27590
55941I195238L45833L56470L67461L89211M14413M32707M51950M83719N21322
55932A2958324N54346N90623O40231O92492P34257P76452Q35800R04990R69114
55923A9656629J036734J124596J226066J325837J430856J553835J681381J793389
55915C0829323J899568K021672K156410K293812K454035K664076K915366L187454
55907E0421716L493996L859120M271818M718001N236022N882498O665079P568913
55899I2117163Q620769R856441J1256237J2794290J4520064J6505432J8762270
55892A84432666K1326623K4360868K8009173L2195508L6719793M1360559M5372946
$$ plain form
55885 413778136 460556979 503380781 535331307 550855000 548204942 529573172 499322400
55878 499322400 462078966 421730126 381123430 342040719 305403479 271665390 241103044
55871 241103044 213849195 189849339 168913643 150790785 135172211 121698507 110027298
55864 110027298 99881806 91024915 83235923 76341808 70232750 64817170 59987745 55647777
55856 55647777 51735891 48201006 44980171 42021095 39300571 36800894 34490515 32344457
55848 32344457 30360716 28538713 26860839 25309731 23883366 22577684 21372814 20251410
55840 20251410 19213771 18261222 17380695 16558606 15794164 15085811 14418771 13778490 13163533
55831 13163533 12574624 12004407 11448750 10915336 10410601 9929944 9469798 9036732 8635241
$$ packed form
55885D13778136M6778843M2823802L1950526J5523693k650058j8631770l0250772
55878D99322400l7243434m0348840m0606696l9082711l6637240l3738089l0562346
55871B41103044k7253849k3999856k0935696j8122858j5618574j3473704j1671209
55864A10027298j0145492q856891p788992o894115o109058n415580m829425m339968
55856E5647777l911886l534885l220835k959076k720524k499677k310379k146058
55848C2344457j983741j822003j677874j551108j426365j305682j204870j121404
55840B0251410j037639r52549q80527q22089p64442p08353o67040o40281o14957
55831A3163533n88909n70217n55657n33414n04735m80657m60146m33066m01491
$$ plain form
55822 8635241 8258659 7901218 7567042 7258247 6966209 6683959 6415710 6164930 5924334
55813 5924334 5687282 5458425 5243498 5038435 4837646 4643467 4458473 4277862 4098538
55804 4098538 3927107 3770248 3625353 3488457 3362692 3250768 3147757 3049646 2960842 2884795
55794 2884795 2815006 2743596 2671347 2601318 2530257 2455068 2381022 2314812 2255063 2197244 2142273
55783 2142273 2093057 2048197 2006008 1969235 1939318 1911723 1883057 1856789 1835872 1816165 1793574
55772 1793574 1771059 1751726 1731357 1705100 1675754 1648136 1620755 1590265 1558948 1530387 1502442
55761 1502442 1471569 1439747 1410501 1382373 1352823 1324373 1300529 1279661 1258922 1240039 1225266
55750 1225266 1211785 1196054 1179678 1165479 1152125 1138197 1126924 1121021 1117306 1112301 1108402 1108365 1108450
$$ packed form
55822H635241l76582l57441l34176l08795k92038k82250k68249k50780k40596
55813E924334k37052k28857k14927k05063k00789j94179j84994j80611j79324
55804D098538j71431j56859j44895j36896j25765j11924j03011r8111q8804p6047
55794B884795o9789p1410p2249p0029p1061p5189p4046o6210n9749n7819n4971
55783B142273m9216m4860m2189l6773k9917k7595k8666k6268k0917j9707k2591
55772A793574k2515j9333k0369k6257k9346k7618k7381l0490l1317k8561k7945
55761A502442l0873l1822k9246k8128k9550k8450k3844k0868k0739j8883j4773
55750A225266j3481j5731j6376j4199j3354j3928j1273n903l715n005l899l7Q5
$$ plain form
55737 1108450 1103753 1096099 1089875 1084027 1075000 1063890 1053679 1042564 1026953 1008357 990800 973995
55725 973995 955331 936050 919315 904658 890257 878156 871164 866965 861248 854529 850136 847583 843621
55712 843621 837688 830739 820800 805399 786643 768554 751209 732554 713815 697722 683405 668413
55700 668413 653840 642135 631774 619497 606006 594167 583448 571697 560751 554598 553101 552856
55688 552856 553150 555862 560484 564423 567511 571339 574808 574933 571399 566193 559783 551794 544254 539784 537601
55673 537601 535366 533674 534557 536985 538077 537416 535969 532325 524488 514057 504298 495380 485784 476754
55659 476754 470773 466999 462715 457973 454401 451104 446460 442387 441767 443085 442743 441343 442321 445438 447309
55644 447309 447760 449944 454242 457426 458127 458101 457834 455780 452373 450112 449279 448041 447057 449372 455125 460695
$$ packed form
55737A108450m697p654o224n848r027j1110j0211j1115j5611j8596j7557j6805
55725I73995j8664j9281j6735j4657j4401j2101o992m199n717o719m393k553l962
55712H43621n933o949r939j5401j8756j8089j7345j8655j8739j6093j4317j4992
55700F68413j4573j1705j0361j2277j3491j1839j0719j1751j0946o153j497k45
55688E52856K94K712M622L939L088L828L469J25l534n206o410p989p540m470k183
55673E37601k235j692Q83K428J092o61j447l644p837j0431r759q918r596r030
55659D76754n981l774m284m742l572l297m644m073o20J318l42j400R78L117J871
55644D47309M51K184M298L184P01k6k67k054l407k261q33j238r84K315N753N570
$$ plain form
55628 460695 463818 465561 466791 466886 466602 468203 471800 474938 476336 476711 475778 472194 466769 461997 457978
55613 457978 452396 444981 438337 433841 430268 426969 424864 423594 421106 416922 412807 409618 406427 403185
55599 403185 401232 400799 400897 401832 404761 408616 410732 410886 411663 414376 417627 420180 422165 423006 421235 416980
55583 416980 411980 406751 400345 392978 386145 379969 373225 366054 359805 354167 347361 339258 331512 324544
55569 324544 317294 309987 304201 299995 295663 290415 284810 278940 272829 267950 265306 262812 258005 252593
55555 252593 250472 251665 252370 250775 248551 246451 243015 238464 235579 235511 236438 237336 239290 241975 242766 240855
55539 240855 238801 238401 238272 236900 234847 232419 228326 222525 217682 216012 216901 218819 221120 222789 222193
55524 222193 219557 217411 217126 217105 215496 212618 209700 207363 206278 207231 209641 211833 213247 214398 214653
$$ packed form
55628D60695L123J743J230R5k84J601L597L138J398L75r33l584n425m772m019
55613D57978n582p415o644m496l573l299k105j270k488m184m115l189l191l242
55599D03185j953m33R8R35K929L855K116J54P77K713L251K553J985Q41j771m255
55583D16980n000n229o406p367o833o176o744p171o249n638o806q103p746o968
55569C24544p250p307n786m206m332n248n605n870o111m879k644k494m807n412
55555B52593k121J193P05j595k224k100l436m551k885o8R27Q98J954K685P91j911
55539B40855k054m00j29j372k053k428m093n801m843j670Q89J918K301J669n96
55524B22193k636k146k85k1j609k878k918k337j085R53K410K192J414J151K55
$$ plain form
55509 214653 212620 208998 206278 205244 204560 204174 205931 210100 214349 217046 218620 218897 216333 211091 205892
55494 205892 202478 199962 197647 196444 196257 195125 192569 190902 191442 192155 190976 188991 188354 189124 190088 190896
55478 190896 191724 192388 193088 194523 196209 196370 194326 191311 188440 185897 184576 186002 189759 193400 195840
55463 195840 198576 202724 207260 211113 214718 218681 223102 228680 235935 242963 246879 247965 249192 251067
55449 251067 250637 246638 241561 236943 230604 221064 211151 204211 199600 194873 190085 186938 185567 184898 184679
55434 184679 184824 184233 182294 180154 178721 176999 173979 170435 167295 164251 161563 160943 162588 163493 161110
55419 161110 157029 154763 155250 156620 157134 156405 154799 153282 152825 152830 151486 148601 146217 145343 144325 141878
55403 141878 139461 138846 139420 139808 140191 141102 141774 141622 141674 142605 143128 142108 140576 139774 139032 137418 135771
$$ packed form
55509B14653k033l622k720j034o84l86J757M169M249K697J574K77k564n242n199
55494B05892l414k516k315j203j87j132k556j667N40P13j179j985o37P70R64Q08
55478A90896Q28O64P00J435J686J61k044l015k871k543j321J426L757L641K440
55463A95840K736M148M536L853L605L963M421N578P255P028L916J086J227J875
55449B51067m30l999n077m618o339r540r913o940m611m727m788l147j371o69k19
55434A84679J45n91j939k140j433j722l020l544l140l044k688o20J645R05k383
55419A61110m081k266M87J370N14p29j606j517m57Nj344k885k384q74j018k447
55403A41878k417o15N74L88L83R11O72j52N2R31N23j020j532q02p42j614j647
$$ plain form
55386 135771 135169 135054 134682 134673 135436 135901 135574 135706 136581 136087 133331 131233 132548 135293 135335 132182 129124 128570
55368 128570 130027 131946 133039 132389 130460 129369 130312 131674 131554 130808 131459 133359 134795 135276 135309 134432
55352 134432 132045 129437 128492 128795 128213 126012 123470 121903 121806 123281 125596 127091 127236 127894 130754 134513
55336 134513 136566 136568 136215 136313 136222 135668 135048 134253 132969 131771 131477 131955 132812 134403 136777 138758 139502 139825
55318 139825 140448 140383 138876 137458 137828 138997 138889 137697 137164 137430 137161 136353 136553 138352 140593 141927 141616
55301 141616 139354 135834 132879 131560 130988 130254 130249 131758 133244 132741 130863 129663 129545 129532 129544 129954 129801
55284 129801 127978 125526 124313 124089 123243 121747 120857 120474 119463 118226 118363 119964 121573 122617 123578 124125
55268 124125 123459 122254 121883 121964 120994 119204 118338 118766 119242 119444 120326 121874 122904 123198 123637 124116 123570 122206
$$ packed form
55386A35771o02j15l72rP63M65l27J32Q75m94k756k098J315K745M2l153l058n54
55368A28570J457J919J093o50j929j091R43J362j20p46O51J900J436M81L3q77
55352A34432k387k608r45L03n82k201k542j567r7J475K315J495J45O58K860L759
55336A34513K053Kl53R8r1n54o20p95j284j198k94M78Q57J591K374J981P44L23
55318A39825O23o5j507j418L70J169j08j192n33K66k69q08K00J799K241J334l11
55301A41616k262l520k955j319n72p34nJ509J486n03j878j200j18j3J2M10j53
55284A29801j823k452j213k24q46j496q90l83j011j237J37J601J609J044R61N47
55268A24125o66j205l71Q1r70j790q66M28M76K02Q82J548J030K94M39M79n46j364
$$ plain form
55250 122206 121500 121846 122306 122732 123865 125227 125199 123491 121483 120009 118962 119063 121453 125056 126855 125598
55234 125598 123164 121572 120662 119501 118168 117235 117022 118030 120567 123401 124327 122718 120238 118726 118680 119947
55218 119947 122193 124322 125008 124340 123671 123702 124015 124556 125897 127905 129769 131517 133888 136486 137751 137080
55202 137080 135427 133488 130942 127863 125357 124256 124380 125339 126916 128530 129579 130287 131066 131335 130360 128933
55186 128933 128598 129543 130885 132552 134843 136531 135755 132934 130575 129973 130111 130017 130024 130316 130314 130058 130383 131272
55168 131272 131730 131451 130829 129439 126726 124238 124570 127554 130078 130487 130662 132607 135291 136442 135692 134551
55152 134551 134611 136875 141453 146896 151063 153381 155040 156554 156859 155506 153989 153769 154448 154804 154311 152738
55136 152738 149597 145045 140452 137273 136111 136928 139021 140677 140381 138671 137448 137314 137210 136712 136722 137548
$$ packed form
55250A22206p06L46M60M26J133J362k8j708k008j474j047J01K390L603J799j257
55234A25598k434j592r10j161j333r33k13J008K537K834R26j609k480j512m6J267
55218A19947K246K129O86o68o69L1L13N41J341K008J864J748K371K598J265o71
55202A37080j653j939k546l079k506j101J24R59J577J614J049P08P79K69r75j427
55186A28933l35R45J342J667K291J688p76k821k359o02J38r4PK92kk56L25Q89
55168A31272M58k79o22j390k713k488L32K984K524M09J75J945K684J151p50j141
55152A34551O0K264M578N443M167K318J659J514L05j353j517k20O79L56m93j573
55136A52738l141m552m593l179j162Q17K093J656k96j710j223j34j04m98J0Q26
$$ plain form
55120 137548 138289 138580 138951 138946 137093 133628 131232 131949 134984 138386 141246 143456 145000 146383 148166 149445
55104 149445 148489 145467 142633 141253 140445 139690 139974 141256 141278 138519 134479 131569 130470 130828 132465 134396
55088 134396 134587 132436 129911 128748 128228 127168 126178 126201 126636 126804 127579 129577 131312 131277 130465 130764 132170
55071 132170 133610 135135 136999 137790 136103 133411 132746 134809 137482 139038 139884 141153 143219 145710 147811
55056 147811 148681 148530 148784 150305 152257 153671 154957 156525 157174 155718 153285 152098 152624 153719 154910
55041 154910 156585 158394 159455 159962 160852 162126 163221 164805 168273 173332 177792 179966 179913 178377 176130
55026 176130 174469 174647 176363 178125 179460 181397 184402 187255 188731 189262 190016 191096 191551 190720 188868
55011 188868 186686 184736 183407 183028 183736 185216 186737 187675 187860 187233 185554 183106 181335 181666 183533 184656
$$ packed form
55120A37548P41K91L71nj853l465k396P17L035L402K860K210J544J383J783J279
55104A49445r56l022k834j380q08p55K84J282K2k759m040k910j099L58J637J931
55088A34396J91k151k525j163n20j060r90K3M35J68P75J998J735l5q12K99J406
55071A32170J440J525J864P91j687k692o65K063K673J556Q46J269K066K491K101
55056A47811Q70j51K54J521J952J414J286J568O49j456k433j187N26J095J191
55041A54910J675J809J061N07Q90J274J095J584L468N059M460K174n3j536k247
55026A76130j661J78J716J762J335J937L005K853J476N31P54J080M55q31j852
55011A88868k182j950j329l79P08J480J521R38J85o27j679k448j771L31J867J123
$$ plain form
54995 184656 183627 181219 178851 177031 175904 176010 177377 178774 178952 178073 177135 176604 176347 176212 175983 175434
54979 175434 175014 175548 176702 176918 175700 174670 175274 176690 177367 177496 178267 179552 180120 179683 179133 179026 179346
54962 179346 180417 182511 184633 185224 184149 182833 182380 182657 183160 183668 183964 183948 184115 185080 186648 188115 189339
54945 189339 190625 191832 192583 193315 195043 197932 200922 202893 203630 203650 203662 204075 204435 203504 200533 196242 191971
54928 191971 188210 184759 182028 181046 181968 183382 183513 181902 179805 179113 180732 183757 186380 187658 188109
54913 188109 188610 189378 190217 190971 191293 190672 189232 188000 188037 189867 193951 200669 209190 217234 222865 226143
54897 226143 228679 232192 237802 245680 254710 263315 271240 279814 290097 301845 314772 329478 346301
54884 346301 364386 382784 401251 419035 434139 444874 451051 452684 449018 440215 428561 416217
$$ packed form
54995A84656j029k408k368j820j127J06J367J397J78q79r38n31k57j35k29n49
54979A75434m20N34J154K16j218j030O04J416O77J29P71J285N68m37n50j07L20
54962A79346J071K094K122N91j075j316m53K77N03N08K96j6J67R65J568J467J224
54945A89339J286J207P51P32J728K889K990J971P37K0J2M13L60r31k971m291m271
54928A91971l761l451k731r82R22J414J31j611k097o92J619L025K623J278M51
54913A88109N01P68Q39P54L22o21j440j232L7J830M084O718Q521Q044N631L278
54897B26143K536L513N610P878R030Q605P925Q574J0283J1748J2927J4706J6823
54884C46301J8085J8398J8467J7784J5104J0735O177J633l666q803j1654j2344
$$ plain form
54872 416217 402824 387086 369678 352672 336821 321394 306270 292362 280256 270025 262097 256791
54860 256791 253359 250845 249313 248722 247409 243838 239487 237795 240106 244506 248886 253317 259030 266659
54846 266659 276074 286767 297977 309397 321769 335751 350381 363933 376070 387604 398024 404946
54834 404946 406498 403034 396137 387024 376264 363938 349835 334367 319330 306578 295859 285169
54822 285169 273408 261440 250318 239909 229905 221028 214300 209689 206108 202465 198498 194917 192802
54809 192802 192400 192550 191690 189330 186299 183930 183328 184683 186676 187420 186796 186882 189005 191441 191624 189667
54793 189667 187740 186550 184683 181393 177847 175194 173241 171574 170311 169062 166602 162551 158318 155684
54779 155684 155101 155787 156753 157457 158151 159690 162372 165124 166680 167168 167500 167658 167065 166376 167068 169083 170594
$$ packed form
54872D16217j3393j5738j7408j7006j5851j5427j5124j3908j2106j0231p928n306
54860B56791l432k514j532n91j313l571m351j692K311M400M380M431N713P629
54846B66659R415J0693J1210J1420J2372J3982J4630J3552J2137J1534J0420O922
54834D04946J552l464o897r113j0760j2326j4103j5468j5037j2752j0719j0690
54822B85169j1761j1968j1122j0409j0004q877o728m611l581l643l967l581k115
54809A92802m02J50q60k360l031k369o02J355J993P44o24Q6K123K436J83j957
54793A89667j927j190j867l290l546k653j953j667j263j249k460m051m233k634
54779A55684n83O86R66P04O94J539K682K752J556M88L32J58n93o89O92K015J511
$$ plain form
54762 170594 170552 169959 170123 171135 172630 174665 177068 179102 180565 182338 185140 188545 191659 194063 195829
54747 195829 197514 200321 205230 211607 217619 222263 226091 230015 234737 241420 251074 262584 273042 281279
54733 281279 289903 302613 320195 340177 359628 377172 392779 406914 420009 432028 442303 449889
54721 449889 453986 453987 449559 441014 429398 416082 402442 389649 378228 367851 358010 348875 341081
54708 341081 334869 330003 326414 324386 324169 325616 327951 329779 330200 330364 332860 338731 346259 353690 361918
54693 361918 372900 386593 401427 416963 433921 452082 470461 489345 509947 532045 554006
54682 554006 575021 594979 612162 623686 628738 629089 625906 618536 607002 592962 576944 557275
54670 557275 533471 508523 485889 465847 446599 427484 409271 392504 377439 364753 354725
$$ packed form
54762A70594m2n93J64J012J495K035K403K034J463J773K802L405L114K404J766
54747A95829J685K807M909O377O012M644L828L924M722O683R654J1510J0458Q237
54733B81279Q624J2710J7582J9982J9451J7544J5607J4135J3095J2019J0275P586
54721D49889M097Jm428q545j1616j3316j3640j2793j1421j0377r841r135p794
54708C41081o212m866l589k028k17J447K335J828M21J64K496N871P528P431Q228
54693C61918J0982J3693J4834J5536J6958J8161J8379J8884K0602K2098K1961
54682E54006K1015J9958J7183J1524N052L51l183p370j1534j4040j6018j9669
54670E57275k3804k4948k2634k0042j9248j9115j8213j6767j5065j2686j0028
$$ plain form
54659 354725 346239 337907 329560 321712 314464 307916 302618 298533 294551 290174 286578 284768 283713 281759
54645 281759 278977 276565 274589 271934 268219 264402 261548 259947 259255 258721 257528 255623 253958 253468 254259
54630 254259 256102 258847 261837 263880 264628 265192 266596 268428 269789 270719 271769 272890 273729 274424 275314 276363
54614 276363 277634 279764 283298 288073 293723 300128 307013 313944 321058 328747 336309 342287 346771 351878
54600 351878 359039 367200 374731 381667 388839 396149 403139 410070 416947 422583 426274 429419 433862 439442
54586 439442 444824 450013 456243 463950 472550 481870 492272 503789 516621 531958 550579 570959 590626
54573 590626 609306 628981 650611 672437 691904 707822 720086 728479 732491 731652 725566 714104
54561 714104 697802 677761 655226 631560 608171 585771 564017 542544 522049 503696 487789
$$ packed form
54659C54725q486q332q347p848p248o548n298m085l982m377l596j810j055j954
54645B81759k782k412j976k655l715l817k854j601o92n34j193j905j665m90P91
54630B54259J843K745K990K043P48N64J404J832J361R30J050J121Q39O95Q90J049
54614B76363J271K130L534M775N650O405O885O931P114P689P562N978M484N107
54600C51878P161Q161P531O936P172P310O990O931O877N636L691L145M443N580
54586D39442N382N189O230P707Q600R320J0402J1517J2832J5337J8621K0380J9667
54573E90626J8680J9675K1630K1826J9467J5918J2264Q393M012q39o086j1462
54561G14104j6302k0041k2535k3666k3389k2400k1754k1473k0495j8353j5907
$$ plain form
54550 487789 473773 461176 449888 439844 431112 423916 417973 412408 406987 402736 400463 399297 397573
54537 397573 394501 390059 383960 375996 366866 357569 348403 339532 331830 325956 321230 316714 312732 309850
54523 309850 306898 301783 294066 285185 276226 267064 257750 249230 242411 237636 235123 234681 235019 234591 233230
54508 233230 231816 230523 228829 227152 226714 227418 227494 225861 223451 221502 219843 217761 215489 213854 213174
54493 213174 213334 214354 216128 218039 219503 220701 222391 225225 229310 234018 238104 240542 241493 242105 243386
54478 243386 245723 249326 254229 259623 264003 266669 268757 272414 279046 288396 298992 309421 319384 329616
54464 329616 340744 352399 363559 373386 381493 387875 392985 397358 400593 401206 398112 391779 383286 372913
54450 372913 360590 347260 334605 323470 313399 303595 293532 282891 271865 261451 252653 245533
$$ packed form
54550D87789j4016j2597j1288j0044q732p196n943n565n421m251k273j166j724
54537C97573l072m442o099p964r130r297r166q871p702n874m726m516l982k882
54523C09850k952n115p717q881q959r162r314q520o819m775k513m42L38m28j361
54508B33230j414j293j694j677m38P04P6j633k410j949j659k082k272j635o80
54493B13174J60J020J774J911J464J198J690K834M085M708M086K438R51O12J281
54478B43386K337L603M903N394M380K666K088L657O632R350J0596J0429R963J0232
54464C29616J1128J1655J1160R827Q107O382N110M373L235O13l094o333q493j0373
54450C72913j2323j3330j2655j1135j0071r804j0063j0641j1026j0414q798p120
$$ plain form
54438 245533 239763 235699 233855 233539 233238 232387 231725 231708 231536 229969 226469 221539 216581 213301 212321 212402 211823
54421 211823 210470 209705 210262 211279 211553 210867 209841 209132 208946 208844 208129 206841 206003 206292 206993 207171 207294
54404 207294 208553 211014 213699 216133 218400 219948 220026 219333 219528 220734 221156 219736 217703 216695 216636 216415
54388 216415 215673 214827 213947 212561 210445 208146 206770 207131 208684 209539 208339 206004 204667 205005 205743 205727
54372 205727 205139 204355 203042 201061 199194 198204 197931 197879 197974 198287 198790 199781 201695 204095 205704 206055 206349
54355 206349 208096 211506 215602 219296 222043 224151 226767 230840 235821 240180 243338 246045 248717 250763
54341 250763 252284 255131 261133 269968 279732 288999 297539 305462 312560 318324 322189 324134 325213 326898
54327 326898 329642 332753 335716 338609 340891 341198 339102 335968 333152 330393 327022 323651 321187 318904
$$ packed form
54438B45533n770m064j844l16l01q51o62j7j72j567l500m930m958l280r80Q1n79
54421B11823j353p65N57J017K74o86j026p09j86j02p15j288q38K89P01J78J23
54404B07294J259K461K685K434K267J548P8o93J95J206M22j420k033j008n9k21
54388B16415p42q46q80j386k116k299j376L61J553Q55j200k335j337L38P38j6
54372B05727n88p84j313j981j867r90k73n2R5L13N03R91J914K400J609L51K94
54355B06349J747L410M096L694K747K108K616M073M981M359L158K707K672K046
54341B50763J521K847O002Q835R764R267Q540P923P098N764L865J945J079J685
54327C26898K744L111K963K893K282L07k096l134k816k759l371l371k464k283
$$ plain form
54313 318904 315085 309420 303414 298402 294226 290015 285379 280665 276648 274006 272601 271401 269635 267719
54299 267719 266426 265492 263940 261688 259891 259536 260430 261794 263187 264523 265693 266606 267450 268669 270736
54284 270736 273902 278057 282840 287986 293441 299007 304095 308151 311266 314162 317610 321970 327058 332099
54270 332099 335834 337050 335319 331283 326218 321214 316580 311933 306797 301100 295097 289040 283053 277138
54256 277138 271132 264928 258922 253863 249943 246343 242058 236815 230831 224256 217496 211502 206831 202847
54242 202847 198857 195573 194091 193622 191879 188015 183679 180620 178698 177086 175973 175797 175771 174669 172620
54227 172620 170869 170003 169561 169335 169854 171279 172631 172720 171419 169630 168109 166614 164384 161365 158658 157497
54211 157497 158000 159436 161567 165013 169981 175297 179126 180424 179476 177435 175548 174403 173623 172570 171491
$$ packed form
54313C18904l819n665o006n012m176m211m636m714m017k642j405j200j766j916
54299B67719j293r34j552k252j797l55Q94J364J393J336J170R13Q44J219K067
54284B70736L166M155M783N146N455N566N088M056L115K896L448M360N088N041
54270C32099L735J216j731m036n065n004m634m647n136n697o003o057n987n915
54256B77138o006o204o006n059l920l600m285n243n984o575o760n994m671l984
54242B02847l990l284j482m69j743l864m336l059j922j612j113j76k6j102k049
54227A72620j751q66m42k26N19J425J352Q9j301j789j521j495k230l019k707j161
54211A57497N03J436K131L446M968N316L829J298r48k041j887j145p80j053j079
$$ plain form
54196 171491 171465 172998 175162 176551 176673 175936 174602 172384 169247 166180 164673 165163 166204 165793 163732 162034
54180 162034 162453 164330 165769 166298 167085 168790 170790 172714 175133 178017 179937 179854 178680 177806 176821 174095
54164 174095 169489 165185 163477 164551 166895 169327 171882 174713 176938 177373 176303 175540 176259 177571 177978
54149 177978 177491 177203 177368 177422 177726 179551 182898 185762 186420 185453 184721 185016 185433 184551 181754 177734 173953
54132 173953 171271 169196 167074 165639 166241 168656 171019 172116 172378 172343 171674 170279 168903 167837 166446
54117 166446 164802 164242 165105 165347 162963 158781 155310 153573 152644 151786 151355 151631 152170 152522 152764 153106 153625
54100 153625 154360 155281 156256 157241 158123 158410 157913 157922 160420 165451 170466 173209 174023 174211 173407 170344 165482
54083 165482 161003 158321 157049 156374 156110 156274 156710 157343 158072 158514 158468 158303 158183 157416 155571 153629 152836
$$ packed form
54196A71491k6J533K164J389J22p37j334k218l137l067j507M90J041m11k061j698
54180A62034M19J877J439N29P87J705K000J924K419K884J920q3j174q74r85k726
54164A74095m606m304j708J074K344K432K555K831K225M35j070p63P19J312M07
54149A77978m87k88J65N4L04J825L347K864O58r67p32K95M17q82k797m020l781
54132A73953k682k075k122j435O02K415K363J097K62l5o69j395j376j066j391
54117A66446j644n60Q63K42k384m182l471j737r29q58m31K76N39L52K42L42N19
54100A53625P35R21R75R85Q82K87m97RK498N031N015K743Q14J88q04l063m862
54083A65482m479k682j272o75k64J64M36O33P29M42m6j65j20p67j845j942p93
$$ plain form
54066 152836 152753 151825 149683 147520 146176 145234 144286 143795 144106 144636 144698 144486 144618 145116 145347 144823 143681 142425
54048 142425 141319 140240 139213 138783 139327 140154 140183 139653 140133 142415 145479 148129 150446 152678 153843 152906
54032 152906 150646 148990 148850 149804 151399 153433 155239 156023 155833 155219 154290 153189 153013 154846 158043 160834
54016 160834 162497 163652 164603 164970 164977 165562 166732 167273 166673 166254 167676 171063 175063 178112 179405 179348 179274
53999 179274 180164 181568 182491 183109 184571 187106 189587 191248 192607 194183 195399 195581 195286 195820 197781 200687
53983 200687 203819 206975 210498 214804 219861 225147 230183 234839 238983 242400 245532 249742 256084 264252
53969 264252 273452 283821 295884 308994 321532 332694 343054 353363 363692 373774 383248 391550
53957 391550 398492 404916 411843 418929 424667 428187 430092 431649 433976 437688 442166 445321 445335 442629 438968
$$ packed form
54066A52836q3r28k142k163j344r42r48m91L11N30O2k12J32M98K31n24j142j256
54048A42425j106j079j027m30N44Q27K9n30M80K282L064K650K317K232J165r37
54032A52906k260j656j40R54J595K034J806P84j90o14r29j101j76J833L197K791
54016A60834J663J155R51L67PN85J170N41o00m19J422L387M000L049J293n7p4
53999A79274Q90J404R23O18J462K535K481J661J359J576J216J82k95N34J961K906
53983B00687L132L156L523M306N057N286N036M656M144L417L132M210O342Q168
53969B64252R200J0369J2063J3110J2538J1162J0360J0309J0329J0082R474Q302
53957C91550O942O424O927P086N738L520J905J557K327L712M478L155J4k706l661
$$ plain form
53942 438968 434939 429867 424127 419520 416729 414117 409975 404631 399380 394497 389341 383595 377461 371290
53928 371290 365775 361748 358997 355834 350636 343462 335770 329094 324296 321376 319509 317807 316334 315698
53914 315698 315532 314415 311730 308528 305939 303773 301485 299546 298841 299328 300284 301390 302729 304089 305085
53899 305085 305729 306248 306602 306710 306810 307053 307086 306521 305555 304687 304217 304432 305845 308657 312212 315542 318397
53882 318397 321380 325114 329521 333961 338074 342446 348093 355014 361777 367211 372016 377744 384474 390720
53868 390720 395553 399588 403685 407868 411821 415308 417757 418609 418487 418853 420077 421109 421605 423038 426942
53853 426942 433308 441535 451611 463236 474958 485515 495282 505289 515651 526019 536649 547680
53841 547680 558096 566725 573716 579848 585013 588684 591334 593907 596207 597186 596593 595048 592656 588763
$$ packed form
53942D38968m029n072n740m607k791k612m142n344n251m883n156n746o134o171
53928C71290n515m027k751l163n198p174p692o676m798k920j867j702j473o36
53914C15698j66j117k685l202k589k166k288j939p05M87R56J106J339J360R96
53899C05085O44N19L54J08J00K43L3n65r66q68m70K15J413K812L555L330K855
53882C18397K983L734M407M440M113M372N647O921O763N434M805N728O730O246
53868C90720M833M035M097M183L953L487K449Q52j22L66J224J032M96J433L904
53853D26942O366Q227J0076J1625J1722J0557R767J0007J0362J0368J0630J1031
53841E47680J0416Q629O991O132N165L671K650K573K300R79n93j545k392l893
$$ plain form
53827 588763 583111 576174 568461 560337 552161 543632 533572 521686 509887 500194 491722 481755 469791
53814 469791 458304 448990 440512 431114 421534 413598 407160 400334 392283 384167 377332 371686 366033 359350
53800 359350 351766 344652 339375 335388 330132 321672 311094 301428 294472 289693 285959 282928 280367 277432
53786 277432 273572 269521 266522 264949 264355 264386 264785 264729 263234 260411 257569 255768 254856 254138 253336 252521 251659
53769 251659 250714 249766 248644 246901 244628 242785 242196 242636 243475 244691 246484 248378 249704 250745 252341
53754 252341 254385 255737 255728 254843 253747 252640 251820 251893 252906 254179 255598 258380 263851 271907 281143 289956
53738 289956 297153 302275 306269 311380 319436 330109 341367 351533 360416 368506 375774 381722 386348
53725 386348 390539 395181 400076 404315 407731 411227 415161 418263 419184 418604 418455 419155 419006 416598 412452
$$ packed form
53827E88763n652o937p713q124q176q529j0060j1886j1799r693q472r967j1964
53814D69791j1487r314q478r398r580p936o438o826q051q116o835n646n653o683
53800C59350p584p114n277l987n256q460j0578r666o956m779l734l031k561k935
53786B77432l860m051k999j573n94L1L99n6j495k823k842j801r12p18q02q15q62
53769B51659r45r48j122j743k273j843n89M40Q39J216J793J894J326J041J596
53754B52341K044J352rq85j096j107q20P3J013J273J419K782N471Q056R236Q813
53738B89956P197N122L994N111Q056J0673J1258J0166Q883Q090P268N948M626
53725C86348M191M642M895M239L416L496L934L102R21n80j49P00j49k408m146
$$ plain form
53710 412452 407850 403276 398676 394099 389252 383407 376691 370686 366684 363910 360479 355670 350323 345347
53696 345347 340870 336797 333308 330611 328692 327308 326047 324593 323149 322202 321561 320182 317427 314046 311438
53681 311438 310258 310246 310967 312172 313713 315529 317551 319452 320930 322357 324470 327138 329200 329888 329640
53666 329640 329131 328491 328117 329162 332240 336354 340064 342957 345082 345835 344716 342665 341321 341244 341966 343365
53650 343365 345666 348334 350359 351716 353363 355656 357825 359241 360247 361423 362879 364541 366480 368680
53636 368680 370996 373456 376150 378851 381317 383914 387421 392151 397708 403466 408842 413284 416481 418513
53622 418513 419633 420356 421941 425678 430836 434451 434557 433024 433539 437117 441345 443987 445471 447260 449461
53607 449461 451085 451594 451163 450036 448435 446767 445330 444025 442582 440742 438216 435039 432002 430034 429044
$$ packed form
53710D12452m602m574m600m577m847n845o716o005m002k774l431m809n347m976
53696C45347m477m073l489k697j919j384j261j454j444r47o41j379k755l381k608
53681C11438j180j2P21J205J541J816K022J901J478J427K113K668K062O88k48
53666C29640n09o40l74J045L078M114L710K893K125P53j119k051j344p7P22J399
53650C43365K301K668K025J357J647K293K169J416J006J176J456J662J939K200
53636C68680K316K460K694K701K466K597L507M730N557N758N376M442L197K032
53622D18513J120P23J585L737N158L615J06j533N15L578M228K642J484J789K201
53607D49461J624N09m31j127j601j668j437j305j443j840k526l177l037j968r90
$$ plain form
53592 429044 428055 426590 425242 424654 424718 425075 425688 426554 427345 427582 426826 424809 422078 420245 420540 422043 422513
53575 422513 421196 419565 418924 418674 417813 416933 417492 419841 423106 426504 429780 432830 435920 439907 445146
53560 445146 450444 454210 456578 459302 463476 468392 472861 476698 480446 484525 489268 495070 501727 508023
53546 508023 512722 515898 518775 522473 527517 534265 542796 552117 560395 566722 572147 578269 585125 591389
53532 591389 596534 601803 608705 617281 626337 634801 642280 648630 653647 657237 659541 660907 661829 662702 663498
53517 663498 663908 663906 663771 663454 662506 660957 659668 659294 659316 658672 657021 654886 652908 651491 650788 650457 649800 648729
53499 648729 648165 648761 649671 649595 648760 648773 650445 652852 654775 656067 657220 658473 659992 662346 665988 670498
53483 670498 674933 678903 682879 687427 692482 697653 703032 709269 716573 723953 730006 734494 738595 743565
$$ packed form
53592D29044r89j465j348n88O4L57O13Q66P91K37p56k017k731j833K95J503M70
53575D22513j317j631o41k50q61q80N59K349L265L398L276L050L090L987N239
53560D45146N298L766K368K724M174M916M469L837L748M079M743N802O657O296
53546E08023M699L176K877L698N044O748Q531R321Q278O327N425O122O856O264
53532E91389N145N269O902Q576R056Q464P479O350N017L590K304J366R22Q73P96
53517F63498M10kj35l17r48j549j289l74K2o44j651k135j978j417p03l31o57j071
53499F48729n64N96R10p6q35J3J672K407J923J292J153J253J519K354L642M510
53483F70498M435L970L976M548N055N171N379O237P304P380O053M488M101M970
$$ plain form
53469 743565 749815 757479 766955 778164 789952 801089 811605 822521 834625 848186 863426 880360
53457 880360 898283 916252 934159 952825 973124 995425 1019620 1045120 1071069 1097057 1123406
53446 1123406 1150330 1177360 1204181 1231490 1260304 1290882 1323113 1357277 1393468 1430820 1468355
53435 1468355 1506040 1543867 1580696 1615555 1649523 1684491 1720309 1755218 1789099 1824036 1860972
53424 1860972 1897936 1932710 1965569 1998023 2030204 2061075 2090408 2119038 2147528 2175805 2203948
53413 2203948 2232448 2261603 2291150 2320227 2347515 2371983 2394013 2415229 2436670 2457494 2475938
53402 2475938 2490974 2502566 2510893 2516134 2518767 2519372 2518100 2514590 2508318 2498952 2486674 2472283 2456583
53389 2456583 2439476 2420030 2397582 2372455 2345631 2318246 2291338 2265225 2238834 2210344 2178911
$$ packed form
53469G43565O250P664R476J1209J1788J1137J0516J0916J2104J3561J5240J6934
53457H80360J7923J7969J7907J8666K0299K2301K4195K5500K5949K5988K6349
53446A123406K6924K7030K6821K7309K8814L0578L2231L4164L6191L7352L7535
53435A468355L7685L7827L6829L4859L3968L4968L5818L4909L3881L4937L6936
53424A860972L6964L4774L2859L2454L2181L0871K9333K8630K8490K8277K8143
53413B203948K8500K9155K9547K9077K7288K4468K2030K1216K1441K0824J8444
53402B475938J5036J1592Q327N241K633O05j272l510o272r366j2278j4391j5700
53389B456583j7107j9446k2448k5127k6824k7385k6908k6113k6391k8490l1433
$$ plain form
53378 2178911 2145428 2111473 2078091 2045759 2014772 1985207 1956859 1929534 1903304 1878576 1856171
53367 1856171 1836937 1820647 1805802 1791483 1778907 1769949 1764491 1760856 1758735 1759707 1764459 1771450 1779216
53354 1779216 1788246 1799386 1811937 1824844 1838624 1854521 1872558 1891995 1913173 1937367 1964950
53343 1964950 1994929 2026274 2058807 2092875 2128966 2167613 2209021 2252836 2298703 2346769 2397289
53332 2397289 2450139 2505139 2562392 2622010 2684125 2749431 2818832 2891939 2966781 3041609 3116163
53321 3116163 3190600 3264360 3337155 3410049 3484205 3559178 3633562 3706638 3778121 3846930 3911708
53310 3911708 3972398 4030088 4085428 4138169 4187818 4233534 4273609 4306338 4331432 4349624 4361112
53299 4361112 4365438 4362604 4352984 4336254 4311670 4279513 4241098 4197231 4147772 4092823 4033298 3970168
$$ packed form
53378B178911l3483l3955l3382l2332l0987k9565k8348k7325k6230k4728k2405
53367A856171j9234j6290j4845j4319j2576q958n458l635k121R72M752O991P766
53354A779216R030J1140J2551J2907J3780J5897J8037J9437K1178K4194K7583
53343A964950K9979L1345L2533L4068L6091L8647M1408M3815M5867M8066N0520
53332B397289N2850N5000N7253N9618O2115O5306O9401P3107P4842P4828P4554
53321C116163P4437P3760P2795P2894P4156P4973P4384P3076P1483O8809O4778
53310C911708O0690N7690N5340N2741M9649M5716M0075L2729K5094J8192J1488
53299D361112M326k834r620j6730k4584l2157l8415m3867m9459n4949n9525o3130
$$ plain form
53287 3970168 3904174 3836437 3768222 3699771 3630314 3559541 3488108 3416573 3344894 3273347 3202889
53276 3202889 3134146 3066960 3001280 2937524 2875525 2814380 2754178 2696887 2644339 2595999 2549908
53265 2549908 2505379 2463451 2424793 2388574 2353878 2321152 2291466 2265012 2241317 2220563 2203465
53254 2203465 2189486 2176134 2160976 2143969 2127043 2111569 2097144 2082866 2068791 2055618 2043774
53243 2043774 2033428 2024849 2018167 2013233 2010246 2009966 2012653 2017340 2022944 2029672 2038365 2048782 2059637
53230 2059637 2070333 2081742 2095150 2111283 2130520 2153164 2179003 2207161 2236885 2268129 2300965
53219 2300965 2334711 2368031 2399968 2430682 2461087 2491684 2521828 2550327 2576677 2601121 2623393
53208 2623393 2642170 2656495 2667300 2676605 2685148 2691435 2693298 2690082 2683147 2674385 2664274 2651362 2633918
$$ packed form
53287C970168o5994o7737o8215o8451o9457p0773p1433p1535p1679p1547p0458
53276C202889o8743o7186o5680o3756o1999o1145o0202n7291n2548m8340m6091
53265B549908m4529m1928l8658l6219l4696l2726k9686k6454k3695k0754j7098
53254B203465j3979j3352j5158j7007j6926j5474j4425j4278j4075j3173j1844
53243B043774j0346q579o682m934k987k80K687M687N604O728Q693J0417J0855
53230B059637J0696J1409J3408J6133J9237K2644K5839K8158K9724L1244L2836
53219B300965L3746L3320L1937L0714L0405L0597L0144K8499K6350K4444K2272
53208B623393J8777J4325J0805R305Q543O287J863l216o935q762j0111j2912j7444
$$ plain form
53195 2633918 2611997 2587346 2561228 2533215 2502578 2469888 2436294 2401867 2365765 2327755 2288497
53184 2288497 2248507 2207895 2167122 2126977 2087533 2048008 2008046 1968572 1931003 1895921 1862654
53173 1862654 1829814 1796254 1761994 1728374 1696990 1668370 1641775 1616161 1591115 1567073 1544882
53162 1544882 1524865 1506118 1487134 1467516 1448536 1431569 1416523 1402388 1388647 1375290 1362024
53151 1362024 1348477 1334869 1321430 1307426 1291831 1274838 1257712 1241221 1225103 1209013 1192959
53140 1192959 1176778 1160191 1143598 1128004 1113898 1100780 1087778 1074126 1059260 1043250 1026934
53129 1026934 1010771 993915 975479 956447 938883 923240 907845 891326 874115 857124 840371
53118 840371 823748 807975 793720 780456 767148 753661 740829 729403 719358 709929 700060 689230
$$ packed form
53195B633918k1921k4651k6118k8013l0637l2690l3594l4427l6102l8010l9258
53184B288497l9990m0612m0773m0145l9444l9525l9962l9474l7569l5082l3267
53173A862654l2840l3560l4260l3620l1384k8620k6595k5614k5046k4042k2191
53162A544882k0017j8747j8984j9618j8980j6967j5046j4135j3741j3357j3266
53151A362024j3547j3608j3439j4004j5595j6993j7126j6491j6118j6090j6054
53140A192959j6181j6587j6593j5594j4106j3118j3002j3652j4866j6010j6316
53129A026934j6163j6856j8436j9032j7564j5643j5395j6519j7211j6991j6753
53118H40371j6623j5773j4255j3264j3308j3487j2832j1426j0045r429r869j0830
$$ plain form
53106 689230 678053 667633 658298 649477 640791 632403 624218 615718 606890 598503 591046 584171 577485 571054
53092 571054 564777 558211 551574 546078 542551 540304 537894 534505 530098 524875 519217 513741 508881 504672
53078 504672 501161 498636 497222 496694 496756 497007 496737 495502 493791 492203 490169 486813 482980 480618 479668 477488
53062 477488 472516 466931 464134 464756 466791 468755 470953 473889 477084 479627 480981 481335 481864 484180 488575
53047 488575 493253 496321 498115 500373 503520 506205 507447 507858 508476 509541 510785 511896 512281 511119 508110
53032 508110 503641 498048 491394 484135 477180 470839 464329 456900 448988 441692 435278 428784 421203 412755
53018 412755 404711 397993 392305 386793 381150 375497 369467 362489 355182 349358 345870 343290 339629 334648
53004 334648 329485 324642 319815 315518 313265 313652 315334 316466 316393 315374 313500 310665 307287 304251 302045
$$ packed form
53106F89230j1177j0420r335q821q686q388q185q500q828q387p457o875o686o431
53092E71054o277o566o637n496l527k247k410l389m407n223n658n476m860m209
53078E04672l511k525j414n28O2K51k70j235j711j588k034l356l833k362r50k180
53062D77488m972n585k797O22K035J964K198K936L195K543J354L54N29K316M395
53047D88575M678L068J794K258L147K685J242M11O18J065J244J111L85j162l009
53032E08110m469n593o654p259o955o341o510p429p912p296o414o494p581q448
53018D12755q044o718n688n512n643n653o030o978p307n824l488k580l661m981
53004C34648n163m843m827m297k253L87J682J132p3j019j874k835l378l036k206
$$ plain form
52989 302045 300295 298240 295556 292674 290212 288033 285080 280475 274690 269313 265726 264335 264806 266348
52975 266348 267649 267312 265006 262046 260280 260217 260489 259412 256985 254972 254813 255840 256019 254152 250686 246570
52959 246570 242444 239146 237721 238098 238580 237719 236134 235589 236757 238832 240783 241857 241366 239464 237940
52944 237940 238659 241059 242578 241890 240280 239446 239539 240185 241815 244544 246810 246799 244777 242600 241313 240596
52928 240596 240438 241700 244635 248104 250954 253310 255892 258694 261074 262782 264295 266314 269268 273066
52914 273066 277016 280295 282936 286043 290501 295648 299785 302013 303042 304153 305952 308418 311705 316334
52900 316334 322716 330717 339559 347904 354475 359172 363510 369251 376315 382538 385897 386696 387111 388803 391484
52885 391484 393773 394789 394560 393261 390680 386580 381208 375135 368649 361649 354327 347751 343342 341525
$$ packed form
52989C02045j750k055k684k882k462k179k953m605n785n377l587j391M71J542
52975B66348J301l37k306k960j766o3K72j077k427k013j59J027J79j867l466m116
52959B46570m126l298j425L77M82q61j585n45J168K075J951J074m91j902j524
52944B37940P19K400J519o88j610q34R3O46J630K729K266j1k022k177j287p17
52928B40596j58J262K935L469K850K356K582K802K380J708J513K019K954L798
52914B73066L950L279K641L107M458N147M137K228J029J111J799K466L287M629
52900C16334O382Q001Q842Q345O571M697M338N741P064O223L359P99M15J692K681
52885C91484K289J016k29j299k581m100n372o073o486p000p322o576m409j817
$$ plain form
52871 341525 341072 340102 337768 334855 332689 331679 330990 329497 326829 323579 320661 318483 316610 314179 310814
52856 310814 307232 304823 304465 305759 307463 308575 308953 309107 309640 310723 311793 311781 309996 306927 303941 302145
52840 302145 301732 302360 303675 305276 306638 307463 307955 308506 309242 310051 310770 311177 311129 310998 311662 313674 316562
52823 316562 319202 320732 321014 320645 320815 322620 325936 329186 330667 329989 328031 325981 324807 325075 326552
52808 326552 328331 329897 331599 333521 334697 334501 334106 335171 337524 339780 342130 346517 353607 361321 367322
52793 367322 371511 374971 377724 378980 378964 379041 380172 382193 384446 386442 388161 390358 394316 400594 408213
52778 408213 415528 421632 426575 430783 434995 440237 446948 454151 460040 463319 463701 461630 458115 454378
52764 454378 450946 447355 443227 439120 435599 432119 427852 423145 418970 415174 410612 405069 399749 395442
$$ packed form
52871C41525m53r70k334k913k166j010o89j493k668l250k918k178j873k431l365
52856C10814l582k409l58J294J704J112L78J54N33J083J070j2j785l069k986j796
52840C02145m13O28J315J601J362Q25M92N51P36Q09P19M07m8j31O64K012K888
52823C16562K640J530K82l69J70J805L316L250J481o78j958k050j174K68J477
52808C26552J779J566J702J922J176j96l95J065K353K256K350M387P090P714O001
52793C67322M189L460K753J256j6P7J131K021K253J996J719K197L958O278P619
52778D08213P315O104M943M208M212N242O711P203N889L279L82k071l515l737
52764D54378l432l591m128m107l521l480m267m707m175l796m562n543n320m307
$$ plain form
52750 395442 391304 386075 379704 373135 367152 361996 357658 353892 350214 346284 342041 337347 332093 326979
52736 326979 323432 321952 320981 318427 314166 310062 307437 305624 303593 302004 302433 304866 307143 307199 305033
52721 305033 302103 299587 297793 296607 295643 294240 292122 289980 288716 288187 287341 285535 283067 280468 277986
52706 277986 275785 273940 272165 270238 268681 268143 268060 266947 264327 261394 259301 257705 255561 252556 249184
52691 249184 246141 244222 243993 244877 245206 243930 241728 239898 238796 237857 236302 233250 228183 222200 217810
52676 217810 216316 216228 215422 213910 212974 212395 210581 207307 204475 203805 205079 206996 208552 209350 209614 210181
52660 210181 211578 213019 213329 212735 212567 213180 213587 213268 212771 212123 210285 207011 203824 202090 201303 200375 199615
52643 199615 200178 202294 205247 208549 211937 214769 216684 218632 221957 226509 230841 234336 237881 242138
$$ packed form
52750C95442m138n229o371o569n983n156m338l766l678l930m243m694n254n114
52736C26979l547j480r71k554m261m104k625j813k031j589M29K433K277N6k166
52721C05033k930k516j794j186r64j403k118k142j264n29q46j806k468k599k482
52706B77986k201j845j775j927j557n38q3j113k620k933k093j596k144l005l372
52691B49184l043j919k29Q84L29j276k202j830j102r39j555l052n067n983m390
52676B17810j494q8q06j512r36n79j814l274k832o70J274J917J556P98K64N67
52660B10181J397J441L10n94j68O13M07l19m97o48j838l274l187j734p87r28p60
52643A99615N63K116K953L302L388K832J915J948L325M552M332L495L545M257
$$ plain form
52629 242138 246329 249486 252018 255158 259320 263837 268063 271808 274732 276182 275965 274671 272875 270605
52615 270605 267996 265717 263896 261155 255895 248581 241684 237139 234852 233917 233928 234313 233635 230876 226864
52600 226864 223210 220240 217057 213199 209016 204683 200152 196070 193459 192298 191500 190423 189274 187912
52586 187912 185550 182126 178805 176511 174897 173348 172078 171543 171652 172275 173704 175786 177264 177077 175919
52571 175919 175633 177153 179657 181550 181744 180246 178088 176545 175939 175368 173970 172202 171437 172484 174839
52556 174839 177124 178033 177274 175990 175904 177558 179735 180924 180833 179927 178256 175802 173674 173686 176457 180716
52540 180716 184783 188083 190895 193168 194212 193464 191384 189516 189423 191116 192697 192235 190036 188354 188593
52525 188593 189645 189599 188387 187727 188663 190323 191308 191419 191507 192301 194038 196765 200219 203607 206213 208185
$$ packed form
52629B42138M191L157K532L140M162M517M226L745K924J450k17j294j796k270
52615B70605k609k279j821k741n260p314o897m545k287r35J1L85o78k759m012
52600B26864l654k970l183l858m183m333m531m082k611j161p98j077j149j362
52586A87912k362l424l321k294j614j549j270n35J09O23J429K082J478j87j158
52571A75919k86J520K504J893J94j498k158j543o06n71j398j768p65J047K355
52556A74839K285R09p59j284q6J654K177J189r1r06j671k454k128J2K771M259
52540A80716M067L300K812K273J044p48k080j868r3J693J581m62k199j682K39
52525A88593J052m6j212o60R36J660R85J11Q8P94J737K727L454L388K606J972
$$ plain form
52509 208185 210121 211981 213181 213877 215279 218201 221832 224457 225119 224170 222524 220838 219313 217945 216956
52494 216956 216964 218442 220970 223432 225093 226066 226729 227385 228581 230845 233645 235601 236410 237628 240490 243767
52478 243767 245096 244083 242719 242789 244157 245777 247236 248816 250751 252945 255049 256703 257992 259560 261714
52463 261714 263675 264337 263682 262780 262560 263212 264529 266045 267071 267494 268307 270329 272584 273107 271368 268709
52447 268709 266435 264775 263966 264748 267042 269353 270448 270825 271727 273318 274562 274520 273243 271665 270849 270932
52431 270932 270844 269709 268397 268713 271031 273919 276285 278471 280814 282626 283452 283994 284679 284499 282567 279989
52415 279989 278754 279351 280681 281909 283189 284871 287058 289806 292788 295016 295803 295852 296482 297962 299460
52400 299460 300398 300969 301530 302448 304496 308256 312942 316750 318747 319730 320918 322497 323866 324684 325038 324926
$$ packed form
52509B08185J936J860J200O96J402K922L631K625O62r49j646j686j525j368r89
52494B16956QJ478K528K462J661R73O63O56J196K264K800J956Q09J218K862L277
52478B43767J329j013j364P0J368J620J459J580J935K194K104J654J289J568K154
52463B61714J961O62o55r02k20O52J317J516J026M23Q13K022K255N23j739k659
52447B68709k274j660q09P82K294K311J095L77R02J591J244m2j277j578q16Q3
52431B70932q8j135j312L16K318K888K366K186K343J812Q26N42O85j80j932k578
52415B79989j235N97J330J228J280J682K187K748K982K228P87M9O30J480J498
52400B99460R38N71N61R18K048L760M686L808J997R83J188J579J369Q18L54j12
$$ plain form
52384 324926 324248 323369 323187 324286 326206 327949 329266 331020 333948 337449 340211 341821 343074 344654 346284
52369 346284 347391 347917 348114 348172 348385 349188 350595 352023 352893 353026 352441 351532 351526 353740 357788 361427 362967
52352 362967 363210 364244 366902 370178 372704 374007 374556 375324 377148 379952 382720 384509 385218 385189 384736 384398
52336 384398 384883 386057 386688 385964 384763 384564 385524 386450 386334 385197 383724 382792 383086 384397 385518 385437 384400
52319 384400 383271 382283 381117 379738 378303 376523 373993 370959 368054 365436 362998 361241 361049 362535 364713
52304 364713 366420 367163 367233 367478 368838 371528 374827 377982 381043 384344 387567 390023 391628 393041 394949
52289 394949 397562 400538 403043 404304 404550 404957 406266 408073 409950 412421 416076 420486 424953 429662 435018
52274 435018 440410 444822 448250 451338 453925 455350 456145 458171 462715 469231 476082 481825 485917 489008
$$ packed form
52384C24926o78q79j82J099J920J743J317J754K928L501K762J610J253J580J630
52369C46284J107N26J97N8K13Q03J407J428Q70J33n85r09oK214M048L639J540
52352C62967K43J034K658L276K526J303N49P68J824K804K768J789P09k9m53l38
52336C84398M85J174O31p24j201j99R60R26j16j137j473r32K94J311J121q1j037
52319C84400j129r88j166j379j435j780k530l034k905k618k438j757j92J486K178
52304C64713J707P43P0K45J360K690L299L155L061L301L223K456J605J413J908
52289C94949K613K976K505J261K46M07J309J807J877K471L655M410M467M709N356
52274D35018N392M412L428L088K587J425P95K026M544O516O851N743M092L091
$$ plain form
52260 489008 492578 497516 503008 507496 510637 513751 518489 525681 535151 545888 556592 566714 576766
52247 576766 587157 597436 607401 618158 630797 644581 657885 670754 685177 702795 723384 745572
52235 745572 768069 790304 812769 836555 861793 887088 911456 935974 962154 989442 1016160
52224 1016160 1042276 1069058 1096252 1122055 1146179 1170619 1196576 1222629 1246889 1269192 1290205
52213 1290205 1309978 1328503 1346253 1363043 1377580 1389264 1399320 1409096 1418292 1425915 1431862 1436359
52201 1436359 1438783 1438404 1435825 1432585 1429619 1426813 1423611 1419527 1414650 1410103 1407323 1406426 1406076 1405391 1404926
52186 1404926 1405352 1406505 1408621 1413194 1421306 1431992 1443512 1455428 1468156 1481234 1493559 1505053
52174 1505053 1516844 1529957 1544807 1561546 1579698 1597587 1613377 1626857 1639374 1651883 1663705
$$ packed form
52260D89008L570M938N492M488L141L114M738P192R470J0737J0704J0122J0052
52247E76766J0391J0279R965J0757J2639J3784J3304J2869J4423J7618K0589K2188
52235G45572K2497K2235K2465K3786K5238K5295K4368K4518K6180K7288K6718
52224A016160K6116K6782K7194K5803K4124K4440K5957K6053K4260K2303K1013
52213A290205J9773J8525J7750J6790J4537J1684J0056R776R196P623N947M497
52201A436359K424l79k579l240k966k806l202m084m877m547k780q97l50o85m65
52186A404926M26J153K116M573Q112J0686J1520J1916J2728J3078J2325J1494
52174A505053J1791J3113J4850J6739J8152J7889J5790J3480J2517J2509J1822
$$ plain form
52163 1663705 1673249 1679382 1682138 1682644 1682280 1681517 1679561 1675329 1668403 1658744 1646027 1629985 1611175 1590874
52149 1590874 1570341 1550353 1531012 1511632 1491196 1469306 1446288 1422340 1397294 1371529 1346144
52138 1346144 1321778 1298153 1275397 1254760 1237108 1221547 1206550 1191767 1177867 1165360 1154574
52127 1154574 1145885 1138662 1130740 1120455 1108757 1097869 1088227 1078374 1067633 1057154 1048156 1040699 1034504
52114 1034504 1029431 1024641 1018794 1011843 1005459 1000814 997029 992686 987883 983643 980049 976379 972783 970439
52100 970439 969688 969116 967112 963766 960561 958352 956350 953305 949181 945186 942312 940380 938636 936805 935147
52085 935147 933754 932263 930311 928056 926172 925323 925536 926072 926052 925147 923508 921286 918853 917313 917843 920127
52069 920127 922196 922463 921397 920630 920949 921808 922380 922267 921444 920267 919477 919655 920780 922748 925955 930632
$$ packed form
52163A663705R544O133K756N06l64p63j956m232o926r659j2717j6042j8810k0301
52149A590874k0533j9988j9341j9380k0436k1890k3018k3948k5046k5765k5385
52138A346144k4366k3625k2756k0637j7652j5561j4997j4783j3900j2507j0786
52127A154574q689p223p922j0285j1698j0888r642r853j0741j0479q998p457o195
52114A034504n073m790n847o951o384m645l785m343m803m240l594l670l596k344
52100I70439p51n72k004l346l205k209k002l045m124l995k874j932j744j831j658
52085I35147j393j491j952k255j884q49K13N36k0r05j639k222k433j540N30K284
52069I20127K069K67j066p67L19Q59N72j13q23j177p90J78J125J968L207M677
$$ plain form
52053 930632 935911 940494 944286 948589 954582 962359 971585 982221 994121 1006594 1019124 1032284 1047346
52040 1047346 1064940 1084540 1105437 1127857 1152666 1179980 1208616 1237305 1266171 1296323 1328004
52029 1328004 1359960 1391007 1421572 1452959 1485407 1517498 1547568 1575154 1600969 1625796 1649736
52018 1649736 1672482 1693959 1714197 1732451 1747086 1757051 1763201 1767293 1769722 1769198 1764765 1757097 1747485
52005 1747485 1736583 1724688 1712138 1698583 1682780 1664214 1644350 1625363 1608197 1592720 1578981
51994 1578981 1566914 1555291 1542578 1528929 1516132 1505398 1496418 1488843 1483404 1480813 1480430 1481003 1482400
51981 1482400 1485921 1492826 1502868 1514308 1525352 1535650 1546367 1558660 1572201 1585414 1597006 1607066
51969 1607066 1616705 1626774 1636866 1645539 1651852 1656559 1661260 1666200 1669746 1670356 1668153 1663937 1657561 1648361
$$ packed form
52053I30632N279M583L792M303N993P777R226J0636J1900J2473J2530J3160J5062
52040A047346J7594J9600K0897K2420K4809K7314K8636K8689K8866L0152L1681
52029A328004L1956L1047L0565L1387L2448L2091L0070K7586K5815K4827K3940
52018A649736K2746K1477K0238J8254J4635R965O150M092K429n24m433p668r612
52005A747485j0902j1895j2550j3555j5803j8566j9864j8987j7166j5477j3739
51994A578981j2067j1623j2713j3649j2797j0734q980p575n439k591l83N73J397
51981A482400L521O905J0042J1440J1044J0298J0717J2293J3541J3213J1592J0060
51969A607066R639J0069J0092Q673O313M707M701M940L546O10k203m216o376r200
$$ plain form
51955 1648361 1636608 1623292 1608739 1592502 1574456 1554918 1533658 1509928 1483672 1455919 1427623
51944 1427623 1398780 1368849 1337500 1304831 1271381 1237996 1205242 1173004 1141066 1109786 1079520
51933 1079520 1049772 1019853 990305 962577 937145 912868 888428 863596 838908 814994 792554
51922 792554 772140 753379 735011 716205 697474 679999 664433 650521 637370 623952 609912
51911 609912 596208 584478 575404 568010 560673 552402 543037 532820 522174 511609 501592 492634 485316
51898 485316 479647 474431 468093 460446 453031 447319 443110 439143 434802 430583 427008 423736 419966 415424
51884 415424 410562 405714 400473 394409 388185 383106 379362 375671 371267 367262 365066 364191 362886 360458
51870 360458 357626 354890 352157 349972 349341 349831 349408 347000 343983 342220 341720 341305 340644 340255 339982 338816
$$ packed form
51955A648361j1753j3316j4553j6237j8046j9538k1260k3730k6256k7753k8296
51944A427623k8843k9931l1349l2669l3450l3385l2754l2238l1938l1280l0266
51933A079520k9748k9919k9548k7728k5432k4277k4440k4832k4688k3914k2440
51922G92554k0414j8761j8368j8806j8731j7475j5566j3912j3151j3418j4040
51911F09912j3704j1730r074p394p337q271r365j0217j0646j0565j0017q958p318
51898D85316n669n216o338p647p415n712m209l967m341m219l575l272l770m542
51884D15424m862m848n241o064o224n079l744l691m404m005k196q75j305k428
51870C60458k832k736k733k185o31M90m23k408l017j763n00m15o61l89k73j166
$$ plain form
51854 338816 336278 333031 329955 327168 324141 320402 316089 312039 309246 308038 307886 308055 308117 307802 306824 305191
51838 305191 303325 301617 300113 298825 297866 297111 296249 295513 295694 296872 297609 296206 292618 288469 285156 282574
51822 282574 279837 276701 273785 271692 270431 269820 269978 271053 272722 274588 276890 280048 283323 284923 284065
51807 284065 282146 281071 281075 281288 281837 283871 287474 290940 292555 292239 291198 290820 292145 295486 300089 304774
51791 304774 309093 313247 317000 319695 321438 323159 325218 327079 328705 331088 334759 338810 342012 344007
51777 344007 344934 344963 344803 345516 347027 347923 347497 346877 347158 347753 347831 348168 349875 352175 353257 352758 351639 350057
51759 350057 347413 344435 343073 343685 344112 342393 339026 335649 332840 330404 328809 328743 329448 328917 326200 322712
51743 322712 320861 321755 324677 328474 332724 337275 341238 343329 343363 342745 343066 344589 346351 347233 346489 343864
$$ packed form
51854C38816k538l247l076k787l027l739m313m050k793j208j52J69O2l15r78j633
51838C05191j866j708j504j288r59p55q62p36J81J178P37j403l588m149l313k582
51822B82574k737l136k916k093j261o11J58J075J669J866K302L158L275J600q58
51807B84065j919j075MK13N49K034L603L466J615l16j041l78J325L341M603M685
51791C04774M319M154L753K695J743J721K059J861J626K383L671M051L202J995
51777C44007R27K9j60P13J511Q96m26o20K81N95P8L37J707K300J082m99j119j582
51759C50057k644k978j362O12M27j719l367l377k809k436j595o6P05n31k717l488
51743C22712j851Q94K922L797M250M551L963K091L4o18L21J523J762Q82p44k625
$$ plain form
51727 343864 339951 336132 333514 332145 331799 332944 335949 339669 342111 342701 342764 343383 343858 343023 341265 340135
51711 340135 340267 340715 340470 339828 339771 340465 341054 340908 340504 340753 341847 343317 345016 347337 350352 353440 356147
51694 356147 358853 362034 365307 367826 369406 370686 372329 374600 377519 380893 384219 387151 389990 393218
51680 393218 396704 399986 403269 407341 412357 417484 422171 427130 433538 441749 451319 461858 473030 483909
51666 483909 493339 501383 509742 520001 531640 542515 551335 558916 566542 573760 578686 580385 580081 579773
51652 579773 580251 580798 580357 578396 574866 569881 563652 556688 549909 544304 540267 537384 535130 533518 532665
51637 532665 532148 531508 531064 531178 530862 528568 524838 522722 524482 528837 532609 534376 535313 536963 539655 543052
51621 543052 547056 551788 557343 563568 569520 573442 574207 572840 571822 572839 575781 579650 583418 586024
$$ packed form
51727C43864l913l819k618j369l46J145L005L720K442N90O3O19M75q35j758j130
51711C40135J32M48k45o42n7O94N89j46m04K49J094J470J699K321L015L088K707
51694C56147K706L181L273K519J580J280J643K271K919L374L326K932K839L228
51680C93218L486L282L283M072N016N127M687M959O408Q211R570J0539J1172J0879
51666D83909R430Q044Q359J0259J1639J0875Q820P581P626P218M926J699l04l08
51652E79773M78N47m41j961l530m985o229o964o779n605m037k883k254j612q53
51637E32665n17o40m44J14l16k294l730k116J760M355L772J767R37J650K692L397
51621E43052M004M732N555O225N952L922P65j367j018J017K942L869L768K606
$$ plain form
51607 586024 586786 586319 586202 587298 589115 591163 594069 598588 604136 609126 612691 615500 618904 623605 629029
51592 629029 633798 636836 638205 638859 639621 640532 641167 641315 641258 641423 641678 640893 637617 631565 624101 616761 609575
51575 609575 601533 592482 583701 576452 570794 566000 561379 556303 550174 543040 535925 530044 525782 522637
51561 522637 519839 516769 513199 509583 506930 505832 505398 503447 498215 490242 482448 477767 476445 476122 474836
51546 474836 473132 472419 472224 470683 467571 465003 464531 465064 464625 463099 462061 462611 464529 467115 469716 471610
51530 471610 472369 472414 472641 473598 475486 478537 482559 486435 489119 491109 494057 498793 504517 510137 515578
51515 515578 521430 527900 534512 540514 545418 549453 553479 557983 562265 565309 567363 569676 572527 574598
51501 574598 574791 573608 571933 569408 565244 559975 555113 551179 547331 542945 538452 534371 530603 527226
$$ packed form
51607E86024P62m67j17J096J817K048K906M519N548M990L565K809L404M701N424
51592F29029M769L038J369O54P62R11O35J48n7J65K55p85l276o052p464p340p186
51575F09575q042r051q781p249n658m794m621n076o129p134p115n881m262l145
51561E22637k798l070l570l616k653j098m34j951n232p973p794m681j322l23j286
51546D74836j704p13j95j541l112k568m72N33m39j526j038N50J918K586K601J894
51530D71610P59M5K27R57J888L051M022L876K684J990K948M736N724N620N441
51515E15578N852O470O612O002M904M035M026M504M282L044K054K313K851K071
51501E74598J93j183j675k525m164n269m862l934l848m386m493m081l768l377
$$ plain form
51487 527226 525086 524929 526436 528724 531472 535030 539662 545018 550206 554265 556973 559394 563122 568666
51473 568666 574964 580758 585868 590668 595001 598366 600852 603141 605700 608489 611243 613459 614404 613764 612192
51458 612192 610631 609424 608616 608676 609939 611538 612009 611047 609716 608839 608250 607876 608374 609939 611391 611341 609926
51441 609926 608675 608905 610618 612618 613273 611497 607556 602814 598416 594333 589777 584204 577829 571461 565924
51426 565924 561227 556257 549985 543060 537560 534812 534123 533891 533256 532201 530801 529071 527164 525214 523389
51411 523389 522451 523648 527461 532834 538070 542123 544830 546626 548445 551182 554707 558136 561617 566839
51397 566839 574890 584422 593053 600001 606259 612646 618971 624946 630773 636715 642905 649562 656674 663524
51383 663524 669121 673031 675361 676385 676809 677856 680143 682805 684554 685261 685716 686350 687171 688477 690435
$$ packed form
51487E27226k140j57J507K288K748L558M632N356N188M059K708K421L728N544
51473E68666O298N794N110M800M333L365K486K289K559K789K754K216R45o40j572
51458F12192j561j207q08O0J263J599M71r62j331q77n89l74M98J565J452n0j415
51441F09926j251K30J713K000O55j776l941m742m398m083m556n573o375o368n537
51426E65924m697m970o272o925n500k748o89k32o35j055j400j730j907j950j825
51411E23389r38J197L813N373N236M053K707J796J819K737L525L429L481N222
51397E66839Q051R532Q631O948O258O387O325N975N827N942O190O657P112O850
51383F63524N597L910K330J024M24J047K287K662J749P07M55O34Q21J306J958
$$ plain form
51368 690435 692293 693137 693162 693042 692510 691048 689694 690449 693706 697762 701145 703911 706311 707818 708191 708111
51352 708111 707803 706122 702029 696220 690433 685747 682234 679680 677756 675803 673112 669398 664859 660048
51338 660048 655752 652583 650591 649483 648987 648566 647344 645183 643279 642510 641691 638957 634597 630711 628133
51323 628133 625775 623357 622490 624012 626174 626725 625295 622597 618968 615168 612987 613214 614039 613061 609843
51308 609843 604943 597806 587748 576080 564942 554467 543287 531552 521079 512429 504035 494723
51296 494723 485204 476494 468646 461616 455661 450065 443109 434375 425756 419119 414140 409424 404587 399974
51282 399974 395387 390642 386703 384649 383801 382273 379374 376096 373130 369783 365412 360794 357253 355185
51268 355185 354235 354393 355864 357978 359224 358767 357361 356431 356677 358026 360455 364058 368223 371536 373025
$$ packed form
51368F90435J858Q44K5j20n32j462j354P55L257M056L383K766K400J507L73q0
51352G08111l08j681m093n809n787m686l513k554j924j953k691l714m539m811
51338F60048m296l169j992j108m96m21j222k161j904p69q19k734m360l886k578
51323F28133k358k418q67J522K162N51j430k698l629l800k181K27Q25r78l218
51308F09843m900p137j0058j1668j1138j0475j1180j1735j0473q650q394r312
51296D94723r519q710p848p030n955n596o956q734q619o637m979m716m837m613
51282C99974m587m745l939k054q48j528k899l278k966l347m371m618l541k068
51268C55185r50J58J471K114J246m57j406r30K46J349K429L603M165L313J489
$$ plain form
51253 373025 373289 373970 376185 379705 383597 387259 390707 394139 397594 401106 404889 409111 413619 418213 423206
51238 423206 429227 436241 443173 448896 453263 456792 459731 462044 463856 465002 464326 460676 454781 449062
51224 449062 444996 441615 437266 432009 427323 424040 421549 418785 415074 410095 403911 397127 390367 383463
51210 383463 375825 367705 360418 354916 350610 346104 340824 335382 330367 325400 319839 314126 309680 307199
51196 307199 305745 304033 302099 300803 300058 298687 296225 293692 292097 291107 289903 288480 287283 286218 285026
51181 285026 284264 284838 286578 288154 288533 288008 287678 288434 290538 293697 297296 300674 303291 304718 304816 304025
51165 304025 303091 302264 301127 299470 297867 297016 296945 297267 297665 297650 296446 293922 291251 289816 289629 289606 289283
51148 289283 289436 290887 293378 295866 297515 298220 298427 298614 298931 299384 300210 301541 302700 302553 300894 298697
$$ packed form
51253C73025K64O81K215L520L892L662L448L432L455L512L783M222M508M594M993
51238D23206O021P014O932N723M367L529K939K313J812J146o76l650n895n719
51224D49062m066l381m349n257m686l283k491k764l711m979o184o784o760o904
51210C83463p638q120p287n502m306m506n280n442n015m967n561n713m446k481
51196C07199j454j712j934j296p45j371k462k533j595r90j204j423j197j065j192
51181B85026p62N74J740J576L79n25l30P56K104L159L599L378K617J427R8p91
51165C04025r34q27j137j657j603q51p1L22L98j5j204k524k671j435j87k3l23
51148B89283J53J451K491K488J649P05K07J87L17M53Q26J331J159j47j659k197
$$ plain form
51132 298697 296581 293944 290387 286996 285081 284268 283225 281826 281161 281504 281807 281404 280881 280764 280485 279209
51116 279209 276743 273159 268493 263542 260191 259974 262435 265411 266839 266200 264632 263854 264575 265740 265698 264181
51100 264181 262560 261927 261664 260450 258227 256455 256421 257825 259283 259998 260538 261618 262522 261593 258570 255545
51084 255545 254878 256809 259855 262748 264768 264891 262506 258960 256644 256096 255559 253903 252276 251841 251524 249560
51068 249560 246258 243562 242428 242264 242735 244487 247761 251531 254586 256732 258554 260577 262945 265421 267398
51053 267398 268305 268286 268265 269192 271437 274838 278940 283063 286539 289065 290576 290738 289003 285523 281693 279308
51037 279308 279124 280489 282361 284346 286536 288709 290180 290569 290342 290377 291221 292893 295007 296746 297037 295424
$$ packed form
51132B98697k116k637l557l391j915q13j043j399o65L43L03m03n23j17k79j276
51116B79209k466l584m666m951l351k17K461K976J428o39j568p78P21J165m2j517
51100B64181j621o33k63j214k223j772l4J404J458P15N40J080R04r29l023l025
51084B55545o67J931L046K893K020J23k385l546k316n48n37j656j627m35l17j964
51068B49560l302k696j134j64M71J752L274L770L055K146J822K023K368K476J977
51053B67398R07j9k1R27K245L401M102M123L476K526J511J62j735l480l830k385
51037B79308j84J365J872J985K190K173J471L89k27L5Q44J672K114J739K91j613
$$ [...]
##END NTUPLES=NMR SPECTRUM
##END=
