
##TITLE=AC1165_Meta-centauros1_5890947_9W8fkWj1DD
##JCAMPDX= 6.0         $$ Bruker NMR JCAMP-DX V2.0
##DATA TYPE= NMR SPECTRUM
##DATA CLASS= NTUPLES
##ORIGIN= BRUKER
##OWNER= Administrator
$$ 1.72 TOPSPIN		Version 2.1
$$ 2012-04-02 18:51:38.000 -0500  Administrator@TOPSPIN
$$ Compression mode = diff/dup
##.OBSERVE FREQUENCY= 400.13188235
##.OBSERVE NUCLEUS= ^1H
##.ACQUISITION MODE= SIMULTANEOUS (DQD)
##.ACQUISITION SCHEME= undefined
##.AVERAGES= 8
##.DIGITISER RES= 22
##SPECTROMETER/DATA SYSTEM= spect
##.PULSE SEQUENCE= zg30
##.SOLVENT NAME= COFFEE_meoh
##.SHIFT REFERENCE= INTERNAL, COFFEE_meoh, 1, 14.98061
##AUDIT TRAIL= $$ (NUMBER, WHEN, WHO, WHERE, PROCESS, VERSION, WHAT)
$$ ##TITLE= Audit trail, TOPSPIN		Version 2.1
$$ ##JCAMPDX= 5.01
$$ ##ORIGIN= Bruker BioSpin GmbH
$$ ##OWNER= Administrator
$$ $$ C:\Bruker\TOPSPIN/data/COFFEE/nmr/AC1165_Meta-centauros1_5890947_9W8fkWj1DD/10/pdata/1/auditp.txt
$$ ##AUDIT TRAIL=  $$ (NUMBER, WHEN, WHO, WHERE, PROCESS, VERSION, WHAT)
(   1,<2012-04-02 18:51:28.015 -0500>,<Administrator>,<TOPSPIN>,<go>,<TOPSPIN 2.1>,
      <created by zg
	started at 2012-04-02 18:50:20.906 -0500,
	POWCHK enabled, PULCHK disabled,
       configuration hash MD5:
       1A 1E CE 29 27 FD 77 03 67 4E F0 E3 C4 B2 CB 90
       data hash MD5: 64K
       95 0E 13 93 60 5A 0E 0E 24 62 EE EA 18 74 0F B0>)
(   2,<2012-04-02 18:51:32.390 -0500>,<Administrator>,<TOPSPIN>,<proc1d>,<TOPSPIN 2.1>,
      <Start of raw data processing
       efp LB = 0 FT_mod = 6 PKNL = 1 PHC0 = 0 PHC1 = 0 SI = 32K 
       data hash MD5: 32K
       11 F9 B8 85 81 4E 09 00 9B B2 17 0A 94 01 5C 82>)
(   3,<2012-04-02 18:51:32.796 -0500>,<Administrator>,<TOPSPIN>,<proc1d>,<TOPSPIN 2.1>,
      <pk PHC0 = 214.2554 PHC1 = 0 
       data hash MD5: 32K
       2B 0E 7E B6 AE 90 E4 19 29 EA BB 8A F0 D9 F5 1C>)
(   4,<2012-04-02 18:51:32.890 -0500>,<Administrator>,<TOPSPIN>,<proc1d>,<TOPSPIN 2.1>,
      <abs ABSG = 1 
       data hash MD5: 32K
       AB 37 1C 3A D7 CD 74 15 24 DE 47 47 27 3F 1A F0>)
(   5,<2012-04-02 18:51:32.921 -0500>,<Administrator>,<TOPSPIN>,<proc1d>,<TOPSPIN 2.1>,
      <abs ABSG = 2 
       data hash MD5: 32K
       A0 56 DC D9 52 61 20 BE 75 7E FA BB 98 6C 48 9C>)
(   6,<2012-04-02 18:51:32.968 -0500>,<Administrator>,<TOPSPIN>,<proc1d>,<TOPSPIN 2.1>,
      <abs ABSG = 3 
       data hash MD5: 32K
       CA 59 5D 24 F5 6F 2D 15 FE 9C 23 D1 E6 67 2B B1>)
(   7,<2012-04-02 18:51:33.031 -0500>,<Administrator>,<TOPSPIN>,<proc1d>,<TOPSPIN 2.1>,
      <abs ABSG = 4 
       data hash MD5: 32K
       6B 92 69 64 D0 D8 9F 32 55 B0 AC 93 31 BA AD 6C>)
(   8,<2012-04-02 18:51:33.234 -0500>,<Administrator>,<TOPSPIN>,<proc1d>,<TOPSPIN 2.1>,
      <abs ABSG = 5 
       data hash MD5: 32K
       94 1D 67 99 F3 E1 A7 A8 E6 21 6C 4A 99 86 B8 E1>)
$$ ##END=
$$ 
$$ $$ hash MD5
$$ $$ 48 D3 34 5C D8 C2 AD A6 CC 6E 91 10 39 46 89 CD
##$RELAX= 
##$RELAX= 
##$RELAX= 
##$RELAX= 
##$RELAX= 
##$RELAX= 
##$RELAX= 
$$ Bruker specific parameters
$$ --------------------------
$$ [...]
##$TP= (0..7)
150 150 150 150 150 150 150 150
##$TP07= 0
##$TPNAME0= <>
##$TPNAME1= <>
##$TPNAME2= <>
##$TPNAME3= <>
##$TPNAME4= <>
##$TPNAME5= <>
##$TPNAME6= <>
##$TPNAME7= <>
##$TPOAL= (0..7)
0.5 0.5 0.5 0.5 0.5 0.5 0.5 0.5
##$TPOFFS= (0..7)
0 0 0 0 0 0 0 0
##$TUNHIN= 0
##$TUNHOUT= 0
##$TUNXOUT= 0
##$USERA1= <user>
##$USERA2= <user>
##$USERA3= <user>
##$USERA4= <user>
##$USERA5= <user>
##$V9= 5
##$VALIST= <valist>
##$VCLIST= <CCCCCCCCCCCCCCC>
##$VD= 0
##$VDLIST= <DDDDDDDDDDDDDDD>
##$VPLIST= <PPPPPPPPPPPPPPP>
##$VTLIST= <TTTTTTTTTTTTTTT>
##$WBST= 2048
##$WBSW= 25
##$XGAIN= (0..3)
0 0 0 0
##$XL= 0
##$YL= 0
##$YMAX_a= 497857
##$YMIN_a= -601676
##$ZGOPTNS= <>
##$ZL1= 120
##$ZL2= 120
##$ZL3= 120
##$ZL4= 120
##$ABSF1= 14.98061
##$ABSF2= -5.57192
##$ABSG= 5
##$ABSL= 3
##$ALPHA= 0
##$AQORDER= 0
##$ASSFAC= 0
##$ASSFACI= 0
##$ASSFACX= 0
##$ASSWID= 0
##$AUNMP= <proc_prof1d_extract_pilot.lims>
##$AXLEFT= 0
##$AXNAME= <>
##$AXNUC= <1H>
##$AXRIGHT= 0
##$AXTYPE= 0
##$AXUNIT= <>
##$AZFE= 0.1
##$AZFW= 0.1
##$BCFW= 0
##$BC_mod= 0
##$BYTORDP= 0
##$COROFFS= 0
##$CY= 15
##$DATMOD= 1
##$DC= 0
##$DFILT= <>
##$DTYPP= 0
##$F1P= 0
##$F2P= 0
##$FCOR= 0.5
##$FTSIZE= 32768
##$FT_mod= 6
##$GAMMA= 0
##$GB= 0
##$INTBC= 1
##$INTSCL= 1
##$ISEN= 128
##$LB= 0
##$LEV0= 0
##$LPBIN= 0
##$MAXI= 10000
##$MC2= 0
##$MEAN= 0
##$ME_mod= 0
##$MI= 0
##$NCOEF= 0
##$NC_proc= -8
##$NLEV= 6
##$NOISF1= 0
##$NOISF2= 0
##$NSP= 0
##$NTH_PI= 0
##$NZP= 0
##$OFFSET= 14.98061
##$PC= 1
##$PHC0= 214.2554
##$PHC1= 0
##$PH_mod= 1
##$PKNL= yes
##$PPARMOD= 0
##$PPDIAG= 0
##$PPIPTYP= 0
##$PPMPNUM= 2147483647
##$PPRESOL= 1
##$PSCAL= 4
##$PSIGN= 0
##$PYNMP= <proc.py>
##$REVERSE= no
##$SF= 400.13
##$SI= 32768
##$SIGF1= 0
##$SIGF2= 0
##$SINO= 400
##$SIOLD= 32768
##$SPECTYP= <>
##$SREGLST= <1H.CDCl3>
##$SSB= 0
##$STSI= 32768
##$STSR= 0
##$SW_p= 8223.68421052632
##$SYMM= 0
##$S_DEV= 0
##$TDeff= 65536
##$TDoff= 0
##$TI= <>
##$TILT= no
##$TM1= 0
##$TM2= 0
##$TOPLEV= 0
##$USERP1= <user>
##$USERP2= <user>
##$USERP3= <user>
##$USERP4= <user>
##$USERP5= <user>
##$WDW= 1
##$XDIM= 32768
##$YMAX_p= 440390525
##$YMIN_p= -636486
##$CURPLOT= <Network HP LaserJet P1505>
##$CURPRIN= <$Network HP LaserJet P1505>
##$DFORMAT= <normdp>
##$LAYOUT= <+/1D_H.xwp>
##$LFORMAT= <normlp>
##$PFORMAT= <normpl>
##$SURQMSG= 1
$$ End of Bruker specific parameters
$$ ---------------------------------
##NTUPLES= NMR SPECTRUM
##VAR_NAME=  FREQUENCY,     SPECTRUM/REAL,   SPECTRUM/IMAG
##SYMBOL=    X,             R,               I
##VAR_TYPE=  INDEPENDENT,   DEPENDENT,       DEPENDENT
##VAR_FORM=  AFFN,          ASDF,            ASDF
##VAR_DIM=   32768,         32768,           32768
##UNITS=     HZ,            ARBITRARY UNITS, ARBITRARY UNITS
##FACTOR=    0.250966925370066, 1,           1
##FIRST=     8223.43324360095, -142381,      -27344
##LAST=      0,             -49686,          99397
##MIN=       0,             -636486,         0
##MAX=       8223.43324360095, 440390525,    0
$$ Real data points
##PAGE= N=1
##DATA TABLE= (X++(R..R)), XYDATA
$$ [...]
19484a11280A81859b66444j04692J76488j61333R8890B14843a60106O103a7747
19473a8553j0670I997d38424g1479G7426a8438j95758J04083d6130A99802a91473
19461a89929k23396a69058O5993p7922q0721k2496g7703B05072c23531a39624
19450b26342A97595C8490d20581H0090h8576l89960B03481b62180b8522B70379
19439a7761j08715j06441F5995a31974A02574l1764K3494d2097h816H6666f5459
19427i1264j20111L7203h6426B07490a94085A21688J08865b79960l8748G6844
19416a38001j94129C37535a04191j55144f2891n3087n8580l749n3123O8408l29
19405a63351N5198J5052B959K01751I6933C3985b4107l89685B2903a91357j18840
$$ plain form
19484 -111280 181859 -266444 -371136 -194648 -355981 -257091 214843 -160106 -154003 -17747
19473 -18553 -29223 9997 -438424 -71479 77426 -18438 -214196 -110113 -46130 199802 -191473
19461 -189929 -413325 -169058 -103065 -180987 -261708 -284204 -77703 205072 -323531 -139624
19450 -226342 197595 38490 -420581 80090 -88576 -478536 203481 -262180 -28522 270379
19439 -17761 -126476 -232917 65995 -131974 102574 70810 94304 -42097 -8816 86666 -65459
19427 -91264 -211375 -174172 -86426 207490 -194085 121688 230553 -279960 -318708 76844
19416 -138001 -332130 337535 -104191 -259335 -62891 -115978 -174558 -178307 -231430 -163022 -163351
19405 -163351 -108153 -93101 2959 204710 96933 33985 -24107 -413792 22903 -191357 -310197
19394c10197J16777A65215c1942l62843B30013a88358A23292b20048D4469O9146
19384A13615f4242r9799d4461H1228b27096o548L7699i525k60440l6604C3555
19372f4733l2091G16K6474b62706d052q7567J0881H253c61040J16251B2425a09819
19359f1320B95112a50850a1930A65419a45140M5075A44055a57948o336K4738F9235
19347I7171i3693E4591b49910e049B5999b33085a14521F351i5838A87221g9248
19335I9026a16817B48428A1290J02497R0370e9280B117J89946a75664r8309l1058
19324c05031A35980a31313f189j63642E196a3522k36058O7824B38060A2077c02442
19312f1959j06784k06089a36915A08618J69753b26235C06496a97874H5292K40081
$$ plain form
19394 -310197 -193420 165215 -31942 -394785 230013 -188358 123292 -220048 44469 113615
19384 113615 -64242 -164041 -44461 81228 -227096 -233644 -195945 -9525 -269965 -306569 33555
19372 -64733 -96824 716 27190 -262706 -4052 -91619 -80738 8253 -361040 -244789 22425 -109819
19359 -61320 295112 -150850 -11930 165419 -145140 -100065 144055 -157948 -164284 -139546 69235
19347 97171 -93693 54591 -249910 -5049 25999 -233085 -114521 6351 -95838 187221 -79248
19335 99026 -116817 248428 11290 113787 204157 -59280 2117 192063 -175664 -273973 -305031
19324 -305031 135980 -131313 -6189 -169831 5196 -13522 -249580 -181756 238060 12077 -302442
19312 -61959 -168743 -374832 -136915 108618 278371 -226235 306496 -197874 85292 325373
19302C25373a89051A17003a62343e7972a1356j26556O549A00021b03208l7104
19292b40312J01109j64117a5908n5544b3119E5543O9352J46160b10115j64523
19282c74638d3589k33565H9412e8831j63002m2998B46877B5744N2022b54125Q7137
19271a66988K6882k43601b7325j26405j18602A08928d648j87726d1836E7827a18971
19259A053c14664C73732h1689k27616J4539C4767J74163a62893f416j33620O9557
19248g0479k01565G2972K05709b6056j03135c1939j1739l83539d0255J1096j28190
19237a57349j3857j03233B0169a4858j135j47629j1310A0011b34442J07091A12201
19225a11626A29828n9394P5365b19364J9230O8125k28404J68432j57631D3827
$$ plain form
19302 325373 -189051 117003 -162343 -57972 -11356 -137912 -131363 100021 -203208 -240312
19292 -240312 -139203 -303320 -15908 -71452 -23119 55543 124895 271055 -210115 -374638
19282 -374638 -43589 -277154 89412 -58831 -221833 -264831 246877 25744 77766 -254125 -166988
19271 -166988 -140106 -383707 -27325 -153730 -272332 108928 -4648 -192374 -41836 57827 -118971
19259 1053 -314664 373732 -81689 -309305 -294766 34767 208930 -162893 -6416 -140036 -70479
19248 -70479 -272044 72972 278681 -26056 -129191 -31939 -43678 -427217 -40255 -29159 -157349
19237 -157349 -171206 -274439 20169 -14858 -15993 -163622 -174932 10011 -234442 -127351 112201
19225 -111626 129828 70434 145799 -219364 -200134 -132009 -360413 -191981 -349612 43827
19214a15704l5393H5433k9834a89870j56928E0500d66167b19968M1142B0580b71519
19202e6980B3327M6996g9946m0405j1078l21107G7899J4368c9414C05271a96739
19190B9330i4310A87584f068r475j1883l42109e3264m6558k71006M6805a49907
19178b93573A35396a18895B07573a44962M3684F9574a53231j25379c7616k17363
19168b54979e8926A20350E4567b06943J02447J8622l81882J93057H259N0839j1712
19157D7386j8938J60582K355b68280a3479r6204B0393J78008f4341F7237a4481
19145a91877j8897e8965r554k49697A75695a03729b1657l6620B74153i4491Q840
19134h5651b8050I5744d4282k3373C48284e5081A14912m6505M05140A7509a43464
$$ plain form
19214 -115704 -151097 85433 55599 -189870 -346798 50500 -466167 -219968 -178826 20580 -271519
19202 -56980 23327 70323 -79946 -120351 -131429 -452536 77899 92267 -39414 305271 -196739
19190 29330 -94310 187584 -6068 -15543 -27426 -369535 -53264 -99822 -370828 -324023 -149907
19178 -293573 135396 -118895 207573 -144962 -101278 69574 -153231 -278610 -37616 -254979
19168 -254979 -58926 120350 54567 -206943 -104496 -85874 -467756 -274699 8259 59098 47386
19157 47386 28448 189030 191385 -268280 -13479 -109683 20393 198401 -64341 67237 -14481
19145 -191877 -210774 -58965 -68519 -318216 175695 -103729 -21657 -58277 274153 -94491 -85651
19134 -85651 -28050 95744 -44282 -67655 348284 -55081 114912 68407 473547 17509 -143464
19122b93727d9005j38883o4482f3611r8845L5144o0898h2272B9948j1886f1496
19110A53883a31379M7715e365l5323j32906b1323k16846A11902m8742a30421B9533
19098A17368L7018i3078A31793a49523A4348c0750I7937D4400e3730A40719a55992
19086b45554L6541K6487j53592b50I993a02165A40619a04762L9337A55714a12065
19074B10332D5779a93655P809F4362k2530c19012l0181a09685B881i8126j83588
19063b81714J10330G3986a12209d8436G0899J71679j02264m7332K18320g3355
19052A0263J0868c25585a32408H6497B3985a98997A45671b46581D092R0215j836
19041I2471P6477p9433e3954l0703a0868o8957o7910d109A51461c60525E9115
$$ plain form
19122 -293727 -49005 -187888 -252370 -63611 -162456 -127312 -188210 -82272 29948 18062 -61496
19110 153883 -131379 -83664 -5365 -40688 -173594 -21323 -238169 111902 63160 -130421 29533
19098 117368 154386 -93078 131793 -149523 14348 -30750 97937 44400 -53730 140719 -155992
19086 -245554 -209013 -182526 -336118 -250 9993 -102165 140619 -104762 -65425 155714 -112065
19074 210332 45779 -193655 -185846 64362 41832 -319012 -349193 -109685 2881 -98126 -281714
19063 -281714 -171384 73986 -112209 -48436 70899 242578 140314 92982 311302 -73355
19052 10263 21131 -325585 -132408 86497 23985 -198997 145671 -246581 4092 94307 92471
19041 92471 168948 89515 -53954 -84657 -10868 -79825 -147735 -4109 151461 -360525 59115
19029d40559i8965N421p9430j28944J15880j09882O5377d617D8596a01195D16479
19017a72363C09669a54788A08662Q3254c7274Q292n1147H142a37082e8915j05507
19006a64422e6400H613J53053h8349f409A7386d18567a57071A36935a38923b9319
18994a15936P549H3736a9394A70642B686P6200a26567A68986G1834J52305b72211
18982a29764B26002o0185a12724F5820j3828J72057E2172a70840G8706f6401d781
18970a7135A27459b30423k1737K4581k1418C6985Q8318J59352K551A3805J63951
18959A77756q0685A7964L44573J13338k06008a91229C31722E3405b50787g8297
18948A41065a81472B1479L90330a2380D3604J41087b63231A7300M6596J41397
$$ plain form
19029 -440559 -98965 -93544 -172974 -301918 -186038 -295920 -230543 -4617 48596 -101195 416479
19017 -172363 309669 -154788 108662 191916 -37274 -28982 -80129 8142 -137082 -58915 -164422
19006 -164422 -56400 8613 161666 -88349 -6409 17386 -418567 -157071 136935 -138923 -29319
18994 -115936 -108387 83736 -19394 170642 2686 78886 -126567 168986 71834 224139 -272211
18982 -129764 226002 165817 -112724 65820 51992 224049 52172 -170840 78706 -66401 -4781
18970 -17135 127459 -230423 -252160 -227579 -248997 36985 125303 284655 287206 13805 177756
18959 177756 97071 17964 362537 475875 269867 -191229 331722 53405 -250787 -78297
18948 141065 -181472 21479 411809 -12380 43604 184691 -263231 17300 63896 205293
18938B05293i0728k814L3684j1235b9000A72134G3187a71741e5881n8008k7902
18927a41791B8555A3740a65152c276j3495A15378E6985K45380e07180e5676k89068
18916c44744J07966I0345m3121R728a63403I4882j1403j7016c0320k4406m15593
18905d70319J05199a08844F20048a31513F7053j5150O4633a57370P3172G6190
18894B25198I6553K87197N3386G9488e5721k46167J20003r2331A23539h1771K5226
18883e6545A9789J12419E9082P5211K46607g6591k7688l7132B62595j26180J60408
18872B96823h2192E4930b07536O9462C8180a23208j09693A42797a06476B40084
18861f4302k9532k5972l91928d9695r1268E783b6713A91344J9462a02823A84329
$$ plain form
18938 205293 -90728 -93542 -59858 -71093 -29000 172134 73187 -171741 -55881 -113889 -141791
18927 -141791 28555 13740 -165152 -3276 -16771 115378 56985 302365 -507180 -55676 -344744
18916 -344744 -236778 90345 47224 56952 -163403 94882 83479 66463 -30320 -54726 -470319
18905 -470319 -365120 -108844 620048 -131513 67053 51903 116536 -157370 -84198 76190
18894 225198 96553 383750 437136 79488 -55721 -301888 -181885 -274216 123539 -81771 -56545
18883 -56545 19789 132208 59082 134293 380900 -76591 -104279 -141411 262595 136415 296823
18872 296823 -82192 54930 -207536 -138074 38180 -123208 -232901 142797 -106476 240084
18861 -64302 -93834 -119806 -511734 -49695 -140963 5783 -26713 191344 210806 -102823 184329
18849A0466g3357A18412C1710K20714a56412C6905K555b23520B38826o0965b55962
18837a57204M2941n3076A72699J69413D2526e0327B08497d20989P1570a37599
18826A80408h7354H7599B3432a23321m4590L4792e8421j46417O6234b3453k39958
18815b63411r9649D26781b13298I2079P4642g617k53074A32235a7345A57186M4102
18804B01288D1692b14049A06223K49090c7534n1890q3115q0027A83956P2861c8352
18792B62778a03557B03342Q5537A06343k4085B5206a26254o3957K1503C64369
18781i1959k7116C617e7918C8N4846f9941L1255A849L7693Q0038l1303b17022
18768E2544a53849G7805d513k88224O1767A6453b07857f0651j55932n1978B6302
$$ plain form
18849 10466 -73357 118412 31710 252424 -156412 36905 39460 -223520 238826 177861 -255962
18837 -157204 -114263 -167339 172699 342112 42526 -50327 208497 -420989 -349419 -137599
18826 180408 -87354 87599 23432 -123321 -167911 -133119 -58421 -204838 -138604 -23453 -263411
18815 -263411 -363060 426781 -213298 92079 166721 -7617 -260691 132235 -17345 157186 201288
18804 201288 41692 -214049 106223 355313 -37534 -89424 -172539 -252566 183956 256817 -38352
18792 262778 -103557 203342 288879 106343 82258 25206 -126254 -190211 -168708 364369
18781 -91959 -119075 3617 -57918 38 54884 -69941 -38686 1849 39542 119580 88277 -217022
18768 52544 -153849 77805 -4513 -292737 -230970 16453 -207857 -60651 -216583 -268561 26302
18756f598H0640J72646a37243j83659o166f3516n00845A97460J02132a45547f3412
18744a73191C35185I9761a51619f850B14868G0675h1767m243F1342j4102A7342
18732a01243A52849e9729r2196p5266B54028p7566a33587b1430m1199j31338a311
18720e7261a9598p5919j71744E991L7797b24260A82237i45j90315A82277c71941
18708b94953O7175B8367c60549a39389I1744a21380j27539A35587a46858A49657
18697B79716A13782b14058E3912d04350c6553j2370f115m41815A2223a54356e660
18685a17091o8580N0448O1760F720M4854c48335j893g4479k04937J33731O3336
18674h2349j5710K6325n0483j80708e2049B15381F0421b17078i686k92639h8825
$$ plain form
18756 -6598 80640 253286 -137243 -320902 -327068 -63516 -564361 197460 299592 -145547 -63412
18744 -173191 335185 99761 -151619 -6850 214868 70675 -81767 -86010 61342 47240 17342
18732 -101243 152849 -59729 -151925 -227191 254028 176462 -133587 -21430 -62629 -193967 -1311
18720 -57261 -19598 -95517 -267261 5991 43788 -224260 182237 -945 -191260 182277 -371941
18708 -294953 -227778 28367 -360549 -139389 91744 -121380 -248919 135587 -146858 149657
18697 279716 113782 -214058 53912 -404350 -36553 -48923 -6115 -447930 12223 -154356 -5660
18685 -117091 -185671 -135223 -73463 6720 51574 -348335 -350228 -74479 -279416 -145685 -82349
18674 -82349 -98059 -71734 -122217 -302925 -52049 215381 60421 -217078 -9686 -302325 -88825
18662A1573N9320C4544c87378J61205e2653B96512b32487G8358b67331a05616
18651b3416D17698h6906p2938q0713B58362h782n29556b25069a7044A66538b614
18639c7466j59076a0204j74439r2302d6237i029l27289l2606B681d3673D8184
18627A17181k5976B0612b43627i2797j0923m1129A44490o4957c67305i893n2379
18616f2272k13128a36233d2531o4208k9260A68362G5165A7068a19477O984L3036
18605g9457E7539b21393A60056E8337l017c54179A36551b9601R528o2262j12226
18594a94561M8818L7634m1876B07586a54708G294c75607A97682P2136C5730b50664
18582b91623C26836a7360l33421A44430a06624j54298a10879c3757A5191b26204
$$ plain form
18662 11573 70893 34544 -387378 -226173 -52653 296512 -232487 78358 -267331 -105616
18651 -23416 417698 -86906 -159844 -240557 258362 -8782 -538338 -225069 -17044 166538 -2614
18639 -37466 -196542 -10204 -184643 -276945 -46237 -9029 -336318 -368924 2681 -43673 48184
18627 117181 91205 20612 -243627 -92797 -103720 -144849 144490 79533 -367305 -9893 -62272
18616 -62272 -275400 -136233 -42531 -106739 -135999 168362 75165 17068 -119477 -112493 -79457
18605 -79457 57539 -221393 160056 58337 55320 -354179 136551 -29601 -20073 -82335 -194561
18594 -194561 -145743 -108109 -149985 207586 -154708 7294 -375607 197682 269818 35730 -250664
18582 -291623 326836 -17360 -350781 144430 -106624 -260922 -110879 -33757 15191 -226204
18571E5108J98797A01889A026K74335a01642C49593i2014i883j0710o7229A39745
18559A18557O6395c84960h6654E6939d9606j35658e1573k44788P903b4409j0509
18548c4918o4776A85176K29595g4576A9776b77650c4134B40532a50444k13040
18538c63484i4847c5185r4167l7845F9309c579C3738d373A0881J2961a08512b1260
18525b13567A18283b65015J03258j55208a7641k19844A43590i6593K6625J198
18515f8770R517j80714Q1020A49313a6482R69m5108D6079f2521j52792M4499A46192
18502B35365b7437H8649O9628m7818E1998c45417e7288E8211f5275n4377E8076
18490d05887B26478a17620B8124f5300B6891J44647F7528b26789A24441e7710
$$ plain form
18571 55108 253905 101889 1026 275361 -101642 349593 -92014 -9883 -20593 -87822 139745
18559 118557 184952 -384960 -86654 56939 -49606 -185264 -51573 -296361 -288458 -24409 -34918
18548 -34918 -99694 185176 414771 -74576 19776 -277650 -34134 240532 -150444 -363484
18538 -363484 -94847 -35185 -129352 -167197 69309 -3579 33738 -4373 10881 23842 -108512 -21260
18525 -213567 118283 -265015 -161757 -316965 -17641 -237485 143590 -96593 -69968 -68770
18515 -68770 -59253 -239967 -158947 149313 -16482 -15513 -60621 46079 -62521 -215313 -170814 146192
18502 235365 -27437 88649 158277 110459 51998 -345417 -57288 58211 -65275 -119652 58076
18490 -405887 226478 -117620 28124 -65300 26891 171538 67528 -226789 124441 -57710
18479c89977D3291b38996d3048k4642L2752j05377A01614c1020A4481K8334e20758
18467C1802J28120D0484f1725j48811C29573a49811l8478B74833d89245b1539
18456h8772L789B8412a99961A40087h7916L6419F7779a83991r6927h9559j7499
18445a07058j97744B51177a36908J1168B19912b38947g839j76071k91b707E3805
18433e777q6591J2848E4536g1327B4789N527R042a43958j01918j16891a54677
18421I7363c46865d9438A50502b5899j41935l066C38126b90590F0840j3373c17034
18409a57233e3580j98511Q8529O571k91981A7692e0281B55713E6051j2503c15483
18397A7888c1503A90878h2448k8334a7458G7248P6086b39874i0629H2848c93360
$$ plain form
18479 -389977 43291 -238996 -43048 -67690 -34938 -140315 101614 -31020 14481 42815 -520758
18467 31802 159922 40484 -61725 -210536 329573 -149811 -188289 274833 -489245 -21539
18456 -88772 -84983 28412 -199961 140087 -87916 -51497 67779 -183991 -280918 -89559 -107058
18445 -107058 -304802 251177 -136908 -125740 219912 -238947 -7839 -183910 -184201 -2707 53805
18433 -5777 -92368 -79520 54536 -71327 24789 30316 39358 -143958 -245876 -362767 -154677
18421 97363 -346865 -49438 150502 -25899 -167834 -170900 338126 -290590 60840 47467 -317034
18409 -157233 -53580 -252091 -163562 -156991 -448972 17692 -50281 255713 56051 43548 -315483
18397 17888 -31503 190878 -82448 -110782 -17458 77248 153334 -239874 -90629 82848 -393360
18385A03195a32336a3041C0002a59182K0414G8236c8379r8328B06966k2239a62371
18373a81906C2959c53637e5031j13519A85305c06532d5095n9906f721B98666j48607
18362A50059a76051d1726k13231d6069A76159d9170q8909p3441B12231E0112a97326
18350b34668h0259C3310R5582d0117A68618F4394i6007M6859k64662e7462j64146
18339b21608E105O0603J19457A1960c22789B05188o5616c07362m0186I8544f4646
18327b3331k8592j92190j35403a16566A02278a40407j4095F319b54465a14083
18316B30279a9830B03471D9720g1755A24072A5387a12376A9536a11661A23865
18305c7195n164j29286M2615l2466O7550K443C5007e9988r3164A91982a68936
$$ plain form
18385 103195 -132336 -13041 30002 -159182 -138768 78236 -38379 -136707 206966 184727 -162371
18373 -181906 32959 -353637 -55031 -168550 185305 -306532 -45095 -105001 -6721 298666 150059
18362 150059 -176051 -41726 -254957 -46069 176159 -49170 -138079 -211520 212231 50112 -197326
18350 -234668 -80259 33310 128892 -40117 168618 64394 -96007 -49148 -313810 -57462 -221608
18339 -221608 5105 65708 185165 11960 -322789 205188 139572 -307362 -347548 98544 -64646
18327 -23331 -51923 -244113 -379516 -116566 102278 -140407 -154502 6319 -254465 -114083
18316 230279 -19830 203471 49720 -71755 124072 15387 -112376 19536 -111661 123865
18305 -37195 -42359 -171645 -129030 -161496 -93946 -91503 35007 -59988 -153152 191982 -168936
18293a66072a1393j73693B6433c65656J41712A1138a11485A67911c58071A483
18282a9003k64874A34231a14323A22335b80747m465n5541e4513A88363h2148r9024
18271a81172C08643d03A11433B2390K04170a83579B54375g8483p3140E5380g4547
18259d02062A13931c18058N835B15495b2771j29044B7100R4721J35032F8152A6877
18247e8572k1293K6111l00771e1445r9070o2406C03849a4188j88177A68370E3000
18235G019L56528f9924E2070L9629h8848Q649k66147i7935j9045o7328A3257b68354
18222A34214a0681B26149H3236b45597f2269p7213A40390a0193A57049F9345M1132
18211A10477b14242a0313j8125h208k33551a4290J385j25561A95072a00131d799
$$ plain form
18293 -166072 -11393 -185086 26433 -365656 -223944 11138 -111485 167911 -358071 1483
18282 -19003 -283877 134231 -114323 122335 -280747 -285212 -340753 -54513 188363 -82148 -181172
18271 -181172 308643 -403 111433 22390 226560 -183579 254375 -78483 -151623 55380 -74547
18259 -402062 113931 -318058 -312223 215495 -22771 -151815 27100 121821 256853 68152 16877
18247 -58572 -79865 -53754 -354525 -51445 -150515 -212921 303849 -14188 -202365 168370 53000
18235 7019 363547 -69924 52070 91699 -88848 -80199 -346346 -97935 -116980 -184308 13257 -268354
18222 134214 -10681 226149 83236 -245597 -62269 -139482 140390 -10193 157049 69345 110477
18211 110477 -214242 -10313 -28438 -8208 -241759 -14290 -12905 -138466 195072 -100131 -4799
18199B33718g2554I9929b36654B9386b68070J31449B64512e3402j14955j9932
18189a88289A64389A1931M5307a26635A4083K97184a00061C8551J17138a6544
18178B4631K1622c26937a37425m6026m4367B7230i4897r5873D40348A52978c31690
18166b57254P4696A10816l2667b4331p617r8654a7640m8984c3282j15201f2781
18154A5901f1807A8694g0723E0820M7930a40446A5237a416j16877A18864E6331
18142c1839A57775i3803j57142j2802B15897K6990r7988c6687l05904a26312k7760
18131a54072e8412j15650k59388e9519k34897a25170A58407c32255C6379K2245
18121E8624a66125C9771K39337d04930a37875d0984J9720A28787g6526k34436
$$ plain form
18199 233718 -72554 99929 -236654 29386 -268070 -136621 264512 -53402 -168357 -188289
18189 -188289 164389 11931 57238 -126635 14083 311267 -100061 38551 155689 -16544
18178 24631 46253 -326937 -137425 -183451 -227818 27230 -94897 -190770 440348 152978 -331690
18166 -257254 -182558 110816 78149 -24331 -31948 -130602 -17640 -66624 -33282 -148483 -62781
18154 15901 -61807 18694 -70723 50820 98750 -140446 15237 -1416 -118293 118864 56331
18142 -31839 157775 -93803 -250945 -263747 215897 242887 144899 -36687 -342591 -126312 -154072
18131 -154072 -58412 -174062 -433450 -59519 -294416 -125170 158407 -332255 36379 58624
18121 58624 -166125 39771 279108 -404930 -137875 -40984 -21264 128787 -76526 -310962
18111c10962J54720B0472a89612A96183b33986G4066c55926B78350a67470A30699
18100b69570A7077b496j07085A40157F0489r905J14970F2866a19110A138K10823
18089B11961A4031e3370B05582L1468h8146A7503J94451a69186E7199d5840A48614
18077i336n2209G9156K78187H8187a06191k4250k60780f7139E3214J03702D0407
18065g388q9688D8709K6637a85308N093a0971j55953d0522K551B91942D8472d10690
18052f7598m03818C6081a23041A68921a8067j71057l394l8230C0982K84050f4575
18040c7627l2172B75545f6785A02252e2472j23634g4655I0547p129a00528C25174
18028I0291a98301B4901M093J18127c9954j43977n4230C36318e6523h167G9577
$$ plain form
18111 -310962 -156242 20472 -189612 196183 -233986 74066 -355926 278350 -167470 130699
18100 -269570 17077 -2496 -109581 140157 60489 50584 165554 62866 -119110 1138 211961
18089 211961 14031 -53370 205582 237050 -88146 17503 211954 -169186 57199 -45840 148614
18077 -9336 -61545 79156 357343 88187 -106191 -130441 -391221 -67139 53214 156916 40407
18065 -7388 -97076 48709 75346 -185308 -180215 -10971 -166924 -40522 -37971 291942 48472 -410690
18052 -67598 -471416 36081 -123041 168921 -18067 -189124 -192518 -230748 30982 315032 -64575
18040 -37627 -69799 275545 -66785 102252 -52472 -176106 -74655 90547 83418 -100528 325174
18028 90291 -198301 24901 28994 147121 -39954 -183931 -238161 336318 -56523 -8167 79577
18016a03666l6821A73668M7902F6100a15427A33299d7H9636a85651i1016k07778
18005b98794J12713B46103a98933M4218H5550d1575r0A55456A8556I085K87508
17994B96593b0103e401F5410J10314c82052g3927B89811e8905j26989J6261M9506
17983a20127D5897J66236b84303J02076m6930c3535B42257b17778b3270j20525
17973a43795G2233A2373d1666j46696A92228I1391Q9346m188d099C06700b9140
17961d8622f586B4335Q5528a38726L6920A65815d9386A24329d5270j83142b1642
17949g3058J2295A9650m9J38857d1930j77950D534a98384F7818j1007b9343l8545
17937f7888A63938L2335l8891F2849N1918a48212j5507A39119m8237B6148a39819
$$ plain form
18016 -103666 -140487 173668 221570 66100 -115427 133299 -47 89636 -185651 -91016 -298794
18005 -298794 -186081 246103 -198933 -154715 85550 -41575 -41665 155456 18556 9085 296593
17994 296593 -20103 -5401 65410 175724 -382052 -73927 289811 -58905 -185894 -169633 -120127
17983 -120127 45897 212133 -284303 -182227 -229157 -33535 242257 -217778 -23270 -143795
17973 -143795 72233 12373 -41666 -188362 192228 91391 180737 176549 -4099 306700 -29140
17961 -48622 -6586 24335 109863 -138726 -101806 165815 -49386 124329 -45270 -228412 -21642
17949 -73058 -60763 19650 19601 158458 -41930 -219880 4534 -198384 67818 56811 -29343 -67888
17937 -67888 163938 196273 157382 62849 114767 -148212 -163719 139119 90882 26148 -139819
17925a11852C89656j72175c0129A77108c4727G9963b96282A95778a34451r4779
17915b29230O054e8248B77906b13935A73192a5385q6564A64450A44g6313H1503
17903D1174J21570c1262A54912J2759g140j82776A4633a27400I9899A0703a55205
17891B53a44943A90895G2213C760a08750A48420J81738A08608C0885J33087o0902
17880A03070i6934l720j7774j57174C1974K558K00076a16329A48490b95233A7561
17868e8542o2450B96619C5644M1001k1693j5796c2237B7317M4513h869l0835P483
17856c2221C4526K44106q7262i7951C70270g9385A30875J58541B924c02195d4318
17844B28360f5792C6234o226J89855a03787A54225h202B0026K2314a69784k7353
$$ plain form
17925 -111852 389656 217481 -30129 177108 -34727 79963 -296282 195778 -134451 -229230
17915 -229230 -223176 -58248 277906 -213935 173192 -15385 -101949 164450 144 -76313 81503
17903 41174 162744 -31262 154912 167671 -7140 -189916 14633 -127400 99899 10703 -155205
17891 253 -144943 190895 72213 3760 -108750 148420 330158 108608 30885 163972 103070
17880 103070 -96934 -100654 -118428 -275602 31974 34532 234608 -116329 148490 -295233 17561
17868 -58542 -120992 296619 35644 76645 54952 39156 -32237 27317 71830 -8869 -39704 -32221
17856 -32221 34526 278632 191370 -97951 370270 -79385 130875 289416 2924 -302195 -44318
17844 228360 -65792 36234 30008 219863 -103787 154225 -8202 20026 42340 -169784 -197137
17833a97137A17517A1620K13212b33951D8525a3006A30445a16612F3831d5557
17822d3228j05495k16350c4552A69114L0904A499K48182B5814j587N6326a53192
17810B58649j5076E0133a13480A61431b7523j09456f1682q3531d0337A04071P4784
17799A78855d5081j46741h0714B54279a24808j11830E4812J2011b59116G5784
17788C9085J33002M178b04892d4221F5088B6810b06834A45254h0751A37519c36643
17776e3596I0919b98306D9793k2904K8860R5452C6202K81718a87176b0669B14316
17764h4226M1656m0816a3448A90352e5177B22475c8313B25194k28b0767j37290
17753a58057a9443o6794M1993n4665j93907B21904a64277L8174f972j31884B536
$$ plain form
17833 -197137 117517 11620 224832 -233951 48525 -13006 130445 -116612 63831 -45557
17822 -43228 -148723 -365073 -34552 169114 200018 1499 249681 25814 24227 80553 -153192
17810 258649 243573 50133 -113480 161431 -27523 -136979 -61682 -145213 -40337 104071 178855
17799 178855 -45081 -191822 -80714 254279 -124808 -236638 54812 66823 -259116 75784
17788 39085 172087 176265 -204892 -44221 65088 26810 -206834 145254 -80751 137519 -336643
17776 -53596 90919 -298306 49793 26889 55749 151201 36202 317920 -187176 -20669 214316
17764 -84226 -42570 -83386 -13448 190352 -55177 222475 -38313 225194 224966 -20767 -158057
17753 -158057 -19443 -86237 -44244 -98909 -292816 221904 -164277 -126103 -6972 -138856 2536
17741B49485i5465A63111J11796J06331j26727j26700a20527J8785B20975N557
17731B26532E5831b6231A95638H2182G917N0456L28423d9045B54737d3515n2880
17720i6395F7709a78650A50154n0886l427l6621N8338M5397o1966N945C1391J82003
17708B13394q9842l0048K18093a2471j51476j13108g830k97462B2901L20572A32502
17696a6804B12160q0898Q6735i2652A75132n6934Q7889K8906p9632a19450L6344
17685h3106k48959e2773B64852O0421C6173J12646J82516j11029K8835H7451b01712
17673E4436K27661a23566D24893B06879C4520a05788I1090j5153f067H1889j4303
17662F7586b22063Q7189I5272L82551e1466m818A33745d67512a07239p0611L2609
$$ plain form
17741 249485 -95465 163111 274907 381238 254511 127811 -120527 -101742 220975 226532
17731 226532 55831 -26231 195638 82182 7917 58373 386796 -49045 254737 -43515 -96395
17720 -96395 67709 -178650 150154 99268 95841 59220 117558 162955 100989 106934 31391 213394
17708 213394 123552 93504 311597 -12471 -163947 -277055 -7830 -305292 22901 343473 132502
17696 -16804 212160 131262 217997 -92652 175132 118198 206087 234993 155361 -119450 -83106
17685 -83106 -332065 -52773 264852 325273 36173 148819 331335 220306 249141 87451 -201712
17673 54436 282097 -123566 424893 206879 34520 -105788 91090 75937 -6067 81889 67586
17662 67586 -222063 -134874 95272 477823 -51466 -56284 133745 -467512 -107239 -177850 -145241
17651a45241A89111L5948P7580J1744F2177J3482J78692j074p9825a9500B71926
17639B77842A30046J90399c8702l4586m1384A10052M45925B5943K11919G884a14164
17627C19877a12315B35315o2632n0654a53190C35969H9851B5463a11546d1039
17616A48055b0633D0990h9487o7934C93510a09987B45470j3254i2713B65497A29799
17604a35636c1515G4943i5319D8056j6111J88737m3810i4572b5147C93519p4397
17593C19122p4928I5691a05584E5007J7306B6996b3430j0604A69925o4363K59759
17582C65321a3010A81085a73888B44134b592D91910A84949c647B36130i1634B99856
17570B23028H6540K7901P9912J3480J36373A58166k3846h1013A60564D3150a40578
$$ plain form
17651 -145241 189111 225059 302639 314383 62177 75659 254351 253277 173452 -19500 271926
17639 277842 130046 320445 -38702 -73288 -114672 110052 555977 25943 237862 7884 -114164
17627 319877 -112315 235315 172683 122029 -153190 335969 89851 25463 -111546 -41039
17616 148055 -20633 40990 -89487 -157421 393510 -109987 245470 232216 -92713 265497 129799
17604 -135636 -31515 74943 -95319 48056 31945 220682 176872 -94572 -25147 393519 319122
17593 319122 244194 95691 -105584 55007 72313 26996 -23430 -34034 169925 105562 365321
17582 365321 -13010 181085 -173888 244134 -2592 491910 184949 -3647 236130 -91634 299856
17570 223028 86540 114441 194353 207833 344206 158166 134320 -81013 160564 43150 -140578
17558C72681a53676A16220D8758N8569K76161A15271J01240b9393E8072k2133
17548C5939g109A45456J0463P772P5346e4642I2287J41200b00945B25022J7572
17537B42594A17495a5966C15255a5351B32118K7892M527a45728D51307j90333
17527B60974q6889m2914b5615B19489L1781M34698B20131b273C37588J57281K8799
17516E23668A47776L65614j78891j5146J63239K66253k70500P929L66721q1952
17506G71043l17055j44511R3292A36272M66585k72225J26021K62J81164A43731
17495F66719J96434p4748m7475J66370m30923J20320M8410A18459E3768K58573
17485C12341j47310r625E8178f2880A39355L09267r9025i8647B48195J62222h3330
$$ plain form
17558 372681 -153676 116220 48758 107327 383488 115271 216511 -29393 58072 35939
17548 35939 -7109 145456 155919 163691 239037 -54642 92287 233487 -200945 225022 242594
17537 242594 117495 -15966 315255 -15351 232118 260010 264537 -145728 451307 260974
17527 260974 174085 131171 -25615 219489 251270 685968 220131 -2273 337588 494869 523668
17516 523668 147776 513390 334499 319353 482592 748845 478345 486274 852995 771043
17506 771043 453988 309477 402769 136272 602857 330632 456653 456915 638079 143731
17495 666719 863153 788405 740930 907300 476377 596697 645107 118459 53768 312341
17485 312341 165031 155406 58178 -62880 139355 448622 349597 -98647 248195 410417 -83330
17473I6165a9903B99169a94195B25098L03842g3855A77006p4192M8220K66990
17463D18024a65205C20323J15133B04674J566F3676e959A95391J48129A43072
17452B47781J4352J92922j63747n1227m7904N8189g5304C36044j48156J68876
17442C56764j24044P533N1842j42397b95742C81412H3299K91746q1308q4508o988
17431B02241R6062q5146n7704L8265o9300K07039j43556K24700P3084l6961j68919
17420B79805n2728J14386J48894j27115N5416j7470O6466B20466L7797J69290
17410D27553j68365J30500d9829I348O63007k11340k21923g2534A67052L8608
17400B05660M6367M3325C2121K30470K55105j11672F7463K79972G7179N0288K18542
$$ plain form
17473 96165 -19903 299169 -194195 225098 528940 -73855 177006 102814 151034 418024
17463 418024 -165205 320323 435456 204674 206240 63676 -5959 195391 343520 143072
17452 247781 262133 455055 291308 240081 192177 250366 -75304 336044 187888 356764
17442 356764 232720 240253 292095 149698 -295742 381412 83299 375045 293737 209229 202241
17431 202241 298303 213157 155453 193718 124418 331457 187901 412601 485685 448724 279805
17420 279805 227077 341463 490357 363242 418658 401188 467654 220466 258263 427553
17410 427553 259188 389688 -49829 9348 672355 461015 239092 -72534 167052 205660
17400 205660 252027 295352 32121 262591 517696 406024 67463 347435 77179 127467 346009
17389C46009J05196A86439q5620E45K41494A01618k2551K26331J12372A28042
17378B51955O9936J26243C4901L1095a36495A3281K56165H6780K16063j21806
17368A81037J32491J2325J35459D0683J74709J93792a4932B70500N0279m0306
17358B80473J05444A14448K83562l1578H5223J28091p6268L71371A80684J29164
17348C09848k3750l7753J26039a82027A34673n652O9915a07834J5933B9350a71494
17336B45960a5844C25068j6797g409B82271C1992O3060N7159J38927j27464B6843
17324a39539C18246j0406l5419L7943j30834j5841k6220g4895B5665L66086j63161
17313B28590J17763G8204L58745k689A64861J12067K75876k57632b10915D64758
$$ plain form
17389 346009 451205 186439 100819 545 242039 101618 79067 305398 417770 128042
17378 251955 321891 448134 34901 65996 -136495 13281 269446 86780 302843 181037
17368 181037 313528 325853 461312 40683 215392 409184 -14932 270500 320779 280473
17358 280473 385917 114448 398010 366432 85223 213314 137046 508417 180684 309848
17348 309848 286098 248345 374384 -182027 134673 129021 198936 -107834 -91901 29350 -171494
17336 245960 -15844 325068 308271 -7409 282271 31992 95052 152211 291138 163674 26843
17324 -139539 318246 307840 272421 310364 179530 163689 137469 -74895 25665 391751 228590
17313 228590 346353 78204 436949 434260 164861 276928 552804 295172 -210915 464758
17302A20833i885C41721P9289A72550M8790M556L44667B30642d077A6054M53484
17291D69538J9236N2820k24724K035r8454o1869L15716k04841J8494A19768K9643
17280A49411K56417C4020N6451J10845J47687j29319F8819J06031o106M9574K94432
17269E12750B27120K2142J85980A28151J15203J33843A55609O6496o7313L2334
17259A87126K64186k22088K30112j01886q0852K66998B57373Q8834O8918A63353
17248B71465Q155G8192K84181E9738P2689J04952L9104J98426d1398A86030O7182
17237B53212K39590m3413c1083D75549j24741J45203C5790P9668K90915o5286
17227C41087A63320M63796A74704J98566q6537j02411g0251A62474L13859j27933
$$ plain form
17302 120833 -9885 341721 421010 172550 221340 225896 570563 230642 -4077 16054 469538
17291 469538 488774 541594 316870 318905 220451 158582 474298 269457 287951 119768 149411
17280 149411 405828 34020 90471 201316 349003 219684 68819 174850 168744 218318 512750
17269 512750 227120 249262 435242 128151 243354 377197 155609 222105 154792 187126
17259 187126 451312 229224 459336 357450 276598 543596 257373 346207 415125 163353
17248 271465 279620 78192 362373 59738 132427 237379 276483 474909 -41398 186030 253212
17237 253212 492802 449389 -31083 475549 350808 496011 35790 115458 406373 341087
17227 341087 163320 627116 174704 373270 286733 184322 -70251 162474 476333 348400
17217C48400r4816A17717K11741H4308K18315j11620O761L05295D2125L72803
17207D14928M3210k3054j09767o6947P2618B0155L37741r1491K50730k23330J39567
17196D33372j53187J38840A65878M74029B51675K83393K6642m4091j47728j01817
17186B68074Q2507j68989j1680L57501F7035J05780K04227A68018M6090M1743
17176B55851J72362K11809k43037R9786k36011Q6023J27107j62907J23447j62011
17166B72419J78864J45788j86894J7471J02108l917n1421j6353p8392o061E3354
17154F70663k42358a62431F18634j16753J12345B83306I2235O4458p848L40771
17144D89616m0857A72941J56329J43650k21383J79923P186K78065j88986J61893
$$ plain form
17217 348400 253584 117717 329458 84308 302623 191003 197764 503059 42125 414928
17207 414928 458138 435084 325317 258370 330988 20155 357896 266405 517135 293805 433372
17196 433372 280185 419025 165878 639907 251675 535068 561710 517619 369891 268074
17186 268074 350581 181592 169912 527413 67035 172815 377042 168018 214108 255851
17176 255851 428213 640022 396985 496771 260760 346783 473890 310983 434430 272419
17166 272419 451283 597071 410177 427648 529756 525839 474418 458065 379673 373612 53354
17154 670663 428305 -162431 618634 501881 614226 283306 92235 156693 148845 489616
17144 489616 448759 172941 329270 472920 251537 431460 438646 716711 527725 689618
17134F89618d3573C54091e5255F10008j20890n2027J82765k24633E7105O0552
17124A17657K62212P7071k9520K86549l53503K42422m6208j74593L0703J07837
17114E20627o290j27367M6277K50333j12561J6889k03930A26693L66732J43177
17104F36602K4875r0040k71229K6345L94880k42189N9007L7869k04428J5618m4235
17093C43075Q2470j07806P081K67009q8855K03315R8224C06763J43025Q0662l5311
17082D95139J59630M0606j50347K87209l39284M138q8432N5271N7010K59168J38205
17071I18313D37025r3190M10062j95207k7130J7720J5521J32673k76618l403j61509
17060B55944K19383j70088Q16425m20543C02360K63051J05768p0585o9117j659
$$ plain form
17134 689618 -43573 354091 -55255 610008 489118 437091 619856 395223 57105 117657
17124 117657 379869 456940 427420 713969 360466 602888 556680 382087 412790 520627
17114 520627 514337 386970 433247 683580 571019 587908 383978 126693 493425 636602
17104 636602 661477 571437 300208 326553 721433 479244 538251 576120 371692 387310 343075
17093 343075 425545 317739 324820 591829 502974 706289 804513 306763 449788 530450 495139
17082 495139 654769 695375 545028 832237 492953 497091 408659 463930 520940 780108 918313
17071 918313 437025 343835 753897 558690 531560 549280 564801 697474 420856 417453 255944
17060 255944 475327 305239 1121664 701121 302360 565411 671179 600594 531477 529818
17050E29818J18386j16202r8118M12210j19374R5451k28247N39453D22050K74550
17040F96600j78201K83520O2123k7451n1474P2699o2102k42612j75190N15233
17030H93145m5060M2759k07433n9590M7715m2981K89749o5093J2382j62575k9596
17019F73422K9316j1722J5817P0570J9280K97646k79785J55272J6941J32804l37138
17008G82423J97361J5700k69479J20083j24617j6504M71643n23169j1305L02854
16998I44990k85739J83796J36441o0131K40619k64485N3550L69833k36944k86553
16988G95377N08844k51308P8322K92614m27169q0183o1708r5646L22874n3554
16978A028463J60608K16203k79339j14644J21160l3835R7963m269o1634K37246
$$ plain form
17050 529818 648204 532002 433884 846094 726720 822171 593924 1133377 422050 696600
17040 696600 518399 801919 864042 836591 785117 857816 795714 553102 377912 893145
17030 893145 848085 890844 683411 623821 671536 628555 918304 853211 865593 703018 673422
17019 673422 702738 691016 706833 777403 796683 1094329 814544 969816 986757 1119561 782423
17008 782423 979784 995484 726005 846088 721471 704967 1176610 653441 642136 944990
16998 944990 659251 843047 979488 919357 1159976 895491 949041 1318874 1081930 795377
16988 795377 1304221 1052913 1131235 1423849 996680 916497 854789 759143 1082017 1028463
16978 1028463 1189071 1405274 1125935 1011291 1132451 1098616 1196579 1192310 1130676 1367922
16968A367922j10698N520J14039j22036j4034n39144N08498K7764J0953M409K9939
16957A283132j75074J63075l03276K07420J30188j68670J21879r7438O4891k38669
16947I87458K01593q0590M76003j30634m9926n1862k42065M08253L1440o6759
16937A482911r3500j1089l38069O41578j85906J3772j59706O9247N35035k08728
16927A745545K87664l45779J63002m80440J67273J31724j79811J04270N12862
16918B106310k14781m6532j10668K30769q7492K00793k35349J39406l69051K66473
16908A879878M34406n37506j12629J74064J33508R3367j57611J76051K3240L04342
16898B411110l03550J38768j50346L71237k38484L42965n45531M04872j4451N7618
$$ plain form
16968 1367922 1257224 1262744 1376783 1254747 1240713 701569 1210067 1237831 1248784 1253193 1283132
16957 1283132 1108058 1271133 967857 1175277 1305465 1136795 1258674 1161236 1226127 987458
16947 987458 1189051 1108461 1584464 1453830 1403904 1352042 1109977 1518230 1549670 1482911
16937 1482911 1389411 1378322 1040253 1681831 1495925 1509697 1349991 1419238 1954273 1745545
16927 1745545 2033209 1687430 1850432 1369992 1537265 1668989 1489178 1593448 2106310
16918 2106310 1891529 1844997 1734329 1965098 1877606 2078399 1843050 1982456 1613405 1879878
16908 1879878 2314284 1776778 1664149 1838213 1971721 2065088 1907477 2083528 2106768 2411110
16898 2411110 2107560 2246328 2095982 2467219 2228735 2571700 2026169 2431041 2416590 2474208
16888B474208k0289k70273L60092j23140k5380L10774k71274Q9206k00309N56715
16878B880330k02729k52186N48114l26670M968K9360J64931K26831q8755P3897
16868C058091R2784j77356q7315M81866j61944j69140L35913k26273o373M57756
16858C598009k67400k68986L19323J22914j14889J70100K71416m76552N28594
16849C882529J17311Q2709l37186K47314o0501J87835J35690p5117l17146K78267
16839D141705K68303k55658L44222j74354L18371j35093K864O8617K39898P8309
16829D897184j14720O13324n57191L93567J22078O8520L68969j16353n5683p1524
16819E548171L77145L13054k71490P7367L2646J13067K4803L30201J69904J98874
$$ plain form
16888 2474208 2453919 2183646 2543738 2420598 2395218 2705992 2434718 2523924 2323615 2880330
16878 2880330 2677601 2425415 2973529 2646859 2651827 2681187 2846118 3072949 2984194 3058091
16868 3058091 3150875 2973519 2886204 3368070 3206126 3036986 3372899 3146626 3140253 3598009
16858 3598009 3330609 3061623 3380946 3503860 3388971 3559071 3830487 3353935 3882529
16849 3882529 3999840 4082549 3745363 3992677 3932176 4120011 4255701 4180584 3863438 4141705
16839 4141705 4410008 4154350 4498572 4324218 4642589 4507496 4510360 4578977 4818875 4897184
16829 4897184 4782464 5395788 4838597 5232164 5354242 5422762 5791731 5675378 5619695 5548171
16819 5548171 5925316 6238370 5966880 6044247 6076893 6189960 6214763 6544964 6714868 6913742
16809F913742J61727K6119l6596L32929Q8657K41940k43824L08464K32199K34317
16799H259674K61421L0442J12457N14839J17890Q3693P023O87935J05195J24942
16789A0305511L91844J78128M7813K30952L44775K08660N52655J68645K84279
16780A2713262J56296J83458J99204P28463J1473J083776k48288P78030O0386
16771A5666060O92178L21790O24687M27661N81890J60089R71894L37761N54634
16762B0338644M72944P33077Q94538M62352Q80636P24672R31340P76829M91348
16753B6706380J090554J358048N18733J002085J548624O54044J454174J060355
16745C5392997J433409J580692J282742J412307J767609J432157J912201J943320
$$ plain form
16809 6913742 7075469 7101588 7064992 7397921 7486578 7728518 7484694 7793158 8025357 8259674
16799 8259674 8521095 8551537 8663994 9178833 9296723 9380416 9387439 10075374 10180569 10305511
16789 10305511 10697355 10875483 10923296 11154248 11499023 11707683 12260338 12428983 12713262
16780 12713262 12869558 13053016 13252220 13980683 13992156 15075932 14827644 15605674 15666060
16771 15666060 16358238 16680028 17304715 17732376 18314266 18474355 19446249 19784010 20338644
16762 20338644 20811588 21544665 22439203 22901555 23782191 24506863 25438203 26215032 26706380
16753 26706380 27796934 29154982 29673715 30675800 32224424 32878468 34332642 35392997
16745 35392997 36826406 38407098 39689840 41102147 42869756 44301913 46214114 48157434
16737D8157434J591400K346457J944118K226127J927100K730565K374532K730018
16729F6027751K493659K465361L320978K803349K905324L194883L485689K674378
16721H9371372L429364L306452L337509K910318L353956L239049K995216K655554
16713A14598790K682815K523479J752383J916854J710772J108378Q07425M09847
16705A27510743j20329j01678q75668p65180j304832k256204j968711k501393
16697A17616748k163013l068986l199592k685111l345976l228978l230785l231768
16689I3462539l313536l170000l159484l359258l239066k818349l238896k326309
16681F8837641l353199k393833k501126k229492k518572j896023k433921j931738
$$ plain form
16737 48157434 49748834 52095291 54039409 56265536 58192636 60923201 63297733 66027751
16729 66027751 68521410 70986771 74307749 77111098 80016422 83211305 86696994 89371372
16721 89371372 92800736 96107188 99444697 102355015 105708971 108948020 111943236 114598790
16713 114598790 117281605 119805084 121557467 123474321 125185093 126293471 127100896 127510743
16705 127510743 127390414 127288736 126413068 125647888 124343056 122086852 120118141 117616748
16697 117616748 115453735 112384749 109185157 106500046 103154070 99925092 96694307 93462539
16689 93462539 90149003 86979003 83819519 80460261 77221195 74402846 71163950 68837641
16681 68837641 65484442 63090609 60589483 58359991 55841419 53945396 51511475 49579737
16673D9579737j925169j975035j586016j697768j471255j837979j338366j480399
16665C6267750j372720j220266p89499j722248m73396j277206j089324p54152
16657B7568939q69604q45793j214991p58995p88088o82499r54169n13533n92809
16648B0348458n00049r92916Q121o87296l32605o81802m91803o87809m83658m1593
16638A5457048l49685n40339j61509n40756m47261p7313o20187l91351k24770
16629A2103877m72169k03201J62955n38393m5016o68156J04345m08907m04902
16620I630433k01658J16196m33160l17918M66422m78772j32003j50183k08453
16611H290904p4496m52497K4291l14526Q5343k91488m4146k99025l1208o9165
$$ plain form
16673 49579737 47654568 45679533 44093517 42395749 40924494 39086515 37748149 36267750
16665 36267750 34895030 33674764 32885265 31163017 30689621 29412415 28323091 27568939
16657 27568939 26699335 25853542 24638551 23879556 23091468 22408969 21454800 20941267 20348458
16648 20348458 19848409 18855493 18863614 18176318 17843713 17161911 16670108 15982299 15498641 15457048
16638 15457048 15107363 14567024 14405515 13864759 13417498 13340185 12719998 12328647 12103877
16629 12103877 11631708 11428507 11591462 11053069 11008053 10339897 10444242 10035335 9630433
16620 9630433 9428775 9544971 9111811 8793893 9260315 8781543 8649540 8499357 8290904
16611 8290904 8216408 7763911 7788202 7473676 7559019 7267531 7223385 6924360 6893152 6823987
16601F823987k5260j73922j32047P4774l52726m22030o1895p8618N6208k67566
16591E440905n8603J5061J07050J3111j17022m86601K42767j9831j82880k16157
16581D737800j90622K00353j32887q6063l08515J36453J76808j7232m72011K29393
16571D273477J05065j98850k89310K67260k43472l60959L95697r6530k52041j69278
16561C431059j9299L3118M1368k46819K60668l7727m8692k67819r0274j55100
16551B900483J12151K69512l91041L7816n6969k50375J92879K29434l25110j09045
16541B609735J1213K14175m13545J14114j74915N05037p42026M40832p8992K80665
16531B766293l28546n1691J6003L0218J91105n00805L96283j60932m04640J09153
$$ plain form
16601 6823987 6798727 6624805 6492758 6567532 6214806 5792776 5730881 5652263 5708471 5440905
16591 5440905 5382302 5397363 5504413 5517524 5400502 4913901 5156668 5136837 4953957 4737800
16581 4737800 4547178 4747531 4614644 4528581 4220066 4356519 4533327 4516095 4044084 4273477
16571 4273477 4378542 4179692 3890382 4157642 3914170 3553211 3948908 3852378 3600337 3431059
16561 3431059 3411760 3444878 3486246 3239427 3500095 3462368 3413676 3145857 3055583 2900483
16551 2900483 3012634 3282146 2891105 2928921 2871952 2621577 2814456 3043890 2718780 2609735
16541 2609735 2620948 2835123 2421578 2535692 2360777 2865814 2123788 2564620 2485628 2766293
16531 2766293 2437747 2386056 2402059 2432277 2623382 2122577 2518860 2357928 1953288 2062441
16521B062441K65047j87754k35079n3549N6814O00797l68612J61655k87469k60361
16511A753930Q5354L11038j61721l18184J07521J84850j73988J38328l08694L66164
16501A984598j40899K09681k26873l52492M33612j32253N0174P6462k86058k10646
16491A405306J92087J1594L22830l85591J65875j83011k4768L1799L8485J07986
16481A682592j98342j58241J03741M6839j91707P8805p0481M00332j43600l08880
16471A241058O3118K85565j76854o0566L2768j26796J19700L32408l76510j07584
16461A226307k59035K04220M28910k68970n66523M69724m1887l36132N49258j99529
16451A206343j198k97868K55685Q3394k64292O8073M131m5745J25478j54201j59505
$$ plain form
16521 2062441 2327488 2139734 1904655 1851106 1907920 2508717 2140105 2301760 2014291 1753930
16511 1753930 1839284 2150322 1988601 1670417 1777938 1962788 1788800 1927128 1618434 1984598
16501 1984598 1843699 2053380 1826507 1474015 1907627 1775374 1825548 1902010 1615952 1405306
16491 1405306 1597393 1608987 1931817 1546226 1712101 1529090 1504322 1536121 1574606 1682592
16481 1682592 1484250 1326009 1429750 1476589 1284882 1363687 1293206 1693538 1549938 1241058
16471 1241058 1304176 1589741 1412887 1352321 1385089 1258293 1377993 1710401 1333891 1226307
16461 1226307 967272 1171492 1600402 1331432 764909 1234633 1192746 856614 1405872 1206343
16451 1206343 1205145 907277 1162962 1246356 982064 1050137 1054268 1008523 1134001 979800 820295
16440H20295L71182n3836j17471J49772J27592m902k32016L4068j59173M06363
16430A341874k85710K14008l21202J02907j35683J72314j66760K28149j96086
16421I53811J1946j4841M1061J5501j59067K2115k23992M90443m07436Q1756K46600
16410A057897m16005K54546k0309Q0708j19311K23J97124q2665j19428L01976
16400A134756D98656K52387J42080j37512M6954j52724K03700k98118M62965D86287
16389G63379M5868j57110M98113l24388K15880n5344r3306m44129N73558l61824
16379F60697N4868M6612j48779K13574J06954j18680r1366l8570l1774k4677K89034
16368I17893K7728C40677R6162Q1327K89555j35294k27871M49392k49461k5606
$$ plain form
16440 820295 1191477 1137641 1020170 1169942 1297534 1292632 1060616 1094684 935511 1341874
16430 1341874 1056164 1270172 948970 1051877 916194 1088508 921748 1149897 953811
16421 953811 965757 950916 991977 1007478 848411 870526 646534 1136977 729541 811297 1057897
16410 1057897 641892 896438 876129 956837 837526 837749 1034873 952208 832780 1134756
16400 1134756 498656 751043 893123 755611 802565 649841 853541 555423 1018388 486287
16389 763379 809247 652137 1150250 825862 1041742 986398 893092 448963 1022521 660697
16379 660697 715565 762177 613398 826972 933926 815246 723880 685310 653536 628859 917893
16368 917893 945621 340677 436839 518166 807721 672427 444556 893948 644487 618881
16358F18881K88191k34851N01074l03729C22645M63736K98479m09749p4331j19462
16348D81318j69591M97184k65861k5244O7486J03159j67077K5505j3803J17882
16338F50958k82976J94233J81378j9190K09287j75326k70955J77658l18497L80376
16328G26946n3774j73282p077k14082J87200k26901L37064J58722L9525l18599
16318D55742m5447j58143K24907r2417R3585o3616K21535k76446O3963Q8476o1161
16307D50978k4663l3476J37272M5198q2663K3163o2061B18757O1157L42122B91942
16295E65260k49995K37141P1372k52327j4098J3494j6810r8576M3378P333l1424
16284B74748R3574j69013J69808k5653A70845K91829A27833O85929C88036Q048
$$ plain form
16358 618881 907072 672221 1173295 869566 322645 786381 1084860 675111 600780 481318
16348 481318 311727 808911 543050 517806 585292 688451 521374 546879 533076 650958
16338 650958 367982 562215 743593 724403 933690 758364 487409 665067 346570 726946
16328 726946 673172 499890 492813 278731 465931 239030 576094 734816 774341 455742
16318 455742 410295 252152 477059 384642 478227 414611 636146 359700 423663 512139 450978
16307 450978 426315 392839 530111 575309 492646 515809 453748 218757 279914 622036 291942
16295 565260 315265 552406 623778 371451 357353 370847 354037 255461 298839 306172 274748
16284 274748 368322 199309 369117 343464 170845 462674 127833 813762 388036 396084
16274C96084L0693j36978L45386k83389j00937M01276l17561L02313q5509j56000
16264C95378J12412J55546A18207m4334N42460j94545j0393Q8013L7244B62076
16253C87896j33823J26362J26040A18537L48689L02356A57218M66485j49971B9146
16242B55839K37509D2440M82101e5252E58991A32552J56359K37300A81513m5213
16232A36300K46144O9084A27440M38762k18618K49587A02035L04563F7795M47407
16222E15202j9037j16977j28825d123D84383o5271d0850B65051N092n1571J42515
16211C61087R7850Q5293q0901J59886e7216A56329L39105A17976K77882L01632
16201F97490C32409H2518L03586I8330b6899D08071j19257Q6638F987K91569M1764
$$ plain form
16274 396084 426777 289799 635185 351796 250859 652135 334574 636887 551378 395378
16264 395378 507790 663336 118207 73873 616333 421788 411395 499408 536652 262076
16253 387896 254073 380435 506475 118537 467226 769582 157218 623703 473732 29146
16242 255839 493348 42440 524541 -55252 558991 132552 288911 526211 181513 136300
16232 136300 382444 451528 127440 566202 347584 597171 102035 406598 67795 515202
16222 515202 496165 379188 250363 -4123 484383 419112 -40850 265051 270143 218572 361087
16211 361087 458937 544230 463329 623215 -57216 156329 495434 117976 395858 697490
16201 697490 332409 82518 386104 98330 -26899 408071 288814 375452 6987 298556 340320
16190C40320m0160H0072M19139A82976Q2947c009A92883O7606B5387L66981A58171
16178A31259J89651A59957J38469A03120k6914K55313A14803J54362j06087M3950
16168B07028e5184A85996M348N383e4071D67314j66257A19051K09875K26351j01977
16157D53300p939k04804a8981C11164J88882j73303j27454q1965b23506C04975
16146A55745K35470q7717I7575J54775G364e6105b3272F3232J43361J0626E5959
16134B19533m9540m3182q109f2935k8547l0196A45164K35555J8429c2317n604
16123c7921G8003a7348C09154Q2309A28570K32772r8618k6230m4213i814B14279
16111B16782H3085C5240J32074M0906K5906a61852j20035C72744a9490I3748J45479
$$ plain form
16190 340320 300160 80072 499211 182976 265923 -3009 192883 260489 25387 392368 158171
16178 131259 320910 159957 298426 103120 76206 331519 114803 269165 163078 207028
16168 207028 -55184 185996 190344 195727 -54071 467314 301057 119051 328926 555277 453300
16157 453300 445361 240557 -18981 311164 500046 326743 199289 117324 -223506 304975
16146 155745 391215 303498 97575 252350 7364 -56105 -23272 63232 206593 217219 55959
16134 219533 169993 126811 118702 -62935 -91482 -121678 145164 380719 399148 -32317 -37921
16123 -37921 78003 -17348 309154 391463 128570 361342 262724 236494 192281 -9814 214279
16111 216782 83085 35240 167314 208220 234126 -161852 -281887 372744 -19490 93748 239227
16100B39227a86031B28307G5659J42071q7726f5983n5802C07960q2945o0144a3787
16088E3036J92756a37005Q302F1187i392B0132M3500L8394j7846Q7757j625j2082
16076A58230a2552r8102G647K09975D5412b15025A48900J51525a14106A59075
16065a45329A14299Q180B4161a23615G8128J21684O1323A2627e8936E382J22661
16054A28043j2662c7328C31644b81240B03715C6205a52362d8479C38315j08318
16044B29997I181K44641J30844B5900R8561i122k9753j0211B83574a52498B44276
16032g7831H1644a59365k45198a91176D462K96283f7890j48396G2301a12168B20602
16020D6857Q9510J86531a7955C9846e2995D0393P600f5357k83703A87952a11876
$$ plain form
16100 239227 -186031 228307 75659 217730 130004 -65983 -121785 307960 225015 164871 -13787
16088 53036 245792 -137005 -128703 61187 -9392 20132 63632 102026 84180 171937 170312 158230
16076 158230 -12552 -110654 7647 217622 45412 -215025 148900 300425 -114106 159075
16065 -145329 114299 122479 24161 -123615 78128 199812 261135 12627 -58936 5382 128043
16054 128043 115381 -37328 331644 -281240 203715 36205 -152362 -48479 338315 229997
16044 229997 9181 253822 384666 25900 124461 -9122 -38875 -49086 283574 -152498 244276
16032 -77831 81644 -159365 -404563 -191176 4462 300745 -67890 -216286 72301 -112168 220602
16020 46857 136367 322898 -17955 39846 -52995 40393 47993 -65357 -349060 187952 -111876
16008D24039b85656D7339D877J53750F2590g461H1160M3378a68916r0070A19422
15996f2134B9387a63946e4916A04038m6938K58849A04068b5667A53295c29304
15985e1946E737R4750h9272c6563A20440d888B20233L667k9536l193O322J09020
15973C06513O0094L39252K10682j86393L73698k70166p240l35447j49931G7817
15962I5320C5726e3247m386B49796q5697o0034J92688j37488i3256l22126A35193
15950a59508B22311b92698A7389b39439D4404K44619g2631l04748a1626A79481
15939A63727C0422P946b28353J05652L9698p4025G5462l3617b76067E7156c08684
15927c91802C5174h232k40842D6871e11985D0647N6147b10782J00635B3004a60111
$$ plain form
16008 424039 -285656 47339 4877 158627 62590 -7461 81160 124538 -168916 -258986 119422
15996 -62134 29387 -163946 -54916 104038 57100 315949 104068 -25667 153295 -329304
15985 -51946 5737 100487 -89272 -36563 120440 -4888 220233 223900 194364 191171 197493 306513
15973 306513 366607 705859 916541 730148 1103846 833680 826440 490993 341062 77817
15962 95320 35726 -53247 -57633 249796 164099 104065 296753 159265 -93256 -415382 135193
15950 -159508 222311 -292698 17389 -239439 44404 289023 -72631 -377379 -11626 179481
15939 163727 30422 38368 -228353 -122701 -83003 -157028 75462 41845 -276067 57156 -308684
15927 -391802 35174 -8232 -249074 46871 -511985 40647 96794 -210782 -110147 23004 -160111
15915A60472a38684N1441I0132e3461a6493J626j07435A79188B0921f7264j29344
15904a96608B42479B3688K87343D2878f8661D9630h5177j60510b1353m9465j87963
15893b58781g7718q2990f8163K3051B2225H544J5971J71778Q7618o9327p2698
15882A41886d9156m2391A12841n5347b85970L3244P6280k09022A28133n6031c2627
15870d8070B30383d1945j05250A90000H6962P2757J3282a6372k6937A5865M26689
15859D42554b9364j54302J3138a0989j9474B06511c7524a6843k5866j72202R8255
15848a16656r5240d8704H2791a29886d1980A07163e37j77209g6121j78032G4839
15836c9603l8746A0894b40093f6628K3105J7648j41178A29860C0696a11403H7061
$$ plain form
15915 160472 -138684 -87243 90132 -53461 -16493 -14867 -122302 179188 20921 -67264 -196608
15904 -196608 242479 23688 311031 42878 -68661 49630 -85177 -245687 -21353 -70818 -258781
15893 -258781 -77718 -160708 -68163 -45112 22225 8544 24515 196293 283911 214584 141886
15882 141886 -49156 -91547 112841 57494 -285970 -252726 -176446 -385468 128133 72102 -32627
15870 -48070 230383 -41945 -147195 190000 86962 159719 173001 -16372 -43309 15865 442554
15859 442554 -29364 -183666 -170528 -10989 -30463 206511 -37524 -16843 -42709 -214911 -116656
15848 -116656 -211896 -48704 82791 -129886 -41980 107163 -537 -177746 -76121 -254153 74839
15836 -39603 -78349 10894 -240093 -66628 -43523 -25875 -167053 129860 30696 -111403 87061
15824b78596E1448c3286A6639b01668j7378d0746j9728C29559A44714a17954k5183
15813a43137A45841a51907G9608i3823b3448j6702A25824E4686J6087a20682C75324
15801A72159a24385j62857B70114g0972l827r9808D98519c34682B0822c388q7316
15790i0704m7139A70065D8879j8904c53659G8709b24826a0494m24734c3481n0403
15779h3884C17466b39704A66946b09865A32814a84179A23748m1944a05903G8311
15768H1379P8265a22210M51d7925A50109A3165J12477c5172A29524K51377A1734
15756B9584a17579q9122C4171A4331J22426C6637g2647A5296J15889A8579J08092
15745A26671K43855A39027b38546R8947B6373a71433B54117P2786F4165N9355
$$ plain form
15824 -278596 51448 -33286 16639 -201668 -219046 -40746 -60474 329559 144714 -117954 -143137
15813 -143137 145841 -151907 79608 -93823 -23448 -40150 125824 54686 70773 -120682 375324
15801 172159 -124385 -287242 270114 -70972 -74799 -174607 498519 -334682 20822 -3388 -90704
15790 -90704 -137843 170065 48879 29975 -353659 78709 -224826 -10494 -435228 -33481 -83884
15779 -83884 317466 -239704 166946 -209865 132814 -184179 123748 81804 -105903 78311
15768 81379 159644 -122210 -121759 -47925 150109 13165 125642 -35172 129524 380901 11734
15756 29584 -117579 -206701 34171 14331 136757 36637 -72647 15296 131185 18579 126671
15745 126671 370526 139027 -238546 -139599 26373 -171433 254117 326903 64165 123520
15735A23520m9302e1931m0945D2044b74022C5705H094i2059E8725a128B22429
15723b49147J9851A65607M6796a51949l8834D3045q953a93748j91751G2817a89614
15711b4418o2566M2932j95899J7687q5413c9792F6832e8069k48486A42945c54982
15699F3823i8447J8780B76994j22196d49394I4123f1023A37067j6496n3726K4279
15688I1124b36094C6837a11233j19714D7837I411d26829I9035D4313a3448A05429
15676H6462Q9785b23677c772A77162D688J05642a23266K4478k22140C71986d5518
15664b83247a33314k21924J27732P7167r9053a19189K6747d193n0166j47491a6786
15652D6478P5865k7283L8192a01603j431D2225a05520D8501b5786p4613C1196
$$ plain form
15735 123520 74218 -51931 -92876 42044 -274022 35705 8094 -92059 58725 -1128 222429
15723 -249147 -229296 165607 212403 -151949 -190783 43045 34092 -193748 -385499 72817 -189614
15711 -24418 -86984 -44052 -239951 -222264 -307677 -39792 66832 -58069 -306555 142945 -354982
15699 63823 -98447 -79667 276994 154798 -449394 94123 -61023 137067 120571 66845 91124
15688 91124 -236094 36837 -111233 -230947 47837 9411 -426829 99035 44313 -13448 105429
15676 86462 176247 -223677 -3772 177162 4688 110330 -123266 -98788 -320928 371986 -45518
15664 -283247 -133314 -355238 -227506 -150339 -249392 -119189 -92442 -4193 -54359 -201850 -16786
15652 46478 122343 95060 133252 -101603 -103034 42225 -105520 48501 -25786 -100399 31196
15640A58461c01026a46371O210A4678a42394b5912l1294k3543k4869I115a68354
15628a77733m882p7208D2381f2846o6036D0118d7277C7837d8624j7225k4111o8064
15616a58024A79025m8507a70902b8843I9060A0750a40264L8080A87397q535a46998
15604e8683i465N42p2481q6716M5857M1741N71B43259A3302J51623b3071j30423
15592a53494q7453k43727l6088A24839M568e4270I4123b68779A2216a6314l5255
15581e1569k7277G9576a4630A79479a39785A69098d65j85201N3138I0010c1571
15569b82071A39365a27963E3933K4698A8152i5901C5g3496C1956M191Q6177d4880
15556A5506If0024C1113a43152M2476B45846a60022j40419A1880N1596b58717
$$ plain form
15640 158461 -301026 -146371 -140161 14678 -142394 -25912 -57206 -80749 -105618 9115 -168354
15628 -177733 -182615 -259823 42381 -62846 -128882 40118 -47277 37837 -48624 -65849 -89960 -158024
15616 -158024 179025 130518 -170902 -28843 99060 10750 -140264 -102184 187397 178862 -146998
15604 -58683 -9465 -8923 -81404 -168120 -122263 -80522 -79951 243259 13302 164925 -23071 -153494
15592 -153494 -240947 -484674 -520762 124839 129407 -54270 94123 -268779 12216 -16314 -51569
15581 -51569 -78846 79576 -14630 179479 -139785 169098 -465 -185666 -132528 90010 -31571
15569 -282071 139365 -127963 53933 78631 18152 -95901 35 -73496 31956 36147 122324 -44880
15556 15506 9 -60024 31113 -143152 -100676 245846 -160022 -300441 11880 63476 -258717
15544i4934l0875d4058B51101h4015j19733g662k14472q5659b0839j03310C8943
15532a74971A88154m4005i9188q796l2847N6445B53695A22626j4812C816J29082
15521A32898b96332A9050O652J88247F6447Q9757b14686B9570N0986K2636a40000
15509E6373K15847F7263a83667L3709N9278A26166h4797H2289h8183c275B59947
15497A21061k3530J68160b47386B58365c18401P7062B4042P9068B1278K34689
15487B55967b58374a00150q1858H8519c8682A04971g4150A99415N6797a72005
15476C47533h8230A90038c7887A29656c28659b4793A37702f3574m8490A32988
15465A17652J25170j7281g0333F67033e9287A9726K68358M50266l56949J0567
$$ plain form
15544 -94934 -125809 -44058 251101 -84015 -203748 -7662 -222134 -307793 -20839 -124149 38943
15532 -174971 188154 144149 -99188 -107984 -140831 -84386 253695 122626 107814 3816 132898
15521 132898 -296332 19050 25702 213949 66447 156204 -214686 29570 80556 103192 -140000
15509 56373 272220 67263 -183667 -149958 -90680 126166 -84797 82289 -88183 -3275 259947
15497 121061 97531 265691 -247386 258365 -318401 -241339 24042 103110 21278 255967
15487 255967 -258374 -100150 -182008 88519 -38682 104971 -74150 199415 256212 -172005
15476 347533 -88230 190038 -37887 129656 -328659 -24793 137702 -63574 -112064 132988
15465 117652 242822 225541 -70333 667033 -59287 19726 288084 738350 381401 391968
15455C91968N2868A76144L7881Q546A4661K53408E5741j1969a00615g083p9983
15444h7066l4496A13980a29298A63371a49962f1541k13061M2361A20991a74385
15433A16416D2720B0434c2863J2631A72574K38541Q2506M55429J06624k79006
15423G76668k33224A14654J18935H3581b39870B81167C7311a70849C6217K3824
15413F0041J47321R6751a9125N569E8510J22680l7393E828b64760e0681A02712
15401a54180j67841I8466c3928j78518j13337f0192B85572o4928i0861A3467a34172
15389c13408k71661b11980j61023f9787c3054D0072J29501D1280c06791A11269
15378A37021n4067B3623L4655h2600B22902j11295g2463A77084K2874p155J70859
$$ plain form
15455 391968 444836 176144 214025 222571 14661 268069 55741 43772 -100615 -7083 -87066
15444 -87066 -121562 113980 -129298 163371 -149962 -61541 -274602 -232241 120991 -174385
15433 116416 42720 20434 -32863 -20232 172574 411115 493621 949050 1055674 776668
15423 776668 543444 114654 233589 83581 -239870 281167 37311 -170849 36217 60041
15413 60041 207362 304113 -19125 -13556 58510 181190 143797 5828 -264760 -50681 102712
15401 -154180 -322021 98466 -33928 -212446 -325783 -60192 285572 220644 -90861 13467 -134172
15389 -313408 -585069 -211980 -373003 -69787 -33054 40072 169573 41280 -306791 111269
15378 137021 82954 23623 58278 -82600 222902 111607 -72463 177084 199958 192803 363662
15367C63662a04776C25483b92643D2300i399A35212C8108L042K16947a74125B5605
15355H5446f160E60269A40730d67628B76195J52347j57992J44851A75643l5190
15345A40453a98020A52133J85665A36903N6631p4179R3269c296G1282b23001A02932
15333C14742a3703A87886q3658Q322N39365j95500A18299K31867p4032A6788J43272
15322A60060J14189J3298D1604L31977j79241n7095L55649A21880B9685K07770
15312B37455q1909j3149n7125j0989P6296p4682K92808A47532D2132b6322k36410
15301b62732E8726f3346j55160m0285C35405e4270B6949O441J91750O7129G7828
15289B21513L2810h2429B7771a40021c8568C75271d0398A72073l0489b63719A0749
$$ plain form
15367 363662 -104776 325483 -292643 42300 -9399 135212 38108 41150 258097 -174125 25605
15355 85446 -6160 560269 140730 -467628 276195 428542 270550 415401 175643 140453
15345 140453 -198020 152133 337798 136903 193534 119355 212624 -3296 71282 -223001 102932
15333 314742 -13703 187886 104228 112550 651915 456415 118299 350166 276134 16788 160060
15322 160060 274249 287547 41604 373581 194340 137245 492894 121880 29685 237455
15312 237455 155546 142397 85272 74283 150579 75897 368705 147532 42132 -26322 -262732
15301 -262732 58726 -63346 -218506 -258791 335405 -54270 26949 33390 225140 292269 77828
15289 221513 254323 -82429 27771 -140021 -38568 375271 -40398 172073 141584 -263719 10749
15277A74558J27165A24029d2937l14602h9279A900M60871I7967K63291b42444
15266C77439A36723b03822A23716b04943A73339l3465b4737j18932A50928h1792
15255A17366h2965B49877f2920j17427A24767j5776K20240a32848e2248A8365
15244A71487N3013c8972A22860E3910K20068E5413J504J34931a78966B83316J16258
15233C99574r8554A44667J18827j165M03743M31970M0948K70884O1227o11107
15223H59994k68937j07319B31599P2193N1005A48418e4685a0098A90232J98948
15213C89180j26624j27809J06591a84357H7978J8838j5400a67431A32435i0734
15202D21645a0918A42916a07232l06075e9727B0418b77664d3328k4010E8279d5532
$$ plain form
15277 174558 301723 124029 -42937 -357539 -89279 1900 462771 97967 361258 -242444
15266 377439 136723 -203822 123716 -204943 173339 139874 -24737 -143669 150928 -81792
15255 117366 -82965 249877 -62920 -180347 124767 108991 329231 -132848 -52248 18365
15244 171487 224500 -38972 122860 53910 273978 55413 56917 191848 -178966 283316 399574
15233 399574 301020 144667 263494 262329 666072 1098042 1138990 1409874 1471101 859994
15223 859994 591057 483738 231599 303792 354797 148418 -54685 -10098 190232 389180
15213 389180 262556 134747 241338 -184357 87978 106816 91416 -167431 132435 -90734
15202 421645 -10918 142916 -107232 -413307 -59727 20418 -277664 -43328 -67338 58279 -45532
15190b23500R9747A03873C9982c20970E3787P5555l7779K230N9652F5289a61512
15178D6929B319J11206l2038f6035n6084D8688Q7761j1267r19b14911A53423e2717
15165A05128a56936c8828C64006A27398a9798j54561a378n5051A90832c74510
15154A71987j0985O1242O4670D8012f000C7670O814J09908a26343g922E1733i210
15141A6118O39934D5853d2986G3549B5199O4274N200A6632K30342a85330I5495
15129B27572A09948a62981A42155q843B2126a22654j22972B88318A30929R8774
15119B29703E1170g3487E0218a97749E5067K7703b7103A56923K16455A11518M378
15108A15896J17327c0393o2593H6639Q0932M9839L37698B60151O0885A51011K11192
$$ plain form
15190 -223500 -123753 103873 39982 -320970 53787 129342 91563 93793 153445 65289 -161512
15178 46929 2319 113525 81487 -66035 -122119 48688 136449 125182 124263 -214911 153423 -52717
15165 105128 -156936 -38828 364006 127398 -19798 -174359 -1378 -56429 190832 -374510
15154 171987 161002 222244 286914 48012 -6000 37670 44484 154392 -126343 -7922 51733 -9210
15141 16118 656052 45853 -42986 73549 25199 89473 94673 16632 246974 -185330 95495
15129 227572 109948 -162981 142155 133312 22126 -122654 -245626 288318 130929 229703
15119 229703 51170 -73487 50218 -197749 55067 82770 -27103 156923 373378 111518 115896
15108 115896 233223 -30393 -92986 86639 167571 217410 555108 260151 321036 151011 362203
15097C62203b00831C88016j43229a33136n8101O5262b8725B68766Q2582b3599
15086A38147K5251L51992A02141q663K23737l7698n8478n7782d3598B05042a23425
15074A14100K40398j69888F8315f813j51998p614B03212o7370D8247R9977b00283
15062D8953c6971k3700d15m9539K48m2546B32864J43673j23605M1695K7048j13559
15050B08116J32495L8753j64472q7604K60723A37854A3023a21984D1011K98970
15040C39981A65365P023o2825L95574A93555b106B99734D071J30547K0606o6506
15029H8718J72687J06534o6101e5722A5363L07729K31132k13534K01823j64859
15019C77654P9502j18275j2465K97065l07725O3990L65927k61060M7565J59117
$$ plain form
15097 362203 -200831 388016 244787 -133136 -191237 -125975 -28725 268766 351348 -23599
15086 138147 163398 515390 102141 93478 317215 279517 221039 163257 -43598 205042 -123425
15074 114100 354498 184610 68315 -6813 -158811 -166425 203212 135842 48247 148224 -200283
15062 48953 -36971 -60671 -415 -49954 -49706 -92252 232864 376537 252932 294627 321675 208116
15050 208116 340611 379364 214892 127288 388011 137854 13023 -121984 41011 339981
15040 339981 165365 172388 109563 505137 193555 -2106 299734 4071 134618 155224 88718
15029 88718 261405 367939 301838 -55722 15363 323092 554224 340690 542513 377654
15019 377654 457156 338881 326416 623481 315756 379746 745673 484613 532178 691295
15009F91295A42776K03737J52914N07A71516N50914k90568Q908q1967K47643j24010
14998D82436B05543R8001L12998A64790K36843N2334L0735k3654k01924K39071
14988D98195K5304p9714J01702j73953N9381j21946K5420o6785k3922K15685j24752
14977C34615i2167A02945L69214J34678B38249L13651j23836k2731J86014k28287
14967C63060K36285m7011K34015j49177j05701B55423J52474M5894Q4169A85247
14956F73916K06556D07312L42546B68461J21451j1505j71819K39440E6081K99233
14946C55314k961r7857O101J04797F6125J58726L75261O1455k33979N7317A24432
14934I387L83402A30566K62041J72391n134B21325L19927B9601N05242j69359
$$ plain form
15009 691295 142776 346513 499427 499934 171516 722430 431862 440770 358803 606446 482436
14998 482436 205543 303544 616542 164790 401633 453967 484702 461048 259124 498195
14988 498195 523499 443785 545487 371534 430915 308969 334389 267604 243682 459367 334615
14977 334615 -92167 102945 472159 606837 238249 551900 428064 405333 591347 363060
14967 363060 599345 552334 786349 637172 531471 255423 407897 453791 537960 185247
14956 673916 880472 407312 749858 268461 389912 378407 206588 446028 56081 355314
14946 355314 352353 254496 260597 365394 66125 224851 600112 661567 427588 484905 124432
14934 9387 392789 130566 392607 564998 559864 221325 541252 29601 534843 365484
14924C65484M95179B05309J11276P8984m9216J58356Q6276k15631J25863K48449
14914G49666Q4929l5745M48151N7806j72297N16015l30260O5222J37179l66308
14904A154358K4934k6187M31986K35342R1962k0871n91552J06323k91756j42827
14894I71712j62588j89295K0178B79032J18481A46855J06906J54941j7578K00614
14884E91738l9692B43382J99874j74600k2389K52644A31265g795C75324K68766
14874F44090k27230J34790J46084k67179K34072M3437M1360j95716r2089J53441
14864F15060J23973K6842m3602J28184l89446J64657k64226k6486K99525j52102
14854D82379j10282J80309j75321j06082N0437N44494C01908M14269j86649o0131
$$ plain form
14924 365484 860663 205309 316585 395569 346353 504709 590985 375354 501217 749666
14914 749666 834595 798850 1247001 1304807 1132510 1648525 1318265 1383487 1520666 1154358
14904 1154358 1179292 1153105 1585091 1820433 1912395 1891524 1299972 1406295 1114539 971712
14894 971712 809124 619829 640007 279032 397513 146855 253761 408702 391124 591738
14884 591738 552046 243382 443256 268656 246267 498911 131265 -7795 375324 644090
14874 644090 416860 551650 697734 430555 664627 708064 749424 553708 461619 615060
14864 615060 739033 765875 722273 850457 461011 625668 361442 334956 634481 482379
14854 482379 372097 552406 377085 271003 321440 865934 301908 716177 529528 469397
14844D69397m7875L44605j43285B89201L66245l16412L64528k04497R0251J02153
14834F91469k80513O3987m7163L66616A95022M12154n8633J12486L73745j68623
14824H66151K98713k507k26379N6673l14379J31158j14781J6903j50058l5087
14814E26407r043M9976M9712J09788J29917m8680l46109K12830N1601B71036K73945
14803E44981K4878K24241j35030j0168j47507K58620j01385J68970j04494C43810
14792F64554j50720L22980k75815K69307j16872R509q8283K05274k47435L35061
14782I27560l54729k21667k5726N31425C57980J58593M7893j58388M11989B45165
14771A73686M65046j8094k13135n7069M27872C14651J58040M58296k90958j85395
$$ plain form
14844 469397 421522 766127 622842 289201 655446 339034 703562 499065 589316 691469
14834 691469 410956 474943 427780 794396 195022 607176 548543 661029 1034774 866151
14824 866151 1164864 1162357 935978 992651 678272 809430 694649 711552 561494 526407
14814 526407 517364 567340 617052 726840 856757 808077 461968 674798 726399 271036 544981
14803 544981 569859 794100 659070 648902 501395 760015 658630 827600 723106 343810
14792 664554 513834 836814 560999 830306 713434 722943 634660 839934 592499 927560
14782 927560 572831 351164 325438 856863 357980 516573 564466 406078 818067 245165
14771 173686 638732 620638 407503 350434 778306 314651 472691 930987 640029 454634
14761D54634L06037M3574j12616M5300J20291o6359C94393K94728j95098o120
14751D87903J78379k88743K00587J24011B31803K10480O314M1358j61589j00477
14741B27889K62730J00712k28075A40901M80678J19607k01938L92643l80335l9512
14731E12044J4904K56798N6836k56387j38670K77135k46296J52201n2822J1627
14721E87370q8348M2503M45533q1426J43677k60687L56362J86180l82968K16059
14711A164255M00883k76885K36949l87087J22252J88250o04817n8365K29179l60497
14701F54117K80897k32448K74801l27676l2361L32474J67542k34201L1308j7231
14691H97222R3132o25j6061L6583O7968j20034O06370k03959R9173J36917m78224
$$ plain form
14761 454634 760671 804245 691629 736929 857220 790861 394393 689121 494023 487903
14751 487903 666282 377539 578126 702137 231803 442283 448597 489955 328366 227889
14741 227889 490619 591331 363256 140901 621579 741186 539248 931891 551556 512044
14731 512044 526948 783746 840582 584195 445525 722660 476364 628565 575743 587370
14721 587370 499022 541525 987058 905632 1049309 788622 1144984 1331164 948196 1164255
14711 1164255 1565138 1288253 1525202 1138115 1260367 1448617 843800 785435 1014614 654117
14701 654117 935014 702566 977367 649691 617330 949804 1117346 883145 914453 897222
14691 897222 990354 989729 973668 1010251 1078219 958185 1564555 1360596 1459769 1596686 1118462
14680A118462K08450j7370m79295R5753J69535J84417j20410m60622M80097k96731
14670H82286j06559K63331k16166P8683K78595j78501J68410n47018J94412N3028
14660H70501N7707j01070R501k7890P7162P2940l91148J13440L33054j92864Q5712
14649I07045J28849J31309o9227q5003k48404L35607k16398k3493O1879j8529
14639I03635j65N9821J66741K63996k12797L00080j15981n13067m5743J7005K47474
14628A070999o9515q123j340K2279R8787K0345k81217L74310l11746K58606L87552
14617A560937l13817q709j84165m4747K42997j01583L2804j12013R4559k01956
14607I64307L572K55086L59400n58273P8231K44630k13947M6669K57524m70535
$$ plain form
14680 1118462 1326912 1309542 830247 926000 1095535 1279952 1159542 698920 1179017 882286
14670 882286 775727 1039058 822892 901575 1180170 1001669 1170079 623061 817473 870501
14660 870501 928208 827138 836639 808749 885911 958851 567703 681143 1014197 821333 907045
14649 907045 1035894 1167203 1097976 1012973 764569 1100176 883778 860285 922164 903635
14639 903635 903470 963291 1130032 1394028 1181231 1481311 1365330 852263 806520 823525 1070999
14628 1070999 1001484 993361 992021 1014300 1113087 1133432 852215 1226525 914779 1173385 1560937
14617 1560937 1247120 1238411 1054246 1009499 1252496 1150913 1183717 1071704 1166263 964307
14607 964307 967879 1222965 1582365 1024092 1102323 1346953 1133006 1179675 1437199 966664
14597I66664J88560K69166j70408j80519L98604j67677k0659P6479M1341L38427
14587A739978m20137M25785k84882n5051j2917J91857J3978p7264L52212l00822
14577A572737j99443K11725m23135P06823l22712M6706J39115k30343M18101l32179
14567A587395J64111p6984n2984N3781L88143J5204p7120j00972j86285J03451
14557A817740j35580K38887k86159L12860K2458L06892l27016J53404K53672j78178
14547B178980Q25088p31322J82656N01436j73176L36604K38282Q5075M02312J03833
14537C949768O90336P46861J402433K147515L250756O662935R832921J9394j0531402
14528A8171517o304155l730730k578363r56406o8790M98666j431575l93214m59935
$$ plain form
14597 966664 1155224 1424390 1253982 1073463 1472067 1304390 1283731 1360210 1401551 1739978
14587 1739978 1319841 1745626 1460744 1405693 1392776 1584633 1598611 1521347 1873559 1572737
14577 1572737 1373294 1585019 1161884 1868707 1545995 1592701 1731816 1501473 1919574 1587395
14567 1587395 1751506 1674522 1621538 1675319 2063462 2078666 2001546 1900574 1714289 1817740
14557 1817740 1682160 1921047 1634888 1947748 1970206 2277098 1950082 2103486 2357158 2178980
14547 2178980 3004068 2272746 2455402 2956838 2783662 3120266 3358548 3443623 3845935 3949768
14537 3949768 4640104 5386965 6789398 8936913 12187669 18850604 28683525 28702919 18171517
14528 18171517 11867362 8136632 5558269 4601863 4533073 5031739 3600164 3206950 2747015
14519B747015n24208K2698k95218O0184K07912k96483j45210J33712J90773J109
14509B102284M32457k95895k04886K74350j35953J38534j49681J88552J59849
14500B509611J9642K27864M5521l49527O6180m57399P29238P769l54322K73643
14490B718220J58583l01557L41726R5659J18960l77286J38163j82380L48359k754
14480C055693j25184K83345j40726k39721M81352J87174j04367q5785J07455K5412
14470C444648m08181M74492P1717n00288L72394J15969K48726k01566K07551k95243
14460C530219J69412J47498p6551K34263n21996O21251n4424K27916l87069R2800
14450C983319q1384M20863Q0706q9399J97566q6382J84151m5507n5791P3791K78006
$$ plain form
14519 2747015 2222807 2245505 1950287 2010471 2218383 1921900 1776690 1910402 2101175 2102284
14509 2102284 2534741 2238846 2033960 2308310 2172357 2310891 2161210 2349762 2509611
14500 2509611 2529253 2757117 2802638 2453111 2519291 2061892 2791130 2798899 2444577 2718220
14490 2718220 2876803 2575246 2916972 3012631 3131591 2754305 2892468 2710088 3058447 3055693
14480 3055693 2930509 3213854 3073128 2833407 3314759 3501933 3397566 3311781 3419236 3444648
14470 3444648 3036467 3510959 3582676 3082388 3454782 3570751 3819477 3617911 3825462 3530219
14460 3530219 3699631 3847129 3770578 4004841 3482845 4104096 4049672 4277588 3890519 3983319
14450 3983319 3901935 4322798 4403504 4314105 4511671 4425289 4609440 4563933 4508142 4581933 4859939
14439D859939j58920K74428r3951N0765l944J13636K43544j14263J11161J49863
14429E432258j21576Q6695L41836j0837Q8549K33436m22049J4313L05971J3299
14419E961895L91310l6028l4956K95004J05999k05770q6524M14437K41164J13188
14409G159719J06030J56903K16182j89010L87499j04790J23456O9918M68085k33785
14399H160207R5930j1928K8984m4243L29744O2922M39209j07967j6377L67822
14389I304303Q8582K80888M5059K02659L84594j16118N1200K93532m4334M05618
14379A0895983J31471L15983L4091K12N25644J52069J00596J23848k6863M62838
14369A2715872K73307N31084J21742L7725N05466K67787K24707K15280K08067
$$ plain form
14439 4859939 4701019 4975447 4881496 4932261 4928317 5041953 5285497 5171234 5282395 5432258
14429 5432258 5310682 5397377 5739213 5728376 5816925 6050361 5628312 5642625 5948596 5961895
14419 5961895 6353205 6317177 6282221 6577225 6683224 6477454 6390930 6805367 7046531 7159719
14409 7159719 7265749 7422652 7638834 7449824 7837323 7732533 7855989 7925907 8393992 8160207
14399 8160207 8256137 8244209 8273193 8228950 8558694 8621616 9060825 8952858 8936481 9304303
14389 9304303 9392885 9673773 9718832 9921491 10306085 10189967 10241167 10534699 10490365 10895983
14379 10895983 11027454 11343437 11377528 11377740 11903384 12055453 12156049 12279897 12253034 12715872
14369 12715872 12989179 13520263 13642005 13679730 14185196 14452983 14677690 14892970 15101037
14360A5101037L03019J049M69883M14998L03881L12467N72020K61310P5599R43324
14350A8758587M06486o8827O26140P42656L04910J73585N30292O79000J15621
14341B2268450Q00416N13691O21036L68276R39843L10379N59160M95170J226681
14332B8103102N29739O05289P77361R14928P68251R92245P56066P35020J273600
14323C5455601Q76276J237698J068647P61991J476571J036179J412088J257558
14315D4582609J480487J673859J493612J529891J876818J841151J637630K132727
14307E8248784K368267K363783J925456K592603K268724K595837K732007L007391
14299G8102852K984704L674540L261861L496086L938498M208044M468931M697828
$$ plain form
14360 15101037 15404056 15405105 15874988 16289986 16593867 16906334 17478354 17739664 17815263 18758587
14350 18758587 19165073 19096246 19722386 20465042 20769952 20943537 21473829 22152829 22268450
14341 22268450 23068866 23582557 24203593 24571869 25511712 25822091 26381251 26876421 28103102
14332 28103102 28632841 29238130 30015491 30930419 31698670 32690915 33446981 34182001 35455601
14323 35455601 36331877 37569575 38638222 39400213 40876784 41912963 43325051 44582609
14315 44582609 46063096 47736955 49230567 50760458 52637276 54478427 56116057 58248784
14307 58248784 60617051 62980834 64906290 67498893 69767617 72363454 75095461 78102852
14299 78102852 81087556 84762096 88023957 91520043 95458541 99666585 104135516 108833344
14291A08833344M964285N109895N653883O059373O237217O538724O730220P673957
14283A57800898P601721Q551306Q357027R758219R460746J0859753J0769832J1851577
14275B35011079J1888473J2683212J3143847J3633733J4156064J3821413J3766599
14268C28104420J3727192J3834601J2851251J2121021J1308167J0215873R347117
14261D11509642Q622286P929105O853301M194285R41990L39916o21049n935315
14253D33834161o299539o015136n178587p241652r944639j1492314j2870140j3133107
14245C61659047j3335408j3084917j3075192j3857405j3728666j3360868j2928117
14238B68288474j1995437j1619137j1870269j1626778j0828110j0539942j0411691
$$ plain form
14291 108833344 113797629 118907524 124561407 130620780 136857997 143396721 150126941 157800898
14283 157800898 165402619 173953925 182310952 192069171 201529917 212389670 223159502 235011079
14275 235011079 246899552 259582764 272726611 286360344 300516408 314337821 328104420
14268 328104420 341831612 355666213 368517464 380638485 391946652 402162525 411509642
14261 411509642 420131928 428061033 434914334 439108619 440050609 440390525 439769476 433834161
14253 433834161 427534622 421519486 416340899 409099247 399154608 387662294 374792154 361659047
14245 361659047 348323639 335238722 322163530 308306125 294577459 281216591 268288474
14238 268288474 256293037 244673900 232803631 221176853 210348743 199808801 189397110
14231A89397110r873402q774729q185196p958495p431334p256472o560834o054717
14223A27301931n617549n486171n262013m780073m319245m237122m052626l577371
14215H9969761l424731l544580l410455k902693l320481k411447k857340k217334
14207F5880700k109062k159773j852725k342025k277196j419373k012924j368441
14199E0339181j828799j157320j366032j528953j465225j220691j065781p99769
14191C9906611j126777j464727r09895r58779o29201j092687n41475p60866j447732
14182C0974472n09184r90550o18178q13720k82893q36495o87253p20974n26275
14173B4988950p94251n48520m74376l71261m79629p63878l83288o6086o37644
$$ plain form
14231 189397110 179523708 170748979 162563783 154605288 147173954 139917482 133356648 127301931
14223 127301931 121684382 116198211 110936198 106156125 101836880 97599758 93547132 89969761
14215 89969761 86545030 83000450 79589995 76687302 73366821 70955374 68098034 65880700
14207 65880700 63771638 61611865 59759140 57417115 55139919 53720546 51707622 50339181
14199 50339181 48510382 47353062 45987030 44458077 42992852 41772161 40706380 39906611
14191 39906611 38779834 37315107 36405212 35446433 34817232 33724545 33183070 32422204 30974472
14182 30974472 30465288 29474738 28856560 28042840 27759947 26923452 26236199 25515225 24988950
14173 24988950 24194699 23646179 23171803 22800542 22320913 21557035 21173747 21107661 20470017
14164B0470017o14293n42879j31287q23082N73058q03347o23550r6865j14949
14155A7292823o97579Q1927l90875l74572j49068p37673J6771m00955n6983p22812
14145A3861004J75870N130n39558k39427k14726k95142l84689j89j37536Q0650
14135A2311387m97155j56030m54412k98054R9771m41987r2402K20871o16571N1825
14125A0127243j61590q0910O5991n13690J63289m40363j77783L4780M2641k25258
14115H834350Q5822l28889k39993l53484M40044n26245L5205k53056k15381M02641
14105G881014l39038j20898j59823J3786k41443J13232o676R673r2530j51984
14095F905313j48065j66675o7317j8291j96900j37000R3200m09049K813k6822
$$ plain form
14164 20470017 19855724 19312845 19181558 18358476 18931534 18128187 17504637 17407772 17292823
14155 17292823 16595244 16677171 16286296 15911724 15762656 15024983 15041754 14640799 14583816 13861004
14145 13861004 14036874 14042004 13502446 13263019 13048293 12753151 12368462 12368273 12230737 12311387
14135 12311387 11814232 11658202 11203790 10905736 11005507 10563520 10471118 10691989 10075418 10127243
14125 10127243 9965653 9884743 9950734 9437044 9600333 9159970 8982187 9016967 9059608 8834350
14115 8834350 8920172 8591283 8351290 7997806 8437850 7911605 7946810 7693754 7478373 7881014
14105 7881014 7541976 7421078 7261255 7275041 7033598 7146830 7140154 7149827 7057297 6905313
14095 6905313 6757248 6590573 6523256 6504965 6308065 6171065 6264265 5855216 5858029 5831207
14085E831207J82346j88821p2222K28393n16654q357K88937n66727K68421r0655
14075E355868J70729k66090j66069J92152K4377k85914J22092l74440j32085J348
14065D641968K71951l34511k6412J98716j62217k50071J66363l83578K26137m6367
14055D301979R392J91629k65317k89031o3173K73623N4935k43184L67335l93709
14045C944479k8152k43988L24133K14817N7910m36274N2937l16901j54329K5930
14035C440562p8092J43084p5584o0707K62612l35986K36648j88047K67844k82399
14025C329935k39032l4045J81871q515k99577J76526l4259L73738l15280M5370
14015C176732m7586l03431R6464L02756j20504k10857L23581n01885o8590J07114
$$ plain form
14085 5831207 6013553 5824732 5752510 5980903 5464249 5455892 5744829 5178102 5446523 5355868
14075 5355868 5526597 5260507 5094438 5286590 5310967 5025053 5147145 4772705 4640620 4641968
14065 4641968 4913919 4579408 4552996 4751712 4589495 4339424 4505787 4122209 4348346 4301979
14055 4301979 4311371 4503000 4237683 3948652 3885479 4159102 4214037 3970853 4338188 3944479
14045 3944479 3916327 3672339 3996472 4211289 4269199 3832925 3885862 3568961 3414632 3440562
14035 3440562 3362470 3505554 3429970 3369263 3631875 3295889 3532537 3344490 3612334 3329935
14025 3329935 3090903 3056858 3238729 3230214 2930637 3107163 3072904 3446642 3131362 3176732
14015 3176732 3129146 2825715 2922179 3224935 3104431 2893574 3217155 2715270 2646680 2753794
14005B753794k54194J74128k08629J85862j29361k44844L3263J23731j12916K10179
13995B531013l13073L66818n7740l06509N04000n91571J3804p806K15219O0768
13985B414923L751m08902J48675J77228M49555n0576j5958r6355L43530N18063
13975C483934P76434J190906K764012N802308J0359123N794265q517781o327973
13967A5325228m573338k713332j996777r92443p82805k67085n07805k14052j61071
13958C116520k68387m2619j49469j76639j31314L05213p2932k63469L253L25229
13948B645386l12757j1355J02658k86320k75930K42790J44353m39148K55775p8832
13938A986620O0713k32892j0179K0425J27435J1631p968r3899L01792l88840P1269
$$ plain form
14005 2753794 2499600 2673728 2465099 2650961 2521600 2276756 2310019 2433750 2320834 2531013
13995 2531013 2217940 2584758 2527018 2220509 2724509 2132938 2146742 2138936 2354155 2414923
13985 2414923 2418674 2009772 2158447 2335675 2785230 2734654 2718696 2622341 2965871 3483934
13975 3483934 4260368 5451274 8215286 14017594 24376717 30170982 21653201 15325228
13967 15325228 10751890 8038558 6041781 5049338 4266533 3999448 3491643 3277591 3116520
13958 3116520 2848133 2805514 2656045 2479406 2348092 2653305 2580373 2316904 2320157 2645386
13948 2645386 2332629 2321274 2423932 2137612 1861682 2104472 2248825 1809677 2065452 1986620
13938 1986620 2047333 1814441 1804262 1824687 1952122 1963753 1955785 1861886 2163678 1774838 1846107
13927A846107l06241N48881l77563J29949l6351J11665m91917J37660j12993K26050
13917A675247L630j7451j7057l46206M12353j09868J31917k09633J85694j0926
13907A697700l59762J58182p6922M9494j3574K94672m22292K25933k02898j13350
13897A237183M01740q3991l77619K46332J00348j7423j35682L02558n06197J27893
13887A295142J46769j64500L68093l82261N7120J08273j37243j21482N0892L1816
13877A252619J30279L2110k82060J74969q2474K45241r1119r8160O1416l63109
13867I79712J33858L14793P0387l35655K38764j98198q6053l2787K29346l59462
13857I54705M01245j45435j25173N469l7767q1771J74468k72186K45309N1187
$$ plain form
13927 1846107 1539866 2088747 1711184 1841133 1804782 1916447 1424530 1562190 1449197 1675247
13917 1675247 1678877 1661426 1644369 1298163 1710516 1600648 1732565 1522932 1708626 1697700
13907 1697700 1337938 1496120 1419198 1468692 1455118 1749790 1327498 1553431 1350533 1237183
13897 1237183 1638923 1554932 1177313 1423645 1523993 1506570 1370888 1673446 1167249 1295142
13887 1295142 1441911 1277411 1645504 1263243 1320363 1428636 1291393 1169911 1220803 1252619
13877 1252619 1382898 1415008 1132948 1307917 1225443 1470684 1379565 1281405 1342821 979712
13867 979712 1113570 1428363 1498750 1163095 1401859 1203661 1117608 1084821 1314167 954705
13857 954705 1355950 1210515 1085342 1090811 1053044 971273 1145741 873555 1118864 1170051
13847A170051k65640L09275o8442p5963k72216K27970J63838j08149j60099K8344
13837I48969K27982m35603K33312J57936J16052m10469M45668l57059J33042j69249
13827H90581L26321K04518l12528j83670J15175k49942K02790r629m6096k37959
13817F99561M526J29437J49174l39222l0397M46115l33673K75527p9998J42042
13807A063092j09356K37150j03167l83810K06348K2003j35331M52128k37875J74547
13797A185729C41681M81945l82310L50018p543R7507p1517K4252p4383K17378
13787I77028M962k16579j41047K32393j43680N3721L6649K26352k96757R1776
13777H24818M3082k05771K40815q1932B79195Q64060j88190n9725l0387q5822
$$ plain form
13847 1170051 904411 1213686 1145244 1069281 797065 1025035 1188873 1080724 920625 948969
13837 948969 1176951 741348 974660 1132596 1248648 838179 1283847 926788 1059830 890581
13827 890581 1216902 1421420 1108892 925222 1040397 790455 993245 983616 937520 699561
13817 699561 704087 833524 982698 643476 613079 1059194 725521 1001048 921050 1063092
13807 1063092 953736 1190886 1087719 703909 910257 932260 796929 1249057 1011182 1185729
13797 1185729 341681 823626 441316 791334 783791 881298 809781 834033 759650 977028
13787 977028 981990 765411 624364 856757 713077 766798 803447 1029799 733042 824818
13777 824818 867900 662129 902944 821012 279195 1143255 955065 895340 864953 779131
13767G79131K30120j98111j41705N21845E07417K09601r0051M37264E19874n21
13757E19353K45277r4715J40287o7903R6639j57954k39702L18643j0673k37416
13747E11836J43349Q5701N3975j13963L75893k23307j97174J8724B79634L42739
13737F22373K83938k02501k33207Q4659M31751D22992j4600o4111Q8235K91750
13727G24266k03784j17074L83453B54254M81278n5862j09914k33566R1635K69643
13717F97468k54716K06225j26448K63870j40733L18356C38525r460J09018m1210
13707C96873J70431j24609K0049K17815j54232K01097J7444l25912J48852J15252
13697F83060q8646j32311K73456l52342o0665M49020j29631K15385k79081K9280
$$ plain form
13767 779131 1009251 811140 669435 1191280 507417 717018 626967 1064231 519874 519353
13757 519353 764630 669915 810202 742299 838938 680984 441282 759925 749252 511836
13747 511836 655185 740886 794861 680898 1056791 833484 636310 655034 279634 622373
13737 622373 906311 703810 470603 555262 987013 422992 408392 344281 432516 724266
13727 724266 520482 403408 786861 254254 735532 679670 569756 336190 427825 697468
13717 697468 442752 648977 522529 786399 645666 964022 338525 329065 438083 396873
13707 396873 567304 442695 462744 680559 526327 727424 744868 418956 567808 683060
13697 683060 594414 462103 735559 383217 322552 771572 641941 857326 578245 607525
13687F07525K32781o5371k11738j18171K65688j5667j67881J25764j92444j37234
13677C23252K394Q3519K57556N1168C07343L65612k90727p560J25681J85398M6170
13666G31917r7231K07020l64042j8592L6906A47515O4019M47888k20433K82564
13656G21553A46035Q1801P3510o9027L4413A24942L60521J34793B52472K83864
13646E36336k40048J16944M94675m21126j73533K11507j11049J80659B46284l3689
13636B12595O7181K02892R446M1793M12849C97195L37513l67195J3011J19554
13626E00078b5608C23498J95701j48476K67409A01091K40053J02192P4585M9983
13616E67904k01854P9535J55454j54958L1186J91797j92058j49312P1323j25629
$$ plain form
13687 607525 840306 774935 563197 445026 710714 695047 527166 652930 460486 323252
13677 323252 325646 409165 666721 717889 307343 672955 382228 374668 500349 685747 731917
13666 731917 634686 841706 477664 459072 495978 147515 211534 659422 438989 721553
13656 721553 146035 227836 301346 232319 266732 124942 485463 620256 252472 536336
13646 536336 296288 413232 907907 486781 313248 524755 413706 594365 246284 212595
13636 212595 279776 482668 492114 533907 946756 397195 734708 367513 380524 500078
13626 500078 -25608 323498 519199 370723 638132 101091 341144 443336 517921 567904
13616 567904 366050 445585 601039 446081 477267 669064 477006 327694 399017 273388
13606B73388J89426j05026A77273K94873j1201B14214O5370J18668J24870j39055
13596C84067N2208j36931C272M24841I2653L87168j11162M1653p1902J25458O9033
13585E32901j60651j04517M56172C58653n4018j32815J11174O7514j5167j2855
13575C22486o9923J65894j99996J51353J54689l9795k35317J79560o3406A70089
13564G11973k41156l3975L1301j3772R9934B16602m7363L25868A42400L78863
13554E21263k32436N6443L57858A80103K89748A47181J46793r426A23954K11188
13544C35142J57392K39123A22893L55247G8774L43707m7915G6491N67133l15720
13534C27904j16078j9300K32590O7645A31121l0258j4285L3337k5663K78157j77435
$$ plain form
13606 273388 462814 357788 177273 472146 460945 214214 279584 398252 523122 384067
13596 384067 436275 299344 3272 428113 92653 479821 368659 410312 338410 463868 532901
13585 532901 372250 267733 723905 358653 304635 171820 282994 350508 335341 322486
13575 322486 252563 418457 218461 369814 524503 484708 249391 428951 365545 170089
13564 711973 470817 436842 468143 454371 554305 216602 169239 495107 142400 521263
13554 521263 288827 345270 703128 180103 469851 147181 293974 284548 123954 335142
13544 335142 492534 731657 122893 478140 78774 422481 374566 76491 643624 327904
13534 327904 211826 192526 425116 492761 131121 100863 86578 119915 94252 372409 194974
13523A94974O1723A03046L9201K14360K6312J79838B20085r6712J76034p8693
13513B20714M02767k39541A76427M474J55336L3117j2554n3235G0597L63084n2852
13502C80829A63732K94858b9190A16448J41622J7291F0823M54033B26610L2182
13492B58792L94823A16160N4620J19420J3911O2765J81119B22306K1152K20984
13482D64442j80147L36429B68265K84126j79999k5736G6734C1380K35659n7625
13472B09414J14903H0439K63967i1563A00831K74249J2399j57039a45849B06565
13461B93160A02909P1746a37678A68197q0558L6356j4536K41938N0092j3217A76667
13449H6378J92957q4747o0028J96176C6129L91539B09704m7513J67551J25736
$$ plain form
13523 194974 256697 103046 142247 356607 382919 562757 220085 123373 299407 220714
13513 220714 623481 383940 176427 180901 336237 369354 356800 303565 70597 433681 380829
13502 380829 163732 458590 -29190 116448 258070 275361 60823 514856 226610 258792
13492 258792 653615 116160 170780 290200 304111 366876 547995 222306 243458 464442
13482 464442 284295 620724 268265 552391 372392 346656 76734 31380 267039 209414
13472 209414 324317 80439 344406 -91563 100831 375080 387479 230440 -145849 206565
13461 293160 102909 174655 -137678 168197 87639 123995 109459 351397 401489 388272 176667
13449 86378 279335 194588 134560 330736 36129 427668 209704 162191 329742 455478
13439D55478A14242K73100h8828B24727a00610B20796G2561J17388N2487J7793
13429B60229C7971K92807A28432M404A4729K09719J67016A12538P1610J86209
13419C70357A1004L94397j35268p0983b4845B08915r1566J12029o754K09936j63948
13408B68612M6876P7064R344A26945K60023H518L50790c9256B82259j26553N9709
13397B15415a3670D67660j84700C8897K49181a92862B50253J88716A84984J44110
13387C29094j18402K07228M541a7792C3609L709P4440a01029d6324B75592a07030
13375B58979G254J94273J29062K23189B50656C8992R2885n5796K04134o307j0366
13364B63542f6225A28177J11769L51838k43079j0876a41913E96275k81495j35543
$$ plain form
13439 455478 114242 387342 -88828 224727 -100610 220796 72561 189949 242436 260229
13429 260229 37971 330778 128432 132836 14729 224448 391464 112538 184148 370357
13419 370357 11004 405401 270133 199150 -24845 208915 117349 229378 222624 432560 268612
13408 268612 315488 392552 401896 126945 386968 8518 359308 -39256 282259 155706 215415
13397 215415 -13670 467660 282960 38897 288078 -192862 250253 438969 184984 329094
13387 329094 210692 417920 422461 -17792 33609 37318 111758 -101029 -46324 275592 -107030
13375 258979 7254 201527 330589 553778 250656 38992 131877 76081 280215 273908 263542
13364 263542 -66225 128177 239946 591784 348705 337829 -141913 596275 314780 179237
13354A79237j9031J0117L7608J70036J75741k46801b6848B43848o1737q4059c9426
13342B84356r5094K24273j17964j42447A4865K78071j3635J72156H1143K7022
13332A08165J18061m0504I2108M86438B17846p880P8065g4509B97104D046K23780
13321B27826K14106o6367A42679R1351I2428J03367J48906j12205K17527j78727
13311B71296a18683L1836A60657R2980A25508J46164A24852K56938A53988E7132
13300a183m4840j05151c1879k5100A07005O9171L9672b57581B08936J43944c8951
13288A44382c66870B49289c7083D46011A6321J54818a64070B39046L17674b3170
13277f1071i31D08431j59834p5843a41159A03519A011J31212J91822j49844B0499
$$ plain form
13354 179237 160206 170323 207931 377967 553708 306907 -26848 243848 182111 98052 -39426
13342 284356 189262 413535 295571 153124 14865 292936 279301 451457 81143 108165
13332 108165 226226 185722 92108 578546 217846 209966 288031 -74509 297104 4046 227826
13321 227826 441932 375565 142679 234030 92428 195795 344701 232496 450023 271296
13311 271296 -118683 -86847 160657 253637 125508 271672 124852 381790 153988 57132
13300 -1183 -46023 -151174 -31879 -56979 107005 176176 215848 -257581 208936 352880 -38951
13288 144382 -366870 249289 -37083 446011 16321 171139 -164070 239046 556720 -23170
13277 -61071 -931 408431 248597 172754 -141159 103519 1011 132223 324045 174201 20499
13265A94599J48473A16196L12799G1431K83244a8900j9501A3199K46575J53123
13255D12897e2427D3301K52978l333r3266Q2055B7769K40654p8466e551A00261
13243B0123M5032R2094k1600L0429a90481B36735j17259C0528J49081E0485a11753
13231B7503M4476P1052M2574m3586c22343B57903g2956C25494A58722d08247A88603
13219D3244a4012k45123F6079d1021B03740J46093A51521K89543E4791a64668
13208b4060C77913h0662A57337p6095J74552g4115D3366K88063j13755a2056I0926
13196H0634i1774C08242b79971c7622A22372N9392J2595C5577M29648b50620B59396
13184H526J6825a05144A2890K53972a40370c7090A22510L45580G8324J53256m5175
$$ plain form
13265 194599 343072 116196 428995 71431 354675 -18900 -38401 13199 259774 412897
13255 412897 -52427 43301 296279 292946 199680 281735 27769 268423 189957 -5551 100261
13243 20123 65155 157249 135649 166078 -190481 236735 119476 30528 179609 50485 -111753
13231 27503 71979 143031 185605 142019 -322343 257903 -72956 325494 158722 -408247 188603
13219 43244 -14012 -259135 66079 -41021 203740 349833 151521 441064 54791 -164668
13208 -24060 377913 -80662 157337 81242 255794 -74115 43366 331429 217674 -12056 90926
13196 80634 -91774 308242 -279971 -37622 122372 181764 194359 35577 465225 -250620 259396
13184 8526 25351 -105144 12890 266862 -140370 -37090 122510 468090 78324 231580 186405
13173A86405C9057L41736j25905J2763J5581C4971e0118a4816C48585A24214a10470
13161B35089g8322E09295A71910n1001B1741a320B5067a9030B85782b96410A77633
13149a7202j2309B12693a1836B25445F5484a02196H1501E276K8559K39871h2336
13137A98001J97098C4865K3073L77308A59451F6100E176g491H0553a23806j46682
13126b70488B27347e8334G9056l0340c79651A96506l2772E8927O799J09222K99435
13115D74383a8828E9430J19007q7689R944C1867J94930k2790p7961B671e4448
13103D4452M1241d6384A90643Q5059c6023C53214r5970g660A76715a84997E49242
13091D17a35235A09330K5146k2200a71949A84612a15341o0103B47567l4085L8009
$$ plain form
13173 186405 39057 380793 254888 267651 283232 34971 -50118 -14816 348585 124214 -110470
13161 235089 -78322 509295 171910 120909 21741 -1320 25067 -19030 285782 -296410 177633
13149 -17202 -29511 212693 -11836 225445 65484 -102196 81501 5276 33835 273706 -82336
13137 198001 395099 34865 57938 435246 159451 66100 5176 -7491 80553 -123806 -270488
13126 -270488 227347 -58334 79056 48716 -379651 196506 163734 58927 65726 174948 474383
13115 474383 -18828 59430 178437 90748 100692 31867 226797 204007 126046 2671 -54448
13103 44452 85693 -46384 190643 275702 -36023 353214 257244 -7660 176715 -184997 549242
13091 417 -135235 109330 134476 112276 -171949 184612 -115341 -175444 247567 213482 251491
13080B51491i5541B04112b8285P60B44398G7083j0439L45270B3069J13214O9616
13069B05899o0774a42227N6976c5583j67069A87510K51051A01445K38344j56785
13059A83004J29310f0527A85640L1949m2718m8185C2342g0056B52213c6604j4195
13048e0799n7537B9243K91561c7881C7960J60240l5097a21523A96483b16843c7739
13036C7733e7782q6724M3350A5501i5023B18187b8114m1856n1406B93167a07763
13024A45960O8948B0217N6473J19316j4153J99171b30707C3767a39215A29046
13013e7437H600M98761q2216b35424G3542L05414B1282Q0050j6249a43552C6320
13001C46643j29898D4332J85064a7594A27230N7512G1436J67953l1423a93900
$$ plain form
13080 251491 -95541 204112 -28285 -27525 244398 77083 66644 411914 23069 136283 205899
13069 205899 145125 -142227 -85251 -35583 -202652 187510 438561 101445 339789 183004
13059 183004 312314 -60527 185640 217589 174871 126686 32342 -70056 252213 -36604 -50799
13048 -50799 -108336 29243 320804 -37881 37960 198200 163103 -121523 196483 -216843 -37739
13036 37733 -57782 -144506 -101156 15501 -95023 218187 -28114 -69970 -121376 293167 -107763
13024 145960 214908 20217 76690 196006 181853 381024 -230707 33767 -139215 129046
13013 -57437 8600 507361 425145 -235424 73542 378956 21282 101332 85083 -143552 36320
13001 346643 216745 44332 229396 -17594 127230 184742 71436 239389 207966 -193900
12990F9791B3252K54766j11307a70628A01060J90463E0812K92023G0354O5149
12980A35503a48520A14207e8321G6544l1926M32673d9870B2082K62059c2607E9851
12968a45622B20697F620J21207d4187A04681J74653b79044A62673K8241D190a40994
12956A31868b08647A25822j5521d461l36474c5705b555C45690k5460c66485G720
12944b02955h5976j6878B94637I2184J57944A2570e3428B99391A28880j689l2117
12933I5074D1667N3176B5287O2982k1774O1072b58158O7528M5424A9972M39020
12922D58992D3984J52854a65962a0893j72064B89144c6167C21392a4272C55122
12911f6036A89328e5626b6879A89997A2899J32307b43010G2252J35037G1681J44586
$$ plain form
12990 69791 23252 278018 166711 -170628 101060 291523 50812 342835 70354 135503
12980 135503 -148520 114207 -58321 76544 44618 477291 -49870 22082 284141 -32607 59851
12968 -145622 220697 6620 127827 -44187 104681 279334 -279044 162673 190914 4190 -140994
12956 131868 -208647 125822 110301 -4461 -340935 -35705 -2555 345690 320230 -366485 7720
12944 -202955 -85976 -102854 294637 92184 250128 12570 -53428 299391 128880 127191 95074
12933 95074 41667 94843 25287 88269 66495 127567 -258158 -190630 -145206 19972 458992
12922 458992 43984 196838 -165962 -10893 -182957 289144 -36167 321392 -14272 355122
12911 -66036 189328 -55626 -26879 189997 12899 145206 -243010 72252 207289 71681 216267
12900B16267a53555j65016J42350A45106a42575A08232O9101C2741O228L1064
12890G0033l169J03680a07062R286j4521A49782E1387A9693L64229c12670B53748
12878G0076d9950F0925J16743e1705G0126K1999a21727b0237B13312b30304A23867
12866D6305J10417c26239F1570h2713L2155n8600B09475q2999N3515k8758J45594
12855B96827C737b5625E42277a28726C4418L8162L75035b29096i4549n9067A19129
12843G2695K29514A50902p4322K06142M8346D3635K80135L0399a65724K4931D4966
12831I6635J27913F2206L7003B9272J16208b02210f7752K293A0286c50489a25440
12819a13006d9680A22332i3446l7775F6669J45404a94080c7346A9618J98316b61151
$$ plain form
12900 216267 -153555 -318571 -176221 145106 -142575 108232 177333 32741 38969 70033
12890 70033 66864 170544 -107062 -97776 -112297 149782 51387 19693 383922 -312670 253748
12878 70076 -49950 60925 177668 -51705 70126 92125 -121727 -20237 213312 -230304 123867
12866 46305 156722 -326239 61570 -82713 -50558 -109158 209475 126476 179991 151233 296827
12855 296827 3737 -25625 542277 -128726 34418 72580 447615 -229096 -94549 -153616 119129
12843 72695 302209 150902 76580 282722 331068 43635 323770 354169 -165724 -140793 44966
12831 96635 224548 62206 99209 29272 145480 -202210 -67752 -65459 10286 -350489 -125440
12819 -113006 -49680 122332 -93446 -131221 66669 212073 -194080 -37346 19618 217934 -261151
12807e2938C3170P297b60844a19438F3582A152K7459c5702H3141g2707j62395
12796b35102H6188P7366m0286J4106n9996J49510a20393q9054e7350D389M7228
12785E1617J39253a32463B55526P9259A59680c6993A8359N5602L2360a11203J4734
12774i6469A89306a81836K9551G836K81381k778A26800b08767M0893Q2611D40377
12762A62022m8752N4684K15246H7491J15759E0841J28720G0475M9089C9309a59684
12750A51839Q2624J6779c29555g7374F8467J02224R5681c395j57025a5219m7661
12739f2880A01527b77979e1508E9853K68603a21654A70265C5874b17411j03200
12729c20611A31457b44219B8732g3942m9708e0906D52888B4482K36855j23932
$$ plain form
12807 -52938 33170 40467 -260844 -119438 63582 1152 28611 -35702 83141 -72707 -235102
12796 -235102 86188 163554 123268 137374 77378 226888 -120393 -209447 -57350 4389 51617
12785 51617 190870 -132463 255526 334785 159680 -36993 18359 73961 106321 -111203 -96469
12774 -96469 189306 -181836 -152285 7836 289217 286439 126800 -208767 -167874 -85263 440377
12762 162022 113270 167954 383200 87491 203250 50841 179561 70475 119564 39309 -159684
12750 151839 234463 251242 -329555 -77374 68467 170691 266372 -3395 -160420 -15219 -62880
12739 -62880 101527 -277979 -51508 59853 328456 -121654 170265 35874 -217411 -320611
12729 -320611 131457 -244219 28732 -73942 -123650 -50906 452888 24482 261337 137405
12719A37405o7685M037A1644b22866o8391A81788a49429e9548A2011K45861B922
12707a00360F304f1754o8871p1450B68206E7134M0112Q3697a8736o5638B03432
12695F5831d0784A79772i9367O968E0222d2205F5240Q6530a42164B7090a8521
12683a17057A01499d4260A7999N2984a18763c4647A61903d6645D17535b16002
12672e7589I9390a08729A04365K19053c3482A90017N5014N9203j32786F2497a18237
12660i0813j34738A42485J82596K7365A10049l4044a83463n0893B5407d6778r283
12649e6061q5385j0792e1615I8058a94622A71369n0930p274e6527B5569c9954
12637c24168A81300a92711D42326G3446a42894B01969b19389B63159j26538a30868
$$ plain form
12719 137405 69720 73757 11644 -222866 -291257 181788 -149429 -59548 12011 257872 2922
12707 -100360 6304 -61754 -130625 -202075 268206 57134 97246 180943 -18736 -84374 203432
12695 65831 -40784 179772 -99367 -92399 50222 -42205 65240 151770 -142164 27090 -18521
12683 -117057 101499 -44260 17999 70983 -118763 -34647 161903 -46645 417535 -216002
12672 -57589 99390 -108729 104365 323418 -33482 190017 245031 304234 171448 62497 -118237
12660 -90813 -225551 142485 325081 352446 110049 76005 -183463 -234356 25407 -46778 -56061
12649 -56061 -141446 -152238 -51615 98058 -194622 171369 120439 113165 -56527 25569 -39954
12637 -324168 181300 -192711 442326 73446 -142894 201969 -219389 263159 136621 -130868
12626a20144H006J97329n8624j1194m0919J91245C6702b2440A04949p694L0537
12615A27792M02401A28270J44083K18141a9309C20769j40582h740K520B34476
12604B78615b79947A28189h3035A03370a83151A33446c984G9734a87531A66662
12593B37417o6289Q501j3700O3665a84797K4953H973M8468H803m344L38850A49585
12580C15462a85382K8176A47196c8068E76024H0383E552K053K7943P3022d9120
12568A94939g8825B5515c22192h6812F0822a01053C53367C2216J60195b89561
12557a64382F8094a71825A42918P4817d7654D6580P6785a50280A44861C4212f556
12545I1012Q1498D5341a54482A17282a77894I1320j5128J85036a49715L3220H232
$$ plain form
12626 -120144 8006 205335 146711 135517 94598 285843 36702 -22440 104949 97255 127792
12615 127792 530193 128270 272353 490494 -19309 320769 180187 -8740 -6220 234476
12604 278615 -279947 128189 -83035 103370 -183151 133446 -3984 79734 -187531 166662
12593 237417 171128 179629 165929 229594 -184797 -159844 8973 57441 8803 4459 343309 149585
12580 315462 -185382 -157206 147196 -38068 576024 80383 5552 7605 35548 108570 -49120
12568 194939 -78825 25515 -322192 -86812 60822 -101053 353367 32216 192411 -289561
12557 -164382 68094 -171825 142918 217735 -47654 46580 123365 -150280 144861 34212 -6556
12545 91012 172510 45341 -154482 117282 -177894 91320 76192 261228 -149715 -116495 8232
12533A0514M9369M6950b31B21599C412J78438e8487A98853K3314D1613a1870r3779
12521a05649E8749K24199b11878L5196D3809J4389d90566a08559b0230A32267
12510A0647J55550l2923h2345G6582m211J2144a52183D06454E5054J10614b26236
12498a17327k75097d9488E2394b86401A77697C9333K69830b8662A02551O4145
12488A66696F2202Q883j8371K68060a50072N0601n6430A62659K9614f2519B17358
12476a21357E40510B2202K21956C6651h2064A03586h5181j06756r6158A6928J78548
12465A95476J71300a09451j06164A46972A2491o198N4378P6789K2932a53955C05943
12453B43457K4663a00246d11k04460a1618k0436q7400o5378c2617A21676a47385
$$ plain form
12533 10514 59883 106833 -231 221599 3412 181850 -58487 198853 222167 41613 -11870 -105649
12521 -105649 58749 282948 -211878 -176682 43809 58198 -490566 -108559 -20230 132267
12510 10647 166197 133274 -82345 76582 72371 84515 -152183 406454 55054 165668 -226236
12498 -117327 -392424 -49488 52394 -286401 177697 39333 309163 -28662 102551 166696
12488 166696 62202 71085 52714 320774 -150072 -99471 -155901 162659 192273 -62519 217358
12476 -121357 540510 22202 244158 36651 -82064 103586 -85181 -191937 -288095 16928 195476
12465 195476 366776 -109451 -215615 146972 12491 6293 60671 137460 160392 -153955 305943
12453 243457 268120 -100246 -411 -204871 -11618 -32054 -119454 -184832 -32617 121676 -147385
12441a04886A52813c2633n4576E9471b27272i5079j9391D2525b61702d1150j98064
12430b39214B30882e3756A93898q0293P4648n8971b852j95633O7536A9357R8849
12419A18206E6055a23033j95005A92859i8671A24677d803m2501F4667B0651a0297
12407c47380A632J94986e2030j91078R6152b3102A33369e25556A6173L04063H954
12395b29461N4922E8451b41043R1294E0032a68576f3517p0172A34388D6351J87420
12384B33771a6604l9610f098o2061n9926F8175h755G6996J35654F3314K19283
12373B82597A09024J5492f3878C52321b78422A73653d8594B06410g8082A15195
12362A2295K96322c22051d6449j72088I5407A8501f4516A63189a40382C02641
$$ plain form
12441 -104886 152813 -32633 -87209 59471 -227272 -95079 -114470 42525 -261702 -41150 -239214
12430 -239214 230882 -53756 193898 113605 188253 129282 -2852 -198485 -130949 19357 118206
12419 118206 56055 -123033 -318038 192859 -98671 124677 -4803 -47304 64667 20651 -10297
12407 -347380 1632 196618 -52030 -243108 -146956 -23102 133369 -525556 16173 320236 8954
12395 -229461 -174539 58451 -241043 -149749 50032 -168576 -63517 -133689 134388 46351 233771
12384 233771 -16604 -56214 -6098 -68159 -128085 68175 -8755 76996 212650 63314 282597
12373 282597 109024 124516 -63878 352321 -278422 173653 -48594 206410 -78082 115195
12362 12295 308617 -322051 -46449 -218537 95407 18501 -64516 163189 -140382 302641
12351I1252f6453j0724B23547C5161k613J0449J16081d8870j04556A05136d8495
12339B57834H127a7701m13A82273p786a19392B52686b6507C52833D6223i2356
12327A57411g5508A97008O2023Q2294j52022J9454a43826H7760a56965A95944
12316I4159M47495h4159B62382A01829R3913f4775I9576B5494L34733A05818D1773
12304a07087k72271C06970G1943J26800p7139b02117D17187H4128a04830B92561
12293A21429R4329O2481B0030J4942R9863e8429A12984K6138A0322K92730b99688
12281G6393a67517B4252d5606A59755c2841C24554b88163a28475j4745G5094K25136
12270C00230i3038B82663A32996l6298k2412J03452g188B02511D772J9353J53469
$$ plain form
12351 91252 -66453 -77177 223547 35161 32548 42997 159078 -48870 -153426 105136 -48495
12339 257834 8127 -17701 -18114 182273 174487 -119392 252686 -26507 352833 46223 -92356
12327 157411 -75508 197008 259031 341325 189303 208757 -143826 87760 -156965 195944
12316 94159 541654 -84159 262382 101829 195742 -64775 99576 25494 360227 105818 41773
12304 -107087 -379358 306970 71943 198743 121604 -202117 417187 84128 -104830 292561
12293 121429 215758 278239 20030 34972 134835 -58429 112984 139122 10322 303052 -299688
12281 76393 -167517 24252 -45606 159755 -32841 324554 -288163 -128475 -143220 75094 300230
12270 300230 -93038 282663 132996 96698 74286 177738 -7188 202511 4772 24125 177594
12259A77594M90F2642M5658Q8032o4627K08677K24304k22696a24298C27111J52100
12248D79211A95678K336P3922H0889b28264A98648G0029K96931j51459J81K4344
12237B40026l9012B3222L0101k0990N2277c3066I9892P4221G4238b8953A08892
12225B33517l250F6697L25323a29873f4252F779c5832A52747L2901c0954A88117
12213B5353R2042a3613G8824L09905C4070a02406A2537J37593C6483b3455F08346
12201B75001A10871a6487B22840n9619E0160g9196J983D04071j64738e4307A70089
12189A22855K71969g8434C80461E7757K11779a00346A55129J31231C421P60K61020
12178B65201n6114I8815D2298J1179A6439K6296K55505b5753A64523a50186M7642
$$ plain form
12259 177594 178084 62642 108300 196332 131705 340382 564686 341990 -124298 327111 479211
12248 479211 195678 198014 271936 80889 -228264 198648 70029 366960 215501 215682 240026
12237 240026 201014 23222 53323 32333 84610 -33066 99892 174113 74238 -28953 108892
12225 233517 230267 66697 392020 -129873 -64252 6779 -35832 152747 185648 -30954 188117
12213 25353 117395 -13613 78824 388729 34070 -102406 12537 150130 36483 -23455 608346
12201 275001 110871 -16487 222840 163221 50160 -79196 -77213 404071 239333 -54307 170089
12189 122855 394824 -78434 380461 57757 269536 -100346 155129 286360 3421 4181 265201
12178 265201 209087 98815 42298 53477 16439 42735 298240 -25753 164523 -150186 -102544
12167a02544C24374A18809J6320M80420g1861a005B28617o2289J80364G8030f2281
12155G7153J62314J88601A7263R2679d4328D11374J98380j48395A19037k8439
12145I0598Q2904r929C7438K44325A27566K45657A21510a40682C08728E1513J19354
12134A70867G4599J7917b84417J00551c3410G2706L0855c3257B76990a99219a2855
12122a7261j33202I156K98051B4518a138p2687B08441Q7306F7936J05040g970
12110B02233J04m2427J52159c09497A64220e0876D6828L3941c2809H5365Q7551
12099A72916a27384A85799b20507D32915I5257a42362B38547p6615H236L76187
12089C84423l8702i547A65617J94084d0115j23289A36542J34450k5305e193B3321
$$ plain form
12167 -102544 324374 118809 135129 615549 -71861 -1005 228617 166328 346692 78030 -62281
12155 77153 239467 428068 17263 109942 -44328 411374 609754 461359 119037 90598
12145 90598 173502 163573 37438 281763 127566 373223 121510 -140682 308728 51513 170867
12134 170867 74599 92516 -284417 -183866 -33410 72706 103561 -33257 276990 -199219 -12855
12122 -17261 -150463 9156 307207 24518 -1138 -73825 208441 295747 67936 172976 -7970
12110 202233 202337 159910 312069 -309497 164220 -50876 46828 80769 -32809 85365 172916
12099 172916 -127384 185799 -220507 432915 95257 -142362 238547 161932 8236 384423
12089 384423 345721 -9547 165617 359701 -40115 -163404 136542 270992 245687 -5193 23321
12077a091j48280A63185J17830f0097B06144p0123J09982I8666P1360J42050j13808
12066A98268d6308k4318C21362A29892L83529a46557B3004L94110D3366K51354
12056B94720D5132K40728e1056q0664C91570r9304j25155J62039j48139n2839
12046A28172O9847B308c2869k21269B74277A27360b26231h9285B43921r9949N5902
12035A99874r9497h2057k3399h391A15907J39018b65978b6957I4907a4263k69306
12024b83569A28345d8586H9071c9262C44865l5101c4818j48914A01485c6536A08076
12012G8503M00042B10401I5767a92605A35200F7242a30674e7112B5426L783J80064
12001B09273E7598K85089G9219L162A7055K12936G1234K39063P4801j50307b06853
$$ plain form
12077 -1091 -149371 163185 281015 -60097 206144 136021 246003 98666 170026 312076 198268
12066 198268 -46308 -70626 321362 129892 513421 -146557 23004 417114 43366 294720
12056 294720 45132 285860 -51056 -131720 391570 292266 167111 329150 181011 128172
12046 128172 198019 2308 -32869 -254138 274277 127360 -226231 -89285 243921 143972 199874
12035 199874 100377 -82057 -105456 -8391 115907 254925 -265978 -26957 94907 -14263 -283569
12024 -283569 128345 -48586 89071 -39262 344865 309764 -34818 -183732 101485 -36536 108076
12012 78503 478545 210401 95767 -192605 135200 67242 -130674 -57112 25426 29209 209273
12001 209273 57598 342687 79219 82381 17055 229991 71234 310297 385098 234791 -206853
11989A02368K7542F2467O7938c8211j08508b1464A06829E0869Q7816c59628a58566
11977a2526m1542n2141B06396D9445e16589b32947B45431A02051L3779a40802
11966A85386a68677E2080a46942j28247A23170l9102c39141i358C5387a38966
11955c05613a38006j28577J15134e0782j19427I1109f5270j15188G8135c40526
11944B49170i4381E4935N9788l2948j1600c3357C7872b04054B06613a6072n6932
11933g3004A59810M1479c8527j15541P0585j49843J1177P3154m919j99682R9789
11922b53807B89030B1614K12475A02787B6034e32l8380l4089B67792g9157E7870
11910i0679C12909c3441D0415L4741l0912a99284e2770C3212J33277i9046n6551
$$ plain form
11989 102368 129910 62467 130405 -38211 -146719 -21464 106829 50869 138685 -359628 -158566
11977 -12526 -54068 -106209 206396 49445 -516589 -232947 245431 102051 135830 -140802
11966 185386 -168677 52080 -146942 -275189 123170 84068 -339141 -9358 35387 -138966
11955 -305613 -138006 -266583 -151449 -50782 -170209 91109 -65270 -180458 78135 -340526
11944 249170 -94381 54935 114723 81775 70175 -33357 37872 -204054 206613 -16072 -73004
11933 -73004 159810 201289 -38527 -154068 -83483 -233326 -222149 -148995 -153914 -353596 -253807
11922 -253807 289030 21614 234089 102787 26034 -532 -38912 -73001 267792 -79157 57870
11910 -90679 312909 -33441 40415 75156 44244 -199284 -52770 33212 166489 -99046 -155597
11899a55597E6941a05894A26086e9311B15625d0187G8478a72470G9018K8927J28467
11888B36412g0485B21211N4595F4846a35870B15780N782b18871J9535A19214l3664
11877H5550b76501i3768a0573l23732F4652J17206a05696L408A06346e4321n0350
11866a04671D1114b0907j76477I2942a17090k4943p0740E4623b01155I486a40795
11854D8888b21334b58B86456r2905q0017b75065i5838k06512N7209a16091A4054
11842D016K32156b81366J23624B70551a39049D5376d4133j4931D02085a18969
11831a12407F6798P1427a13262A25580a07813M8432D5457d9874j96473h6356j94840
11820b81196g9789k70627a04624b3696C7704A0016a23918B54486a67575A57761
$$ plain form
11899 -155597 56941 -105894 126086 -59311 215625 -40187 78478 -172470 79018 107945 236412
11888 236412 -70485 221211 275806 64846 -135870 215780 221562 -218871 -199336 119214 85550
11877 85550 -276501 -93768 -10573 -334305 64652 181858 -105696 -102288 106346 -54321 -104671
11866 -104671 41114 -20907 -197384 92942 -117090 -142033 -212773 54623 -201155 9486 -140795
11854 48888 -221334 -258 286456 193551 113534 -275065 -95838 -302350 -245141 -116091 14054
11842 4016 236172 -281366 -157742 270551 -139049 45376 -44133 -59064 402085 -118969
11831 -112407 66798 138225 -113262 125580 -107813 -59381 45457 -49874 -246347 -86356 -281196
11820 -281196 -79789 -350416 -104624 -23696 37704 10016 -123918 254486 -167575 157761
11809b78448g8261A01917a93356K3305d4316o6969A58371n7998b63962A42421
11798c7308q1883B08852a80999k98247d7838J0285A07914a27011d2455j70116
11788b12571B2581b5054F3835b76553A98139e3503j89286i166p807j24388L8296
11777a03065n5536j68427I7544a95170B03078a87412A66168c1913A59516l1232
11767A28284O0506i3355k11268h8746q0525G376g897k00193A90014A7036a54655
11755i6182d0817G9986b996j96067h5410q2207b375C7486e4266B51272a09961
11743A7122M6012e7778q7823c8737A5849a85215F3294K17473d5899J8347j37841
11732a65393B44366a34698C5645a98870m4820H399d4421D3188a03755k14750k6350
$$ plain form
11809 -278448 -78261 101917 -193356 -170051 -44316 -111285 158371 100373 -263962 142421
11798 -37308 -119191 208852 -180999 -479246 -47838 -37553 107914 -127011 -42455 -212571
11788 -212571 22581 -25054 63835 -276553 198139 -53503 -242789 -9166 -16973 -141361 -103065
11777 -103065 -158601 -327028 97544 -195170 203078 -187412 166168 -31913 159516 128284
11767 128284 188790 -93355 -304623 -88746 -169271 7376 -7897 -208090 190014 17036 -154655
11755 -96182 -40817 79986 -2996 -199063 -85410 -167617 -2375 37486 -54266 251272 -109961
11743 17122 63134 -57778 -145601 -38737 15849 -185215 63294 280767 -45899 -27552 -165393
11732 -165393 244366 -134698 35645 -198870 -243690 8399 -44421 43188 -103755 -318505 -344855
11721c44855J72139j3123B71306A17112Q300c5030E8267B3755b16709A55614K0719
11710A76333K7455J54101D832g4584j14569A3408a98766K9860B67529D5302N4572
11699I9874r251L1330H969i7487N45j6997A68155C4153b4879k37427A52917b71315
11686A27871A5936K34824A21915J9215a7914k53775H3219K04465a47132C04752
11675I1926b3515B18273A06414h4062o7372J5654d0467C4265J02341e7423h805
11663B8924a70659O4910j07146c5421A4769K8021a01083A62753J18926a10772
11652I4908c6795B41883a15293B53087a5857F1504L91128c2121r5203d2549B47756
11640a36549G2406c03j2078r027H1187K00615j09952a9900C68069j28111q3373
$$ plain form
11721 -344855 -172716 -185839 271306 117112 125412 -35030 58267 23755 -216709 155614 176333
11710 176333 203788 357889 4832 -74584 -189153 13408 -198766 -168906 267529 45302 99874
11699 99874 90623 121953 8969 -97487 -96942 -113939 168155 34153 -24879 -262306 152917 -271315
11686 127871 15936 250760 121915 141130 -17914 -271689 83219 287684 -147132 304752
11675 91926 -23515 218273 106414 -84062 -151434 -135780 -40467 34265 136606 -57423 -8805
11663 28924 -170659 -105749 -212895 -35421 14769 42790 -101083 162753 281679 -110772
11652 94908 -36795 241883 -115293 253087 -15857 61504 452632 -32121 -127324 -42549 247756
11640 -136549 72406 -303 -12381 -21408 81187 281802 171850 -19900 368069 239958 156585
11629A56585k1496C6851P4508C8558b48725A27888a32241G9795a79309D8545K2221
11618G0766K41653a4870o8427E9524J71681b80201A89007e4878C16374j7142c4736
11606h5280d893j45843B53757J56296G0320e9129j36060A19328B9293a40174A66775
11594i7624A70296G9793d6947G2156K80153a83164D76719a12296e0489k94037
11584c44526A09647b19123B29469J7889H5628g482H8492o154K72213a57254N2407
11573a04847A50228b95269B66406b6146j97340J215c2098A78310N3884j9979F0002
11561b70333A74231d6591h65l9389A23757D3410A5591c4337A04308a44021N2195
11550i1826A11797a50548A00694E298i5432A3045J40341c3842C22940A34600f5
$$ plain form
11629 156585 135089 36851 111359 38558 -248725 127888 -132241 79795 -179309 48545 70766
11618 70766 312419 -14870 -83297 59524 231205 -280201 189007 -54878 316374 299232 -34736
11606 -85280 -4893 -150736 253757 410053 70320 -59129 -195189 119328 29293 -140174 166775
11594 -97624 170296 79793 -46947 72156 352309 -183164 476719 -112296 -50489 -344526
11584 -344526 109647 -219123 229469 247358 85628 -7482 88492 82338 354551 -157254 -104847
11573 -104847 150228 -295269 266406 -26146 -223486 -222271 -32098 178310 232194 212215 60002
11561 -270333 174231 -46591 -865 -40254 123757 43410 15591 -34337 104308 -144021 -91826
11550 -91826 111797 -150548 100694 5298 -95432 13045 153386 -33842 322940 134600 -65
11538E335i7806A54517a92460B23097o4364f2962A90801c43345G542b45236C70253
11526C3330K10994A10407C7507J51036j2435i3948A20661n3145a55558f0808C19201
11514a63140E3572J90256k6270n9609J94785a19201B7330g5901E8473e6317A93852
11502A9439O4559O6658J57508g5672k6401O051C262O2611L0361C9849j0044d2869
11489C5496J24779J9651n9699c2051B03762I9306K03842c457B53937A16470K9499
11478A45969f0055f126B68217b5874B60863c2952E015M5014a20146N6735K1329
11467d2082B43082g3557A22019L56707i7454B09327e4535j28049I7077J43213
11457B40290d8357H3505J96865b41426A14868h9229C65979q2632a48571D64808
$$ plain form
11538 5335 -97806 154517 -192460 223097 158733 -62962 190801 -343345 7542 -245236 370253
11526 33330 244324 110407 37507 188543 176108 -93948 120661 67516 -155558 -60808 319201
11514 -163140 53572 243828 217558 157949 352734 -119201 27330 -75901 58473 -56317 193852
11502 19439 83998 150656 308164 -75672 -102073 -96022 3262 65873 96234 39849 29805 -42869
11489 35496 160275 179926 120227 -32051 203762 99306 303148 -3457 253937 116470 145969
11478 145969 -60055 -6126 268217 -25874 260863 -32952 5015 50029 -120146 -63411 -42082
11467 -42082 243082 -73557 122019 478726 -97454 209327 -54535 -182584 97077 240290
11457 240290 -48357 83505 280370 -241426 114868 -89229 365979 283347 -148571 464808
11446a33908A79606Q1453A972N1487J17972m6050G66J81234Q2431H8951d41747
11434c4780A01792A8419L4383a09573K8341A03641D2508j8649O9483k9138a32177
11422a226I7519a38722C59401K4882g0165A55195a10588h751C05417a98425I0837
11410a98098D4725P8731a01787B81862f9630E1459j6633D785b35900O8686D9866
11398A58078a01187o8127B02861H3325f9508K8748p0543C8222a17710d9878B07009
11386B10584r9124K9959b22666J08797j60011A54443N0449E4649J40260q3868
11376A11041b58685c2009B68118i9928k08011a38489D6795i9946a620l97481h3244
11364a69797B5549h8007b4011k01048A24660Q7754p6290j4826E72b3990j35247
$$ plain form
11446 -133908 179606 261059 1972 53459 171431 125381 766 182000 264431 88951 -441747
11434 -34780 101792 18419 52802 -109573 -81232 103641 42508 23859 93342 64204 -132177
11422 -1226 97519 -138722 359401 384283 -70165 155195 -110588 -8751 305417 -198425 90837
11410 -198098 44725 123456 -101787 281862 -69630 51459 34826 4785 -235900 -167214 49866
11398 158078 -101187 -169314 202861 83325 -69508 -40760 -111303 38222 -117710 -49878 207009
11386 210584 111460 141419 -222666 -113869 -273880 154443 204892 54649 194909 111041
11376 111041 -258685 -32009 268118 -99928 -307939 -138489 46795 -99946 -1620 -399101 -83244
11364 -169797 25549 -88007 -24011 -225059 124660 212414 136124 121298 572 -23990 -159237
11353a59237J9033j21909J24909j79243A00922B4030J01550n8730P6114J13266
11343B56230g4143F1415k8132L27650b58732d0369j35696C73300d04051A57748
11332b99628i8200d0148M462J101n9873d1928A91369c8407E008g0406J0277j46748
11320b06877F6603J55803A03299J84290A00304a70866b7472r6657D5107L12304
11310C57411A0333L4016b61238C169R3477j7118b2530B65765c33499a22939N3644
11299f9295j89665C2583a00433A31451a80111I525d4002A49191i8600k56444M8534
11288c06510e9536F570b59052h7337A03116n770c3587j44087j13454b5601j63788
11277a89389a0083k469n5548j9052k17202A64951a43334d1951K714A54234d6962
$$ plain form
11353 -159237 -140204 -262113 -137204 -316447 100922 24030 125580 66850 142964 256230
11343 256230 -74143 61415 33283 360933 -258732 -40369 -176065 373300 -404051 157748
11332 -299628 -98200 -40148 -35686 -34585 -94458 -41928 191369 -38407 5008 -70406 -60129 -206877
11320 -206877 66603 222406 103299 287589 100304 -170866 -27472 -124129 45107 357411
11310 357411 10333 44349 -261238 3169 96646 79528 -22530 265765 -333499 -122939 -69295
11299 -69295 -258960 32583 -100433 131451 -180111 9525 -44002 149191 -98600 -355044 -306510
11288 -306510 -59536 6570 -259052 -87337 103116 97346 -33587 -177674 -291128 -25601 -189389
11277 -189389 -10083 -12552 -68100 -87152 -304354 164951 -143334 -41951 -39237 154234 -46962
11265a11033J4691M126a310l65865a10370e0284j9411j93695e3085k21461k6852
11254c01398i3469j25598I825J52612n2528i6155q2565E7264b29496A32677K1876
11243A54553m0499b32848h6964D399O0596b79525A55580b32198P2223g2547D8623
11231A31792o1094a58558e2242p3487c1162k1967F431J00380m6275N6613a81592
11219A2829g4374A2570J29393E370L0627K5076j3797O3093b30053A3808e7901
11207C5271O4515C0558h1023p4853d4116B41874d50885a4592I2182B500K69569
11196B72069I883b7359l8839F9476a37925A0949a43397A88939b75287c5939m7542
11185h3481I8778b41143A36455f5655m8061B4877a0078j23753i836l5966l4416
$$ plain form
11265 -111033 -96342 -92216 -1310 -367175 -110370 -50284 -69695 -263390 -53085 -274546 -301398
11254 -301398 -93469 -219067 9825 162437 109909 -96155 -178720 57264 -229496 132677 154553
11243 154553 114054 -232848 -86964 4399 64995 -279525 155580 -232198 -159975 -72547 48623
11231 131792 70698 -158558 -52242 -125729 -31162 -53129 6431 106811 60536 117149 -181592
11219 12829 -74374 12570 141963 5370 35997 61073 47276 110369 -230053 13808 -57901
11207 35271 99786 30558 -81023 -155876 -44116 241874 -450885 -14592 92182 2500 272069
11196 272069 9883 -27359 -66198 69476 -137925 10949 -143397 188939 -275287 -35939 -83481
11185 -83481 98778 -241143 136455 -65655 -113716 24877 -10078 -133831 -9836 -45802 -80218
11174h0218j60576A53994b32655n0970f1774k70007b2665H046b20082f3457C65376
11162H0323A207a52649l15632C2905a31797b1923k43298k38909A613h0976B3883
11150A48305l6207C921b54235J3360k64622A54534B8575a06433I3692R0500D315
11138G5274a11259p7157H9842b982B76424b59596a24985L3033A98221N227b91402
11126i7530a5994q1114l2709B6519b1071B79822C5083Q1034E111L30321j22833
11115B12599a34991C7814R1167C7372J06537J32813j23616a8272a370G6240C8105
11103H3671B8289f4433J2355H3199B7865J67797M1833d149p3129j2854A717b83396
11090a40593A68045a31272F0995L16252B281R349J46773G959a13327C45929c5620
$$ plain form
11174 -80218 -240794 153994 -232655 -283625 -61774 -331781 -22665 8046 -220082 -63457 365376
11162 80323 1207 -152649 -468281 32905 -131797 -21923 -265221 -504130 1613 -80976 23883
11150 148305 112098 3921 -254235 -240875 -505497 154534 28575 -106433 93692 184192 4315
11138 75274 -111259 -188416 89842 -2982 276424 -259596 -124985 -91952 198221 203448 -291402
11126 -97530 -15994 -97108 -129817 26519 -21071 279822 35083 116117 5111 335432 212599
11115 212599 -134991 37814 128981 37372 143909 276722 153106 -18272 -1370 76240 38105
11103 83671 28289 -64433 -52078 83199 27865 195662 237495 -4149 -77278 -90132 1717 -283396
11090 -140593 168045 -131272 60995 377247 2281 11630 158403 7959 -113327 345929 -35620
11078a34914C09318J29152d4911B19095H3663L03572c11970A28623M3034l693
11068A67964J80741A05319K01959J00955C4605L9231K8043D4362J36094H2842
11057D5528L27215B5422J91101Q358J07650m726q0602m7531J36051A28909K64495
11046C93404j62888p2683J46336K83765H0490Q0194R0330k5104M00574j6445B03550
11034D28485A55903L94085J37321J5025B63782K26734n0439k4287L8150J52638
11024F06578j94354o0979j55864O27093l25384K29173A65927M09402J47455B64185
11013C73855l6264L96697j12273j99012L84432M4916k75937n1283j41652j04341
11003B79138J83183J30034A59408M07046j97814A47714N68457l21394A60158N93002
$$ plain form
11078 -134914 309318 438470 -44911 219095 83663 387235 -311970 128623 171657 167964
11068 167964 348705 105319 307278 408233 34605 73836 101879 44362 180456 82842
11057 45528 372743 25422 216523 224881 332531 327805 247203 199672 335723 128909 393404
11046 393404 230516 157833 304169 587934 80490 160684 251014 225910 626484 610039 203550
11034 428485 155903 549988 687309 702334 263782 490516 440077 415790 453940 606578
11024 606578 412224 351245 195381 822474 497090 726263 165927 575329 722784 264185
11013 373855 337591 734288 622015 423003 807435 852351 576414 525131 383479 279138
11003 279138 462321 592355 159408 566454 368640 147714 716171 394777 160158 753160
10993G53160j20834J12720D3490M74366k03894L48510C09662J90935N060m0592
10983D65065K15623l702j26611p2548A74284K29016K38625k78257j40452M19717
10973F42933n9525N7995J75725B56581J23312M50691l12842j08492J74999J75479
10963G59728O7528M9929K69607l03474J94228k610L25576N0661J05491M8214L05850
10952A870728j34420Q6179n6964q5637k24031j39830M72415m89599k47882K65534
10942A316493K09574m16860K60049m2592L65413k922l59192j7542k61240R4960
10932A146141k32149n988j39162N1349k47872J47484i26A63111L50695g3791A40161
10920a66324A67751o2639J71520q3802J7915q9091N0127J6851J88674A86301b5351
$$ plain form
10993 753160 632326 745046 43490 517856 313962 662472 309662 500597 505657 465065
10983 465065 680688 676986 550375 477827 174284 403300 641925 363668 223216 642933
10973 642933 583408 641403 817128 256581 379893 830584 517742 409250 584249 759728
10963 759728 827256 877185 1146792 843318 1037546 1034936 1360512 1411173 1516664 1564878 1870728
10952 1870728 1736308 1822487 1765523 1679886 1455855 1316025 1788440 1298841 1050959 1316493
10942 1316493 1526067 1109207 1369256 1326664 1692077 1689155 1329963 1312421 1051181 1146141
10932 1146141 913992 908004 768842 820191 572319 719803 -926 163111 513806 -73791 140161
10920 -166324 167751 105112 276632 192830 210745 121654 171781 188632 377306 186301 -25351
10908g2643l1230H9100g5400l1906a5380A50575d3412E7367a01146d2793C18866
10896B0449J95435J6493f6555C6968b57020J2676g0246q6113O8342L6132j58532
10885b10417B48494D3210L83719B3720K35052a03918A34122e5446C697L81636
10875C85333A24939L9107b19919r4980A08761J08285j08024j0008c17266A54959
10864e7149a8400B65540a57967N9124q6686B1723b1382A5660J08887j3771a37963
10852A72178b96573C5822b52455H0403a91913c2809B90219J1901E4236d6716p4250
10841a20966B00431b57991I0192a28463r131M6666k6447A76209J67361c85533
10830D10780D8474P9474a5731j6704H5251k9316A6960J11394a03936C9279Q051
$$ plain form
10908 -72643 -103873 89100 -75400 -107306 -15380 150575 -43412 57367 -101146 -42793 318866
10896 20449 215884 232377 -66555 36968 -257020 -244344 -70246 -156359 -88017 -51885 -210417
10885 -210417 248494 43210 426929 23720 258772 -103918 134122 -55446 3697 385333
10875 385333 124939 164046 -219919 -314899 108761 217046 109022 99014 -317266 154959
10864 -57149 -18400 265540 -157967 -98843 -185529 21723 -21382 15660 124547 110776 -137963
10852 172178 -296573 35822 -252455 80403 -191913 -32809 290219 302120 54236 -46716 -120966
10841 -120966 200431 -257991 90192 -128463 -137594 -90928 -117375 176209 343570 -385533
10830 410780 48474 127948 -15731 -32435 85251 55935 16960 128354 -103936 39279 47330
10819D7330h9854B45135a12021R820b4895l38510a74248j633B6041R1929C8583
10807B99273q1266d64696J48706A62039e1675D17756e9673l4240k4843J7818b0140
10795a06453j11569H2525a7292r5622c658l20537B4184k083a89371A06692a43804
10783a16902l58377A37044J1675I905h5961r9587h1325K5710j54036K2196O197
10772a81258j90964J45689C6189b24248C5167J99421b46669k37316H2318h3178
10761h5514A73530a3221B02900D3616c54236h5829E7604c144D5367K45261b12755
10749E7787c9143j55780C48678d4658J259j2703B1942e4212E3944L3397i9465
10737H7752i1428D0114b20385C6303a58432G20e6639B79213a67676B8136K33390
$$ plain form
10819 47330 -89854 245135 -112021 -102201 -24895 -363405 -174248 -175881 26041 117970 38583
10807 299273 218007 -464696 -315990 162039 -51675 417756 -59673 -93913 -118756 -100938 -20140
10795 -106453 -218022 82525 -17292 -112914 -3658 -324195 24184 22101 -189371 106692 -143804
10783 -116902 -475279 137044 148719 9905 -85961 -185548 -81325 -55615 -209651 -187455 -181258
10772 -181258 -372222 -226533 36189 -224248 35167 234588 -246669 -483985 82318 -83178
10761 -85514 173530 -13221 202900 43616 -354236 -85829 57604 -3144 45367 290628 -212755
10749 57787 -39143 -194923 348678 -44658 -43399 -56102 21942 -54212 53944 87341 -99465
10737 87752 -91428 40114 -220385 36303 -158432 720 -56639 279213 -167676 28136 261526
10726B61526c9343D4227B1580J06374J31541a72787h1890n9012B07919a89927
10715a00141n9256H5919d6569C054c6457B7775a02109D9885J50779G364a14233
10703A88966a59436F9361K02561Q5430B7942d6765k46955H0588b04501B6738b19269
10691a04838B4288b34947n0495A19086e7175p774G2048O4478L85332D8937k533
10680D6404a2381D4155J2754a86242Q9796D08233F8420K34164d6492j52835h125
10668G2541e7388k5114J4291j15427E0092d6353A50401a8535p8720j16944o131
10657b20330k396A02637a66657c3788j12530d4477j71973h0069b0535j38942L7742
10646a21735l57674c1688g341I3061l2853b9830k63595I8110m893a64417g2796
$$ plain form
10726 261526 -39343 44227 21580 127954 259495 -172787 -81890 -140902 207919 -189927
10715 -100141 -159397 85919 -46569 3054 -36457 27775 -102109 49885 200664 7364 -114233
10703 188966 -159436 69361 271922 357352 27942 -46765 -293720 80588 -204501 26738 -219269
10691 -104838 24288 -234947 -285442 119086 -57175 -64949 72048 136526 521858 48937 46404
10680 46404 -12381 44155 56909 -186242 -96446 408233 68420 302584 -46492 -199327 -8125
10668 72541 -57388 -82502 -68211 -183638 50092 -46353 150401 -18535 -97255 -214199 -220330
10657 -220330 -222726 102637 -166657 -33788 -146318 -44477 -216450 -80069 -20535 -159477 -121735
10646 -121735 -479409 -31688 -7341 93061 60208 -29830 -293425 98110 93217 -164417 -72796
10634b24384J11136j29083l12187B48479a9325r3067q5772j78297D6461J30667
10624A77128R8589b70922a26679o6871B84586j20099a72386f9199F2259b41795
10613f8502k24659H1153b44888f6597q1369L1164F4492B689c4804l11389m7083
10602c93276J95430J0371D220a32505C1904a54851A48988F942b52804A50980M782
10591A55762h9150D7990A3489c26194A62687O3546b54432A61140b97144B2018
10580d3261B4387J09221b74947p428e412m01231H2312J39457B1623a0418q2045
10569i2463j3345E3288J46068b45360a20556a2180q0686o419B8776a21681F6317
10557a80036A02492b00889C32709j6107b69794c8426l88k07568a5714j11717A27598
$$ plain form
10634 -224384 -113248 -242331 -554518 248479 -19325 -112392 -198164 -376461 46461 177128
10624 177128 275717 -270922 -126679 -193550 284586 164487 -172386 -69199 62259 -241795
10613 -68502 -293161 81153 -244888 -66597 -147966 -116802 64492 2689 -34804 -346193 -393276
10602 -393276 -197846 -187475 4220 -132505 31904 -154851 148988 6942 -252804 150980 155762
10591 155762 -89150 47990 13489 -326194 162687 226233 -254432 161140 -297144 22018
10580 -43261 24387 133608 -274947 -282375 -5412 -406643 82312 221769 21623 -10418 -92463
10569 -92463 -105808 53288 199356 -245360 -120556 -12180 -92866 -99285 28776 -121681 66317
10557 -180036 102492 -200889 332709 316602 -269794 -38426 -38814 -246382 -15714 -127431 127598
10545a72189A43561a01056J6226F0574L5718f0050j1724k97639i4795j9664e5872
10533g3291l18999A46288a09095j5773A90773G0797a13134b2280k82147a18449
10522A52399a18882j05492A36592h0269B30967F2267b4262I0115B1068f9717k19743
10511b89460g7465A71132i6861A40751a47017d7017k73242A71750a58988I8977
10500b31273P1154k518o99J5877L7373C2617J35255j5526d5714I4929c00657a45963
10487e7789A5269b037H5225a83244B06838B4156a30259L0476A00938M4011b22565
10475i0746A31746A6023J23619B1623a49296A00313m260a8820A31484M8569C6198
10463I8218P5931O3502J46722j67695J80362J97377N6691k77102A40688a6149
$$ plain form
10545 -172189 143561 -101056 -84830 60574 96292 -60050 -71774 -369413 -94795 -114459 -55872
10533 -73291 -392290 146288 -109095 -124868 190773 70797 -113134 -22280 -304427 -118449
10522 152399 -118882 -224374 136592 -80269 230967 62267 -24262 90115 21068 -69717 -289460
10511 -289460 -77465 171132 -96861 140751 -147017 -47017 -320259 171750 -158988 98977
10500 -231273 -160119 -162637 -163336 -147459 -110086 32617 167872 152346 -45714 94929 -300657 -145963
10487 -57789 15269 -2037 85225 -183244 206838 24156 -130259 -99783 100938 144949 -222565
10475 -90746 131746 16023 139642 21623 -149296 100313 96053 -18820 131484 180053 36198
10463 98218 174149 237651 384373 216678 397040 594417 651108 374006 140688 -16149
10452A82222J5239e8558C54060d1281B92907b90680a1919k37699g8940B80866
10441c2067E2394J24928c3351n2282K7859C9587b15851A7984B477b24113C4789
10429a43455F7769a03041m4150j46633B77783b08887L6236A02559e802F0682J31090
10418A91772a0457A29951a53500j82077I1140M6971E2850c7605k03556d3125I9794
10406A50277b45700o5967P1172g3974c4349D77696b75763A43667b35961d0380
10395A7731R410A0642b70716J26551A18152e7137D8750o66J18337a50553M313
10384a46240E6493N2321e6774o2992M6988l21999E6626J67493f2167C8110K46617
10373B84727C1801b68597I4520a02512B13418h68B30118j01627b09672B7196J80388
$$ plain form
10452 182222 197461 -58558 354060 -41281 292907 -290680 -11919 -249618 -78940 280866
10441 -32067 52394 177322 -33351 -85633 -57774 39587 -215851 17984 2477 -224113 34789
10429 -143455 67769 -103041 -147191 -293824 277783 -208887 -172651 102559 -5802 60682 191772
10418 191772 -10457 129951 -153500 -335577 91140 138111 52850 -37605 -241161 -43125 99794
10406 150277 -245700 -311667 -240495 -73974 -34349 477696 -275763 143667 -235961 -40380
10395 17731 27141 10642 -270716 -144165 118152 -57137 48750 48084 166421 -150553 -146240
10384 -146240 56493 108814 -56774 -119766 -72778 -394777 56626 224119 -62167 38110 284727
10373 284727 31801 -268597 94520 -102512 213418 -868 230118 128491 -209672 27196 207584
10362B07584c51555D72300A31347l8186a9997C99257q2169j00992B2856K65902
10352B88758j08250l4932m1213J4025K27543A59415K21973j12418p0351F2459
10341c003A28579e8445C03026a87761B46890b0341B64691j23061K39527j862i2032
10329a91644B40961j20213b41950B01771K56845m1280H0032J48283a67757C61961
10318b42360H1508b3868h972A15139C4498a5950P659j73374B53007J17835A81753
10306C76830j14055e6202A25452J28179I6479Q7413Q2067p2174B6869b24813h644
10294i0340C3116J22694j3327a49398g2997m9610A18723D6596a22989l0860n7155
10283b11004c4118l8539A59259b71882J28146O8152C4167a00176j32130e1749
$$ plain form
10362 207584 -351555 472300 131347 93161 -19997 399257 317088 216096 22856 288758
10352 288758 180508 145576 104363 118388 345931 159415 381388 268970 198619 62459
10341 -3003 128579 -58445 303026 -187761 246890 -20341 264691 141630 381157 379295 -92032
10329 -191644 240961 120748 -241950 201771 458616 417336 80032 228315 -167757 361961
10318 -242360 81508 -23868 -8972 115139 34498 -15950 -8291 -181665 253007 370842 181753
10306 376830 262775 -56202 125452 253631 96479 183892 265959 193785 26869 -224813 -8644
10294 -90340 33116 155810 142483 -149398 -72997 -122607 118723 46596 -122989 -153849 -211004
10283 -211004 -34118 -72657 159259 -271882 -143736 -75584 34167 -100176 -232306 -51749
10272a07565k65009a05254j47205a04511b6124l9643A40248K44133a35681N8727
10262g6954r5367K5469f2827j41709h6893l8680J3753l58982g3044B1283a82626
10250D457a85774A1267a61955A09374a12354B51150K90935B61853A29969B4935
10239A98191J84258A22594P0991J51167K4158b2846D2457f49q8995b8974A67006
10227c56614B29861g6686K2238a8534A45151B937M0467M2139a46879k52588C9008
10215a83024A79182C7378b37322d5026B499a03320j01690k889g2996m6797A21564
10203C16948a24237A42071c20931A96404E7251a06372L2969j24808A13415h3193
10192b24650B24795n6324m7748b54681N8192d7654l33922G0787R8133b05973G3259
$$ plain form
10272 -107565 -372574 -105254 -252459 -104511 -26124 -65767 140248 384381 -135681 -76954
10262 -76954 -172321 -146852 -62827 -204536 -86893 -125573 -111820 -470802 -73044 21283 -182626
10250 4457 -185774 11267 -161955 109374 -112354 251150 542085 261853 129969 24935
10239 198191 382449 122594 193585 344752 368910 -22846 42457 -649 -89644 -28974 167006
10227 -356614 229861 -76686 -54448 -18534 145151 2937 43404 85543 -146879 -399467 39008
10215 -183024 179182 37378 -237322 -45026 2499 -103320 -205010 -207899 -72996 -119793 121564
10203 316948 -124237 142071 -320931 196404 57251 -106372 -73403 -198211 113415 -83193
10192 -224650 224795 168471 120723 -254681 -196489 -47654 -381576 70787 168920 -205973 73259
10180b51849B18529a73140C1142R0750b06476f3133F7473i5276I5654O2985d2993
10168b13384A02239h2998j35524Q8471D7133a69821c6340j11276D237a88116c4360
10156a04903j90406k77568A67843c06171d2770l22719h0142G3461a88499B70866
10145a60515j04193P4154A38436b11369K0871L8411B1814P005J36495b36706a3090
10133c63k12798j99426A14471a84700G1897N7501b30809M0547p6159B59475d4422
10121A7138f3871j25479E4299i951A09893m3025b3995C06094b81002C71643j62574
10110B09069a90226a24o7947r8048p3616O4230F2319a20038M0827j6163g0A06647
10097b24546A73717b87116M7774c2681k89025N3253g2876A06267K4634b31742
$$ plain form
10180 -251849 218529 -173140 31142 121892 -206476 -63133 67473 -95276 95654 158639 -42993
10168 -213384 102239 -82998 -218522 -130051 47133 -169821 -36340 -147616 4237 -188116 -34360
10156 -104903 -295309 -572877 167843 -306171 -42770 -365489 -80142 73461 -188499 270866
10145 -160515 -264708 -190554 138436 -211369 -190498 -152087 21814 28819 165314 -236706 -13090
10133 -363 -213161 -412587 114471 -184700 71897 129398 -230809 -190262 -266421 259475 -44422
10121 17138 -63871 -189350 54299 -9951 109893 66868 -23995 306094 -281002 371643 209069
10110 209069 -190226 -124 -68071 -166119 -239735 -175505 62319 -120038 -79211 -95374 -70 106647
10097 -224546 173717 -287116 -239342 -32681 -321706 -268453 -72876 106267 130901 -231742
10086c5864A26912d2164B1491N6661N3470c58110b8140H6154d8861A1033b92010
10074b80156b550q2273B61196A09731g0970l9302k08398C4167h8421j73016J11631
10063a49806l142F1392h894C92066b85271J13101B03612b43733R0754f9245m8755
10052a18000G671d218j96972L2780C1829b48168e8503E621e3263G147a21492j2247
10040a33739N2924J8335m4103A84575a81749b2152j19094N0282q4081k0340h9620
10028H4147Q8165b0281j2089j79106p4313J39933k5009B70869G92c1830F012d19751
10015b28140D7093B2643a93136N4661D7577O7118d5430l9198K989m4319A25933
10003b01624C8920l220b35254A37907b842j99956B64928m8939b05509K4869C8047
$$ plain form
10086 -35864 126912 -42164 21491 78152 131622 -358110 -28140 86154 -48861 11033 -292010
10074 -280156 -2550 -84823 261196 109731 -70970 -110272 -318670 34167 -88421 -261437 -149806
10063 -149806 -152948 61392 -8894 392066 -285271 -172170 203612 -243733 -152979 -69245 -118000
10052 -118000 7671 -4218 -201190 -168410 31829 -248168 -58503 5621 -53263 7147 -121492 -133739
10040 -133739 -80815 -62480 -106583 184575 -181749 -22152 -141246 -90964 -175045 -195385 -89620
10028 84147 172312 -20281 -32370 -211476 -285789 -145856 -170865 270869 792 -31830 6012 -419751
10015 -228140 47093 22643 -193136 -138475 47577 114695 -45430 -84628 -81639 -125958 125933
10003 -201624 38920 35700 -235254 137907 -2842 -202798 264928 215989 -205509 -180640 38047
9991a20008A17810A0404a05696b6802j56649h2703i457l8222p8229B67154c37834
9979d5919n1896j95944Q4171b9188A64932N3306d05348a10195j63942i4216M6269
9968d7947a7933F6502K83972a60096A27206d38707B00058b79868J28237j4190
9958a65821j26522j1741A86931J37792b14335j9421j5187C7887L53563A82122
9947a07291C61451a39966j54600e9249j09558a7641k12163L2976l51090a13265
9936a81412A60569n6307d5957n0776d0879m7311K0188B37321D0001e3414A57773
9924A43262F63K33736b22532r7958i6579P505j09551B47235a66924b2122E7155
9912i0177B95977b8032j31569K0765j3706I7814h0897j65416A24320g8394j51060
$$ plain form
9991 -120008 117810 10404 -105696 -26802 -183451 -82703 -9457 -47679 -125908 267154 -337834
9979 -45919 -97815 -293759 -209588 -29188 164932 218238 -405348 -110195 -274137 -94216 -47947
9968 -47947 -17933 66502 350474 -160096 127206 -438707 200058 -279868 -151631 -165821
9958 -165821 -292343 -304084 186931 324723 -214335 -233756 -248943 37887 391450 182122
9947 -107291 361451 -139966 -294566 -59249 -168807 -17641 -229804 -196828 -547918 -113265
9936 -181412 160569 104262 -45957 -96733 -40879 -88190 -68002 237321 40001 -53414 157773
9924 143262 663 234399 -222532 -320490 -96579 -89074 -198625 247235 -166924 -22122 57155
9912 -90177 295977 -28032 -159601 -138836 -152542 97814 -80897 -246313 124320 -78394 -229454
9901b29454j96707J62775A60095d6117j27283E2576J27001b59451K5836a6119
9890A15645K332D2669L7046N7404b14614A40629b28159h8848H7181K17179e8354
9878B03240C579J15243c5701o8253B04125D0409Q5274e3911B58832a10957D9718
9866a78960j20966C949J6169R7236b32399j03814a31619k55698A0685i6896p3935
9855a70831B46401A2458K8171O1902J15186c61042k9249a71314M6879A34303a42712
9843a04189J2491H383J6946N6270d42173J89757I9999a05336F6940P2607f3690
9831B14344c52081B7257a25857B05851a61636g6188j28629j256B87887E2530b37586
9819h3168A56509G3547J43773G6785a7886q1538k03567A83857b41370J08753K1836
$$ plain form
9901 -229454 -426161 -263386 160095 -46117 -173400 52576 179577 -259451 -233615 -16119
9890 115645 117977 42669 79715 137119 -214614 140629 -228159 -88848 87181 304360 -58354
9878 203240 3579 118822 -35701 -103954 204125 40409 125683 -53911 258832 -110957 49718
9866 -178960 -299926 3949 20118 117354 -232399 -336213 -131619 -387317 10685 -96896 -170831
9855 -170831 246401 12458 40629 102531 217717 -361042 -390291 -171314 -124435 134303 -142712
9843 -104189 -91698 8383 25329 81599 -442173 -252416 99999 -105336 66940 139547 -63690
9831 214344 -352081 27257 -125857 205851 -161636 -76188 -204817 -206073 287887 52530 -237586
9819 -83168 156509 73547 217320 76785 -17886 -99424 -302991 183857 -241370 -132617 -110781
9808a10781E9571a3830l4308j57829e2444l2634k346K0797F8098J06508c6254
9796F0692J48756C6687a25874j67068j95549K31508J16677j1517H9583q880a72900
9784a58160K0036F7607r312k4699J96803r0812i1308q4718k1394D5768a26523
9772e4766l11920k7306E6116f3091k84713J11432N2247K0010n6630A56219a29959
9760e9559j25942A31009E9906J93790c4234j64044h6177b1201m4761K7988o1165
9749i9139D9422e92879b6605k7539B55400D3725K987M1487K12095j43765F8186
9737a75633f4577j31436d5334k73854G7470C1141g9222E033O6712a66989e587
9725c9324k59136C1356a74894L1743b3612n7875j02028A50968I875c39844N9688
$$ plain form
9808 -110781 59571 -13830 -48138 -205967 -52444 -85078 -87424 -66627 68098 174606 -36254
9796 60692 209448 36687 -125874 -292942 -488491 -256983 -140306 -151823 89583 80703 -172900
9784 -158160 -138124 67607 58295 33596 230399 139587 -91308 -176026 -197420 45768 -126523
9772 -54766 -366686 -393992 56116 -63091 -347804 -236372 -184125 -164115 -220745 156219 -129959
9760 -59559 -185501 131009 59906 253696 -34234 -198278 -86177 -21201 -65962 -37974 -99139
9749 -99139 49422 -592879 -26605 -54144 255400 43725 46712 88199 300294 156529 68186
9737 -175633 -64577 -196013 -45334 -319188 77470 31141 -79222 5033 71745 -166989 -5587
9725 -39324 -298460 31356 -174894 -143151 -23612 -81487 -183515 150968 9875 -339844 -280156
9714b80156f920B09798D1025N958O8329p923P403a1100o9134A05078b02391R2203
9702a10188j88305A24123D8714J30502b39198R3662J2860q660a5006l31739j19582
9691d66327b17718c707j95967A36016H11a38970K4087j62533H4035J06183p5595
9680A14623a55253j43591r640d7967p6234H7855K49119E1057Q4641A9704R959
9669B9663g6699r2599Q215o2732I190d908j66528A53231c95059A97518B3691L23096
9657C46787a58615a8307j12496o0425j01612G2370a17766j6139A51589b30394
9646a1636I0531B5629b00089c2515H2157M5521a12164p8088h2505I3500a3852
9634b16535a3007n8162j2012D6937h5136I1848L5243l7310a44693A46399a32345
$$ plain form
9714 -280156 -6920 209798 41025 46983 115312 107389 114792 -11100 -80234 105078 -202391 -110188
9702 -110188 -298493 124123 48714 179216 -239198 -145536 -132676 -141336 -15006 -346745 -466327
9691 -466327 -217718 -3707 -199674 136016 811 -138970 -114883 -277416 84035 190218 114623
9680 114623 -155253 -298844 -308484 -47967 -124201 87855 336974 51057 135698 19704 29663
9669 29663 -76699 -169298 -161083 -223815 9190 -4908 -171436 153231 -395059 197518 23691 346787
9657 346787 -158615 -18307 -130803 -191228 -292840 72370 -117766 -133905 151589 -230394
9646 -11636 90531 25629 -200089 -32515 82157 127678 -112164 -190252 -82505 93500 -13852
9634 -216535 -13007 -71169 -83181 46937 -85136 91848 127091 89781 -144693 146399 -132345
9622g255k31910D572d0436j98367p614j7993c8379l82529B2973b49619M5238N6523
9610a47858O6633j79329J07132j0822n1880F8681b46124g367m7611A62840L7444
9599B00284r0224b22289r1920n9037c3724n7548k20877P9248a16346o6281b1853
9587B69139d5370I992a021j02281P684j7608F5785p679b24525A23895c02653A10802
9574B9128c80129J60857J4326L7775C10156A6131a71802K5253k91548A06182b60123
9562a12845A07799a74609m0630L0723e8941l4411D7773c67470i209A56237a85904
9550g2998c5968q3183G2047a40828A35010c4013l08192H1166C634a36158n4168
9539a90326O8313A96166a0909A69293G3892N3242A9809b03523n2120A16988n7548
$$ plain form
9622 -7255 -239165 4572 -40436 -238803 -246417 -264410 -38379 -420908 22973 -249619 -204381 -147858
9610 -147858 -81225 -260554 -153422 -164244 -216124 68681 -246124 -7367 -54978 162840 200284
9599 200284 110060 -222289 -314209 -373246 -33724 -91272 -312149 -232901 -116346 -182627 -21853
9587 269139 -45370 9992 -1021 -103302 -95618 -113226 65785 58106 -224525 123895 -302653 110802
9574 29128 -380129 -219272 -204946 -167171 310156 16131 -171802 -146549 -438097 106182 -260123
9562 -112845 107799 -174609 -215239 -184516 -58941 -93352 47773 -367470 -9209 156237 -185904
9550 -72998 -35968 -119151 72047 -140828 135010 -34013 -342205 81166 3634 -136158 -190326
9539 -190326 -122013 196166 -10909 169293 73892 127134 19809 -203523 -255643 116988 59440
9528E9440b86205p0152d4842A9026b48197F2306L1453b17412k9771O2790B71983
9516F6822a27619l1519g5554R281j18293j13245a05847j35814G3213c5063A07864
9504A62858h5756o3016O8209G7525f0565n9929M6975A9398b70809F968b53713
9492b2535A07210a79282h1982l02716a1430F2222a14559D9421L20235a64188G0281
9480b18505D9888h8018k78994J58969j3099f6994k35115a04484j0174A71585b05045
9468c29993A31650M7121i0883B9759d1868j17215o3671f1142A05791b09036B01779
9456A39902b94880a09579A18379B6810P4030C6467a92906B12552I204K15a08555
9444b12156M8470J8609c4885l3030G2087I67N4659L0327c17674A08747m6756b95851
$$ plain form
9528 59440 -286205 -356357 -44842 19026 -248197 62306 93759 -217412 -247183 -184393 271983
9516 66822 -127619 -159138 -75554 -66273 -184566 -297811 -105847 -241661 73213 -35063 107864
9504 162858 -85756 -148772 -80563 77525 -60565 -120494 -73519 19398 -270809 6968 -253713
9492 -22535 107210 -179282 -81982 -384698 -11430 62222 -114559 49421 369656 -164188 70281
9480 -218505 49888 -88018 -367012 -208043 -221142 -66994 -302109 -104484 -114658 171585 -205045
9468 -329993 131650 178771 -90883 29759 -41868 -159083 -222754 -61142 105791 -209036 201779
9456 139902 -294880 -109579 118379 26810 100840 36467 -192906 212552 9204 9419 -108555
9444 -212156 -163686 -145077 -34885 -67915 72087 967 55626 85953 -317674 108747 61991 -295851
9431i5018k3702K5521j77695Q5056e0609k29438C6187c5539B89365J41463j03353
9420C27475b70433J33633l770n0168A14358a75655C5493g0827A30472b00791M3411
9409a57380J8160J9922A13336a49778a9154p691j23010A27372J21366h6699o3785
9398a50484e9072j03650l33738B8372e8242r935A33660g7518j12308k1874q697
9387b20397A46581a10554O537j38624P3607o6095H1596a16345M9474B38208l0643
9376B07565E7808J09601q0564J41734a37253C255b04346M6383L2105m15403h0306
9364a48935f7763a3775A5567Q8001b18802e3206b2149k56376L095E6788a32815
9352a18015k55016B80908a55177O8024A60602o0771K0667i0905K852A87626c72444
$$ plain form
9431 -95018 -118720 -93199 -270894 -185838 -50609 -280047 36187 -35539 289365 430828 327475
9420 327475 -270433 -136800 -140570 -190738 114358 -175655 35493 -70827 130472 -200791 -157380
9409 -157380 -139220 -119298 113336 -149778 -19154 -26845 -149855 127372 248738 -86699 -150484
9398 -150484 -59072 -162722 -496460 28372 -58242 -68177 133660 -77518 -189826 -211700 -220397
9387 -220397 146581 -110554 -104017 -242641 -169034 -235129 81596 -116345 -66871 238208 207565
9376 207565 57808 167409 86845 228579 -137253 3255 -204346 -157963 -125858 -541261 -80306
9364 -148935 -67763 -13775 15567 103568 -218802 -53206 -22149 -278525 -275430 56788 -132815
9352 -118015 -373031 280908 -155177 -87153 160602 99831 120498 -90905 -88053 187626 -372444
9340A15957e3123B01523b86720i3605j1184j22783e8510q3200d0965F5405L811
9329F9216i558A32519a0213A02795c63825a4148A60763B8645m452b56411N7569
9318a98842P927I4385a26361G0963h8682A30235d98625B01033b46665E8059i1167
9306a58413k1929k21253d942B79637k2231b18953N6660a6646n3867j60514C02302
9294b05925N3878A56508d16660F1314a47114A01190k6014i2674C11394g7182j61494
9283b38676n9005A7710b95282N2461E0677J35156c0069k54780A52129f6609F6230
9271h4131A22754a00976M3164j19448C83101d08105a85624G3205R4932j4388C7919
9259I6716e75056K61471B888K84492D5316c02317H6932a65769d4541k24719A53412
$$ plain form
9340 115957 -53123 201523 -286720 -93605 -104789 -227572 -58510 -141710 -40965 65405 69216
9329 69216 -9558 132519 -10213 102795 -363825 -14148 160763 28645 24193 -256411 -198842
9318 -198842 -190915 94385 -126361 70963 -88682 130235 -498625 201033 -246665 58059 -91167
9306 -158413 -180342 -401595 -4942 279637 257406 -218953 -162293 -16646 -70513 -231027 302302
9294 -205925 -152047 156508 -416660 61314 -147114 101190 75176 -92674 311394 -77182 -238676
9283 -238676 -297681 17710 -295282 -242821 50677 185833 -30069 -284849 152129 -66609 66230
9271 -84131 122754 -100976 -57812 -177260 383101 -408105 -185624 73205 168137 153749 37919
9259 96716 -575056 -313585 2888 287380 45316 -302317 86932 -165769 -44541 -269260 153412
9247b79424J9831A1122J68409f6630J4946p3673N490K000j56459a29872A25970
9235a13788j46551J24337e1635b470k5548O265m36913a99865l4534j0493A6961
9223c20802A96365a41970j28190q9175J68204k07200B56508g6717k04328A64940
9212d7733h321k15345A56208N5827b36764F7425b12583A79047c60822k3349F5085
9200b03872B36122L5892a04228J1817D99841a29483e8031j78396H4061b5601l9597
9189f5198j804j40713F654a58123r9895P9087G2758d06556A65219a80772g8276
9177C72576a59294b8471a2093j78434b6674F3305L49869a2768j34025M9942F2572
9165e7043J3257p676q6602A34453a77194Q4453M0076J583n835l3988j0623L9372
$$ plain form
9247 -279424 -259593 11122 179531 -66630 -51684 -125357 -119867 -117867 -274326 -129872 125970
9235 -113788 -260339 -136002 -51635 -2470 -28018 -21753 -458666 -199865 -234399 -244892 16961
9223 -320802 196365 -141970 -270160 -359335 -191131 -398331 256508 -76717 -281045 164940
9212 -47733 -8321 -223666 156208 212035 -236764 67425 -212583 179047 -360822 -384171 65085
9200 -203872 236122 272014 -104228 -92411 499841 -129483 -58031 -236427 84061 -25601 -65198
9189 -65198 -67002 -207715 6654 -158123 -258018 -178931 72758 -406556 165219 -180772 -78276
9177 372576 -159294 -28471 -12093 -190527 -26674 63305 413174 -12768 -146793 -96851 62572
9165 -57043 -43786 -51462 -138064 134453 -177194 -92741 -52665 -51082 -56917 -90905 -101528 -62156
9153f2156B73189b8123k58697d6787A53128a6289B58032A6923a37607L2638l0495
9142a35464M3069C3675O2776k4159k2704J53630e1244I033b57994B29288c14268
9130a50965j33002A418g9102A02719a42400E2729M5054J83152i3145B9012a00807
9118B7297a29944Q498A17917h5165A2768c58243a15819k14199H1423Q1467b3527
9106b57330c3391m0206o6438o1067j25087c7351n6457q049K781D6234K40619b7327
9093f5167G6275a83218m1183A25180J57042d2963O575q6189O0869N767n1824G455
9080C70402E4446K05951b4008n3647p6345E2108a72279C20819b45888B9113G531
9068d3292O187j06705k03264c0308A95135G4551d5073k97637g8017j10117K164
$$ plain form
9153 -62156 273189 -28123 -286820 -46787 153128 -16289 258032 16923 -137607 -104969 -135464
9142 -135464 -92395 33675 96451 72292 49588 203218 -51244 9033 -257994 229288 -314268
9130 -150965 -283967 1418 -79102 102719 -142400 52729 97783 280935 -93145 29012 -100807
9118 27297 -129944 -121446 117917 -85165 12768 -358243 -115819 -330018 81423 162890 -23527
9106 -257330 -33391 -73597 -140035 -201102 -326189 -37351 -93808 -101857 -99076 46234 286853 -27327
9093 -65167 76275 -183218 -224401 125180 282222 -42963 -36388 -122577 -61708 -55941 -107765 7455
9080 370402 54446 260397 -24008 -77655 -154000 52108 -172279 320819 -245888 29113 7531
9068 -43292 -37105 -143810 -347074 -30308 195135 74551 -45073 -342710 -78017 -188134 -185970
9057a85970e5194B8433g6488n4026j23958a15362k3563q3296A09075j5450Q8330
9046A81955J8087M631N1254Q2353a97926J650A59553K02275b1068p2079R872F7994
9033A6700a97526a812B84138c8372j20754I3391a05829F2291a86778R1158H8827
9021A59897c12224b5072j1345p5493q190j49001L7407C35442b14289m6881o8116
9010c29286b5350C53654b21567K1891A7293O7693b46646B05131g692j1027q5617
8999a04336b393j12931B63134i9054j64555O0205o3337k1445E9716c21789a34243
8987a22026j25706C6959a51338m9041B55997b35769f9665j2711m3403A58868F739
8975f6800j21591j95381j64104E9644h3872j93659B58806a47139A0513a62185
$$ plain form
9057 -185970 -55194 28433 -76488 -130514 -254472 -115362 -138925 -222221 109075 93625 181955
9046 181955 200042 204673 255927 338280 -197926 -196276 159553 361828 -21068 -93147 -83275 67994
9033 16700 -197526 -1812 284138 -38372 -159126 93391 -105829 62291 -186778 -95620 88827
9021 159897 -312224 -25072 -36417 -111910 -120100 -269101 -231694 335442 -214289 -261170 -329286
9010 -329286 -25350 353654 -221567 -199676 17293 84986 -246646 205131 -7692 -18719 -104336
8999 -104336 -2393 -115324 263134 -99054 -263609 -203404 -266741 -288186 59716 -321789 -134243
8987 -122026 -247732 36959 -151338 -200379 255997 -235769 -69665 -82376 -125779 158868 6739
8975 -66800 -188391 -383772 -547876 59644 -83872 -277531 258806 -147139 10513 -162185
8964e2877L492D9322b39756P7506c1546j05006M5386D762O4153k3851j5252D669
8951a17362e0307k68831q3468a33527A9684d9392A5179G248a2171B54753i5751
8939B92252b56613B02580o4815f3028k1338A01454b665H448a11975j36169j43162
8928c91306h7763K0975A52334m7556N9899b75539D22814i9267B39848C8061a85550
8916A48678J41465j06520a40342j16799A75861a29102B27354M0217K25747P965
8906E01283P04790J134089J746778L847971l712799j314398j367178n66434D19567
8896C54811p8561M5958G6638M02855b61284B82971q0780I4960I484J15587a1294
8884A8925a28251A62334a08852k3573d7643O733A04607I312c4867p6080A06709
$$ plain form
8964 -52877 -49385 49322 -239756 -162250 -31546 -136552 -91166 4762 68915 45064 29812 4669
8951 -117362 -50307 -319138 -402606 -133527 19684 -49392 15179 7248 -12171 254753 -95751
8939 292252 -256613 202580 137765 -63028 -84366 101454 -2665 8448 -111975 -248144 -391306
8928 -391306 -87763 -66788 152334 104778 164677 -275539 422814 -99267 239848 38061 -185550
8916 148678 290143 183623 -140342 -257141 175861 -129102 227354 267571 493318 501283
8906 501283 1206073 2340162 4086940 7934911 4222112 2907714 1540536 974102 419567
8896 354811 276250 322208 76638 479493 -261284 282971 202191 94960 9484 125071 -11294
8884 18925 -128251 162334 -108852 -132425 -47643 -40910 104607 9312 -34867 -110947 106709
8872b24246J3264E6821a75291J3365A78857a4392k91695B763c87873f6110A39959
8860A33890c79394a72655k64294a41481j2303F0471a5210l6809k42153H4409b5167
8848b8950D9778G032J38068a33974B61459c0207k8988F0864P2399c11060a11002
8836c2415B64102B6415J3921g0125I6165B5441J81683a98312A37007c53845D3079
$$ plain form
8872 -224246 -210982 56821 -175291 -161926 178857 -14392 -306087 2763 -387873 -66110 139959
8860 133890 -379394 -172655 -436949 -141481 -153784 60471 -15210 -52019 -294172 84409 -25167
8848 -28950 49778 7032 145100 -133974 261459 -30207 -59195 60864 133263 -311060 -111002
8836 -32415 264102 26415 40336 -70125 96165 25441 207124 -198312 137007 -353845 43079
$$ [...]
##END NTUPLES=NMR SPECTRUM
##END=
