
##TITLE=AC1165_Meta-centauros1_5890947_9W8fkWj1DD
##JCAMPDX= 6.0         $$ Bruker NMR JCAMP-DX V2.0
##DATA TYPE= NMR SPECTRUM
##DATA CLASS= NTUPLES
##ORIGIN= BRUKER
##OWNER= Administrator
$$ 1.72 TOPSPIN		Version 2.1
$$ 2012-04-02 19:05:16.375 -0500  Administrator@TOPSPIN
$$ Compression mode = diff/dup
##.OBSERVE FREQUENCY= 400.13188235
##.OBSERVE NUCLEUS= ^1H
##.ACQUISITION MODE= SIMULTANEOUS (DQD)
##.ACQUISITION SCHEME= undefined
##.AVERAGES= 64
##.DIGITISER RES= 22
##SPECTROMETER/DATA SYSTEM= spect
##.PULSE SEQUENCE= noesygpps1d.comp
##.SOLVENT NAME= COFFEE_meoh
##.SHIFT REFERENCE= INTERNAL, COFFEE_meoh, 1, 14.96833
##AUDIT TRAIL= $$ (NUMBER, WHEN, WHO, WHERE, PROCESS, VERSION, WHAT)
$$ ##TITLE= Audit trail, TOPSPIN		Version 2.1
$$ ##JCAMPDX= 5.01
$$ ##ORIGIN= Bruker BioSpin GmbH
$$ ##OWNER= Administrator
$$ $$ C:\Bruker\TOPSPIN/data/COFFEE/nmr/AC1165_Meta-centauros1_5890947_9W8fkWj1DD/12/pdata/1/auditp.txt
$$ ##AUDIT TRAIL=  $$ (NUMBER, WHEN, WHO, WHERE, PROCESS, VERSION, WHAT)
(   1,<2012-04-02 19:05:10.875 -0500>,<Administrator>,<TOPSPIN>,<go>,<TOPSPIN 2.1>,
      <created by zg
	started at 2012-04-02 18:53:38.843 -0500,
	POWCHK enabled, PULCHK disabled,
       configuration hash MD5:
       1A 1E CE 29 27 FD 77 03 67 4E F0 E3 C4 B2 CB 90
       data hash MD5: 64K
       26 D5 FC 02 19 3B FD 2E 5A EA 5A CA DD 66 1C EC>)
(   2,<2012-04-02 19:05:13.890 -0500>,<Administrator>,<TOPSPIN>,<proc1d>,<TOPSPIN 2.1>,
      <Start of raw data processing
       efp LB = 0.3 FT_mod = 6 PKNL = 1 PHC0 = 0 PHC1 = 0 SI = 128K 
       data hash MD5: 128K
       F7 2E CF FA 3C 46 12 93 01 CC BE 76 44 74 FD 8D>)
(   3,<2012-04-02 19:05:15.359 -0500>,<Administrator>,<TOPSPIN>,<proc1d>,<TOPSPIN 2.1>,
      <pk PHC0 = 34.12354 PHC1 = 0 
       data hash MD5: 128K
       68 CF 68 B2 97 07 3A 7D 63 69 DA 53 87 B1 E7 1A>)
(   4,<2012-04-02 19:05:15.968 -0500>,<Administrator>,<TOPSPIN>,<proc1d>,<TOPSPIN 2.1>,
      <abs ABSG = 1 
       data hash MD5: 128K
       6E 39 18 74 52 46 60 D8 B2 1C 7C 4E C9 35 E6 C3>)
(   5,<2012-04-02 19:05:16.062 -0500>,<Administrator>,<TOPSPIN>,<proc1d>,<TOPSPIN 2.1>,
      <abs ABSG = 2 
       data hash MD5: 128K
       07 B5 BF 0D 37 D3 3E 54 F1 E6 5D 7E 96 AE C3 64>)
(   6,<2012-04-02 19:05:16.125 -0500>,<Administrator>,<TOPSPIN>,<proc1d>,<TOPSPIN 2.1>,
      <abs ABSG = 3 
       data hash MD5: 128K
       83 10 30 88 1F A6 AE 84 A4 E2 01 44 CA B8 13 1C>)
(   7,<2012-04-02 19:05:16.203 -0500>,<Administrator>,<TOPSPIN>,<proc1d>,<TOPSPIN 2.1>,
      <abs ABSG = 4 
       data hash MD5: 128K
       6C 9E 97 F8 97 F4 94 F9 FE 70 99 71 FF 92 0F 31>)
(   8,<2012-04-02 19:05:16.281 -0500>,<Administrator>,<TOPSPIN>,<proc1d>,<TOPSPIN 2.1>,
      <abs ABSG = 5 
       data hash MD5: 128K
       DE C8 5D 6C 02 F1 D7 D3 91 92 D6 FB E3 CD BB 48>)
$$ ##END=
$$ 
$$ $$ hash MD5
$$ $$ 64 B4 8B 3D FB A5 3C 88 6F 24 6C 85 5C 26 F6 03
##$RELAX= 
##$RELAX= 
##$RELAX= 
##$RELAX= 
##$RELAX= 
##$RELAX= 
##$RELAX= 
##$RELAX= 
$$ [...]
##$TP07= 0
##$TPNAME0= <>
##$TPNAME1= <>
##$TPNAME2= <>
##$TPNAME3= <>
##$TPNAME4= <>
##$TPNAME5= <>
##$TPNAME6= <>
##$TPNAME7= <>
##$TPOAL= (0..7)
0.5 0.5 0.5 0.5 0.5 0.5 0.5 0.5
##$TPOFFS= (0..7)
0 0 0 0 0 0 0 0
##$TUNHIN= 0
##$TUNHOUT= 0
##$TUNXOUT= 0
##$USERA1= <user>
##$USERA2= <user>
##$USERA3= <user>
##$USERA4= <user>
##$USERA5= <user>
##$V9= 5
##$VALIST= <valist>
##$VCLIST= <CCCCCCCCCCCCCCC>
##$VD= 0
##$VDLIST= <DDDDDDDDDDDDDDD>
##$VPLIST= <PPPPPPPPPPPPPPP>
##$VTLIST= <TTTTTTTTTTTTTTT>
##$WBST= 2048
##$WBSW= 25
##$XGAIN= (0..3)
0 0 0 0
##$XL= 0
##$YL= 0
##$YMAX_a= 13105631
##$YMIN_a= -6090229
##$ZGOPTNS= <>
##$ZL1= 120
##$ZL2= 120
##$ZL3= 120
##$ZL4= 120
##$ABSF1= 14.96833
##$ABSF2= -5.5842
##$ABSG= 5
##$ABSL= 3
##$ALPHA= 0
##$AQORDER= 0
##$ASSFAC= 0
##$ASSFACI= 0
##$ASSFACX= 0
##$ASSWID= 0
##$AUNMP= <proc_prof1d_extract.lims>
##$AXLEFT= 0
##$AXNAME= <>
##$AXNUC= <1H>
##$AXRIGHT= 0
##$AXTYPE= 0
##$AXUNIT= <>
##$AZFE= 0.1
##$AZFW= 0.1
##$BCFW= 0
##$BC_mod= 0
##$BYTORDP= 0
##$COROFFS= 0
##$CY= 15
##$DATMOD= 1
##$DC= 0
##$DFILT= <>
##$DTYPP= 0
##$F1P= 0
##$F2P= 0
##$FCOR= 0.5
##$FTSIZE= 131072
##$FT_mod= 6
##$GAMMA= 0
##$GB= 0
##$INTBC= 1
##$INTSCL= 1
##$ISEN= 128
##$LB= 0.3
##$LEV0= 0
##$LPBIN= 0
##$MAXI= 10000
##$MC2= 0
##$MEAN= 0
##$ME_mod= 0
##$MI= 0
##$NCOEF= 0
##$NC_proc= -3
##$NLEV= 6
##$NOISF1= 0
##$NOISF2= 0
##$NSP= 0
##$NTH_PI= 0
##$NZP= 0
##$OFFSET= 14.96833
##$PC= 1
##$PHC0= 34.12354
##$PHC1= 0
##$PH_mod= 1
##$PKNL= yes
##$PPARMOD= 0
##$PPDIAG= 0
##$PPIPTYP= 0
##$PPMPNUM= 2147483647
##$PPRESOL= 1
##$PSCAL= 4
##$PSIGN= 0
##$PYNMP= <proc.py>
##$REVERSE= no
##$SF= 400.130004913582
##$SI= 131072
##$SIGF1= 0
##$SIGF2= 0
##$SINO= 400
##$SIOLD= 131072
##$SPECTYP= <>
##$SREGLST= <1H.CDCl3>
##$SSB= 0
##$STSI= 131072
##$STSR= 0
##$SW_p= 8223.68421052632
##$SYMM= 0
##$S_DEV= 0
##$TDeff= 65536
##$TDoff= 0
##$TI= <>
##$TILT= no
##$TM1= 0
##$TM2= 0
##$TOPLEV= 0
##$USERP1= <user>
##$USERP2= <user>
##$USERP3= <user>
##$USERP4= <user>
##$USERP5= <user>
##$WDW= 1
##$XDIM= 131072
##$YMAX_p= 474736050
##$YMIN_p= -426617415
##$CURPLOT= <Network HP LaserJet P1505>
##$CURPRIN= <$Network HP LaserJet P1505>
##$DFORMAT= <normdp>
##$LAYOUT= <+/1D_H.xwp>
##$LFORMAT= <normlp>
##$PFORMAT= <normpl>
##$SURQMSG= 1
$$ End of Bruker specific parameters
$$ ---------------------------------
##NTUPLES= NMR SPECTRUM
##VAR_NAME=  FREQUENCY,     SPECTRUM/REAL,   SPECTRUM/IMAG
##SYMBOL=    X,             R,               I
##VAR_TYPE=  INDEPENDENT,   DEPENDENT,       DEPENDENT
##VAR_FORM=  AFFN,          ASDF,            ASDF
##VAR_DIM=   131072,        131072,          131072
##UNITS=     HZ,            ARBITRARY UNITS, ARBITRARY UNITS
##FACTOR=    0.0627417313425165, 1,          1
##FIRST=     8223.62146879498, 2388,         -98101
##LAST=      0,             5988,            -99019
##MIN=       0,             -426617415,      0
##MAX=       8223.62146879498, 474736050,    0
$$ Real data points
##PAGE= N=1
##DATA TABLE= (X++(R..R)), XYDATA
$$ [...]
61754B885652M0878M5992M9931N3660N8368O4216P0669P7266Q3851R0423R7101
$$ 2885652 2926530 2972522 3022453 3076113 3134481 3198697 3269366 3346632 3430483 3520906 3618007
61743C618007J04011J11237J18952J27438J36661J46182J55820J66224J78173
$$ 3618007 3722018 3833255 3952207 4079645 4216306 4362488 4518308 4684532 4862705
61734D862705J91453K05029K18457K32625K48916K67901K88916L10833L33395
$$ 4862705 5054158 5259187 5477644 5710269 5959185 6227086 6516002 6826835 7160230
61725G160230L58067L87273M22233M61874N04531N50532O02163O61009P26408
$$ 7160230 7518297 7905570 8327803 8789677 9294208 9844740 10446903 11107912 11834320
61716A1834320P97023Q72904R54999J043120J135289J228740J320586J407245
$$ 11834320 12631343 13504247 14459246 15502366 16637655 17866395 19186981 20594226
61708B0594226J483805J543847J579096J579008J531604J426083J255883J021000
$$ 20594226 22078031 23621878 25200974 26779982 28311586 29737669 30993552 32014552
61700C2014552P29417L97389M7477k95861o11119q82748j101953j266323j378627
$$ 32014552 32743969 33141358 33188835 32892974 32281855 31399107 30297154 29030831 27652204
61691B7652204j444738j471557j466335j436889j391026j334713j271048j201492
$$ 27652204 26207466 24735909 23269574 21832685 20441659 19106946 17835898 16634406
61683A6634406j127916j052977r78818r06319q35946p68688p05626o46987n92334
$$ 16634406 15506490 14453513 13474695 12568376 11732430 10963742 10258116 9611129 9018795
61674I018795n41582m95152m52913m13736l76683l42346l12200k86528k63724
$$ 9018795 8477213 7982061 7529148 7115412 6738729 6396383 6084183 5797655 5533931
61665E533931k42094k21702k03679j88021j73303j58781j45719j35648j27954
$$ 5533931 5291837 5070135 4866456 4678435 4505132 4346351 4200632 4064984 3937030
61656C937030j20334j11529j02575r5187q9796q5565q1461p6660p0665o4014n8523
$$ 3937030 3816696 3705167 3602592 3507405 3417609 3332044 3250583 3173923 3103258 3039244 2980721
61645B980721n5811n5350n4732n2177m8332m5272m4024m3549m2207l9810l7840
$$ 2980721 2924910 2869560 2814828 2762651 2714319 2669047 2625023 2581474 2539267 2499457 2461617
61634B461617l7496l8059l7795l6250l4733l4212l3808l2207k9710k7658k6260
$$ 2461617 2424121 2386062 2348267 2312017 2277284 2243072 2209264 2177057 2147347 2119689 2093429
61623B093429k4501k2265k0914k1218k1908k1325j9566j7957j7052j6252j5107
$$ 2093429 2068928 2046663 2025749 2004531 1982623 1961298 1941732 1923775 1906723 1890471 1875364
61612A875364j3848j2754j1916j1697j2430j3581j4004j3376j2626j2620j3016
$$ 1875364 1861516 1848762 1836846 1825149 1812719 1799138 1785134 1771758 1759132 1746512 1733496
61601A733496j2893j1998j0911j0222j0031j0021r658q443o379m220l009l246
$$ 1733496 1720603 1708605 1697694 1687472 1677441 1667420 1657762 1649319 1642940 1638720 1635711 1632465
61589A632465m421n375n247m233l263k782k148o65J166K179K204K255K858L208
$$ 1632465 1628044 1622669 1617422 1613189 1609926 1607144 1604996 1604331 1605497 1607676 1609880 1612135 1614993 1618201
61575A618201K526J422J113J744K355K208J417M62k25k63M21J345J919K062J943
$$ 1618201 1620727 1622149 1623262 1625006 1627361 1629569 1630986 1631448 1631223 1630960 1631381 1632726 1634645 1636707 1638650
61560A638650J413K21j442l182m983o804p945p752o837o628p581q749r262r362
$$ 1638650 1640063 1640284 1638842 1635660 1630677 1623873 1615928 1608176 1601339 1594711 1587130 1578381 1569119 1559757
61546A559757r643j0183j0732j0965j0307q392o025m727m854n131m584l824l661
$$ 1559757 1550114 1539931 1529199 1518234 1507927 1499535 1493510 1488783 1483929 1478798 1474214 1470390 1466729
61533A466729l573k590p97J180L472O442R412J1207J1667J1591J1543J1792J2948
$$ 1466729 1463156 1460566 1459769 1460949 1464421 1470863 1480275 1491482 1503149 1514740 1526283 1538075 1551023
61520A551023J5341J8123K0250K2086K4603K7472K9545L0943L2765L4808L5717
$$ 1551023 1566364 1584487 1604737 1626823 1651426 1678898 1708443 1739386 1772151 1806959 1842676
61509A842676L5765L7145M0705M4471M6577M7673M9039N0130M9794M8408M6854
$$ 1842676 1878441 1915586 1956291 2000762 2047339 2095012 2144051 2194181 2243975 2292383 2339237
61498B339237M4623M1077L7550L5938L5788L4989L2892L0466K7691K3443J8297
$$ 2339237 2383860 2424937 2462487 2498425 2534213 2569202 2602094 2632560 2660251 2683694 2701991
61487B701991J4753J3637J2490Q847L427j375m710p335r464j0457j0304r955j0016
$$ 2701991 2716744 2730381 2742871 2751718 2755145 2753770 2749060 2741725 2732261 2721804 2711500 2701545 2691529
61474B691529j0104r584q276o384m176j740J259N416J0833J6706K1900K5861K9075
$$ 2691529 2681425 2671841 2663565 2657181 2653005 2651265 2652524 2657940 2668773 2685479 2707379 2733240 2762315
61461B762315L2824L8377M5883N4120O2044P0289Q0172R1505J02984J14777J28804
$$ 2762315 2795139 2833516 2879399 2933519 2995563 3065852 3146024 3237529 3340513 3455290 3584094
61450C584094J45489J62211J76630J90161K06156K25551K46174K65875K84100
$$ 3584094 3729583 3891794 4068424 4258585 4464741 4690292 4936466 5202341 5486441
61441E486441L00614L14653L25745L33345L35270L28073L09776K80983K42997
$$ 5486441 5787055 6101708 6427453 6760798 7096068 7424141 7733917 8014900 8257897
61432H257897J96665J43917Q8706L4901j5814o2809j04561j39385j67259j89186
$$ 8257897 8454562 8598479 8687185 8722086 8706272 8643463 8538902 8399517 8232258 8043072
61422H043072k05120k14214k16964k15371k10663k02286j89861j74942j59912
$$ 8043072 7837952 7623738 7406774 7191403 6980740 6778454 6588593 6413651 6253739
61413F253739j45696j31365j15667r8379q0337o2677m6065l0465j5587j526J1358
$$ 6253739 6108043 5976678 5861011 5762632 5682295 5619618 5573553 5543088 5527501 5525975 5537333
61402E537333K3138L4442M5650N6272O5430P2690P8108Q1639Q3041Q2508Q1016
$$ 5537333 5560471 5594913 5640563 5696835 5762265 5834955 5913063 5994702 6077743 6160251 6241267
61391F241267P9705P8909P8078P6695P5017P3677P2770P1843P0677O9573O8627
$$ 6241267 6320972 6399881 6477959 6554654 6629671 6703348 6776118 6847961 6918638 6988211 7056838
61380G056838O7297O5064O2141N9022N5618N1324M5710L8712L0414K1291J2411
$$ 7056838 7124135 7189199 7251340 7310362 7365980 7417304 7463014 7501726 7532140 7553431 7565842
61369G565842M781j622p580j3534j9317k4820l0040l4436l7186l8378l9060l9674
$$ 7565842 7570623 7569001 7561421 7547887 7528570 7503750 7473710 7439274 7402088 7363710 7324650 7284976
61357G284976l9280l6969l3275k9538k6440k3848k1477j8893j5513j1584q793
$$ 7284976 7245696 7208727 7175452 7145914 7119474 7095626 7074149 7055256 7039743 7028159 7019366
61346G019366q714j0865j3345j5276j7369k0055k2339k2928k1462j8067j2737
$$ 7019366 7010652 6999787 6986442 6971166 6953797 6933742 6911403 6888475 6867013 6848946 6836209
61335F836209n802J965J0582K1447L5693N2503P0148Q8362J08479J31236J55587
$$ 6836209 6830407 6832372 6842954 6864401 6900094 6952597 7022745 7111107 7219586 7350822 7506409
61324G506409J80063K04364K29053K54218K79054L02423L23214L40115L51477
$$ 7506409 7686472 7890836 8119889 8374107 8653161 8955584 9278798 9618913 9970390
61315I970390L55640L51432L38203L15412K82450K39363J87908J31417P3336J6011
$$ 9970390 10326030 10677462 11015665 11331077 11613527 11852890 12040798 12172215 12245551 12261562
61305A2261562l8999r0288j37049j79713k19086k54700k84837l08343l25597l37503
$$ 12261562 12222563 12132275 11995226 11815513 11596427 11341727 11056890 10748547 10422950 10085447
61295A0085447l44377l46328l44008l38281l29643l18504l05536k91071k74685
$$ 10085447 9741070 9394742 9050734 8712453 8382810 8064306 7758770 7467699 7193014
61286G193014k56223k36851k18158k00290j82032j62741j43246j24552j06669
$$ 7193014 6936791 6699940 6481782 6281492 6099460 5936719 5793473 5668921 5562252
61277E562252q9269p2683n7355m2806k7963j2488K770J6510K7835L6589M3465
$$ 5562252 5472983 5400300 5342945 5300139 5272176 5259688 5262458 5278968 5306803 5343392 5386857
61266E386857M9648N5859O1699O6257O9151P0453O9913O7182O2881N8616N5311
$$ 5386857 5436505 5492364 5554063 5620320 5689471 5759924 5829837 5897019 5959900 6018516 6073827
61255F073827N2255M8340M3714L9477L5974L2230K7130K0598J3308N732k208j0655
$$ 6073827 6126082 6174422 6218136 6257613 6293587 6325817 6352947 6373545 6386853 6392585 6390377 6379722
61243F379722j9300k7445l4619m1060m7415n3866n9831o4696o8582p2066p5353
$$ 6379722 6360422 6332977 6298358 6257298 6209883 6156017 6096186 6031490 5962908 5890842 5815489
61232E815489p8017p9449p9281p7593p5077p2675p0569o7825o3555n8194n2891
$$ 5815489 5737472 5658023 5578742 5501149 5426072 5353397 5282828 5215003 5151448 5093254 5040363
61221E040363m7925m2751l7576l3586l1350l0118k9302k9397l0648l1905l1975
$$ 5040363 4992438 4949687 4912111 4878525 4847175 4817057 4787755 4758358 4727710 4695805 4663830
61210D663830l1286l0730k9595k6353k1389j7161j5159j3994j1120n371K724J2136
$$ 4663830 4632544 4601814 4572219 4545866 4524477 4507316 4492157 4478163 4467043 4461672 4464396 4476532
61198D476532K2015L1826M1659N2164O3773P6291Q9358J02688J15611J27099J36667
$$ 4476532 4498547 4530373 4572032 4624196 4687969 4764260 4853618 4956306 5071917 5199016 5335683
61187E335683J44501J50279J52641J50385J43313J31172J12610Q6462N3769J7518
$$ 5335683 5480184 5630463 5783104 5933489 6076802 6207974 6320584 6407046 6460815 6478333
61177F478333j9423n5381q9291j20148j47006j68827j84352j93001j95745j94306
$$ 6478333 6458910 6403529 6314238 6194090 6047084 5878257 5693905 5500904 5305159 5110853
61167E110853j89599j81953j72672j64036j57147j50739j42773j32685j21643
$$ 5110853 4921254 4739301 4566629 4402593 4245446 4094707 3951934 3819249 3697606
61158C697606j11075j01479r2385q3136p3876o5678n9280n3809m7487l9785l2100
$$ 3697606 3586531 3485052 3392667 3309531 3235655 3169977 3110697 3056888 3009401 2969616 2937516
61147B937516k6015k1460j7054j1682n364Q99N798Q617R924J1039J2634J4208
$$ 2937516 2911501 2890041 2872987 2861305 2855941 2856840 2862638 2871255 2881179 2892218 2904852 2919060
61135B919060J4908J4214J1853Q000L816P32j390m304q928j3818j7061j8703k0169
$$ 2919060 2933968 2948182 2960035 2968035 2971851 2972583 2971193 2966889 2957961 2944143 2927082 2908379 2888210
61122B888210k2120k4306k6872l0083l2948l3873l2985l2365l3431l5283l6286
$$ 2888210 2866090 2841784 2814912 2784829 2751881 2718008 2685023 2652658 2619227 2583944 2547658
61111B547658l6233l6172l6805l7914l8946l9630m0127m0836m1841m2612m2699
$$ 2547658 2511425 2475253 2438448 2400534 2361588 2321958 2281831 2240995 2199154 2156542 2113843
61100B113843m2507m2605m2407m0658l7451l4521l3055l2371l1510l0947l1543
$$ 2113843 2071336 2028731 1986324 1945666 1908215 1873694 1840639 1808268 1776758 1745811 1714268
61089A714268l2670l2839l1867l1031l1100l1370l0762k8931k6181k3080k0442
$$ 1714268 1681598 1648759 1616892 1585861 1554761 1523391 1492629 1463698 1437517 1414437 1393995
61078A393995j8772j7516j5547j2724j0219q801p579n200j848R27K278L130M819
$$ 1393995 1375223 1357707 1342160 1329436 1319217 1310416 1302837 1297637 1295789 1296716 1298994 1302124 1306943
61065A306943P265R110R583R491J0162J1771J3329J4125J4537J5228J6188J6990
$$ 1306943 1314208 1323318 1332901 1342392 1352554 1364325 1377654 1391779 1406316 1421544 1437732 1454722
61053A454722J7455J7485J6638J4715J2647J1874J2565J3130J1895Q823N151J922
$$ 1454722 1472177 1489662 1506300 1521015 1533662 1545536 1558101 1571231 1583126 1591949 1597100 1599022
61041A599022n44k102k637k588k918m110n537o301o414o647p280p605o948n811
$$ 1599022 1598478 1596376 1593739 1591151 1588233 1584123 1578586 1572285 1565871 1559224 1551944 1544339 1537391 1531580
61027A531580n473o553q325r497r411q407p425p363q586j0662j2554j3300j2772
$$ 1531580 1526107 1519554 1511229 1501732 1492321 1483914 1476489 1469126 1460540 1449878 1437324 1424024 1411252
61014A411252j1816j1493j1919j1980j0508p906o022o094p289p852p226o141m958
$$ 1411252 1399436 1387943 1376024 1364044 1353536 1345630 1339608 1333514 1326225 1318373 1311147 1305006 1300048
61001A300048l179q55P60P47l9%J253K696L472L821M446N528O618P324P995R508
$$ 1300048 1296869 1296014 1296774 1297521 1297482 1297482 1298735 1301431 1304903 1308724 1313170 1318698 1325316 1332640 1340635 1350143
60985A350143J2173J4968J6482J6574J6356J6524J6753J6983J8081K0402K2858
$$ 1350143 1362316 1377284 1393766 1410340 1426696 1443220 1459973 1476956 1495037 1515439 1538297
60974A538297K4371K5402K6887K8619K9994L1638L4615L8493M1801M4203M6676
$$ 1538297 1562668 1588070 1614957 1643576 1673570 1705208 1739823 1778316 1820117 1864320 1910996
60963A910996M9660N2696N5787N9348O2716O4631O5690O8460P4314Q1810Q8908
$$ 1910996 1960656 2013352 2069139 2128487 2191203 2255834 2321524 2389984 2464298 2546108 2635016
60952B635016R5222J01105J06399J11567J18499J28411J39780J50087J58910J67730
$$ 2635016 2730238 2831343 2937742 3049309 3167808 3296219 3435999 3586086 3744996 3912726
60942C912726J77367J87480J98417K11881K29259K50334K73909K99107L25985
$$ 3912726 4090093 4277573 4475990 4687871 4917130 5167464 5441373 5740480 6066465
60933F066465L55449L88561M26082M69265N21189N86074O66765P63935Q77742
$$ 6066465 6421914 6810475 7236557 7705822 8227011 8813085 9479850 10243785 11121527
60924A1121527J008096J152668J308309J477508J671212J902038K176547K495311
$$ 11121527 12129623 13282291 14590600 16068108 17739320 19641358 21817905 24313216
60916B4313216K849425L197884L443308L451624L129583K504364J729143J003818
$$ 24313216 27162641 30360525 33803833 37255457 40385040 42889404 44618547 45622365
60908D5622365M79174K15050J93621L39512N23462N79033L62941j66334r16686
$$ 45622365 46101539 46316589 46510210 46849722 47373184 47952217 48315158 48148824 47232138
60899D7232138j710843k378713k825369l040208l065727k962011k784642k574403
$$ 47232138 45521295 43142582 40317213 37277005 34211278 31249267 28464625 25890222
60891B5890222k355127k138586j931994j741385j569827j415861j275661j146462
$$ 25890222 23535095 21396509 19464515 17723130 16153303 14737442 13461781 12315319
60883A2315319j027610r19287q21256p32775o53061n81591n18118m62477m14458
$$ 12315319 11287709 10368422 9547166 8814391 8161330 7579739 7061621 6599144 6184686
60874F184686l73575l38693l08012k80027k54650k32892k15227k00790j88340
$$ 6184686 5811111 5472418 5164406 4884379 4629729 4396837 4181610 3980820 3792480
60865C792480j77340j67652j58853j50460j42419j34715j26975j19060j11519
$$ 3792480 3615140 3447488 3288635 3138175 2995756 2861041 2734066 2615006 2503487
60856B503487j04694r7833r0099q2174p5777p1508o8153o4331n9961n5744n2031
$$ 2503487 2398793 2300960 2210861 2128687 2052910 1981402 1913249 1848918 1788957 1733213 1681182
60845A681182m8730m5821m3300m0841l8022l4834l1713k9090k7053k5384k3759
$$ 1681182 1632452 1586631 1543331 1502490 1464468 1429634 1397921 1368831 1341778 1316394 1292635
60834A292635k1877j9504j6632j3700j1469j0201r070o958m001j547k38R35K898
$$ 1292635 1270758 1251254 1234622 1220922 1209453 1199252 1190182 1183224 1179223 1177676 1177438 1178373 1181271
60821A181271M625M385K412P96O14O88k88j762k461k529l208m819o251o414n340
$$ 1181271 1185896 1190281 1192693 1193489 1194103 1194791 1194503 1192741 1190280 1187751 1184543 1179724 1173473 1167059 1161719
60806A161719l723k104q31k89p49k081l726m872m739l053l80K106L457L642L542
$$ 1161719 1157996 1155892 1155061 1154772 1154023 1151942 1148216 1143344 1138605 1135552 1135172 1137278 1140735 1144377 1147919
60791A147919M157N765P900J0195J2939J6395J9733K1397K0759J8956J7612J7117
$$ 1147919 1152076 1157841 1165741 1175936 1188875 1205270 1225003 1246400 1267159 1286115 1303727 1320844
60779A320844J6531J4999J2744J0812J0056J0423J1028J1122J0947J1344J2288
$$ 1320844 1337375 1352374 1365118 1375930 1385986 1396409 1407437 1418559 1429506 1440850 1453138
60768A453138J2458J0819Q078N845M609L558K306J624K103L085L583L513L241
$$ 1453138 1465596 1476415 1484493 1490338 1494947 1498505 1500811 1502435 1504538 1507623 1511206 1514719 1517960
60755A517960K472O56j720l266l295k597k389l119m566o408q295r789j0831j1882
$$ 1517960 1520432 1521088 1519368 1516102 1512807 1510210 1507821 1504702 1500136 1493728 1485433 1475644 1464813 1452931
60741A452931j3192j4241j4447j4070j3681j3012j1251q580o509o185p037p531
$$ 1452931 1439739 1425498 1411051 1396981 1383300 1370288 1359037 1350457 1343948 1337763 1330726 1323195
60729A323195o814n049k754n21R66J498J908L330N762P977R096R630J0725J2753
$$ 1323195 1316381 1311332 1308578 1308057 1309023 1310521 1312429 1315759 1321521 1329498 1338594 1348224 1358949 1371702
60715A371702J5054J6814J7860J8646J9580K0530K1084K1354K1975K3008K3336
$$ 1371702 1386756 1403570 1421430 1440076 1459656 1480186 1501270 1522624 1544599 1567607 1590943
60704A590943K2045J9983J8821J8592J7492J4572J1249R329Q612P668O096M677
$$ 1590943 1612988 1632971 1651792 1670384 1687876 1702448 1713697 1723026 1731638 1739306 1745402 1750079
60692A750079L751K854J778P63k66j452k181j814j212k032m298o240o968p648
$$ 1750079 1753830 1756684 1758462 1759225 1758959 1757507 1755326 1753512 1752300 1750268 1745970 1739730 1732762 1725114
60678A725114r196j0521j0329r323r032r488r755r990j1047j2435j2579j1263
$$ 1725114 1715918 1705397 1695068 1685745 1676713 1667225 1657470 1647480 1636433 1623998 1611419 1600156
60666A600156j0018r755r574q437o700n211m082l033k092j209l5J424K699L809
$$ 1600156 1590138 1580383 1570809 1562372 1555672 1550461 1546379 1543346 1541254 1540045 1540010 1541434 1544133 1547942
60652A547942N263O534N910K963rn24P63J006r65l502m944n755o986q113p766
$$ 1547942 1553205 1559739 1565649 1568612 1568603 1568079 1568842 1569848 1568883 1565381 1560437 1554682 1547696 1539583 1531817
60637A531817o112n077n956p705q208o833n152m968o377q181r672j1050j2283
$$ 1531817 1525705 1520628 1514672 1506967 1498759 1491926 1486774 1481806 1475429 1467248 1457576 1446526 1434243
60624A434243j2747j2429j2455j3548j4839j5028j4171j3306j2852j2563j2654
$$ 1434243 1421496 1409067 1396612 1383064 1368225 1353197 1339026 1325720 1312868 1300305 1287651
60613A287651j3610j4913j5236j4136j2447j0712q534n920m052l785m140l364
$$ 1287651 1274041 1259128 1243892 1229756 1217309 1206597 1198063 1192143 1188091 1184306 1180166 1176802
60601A176802j033J613L210L426K929K758L572N016O026O041N699N890O496O648
$$ 1176802 1175769 1177382 1180592 1184018 1186947 1189705 1193277 1198293 1204319 1210360 1216059 1221949 1228445 1235093
60587A235093O048N366N313N769N938N070K984K90j823k218n57K448N494P492
$$ 1235093 1241141 1246507 1251820 1257589 1263527 1268597 1271581 1271871 1270048 1267830 1267273 1269721 1275215 1282707
60573A282707Q204Q282Q603R485J0606J1594J2409J3096J3535J3745J4246J5741
$$ 1282707 1290911 1299193 1307796 1317281 1327887 1339481 1351890 1364986 1378521 1392266 1406512 1422253
60561A422253J8282K0933K2405K2234K1288K0973K1880K3332K4202K3849K2276
$$ 1422253 1440535 1461468 1483873 1506107 1527395 1548368 1570248 1593580 1617782 1641631 1663907
60550A663907J9937J7688J6331J5656J4368J1482P377K937j674o567j1090j4400
$$ 1663907 1683844 1701532 1717863 1733519 1747887 1759369 1766746 1769683 1768009 1761442 1750352 1735952
60538A735952j6734j8880k0641k1233k1038k1290k1890k1240j8803j6105j4451
$$ 1735952 1719218 1700338 1679697 1658464 1637426 1616136 1594246 1573006 1554203 1538098 1523647
60527A523647j3261j1669j0170r299q055n370k229n49n37p83o80j003k134l130
$$ 1523647 1510386 1498717 1488547 1479248 1471193 1465823 1463594 1463045 1462508 1461725 1461045 1460042 1457908 1454778
60513A454778k944j619r0O25J68o03k33J540L310M175N341Q136J1353J2555J1681
$$ 1454778 1451834 1450215 1450125 1450750 1450918 1450315 1450082 1451622 1454932 1459107 1464448 1472584 1483937 1496492 1508173
60498A508173J1154J2248J3539J3589J3183J3667J4726J5158J4785J4248J3700
$$ 1508173 1519327 1531575 1545114 1558703 1571886 1585553 1600279 1615437 1630222 1644470 1658170
60487A658170J3094J3185J4866J7656K0133K1994K4626K9194L4950M0004M3376
$$ 1658170 1671264 1684449 1699315 1716971 1737104 1759098 1783724 1812918 1847868 1887872 1931248
60476A931248M5497M6793M6694M4509M0551L5341K8104J7587M658p372j5996k1861
$$ 1931248 1976745 2023538 2070232 2114741 2155292 2190633 2218737 2236324 2240982 2233610 2217614 2195753
60464B195753k6703l0228l0779k8296k4619k0964j6895j1921o434r03M315Q340
$$ 2195753 2169050 2138822 2108043 2079747 2055128 2034164 2017269 2005348 1998914 1998011 2002326 2010666
60452B010666J0596J2388J5721K0221K3366K4461K6110L0518L6502M1962M7449
$$ 2010666 2021262 2033650 2049371 2069592 2092958 2117419 2143529 2174047 2210549 2252511 2299960
60441B299960N4928O4250P3336Q1524R0531J01924J15434J29978J44983J60256
$$ 2299960 2354888 2419138 2492474 2573998 2664529 2766453 2881887 3011865 3156848 3317104
60431C317104J75600J90873K05875K20367K35000K51926K73272K98876L26229
$$ 3317104 3492704 3683577 3889452 4109819 4344819 4596745 4870017 5168893 5495122
60422E495122L52404L74769L89525L90816L72469L30951K66803J83862Q7602j5632
$$ 5495122 5847526 6222295 6611820 7002636 7375105 7706056 7972859 8156721 8244323 8228691
60412H228691j18157k10974k86166l40187l74405l92171l96298l89581l75837
$$ 8228691 8110534 7899560 7613394 7273207 6898802 6506631 6110333 5720752 5344915
60403E344915l58456l38553l16028k92072k69017k48014k28429k09607j91730
$$ 5344915 4986459 4647906 4331878 4039806 3770789 3522775 3294346 3084739 2893009
60394B893009j74740j57939j41234j25570j11664r9304q8418p9657p3199o7879
$$ 2893009 2718269 2560330 2419096 2293526 2181862 2082558 1994140 1914483 1841284 1773405
60384A773405o2362n6592n1311m6614m1835l6699l2037k8990k7677k6736k4583
$$ 1773405 1711043 1654451 1603140 1556526 1514691 1477992 1445955 1416965 1389288 1362552 1337969
60373A337969k1285j8694j8157j8727j8470j7018j5541j4472j2922j0607q774
$$ 1337969 1316684 1297990 1279833 1261106 1242636 1225618 1210077 1195605 1182683 1172076 1163302
60362A163302q379q587q011o626n439m928m658m019k719q87Q22J742K149K926
$$ 1163302 1154923 1146336 1138325 1131699 1126260 1121332 1116674 1112655 1109936 1109049 1109871 1111613 1113762 1116688
60348A116688L966M041K903K268L571N778O932O995P408Q433Q917Q676Q946R973
$$ 1116688 1120654 1124695 1127598 1129866 1133437 1139215 1146147 1153142 1160550 1168983 1177900 1186576 1195522 1205495
60334A205495J0054Q056N448M473N350O447O528N602M064K374J434K023L569M334
$$ 1205495 1215549 1223605 1229053 1233526 1238876 1245323 1251851 1257453 1261517 1263891 1265325 1267348 1270917 1275251
60320A275251L167O34j654k450j734o66n57j445j940j096M3k51j762k455j356
$$ 1275251 1278418 1279052 1277398 1274948 1273214 1272548 1271991 1270546 1268606 1267510 1267553 1267302 1265540 1263085 1261729
60305A261729K20R84J741L837O627Q164P965P455P715Q287Q521Q685R159R661
$$ 1261729 1261949 1262933 1264674 1268511 1275138 1283302 1291267 1298722 1306437 1314724 1323245 1331930 1341089 1350750
60291A350750J0059J1003J2828J4513J4745J3693J2738J2523J2194J0720Q360
$$ 1350750 1360809 1371812 1384640 1399153 1413898 1427591 1440329 1452852 1465046 1475766 1484126
60280A484126O443N961O570O922N940L793J579J13p28j382j789j467j56J912M128
$$ 1484126 1490569 1496530 1503100 1510022 1515962 1519755 1521334 1521447 1520719 1519337 1517548 1516081 1515925 1517837 1521965
60265A521965N691N921M826L207J964J234M17j103l396n980q127r360r827j0072
$$ 1521965 1527656 1533577 1538403 1541610 1543574 1544808 1545225 1544122 1540726 1534746 1526619 1517259 1507432 1497360
60251A497360j0242r749p972n267k998k431l603n258o010n520m407l118j503L01
$$ 1497360 1487118 1477369 1469397 1464130 1461132 1458701 1455098 1449840 1443830 1438310 1433903 1430785 1429282 1429583
60237A429583J497J828K358L914N394N209M029M070N533O057M502K980L570N031
$$ 1429583 1431080 1432908 1435266 1439180 1444574 1449783 1453812 1457882 1463415 1469472 1473974 1476954 1480524 1485555
60223A485555M978L866M074N932P478Q113R583J2647J5256J5423J4011J3134J3195
$$ 1485555 1490533 1494399 1498473 1504405 1511883 1519996 1529579 1542226 1557482 1572905 1586916 1600050 1613245
60210A613245J3179J2991J3674J5521J7478J8648J9425K0775K3103K6153K9564
$$ 1613245 1626424 1639415 1653089 1668610 1686088 1704736 1724161 1744936 1768039 1794192 1823756
60199A823756L3109L6560L9729M2682M5752M9200N3015N7167O1885O7327P3242
$$ 1823756 1856865 1893425 1933154 1975836 2021588 2070788 2123803 2180970 2242855 2310182 2383424
60188B383424P9478Q6628R5178J04132J11751J18176J25785J35920J46606J55122
$$ 2383424 2462902 2549530 2644708 2748840 2860591 2978767 3104552 3240472 3387078 3542200
60178C542200J61669J68351J75225J79913J81306J81024J80229J77088J69028
$$ 3542200 3703869 3872220 4047445 4227358 4408664 4589688 4769917 4947005 5116033
60169E116033J56168J40899J24933J08252R0548P2242N4007L6230J9266L790r310
$$ 5116033 5272201 5413100 5538033 5646285 5736833 5809075 5863082 5899312 5918578 5922368 5913058
60158E913058j9450k6995l3137l8434m1482l9973l3310k3341j2213n22J1924K4841
$$ 5913058 5893608 5866613 5833476 5795042 5753560 5713587 5680277 5656936 5644723 5644201 5656125 5680966
60146E680966L7955N1980O7891Q5457J03282J20035J34971J47659J57872J65542
$$ 5680966 5718921 5770901 5838792 5924249 6027531 6147566 6282537 6430196 6588068 6753610
60136F753610J70191J70808J66848J59054J48506J35075J17612R5734P0837M5237
$$ 6753610 6923801 7094609 7261457 7420511 7569017 7704092 7821704 7917438 7988275 8033512
60126H033512K0545l050k6076m8446o8907q5996r9283j09109j15304j17115j14437
$$ 8033512 8054057 8051007 8024931 7976485 7907578 7821582 7722299 7613190 7497886 7380771 7266334
60115G266334j08130r8805q6293p0806n3633l5931j7699J430K1195M1222O1444
$$ 7266334 7158204 7059399 6973106 6902300 6848667 6812736 6795037 6796467 6817662 6858884 6920328
60104F920328Q0850R6746J06744J11071J11682J09444J03621R4046Q2197O9738
$$ 6920328 7001178 7097924 7204668 7315739 7427421 7536865 7640486 7734532 7816729 7886467
60094G886467N7047M3712K9780J6084L869n570j1326j3133j1047m965N116J8601
$$ 7886467 7943514 7987226 8017006 8033090 8036959 8031389 8020063 8006930 7995883 7990918 7996034 8014635
60082H014635L4641N2907P3507R6167J20110J44968J71358K00293K32112K65944
$$ 8014635 8049276 8102183 8175690 8271857 8391967 8536935 8708293 8908586 9140698 9406642
60072I406642L00226L34014L67773M02354M37064M69465M97429N20594N39203
$$ 9406642 9706868 10040882 10408655 10811009 11248073 11717538 12214967 12735561 13274764
60063A3274764N52471N59034N58202N49510N31679N03584M66058M21241L70029
$$ 13274764 13827235 14386269 14944471 15493981 16025660 16529244 16995302 17416543 17786572
60054A7786572L11749K46638J77032J05201L1385m4616j20587j92111k55813l11293
$$ 17786572 18098321 18344959 18521991 18627192 18658577 18613961 18493374 18301263 18045450 17734157
60044A7734157l59546m00142m30775m49335m55662m51061m36883m14390l85443
$$ 17734157 17374611 16974469 16543694 16094359 15638697 15187636 14750753 14336363 13950920
60035A3950920l51995l14781k73651k29617j85240j42288j00344n8967j9985J3990
$$ 13950920 13598925 13284144 13010493 12780876 12595636 12453348 12353004 12294037 12274052 12288042
60025A2288042M2425O6268Q4902R5954R8370R3704Q3662O8088M6513K0374p515
$$ 12288042 12330467 12396735 12481637 12577591 12675961 12769665 12853327 12921415 12967928 12988302 12980787
60014A2980787l5043o1509q7068j12190j37120j61134j82919k02121k19664k35851
$$ 12980787 12945744 12884235 12797167 12684977 12547857 12386723 12203804 12001683 11782019 11546168
60004A1546168k48995k56985k59681k58625k54689k47113k34960k18652j99683
$$ 11546168 11297173 11040188 10780507 10521882 10267193 10020080 9785120 9566468 9366785
59995I366785j79270j57547j33945j08278q1362n4305k7239N45K8926N6228Q0846
$$ 9366785 9187515 9029968 8896023 8787745 8706383 8652078 8624839 8625384 8654310 8710538 8791384
59984H791384J03054J24058J43445J58618J67120J68603J64113J54284J39217
$$ 8791384 8894438 9018496 9161941 9320559 9487679 9656282 9820395 9974679 10113896
59975A0113896J19673R7164P2475M5034J4431j7964m9728p9502j07367j33097
$$ 10113896 10233569 10330733 10403208 10448242 10462673 10444709 10394981 10315479 10208112 10075015
59965A0075015j55154j72048j83957j92127j97057j97913j93535j83547j68783
$$ 10075015 9919861 9747813 9563856 9371729 9174672 8976759 8783224 8599677 8430894
59956H430894j51110j32430j13184r2215o8673m3487j8125P520L4690O3392R1846
$$ 8430894 8279784 8147354 8034170 7941955 7873282 7829795 7811670 7819190 7853880 7917272 8009118
59945H009118J18488J43420J67538J91099K13397K32884K47393K55172K56066
$$ 8009118 8127606 8271026 8438564 8629663 8843060 9075944 9323337 9578509 9834575
59936I834575K50913K39701K21560J96893J68078J37200J04095O7781K9023r716
$$ 9834575 10085488 10325189 10546749 10743642 10911720 11048920 11153015 11220796 11249819 11240103
59926A1240103m6489q0959j13324j42818j67494j85275j95477j99239j97965j91424
$$ 11240103 11193614 11112655 10999331 10856513 10689019 10503744 10308267 10109028 9911063 9719639
59916I719639j78477j59816j38488j16809r4148o8961m1877j4999J1000L6983
$$ 9719639 9541162 9381346 9242858 9126049 9031901 8962940 8921063 8906064 8917064 8954047
59906H954047O2773Q6545J07271J25793J42632J56227J64686J68188J68379J66009
$$ 8954047 9016820 9103365 9210636 9336429 9479061 9635288 9799974 9968162 10136541 10302550
59896A0302550J60623J52303J42309J31638J20127J07508R4757Q3627P5199O9541
$$ 10302550 10463173 10615476 10757785 10889423 11009550 11117058 11211815 11295442 11370641 11440182
59886A1440182O6576O6804P1146Q0625R6093J17690J44379J74612K07768K44409
$$ 11440182 11506758 11573562 11644708 11725333 11821426 11939116 12083495 12258107 12465875 12710284
59876A2710284K84734L27368L70218M12015M52222M89764N22608N48427N64794
$$ 12710284 12995018 13322386 13692604 14104619 14556841 15046605 15569213 16117640 16682434
59867A6682434N68827N57639N29339M83018M18143L35318K38017J32282K4057
$$ 16682434 17251261 17808900 18338239 18821257 19239400 19574718 19812735 19945017 19969074
59858A9969074q2484j83823k75815l54705m18687m67468n00953n19335n23964
$$ 19969074 19886590 19702767 19426952 19072247 18653560 18186092 17685139 17165804 16641840
59849A6641840n17051n00698m76889m47772m14724l77428l35087k88623k40650
$$ 16641840 16124789 15624091 15147202 14699430 14284706 13907278 13572191 13283568 13042918
59840A3042918j93242j46716j00772n5756j2347K9082O8105J03720J34730J60296
$$ 13042918 12849676 12702960 12602188 12546432 12534085 12563167 12631272 12734992 12869722 13030018
59830A3030018J79490J90507J90880J78753J53956J17981P3106K1522l4985r4751
$$ 13030018 13209508 13400015 13590895 13769648 13923604 14041585 14114691 14136213 14101228 14006477
59820A4006477j55717k15070k69389l15597l52252l79906l99832m12567m18086
$$ 14006477 13850760 13635690 13366301 13050704 12698452 12318546 11918714 11506147 11088061
59811A1088061m17065m10846m00044l84328l64073l41184l17486k93252k68311
$$ 11088061 10670996 10260150 9860106 9475778 9111705 8770521 8453035 8159783 7891472
59802G891472k43687k20769j99369j78095j56755j37040j20718j08136r8666r1447
$$ 7891472 7647785 7427016 7227647 7049552 6892797 6755757 6635039 6526903 6428237 6336790
59792F336790q5377p9498p3965o9835o7334o4951o0774n4343m6845m0060l5317
$$ 6336790 6251413 6171915 6097950 6028115 5960781 5895830 5835056 5780713 5733868 5693808 5658491
59781E658491l2889l1975l1769l2790l6450m3022n0706n7286o1965o4994o6228
$$ 5658491 5625602 5593627 5561858 5529068 5492618 5449596 5398890 5341604 5279639 5214645 5148417
59770E148417o5038o1436n6319n0620m4740l8768l2746k6721k0965j5960j1618
$$ 5148417 5083379 5021943 4965624 4915004 4870264 4831496 4798750 4772029 4751064 4735104 4723486
59759D723486o792j48Q487J8170K8041L7747M6718N4134N9974O5307P0892P6103
$$ 4723486 4716694 4716546 4725033 4743203 4771244 4808991 4855709 4909843 4969817 5035124 5106016 5182119
59747E182119P9963Q2742Q5543Q8350Q9464Q7224Q1699P4370O6695N9426N2860
$$ 5182119 5262082 5344824 5430367 5518717 5608181 5695405 5777104 5851474 5918169 5977595 6030455
59736F030455M7039M1848L7431L4607L4413L7210M2553N0107O0199P3150Q8475
$$ 6030455 6077494 6119342 6156773 6191380 6225793 6263003 6305556 6355663 6415862 6489012 6577487
59725F577487J05225J23180J43260J66595J93339K22574K53276K85139L18425
$$ 6577487 6682712 6805892 6949152 7115747 7309086 7531660 7784936 8070075 8388500
59716H388500L53280L89426M26274M62618M95825N21236N32468N22552M85729
$$ 8388500 8741780 9131206 9557480 10020098 10515923 11037159 11569627 12092179 12577908
59707A2577908M19699L27375K16529R7471j9174j23437k07202k66566l03053l21317
$$ 12577908 12997607 13324982 13541511 13638982 13619808 13496371 13289169 13022603 12719550 12398233
59697A2398233l25411l17708l00664k77683k51644k23635j93765j62334j29809
$$ 12398233 12072822 11755114 11454450 11176767 10925123 10701488 10507723 10345389 10215580
59688A0215580r6605o3519l1505m51L0915O3303R5918J27872J59452J91139K22489
$$ 10215580 10118975 10055456 10023951 10023500 10054415 10117718 10213636 10341508 10500960 10692099 10914588
59677A0914588K53346K85214L19909L57393L96390M36648M79019N23587N69502
$$ 10914588 11167934 11453148 11773057 12130450 12526840 12963488 13442507 13966094 14535596
59668A4535596O16669O66005P17701P70775Q24539Q78997R33248R84937J031790
$$ 14535596 15152265 15818270 16535971 17306746 18131285 19010282 19943530 20928467 21960257
59659B1960257J072346J104595J125548J133260J128107J111369J084126J048923
$$ 21960257 23032603 24137198 25262746 26396006 27524113 28635482 29719608 30768531
59651C0768531J011043R76226R47672R26478R13708R09759R12242R16860R20572
$$ 30768531 31779574 32755800 33703472 34629950 35543658 36453417 37365659 38282519 39203091
59642C9203091R21754R17028R00305Q66217Q13083P41649O52885N48740M33906
$$ 39203091 40124845 41041873 41942178 42808395 43621478 44363127 45016012 45564752 45998658
59633D5998658L14868J97486Q6710j2221r4384j57104j99854k22103k22842k02479
$$ 45998658 46313526 46511012 46597722 46585501 46491117 46334013 46134159 45912056 45689214 45486735
59623D5486735j63672j09332m0777M1431J35837K40138L52137M69691N90278P11329
$$ 45486735 45323063 45213731 45172954 45214385 45350222 45590360 45942497 46412188 47002466 47713795
59613D7713795Q30313R43569J045533J129956J191037J222270J215040J160553
$$ 47713795 48544108 49487677 50533210 51663166 52854203 54076473 55291513 56452066
59605E6452066J053741Q94490O85716M32582J44564j63320m72889p66611j029728
$$ 56452066 57505807 58400297 59086013 59518595 59663159 59499839 59026950 58260339 57230611
59596E7230611j251145j424545j548735j626167j661283j660438j631875j584093
$$ 57230611 55979466 54554921 53006186 51380019 49718736 48058298 46426423 44842330
59588D4842330j524112j458333j394681j342667j310654j302793j317636j348393
$$ 44842330 43318218 41859885 40465204 39122537 37811883 36509090 35191454 33843061
59580C3843061j384687j415657j433039j432461j412910j375726j323874j261309
$$ 33843061 32458374 31042717 29609678 28177217 26764307 25388581 24064707 22803398
59572B2803398j192422j121445j051339r82807r15036q47852p82630p20686o61884
$$ 22803398 21610976 20489531 19438192 18455385 17540349 16692497 15909867 15189181 14527297
59563A4527297o05708n52859n04531m60693m20391l83272l49460l18164k87981
$$ 14527297 13921589 13368730 12864199 12403506 11983115 11599843 11250383 10932219 10644238
59554A0644238k58821k32342k10110j92287j78291j67666j60053j55131j52896
$$ 10644238 10385417 10153075 9942965 9750678 9572387 9404721 9244668 9089537 8936641
59545H936641j53303j55516j58300j61140j64095j66632j67718j67049j65062
$$ 8936641 8783338 8627822 8469522 8308382 8144287 7977655 7809937 7642888 7477826
59536G477826j61559j55706j47680j38942j30237j20644j09450r7726q6976p6970
$$ 7477826 7316267 7160561 7012881 6873939 6743702 6623058 6513608 6415882 6328906 6251936
59526F251936o6102n3498m0001k7314j6712q172l73Q000J6708K4384L0634L6645
$$ 6251936 6185834 6132336 6092335 6065021 6048309 6040137 6039764 6047764 6064472 6088856 6119490 6156135
59514F156135M3208M9361N3904N7311O1032O5584P0558P5962Q2371Q9901R8126
$$ 6156135 6199343 6248704 6302608 6359919 6420951 6486535 6557093 6633055 6715426 6805327 6903453
59503F903453J06941J16770J27988J40771J55223J71064J87526K04254K22028
$$ 6903453 7010394 7127164 7255152 7395923 7551146 7722210 7909736 8113990 8336018
59494H336018K41829K63414K85536L07323L28747L49858L70366L89833M07689
$$ 8336018 8577847 8841261 9126797 9434120 9762867 10112725 10483091 10872924 11280613
59485A1280613M22971M34611M41965M44739M42665M35552M23442M06437L84733
$$ 11280613 11703584 12138195 12580160 13024899 13467564 13903116 14326558 14732995 15117728
59476A5117728L59039L30159K97898K61410K21515J81827J46344J16457R1167
$$ 15117728 15476767 15806926 16104824 16366234 16587749 16769576 16915920 17032377 17123544
59467A7123544O9537N1676L8056K9506K7619L3556M6363O3775Q4571J08510J33824
$$ 17123544 17193081 17244757 17282813 17312319 17339938 17373494 17419857 17483632 17568203 17676713 17810537
59456A7810537J56475J72520J79775J76702J61337J32527R1202L9422k1201q9316
$$ 17810537 17967012 18139532 18319307 18496009 18657346 18789873 18881075 18920497 18899296 18809980
59446A8809980j62874k39024l14276l84283m44668m93190n30426n57405n73432
$$ 18809980 18647106 18408082 18093806 17709523 17264855 16771665 16241239 15683834 15110402
59437A5110402n77338n70037n54277n32162n04456m72187m37520m02530l68099
$$ 15110402 14533064 13963027 13408750 12876588 12372132 11899945 11462425 11059895 10691796
59428A0691796l34248l00640k66540k31445j96223j62779j31870j02099p1682
$$ 10691796 10357548 10056908 9790368 9558923 9362700 9199921 9068051 8965952 8894270
59419H894270m0500r536K1013N1671Q2043J10707J37403J64048J92477K21663
$$ 8894270 8853770 8844234 8865247 8916918 8998961 9109668 9247071 9411119 9603596 9825259
59409I825259K48375K70634K89279L05615L18413L24338L20992L08540K88140
$$ 9825259 10073634 10344268 10633547 10939162 11257575 11581913 11902905 12211445 12499585
59400A2499585K59799K22497J75970J21670O1989q92o5178j28920j89592k44418
$$ 12499585 12759384 12981881 13157851 13279521 13341510 13340618 13275440 13146520 12956928 12712510
59390A2712510k91217l29112l58461l80045l94391m01830m02865l98277l89052
$$ 12712510 12421293 12092181 11733720 11353675 10959284 10557454 10154589 9756312 9367260
59381I367260l76501l62162l47013l30741l12341k91689k70146k49370k29861
$$ 9367260 8990759 8628597 8281584 7950843 7638502 7346813 7076667 6827297 6597436
59372F597436k11064j92588j74749j57907j41838j26044j10429r5499q1998p0321
$$ 6597436 6386372 6193784 6019035 5861128 5719290 5593246 5482817 5387318 5305320 5234999
59362E234999o0053n0027l9148k7321j5428m486M934J2656J9006K5197L2701M1437
$$ 5234999 5174946 5124919 5085771 5058450 5043022 5038536 5043470 5056126 5075132 5100329 5133030 5174467
59350E174467M9052N2899N2609N0051M7123M4710M3879M6606N4295O6183Q0119
$$ 5174467 5223519 5276418 5329027 5379078 5426201 5470911 5514790 5561396 5615691 5681874 5761993
59339E761993R4663J09501J23900J35861J43572J47551J50921J57367J68799J84879
$$ 5761993 5856656 5966157 6090057 6225918 6369490 6517041 6667962 6825329 6994128 7179007
59329G179007K04510K27327K53593K83107L14916L48199L83008M19971M59666
$$ 7179007 7383517 7610844 7864437 8147544 8462460 8810659 9193667 9613638 10073304
59320A0073304N02304N47617N94710O42345O89566P35660P79248Q17900Q48935
$$ 10073304 10575608 11123225 11717935 12360280 13049846 13785506 14564754 15382654 16231589
59311A6231589Q70314Q80412Q77552Q60455Q29302P86249P35059O80020O24266
$$ 16231589 17101903 17982315 18859867 19720322 20549624 21335873 22070932 22750952 23375218
59302B3375218N68468N11628M53638L96322L41274K87326K31431J71688J08289
$$ 23375218 23943686 24455314 24908952 25305274 25646548 25933874 26165305 26336993 26445282
59293B6445282M1613k9011j04023j82070k60351l35910m06331m70107n27068n77815
$$ 26445282 26486895 26457884 26353861 26171791 25911440 25575530 25169199 24699092 24172024 23594209
59283B3594209o22257o59375o88959p12633p32003p46429p53859p53629p47043
$$ 23594209 22971952 22312577 21623618 20910985 20178982 19432553 18678694 17925065 17178022
59274A7178022p35235p17871o94533o66253o34867o01611n67081n31810m95930
$$ 17178022 16442787 15724916 15030383 14364130 13729263 13127652 12560571 12028761 11532831
59265A1532831m58899m20751l83338l48964l17830k88000k58247k29586k03310
$$ 11532831 11073932 10653181 10269843 9920879 9603049 9315049 9056802 8827216 8623906
59256H623906j78805j54539j30527j08296q8674p0843n3778l7468k2381q492M627
$$ 8623906 8445101 8290562 8160035 8051739 7963065 7892222 7838444 7800976 7778595 7770103 7774730
59245G774730J7337K9785M1778N2582O1467O8585P4670P9776Q3068Q4178Q3839
$$ 7774730 7792067 7821852 7863630 7916212 7977679 8046264 8120934 8200710 8283778 8367956 8451795
59234H451795Q2714Q0459P6626P1777O6921O2423N8366N5448N4605N6126N9924
$$ 8451795 8534509 8614968 8691594 8763371 8830292 8892715 8951081 9006529 9061134 9117260 9177184
59223I177184O6212P4906Q4682R4025J03225J14118J27486J41753J54685J65359
$$ 9177184 9243396 9318302 9402984 9497009 9600234 9714352 9841838 9983591 10138276 10303635
59213A0303635J73625J78274J76809J67324J50247J28038J03133P6297M7158J6171
$$ 10303635 10477260 10655534 10832343 10999667 11149914 11277952 11381085 11457382 11504540 11520711
59203A1520711j4684m3446o9484r2460j10953j23614j31223j35763j37386j34209
$$ 11520711 11506027 11462581 11393097 11300637 11189684 11066070 10934847 10799084 10661698 10527489
59193A0527489j25864j15324j05760r6952q6551p4148o2158n2820m6048m0464
$$ 10527489 10401625 10286301 10180541 10083589 9997038 9922890 9860732 9807912 9761864 9721400
59183I721400l5150k9762k4071j8240j2825p858k422M400J2560K1686L2240M5443
$$ 9721400 9686250 9656488 9632417 9614177 9601352 9593494 9591072 9595472 9608032 9629718 9661958 9707401
59171I707401O2090Q1978J04628J30091J58857J91055K25977K62518K99958L38024
$$ 9707401 9769491 9851469 9956097 10086188 10245045 10436100 10662077 10924595 11224553 11562577
59161A1562577L75853M11219M41347M64367M79375M84864M77917M55458M15948
$$ 11562577 11938430 12349649 12790996 13255363 13734738 14219602 14697519 15152977 15568925
59152A5568925L59577K87566K02139J06775N477r8246k01000k98296l85025m57555
$$ 15568925 15928502 16216068 16418207 16524982 16530459 16432213 16231213 15932917 15547892 15090337
59142A5090337n14812n57217n85510o00923o05200n99643n84939n62717n36298
$$ 15090337 14575525 14018308 13432798 12831875 12226675 11627032 11042093 10479376 9943078
59133I943078n08630m80119m49753m17869l86338l56254l27214k99120k73051
$$ 9943078 9434448 8954329 8504576 8086707 7700369 7344115 7016901 6717781 6444730
59124F444730k49656k28032k07119j87196j69122j52894j37817j23475j09805
$$ 6444730 6195074 5967042 5759923 5572727 5403605 5250711 5112894 4989419 4879614
59115D879614r6780q4664p3983o4607n5580m6493l8220l1441k5241j8262j0550
$$ 4879614 4782834 4698170 4624187 4559580 4504000 4457507 4419287 4387846 4362605 4344343 4333793
59104D333793l094L898J0976J8130K4874L1429L8455M5607N1851N7272O3187O9968
$$ 4333793 4330699 4334597 4345573 4363703 4388577 4420006 4458461 4504068 4555919 4613191 4676378 4746346
59092D746346P6209Q0783Q4608Q9399R5387J01267J05914J09299J11744J13054
$$ 4746346 4822555 4903338 4987946 5077345 5172732 5273999 5379913 5489212 5600956 5714010
59082E714010J12576J09918J05532J00407R5064Q9057Q1783P3398O4440N4892
$$ 5714010 5826586 5936504 6042036 6142443 6237507 6326564 6408347 6481745 6546185 6601077
59072F601077M4591L4368K5698J9090J3787R336O455N915P530J0912J6318K4023
$$ 6601077 6645668 6680036 6705734 6724824 6738611 6747947 6754402 6760317 6767847 6778759 6795077 6819100
59060F819100L3494M3835N4679O6081P8108R1071J05572J21642J38389J55082
$$ 6819100 6852594 6896429 6951108 7017189 7095297 7186368 7291940 7413582 7551971 7707053
59050G707053J72020J89537K06916K23271K38994K54965K70562K83712K93031
$$ 7707053 7879073 8068610 8275526 8498797 8737791 8992756 9263318 9547030 9840061
59041I840061K98591L00143K95699K82770K60301K28758J88925J41687Q8819L3150
$$ 9840061 10138652 10438795 10734494 11017264 11277565 11506323 11695248 11836935 11925754 11958904
59031A1958904k2405p5625j24922j69074k07308k39338k65104k84780k99172l09740
$$ 11958904 11936499 11860874 11735952 11566878 11359570 11120232 10855128 10570348 10271176 9961436
59021I961436l17701l23236l25897l25559l22554l17060l09247l00128k91312
$$ 9961436 9643735 9320499 8994602 8669043 8346489 8029429 7720182 7420054 7128742
59012G128742k83313k74755k64080k51586k38931k27005k15424k04078j93827
$$ 7128742 6845429 6570674 6306594 6055008 5816077 5589072 5373648 5169570 4975743
59003D975743j85054j76492j66431j54789j43285j33611j25931j19113j12021
$$ 4975743 4790689 4614197 4447766 4292977 4149692 4016081 3890150 3771037 3659016
58994C659016j04458r7121r0770q5554q1078p6883p2641o8109o3364n9076n6046
$$ 3659016 3554558 3457437 3366667 3281113 3200035 3123152 3050511 2982402 2919038 2859962 2803916
58983B803916n4283n2866n0929m8447m6013m4021m2255m0104l7168l3761l0648
$$ 2803916 2749633 2696767 2645838 2597391 2551378 2507357 2465102 2424998 2387830 2354069 2323421
58972B323421k8121k5655k2854k0238j8449j6992j4700j1287p506l901n80J705
$$ 2323421 2295300 2269645 2246791 2226553 2208104 2191112 2176412 2165125 2157619 2153718 2153138 2154843
58960B154843J768n0j410n45J611K963L112L353M329N240N467N574O166O783O662
$$ 2154843 2156611 2156561 2155151 2154606 2156217 2159180 2162292 2165645 2169974 2175214 2180681 2186255 2192421 2199204 2205866
58945B205866O154O569Q605J1328J2969J2724J1650J1509J2767J4159J4457J4165
$$ 2205866 2212020 2218589 2227194 2238522 2251491 2264215 2275865 2287374 2300141 2314300 2328757 2342922
58933B342922J4880J7221J9986K1450K1049J9781J9189K0036K1723K2994K3332
$$ 2342922 2357802 2375023 2395009 2416459 2437508 2457289 2476478 2496514 2518237 2541231 2564563
58922B564563K3532K4722K7056K9631L1402L1772L0671K8735K7393K7919L0077
$$ 2564563 2588095 2612817 2639873 2669504 2700906 2732678 2763349 2792084 2819477 2847396 2877473
58911B877473L2294L3560L4609L6623L9390M1646M3147M5147M8407N1739N3522
$$ 2877473 2909767 2943327 2977936 3014559 3053949 3095595 3138742 3183889 3232296 3284035 3337557
58900C337557N4032N5037N7304N9882O2076O4709O8595P2878P6091P8351Q1322
$$ 3337557 3391589 3446626 3503930 3563812 3625888 3690597 3759192 3832070 3908161 3986512 4067834
58889D067834Q6272R3063J00647J07688J13128J17386J22720J31071J41477J51111
$$ 4067834 4154106 4247169 4347816 4455504 4568632 4686018 4808738 4939809 5081286 5232397
58879E232397J58996J67151J77579J89764K02084K14458K28158K43861K61155
$$ 5232397 5391393 5558544 5736123 5925887 6127971 6342429 6570587 6814448 7075603
58870G075603K79601K99096L19352L40073L61699L85359M11992M41929M75019
$$ 7075603 7355204 7654300 7973652 8313725 8675424 9060783 9472775 9914704 10389723
58861A0389723N10732N48300N87305O28007O70761P15408P61533Q08980Q57495
$$ 10389723 10900455 11448755 12036060 12664067 13334828 14050236 14811769 15620749 16478244
58852A6478244R06040R52810R95698J032322J059885J075434J076177J059317
$$ 16478244 17384284 18337094 19332792 20365114 21424999 22500433 23576610 24635927
58844B4635927J021996R61752Q77093P67752O34976M81909L13365J35235m5649
$$ 24635927 25657923 26619675 27496768 28264520 28899496 29381405 29694770 29830005 29784356
58835B9784356k21588l85402n32460o60608p68044q52531r13560r53912r77697
$$ 29784356 29562768 29177366 28644906 27984298 27216254 26363723 25450163 24496251 23518554
58826B3518554r87329r83413r67041r40875r08113q71310q32083p91092p48556
$$ 23518554 22531225 21547812 20580771 19639896 18731783 17860473 17028390 16237298 15488742
58817A5488742p05366o63348o23751n86000n48923n12725m78714m47449m18369
$$ 15488742 14783376 14120028 13496277 12910277 12361354 11848629 11369915 10922466 10504097
58808A0504097l91033l65527l41627l18700k96513k75192k54412k33797k14243
$$ 10504097 10113064 9747537 9405910 9087210 8790697 8515505 8261093 8027296 7813053
58799G813053j97429j83416j69797j54243j37241j21446j08569r7577q6025p2582
$$ 7813053 7615624 7432208 7262411 7108168 6970927 6849481 6740912 6643335 6557310 6484728
58789F484728n8060m4164l1709k0254r094K089J3655K6143L9430N2360O4032P5120
$$ 6484728 6426668 6382504 6350795 6330541 6321447 6323536 6337191 6363334 6402764 6455124 6519156 6594276
58777F594276Q7079J00309J13845J26781J39344J52441J66701J82028J97818K13715
$$ 6594276 6681355 6781664 6895509 7022290 7161634 7314075 7480776 7662804 7860622 8074337
58767H074337K30337K48965K70268K93696L18323L43699L69635L96070M23850
$$ 8074337 8304674 8553639 8823907 9117603 9435926 9779625 10149260 10545330 10969180
58758A0969180M54695M89474N27215N66802O08801O54317P02742P52107Q01281
$$ 10969180 11423875 11913349 12440564 13007366 13616167 14270484 14973226 15725333 16526614
58749A6526614Q50157Q97753R41543R78807J007342J024598J027222J011728R74919
$$ 16526614 17376771 18274524 19216067 20194874 21202216 22226814 23254036 24265764 25240683
58740B5240683R14071Q27924P17530N85129M32717K63357Q3653r7101k70822m32472
$$ 25240683 26154754 26982678 27700208 28285337 28718054 28981411 29065064 28967963 28697141 28264669
58730B8264669n78240p04156q07489q87955r46722r85431j006794j014317j010203
$$ 28264669 27686429 26982273 26174784 25286829 24340107 23354676 22347882 21333565 20323362
58721B0323362r94734r68791r35671q99079q60381q19213p75976p32265o89449
$$ 20323362 19328628 18359837 17424166 16525087 15664706 14845493 14069517 13337252 12647803
58712A2647803o48208o09170n72809n38873n06676m75861m46264m17625l90082
$$ 12647803 11999595 11390425 10817616 10278743 9772067 9296206 8849942 8432317 8042235
58703H042235l64348l40594l17859k95498k74525k56345k40634k25647k10329
$$ 8042235 7677887 7337293 7019434 6723936 6449411 6193066 5952432 5726785 5516456
58694E516456j95002j80320j66757j54880j44845j35592j25725j15320j05787
$$ 5516456 5321454 5141134 4974377 4819497 4674652 4539060 4413335 4298015 4192228
58685D192228r7865r0855q4059p7784p2512o8103o4391o1594n9454n6898n3354
$$ 4192228 4094363 4003508 3919449 3841665 3769153 3701050 3636659 3575065 3515611 3458713 3405359
58674C405359m9687m6835m4158m0333l5707l2515l2462l5010l8258m0687m1625
$$ 3405359 3355672 3308837 3264679 3224346 3188639 3156124 3123662 3088652 3050394 3009707 2968082
58663B968082m1065l9918l9863m1885m5099m7892m9847n1598n2954n2768n1029
$$ 2968082 2927017 2887099 2847236 2805351 2760252 2712360 2662513 2610915 2557961 2505193 2454164
58652B454164m9554m9534m9638m8009m5310m3968m4546m4685m2223l8049l4922
$$ 2454164 2404610 2355076 2305438 2257429 2212119 2168151 2123605 2078920 2036697 1998648 1963726
58641A963726l4171l4424l3355l0138k6249k4003k4213k5377k5451k4149k2906
$$ 1963726 1929555 1895131 1861776 1831638 1805389 1781386 1757173 1731796 1706345 1682196 1659290
58630A659290k2723k2950k2302k0322j7492j4545j2033j0019p941n219k205l2
$$ 1659290 1636567 1613617 1591315 1570993 1553501 1538956 1526923 1516904 1508963 1503744 1501539 1501507
58618A501507P60R17J581L102M896O002N689M005J887K37j066k604l969l943k423
$$ 1501507 1502267 1503184 1504765 1507867 1512763 1518765 1524454 1528459 1530346 1530583 1529517 1526913 1522944 1519001 1516578
58603A516578j071j373k850l984m220m194m435m769m858m487l345j190J616M228
$$ 1516578 1515507 1514134 1511284 1507300 1503080 1498886 1494451 1489682 1484824 1480337 1476992 1475802 1477418 1481646
58589A481646O238Q153J0679J3733J6452J8364K0130K2728K5984K8733L0614L2763
$$ 1481646 1487884 1496037 1506716 1520449 1536901 1555265 1575395 1598123 1624107 1652840 1683454 1716217
58577A716217L6114L9867M2712M4901M7785N1757N6150O0873O6410P2115P6425
$$ 1716217 1752331 1792198 1834910 1879811 1927596 1979353 2035503 2096376 2162786 2234901 2311326
58566B311326P9486Q3864R1515J01338J10900J19598J28884J40208J53875J69399
$$ 2311326 2390812 2474676 2566191 2667529 2778429 2898027 3026911 3167119 3320994 3490393
58556C490393J85796K01851K17010K31828K46986K62211K76615K89381K99472
$$ 3490393 3676189 3878040 4095050 4326878 4573864 4836075 5112690 5402071 5701543
58547E701543L05262L05196K98202K82863K57226K20563J74800J23036O7336R132
$$ 5701543 6006805 6312001 6610203 6893066 7150292 7370855 7545655 7668691 7736027 7745159
58537G745159m8759j02219j48116j85553k14863k36527k51189k59622k62303k59722
$$ 7745159 7696400 7594181 7446065 7260512 7045649 6809122 6557933 6298311 6036008 5776286
58527E776286k53177k44412k34228k22286k08578j94203j80176j66390j52410
$$ 5776286 5523109 5278697 5044469 4822183 4613605 4419402 4239226 4072836 3920426
58518C920426j38747j26472j15747j05620r5461q5959p8377p3105o9396o6314
$$ 3920426 3781679 3655207 3539460 3433840 3338379 3252420 3174043 3100938 3031542 2965228
58508B965228o3424o0581n7661n4863n2742n1345m9674m6734m3125m0747m0774
$$ 2965228 2901804 2841223 2783562 2728699 2675957 2624612 2574938 2528204 2485079 2444332 2403558
58497B403558m2469m4203m5041m5075m4740m4254m3491m2217m0562l9190l8574
$$ 2403558 2361089 2316886 2271845 2226770 2182030 2137776 2094285 2052068 2011506 1972316 1933742
58486A933742l8287l7535l6289l5039l3521l0865k7265k4394k3391k3224k2020
$$ 1933742 1895455 1857920 1821631 1786592 1753071 1722206 1694941 1670547 1647156 1623932 1601912
58475A601912j9426j6785j5270j4777j4686j4766j5030j5102j4316j2577j0763
$$ 1601912 1582486 1565701 1550431 1535654 1520968 1506202 1491172 1476070 1461754 1449177 1438414
58464A438414r945j0162j0446j0196r948j0439j1432j2160j2394j2361j2026j1316
$$ 1438414 1428469 1418307 1407861 1397665 1387717 1377278 1365846 1353686 1341292 1328931 1316905 1305589
58452A305589j0634j0292r905r233q989r568r732q222o137n688o688o665m683
$$ 1305589 1294955 1284663 1274758 1265525 1256536 1246968 1237236 1229014 1222877 1217189 1210501 1203836 1199153
58439A199153k795k849m015m675m874n446o140o195n783n554n502n367n336n482
$$ 1199153 1196358 1193509 1189494 1184819 1179945 1174499 1168359 1162164 1156381 1150827 1145325 1139958 1134622 1129140
58425A129140n306m563l717k986j977r04q69k124l302l240k406j685j116o52q41
$$ 1129140 1123834 1119271 1115554 1112568 1110591 1109687 1108818 1106694 1103392 1100152 1097746 1096061 1094945 1094293 1093452
58410A093452j695k249k244k810m358n437m898l701l051k370q31O71J006J015
$$ 1093452 1091757 1089508 1087264 1084454 1080096 1074659 1069761 1066060 1063009 1060639 1059808 1060479 1061485 1062500
58396A062500K146L918M772M662M723N040M741L816K993K173P26r97k003k231
$$ 1062500 1064646 1068564 1073336 1077998 1082721 1087761 1092502 1096318 1099311 1101484 1102210 1101213 1099210 1096979
58382A096979k426k886l498m442n656o314o071n864o349o668o054n350n251m589
$$ 1096979 1094553 1091667 1088169 1083727 1078071 1071757 1065686 1059822 1053473 1046805 1040751 1035401 1030150 1025561
58368A025561k445n56j185l560m891m206k750j265N60K257K744K227J981K423
$$ 1025561 1023116 1022560 1021375 1017815 1012924 1008718 1005968 1004703 1005263 1007520 1010264 1012491 1014472 1016895
58354A016895L218M696P021Q692Q217O812O988Q889J0398J0485R960R294Q376
$$ 1016895 1020113 1024809 1031830 1040522 1048739 1055551 1062539 1071428 1081826 1092311 1102271 1111565 1119941
58341A119941Q100R450J1088J0669Q553P446Q245R119Q897Q501Q450P869O546
$$ 1119941 1128041 1137491 1148579 1159248 1167801 1175247 1183492 1192611 1201508 1210009 1218459 1226328 1232874
58328A232874N490M804L650K638L458N570O300N090M550O124P677O985M983L788
$$ 1232874 1238364 1243168 1246818 1249456 1252914 1258484 1264784 1269874 1274424 1280548 1288225 1295210 1300193 1303981
58314A303981L687L871M205M682M793M809N957Q201R666R428R033J0022J1707
$$ 1303981 1307668 1311539 1315744 1320426 1325219 1330028 1335985 1344186 1353852 1363280 1372313 1382335 1394042
58301A394042J2668J2669J1929J0245Q140P228Q064R172R204Q591Q139P739P452
$$ 1394042 1406710 1419379 1431308 1441553 1449693 1456921 1464985 1474157 1483361 1491952 1500091 1507830 1515282
58288A515282Q015R169R291P773O062N282M783M134M386N934P246P300P366Q683
$$ 1515282 1523297 1532466 1541757 1549530 1555592 1560874 1565657 1569791 1574177 1580111 1587357 1594657 1602023 1610706
58274A610706J0228J0576J0309J0669J1371J1685J2300J4128J6395J7862J9015
$$ 1610706 1620934 1631510 1641819 1652488 1663859 1675544 1687844 1701972 1718367 1736229 1755244
58263A755244K1088K3706K5336K5643K5730K6313K6945K6973K6325K5373K4627
$$ 1755244 1776332 1800038 1825374 1851017 1876747 1903060 1930005 1956978 1983303 2008676 2033303
58252B033303K4330K4190K3948K4039K4914K5945K6229K6186K6916K8136K8554
$$ 2033303 2057633 2081823 2105771 2129810 2154724 2180669 2206898 2233084 2260000 2288136 2316690
58241B316690K8119K7991K8405K8726K9568L2289L6105L8473L8955M0027M3165
$$ 2316690 2344809 2372800 2401205 2429931 2459499 2491788 2527893 2566366 2605321 2645348 2688513
58230B688513M6747M8945N0198N1558N2854N3814N5042N6711N7989N8503N8730
$$ 2688513 2735260 2784205 2834403 2885961 2938815 2992629 3047671 3104382 3162371 3220874 3279604
58219C279604N8695N8483N9883O4757P1511P6369P8421Q0149Q2860Q5457Q8259
$$ 3279604 3338299 3396782 3456665 3521422 3592933 3669302 3747723 3827872 3910732 3996189 4084448
58208D084448R3350R9969J04260J05558J08204J14730J21754J25767J28692J34208
$$ 4084448 4177798 4277767 4382027 4487585 4595789 4710519 4832273 4958040 5086732 5220940
58198E220940J42121J50214J58674J69001J80823J92950K05524K18565K30784
$$ 5220940 5363061 5513275 5671949 5840950 6021773 6214723 6420247 6638812 6869596
58189F869596K42008K54060K67323K79526K90067L01814L16438L31924L47262
$$ 6869596 7111604 7365664 7632987 7912513 8202580 8504394 8820832 9152756 9500018
58180I500018L65304L87969M12897M38302M66843N00891N37976N74896O12601
$$ 9500018 9865322 10253291 10666188 11104490 11571333 12072224 12610200 13185096 13797697
58171A3797697O53259O96406P41812P91959Q47746R05766R63719J024303J090252
$$ 13797697 14450956 15147362 15889174 16681133 17528879 18434645 19398364 20422667 21512919
58162B1512919J160316J233915J314147J401952J493249J586487J686751J797540
$$ 21512919 22673235 23907150 25221297 26623249 28116498 29702985 31389736 33187276
58154C3187276J915464K039004K175082K330806K506593K704656K935984L210793
$$ 33187276 35102740 37141744 39316826 41647632 44154225 46858881 49794865 53005658
58146E3005658L530538L898090M327204M833384N425912O118696O937017P902599
$$ 53005658 56536196 60434286 64761490 69594874 75020786 81139482 88076499 95979098
58138I5979098R026646J0330631J1854224J3619929J5603527J7759266K0059848
$$ 95979098 105005744 115336375 127190599 140810528 156414055 174173321 194233169
58131A94233169K2506480K5153991K8150817L1607622L5167033L7596665L7012681
$$ 194233169 216739649 241893640 270044457 301652079 336819112 374415777 411428458
58124D11428458L1881937K2111953R313702l969355j5420978k3717991k8629285
$$ 411428458 443310395 465422348 474736050 470766695 455345717 431627726 402998441
58117D02998441l0668875l0642724k9314325k7267478k4917508k2556316k0364727
$$ 402998441 372329566 341686842 312372517 285105039 260187531 237631215 217266488
58110B17266488j8416182j6705930j5187557j3793097j2452346j1121760r793170
$$ 217266488 198850306 182144376 166956819 153163722 140711376 129589616 119796446
58103A19796446q468367p141602n821663m552581l384292k329083j381639n97711
$$ 119796446 111328079 104186477 98364814 93812233 90427941 88098858 86717219 86119508
58095H6119508j30365j52931p22503j706181k833779l829645m523346m877456
$$ 86119508 85989143 85836212 85113709 83407528 80573749 76744104 72220758 67343302
58087F7343302m945948m815910m568383m261360l927719l585041l249132k937464
$$ 67343302 62397354 57581444 53013061 48751701 44823982 41238941 37989809 35052345
58079C5052345k660759k417395k199417k001027j819458j652352j498365j358179
$$ 35052345 32391586 29974191 27774774 25773747 23954289 22301937 20803572 19445393
58071A9445393j232125j118863j018070r31535q59216p96963p40415o88654o41920
$$ 19445393 18213268 17094405 16076335 15144800 14285584 13488621 12748206 12059552 11417632
58062A1417632n98613n57191n18472m83483m51081m20174l92200l68971l49879
$$ 11417632 10819019 10261828 9743356 9259873 8808792 8388618 7996418 7627447 7277568
58053G277568l33466l19849l09319l00164k90021k78018k64039k47709k29826
$$ 7277568 6944102 6624253 6314934 6014770 5724749 5446731 5182692 4934983 4705157
58044D705157k12874j98230j84535j70560j57633j47286j38395j28932j19052
$$ 4705157 4492283 4294053 4109518 3938958 3781325 3634039 3495644 3366712 3247660
58035C247660j10326j03293r7633r3499r0842q8558q5837q3106q0401p6444p0913
$$ 3247660 3137334 3034041 2936408 2842909 2752067 2663509 2577672 2494566 2414165 2337721 2266808
58024B266808o5798o2667o0285n6785n2709m9736m7810m5652m3117m0950l9023
$$ 2266808 2201010 2138343 2078058 2021273 1968564 1918828 1871018 1825366 1782249 1741299 1702276
58013A702276l6610l3811l1170k8681k6408k5077k4791k4316k2997k2007k2182
$$ 1702276 1665666 1631855 1600685 1572004 1545596 1520519 1495728 1471412 1448415 1426408 1404226
58002A404226k2157k0347j7503j5270j3507j1286r489r922j2233j3996j3720j2001
$$ 1404226 1382069 1361722 1344219 1328949 1315442 1304156 1294667 1284745 1272512 1258516 1244796 1232795
57990A232795r910q097p357q089r083q496o436n129o025p944q533o785l680j021
$$ 1232795 1222885 1214788 1207431 1199342 1190259 1181763 1175327 1170198 1164173 1156229 1147696 1140911 1137231 1136210
57976A136210Rm32j305j892k433l371m408m708l944k835k679m173o406p405o317
$$ 1136210 1136219 1135787 1134482 1132590 1130157 1126786 1122378 1117670 1113726 1110891 1108212 1104039 1097633 1090228 1083911
57961A083911m572l997m348m182l749m791p231q466p031m999n173p369r205r471
$$ 1083911 1079339 1075342 1070994 1066812 1063063 1058272 1051041 1042575 1035544 1030545 1025372 1018003 1008798 999327
57947I99327q956q623q613q817r087q954q163p400p669q889r670q658n958l328
$$ 999327 990371 981748 973135 964318 955231 946277 938114 930714 923045 914156 904486 895828 889870 886542
57933H86542k731m142n160l587r8K761L941M686O045P344P684P319O970O919P280
$$ 886542 883811 879669 874509 870922 870824 873585 877526 882212 888257 895601 903285 910604 917574 924493 931773
57918I31773P830P341M703R68j462k069k628l983m761m238l975n148o482o570
$$ 931773 939603 946944 951647 952615 951153 949084 946456 942473 937712 933474 929499 924351 917869 911299
57904I11299o264o896p899q146p987q006p260m969k643k265l412m302m679n449
$$ 911299 905035 898139 890240 882094 874107 866101 858841 853872 851229 848964 845552 841250 836571 831122
57890H31122o405o497n839n285m535k676j52J644K300K221J285m42j392j63J945
$$ 831122 824717 818220 812381 807096 802561 799885 799733 801377 803677 805898 807183 806741 805349 805186 807131
57875H07131K281N57j072j509j937l237m441m567m298m799o095p299p720p312
$$ 807131 809412 809969 808897 807388 805451 802214 797773 793206 788908 784109 778014 770715 762995 755683
57861G55683o591o305o600o742o100m889l381j222J486L471L852L565L880M474
$$ 755683 749092 742787 736187 729445 723345 718456 715075 713853 715339 718810 722662 726227 730107 734581
57847G34581M537M736O161Q170R287R575R992J0108Q782O653N377M628K565o76
$$ 734581 739118 743854 750015 758185 767472 777047 787039 797147 805929 812582 817959 822587 825152 824476
57833H24476k776k951l168m828o667p080o347n518n032n491p707j0761j1962j0153
$$ 824476 821700 818749 815581 810753 804086 797006 790659 785141 780109 774618 766911 756150 744188 734035
57819G34035p337n673m693l142j763j966k926k359K28L020M482M748M493L924
$$ 734035 726698 721025 716332 713190 711427 709461 706535 704176 704404 707424 711906 716654 721147 725071
57805G25071L258L072L668M678N498N753N392M708M156L851L462K764J919R53
$$ 725071 728329 731401 735069 739747 745245 750998 756390 761098 765254 769105 772567 775331 777250 778203
57791G78203n52k820n379p615r429j0892j1634j1173r719q274p792q366r158r103
$$ 778203 777651 774831 769452 761837 752408 741516 729882 718709 708990 700716 692924 684558 675400 666297
57777F66297p900o226m945m399m677n904p544q086o547m056k918m077o531r001
$$ 666297 658397 652171 647226 642827 638150 632246 624702 616616 610069 606013 603095 599018 592487 583486
57763E83486j0921j1817j1293j0065r592j0032r868q278o570o260o839o668n354
$$ 583486 572565 560748 549455 539390 529798 519766 509898 501620 495050 488790 481951 475283 469929
57750D69929l882k871j921o21P15J483J419Q57O42J494L052M082M121M343N987
$$ 469929 466047 463176 461255 460634 461349 462832 464251 465108 465750 467244 470296 474378 478499 482842 488829
57735D88829Q346R271P699M860K752J952J463M23o03l49J341L054L379K488J596
$$ 488829 497175 506446 514145 519005 521757 523709 525172 525595 524992 524643 525984 529038 532417 534905 536501
57720E36501J314J211P93l9j399l347n155n702m923m085m186m759m762l956k867
$$ 536501 537815 539026 539819 539780 538381 535034 529879 524177 519254 515169 510983 506224 501462 497506 494639
57705D94639k017j686j922k318k296j947j931k126j228J522M873O781O718N927
$$ 494639 492622 490936 489014 486696 484400 482453 480522 478396 477168 478690 483563 490344 497062 502989
57691E02989N702O272P269Q329Q942Q452O744M713L613L869M657M788M027L295
$$ 502989 508691 514963 522232 530561 539503 547955 554699 559412 563025 566894 571551 576339 580366 583661
57677E83661L486M422N280N742O196O986Q160R652J1132J1836J1454J0955J1474
$$ 583661 587147 591569 596849 602591 608787 615773 623933 633585 644717 656553 668007 678962 690436
57664F90436J2519J2551J1553J1457J3530J6610J8821J9741J9983J9782J9293
$$ 690436 702955 715506 727059 738516 752046 768656 787477 807218 827201 846983 866276
57653H66276J9256K0092K1036K1478K2398K4946K8302L0619L1808L3517L6396
$$ 866276 885532 905624 926660 948138 970536 995482 1023784 1054403 1086211 1119728 1156124
57642A156124L9128M0618M1493M2873M5160M8665N4039O0946O7512P2360P6510
$$ 1156124 1195252 1235870 1277363 1320236 1365396 1414061 1468100 1529046 1596558 1668918 1745428
57631A745428Q2006Q9225R6796J03986J11908J22131J34988J49558J64696J79829
$$ 1745428 1827434 1916659 2013455 2117441 2229349 2351480 2486468 2636026 2800722 2980551
57621B980551J95303K12061K30407K48877K64947K77167K86088K92488K95122
$$ 2980551 3175854 3387915 3618322 3867199 4132146 4409313 4695401 4987889 5283011
57612E283011K91047K78241K57250K29995J97313J57964J09782N1700j4530q3699
$$ 5283011 5574058 5852299 6109549 6339544 6536857 6694821 6804603 6856303 6841773 6758074
57602F758074j48192k00846k37986k60201k70446k71640k66050k55915k43434
$$ 6758074 6609882 6409036 6171050 5910849 5640403 5368763 5102713 4846798 4603364
57593D603364k29836k15228j99730j84242j69512j55070j40003j24654j10531
$$ 4603364 4373528 4158300 3958570 3774328 3604816 3449746 3309743 3185089 3074558
57584C074558r8326q6974p5238o3417n2676m3234l4192k4942j5836p394N05Q534
$$ 3074558 2976232 2889258 2814020 2750603 2697927 2654693 2620501 2595559 2579723 2572329 2572834 2581368
57572B581368J7478K7659L8300M7824N5708O3638P3772Q6014R8356J09776J21201
$$ 2581368 2598846 2626505 2664805 2712629 2768337 2831975 2905747 2991761 3090117 3199893 3321094
57561C321094J33304J45231J56358J67488J79041J89351J96239J99062J97770
$$ 3321094 3454398 3599629 3755987 3923475 4102516 4291867 4488106 4687168 4884938
57552D884938J91017J77067J55752J27851R3382N2676Q744l3818p2529j07781
$$ 4884938 5075955 5253022 5408774 5536625 5630007 5682683 5691427 5657609 5585080 5477299
57542E477299j39719j66431j85958j98440k05472k08629k09104k07505k03359
$$ 5477299 5337580 5171149 4985191 4786751 4581279 4372650 4163546 3956041 3752682
57533C752682j96027j86477j76810j67713j57970j47200j37131j29133j22056
$$ 3752682 3556655 3370178 3193368 3025655 2867685 2720485 2583354 2454221 2332165
57524B332165j14014j05091r6645q8979q1374p3834o7163o1542n6318n1071m5910
$$ 2332165 2218151 2113060 2016415 1927436 1846062 1772228 1705065 1643523 1587205 1536134 1490224
57513A490224m0889l6139l2253k9588k7436k4867k2130k0257j9352j8380j6578
$$ 1490224 1449335 1413196 1380943 1351355 1323919 1299052 1276922 1256665 1237313 1218933 1202355
57502A202355j4101j1197p735l915o41J387K560L876N776P828R468J0772J2210
$$ 1202355 1188254 1177057 1169322 1165407 1164766 1166153 1168713 1172589 1178365 1186193 1195661 1206433 1218643
57489A218643J3876J5374J6770J9008K2770K7211L0696L2679L4079L5934L8576
$$ 1218643 1232519 1247893 1264663 1283671 1306441 1333652 1364348 1397027 1431106 1467040 1505616
57478A505616M2085M6406N0879N4783N8579O3569P0135P7525Q5394R3936J02338
$$ 1505616 1547701 1594107 1644986 1699769 1758348 1821917 1892052 1969577 2054971 2148907 2251245
57467B251245J09234J15432J23817J35088J45814J52686J56683J60482J63276
$$ 2251245 2360479 2475911 2599728 2734816 2880630 3033316 3189999 3350481 3513757
57458C513757J61294J52586J38235J19030R4247O4307L1969k99l1928o2289q9134
$$ 3513757 3675051 3827637 3965872 4084902 4179149 4243456 4275425 4275126 4243198 4180909 4091775
57447D091775j10399j26177j37608j45009j48258j47999j45325j40865j35058
$$ 4091775 3981376 3855199 3717591 3572582 3424324 3276325 3131000 2990135 2855077
57438B855077j28618j21905j14463j05895r6717q7747p9260p1245o3875n7130
$$ 2855077 2726459 2604554 2490091 2384196 2287479 2199732 2120472 2049227 1985352 1928222
57428A928222n0475m3445l6103k8664k1321j4649r321m905J11O588J3718K0238
$$ 1928222 1877747 1834302 1798199 1769535 1748214 1733565 1724244 1719339 1719450 1726038 1739756 1759994
57416A759994K5877L1023L6007M1476M8539N7371O6362P3828Q0183Q7295R6045
$$ 1759994 1785871 1816894 1852901 1894377 1942916 2000287 2066649 2140477 2220660 2307955 2404000
57405B404000J05661J15241J24502J32895J39255J42943J44420J43887J39964
$$ 2404000 2509661 2624902 2749404 2882299 3021554 3164497 3308917 3452804 3592768
57396C592768J30553J14852R3935O9268M1286R817k4219n8047q8252j12853j32087
$$ 3592768 3723321 3838173 3932108 4001376 4042662 4052479 4028260 3970213 3881961 3769108 3637021
57385C637021j47249j58940j66486j69006j66984j62471j57453j52103j45251
$$ 3637021 3489772 3330832 3164346 2995340 2828356 2665885 2508432 2356329 2211078
57376B211078j36665j27961j20643j14187j07155r9612r2889q7133q0890p3533
$$ 2211078 2074413 1946452 1825809 1711622 1604467 1504855 1411966 1324833 1243943 1170410
57366A170410o6527o1393n7628n3672m8917m3776l8674l4141l1115k9838k9033
$$ 1170410 1103883 1042490 984862 931190 882273 838497 799823 765682 734567 704729 675696
57355F75696k7423k5413k3957k2429j9577j6232j4808j5650j6127j4368j2013
$$ 675696 648273 622860 598903 576474 556897 540665 525857 510207 494080 479712 467699
57344D67699j1557j2554j2466j0645r126r417j0442j0300q707o815n583n280n903
$$ 467699 456142 443588 431122 420477 411351 401934 391492 381192 372485 365670 360087 354807 348904
57331C48904p125q092q069p197o152n275m568m276m656n230n109m278l861m673
$$ 348904 341779 333687 325618 318421 312269 306994 302426 298150 293494 288264 283155 278877 275016 270343
57317B70343o009o412n336l560k118j358j078j138j624k518l392l509k472r38
$$ 270343 264334 257922 252586 249026 246908 245550 244472 243334 241710 239192 235800 232291 229819 228881
57303B28881l75j733m295o170o107m654l375l126l371l114k211j437j461k120
$$ 228881 228506 226773 222478 216308 210201 205547 202172 199046 195675 192561 190350 188913 187452 185332
57289A85332k781l090l075k793k153j142J59J706L337M545M753L864K344Q23n1
$$ 185332 182551 179461 176386 173593 171440 170298 170457 172163 175500 180045 184798 188662 191006 191829 191778
57274A91778L84K261M529N620N072M037L849M557N353N879O634Q263J0851J3688
$$ 191778 192162 194423 198952 204572 209644 213681 217530 222087 227440 233319 239953 248216 259067 272755
57260B72755J5542J5632J4618J4153J5121J6896J8577K0144K1744K2757K2555
$$ 272755 288297 303929 318547 332700 347821 364717 383294 403438 425182 447939 470494
57249D70494K1635K0768J9581J7228J4237J2345J2327J3285J4235J5227J6421
$$ 470494 492129 512897 532478 549706 563943 576288 588615 601900 616135 631362 647783
57238F47783J7303J7443J7348J7894J9388K1510K3628K4967K5287K5637K7577
$$ 647783 665086 682529 699877 717771 737159 758669 782297 807264 832551 858188 885765
57227H85765L1127L4337L5429L4655L3425L2618L2464L3113L3996L3314K9683
$$ 885765 916892 951229 986658 1021313 1054738 1087356 1119820 1152933 1186929 1220243 1249926
57216A249926K4223J9726J7541J6353J4175J0371N358m14o255j0885j3524j4995
$$ 1249926 1274149 1293875 1311416 1327769 1341944 1352315 1357673 1357259 1351004 1340119 1326595 1311600
57204A311600j6718j8749j9892j9873k0175k1958k4023k3893k0634j5573j0447
$$ 1311600 1294882 1276133 1256241 1236368 1216193 1194235 1170212 1146319 1125685 1110112 1099665
57193A099665n927k124O99K648M560P020R559J1493J2947J4158J4499J3328J1573
$$ 1099665 1093738 1091614 1092313 1094961 1099521 1106541 1116100 1127593 1140540 1154698 1169197 1182525 1194098
57180A194098J1005J2000J3162J3492J3736J5127J7764K0819K3763K6761L0214
$$ 1194098 1205103 1217103 1230265 1243757 1257493 1272620 1290384 1311203 1334966 1361727 1391941
57169A391941L4188L7941M0143M0258L9589M0003M1660M3269M4511M6549M9608
$$ 1391941 1426129 1464070 1504213 1544471 1584060 1624063 1665723 1708992 1753503 1800052 1849660
57158A849660N2061N3028N4156N7009O0147O0937N9379N7819N7370N7094N6690
$$ 1849660 1901721 1954749 2008905 2065914 2126061 2186998 2246377 2304196 2361566 2418660 2475350
57147B475350N7339N9219O0567O0438O0374O1860O3780O4186O3179O1998O0352
$$ 2475350 2532689 2591908 2652475 2712913 2773287 2835147 2898927 2963113 3026292 3088290 3148642
57136C148642N6946N2297M8538M6318M4130M1255L9065L8190L6562L2181K6594
$$ 3148642 3205588 3257885 3306423 3352741 3396871 3438126 3477191 3515381 3551943 3584124 3610718
57125C610718K3238K2912K3116K1935K0376K0125K0862K1115K0557K0028J9840
$$ 3610718 3633956 3656868 3679984 3701919 3722295 3742420 3763282 3784397 3804954 3824982 3844822
57114C844822J9554J9078J8860J8904J8527J7262J5244J2608R207N079N30m301
$$ 3844822 3864376 3883454 3902314 3921218 3939745 3957007 3972251 3984859 3994066 3999145 3999675 3995374
57102C995374r429j4364j8182k0581k2232k3886k5661k7534k9872l2896l5991
$$ 3995374 3985945 3971581 3953399 3932818 3910586 3886700 3861039 3833505 3803633 3770737 3734746
57091C734746l8136l8819l8104l6136l3092k9597k6708k5555k7256l2828m2691
$$ 3734746 3696610 3657791 3619687 3583551 3550459 3520862 3494154 3468599 3441343 3408515 3365824
57080C365824n6165p1939q9054j07202j26178j45480j64467j82522j99180k14587
$$ 3365824 3309659 3237720 3148666 3041464 2915286 2769806 2605339 2422817 2223637 2009050
57070B009050k29968k47022k66549k88024l10630C32727b5815l83894m11188m42984
$$ 2009050 1779082 1532060 1265511 977487 666857 332727 -25815 -409709 -820897 -1263881
57060a263881m81751n27779n79770o37276p01332p72831q52038r40266j040291
$$ -1263881 -1745632 -2273411 -2853181 -3490457 -4191789 -4964620 -5816658 -6756924 -7797215
57051g797215j154087j281665j423604j583438j766263j976425k218588k499953
$$ -7797215 -8951302 -10232967 -11656571 -13240009 -15006272 -16982697 -19201285 -21701238
57043b1701238k829436l215776l669235m205097m843767n607883o520365p602032
$$ -21701238 -24530674 -27746450 -31415685 -35620782 -40464549 -46072432 -52592797 -60194829
57035f0194829q865431j0308547j1914824j3658418j5511181j7450387j9455572
$$ -60194829 -69060260 -79368807 -91283631 -104942049 -120453230 -137903617 -157359189
57028a57359189k1471927k3353301k4861467k5779343k6057817k5821212k5180135
$$ -157359189 -178831116 -202184417 -227045884 -252825227 -278883044 -304704256 -329884391
57021c29884391k4037536k2115448j9187222j5268340j0590064n443660r0754
$$ -329884391 -353921927 -376037375 -395224597 -410492937 -421083001 -426526661 -426617415
57014d26617415N211584J0181689J4558229J8168601K0941002K2862926K3947392
$$ -426617415 -421405831 -411224142 -396665913 -378497312 -357556310 -334693384 -310745992
57007c10745992K4239927K3845311K2936061K1722610K0394931J9071136J7788129
$$ -310745992 -286506065 -262660754 -239724693 -218002083 -197607152 -178536016 -160747887
57000a60747887J6534832J5293601J4059735J2840425J1649424J0503211R416350
$$ -160747887 -144213055 -128919454 -114859719 -102019294 -90369870 -79866659 -70450309
56993g0450309Q398244P454520O589390N804899N100054M472951L921977L442936
$$ -70450309 -62052065 -54597545 -48008155 -42203256 -37103202 -32630251 -28708274 -25265338
56985b5265338L027093K664544K348240K073081J833188J622675J437791J275930
$$ -25265338 -22238245 -19573701 -17225461 -15152380 -13319192 -11696517 -10258726 -8982796
56977h982796J133585J007398Q96100P99288P15145O41308N76886N21519M73273
$$ -8982796 -7849211 -6841813 -5945713 -5146425 -4431280 -3789972 -3213086 -2691567 -2218294
56968b218294M29710L90469L56697L28262L03456a28565A32715K43519K26616
$$ -2218294 -1788584 -1398115 -1041418 -713156 -409700 -128565 132715 376234 602850
56959F02850K09618J92042J73390J53719J34243J15880R7551P7674N6932L7677
$$ 602850 812468 1004510 1177900 1331619 1465862 1581742 1679293 1756967 1813899 1851576
56949A851576K0659M427j1579k5348l4718l9883m1937l9870l1159j6362k515n38
$$ 1851576 1872235 1876662 1865083 1839735 1805017 1765134 1723197 1683327 1652168 1635806 1633291 1632753
56937A632753j7886n2822r5620j35094j64046j79963j83322j76647j63966j49106
$$ 1632753 1614867 1562045 1466425 1331331 1167285 987322 804000 627353 463387 314281
56927C14281j34249E9684d8443r7814q8712q0309p3228o8230o4846o1966n9220
$$ 314281 180032 59684 -48443 -146257 -234969 -315278 -388506 -456736 -521582 -583548 -642768
56916f42768n6708n3995n0577m6732m2676l7509l0448k2589j5776r982l542L990
$$ -642768 -699476 -753471 -804048 -850780 -893456 -930965 -961413 -984002 -999778 -1009760 -1013302 -1009312
56904a009312J0973J5979J9454K2557K5756K9123L2844L6522L8767L8225L4668
$$ -1009312 -998339 -982360 -962906 -940349 -914593 -885470 -852626 -816104 -777337 -739112 -704444
56893g04444K8929K2308J6175J1420Q051N792M906N600O909P410P112P360Q515
$$ -704444 -675515 -653207 -637032 -625612 -617561 -611769 -606863 -601263 -594354 -586944 -579832 -572472 -563957
56880e63957R177Q442P724R104J2584J6141J8419K0298K3470K7899L1243L0990
$$ -563957 -554780 -546338 -538614 -529510 -516926 -500785 -482366 -462068 -438598 -410699 -379456 -348466
56868c48466K6907K0885J4471P568N2o498j0129j1029j1201j1735j1879j0967
$$ -348466 -321559 -300674 -286203 -278635 -278583 -285081 -295210 -306239 -317440 -329175 -341054 -352021
56856c52021r716r016q745q364p760o872n497m064l550l995m048k771j087m41
$$ -352021 -361737 -370753 -379498 -387862 -395622 -402494 -407991 -412055 -415605 -419600 -423648 -426419 -427506 -427947
56842d27947q10r44j10J365K857L867M088L872M504P102J1237J5254J7999J9795
$$ -427947 -428757 -429701 -429811 -428446 -425589 -421722 -417634 -413762 -409258 -402156 -390919 -375665 -357666 -337871
56828c37871K1684K4131K6652K8500K9536L0213L0578K9756K7011K3116J9754
$$ -337871 -316187 -292056 -265404 -236904 -207368 -177155 -146577 -116821 -89810 -66694 -46940
56817d6940J7491a4081a286I505J0608J1946J3438J4335J4874J5458J6310J7749
$$ -46940 -29449 -14081 -1286 9505 20113 32059 45497 59832 74706 90164 106474 124223
56805A24223J9937K2361K4269K5769K7947L1609L5974L8762L7736L2345K3826
$$ 124223 144160 166521 190790 216559 244506 276115 312089 350851 388587 420932 444758
56794D44758J3666K574q480j7078k0726j9645j6759j4444j2533r940o666l042
$$ 444758 458424 460998 452518 435440 414714 395069 378310 363866 351333 341393 334727 331685
56782C31685J630P994J4978K0831K5532L0846L8020M6558N4929O1195O2958N8027
$$ 331685 333315 341309 356287 377118 402650 433496 471516 518074 573003 634198 697156 755183
56770G55183M5898K8332Q663r259k2375k9977l3801l5696l5627l2897k8494k4540
$$ 755183 801081 829413 838076 828817 806442 776465 742664 706968 671341 638444 609950 585410
56758E85410k1622j8449j4315j0013n900q11O073J3598J9984K4896K9083L2568
$$ 585410 563788 545339 531024 521011 515111 514300 520373 533971 553955 578851 607934 640502
56746F40502L4015L1572K3990J1747k465j5187k4742l1735l6779l9012l7686l4046
$$ 640502 674517 706089 730079 741826 739361 724174 699432 667697 630918 591906 554220 520174
56734E20174l0215k6944k3712k0485j7865j5660j2768q672m119qL557O959J0405
$$ 520174 489959 463015 439303 418818 400953 385293 372525 363853 359734 359726 363283 370242 380647
56721C80647J3619J5709J5488J2473P452J459n284j2509j8411k0754j9698j8101
$$ 380647 394266 409975 425463 437936 445388 446847 441563 429054 410643 389889 370191 352090
56709C52090j8187j9039j8335j5698j3141j2501j3544j4625j4415j2774j0436
$$ 352090 333903 314864 296529 280831 267690 255189 241645 227020 212605 199831 189395
56698A89395q123n966l794j928j178j778k823l244l004k735k532j910q99l52q31
$$ 189395 181272 175306 171512 169584 168406 166628 163805 160561 157557 154822 152290 150380 149481 149129 148298
56683A48298j806k242j670m74M40J58j478l375m103l666l660m930n928m635j728
$$ 148298 146492 144250 142580 142106 142546 142704 141226 137851 133748 130082 126422 121492 115564 110929 109201
56668A09201j12j048k423k012q90j857n089p526o856m212k058r27K84J839K662
$$ 109201 109089 108041 105618 103606 102716 100859 95770 88244 81388 77176 75118 74191 74475 76314 78976
56653G8976K110Q40l59j368k154k324j833j360j459j803j683q36M78J771K335
$$ 78976 81086 81926 81567 80199 78045 75721 73888 72528 71069 69266 67583 66747 67225 68996 71331
56638G1331J622P3r23m69P90J610J711J684J720J418P88N47J046J594J305K31
$$ 71331 72953 73026 72103 71634 72424 74034 75745 77429 79149 80567 81355 81902 82948 84542 85847 86078
56622H6078o73n97M04J612K379K615K568K403K247K520L581M854N085M002L013
$$ 86078 85405 84808 85212 86824 89203 91818 94386 96789 99036 101556 105137 109991 115076 119078 122091
56607A22091L436M612M862L842K711K147J644R65P96J360J658Q78n17j794l067
$$ 122091 125527 130139 135001 138843 141554 143701 145345 146310 147106 148466 150124 151002 150485 148691 145624
56592A45624m422m918l632j210P25J291O81o92k230k850j825K8R94K46j656l624
$$ 145624 141202 136284 132652 131442 132167 133458 134139 133447 131217 128367 126542 126570 127564 127810 126154 122530
56576A22530m636l924j792J23N30J72N85J548J466K12l06R76K592K785J991J806
$$ 122530 117894 113970 112178 112301 112831 113003 113588 115136 116602 116814 116508 117484 120076 122861 124852 126658
56560A26658K512K982K565J763J238J017P33Q0r04j671j618q51n4M68R33J120
$$ 126658 129170 132152 134717 136480 137718 138735 139468 139548 138644 136973 135355 134504 134450 134918 135851 136971
56544A36971L71r24j022Q99L117L347J697L24M12J022R76N02M80R78J294Q96j67
$$ 136971 137342 136418 135396 136295 139412 142759 144456 144780 145192 146214 147190 147692 148172 149150 150444 151340 151173
56527A51173j420k151j687J19K571M450M765L546J846Q33P58J029J207J353J454
$$ 151173 149753 147602 145915 146034 148605 153055 157820 161366 163212 164045 164803 165832 167039 168392 169846
56512A69846J331J331K152L608M537M607N041O554P647O547M122L062M262N838
$$ 169846 171177 172508 174660 178268 182805 187412 192453 199007 206654 213201 217323 220385 224647 230485
56498B30485O022N391N449O316O859O341N011L461K175J577J874K755L462L287
$$ 230485 236507 241898 247347 253663 260522 266863 271874 275335 277510 279087 280961 283716 287178 290465
56484B90465K151P67J2n9k47j013j870k414l175m510n350m374k138o27p73j711
$$ 290465 292616 293383 293395 293336 293089 292076 290206 287792 284617 280107 274757 270383 268245 267618 266845 265134
56468B65134k496l049l168k283p98j63q23j365o88K04l05k132l765m163l333j768
$$ 265134 262638 259589 256421 254138 253340 253177 252354 250989 250301 250505 250200 248068 244303 240140 236807 235039
56452B35039l69k25j336k123j284L46R16Q6q75j098r22p49m83k04l14p04p48l46
$$ 235039 234670 234445 233109 230986 229702 230048 230964 231050 230175 229077 228155 227406 226923 226719 226405 225701 224953 224607
56434B24607j32m31p59n66J63J176K035J975O31q99p83J226L171L222J956J440
$$ 224607 224475 224044 223285 222719 222882 224058 226093 228068 228699 227800 227017 228243 231414 234636 236592 238032
56418B38032K527L908L904K490J301J847L943O035O951O960O858O597N647M410
$$ 238032 240559 244467 248371 250861 252162 254009 257952 263987 270938 277898 284756 291353 297000 301410
56404C01410M161N334O879P710P960Q165Q073P193N934N238N274N334M905M117
$$ 301410 305571 310905 317784 325494 333454 341619 349692 356885 362819 368057 373331 378665 383570 387687
56390C87687L251K483K004J692P98j242l664m957m650l720l058k544k047k258
$$ 387687 390938 393421 395425 397117 397915 396673 393009 388052 383402 379682 376624 374080 372033 369775
56376C69775l689n505o332n873m948m246l809l482l133k596k074k268l296l873
$$ 369775 366086 360581 354249 348376 343428 339182 335373 331891 328758 326162 324088 321820 318524 314651
56362C14651k764r11o78k652m596m257k114m04l87j586l074m241m619m002k753
$$ 314651 311887 310976 310298 307646 303050 298793 296679 296275 295888 294302 291228 286987 282368 278366 275613
56347B75613j429k39N94N24m93j324r32J9jr36r95P85K967L445J965K20j21J067
$$ 275613 274184 273945 274539 275063 274570 273246 272314 272333 272332 271396 270401 271186 274153 277598 279563 279783 279662 280729
56329B80729K509K747J486j08o05J56J075J300J034P23K24o58j320q25Q37K497
$$ 280729 283238 285985 287471 287363 286758 286914 287989 289289 290323 291046 291270 290612 289292 288467 289304 291801
56313B91801L040K593K257K695L434L822M175N128O057N432L162J311J593L221
$$ 291801 294841 297434 299691 302386 305820 309642 313817 318945 325002 330434 333596 334907 336500 339721
56299C39721M373M757N198N614N248M470M374M721M234K991K396K606K164P88
$$ 339721 344094 348851 354049 359663 364911 369381 373755 378476 382710 385701 388097 390703 392867 393655
56285C93655K34J480L165M037M842O266O996N797L926L310L566L089K088K243
$$ 393655 393889 395369 398534 402571 407413 413679 420675 426472 430398 433708 437274 440363 442451 444694
56271D44694L829N452O435P335Q141Q082P476P927J0056J2530J3829J3762J2897
$$ 444694 448523 453975 460410 467745 475886 483968 491444 499371 509427 521957 535786 549548 562445
56258E62445J1712J0763J0712J1626J2999J4472J5808J6386J5832J5005J5049
$$ 562445 574157 584920 595632 607258 620257 634729 650537 666923 682755 697760 712809
56247G12809J5499J4814J2958J1762J2196J2819J2004J0309R415R644R940R859
$$ 712809 728308 743122 756080 767842 780038 792857 804861 815170 824585 834229 844169 854028
56235H54028J0152J1317J2641J3057J2498J1924J2271J3630J5528J7686K0198
$$ 854028 864180 875497 888138 901195 913693 925617 937888 951518 967046 984732 1004930
56224A004930K2962K5473K7484K9508L2225L5683L9428M3155M6724M9866N2450
$$ 1004930 1027892 1053365 1080849 1110357 1142582 1178265 1217693 1260848 1307572 1357438 1409888
56213A409888N4910N7990O2213O7862P5047Q3358R1944J00456J09435J19263J29374
$$ 1409888 1464798 1522788 1585001 1652863 1727910 1811268 1903212 2003668 2113103 2232366 2361740
56202B361740J39268J49717J61974J76126J91082K05759K19495K31782K42647
$$ 2361740 2501008 2650725 2812699 2988825 3179907 3385666 3605161 3836943 4079590
56193D079590K52736K62009K68764K71091K68851K62949K52999K37314K15165
$$ 4079590 4332326 4594335 4863099 5134190 5403041 5665990 5918989 6156303 6371468
56184F371468J87769J56867J23565Q8617N2823J6977j7713m9295p6255r8905j18623
$$ 6371468 6559237 6716104 6839669 6928286 6981109 6998086 6980373 6931078 6854823 6755918 6637295
56173F637295j35912j50231j61290j69259j74139j76446j78012j80367j82557
$$ 6637295 6501383 6351152 6189862 6020603 5846464 5670018 5492006 5311639 5129082
56164E129082j82556j80645j79274j79330j78962j76709j73666j71346j69259
$$ 5129082 4946526 4765881 4586607 4407277 4228315 4051606 3877940 3706594 3537335
56155C537335j65811j60304j53099j45000j37327j31260j26322j20715j13851
$$ 3537335 3371524 3211220 3058121 2913121 2775794 2644534 2518212 2397497 2283646
56146B283646j07157j01643r6210q9477q1925p5066o9452o4559n9680n4193m7838
$$ 2283646 2176489 2074846 1978636 1889159 1807234 1732168 1662716 1598157 1538477 1484284 1436446
56135A436446m1475l6577l3423l0910k8423k6395k4564k1697j8025j5887j6494
$$ 1436446 1394971 1358394 1324971 1294061 1265638 1239243 1214679 1192982 1174957 1159070 1142576
56124A142576j7735j6889j4095j1324r166o666l588r30N96J300K004L669O818
$$ 1142576 1124841 1107952 1093857 1082533 1073367 1066701 1063113 1062183 1062779 1064079 1066083 1069752 1076570
56111A076570J0448J2457J2180J1571J2773J5548J8215J9969K0909K0899K0022
$$ 1076570 1087018 1099475 1111655 1123226 1135999 1151547 1169762 1189731 1210640 1231539 1251561
56100A251561J9324J9612K0070J9508J8220J7360J7241J7556J8382J9550J9984
$$ 1251561 1270885 1290497 1310567 1330075 1348295 1365655 1382896 1400452 1418834 1438384 1458368
56089A458368J9301J9284K1990K7016L2321L7302M3274N1242O0696P0542P9938
$$ 1458368 1477669 1496953 1518943 1545959 1578280 1615582 1658856 1710098 1770794 1841336 1921274
56078A921274Q8500R6779J05982J16134J25253J31444J34894J36377J35005J29421
$$ 1921274 2009774 2106553 2212535 2328669 2453922 2585366 2720260 2856637 2991642 3121063
56068C121063J20450J10693J01934R4527Q8380Q2527P4466O2285M7111L1477J5940
$$ 3121063 3241513 3352206 3454140 3548667 3637047 3719574 3794040 3856325 3903436 3934913 3950853
56057C950853k86j5924k8032l6236m3921n4315o7490q1847r6270j09610j19979
$$ 3950853 3950567 3934643 3906611 3870375 3826454 3772139 3704649 3622802 3526532 3416922 3296943
56046C296943j26078j28223j27171j23061j16230j07938r9357r0647q1642p2611
$$ 3296943 3170865 3042642 2915471 2792410 2676180 2568242 2468885 2378238 2296596 2223985
56036B223985o3785n5014m6470l9062l3590k9949k7364k5046k2544j9867j7337
$$ 2223985 2160200 2105186 2058716 2019654 1986064 1956115 1928751 1903705 1881161 1861294 1843957
56025A843957j5083j3119j1953j2063j2236r966m822M2J594R83J601M063N918
$$ 1843957 1828874 1815755 1803802 1791739 1779503 1769537 1764715 1764757 1766351 1767334 1768935 1772998 1778916
56012A778916O095O583Q970J1991J3786J4597J5808J7687J9397K0319K0422K0093
$$ 1778916 1785011 1791594 1800564 1812555 1826341 1840938 1856746 1874433 1893830 1914149 1934571 1954664
56000A954664K0263K1909K4798K7441K8838K9572L0800L2838L5149L7199L8955
$$ 1954664 1974927 1996836 2021634 2049075 2077913 2107485 2138285 2171123 2206272 2243471 2282426
55989B282426M0808M3060M5341M6759M7006M6795M6820M6976M7143M7942M9828
$$ 2282426 2323234 2366294 2411635 2458394 2505400 2552195 2599015 2645991 2693134 2741076 2790904
55978B790904N2268N4715N7528O1055O4650O7690P0658P4185P8064Q2136Q6904
$$ 2790904 2843172 2897887 2955415 3016470 3081120 3148810 3219468 3293653 3371717 3453853 3540757
55967C540757R2116R6288R9021J02291J07709J14025J19250J23696J28936J35288
$$ 3540757 3632873 3729161 3828182 3930473 4038182 4152207 4271457 4395153 4524089 4659377
55957D659377J42502J51323J61956J72511J81497J90435K01445K13770K25326
$$ 4659377 4801879 4953202 5115158 5287669 5469166 5659601 5861046 6074816 6300142
55948F300142K36001K46518K55944K63668K72139K84079K98495L13090L28818
$$ 6300142 6536143 6782661 7038605 7302273 7574412 7858491 8156986 8470076 8798894
55939H798894L48086L70127L92762M17262M46655M80159N14137N47789N83298
$$ 8798894 9146980 9517107 9909869 10327131 10773786 11253945 11768082 12315871 12899169
55930A2899169O21319O61176P04480P53301Q05524Q57503R10426R68547J032142
$$ 12899169 13520488 14181664 14886144 15639445 16444969 17302472 18212898 19181445 20213587
55921B0213587J098305J167778J244318J327792J414782J505680J604362J711308
$$ 20213587 21311892 22479670 23723988 25051780 26466562 27972242 29576604 31287912
55913C1287912J824576J947158K085693K242593K418054K619180K857710L139291
$$ 31287912 33112488 35059646 37145339 39387932 41805986 44425166 47282876 50422167
55905E0422167L465468L845956M297838M833184N460293O196967P068144Q090635
$$ 50422167 53887635 57733591 62031429 66864613 72324906 78521873 85590017 93680652
55897I3680652R276104J0647535J2232193J4040019J6077646J8386463K1029464
$$ 93680652 102956756 113604291 125836484 139876503 155954149 174340612 195370076
55890A95370076K4022391K7294227L0674108L3768042L5727703L5236288L1024701
$$ 195370076 219392467 246686694 277360802 311128844 346856547 382092835 413117536
55883D13117536K2709476J1282494j207413j2554062k1229370k6706973k9286958
$$ 413117536 435827012 447109506 445902093 433348031 412118661 385411688 356124730
55876C56124730k9694143k8705971k6942783k4827845k2634150k0528485j8592448
$$ 356124730 326430587 297724616 270781833 245953988 223319838 202791353 184198905
55869A84198905j6847269j5285938j3889758j2629285j1471894j0396369r394426
$$ 184198905 167351636 152065698 138175940 125546655 114074761 103678392 94283966
55862I4283966q459901p586943o778391o044755n391384m813284m302926l855251
$$ 94283966 85824065 78237122 71458731 65413976 60022592 55209308 50906382 47051131
55854D7051131l463630l118613k813322k544877k309249k100157j914168j751524
$$ 47051131 43587501 40468888 37655566 35110689 32801440 30701283 28787115 27035591
55846B7035591j610641j486474j375390j277135j190858j113345j041973r75674
$$ 27035591 25424950 23938476 22563086 21285951 20095093 18981748 17939775 16964101
55838A6964101r12422q49742p88361p31724o81338o35980n95251n59996n28840
$$ 16964101 16051679 15201937 14413576 13681852 13000514 12364534 11769283 11209287 10680447
55829A0680447m98453m68078m40216m16084l93947l72795l54127l38763l24874
$$ 10680447 10181994 9713916 9273700 8857616 8463669 8090874 7736747 7397984 7073110
55820G073110l10614k96394k83357k71507k60212k48986k37358k25479k14604
$$ 7073110 6762496 6466102 6182745 5911238 5651026 5402040 5164682 4939203 4724599
55811D724599k05526j96978j87376j77311j68167j59322j49098j37654j26280
$$ 4724599 4519073 4322095 4134719 3957408 3789241 3629919 3480821 3343167 3216887
55802C216887j14731j02102q9593p9479p1961o5893o1881o1409o3485o5462o6727
$$ 3216887 3102156 3000054 2910461 2830982 2759021 2693128 2631247 2569838 2506353 2440891 2374164
55791B374164o8240o8994o6863o2835o0385o0033n8349n3249m6804m1683l7993
$$ 2374164 2305924 2236930 2170067 2107232 2046847 1986814 1928465 1875216 1828412 1786729 1748736
55780A748736l4808l1924k8843k4597j9674j5898j3782j2223j1077j1238j1963
$$ 1748736 1713928 1682004 1653161 1628564 1608890 1592992 1579210 1566987 1555910 1544672 1532709
55769A532709j1380j0227j1631j6131k0341k1988k2902k5216k7829k8937k9330
$$ 1532709 1521329 1511102 1499471 1483340 1462999 1441011 1418109 1392893 1365064 1336127 1306797
55758A306797l0599l2091l2132l0729k8943k6931k4510k2424k1279k0250j8333
$$ 1306797 1276198 1244107 1211975 1181246 1152303 1125372 1100862 1078438 1057159 1036909 1018576
55747A018576j5939j4043j2839j2163j1995j1691j0067p171m558l057j970j174
$$ 1018576 1002637 988594 975755 963592 951597 939906 929839 922668 918110 915053 913083 911909
55735I11909j894m241o151o387o509q094r925j0141r598j0437j2339j2830j1066
$$ 911909 910015 905774 899623 893236 886727 878633 868708 858567 848969 838532 826193 813363 802297
55722H02297r054q817r905j0219q374n072k613k893n566q527j0263j0999j1482
$$ 802297 793243 784426 774521 764302 755928 750856 748243 745350 739784 731257 720994 709995 698513
55709F98513j1949j2569j3628j4616j4426j3044j1688j0821r624q146q045r996
$$ 698513 686564 673995 660367 645751 631325 618281 606593 595772 586148 578002 569957 559961
55697E59961j2157j2723j2403j2732j3459j3445j2867j2493j1805r910p547o092
$$ 559961 547804 535081 522678 509946 496487 483042 470175 457682 445877 435967 428420 422328
55685D22328n163l343r56p5j639m345o458p256o716n312m136l849l527k021k85
$$ 422328 417165 413822 412866 412791 411152 406807 400349 393093 386377 381065 376929 373080 369553 367532 367247
55670C67247n14k768m502m095k916k853l565l732l724m913o886p446n729l638
$$ 367247 366733 363965 359463 355368 352452 349599 346034 342302 338578 333665 326779 319333 313604 309966
55656C09966l355m560n203m217k315n16Q82J811K129K156K600L398L582K822K160
$$ 309966 306611 302051 296848 292631 290316 289800 290682 292493 294622 296778 299378 302776 306358 309180 311340
55641C11340K320K360J147n85j130l07N49P97J075J651J911J842K479M201N940
$$ 311340 313660 316020 317167 316582 315452 315145 315694 316491 317566 319217 321128 322970 325449 329650 335590
55626C35590O697O766O731O441N692N031N052N546N856N452L899J231j322k169
$$ 335590 342287 349053 355784 362225 367917 372948 378000 383546 389402 394854 398753 399984 398662 396493
55612C96493j543j563l412n629o135m873l299k238j490r45p57p88q55j205j864
$$ 396493 394950 393387 389975 384346 378211 373338 370039 367801 366311 365366 364609 363821 362966 361761 359897
55597C59897j899m10J917L256K686J189M96J324K734L059J534r56k948m017m688
$$ 359897 357998 357588 359505 362761 365447 366636 367132 368456 371190 374249 375783 374827 371879 367862 363174
55582C63174n073m773m217m749o755q883r780r682r497r413r323r605j0350j0564
$$ 363174 358101 353328 349111 344362 337607 328724 318944 309262 299765 290352 281029 271424 261074 250510
55568B50510r369p494o520o991q149r087r182p878n156k243q61j584l334m456
$$ 250510 241141 233647 227127 220136 211987 202900 193718 185840 180684 178441 177580 175996 172662 168206
55554A68206m028k456j139j243k493l523l417k346p12J206K534K064l7j958k487
$$ 168206 164178 161722 160583 159340 156847 153324 149907 147561 146849 148055 150589 152653 152616 150658 148171
55539A48171k391k694k856k055j144j654l386m619m432l321j806P5J774K167R83
$$ 148171 145780 143086 140230 138175 137031 135377 131991 127372 122940 119619 117813 117888 119662 121829 122812
55524A22812o49j538j596j462j502j553j307p78m00n75j069j198q11n52q91j331
$$ 122812 122163 120625 119029 117567 116065 114512 113205 112427 112027 111452 110383 109185 108374 107822 106931 105600
55508A05600j021K73K021L362L587K732J810J668J671N26j450k296j085Q00J582
$$ 105600 104579 104852 106873 110235 113822 116554 118364 120032 121703 122229 120779 118483 117398 118198 119780
55493A19780R25q24l489o100o655m405j202P23J196J152P78J46K78J607K660K199
$$ 119780 120705 119881 116392 110292 103637 99232 98030 98753 99949 101101 101879 102025 102303 103910 106570 108769
55477A08769J453K094L231K883J538J317K259K348J104K15L66L55j68J66J698
$$ 108769 110222 112316 115547 118430 119968 121285 123544 125892 126996 127211 127577 127932 127764 127930 129628
55462A29628K746K456K243L124L839L093J777J269J141K32j330k765m100n517
$$ 129628 132374 134830 137073 140197 144036 147129 148906 150175 151316 151548 150218 147453 143353 137836
55448A37836o174n372m091l850m642n363n743o373p141p072n781m019k714k215
$$ 137836 131662 126290 122199 118349 113707 108344 102601 96228 89087 82015 76234 72215 69501 67286
55434F7286k527l461m412m571l570j818k84J20o61j552j396m18L2n89j200p00
$$ 67286 64759 61298 56886 52315 48745 46927 46643 46763 46102 44550 43154 42736 42768 42179 40979 40279
55418D0279M35R00L87j31K30J212J655O00j665l539l529j829n9O33N28L78L62
$$ 40279 40714 41614 42001 41870 42100 43312 44967 45567 43902 40363 36834 35005 34946 35579 36107 36485 36847
55401C6847L72M81N47P8r94j869j766r04j53j55j077k677m289n186n225m687l572
$$ 36847 37219 37700 38247 38325 37331 35462 33696 32792 32639 32484 31407 28730 24441 19255 14030 9343 5771
55384E771j778M4R74J243J874K601J820n68k056p60J700K393J025l82r63j610
$$ 5771 3993 4037 5011 6254 8128 10729 12549 11981 9925 9165 10865 13258 14283 13901 12938 11328
55368A1328k315j570Q26K703K467J383J384K067J687J96p73o76q17j989k920k042
$$ 11328 9013 7443 8269 10972 13439 14822 16206 18273 19960 20156 19383 18707 17890 15901 12981 10939
55352A0939J91J803J634L37o07j97J542L604M525L585J558j35r67j446j806j460
$$ 10939 11130 12933 14567 14904 14297 14100 15642 19246 23771 27356 28914 28779 27812 26366 24560 23100
55336B3100r1J431J867Q91q14k322k886k160o57M09L69j38j60K20K42j71k66M42
$$ 23100 23009 24440 26307 27198 26384 24062 21176 19016 18359 18768 19137 18999 18839 19059 19301 19130 18864 19306
55318A9306J660K736K902J500j219l612m019k600q98K26J096J695J233l45j722
$$ 19306 20966 23702 26604 28104 26885 23273 19254 16654 15756 15982 17078 18773 20006 19661 17939
55303A7939j902j531j673k079j694k59J391K324K067O76j097k014j454q6J070
$$ 17939 16037 14506 12833 10754 9060 8801 10192 12516 14583 15259 14162 12148 10694 10608 11678
55288A1678J854K655L307L114J847J58j098j565j493j467j868k436k592k314k175
$$ 11678 13532 16187 19494 22608 24455 24613 23515 21950 20457 18990 17122 14686 12094 9780 7605
55273G605k207j565M4J329P86j101k223A267L50J439J583J548J700J602Q30m39
$$ 7605 5398 3833 3877 5206 5992 4891 2668 1267 1617 3056 4639 6187 7887 9489 10319 9880
55257I880j649k291k065j034K81J243J649J747J607R43k12r91n44O97J368R13
$$ 9880 8231 5940 3875 2841 3122 4365 6014 7761 9368 10311 10099 9108 8564 9261 10629 11542
55241A1542K99N99J487J787J013k85j396j917j662p93O9N51J092K060K629J619
$$ 11542 11841 12440 13927 15714 16727 16442 15046 13129 11467 10674 10743 11294 12386 14446 17075 18694
55225A8694m99j707r32N52Q58j58j013n69P89J794J594N38k31k2N46L21q58j939
$$ 18694 18195 16488 15556 16108 16966 16808 15795 15226 16015 17809 19403 19941 19710 19688 20234 20555 19697 17758
55207A7758j961r46N47J972K757K473J444M69k77j340k716l376k619j073L16J446
$$ 17758 15797 14851 15398 17370 20127 22600 24044 24513 24236 22896 20180 16804 14185 13112 13428 14874
55191A4874K424K589J306o27j544q32N13J241R77M0r58j236k54J530K761K520
$$ 14874 17298 19887 21193 20566 19022 18190 18703 19944 20921 20961 20003 18767 18513 20043 22804 25324
55175B5324J392Q52J518K301J572q39l197l673k347q94m83o53m33K07M63j20j059
$$ 25324 26716 27568 29086 31387 32959 32120 28923 25250 22903 22009 21526 20873 20440 20647 21110 20990 19931
55158A9931j450q41L12J072J015O82O70O30j46j216j045R79L394M083K436k63
$$ 19931 18481 17640 17952 19024 20039 20721 21391 22021 21875 20659 19614 20593 23987 28070 30506 30243
55142C0243k198k386j150L66J299J837K649L578L560K025k42j922k450k216j944
$$ 30243 28045 25659 24509 24875 26174 28011 30660 34238 37798 39823 39581 37659 35209 32993 31049
55127C1049k016k070j331K54J463J236L04K70J160J360K33q73q14l60o68j358
$$ 31049 29033 26963 25632 25886 27349 28585 28889 29159 30319 31679 31912 31039 30225 29865 29197 27839
55111B7839j348n49M08J299J982J774M20r79j294r67j142j782j985j630j299j006
$$ 27839 26491 25942 26350 27649 29631 31405 31825 30846 29552 28585 27443 25661 23676 22046 20747 19741
55095A9741l92Q3l35j111q67M27J204N49n20o22K04Q70P38K23K34J363L209M469
$$ 19741 19349 19432 19097 17986 17119 17546 18750 19299 18779 18157 18361 19231 19969 20192 20426 21789 24998 29467
55077B9467M020J979n06k255k607j554m4M09p38k188k306j117J13Q21J469K136
$$ 29467 33487 35466 34960 32705 30098 28544 28500 28909 28171 25983 23677 22560 22673 23494 24963 27099
55061B7099K190J568J148J511K209K577K422J760P42M8M95J878K951K835J890
$$ 27099 29289 30857 32005 33516 35725 38302 40724 42484 43226 43274 43769 45647 48598 51433 53323
55046E3323R58M01J37j3j69j61N44K023L204K862J284m5m75q09j585k041j431
$$ 53323 54281 54682 54819 54806 54637 54476 55020 57043 60247 63109 64393 64348 63873 63064 61479 59438 58007
55029E8007l10L63P08J453K505K935K307J263O01L50P9k37j07N65R39K41q62p81
$$ 58007 57697 58060 58768 60221 62726 65661 67968 69231 69832 70182 70261 70024 69917 70482 71421 71662 70800 70019
55011G0019P93K197J969P83J58J42l26j218j420p89n24j117j542j028k59k1N1
$$ 70019 70812 73009 74978 75761 75919 76061 75735 74517 73097 72308 71784 70667 69125 68097 67838 67817 67868
54994F7868N10R66Q54M03o3q95k227l152k968k528l039l961l573j637o7l68j508
$$ 67868 68378 69344 70198 70601 70538 69643 67416 64264 61296 58768 55729 51768 48195 46558 46491 46123 44615
54977D4615j238R18K909K662O60o17K45J954K404J508J044J995L265L408K466
$$ 44615 43377 44295 47204 49866 50526 49909 50154 52108 54512 56020 57064 59059 62324 65732 68198
54962F8198J449Q61N69N04O25N15j57r96j352j367j759k591k940k046l32J103
$$ 68198 69647 70508 71077 71581 72206 72721 72564 71568 70216 68849 67090 64499 61559 59513 59181 60284
54946F0284J753K132K912L932M375L823K646J310j99j828k841k508j190n2K42
$$ 60284 62037 64169 67081 71013 75388 79211 81857 83167 82968 81140 78299 75791 74601 74549 74791
54931G4791o6n61j059j220o51M35J320J743K107K492K212P10j545l252l116p16
$$ 74791 74725 74164 73105 71885 71234 71669 72989 74732 76839 79331 81543 82253 80708 77456 74340 73624
54915G3624K685M583L564J197L05J264J676J69j372o13J691K858K078J073J212
$$ 73624 76309 80892 84456 85653 85958 87222 88898 89067 87695 87082 88773 91631 93709 94782 95994
54900I5994J820J832J565K085L553N063N750N550M997M588M387M216M037M113
$$ 95994 97814 99646 101211 103296 106849 111912 117662 123212 128209 132797 137184 141400 145437 149550
54886A49550M716O017Q161J1062J4011J6004J6628J6144J4632J1653P211K283
$$ 149550 154266 160283 168444 179506 193517 209521 226149 242293 256925 268578 275789 278072
54874B78072k001n191p153p641p030o795q261j0996j3190j3489j1987r663p632
$$ 278072 276071 270880 263727 256086 249056 242261 234000 223004 209814 196325 184338 174675 167043
54861A67043o716p000p562p121n195k503l44L19m14j327j132J71J403J827J989
$$ 167043 160327 153327 145765 138644 133449 130946 130602 130921 130507 129180 128048 128219 129622 131449 133438
54846A33438K584L303L609L878M885O620Q511J0418J2437J4028J4371J3484J2020
$$ 133438 136022 139325 142934 146812 151697 158317 166828 177246 189683 203711 218082 231566 243586
54833B43586J0131P423M005N41k812o478j0217j2781j3248j2167j0991j0784j1498
$$ 243586 253717 261140 265145 265686 262874 256396 246179 233398 220150 207983 196992 186208 174710
54820A74710j2059j1159q587n878m959o067p576p935o935n169l117j317n12r40
$$ 174710 162651 151492 142905 137027 132068 126001 118425 110490 103555 98386 95269 93952 93440 92500
54806I2500j851k221j678m89Q58J729J482J00j548k452k353j672q00J74J131J611
$$ 92500 90649 88428 86750 86261 87119 88848 90330 90430 88882 86430 84077 82405 81605 81779 82910 84521
54790H4521R19j199l847n207m135j543M04N10m96j256j270q29k30L53O62N43J41
$$ 84521 85440 84241 80394 75187 71052 69509 69913 70423 69927 68671 67401 66572 66342 66695 67357 67900 68041
54773F8041l10o06m30L15Q85K34j429k505k134j448j640j710K18L670N832N149
$$ 68041 67731 67125 66695 67010 67895 68129 66700 64195 62061 60613 58973 57263 57481 61151 66983 72132
54757G2132L270K513K776K205J81j761j841J40K904M943N616N505N544N615M483
$$ 72132 75402 77915 80691 82896 83077 81316 79475 79615 82519 87462 93078 98583 104127 109742 114225
54742A14225J843l61J45K997N529O098N719O003O937P629Q118R252J1317J3668
$$ 114225 116068 115707 115852 118849 124378 130476 136195 142198 149135 156764 164882 174134 185451 199119
54728A99119J5370J5619J4243J2439J2027J2924J2400Q293K250k022l350l852
$$ 199119 214489 230108 244351 256790 268817 281741 294141 302434 304684 302662 299312 295460
54716B95460n204o483o374n488n100n182n101n134n751o218n435l723k305j512
$$ 295460 290256 283773 277399 271911 266811 261629 256528 251394 245643 239425 233990 230267 227962 226450
54702B26450p93k58n86j359r32J476M617O677P120O773O740P707R696J1995J3742
$$ 226450 225657 225399 224813 223454 222522 223998 228615 235292 242412 249185 255925 263632 273328 285323 299065
54687B99065J4842J5955J7369J8437J8545J8130J8089J8481J8315J6631J3302
$$ 299065 313907 329862 347231 365668 384213 402343 420432 438913 457228 473859 487161
54676D87161Q881M078m29m183p333j0606j4518j8507k1133k1340j9410j6763j4930
$$ 487161 496042 500120 499691 495508 488175 477569 463051 444544 423411 402071 382661 365898 350968
54663C50968j4654j5526j6251j5642j3732j1768j0825j0641j0160q879p244n932
$$ 350968 336314 320788 304537 288895 275163 263395 252570 241929 231769 222890 215646 209714
54651B09714n266n219n438n403n009m763m883m579l060j053k83j368l058l667
$$ 209714 204448 199229 193791 188388 183379 178616 173733 169154 166094 165041 164758 163390 160332 156665
54637A56665k552k71J795K180P69n13K69K426L457K500J141N40p2j125j205O12
$$ 156665 154113 153842 155637 157817 158586 158073 158342 160768 164225 166725 167866 168406 168334 167209 166004 166616
54621A66616K698K956J589J00j023j636m98K874N960N776L284K288L920N302M324
$$ 166616 169314 172270 173859 173959 172936 171300 170802 173676 179636 185412 188696 190984 194904 200206 204530
54606B04530K689K677L569L421K563K898M541N516M659L090K445K928L672M213
$$ 204530 207219 209896 213465 216886 219449 222347 226888 232404 237063 240153 242598 245526 249198 253411
54592B53411M908N990O807O364M673L115L025M248N679O816P991R308J0453J1603
$$ 253411 258319 264309 271116 277480 282153 285268 288293 292541 298220 305036 313027 322335 332788 344391
54578C44391J3497J6207J8767K0353K1107K1445K1418K1218K1427K2074K2047
$$ 344391 357888 374095 392862 413215 434322 455767 477185 498403 519830 541904 563951
54567E63951K0153J6323J1254N367j201p809j3280j6795j8550j9523k0618k1931
$$ 563951 584104 600427 611681 617048 615847 608038 594758 577963 559413 539890 519272 497341
54555D97341k2742k2308k0661j8532j6677j5418j4619j3786j2406j0561q962q096
$$ 497341 474599 452291 431630 413098 396421 381003 366384 352598 340192 329631 320669 312573
54543C12573p689p352p208p397p588p699q315r545j0175r148p319o324o198n622
$$ 312573 304884 297532 290324 282927 275339 267640 259325 249780 239605 230457 223138 216814 210616 204994
54529B04994m238l005k462k281k569l814n315n633m884m749n673n959m516k605
$$ 204994 200756 197751 195289 193008 190439 186625 181310 175677 170793 166044 160371 154412 149896 147291
54515A47291j862k170k555k713k601j988j385j947l355l536j722j0k83j380j207
$$ 147291 145429 143259 140704 137991 135390 133402 132017 130070 126715 123179 121457 121447 121164 119784 118577
54500A18577j03J80m43p51p48j251j601l88J718K382J090r0L82J739K640K859
$$ 118577 118474 118654 118211 117460 116712 115461 113860 113472 115190 117572 118662 118572 118954 120693 123333 126192
54484A26192K539J559M19K42J153K015K335L041M586N760N432M356M091M941O081
$$ 126192 128731 130290 130709 130951 132104 134119 136454 139495 144081 149841 155273 159629 163720 168661 174742
54469A74742P071Q193R589J0915J1774J2006J1758J1520J1763J2205J1781R745
$$ 174742 181813 190006 199595 210510 222284 234290 246048 257568 269331 281536 293317 303062
54457C03062O463L002J50j964l711n585p729r764j1241j2066j2159j1261r704
$$ 303062 309525 312527 312677 310713 307002 301417 293688 283924 272683 260617 248458 237197 227493
54444B27493q811r417j0304r475o953m915m739n416n465m986m817m780m077k788
$$ 227493 218682 209265 198961 189486 182533 177618 172879 167463 161998 157012 152195 147415 143338 140550
54430A40550j739j236r59q82j308j982k094j272K4J197K009K196J189j120l511
$$ 140550 138811 137575 136616 135734 134426 132444 130350 129078 129102 130299 132308 134504 135693 134573 131062
54415A31062m008j802J513L343K828J586J426K104K210J521J127J451J659J248
$$ 131062 127054 125252 126765 130108 132936 134522 135948 138052 140262 141783 142910 144361 146020 147268
54401A47268P91O26J62p57j034J7J184P98r48k333k342j443m43K58K85p00k329
$$ 147268 148059 148685 148847 148090 147056 147073 148257 149055 148107 145774 143432 141989 141546 141804 142089 141389 139060
54384A39060l673m226m194l825l077k061j061j54O33P94k01j705k152r55N02M88
$$ 139060 135387 131161 126967 123142 120065 118004 116943 116789 117422 118216 118015 116310 114158 113203 113705 114193
54368A14193q61j757r80O99J572J004M5L5R24J392O89k10J47J611K519K038J356
$$ 114193 113332 111575 110595 111294 112866 113870 113915 113950 114874 116266 116955 116745 116892 118503 121022 123060 124416
54351A24416J881L102L406K704K741M373N814M744J474j183j130J046L461N052
$$ 124416 126297 129399 132805 135509 138250 142623 148437 153181 154655 153472 152342 153388 156849 161901
54337A61901N795N719M842L762L294L482L539K816J321n12k031k405j280M68J408
$$ 161901 167696 173415 178257 182019 185313 188795 192334 195150 196471 195959 193928 191523 190243 190711 192119
54322A92119J146N56J92n52k142l680m055l757m235n514n774l919j449p81k191
$$ 192119 193265 193821 194013 193461 191319 187639 183584 179827 175592 170078 164304 160385 158936 158155 155964
54307A55964l602l434k516k525l396l434j840J34R59P27N13N65L33m6L59J606
$$ 155964 152362 148928 146412 143887 140491 137057 135217 135351 136310 137037 137550 138115 138448 138402 138761 140367
54291A40367K329J496j06q98m46M29J066J576K150K628K884L017K959K427J550
$$ 140367 142696 144192 144086 143188 142742 143171 144237 145813 147963 150591 153475 156492 159451 161878 163428
54276A63428J152J910L345M040L033Q37j086j865j910k016k255k286k478l653
$$ 163428 164580 166490 169835 173875 176908 177745 176659 174794 172884 170868 168613 166327 163849 160196
54262A60196n545o412n005k317n81p84j997k922l172k949k382j571q60n58p61
$$ 160196 154651 148239 143234 140917 140336 139552 137555 134633 131461 128512 126130 124559 123699 123141 122380
54247A22380j502k730l950m378l707k491j460q70o25o47p72o97m39n05j225k140
$$ 122380 120878 118148 114198 109820 106113 103622 102162 101292 100667 100020 99248 98551 98112 97607 96382 94242
54231I4242k521k312k114k344k772k869k325j285l89k89q25r00K41J830K369J542
$$ 94242 91721 89409 87295 84951 82179 79310 76985 75700 75311 75022 74197 73297 73538 75368 77737 79279
54215G9279N99O20J293J733J776J678J246J75r68j086j9J061R86j83j420j748
$$ 79279 79878 80498 81791 83524 85300 86978 88224 88399 87431 86345 86326 87387 88373 88190 86770 85022
54199H5022q49Q64K466L181L120K934K695J728J6j056k29J718K651J682J8r90
$$ 85022 84173 85037 87503 90684 93804 96738 99433 101161 101177 100121 99892 101610 104261 105943 105961 104971
54183A04971j505k225k669j739K96J648J203q9n55J80J139J447J068L48l61m87
$$ 104971 103466 101241 98572 96833 97129 98777 99980 99891 99336 99516 100655 102102 103170 103518 103157 102670
54167A02670M80K165L284K852J240k61o68L7J205K150K677L004L014J846r88m055
$$ 102670 103150 105315 108599 111451 112691 112430 111762 111799 113004 115154 117831 120835 123849 125695 124707 120652
54151A20652m775k419O60J796J202J054J973K350J182l23p94o97j106j665j304
$$ 120652 115877 113458 114118 115914 117116 118170 120143 122493 123675 123352 122558 121861 120755 119090 117786
54136A17786k75Pr62k169k620k381j951j511j238j553k545l510l535k477j115
$$ 117786 117511 117518 116556 114387 111767 109386 107435 105924 104686 103133 100588 97078 93543 91066 89951
54121H9951l43k44k9R48K133K220Q34q42j515j205o16K18J682L222L491K062P1
$$ 89951 89608 89364 89335 90283 92416 94636 95470 94628 93113 91908 91292 91510 93192 96414 99905 101967 102038
54104A02038j089j073m61Q1J92j2J9N76J065O52n36j543j984k438l266l906l678
$$ 102038 100949 99876 99415 99496 99688 99676 99695 100271 101336 101988 101452 99909 97925 95487 92221 88315 84637
54087H4637k563r51O16J270M40r95j278j31O52k04j524j458j88O35L96j39n38
$$ 84637 82074 81123 81739 83009 83449 82454 81176 81045 81697 81493 79969 78511 78323 78958 79354 79215 78677
54070G8677j061j445j031k28j84p71o01M90Q17l49j173K02K784M137L581K170
$$ 78677 77616 76171 75140 74912 74728 73957 73356 73846 74663 74314 73141 73343 76127 80264 83845 86015
54054H6015L24k212m321l892r79J486J299l01q17l5M02J7O6J136K042J685O09
$$ 86015 86339 84127 79806 75914 74935 76421 77720 77419 76602 76567 76969 76986 77052 78188 80230 81915 82524
54037H2524K1J97O82J265J879K001J104l86j295j076m79o47j744k702k395q62
$$ 82524 82545 82742 83424 84689 86568 88569 89673 89287 87992 86916 86437 85790 84046 81344 78949 78087
54021G8087Q13J817K318K524J796l23k550k799r49O42J19j580k372j862j199p98
$$ 78087 78900 80717 83035 85559 87355 87032 84482 81683 80734 81376 81495 79915 77543 75681 74482 73684
54005G3684J10J773L278L730L004J323o72j447K02L052M125K238l55q33Q41K632
$$ 73684 73794 75567 78845 82575 85579 86902 86230 84783 84985 88037 92162 94400 94045 93212 94053 96685
53989I6685L435L811M251M398M105L923M145M323M039L458K844K212J815K254
$$ 96685 100120 103931 108182 112580 116685 120608 124753 129076 133115 136573 139417 141629 143444 145698
53975A45698L680N377O601P440Q351R259R692R607R478R455R067P980O642N836
$$ 145698 149378 154755 161356 168796 177147 186406 196098 205705 215183 224638 233705 241685 248327 254163
53961B54163N874O562P621Q586Q544O930M664L606M204M551K682o49k655j927
$$ 254163 260037 266599 274220 282806 291350 298280 302944 306550 310754 315305 317987 317338 314683 312756
53947C12756K3Q07l11k336m089n042n225n011m800m554l967l261l217m027m775
$$ 312756 312779 313586 313275 310939 306850 301808 296583 291572 286772 282218 278251 274990 271773 267746 262971
53932B62971m610l855l354l247l230l434m160n014n106m160k665j196k65n68k345
$$ 262971 258361 254506 251152 247905 244675 241241 237081 232067 226961 222801 220136 218940 218675 218107 215762
53917B15762m448m989l374r84M25M26j73n58o00n64n24r4J133K754L606L030J787
$$ 215762 211314 206325 202951 201967 202392 202818 202645 202087 201487 200923 200399 200305 201438 204192 207798 210828 212615
53900B12615J055Q87M87k29m48J07P53J167J932L205L878K955J028l88n16M25
$$ 212615 213670 214557 215044 214815 214367 214474 215227 216394 218326 221531 225409 228364 229392 229004 228488 228913
53884B28913J931L346L847L286K716L143M098M441M283M856O477P941Q273P990
$$ 228913 230844 234190 238037 241323 244039 247182 251280 255721 260004 264860 271337 279278 287551 295541
53870B95541Q007Q204P767O444M744L202K003J099M22Q8M67J700L153L954M103
$$ 295541 303548 311752 319519 325963 330707 333909 335912 337011 337433 337521 337988 339688 342841 346795 350898
53855C50898M284M530M109L171L157M712O443P053P523R366J1493J1187Q066M838
$$ 350898 355182 359712 363821 366992 370149 374861 381304 388357 395880 405246 416739 427926 435992 440830
53841D40830L500L080K143J429K145L199K333n64l295m304m145l920l825l689
$$ 440830 444330 447410 449553 450982 453127 456326 458659 458095 454800 450496 446351 442431 438606 434917
53827D34917l801m577o004p715r185r906r897r828j0029r837q707p528p575q480
$$ 434917 431116 426539 420535 412820 403635 393729 383832 374004 363975 354138 345431 337903 330328 321848
53813C21848q585p272n606m561m121m283n309o515o440n033m159m962o273o686
$$ 321848 313263 305991 300385 295824 291703 287420 282111 275596 269156 264123 259964 255002 248729 242043
53799B42043o721p326p556n803k761j099k169m593o234o272n160l736k786k566
$$ 242043 235322 227996 220440 214637 211876 210777 208608 204015 197781 191509 186349 182613 179827 177261
53785A77261k504j873q15j20j89q34j768k560k448j155L60Q83M50r3n47j234j794
$$ 177261 174757 172884 172069 171949 171760 170926 169158 166598 164150 162995 163355 164238 164688 164595 164048 162814 161020
53768A61020j548r77j238k238k639k051j538j566j136K71J528J731J757K734M084
$$ 161020 159472 158495 157257 155019 152380 150329 148791 147225 146089 146360 147888 149619 151376 154110 158194
53753A58194M446L711K788K177K000K676M117M813L463J161L13J402K561K636
$$ 158194 162640 166351 169139 171316 173316 175992 180109 184922 188385 189546 189859 191261 193822 196458
53739A96458K853M581O946P975P260O192N922O342P001P903Q954R349Q140N323
$$ 196458 199311 203892 210838 218813 226073 232265 238187 244529 251530 259433 268387 277736 285876 291199
53725B91199K052j56m41Q92K636L524L100J851M47r50k436l667l906l020k052
$$ 291199 293251 293095 292654 293546 296182 299706 302806 304657 305104 304154 301718 298051 294145 291125 289073
53710B89073k293l851n393n452l860j961j426k676m433m977l917k395j583j484
$$ 289073 286780 282929 277536 272084 268224 266263 264837 262161 257728 252751 248834 246439 244856 243372
53696B43372j540j721k374l332l954l796k719o91J751L317L159K075J407J140
$$ 243372 241832 240111 237737 234405 230451 226655 223936 223245 224996 228313 231472 233547 234954 236094
53682B36094K74j004j197J07J307R49n41k120l574m624m018j176K096L207J721
$$ 236094 236368 235364 234167 234274 235581 236530 235989 233869 230295 225671 221653 220477 222573 225780 227501
53667B27501p30k913m805o203o426n515m233k584M8K974M090K622O45N95K179
$$ 227501 226771 223858 219053 212850 206424 200909 196676 194092 194140 197114 201204 203826 204471 205066 207245
53652B07245L023J905k4r33j67J669L543M492M016K465R45M37R55J611J648J299
$$ 207245 210268 212173 212149 211216 211049 212718 216261 220753 224769 227234 228179 228616 229571 231182 232830 234129
53636B34129J538K802M283M841M396L876L788L573K679J565J098J350J659J645
$$ 234129 235667 238469 242752 247593 251989 255865 259653 263226 265905 267470 268568 269918 271577 273222
53622B73222J625J961K628L410M103M326L630K105N04n76j381k456l461l298j599
$$ 273222 274847 276808 279436 282846 286949 291275 294905 297010 297514 296938 295557 293101 289640 286342 284743
53607B84743M27J242P63K23L29L68n56k033k744k037n75M99N99n2p47r26o89o76
$$ 284743 285170 286412 287175 287398 287727 288095 287539 285506 282762 280725 280150 280649 281248 281196 280449 279523 278834 278158
53589B78158j220j818j737j005l18r3l1K89P84J036Q79P15J167K291L305L481
$$ 278158 276938 275120 273383 272378 272060 271967 271936 272225 273009 274045 274924 275639 276806 279097 282402 285883
53573B85883L223L547M339M123K222M8o62j04M91J071K396L830L747K304J674
$$ 285883 289106 292653 296992 301115 303337 303385 302723 302619 303110 304181 306577 310407 314154 316458 318132
53558C18132K802L955L566K706L063M122M219L449L435M664N912O216N783N032
$$ 318132 320934 324889 328455 331161 334224 338346 342565 346014 349449 354113 360025 366241 372024 377056
53544C77056M220M127N506P612Q594P685N947M599L867L694M230N020M846L259
$$ 377056 381276 385403 390909 398521 407115 414800 420747 425346 429213 432907 437137 442157 447003 450262
53530D50262J464J060K416M666O501O742N092K791J655J977K229J315L9l04K43
$$ 450262 451726 452786 455202 459868 466369 473111 478203 480994 482649 484626 486855 488170 488209 487905 488148
53515D88148Q25J143J302J107N78M47J105J641J011l81j423j935k294j885K36
$$ 488148 488973 490116 491418 492525 493103 493550 494655 496296 497307 496926 495503 493568 491274 489389 489625
53500D89625L190M455K820k7j466o59J164K387K385J685J209J410K061K960M285
$$ 489625 492815 497270 500090 500063 498597 497938 499102 501489 503874 505559 506768 508178 510239 513199 517484
53485E17484N848O682O135M898M011L514L151L666N697P838P881O081N064O078
$$ 517484 523332 530014 536149 541047 545058 548572 551723 555389 561086 568924 576805 582886 587950 594028
53471E94028P460P738P932R296J0709J0377Q858Q260R186J0481J1574J3042J4947
$$ 594028 601488 609226 617158 626454 637163 647540 656398 664658 673844 684325 695899 708941 723888
53458G23888J6397J7020J7430J7991J8380J8621J9357K0774K2208K3120K3622
$$ 723888 740285 757305 774735 792726 811106 829727 849084 869858 892066 915186 938808
53447I38808K4014K4603K5971K8284L0387L0751K9544K8521K8736K9581L0456
$$ 938808 962822 987425 1013396 1041680 1072067 1102818 1132362 1160883 1189619 1219200 1249656
53436A249656L1861L4077L6079L6843L6820L7030L7523L7719L7616L7434L6675
$$ 1249656 1281517 1315594 1351673 1388516 1425336 1462366 1499889 1537608 1575224 1612658 1649333
53425A649333L4782L2557L1708L2736L4144L4007L1867K9071K7605K8422L0440
$$ 1649333 1684115 1716672 1748380 1781116 1815260 1849267 1881134 1910205 1937810 1966232 1996672
53414A996672L1425L0306K8311K7280K7340K7131K5933K4340K2877K1288J9542
$$ 1996672 2028097 2058403 2086714 2113994 2141334 2168465 2194398 2218738 2241615 2262903 2282445
53403B282445J8278J7517J5934J2407P603L116m37l405n669o693p054q467j1650
$$ 2282445 2300723 2318240 2334174 2346581 2354184 2357300 2356863 2353458 2347789 2341096 2334042 2325575 2313925
53390B313925j5090j6887j7130j7561j9189k1233k2418k2531k2412k2924k4194
$$ 2313925 2298835 2281948 2264818 2247257 2228068 2206835 2184417 2161886 2139474 2116550 2092356
53379B092356k5657k6678k7225k7715k8062k7328k5003k2234k0806k0884k0742
$$ 2092356 2066699 2040021 2012796 1985081 1957019 1929691 1904688 1882454 1861648 1840764 1820022
53368A820022j9032j6342j3991j2177j0248q055o074m424k701p48J044K238K707
$$ 1820022 1800990 1784648 1770657 1758480 1748232 1740177 1734103 1729679 1726978 1726230 1727274 1729512 1732219
53355A732219K749L198N048Q288J1491J3308J4064J5160J7146J9307K1031K2605
$$ 1732219 1734968 1738166 1743214 1751502 1762993 1776301 1790365 1805525 1822671 1841978 1863009 1885614
53343A885614K4646K7523L1241L5120L7773L8481L8532L9946M2833M5455M7055
$$ 1885614 1910260 1937783 1969024 2004144 2041917 2080398 2118930 2158876 2201709 2247164 2294219
53332B294219M8985N2254N5771N8199O0109O2555O4691O4914O3942O4488O7552
$$ 2294219 2343204 2395458 2451229 2509428 2569537 2632092 2696783 2761697 2825639 2890127 2957679
53321B957679P0851P1770P0398O8717O7900O7648O7406O6814O5217O2055N8036
$$ 2957679 3028530 3100300 3170698 3239415 3307315 3374963 3442369 3509183 3574400 3636455 3694491
53310C694491N4779N2774N0534M6531M1260L6387L2240K7542K1632J5481R851
$$ 3694491 3749270 3802044 3852578 3899109 3940369 3976756 4008996 4036538 4058170 4073651 4083502
53299D083502L837l513j1174j7405k2410k7919l4186l9381m2584m5397m9520n4098
$$ 4083502 4087339 4083826 4072652 4055247 4032837 4004918 3970732 3931351 3888767 3843370 3793850 3739752
53287C739752n7009n7856n8102n8784n9606o0155o0553o0752o0305n9143n7748
$$ 3739752 3682743 3624887 3566785 3508001 3448395 3388240 3327687 3266935 3206630 3147487 3089739
53276C089739n6284n4423n2324n0974n0958n1344n0436m7560m3729m0573l8765
$$ 3089739 3033455 2979032 2926708 2875734 2824776 2773432 2722996 2675436 2631707 2591134 2552369
53265B552369l7628l6071l3823l1455k9419k7508k5490k3706k2552k1662k0220
$$ 2552369 2514741 2478670 2444847 2413392 2383973 2356465 2330975 2307269 2284717 2263055 2242835
53254B242835j8138j6415j6140j7326j8889j9802k0142k0714k1547k1305j8837
$$ 2242835 2224697 2208282 2192142 2174816 2155927 2136125 2115983 2095269 2073722 2052417 2033580
53243B033580j4999j1913j0332r010o946m976m202l986k867p51J222K584L963
$$ 2033580 2018581 2006668 1996336 1987326 1980380 1975404 1971202 1967216 1964349 1963598 1964820 1967404 1971367
53230A971367N744P670R870J2915J6544J9477K1026K1995K3467K5451K7230K8367
$$ 1971367 1977111 1984781 1994651 2007566 2024110 2043587 2064613 2086608 2110075 2135526 2162756 2191123
53218B191123K8779K8465K7733K7250K7231K6871K5130K2001J8511J5592J3323
$$ 2191123 2219902 2248367 2276100 2303350 2330581 2357452 2382582 2404583 2423094 2438686 2452009
53207B452009J1269R217P260N289K673j132n685r684j2211j3549j4595j5871j7435
$$ 2452009 2463278 2472495 2479755 2485044 2487717 2486585 2480900 2471216 2459005 2445456 2430861 2414990 2397555
53194B397555j9334k1609k4176k6978k9822l1821l1920l0621l0165l1860l4099
$$ 2397555 2378221 2356612 2332436 2305458 2275636 2243815 2211895 2181274 2151109 2119249 2085150
53183B085150l4520l3393l2924l3627l3667l2118l0469k9985k9652k8174k6289
$$ 2085150 2050630 2017237 1984313 1950686 1917019 1884901 1854432 1824447 1794795 1766621 1740332
53172A740332k5410k5251k4649k3781k3720k4220k3904k2452k1016k0363j9948
$$ 1740332 1714922 1689671 1665022 1641241 1617521 1593301 1569397 1546945 1525929 1505566 1485618
53161A485618j9083j7752j6075j4107j2354j1457j1183j0746j0248j0654j2058
$$ 1485618 1466535 1448783 1432708 1418601 1406247 1394790 1383607 1372861 1362613 1351959 1339901
53150A339901j3342j4067j5308j7694j9853k0147j9147j8900k0018k0964k0359
$$ 1339901 1326559 1312492 1297184 1279490 1259637 1239490 1220343 1201443 1181425 1160461 1140102
53139A140102j8742j7547j7255j7277j7110j6937j7094j7526j7885j7952j7834
$$ 1140102 1121360 1103813 1086558 1069281 1052171 1035234 1018140 1000614 982729 964777 946943
53128I46943j7740j7664j7463j7244j7378j7931j8383j8320j8112j8278j8389
$$ 946943 929203 911539 894076 876832 859454 841523 823140 804820 786708 768430 750041
53117G50041j7373j5164j3115j2344j2428j2372j2159j2301j2410j1464r533p970
$$ 750041 732668 717504 704389 692045 679617 667245 655086 642785 630375 618911 609378 601408
53105F01408p558p592p307p170p884q950r305q886q473q196p320n669m291m312
$$ 601408 593850 586258 578951 571781 563897 554947 545642 536756 528283 520087 512767 507098 502807 498495
53091D98495n680p311q097p593o176m809m260m388m447m200m288n262o608p108
$$ 498495 492815 485504 477407 469814 463638 458829 454569 450181 445734 441534 437246 431984 425376 418268
53077D18268o104m204k728k431k841k941k454k118k458k901k636j852j299j000
$$ 418268 412164 407960 405232 402801 399960 397019 394565 392447 389989 387088 384452 382600 381301 380301
53063C80301m07K32j79j903l654m154l596k927k516k291k559l523m278l435r91
$$ 380301 379894 380126 379947 378044 374390 370236 366640 363713 361197 358906 356347 352824 348546 345111 344120
53048C44120J389K259J898J408R69j78k152l650l292j368L39N04l56o70M19K290
$$ 344120 345509 347768 349666 351074 352043 351865 349713 346063 342771 341403 341742 342246 341890 341220 341639 343929
53032C43929L660L713K630J337P14P68P35J77m17n18n50j296k587l555l944m149
$$ 343929 347589 351302 353932 355269 355983 356751 357486 357663 357246 356728 356178 354882 352295 348740 344796 340647
53016C40647m042l117k018k383m375n773m776k654k112l659n352n730n288m822
$$ 340647 336605 333488 331470 329087 324712 318939 314163 311509 309397 305738 300386 294656 289368 284546
53002B84546m133l054k305k368k505j945j208j167j500j312r47j765m009o105
$$ 284546 280413 277359 275054 272686 270181 268236 267028 265861 264361 263049 262102 260337 256328 250223
52988B50223o523n373l712k115o83J96N0r48k062k770k902k337j180j18J35k68
$$ 250223 243700 238327 234615 232500 231817 232013 232063 231115 229053 226283 223381 221044 219864 219746 219881 219613
52972B19613o25p80j173j737j732r94m79r45j878k351k285k168k075j833j742
$$ 219613 218988 218208 217035 215298 213566 212572 212093 211148 209270 206919 204634 202466 200391 198558 196816
52957A96816k140k469j784k34Q64O48k78o85l5J186K077K061J340O63M89O28R19
$$ 196816 194676 192207 190423 190189 191053 191701 191423 190738 190703 191889 193966 196027 197367 198030 198519 199147 200066
52940B00066J697K920L428K123k40j570r56K98M33q01k287k854k060m08Q04L71
$$ 200066 201763 204683 208111 210234 209994 208424 207468 207766 208199 207398 205111 202257 200197 199789 200593 200964
52924B00964j434k885k538p45J042J974K392K830L046K359R38K02J334L428M142
$$ 200964 199530 196645 194107 193362 194404 196378 198770 201600 204646 207005 207943 208145 209479 212907 217049
52909B17049K568M82j12M14M40j58k02M30P17P09J583L204L789K722J649J708
$$ 217049 219617 220099 219987 220401 220841 220683 220481 220911 221628 222337 223920 227124 230913 233635 235284 236992
52893B36992J803R77N35J959M236N317N134N092N382N063M340M487N432N461L746
$$ 236992 238795 239772 240307 242266 246502 251819 256953 262045 267427 272490 276830 281317 286749 292210 295956
52878B95956J554M59O79J649K863L503K526M7k075k018j20J474J159n62j895j740
$$ 295956 297510 297969 298648 300297 303160 306663 309189 309236 307161 305143 305023 306497 307656 307094 305199 303459
52862C03459o54M4k81j277k286k834k664k150k286l313l568j294K288L641J430
$$ 303459 302805 302849 302568 301291 299005 296171 293507 291357 289071 285758 282190 280896 283184 286825 288255
52847B88255j493j945m72K04o44j412j189p28o25n28k97k16o9O16J329J125K77
$$ 288255 286762 284817 284345 284549 283905 282493 281304 280576 279951 279423 279126 278910 278841 279457 280786 281911 282188
52830B82188j09n6o16j757k118j159mL12K0k15J4J150L155M578L847J725P09J475
$$ 282188 282079 282023 281407 279650 277532 276373 276369 276681 276701 276486 276500 277650 280805 285383 289230 290955 291664 293139
52812B93139J998R47j17P18K607L132J543o69j837j599p24l34q05j095J10K228
$$ 293139 295137 296084 295967 296685 299292 302424 303967 303298 301461 299862 299138 298804 297999 296904 297014 299242
52796B99242L033J625k45o81J2N55Q74J531K120J952J626K284L644M249L470K027
$$ 299242 302275 303900 303655 302974 302986 303541 304415 305946 308066 310018 311644 313928 317572 321821 325291 327318
52780C27318Q36M24J182K949M527M677L507K154J403J439K355L700M003K210n52
$$ 327318 328154 328578 329760 332709 337236 341913 345420 347574 348977 350416 352771 356471 360474 362684 362132
52765C62132j899r66P94J583R67l98j610j899j177m44q05j952k528k106j825k636
$$ 362132 360233 359267 360061 361644 362611 362213 360603 358704 357527 357083 356278 354326 351798 349692 347867 345231
52749C45231l886m244l468k587k626l494m101l539k253j738k763m326m854m072
$$ 345231 341345 337101 333633 331046 328420 324926 320825 317286 315033 313295 310532 306206 301352 297280
52735B97280k825j606m52l8j306l638m884m042k789l323n442o951o516m915l605
$$ 297280 294455 292849 292397 292359 291053 287415 282531 278489 275700 272377 266935 259984 253468 248553 244948
52720B44948l063k890k759k748l039l557l801l101j325O32J437O33q90j846j758
$$ 244948 241885 238995 236236 233488 230449 226892 223091 219990 218665 219297 220734 221367 220477 218631 216873
52705B16873j064m28l50j052k258l074k802j961j805k646l334k904k057k242l664
$$ 216873 215809 215381 215031 213979 211721 208647 205845 203884 202079 199433 196099 193195 191138 188896 185232
52690A85232n046n151l893k154j137j609k978l506k384j029j138j997j579r7n0
$$ 185232 180186 175035 171142 168988 167851 166242 163264 159758 157374 156345 155207 153210 151631 151534 151484
52675A51484k104l436j742J154J799j93k225k649k179j724j190p57j171k127j976
$$ 151484 149380 145944 144202 145356 147155 146962 144737 142088 139909 138185 136995 136238 135067 132940 130964
52660A30964jK260K862J766N05J63L83Q4j253k766k908j260N19N35r46j995j752
$$ 130964 130963 133223 136085 137851 138356 138519 138902 138986 137733 134967 132059 130799 131318 131853 130907 128912 127160
52643A27160j216j176r72M4J271K037K703L497L307J192j701l210k737j336L41
$$ 127160 125944 124768 123796 123840 125111 127148 129851 133348 136655 137847 136146 132936 130199 128863 129204
52628A29204K414M118L740J166j099p10J641L418L612L352L443L169K010R80J198
$$ 129204 131618 135736 139476 140642 139543 138833 140474 143892 147504 150856 154299 157468 159478 160458 161656
52613A61656K201K901L329M041M385L152Q36n62m07m42k053m114m704l752k589
$$ 161656 163857 166758 170087 174128 178513 181665 182501 181939 181532 181090 179037 174923 170219 166467 163878
52598A63878j877j517j845l222m712m758l203j282K62J661K859L258K928K542
$$ 163878 162001 160484 158639 155417 150705 145947 142744 141462 141724 143385 146244 149502 152430 154972
52584A54972J892j3k846m490l564j256J58k34j661k910l115k153q64k27Q6J291
$$ 154972 156864 156851 154005 149515 145951 144695 144853 144619 142958 140048 136933 134780 133916 133689 133775 135066
52568A35066L280M166K823O17n56p52j213k003k013q20P39J579J025r46l160l604
$$ 135066 138346 142512 145335 145952 145396 144644 143431 141428 139415 138595 139334 140913 141938 140992 137832 134228
52552A34228j607R70K023J852K008K271J127j085k004p44O53M17l64L02K140L140
$$ 134228 132621 133591 135614 137466 139474 141745 142872 141787 139783 139039 139692 140109 139745 140047 142187 145327
52536A45327K382Q27l33p78o92l54j09j00j04L7J43K81J006K392L374K950J665
$$ 145327 147709 148536 148203 147425 146733 146379 146270 146170 146066 146103 146246 146527 147533 149925 153299 156249 157914
52519A57914R86J470K290K427J611K54p16k30J858M086M699L644K419J954J673
$$ 157914 158900 160370 162660 165087 166698 166952 166236 166006 167864 171950 176649 180293 182712 184666 186339
52504A86339Q93K8k18M7M00J028K314L786M356L586K140R45L91L20M52O34Q27
$$ 186339 187232 187260 187042 187089 187489 188517 190831 194617 198973 202559 204699 205644 206035 206355 206807 207441 208268
52487B08268R32P58K97p4m9O0k19m94K40K001L391L344K530K141K076J559R97
$$ 208268 209200 209958 210255 210181 210132 210192 209973 209479 209719 211720 215111 218455 220985 223126 225202 226761 227758
52470B27758J550K934L291J863L14M87J859K429J459R5m81m13n46j181j799j738
$$ 227758 229308 232242 235533 237396 237710 238197 240056 242485 243944 244039 243558 243145 242599 241418 239619 237881
52454B37881r81j79K26P95K243L758L341N00k340k517n20P93J04j057j052m00
$$ 237881 236900 236721 236947 237742 239985 243743 247084 247584 245244 242727 242207 243000 243104 242047 240995 240595
52438B40595l32n86l6J248K045J782J154R35J125J345J382J137N72j43q29j502
$$ 240595 240263 239677 239641 240889 242934 244716 245870 246805 247930 249275 250657 251794 252366 252223 251394 249892
52422B49892k036j878q22K22J78n46m37Q45J752J059k61l41J134K972M343N187
$$ 249892 247856 245978 245156 245378 245556 245010 244573 245418 247170 248229 247968 247627 248761 251733 256076 261263
52406B61263M987K915k62k017r49J142J479N8m99J162L030K477o3j588m10J887
$$ 261263 266250 269165 268903 266886 265937 267079 268558 268616 268117 269279 272309 274786 274723 273135 272725 274612
52390B74612K749J853J038J582K647K711J645O77O76J187J254O04j55k76M31J480
$$ 274612 277361 279214 280252 281834 284481 287192 288837 289514 290190 291377 292631 293235 293080 292804 293235 294715
52374B94715K179K239J821R02q53l155m425l173k4K562K993K002J007J95r08j889
$$ 294715 296894 299133 300954 301856 301003 297848 293423 290250 290226 292788 295781 297783 298790 298985 298077 296188
52358B96188j854q94N4N63Q39P61J14m12J64J428J832J045N73J475K760K927K006
$$ 296188 294334 293440 293494 294057 294896 295657 295771 295359 295523 296951 298783 299828 300401 301876 304636 307563 309569
52341C09569J056M64j01o19o60k55k3m97j664k911l302k462j379j429k231j744
$$ 309569 310625 311089 310988 310369 309709 309454 309431 308934 307270 304359 301057 298595 297216 295787 293556 291812
52325B91812Q17L408L781K465J585J610J160k87j639k213k631l144k725p33J782
$$ 291812 292629 296037 299818 302283 303868 305478 306638 306351 304712 302499 299868 296724 293999 293266 295048
52310B95048L309L627L493L486L811M552N230M790K880P69R1R59K070K569K962
$$ 295048 298357 301984 305477 308963 312774 317326 322556 327346 330226 330995 331086 332045 334115 336684 339646
52295C39646M049N662O828O922O159N100M055L177K784L168M104M940N274N138
$$ 339646 343695 349357 356185 363107 369266 374366 378421 381598 384382 387550 391654 396594 401868 407006
52281D07006M541L469K535K754M061M916M119K465J581J873K745M224O671R047
$$ 407006 411547 415016 417551 420305 424366 429282 433401 435866 437447 439320 442065 446289 452960 462007
52267D62007R359P409N504N600O922P453O709N895N920O564P405Q562J0292J2383
$$ 462007 471366 478775 484279 489879 496801 504254 510963 516858 522778 529342 536747 545309 555601 567984
52253E67984J4191J5064J4921J4368J4113J4172J4201J4560J6245J9328K2262
$$ 567984 582175 597239 612160 626528 640641 654813 669014 683574 699819 719147 741409
52242G41409K3421K2920K2141K1953K2178K2698K3982K6235K8629L0027L0289
$$ 741409 764830 787750 809891 831844 854022 876720 900702 926937 955566 985593 1015882
52231A015882L0328L0893L1690L2041L2008L2334L3215L3869L3546L2399L0970
$$ 1015882 1046210 1077103 1108793 1140834 1172842 1205176 1238391 1272260 1305806 1338205 1369175
52220A369175K9378K7492K5408K3300K1386K0395K1071K2407K1625J7399J2205
$$ 1369175 1398553 1426045 1451453 1474753 1496139 1516534 1537605 1560012 1581637 1599036 1611241
52209A611241R604R763R676P570M755K867J639K55j134k348l801n142m952l038
$$ 1611241 1620845 1630608 1640284 1647854 1652609 1655476 1657115 1657370 1656236 1653888 1650087 1644945 1639993 1636955
52195A636955j370j373j850j077N57J749K653M100N634O528P868J1215J5613J8218
$$ 1636955 1635585 1634212 1632362 1631285 1631842 1633591 1636244 1640344 1645978 1652506 1660374 1671589 1687202 1705420
52181A705420J7965J6689J6494J7750J9864K2203K3906K4159K3205K1884K0237
$$ 1705420 1723385 1740074 1756568 1774318 1794182 1816385 1840291 1864450 1887655 1909539 1929776
52170A929776J7717J4807J2939J2600J2768J2391J1186Q975N675K064q66l412
$$ 1929776 1947493 1962300 1975239 1987839 2000607 2012998 2024184 2033159 2038834 2040898 2040032 2036620
52158B036620o552r838j1734j2343j3646j6340j8479j8436j7386j7460j8910k0710
$$ 2036620 2030068 2020230 2008496 1996153 1982507 1966167 1947688 1929252 1911866 1894406 1875496 1854786
52146A854786k2532k4342k5071k3684k1139j9586j9699k0255k0215j9779j9348
$$ 1854786 1832254 1807912 1782841 1759157 1738018 1718432 1698733 1678478 1658263 1638484 1619136
52135A619136j8777j7977j7192j6302j4658j2018r164p207o517o504o288n601
$$ 1619136 1600359 1582382 1565190 1548888 1534230 1522212 1513048 1505841 1499324 1492820 1486532 1480931
52123A480931n150n817p439q711q626p497o290n432m850m566m607m623m301l993
$$ 1480931 1475781 1469964 1462525 1453814 1445188 1437691 1431401 1425969 1421119 1416553 1411946 1407323 1403022 1399029
52109A399029m353n455o674p164o292m195k315k543n074p738q359p246o347o509
$$ 1399029 1394676 1389221 1382547 1375383 1369091 1364896 1362581 1360038 1354964 1347226 1338867 1331621 1325274 1318765
52095A318765o883o651n911m864l493k272j947k379k718k871l561m651m826l481
$$ 1318765 1311882 1305231 1299320 1294456 1290963 1288691 1286744 1284365 1281647 1278776 1275215 1270564 1265738 1262257
52081A262257j683o49n68j593m224p568q863o655l262j970k571k149L9J318k09
$$ 1262257 1260574 1259925 1259357 1257764 1253540 1245972 1237109 1230454 1227192 1225222 1222651 1220502 1220541 1221859 1221650
52066A221650k731l491k489j703j921k268k078j379N8K427M622N072M030L590
$$ 1221650 1218919 1215428 1212939 1211236 1209315 1207047 1204969 1203590 1203648 1206075 1210697 1215769 1219799 1223389
52052A223389M961P080Q486R365J0817J3090J5664J8361K1206K3513K4248K3452
$$ 1223389 1228350 1235430 1243916 1253281 1264098 1277188 1292852 1311213 1332419 1355932 1380180 1403632
52040A403632K2564K3168K5797K9790L3713L6159L6918L7326L8767M0757M1431
$$ 1403632 1426196 1449364 1475161 1504951 1538664 1574823 1611741 1649067 1687834 1728591 1770022
52029A770022M0144L8569L8563L9675L9754L7692L4574L2006L0128K7734K3947
$$ 1770022 1810166 1848735 1887298 1926973 1966727 2004419 2038993 2070999 2101127 2128861 2152808
52018B152808J9428J5866J4298J3784J2045P848K526j459l375m739o910r382j1156
$$ 2152808 2172236 2188102 2202400 2216184 2228229 2236077 2238603 2237144 2233769 2229030 2222120 2212738 2201582
52005B201582j2611j4672j6826j7694j7441j7770j9149j9792j8376j6217j5253
$$ 2201582 2188971 2174299 2157473 2139779 2122338 2104568 2085419 2065627 2047251 2031034 2015781
51994B015781j5056j3546j0131o284l285r80R91K527L898N819P977Q948Q371P982
$$ 2015781 2000725 1987179 1977048 1970764 1967479 1966499 1967490 1970017 1973915 1979734 1987711 1996659 2005030 2013012
51980B013012R382J1760J3008J2435J1154J0200R511Q761Q112P931Q278Q737Q430
$$ 2013012 2022394 2034154 2047162 2059597 2070751 2080951 2090462 2099223 2107335 2115266 2123544 2132281 2140711
51967B140711O518L221M4j644k145l018n335q805j2339j4825j5671j5465j6013
$$ 2140711 2147229 2150450 2150494 2148850 2146705 2143687 2138352 2129547 2117208 2102383 2086712 2071247 2055234
51954B055234j8777k3089k6564k7636k7113k7018k8389l0680l2908l4818l6746
$$ 2055234 2036457 2013368 1986804 1959168 1932055 1905037 1876648 1845968 1813060 1778242 1741496
51943A741496l8698l9963l9939l9020l8187l7701l6888l5547l4846l6046l8584
$$ 1741496 1702798 1662835 1622896 1583876 1545689 1507988 1471100 1435553 1400707 1364661 1326077
51932A326077m0287l9626l7371l5758l6186l7875l8771l7713l5429l3243l1480
$$ 1326077 1285790 1246164 1208793 1173035 1136849 1098974 1060203 1022490 987061 953818 922338
51921I22338k9799k8573k8480k8861k8052k5824k3872k3131k2220j9838j7141
$$ 922338 892539 863966 835486 806625 778573 752749 728877 705746 683526 663688 646547
51910F46547j6061j6379j6391j5652j5121j5016j4551j3531j2400j0977r022p759
$$ 646547 630486 614107 597716 582064 566943 551927 537376 523845 511445 500468 491446 483687
51898D83687q543j0040r284o070l810m923p692r048q543p767p490p291o977o530
$$ 483687 475144 465104 455820 449750 445940 441017 433325 424277 415734 407967 400477 393186 386209 379679
51884C79679n467l809k974m041n681n518l299j218j086k524m026m618m242l439
$$ 379679 374212 370403 367429 363388 357707 352189 348890 347672 346586 344062 340036 335418 331176 327737
51870C27737k896k820k711k151j424q56j79N85L19j806m537n562m391k860k481
$$ 327737 324841 322021 319310 317159 315735 314879 314700 315285 315604 313798 309261 303699 299308 296448 293967
51855B93967k681k305j586j584k308k580j666j90O92M68m90j452j874j792j857
$$ 293967 291286 288981 287395 285811 283503 280923 279257 279067 279759 280227 279737 278285 276411 274619 272762
51840B72762k735m169m890l992k225j226j379j379k99Q60O02q78k174k713k812
$$ 272762 270027 265858 260968 256976 254751 253525 252146 250767 250468 251328 251930 251052 248878 246165 243353
51825B43353k185l26J490P71k699n722n461k913j132j047r74L36K006K598J858
$$ 243353 241168 240842 242332 243103 240404 234682 229221 226308 225176 224129 223155 223491 225497 228095 229953
51810B29953N18o46j190r88k39P02J489J705J166N27R19K419L550K992J265qN8
$$ 229953 230471 229825 228635 227647 227408 228110 229599 231304 232470 232997 233916 236335 239885 242877 244142 244134 244192
51793B44192J199K773M096M511M007L241K493J285j91n89M83J176k1j525o66K102
$$ 244192 245391 248164 252260 256771 260778 264019 266512 267797 267606 267017 267500 268676 268655 267130 266464 268566
51777B68566L538K168O5m50L58R51P80Q9r69j892j692k94R51J061Q09J340K354
$$ 268566 272104 274272 274337 273887 274245 275196 275976 276065 275096 273204 271512 271218 272169 273230 274039 275379 277733
51760B77733K628J597m10k720m252l806j416J149K151J624O21m14j539k257j887
$$ 277733 280361 281958 281548 278828 274576 270770 269354 270503 272654 274278 274899 274485 272946 270689 268802
51745B68802o99L20P46Q77Q20K73p53j655j785r15N43J558J244N8l87P75K471
$$ 268802 268103 268423 269169 270046 270866 271139 270386 268731 266946 266031 266574 268132 269376 269434 269047 269822 272293
51728B72293L126K672K237K365K505J995O64j198k747k845j450k25n78j468o07
$$ 272293 275419 278091 280328 282693 285198 287193 287857 286659 283912 281067 279617 279392 278814 277346 276739
51713B76739K137M133L314P69o80L30K711M347L937J876r2n10K26M37n99j707
$$ 276739 278876 283009 286323 287092 286412 286742 289453 293800 297737 299613 299521 299011 299237 299674 299075 297368
51697B97368j516j90J178K079K613K647K099J830L128O002Q832R961R288P924
$$ 297368 295852 295662 296840 298919 301532 304179 306278 308108 311236 317238 326070 336031 345319 353243
51683C53243O792N843M644L452L425N527R135J2204J3149J2265J0947R960R032
$$ 353243 360035 365878 370522 373974 377399 382926 392061 404265 417414 429679 440626 450586 459618
51670D59618P910O810N727M164K032K39k36L51P20Q6r52j172k48O61L5k329m832
$$ 459618 467528 474338 480065 484229 486261 486500 486264 486615 487335 487421 486469 485297 485049 485710 485745 483416 478584
51653D78584n502l847j159Q21J207K05j332k406k440j716j006o83n01k38jK09
$$ 478584 473082 469235 468076 468897 470104 470309 468977 466571 464131 462415 461409 460726 460225 459987 459986 460195
51637D60195N93Q81K65j474l282l882l034j287Q74K899L903L687L497M456N685
$$ 460195 460788 461669 461934 460460 457178 453296 450262 448975 449849 452748 456651 460338 463835 468291 473976
51622D73976N422M032L972O242Q593Q285N365K007k99j463j484k33J595K678K548
$$ 473976 479398 483430 487402 493644 502237 510522 515887 517894 517595 516132 514648 514415 516010 518688 521236
51607E21236J891J276N63k33m92Q3Q44R60M83O8L6R8j08n86j067j356j513j753
$$ 521236 523127 524403 524966 524733 524241 524324 525168 526128 526611 526679 526715 526813 526705 526119 525052 523696 522183 520430
51589E20430k262l129m368n775o860p289p299p215o661m940k433p45r05k158l122
$$ 520430 518168 515039 510671 504896 498036 490747 483448 476233 469572 464632 462199 461454 460549 458391 455269
51574D55269l435l574l788m148m997o165o353m720k645k273l392l643k149r58
$$ 455269 451834 448260 444472 440324 435327 429162 422809 418089 415444 413171 409779 406136 403987 403029
51560D03029j909l827m293l083k065k324k994k900j997q71J02O81N18o12k529
$$ 403029 401120 397293 393000 389917 387852 385528 382534 379634 377637 376766 376868 377549 378067 377455 374926
51545C74926m600n766n022k445L20J484J024N24J024J800J677P80L10Q55J701
$$ 374926 370326 364560 359538 357093 357413 358897 359921 360445 361469 363269 364946 365726 366036 366891 368592
51530C68592J861J276Q22J302K638L909M190L379K283J813K184K996L881M640
$$ 368592 370453 371729 372551 373853 376491 380400 384590 387969 390252 392065 394249 397245 401126 405766
51516D05766M771L574J189r62j465o00N9l70j212j597j662j863j857j087K1M30
$$ 405766 410537 414111 415300 414338 412873 412273 412332 411962 410750 409153 407491 405628 403771 402684 402705 403135
51500D03135o4p25j116j503j859j582o38o7o03j376q10J376L728M573L563J726
$$ 403135 403071 402346 401230 399727 397868 396286 395648 395581 394978 393602 392792 394168 397896 402469 406032 407758
51484D07758L93J27N17Q73J070J477K101K312J663O51J61M31J084K005L421M957
$$ 407758 408151 408278 408795 409668 410738 412215 414316 416628 418291 418942 419103 419534 420618 422623 426044 431001
51468D31001N308L577O36j492j698o12O69J869K990L323K127J78p41p8P72N51
$$ 431001 436309 439886 440522 439030 437332 436720 437389 439258 442248 445571 447698 447876 447135 447057 447829 448380
51452D48380j40l1P32Q53k74k101m009n671o572o270n260m482l894k612o76N42
$$ 448380 448240 448209 448941 449794 449520 447419 443410 437739 431167 424897 419637 415155 411261 408649 407973 408515
51436D08515J48j032j662j474j004n76l41p18j873l038l144k064p74l73j213k600
$$ 408515 408663 407631 405969 404495 403491 402915 402574 401856 399983 396945 393801 391737 390963 390590 389377 386777
51420C86777l138j744J151L753M542L545J943R55J307L013N018N838N221M634
$$ 386777 383639 381895 383046 386799 391341 394886 396829 397784 399091 402104 407122 412960 418181 422815
51406D22815N319O562O897O490O831Q232R135Q321O491M956L872K803K179K767
$$ 422815 428134 434696 441593 448083 454914 463146 472281 480602 487093 492049 495921 498724 500903 503670
51392E03670L978M055K384N37L59J711K832K496J110j09j43J429L970N611M596
$$ 503670 507648 511703 514087 514624 514983 516694 519526 522022 523132 523023 522880 524309 528279 533890 538486
51377E38486J343j591k260j278m63l85k57M11J324K223K999L046J688o46k630
$$ 538486 539829 538238 535978 534700 534237 533852 533595 534006 535330 537553 540552 543598 545286 544640 542010
51362E42010l519l578l238k801k875l743m418l669k063j415k029k345j723j497
$$ 542010 538491 534913 531675 528874 525999 522256 517838 514169 512106 510691 508662 506317 504594 503097
51348E03097k364k852j897r95j773k998k425n03M12n9J0J196J580J6j882k257
$$ 503097 500733 497881 495984 494989 493216 490218 487793 487290 487702 487643 487653 488849 490429 490445 488563 486306
51332D86306j698j884k860l278k589j550r61r94j673k899m034m259l534k622k211
$$ 486306 484608 482724 479864 476586 473997 472447 471486 470492 468819 465920 461886 457627 454093 451471 449260
51317D49260k428l232m630o224p046o407m886m001m685o334p617p988p862p487
$$ 449260 446832 443600 438970 432746 425700 419293 414407 410406 405721 399387 391770 383782 375920 368433
51303C68433o487m888l790m196n541o274n817n099m954m863l858k145j082j502
$$ 368433 361946 357058 353268 349072 343531 337257 331440 326341 321387 316524 312666 310521 309439 307937
51289C07937k622k981k189j233j115j717k319k655k843k596j509qQ48O92J53k56
$$ 307937 305315 302334 300145 298912 297797 296080 293761 291106 288263 285667 284158 284150 284998 285690 285843 285587
51273B85587o39q83n06J03m48k575m585m541k533p9J859L020K882J256m97m99
$$ 285587 284948 284065 283559 283662 283214 280639 276054 271513 268980 268901 270760 273780 276662 277918 277421 276922
51257B76922J263K906L200K806K829L333L798M020M037L805L328K666J688L56
$$ 276922 278185 281091 284291 287097 289926 293259 297057 301077 305114 308919 312247 314913 316601 316957
51243C16957p75j081p85o35p71p42m93m11n26p32j626l749n957o140m015j759
$$ 316957 316182 315101 314316 313681 312910 312168 311675 311264 310738 310006 308380 304631 298674 292534 288519 286760
51227B86760j286k211l141l541l414k508j045k51q13j678j564r56j276k660l933
$$ 286760 285474 283263 280122 276581 273167 270659 269614 269363 268550 266872 265308 264352 263076 260416 256483
51212B56483m442m490m156l143j840j248j449j345l41O34L94r26k143k354j498
$$ 256483 252041 247551 243395 240252 238412 237164 235715 234370 234029 234663 235057 234131 231988 229634 228136
51197B28136o0J227J630R65j06o28k78M88J083J314J228P67p7q35p39L23J299
$$ 228136 228076 229303 230933 231898 231792 231164 230886 231374 232457 233771 234999 235766 235689 234854 234115 234438 235737
51180B35737R85m04j328q12K78M48l70q01O4J488K122J499Q8j483k555k280l13
$$ 235737 236722 236318 234990 234178 234456 234904 234534 233733 233797 235285 237407 238906 238994 237511 234956 232676 232363
51163B32363K182L267K381J092J046J874J957Q14m45r55j097j451j815j803j470
$$ 232363 234545 237812 240193 241285 242331 244205 246162 246976 246531 245576 244479 243028 241213 239410 237940
51148B37940p73O72K543L434K528R62M68J146J751J696J435J093J80j132j681
$$ 237940 237167 237839 240382 243816 246344 247306 247774 248920 250671 252367 253802 254895 255075 253943 252262
51133B52262q09O98J544J114m53k540m059l932k157QJ219J078N5j098j715j593
$$ 252262 251453 252151 253695 254809 254356 251816 247757 243825 241668 241676 242895 243973 244028 242930 241215 239622
51117B39622j203j164j461j584j226m60O09J660J977J177j65j308k269l056k690
$$ 239622 238419 237255 235794 234210 232984 232524 233133 234793 236770 237947 237782 236474 234205 231149 228459
51102B28459n27J942K410Q52o11j023j628l090l959l086j699j474k084k160j568
$$ 228459 227932 229874 232284 233136 232525 231502 229874 226784 222825 219739 218040 216566 214482 212322 210754
51087B10754j081p58j03P65J369J651J472K40j753k733j553L89R00j49j211j470
$$ 210754 209673 208915 208812 209577 210946 212597 214069 214309 212556 209823 208270 208659 209559 209410 208199 206729
51071B06729j114l8J753K899K004O5m97P16J631J005R2M48J835L188M025M049
$$ 206729 205615 205577 207330 210229 212233 212298 211801 212517 214148 215153 215245 215693 217528 220716 224741 228790
51055B28790K778O01r03p39L00R31Q97N18k46j339k003j572l19J091K288K865
$$ 228790 231568 232169 231266 230527 230827 231758 232655 233173 232927 231588 229585 228013 227694 228785 231073 233938
51039B33938K240O35o65p98l94l85n81l03L81J045J798K740L224K817K343K660
$$ 233938 236178 236813 236148 235350 234956 234571 233990 233687 234068 235113 236911 239651 242875 245692 248035 250695
51023B50695L032K180M63o89j170k076l113k365O54L666M507L748L069K478J012
$$ 250695 253727 255907 256370 255681 254511 252435 249322 246957 247611 251277 255784 259532 262601 265079 266091
51008B66091q75j656j151o02l21Q15L011M497L735J495l16j021j263j514j591
$$ 266091 265216 263560 262409 261807 261486 262301 265312 269809 273544 275039 274723 273702 272439 270925 269334
50993B69334j359r42k17J020K412L136K725J537M80L20R74J312K66j550k113m66
$$ 269334 267975 267033 266816 267836 270248 273384 276109 277646 278126 278446 279420 280732 280998 279448 277335 276869
50977B76869J909L119L388M215N641O041M701K954K330K821L483L665L039J480
$$ 276869 278778 281897 285285 289500 295141 301182 305883 308837 311167 313988 317471 321136 324175 325655
50963C25655m02j285n00J176K488K955K840K492K173J981J594P10q7L02K002L900
$$ 325655 325253 323968 323468 324644 327132 330087 332927 335419 337592 339573 341167 341877 341790 342092 344094 347994
50947C47994N160O056O916P312O960O420O178O001N915O807R048J1405J2391J2052
$$ 347994 353154 359210 366126 373438 380398 386818 392996 398997 404912 411719 420767 432172 444563 456615
$$ [...]
##END NTUPLES=NMR SPECTRUM
##END=
