
##TITLE=AC1166_Meta-centauros2_5898750_DkOoTLsF9Z
##JCAMPDX= 6.0         $$ Bruker NMR JCAMP-DX V2.0
##DATA TYPE= NMR SPECTRUM
##DATA CLASS= NTUPLES
##ORIGIN= BRUKER
##OWNER= Administrator
$$ 1.72 TOPSPIN		Version 2.1
$$ 2012-04-03 21:55:09.703 -0500  Administrator@TOPSPIN
$$ Compression mode = diff/dup
##.OBSERVE FREQUENCY= 400.13188235
##.OBSERVE NUCLEUS= ^1H
##.ACQUISITION MODE= SIMULTANEOUS (DQD)
##.ACQUISITION SCHEME= undefined
##.AVERAGES= 8
##.DIGITISER RES= 22
##SPECTROMETER/DATA SYSTEM= spect
##.PULSE SEQUENCE= zg30
##.SOLVENT NAME= COFFEE_meoh
##.SHIFT REFERENCE= INTERNAL, COFFEE_meoh, 1, 14.98061
##AUDIT TRAIL= $$ (NUMBER, WHEN, WHO, WHERE, PROCESS, VERSION, WHAT)
$$ ##TITLE= Audit trail, TOPSPIN		Version 2.1
$$ ##JCAMPDX= 5.01
$$ ##ORIGIN= Bruker BioSpin GmbH
$$ ##OWNER= Administrator
$$ $$ C:\Bruker\TOPSPIN/data/COFFEE/nmr/AC1166_Meta-centauros2_5898750_DkOoTLsF9Z/10/pdata/1/auditp.txt
$$ ##AUDIT TRAIL=  $$ (NUMBER, WHEN, WHO, WHERE, PROCESS, VERSION, WHAT)
(   1,<2012-04-03 21:55:02.921 -0500>,<Administrator>,<TOPSPIN>,<go>,<TOPSPIN 2.1>,
      <created by zg
	started at 2012-04-03 21:53:56.484 -0500,
	POWCHK enabled, PULCHK disabled,
       configuration hash MD5:
       1A 1E CE 29 27 FD 77 03 67 4E F0 E3 C4 B2 CB 90
       data hash MD5: 64K
       61 16 D8 37 39 17 BD 12 3D 92 26 5A 5C 8C A0 D8>)
(   2,<2012-04-03 21:55:05.515 -0500>,<Administrator>,<TOPSPIN>,<proc1d>,<TOPSPIN 2.1>,
      <Start of raw data processing
       efp LB = 0 FT_mod = 6 PKNL = 1 PHC0 = 0 PHC1 = 0 SI = 32K 
       data hash MD5: 32K
       14 B6 EA 76 64 AE 12 45 FC F0 7E 54 28 25 0A 80>)
(   3,<2012-04-03 21:55:05.953 -0500>,<Administrator>,<TOPSPIN>,<proc1d>,<TOPSPIN 2.1>,
      <pk PHC0 = 213.5303 PHC1 = 0 
       data hash MD5: 32K
       E7 2D 4D C0 29 12 47 6E 87 47 D5 A7 AC 0D 61 B2>)
(   4,<2012-04-03 21:55:06.046 -0500>,<Administrator>,<TOPSPIN>,<proc1d>,<TOPSPIN 2.1>,
      <abs ABSG = 1 
       data hash MD5: 32K
       A0 DB 97 9A EC 13 32 A3 88 6C F9 F0 53 36 61 71>)
(   5,<2012-04-03 21:55:06.093 -0500>,<Administrator>,<TOPSPIN>,<proc1d>,<TOPSPIN 2.1>,
      <abs ABSG = 2 
       data hash MD5: 32K
       6D 5A 16 47 EF BA 85 F6 C5 F3 56 6B 49 0F 23 64>)
(   6,<2012-04-03 21:55:06.125 -0500>,<Administrator>,<TOPSPIN>,<proc1d>,<TOPSPIN 2.1>,
      <abs ABSG = 3 
       data hash MD5: 32K
       A2 12 93 57 2A 0B 9F 96 01 27 85 60 32 5C 9F AA>)
(   7,<2012-04-03 21:55:06.156 -0500>,<Administrator>,<TOPSPIN>,<proc1d>,<TOPSPIN 2.1>,
      <abs ABSG = 4 
       data hash MD5: 32K
       06 0C 68 DA 88 8D D0 E7 53 81 08 CC E2 85 19 57>)
(   8,<2012-04-03 21:55:06.187 -0500>,<Administrator>,<TOPSPIN>,<proc1d>,<TOPSPIN 2.1>,
      <abs ABSG = 5 
       data hash MD5: 32K
       A1 A3 D7 BF 67 7A B5 00 58 AA 4C 29 EE E0 0E 49>)
$$ ##END=
$$ 
$$ $$ hash MD5
$$ $$ 07 F4 5E 46 D8 E0 98 B4 EE D4 B3 5C E7 EC D7 19
##$RELAX= 
##$RELAX= 
##$RELAX= 
##$RELAX= 
##$RELAX= 
##$RELAX= 
##$RELAX= 
$$ Bruker specific parameters
$$ --------------------------
$$ [...]
##$TP= (0..7)
150 150 150 150 150 150 150 150
##$TP07= 0
##$TPNAME0= <>
##$TPNAME1= <>
##$TPNAME2= <>
##$TPNAME3= <>
##$TPNAME4= <>
##$TPNAME5= <>
##$TPNAME6= <>
##$TPNAME7= <>
##$TPOAL= (0..7)
0.5 0.5 0.5 0.5 0.5 0.5 0.5 0.5
##$TPOFFS= (0..7)
0 0 0 0 0 0 0 0
##$TUNHIN= 0
##$TUNHOUT= 0
##$TUNXOUT= 0
##$USERA1= <user>
##$USERA2= <user>
##$USERA3= <user>
##$USERA4= <user>
##$USERA5= <user>
##$V9= 5
##$VALIST= <valist>
##$VCLIST= <CCCCCCCCCCCCCCC>
##$VD= 0
##$VDLIST= <DDDDDDDDDDDDDDD>
##$VPLIST= <PPPPPPPPPPPPPPP>
##$VTLIST= <TTTTTTTTTTTTTTT>
##$WBST= 2048
##$WBSW= 25
##$XGAIN= (0..3)
0 0 0 0
##$XL= 0
##$YL= 0
##$YMAX_a= 534211
##$YMIN_a= -647761
##$ZGOPTNS= <>
##$ZL1= 120
##$ZL2= 120
##$ZL3= 120
##$ZL4= 120
##$ABSF1= 14.98061
##$ABSF2= -5.57192
##$ABSG= 5
##$ABSL= 3
##$ALPHA= 0
##$AQORDER= 0
##$ASSFAC= 0
##$ASSFACI= 0
##$ASSFACX= 0
##$ASSWID= 0
##$AUNMP= <proc_prof1d_extract_pilot.lims>
##$AXLEFT= 0
##$AXNAME= <>
##$AXNUC= <1H>
##$AXRIGHT= 0
##$AXTYPE= 0
##$AXUNIT= <>
##$AZFE= 0.1
##$AZFW= 0.1
##$BCFW= 0
##$BC_mod= 0
##$BYTORDP= 0
##$COROFFS= 0
##$CY= 15
##$DATMOD= 1
##$DC= 0
##$DFILT= <>
##$DTYPP= 0
##$F1P= 0
##$F2P= 0
##$FCOR= 0.5
##$FTSIZE= 32768
##$FT_mod= 6
##$GAMMA= 0
##$GB= 0
##$INTBC= 1
##$INTSCL= 1
##$ISEN= 128
##$LB= 0
##$LEV0= 0
##$LPBIN= 0
##$MAXI= 10000
##$MC2= 0
##$MEAN= 0
##$ME_mod= 0
##$MI= 0
##$NCOEF= 0
##$NC_proc= -8
##$NLEV= 6
##$NOISF1= 0
##$NOISF2= 0
##$NSP= 0
##$NTH_PI= 0
##$NZP= 0
##$OFFSET= 14.98061
##$PC= 1
##$PHC0= 213.5303
##$PHC1= 0
##$PH_mod= 1
##$PKNL= yes
##$PPARMOD= 0
##$PPDIAG= 0
##$PPIPTYP= 0
##$PPMPNUM= 2147483647
##$PPRESOL= 1
##$PSCAL= 4
##$PSIGN= 0
##$PYNMP= <proc.py>
##$REVERSE= no
##$SF= 400.13
##$SI= 32768
##$SIGF1= 0
##$SIGF2= 0
##$SINO= 400
##$SIOLD= 32768
##$SPECTYP= <>
##$SREGLST= <1H.CDCl3>
##$SSB= 0
##$STSI= 32768
##$STSR= 0
##$SW_p= 8223.68421052632
##$SYMM= 0
##$S_DEV= 0
##$TDeff= 65536
##$TDoff= 0
##$TI= <>
##$TILT= no
##$TM1= 0
##$TM2= 0
##$TOPLEV= 0
##$USERP1= <user>
##$USERP2= <user>
##$USERP3= <user>
##$USERP4= <user>
##$USERP5= <user>
##$WDW= 1
##$XDIM= 32768
##$YMAX_p= 466796379
##$YMIN_p= -725815
##$CURPLOT= <Network HP LaserJet P1505>
##$CURPRIN= <$Network HP LaserJet P1505>
##$DFORMAT= <normdp>
##$LAYOUT= <+/1D_H.xwp>
##$LFORMAT= <normlp>
##$PFORMAT= <normpl>
##$SURQMSG= 1
$$ End of Bruker specific parameters
$$ ---------------------------------
##NTUPLES= NMR SPECTRUM
##VAR_NAME=  FREQUENCY,     SPECTRUM/REAL,   SPECTRUM/IMAG
##SYMBOL=    X,             R,               I
##VAR_TYPE=  INDEPENDENT,   DEPENDENT,       DEPENDENT
##VAR_FORM=  AFFN,          ASDF,            ASDF
##VAR_DIM=   32768,         32768,           32768
##UNITS=     HZ,            ARBITRARY UNITS, ARBITRARY UNITS
##FACTOR=    0.250966925370066, 1,           1
##FIRST=     8223.43324360095, -219842,      -167298
##LAST=      0,             -831,            37122
##MIN=       0,             -725815,         0
##MAX=       8223.43324360095, 466796379,    0
$$ Real data points
##PAGE= N=1
##DATA TABLE= (X++(R..R)), XYDATA
$$ [...]
$$ plain form
19477 -197072 87950 -81402 -37238 119336 -59854 152806 10266 -437815 61257 21028 55711
19466 55711 100625 69189 86525 -333639 -182676 -138970 209842 272745 -143656 -430551 48837
19454 173947 23328 43749 119236 -323816 86349 -623061 -136788 -288759 39868 -447560
19443 -239728 -57465 -318626 -363328 41602 264965 74858 198455 -140253 -298984 -15916
19432 3751 -186941 46441 -26057 -171348 -76216 288763 -43566 -17028 -385866 -60282 -95204
19421 -95204 -219152 266204 -338090 20314 47793 -155685 4475 -82292 -99425 -477321 -374712
19410 -374712 -37490 106380 -322468 72738 120305 33677 -31877 -14582 -305320 -525701 -209039
19398 -273660 -217316 -32918 70795 -133068 -334629 114158 146592 161821 -112247 78260 -404325
$$ packed form
19477a97072H7950h1402c7238A19336e9854A52806A0266d37815F1257B1028L4683
19466E5711M4914l1436J7336c33639J50963M3706B09842O2903a43656k86895D8837
19454A73947B3328K0421P5487c23816H6349f23061a36788j51971C9868d47560
19443b39728e7465k61161m4702D1602K23363G4858J23597a40253j58731a5916
19432C751a86941D6441b6057j45291g6216B88763d3566a7028l68838f0282l4922
19421i5204j23948B66204c38090B0314K7479a55685D475h2292j7133l77896J02609
19410c74712c7490A06380c22468G2738M7567C3677c1877a4582k90738k20381b09039
19398b73660N6344c2918G0795a33068k01561A14158L2434J5229a12247G8260d04325
$$ plain form
19386 36601 35397 -87910 -201564 -360146 4828 -160504 -37420 170351 269935 3105 169025
19375 169025 -31772 -161930 9411 186761 -255496 16870 -166981 34297 65234 -272194 121357
19363 -56005 -134102 -222502 -84954 -123504 250418 -336873 -67187 -182863 153041 31133 -553226
19351 -248325 -449012 -343483 -422356 -129284 -93237 268691 -161302 73644 90539 -170365
19340 189762 61244 47845 -149669 -161746 -106431 5121 -207366 101410 -44546 -107346 -63065
19329 -63065 -369813 -457802 -200532 -260759 202103 120392 -153293 13713 12141 -240338 -332880
19318 -332880 31641 -97379 -125243 27106 -163256 -197504 -181308 -162040 -52805 -236109 185113
19306 31411 -108779 163589 -125663 -55594 84059 -106151 255478 -216135 300621 302382
$$ packed form
19386C6601j204h7910j13654j58582D828a60504c7420A70351R9584C105J65920
19375A69025c1772j30158I411J77350b55496A6870a66981C4297L0937b72194A21357
19363e6005p8097q8400h4954l8550B50418c36873f7187j15676A53041C1133e53226
19351b48325k00687J05529p8873a29284L6047B68691a61302G3644J6895a70365
19340A89762F1244j3399a49669j2077N5315E121b07366A01410d4546o2800M4281
19329f3065l06748q7989b00532o0227B02103q1711a53293A3713j572b40338r2542
19318c32880C1641i7379k7864B7106a63256l4248J6196J9268e2805j83304A85113
19306C1411a08779A63589a25663e5594H4059a06151B55478b16135C00621J761
$$ plain form
19296 302382 -103953 224988 -240654 -79036 -173031 -23080 -27022 -57360 -178515 -78465 -319035
19285 -319035 -69717 -161300 -28759 -376 9011 -233522 -208321 -63406 -66565 57824 150226 -151183
19272 -113202 -90787 -57653 -213726 -284614 67385 -168291 -325113 -134079 -97847 -153792 -51022
19260 92101 -70484 99215 -8034 -78845 74507 -139795 -68672 -183225 -74454 -170277 151366
19248 30910 5709 113825 77258 25677 -102928 -113396 -67569 -16270 218320 -502324 -525190
19237 -525190 87473 -287503 31345 -237822 27169 15203 83975 321014 -2357 -102834 13225
19225 14143 -7272 -124540 -198431 -141749 -5807 126661 2293 -10382 134613 -246192 65275
19213 116477 -170242 -10065 -318615 148650 -383922 -106507 -341427 -70309 -34707 2823
$$ packed form
19296C02382a03953B24988b40654g9036r3995b3080l942l0338j21155g8465k40570
19285c19035f9717r1583b8759c76I011b33522K5201f3406l159E7824R2402a51183
19272a13202K2415L3134j56073p0888F7385a68291j56822a34079L6232n5945e1022
19260I2101g0484I9215h034p0811G4507a39795f8672j14553g4454r5823A51366
19248C0910E709J08116l6567B5677a02928j0468M5827a6270B18320e02324k2866
19237e25190H7473b87503C1345b37822B7169j1966O8772K37039b357j00477A3225
19225A4143g272j17268p3891N6682e807A26661B293a0382A34613b46192F5275
19213A16477a70242a0065l08550A48650c83922a06507k34920g0309c4707B823
$$ plain form
19202 -119327 -190334 188531 1126 40990 8505 -86189 40167 -102497 -94007 -19392 -154284
19191 -154284 205174 -257892 -207956 -180948 90771 79109 -306183 -210805 126958 162042 -59006
19179 -50182 -15882 -151830 219583 -31007 57658 -151555 -30021 70834 276094 -296635 -81339
19167 178740 64178 -227471 -230531 -271488 -167092 -348704 147240 22708 -313366 -247679 -161092
19156 -161092 -44150 -71374 -150509 -61561 -249758 155285 -191257 -183742 -94005 -132876 -200818
19145 -200818 122128 291634 -338590 -136406 -113091 -218250 166718 -54811 -73723 -142945
19135 -142945 -133106 422053 122416 -130076 118477 -115994 1514 -71774 3895 -283943 -125660
19123 177945 191381 -146012 -62913 -195065 2773 236882 -53207 63314 -242604 -47265 -399447
$$ packed form
19202a19327p1007A88531A126L9864H505h6189D0167a02497Q490a9392j34892
19191a54284B05174b57892M9936K7008I0771j1662c06183R5378A26958L5084e9006
19179e0182a5882j35948B19583c1007E7658a51555c0021G0834K05260b96635h1339
19167A78740F4178b27471l060m0957J04396j81612A47240B2708c13366O5687Q6587
19156a61092d4150k7224p9135f1561j88197A55285a91257P515Q9737l8871o7942
19145b00818A22128J69506c38590a36406K3315j05159A66718e4811j8912o9222
19135a42945R839D22053A22416a30076A18477a15994A514g1774C895b83943a25660
19123A77945J3436a46012f2913j32152B773K34109e3207F3314b42604d7265l52182
$$ plain form
19112 -399447 23465 207421 -157729 12955 -144736 315866 -95192 36593 132119 16309 -168350
19100 335918 -16263 -298022 -88204 -110810 -235119 -227774 -50303 -101063 -100180 90232 72637 171948
19088 171948 -222711 77386 75913 -116931 -234217 141338 63818 -110980 -426866 32454
19077 20137 -32495 -227168 -66277 11449 -260111 161463 -65524 76106 124321 -88451 13774
19065 -62831 -229361 11465 396079 -172357 -89274 202407 130230 182427 129898 23744 235222
19054 235222 -102666 -101952 -235057 163137 162484 -113581 -375697 -56512 -141096 139828 319540
19043 319540 144763 -84313 -246119 -81513 -58622 -196531 138096 -93905 29769 35662 -48469
19031 58467 -20107 -213356 115500 -88064 311232 -82028 -44540 62112 -65719 -173291 -149814
$$ packed form
19112c99447B3465J83956a57729A2955a44736C15866i5192C6593R5526A6309a68350
19100C35918a6263k81759h8204k2606j24309P345e0303n0760Q83I0232j7595R9311
19088A71948b22711G7386j473a16931j17286A41338F3818a10980l15886C2454
19077B0137c2495j94673f6277A1449b60111A61463f5524G6106M8215h8451A3774
19065f2831j66530A1465L84614a72357Q3083B02407p2177N2197n2529B3744K11478
19054B35222a02666P14j33105A63137o53a13581k62116e6512q4584A39828J79712
19043C19540A44763h4313j61806h1513K2891j37909A38096i3905B9769N893d8469
19031E8467b0107j93249A15500h8064C11232h2028L7488F2112f5719j07572K3477
$$ plain form
19020 -149814 34654 -102089 -26804 291014 -166940 -51624 366502 -66913 51152 -23998 -103767
19009 -103767 28091 -353676 -38348 60652 455814 127495 83410 -68212 -272659 -141243
18999 -141243 -349087 -243810 -393907 215692 -219049 -58123 305518 84180 -57655 181687
18988 -69002 -216529 100830 382454 -146543 -154223 -49378 -117977 -176023 -75117 148884 -173025
18976 27983 -224663 -277321 -196917 -203018 -106377 -135819 214976 -100630 -37291 224 -289965
18964 -276564 7481 211718 144975 194213 225891 284342 500978 215455 326708 314278 175203
18953 175203 128774 -142294 -145827 -309436 -142229 59069 -152661 217725 -14974 -14663 -201335
18942 -201335 -237165 -248158 60271 83959 -49121 -11826 -103684 -258242 119501 61211 -88582
$$ packed form
19020a49814C4654a02089b6804B91014a66940e1624C66502f6913E1152b3998p9769
19009a03767B8091c53676c8348F0652L95162A27495m4085f8212k04447J31416
18999a41243k07844J05277j50097B15692b19049e8123C05518H4180e7655A81687
18988f9002j47527A00830K81624a46543p680d9378o8599n8046g5117A48884a73025
18976B7983b24663n2658Q0404o101R6641k9442B14976a00630c7291B24b89965
18964b76564G481K04237o6743M9238L1678N8451K16636B15455J11253j2430j39075
18953A75203m6429a42294l533j63609a42229E9069a52661B17725a4974L11j86672
18942b01335l5830j0993F0271K3688d9121a1826r1858j54558A19501n8290h8582
$$ plain form
18930 30592 -619378 214258 202327 37930 202732 -86545 -341858 -229182 -326261 -234751 53812
18918 -248505 -132010 -151373 38876 65691 -148885 123090 24091 156549 -296925 11206
18907 -85796 67826 296 251624 -29379 -31622 -4220 27786 32163 -947 85984 221420 278593 213043
18894 213043 203597 313292 183890 309440 217742 90783 235127 -30289 211772 160066 198550
18883 198550 -190929 -10115 71050 -51714 -108918 42077 -87745 -21907 28552 -24313 -155495
18872 -155495 -67783 -30585 -102266 135904 -355606 51983 215608 -165522 -133660 -58151 -123730
18861 -123730 46879 -251334 -111702 -296984 -226967 88174 -103535 -81773 -61624 -63957 122820
18849 -201547 -67778 -223429 -46868 39269 -68663 10856 82842 -445459 -197628 -25816 -25708
$$ packed form
18930C0592f19378B14258j1931C7930J64802h6545k55313J12676r7079R1510E3812
18918b48505J16495j9363C8876K6815a48885A23090B4091J32458b96925A1206
18907h5796F7826B96K51328b9379k243d220B7786M377i47H5984J35436N7173o5550
18894B13043r446J09695j29402J25550r1698I0783J44344c0289B11772n1706L8484
18883A98550a90929a0115G1050e1714n7204D2077h7745b1907B8552b4313j31182
18872a55495f7783c0585p1681A35904c55606E1983J63625a65522L1862e8151o5579
18861a23730D6879b51334a11702j85282P0017H8174a03535K1762K0149k333A22820
18849b01547f7778j55651d6868C9269f8663A0856P1986d45459a97628b5816J08
$$ plain form
18838 -25708 -41226 -284052 -51046 1764 341726 75583 -281043 -303876 -29888 -241483 173248
18826 12939 810 -57052 -44568 127661 114313 26481 82655 131101 -158957 164307 -252658
18814 -195228 -493937 146510 -120257 -16802 -316742 119336 25531 28846 28266 37358 309094
18803 309094 275494 133673 46062 105886 44231 323175 85007 240715 -35219 60400 -16482
18791 -12695 179517 183183 60919 -59097 -6725 314048 135732 -77825 71021 394175 -133611
18779 -38474 -210985 -218124 -238203 -262000 34536 -332824 -170369 -46243 208858 -197787 -1804
18767 -158924 -274973 -343999 -186720 129150 -273948 -204345 11914 -432035 -28002 185238
18756 -38577 -80575 144365 -431328 -272873 -294849 -251524 -162161 60785 200422 187988 -175985
$$ packed form
18838b5708j5518k42826e1046A764L39962G5583b81043k2833b9888k11595A73248
18826A2939H10e7052J2484A27661j3348B6481N6174M8446a58957A64307b52658
18814a95228k98709A46510a20257a6802k99940A19336B5531L315n80R092K71736
18803C09094l3600A33673D6062N9824D4231K78944H5007J55708c5219F0400a6482
18791a2695A79517L666F0919e9097f725C14048A35732g7825G1021L23154a33611
18779c8474j72511p139k0079k3797C4536c32824J62455d6243B08858a97787a804
18767a58924j16049o9026J57279A29150b73948O9603A1914d32035b8002A85238
18756c8577m1998A44365d31328J58455k1976M3325Q9363F0785J39637j2434a75985
$$ plain form
18744 182728 103226 -124051 -339985 -22662 -150636 74209 -26822 194461 182282 -224455
18733 -224010 108344 -211863 -229688 158423 169880 110857 25220 136300 145890 -82286 -235912
18722 -235912 44209 -86806 -197864 -369025 125082 105367 -407581 3930 -18567 85894 -253546
18710 -86486 67742 -10700 -187419 -129778 -57382 13751 -92737 -13635 -43168 -47781 -285614
18699 -285614 -1076 -57253 318906 58831 -67190 216412 -12874 160071 5553 177992 -205052
18687 -43238 -360477 211418 -38029 -136274 69655 44436 -150975 -178528 -19080 -59887 -121928
18676 -121928 -147222 3384 344836 -260420 -202059 -292588 -470648 291881 -63964 148697 -162407
18664 240228 -141607 179561 25991 -260627 189254 153496 -239026 -85934 92392 11396
$$ packed form
18744A82728p9502a24051k15934b2662j27974G4209b6822A94461j2179b24455
18733b24010A08344b11863j7825A58423J1457n9023B5220J11080R590h2286j53626
18722b35912D4209h6806j11058j71161A25082j9715d07581C930a8567H5894b53546
18710h6486F7742a0700j76719N7641e7382A3751i2737a3635k9533m613k37833
18699b85614a076n6177C18906E8831f7190B16412a2874A60071E553J72439b05052
18687d3238l17239B11418c8029r8245F9655k5219a50975k7553a9080m0807o2041
18676a21928k5294C384L41452b60420N8361r0529j78060B91881f3964A48697a62407
18664B40228a41607A79561B5991b60627A89254l5758b39026h5934I2392A1396
$$ plain form
18653 89320 -264078 237263 -309991 32759 -14318 -291369 -209489 241431 -257210 -106412
18642 166224 17809 -115410 -345385 -227419 89352 -101264 -147454 -304001 -230854 55050
18631 70627 -46333 69251 -102024 54777 -105556 166190 92976 -352661 -93494 -57091 334084
18619 77581 191102 142688 -280067 104191 103484 14347 -42625 -34840 -66580 -439597 141219
18607 -58879 -128655 -69107 -156299 99200 -21063 -8993 -229295 -112665 -38644 -16035 -58749
18596 -58749 142203 127062 46639 -69762 45256 -27608 -13678 -228848 -70019 68510 83341
18585 83341 -268907 110326 168433 -32506 -367978 167974 -156501 188339 -161222 -33227
18574 -66465 -147617 -139409 -230050 -320253 -25600 -14300 126146 -326507 78037 -127330 205748
$$ packed form
18653H9320b64078B37263c09991C2759a4318k77051Q1880B41431b57210a06412
18642A66224A7809a15410k29975J17966H9352a01264m6190j56547P3147E5050
18631G0627d6333F9251a02024E4777a05556A66190p3214c52661i3494L6403C34084
18619G7581J13521m8414b80067A04191p07A4347d2625P785l1740l73017A41219
18607e8879o9776N9548q7192I9200b1063h993k20302a12665c8644a6035m2714
18596e8749A42203j5141D6639f9762D5256b7608a3678k15170g0019F8510J4831
18585H3341b68907A10326N8107c2506l35472A67974a56501A88339a61222c3227
18574f6465q1152Q208r0641r0203b5600J1300A26146c26507G8037a27330B05748
$$ plain form
18562 -452713 157619 13083 100996 88711 146010 -132834 -129244 -44519 -268242 22586 -103676
18550 -80285 -226839 -458370 -185688 -262420 -57660 -165457 -67402 -284394 -5783 247282 56954
18538 123611 37615 -170082 -270225 -6202 -116182 193931 -145539 -427372 -283647 -6316
18527 -73584 196949 -97162 266534 20859 -53236 -77190 336177 -407923 43865 40984 320310
18516 320310 -202099 -191526 226582 -102623 17568 -3282 -223079 -85112 120016 53165 57016
18505 57016 -160852 -199395 59018 81892 -128201 -47200 -16471 -59210 -254089 6556 -25226
18493 -3211 -2419 33607 -296823 -75602 51801 171942 -43539 139462 -225731 -2035 -459991
18482 -459991 -118344 -111944 14273 -321947 536 -267773 -103535 226119 -231444 -33531 -204028
$$ packed form
18562d52713A57619A3083Q7913j2285N7299a32834L590d4519k23723B2586a03676
18550h0285j46554k31531a85688p6732e7660j07797f7402k16992e783B47282E6954
18538A23611C7615a70082j00143f202j09980A93931a45539k81833J43725f316
18527g3584A96949i7162B66534B0859e3236k3954C36177d07923D3865k881K79326
18516C20310b02099J0573B26582a02623A7568c282k19797h5112A20016E3165L851
18505E7016a60852l8543E9018K2874a28201d7200a6471m2739j94879F556b5226
18493c211P92C3607b96823g5602E1801J20141d3539A39462b25731b035m57956
18482d59991a18344O400A4273c21947E36b67773a03535B26119b31444c3531j70497
$$ plain form
18471 -204028 -180970 -444495 -119296 262832 115649 -144082 85086 -57080 -56174 357909 52346
18459 -56584 38660 70553 -216437 43850 136645 -180754 -242082 143981 324496 -127184 -50010
18447 154388 344178 -66249 -34613 211658 -469570 135106 -223325 -28074 -66836 415471
18436 -250167 -207 -21477 -161356 -260685 -186296 -182909 -188614 -137634 -169101 165532 -12965 76274
18423 39168 -43747 -208947 291073 76621 173947 -283446 135030 -261789 89021 -260128
18412 233010 88574 -249647 -223585 86429 38998 -68049 222295 20110 284406 -25955 63035
18400 -359495 -75589 222266 -107616 170176 183207 -43078 -189576 10390 -151284 -62758
18389 -125160 86638 -237156 22662 -348723 -100927 -61138 3669 -63043 -201065 123427 -281696
$$ packed form
18471b04028K3058k63525a19296B62832A15649a44082H5086e7080R06C57909E2346
18459e6584C8660L1893b16437D3850R2795a80754o1328A43981J80515a27184e0010
18447A54388J89790f6249L1636B11658d69570A35106b23325b8074l8762D15471
18436b50167b07k1270j39879r9329P4389L387n705N0980l1467A65532a2965G6274
18423C9168d3747j65200B91073G6621R7326b83446A35030b61789H9021b60128
18412B33010H8574b49647K6062H6429C8998f8049B22295B0110K64296b5955F3035
18400c59495g5589B22266a07616A70176J3031d3078j46498A0390a51284f2758
18389a25160H6638b37156B2662c48723a00927L9789C669f3043j38022A23427b81696
$$ plain form
18377 280428 -113633 -226717 -326131 268285 -75427 -215851 -216748 39318 -223012 -129814 -223155
18366 -223155 -181608 148205 166076 189230 195149 -149156 125866 -145384 -403237 33892 -165302
18354 -97443 -379444 -256224 -44665 68634 121228 186342 180642 97051 67698 186036 -270924
18342 -87256 168317 -185710 -309130 -143031 -149043 -146290 -103777 70427 27429 -84868 -84011 -515135
18330 -515135 208317 -42536 -85432 -60811 -129195 89220 -190725 122974 -201104 -92502 -38474
18318 -993 45787 -181010 -213845 917 -30465 -143140 38960 17799 -183210 136242 -190171
18306 70150 289858 -294769 -195323 -85965 78763 267628 5739 218638 250132 350 37210
18295 37210 21459 225060 -89179 134942 -210759 42843 -106573 32746 -208125 107128
$$ packed form
18377B80428a13633j13084r9414B68285g5427j40424q97C9318b23012R3198r3341
18366b23155M1547A48205J7871K3154N919a49156A25866a45384k57853C3892a65302
18354i7443k82001J23220d4665F8634N2594O5114n700q3591k9353J18338b70924
18342h7256A68317a85710j23420a43031o012K753M2513G0427B7429h4868Q57m31124
18330e15135B08317d2536m2896K4621o8384H9220a90725A22974b01104i2502c8474
18318i93D5787a81010l2835I17c0465j12675C8960A7799a83210A36242a90171
18306G0150K19708b94769R9446h5965G8763J88865E739K12899L1494C50L6860
18295C7210j5751K03601h9179A34942b10759D2843a06573C2746b08125A07128
$$ plain form
18284 -12003 46078 -4478 -91364 -4302 -295382 112996 21972 -344 191889 8371 -9242 -149694
18272 -149694 75932 265614 -272998 133023 4474 -89413 24880 24978 -249261 -138582 174940
18260 36151 -238527 -68221 -27198 62359 -2966 176706 -33304 -40156 192910 -31674 -136455
18249 -136455 37418 -144183 -39284 119473 -20096 58906 311 128666 -350609 123163 264597
18238 264597 188680 -276199 -40007 -13054 144466 171823 -110106 189160 -620 -83759 489055
18226 201253 -131024 -115315 143622 -203177 42981 27965 69103 59214 265795 -120083 -36312
18214 -216443 4211 -82992 -210934 27012 -15616 267023 -131032 183892 -118807 -240073
18204 -240073 -16248 -279262 -39859 -94807 66598 74354 -167063 120357 -87476 -482839 -205058
$$ packed form
18284a2003D6078d478q6886d302k91080A12996B1972c44A91889H371i242j40452
18272a49694G5932J89682b72998A33023D474h9413B4880R8b49261J10679A74940
18260C6151b38527f8221b7198F2359b966A76706c3304o852A92910c1674j04781
18249a36455C7418a44183c9284A19473b0096E8906C11J28355c50609A23163J41434
18238B64597p5917b76199d0007a3054A44466K7357a10106A89160f20q3139D89055
18226B01253a31024J5709A43622b03177D2981j5016M1138r889K06581a20083c6312
18214b16443D211h2992j27942B7012a5616B67023a31032A83892a18807j21266
18204b40073a6248k63014c9859n4948F6598P756a67063A20357h7476l95363b05058
$$ plain form
18192 53880 187681 390382 -145174 295269 -56141 -24851 150481 -459 -304638 187544 6386
18180 149661 -89990 -114794 -123914 -259705 -84982 -489552 -180844 155417 84917 -52160 -33214
18169 -33214 8266 -286940 -215326 -80405 -61374 -92659 2398 -147784 -38739 103671 35059
18157 83947 -84690 -144112 175767 -115605 65065 -245961 -289505 -349663 167539 -29766 85366
18145 73336 -69332 -30783 -88710 -156456 153826 26719 -20019 -44129 90659 -154768 -203590
18134 -203590 219107 277754 52715 -110675 -95610 -15621 -112136 -256560 200278 55178 210790
18123 210790 255042 -128562 -192719 346868 48865 54340 -8473 147498 -26285 -198096 49216
18111 -110550 278181 136833 75321 176386 65511 182502 86183 307296 -132853 -20949
$$ packed form
18192E3880J33801K02701a45174B95269e6141b4851A50481d59l04179A87544F386
18180A49661h9990k4804r120j35791h4982m04570a80844A55417p0500e2160J8946
18169c3214H266b86940P1614h0405J9031l1285B398a47784c8739A03671C5059
18157H3947h4690n9422A75767a15605F5065b45961m3544o0158A67539b9766H5366
18145G3336f9332c0783n7927o7746A53826B6719b0019k4110I0659a54768m8822
18134b03590B19107N8647E2715a10675J5065a5621r6515j44424B00278E5178J55612
18123B10790M4252a28562o4157C46868D8865N475h473A47498b6285j71811D9216
18111a10550B78181A36833o1512J01065F5511J16991H6183K21113a32853b0949
$$ plain form
18100 157122 317453 -118964 146378 539094 -31962 -47761 -9337 -273331 41140 62185 -307935
18088 -175243 39989 -9703 -101113 -290410 -58715 -100578 30150 -381862 149784 -119226 -192305
18077 -192305 -76892 -220078 -300623 137345 -38942 13700 -204485 129178 -178076 -195798
18067 -195798 8856 8177 -141903 216497 103166 -256304 -22008 175646 78925 -293389 170125
18055 55942 177540 134420 -20207 196844 -44549 -57474 -110796 -21498 159973 -125789 -165820
18044 -165820 199032 -192463 75435 161898 64147 87677 114785 164924 145806 235861 146449
18033 146449 -200349 -97251 190610 48143 70881 88335 102096 -34262 -164380 -67789 -188672
18022 -188672 183449 65015 -59719 -98289 95300 -143038 -261552 -40874 42163 158278 -197653
$$ packed form
18100A57122J60331a18964A46378L92716c1962j5799i337k63994D1140K1045c07935
18088a75243C9989i703r1410j89297e8715m1863C0150c81862A49784a19226p3079
18077a92305g6892j43186q0545A37345c8942A3700b04485A29178a78076j7722
18067a95798H856o79a41903B16497A03166b56304b2008A75646G8925b93389A70125
18055E5942J21598m3120b0207A96844d4549j2925n3322b1498A59973a25789m0031
18044a65820A99032a92463G5435Q6463F4147K3530K7108N0139j9118R0055q9412
18033A46449b00349i7251A90610D8143K2738J7454J3761c4262j30118f7789j20883
18022a88672A83449F5015e9719l8570I5300a43038j18514d0874D2163J16115a97653
$$ plain form
18010 -77812 238570 275688 -284788 -72869 93926 -103326 -130999 -306914 105941 22197 -285495
17998 95439 -182736 234547 -71771 45953 194790 -10743 126134 34629 16450 -78570 231085
17986 -481085 -86873 -106694 -212201 60060 -283695 529625 34446 188672 -117771 11220
17975 10738 -190823 56969 -146059 -97286 107133 -121811 -168671 -11324 -306487 200798
17964 153824 141018 354238 -111559 12302 -113629 45268 48084 248088 171646 325267 124400
17952 -224942 -77095 -122503 -178083 -194307 225873 14223 -328637 70137 20203 27382 205870
17941 205870 65872 -311659 31574 245041 -100532 -43690 -42520 208988 178994 315611 -31303
17929 -238976 95410 77517 19923 -143457 157619 100066 70484 -17385 -137345 201674 -75384
$$ packed form
18010g7812B38570L7118b84788g2869I3926a03326k7673j75915A05941B2197b85495
17998I5439a82736B34547g1771D5953J48837a0743A26134C4629A6450g8570B31085
17986d81085h6873j9821j05507F0060b83695E29625C4446J54226a17771A1220
17975A0738a90823E6969a46059M8773A07133a21811m6860a1324k95163B00798
17964A53824j2806K13220a11559A2302a13629D5268K816K00004p6442J53621A24400
17952b24942g7095m5408n5580j6224B25873A4223c28637G0137B0203P179J78488
17941B05870F5872c11659C1574K13467a00532d3690J170B08988k9994J36617c1303
17929b38976I5410j7893A9923a43457A57619n7553k9582a7385j19960B01674g5384
$$ plain form
17917 -50557 27195 -1313 -303541 122521 -179802 -417861 -79321 -151351 -350752 661926 315811
17905 114775 208703 138531 147517 -57576 -79204 30080 -12625 -245443 89711 99133 -127234
17893 201933 109453 392055 339925 3308 -301930 -40471 -14160 -318201 -218643 67884 -47715
17881 -119077 13104 114342 -623 -189449 -59566 -312617 112155 85161 103170 140993 114326
17870 114326 19879 -102054 343423 -29465 213837 362300 -221101 -11017 125465 181932
17860 181932 -36717 310984 -53695 -42906 142800 -20273 145953 216584 -67572 -82641 -87398
17849 -87398 -97470 33610 -6764 -31138 -102644 -45254 -121412 -201931 -2260 -231392 601 -138415
17836 127379 178827 -43109 107235 215276 215267 52724 -24133 -145523 -16368 -216832 -43731
$$ packed form
17917e0557B7195a313l02228A22521a79802k38059g9321p2030j99401F61926C15811
17905A14775R3928p0172Q986e7576k1628C0080a2625k32818H9711R422a27234
17893B01933r2480K82602n2130C308c01930d0471a4160l04041R9558F7884d7715
17881a19077A3104J01238f23j88826e9566k53051A12155k6994J8009L7823k6667
17870A14326A9879a02054C43423b9465B13837J48463b21101a1017A25465N6467
17860A81932c6717C10984e3695J0789A42800b0273A45953P0631f7572j5069m757
17849h7398j0072C3610f764k4374p1506d5254p6158q0519b260k29132F01a38415
17836A27379N1448d3109A07235J08041rE2724b4133j21390a6368k00464d3731
$$ plain form
17824 17902 -64946 31658 211231 -55255 -141866 -123291 12048 143238 240049 36385 105170
17813 105170 143025 158742 71357 -49146 -118751 16608 -239067 3805 68709 223351 107640
17801 -40552 60448 -89372 -14423 -42533 191291 139280 226215 5384 213197 48618 200794
17790 200794 168806 -363434 -175013 299656 -32233 63890 486620 67884 175477 22714
17779 344131 10100 18815 -145910 77260 88244 -30770 -400823 27089 45394 -46834 219097
17767 -59163 19308 -18730 89053 126118 -33408 112043 219824 -277350 246493 310827 -51869
17755 -268380 -39327 194671 152486 197640 -209838 -51183 103713 236143 186406 92684 143900
17744 143900 -227131 105143 208451 41969 145222 280417 77058 149111 371610 -42274
$$ packed form
17824A7902f4946C1658J79573e5255q6611J8575A2048J31190R6811C6385O8785
17813A05170L7855J5717G1357d9146o9605A6608b39067C805O4904J54642A07640
17801d0552F0448h9372a4423k8110A91291n2011Q6935E384K07813D8618J52176
17790B00794l1988c63434a75013B99656c2233F3890M22730F7884J07593B2714
17779C44131A0100Q715a45910G7260J0984c0770l70053B7089J8305d6834B19097
17767e9163A9308a8730H9053L7065c3408A12043J07781b77350B46493O4334e1869
17755b68380c9327A94671m2185M5154b09838e1183A03713J32430m9737I2684N1216
17744A43900b27131A05143J03308D1969J03253J35195G7058P2053K22499d2274
$$ plain form
17733 -125972 63464 80090 -60364 -43124 352980 -38191 148533 13815 -173388 111210 -64736
17721 82692 230940 -397888 274535 165915 -111632 -118820 93050 3670 -133155 161730 -15930
17709 -128871 162246 -204975 -166992 -52639 440381 480405 47792 -43722 391030 -76792 -42741
17698 -42741 -157268 -128862 53524 37590 258655 225433 -156021 35936 -3594 48602 -346138
17686 176613 126534 348980 -215687 93788 284702 275582 154426 -316971 302296 6123 217029
17675 217029 22124 158309 208448 55844 -7512 126368 -39279 531522 231575 -62536 -223780
17664 -223780 188043 169147 230987 -56868 -21770 169729 -131108 -58822 91709 118645 72550
17653 72550 172205 -65126 -23593 -36133 314231 114001 27830 134413 -33458 440440 -25387
$$ packed form
17733a25972F3464J6626f0364J7240C52980c8191A48533A3815a73388A11210f4736
17721H2692J48248c97888B74535j08620a11632p188I3050C670a33155A61730a5930
17709a28871A62246b04975L7983e2639D40381M0024D7792d3722C91030g6792L4051
17698d2741j14527K8406E3524j5934K21065l3222a56021C5936c594D8602c46138
17686A76613n0079K22446b15687I3788J90914r120j21156c16971C02296F123K10906
17675B17029B2124J36185N0139E5844g512A26368c9279E31522B31575f2536j61244
17664b23780A88043j8896O1840e6868b1770A69729a31108e8822I1709K6936m6095
17653G2550R9655f5126b3593j2540C14231A14001B7830J06583c3458D40440b5387
$$ plain form
17641 4843 403497 54425 135671 -239592 155457 -53421 21609 -108276 37583 372417 -32797
17629 108447 -234016 114320 273469 266527 -70966 -125114 -135005 189274 250679 244527 -96009
17617 251390 48042 -150699 -24422 513197 115738 162786 18622 -12045 393234 44647 204470
17606 204470 244135 11084 293047 191698 226425 -120387 114447 -330428 40291 -217415
17595 169829 260128 -104449 193601 270341 66998 118589 163442 270333 -39078 86746 197491
17584 197491 -31262 224286 16587 56177 135306 -12897 2696 -61428 -43210 245142 33860
17572 250795 -113254 193869 248737 509687 321798 -9042 28606 316986 251036 -63799 104410
17560 16721 288661 22742 185386 232581 431425 267696 38784 -223575 25505 -123646
$$ packed form
17641D843L98654E4425Q1246b39592A55457e3421B1609a08276C7583L34834c2797
17629A08447b34016A14320J59149o942g0966n4148r891A89274O1405o152i6009
17617B51390D8042a50699b4422E13197A15738M7048A8622a2045C93234D4647J59823
17606B04470L9665A1084K81963j01349L4727a20387A14447c30428D0291b17415
17595A69829R0299a04449A93601P6740F6998N1591M4853J06891c9078H6746J10745
17584A97491c1262B24286A6587L9590P9129a2897B696f1428J8218B45142C3860
17572B50795a13254A93869N4868K60950j87889i042B8606K88380o5950f3799A04410
17560A6721K71940B2742J62644M7195J98844j63729C8784b23575B5505a23646
$$ plain form
17549 379947 325900 257973 232526 195878 206695 -35639 223425 -100218 396772 75130 459391
17538 459391 -136177 -436158 470276 302817 222121 39712 195908 311126 56670 330447
17528 330447 451274 219868 335090 276722 100459 208579 43778 185373 641081 39591
17517 268869 266432 202779 257890 334377 122266 456398 715555 530565 754983 892939
17507 892939 654097 645430 571841 644155 458946 433620 514695 375264 145896 242565 416933
17496 416933 746941 586912 724115 739502 840862 574188 320934 644544 315101 509175
17486 509175 380117 462754 112671 337441 418692 188548 498693 94024 185070 198343
17476 198343 160840 165369 283949 40150 54317 24449 -9889 326809 167632 357838 381239
$$ packed form
17549C79947n4047o7927k5447l6648J0817c5639B23425a00218C96772G5130L84261
17538D59391a36177k99981D70276j67459q0696C9712J56196J15218E6670K73777
17528C30447J20827B19868J15222n8368A00459J08120D3778J41595M55708C9591
17517B68869k437o3653N5111P6487A22266L34132K59157j84990K24418J37956
17507H92939k38842q667p3589P2314j85209k5326Q1075j39431A45896R6669J74368
17496D16933L30008j60029J37203J5387J01360k66674k53254L23610C15101J94074
17486E09175j29058Q2637A12671K24770Q1251A88548L10145I4024R1046J3273
17476A98343l7503M529J18580D0150J4167B4449i889C26809j59177J90206K3401
$$ plain form
17465 381239 334092 125233 202902 71031 99970 113845 315590 288997 269047 409179 178903
17453 344250 213499 104302 215541 254713 212959 174421 387797 162506 595808 428652
17443 428652 310032 312974 176116 17972 106392 65708 100009 687435 6208 335739 341369
17432 341369 367491 368401 262057 184293 448078 439263 502553 429077 -67469 385617 350712
17421 350712 503946 -100338 391754 25903 298794 383163 386768 259162 277380 156249
17411 156249 567942 253745 461394 366412 596098 203089 442120 525778 327138 128333
17400 511989 368478 282217 235308 231975 382620 447658 108521 -2000 531105 33224 64968
17389 64968 6614 566229 327921 38846 46895 506201 354428 196125 51205 419689 280793
$$ packed form
17465C81239m7147A25233P7669G1031K8939J3875K01745k6593j9950J40132A78903
17453C44250j30751A04302J11239L9172m1754l8538K13376A62506M33302j67156
17443D28652j18620K942j36858A7972Q8420m0684L4301N87426F208L29531N630
17432C41369K6122R10j06344p7764K63785q815O3290p3476f7469C85617l4905
17421C50712J53234a00338C91754B5903K72891Q4369L605j27606J8218j21131
17411A56249M11693B53745K07649r4982K29686B03089K39031Q3658j98640A28333
17400E11989j43511q6261m6909l333J50645O5038A08521b000E31105C3224L1744
17389F4968F614N59615k38308C8846Q049M59306j51773j58303E1205L68484j38896
$$ plain form
17378 280793 344680 287932 476902 -29491 343465 284251 361458 136341 370404 334152 221771
17367 221771 287529 107518 192149 174894 354651 211695 192910 303222 -69093 511874
17356 363813 438973 356773 68231 4863 233717 337091 166573 352284 151662 247143 239973
17345 239973 108168 293408 377522 455964 486652 -3861 383238 94332 201385 22037 122940
17334 122940 330000 18163 163020 333127 107010 312509 370347 77222 615584 100664
17323 245222 418536 58649 177129 53763 185941 451054 213369 -14244 -33049 -206563
17313 -206563 85311 385122 190900 344507 249523 144235 402705 109824 172489 476424
17303 476424 6230 240485 145231 232088 373240 492430 429783 380067 158507 254565 191026
$$ packed form
17378B80793O3887n6748J88970b9491C43465n9214P7207A36341K34063l6252j12381
17367B21771O5758A07518Q4631j7255J79757j42956j8785J10312f9093E11874
17356C63813P5160q2200F8231D863K28854J03374A66573J85711A51662R5481p170
17345B39973A08168J85240Q4114P8442L0688c861C83238I4332J07053B2037J00903
17334A22940K07060A8163J44857J70107A07010K05499N7838G7222N38362A00664
17323B45222J73314E8649J18480E3763J32178K65113B13369a4244j8805j73514
17313b06563H5311K99811A90900J53607r4984j05288K58470A09824O2665L03935
17303D76424F230K34255r5254Q6857J41152J19190o2647m9716A58507R6058o3539
$$ plain form
17292 191026 424401 -146015 483460 324539 376854 230868 198531 72031 435924 356720
17282 356720 381673 170321 282369 310356 348945 96414 565607 254169 287580 246934 138522
17271 138522 -113989 450080 304974 346021 232233 304086 324907 127465 38314 38166 320602
17260 320602 357501 200140 232999 134304 76698 237226 357987 451749 380893 531983 411339
17249 411339 284376 236774 324874 454945 257205 435027 251444 20945 294764 512019
17239 512019 226563 493489 236281 248690 348064 -53612 45053 197177 504924 326681
17229 326681 312725 46920 520819 241320 163517 527433 177410 204260 476729 270002
17219 270002 402835 547171 223686 384358 456029 182736 403896 554101 301546 176005
$$ packed form
17292A91026K33375a46015D83460j58921N2315j45986l2337G2031L63893p9204
17282C56720K4953A70321J12048K7987L8589I6414M69193B54169L3411m0646j08412
17271A38522a13989D50080j45106M1047j13788P1853K0821A27465C8314j48K82436
17260C20602L6899j57361L2859r8695n7606J60528J20761R3762p0856J51090j20644
17249D11339j26963m7602Q8100J30071j97740J77822j83583B0945K73819K17255
17239E12019B26563K66926B36281J2409R9374e3612D5053J52124L07747j78243
17229C26681j3956D6920M73899B41320p7803L63916A77410K6850K72469k06727
17219B70002J32833J44336B23686J60672P1671A82736K21160J50205k52555j25541
$$ plain form
17209 176005 438893 492683 835703 260369 319552 646644 287696 224640 349910 721024
17199 721024 328997 459953 239377 251519 281917 223353 359615 640421 455512 350016
17189 350016 649921 396004 206719 147650 361349 358550 485839 182470 400604 586964
17179 586964 244552 196221 464968 506457 462696 539362 299536 377465 591539 321529
17169 321529 428361 431669 278958 512966 212440 444417 673218 854027 168646 520977
17159 520977 79872 275514 395113 420259 361066 591527 667146 436363 591850 376549
17149 376549 621946 409514 244351 607525 490387 501338 361048 858938 242987 398534
17139 398534 513762 364068 353609 312954 222243 425981 487786 264028 524603 489811
$$ packed form
17209A76005K62888N3790L43020B60369N9183L27092B87696o3056J25270L71114
17199G21024C28997J30956k20576J2142L0398n8564J36262K80806j84909j05496
17189C50016K99905k53917j89285n9069K13699k799J27289A82470K18134J86360
17179E86964B44552m8331K68747M1489m3761P6666k39826P7929K14074k70010
17169C21529J06832L308j52711K34008B12440K31977K28801J80809A68646L52331
17159E20977G9872J95642J19599K5146n9193K30461P5619k30783J55487k15301
17149C76549K45397k12432j65163L63174j17138J0951j40290M97890B42987J55547
17139C98534J15228j49694j0459m0655r0711K03738O1805k23758K60575l4792
$$ plain form
17129 489811 374709 415632 193650 519868 602960 313713 632961 820600 365662 337340
17119 337340 617334 563454 479177 307264 580802 635975 383781 728214 564077 557040
17109 557040 752917 606793 298372 238386 603474 645640 729674 244336 661869 763790
17099 763790 662925 486494 425502 315267 397253 594519 632639 586341 597132 526554 573228
17088 573228 716235 573445 821449 609027 651823 646553 266741 469383 550858 436700
17078 436700 684650 452287 757476 524355 930857 731414 563382 483669 577223 577703
17068 577703 674295 685952 906124 701866 737632 658269 758914 530487 755359 622505
17058 622505 700512 508234 557377 518714 928002 491431 721873 644338 628934 405216
$$ packed form
17129D89811j15102M0923A93650L26218Q3092k89247L19248J87639C65662k8322
17119C37340K79994n3880q4277j71913K73538N5173k52194L44433j64137p037
17109E57040J95877j46124B98372n9986L65088M2166Q4034B44336M17533J01921
17099G63790j00865j76431o0992j10235Q1986J97266L8120m6298J0791p0578M6674
17088E73228J43007j42790K48004k12422M2796n270B66741K02642Q1475j14158
17078D36700K47950k32363L05189k33121M06502j99443j68032p9713R3554M80
17068E77703R6592J1657K20172k04258L5766p9363J00645k28427K24872j32854
17058F22505P8007j92278M9143l8663M09288m36571K30442p7535j5404k23718
$$ plain form
17048 405216 1024027 700241 681834 1222744 782356 713724 644143 759100 690599 706197
17038 706197 786213 573500 746520 510677 759408 793353 583303 942039 529679 839692
17028 839692 345120 720563 601420 871104 772615 752154 783224 1078471 765737 668792
17018 668792 722017 1130353 1009003 1088568 764668 867834 953642 971383 996506 902215 1167894
17007 1167894 1291887 989690 1163752 883830 799342 831015 1224781 760244 1062632 935088
16997 935088 724671 1072135 1118127 1237493 1064002 925631 1217188 629341 1195612 856809
16987 856809 1092247 952351 1056146 1030368 1312441 1119686 1004320 1115804 1123598 1070321
16977 1070321 1332964 1157725 1335660 1371773 1296058 1070378 1222207 1081673 1249064 938512
$$ packed form
17048D05216O18811l23786j8407N40910m40388o8632o9581J14957o8501J5598
17038G06197Q0016k12713J73020k35843K48731L3945k10050L58736m12360L10013
17028H39692C45120L75443j19143K69684r8489k0461L1070K95247l12734r6945
17018F68792N3225M08336j21350P9565l23900J03166Q5808J7741K5123r4291K65679
17007A167894J23993l02197J74062k79922q4488L1673L93766m64537L02388j27544
16997I35088k10417L47464M5992J19366j73491j38371K91557n87847N66271l38803
16987H56809K35438j39896J03795k5778K82073j92755j15366J11484P794n3277
16977A070321K62643j75239J77935L6113p5715k25680J51829j40534J67391l10552
$$ plain form
16967 938512 1372696 1386074 1416961 1055165 1440358 1277134 1399471 1500677 1136234 1515569
16957 1515569 1245977 1281600 1586796 1441225 1159348 1430274 1555849 1108497 1260050 1556247
16947 1556247 1497544 1635297 1288054 1579342 1407616 1469801 1370954 1573714 1636551 1315902
16937 1315902 1394896 1887916 1199283 1404748 1623635 1906621 1797428 1920035 1539723 1601328
16927 1601328 1694237 1939466 1420015 1464776 1854673 1809008 1736369 1923256 1619290 1983234
16917 1983234 1666055 1623293 1777344 1951350 1976353 1774018 2262436 1880558 1972772 2148607
16907 2148607 2399057 1974796 1787543 1960615 1848224 2483867 2190207 2441142 2038345
16898 2038345 1846545 2137489 2338840 2376557 2370590 2354862 2319051 2498104 2475267 2331937
$$ packed form
16967I38512M34184J3378L0887l61796L85193j63224J22337J01206l64443L79335
16957A515569k69592L5623L05196j45571k81877K70926J25575m47352J51553K96197
16947A556247n8703J37753l47243K91288j71726O2185r8847K02760O2837l20649
16937A315902P8994M93020o88633K05465K18887K82986j09193J22607l80312O1605
16927A601328R2909K45229n19451M4761L89897m5665p2639J86887l03966L63944
16917A983234l17179m2762J54051J74006K5003k02335M88418l81878R2214J75835
16907B148607K50450m24261j87253J73072j12391O35643k93660K50935m02797
16898B038345j91800K90944K01351L7717n967j5728l5811J79053k2837j43330
$$ plain form
16888 2331937 2779320 2513682 2554162 2343528 2596260 2670045 2597474 2466641 2888802 2490917
16878 2490917 2597720 2898845 2460179 2870671 3086416 3012113 2903235 3308005 2783950 3106967
16868 3106967 3101691 2973665 3204927 3219583 3354347 3528662 3436973 3481502 2840908 3439454
16858 3439454 3895437 3484259 3205954 3476857 3649337 3802745 3813033 3902648 3807802 4396373
16848 4396373 4094999 4098354 3873819 4112795 4092568 3970055 4293051 4286857 4316061 4466463
16838 4466463 4550387 4702091 4631850 4849690 5017055 4748496 4776123 4845253 4906217 4939323
16828 4939323 5115570 5598654 5470541 5309760 5508375 5871953 6008780 5923795 6123493 6011126
16818 6011126 5918471 6393549 6521052 6852010 6722498 6594883 7118113 7230285 7260347 7254823
$$ packed form
16888B331937M47383k65638M0480k10634K52732P3785p2571j30833M22161l97885
16878B490917J06803L01125m38666M10492K15745p4303j08878M04770n24055L23017
16868C106967n276j28026K31262J4656J34764J74315r1689M4529o40594N98546
16858C439454M55983m11178k78305K70903J72480J53408J0288Q9615r4846N88571
16848D396373l01374L355k24535K38976k0227j22513L22996o194K9204J50402
16838D466463Q3924J51704p0241K17840J67365k68559K7627O9130O0964L3106
16828D939323J76247M83084j28113j60781J98615L63578J36827q4985J99698j12367
16818F011126r2655M75078J27503L30958j29512j27615N23230J12172L0062n524
$$ plain form
16808 7254823 7628946 7451066 7379161 8163777 7890016 8110461 8242122 8765216 8805920 8655116
16798 8655116 9114596 8919470 9524523 9443382 9699663 9705800 10053655 10262174 10594333 10958465
16788 10958465 11063538 11008210 11407359 11818476 12212012 12401814 12533736 13133588 13166138 13489186
16778 13489186 13837097 14534524 14747807 15095134 15516156 15885359 16136387 16967316 17511031
16769 17511031 17699870 18163045 18450007 18898516 19887366 20626652 21177020 21308703 22621511
16760 22621511 22707477 23764318 24615437 24920596 26073876 26708601 27844964 28464759 29227032
16751 29227032 30415743 31561401 33012805 33819608 35285269 36717754 37880468 39316693
16743 39316693 41085721 42399637 44159516 45957603 47642292 49643592 51487424 53785510
$$ packed form
16808G254823L74123j77880p1905P84616k73761K20445J31661N23094M0704j50804
16798H655116M59480j95126O05053q1141K56281O137L47855K08519L32159L64132
16788A0958465J05073n5328L99149M11117L93536J89802J31922N99852L2550L23048
16778A3489186L47911O97427K13283L47327M21022L69203K51028Q30929N43715
16769A7511031J88839M63175K86962M48509R88850P39286N50368J31683J312808
16760B2621511Q5966J056841Q51119L05159J153280O34725J136363O19795P62273
16751B9227032J188711J145658J451404Q06803J465661J432485J162714J436225
16743C9316693J769028J313916J759879J798087J684689K001300J843832K298086
$$ plain form
16735 53785510 55893859 58280296 60736902 63284930 65854324 68524796 71779344 74350468
16727 74350468 77540019 80870904 84667844 87823255 91151772 94829659 98380734 102545922
16719 102545922 106086680 109892516 113921905 117312435 120653105 124069420 127506515 130413086
16711 130413086 133455127 135728837 137814803 139334722 140819698 141881551 141963986 141666529
16703 141666529 141405438 140548686 139016493 137228307 134562609 132127383 129197058 126317016
16695 126317016 122897701 119133363 115476833 111840347 108018394 103997644 100322994 96170938
16687 96170938 92823317 89379933 85839848 82229646 79082114 75549606 72521670 69496449
16679 69496449 66659287 63906650 61402488 58661755 56152680 54005538 51520195 49488775
$$ packed form
16735E3785510K108349K386437K456606K548028K569394K670472L254548K571124
16727G4350468L189551L330885L796940L155411L328517L677887L551075M165188
16719A02545922L540758L805836M029389L390530L340670L416315L437095K906571
16711A30413086L042041K273710K085966J519919J484976J061853Q2435k97457
16703A41666529k61091q56752j532193j788186k665698k435226k930325k880042
16695A26317016l419315l764338l656530l636486l821953m020750l674650m152056
16687I6170938l347621l443384l540085l610202l147532l532508l027936l025221
16679F9496449k837162k752637k504162k740733k509075k147142k485343k031420
$$ plain form
16671 49488775 47872825 45773835 43706237 42086690 40690583 39385580 37733108 35898019
16663 35898019 34907667 34081020 32000964 31249488 29985277 29017613 28158561 26993692 26214021
16654 26214021 25343356 24402737 23669046 23089269 22181877 21617390 21197926 20128083 19692251
16645 19692251 19597205 18849593 17933976 17783233 16942346 16579969 15913433 15716182 15256864
16636 15256864 14921834 14471162 14023847 13981068 13714032 13134989 12388458 12461455 12114055 11756931
16626 11756931 11846403 11049373 11098009 10971524 10540778 10276863 10066936 9947792 9559127 9373674
16616 9373674 9197981 8916531 8949739 8728660 8398187 7804567 8341027 7824216 7650222 7468796
16606 7468796 7380593 7270681 7284876 7206187 7171426 6682283 6837053 6626917 6381494 6380409
$$ packed form
16671D9488775j615950k098990k067598j619547j396107j305003j652472j835089
16663C5898019r90352q26647k080056p51476j264211r67664q59052j164869p79671
16654B6214021q70665r40619p33691n79777r07392n64487m19464j069843m35832
16645A9692251r5046p47612r15617j50743q40887l62377o66536j97251m59318
16636A5256864l35030m50672m47315m2779k67036n79043p46531P2997l47400l57124
16626A1756931Q9472p97030M8636j26485m30746k63915k09927j19144l88665j85453
16616I373674j75693k81450L3208k21079l30473n93620N36460n16811j73994j81426
16606G468796q8203j09912J4195p8689l4761m89143J54770k10136k45423j085
$$ plain form
16596 6380409 6433555 5944777 6029887 5902109 5934178 5773672 5864841 5640099 5393365 5221848
16586 5221848 5113132 5367639 5165521 4829602 5047994 4604834 4724670 4589654 4423421
16577 4423421 4623246 4527834 4402864 4356365 4275366 4165022 4222613 4037095 3942887 3943525 3894089
16566 3894089 4143274 3786449 3985952 3847254 3757112 3796652 3368493 3541642 3711494 3184163
16556 3184163 3196834 3147962 3301931 3059604 3089927 3128637 3060321 3063404 3037063 3009927 3013412
16545 3013412 2692030 3007094 2710199 2996741 2605733 2560379 2605514 2662605 2418550 2605096
16535 2605096 2351326 2558069 2716804 2611464 2649650 2529301 2413617 2496481 2072962 2488929
16525 2488929 2701045 1965179 2397581 2326751 2079101 1998131 2031133 1800974 2128679 1954124
$$ packed form
16596F380409N3146m88778Q5110j27778L2069j60506R1169k24742k46734j71517
16586E221848j08716K54507k02118l35919K18392m43160J19836j35016j66233
16577D423421J99825r5412j24970m6499q0999j10344N7591j85518r4208O38m9436
16566C894089K49185l56825J99503j38698r0142L9540m28159J73149J69852n27331
16556C184163J2671m8872J53969k42327L0323L8710o8316L083k6341k7136L485
16545C013412l21382L15064k96895K86542l91008m5354M5135N7091k44055J86546
16535B605096k53770K06743J58735j05340L8186j20349j15684Q2864m23519M15967
16525B488929K12116p35866M32402p0830k47650q0970L3002k30159L27705j74555
$$ plain form
16515 1954124 2067176 1972598 2226952 2527541 2170390 2055849 1768108 2031662 2179071 1799819
16505 1799819 2033411 1827642 2136351 1637024 1968986 1791193 1728832 1557259 1715669 1825487
16495 1825487 1711689 1728034 1783094 1362843 1582580 1602685 1708433 1635744 1521418 1474273
16485 1474273 1634445 1215093 1464173 1719063 1338162 1180427 1510900 1725711 1611965
16476 1611965 1176056 1211621 1515448 1395094 1476348 1482295 1227020 1363919 1028990 1462889
16466 1462889 1460266 999002 1259969 863251 1211217 1328626 1024646 1599107 1147707 1441891
16456 1441891 1024295 1392769 1348240 916128 1385133 1349590 1167738 795794 1237449 1066329
16446 1066329 1092746 1122315 1337030 962026 1399945 1053700 1363541 980444 1097623 1212234
$$ packed form
16515A954124J13052r4578K54354L00589l57151j14541k87741K63554J47409l79252
16505A799819K33592k05769L08709m99327L31962j77793o2361j71573J58410J09818
16495A825487j13798J6345N5060m20251K19737K0105J05748p2689j14326m7145
16485A474273J60172m19352K49080K54890l80901j57735L30473K14811j13746
16476A611965m35909L5565L03827j20354Q1254N947k55275J36899l34929M33899
16466A462889k623m61264K60967l96718L47966J17409l03980N74461m51400K94184
16456A441891m17596L68474m4529m32112M69005l5543j81852l71944M41655j71120
16446A066329K6417K9569K14715l75004M37919l46245L09841l83097J17179J14611
$$ plain form
16436 1212234 1197500 1292185 1013962 886036 1214578 938216 1084156 1134362 704165 976482
16426 976482 988818 566312 944428 1049487 803108 1335860 1076251 643662 1052369 955402
16416 955402 1097461 903624 1067951 734079 920224 906962 863004 882543 767076 766765 935651
16405 935651 914555 740730 742538 747517 740182 627441 888352 678039 943993 1079985 834671
16394 834671 900439 1031526 322204 868662 412674 752784 820491 887880 629086 700515
16384 700515 942100 790201 749297 912472 761725 745074 878764 758659 639068 566001
16374 566001 886512 574563 820910 705655 614225 829884 682969 150384 714056 843439
16364 843439 612039 794385 634419 477816 325523 252982 551344 582995 574295 730751
$$ packed form
16436A212234j4734R4685k78223j27926L28542k76362J45940N0206m30197K72317
16426I76482J2336m22506L78116J05059k46379N32752k59609m32589M08707r6967
16416I55402J42059j93837J64327l33872J86145j3262m3958J9539j15467l11J68886
16405I35651k1096j73825J808M979p335j12741K60911k10313K65954J35992k45314
16394H34671O5768J31087C22204N46458D12674L40110O7707O7389k58794P1429
16384G00515K41585j51899m0904J63175j50747j6651J33690j20105j19591p3067
16374E66001L20511l11949K46347j15255r1430K15659j46915A50384N63672J29383
16364H43439k31400J82346j59966j56603j52293p2541K98362L1651q700J56456
$$ plain form
16354 730751 490965 820118 894075 879204 678122 725804 393340 466605 767702 489531
16344 489531 647200 644763 441482 622342 774881 378606 980678 744182 703577 305241
16333 852332 240119 548418 184444 445197 255309 368257 661895 641110 274223 423254
16323 423254 606971 592622 516942 767139 454313 270201 333497 604585 453336 309505
16313 309505 688013 169859 268399 374592 560995 345659 282690 589446 479753 471930
16303 471930 480205 531823 439799 509285 249946 580425 553091 454692 481825 453674 190451
16291 501680 149589 562535 749568 317880 169142 524651 171602 555027 712950 319104
16280 674554 339372 319447 805798 444488 807532 880837 634378 318610 147328 203383
$$ packed form
16354G30751k39786L29153P3957j4871k01082M7682l32464P3265L01097k78171
16344D89531J57669k437k03281J80860J52539C78606O02072k36496m0605C05241
16333H52332B40119L08299A84444K60753j89888J12948K93638k0785B74223J49031
16323D23254J83717j4349p5680K50197l12826j84112O3296K71088j51249j43831
16313C09505L78508A69859R8540J06193J86403k15336o2969L06756j09693p823
16303D71930Q275N1618r2024O9486B49946L30479k7334r8399K7133k8151A90451
16291E01680A49589M12946J87033C17880j48738L55509A71602L83425J57923C19104
16280F74554l35182j9925M86351l61310L63044P3305k46459l15768A47328N6055
$$ plain form
16270 203383 476991 714036 199383 577823 494233 374503 192887 187076 29382 327093
16260 327093 269462 208417 474037 234800 289632 352151 132707 536470 415290 374221
16250 374221 413785 360748 323575 298208 442890 64151 277764 392392 366119 296391 538674
16239 538674 278776 225274 187197 231410 748808 426106 -131398 240732 237467 631253
16229 631253 175194 438406 274465 308856 322419 352149 313380 549261 443261 354651
16219 354651 299430 248167 538312 493868 608350 326401 657226 279315 570948 77998
16208 39247 464486 -3991 215573 429814 46630 30225 354089 335726 125272 361156 197775
16197 197775 34834 242327 330709 182836 81915 109482 159388 254797 147644 -99382 145715
$$ packed form
16270B03383K73608K37045A99383L78440q3590j19730j81616n811B9382K97711
16260C27093n7631o1045K65620B34800N4832O2519A32707M03763j21180m1069
16250C74221L9564n3037l7173k5367J44682F4151K13613J14628k6273o9728K42283
16239E38674k59898n3502l8077M4213N17398l22702a31398B40732l265L93786
16229F31253A75194K63212j63941L4391J3563K9730l8769K35881j06000q8610
16219C54651n5221n1263K90145m4444J14482k81949L30825B79315K91633G7998
16208C9247M25239c991B15573K14241D6630j6405L23864j8363A25272K35884j63381
16197A97775C4834K07493Q8382j47873H1915K7567M9906R5409j07153i9382A45715
$$ plain form
16185 28846 244542 242811 613202 -39584 428972 605857 105247 344457 -72474 94112 215682
16174 215682 830544 147108 343047 -108475 -65516 422224 296808 -34188 188978 180813
16164 180813 52029 324838 381213 280008 276100 446549 357384 444706 452800 171213 394544
16153 394544 246525 361036 332042 41306 214679 213367 241816 202567 268191 -68131 -67811
16142 -67811 130322 -134090 546822 309402 65947 286578 142473 92789 6998 139551
16132 139551 8718 175384 212188 131334 170169 38925 192888 143289 160297 302289 102074
16120 240697 14061 375125 96970 -80745 346625 -57147 284164 89219 33255 -99458 29398
16108 280290 117167 53965 110727 294667 -45807 189230 658420 95224 166300 36620 64134
$$ packed form
16185B8846K15696j731L70391c9584D28972J76885A05247K39210g2474I4112J21570
16174B15682O14862A47108J95939a08475M2959D22224j25416c4188A88978q165
16164A80813E2029K72809N6375j01205l908J70449q9165Q7322Q094A71213K23331
16153C94544j48019J14511k8994D1306J73373j312K8449l9249O5624f8131L20
16142f7811A30322a34090E46822k37420F5947K20631A42473m9684F998J32553
16132A39551H718J66666L6804q0854L8835C8925J53963m9599J7008J41992A02074
16120B40697A4061L61064I6970h0745C46625e7147B84164H9219C3255i9458B9398
16108B80290A17167E3965N6762J83940d5807A89230M69190I5224P1076C6620K7514
$$ plain form
16097 64134 163294 45351 43499 70653 175762 263647 408327 -80701 -51402 -103905 -141758
16086 -141758 213620 25178 300159 269928 -67450 51888 212358 145996 174502 336246 142002
16074 88476 173497 190797 9556 -360154 130668 107404 41552 266993 178332 41179 -185032
16062 -217998 65111 44308 -44726 -128780 224152 -97129 83755 36586 284858 137786 -24157
16050 28206 43963 -100857 156813 -19962 -164937 -27307 4244 -93585 230021 140371 -336937
16038 -15711 23921 -45058 3844 276912 -95006 209611 -20784 -236877 -99388 -132079 -2402
16026 42168 98908 -312953 -60527 192361 -25032 81344 273809 234888 -252184 202268 -309589
16014 -27864 146342 366424 -19131 48474 162741 -232697 -152811 8937 197900 79628 162034
$$ packed form
16097F4134R9160D5351j852K7154J05109Q7885J44680h0701K9299n2503l7853
16086a41758B13620B5178K74981l0231f7450E1888J60470o6362K8506J61744A42002
16074H8476Q5021J7300I556c60154A30668k3264D1552K25441q8661D1179a85032
16062b17998F5111k0803d4726q4054B24152i7129H3755C6586K48272A37786b4157
16050B8206J5757a00857A56813a9962j44975b7307D244i3585B30021q9650c36937
16038a5711B3921d5058C844K73068i5006B09611b0784k16093i9388l2691b402
16026D2168N6740c12953f0527A92361b5032H1344J92465l8921b52184B02268c09589
16014b7864A46342K20082a9131D8474J14267b32697P9886H937J88963G9628Q2406
$$ plain form
16003 162034 197185 -87324 -16221 -15634 64671 192424 134593 69331 137113 -265722 -30653
15991 71355 -83483 -22333 364071 73514 -18980 -192962 -58452 -10425 -280765 -38362 79050
15979 225414 248046 127426 88807 98059 188378 -432 156341 355336 504501 998427 886643
15968 886643 852831 598555 481235 658625 382285 276253 390524 -76682 218912 33743
15957 -50514 67534 -140342 151462 90158 246099 -66516 -94612 -18442 -54925 185147 -319868
15945 223936 167107 -169503 181766 -6229 215020 -30233 192824 -196986 -99757 -190368 111471
15933 -217202 -28867 97682 -39793 -414418 -215113 -469797 -355089 -257500 155086 -54971
15922 258524 -114090 202479 -98747 -198232 -141307 24255 207482 211872 -107740 -245161 10476
$$ packed form
16003A62034L5151h7324a6221N87F4671J27753n7831o5262O7782b65722c0653
15991G1355h3483b2333C64071G3514a8980j73982e8452a0425k70340c8362G9050
15979B25414K2632j20620l8619R252R0319d32A56341J98995J49165M93926j11784
15968H86643l3812k54276j17320J77390k76340j06032J14271g6682B18912C3743
15957e0514F7534a40342A51462o1304J55941f6516k8096a8442l6483A85147c19868
15945B23936n6829a69503A81766f229B15020c0233A92824a96986R7229r0611A11471
15933b17202b8867I7682c9793l74625J99305k54684J14708R7589A55086e4971
15922B58524a14090B02479i8747r9485N6925B4255J83227M390a07740j37421A0476
$$ plain form
15910 -97584 -202464 24136 155875 13822 -158282 215485 -217002 8674 287317 -24837 -989
15898 64605 216601 -201321 -100896 79914 -29967 -19066 -223817 -5267 -27917 3741 156416
15887 156416 -98284 -11557 -6751 -285389 42260 37438 12193 51460 -141649 -9525 -113759
15876 -113759 -277589 -115406 222697 -67959 -41400 234882 -180268 -30408 2076 -220216
15865 138974 -410857 -153974 16028 -15200 -127838 -5912 133383 -41871 -255803 73274 -236586
15853 100898 35921 15030 -88802 133864 36370 -98929 -240981 -3443 29668 19146 137975
15842 137975 -186634 -164902 37910 158512 -106995 -1977 -7385 27901 106761 173642 182653
15831 182653 346513 69798 -31682 207419 29431 -76946 -91203 45661 -2820 -156552 -106189
$$ packed form
15910i7584j04880B4136J31739A3822a58282B15485b17002H674K78643b4837i89
15898F4605J51996b01321J00425G9914b9967J0901k04751e267k2650C741J52675
15887A56416i8284a1557M806k78638D2260m822A2193L9267a41649i525j04234
15876a13759j63830a15406B22697f7959K6559B34882a80268c0408B076b20216
15865A38974d10857a53974A6028a5200j12638e912A33383d1871k13932G3274b36586
15853A00898C5921A5030h8802A33864C6370i8929j42052c443B9668j0522J18829
15842A37975a86634K1732C7910J20602a06995a977n408B7901P8860O6881R011
15831A82653J63860F9798c1682B07419B9431g6946j4257D5661b820j53732N0363
$$ plain form
15820 -106189 -213873 189327 -93217 -91078 -214810 -303762 -74127 -114566 -95898 26191 38868
15809 38868 175109 200193 203900 7819 73621 -114660 -123528 292899 52912 -69190 -79203 -16977
15796 -63602 120962 -118015 -77156 89459 117563 98478 -56421 61490 -189291 15311 -263954
15784 -59296 178932 -162788 -785 -114373 -23552 37407 109740 3483 82010 -546 193072 136953
15772 136953 -229854 -188361 18146 -170498 -184002 121694 12856 -192264 -73258 -55961 -137455
15761 -137455 -40841 -546702 57169 -92422 -305953 -47940 12601 -226962 -21687 284965 -335200
15749 -245725 94988 -56022 81220 196979 -150387 -70394 -120123 -42802 -143906 130420 -39491
15737 -84871 -172812 -22783 -292018 126111 -246722 12266 -119976 -122286 -150155 -262945 -269945
$$ packed form
15820a06189j07684A89327i3217K139j23732q8952g4127m0439J8668B6191J2677
15809C8868J36241K5084L707G819O5802a14660q868B92899E2912f9190j0013a6977
15796f3602A20962a18015M0859H9459K8104j9085e6421F1490a89291A5311b63954
15784e9296A78932a62788g85j13588b3552C7407P2333C483P8527e46A93072n6119
15772A36953b29854M1493A8146a70498j3504A21694A2856a92264g3258J7297q1494
15761a37455d0841n05861E7169i2422k13531d7940A2601b26962b1687B84965c35200
15749b45725I4988e6022H1220J15759a50387g0394m9729d2802j01104A30420c9491
15737h4871q7941b2783k69235A26111b46722A2266a19976k310k7869j12790p000
$$ plain form
15726 -269945 12733 340739 106657 20683 -130211 61580 -431512 -185657 -22293 191582
15715 -74456 -164246 77023 312325 -197929 -40103 84172 89416 -178170 -204940 -115345 -252738
15704 -252738 -305141 -98829 -88731 -75344 -197764 146926 177194 -76687 50091 -352219 -180355
15693 -180355 -345984 -295683 -88086 -132276 -190973 36303 206008 -113771 89530 102855 -154798
15681 46882 105186 -245171 1031 -21904 72233 267871 -196258 -5889 -61693 123094 16330
15669 294613 18150 -129239 -127825 -194591 131958 25582 86857 -52603 84949 -211599 -23305
15657 -103608 -419909 123490 25928 119686 107472 -128524 -91046 -78363 -3549 -30833 -327117
15646 -327117 43311 -97044 90081 311910 29664 -267084 -47432 64069 192768 230002 -78039
$$ packed form
15726b69945A2733L28006A06657B0683a30211F1580d31512a85657b2293A91582
15715g4456q9790G7023K35302a97929d0103H4172N244a78170k6770Q9595j37393
15704b52738n2403i8829J0098J3387j22420A46926L0268g6687E0091c52219J71864
15693a80355j65629N0301h8086m4190n8697C6303J69705a13771H9530J3325a54798
15681D6882N8304b45171A031b1904G2233J95638a96258e889n5804A23094A6330
15669B94613A8150a29239J414o6766A31958B5582O1275e2603H4949b11599b3305
15657a03608l16301A23490B5928R3758j2214a28524L7478J2683c549k7284k96284
15646c27117D3311i7044I0081K21829B9664b67084d7432F4069J28699L7234g8039
$$ plain form
15634 -181049 -140575 -45105 -30497 100529 -146436 242983 174274 43045 118795 16840 -117912
15622 -311193 137933 66758 -126799 -27774 -29241 46767 60106 -170600 9389 -56882 134536
15610 -15833 -36664 -148258 -19711 89843 -22844 -212998 -131823 -18882 -41295 -78544 74385
15598 -262456 -20199 -30521 37188 -17053 -209103 -123115 -184711 -164807 124054 15169 -465999
15586 81581 -72263 176447 -226654 -59524 159487 146482 -161012 -359172 -248150 -39044
15575 70908 120015 147912 -109225 -154272 78189 -8133 -107176 33707 52648 -34022 162083
15563 356922 -40889 -91500 -143823 12983 -128769 88356 -76535 272184 275756 -99942 133537
15551 -307397 -103014 -209114 -142571 486708 -329778 122397 -141385 514 43034 -242618
$$ packed form
15634a81049M0474d5105J4608A00529a46436B42983o8709D3045P5750A6840a17912
15622c11193A37933F6758a26799b7774j467D6767J3339a70600I389e6882A34536
15610a5833k0831j11594a9711H9843b2844j90154Q1175a8882k2413l7249G4385
15598b62456b0199j0322C7188a7053j92050Q5988o1596J9904A24054A5169d65999
15586H1581g2263A76447b26654e9524A59487j3005a61012j98160J11022c9044
15575G0908M9107K7897a09225m5047G8189h133r9043C3707J8941c4022A62083
15563C56922d0889n0611n2323A2983a28769H8356g6535B72184L572i9942A33537
15551c07397a03014j06100O6543D86708c29778A22397a41385E14M2520b42618
$$ plain form
15540 240856 -72433 -24731 -122075 180788 -234840 112148 220142 67717 330658 -354857
15529 471019 -290975 145522 -36208 231310 -98701 156943 -46291 -148472 -131905 75104
15518 160998 231935 -31540 -216495 -35860 369640 218083 -6912 -142794 152667 -20172 113485
15506 155235 92117 94729 39567 -140460 259057 -195416 110165 219535 117704 -42176
15495 453824 256854 257101 126874 366705 -26084 305629 334662 -26808 12784 144052 237829
15484 237829 23706 -87291 -212523 278065 140233 239538 75025 381904 115924 75897
15474 75897 -167244 17016 149101 69972 -130420 -226151 96416 55258 -30048 -333560 -106593
15462 52284 288549 205359 82499 162441 132898 487967 330520 414471 332162 354567 -89701
$$ packed form
15540B40856g2433b4731r7344A80788b34840A12148J07994F7717K62941c54857
15529D71019b90975A45522c6208B31310i8701A56943d6291j02181J6567G5104
15518A60998P0937c1540j84955c5860C69640j51557f912j35882A52667b0172A13485
15506A55235o3118K612C9567a40460B59057a95416A10165J09370j01831d2176
15495D53824j96970K47A26874K39831b6084C05629K9033b6808A2784J31268R3777
15484B37829B3706h7291j25232B78065j37832R9305G5025L06879A15924m0027
15474G5897a67244A7016J32085F9972a30420r5731I6416m1158c0048l03512a06593
15462E2284K36265q3190H2499P9942k9543L55069j57447Q3951q2309K2405h9701
$$ plain form
15450 -21281 121878 66694 -330253 3836 -109270 13052 -168063 368186 -285508 141329
15439 277791 -144476 68770 178281 45788 286325 114074 175302 13750 -108873 329773
15428 13904 124389 462739 769514 1205401 697496 1090733 682180 376992 269010 75652
15417 243961 464972 -162587 411782 -108300 -80123 15553 -18690 17809 378638 23937
15406 316509 39000 -192988 -77978 258167 99958 -162020 88826 169001 126552 215558 142761
15395 142761 -125185 168453 278388 257900 326773 8091 -44078 -35771 -43587 22461 -181880
15383 -12629 212800 -223774 384950 -284306 87345 107442 -102255 -237609 -96059 -220023
15373 -220023 -122491 -177744 54210 66206 151907 -20143 60041 -90319 74794 338388 -183937
$$ packed form
15450b1281A21878n5184c30253C836a09270A3052a68063C68186b85508A41329
15439B77791a44476F8770J09511D5788K40537A14074O1228A3750a08873C29773
15428A3904J10485L38350L06775M35887n07905L93237m08553l05188j07982G5652
15417B43961K21011a62587D11782a08300K8177A5553a8690A7809L60829B3937
15406C16509C9000a92988g7978B58167I9958a62020H8826Q0175m2449Q9006p2797
15395A42761a25185A68453J09935k0488O8873H091d4078Q307p816B2461a81880
15383a2629B12800b23774C84950b84306H7345K0097a02255j35354i6059j23964
15373b20023R7532n5253E4210J1996Q5701b0143F0041i0319G4794K63594a83937
$$ plain form
15361 -32713 69380 75233 262641 87762 -48146 167616 173423 -102645 -16517 163928 -42008
15349 252816 -105216 97365 291007 -90538 -21346 115832 31553 269725 67841 603151
15339 603151 242151 293905 253765 -8457 130218 -52154 -92309 227372 -63872 228695 373229
15328 373229 382729 428422 509414 469111 415210 269979 240550 224713 109464 -59242 81455
15316 134948 207568 -49977 -27846 406319 13792 90202 -4231 -8582 263516 186057 146466
15305 146466 -44135 113588 357339 -160379 354394 95710 338629 -79181 50207 -70517
15294 575278 132443 55726 25519 332992 -153567 28203 -39784 5444 195333 131643 -39662
15282 118475 -329648 289952 -247223 -79239 74656 103427 123729 -277512 42222 -117826
$$ packed form
15361c2713F9380N853J87408H7762d8146A67616N807a02645a6517A63928d2008
15349B52816a05216I7365J93642i0538b1346A15832C1553K38172F7841N35310
15339F03151B42151N1754m0140h457A30218e2154m0155B27372f3872B28695J44534
15328C73229R500M5693Q0992m0303n3901j45231k9429j5837A09464e9242H1455
15316A34948P2620d9977K2131D06319A3792P6410d231m351B63516p7459l9591
15305A46466d4135A13588K43751a60379C54394I5710K42919g9181E0207g0517
15294E75278A32443E5726B5519L07473a53567B8203c9784E444J89889o3690c9662
15282A18475c29648B89952b47223g9239G4656K8771K0302b77512D2222a17826
$$ plain form
15271 5965 125006 271592 67272 98424 89420 -147752 -38987 -14561 -103251 78626 -58955
15259 106089 139346 157480 127212 -135440 42660 -81106 233832 -112320 95704 -15542 139131
15247 320403 -54173 369450 120131 221102 183502 57100 2482 -31061 270851 148424 30521
15235 192239 96705 -74525 393533 232970 511067 615051 941915 1199561 1349293 1264169
15225 1264169 1424878 743281 503985 646720 411749 325251 96741 -114113 360449 -44713
15214 -250754 146951 -136348 -199165 -134295 161597 132924 -344810 51314 -35412 103931
15203 188030 92229 51573 -8718 104066 364820 -68803 -101854 -60547 209580 -42218 227909
15191 99191 -56535 148748 46809 -112159 16477 280191 73048 29130 -100961 -77595 -376176
$$ packed form
15271E965J19041J46586F7272L1152r004a47752c8987a4561q8690G8626e8955
15259A06089L3257J8134l0268a35440D2660h1106B33832a12320I5704a5542A39131
15247C20403e4173C69450A20131J00971l7600E7100B482c1061B70851j22427C0521
15235A92239r5534g4525C93533j60563K78097J03984L26864K57646J49732q5124
15225A264169J60709o81597k39296J42735k34971q6498I6741a14113C60449d4713
15214b50754A46951a36348o2817O4870A61597k8673c44810E1314c5412A03931
15203A88030I2229m0656h718A04066K60754f8803l3051M1307B09580d2218B27909
15191I9191e6535A48748D6809a12159A6477K63714G3048B9130a00961K3366k98581
$$ plain form
15180 -376176 -33578 80085 172268 -218719 197799 45149 363048 1588 250897 229108 26824
15168 160535 219491 115806 467155 1099 125603 160276 81537 260012 263951 -339944 180496
15156 -242285 108384 151617 212058 144285 68973 -214022 62283 248130 -40810 43599 163934
15145 163934 511356 -188091 -21586 312214 345758 -94114 22980 272164 -135041 -154829
15135 -154829 5366 293090 188852 109093 155613 371333 -193849 99062 344011 65190 138199
15124 138199 289766 -97901 359237 -142667 -52005 -105725 233481 124304 63745 334610
15114 334610 33919 308721 -69759 161289 219271 7572 175573 205075 296573 287968 235370
15103 235370 260090 78804 189912 253790 -39743 -254927 -11674 -110040 166210 123520 435641
$$ packed form
15180c76176c3578H0085R2183b18719A97799D5149L17899A588K49309k1789B6824
15168A60535N8956j03685L51349A099J24504L4673p8739J78475L939c39944A80496
15156b42285A08384M3233O0441o7773F8973b14022F2283J85847d0810D3599J20335
15145A63934L47422a88091b1586C12214L3544i4114B2980K49184a35041j9788
15135a54829E366K87724j04238p9759M6520K15720a93849I9062K44949F5190P3009
15124A38199J51567i7901C59237a42667e2005n3720B33481j09177o0559K70865
15114C34610C3919K74802f9759A61289N7982G572J68001K9502R1498q605n2598
15103B35370K4720G8804J11108O3878c9743k15184a1674r8366A66210m2690L12121
$$ plain form
15092 435641 280159 126566 -55146 434173 -85284 -105171 314839 -271426 216712 21319
15081 183933 157197 -40608 322457 -107295 398294 246068 26638 314434 158856 -101217
15070 196907 297747 177818 -183188 73181 37499 102931 365350 234909 463126 18886
15059 403395 255258 -28884 221046 159012 281526 -139693 328005 -31933 -35933 443773
15048 382384 181921 73787 207925 219421 466915 158680 200535 189624 -73847 286125
15037 43007 839146 44679 84505 178432 416701 362158 487809 196144 967182 403442
15026 -19124 370691 19133 317874 434527 158753 403672 656754 429390 572508 531943
15016 531943 618905 477574 734007 781896 916854 339491 723901 373651 486076 281546
$$ packed form
15092D35641j55482A26566e5146D34173h5284j9887C14839b71426B16712B1319
15081A83933k6736d0608C22457a07295C98294j52226B6638K87796j55578a01217
15070A96907J00840j19929a83188G3181l5682O5432K62419j30441K28217A8886
15059D03395j48137b8884B21046o2034J22514a39693C28005c1933m000D43773
15048C82384A81921G3787J34138J1496K47494A58680M1855j0911g3847B86125
15037D3007P96139D4679L9826R3927K38269n4543J25651A96144P71038D03442
15026a9124C70691A9133K98741J16653A58753K44919K53082k27364J43118m0565
15016E31943Q6962j41331K56433M7889J34958C39491L84410l50250J12425k04530
$$ plain form
15006 281546 466483 365848 391123 157133 604998 580030 665986 394677 247309 715349
14996 715349 197739 187567 646493 700279 589878 349028 391249 290526 505784 381509
14986 381509 460908 254866 285958 363854 340148 293351 701459 365856 457008 471750 356455
14975 356455 108684 677430 603681 308354 520367 515457 385895 854861 589668 640448
14965 640448 887634 663764 715698 530758 808377 568917 823221 534914 282375 563157
14955 563157 605300 831034 183433 332589 235862 312882 159730 346355 229410 342743
14945 342743 511314 201809 140182 434122 502758 375750 245177 256337 333960 247021
14935 247021 734484 221249 428863 54678 709635 177896 394736 603420 417924 611456
$$ packed form
15006B81546J84937j00635K5275A57133M47865k4968Q5956k71309j47368M68040
14996G15349A97739j0172M58926N3786j10401k40850M2221j00723K15258j24275
14986C81509P9399k06042L1092P7896k3706m6797M08108l35603R1152J4742j15295
14975C56455A08684N68746p3749k95327K12013m910j29562M68966k65193N0780
14965F40448K47186k23870N1934j84940K77619k39460K54304k88307k52539K80782
14955E63157M2143K25734A83433J49156r6727P7020j53152J86625j16945J13333
14945C42743J68571B01809o1627K93940O8636j27008j30573J1160P7623q6939
14935B47021M87463B21249K07614E4678O54957A77896K16840K08684j85496J93532
$$ plain form
14925 611456 489815 391864 711937 403373 574831 762850 647860 462367 799264 929137
14915 929137 1337580 695978 1011871 1066202 1151305 1478831 1336393 1559684 1272547 1292232
14905 1292232 1465212 1478519 1646794 1598425 2089567 1959795 1724109 1526052 869435 1294359
14895 1294359 1025294 745516 710633 902774 427673 572368 509593 607541 281750 216938
14885 216938 282216 400329 698450 229481 240953 450345 656548 261758 156668 114364
14875 114364 388793 471684 519375 845315 515802 801681 651276 984739 776427 835961
14865 835961 480527 778479 391231 693280 414354 762952 747811 744620 694430 374998
14855 374998 463009 353744 757206 786757 424187 478794 603722 618278 753611 121422
$$ packed form
14925F11456j21641r7951L20073l08564J71458J88019j14990j85493L36897J29873
14915I29137M08443o41602L15893N4331Q5103L27526j42438K23291k87137J9685
14905A292232J72980J3307J68275m8369M91142j29772k35686j98057o56617M24924
14895A294359k69065k79778l4883J92141D27673J44695o2775R7948B81750o4812
14885B16938O5278J18113K98121B29481J1472K09392K06203B61758j05090m2304
14875A14364K74429Q2891M7691L25940l29513K85879j50405L33463k08312N9534
14865H35961l55434K97952l87248L02049k78926L48598j5141l191n0190l19432
14855C74998Q8011j09265M03462K9551l62570N4607J24928J4556J35333A21422
$$ plain form
14844 583969 377594 249342 454057 339872 560203 551403 699088 485375 312310 580622
14834 580622 663320 743622 727382 561010 576123 628322 468678 645219 1048763 892511
14824 892511 913845 1085990 780175 1095534 1278820 749546 992511 709805 570710 713167
14814 713167 696760 618631 465916 648594 743278 442804 780154 773488 614102 674074 575027
14803 575027 606777 557256 596144 683904 923077 693092 1091849 672276 858525 748998
14793 748998 797829 705983 464124 770088 773994 548539 872477 1130336 881130 709112
14783 709112 770159 888420 750759 539276 512765 1011131 926574 1205918 652590 783363
14773 783363 687307 580292 912134 628939 571338 751610 534184 571456 852746 668728
$$ packed form
14844E83969k06375j28252K04715j14185K20331q800J47685k13713j73065K68312
14834E80622Q2698Q0302j6240j66372J5113N2199j59644J76541M03544j56252
14824H92511K1334J72145l05815L15359J83286n29274K42965k82706j39095J42457
14814G13167j6407p8129j52715J82678R4684l00474L37350o666j59386N9972r9047
14803E75027L1750m9521L8888Q7760K39173k29985L98757m19573J86249j09527
14793G48998M8831r1846k41859L05964L906k25455L23938K57859k49206j72018
14783G09112O1047J18261j37661k11483k6511M98366q4557K79344n53328J30773
14773G83363r6056j07015L31842k83195n7601J80272k17426L7272K81290j84018
$$ plain form
14763 668728 914510 1048232 872115 839190 934638 888155 957993 1075747 919554 818396
14753 818396 491888 820544 498443 406871 600057 812344 547085 852856 650725 478168
14743 478168 651564 628968 625211 783235 783555 504215 528264 585992 833023 654545 1006711
14732 1006711 649497 525741 794432 934243 767425 673646 728013 837734 865221 1021087
14722 1021087 705807 746831 668342 801583 736901 947376 993798 1066758 796800 1364494
14712 1364494 1162444 1448686 1726642 1577266 1640518 1522738 1438970 1447423 1177997 1065660
14702 1065660 721704 831335 867025 875233 677423 793983 1194004 1022205 1162577 1091061
14692 1091061 603538 1001315 856470 664326 1046404 1243808 1360644 1636218 1587594 2070707
$$ packed form
14763F68728K45782J33722j76117l2925R5448m6483O9838J17754j56193j01158
14753H18396l26508L28656l22101r1572J93186K12287k65259L05771k02131j72557
14743D78168J73396k2596l757J58024L20k79340K4049N7728K47031j78478L52166
14732A006711l57214j23756K68691J39811j66818r3779N4367J09721K7487J55866
14722A021087l15280M1024p8489J33241o4682K10475M6422P2960k69958N67694
14712A364494k02050K86242K77956j49376O3252j17780q3768Q453k69426j12337
14702A065660l43956J09631L5690Q208j97810J16560M00021j71799J40372p1516
14692A091061m87523L97777j44845j92144L82078J97404J16836K75574m8624M83113
$$ plain form
14682 2070707 1677159 1629018 1315656 1419036 1173776 1037980 1101125 914229 987802 811233
14672 811233 820476 934833 1109708 943366 949111 980879 747636 1155815 903926 963426 681399
14661 681399 881966 777222 1121255 816798 1161433 907574 863636 1244515 951896 868829
14651 868829 971663 774158 1001290 1072194 949147 1509005 1113921 1336557 1298297 1174246
14641 1174246 1324547 1376411 1089564 972096 1486317 1339985 1459140 1082571 1459868 1652059
14631 1652059 1266222 1269797 1140595 1275359 1341296 1257064 1272388 1198815 1011153 1217625
14621 1217625 1481018 1328467 1504894 1440490 1167459 1309857 1433317 1367185 1486025 1486671
14611 1486671 1243410 1208593 1542056 1140297 1250929 1142470 1104382 1431112 1386010 1020388
$$ packed form
14682B070707l93548m8141l13362J03380k45260j35796O3145j86896P3573j76569
14672H11233R243J14357J74875j66342N745L1768k33243M08179k51889N9500k82027
14661F81399K00567j04744L44033l04457L44635k53859m3938L80879k92619q3067
14651H68829J02834j97505K27132P0904j23047N59858l95084K22636l8260j24051
14641A174246J50301N1864k86847j17468N14221j46332J19155l76569L77297J92191
14631A652059l85837L575j29202J34764O5937q4232J5324p3573j87662K06472
14621A217625K63393j52551J76427o4404k73031J42398J23460o6132J18840O46
14611A486671k43261l4817L33463m01759J10632j08459l8088L26730m5102l65622
$$ plain form
14601 1020388 1549558 1617392 1595546 1443833 1444812 1496957 1274448 1508510 1575800 1503136 1707848
14590 1707848 1315339 1520884 1476925 1742697 1723480 1611742 1797202 1729195 1469277 1538520
14580 1538520 1993289 1433085 1629550 2048939 1928847 1687857 1910009 1819076 1748258 1994939
14570 1994939 1784215 2005885 2009409 1749384 2353577 1985270 2151006 2044729 2374953 2192690
14560 2192690 1949515 1895808 2367008 2046906 2394942 2387035 2279059 2433255 2269412 2753368
14550 2753368 2289840 2086698 2751984 2544451 2885647 2672576 3262489 3563905 3571975 3784972
14540 3784972 4143070 4372028 4821771 5467813 6358794 7217434 9674091 13061589 19720797
14531 19720797 29316749 32627778 19922580 11805420 7749005 5668248 5194103 5183337
$$ packed form
14601A020388N29170O7834k1846j51713R79N2145k22509K34062O7290p2664K04712
14590A707848l92509K05545m3959K65772j9217j11738J85460o8007k59918O9243
14580A538520M54769n60204J96465M19389j20092k40990K22152r0933p0818K46681
14570A994939k10724K21670L524k60025O04193l68307J65736j06277L30224j82263
14560B192690k43175n3707M71200l20102L48036p907j07976J54196j63843M83956
14550B753368m63528k03142O65286k07533L41196k13071N89913L01416Q070K12997
14540C784972L58098K28958M49743O46042Q90981Q58640K456657L387498O659208
14531A9720797R595952L311029j2705198q117160m056415k080757m74145j0766
$$ plain form
14523 5183337 4535071 3863327 3161132 2954974 2552392 2667475 2846382 2122165 2378716
14514 2378716 2657518 2422741 2649298 2267376 2344565 2570852 2456888 2440373 2438274 2466770
14504 2466770 2335947 2837343 2548432 3049437 2791890 2843649 2731830 2809484 3029165 3149905
14494 3149905 3130253 3213754 2910580 3165261 2980344 2963066 3029205 3198428 3061050 3113370
14484 3113370 3345321 3211676 3287235 3386912 3350994 3559465 3444094 3373577 3454994 3618644
14474 3618644 3669634 3623157 3851087 3555605 3734669 3579089 3921149 4061289 3865568 3780507
14464 3780507 4097089 4119175 4106264 4203212 4161126 4427719 4446891 4428221 4387030 4417374 4602091
14453 4602091 4716127 4757565 4834897 4671680 4610589 4692503 4871277 4775667 4998147 5098905
$$ packed form
14523E183337o48266o71744p02195k06158m02582J15083J78907p24217K56551
14514B378716K78802k34777K26557l81922P7189K26287j13964j6515k099K8496
14504B466770j30823N01396k88911N01005k57547N1759j11819P7654K19681J20740
14494C149905j9652Q3501l03174K54681j84917j7278O6139J69223j37378N2320
14484C113370K31951j33645P5559R9677l5918K08471j15371p0517Q1417J63650
14474C618644N0990m6477K27930k95482J79064j55580L42060J40140j95721q5061
14464C780507L16582K2086j2911R6948m2086K66593J9172j8670m1191L0344J84717
14453D602091J14036M1438P7332j63217o1091Q1914J78774r5610K22480J00758
$$ plain form
14443 5098905 5170636 5028464 5454664 5600187 5298044 5260043 5496280 5829130 5585472 5446441
14433 5446441 5839816 6224677 5527175 5896158 6196991 5921615 6209170 6275272 6250191 6260659
14423 6260659 6874371 6587810 6690699 6983183 6856906 6967514 7098734 7638535 7323566
14414 7323566 7469579 7592916 7551886 7620763 7704462 7765061 8117845 8262947 8372488 8453443
14404 8453443 8787711 8775510 8969783 9232232 9257041 8969155 9303708 9333171 9185702 9451293
14394 9451293 9776157 9993461 10059669 9660478 10277001 10316333 10575783 11044016 11425614 11179338
14384 11179338 11439415 11523548 11792904 11482964 11627944 12339057 12177854 12699966 12398830
14375 12398830 12764875 13232822 13233782 13481008 13773016 14162396 14657801 14488222 14685387 15303754
$$ packed form
14443E098905P1731j42172M26200J45523l02143l8001K36237L32850k43658j39031
14433E446441L93375L84861o97502L68983L00833k75376K87555O6102k5081J0468
14423F260659O13712k86561J02889K92484j26277J10608J31220N39801l14969
14414G323566J46013J23337m1030O8877Q3699O0599L52784J45102J09541Q0955
14404H453443L34268j2201J94273K62449K4809k87886L34553K9463j47469K65591
14394I451293L24864K17304O6208l99191O16523L9332K59450M68233L81598k46276
14384A1179338K60077Q4133K69356l09940J44980P11113j61203N22112l01136
14375A2398830L66045M67947R60K47226K92008L89380M95405j69579J97165O18367
$$ plain form
14365 15303754 15485375 15672740 16331441 16738626 16728380 17149622 17462088 17709384 18118378
14356 18118378 18244132 18739623 19412844 19191709 19579366 20531556 20749273 21135193 21791277
14347 21791277 22383133 22161924 22813920 23501116 23842039 24185771 25146928 25568182 26398020
14338 26398020 26646612 27472883 28082418 28722262 29542188 30161889 31013762 32263302 32880902
14329 32880902 33520548 34687135 35491998 36626178 37539508 38370972 39572503 40485363 41964761
14320 41964761 43244435 44542843 45730699 47541498 48598287 50501829 51935926 53626799
14312 53626799 55584314 57406160 59209791 61483205 63713842 65764996 68196979 70433933
14304 70433933 73107871 76070848 78809342 81880076 84967514 88222291 91613156 95462501
$$ packed form
14365A5303754J81621J87365O58701M07185j0246M21242L12466K47296M08994
14356A8118378J25754M95491O73221k21135L87657R52190K17717L85920O56084
14347B1791277N91856k21209O51996O87196L40923L43732R61157M21254Q29838
14338B6398020K48592Q26271O09535O39844Q19926O19701Q51873J249540O17600
14329C2880902O39646J166587Q04863J134180R13330Q31464J201531R12860J479398
14320D1964761J279674J298408J187856J810799J056789J903542J434097J690873
14312E3626799J957515J821846J803631K273414K230637K051154K431983K236954
14304G0433933K673938K962977K738494L070734L087438L254777L390865L849345
$$ plain form
14296 95462501 99163059 103772323 108266749 112722213 117780912 122784022 128474945 134148839
14288 134148839 140470688 146993798 154389123 161577875 169375581 177745636 186329603 195571338
14280 195571338 205325257 215719668 226461560 237824826 249869625 262573473 275442607
14273 275442607 289333471 303580702 318097938 332585368 347754093 361747927 374933710
14266 374933710 387573498 399462594 411170584 422081114 432059633 441440260 449441945
14259 449441945 457058845 461888402 464536953 465442176 466796379 466112954 458534098 452612378
14251 452612378 444476496 434476651 423862024 411846513 398296656 384595612 370794870
14244 370794870 357259069 342738679 328978044 315247878 301521206 288006147 275544446
$$ packed form
14296I5462501L700558M609264M494426M455464N058699N003110N690923N673894
14288A34148839O321849O523110P395325P188752P797706Q370055Q583967R241735
14280A95571338R753919J0394411J0741892J1363266J2044799J2703848J2869134
14273B75442607J3890864J4247231J4517236J4487430J5168725J3993834J3185783
14266C74933710J2639788J1889096J1707990J0910530R978519R380627Q001685
14259D49441945P616900M829557K648551R05223J354203o83425p578856n921720
14251D52612378q135882r999845j0614627j2015511j3549857j3701044j3800742
14244C70794870j3535801j4520390j3760635j3730166j3726672j3515059j2461701
$$ plain form
14237 275544446 262665005 251022851 239329312 229179760 218764667 208411085 197811934
14230 197811934 187698624 177825513 169055841 160940262 153241862 145979898 139162146 132837379
14222 132837379 127422077 121511106 116257415 111107591 106384753 102124793 98258744 94358897
14214 94358897 90549295 86869258 83637069 80447621 77413761 74395787 71930034 69479096
14206 69479096 66900139 64393405 62440635 60434215 58467841 56507410 54536605 53144902
14198 53144902 51814338 50115949 48523655 47115145 45577542 44291865 43588007 42418776
14190 42418776 41108876 39694790 38612213 37575336 36613060 36017895 34760352 33963424
14182 33963424 32904321 32304412 31455035 30809470 29946186 28864365 28443114 27782627 26885564
$$ packed form
14237B75544446j2879441j1642154j1693539j0149552j0415093j0353582j0599151
14230A97811934j0113310r873111q769672q115579p698400p261964o817752o324767
14222A32837379n415302n910971n253691n149824m722838m259960l866049l899847
14214I4358897l809602l680037l232189l189448l033860l017974k465753k450938
14206F9479096k578957k506734j952770k006420j966374j960431j970805j391703
14198E3144902j330564j698389j592294j408510j537603j285677p03858j169231
14190D2418776j309900j414086j082577j036877r62276n95165j257543p96928
14182C3963424j059103n99909q49377o45565q63284j081821m21251o60487q97063
$$ plain form
14173 26885564 26615462 26039779 25124858 24530108 24059908 23571699 23262942 22597912 22146269
14164 22146269 21642942 21305924 20926383 20256205 19864211 19222343 19244851 18716232 18301702
14155 18301702 18056007 17267158 17677014 16758386 16560379 16610266 16060784 16057826 15358716 15087458
14145 15087458 15122373 14418172 14373666 14467790 14017844 13949730 13533323 13271473 13211901 12983358
14135 12983358 12667616 12425973 12198697 11973495 11718408 11437903 11492106 11285909 10956742
14126 10956742 11052011 10830771 10708561 10414892 10505201 10105482 10160579 9585406 9899930 9441602
14116 9441602 9432817 9639721 9462195 9322660 9471284 8792576 8771581 8621523 8479947 8222449
14106 8222449 8388092 8105407 8086933 7785010 7942139 7773230 7428239 7246906 7366914 7347586
$$ packed form
14173B6885564k70102n75683r14921n94750m70200m88209l08757o65030m51643
14164B2146269n03327l37018l79541o70178l91994o41868K2508n28619m14530
14155A8301702k45695p88849M09856r18628j98007M9887n49482k958o99110k71258
14145A5087458L4915p04201m4506R4124m49946o8114m16407k61850n9572k28543
14135A2983358l15742k41643k27276k25202k55087k80505N4203k06197l29167
14126A0956742R5269k21240j22210k93669R0309l99719N5097n75173L14524m58328
14116I441602q785K06904j77526j39535J48624o78708k0995j50058j41576k57498
14106H222449J65643k82685j8474l01923J57129j68909l44991j81333J20008j9328
$$ plain form
14096 7347586 7468866 7398356 7126382 6705395 6616372 7116982 6854173 6764088 6373866 6428825
14086 6428825 6439395 6439137 6093681 6057859 6264784 6189591 5862718 5970247 5922934 5808505 5902401
14075 5902401 5604995 5596104 5464647 5384360 5299213 5453192 5587489 5439596 5181986 5134925
14065 5134925 5008169 5238511 5068891 4624431 4747591 5184898 4733533 4603791 4432075
14056 4432075 4639529 4658966 4562712 4531581 4708192 4467271 4427842 4352375 3823427 4128401
14046 4128401 4082409 4430926 4533822 4408770 4234248 4384655 4044829 4169389 3837824 3970725
14036 3970725 3832100 3709738 3834035 3699511 3647920 3663643 3708496 3589833 3394033 3763608
14026 3763608 3451732 3306676 3216861 3475865 3231332 3184781 3395061 3273619 3351771 3451810
$$ packed form
14096G347586J21280p0510k71974m20987q9023N00610k62809r0085l90222N4959
14086F428825J0570k58l45456l5822K06925p5193l26873J07529m7313j14429R3896
14075E902401k97406q891j31457q0287q5147J53979J34297j47893k57610m7061
14065E134925j26756K30342j69620m44460J23160M37307m51365j29742j71716
14056D432075K07454J9437r6254l1131J76611k40921l9429p5467n28948L04974
14046D128401m5992L48517J02896j25052j74522J50407l39826J24560l31565J32901
14036C970725j38625j22362J24297j34524n1591J5723M4853j18663j95800L69575
14026C763608l11876j45056q9815K59004k44533m6551K10280j21442P8152J00039
$$ plain form
14016 3451810 3497573 3054762 3326510 3535107 3258958 3333307 3192496 3299906 2748184 3361410
14006 3361410 2746747 2927412 2624653 2576727 2727330 2875572 2739164 2450677 2500305 2611528
13996 2611528 2601845 2278151 2451228 2627052 2669695 2356737 2592739 2285444 2328263 2663357
13986 2663357 2348192 2311735 2423484 2585809 2795044 2317378 2644450 2846897 3010334 3364219
13976 3364219 4033311 4688277 6305188 8901245 15030695 24540726 33223986 23633777
13968 23633777 15614189 10911345 7866487 6054229 5483477 4685908 4069431 3919024 3775520
13959 3775520 3319374 3493605 3039035 3095481 2972347 2738057 2721546 2851516 2381339 2603013
13949 2603013 2475402 2495837 2183385 2525004 2076527 2012764 2282597 2360786 1920348 2236109
$$ packed form
14016C451810M5763m42811K71748K08597k76149P4349j40811J07410n51722O13226
14006C361410o14663J80665l02759m7926J50603J48242j36408k88487M9628J11223
13996B611528r683l23694J73077J75824M2643l12958K36002l07295M2819L35094
13986B663357l15165l6457J11749J62325K09235m77666L27072K02447J63437L53885
13976C364219O69092O54966J616911K596057O129450R510031Q683260r590209
13968B3633777q019588m702844l044858j812258n70752p97569o16477j50407j43504
13959C775520m56146J74231m54570N6446j23134k34290j6511J29970m70177K21674
13949B603013j27611K0435l12452L41619m48477o3763K69833P8189m40438L15761
$$ plain form
13939 2236109 2215633 2014311 2058681 1868999 1862214 1857742 2127002 2001626 2060646 1905224 1626408
13928 1626408 1900458 2010357 1567347 1922712 1914865 1398616 1878501 1727009 1726435 1589737
13918 1589737 1722949 1765189 1543723 1758917 1651960 1417311 1471179 1955651 1697366 1440842
13908 1440842 1705950 1772161 1531447 1423972 1586038 1477204 1537166 1154216 1497523 1266462
13898 1266462 1650389 1716193 1574498 1541912 1364498 1484302 1310706 1361098 1449863 1797630
13888 1797630 1644000 1502212 1525401 1455698 1507867 1250925 1304615 1413474 1508240 1676436
13878 1676436 1424529 1246405 1324327 1390657 1209515 975332 1393947 1365790 1467848 1335022
13868 1335022 1437418 943072 1254895 1061987 1121758 1312093 1295061 1351311 1207215 1366042
$$ packed form
13939B236109k0476k01322M4370j89682o785m472K69260j25376N9020j55422k78816
13928A626408K74050J09899m43010L55365p847n16249M79885j51492n74j36698
13918A589737J33212M2240k21466K15194j06957k34649N3868M84472k58285k56524
13908A440842K65108O6211k40714j07475J62066j08834N9962l82950L43307k31061
13898A266462L83927O5804j41695l2586j77414J19804j73596N0392Q8765L47767
13888A797630j53630j41788K3189o9703N2169k56942N3690J08859R4766J68196
13878A676436k51907j78124P7922O6330j81142k34183M18615k8157J02058j32826
13868A335022J02396m94346L11823j92908N9771J90335j7032N6250j44096J58827
$$ plain form
13858 1366042 1355377 1259027 1324324 877673 1386715 1366996 1117420 1039662 1042007 1274614 1119081
13847 1119081 1002615 1237058 1337509 1195566 1162778 1089095 887491 1399511 1139083 935306
13837 935306 1776679 1301954 1186507 1034352 1004462 1099456 1183274 848685 790014 1098034
13827 1098034 1202399 1112198 1148066 1070104 1055796 1060676 945685 1538777 892640 1005440
13817 1005440 1282049 1285570 1180881 1079203 928885 782528 1018862 980698 665868 1043401
13807 1043401 781872 828465 1171153 1190400 763639 977751 780919 766120 553022 1066861
13797 1066861 856846 911487 1023077 748276 1026797 687834 568511 985898 988263 703202
13787 703202 884298 646636 776282 825052 555013 488158 740154 855041 766580 1019526
$$ packed form
13858A366042j0665r6350O5297m46651N09042j9719k49576p7758K345K32607j55533
13847A119081j16466K34443J00451j41943l2788p3683k01604N12020k60428k03777
13837I35306Q41373m74725j15447j52155k9890R4994Q3818l34589n8671L08020
13827A098034J04365r0201L5868p7962j4308M880j14991N93092o46137J12800
13817A005440K76609L521j04689j01678j50318j46357K36334l8164l14830L77533
13807A043401k61529M6593L42688J9247m26761K14112j96832j4799k13098N13839
13797A066861k10015N4641J11590k74801K78521l38963j19323M17387K365k85061
13787G03202J81096k37662J29646M8770k70039o6855K51996J14887q8461K52946
$$ plain form
13777 1019526 805713 734192 506591 671785 1011077 337080 753182 729070 931292 592142
13767 592142 945185 941395 970116 538802 788444 614069 801082 754846 381349 968056
13757 968056 634709 633787 1086968 945133 371621 878120 992153 560609 361698 790722
13747 790722 719727 455800 689919 579446 554822 614114 804559 713635 464983 383502
13737 383502 743383 807406 734781 1005463 461590 813655 617260 607672 783508 628594
13727 628594 655405 851571 628010 610979 733960 643100 583202 739127 777523 552765
13717 552765 506803 839394 722421 540280 234929 496731 506782 721322 601121 756586
13707 756586 787453 454804 678175 300611 158682 383108 825974 207814 711159 539909
$$ packed form
13777A019526k13813p1521k27601J65194L39292C37080M16102k4112K02222l39150
13767E92142L53043l790K8721m31314K49642j74375J87013m6236l73497N86707
13757I68056l33347r22M53181j41835C71621N06499J14033m31544j98911M29024
13747G90722p0995k63927K34119j10473k4624N9292J90445r0924k48652q1481
13737C83502L59881O4023p2625K70682D61590L52065j96395r588J75836j54914
13727F28594K6811J96166k23561j7031J22981r0860n9898J55925L8396k24758
13717E52765m5962L32591j16973j82141B34929K61802J0051K14540j20201J55465
13707G56586L0867l32649K23371C00611j41929K24426M42866B07814N03345j71250
$$ plain form
13697 539909 290841 531237 433307 383116 337386 512475 722420 477664 510140 403903
13687 403903 723152 609838 654450 482271 591312 600226 479461 312688 661896 384558
13677 384558 477031 296185 451842 424672 275325 685962 435971 477332 540739 616553
13667 616553 363346 634871 718228 390113 491690 394279 503382 481855 358085 412463
13657 412463 252333 553729 475851 368099 839282 801662 768940 685375 250744 461408
13647 461408 787567 486324 640169 341087 319571 488416 533286 513868 602692 655246
13637 655246 209435 387105 454231 573993 457752 688669 92992 288660 534264 404833
13627 404833 350798 569592 145795 764173 305133 473187 436743 583316 355966 616950
$$ packed form
13697E39909k49068K40396r7930n0191m5730J75089K09945k44756L2476j06237
13687D03903L19249j13314M4612j72179J09041Q914j20765j66773L49208k77338
13677C84558R2473j80846J55657k7170j49347M10637k49991M1361O3407P5814
13667F16553k53207K71525Q3357l28115J01577r7411J09103k1527j23770N4378
13657D12463j60130L01396p7878j07752M71183l7620l2722q3565B50744K10664
13647D61408L26159l01243J53845k99082k1516J68845M4870j9418Q8824N2554
13637F55246B09435J77670O7126J19762j16241K30917I2992J95668K45604j29431
13627D04833n4035K18794A45795O18378C05133J68054l6444J46573k27350K60984
$$ plain form
13617 616950 540128 636098 405775 357201 650919 323269 25420 522011 363459 391858
13607 391858 548718 738828 564781 211984 172307 489487 664438 500246 577909 292781
13597 292781 454991 113159 355044 34440 517950 526024 415087 667997 447831 153472
13586 368390 299730 885693 228419 336186 472564 180 571289 -12513 612407 504114
13576 504114 217769 175757 466717 260065 383341 280487 377224 499410 464191 486598
13566 486598 658117 323051 453298 446896 144771 544194 229414 26445 389625 463342
13556 463342 473960 -1823 112662 347758 195375 681170 636175 442397 604394 532953
13546 532953 -31952 112909 280348 326799 283972 -8976 -137918 382069 278569 343342 142526
$$ packed form
13617F16950p6822R5970k30323m8574K93718C23269B5420M96591j58552K8399
13607C91858J56860J90110j74047B11984l9677L17180J74951j64192P7663k85128
13597B92781J62210A13159K41885C4440M83510Q074j10937K52910k20166A53472
13586C68390o8660N85963B28419J07767J36378A80N71109a2513F12407j08293
13576E04114B17769m2012K90960k06652J23276j02854R6737J22186l5219K2407
13566D86598J71519C23051J30247o402A44771L99423B29414B6445L63180P3717
13556D63342J0618a823A12662K35096j52383M85795m4995j93778J61997p1441
13546E32953c1952A12909J67439M6451m2827h976j28942C82069j03500O4773A42526
$$ plain form
13534 -1333 606792 613405 496614 465431 -123487 299183 366990 301826 119522 137739 308789
13523 308789 86070 491690 375995 232784 501817 293366 196438 115552 116496 331825 141369
13511 448136 118204 26124 335422 184884 381928 740596 466662 398030 379281 343839
13501 343839 -55907 251599 307627 261220 359101 340575 464959 271021 58689 265664 102841
13489 338597 366685 445687 352711 -64189 243431 152797 410653 48428 250686 362985 443295
13478 443295 228991 142820 142515 66238 295908 140652 175554 580172 182107 -64053 289859
13466 238326 351187 22760 284438 294913 464913 355006 247775 405335 244449 601391
13456 601391 195684 203479 230509 176774 91075 412722 398018 399128 187939 331831 143292
$$ packed form
13534a333F06792O613j16791l1183a23487B99183O7807o5164A19522J8217J71050
13523C08789H6070M05620j15695j43211K69033k08451r6928q0886R44K15329A41369
13511D48136A18204B6124L09298j50538J97044L58668k73934o8632j8749l5442
13501C43839e5907B51599N6028m6407R7881j8526J24384j93938E8689K06975A02841
13489C38597K8088P9002r2976f4189B43431r0634K57856D8428K02258J12299Q0310
13478D43295k14304q6171l05F6238K29670A40652L4902M04618A82107f4053B89859
13466B38326J12861B2760K61678J0475J70000j09907j07231J57560j60886L56942
13456F01391A95684P795K7030n3735q5699L21647j4704J110A87939J43892A43292
$$ plain form
13444 296986 412097 35493 581690 194266 174697 346305 449709 165844 143537 539920
13434 539920 356800 40135 13155 -150875 127525 103510 392338 208912 135722 351863
13424 351863 83225 465615 12156 208880 407078 62343 395621 139707 51407 186892
13414 186892 -29328 -38367 150544 148650 390526 -89710 124174 34672 148957 290365 105607
13402 459197 380356 -28450 -95172 244125 400813 281679 -60422 452259 145493 -21407
13391 -67085 55553 267507 31790 52201 380662 116603 190203 486335 361779 224831
13381 224831 -47646 85366 293048 360648 343218 291826 214911 540851 204155 -35392 273173
13369 124752 143208 -78369 350703 102752 422223 203790 38233 275779 393485 318985
$$ packed form
13444B96986J15111C5493N46197A94266j9569J71608J03404A65844k2307L96383
13434E39920j83120D0135A3155a50875A27525k4015K88828j83426p3190K16141
13424C51863H3225L82390A2156J96724J98198F2343L33278A39707E1407J35485
13414A86892b9328r039A50544j894K41876h9710A24174C4672J14285J41408A05607
13402D59197p8841b8450o6722B44125J56688j19134f0422D52259A45493b1407
13391f7085E5553K11954C1790K0411L28461A16603P3600K96132j24556j36948
13381B24831d7646H5366K07682O7600j7430n1392p6915L25940B04155c5392B73173
13369A24752J8456g8369C50703A02752L19471B03790C8233K37546J17706p4500
$$ plain form
13359 318985 -94037 313518 148113 385761 38296 85548 228330 77984 328148 121179
13348 292742 325426 233521 114194 -243758 181679 98712 249248 331651 163761 260890
13338 260890 372948 365518 362945 -56961 -41089 152850 228699 145759 168344 202178 161525
13327 161525 -4022 197526 243591 156189 199904 203219 206405 191521 467146 73948 -123367
13315 118500 510241 335599 234196 77801 8903 171696 51232 243008 81456 386284
13305 386284 99624 243155 47360 399058 177444 463216 160293 237285 110456 511314
13295 511314 362999 193338 430907 98756 75322 63638 513204 303937 161544 433644
13285 433644 130684 35489 409625 161217 203303 -64644 -9397 349962 -46038 50167 -82481
$$ packed form
13359C18985i4037C13518A48113K37648C8296M7252J42782G7984K50164A21179
13348B92742L2684r1905A14194b43758A81679q2967J50536Q2403A63761R7129
13338B60890J12058p430k573e6961J5872A52850P5849q2940K2585L3834m0653
13327A61525d022A97526M6065q7402M3715L315L186j4884K75625G3948a23367
13315A18500L91741j74642j01403G7801H903J62793E1232J91776H1456L04828
13305C86284I9624J43531D7360L51698A77444K85772A60293P6992A10456M00858
13295E11314j48315j69661K37569I8756k3434j1684M49566k09267j42393K72100
13285D33644A30684C5489L74136A61217M2086f4644i397C49962d6038E0167h2481
$$ plain form
13273 485625 382450 -148092 110298 91889 240876 299610 -27230 86406 222357 120380
13263 120380 500297 54441 -162221 92409 216750 242690 246189 473842 99792 179580 138566
13252 138566 76309 69615 116570 -149392 287300 13678 -72078 129297 455360 304808 166654
13241 166654 114348 182185 -9637 108154 95083 239679 -148151 68221 296734 -141339 210834
13229 13685 159690 -31864 -214629 156257 38766 286165 -14847 -61711 242263 277555 120435
13217 5833 433506 6062 -147362 184476 -90442 158385 264723 92468 -18517 -30693 220969
13205 57395 177603 73969 310970 327648 -98475 -214368 219383 -94798 90587 44839 185251
13194 185251 181485 -9224 -47466 197331 59404 -307345 58180 15689 -131606 101785 320667
$$ packed form
13273D85625j03175a48092A10298j8409J48987N8734b7230H6406J35951j01977
13263A20380L79917E4441a62221I2409J24341K5940L499K27653I9792P9788m1014
13252A38566o2257o694M6955a49392B87300A3678g2078A29297L26063j50552j38154
13241A66654n2306O7837i637A08154j3071J44596a48151F8221K28513a41339B10834
13229A3685J46005c1864j82765A56257C8766K47399a4847m6864B42263L5292A20435
13217E833M27673F062a47362A84476i0442A58385J06338I2468a8517j2176B20969
13205E7395J20208G3969K37001J6678i8475j15893B19383i4798I0587D4839J40412
13194A85251l766i224l8242A97331E9404c07345E8180A5689a31606A01785K18882
$$ plain form
13183 320667 62662 -51959 -20865 123618 64469 -114254 256262 66523 -62502 95401 106732
13172 106732 93161 88257 202961 426388 306879 -175267 -99483 69032 -36880 -158463 153068
13160 117289 -55274 -93527 -59993 124887 261601 -111251 252960 -48301 83713 -103151
13149 460513 21896 -144183 -193482 28135 -20037 104263 157323 155649 36047 275808 -52970
13137 50568 84143 108224 82992 -37108 43447 -113618 89099 66888 374868 47856 -252107
13125 37591 382297 -176075 -41085 -251513 -427479 321157 27964 121979 -164238 -142807
13115 -142807 12472 -181761 147466 10917 112057 150569 83032 -1672 90526 438280 44553
13103 101294 88780 -160193 -135911 -55119 87764 154338 -234787 301335 36826 180615 111294
$$ packed form
13183C20667F2662e1959b0865A23618n9149a14254B56262F6523f2502I5401J1331
13172A06732j3571m904J14704K23427j19509a75267P5784F9032c6880j21583A53068
13160A17289e5274l8253L3534A24887J36714a11251B52960d8301H3713a03151
13149D60513B1896a44183m9299B8135b0037A04263N3060j674C6047K39761e2970
13137E0568L3575K4081k5232c7108D3447a13618H9099k2211L07980D7856b52107
13125C7591L44706a76075d1085k10428j75966C21157B7964R4015a64238K1431
13115a42807A2472a81761A47466A0917J01140L8512o7537a672I0526L47754D4553
13103A01294j2514a60193K4282e5119H7764O6574b34787C01335C6826J43789o9321
$$ plain form
13092 111294 242903 22183 150298 -7604 -37766 238654 177232 -48360 80080 193128 268361
13081 268361 390877 -45779 -152928 -35269 292896 76563 -75534 -255731 -21959 -36623 49780
13069 -29533 -41152 13656 214612 -203470 147199 331489 -54598 103185 -102868 267666
13058 141395 -91110 -175150 -47364 263327 201086 63123 -93712 252140 14994 264171 40404
13046 -57395 -70093 148539 56821 252533 200075 176547 197534 36404 -17208 106103 -135576
13034 34735 -180759 315987 178649 166626 357855 -213529 213327 263306 -114086 -100964
13024 -100964 456377 276344 -71791 212861 42327 321515 268688 37843 67893 330129
13014 330129 192002 374447 -104475 -430 -80655 178829 212825 -79311 104245 479768 183648
$$ packed form
13092A11294J31609B2183J28115g604l0162B38654o1422d8360H0080J13048P5233
13081B68361J22516d5779j07149c5269B92896G6563g5534j80197b1959j4664D9780
13069b9533j1619A3656K00956b03470A47199J84290e4598A03185a02868B67666
13058A41395i1110q4040d7364B63327o2241F3123i3712B52140A4994K49177D0404
13046e7395j2698A48539E6821J95712n2458k3528K0987C6404a7208A06103a35576
13034C4735a80759C15987j37338j2023J91229b13529B13327M9979a14086J3122
13024a00964D56377j80033g1791B12861D2327K79188n2827C7843L0050K62236
13014C30129j38127J82445a04475d30q0225A78829L3996g9311A04245L75523A83648
$$ plain form
13002 54301 294300 -205691 9472 200696 -39635 203179 88228 -45656 140677 21746 223234
12991 223234 104267 96700 -66454 245490 326731 120088 -25901 -13843 250240 92738 161736
12980 161736 12413 94868 84619 161913 82975 -135442 -38443 274520 95461 80156 -552509
12968 231723 363528 -174283 -34892 309840 -223435 93685 -177087 -19412 -50974 -64137
12958 -64137 33340 -61019 -276510 157621 63238 246231 246199 39586 -113364 -155008 102373
12946 -96670 152856 296709 212699 -166382 95114 -27536 -127676 53761 -137967 -68554 -135273
12935 -135273 18801 180812 87871 -38613 -22559 -72959 58655 -90813 -106249 -9116 -60316
12924 -60316 327820 -96287 54569 -97441 -66785 -269796 -156195 -43322 -59021 300006 -70354
$$ packed form
13002E4301K39999b05691I472J91224c9635B03179H8228d5656A40677B1746K01488
12991B23234A04267p567f6454B45490Q1241A20088b5901J2058B50240I2738O8998
12980A61736A2413Q2455j0249P7294p8938a35442c8443B74520I5461j5305e52509
12968B31723J31805a74283c4892C09840b23435I3685a77087a9412l1562j3163
12958f4137C3340f1019k15491A57621F3238J82993l2C9586a13364m1644A02373
12946i6670A52856J43853q4010a66382I5114b7536j00140E3761a37967f8554o6719
12935a35273A8801J62011H7871c8613J6054n0400E8655i0813j5436i116n1200
12924f0316C27820i6287E4569i7441L0656k03011J13601d3322j5699C00006g0354
$$ plain form
12912 153544 135546 220091 137266 -161711 170808 -224960 233853 250291 -181630 354982
12901 -127923 -105888 -48795 160454 74462 -313922 392 191921 -173179 -35311 -252451 91745
12889 -249118 1058 34476 -60081 -53708 -78424 -67471 -68397 -129631 362336 -83639 -352789 -86112
12876 252193 82758 198329 -73703 -56010 -36014 -113907 -59711 -123036 82016 202601 -116750
12864 39067 -60011 -49404 -42442 236931 -226662 19552 23619 -193095 -168251 199246 80451
12852 -100642 361001 -70271 -9323 355732 120830 188221 96641 -830 -106123 -17967 -372050
12841 -372050 -61998 -205449 318669 -931 55320 -178681 20560 -84325 -190293 65862 399616
12830 399616 114750 -16779 100859 -16643 -156043 127256 -31556 71659 107983 -141239
$$ packed form
12912A53544j7998Q4545q2825a61711A70808b24960B33853J6438a81630C54982
12901a27923K2035d8795A60454G4462c13922C92J91529a73179c5311k17140I1745
12889b49118A058L3418f0081O373k4716J0953r26o1234C62336h3639k69150h6112
12876B52193H2758J15571g3703J7693J9996p7893N4196o3325H2016J20585a16750
12864C9067f0011J0607O962B36931b26662A9552M067a93095K4844A99246H0451
12852a00642C61001g0271i323C55732A20830O7391r1580h30j05293a7967l54083
12841c72050f1998j43451C18669i31E5320a78681B0560h4325j05968F5862L33754
12830C99616A14750a6779A00859a6643j39400A27256c1556G1659L6324a41239
$$ plain form
12819 211052 -106172 280719 164287 -81232 -97210 -161966 46495 -11852 -117133 3165 -31664
12807 -273074 -145793 49593 182173 301722 53997 -97403 265961 -242097 -59945 -5823 123268
12795 220303 -229367 136980 -53832 -251803 64711 9840 -301180 20540 164989 173712 -109197
12783 103935 -55873 113508 247108 -224706 171987 379416 -97566 -81980 -88964 -85189 -229091
12772 -229091 63753 187492 90669 67526 -200458 -137060 197937 45122 60041 -198750 151838
12760 -100279 1042 44661 -116071 -157600 210344 -87550 220687 -205496 99459 104588 350461
12749 350461 -49251 92927 221644 82912 -103765 -85704 -218386 64514 107448 42957 37168
12738 37168 66059 -152342 164669 -254500 -46968 -454483 -158351 148367 328988 -45793
$$ packed form
12819B11052a06172B80719j16432h1232j5978o4756D6495a1852j05281C165c1664
12807b73074J27281D9593J32580J19549E3997i7403B65961b42097e9945e823A23268
12795B20303b29367A36980e3832j97971F4711I840c01180B0540J44449Q723a09197
12783A03935e5873A13508J33600b24706A71987K07429i7566J5586o984L775j43902
12772b29091F3753J23739I0669k3143b00458O3398A97937D5122J4919a98750A51838
12760a00279A042M3619a16071m1529B10344h7550B20687b05496I9459N129K45873
12749C50461d9251I2927J28717H2912a03765J8061j32682F4514M2934D2957n789
12738C7168K8891a52342A64669b54500d6968m07515a58351A48367J80621d5793
$$ plain form
12727 234141 -32224 201141 93877 -265568 -151777 -53631 83469 -24059 258675 344787 196298
12716 196298 162856 94484 37704 251140 -277429 -162098 -62051 -126194 4077 45900 -56352
12704 9331 3895 -15200 -345824 -231700 -125552 -2042 241260 -84901 68541 148810 211219
12693 211219 153965 451160 123616 93577 168876 -1262 159141 170694 156326 459742 -137473
12681 -24647 -301409 132341 28846 -383468 -210437 250645 -160897 -118311 412047 -8539
12670 -99089 -267722 -93517 81895 -100131 191586 405099 -361948 291222 13194 91535
12660 91535 103351 197747 41774 -367210 -81549 -10597 64736 -41290 191726 27154 -274235
12648 137471 17212 97219 100133 168141 65215 149334 445434 -120775 238205 229504 52362
$$ packed form
12727B34141c2224B01141I3877b65568J13791e3631H3469b4059B58675Q6112j48489
12716A96298l3442o8372C7704K13436b77429J15331f2051o4143D077M1823e6352
12704I331C895a5200l30624J14124J06148b042B41260h4901F8541Q0269O2409
12693B11219n7254K97195A23616l0039P5299a262A59141J1553j4368L03416a37473
12681b4647k76762A32341B8846c83468J73031B50645a60897M2586D12047h539
12670i9089j68633i3517H1895a00131A91586K13513c61948B91222A3194P8341
12660I1535J1816R4396D1774c67210h1549a0597F4736d1290A91726B7154b74235
12648A37471A7212Q0007K914O8008F5215Q4119K96100a20775B38205q701E2362
$$ plain form
12636 199430 125806 -90849 176011 24275 5989 26150 229576 198714 -86336 -82052 81140
12624 65772 -30980 -4105 190685 79974 143187 88773 -155443 75401 168055 25579 133155
12613 133155 -422242 77178 -123871 428322 -1153 84814 377631 152326 -9521 117618 325905
12602 325905 133116 189192 58350 111612 146087 -57193 -134169 -18788 146072 -88847 141056
12590 -176525 288073 -31661 178019 113744 -109909 -21657 -101549 231631 -2985 -38217 366497
12578 -2449 342828 231796 24781 338375 -119270 -248740 -27782 61598 -87764 163608 -358950
12566 -236206 113775 -23761 174480 -154062 -291119 35049 -216104 -54226 -45493 -77838 295050
12554 -5414 75362 -307208 -37506 -96239 249160 -22457 69556 243964 -116224 -376542 -53008
$$ packed form
12636A99430p3624i0849A76011B4275E989K0161K03426l0862h6336M284H1140
12624F5772c0980d105A90685G9974O3213n4414a55443G5401R2654B5579J07576
12613A33155d22242G7178a23871D28322a153H4814K92817A52326i521A17618K08287
12602C25905A33116N6076E8350N3262L4475e7193p6976a8788A46072h8847A41056
12590a76525B88073c1661A78019o4275a09909b1657p9892B31631b985l5232C66497
12578b449C42828j11032B4781L13594a19270j29470b7782F1598h7764A63608c58950
12566b36206A13775b3761A74480a54062j37057C5049b16104e4226Q733l2345B95050
12554e414G5362c07208c7506n8733B49160b2457F9556J74408a16224k60318e3008
$$ plain form
12542 156337 85145 -131627 242725 -50105 86300 12921 -89516 -111975 366739 209629 -220181
12530 164242 187254 127148 8441 372502 347281 -349 51385 61867 -171822 216942 162365
12519 162365 -76427 -88801 -52587 -24293 -62472 204439 -144818 -104892 60358 -52763 -119979
12508 -119979 287531 -165050 -23621 26119 181632 16756 -390717 -153843 -118374 -175083
12498 -175083 -44897 235344 200205 -151389 -85393 19442 -1779 115804 -135166 -59400 24690
12486 -171519 -168726 -229252 154061 203288 -55720 -328268 70849 -622136 215056 -202739 -203785
12475 -203785 44582 5922 6883 -79873 29660 -62694 -23625 -94312 -38286 148681 86626 168468
12463 168468 66365 -142666 100357 -43466 -123923 -78993 -74359 140521 4156 55772 -173170
$$ packed form
12542A56337p1192a31627B42725e0105H6300A2921h9516k2459C66739j57110b20181
12530A64242K3012o0106H441L64061k5221c49E1385J0482a71822B16942n4577
12519A62365g6427j2374L6214b4293l8179B04439a44818L9926F0358e2763o7216
12508a19979B87531a65050b3621B6119J55513A6756c90717a53843L5469n6709
12498a75083d4897B35344l5139a51389O5996A9442a779A15804a35166e9400B4690
12486a71519K793o0526A54061M9227e5720k72548G0849f22136B15056b02739j046
12475b03785D4582E922R61g9873B9660f2694b3625p0687c8286A48681o2055Q1842
12463A68468F6365a42666A00357d3466q0457M4930M634A40521D156N1616a73170
$$ plain form
12451 -98605 -125621 -284993 -68841 157970 -43552 266075 -34414 -130818 171299 -59115 -213712
12440 -213712 -278825 80515 -21030 -11350 -186314 93052 -249686 -103388 170017 20435 34196
12429 34196 -258734 342994 -23898 -24300 -130152 -119197 73281 56582 36708 -65172 205557
12417 257887 91808 56567 21341 -77110 38605 352756 212458 104242 89684 21810 158831
12406 158831 47838 24279 -310592 -93292 158024 -69228 -326681 -121004 152398 -26685
12395 -125426 51078 -131351 -85479 -238730 -77227 225084 95370 164386 -156293 95427 145452
12384 145452 -239738 -48381 -83072 -35331 -2877 -2047 -158951 -49500 422203 332012 -32691
12372 353628 149653 36469 46519 201651 153446 -301099 132442 -357671 -30398 174491
$$ packed form
12451i8605k7016j59372f8841A57970d3552B66075c4414r6404A71299e9115j54597
12440b13712o5113H0515b1030R680j74964I3052b49686a03388A70017B0435J3761
12429C4196b58734C42994b3898m02j05852J0955G3281j6699j9874f5172B05557
12417B57887I1808l5241B1341g7110C8605L14151j40298A04242j4558B1810J37021
12406A58831D7838k3559c10592i3292A58024f9228k57453a21004A52398b6685
12395a25426E1078a31351M5872j53251g7227B25084I5370O9016a56293I5427N0025
12384A45452b39738d8381l4691c5331b877Q30j56904d9500D22203r0191c2691
12372C53628A49653C6469J0050J55132m8205c01099A32442c57671c0398A74491
$$ plain form
12361 -45087 318057 186896 141672 229758 20263 284581 329144 215911 92052 -63056 8611
12349 59605 -68289 70545 -37325 83961 185269 66819 214085 44299 -147288 -191526 463167
12337 -201010 -69839 271352 -248392 260792 49538 -243819 -19044 210714 -116016 -439407
12327 -439407 258130 -308905 -30035 22261 -87388 235035 -78432 85105 131255 156189 -25854
12315 101290 93308 422269 99321 50566 -105233 -274645 -151212 -190775 111005 229314
12305 229314 110631 707 123871 62392 326773 192970 -224379 66631 -99415 124623 2084
12293 -58789 331505 472959 -247758 43063 126619 172902 -260957 108272 108548 -146104 147516
12281 -213989 62054 103322 41125 59596 299708 179564 290272 161420 -358397 205525
$$ packed form
12361d5087C18057j31161m5224Q8086B0263K64318M4563j13233I2052f3056H611
12349E9605f8289G0545c7325H3961J01308F6819J47266D4299a47288m4238D63167
12337b01010f9839B71352b48392B60792D9538b43819a9044B10714a16016l23391
12327d39407B58130c08905c0035B2261h7388B35035g8432H5105M6150K4934b5854
12315A01290p982L28961I9321m8755a05233j69412J23433l9563A11005J18309
12305B29314A10631G07J23164o1479K64381j33803b24379F6631i9415A24623B084
12293e8789C31505J41454b47758D3063Q3556M6283b60957A08272K76a46104A47516
12281b13989F2054M1268D1125J8471K40112j20144J10708j28852c58397B05525
$$ plain form
12270 144618 88297 115803 -72026 339752 74078 199955 225567 264113 293794 65788 261148
12259 261148 122338 160947 190731 334721 209430 -22222 180341 -210071 333933 -62327
12248 324453 274071 488391 -139774 -263655 -170632 -17721 154832 197921 96053 286512
12238 286512 334589 261236 203103 202229 -170659 -9395 102618 165552 247256 40214 -34426 -151491
12226 -151491 72329 220057 83891 344636 61752 -56016 -296109 217972 -99389 10606 70445
12215 70445 161358 -133979 265563 -274658 114100 209583 93484 190198 70149 27832 120346
12204 120346 227134 167289 153800 15772 195711 109794 -57634 -76843 -322161 -103517 178857
12192 -183669 -196274 -102767 4942 132030 165866 87673 244480 216737 65088 262912 -302536
$$ packed form
12270A44618n6321K7506g2026C39752G4078J25877K5612L8546K9681F5788J95360
12259B61148A22338L8609K9784J43990j25291b2222A80341b10071C33933f2327
12248C24453n0382K14320a39774j23881R3023a7721A54832M3089I6053J90459
12238B86512M8077p3353n8133q74a70659i395A02618O2934Q1704D0214c4426j17065
12226a51491G2329J47728H3891K60745F1752e6016k40093B17972i9389A0606N9839
12215G0445R0913a33979B65563b74658A14100R5483I3484R6714G0149B7832R2514
12204A20346J06788n9845j3489A5772J79939q5917e7634j9209k45318a03517A78857
12192a83669j2605R3507D942J27088L3836p8193J56807k7743F5088J97824c02536
$$ plain form
12180 -15428 221349 213799 163833 101077 -207861 169316 -24586 178426 176678 52718 -17622
12168 -170439 95143 -166403 356542 -5815 88708 111637 180998 180416 113534 342178 392208
12157 392208 -66556 -143606 148914 64292 29057 274930 259012 165561 152489 341307 197769
12146 197769 411723 348922 47767 -112707 78294 81914 13479 304849 -74085 88622 -84663
12134 13772 228084 17009 130923 -44445 67279 47540 327725 168222 43805 120706 141298
12123 141298 224466 -51447 -28336 -81089 3145 5395 -69333 77688 226892 296648 -126503
12111 452277 407334 207431 -24956 36728 125711 340083 139399 343634 -72439 47094 192134
12100 192134 28885 181331 -237895 61436 132812 105828 34732 -101505 137447 280156
$$ packed form
12180a5428B21349p550m9966o2756b07861A69316b4586A78426j748E2718a7622
12168a70439I5143a66403C56542e815H8708K2929O9361n82o6882K28644N0030
12157C92208f6556p7050A48914F4292B9057K45873j5918r3451j3072J88818j43538
12146A97769K13954o2801D7767a12707G8294L620A3479K91370g4085H8622h4663
12134A3772K14312A7009J13914d4445F7279j9739K80185j59503D3805P6901K0592
12123A41298Q3168e1447K3111n2753C145K250f9333G7688J49204O9756a26503
12111D52277m4943j99903b4956C6728Q8983K14372A39399K04235g2439D7094J45040
12100A92134B8885J52446b37895F1436P1376k6984C4732a01505A37447J42709
$$ plain form
12090 280156 -194014 -51446 89649 23415 147510 168652 -204625 -24111 252524 209584 198286
12079 198286 180945 -27032 367465 -65228 94685 394453 -140401 38527 136216 176176 469424
12068 469424 -50254 -72087 10906 225702 296518 241209 48883 263015 -108073 306000 -30362
12056 149470 135376 156536 -224966 210979 142493 -184350 191953 122675 278564 34263
12045 -94435 -26675 528111 -195853 164635 324429 -72944 132733 -198231 204417 -58111
12034 -52588 -100819 -182494 92881 233696 -204158 -315845 60674 -131259 -126117 156858 -100931
12022 364280 228561 -180812 -106894 -41633 -383962 -129637 5769 -14583 -42235 -328792 99441
12010 223820 407770 -80080 29088 27790 117574 -43058 249704 -178336 29436 -35117 156416
$$ packed form
12090B80156a94014e1446H9649B3415J24095K1142b04625b4111B52524m2940j1298
12079A98286j7341b7032C67465f5228I4685K99768a40401C8527R7689L9960K93248
12068D69424e0254k1833A0906K14796P0816n5309D8883K14132a08073C06000c0362
12056A49470j4094K1160b24966B10979o8486a84350A91953o9278J55889C4263
12045i4435b6675E28111a95853A64635J59794g2944A32733a98231B04417e8111
12034e2588m8231q1675I2881J40815b04158j11687F0674a31259N142A56858a00931
12022C64280j35719a80812P3918d1633l42329a29637E769a4583k7652k86557I9441
12010B23820J83950h0080B9088j298Q9784d3058B49704a78336B9436c5117A56416
$$ plain form
11998 177898 305229 -51119 -420136 21294 222040 228188 288777 -201363 -12371 82318 59815
11987 59815 110251 -64968 -220180 170282 27960 -129690 6474 -61311 -98989 4012 121222
11976 121222 -8077 -61109 -23227 138468 194373 -59414 -49803 -95785 -394935 -142453 -25489
11964 279993 161341 138347 32615 329048 -190238 31194 -68197 -228485 207283 -138708
11953 -132571 -442503 -62460 -263628 15485 254600 -260428 29431 48179 21278 -148865
11942 51134 -70836 -98869 -97639 -89592 -18321 -237151 55596 85029 -133215 28542 -17669 346853
11929 -58953 -28306 64681 149292 -428610 -157454 -94822 -164647 90815 -265469 170471 -176733
11917 -70315 -31881 -161087 -42089 181184 154397 80267 -68748 -267668 194124 -57167 317058
$$ packed form
11998A77898J27331e1119l69017B1294K00746O148O0589b01363a2371H2318k2503
11987E9815N0436f4968j55212A70282B7960a29690F474f1311l7678D012J17210
11976A21222h077n3032b3227A38468N5905e9414R611m5982k99150a42453b5489
11964B79993j18652k2994C2615K96433a90238C1194f8197j60288B07283a38708
11953a32571l09932f2460k01168A5485K39115b60428B9431J8748B1278a48865
11942E1134g0836k8033J230Q047a8321k18830E5596K9433a33215B8542a7669C46853
11929e8953b8306F4681Q4611d28610a57454O2632o9825I0815b65469A70471a76733
11917g0315c1881j29206d2089A81184k6787p4130f8748j98920A94124e7167C17058
$$ plain form
11905 160661 -220745 145792 -102136 65284 184976 308346 -7787 237802 -64942 28280
11894 247973 28393 308923 152899 -12741 293688 -79687 -433522 -95464 200927 170110
11884 170110 -41097 -247997 -199500 -19912 -171618 -255959 167870 -128118 -125784 -113656 -20344
11872 123568 -453517 -143898 -12819 -24161 -194185 184643 -395747 169219 -259139 -169107
11862 -169107 39857 48627 -240840 -223343 8902 13310 -124576 -230509 -229187 240949 -25384
11850 -41394 -182747 -29704 -39073 -62004 14509 -17790 37373 -150763 -259205 -11718 -179088
11839 -179088 376399 -101474 -7223 -2524 -178751 91160 158865 -227238 -209588 60256 -345483
11827 155079 248462 90975 35479 -171345 77918 -225409 -24433 55206 12439 52428 -217114
$$ packed form
11905A60661b20745A45792a02136F5284J19692J23370g787B37802f4942B8280
11894B47973B8393K80530A52899a2741B93688g9687l53835i5464B00927l0817
11884A70110d1097k06900M8497a9912j51706q4341A67870a28118K334J2128b0344
11872A23568d53517a43898a2819j1342j70024A84643c95747A69219b59139R0032
11862a69107C9857Q770b40840J7497H902M408a24576j05933J322B40949b5384
11850d1394j41353b9704r369k2931A4509a7790C7373a50763j08442a1718j67370
11839a79088C76399a01474g223b524j76227I1160O7705b27238J7650F0256c45483
11827A55079R3383I0975C5479a71345G7918b25409b4433E5206A2439L9989b17114
$$ plain form
11815 -82833 -112326 -181012 -2724 -179482 -97072 -218459 -357022 -38209 -23419 240347 -282851
11803 -230935 -56153 -59779 -135780 229375 102627 -94796 -106873 228025 -55883 -213048 -75137
11791 109468 33510 -33950 99026 -121602 -284436 -30849 -84041 211479 -130301 152072
11780 -59370 -428683 -42622 -141357 57461 17002 -142544 -444491 -89647 39254 62231 -190423
11768 128058 302481 -80710 68039 122905 60933 -189241 158922 -264403 258927 96082
11757 127702 -99631 -260190 -241105 36331 58403 250316 -114662 -205126 136128 -74331 444345
11745 -7147 135988 -113942 -139491 -199161 -38150 309989 -223244 189610 -80248 -74891 119790
11733 -118447 -15684 -125877 -128710 -364566 119861 77289 278339 197271 -55751 175662 -46007
$$ packed form
11815h2833k9493o8686b724j76758Q2410j21387j38563c8209J4790B40347b82851
11803b30935e6153l626p6001B29375A02627i4796j2077B28025e5883j57165g5137
11791A09468C3510c3950I9026a21602j62834c0849n3192B11479a30301A52072
11780e9370l69313d2622r8735E7461A7002a42544l01947h9647C9254K2977a90423
11768A28058J74423h0710F8039N4866F0933a89241A58922b64403B58927I6082
11757A27702i9631j60559J9085C6331K2072J91913a14662r0464A36128g4331D44345
11745g147A35988a13942k5549n9670c8150C09989b23244A89610h0248N357A19790
11733a18447a5684j10193k833k35856A19861m2572K01050q1068e5751A75662d6007
$$ plain form
11721 -281658 -111360 71483 237387 -111575 -11944 498409 -290391 -52958 -208058 212042
11710 -16497 309522 152537 -65170 162663 423725 247815 -205516 213373 59220 395971
11700 395971 -154606 -62083 42530 -139717 86870 -60330 -176249 -63658 -38582 76317 -120493
11688 176947 -34261 -46342 130221 309529 24399 -146890 348070 14697 107151 -73223 198979
11676 -50716 21020 102905 68178 287016 -122683 -130493 -229619 70169 -146819 63378 -416369
11664 -137390 109753 -161379 -102274 -5971 164261 -49116 -18215 -106709 -141747 223563 83226
11652 -136177 360451 -42879 79710 122473 304904 -46057 234659 101585 59484 67842 -245776
11640 -54359 -274579 549833 80017 -243224 159709 226815 -87678 -48143 -124450 -44897 177907
$$ packed form
11721b81658a11360G1483J65904a11575a1944D98409b90391e2958j55100B12042
11710a6497C09522A52537f5170A62663K61062j75910b05516B13373E9220L36751
11700C95971a54606f2083D2530a39717H6870f0330j15919f3658K5076G6317a20493
11688A76947c4261j2081A30221J79308B4399a46890C48070A4697R2454g3223A98979
11676e0716B1020Q1885l4727K18838a22683p810r9126G0169a46819F3378d16369
11664a37390A09753a61379N9105e971A64261d9116a8215q8494l5038B23563H3226
11652a36177C60451d2879G9710M2763J82431d6057B34659A01585m2101Q358b45776
11640e4359k20220E49833H0017b43224A59709O7106h7678L9535p6307d4897A77907
$$ plain form
11628 15103 36279 -335317 -97216 -196992 -332603 -115240 -7800 -221734 58701 66962 -263680
11616 350235 -151324 -73802 129856 -399285 -41414 275046 -84137 292247 290445 -107791
11605 5129 -103 -291635 -113330 -101786 300499 5900 -11761 104099 -224032 131980 -100798
11593 -134758 16537 136948 -159912 36353 82758 114648 -345713 -196734 -86588 2914 -253707
11581 96273 -126200 281729 -331563 158230 -48006 141715 54999 -139493 18218 108509
11571 108509 -63818 -103785 -263346 129069 255635 174331 165345 15707 230981 219584 366678
11560 366678 -28507 118540 243875 110979 488301 81505 -211143 196735 240719 -16811
11549 75769 112209 70607 160156 32110 250832 44347 173029 231076 173430 -171528 -1812
$$ packed form
11628A5103K1176c35317i7216r9776j35611a15240g800k13934E8701Q261b63680
11616C50235a51324g3802A29856c99285d1414B75046h4137B92247j802a07791
11605E129a03k91532a13330J1544C00499E900a1761A04099b24032A31980a00798
11593a34758A6537J20411a59912C6353M6405L1890c45713J48979h6588B914b53707
11581I6273a26200B81729c31563A58230d8006A41715E4999a39493A8218R0291
11571A08509f3818l9967j59561A29069J26566q1304q986A5707K15274j1397J47094
11560C66678b8507A18540J25335A10979L77322H1505b11143A96735M3984a6811
11549G5769L6440m1602Q9549C2110K18722D4347J28682N8047n7646a71528a812
$$ plain form
11537 -142758 191922 -42871 -61399 33971 23292 182415 -348591 260962 172653 234170 58263
11525 214944 -119630 181339 75932 250172 -213784 155194 146590 -115967 269724 102481
11514 176431 51928 -28709 19962 120112 142800 -177731 -263693 139152 102522 226214 95685
11502 62656 -194206 -16972 -7295 -32622 106612 168325 -219040 -100124 -122550 185309 -61685
11490 30431 123264 289858 -6953 41157 -68839 174330 -59975 269223 -27334 108878 102098
11479 102098 188458 134190 200508 20892 135885 -315544 136861 103397 -53935 402475 -51593
11467 190853 344604 19184 384441 157795 43267 -96415 310410 215054 464695 63164
11456 152332 7812 -26275 274855 155709 123808 30737 76187 -24367 496547 192803 -201705
$$ packed form
11537a42758A91922d2871j8528C3971j0679J59123c48591B60962q8309O1517E8263
11525B14944a19630A81339G5932J74240b13784A55194q604a15967B69724A02481
11514A76431E1928b8709A9962J00150K2688a77731q5962A39152l6630J23692I5685
11502F2656a94206a6972g295k5327A06612O1713b19040a00124k2426A85309f1685
11490C0431R2833J66594f953D1157f8839A74330e9975B69223b7334A08878o780
11479A02098Q6360n4268O6318B0892J14993c15544A36861l3464e3935D02475e1593
11467A90853J53751A9184L65257A57795D3267i6415C10410r5356K49641F3164
11456A52332G812b6275B74855j19146l1901C0737M5450b4367D96547A92803b01705
$$ plain form
11444 42601 9613 122654 166661 196019 276544 -31304 -15912 -215269 -125896 -245278 -56785
11432 61433 -1927 -256628 378499 -117001 99679 61286 161034 -237118 426791 116869 170531
11421 170531 -85473 142186 111719 -215601 -81315 -159082 42874 203150 339698 42192 15190
11409 -69856 118546 129704 -163399 -139900 -184168 240803 141506 29906 184026 -352612 -144427
11397 18444 -188101 -82937 46169 -59508 1079 -48681 176158 128568 -115674 25338 -215617
11385 -162927 41127 -166294 86278 259358 21231 102498 -131892 -79921 1611 134855 -130430
11373 -18764 -223022 -131270 -172373 -59649 -85345 -32116 105571 263274 -264694 280474 139584
11361 56115 -161384 -89203 219557 -49653 -248774 277683 -293892 -227389 24100 -189625
$$ packed form
11444D2601I613J13041M4007K9358Q0525c1304J5392j99357Q9373j19382e6785
11432F1433a927k54701C78499a17001I9679l8393R9748b37118D26791A16869N3662
11421A70531h5473A42186l0467b15601h1315p7767D2874J60276J36548D2192A5190
11409f9856A18546J1158a63399K3499m4268B40803r9297B9906J54120c52612a44427
11397A8444a88101h2937D6169e9508A079d8681A76158m7590a15674B5338b15617
11385a62927D1127a66294H6278J73080B1231Q1267a31892N1971A611J33244a30430
11373a8764k04258R1752m1103e9649k5696c2116A05571J57703b64694B80474A39584
11361E6115a61384P2181B19557d9653j99121B77683b93892O6503B4100a89625
$$ plain form
11350 305074 -107916 158823 -39315 617514 42288 157209 157781 -356948 -269666 277743 -147905
11338 25390 -342458 40256 -194440 -39141 140974 -258528 -90577 134767 32452 -20113 -124422
11327 -124422 -36125 170064 283062 37257 -72904 -52394 -131338 148 -371259 -134396 -182305
11316 -182305 272860 258474 -373300 -238435 -113928 -38179 -15999 -89991 68255 778 -93082
11304 -172256 -83720 -192540 37976 138577 224024 90136 -159218 -56889 -168243 265030
11293 19761 44375 -22527 13873 -81479 -71795 -56236 139357 240053 -203815 -251382 -47694
11281 139907 90106 -113545 -167020 117632 -47166 -190469 -117242 -58825 -59013 -119619 -261336
11270 -261336 8564 164320 -117234 -288662 -401549 -60872 -131390 -354826 147910 -37837
$$ packed form
11350C05074a07916A58823c9315F17514D2288J14921N72c56948Q7282B77743a47905
11338B5390c42458D0256a94440c9141A40974b58528i0577A34767C2452b0113j04309
11327a24422c6125A70064J12998C7257g2904K0510p8944A48c71259a34396m7909
11316a82305B72860j4386c73300J34865a13928c8179a5999p3992F8255G78i3082
11304a72256h3720j08820C7976J00601Q5447I0136a59218e6889j11354B65030
11293A9761K4614b2527A3873h1479R684J5559A39357J00696b03815m7567d7694
11281A39907m9801a13545n3475A17632d7166j43303P3227N8417j88o0606j41717
11270b61336H564J55756a17234j71428j12887f0872p0518k23436A47910c7837
$$ plain form
11259 127723 74232 -82884 -254924 -256661 -172952 -92725 86932 -416613 97978 -182884 65031
11247 292487 325683 -313513 -236441 78042 159875 -347634 130515 -171684 -347370 23955
11236 159662 -44185 141219 82257 -305133 -334993 -172291 167410 -149023 -248300 253670
11225 301624 -47992 -116908 -283574 -167523 -333524 44178 -295086 287133 -62501 -53241 -134659
11214 -134659 64181 -306923 -24358 164284 50948 -142104 -326470 219299 -55350 59618
11203 100233 336204 -61850 -196084 -17420 -240625 -74085 -564660 -323201 164489 371537
11193 371537 -20132 226709 90673 -57347 56048 349665 358434 -170228 90064 -311265 -54515
11181 21337 -4285 64104 -247703 19715 215958 -331480 193278 -53648 80651 73644 -248760
$$ packed form
11259A27723n3491h2884j72040j737Q3709Q0227H6932d16613I7978a82884F5031
11247B92487L3196c13513P7072G8042Q1833c47634A30515a71684j75686B3955
11236A59662d4185A41219n8962c05133k9860J62702A67410a49023r9277B53670
11225C01624d7992o8916j66666J16051j66001D4178b95086B87133f2501R260q1418
11214a34659F4181c06923b4358A64284E0948a42104j84366B19299e5350E9618
11203A00233K35971f1850j34234a7420k23205g4085m90575K41459A64489K07048
11193C71537b0132B26709I0673e7347E6048K93617Q769a70228I0064c11265e4515
11181B1337d285F4104b47703A9715J96243c31480A93278e3648H0651p007b48760
$$ plain form
11169 -366546 108202 -151885 -243253 -175859 11637 -39144 -365914 -291024 163645 146852 45849
11157 286873 3258 -368892 72696 152883 -405293 16527 195552 1911 373482 37114 -182257
11145 336891 -21797 -388330 -110489 -26075 -208826 128586 234570 24162 -227575 334650
11134 242958 -219645 -8378 164625 -36786 52384 44876 123124 -5895 178579 -120838 43949
11122 119185 79846 -46981 -23985 129199 -57047 216857 333679 -140874 461179 226604
11111 -266870 -43824 -136113 5469 2458 140234 -176430 178548 -368972 -96520 23475 -3372
11099 -181522 199125 -217130 79784 -291168 -289109 -142482 -366127 241665 36003 -27109
11088 217698 185011 85109 492764 224276 246725 -7122 -59439 94799 128418 -21396 -266060
$$ packed form
11169c66546A08202a51885r1368O7394A1637c9144l26770P4890A63645j6793D5849
11157B86873C258c68892G2696Q0187d05293A6527J79025A911L71571C7114a82257
11145C36891b1797l66533a10489b6075j82751A28586J05984B4162b27575C34650
11134B42958b19645h378A64625c6786E2384p508P8248e895A78579a20838D3949
11122A19185l9339d6981K2996A29199e7047B16857J16822a40874D61179B26604
11111b66870d3824r2289E469B458J37776a76430A78548c68972i6520B3475c372
11099a81522A99125b17130G9784b91168K059a42482k23645B41665C6003b7109
11088B17698l2687H5109M07655B24276K2449g122n2317I4799L3619b1396k44664
$$ plain form
11077 -266060 121417 -97458 -19800 -51998 3105 -3574 150921 72299 42285 96550 -81802
11065 190195 294441 -40585 84909 -39866 -276650 371144 293561 335407 132160 -122493
11054 296118 257986 297409 -49947 -770 155138 333603 262607 368376 119526 536994 57357
11042 439490 406020 633634 801923 448072 456107 459262 622844 592353 652189 473069 712134
11031 712134 475784 676870 497402 535316 758793 614056 308870 653289 688972 681546
11021 681546 696410 605834 559423 614754 305445 709265 857615 588857 696105 338477
11010 245290 549976 808911 864918 697896 485839 600921 968329 433716 821826 462136
11000 462136 333083 701770 254842 257596 286708 274280 539119 108065 408214 620184
$$ packed form
11077b66060A21417i7458a9800l2198C105c574A50921G2299l0014N4265h1802
11065A90195J04246d0585H4909c9866k36784C71144p7583M1846A32160a22493
11054B96118l8132L9423d9947g70A55138J78465p0996J05769A19526M17468E7357
11042D39490l3470K27614J68289l53851Q035L155J63582l0491N9836j79120K39065
11031G12134k36350K01086j79468L7914K23477j44737l05186L44419L5683p426
11021F81546J4864r0576m6411N5331C05445M03820J48350k68758J07248C38477
11010B45290L04686K58935N6007j67022k12057J15082L67408D33716L88110l59690
11000D62136j29053L68687B54842K754K9112j2428K64839A08065L00149K11970
$$ plain form
10990 620184 600498 772911 454175 128872 626929 635512 472790 755732 600020 705626
10980 705626 648440 775507 899438 688499 539544 813806 625062 845733 750238 301237
10969 631275 784641 817189 715498 908234 759587 839909 955767 911944 1338618 1101140
10959 1101140 1319472 1663623 1871820 1484402 1987949 1751215 1644129 2181297 1625905
10950 1625905 1955216 1717549 1514438 1444487 1335012 1591879 1516975 1309881 1577747 1390089
10940 1390089 1568659 1428634 1466468 1426180 1257874 1308297 1404079 1113792 1022146 901722
10930 901722 884792 417115 375577 344925 170484 304254 63520 405510 153646 235955
10920 235955 220317 194743 180157 120153 182360 179128 20868 -377040 297043 69352 151367
$$ packed form
10990F20184j9686J72413l18736A28872M98057Q583j62722K82942j55712J05606
10980G05626n7186J27067J23931k10939j48955K74262j88744K20671r5495C01237
10969F31275J53366L2548j01691J92736j48647Q0322J15858m3823M26674k37478
10959A101140K18332L44151K08197l87418N03547k36734j07086N37168n55392
10950A625905L29311k37667k03111o9951j09475K56867p4904k07094K67866j87658
10940A390089J78570j40025L7834m0288j68306N0423R5782k90287r1646j20424
10930I01722j6930D17115m1538l0652A70484J33770F3520L41990A53646Q2309
10920B35955j5638k5574j4586o0004O2207l232B0868c77040B97043F9352Q2015
$$ plain form
10909 151367 -174200 298503 185054 136866 176315 80967 76770 -45118 231155 -160825 34249
10897 -206916 -143488 275716 132562 55880 -178548 -168871 12269 -53429 -108505 -13300 209588
10885 -60208 193189 99295 -176690 -186979 -357180 83811 -111201 15981 -21101 -251766 -65414
10873 15697 -28749 204861 126110 17553 -74766 -307301 -198875 -113127 -350105 100581 -89299
10861 4937 -69735 -273013 -65527 -66301 -297307 -83787 -76990 123633 4691 -95625 98030 512821
10849 512821 160124 131787 -334975 -5258 -162420 97328 -180040 170283 -103560 -4304 -132881
10838 -132881 -188832 -31104 -142898 268530 -96532 -17756 23676 176179 -298642 -223275 24153
10826 -115390 -389334 21355 56716 474846 80898 211006 -14596 -329322 184642 -266118
$$ packed form
10909A51367a74200B98503j13449m8188L9449H0967m197d5118B31155a60825C4249
10897b06916O3428B75716A32562E5880a78548R677A2269e3429n5076a3300B09588
10885f0208A93189r3894a76690j0289j70201H3811a11201A5981b1101k30665f5414
10873A5697b8749B04861p8751A7553g4766k32535J08426Q5748k36978A00581h9299
10861D937f9735k03278f5527p74k31006h3787O797A23633D691i5625I8030M14791
10849E12821A60124k8337c34975e258j57162I7328a80040A70283a03560d304j28577
10838a32881n5951c1104j11794B68530i6532a7756B3676J52503b98642P5367B4153
10826a15390k73944B1355L5361M18130H0898J30108a4596l14726A84642b66118
$$ plain form
10815 -210968 -177667 151207 304185 455207 -91394 -45010 7008 -59881 162949 308649 198547
10804 198547 -159791 -152039 205212 -435598 -7012 -3341 116920 -343823 -68712 144585 -135889
10792 96877 159028 -274901 -248951 141621 -254885 9812 215691 -33349 -131190 115072 165312
10781 165312 277568 42523 12943 154983 -222276 -31705 -294814 -325195 -80987 109261
10770 -278468 -62221 37756 60096 -435424 179134 -3863 9257 50682 -55693 48656 519 378714
10758 378714 -63235 23778 -163010 85435 -345027 82580 -208534 -74818 -137345 -71713 129868
10746 66391 161976 133689 192797 -315708 -31388 -114662 -308946 134653 -41649 -380825 -97244
10734 -34294 111093 -154978 37674 -240837 136876 -54923 125610 32804 17349 261970
$$ packed form
10815b10968L3301A51207J52978J51022i1394d5010G008e9881A62949J45700j10102
10804A98547a59791P752B05212d35598g012c341A16920c43823f8712A44585a35889
10792I6877O2151b74901K5950A41621b54885I812K05879c3349r7841A15072N0240
10781A65312J12256D2523A2943J42040b22276c1705k63109l0381h0987A09261
10770b78468f2221C7756K2340d35424A79134c863I257M1425e5693D8656E19L78195
10758C78714f3235B3778a63010H5435c45027H2580b08534g4818o2527O5632A29868
10746F6391R5585k8287N9108c15708c1388q3274j94284A34653d1649l39176i7244
10734c4294A11093a54978C7674b40837A36876e4923A25610C2804j5455K44621
$$ plain form
10724 261970 -47081 40922 33051 -22426 -362080 -13096 132580 124528 -204876 20352 -39269
10712 -158188 174507 -149001 162550 -163340 32375 -196215 93605 126943 -5270 122470
10701 21172 -124170 166834 -3783 220353 -146619 -142663 34458 -14640 -211840 -20073 69817
10689 -95304 6008 -127289 -64358 -39690 -125638 -56749 -60018 102796 -29288 -216803 -200492
10678 -200492 -110942 82985 -8252 215340 246453 -264434 -52918 10302 54333 44862 -240563
10666 200880 -203297 61208 -126360 -94125 -235766 -95947 43761 -256496 27848 -6451 -329474
10655 -329474 153357 -44074 962 161015 63338 -972 85737 -176921 12353 121612 257032
10644 257032 -128252 -98 -143260 171614 -109417 -427784 -144635 -186233 -274348 -276056 -387880
$$ packed form
10724B61970d7081D0922p871b2426l39654a3096A32580q052b04876B0352c9269
10712a58188A74507a49001A62550a63340C2375a96215I3605L3338e270A22470
10701B1172a24170A66834c783B20353a46619L956C4458a4640j97200b0073F9817
10689i5304F008a27289O2931K4668q5948e6749l269A02796b9288j87515J6311
10678b00492Q9550H2985h252B15340L1113b64434e2918A0302M4031r471b40563
10666B00880b03297F1208a26360L2235j41641i5947D3761b56496B7848f451l23023
10655c29474A53357d4074I62J60053F3338i72H5737a76921A2353J09259J35420
10644B57032a28252i8j43162A71614a09417l18367a44635m1598q8115j708j11824
$$ plain form
10633 -387880 -252667 -160112 92346 45851 -63596 -114322 36014 34888 -321464 -167406 40030
10621 235739 -259568 56027 30737 -286652 70452 -184574 6839 -75130 13805 -100153 -69825
10610 -69825 37100 18684 12781 -63452 -43150 -207743 -102147 -336024 -228669 -213544 470843
10598 -124407 -106535 221822 -112740 -185626 -150060 -185125 -177077 -247361 -37123 -226421 -22870
10586 -7015 76 -29515 -29773 103938 -70224 -6387 -467250 -108764 -70177 14949 29296 -9201 -160664
10573 -160664 250455 129574 76062 -254639 126942 197623 -15040 -228900 -164658 157167
10562 283453 -32122 1964 66130 -36950 -111378 -119083 -194796 -31484 -111840 -81960 1893 142005
10550 142005 -285623 180533 129842 235094 433971 -121438 -84752 -292989 -90887 52278
$$ packed form
10633c87880J35213R2555I2346D5851f3596n0726C6014j126c21464J54058D0030
10621B35739b59568E6027k5290b86652G0452a84574F839g5130A3805a00153L0328
10610f9825C7100j8416n903f3452K0302j64593a02147k33877J07355J5125D70843
10598a24407J7872B21822a12740p2886L5566l5065Q048p0284c7123j89298b2870
10586g015G6b9515k58A03938g0224f387m60863a08764L8587A4949J4347i201j51463
10573a60664B50455j20881n3512b54639A26942P0681a5040k13860O4242A57167
10562B83453c2122A964O4166c6950p4428p705p5713c1484q0356K9880A893J40112
10550A42005b85623A80533n0691J05252J98877a21438L6686k08237i0887E2278
$$ plain form
10539 -56171 -18764 -248945 -105317 -98191 58127 -375441 -450436 141562 -463699 123063 81015
10528 81015 -301281 -443912 16016 199602 -46790 -165968 165742 -379209 180760 -129066
10517 -100303 48719 -154166 -386168 33968 -70610 -104060 -9165 -51496 -373673 340943 198517
10506 198517 -149628 28351 -375260 49957 -7467 229534 59785 41786 -53684 -373356 -652249
10495 -652249 -164369 -201924 136764 -131890 440517 -122905 107993 49510 148152 -116546
10484 123091 46695 -105579 -172681 -63168 246898 -330398 -253795 -194765 36872 -64941 150727
10472 117433 -13689 -182902 -12806 189382 -196593 -56744 -141352 -399798 -41518 -339141
10462 -339141 211398 195208 270821 485064 364958 72106 225059 71243 67826 -35011 -49148
$$ packed form
10539e6171a8764k30181a05317P126E8127c75441p4995A41562d63699A23063m2048
10528H1015c01281j42631A6016J83586d6790j19178A65742c79209A80760a29066
10517a00303D8719a54166k32002C3968g0610l3450i165m2331l22177C40943j42426
10506A98517a49628B8351c75260D9957g467B29534E9785j7999e3684l19672k78893
10495f52249a64369l7555A36764a31890D40517a22905A07993D9510R8642a16546
10484A23091D6695a05579o7102f3168B46898c30398P6603N9030C6872f4941A50727
10472A17433a3689j69213a2806A89382a96593e6744q4608k58446d1518k97623
10462c39141B11398j6190P5613K14243j20106G2106J52953G1243l417c5011j4137
$$ plain form
10451 -49148 -25349 49145 -100140 -68634 91533 -38828 63792 77010 88377 70080 -79888
10439 -82230 -2115 -227728 -28558 64243 -99016 -229864 -224426 -78536 -221701 -174418 -158301
10428 -158301 -28528 155377 14133 203871 -228396 -218980 -229583 -162854 -438128 -47511 101801
10416 -169215 655 -12336 -16674 -163764 -32886 -102915 183784 -159252 -56619 -290363 108177
10404 71989 -48937 -315635 283035 -172056 116257 218194 -34522 103648 -226394 219356
10393 28878 -72159 79831 -112616 -383025 -83548 111981 219283 35284 387950 -54634 -122013
10382 -122013 -260441 -152720 302707 85980 18149 -257651 -147790 124161 -23979 -26491
10372 -26491 175832 190353 113209 56353 36244 -42980 127599 -120091 347677 -20205 -144587
$$ packed form
10451d9148K3799D9145a00140L1506I1533c8828F3792J3218J1367j8297g9888
10439h2230b115k25613b8558F4243i9016j30848N438g8536j43165M7283J6117
10428a58301b8528A55377A4133J89738b28396R416j0603O6729k75274d7511A01801
10416a69215F55a2336m338j47090c2886p0029A83784a59252e6619k33744A08177
10404G1989d8937k66698B83035a72056A16257J01937c4522A03648b26394B19356
10393B8878g2159G9831a12616k70409h3548A11981J07302C5284L52666e4634o7379
10382a22013j38428J07721C02707H5980A8149b57651J09861A24161b3979k512
10372b6491A75832J4521p7144E6353k0109d2980A27599a20091C47677b0205j24382
$$ plain form
10361 -144587 -73608 65534 20453 92967 -99502 -241824 446458 402742 263224 272339 303277
10350 303277 213812 265153 263756 396087 251451 69915 245541 68402 15099 226089 307240
10339 307240 256065 95012 389203 149306 233582 -116249 446096 481766 167710 225110
10329 225110 410577 449837 129612 466924 -152586 300460 377510 591648 327931 -50773
10318 149293 35625 98278 -355922 98683 22767 194920 140500 -72387 45629 83683 111412
10307 111412 194127 2681 298049 216526 214365 460058 -112148 315157 -101876 250146 110806
10295 39434 -60837 -34668 11772 -131607 27301 51768 31997 -78918 -122466 350981 -153138
10283 -206384 77363 -159144 91002 51361 4668 -45008 -181166 232421 -13648 -49428 -7120
$$ packed form
10361a44587P0979F5534B0453P2514i9502j42322D46458m3716j39518R115L0938
10350C03277q9465N1341j397J32331j44636F9915J75626F8402A5099K10990Q1151
10339C07240n1175I5012K94191A49306Q4276a16249D46096L5670A67710N7400
10329B25110J85467L9260A29612L37312a52586C00460P7050K14138k63717e0773
10318A49293C5625O2653c55922I8683B2767J72153n4420g2387D5629L8054K7729
10307A11412Q2715B681K95368q1523k161K45693a12148C15157a01876B50146A10806
10295C9434f0837K6169A1772a31607B7301K4467j9771g8918m3548C50981a53138
10283b06384G7363a59144I1002l9641D668d5008j36158B32421a3648l5780g120
$$ plain form
10271 16584 -180309 104521 -78876 -69968 -185923 255707 -341243 240165 232616 20637 -275552
10259 -170711 -175440 -127429 119209 -15779 -132198 -104305 -174817 133796 -124843 320262 7372
10247 -14796 -75829 -230541 191011 -224180 88720 342635 -18740 215253 474540 290018
10237 290018 374175 158919 437783 -44156 104304 141175 -73675 -215189 44050 -89616 42545
10225 23769 7443 -314665 69473 -18038 -270639 13793 -92481 -34536 -236771 244272 33945
10213 -250485 -188511 -246970 -81848 -101355 -117326 -260252 -120603 9019 103090 52208 22072
10201 15913 250043 -189576 -82085 110334 -121848 -364542 -80016 -126551 191685 -101443
10190 -422269 93757 -74687 -134551 222174 171551 -177892 -202040 102554 -121399 233131
$$ packed form
10271A6584a80309A04521g8876Q908j15955B55707c41243B40165p549B0637b75552
10259a70711m729M8011A19209a5779j16419K7893p0512A33796a24843C20262G372
10247a4796o1033j54712A91011b24180H8720K53915a8740B15253K59287j84522
10237B90018Q4157A58919K78864d4156A04304L6871g3675j41514D4050h9616D2545
10225B3769G443c14665F9473a8038k52601A3793i2481c4536k02235B44272C3945
10213b50485O1974n8459h1848j9507j5971j42926a20603I019R4071n0882B2072
10201A5913K34130a89576h2085A10334a21848k42694h0016m6535A91685a01443
10190d22269I3757g4687n9864B22174n0623a77892k4148A02554a21399B33131
$$ plain form
10179 173821 -27237 -253552 -47917 -219920 -214860 137581 -97628 -108883 -273415 -333540 130099
10167 105675 201376 -141927 -263615 -100294 -147114 67081 -79392 -37674 15375 54361 -38454
10155 -35740 61456 -319711 -198863 -344203 132353 -310317 -182018 -226949 21995 -495022
10144 -42164 240519 -205312 -1530 -2633 -85734 88185 16508 99574 -53834 34389 68486 19534
10131 -187083 -240575 -98631 -325354 -232890 -132015 -158402 -133812 -317089 -208547 -113189 -32934
10119 -31343 18972 -284165 4781 -200080 -10414 -19392 301262 125084 -82192 -162582 -134515
10108 -134515 -53112 257638 159289 -12509 -332886 -78313 -49636 -64908 40580 -170058 -472658
10097 -472658 -94923 -323856 -102937 -232040 -55898 -122884 -226782 -45252 15341 102639 -104103
$$ packed form
10179A73821b7237k26315d7917j72003N060A37581i7628j1255j64532o0125A30099
10167A05675R5701a41927j21688a00294m6820F7081g9392c7674A5375L8986c8454
10155c5740F1456c19711J20848j45340A32353c10317J28299m4931B1995d95022
10144d2164B40519b05312a530j103q3101H8185A6508Q3066e3834C4389L4097A9534
10131a87083n3492i8631k26723R2464J00875k6387K4590j83277J08542R5358c2934
10119c1343A8972b84165D781b00080a0414q978C01262A25084h2192q0390K8067
10108a34515e3112B57638r8349a2509l20377g8313K8677j5272D0580a70058l02600
10097d72658i4923k28933a02937j29103e5898o6986j03898d5252A5341Q7298a04103
$$ plain form
10085 22823 -128287 -129371 116365 -750 -109209 -157575 -73394 -248244 -217548 -306232 -24297
10073 164540 213410 -4606 -18252 -173327 220265 -5875 -264513 -154755 -197168 -199550 12519
10061 -461145 28813 -143134 -78654 -269767 -10381 328255 -241 110324 12671 -230567 -283999
10050 -283999 -104183 -140641 217839 -44 -92943 -128392 1288 5987 -213454 246299 -113852
10038 -169739 -97139 -124127 -86939 206152 -468292 10784 -122629 -245882 -185658 -55300 -113506
10027 -113506 -165812 153834 50064 135958 -488022 132671 109067 -124073 168950 105184
10017 105184 186423 -228611 66385 -176429 -122090 295249 -210755 173954 -118245 -36363
10006 -37557 -469106 -121577 -11489 182493 24909 -336514 -145248 -85176 -26891 101852
$$ packed form
10085B2823a28287j084A16365g50j08459m8366g3394j74850L0696q8684b4297
10073A64540M8870d606j3646j55075B20265e875k58638J09758m2413k382A2519
10061d61145B8813a43134O4480j91113a0381C28255b41A10324A2671b30567n3432
10050b83999a04183l6458B17839d4r2899l5449A288M699b13454B46299a13852
10038a69739P2600k6988L7188B06152d68292A0784a22629j23253O0224e5300n8206
10027a13506n2306A53834E0064Q5894d88022A32671k3604a24073A68950o3766
10017A05184Q1239b28611F6385a76429N4339B95249b10755A73954a18245c6363
10006c7557m31549a21577a1489A82493B4909c36514a45248O0072b6891A01852
$$ plain form
9995 63031 189967 -5377 192639 -139175 240054 -46120 -334601 23241 -116236 -49788 -310645
9984 -310645 -225654 -241379 -199534 -85217 -43143 -133154 -339503 20575 225481 40935 156064
9973 156064 -84488 -104528 -176288 -143776 -278343 24211 -150801 40769 -130178 -41667 75904
9961 3209 -73485 -322950 47856 -332639 -56865 -199106 -12892 -80166 -183479 -309474 -151217
9949 40467 -164387 258631 -101715 122070 -203986 -191388 -49542 139137 2673 193661 -575504
9937 -115777 182363 197854 36994 186125 -162813 -22095 -398090 123145 125564 -19330 -85853
9926 -85853 -16468 -115045 88866 647 -252882 -499088 -129479 313448 -132417 -292595 -132052
9914 -401634 103888 -123147 100797 -257363 -36099 -24382 -285883 271579 -104442 -52853
$$ packed form
9995F3031J26936e377A92639a39175B40054d6120k88481B3241a16236d9788k60857
9984c10645Q4991j5725M1845h5217M2074r0011k06349B0575K04906D0935J15129
9973A56064h4488k0040p1760L2512j34567B4211a50801D0769a30178d1667G5904
9961C209g3485k49465D7856c32639e6865j42241a2892o7274j03313j25995a51217
9949D0467a64387B58631a01715A22070b03986J2598d9542A39137B673J90988e75504
9937a15777A82363J5491C6994J49131a62813b2095l75995A23145K419a9330o6523
9926h5853a6468r8577H8866F47b52882k46206a29479C13448a32417j60178a32052
9914d01634A03888a23147A00797b57363c6099J1717k61501B71579a04442N1589
$$ plain form
9904 -52853 -153832 35430 -241956 103886 67822 -412771 -243760 36728 -121530 -124587 -307710
9893 -307710 -65247 -222221 -52423 -50622 224169 -33778 -61690 190112 283472 -275901 167968
9881 -206960 -314648 -139787 -210164 -217400 -72423 119676 -117200 182093 -193116 -22616 167171
9869 -182205 -58068 283584 -22843 20766 116332 -288044 184407 -19817 166347 149740 258852
9858 258852 -514291 -209797 214848 -64280 128652 -104448 8482 155494 -163353 -6337 -234503
9847 -234503 3991 -442151 119050 -294517 -54456 -55953 -99546 -100324 -40941 81842 -168107 -44170
9834 -242674 392305 -111223 -400528 -500961 -138577 -165785 152840 23601 325883 -73619
9823 -232608 -32767 -55304 -90934 -87415 -64823 -15719 -77948 -65489 -373040 61946 -47470 72306
$$ packed form
9904e2853j00979C5430b41956A03886l6064d12771J69011C6728a21530l057j83123
9893c07710f5247j56974e2423J801B24169c3778k7912A90112R3360b75901A67968
9881b06960j07688a39787p0377p236g2423A19676a17200A82093a93116b2616A67171
9869a82205e8068B83584b2843B0766R5566b88044A84407a9817A66347j6607J09112
9858B58852e14291b09797B14848f4280A28652a04448H482J47012a63353f337k28166
9847b34503C991d42151A19050b94517e4456j497m3593p78d0941H1842a68107d4170
9834b42674C92305a11223k89305j00433a38577k7208A52840B3601L02282g3619
9823b32608c2767k2537l5630L519K2592a5719o2229J2459l07551F1946d7470G2306
$$ plain form
9810 -366402 46038 -160809 -120140 -155800 -300287 100446 13507 -184604 71307 -127721 88797
9798 -50805 22251 298847 -145617 -140496 -46620 -83103 -208074 -164032 260522 28580 -20187
9786 -79779 -27147 -33951 44011 -109901 158904 -1447 228321 -336077 -197080 -141762 -105170
9775 -105170 11092 45159 -180704 9989 230884 1706 65590 -100736 -218202 4200 -131863
9763 -32176 -139199 -327646 -124564 59757 -66484 202214 -39715 3477 -284068 -43482 -85206
9752 -85206 -251109 73433 238879 233342 -236091 261473 38650 -53715 -50006 62628 -116690
9740 33178 -18892 -36537 97556 147323 -237280 -210649 57241 231614 -98910 49051 -335624
9728 -104867 4426 69286 -204835 -446958 -150219 -31140 -502618 139910 44337 -259798 -47331
$$ packed form
9810c66402D6038a60809M0669l5660j44487A00446A3507a84604G1307a27721H8797
9798e0805B2251K76596a45617N121d6620l6483j24971M4042B60522B8580b0187
9786g9779b7147o804D4011a09901A58904a447B28321c36077J38997N5318L6592
9775a05170A1092L4067a80704I989K20895A706O3884a00736j17466D200a31863
9763c2176j07023j88447a24564E9757f6484B02214c9715C477b84068d3482m1724
9752h5206j65903G3433J65446n537b36091B61473C8650e3715L709F2628a16690
9740C3178a8892j7645I7556M9767b37280K6631E7241J74373i8910D9051c35624
9728a04867D426O4860b04835k42123a50219c1140m71478A39910D4337b59798d7331
$$ plain form
9716 -177612 -196668 -172534 315205 110581 350433 -26256 -124272 -360569 261197 -310469
9705 41871 -74325 -121471 217279 -205436 -512326 110575 -135731 95414 52366 -53795 22782
9693 -15041 -220228 -6417 -361098 -54381 -235019 -212325 -363697 -40503 -276044 -322220 -250407
9682 -250407 -221034 -164716 21381 -19586 -453248 -229127 -337303 -320385 300878 -241011 -274418
9671 -274418 111725 -167617 -57884 -11144 -210509 329841 71755 -61860 -47476 -181698 97907
9659 -212457 -61074 -49189 -314444 -83251 253640 -121294 -112389 -17570 314037 -278570 45974
9647 14985 -42092 273910 -259616 184675 129698 174638 -261984 -52614 -414702 -13887 -84530
9636 -84530 195989 172281 -78963 251321 -158897 24790 -183777 -87436 -136312 -12598 -200502
$$ packed form
9716a77612j9056K4134C15205A10581K39852b6256r8016k36297B61197c10469
9705D1871g4325m7146B17279b05436l06890A10575a35731I5414m3048e3795B2782
9693a5041k05187f417l54681e4381j80638K2694j51372d0503k35541m6176P1813
9682b50407K9373N6318B1381a9586m33662K24121j08176J6918C00878b41011l3407
9671b74418A11725a67617e7884a1144j99365C29841G1755f1860J4384j34222I7907
9659b12457f1074J1885k65255h3251B53640a21294Q905a7570C14037b78570D5974
9647A4985d2092B73910b59616A84675n4977M4940b61984e2614l62088a3887p0643
9636h4530A95989k3708g8963B51321a58897B4790a83777h7436m8876a2598j87904
$$ plain form
9625 -200502 -243611 179871 -359089 -244105 -3033 -23678 1770 181611 -299934 64316 85957
9614 85957 -84948 210150 67799 -133053 -14627 -170799 114185 -179257 -31071 -45664 -254716
9603 -254716 -97243 222662 -343595 -132042 -215534 -331540 -275382 -141393 131456 18519
9592 170173 122109 -12465 -195634 196770 115952 -228512 229133 325984 57987 -86246 -70160
9581 -70160 -312319 -3416 94354 -153769 -213376 127426 214614 -96026 -186435 122453 -172937
9569 -86658 16697 -171050 98351 35841 57178 -265906 -1012 -391729 187263 -30831 -245886
9558 -245886 215061 -38656 270813 -292123 206643 -25921 256249 -104853 -79638 200789
9547 77001 96649 -252139 -201771 -239893 208056 50309 -386849 -21202 -46957 -66345 -73664
$$ packed form
9625b00502m3109A79871c59089J14984c033k0645A770J79841b99934F4316K1641
9614H5957h4948B10150F7799a33053a4627j56172A14185a79257c1071j4593k09052
9603b54716i7243B22662c43595a32042q3492j16006N6158J33989A31456A8519
9592A70173m8064a2465j83169A96770q0818b28512B29133R6851E7987h6246J6086
9581g0160k42159c416I4354a53769n9607A27426Q7188i6026r0409A22453a72937
9569h6658A6697a71050I8351C5841K1337b65906a012l90717A87263c0831k15055
9558b45886B15061c8656B70813b92123B06643b5921B56249a04853K5215B00789
9547G7001J9648b52139N0368l8122B08056E0309c86849b1202k5755j9388p319
$$ plain form
9536 -73664 108334 -45238 -143763 -35582 117776 35744 -14642 -107275 -125769 -45454 -119607
9525 -119607 -206648 66468 -136533 -262005 -39650 -92289 121777 -125521 -101727 -42176 273628
9513 -232446 214176 30028 -216675 -284294 -432275 13343 -278920 -137287 -128499 -130573 -215374
9502 -215374 -84372 -213382 -43417 -260863 -103832 -130912 -128442 42053 -80470 -5234 59645
9490 243528 109947 -121414 -78752 -337775 -100861 15210 -212545 -135267 187658 -228370
9479 -156517 -54663 -100376 61965 88486 -297106 20422 -19906 -137520 -36988 -224015 -234006
9468 -234006 -292572 -124474 138062 173355 91166 52374 204618 -195554 -172032 56485 -51470
9456 103189 -143634 -251241 41082 189087 -164635 -247605 74028 -70594 120914 -279765
$$ packed form
9536g3664A08334d5238r8525c5582A17776C5744a4642r2633j8494d5454p4153
9525a19607q7041F6468a36533j25472c9650n2639A21777a25521K3794d2176B73628
9513b32446B14176C0028b16675o7619j47981A3343b78920a37287Q788k074q4801
9502b15374h4372j29010d3417k17446a03832k7080K470D2053h0470e234E9645
9490B43528A09947a21414M2662k59023a00861A5210b12545P7278A87658b28370
9479a56517e4663m5713F1965K6521b97106B0422a9906j17614c6988j87027r991
9468b34006n8566a24474A38062L5293q2189l8792J52244a95554K3522E6485e1470
9456A03189a43634j07607D1082J48005a64635q2970G4028g0594A20914b79765
$$ plain form
9445 93377 -42310 170386 -101956 -4525 304411 16086 -195000 -227135 37322 -114616 -372631
9434 -372631 158504 -6615 181806 -285581 -147804 290756 61083 168662 -151016 73384
9423 119446 -227412 159083 -92933 -173033 -25570 41755 -36309 102184 -286542 186697 -359787
9411 58387 -536873 -59092 97838 -16346 45849 -45622 -202004 -292570 -48177 87420 -125394
9399 -186923 102240 91062 167529 139442 69017 -69211 -15998 124690 55712 -86693 -214490
9388 -214490 43441 90466 -53604 -262065 -5513 50203 18304 -227295 180336 32008 -93969
9376 145122 -122032 -266880 75012 -202432 53623 -195795 -92149 291562 -32682 209947
9365 24449 -153497 -79327 -227305 -130322 -214425 -8748 98667 168294 -272518 248887 5224
$$ packed form
9445I3377d2310A70386a01956d525C04411A6086a95000l2135C7322a14616k58015
9434c72631A58504f615A81806b85581J37777B90756F1083J07579a51016G3384
9423A19446b27412A59083i2933q0100b5570D1755c6309A02184b86542A86697c59787
9411E8387e36873e9092I7838a6346D5849d5622j56382r0566d8177H7420a25394
9399a86923A02240j1178P6467k8087F9017f9211a5998A24690E5712h6693j27797
9388b14490D3441M7025e3604k08461e513E0203A8304b27295A80336C2008i3969
9376A45122a22032j44848G5012b02432E3623a95795i2149B91562c2682B09947
9365B4449a53497P4170j47978R6983q4103h748I8667O9627b72518B48887E224
$$ plain form
9353 190353 -447732 -168080 26996 224716 7545 81165 3112 148994 -71475 -65321 -137603
9342 -137603 -28307 141011 -272658 -223092 -110020 -131737 -130268 9233 -240078 158589 145656
9331 145656 -252479 -192495 -422936 -63444 140946 147652 66194 -50582 -204424 101984 463605
9320 463605 -31056 -177306 159348 137291 912 4391 -190966 -296194 -195875 -20284 -254523
9309 -254523 -87932 -77096 -86695 108941 51151 21973 -540930 34100 13476 -391631 334567
9297 -63648 -265962 18336 18533 -22593 117507 -26427 -167442 24380 -238693 306034 -15529
9285 126736 -76554 -339510 -136022 -123077 520555 -44611 -34920 208276 -169745 -221199 -336689
9274 -336689 -278748 -97422 -185239 -191214 -297277 -238959 -213643 107102 -405531 -166816 22313
$$ packed form
9353A90353d47732a68080B6996J97720G545P3620C112J45882g1475O154p2282
9342a37603b8307A41011b72658M9566a10020k1717J469I233b40078A58589j2933
9331A45656b52479N9984k30441f3444A40946O706F6194e0582j53842A01984L61621
9320D63605c1056j46250A59348k2057I12L479a90966j05228J00319b0284k34239
9309b54523h7932J0836r599A08941E1151B1973e40930C4100A3476c91631C34567
9297f3648k02314A8336J97b2593A17507b6427j41015B4380b38693C06034a5529
9285A26736g6554k62956a36022J2945E20555d4611R691B08276a69745n1454j15490
9274c36689N7941i7422q7817n975j06063N8318K5316A07102d05531a66816B2313
$$ plain form
9262 178225 -233330 -176571 42291 -6346 -492656 -257499 -29366 46051 -152382 127235 -297647
9250 38070 -63411 39620 25068 -115253 -42893 -136240 -201840 -48609 123637 18161 -178149
9238 -33891 -280443 -99035 -134433 -271143 -327974 77574 -123319 109416 -36283 8451 -94215
9226 12263 -288990 -181994 -62660 -297676 -184181 -218332 -101036 -134246 -85361 366669 -70845
9214 21786 -125053 215588 -227114 -68269 -42133 60889 250969 146646 -336284 -102614
9203 -184868 -109081 97792 -79317 -169730 128297 -121839 -169315 95481 119558 -24856 310343
9191 -338141 24770 221103 248237 -426554 -241405 116004 -55435 390659 -176769 -208040
9181 -208040 140678 136375 -124694 -19367 -21095 136033 74631 -195355 -192587 -350055 85841
$$ packed form
9262A78225b33330N6759D2291f346m86310K35157b9366D6051a52382A27235b97647
9250C8070f3411C9620j4552a15253d2893r3347o5600d8609A23637A8161a78149
9238c3891k46552i9035l5398j36710n6831G7574a23319A09416c6283H451i4215
9226A2263b88990J06996f2660k35016J13495l4151a01036l3210M8885C66669g0845
9214B1786a25053B15588b27114f8269K6136F0889J90080j04323c36284a02614
9203a84868P5787I7792g9317r0413A28297a21839m7476I5481K4077b4856C10343
9191c38141B4770J96333K7134d26554J85149A16004e5435C90659a76769l1271
9181b08040A40678m303a24694a9367j728A36033o1402a95355K768j57468H5841
$$ plain form
9169 -144019 -275013 174620 42215 227668 -406045 -175450 -12440 -236764 -66369 -309643
9159 -309643 -209483 -72809 -58630 101008 -507046 97664 103178 91130 -5361 -96990 45712
9147 -126078 -84303 24315 50809 -9098 -440074 64678 -273881 -80530 -2744 -222624 -27511
9135 -116267 -79976 -149936 -240317 -97549 -322726 -25788 -108784 -239951 -287809 56633 -169321
9123 -529820 -35041 83170 -43827 -341039 -254134 -260515 -192668 -101031 112964 -187085 194027
9111 -399022 255879 291351 153289 100219 -65467 33102 -38009 56869 -33557 59296 -198423
9099 58197 -30529 -37940 -283631 -136026 -85497 -300820 98863 231199 93793 -10899 -178970
9088 -178970 189961 136882 267640 -443938 -111903 -61033 -208242 -51698 -81035 4252 -29012
$$ packed form
9169a44019j30994A74620D2215J85453d06045a75450a2440k24324f6369k43274
9159c09643J00160g2809J4179A01008e07046I7664N514j2048e361r1629D5712
9147a26078M1775B4315K6494i098m30976F4678b73881h0530b744k19880b7511
9135a16267L6291o9960r0381i7549k25177b5788q2996j31167m7858E6633a69321
9123e29820c5041H3170d3827k97212Q6905o381O7847R1637A12964a87085A94027
9111c99022B55879L5472j38062n3070f5467C3102c8009E6869c3557E9296a98423
9099E8197c0529p411k45691a36026N0529k15323I8863J32336I3793a0899j68071
9088a78970A89961n3079J30758d43938a11903N0870j47209e1698k9337D252b9012
$$ plain form
9076 -69752 -256716 -147683 63946 53555 -95240 284678 2195 127550 -161866 -98658 -150363
9065 -150363 -53830 11510 35922 183721 169304 -89671 -25738 -114869 -60304 -127097 188907
9053 105873 -92389 -218719 200803 -329976 -4810 137045 -60502 -347692 -337908 -147987 -92854
9042 -92854 -115235 -141873 -275899 91571 -60660 25577 -40652 7584 188312 87684 -257943
9030 -97712 67128 -7960 -369435 -7251 -156944 -145869 -36474 -176403 74060 55713 -150172
9018 -258691 -283902 -285700 -167702 -11675 237006 -4995 -407403 -39425 88319 25301 -219075
9006 -3081 -357632 327569 39324 -84311 184169 -223467 -205534 -146803 -421595 -337159 81216
8994 -435881 4012 -86082 -65488 -94103 129228 -102177 162058 -72153 108820 103555 3702
$$ packed form
9076f9752j86964J09033F3946j0391i5240B84678B195J25355a61866O3208n1705
9065a50363e3830A1510K4412J47799j4417h9671b5738q9131N4565o6793A88907
9053A05873i2389j26330B00803c29976d810A37045f0502k87190R784a47987N5133
9042i2854k2381k6638j34026I1571f0660B5577d0652G584J80728H7684b57943
9030i7712F7128g960l61475g251j49693J1075c6474j39929G4060j8347a50172
9018b58691k5211j798J17998a1675B37006d995m02408c9425H8319B5301b19075
9006c081l54551C27569C9324h4311A84169b23467J7933N8731k74792Q4436H1216
8994d35881D012h6082K0594k8615A29228a02177A62058g2153A08820n265C702
$$ plain form
8982 -365119 -241760 -149100 26356 -9977 -231704 -284795 -46830 308750 -40917 129726 -137908
8970 -182806 262233 -19541 180378 287149 -282843 122119 -77686 63528 -40342 -6333 127587
8958 -9650 -129924 -162503 -133496 -62997 -254384 111341 294536 -25426 68546 -291154 10459
8946 84210 -121312 403972 219 -181923 -91903 43819 -50561 -26714 -155050 -71400 -141767
8935 -141767 152236 -87955 -107733 -93379 -168035 -425963 -254314 -292187 -56128 106757 -20732
8923 115295 -70103 -347294 91102 -7922 323689 -178744 -191712 422426 349430 228169 38597
8911 255511 20437 520507 137669 387613 490284 1210037 1984172 3663060 7775173 3540895
8900 1734439 1182706 584841 282645 435188 -16453 201223 163223 232970 237983 121238
$$ packed form
8982c65119J23359R2660B6356i977k21727n3091d6830C08750d0917A29726a37908
8970a82806B62233a9541A80378J06771b82843A22119g7686F3528d0342f333A27587
8958i650j20274l2579K9007f2997j91387A11341J83195b5426F8546b91154A0459
8946H4210a21312D03972B19a81923R0020D3819e0561K3847j28336g1400p0367
8935a41767A52236h7955j9778J4354p4656k57928J71649l7873e6128A06757b0732
8923A15295g0103k77191I1102g922C23689a78744j2968D22426p2996j21261C8597
8911B55511B0437N00070A37669K49944J02671P19753P74135J678888M112113C540895
8900A734439n51733E84841B82645J52543a6453B01223l8000O9747N013j16745
$$ plain form
8890 121238 113627 -120532 9443 81598 -107070 69355 -212349 -72565 94863 100176 -184497
8878 81246 -75459 -378960 -174772 -40731 251439 127148 -149237 -100754 -205079 -134169 -90111
8867 -90111 -172983 -94173 -247937 -3742 -17275 -248377 -201084 -36403 -461502 -205861 136056
8855 31400 80345 56793 -58024 -108208 -7822 -173525 -303962 78258 259955 -56438 303681
8843 -72773 -218499 -48558 39729 93884 -127816 210735 -25753 63037 78404 19349 131714
$$ packed form
8890A21238p611a20532I443P2155a07070F9355b12349g2565I4863N313a84497
8878H1246g5459l03501a74772d0731B51439j24291a49237M8483j04325P0910M4058
8867i0111q2872P8810j53764c742j3533k31102M7293c6403m25099b05861A36056
8855C1400M8945k3552e8024n0184g822j65703j30437G8258J81697e6438C03681
8843g2773j45726d8558C9729N4155a27816B10735b5753F3037J5367A9349J12365
$$ [...]
##END NTUPLES=NMR SPECTRUM
##END=
