
##TITLE=AC1168_Tolima-ibague-TPAAH12002_7165937_Ki5kZcvc1U
##JCAMPDX= 6.0         $$ Bruker NMR JCAMP-DX V2.0
##DATA TYPE= NMR SPECTRUM
##DATA CLASS= NTUPLES
##ORIGIN= BRUKER
##OWNER= Administrator
$$ 1.72 TOPSPIN		Version 2.1
$$ 2012-12-01 21:51:14.196 -0500  Administrator@X
$$ Compression mode = diff/dup
##.OBSERVE FREQUENCY= 400.02188249412
##.OBSERVE NUCLEUS= ^1H
##.ACQUISITION MODE= SIMULTANEOUS (DQD)
##.ACQUISITION SCHEME= undefined
##.AVERAGES= 8
##.DIGITISER RES= 22
##SPECTROMETER/DATA SYSTEM= spect
##.PULSE SEQUENCE= zg30
##.SOLVENT NAME= COFFEE_meoh
##.SHIFT REFERENCE= INTERNAL, COFFEE_meoh, 1, 14.98509
##AUDIT TRAIL= $$ (NUMBER, WHEN, WHO, WHERE, PROCESS, VERSION, WHAT)
$$ ##TITLE= Audit trail, TOPSPIN		Version 2.1
$$ ##JCAMPDX= 5.01
$$ ##ORIGIN= Bruker BioSpin GmbH
$$ ##OWNER= Administrator
$$ $$ E:\/data/COFFEE/nmr/AC1168_Tolima-ibague-TPAAH12002_7165937_Ki5kZcvc1U/10/pdata/1/auditp.txt
$$ ##AUDIT TRAIL=  $$ (NUMBER, WHEN, WHO, WHERE, PROCESS, VERSION, WHAT)
(   1,<2012-12-01 21:51:05.992 -0500>,<Administrator>,<X>,<go>,<TOPSPIN 2.1>,
      <created by zg
	started at 2012-12-01 21:49:59.883 -0500,
	POWCHK enabled, PULCHK disabled,
       configuration hash MD5:
       86 BA 57 50 F2 9D 5C 9B 26 00 A9 28 5F 66 2E 89
       data hash MD5: 64K
       A7 2B 30 51 5A 68 3D EC 00 3D 61 D5 AB 8F 7E 55>)
(   2,<2012-12-01 21:51:09.055 -0500>,<Administrator>,<X>,<proc1d>,<TOPSPIN 2.1>,
      <Start of raw data processing
       efp LB = 0 FT_mod = 6 PKNL = 1 PHC0 = 0 PHC1 = 0 SI = 32K 
       data hash MD5: 32K
       4E 6A BA 12 F0 25 64 2B E4 AE 54 DD 89 37 13 17>)
(   3,<2012-12-01 21:51:09.524 -0500>,<Administrator>,<X>,<proc1d>,<TOPSPIN 2.1>,
      <pk PHC0 = 98.12988 PHC1 = 0 
       data hash MD5: 32K
       88 6E 32 08 B4 34 1C FE 4E D8 02 23 7B 6D 6C 68>)
(   4,<2012-12-01 21:51:09.742 -0500>,<Administrator>,<X>,<proc1d>,<TOPSPIN 2.1>,
      <abs ABSG = 1 
       data hash MD5: 32K
       45 21 40 31 37 38 C1 8D 49 DE 12 51 A5 5D D7 F0>)
(   5,<2012-12-01 21:51:09.899 -0500>,<Administrator>,<X>,<proc1d>,<TOPSPIN 2.1>,
      <abs ABSG = 2 
       data hash MD5: 32K
       9F 2D CB C2 E6 E5 E9 96 13 36 98 45 36 6D B8 A4>)
(   6,<2012-12-01 21:51:10.071 -0500>,<Administrator>,<X>,<proc1d>,<TOPSPIN 2.1>,
      <abs ABSG = 3 
       data hash MD5: 32K
       2E 29 0A 43 38 69 D7 7F C7 34 15 1C 57 79 F9 B1>)
(   7,<2012-12-01 21:51:10.227 -0500>,<Administrator>,<X>,<proc1d>,<TOPSPIN 2.1>,
      <abs ABSG = 4 
       data hash MD5: 32K
       0A CA 66 D3 64 75 2E 49 FC 49 7C 2D 47 80 BA 14>)
(   8,<2012-12-01 21:51:10.367 -0500>,<Administrator>,<X>,<proc1d>,<TOPSPIN 2.1>,
      <abs ABSG = 5 
       data hash MD5: 32K
       38 6A 53 7F 45 84 5C D1 38 74 14 75 AF 84 6B A5>)
$$ ##END=
$$ 
$$ $$ hash MD5
$$ $$ 75 CE A8 02 73 9D 93 ED 16 68 F7 7D C7 22 F7 3F
##$RELAX= 
##$RELAX= 
##$RELAX= 
##$RELAX= 
##$RELAX= 
##$RELAX= 
##$RELAX= 
$$ Bruker specific parameters
$$ --------------------------
##$DU= <E:\>
##$EXPNO= 10
$$ [...]
150 150 150 150 150 150 150 150
##$TP07= 0
##$TPNAME0= <>
##$TPNAME1= <>
##$TPNAME2= <>
##$TPNAME3= <>
##$TPNAME4= <>
##$TPNAME5= <>
##$TPNAME6= <>
##$TPNAME7= <>
##$TPOAL= (0..7)
0.5 0.5 0.5 0.5 0.5 0.5 0.5 0.5
##$TPOFFS= (0..7)
0 0 0 0 0 0 0 0
##$TUNHIN= 0
##$TUNHOUT= 0
##$TUNXOUT= 0
##$USERA1= <user>
##$USERA2= <user>
##$USERA3= <user>
##$USERA4= <user>
##$USERA5= <user>
##$V9= 5
##$VALIST= <valist>
##$VCLIST= <CCCCCCCCCCCCCCC>
##$VD= 0
##$VDLIST= <DDDDDDDDDDDDDDD>
##$VPLIST= <PPPPPPPPPPPPPPP>
##$VTLIST= <TTTTTTTTTTTTTTT>
##$WBST= 1024
##$WBSW= 4
##$XGAIN= (0..3)
0 0 0 0
##$XL= 0
##$YL= 0
##$YMAX_a= 664234
##$YMIN_a= -560149
##$ZGOPTNS= <>
##$ZL1= 120
##$ZL2= 120
##$ZL3= 120
##$ZL4= 120
##$ABSF1= 14.98509
##$ABSF2= -5.573092
##$ABSG= 5
##$ABSL= 3
##$ALPHA= 0
##$AQORDER= 0
##$ASSFAC= 0
##$ASSFACI= 0
##$ASSFACX= 0
##$ASSWID= 0
##$AUNMP= <proc_prof1d_extract_pilot.lims>
##$AXLEFT= 0
##$AXNAME= <>
##$AXNUC= <1H>
##$AXRIGHT= 0
##$AXTYPE= 0
##$AXUNIT= <>
##$AZFE= 0.1
##$AZFW= 0.1
##$BCFW= 0
##$BC_mod= 0
##$BYTORDP= 0
##$COROFFS= 0
##$CY= 15
##$DATMOD= 1
##$DC= 0
##$DFILT= <>
##$DTYPP= 0
##$F1P= 0
##$F2P= 0
##$FCOR= 0.5
##$FTSIZE= 32768
##$FT_mod= 6
##$GAMMA= 0
##$GB= 0
##$INTBC= 1
##$INTSCL= 1
##$ISEN= 128
##$LB= 0
##$LEV0= 0
##$LPBIN= 0
##$MAXI= 10000
##$MC2= 0
##$MEAN= 0
##$ME_mod= 0
##$MI= 0
##$NCOEF= 0
##$NC_proc= -8
##$NLEV= 6
##$NOISF1= 0
##$NOISF2= 0
##$NSP= 0
##$NTH_PI= 0
##$NZP= 0
##$OFFSET= 14.98509
##$PC= 1
##$PHC0= 98.12988
##$PHC1= 0
##$PH_mod= 1
##$PKNL= yes
##$PPARMOD= 0
##$PPDIAG= 0
##$PPIPTYP= 0
##$PPMPNUM= 2147483647
##$PPRESOL= 1
##$PSCAL= 4
##$PSIGN= 0
##$PYNMP= <proc.py>
##$REVERSE= no
##$SF= 400.02
##$SI= 32768
##$SIGF1= 0
##$SIGF2= 0
##$SINO= 400
##$SIOLD= 32768
##$SPECTYP= <>
##$SREGLST= <1H.CDCl3>
##$SSB= 0
##$STSI= 32768
##$STSR= 0
##$SW_p= 8223.68421052631
##$SYMM= 0
##$S_DEV= 0
##$TDeff= 65536
##$TDoff= 0
##$TI= <>
##$TILT= no
##$TM1= 0
##$TM2= 0
##$TOPLEV= 0
##$USERP1= <user>
##$USERP2= <user>
##$USERP3= <user>
##$USERP4= <user>
##$USERP5= <user>
##$WDW= 1
##$XDIM= 32768
##$YMAX_p= 471836277
##$YMIN_p= -737172
##$CURPLOT= <Network HP LaserJet P1505>
##$CURPRIN= <$Network HP LaserJet P1505>
##$DFORMAT= <normdp>
##$LAYOUT= <+/1D_H.xwp>
##$LFORMAT= <normlp>
##$PFORMAT= <normpl>
##$SURQMSG= 1
$$ End of Bruker specific parameters
$$ ---------------------------------
##NTUPLES= NMR SPECTRUM
##VAR_NAME=  FREQUENCY,     SPECTRUM/REAL,   SPECTRUM/IMAG
##SYMBOL=    X,             R,               I
##VAR_TYPE=  INDEPENDENT,   DEPENDENT,       DEPENDENT
##VAR_FORM=  AFFN,          ASDF,            ASDF
##VAR_DIM=   32768,         32768,           32768
##UNITS=     HZ,            ARBITRARY UNITS, ARBITRARY UNITS
##FACTOR=    0.250966925370066, 1,           1
##FIRST=     8223.43324360094, -4678,        -352192
##LAST=      0,             -29386,          -299553
##MIN=       0,             -737172,         0
##MAX=       8223.43324360094, 471836277,    0
$$ Real data points
##PAGE= N=1
##DATA TABLE= (X++(R..R)), XYDATA
$$ [...]
23774 2368 -171743 -283478 122849 273356 -329005 6541 132394 231871 -25966 48363 66755
23763 66755 189836 -85869 70024 -12300 -9047 46827 71367 -77005 -222362 -75058 -138782
23752 -138782 -257081 49335 97424 92661 -233562 -156734 22974 227236 -167951 -134887 274687
23740 121583 281481 116068 -196963 215801 -126032 155105 133518 -282317 -16350 133173
23729 -124919 -100830 -62627 -300091 -102618 -81550 -56599 -155927 -222886 65028 -79832 -60198
23718 -60198 -91308 -34304 -163931 -226353 232686 -135095 -130831 -175990 -4818 -167016 18946
23706 -86974 -110485 192607 268987 68313 17758 -343717 193443 229957 78292 -59182 53888
23694 -30278 528797 247826 37828 -153497 -144446 -11467 -64543 -76463 293044 -420825 -9256
23682 -111046 -104740 -57737 35080 -85398 -10474 -6462 301781 174358 213541 -169111 -86878
23671 -86878 -11722 -141157 223636 30674 131961 -191947 -273574 -55203 -212995 -172301 -57976
23659 1010 53915 -241763 -299428 -141762 -78406 -69434 71302 -14049 -167193 18926 -6887 -50651
23647 -50651 -46288 75258 69696 -135531 133841 92073 -206473 192227 -96933 4963 110627
23636 110627 -115633 -32868 -201827 259513 249542 25637 48183 182149 -157743 -122946 93734
23624 -188378 30945 41830 -274055 -60571 -259974 -91336 305756 -5604 238647 -142488 245532
23612 -288668 139234 -166008 -82029 77122 -155987 -160385 8698 -176877 -461489 72020 61197
23601 61197 -42664 -26802 278799 377816 -227347 34718 130787 156107 -48750 128641 -274637
23589 238194 322993 198513 127369 371895 -141605 365746 229991 258374 -89311 19082
23578 322562 -366844 -152577 -17564 -370152 -100158 -23573 -8926 -83198 -41066 25436 -165212
23566 -106197 -204963 -374557 -44379 -186145 204770 -252807 -186494 -8888 -414119 -42150 -129066
23555 -129066 68154 -176451 -210253 -95834 97167 177392 -221555 90437 -128730 198590 -51098
23543 173837 -74744 -34291 -90058 -83314 211048 241983 -142454 -129737 208737 18313 35850
23532 35850 116967 261794 -119199 138557 17573 -101442 -19228 191800 -131620 -69055
23522 -69055 -166492 -171122 17040 -126939 206192 -220990 72986 -97255 -251864 -213393 -16907
23510 -17043 109991 4013 -28726 95649 52599 121839 -106938 -198077 216340 -13511 -149241
23499 -149241 30254 -36674 138955 124958 434040 23036 174198 -100189 -82204 360181
23488 75353 -291498 112586 3228 -260869 -90469 -2869 168469 143856 114861 121272 113020 -158242
23475 -95957 12345 45375 -61666 111442 -171546 200073 277115 57301 99170 223897 -286519
23463 -18353 65914 -122956 -69570 -227961 -42336 69795 89151 -160536 -60352 189057 53300
23451 271004 167483 -303153 22832 -14581 85364 -135606 -293547 41369 -57587 -78889 -283169
23440 -283169 104514 13679 -268096 106978 -174911 30084 151978 -139858 170821 -81217
23429 93589 -5905 -49510 3690 217793 115933 106671 182784 -233839 219893 -71671 -70312 -87319
23417 -87319 -158266 146459 -236389 81265 -84750 6466 -20927 9413 -152695 107995 249360
23406 249360 -247698 21866 -209702 -111962 -83730 44149 194300 -130446 149651 62979
23395 -46922 57755 -275684 40729 -300270 -294903 153897 2994 139155 -146307 -107977 -46396
23383 2304 71146 186061 42006 23343 171340 -33540 -110445 231197 -257926 -77458 142335
23371 -259168 -178610 23261 117147 70375 -38311 364827 -52337 60610 18854 -302275 -117161
23359 -123958 -18504 -353953 12878 -130094 -21404 -175855 169530 -291531 -220623 -323929
23349 -323929 -275190 91357 -18801 51728 -104713 -643388 256301 -66623 47067 176865 -279828
23337 -173101 36884 12259 -143425 41965 -129317 -185270 -286027 -53922 171554 34404 131105
23326 131105 -522047 -264648 -12161 227096 -16040 -54696 -134950 352616 -141624 -278911
23316 -278911 -58005 -281593 97238 -160265 -111466 -90812 218182 217607 -128338 -21219 174158
23304 -157908 -212370 -161766 -80036 69497 77232 -267136 -303367 -95101 -111101 -102073 70057 -113929
23291 101877 -235912 164975 15193 -133775 231119 156812 60561 -149344 -22866 -112325
23281 -112325 -29392 -92681 -113048 164889 -191363 -68621 -33321 145396 -208304 108293
23270 -26444 215490 -10873 -96356 36527 20858 236707 -226777 -75172 -62532 -73310 -34292
23258 110846 28849 -88006 12929 -52043 -28746 -152885 -73369 203377 -13503 -629818 -116430
23246 -64120 610509 -283375 367415 153265 208867 105942 81910 195629 -82438 -95521
23236 -95521 -141589 -11338 193105 334835 -1384 -72518 -400861 30282 200127 -209185 -52949
23224 -18120 -376294 301916 -85759 174672 -249915 -41288 -242286 -60260 134006 -258938
23213 381698 38017 -13070 172408 98322 -189218 43982 -3114 -277704 -76541 133882 196308
23202 196308 310078 -447327 -123008 -388474 182414 -91941 -161207 -98237 192902 -96717
23191 249407 181201 25055 -147605 19804 94107 -222297 -142187 95210 210235 -70385 86394
23179 -25995 44007 -21034 30455 -253292 -340929 186095 -173630 109858 -47913 51038 103490
23168 103490 85446 51632 -39903 -203367 -212582 -74548 3318 32007 -171976 -119149 -177853
23157 -177853 -220421 309462 60091 -299165 -40148 40035 -7558 84203 76519 -95913 -252320
23146 -252320 -191538 -74823 -90461 328242 327948 -173190 -93953 -188435 202805 85603 -345431
23134 16079 141261 -294643 -91716 51349 246311 130408 418040 -7432 122239 322907
23124 322907 -32003 95821 53016 43769 132978 -279146 37349 -275743 -282847 138929 44033
23112 215283 -195842 332441 213141 249047 -24613 -176095 -119006 250327 61278 -107146
23101 351168 361900 40499 -77360 -235371 192743 15425 41732 -130768 -152911 195401 326745
23090 326745 -71224 -161265 138423 42168 -23849 -112391 -85220 91978 -175636 -342901 -60582
23078 -118149 -16906 164988 30458 49513 159270 -65185 41103 -260129 -26389 141142 -134000
23066 17819 -446879 -331489 -178006 48352 -34471 -68654 201962 39325 76476 351222 41318
23054 -37803 -32523 174062 -304241 -249664 150076 22046 166484 -96194 178239 -112002 -123579
23043 -123579 18253 -84467 -49818 -60466 -56887 -45848 -92951 -105431 -117734 -63091 86124 -142115
23030 166769 20011 185580 294785 109714 -122752 23490 288291 -93508 -227239 93337
23019 -166629 449939 160773 -329041 -305438 42923 -380183 33285 275907 -258715 -49293
23008 -372658 -5893 -14756 -95666 47065 255300 -124202 215706 -42817 81018 -105075 -137122
22997 -137122 -192933 -86506 12050 -53182 -43966 -26498 259511 -27928 231768 263569 -366092
22985 137263 -40354 -60493 -151154 -65168 -243188 -26005 51962 49591 37368 -4998 24972 -154121
22972 63041 15540 -284843 107579 287151 42224 -92922 251292 -330959 255512 129070
22962 129070 68690 -154856 217464 19566 -470370 -214230 -114167 5998 270310 -81148
22951 176810 -124858 -135052 -121767 77110 49363 -255813 83205 -292793 58836 45140 136434
22940 136434 19638 -87484 -38331 -253827 59576 -120130 -230840 -5088 -226705 -80293 -75969
22929 -75969 -160327 339199 22250 607 249818 -40488 132950 -167700 86440 298414 34695
22917 50807 -12466 -145960 131546 241178 72340 34615 -205510 -161107 76256 57411 -98951
22905 -207666 -180675 -67734 100352 -273318 117461 -45510 -7818 -215212 -206325 -372221 -125694
22893 -109113 -81803 -18677 157612 87362 -76469 364830 -39103 116715 115449 126795 93697
22882 93697 204452 -205442 -198698 105465 -208891 3624 -282696 92823 46020 -479076 -203240
22870 -192338 -265403 279897 5291 -36218 109732 -113504 81653 40883 181089 102924 -193723
22858 -61079 -141764 118036 158866 54093 43836 -316557 71152 -124106 -113912 -149221 258724
22846 255230 -47802 349478 -18254 -154819 85762 260654 -438203 -67273 -398225 68733
22835 -70592 -244995 -29250 162536 -106870 -306275 -43132 -199597 -25604 74846 -227550
22824 114061 156088 -99679 -271591 -124141 -114627 105296 147724 137636 -138962 138446 61208
22812 290815 201041 -201083 140739 -210568 68681 -37008 -54187 53120 220305 -78078 -132396
22801 -132396 -52602 -32969 -14981 -1356 -260851 -76569 -241861 130435 -123957 -47238 120500
22789 26678 -21635 -24273 -124386 -130657 -101440 173618 -144518 240039 -142403 -108109 -21078
22777 -119719 206475 -162576 -149319 -27868 39091 126985 113260 54558 -5533 -372 98203 210678
22765 210678 -307570 115741 112744 81026 -59950 28289 45188 -146136 -16839 -146416 -100684
22754 -100684 -194826 -330647 -34465 -312510 126048 -313836 80540 79189 -19797 -215645 -154641
22743 -154641 56846 19891 -164334 -326451 222113 -117039 77431 -83210 137403 46084
22732 -471788 -130795 -313823 281392 138503 13497 -2615 49428 162232 -73163 -271839
22722 -271839 -31982 -258683 -20662 15532 -440863 -65640 -47800 1560 -176633 -242695 173575
22710 -55872 -88315 42756 -61566 -196132 -138041 126880 79709 86554 -272350 -6220 31810
22698 -26768 -71094 -109049 45205 130857 170561 89901 -327037 60132 -90597 -140891 -227035
22687 -227035 -87435 -321461 197129 170915 239348 -37778 -260738 293586 -146478 -247491
22677 -247491 -66639 -199567 4346 169997 26697 -259563 -399404 -130203 166409 -54927
22666 -332473 61922 142951 223228 78532 -4635 -88268 -47346 146795 55786 -39376 177753
22654 72308 -61830 -46603 -146446 86288 -155808 -149251 13145 361884 -207043 117891 54570
22642 378061 -43964 5874 75744 122378 7704 85577 23603 -69807 -128898 -381617 -170341
22630 -546561 211577 -50644 -178806 -242083 271156 -111752 -279290 77151 181506 -24527
22619 90142 99689 264909 -1091 201253 -188735 -295370 -144269 374832 -63706 -52352 54202
22607 8196 -80630 -50273 -8963 -332249 -42501 -2163 244423 -165455 -96328 225075 150154
22596 150154 -449055 4703 94936 -17605 61391 -136205 173003 -152523 -68456 130733 68083
22585 68083 14271 -152747 41327 -154314 -134230 -28270 170362 -79983 70168 283748 -18357
22573 -206450 28874 265378 -129931 219466 13577 -77326 -40027 294700 -86348 107599
22562 -9688 243868 105273 -39998 -39961 -63583 -88155 222768 -57056 -160387 -44038 -76917 -359927
22550 -359927 164388 -44273 -104873 372161 274930 -65956 -210846 186124 -251072 -372925
22540 -372925 -93296 42991 -149755 58290 -45955 38070 -347330 67612 -182751 377222 -143200
22528 -99044 -312989 -406549 264303 -309708 90271 -166527 -39388 -80225 7798 66546 81283
22517 81283 -142559 -251504 -42428 213637 -65888 -141502 165509 244005 -3028 72400 -7122
22505 -130067 149912 -86484 -218668 -148614 -126095 32989 -85239 -81769 -5419 -50435 -226317
22494 -226317 108396 -22901 156711 286015 21840 64810 81142 53254 151811 -249226 -269329
22483 -269329 -88984 -484888 -448319 -121689 -51070 47715 -260614 972 -91540 -173512 -54124
22471 23357 252657 106984 39326 71176 54924 89236 -83652 -239321 22937 -70331 91032
22459 -171817 -211951 -74555 -75983 21987 -231729 -122231 -363390 -202325 191263 -46366 74564
22447 7794 -167091 -227962 185646 178528 -223458 -95805 -69322 -2904 156135 114406 -37023
22435 -201777 103868 -216894 -113226 -160752 59917 -201752 59672 202610 -142252 -62129
22424 -172290 100533 42753 -167599 -46009 -244753 72795 -52076 17263 -118322 -199559 -321151
22413 -321151 -129478 -47624 -193844 132648 -17753 161751 -185829 226326 -154829 173860
22402 185451 239385 129412 -33468 271783 34766 -332780 20637 -160989 -10768 -149733
22392 -149733 -219665 -32703 -263922 -45235 86119 83571 -29577 -18414 -238899 81817 -70952
22380 -10432 255726 -11530 -256850 130104 125657 -236156 -174721 -95487 89713 -235738 -197724
22369 -197724 -195037 132329 74556 -79026 81810 -21350 -346629 -162894 98018 -298263 75501
22357 -96013 -199632 136689 74750 -29470 79391 231067 -82829 -326140 29009 -180124 116264
22345 -122147 -207154 16441 -161214 -17396 -161536 262839 71682 -376166 -164393 -206714
22335 -206714 47163 45460 155040 -75038 -312974 -188362 79272 295658 -170520 41511 -84690
22323 -101162 -11666 -123943 -22821 -286790 -63319 1867 -342432 -41407 15857 -59148 16794
22311 3732 115182 39533 137026 -229122 -91856 205276 -97501 203948 137886 -130986 -48130
22299 -26971 105846 134266 206141 202006 -196303 125111 -169034 19778 -64448 -166621 -13119
22287 -90924 -181226 -29531 -81642 112145 -48526 -224959 108108 168348 61531 -269666 37390
22275 -99222 -143701 -256773 -64666 141326 -174881 -95521 120689 -279705 -145470 -77589
22265 -77589 78926 -206339 -314464 -23655 -89841 28198 -103952 -49612 -179252 316027 -273571
22253 -10599 -139243 226995 8789 -26956 201105 141136 189003 -36651 179730 -403908 -19002
22241 65677 -195312 16516 -305452 -189432 115300 87865 -94685 -13409 -239473 245665
22230 -55488 187190 -113284 48589 -93619 211361 -219555 -247837 -83740 -29748 48581 208712
22219 208712 -110616 130968 -242055 163785 94015 -78317 34189 38734 54805 -123475 17729
22207 44081 -382029 230809 99787 -150904 -151774 282637 147836 170072 214904 -108322 -103867
22196 -103867 -94544 136126 -50918 -86307 -103564 -17272 41741 -367164 -181265 75127 -69269
22184 145391 261173 -169664 11870 18667 84256 -142761 -10854 -298926 115967 -340227
22173 -243885 -42880 -296811 -55540 -69487 -398985 -68698 -134220 -109894 90311 240836 -414428
22161 -43438 -103728 60293 -44033 -166018 -142661 -8765 -97808 106815 -97396 129346 -38636
22149 -95094 -79387 167202 -82502 92412 -155190 166017 -77219 40765 -72127 -77182 -320077
22138 -320077 108709 -92307 5088 -173144 13987 -105696 -77486 -328335 -78085 -258585 81504
22126 -172859 -297639 126213 56436 -192396 5313 48751 -131712 -240645 -251708 3518 141422
22115 141422 -255667 101191 -78987 -161294 53622 71073 -47794 -206210 129849 230204
22105 230204 -256892 106761 260179 -300493 -322194 -37252 97461 -267988 -272159 -57572 -133368
22094 -133368 169291 -157969 -141300 122148 -117007 4253 58089 -4901 -27895 45655 -194843
22082 219027 135260 75567 -136499 -235023 190867 247488 74402 -70968 -116024 -137935 -16534
22070 -170663 146158 -247391 -398825 -324457 -350237 162947 -200645 49481 -122995 -208494
22060 -208494 -267171 -281338 94078 -42042 -122946 -369536 -168229 -184259 192016 -187833 -84516
22048 127246 38272 251511 56973 98154 144819 24906 70361 -36860 140579 -64171 72310
22036 -346079 102803 74938 -158600 -355807 84958 -183290 31110 -79207 -121161 -57891 -190140
22025 -190140 168873 88597 72994 -232383 -221136 237666 -202585 133575 -312686 -156804
22015 -156804 -484704 -71874 -180721 -144529 -291796 -223509 -153340 272388 -105583 -191029
22005 -191029 -256946 -101843 232837 -246796 -221592 -266810 71267 -321010 105616 -88411
21994 -92391 -281136 81879 -243363 88559 165393 -41009 -219098 -16600 132744 -55797 -14301
21982 -237045 68135 103195 -295511 -288713 153667 -42747 -47480 -7893 -190779 -17422 -25723 -224660
21970 -224660 169487 -239775 -290185 -136794 10853 130974 -56710 -41390 38161 85806 -65606
21958 15740 -175101 89174 -203689 -237276 17925 143910 111044 -282529 153930 -116738
21947 185517 -168672 256173 67712 294341 -111822 -404273 -178749 243467 105682 -72355
21936 -155540 -98728 -10240 -179801 -159431 210504 118342 32567 67837 -134354 -256397 183142
21924 89615 -49297 -404727 -2906 113080 -120415 -218170 142524 -141005 122559 235627
21914 235627 -299922 -174625 -28433 -470435 -358388 -173899 136332 -91039 -215330 158400
21903 -397210 48668 -498884 100014 58602 33376 375699 -724 46823 219299 65725 54402
21892 54402 280126 330479 -80988 46816 133499 -6296 187972 217138 -263132 -53517 -37238
21881 -37238 127784 -280169 -130341 110156 -25941 -51816 -160812 -145478 -152330 -81881 -287812
21870 -287812 -204772 -87576 -129497 360507 -176752 52667 -151736 -131667 13695 -91873 -491433
21859 -491433 -31643 79237 -374864 -89805 -55264 -143972 -6512 -153612 31432 -122162 -144535
21848 -144535 51409 194060 -175010 -49744 -94902 -36396 25531 -303602 136408 37070 -191303
21836 -328587 -260264 -208742 24913 -126907 -98978 70429 -347529 -302485 -53379 -124208 -72442
21825 -72442 -172912 -120549 172465 -141159 -81782 147960 211071 -268065 -216846 -45803 -99008
21814 -99008 -397941 88835 141564 -48848 -385394 -83069 -51610 -98216 -187993 -223637 145519
21802 -208581 -101725 42796 118334 288057 -176975 -121815 -144446 -2658 255855 -225996 -362254
21791 -362254 18693 315616 26036 166778 20795 -132155 200798 -156839 -33995 -262187
21781 -262187 211034 -251200 151619 -525563 -168752 -14870 -239951 366980 -211811 -147955
21771 -147955 57112 -21622 206 -25413 -199810 156407 189305 89668 409333 -116086 -201661
21760 -201661 -295953 -125895 22103 335569 79587 225192 27083 10719 -105825 -312225
21750 -312225 -177779 -139790 72181 104118 -262338 -13080 82734 -68455 -49942 -28683 -240485
21739 -240485 258232 -43788 74454 -170677 -26866 -173148 152442 -39404 210192 111825
21729 111825 93043 -268625 18205 -188642 126837 -1982 -350991 -158203 -249792 -74612 -228382
21718 -228382 -69304 257338 -84355 58866 61422 122854 -56357 -79459 117302 -183708 -137850
21707 -137850 -189955 185950 -149984 -1020 -139094 -67616 -35415 11605 -56764 -322512 -217152
21696 -217152 59643 -87385 75656 39401 -35739 93501 -160402 -214501 -123668 -111840 -46619
21684 42968 -277295 -230132 -246542 -189765 -268106 -8812 -243062 360295 -227434 -12963 8143
21672 -176189 244698 -137577 -89779 -84916 -5130 -149525 -19652 -270640 302163 -79061 223920
21660 -141277 24967 206309 -46383 124315 -30867 160522 74989 -91413 -115800 -62025 -24826
21648 -86698 -94188 -30633 195030 -30559 -124514 -328883 -46878 152745 -15447 -82430 78638
21636 -241456 -29077 -171079 -137721 -294235 -53350 38869 -311847 130159 -42372 -177359
21626 -177359 72231 -241281 102683 -37684 -194972 -251678 -52002 70885 95501 -71448 -313579
21615 -313579 75875 -97955 -238315 19281 -71469 191722 -547455 -101619 -135007 -5509 -6977
21604 -6977 -183150 112301 123381 -163580 -13853 68235 -354599 -78065 459005 -265280 -86252
21592 93235 94003 -122465 -271733 -224413 -73109 -22049 -50724 -103002 -18431 -173567 -39321
21580 57224 6979 -26388 -225408 -339525 107542 887 -119254 -22124 -135856 20957 -16735
21568 -276776 -12937 307375 -163875 368 216714 -5955 13899 -247748 -234179 -136708 75646
21556 186972 284669 154618 -224009 47836 -68483 -341994 153794 82871 14878 -62484 95691
21544 200461 64023 109563 -260413 79793 -148663 52700 15347 -357259 -138046 95199 -59760
21532 860 -73643 289584 58430 -164668 100152 392124 -46830 412562 -52842 -66907 -13610
21520 97320 -42403 -176059 -228204 -164905 -237161 -317151 41424 -150886 192491 -365006 -307390
21509 -307390 -348865 -18680 38946 125847 -300650 68452 -124350 17502 -157068 -317717 -416590
21498 -416590 -245825 -389221 -427259 -31613 64693 -362874 9 23453 -223555 -327836 -178346
21487 -178346 77399 161395 -273900 -223602 202641 -307486 -140448 -13923 -205818 32654
21476 206703 -156152 -324649 3462 -199795 197410 -132537 48328 20941 -185529 -178277 -215406
21465 -215406 -124054 -122901 -114754 -85382 -175177 -187604 -90961 135435 87314 -217527 -68151
21453 -252074 69486 29597 -184268 185529 -19494 -55865 145949 80581 29019 -99695 67125
21441 -5931 -11713 18120 141892 290230 508236 361843 418621 472499 284071 241355 283137
21430 283137 180099 -17491 150935 54272 283925 120563 123417 -352891 195294 32139
21419 7493 68354 -32837 55331 -59153 -113451 -188345 -90740 -135980 -245795 202244 -303874
21407 86607 253 -199662 80531 -336643 -215235 8623 90733 125330 -148809 -158099 -350505
21396 -350505 -122532 -183959 -247368 -43742 199171 185719 79708 -245897 -131838 -219827 68054
21384 -6608 9489 -126681 185749 -134399 217746 18457 -35062 -182106 -285543 -110654 -48213
21372 37897 -222821 322572 -75819 30092 483447 173858 -285248 265048 16777 20468 -205346
21360 -368541 -343900 66413 16495 -219641 84542 -65863 153324 178512 -259554 -230298 213599
21348 -434485 2769 -236046 -49982 53458 -293379 13539 -164373 -148107 -259169 20345 -326127
21336 -44444 62046 16490 -227256 -53939 155790 -186245 -172884 -461438 -133603 33476 -26637
21324 -25356 13135 -80765 -113707 128261 120017 -127706 -246751 -193827 -92877 -79819 14211
21312 -113455 -3032 -78781 -298596 -137416 -116537 -24517 43765 -81211 158729 -120720 96582
21300 -175842 -58820 -157208 64847 -153844 -66944 -96216 114163 -480773 -238665 108238
21289 -91361 123893 200018 -62956 184398 -40478 -79160 -57916 -205812 -400561 212587 157019
21278 157019 -211297 -81785 71017 -132949 -63478 10834 -34359 -254666 106218 53961 -82030
21266 -313498 -101205 78547 -85005 -127598 -143536 -298626 -113716 3934 3430 -90591 68396
21254 -458563 -47158 -127867 -34435 -221231 -89482 -323907 -110999 -132459 26488 -96578 46874
21242 48338 179435 -13037 -171681 165330 38575 56218 -196340 -112417 229591 -40977 167370
21230 53326 -82044 80164 -192965 -81623 -376536 -64724 -257439 -179587 160774 122912 70424
21219 70424 -244843 -271214 -166357 -17680 -369272 182406 -122736 -195744 110860 167985
21209 167985 416 233585 -43031 -8622 71331 25112 77204 -171943 23655 -121240 41207
21197 -11048 -118393 241662 72754 -139993 -30243 -213314 35471 -89623 78354 64591 265102
21186 265102 -104222 50702 -186434 -158405 278002 -46256 -15624 -238826 -255475 -293670 -120617
21174 -96103 -294627 -77851 127737 -191453 118857 94766 70552 -148955 -30253 97704 -281633
21162 -195806 -319661 -119817 -26078 64078 -349540 -5964 266316 -185946 79120 -209569
21151 -167881 132817 -151820 -227314 -68083 -200806 -271596 -138800 202268 354789 -118938
21140 -169318 -87284 299730 -204791 -227326 1577 -280360 -75547 129075 -187922 -214299 -127173
21129 -127173 120167 -279130 106358 -369448 -160482 17095 -151328 -253177 -115716 16982
21118 -441082 -334083 65921 -169564 3326 -164308 -2908 16092 -76099 -4673 102664 69009
21107 69009 -260571 -104538 17584 351346 -99817 -107205 24434 112651 92618 -347386 -68011
21095 -258582 99380 250833 250480 57313 -231644 217927 75025 -329330 249286 465486 -316581
21083 -117345 133294 -212628 -78015 -109696 277261 -15988 226283 -128651 -61374 87550
21072 281353 -283390 -146453 -8911 -72390 95885 -301435 110435 -201882 -503196 -27403
21061 5123 -53395 -122640 -17205 102400 96092 90428 -113288 182239 -175235 -117379 48041
21049 51134 -8645 35281 -251772 56923 188464 -127411 43815 -21422 -118593 218688 -124664
21037 278247 -115833 -123236 159842 48400 -311799 230558 -58045 20522 -171859 235743
21026 -222377 57814 -241876 -94288 109088 -105730 -198387 -313406 -38572 -57919 -206671
21016 -206671 38928 2331 -668 4115 -221948 -219437 217431 -220755 52599 278219 41057 301985
21004 301985 449265 242270 282089 166382 -4027 174079 250166 -246439 113347 -224472
20993 -36133 -218473 -55123 -67215 -112883 -66063 -109476 -80256 85987 152487 -148879 -51853
20981 9192 82267 -288159 106041 67962 -267206 40456 -197443 237931 140501 -144192 43314
20969 45271 -167535 16722 104274 -87698 68169 55324 -182332 123903 -127526 -139433 -299874
20958 -299874 -207702 -120761 -216226 -66598 156262 40527 -29847 -200803 292025 153466 31235
20946 -179235 113708 78593 245914 330870 443725 680195 444925 209266 241715 -56880
20935 -45287 -73574 -161261 -145536 -238975 -7890 286200 -178308 -199062 -78202 -337297 99853
20923 -118248 30812 -128691 324362 -157779 -373697 -187159 -10214 224745 -54829 -163845
20913 -163845 68761 -12340 -153700 88803 -211294 -114562 112388 71419 -548911 -293247
20903 -293247 -313889 -231380 130449 -291393 24818 -176367 13764 34957 160020 -318311
20892 -194137 24848 55397 -58358 -191559 -495209 32114 277993 -48994 -69477 -229931 -329527
20881 -329527 -317250 43309 -128232 -11436 302908 -98852 -250734 -359343 -240437 -126947
20871 -126947 109619 -296315 63429 -84766 130042 -347576 -141186 -61718 -131884 -95504
20861 -95504 -8176 97020 -153716 66471 -237367 158063 -95668 17414 -103765 553910 58991
20849 200399 190313 -521097 16120 -8725 -245270 -250701 -94075 -278375 148602 21270 80273
20838 80273 231043 158687 -68460 -205699 -242121 259175 -37606 -228257 -104814 -30651 -273017
20827 -273017 -118599 192726 273721 -213835 -119723 -97627 -69061 -139386 -202381 -240661 42351
20815 -83976 -281902 -59451 -25180 -59349 -170405 -94123 -16924 11169 -335502 -110086 -171922
20804 -171922 -92694 -151116 14942 57972 -295518 196493 -158004 28188 -191697 -204157 65237
20792 133853 -194726 132505 4818 -94418 -68074 4001 105556 -55539 -53961 40002 -396410
20780 -310929 -36725 111686 24163 210663 -291304 80858 -189326 292684 -5347 30965 -16001
20768 -126108 335499 -105195 -239866 81623 -381808 -137516 338553 -105790 -148437 71840
20757 -308995 93586 -208763 224495 235906 181038 156035 94072 116685 2271 -27249 59512
20745 -86358 -62161 -81018 -172189 -302593 -202440 -9318 -90739 -160309 42530 -75780 -42506
20734 -42506 -173018 -82655 -319373 -92449 -37233 -220591 265998 -27085 -248750 -142040
20724 -142040 -32567 -107280 135602 129091 44855 72449 85721 -143761 -189952 154183 59910
20712 -29732 -48304 -235611 -2203 -167031 102205 22571 -279563 -225871 -31231 -61579 -96710
20701 -96710 -213858 -47099 -123257 -227094 -326197 -28138 -199951 47835 -284461 125371 -74914
20689 25046 -102503 332952 -22228 125324 -207467 -319762 -197094 74671 -27618 -144937
20679 -144937 78768 -179421 -48811 -393874 107440 333311 -151317 -26896 -46945 -131086
20669 -131086 123937 -71613 57910 163598 -144447 -202154 -312904 299367 -206815 -70875
20658 -17967 -156058 -364467 -100274 158660 -94441 129738 -171892 58712 -263363 -102507
20647 -130707 -163514 255808 -258441 -229999 -8819 -136618 -132712 -85529 21173 22685 -200871
20635 -212799 -191725 -161395 -9794 -301331 -124066 -3376 -46560 160402 112005 52401 148162
20624 148162 45951 -155138 -30142 62211 1301 12731 194584 30648 -45157 -270502 196811
20612 -222321 -158460 -295242 -382994 248392 -228358 -80185 -65776 -160718 131424 -130846
20601 -305404 213205 132839 -189517 -84397 155755 103562 -174416 -146316 -194659 -175378 -339060
20590 -339060 57038 -150326 129353 154912 -54872 86567 282259 -180335 273896 30593
20579 19092 -106914 -137385 111637 -98704 -289543 -106495 -199316 -12216 -17768 -156149 -206361
20568 -206361 83120 -79139 27776 -180643 -136939 -202695 -298788 -17806 -227760 -138957 -290202
20557 -290202 -172795 -86880 -272704 -74458 -105555 -199293 -120103 -262458 243262 21905 -295222
20545 -235640 -273253 113176 -90765 -146975 -216281 -186459 -90780 197293 -289789 166519 37208
20533 89555 228717 -104158 -66382 25384 50494 231056 -132679 -353890 -65056 161389
20522 -63310 -329345 84394 -83123 -190412 -251214 -267810 -145234 -153245 173427 -156771 -37046
20510 3822 -184802 -256130 175728 -213 -157360 -269094 -118834 -25985 -35619 104767 -319374
20498 115261 132189 -240653 -56379 -347139 267033 -25171 -130685 301072 -232665 86407
20487 -149033 -108094 -27639 38733 -171393 116421 9551 179904 76368 97065 -198531 15285
20475 -147900 -92378 55307 -92004 -513218 139324 170706 -28959 -97675 -291472 122307 -241078
20463 -149662 -310825 -158249 350867 -97567 -47694 85480 178655 227246 -343756 103864
20452 -39143 -260115 50554 62140 -41255 -150576 -3992 -113762 -116531 -72474 -242722 -40374
20440 -154199 145997 177464 75531 -205313 107375 -145999 -208487 -216227 -124036 -50581 -255879
20429 -255879 134267 -248532 -9117 -146251 67880 -66355 -52664 145066 -315761 -288288 -279535
20418 -279535 -144958 -179506 -128025 -39287 -95028 -203760 -93930 -32841 137683 -195994 -403200
20407 -403200 79938 -175500 282860 -248277 -8680 -150477 9458 164756 -204716 -6611 -17320
20396 -17320 -149345 -130142 -72772 -156299 -72421 57221 16979 -78647 -17062 -275741 -4544
20384 -472066 861 -128942 -3320 -50971 -206572 -51118 359491 -200109 -275653 -421504 -327841
20373 -327841 -137604 -66713 176656 76759 -82090 -65609 55935 -20554 -52274 -209078 -102893
20361 -98954 -274570 -109402 -5666 25874 -61716 -65754 -102574 -84115 -56693 -250989 -277026
20350 -277026 -125747 -165519 212558 79977 -5203 -51513 -330103 -396254 -112736 -176365 -175396
20339 -175396 148721 -162238 -146737 189593 15771 -113088 -172926 -291484 -347837 208078
20328 224998 50344 310911 -24908 69680 48563 -70735 256069 303981 -376492 114264 65014
20317 65014 18400 -176207 -252467 -40658 -57277 -37401 -200197 -139676 -285486 117761 -49641
20305 -245911 -53201 -190133 -95638 18813 -112216 181291 -190813 -805 -126198 -178539 -123459
20294 -123459 268515 -309255 -128628 -64780 62868 -67653 -93615 155611 74944 115895 -333771
20282 38956 -356643 -114259 -135101 -337386 133629 -77212 -22056 -226003 31698 -320352
20271 -110529 27729 -177947 118198 146241 101738 177741 90172 -26721 195574 128839 119736
20260 119736 -168449 -20902 -351959 -31880 172496 -208016 -348007 -334045 -91750 37505
20249 -234060 250191 28936 -154560 137269 -299674 -79135 -151605 -17547 172397 97959
20239 97959 134832 -187858 80256 -114737 4359 -54522 6073 -5592 105933 71614 -47716 -161850
20227 -161850 118752 -68913 147431 21224 99976 196573 232663 147695 -49236 156340 -54995
20215 61743 10323 6561 85266 55418 56810 66972 -267527 -186027 82038 -135115 -138525 175056
20202 -139879 75696 -163631 31004 29063 45568 -103401 188068 261591 320732 217851 -100227
20190 -16291 -87890 -126574 -220702 75412 -224164 -3955 -19632 -442289 72929 154696 299455
20179 299455 -37892 94454 100987 -211988 40481 -58676 -139440 247082 -137159 -138579 -139554 203757
20166 155844 170617 30414 101095 44039 -105896 162431 155833 -59275 2215 -157546 145300
20154 -97372 -328746 -252305 213562 -35417 367827 -4106 218419 194230 418549 795977 184183
20142 -84559 397097 179807 213054 427068 776566 442139 -83560 244951 23865 257398
20132 257398 -26153 -216109 -175022 235324 -531144 -188959 179988 262645 -48612 52506
20121 24029 -85825 -124264 16708 -43281 -3877 -37343 -48406 -261612 59167 33657 271693
20110 271693 -115728 135901 -57745 -105347 -492396 -34222 -29312 -61464 -378322 43343 121599
20099 121599 -271926 -200292 -181850 -91956 -323547 85476 184286 -179477 -167049 -224927 -89916
20087 -181593 -228871 -36244 -131633 -141639 -145220 -156156 23996 -305171 -69133 -239575 134369
20075 -271779 -74637 228940 -331658 -180328 -291549 -93755 66209 210544 77710 11847
20064 13625 -261881 -115336 -37252 219479 -71334 -116253 122873 -35546 103939 -88047 -67329
20053 -67329 126701 -44579 -27603 -136545 67663 -138735 -164257 28555 -43842 -278907 -82325
20041 75938 18122 -112060 -57393 -191797 32991 -209589 11903 -39616 -182268 -79638 330336
20029 21031 41075 59145 54812 -53846 26198 -74951 -66671 91985 -46263 -200496 -58565 202843
20016 299951 -82975 -177720 74981 206324 34981 -88306 -103017 -350011 -175701 -61010 192334
20004 167927 156116 -79887 -249625 -198590 297210 32823 -148627 -203640 549674 370631
19994 370631 214510 189411 129194 15478 23684 -102910 500486 116945 31776 234517 16822
19982 220473 141958 -25509 23235 -242412 153864 -293680 -356471 -13523 -415864 -32449 -98307
19971 -98307 47881 -86684 38136 -42701 -227029 -309739 70104 26783 -113115 491566 214926
19959 256680 149897 223359 -312640 7754 101363 389774 -63792 132536 149347 -144727 -11663
19947 150489 -64853 85987 -70769 -33666 117435 67768 -21306 -293491 -237012 -312131 -38645
19935 18756 -250870 276080 -261880 -189629 -90506 -115876 -2498 -113449 -59973 -137000 -107125
19924 -107125 -230303 5066 26875 -342926 -219888 -145528 265848 -49003 -63569 -350778 129447
19912 46476 106368 77662 -367826 -96930 23576 -437818 67517 -58068 98996 -4687 -309712
19901 -309712 -130842 314638 -313283 -16938 -90657 10422 98667 129343 -133807 -230937 -84192
19889 144057 -305974 63972 126201 -161357 -75917 -77883 221223 44513 -380052 16425 39679
19878 39679 -78735 260378 -45294 -77104 -99186 -301367 -507022 -101340 40432 232450 27979
19866 -57404 -64493 346649 60320 -184988 -131819 -297544 -137042 -55563 -203962 -168362 -5200
19854 -227527 -7568 80332 95903 66647 241737 215784 -9420 209028 -137994 55594 9013
19842 -123576 -181812 57262 -111257 4229 -85336 -239207 -19778 -202165 -240102 -249807 -392910
19831 -392910 -207555 100460 -274347 3802 232993 -150679 -268164 46282 -165829 -13651
19820 -85845 136946 -117727 17262 -2566 -357585 -203994 -192873 -88796 -146112 -188577 -90334
19808 16613 -100066 112953 -252977 -236619 -26022 -216786 100082 80276 -108097 154079
19797 169571 -97531 193596 -175319 11485 -130715 -147763 -122475 -295306 -49368 -317573
19787 -317573 -240197 -165228 -38714 -218308 -5088 101911 327884 -57871 -166843 -332900 -356844
19776 -356844 170468 132155 15732 226089 -239518 -233407 96433 158043 123044 -295689 141329
19764 -81106 97475 20858 -164705 -159054 -154564 73084 194284 -452016 -280716 -153968 65288
19752 84651 193351 -128779 139787 69117 -485986 148640 74632 157972 9514 155829 -113065
19740 18046 191526 153356 29408 72591 -26894 128382 -140204 -139379 203018 242976 558742
19729 558742 473356 545934 615762 467323 255135 -129092 279542 64726 137499 196686 -180801
19717 -173037 102754 49355 24002 -99709 -59726 -129110 -315358 45965 114277 156087 14259
19705 -16834 -75032 -97185 210387 56191 1311 130267 -155174 -25244 291757 486126 636050
19694 636050 753725 446268 58961 -87474 -241813 -199683 -185622 -97424 217410 -229397
19683 -27363 74401 -23828 -306109 -253619 264715 371053 -76849 144700 -194053 -52934 6841
19671 -128645 -206871 15491 12069 140247 -271336 60764 61333 -267689 221621 -193107 207130
19659 -166966 -329545 110634 -163481 325013 -163809 -113718 -66025 -42847 -205229 64876
19648 -43203 -48601 47167 -341456 -155037 -51829 -63007 -384457 -193357 -77505 -74286 -300762
19637 -300762 -138951 -213152 -39415 31069 -155480 -84404 -404928 -232503 -37565 26638 -149904
19625 26131 -31574 -101384 -129435 415375 -440076 99631 179365 58177 -267648 -218413 -129791
19614 -129791 95985 15532 21231 -124682 -263123 -180424 -235226 -359538 -123867 127400 -239318
19602 4366 33498 -470695 -240279 -117854 224911 191734 8781 -31715 405698 -68703 6909
19590 -345591 165008 -79734 -404011 -49820 -268865 -63870 137641 -36826 -379302 -164811
19579 -217315 63130 -73666 -111799 -196542 -87282 -224980 -234880 -228872 -326067 -207816 -374589
19568 -374589 -333645 -170944 -119724 -97628 287728 -183311 49081 -36324 -28816 -167221 -144813
19557 -144813 -101286 -93656 -365682 -27336 -297100 179931 42374 59913 -253941 -276984 -203937
19546 -203937 244538 -245509 135315 -16407 -12751 -85785 43598 -190255 33435 94896 83589
19535 83589 -235658 -109852 -64646 -198737 30869 98499 -23159 -338581 63019 49709 96520
19524 96520 -386442 67881 68232 -5428 -99513 -285981 -58124 -58035 -250894 6981 110745 -209133
19511 -256184 -251731 -111163 -197677 -53877 -99815 -433835 -122277 -310290 55233 10517 -318478
19499 -579018 31876 -23342 7049 -186755 -34945 -200827 -108314 149809 22165 -129505 -9371
19487 -147430 88065 264169 -6673 -56700 45746 5593 72531 -12478 -92641 -339953 -64705
19475 251605 -401507 -46428 -314835 196626 -56481 -200930 55654 -169997 334566 36307
19464 -139222 292377 -118850 -110900 60954 -93798 -284189 266509 -366762 -245877 -83470
19453 262738 -276620 172174 34354 99381 -76866 -38075 13531 -390136 -325589 -24916 -263874
19442 -263874 -36631 62043 -142824 -50596 13217 247917 -192872 175138 65164 -25290 -129901
19431 -129901 56010 -80164 172836 -277710 -235456 190046 99805 -226948 -281480 -134293
19420 -229347 -331 29479 -169680 155565 -242431 -163645 -168502 -194981 30789 -49221 -248438
19409 -248438 92358 -383646 86083 121429 37369 180834 -219594 -55956 -130282 9505 -6743
19397 -420296 67373 -137573 -292733 28786 -100315 -67353 124403 -54097 -25749 129292
19386 -304423 -192496 102528 393 -85368 -149916 -143420 4256 -213534 13374 -229170 -16385
19374 41339 -84444 -72725 -91310 109716 134064 263803 -36474 -228692 -130138 20372 -13687
19362 98184 -30296 -122315 -151136 -61576 28602 -341246 -300945 81148 61288 -116372 154404
19350 46275 -165592 -293337 -216962 -163122 141860 -348070 -177549 20322 119142 66819 75762
19339 75762 -370933 -81468 -14013 324723 -106720 -66170 198334 -182716 -15528 178047
19328 -112048 -34421 -23361 106948 -63453 -202014 29215 160984 -148530 118477 -155611
19317 -106178 -22363 144086 -105249 182541 -281696 39301 103798 -142447 -325854 -127965
19306 -283145 -213029 57637 -206872 -280406 -31709 180010 176846 -262255 -119767 -48686 -408882
19295 -408882 13475 -182879 -395715 23099 125259 -145757 -163135 266452 175978 -157944
19284 -56507 42154 -291407 -172409 -290690 -94407 -100288 -267169 -492527 -47008 -1421 -205726
19273 -205726 113938 340188 -302728 95134 55324 -69220 24778 -205455 -246286 58681 -170074
19261 -289977 -135884 -70259 -363210 -193322 -258899 -343479 -103408 -28608 -103083 -89296 -231769
19250 -231769 -134705 -173365 94627 -51226 -2017 3372 -245126 -344852 -91453 -67470 -24377 -36078
19238 -36078 -51004 -29454 31956 -137915 -227560 -118292 176067 137660 -77395 -355563 -10710
19226 -227261 200110 -115508 -37630 -199981 -62361 -247827 1997 201994 -37438 155501
19215 -222872 238642 -134665 -43419 -38854 -260014 -231311 -177293 -311345 85977 -10285 -55252
19204 -55252 -60740 -249005 -237124 75300 15400 -129127 22443 142287 15857 -223603 -39942
19192 43254 -16273 -250025 -374100 24079 -196786 -258830 -297358 -358052 -206956 -439583 -70770
19180 212495 -267660 181822 26699 -198063 -62051 -117080 96624 25406 6900 -214515 53037
19168 357082 -242261 -49953 259465 -194585 -260963 12904 -130485 -275941 54856 -127981
19157 25539 -137549 110907 14815 -78376 60820 -141407 194787 60898 -25035 61693 -192666
19145 -88714 36225 -36672 -163235 -47067 -109976 -39396 170962 279087 -237682 128631 -142267
19133 -159787 58716 56809 -161758 -308302 -45401 228826 -122166 56803 -167578 76825 37027
19121 -381890 -134220 249020 -70810 -79775 136963 -75664 -123401 -103150 174339 -116622 118547
19109 208256 -127867 -29446 233677 -156479 -289814 -171250 94760 33044 -259861 -27763
19098 93779 52568 -327834 -89039 -8086 -28126 122677 196356 278716 -139247 -161796 50677
19086 -355062 -215412 -374268 117258 -255843 -139069 284080 125777 -75298 -73600 143775
19075 -78669 70683 75107 89373 248688 308454 228731 65434 -173539 123737 -84804 -38255
19063 -81896 136642 -234302 -185819 55376 -132151 -195595 -37161 -59962 -14864 11930 128005
19052 128005 4501 -30355 -196645 -369151 38163 172215 -495584 -19433 -243045 -342968 -74489
19040 -49193 10659 -110143 -244353 -31776 -273966 -44866 -61637 -118540 -161224 -122608 19227
19028 66997 23270 169056 246674 -84287 -105469 203024 -335892 -22952 151132 223125 105919
19016 -122141 99939 -97126 72159 101154 2712 104610 -91632 136653 -57941 -27354 -1304
19004 -247574 -68795 283598 95051 -40775 67042 -110673 -46434 -168747 -268186 173161 -13100
18992 -125752 355793 -8500 100011 114516 180551 -119386 -414796 -161739 143767 300304
18982 300304 -626961 -201504 -203125 -278640 -123937 -156948 -121301 121262 -154141 12659 297478
18971 297478 226580 292087 883101 127520 -145384 103887 180176 202835 -159401 64640
18960 122063 76854 257428 47313 -60419 -98295 -327353 128508 54290 -228479 -59454 155442
18948 -200616 91817 68506 -380273 -167206 -207732 -144563 53095 73451 -210671 69466 -11121
18936 154581 -127205 456811 218872 418442 -60244 171073 90268 -283103 -329327 -17867
18925 -336250 -159050 60222 -124851 -441831 60573 -345494 -65573 -96194 -142718 199063
18914 -38448 -297433 -53478 317926 176151 -74624 135816 439293 461732 416560 33370 98781
18903 98781 -68096 -13255 -204692 -87955 266644 530776 -30694 152226 -418703 -306304
18893 -306304 -83168 -70625 -145729 102954 -74866 -448708 -31321 127689 -117151 -387699
18883 -387699 127687 -109623 -17936 -251113 -63782 39539 -332515 -326441 -175682 -483327
18873 -483327 -125685 -229791 51317 -161990 -17975 167879 -295089 -35898 325733 -322772
18862 193566 -141239 -13671 -107228 94083 -6527 -102340 -81741 -348882 139525 -25106 -30431
18851 -30431 -33314 -412880 7426 8411 -118001 125202 107914 -310522 -25700 -244129 -352638
18840 -352638 -172281 24239 -43556 -268204 -347785 -239223 145092 369393 -118750 -116377
18830 -116377 176021 -179998 -71607 -116884 266724 -15852 -183111 101331 72132 -6043 -33462
18819 -33462 307594 -32356 152429 -117472 56344 238976 -30103 -65616 39926 -193098 115124
18807 129570 157299 360263 -217188 198330 -190469 236264 -355327 -282160 67364 189233
18797 189233 -33088 45369 88810 -63985 220494 148818 -498467 -415345 55861 -116893 -70710
18786 -70710 161433 -231054 -511894 -109129 -8610 -246197 -54231 247948 -34445 -142038
18776 -142038 -6947 86936 -250065 -165972 102937 -212255 -521709 10052 16067 -45138 2158
18764 -32626 -77443 -530984 -80212 58083 -124540 -34041 -152828 -214282 194000 313349 -263113
18752 338875 -117723 -293802 -40891 -188538 12813 -111862 -197942 -190925 -89515 -48243 188411
18740 -228063 295763 135347 -94162 225176 -104598 -55275 94176 -38 -71622 6332 -103112
18728 -369950 -114392 21472 -199635 -245399 -327105 194870 92566 -42670 102227 -149290
18717 -33062 -26539 42649 -14755 -157998 -33958 -152039 -231146 95073 -59531 -98426 -41400
18705 -35472 112460 -156786 -27263 61218 -148909 -220299 -257425 -368677 123868 28847 4619
18693 -387507 -32794 1399 -279821 -58757 10276 -28128 9709 275778 -41726 -74298 -242954
18682 -242954 131891 62033 -50890 -43563 -79926 157517 -245834 113354 133798 -15056 -15127
18671 -15127 -61008 -77730 9270 199129 -78050 -507112 146359 116625 21189 21233 -298501 -139561
18658 122993 -115863 -139516 -181469 8332 335373 161089 -72378 272308 -114441 -134596 -67637
18647 -67637 47500 115725 -263443 58229 13890 -118588 -142758 -258825 -56153 -195450 -340009
18636 -340009 -49926 -257054 -192769 67087 -202334 -215585 59696 114143 -47343 -133205 -439578
18625 -439578 22694 -176137 -172025 78382 68340 2935 -60008 -130061 -12310 -10121 -336175 -195656
18613 -195656 -278099 -2801 -226357 136572 -236520 -43564 -111082 -250707 -95009 239974 150474
18602 150474 -154467 133032 -263671 95250 -109772 68465 96624 -263649 205582 73965
18591 -218695 -175304 -57762 -198946 300926 -116705 29793 367250 22435 -270982 79675
18580 -231231 -45983 -35577 98095 -335060 374310 -44528 51282 -279641 15477 -416583 -8683
18568 87880 -127778 115378 -212161 48034 24475 -150103 -234662 75291 225792 -121625
18557 100973 -470566 -51976 -248206 70660 -483226 -5915 -115932 -116287 -177398 -31801 10926
18545 313850 105462 -68934 -291111 -15333 18856 -118688 220434 -155374 -73216 8134 -154567
18533 -266913 -367236 228229 158334 16780 126563 168609 -402849 137819 -9779 62781 -32300
18521 5753 -112770 -73896 73898 -50207 -422102 -157304 -30332 -156357 246272 -128288 -227158
18510 -227158 6717 -12803 -266225 -15371 -312658 -29892 -225491 104495 -270473 5074 -37958
18498 -175084 16054 160919 640 -70955 64781 223849 25287 -197106 -273169 216871 -13497
18486 -88666 -43262 93769 167798 142730 -159626 -20836 -343814 35659 128318 -78897 -202307
18475 -202307 74050 -248558 39919 11120 -231557 -191618 -66291 183000 -252416 -308466 36701
18463 -65932 -85612 59951 -101232 -143774 -140758 -25557 -135953 308765 -406147 88507 180024
18452 180024 -293067 -221106 128726 -264738 -59995 -87156 83553 -259258 -96114 -44441 95839
18440 -229849 -150147 -134784 -220443 -199771 176284 -40335 183592 -135127 -28743 161113 17033
18428 -170689 -351746 -22001 -413332 -42575 -47475 -147683 114194 -87824 119800 305623
18418 305623 35898 -1958 -52083 -224659 -246843 -101300 -301290 -1859 -15206 5946 331231
18407 331231 -44835 -122196 297829 248538 -199856 51598 114216 28310 -146356 155691 -155424
18395 -36993 -45568 -194612 163844 -87800 -168389 180416 -70965 -264648 55279 12447 -165484
18383 -120860 158487 -40519 -23124 51471 224646 -118164 118174 137079 158464 -31978 -13333
18371 126987 53481 -258318 27459 12359 209254 -5340 21520 157803 192273 228890 121427
18360 121427 -175008 -425470 -260081 -85389 80308 222725 29196 22201 81507 -301666 -86728
18348 -260848 -364220 122993 -204522 300554 -124519 50554 -115058 -122442 -120494 -78822 35106
18336 -187689 -351885 -94878 -155449 -105033 -174274 136958 2359 457924 -5721 -45300 80162
18324 -85282 -622293 24840 179813 17117 -8419 -303020 30052 -512914 -97092 -22723 51868
18312 105560 -18399 -143098 -156668 -163339 284481 -104221 349973 -69597 -255442 229677
18301 -114205 74218 -74046 404412 -86717 -167010 -150227 -84759 -193906 -62593 -334592 -425631
18290 -425631 204396 -153901 45426 -208594 -167107 -65593 -256415 -43011 123793 -217090
18279 71912 -179717 -124162 -209453 242073 74904 -72161 -256067 51914 -175683 73948 165658
18268 165658 -135080 199061 15117 -530424 387593 136202 90054 2451 98027 127513 3222
18256 -102375 2964 120978 -375615 4159 37079 -107307 7251 112794 39414 -150575 -134545
18245 -134545 62756 12323 115889 -57278 -212482 -493199 -291143 214091 -32376 -224639
18235 -224639 15213 226066 -62177 98948 -261249 8906 4727 -72321 -246750 106070 -52242
18223 -82899 128170 -18045 -32273 145198 134917 131741 193620 26272 -360300 -55049 -68315
18212 -68315 -21130 109279 -111164 -8463 -121486 -383705 166342 -141479 -249092 458236
18201 -166516 -192013 -64369 -91938 5021 -12728 -179581 229659 -81073 -66273 -4695 -136921
18190 -136921 -31743 65779 132823 69883 231453 99883 119514 -149253 -271407 -104686 80568
18178 178354 -99434 33723 -30137 -28471 -33651 97108 -409916 239587 215163 42290 -244825
18166 -199511 -142634 136813 30422 249338 -244521 501052 315540 179098 37427 -59935
18155 -107281 143876 19413 -81248 -9728 102701 -16517 135936 -67376 -61967 -377154 -57338
18143 211373 77402 5979 -195422 9684 -8890 -45506 58224 20250 -116606 -51128 17180 -14827
18130 -241926 -71860 68843 -217249 74440 -251576 -94144 160743 -524832 -95667 295291
18119 -159292 46122 261964 212639 -127297 204886 -156087 39482 118162 -313586 -273528
18109 -273528 -89200 28583 -44610 -19817 133042 40327 -278404 -82928 14229 -21069 -335833
18098 -335833 166184 27196 -98710 -81548 -110082 -182910 -86414 1012 160230 -26191 -51815
18087 -51815 -297032 -3 283455 -109576 185245 190865 -123669 118206 -33811 -163387 -192837
18076 -192837 -13848 86649 -382173 47628 51435 -247480 -248549 40714 -151486 -95938 -70765
18065 -70765 44084 -199290 -122860 9353 -154525 -27870 176088 6457 -31366 -152602 66944
18053 -159932 -21042 -329478 -437266 -43662 -15700 2795 -94344 252220 -114375 285959 145002
18042 145002 -1694 175065 -87731 187937 499729 -88375 392240 -253104 96419 -117504
18031 75442 207621 121804 195685 -225402 129778 163146 -194800 -252482 129223 121924 112421
18020 112421 -76368 -9453 -301671 -196326 317565 -134592 13153 75972 14133 -47468 303584
18008 58522 -19530 -222434 203625 294071 113570 54926 -225319 99010 -111155 65451 78273
17997 78273 222182 23728 -42726 -289336 45801 67571 147217 55230 -444335 -94560 -260972
17986 -260972 -331036 23898 -178987 -5359 741611 36334 -145925 -111908 -221564 38077 267283
17975 267283 60896 460932 -275592 -134690 -201284 -4790 17788 269209 160241 -142437
17964 28647 -35141 -476359 -57008 31533 -29549 211902 -141248 345307 12422 -90758 244237
17952 61676 -406191 -151834 29838 9495 -5404 -151183 363772 162305 -4766 -34863 -291803
17941 -291803 201755 17625 -31995 -127126 -96294 -162436 190897 -134852 -62408 -84042 -44403
17930 -44403 2292 -126056 -153436 15998 -131490 330187 8883 218093 -182649 -45467 -291560
17919 -291560 42333 30842 18719 244407 77947 -122983 -13057 93735 -88346 22690 305956
17908 305956 303118 -266962 40270 193939 313607 -82598 -11025 -34789 -90263 208103 273850
17897 273850 231180 -266749 -168892 415296 -104762 142916 192213 93926 -52798 -60191 158690
17885 214298 -159313 104257 185741 -161220 170945 -72980 -53652 -198417 54911 -104729
17874 269349 63323 -310081 -183240 80110 -154739 -42112 214077 108077 77924 -386279
17863 4347 302708 246051 21077 -154004 90812 224344 -133718 132495 174910 145252 -184810
17851 351915 73341 -141991 -145800 183636 -109245 -15644 108616 -59121 -37983 126723 -13008
17839 -124920 361791 -335587 138130 -215968 -20215 89530 -151133 298335 -143225 -69247
17828 323007 358998 130566 52350 22080 274211 22812 240020 -105054 -85696 313384
17817 143697 48440 116649 179895 -317739 -66152 -83210 176502 150618 -90898 428267 497437
17806 497437 83966 -207573 260169 -252540 286113 15834 439574 110581 354583 -2816
17795 22287 10226 -203568 295775 102236 -72339 63219 129675 -3600 111592 -48373 116895
17783 114551 -189680 -101032 -16647 -56374 -145184 3252 -82049 1813 -20475 47333 782 28070
17771 28070 71959 195405 75498 144906 54779 148901 439344 244511 30824 78111 50726
17760 50726 -49358 -77185 -60259 195400 17411 190270 -131771 -24065 -47240 136783 357983
17749 357983 114376 84825 -272452 398644 183049 -60870 -19440 254662 38121 -95667
17738 154419 207821 -157143 -108594 293242 118279 64292 245397 -31749 -77717 -296420
17728 -296420 96874 33109 370623 59370 -122873 232082 -83916 51220 -51381 313584 45423
17716 -27522 185032 11676 -45566 -168193 -76661 -33595 -79235 5683 406208 245565 89071
17704 69992 -86785 101141 42597 173821 21871 226768 -138432 -362249 36548 -291422
17693 -263040 68161 243237 66270 277733 -240283 458938 7689 -10715 199337 -7361 -51403
17682 -51403 360290 1772 -69645 -13532 128918 105141 157053 -333916 113987 242452 32250
17670 -7207 -35899 700 209675 97167 -301275 207189 55728 17483 -7062 127254 -101858
17658 9645 281036 -151878 22056 61948 167749 201064 184147 -227286 -150655 130355 213924
17647 213924 272874 124436 82921 283726 239264 135870 -82402 84768 217043 323602
17637 323602 195756 163757 262886 444215 -53946 173384 397977 341877 -5669 201949 -124422
17625 -18668 -151646 361743 231774 232700 299655 512587 204706 -22717 447961 183360 254568
17614 254568 35605 392150 143823 75128 115849 123137 198316 55748 95123 80831 62282
17603 62282 330005 -18111 -84290 78581 249532 221838 374497 -57324 150721 -98650 325517
17591 370527 -88805 234345 190669 -108874 203876 -154685 133903 92065 -357947 -10257
17580 181578 63309 -37534 97271 491268 317764 142512 226784 366971 -156209 332707
17569 -33892 182946 -298741 181530 229517 30013 -94778 165153 107321 85866 -242726 12571
17557 71656 -153394 286987 365692 121159 18925 68663 148630 -47885 159331 -44764 138535
17545 149406 120370 155768 490695 234521 336799 38360 258024 93576 -16104 232166
17534 416794 390442 182945 -15364 132603 349095 599517 216670 531809 766014 818661
17524 818661 994440 1144446 912728 1006954 690128 498097 486857 541899 463280 285470
17514 285470 91333 472144 299888 501402 717410 933221 1098481 1111061 944214 862546
17504 862546 491527 483051 508712 373717 372055 297297 355228 314534 467909 210899 279103
17493 279103 276242 255853 104854 255245 410830 62433 217731 107277 316433 509598
17483 509598 101123 313530 93952 269157 291788 387113 200597 277558 280584 288316 193963
17472 193963 373361 220915 271260 391642 577398 344141 464212 228992 708389 292112
17461 412591 269998 236257 38086 157214 349842 466053 443766 128058 374774 -247987
17450 226354 12901 -19659 489229 201418 571813 669772 169033 427301 391378 72354
17439 398123 451721 209972 240895 571877 366847 79187 418669 216705 259638 659217
17429 659217 565115 365299 440058 310523 640544 225076 273525 516629 587089 622324
17419 622324 576658 226265 321141 253636 290271 314333 652143 641678 466263 521867 566670
17408 566670 101646 424460 46932 -326671 236225 -73636 316158 399469 -171717 251848
17397 360808 53222 556385 152261 160239 182817 550359 240308 88840 380393 265661
17387 265661 253273 226177 42042 -11998 101198 256779 1095 373176 125169 242058 -214242
17375 106633 93625 238107 301259 71347 490312 -85677 363289 86214 149878 -32453 91021
17363 142689 -202565 84064 111278 206206 244459 307028 5275 388203 604576 283317 554798
17352 554798 -80987 -18976 412715 298471 265601 1201 463501 419339 78358 116250 345591
17341 345591 714425 309726 148239 -16481 106547 263786 67572 183921 -11303 140311
17330 424431 274224 227154 -23673 230713 266274 491663 143325 146141 173227 169627 491040
17319 491040 206529 463139 210073 213013 390554 318888 349136 -70735 291531 169771
17309 169771 338844 281130 179244 185036 422510 469927 454513 150491 96779 -14897 307645
17297 27467 380323 439751 492566 426155 183624 197586 507809 -7819 36537 70872 204697
17286 204697 156809 234313 543826 99090 550233 410896 509731 492713 176521 96627 289008
17275 289008 266775 369928 68343 -85663 333068 90062 178608 -31801 584241 303837 105269
17263 74418 70221 418932 385645 293193 -153391 625319 90832 222235 447473 2213 347043
17252 347043 589321 -120628 417186 490567 617727 225475 192688 432108 231961 685981
17242 685981 352675 233847 706638 448200 388951 240352 588650 62849 240434 263103
17232 263103 155615 116093 30873 65372 329115 240520 -51163 346579 284188 388049 90698
17220 153394 66314 424008 403568 351384 586086 487191 183248 358654 273436 15648 429985
17209 429985 304523 360842 468369 227179 247655 3252 167654 463931 184291 462871
17199 462871 738887 56568 356933 431437 223623 68564 358111 275987 445888 475877
17189 475877 336418 383640 387831 262675 470691 531504 464733 628625 335350 11790 553582
17178 553582 536371 187983 135821 532572 595610 708607 458203 654001 514980 238776
17167 408000 508429 698713 592303 559460 666490 330277 520399 368264 371126 594402
17157 594402 216743 634356 335686 398031 421407 753348 455151 499684 296379 21947
17146 472870 361200 478562 354964 314886 581045 852711 241577 570896 526923 701865
17136 701865 648572 614496 380155 442776 374493 639986 527834 636132 372575 405452
17126 405452 546967 626371 686807 830157 944596 664206 600632 637970 567773 441982
17116 441982 901755 899564 507844 535261 482194 619472 481017 719190 749786 893156
17106 893156 368962 687496 649401 809869 610797 815461 348686 863065 501568 680658
17096 680658 592546 927515 813914 464231 742316 530756 562386 663915 660320 276154
17085 512549 582674 560979 487092 433972 551359 966291 696234 390586 545900 707363
17075 707363 509904 853589 738169 598657 612566 481401 765964 669377 642806 1173419
17065 1173419 817876 709318 718167 732330 1001460 889948 666255 941340 676672 990109
17055 990109 883694 852052 385319 751331 980116 843448 836014 974416 903772 943763
17045 943763 1059952 630094 641880 885955 1008835 765827 861045 1021784 913089 955432
17035 955432 829305 1067720 894917 1086918 1055567 934091 866794 818555 1113127 1202002
17025 1202002 1064339 721812 1005535 1256034 839603 938282 1213692 767239 936950 1214316
17015 1214316 1113590 935839 784180 909332 1152748 1228630 1176011 975755 1057265 1091978
17005 1091978 1073745 1279085 1075208 902908 1381577 1347031 1102284 1054972 1543779 1418267
16995 1418267 1063215 1190122 1334399 1250183 1251184 1276659 1388921 1219583 1162918 1001153
16985 1001153 1487108 1590822 1544066 1276742 1203193 1490420 1441699 1461625 1404158 1383669
16975 1383669 1533402 1556196 1534061 1415034 1410654 1338995 1641319 1214126 1505335 1437380
16965 1437380 1652498 1218911 1338877 1542505 1257422 1764397 1612851 1945857 1719096
16956 1719096 1920049 1404151 1392309 1912685 1562062 1868777 1651137 1903984 1687152 1807343
16946 1807343 1405253 2195838 1981944 1630033 2289439 1654287 2083972 1920693 1968262 2036365
16936 2036365 1841570 1753675 2273800 2186395 2108047 1456781 2078803 1811818 2123345 1805166
16926 1805166 2088158 2190265 2116717 1892446 2122400 2447363 2327782 2272077 1880525 2000443
16916 2000443 2186660 2272942 2163663 2370941 2630452 2186703 2528693 2662478 2555232 2789944
16906 2789944 2686711 2310539 2279660 2442969 2695590 2673847 3037752 2943749 2806357 2895757
16896 2895757 2974055 2835566 2896742 2534426 3215225 3243345 2818266 3080843 3309196 2951375
16886 2951375 3404013 3214611 3302208 3286977 3185093 3386866 3706640 3537854 3794434 3305028
16876 3305028 3715315 3644574 3760001 3465907 4121700 3898221 3661014 3953523 3981335 4043341
16866 4043341 4198663 4153257 4318330 4690792 4076210 4497288 4744929 4482637 4473036 4486797
16856 4486797 4769847 4695401 4822261 5137189 4974811 5064743 5301109 5372315 5193707 5291399
16846 5291399 5312515 5488949 5522725 5940000 5905085 5839686 5980429 6234505 5975269 6219537
16836 6219537 6386379 6579243 6334674 6835684 6642050 6936759 7378698 7127645 7462758
16827 7462758 7443433 7606123 7402074 8149036 8028533 8561148 8141305 8443517 8621312 8636120
16817 8636120 9291420 9299080 8962408 9442610 9584417 9549738 10211882 10129060 10275730 10661386
16807 10661386 10673811 11041619 11433386 11486387 11941466 12018136 12455793 12962891 12803585 13344510
16797 13344510 13699089 14199311 14376139 14411140 14885638 15273427 15810799 15900696 16617669 16774888
16787 16774888 17156783 17740447 18474854 18744764 19401090 19626671 20543855 20771259 21601777
16778 21601777 22329342 22751237 23376372 23981438 24846690 25647941 26484965 27640881 28098077
16769 28098077 28933208 30041761 30807246 32102660 33048712 33761142 35290427 36501831 37622321
16760 37622321 38913711 40757277 41977016 43391468 45258398 46855059 48263888 50548745
16752 50548745 51763866 53833292 56091930 58080775 60520385 62774509 65260611 67926702
16744 67926702 70239424 73201639 76055895 78469276 81358722 84607201 87737783 90549903
16736 90549903 94011676 96854347 100397325 103330971 106332318 109634715 112591246 114914952
16728 114914952 117568634 119897007 122191220 123981690 125454926 126971368 127460887 127845485
16720 127845485 128599364 127900861 127847525 126807575 125285466 123856482 122086371 119598048
16712 119598048 117584265 114967751 112319099 109332244 105872148 103019506 99946307 96767364
16704 96767364 93448966 90214535 87552102 84125926 80648027 78263833 74892119 72322022
16696 72322022 69241959 67034043 64649879 62062777 59638904 57162610 55202345 52935349
16688 52935349 50837295 48817963 47444445 45387949 43701711 42010328 40623941 39125056
16680 39125056 37859076 36359757 35470211 34177334 32783608 31818578 30799172 29684689
16672 29684689 28643184 27822384 26813405 26058566 25567348 24442667 24140935 23226477 22617660
16663 22617660 22090780 21150943 20455058 19894658 19279409 18804861 18390058 17882172 17246504
16654 17246504 17209819 16705616 15901103 15538122 15124707 15060910 14252639 14127447 13878290 13534390
16644 13534390 13161798 12733773 12243755 12377766 11875531 11797038 11276910 11119709 10583999
16635 10583999 10825274 10191353 10177433 10037997 9607899 9853624 9666828 8911698 8842931 8945563
16625 8945563 8528204 8280681 8302501 8326810 8150610 8047567 7855717 7603738 7508748 7271594
16615 7271594 7171620 6948598 6844788 6864749 6684547 6911985 6455406 6318312 5826525 5920752
16605 5920752 6233063 6012469 5688101 5527220 5743061 5190081 5936384 5407591 5370606 5104676
16595 5104676 5282403 4806173 4946976 4906535 4867344 4574570 5070588 4672372 4445380 4402576
16585 4402576 4424699 4257687 4183821 4217428 3776028 3867923 3904973 4064568 4093318 3828664
16575 3828664 3682629 3677849 3902242 3593907 3574240 3630988 3503281 3178539 3456621 3114714
16565 3114714 3457439 3198153 3300467 3212592 3419012 3035589 3087507 3319804 2785933 2887466
16555 2887466 2939485 2822121 2909281 2834234 2944583 2728180 3000599 2875400 2554664 2817100
16545 2817100 2492664 2533558 2799606 2738819 2460105 2349002 2459473 2406788 2318782 2416570
16535 2416570 2378974 2321096 2030710 2439728 1849565 2112420 2236053 1921994 1965719 2187446
16525 2187446 2062635 1803328 2085307 2385413 2314502 2084776 1830440 1753571 1955204 1793994
16515 1793994 1790973 1806933 1694298 1893969 1730355 1869234 1831481 1602759 1738265 1897619
16505 1897619 1681463 1486145 1511194 1711884 1431084 1408176 1558390 1599403 1770710 1241382
16495 1241382 1603602 1863472 1676873 1653793 1741388 1497978 1739484 1185271 1741001 1463278
16485 1463278 1536407 1494852 1521915 1264897 1575984 1616804 1514137 1350832 1047431 1279442
16475 1279442 1570430 1430777 1243261 1231543 1274866 1033842 1315543 1219053 1319834 1252741
16465 1252741 1153233 1172302 1290380 1167096 1144526 1333536 1157403 1051935 887811 1039515
16455 1039515 1109529 1173374 1098139 787250 1065458 1162365 1147691 963466 1260123 1177850
16445 1177850 604668 986111 1107425 789392 568356 868533 929665 961667 764923 973262
16435 973262 1059210 918183 1063837 711330 888122 1127209 969421 641805 752652 920580
16425 920580 625089 872319 670437 622159 850837 402107 772154 794682 1026925 618730
16415 618730 1023796 752048 710893 684001 819191 733476 747681 890844 570979 705115
16405 705115 1094425 673873 959174 918873 676361 972609 988218 782806 682524 830228
16395 830228 914125 762047 646091 822908 597593 583921 830790 841427 1142595 476472
16384 589031 440419 596995 773925 790753 604599 510174 523644 662324 318307 664839
16374 664839 446980 463634 342537 418409 409618 450353 765464 351016 612092 703621 905730
16363 905730 504936 900810 169351 557045 583171 134149 476187 490308 597450 534394
16353 534394 465643 860430 530109 600824 508630 465181 520607 613040 224361 360982 802012
16342 802012 568102 363355 507991 681346 328928 -56023 388724 712811 611530 635921
16332 635921 402783 382641 406810 495907 442199 493784 620496 580316 -84221 607256 477580
16321 477580 377671 583604 609945 242082 278996 258836 414311 502884 535861 470173 202435
16309 181693 648763 431221 338186 126974 224403 369109 377680 266464 75339 454908
16299 454908 541799 329884 573807 539736 349426 435436 218895 388877 375730 105585
16288 673524 221796 384447 351295 499831 404777 238917 473240 309733 661964 351946
16278 351946 133711 227695 546142 454533 241314 286703 529173 651876 410646 223493
16268 223493 377816 599491 284727 155901 263367 228783 383214 291687 292055 243075 169401
16257 169401 413111 485254 234721 63925 191935 313129 168831 -116037 411935 456203
16247 456203 165693 57655 371647 584235 136074 191507 72821 366892 168633 268167
16237 268167 239644 179143 227342 377400 370168 6252 342172 276189 231780 268695 200710
16226 200710 319924 -72047 -140768 90744 518049 313761 296434 -71470 350530 281284 64872
16214 -24938 -140 288039 373870 385810 529372 330830 160848 258554 -52383 -97038 311356
16202 314861 137035 443725 208682 305681 301330 -40887 650704 99005 329945 97054 225119
16191 225119 190073 115902 45408 183312 70277 42332 189907 439981 405844 568474 -286467
16179 291184 430466 306167 362572 406702 411227 262551 -33579 340486 332573 121479 -62839
16167 66195 301532 -172509 227507 290048 65541 -61086 339165 250949 104847 -538 359045
16155 153319 54215 273528 -195905 188051 358568 57696 -76300 85109 192517 212508
16145 212508 16159 237545 -45361 -94847 113908 279105 181405 153663 -137405 65593 168731
16134 168731 123756 250035 243776 18897 265718 228613 431704 -98277 67380 143103 256403
16123 256403 75924 297805 -116487 191997 47317 -223237 94400 207349 60290 215353
16113 215353 108545 24505 -119755 283944 61681 18710 284308 -43791 175490 -207217
16102 -32319 154618 79906 175701 -8215 -18388 115881 221477 94063 308208 275479 79359
16090 49425 -313594 258053 -77157 48707 209442 -294965 -76618 315670 -28086 82631 128993
16079 128993 7371 245123 84442 -112110 76234 62018 111019 294108 387219 -189414 206581
16067 79832 -79474 237346 -33287 -295682 84990 -15977 188110 -243626 365327 77231 -137296
16055 61094 281630 68925 -120569 -175942 122854 16092 -209785 -127205 -44569 84088 396621
16044 396621 -16944 -96239 123321 121165 14334 -4375 146408 -110244 313782 196175 -16272
16032 -443893 209385 210679 129475 370237 -179351 -224198 281046 -9907 135492 20978 -113726
16020 185863 -29000 308179 37398 294288 -175925 258067 149649 116338 154699 39632
16009 25617 74925 213744 -157305 40642 -115213 127850 19668 -20526 82285 -44886 9796
15997 -13859 158496 515023 -36793 -345572 72635 -242295 -146023 199523 347815 125326
15986 434328 893979 874392 1089595 1487710 1170861 903671 383069 222419 117915 20778
15975 147043 3837 161525 -291408 190172 -85422 45160 -47419 188018 40756 -27535 -114996
15964 -114996 -219426 123241 -241312 -387648 -43416 141300 -69767 239829 306156 -105693
15953 180186 -367581 68875 -72170 267726 -111927 -81857 -126634 -150662 -1929 -48371 -282409
15942 -282409 352481 111692 -127171 146461 -395687 120600 6869 12344 44380 13395 452204
15931 452204 38974 -140297 94291 -444530 -137005 -205089 -89623 -263835 259193 -253798
15920 -4799 -13427 85083 190875 -137038 -188047 -42892 -219945 -129316 6837 190732 19717
15908 330420 -150422 55848 40808 70390 255194 76751 84558 41817 237161 99107 -21682
15896 -9161 47494 46121 -20810 50748 -92108 -132264 106214 -378745 5057 158523 -105851
15884 246475 111478 -11177 12365 -11239 -136141 -292174 -20080 15993 -237410 -152934 -62517
15872 -94839 -116830 -264261 -136050 163863 -21134 141956 -259675 25952 -107991 76596
15861 74513 -121232 -43247 -209748 17579 65757 -991 2130 -253168 386595 93472 87624 -36844
15848 31 -62582 92648 -84177 179518 -118204 -40004 -226068 -96406 -86503 -512536 160010
15836 -269790 79406 -36600 100029 73048 250447 36862 50155 -292640 -279008 -266327 20356
15824 -348874 -241597 375461 230664 95624 158346 110250 187151 135288 127339 190725 230705
15813 230705 -60163 -115222 135015 54555 -251147 -58987 -96976 160227 27972 -303453 -206578
15802 -206578 190446 99467 124400 190895 14634 -295836 -269457 -123864 24221 271749 -7097
15790 -68238 26664 119281 -11730 11793 -226647 -329121 -75990 193239 24854 57120 -231179
15778 180050 427345 -158087 178295 188974 -33209 -156589 -26916 113689 -35236 -60218
15768 -60218 -180643 -239025 80488 -164452 -100386 -219187 149273 -110124 -35786 69873 -66828
15756 290179 197914 -280222 -77485 -195215 190534 -153063 -64108 60928 240481 55750
15745 -84591 -124763 15269 -88032 129155 -30336 -194375 306206 231964 289160 31998 97276
15734 97276 -107451 78500 135805 -296992 -26679 -67487 -24730 -97008 -339690 24456 72333
15723 72333 22833 -180955 -198183 120260 -74549 -73571 343239 -408910 -106569 -145172 64039
15711 -62607 -6360 -218415 -241269 -5740 -209900 -99495 -15598 -250752 -238909 -141747 -237636
15700 -237636 -226308 -251903 33456 10535 -64109 -7405 -123294 -148180 -73702 32424 228234
15689 228234 378721 62173 -244926 -235486 -162127 14898 -56849 -403631 -195119 -89341 150549
15677 -204780 223108 35545 242480 -7482 17799 158607 -146444 -63960 -31076 -95088 84985
15665 74530 -125371 -248503 -139658 80563 -43233 -218065 -21983 10817 54757 -15154 -171170
15654 -171170 -192582 -15612 -225851 -27037 -153033 -52296 221971 142842 9722 -86748 -25131
15642 217170 -474481 -347108 -213987 -222223 -70094 -551910 92942 93130 -115143 236181 201055
15631 201055 -85134 -50478 26449 256575 92448 77548 148954 27752 -120844 -122906 335032
15619 -41424 62060 -153168 -157240 113632 -76279 28477 -407458 -67401 -105774 36843 43123
15608 43123 31595 24655 -128323 -58094 -235470 57368 112434 -280841 -216497 -19715 -97983
15597 -97983 186484 217042 -14067 31439 300491 -485246 194978 91321 -159287 30842 159952
15586 159952 38036 129678 9279 137834 -111535 -59860 -276918 1032 -92817 37875 38853 -93748
15573 165436 -426802 124175 -29280 -88502 -210047 -290745 -12540 -232009 -170698 117041
15562 116835 275236 -244022 -37750 162523 237699 218536 -215252 -124901 -124081 258140 182331
15551 182331 -136408 -253749 -156870 -76517 -39605 -88156 120581 -477907 29094 -63733 -87194
15540 -87194 -12886 258708 -142801 56356 126940 1944 24596 365143 -34124 -19626 -183590
15529 -183590 117392 16809 196851 -156431 167448 18606 -188978 77987 -84056 60761
15518 -18462 110667 154889 214161 -126345 -80209 -320114 114535 223928 -241927 242531
15507 -141009 -129494 450130 12247 120136 108534 118404 7350 309196 352934 239572 353662
15496 353662 -184833 -59543 19570 385088 -113759 23904 77882 -15724 -121473 -179530 -182361
15485 -182361 231785 189721 345305 39376 -122738 -77365 19014 101171 299686 -24550 327110
15473 397664 441748 767294 793656 382556 487046 -1190 94675 -208468 289779 21949 -6305
15461 -44886 364589 -228596 38781 -53713 157214 -299312 125190 -66606 291660 7847 177962
15450 177962 -210160 171877 -126152 -164323 90034 169462 246765 21299 357057 706153
15440 706153 1034523 1083266 996546 862865 633557 180915 21762 -80723 214811 141758
15430 141758 183946 15858 86139 127838 122463 265694 160432 -155992 21762 -126003 -2893
15418 109959 202381 70928 346742 -331534 640 49145 7632 -154369 147062 -63690 161332
15406 -186347 45391 -48215 -168764 -424433 -357291 113155 193121 179857 19028 302146 118075
15394 138786 263051 -205530 100166 -80053 258359 -46025 -2853 63180 3216 -104071 -81793
15383 -81793 130700 110147 188289 -37636 -277068 83780 -46956 181248 196024 252548 155481
15372 155481 135897 42738 104512 240622 -30082 139016 49986 112614 319832 19531 97058
15361 97058 -160106 375787 196064 223427 109557 98411 -53497 40445 -83921 278387 193367
15350 193367 512112 318614 39226 298398 3289 -97514 115853 298906 229425 206475 195687
15339 195687 434839 642237 27272 -57521 23234 181561 80332 102409 146039 535131 654
15327 312145 67083 130944 -248446 -70463 117491 158641 278151 67790 176233 183040 190418
15316 190418 -137331 -122219 91112 302014 280006 111475 97038 88911 -130417 202728 424391
15305 424391 -220595 12488 -184925 96872 150759 168608 -129565 10592 269463 141162
15295 141162 44927 -147538 -119665 148587 90418 26818 -135529 -28256 -176696 241864
15284 88035 117345 263116 373081 105624 -68452 39002 432654 -173960 -232901 -115877
15273 295058 -117727 377269 131466 71596 60375 54768 22827 152267 -75461 -195009 271054
15261 -3749 37753 76616 438412 242514 3553 -39877 149136 -350909 106403 157782 200714
15250 200714 52454 43045 147863 -131545 91702 15469 62729 403186 1105261 1730118 1640226
15239 1640226 1776148 1787288 633329 194810 384282 72365 -98357 7388 107588 -177607
15228 -151242 -27415 -388661 203994 -202292 -158345 212595 -335676 459448 15163 -189978
15217 -198287 247052 -47288 -57228 124975 95553 89954 -226906 -176861 44789 440032 -81786
15205 -218460 85516 148867 -101125 68515 -299272 -48791 243435 -305863 144902 107604
15195 107604 3284 304284 15608 241076 212995 -149797 -211305 -81277 76349 -17826 274585
15183 -132658 41747 101167 358890 471476 6269 -172699 154995 219128 -29652 242073 356697
15172 356697 178192 337475 58437 211410 -106406 411630 -217755 176489 -21889 41883
15161 88364 -138536 249026 -159344 202932 -77249 81443 -190908 -109707 177354 221203
15151 221203 204108 8991 142144 44648 50410 -81454 372762 -41066 -62285 26908 132608
15140 132608 192458 3617 80341 151309 222056 12091 105361 155126 -156739 223464 309065
15129 309065 70013 344714 169420 -36523 -80863 -61561 160310 123553 208631 429721 658489
15118 658489 149337 257872 175400 193318 15319 163159 421248 -44791 -15713 236085
15107 140755 178248 53016 -11201 269771 13347 18858 63233 227813 225462 26833 46695
15096 46695 -106673 167650 95078 -80555 -166366 205975 -24713 -202637 137955 192990 61840
15084 186344 367789 81668 -262522 139713 -122738 211894 78487 -14061 -36698 -96947
15074 -96947 -324961 297212 258257 14900 -267641 -217602 342999 213451 279212 -108811
15063 16592 223550 30048 -186632 59618 297204 290518 528759 3434 239884 392405 155603
15051 -37531 102600 274698 73866 227745 380061 556815 360009 481651 117975 607814
15041 607814 634080 305280 517467 353072 327897 391792 135763 430803 342504 512044
15031 512044 660308 456266 792307 1018848 764441 710162 622295 190259 265707 431659
15021 431659 642455 463575 975656 472203 733322 155593 392441 615114 360900 380639
15011 380639 387185 380804 508775 473968 519275 552019 309119 257355 250257 173798 182911 256218
14999 256218 578189 443798 757569 420324 624521 221970 218981 294525 570308 551248
14989 551248 498485 779012 636506 642236 625634 854440 572667 581628 853737 939701 836179
14978 836179 509700 481604 726988 463685 338552 514807 484928 868348 699312 589623
14968 589623 571722 103400 198727 263999 527879 555488 111667 383870 399818 420862 512664
14957 512664 257194 90686 158103 608284 260393 149183 322854 320207 661307 563137
14947 563137 530128 479690 107585 150904 465045 750078 745272 626080 616812 666166 393012
14936 393012 464601 735826 250177 483453 924373 667969 738132 1234647 1373953 763472
14926 763472 1464970 1480208 1461584 1834410 1224662 1192136 1507706 1497276 1493167 1843152 2463649
14915 2463649 2171099 2084137 1648393 1424710 1258601 1280767 932947 653053 495281 536394
14905 536394 613540 286119 301381 645215 381681 484264 495569 452739 289307 401675
14895 401675 397252 156714 528809 534773 395164 169508 601759 577407 495746 883774 605565
14884 605565 1260667 906579 1121881 813542 852739 778751 976040 965591 826787 722361
14874 722361 527821 640322 303454 500290 318943 577064 695831 467478 561344 719601
14864 719601 723920 614525 802229 836578 466016 715257 330079 375117 531276 96623
14853 496960 260055 607663 393291 365133 213797 546934 489056 587000 370839 553891
14843 553891 470321 1225340 1160111 1261317 1425052 1356149 901580 1001544 798694 706248
14833 706248 589119 566932 395061 465967 314206 567227 578155 553044 562317 499076 324630
14822 324630 658619 551808 443501 591829 589075 684411 821817 852908 478055 565008
14812 565008 562430 574894 643816 457335 494587 878869 513047 913871 957034 1042611 1032944
14801 1032944 1203526 361582 582561 897118 195443 625073 552586 697637 191553 711978
14791 711978 483602 592088 605695 495882 847612 159676 725796 642506 594292 697142
14781 697142 851967 395074 881315 645578 922003 607253 1282114 1100347 784510 1163624
14771 1163624 695953 1066923 786501 637292 701422 668627 564508 699985 647234 552458
14761 552458 681103 759508 704196 132714 602711 558693 688379 734184 818573 547003
14751 547003 987603 683999 703614 839294 469101 521439 459022 547615 664860 678736
14741 678736 768132 911898 518924 495809 711620 567307 903797 706231 1096460 801577
14731 801577 1147816 939944 1334536 1262474 1639221 1997567 1877736 1724130 1394566 1650323
14721 1650323 872423 886659 715877 1100042 1265703 795448 705265 602337 790066 829230
14711 829230 739845 738661 990213 1039047 970421 957338 1185560 1179993 1320951 1263782 1564715
14700 1564715 1659642 1962819 1859172 1831657 1161105 948641 1236952 884372 1076429 970384
14690 970384 987186 790905 962325 693918 991885 1245906 1000409 1039517 911043 1185197
14680 1185197 1160652 1219204 1031531 769520 986413 773042 1326794 1202824 1108188 1233651
14670 1233651 1267565 821769 999298 910616 930699 747993 823117 974244 380716 722261
14660 722261 941456 1029178 943174 1204344 836033 1427133 1312215 1336681 1239232 1861770
14650 1861770 1468130 1059365 1314359 1391903 1015204 1264390 1045073 1254177 1016825 1185347
14640 1185347 1306476 1097320 1052452 810812 1056939 951802 966553 1690823 1140335 1302775
14630 1302775 1329398 1271606 1162676 1402466 1099182 1246080 986540 1135987 1317022 1270754
14620 1270754 1292556 1622060 1042050 1676038 1705324 1073460 1548943 1543971 1456338 1228656
14610 1228656 1193705 1319713 1229145 1354679 1415487 1479811 1520813 1765822 1787066 1201703
14600 1201703 1427753 1579313 1260853 1680217 1840291 1675372 1442274 1667352 1772351
14591 1772351 1880128 1800256 1885590 1832823 1809088 1899715 1945333 1717666 1871809 1583104
14581 1583104 1846990 1915546 1990831 1997009 1785485 2182153 1772152 2200124 1717119 1886022
14571 1886022 2111032 1999269 2013159 2244149 2176996 2085615 2342778 2356902 2259938 2427891
14561 2427891 2658464 2840050 2378639 2760084 2559443 2684262 3001464 3462427 3731305
14552 3731305 4042898 4336177 5162370 6697224 9602565 19115916 37423219 43926855
14544 43926855 25138048 10013725 5119452 3281229 2657940 2549890 3066358 5210285
14536 5210285 4482259 2931622 2216055 2086301 1980068 2266916 2198825 1959087 2078252
14527 2078252 2079522 1975323 2051074 2098233 2375121 2460658 2331148 2073095 2214376 2604300
14517 2604300 2525213 2344870 2407689 2681566 2498861 2563994 2844483 3063358 2777541 2657184
14507 2657184 2989596 2584742 2912381 2702930 3199407 2768735 2964754 3218119 3061169
14498 3061169 3233383 3233307 3080690 3225679 3078794 3124034 3243322 3463496 3241078 3608924
14488 3608924 3167155 3719932 3506801 3504882 3458522 3641101 3511463 3629076 3930077 3916701
14478 3916701 3882976 4070704 3960004 4138837 3851187 4344985 3839630 4388646 4170267 4322097
14468 4322097 4369904 4038740 4495748 4530505 4433354 4704906 4687038 4650765 4878190 4330292
14458 4330292 4900687 5126671 4693837 5109781 5117520 5290755 5158755 5329985 5560984 5337958
14448 5337958 5681446 5948694 5455377 5688769 5674072 6026495 5789812 5928150 6114801 6151010
14438 6151010 6047993 6118071 6361030 6538528 6372504 6579123 6549092 6941052 6803629 6500176
14428 6500176 6844265 7126195 7148569 7336611 7535889 7697276 7898227 7762118 7784662 8563852
14418 8563852 8539100 8587090 8736041 8634811 8703267 8720515 8709521 8758626 8704892 9054807 9408079
14407 9408079 9609623 9599432 10050187 10304241 10546502 10644203 10606924 10653512 10634444 10908376
14397 10908376 10957923 11436121 11401077 11404771 11699347 11545524 12333715 12341007 12855126 12348989
14387 12348989 13038771 12987612 13377371 13685525 14232541 14588575 14748880 14691792 15370549 15402283
14377 15402283 15756367 15818779 15875874 16487128 16771672 16995806 17387121 18227515 18018376 18782301
14367 18782301 19107062 19544149 20163787 20415052 21079464 21182314 21758615 22074173 22514212
14358 22514212 22891992 23292429 23778550 24374464 25215019 25790915 26203360 26448150 27582000
14349 27582000 28217652 28477371 29500218 30297655 31371773 32046737 32968430 33743043 34426138
14340 34426138 35809998 36375640 37593661 38575512 39772591 41052548 42297298 43471003
14332 43471003 44689484 46241709 47427759 48802459 50723672 52121517 54090307 55662876
14324 55662876 57486450 59921397 61740083 63541743 66069437 68689443 71330534 73743328
14316 73743328 76561846 79394518 82552310 85432925 89247603 92941442 96296349 100580825
14308 100580825 104799428 109598717 114396965 119286138 124918286 130469379 136743399 143257620
14300 143257620 149833090 157049372 164829094 172599217 181411887 190283334 199882834 209932228
14292 209932228 220766504 232143576 243867508 256391893 269446131 283129158 297140035
14285 297140035 311574720 326362716 341382723 356572728 371976744 386796367 401241619
14278 401241619 415473919 428840653 441171470 452062601 461238161 468238373 471836277
14271 471836277 469934737 465449027 463805612 462386127 457070673 452457025 444756305 434148772
14263 434148772 422070974 408113189 393312750 377805119 362053431 346110867 330326232
14256 330326232 314618963 299363622 284849616 270698716 257287963 244296789 231783955
14249 231783955 219932983 209819161 200712656 190448577 181350153 172707186 164751455
14242 164751455 156722817 149261991 142494110 136120364 130322959 124709273 119314903 114102680
14234 114102680 109216965 104203662 100530255 96568052 92698791 89586764 85222691 82222877
14226 82222877 79339169 76151405 73418746 70748386 68340610 65861306 63970192 62086763
14218 62086763 60117632 57362048 55546562 53732213 52463281 51244806 49574016 47844062
14210 47844062 46416858 44863608 43926753 43006866 42046618 40762744 39296918 37948820
14202 37948820 37151892 36358599 35914317 34630396 33791949 32632939 31502309 31000222 30562265
14193 30562265 29475566 28945420 27979305 27428983 26703030 26002948 25042884 24651308 24348419
14184 24348419 23932534 23216200 22692572 22129061 21661676 21475121 20652973 20624134 20010894
14175 20010894 19590938 19159243 19195237 18579346 18025316 17934093 17701500 17173138 17016730 16671589
14165 16671589 16411754 16036140 15803380 15266304 15054693 14674793 14930057 14113797 13840855
14156 13840855 13661733 13553330 13089656 13176794 13141355 12889893 12774909 12460612 12266098 11979298
14146 11979298 11713170 11594128 11332931 11309282 11692267 11027428 10823738 10650810 10285470
14137 10285470 10174579 10199639 9957622 9943095 9903524 9498378 9416761 9211655 9105560 9021967
14127 9021967 8954723 8973218 8778228 8643066 8777931 8390431 8221779 8125650 8235755 7864326
14117 7864326 7872294 7459330 7515609 7612157 7401559 7515264 7553243 7433926 6895068 7081816
14107 7081816 7179312 6933629 6890616 6729070 6905128 6554720 6503074 6344481 6216437 6313081
14097 6313081 6088980 5863213 5739574 5852837 6018862 5948491 5362237 5361148 5553831 5494121
14087 5494121 5448719 5608452 5469599 5430977 4847654 5154775 5000836 4900709 5219585 4978045
14077 4978045 4901997 4734987 4998339 4684230 4965137 4649529 4654378 4551565 4528601 4495417
14067 4495417 4325462 4508657 4630222 4271302 4396492 4935143 4140650 4320652 4369653 4613887
14057 4613887 4161548 4289445 4068525 4095770 4039720 3901378 3615317 3556564 3605407 3754418
14047 3754418 3433722 3692374 3587457 3639074 3542849 3358074 3468485 3459344 3342019 3481640
14037 3481640 3573909 3372770 3121201 3298393 3243002 3293223 3339150 3351183 3194429 3177391
14027 3177391 3019487 2887076 3156571 3001071 3142537 2960510 2561454 2906757 2624837
14018 2624837 2814610 2558268 2797686 2784526 2552068 2731477 2651508 2492394 2532610 2505088
14008 2505088 2461319 2714230 2723620 2303045 2409448 2576743 2175854 2412913 2479803 2154337
13998 2154337 2034499 1948303 2436246 2196007 2288957 2278628 2024017 2265823 2428114 3161744
13988 3161744 4845928 11892525 29329462 45405453 32856216 16803041 9371163 6500132
13980 6500132 5265512 4510704 4015493 3678553 3503301 2997929 3001809 2964712 2820012 2767820
13970 2767820 2639719 2451178 2644927 2466092 2191911 2297791 2209564 2439889 2158136 2244478
13960 2244478 2198916 2005127 2080246 2286340 2252237 1988180 2134430 2248756 1940328 1972481
13950 1972481 2000608 2079074 2170288 1942305 1816884 2005672 2012436 1838384 1863469 1822673 1986974
13939 1986974 1914068 1870961 2016824 1920575 1849608 1838175 1692820 1523584 1742175 1759375
13929 1759375 1528284 2051381 1719293 2066778 1529442 1960108 1904143 1524233 1402115 1742841
13919 1742841 1750476 1572723 1234962 1636359 1872001 1852162 1923036 1388527 1551845 1600299
13909 1600299 1224136 1713759 1563651 1519792 1502961 1597790 1298782 1544112 1293788 1293867 1291359
13898 1291359 1434452 1366676 1505220 1366619 1445854 1206486 1790254 1247182 1186518 1262049
13888 1262049 1556178 1471371 1312831 1655723 1287567 1187601 1438552 1367996 1727800 1130683
13878 1130683 1612318 990209 1328216 1111520 1356099 918336 1273454 1431313 965985
13869 965985 1395001 1345186 1023908 1169949 1528762 1237731 1189292 1039697 1201810 1017329
13859 1017329 747598 1368596 1226246 1288337 1106180 1104533 1163737 841749 1157391 951621
13849 951621 1351755 754255 1156850 1056227 1223593 1170064 1181008 1350714 1127947 982619
13839 982619 739296 1018745 983610 919564 1169886 1087158 868352 727872 882253 793334
13829 793334 897294 897621 1257983 1198638 1074922 968166 943263 1225839 1143709 1048488 1107852
13818 1107852 827178 851934 916944 1094644 908214 765924 1046886 1072854 1077536 878758
13808 878758 754830 787413 748752 753227 666487 737021 1284769 717930 1028144 870053 926740
13797 926740 758860 779507 590265 771876 710353 818282 789155 836850 831708 949588 891759
13786 891759 755048 1013520 882311 610056 838917 606989 553454 723785 585577 695833
13776 695833 570216 426357 826788 618529 932657 808367 838805 895063 786140 730637
13766 730637 311430 925404 629346 711797 872043 427531 688606 600681 1078226 603218
13756 603218 502500 1056524 534995 636792 546916 475151 913226 355500 426918 580363
13746 580363 742309 744791 633877 579905 480492 734297 414795 529009 682908 860983
13736 860983 833476 1013333 537719 464418 742804 410054 695985 506854 527690 796021
13726 796021 922418 853518 784167 709644 663918 224906 447675 566927 630492 471592
13716 471592 670859 573236 735086 710485 674257 727782 600994 522037 395228 533148
13706 533148 838918 485882 733935 397306 609589 543861 384779 554601 909888 473119
13696 473119 367903 270148 685577 362310 952495 776269 1028996 578568 731370 507988
13686 507988 450305 577655 669614 839132 485323 564053 597423 392762 666879 731210
13676 731210 458884 456596 766773 400511 715957 527953 446490 621903 543617 602669
13666 602669 27999 461871 872631 443901 474261 776319 448574 201246 203328 656568
13656 656568 643859 632471 368839 548478 118685 597663 395158 327510 374281 667942
13646 667942 477891 267436 400176 700056 473530 654095 362166 353243 699230 684924
13636 684924 565776 265368 681201 487423 287055 524269 533494 302552 416730 269642
13626 269642 684549 311455 462792 398650 420284 301837 526039 312808 601621 721492
13616 721492 450509 211243 681154 545994 148158 232879 275475 585729 422522 488815
13606 488815 451518 466604 555310 538441 658073 627141 375343 522069 280358 812323
13596 812323 61015 602091 471272 408993 530877 612620 262026 281815 546811 334505
13586 334505 179961 156313 200975 484528 506574 198440 296053 360449 310058 214561 376639
13575 376639 340228 499728 395390 -65581 396621 477378 -212897 422384 748218 292220
13564 360528 546882 128892 216940 434932 213434 491684 530672 569788 253717 377510
13554 377510 237336 485138 190170 419545 119631 217329 506815 265008 563121 305327
13544 305327 247318 203145 625789 216554 90712 194155 294683 380959 303091 524459
13534 524459 61929 136950 261933 240654 529991 397567 214759 814080 341117 106572
13523 180849 465664 366998 482691 238077 -45123 311472 309029 263290 144905 11310 115409
13512 115409 403722 489926 412388 413918 451511 216854 -66757 200682 218273 319837 -34336
13500 415282 135714 144179 543693 417792 323331 184194 322398 159167 455328 304635
13490 304635 346195 487450 293598 105429 183597 248782 372823 153691 347547 383938
13480 383938 409447 199145 292165 104799 190529 205629 295600 203569 227634 145563 202235
13469 202235 361991 393808 -44403 -260318 691885 360157 460363 534163 444978 348704
13459 348704 270756 73844 197708 -80262 471806 132175 479918 600073 391953 211502
13449 211502 252442 291209 613004 436209 -45864 392245 402988 623150 150320 69896
13438 15585 213952 329130 498375 331455 235698 222556 244292 239838 222004 564009 10423
13426 -37050 37983 330469 621915 134492 19701 224221 438820 146796 145713 251027
13416 251027 433510 240096 269178 148561 211393 351983 -33207 -16946 231791 28418
13405 267572 449727 33140 605104 75624 50237 -63398 530488 218319 92306 570886
13395 570886 244698 159788 531685 199813 89352 64300 -15291 146531 316018 409661
13385 409661 5203 74598 98771 -29425 185017 175687 -13810 159473 76042 37388 236481
13374 236481 3015 542110 174520 112892 185214 168665 147085 587433 305287 243875 270204
13363 270204 109483 545400 455553 192199 452560 145842 328733 607492 98608 363957
13353 363957 208884 258364 -123448 271310 122150 239541 270541 -873 104022 309169
13343 309169 273577 429517 319708 532643 317734 398451 303742 97945 294515 402457
13333 402457 672532 138330 262981 202414 446618 328023 163817 727094 321198 183272
13323 183272 258208 276117 470438 21052 264974 371606 167447 582536 -9756 381354
13312 184967 143017 340723 -51120 357908 226306 280735 284318 486098 275348 148016
13302 148016 291719 418791 75030 178334 532209 159921 132975 176813 247856 35656
13291 185506 336909 -83211 -19643 29572 201851 75180 259256 122276 120926 383288 51982
13279 177506 60022 -103952 225150 292601 19429 127624 247304 -175645 266130 -91804
13268 78527 173199 82697 225455 60311 277865 563041 160663 214115 -170096 215785
13257 -235035 -92434 -175789 209991 262002 41764 278563 240835 34921 -26736 337518 124747
13245 -113978 95775 191470 47203 243386 -169303 158782 -82629 107 133197 182551 63022
13233 441140 183931 214247 -24860 28146 106618 -64952 63386 -25830 105929 106771 266851
13222 266851 87488 47654 5227 236579 553579 321731 219797 152401 242055 249256 222246
13211 222246 281545 -23181 87270 323479 -34909 -118118 205784 193577 -189219 -24562 -57780
13200 -57780 55422 -365941 -280489 48388 464765 150739 221807 329158 50215 378768 -100768
13188 178427 392471 488585 397420 326121 140501 480420 60710 -198531 -19720 151222
13177 -14674 285148 40702 149718 128960 -112892 79105 -259643 -115481 30639 38012 -3932
13165 198406 -69743 109335 276134 132972 390076 68148 356341 143141 -199688 200710
13154 394187 187815 -129231 -4658 308146 399657 295409 -219724 20595 77318 -25216 323924
13142 177472 377044 80609 -83628 229524 26335 244999 161507 68214 147212 147028 71830
13130 -103583 104323 359062 5020 307297 168965 186811 166046 257865 -110734 -196149 9853
13118 -129310 -99181 178571 -198432 129249 87818 244996 213677 123681 379151 -164491
13107 290669 167398 130103 -93749 90037 339157 141596 224806 84084 414294 388236 -164473
13095 147747 -24565 85014 349937 140791 -67931 -6921 3497 -111304 -97614 -70251 67536
13083 277085 -32801 24840 101602 54009 475222 60155 -37993 -34106 323415 -83640 -29445
13071 175292 82266 -231081 63454 175139 166743 93663 423274 191458 84204 103504 358560
13060 358560 101821 -62110 152166 49633 134118 145811 162404 234992 114922 -62297 382179
13048 -266713 -116934 141151 153220 150435 99282 -41862 49817 -158219 161667 76677 238973
13037 238973 584359 255338 258706 51607 263289 57736 -144333 545101 246748 139591
13027 139591 91224 -62875 -520119 -230004 109778 263762 451016 -199662 129876 59924
13016 17286 28262 93572 22113 274077 224156 74224 303182 -14937 -70618 131368 282030
13005 282030 -197922 34286 334121 279574 -107631 222177 54798 32183 171060 -24099
12994 967 168577 199322 -54673 332755 44320 -198954 269464 433957 295046 -29749 -275271
12983 -275271 -100227 352436 101274 -28050 -73875 138773 100419 -4212 182366 16317 105638
12972 105638 -228441 -169065 -18749 -104650 74124 331942 -95193 74397 32909 -98747 19084
12960 4287 22935 324262 -199652 -67855 202492 170023 164205 47395 -162093 180316 90812
12949 90812 -117354 -270036 -42011 -110576 131178 316605 373938 45258 126568 34256 -166205
12937 -144163 40267 1761 -91748 67590 -82456 25768 -162570 -111408 -8540 97976 104244 116445
12925 116445 -84339 -3487 241548 233292 80740 30575 71897 142944 15377 109361 118166 45040
12912 -110131 -208668 233289 -93122 -161987 53882 155421 187901 148527 94946 -38377 -127353
12901 -127353 442978 -355890 308920 -169558 -340686 56301 -125950 133850 79742 -147644
12890 32537 50271 -178448 74077 313978 -29903 155766 -123932 -73223 380573 252208
12880 252208 -130862 122475 312143 145278 -108197 337415 175603 564 -129586 160981
12869 -130229 115216 235211 -89985 22505 -170407 42453 18088 110490 -167838 82675 345769
12858 345769 -237038 198441 80704 -220201 249171 107563 8399 -32777 64256 -298124
12847 131897 12099 218906 255767 4758 -36064 -19619 162873 114323 -57891 230356 92045
12835 132779 -290451 -321197 219481 -241912 121637 -216791 118451 -94086 -28206 81816
12824 302428 61959 141827 133674 -25390 18311 -123636 -71037 -317791 128346 65200 131114
12813 131114 184074 303998 172447 -98780 -204984 -5998 -20178 74148 493309 -143167 -353365
12802 -353365 90164 -74590 82892 -14047 249766 -141090 180798 -154374 -56078 217156
12791 -44648 42872 222510 36211 -28573 -74354 25427 264012 119723 -125132 78218 47199
12780 47199 -232817 91275 -69048 373065 -174305 -26328 70194 -266527 1812 58527 -87238
12768 125040 176892 -9044 38369 305100 287738 104769 33355 -177435 -210441 132756 77138
12757 77138 -221982 -25559 17763 -151499 23404 -19927 -87816 -8115 86399 -23167 310052
12745 -92093 -173761 83309 -41880 -156585 135369 299143 267386 -103100 219439 274425 -123004
12733 458298 217396 425850 -210555 100829 -178294 -172347 107671 -8194 -71478 129217
12722 240818 18068 -38510 67381 -36057 -18818 -213877 -19331 3248 -160987 6944 23908
12711 23908 34188 194052 127301 652289 28304 300738 326518 509348 136512 170140 74016
12699 85229 2857 100818 123871 -33277 -138845 331671 114209 -16742 145007 -102897 -74474
12688 -74474 -156291 173295 13454 -106415 359163 139257 -182538 409368 120922 528444
12678 528444 335614 -13444 134504 -145329 136263 283938 81650 84916 68366 -107990
12667 60509 24675 283774 -263600 291798 66167 26240 84322 177750 2183 -181254 135140
12655 423449 272759 252124 319947 141276 -47558 384374 156932 459157 26728 224894
12645 224894 -391542 -50959 -76958 183540 -143605 45621 47927 -65727 -5317 28420 232539
12634 232539 100407 149349 52388 230084 160634 -148932 418241 301283 258423 169744
12624 169744 33376 57364 157616 -104018 394183 165952 231685 117877 -36275 219144
12613 249070 368531 20947 308099 -370387 -203016 -247092 -34454 144709 -123967 -30652
12602 24472 420797 476628 246229 6475 150849 -12162 250682 374491 -168181 240623
12591 -64615 29490 92586 -73451 10141 109690 -256993 -478608 105017 -338270 -153651 -36535
12579 231062 58 11637 -201172 -499594 -153743 12211 -108470 212678 45067 -144077 -92077
12568 -92077 108767 156351 -27933 317923 -245137 71949 245402 -18921 -122499 163301
12557 38304 80699 -204613 -38115 236352 61458 -99502 -15703 -61111 241027 106951 -46922
12545 -44582 -102785 -121779 -14356 -34348 -74481 -406502 42707 94555 -72350 -109603 307896
12533 20184 -256044 71786 -60300 -84103 235644 35911 -11351 -266439 -67194 -87259 104650
12521 -390060 37638 259255 -52006 49290 505393 22785 66969 170163 -146022 303954
12510 36358 139492 185837 -151222 -96122 136127 27639 -156692 201424 123372 -127174
12499 59205 -68474 -75826 228836 -102539 60090 -24257 192268 -95752 -200221 -125308 11279
12487 132448 33803 -63574 254647 -55756 -113639 -212434 62166 63459 194455 193417 113864
12476 113864 -187850 -143946 -60446 54042 112682 63423 525350 47936 271970 -462563 -339388
12465 -339388 -239149 -9129 -267648 -154222 -66738 -85493 145065 236005 -70392 -264476 118407
12453 -27800 65421 91981 -55251 20725 -91790 -459482 71491 -207010 -180542 122425 435064
12442 435064 36942 -20456 200030 -187703 143890 152567 -50627 192677 105655 57751 637194
12431 637194 71468 -367746 -270949 -349033 -108903 -256676 -2911 -326611 7338 -165084 202764
12419 -27444 -20057 -16948 -35544 128934 56376 224919 -10546 87376 88305 -227752 -68882 -32297
12406 -143796 43306 -75116 298831 -231308 -221192 128613 -141423 -22183 -275300 55274
12395 9451 167025 -293317 -187668 44589 -73977 -189460 -24029 -76628 -30598 231452 249232
12384 249232 -105788 274334 -5704 172582 -17116 -45056 282520 185885 256673 101428 172510
12373 172510 -104745 395 57238 16372 285152 80860 60246 284487 15373 143048 -85275
12361 70731 97135 361081 -91407 195386 211142 7252 122363 -38131 -25253 286968 20485
12349 202871 294308 345872 125122 -13815 -184050 -200125 43431 -125937 250560 -197922
12338 6899 -192879 41901 136789 23864 -563740 29495 163054 203185 51170 83064 358420
12327 358420 338190 249418 302560 193464 178671 -119780 586702 -30520 -36442 260168 -46735
12315 8085 -109538 268706 623211 289767 51691 251044 303667 43593 313518 45034 339459
12304 339459 -97360 169423 44813 227318 66539 150640 -75819 -17529 191492 44910 159540
12293 159540 -66556 306683 248526 -38724 125318 259001 33177 -14672 18066 311358 214055
12282 214055 321091 484465 -93427 282388 92894 288281 141958 8789 450891 367473
12272 367473 82308 218775 -32513 269285 166837 64658 272450 418065 152986 237260
12262 237260 616914 -148682 509406 134840 -34487 356273 228244 229284 361708 -32721
12251 164185 360290 153089 -149901 424209 -276605 113634 345006 98585 523497 -118413
12240 444264 91389 -43509 -42039 61811 -89540 289324 -199659 187539 199014 211675 48727
12228 144669 187949 312831 63534 203850 157641 200033 -96188 -97332 297525 326014 632283
12217 632283 241776 285939 397096 221253 298709 583104 360532 315822 -29193 -1907 -63093
12206 -63093 173370 9946 67119 -268249 283375 -2722 -30196 305564 102151 -56696 -5103
12194 210261 312015 414873 99319 334793 -37497 317091 64573 -49166 -201097 152381
12183 83606 -125433 123629 -23131 174204 170903 467683 82554 346409 225468 60776 503545
12172 503545 143880 123765 -21562 240365 291824 334890 163441 429540 218817 -7154 352928
12160 70306 81888 422079 64220 244818 245185 215635 156094 175183 389032 228778 194956
12149 194956 127874 158820 76933 323296 189532 -187472 63349 -181097 110160 510081
12139 510081 336988 89638 144635 169317 172407 59371 116225 43730 -18032 94706 143759
12128 143759 -32880 122618 40557 114613 208393 -96799 165026 91740 66179 -128127 136584
12116 -71138 233674 141997 244894 103749 200935 254388 198847 228674 263175 -182162 92971
12104 180313 248905 179954 -210165 86021 -73088 152075 93209 14924 203269 38143 24234
12093 24234 -208323 195891 386471 199192 42765 28845 232795 268694 318451 300042 -16621
12081 96676 108635 87070 229610 -193183 247147 374891 22459 584595 320174 622874
12071 622874 335154 308867 -24606 89437 371608 57373 240150 98729 393409 -188221
12060 321147 13338 401133 22196 44553 -321061 141898 310103 144140 377054 -145336
12049 286763 37785 -57457 35931 -168707 -103387 -95220 323620 120787 -43898 152562 197589
12038 197589 4211 -130856 32425 15658 -4874 182802 -222052 -1060 -124260 129488 83814
12027 83814 93195 337512 7562 19413 -34147 111971 180005 252286 -354177 -40851 194355
12015 289777 164051 -92644 102947 305680 192731 47164 42753 386283 -247961 83996
12004 -86510 -56765 178861 -23546 58588 -129142 -5492 -27291 -169442 -18656 -3587 -35187
11993 -35187 -88057 158654 -41812 160659 -113450 -63649 185994 -337333 168466 -208461
11982 187572 -519052 -289492 -143989 -247378 -103099 -65064 -136794 209121 18912 85589
11972 85589 141967 210664 -323193 -108674 127950 -87728 237420 -276808 156834 -385828
11961 -278541 311540 35602 -116217 200469 36670 -219034 17733 -157521 -352714 -150597
11950 -119902 270178 27425 -31693 325494 216117 -150669 285358 -143220 62850 -146414
11939 133994 -16820 233230 -98421 205321 -40960 -1669 -248331 -336334 -318704 -137874 -299477
11928 -299477 -298457 207516 -150176 170471 91873 -13090 45569 -17714 -184702 -35987 -216910
11917 -216910 -228825 -226561 5541 91606 -263025 -85909 -58415 9119 22880 217809 -450747
11905 -46581 -32290 -139295 46276 85180 -211252 323377 -165667 -48690 -127417 21471 -238532
11893 116675 -307002 -20484 1281 55375 127445 159195 154542 -94315 -123866 -51555 -152258
11882 -152258 -101484 -108187 193866 83767 -285023 -321404 17637 -356445 -155787 235662 -1814
11870 -95143 -254256 -161337 -114221 -3147 -71399 -219019 -22732 -51514 -65925 -57126 27696 29884
11858 29884 83453 -122390 -299886 109860 -3405 -256390 -23563 -265667 -93849 51470 202379
11847 202379 -110907 101188 57411 206989 249390 -151146 -92093 -23430 -162275 355571
11836 -125347 -19335 -25349 46157 9846 -206131 -57383 -162350 -195523 388779 -58253 -43128
11825 -43128 57200 -456144 -360 344595 197430 144311 -107820 160400 -69231 -47138 -64243
11814 -64243 74962 -190596 -138099 162670 -101676 -45129 91571 156572 140566 -128184 -211899
11803 -211899 207685 100542 -189153 91036 195005 76008 -83854 -21821 -119872 -106675 -98345
11792 -98345 345044 215745 70492 -138336 42101 183660 -25626 -286294 -195047 -157451 148069
11780 77076 -124328 -109289 105653 144175 55223 79061 133155 19921 -27524 258974 -284288
11768 -162945 403686 136505 -191026 367360 -65683 -103720 -79552 -279646 115937 -298273
11757 -48217 166787 -72508 -149184 315859 295981 -100391 6776 210303 158024 103210 -103764
11745 -3645 -6483 96212 -102998 -48475 -243669 335223 -138563 35557 -30658 -186826 -131009
11734 -131009 58646 -61759 -9600 69502 -306431 -76902 61096 -280766 47639 79683 -45667
11722 85531 -393769 133285 -300481 288496 -782 -150083 -310640 -40403 -303480 -105072
11711 -30079 362546 -91487 -189787 -51646 99393 -202272 -21304 -90608 132027 74347 -103894
11699 -205984 54164 -226676 -5876 -832 -152578 21222 130963 30577 227331 8292 -48331
11687 -183300 -40926 380299 209168 11865 -224145 145158 234355 68439 -117944 235248
11676 -218559 232555 210152 112829 63236 68533 218338 369014 104120 38136 -105994 -225571
11665 -225571 64993 108015 58994 -198327 -32443 -25778 291441 161487 383111 -38462 91105
11653 -127833 61122 16047 567159 -126697 -250042 199656 -57952 428546 77612 29660
11642 15644 -100063 450159 -119931 37654 -146865 111530 237305 6706 273233 -17036
11631 -122446 109226 191946 113918 72217 128210 -15222 26837 215801 -266465 316477 89265
11619 -160788 -32989 -30797 38402 136666 197448 277704 137316 -142335 -251644 79022 -333032
11607 -77331 99418 50739 -94352 -57586 158312 -92097 -184225 267726 293424 -74492 -41976
11596 -41976 202515 -127905 -39498 -300207 55444 -235963 143983 219164 365230 -179800
11585 -136014 49164 112878 -10255 -139873 -124457 -72818 -100259 -23093 148321 269475 8165
11573 101505 -113071 123319 -282819 5065 6357 -111897 353997 295042 150077 129065 -27799
11561 462771 135549 76868 96332 -92243 440764 115252 489918 228653 189020 273778
11551 273778 -56689 112344 -296151 38191 75890 285992 145882 122826 -47519 -161177
11541 -161177 -42915 77632 -21335 38531 215984 -21376 127050 -83515 47784 -134803 -76376
11530 -76376 180872 217942 269372 -55400 -143747 -51924 -123139 51880 67535 33305 -25192
11518 187476 -72288 -106830 155720 108817 241920 -149013 182169 -58339 -22408 21027 816
11506 173531 176312 -37804 170634 -49702 15198 304334 286981 32595 140382 95101 266012
11495 266012 143840 211746 320943 -9967 -150121 157902 -76886 9223 110264 175103 295327
11484 295327 131043 153489 -64009 -220778 236510 243302 534068 -212754 524098 179004
11473 75202 168224 562791 380091 176857 146718 652704 36073 176517 383225 420091
11463 420091 303204 439406 6115 -188462 -154331 -38323 132177 11940 47839 -47240 -28874
11452 -28874 240881 -80457 284855 63419 93754 -30096 298856 -248645 -911 103260 176961
11441 176961 -561632 -105298 231681 -176884 376407 356317 -106830 -40453 -108507 160267
11430 335890 244123 -131197 -44633 95695 300486 74469 -173643 -232176 -421255 201385
11419 270974 64933 72154 -119219 215360 40465 -141324 304297 -169287 -73867 11873 101918
11408 101918 346036 329232 406517 -62406 -74084 -97969 133766 -43258 191181 -114206 -181092
11397 -181092 59960 166404 -28371 2735 27562 94289 22915 137053 -140124 41108 -176022
11385 -245373 85055 -77475 -12673 -121484 -41816 399119 -277646 54585 236169 64001 -10017
11373 -115796 219756 33149 -158852 298477 15333 -154073 205258 -122538 -47204 -268404
11363 -268404 -119952 -108272 243091 220579 154306 -72406 -345924 83427 -175005 67178 -182090
11351 48725 -196426 229153 24472 -218040 136724 61085 -212832 104923 -254864 305590
11340 93897 164749 -154293 -16451 -403846 24079 -56645 -237693 -338617 -43838 228932 -290584
11328 -44850 161643 -85583 104778 -86265 120121 -14671 217467 -245996 -11826 -160365
11318 -160365 300500 102830 370803 6860 -44958 -109973 188908 57874 173770 -241556
11307 -10023 29233 -230931 -424311 -53588 88293 -121419 -126379 -76619 25979 -128044 -70477
11296 -70477 177034 202390 -43361 -78773 201168 70282 260699 -505360 -299539 103977
11285 -89239 -14059 363828 227752 126895 111041 -113285 -50943 -55317 -53878 -295 -109636
11274 -109636 179505 -37962 -159044 494900 -90536 30862 -48632 34148 -117980 32373 -30817
11262 134063 -146628 -64355 44694 -205446 -56275 -116230 14494 99476 -23272 282265 9649
11250 -66678 254376 -270087 32933 -91079 253635 -203074 -140522 243706 279214 -140020
11239 54905 -193419 21569 -199963 -84056 -163776 -59050 -155129 -252539 -80858 187544 -4625
11227 458785 54812 -94097 -116191 -202499 -124232 33822 -144869 -166899 20367 -267731 125692
11215 89880 -70318 -221934 155861 -436804 -284911 -136518 -170958 -10859 -75821 -14312 -371559
11204 -371559 143610 -73045 336064 -133046 -199012 -155007 55090 -248967 -91825 -60681 -34179
11193 -34179 -72345 -320945 -40563 -159319 -52043 2823 18121 281816 -272294 -78064 -243783
11182 -243783 136171 -138023 -102216 -346163 -65896 -454579 -133106 335446 -176553 -271582
11172 -271582 -265513 -84095 -30560 55243 -8327 199173 -132112 147911 42956 122453 -164912
11160 42997 -5499 334341 -404333 124918 -101143 -46149 22748 -109479 86579 2838 164768
11149 164768 204819 274850 -8669 -289872 85982 -114830 264724 -87765 -282454 30475 -270516
11137 235335 171031 206217 -82553 214354 21930 -22376 91276 -305850 -22815 51740 85837
11126 85837 205668 202090 385740 68589 -10230 238444 210528 46629 245806 203563 -8899
11114 -26172 -82235 169035 -9578 308658 148274 405509 -90995 101605 152744 -1821 232196
11102 -61848 105008 167057 81313 34039 -247183 313044 58352 61110 153337 -139364 -77389
11091 -77389 400430 243599 73745 317630 88029 232059 41580 76726 90027 233847 -34660
11079 -86710 355541 271446 487082 448385 87324 288885 377638 214543 264563 144921 187815
11068 187815 447294 436158 662768 225372 558463 600402 356196 47500 457633 559419
11058 559419 243307 651657 545326 641271 585679 746963 349335 729434 633143 382268
11048 382268 718484 709803 622806 596253 775200 939634 842113 1007482 239023 768995
11038 768995 761769 1113890 1070177 607372 730225 607645 726937 694773 932995 823996
11028 823996 451518 437873 526690 1019589 556332 716691 940486 853879 887103 939760
11018 939760 518873 488374 636614 392674 436644 731196 648544 770743 1079880 526965
11007 488711 573958 791903 597077 475390 324693 601088 619284 551185 808213 529708
10997 529708 704524 497003 396206 967532 336450 641142 999325 622906 846959 698266
10987 698266 532343 982721 842874 778637 774907 875672 898461 1041783 1165724 1338846
10977 1338846 1309886 1018639 1418620 1265845 1633248 2060729 2087049 2433984 2576438 2747305
10967 2747305 2774660 2584299 3048794 2471573 2318855 2082766 2077239 1892878 1821137 1754229
10957 1754229 1765671 1564696 1783542 1977018 1832279 1824954 2031197 1530051 1460651 1221394
10947 1221394 1055205 1105470 810224 577991 576943 534322 513183 245361 166296 418870
10937 418870 403833 25938 164414 9320 150477 89816 161926 189833 166504 -191789 64393
10925 215949 125471 114615 55367 163603 248151 -89831 163980 178857 190033 84151 -421198
10913 -170876 373869 85854 192017 209147 13325 143185 119463 -11333 43786 -40824 44267
10901 -98345 227841 52468 375630 -184652 203859 -256638 60317 201231 192918 -84399 -22326
10889 71253 -116373 29197 132039 -27928 -41573 64101 -113605 -324841 -398134 -35792 -175658
10878 -175658 154401 -190334 53393 170314 27643 81062 -243374 73043 -163153 113143
10867 -95721 -328803 -53449 315242 109739 140329 82468 -169221 -33061 -74061 165129 163418
10856 163418 35113 335819 -35445 128736 -27959 -122292 49874 3722 -36041 -223896 4570
10844 -153427 -318675 188838 -23950 -74852 -143412 358308 -106225 110794 92906 273219
10834 273219 185342 -3736 -229677 -239466 -227890 -96061 -116709 -132220 65363 -67822 64816 152738
10822 152738 -350611 -208514 324339 146526 -143685 -200633 71709 -98746 10297 124470
10812 124470 194706 31935 239425 151019 113191 -227554 -128389 -90228 -61295 -20222 154645
10800 293304 100124 4371 -41430 315609 -242634 96240 31216 -567388 -188934 86930 -3959
10788 -205264 -97020 112236 -16287 -134945 -5270 -175658 -449388 114267 195227 -2934 46358
10776 -304799 -49161 -24621 -11092 -6721 -52833 85066 -57919 29856 220485 101762 -382400
10764 24385 219753 -319615 -88051 -326590 -47337 -6864 -274064 -146849 -16294 -159966 102066
10752 109307 -207157 -15624 101187 -300007 -55523 206562 -353368 208196 -182127 -348542
10742 -348542 197108 -147859 -180449 -42512 131369 31475 232471 -85060 152330 -39563
10731 18454 124689 -233407 -95081 117942 83581 -32729 -101647 -14987 -56330 -243652 -166748
10720 -166748 -227643 139107 -66500 -149051 176351 -10828 -296166 -37631 -60090 -111248 -215682
10709 -215682 -236541 215022 -258695 -116673 78449 -106795 -195223 -107054 -171220 -287631
10699 -287631 -30765 187527 -21966 -80255 -7178 -189827 78695 -45899 59449 -175103 47408
10687 -104204 37611 -398321 -189130 15094 -316842 -186275 -24440 445206 -86172 6318 -399753
10675 119567 -93251 139868 330747 103685 80105 -250084 -88181 -56848 163485 -15601
10664 117225 -78501 241418 -134097 -343395 -71102 -40098 -235432 -139051 -382676 -235855
10654 -235855 -12861 -7350 -101941 244698 -58802 -243753 -65368 -174888 219753 200115 344473
10643 344473 59864 -151053 13863 27501 -135583 14658 -298321 -209009 -91327 100670 -94981
10631 -24068 -83404 34159 -334795 162918 132184 -262512 19011 14393 14843 -39031 -293350
10620 -293350 -52165 2479 196603 -113050 -66564 -141844 -114418 -305802 65856 -96504 35121
10608 90617 25810 -116841 10982 197015 102524 -171562 132072 -113165 -78012 87962 -227797
10596 299725 33992 -316524 -27737 -161743 -198088 -77062 -113885 -9202 -59932 16025 -27051
10584 -181457 -207991 -413649 -216494 -43187 -163974 -72209 138692 159206 -403234 18349
10573 -244913 -4378 133202 -90566 -254353 265319 11699 177612 -122225 172124 211247
10563 211247 -405735 38653 440746 119206 116839 -131990 82775 -31712 -185152 -292667
10553 -292667 -213606 19869 4582 178304 -137846 -40389 -252824 -2935 -855 93440 218008
10542 218008 -276472 86548 -112513 42639 -55384 7112 -372205 43132 164264 -165949 -170615
10531 -170615 -4781 8783 -54871 -174770 -183981 200988 -241026 90173 49792 -178850 -85873
10519 -27758 -177188 141232 210024 -51737 37370 -162531 -306023 75948 -131936 -441000
10509 -441000 73881 201500 -160470 26380 -168000 -338544 -254111 -84753 -22743 101555
10498 6851 -99343 53085 -86739 -71178 144448 -241103 -39589 247231 -304429 174127 -69651
10486 425665 94267 -102612 10039 -388400 -109684 36839 230387 85963 -6145 88544 331741
10475 331741 290759 419638 428720 583622 -14827 239208 442087 233222 9766 -521492 -922
10463 -130412 -63354 -171694 -169934 -174156 -133260 -2567 33849 -357668 -37232 105404 214227
10452 214227 47634 -107636 -49133 -57437 -47608 -216010 -341805 -242501 -104806 -124110 -168940
10441 -168940 -22779 -58194 292795 -26971 195270 7712 -222002 11390 124897 -51207 -304629
10430 -304629 380439 -22548 96204 -69304 -355303 28670 32911 -14282 -148638 -430478 -288818
10419 -288818 224842 26501 -211047 -271604 72389 221385 -72117 -19083 -198628 214025
10408 -191186 -175519 -115592 -169132 136899 -348511 199791 158006 50101 179361 93519 -112920
10396 -95134 -5419 -113550 -260540 299494 -130192 86659 37978 3875 -264883 77013 45362
10385 45362 122457 326967 -205071 270742 185157 173957 -283647 -40558 163314 -3890 108350
10373 302210 18889 316441 210863 256241 292086 173336 484735 345211 519121 492671
10363 492671 579715 591093 368263 400585 29534 193360 484722 147938 169206 10031 16186
10352 16186 81659 320681 328307 381416 681273 428537 270607 460544 -109010 525079
10341 440806 384128 35316 224905 -70051 418012 84404 37212 173627 247507 -110994 48905
10329 88434 151253 315468 -223522 321816 213812 72820 294363 31796 -42598 298117
10318 180994 238691 -81013 -5127 184049 69437 305777 28331 238989 330810 28375 93342
10307 93342 -99096 46395 231990 -326912 485692 -23973 -129498 -268792 -296309 307720
10296 -245510 212349 -473147 -29061 -180132 -12843 79745 -100048 15440 -11719 -184644
10286 -184644 -154006 -171453 -243683 174679 68324 -320058 -163599 27910 -42725 -318921 -87032
10274 116102 -109150 122795 43463 -67498 35422 296894 -139093 57904 147806 -41770 -82468
10263 -82468 -18116 -191081 -80857 -128407 -110575 71471 -129848 203777 119846 257866 318462
10252 318462 -90744 195767 73200 143803 329088 -153381 83026 -118466 218752 -128711
10241 -87118 150941 -52562 98610 -282324 -192801 -29668 58369 -79891 -55799 70620 -78573
10229 -67037 -311533 20050 60820 70112 -65611 -128963 298784 256766 -145196 129838 -70005
10217 126902 -192076 -248226 -194866 -305533 2901 -355028 220400 85843 -48783 124048 128263
10206 128263 -236166 -20654 228531 3297 85213 -113953 -147620 -50585 -221041 -70864 30605
10194 -97432 91532 95909 -115755 128662 115652 -204305 -187313 -43145 -71066 -113879 -142898
10183 -142898 201795 100663 -95798 144734 634 -77302 -287522 158703 -53222 -47495 -145324
10172 -145324 83446 -145764 112203 -271383 1860 -239872 -135907 116015 18485 -9850 -226578
10161 -226578 8110 -117684 -160483 -42096 37443 25269 -307698 -126253 189721 -29329 -11607
10149 132784 -135314 -21980 154885 -224928 -193332 -97405 -59577 -96388 331838 102333
10138 91362 -283047 529220 -105563 -220136 209699 -238470 -17234 -21237 -440979 102367
10127 -121898 -194443 -225089 135131 -94424 -183198 47391 93091 178032 -214809 104506 -478596
10115 -3064 -9472 -236057 92808 251132 -29649 -94573 -156584 45297 -181538 -124066 -222108
10104 -222108 -19499 46864 63444 -180528 227263 13499 -142973 52301 -44375 -57985 291339
10092 -197555 -44286 154363 -688760 -74773 214863 -17299 -40647 -280375 -293274 -120432
10081 -34790 -38676 -265390 -374214 365284 -210985 -328403 -134611 531913 -290206 204641
10070 -247922 250511 136335 43283 -50389 -402633 313365 -282947 68455 -123021 187852
10059 -130909 -93881 -191558 137544 -71326 -217771 101558 -69653 -98697 -51479 -1198 -34442
10048 -34442 -97663 174890 -202 60116 183875 -70729 -61786 12519 26134 -214443 44166 -347868
10035 -174986 15563 -168567 -195345 420051 -130319 -100368 -231408 -317928 1780 -273817 -307518
10024 -307518 -420330 -15401 -72622 360469 -258089 -340900 148855 -270094 61946 -96899
10013 -160831 -228338 -145363 -303007 -106575 -240104 -359335 176832 -144280 -153256 -445357
10003 -445357 -282682 -11395 -255294 -70298 -203067 67366 -175170 -138946 24140 -128374
9992 -23023 -31562 55210 392735 -9963 -38454 -376843 27163 -125102 115843 410140 145198
9980 121319 8904 140216 69938 -55673 -45712 44281 -124942 -401189 -257324 85068 -95763
9968 -120885 -88823 155998 283932 66716 -146823 -219603 44128 -72678 165606 -5094 -20812
9957 -20812 139626 -135704 69914 -62254 -70010 195469 -33240 33464 -154625 112548 -150474
9945 -176325 -173684 144555 -229832 115356 -54364 126383 244280 -146269 162804 -156573
9934 311599 -40174 148970 -103769 -275350 -482754 -104714 104050 70983 -126709 -44721
9923 -356739 -244991 -343775 -194038 -27762 97165 94469 -194474 -344627 -91662 105038 -90695
9911 -247616 283712 300505 -595588 -147174 -169747 17149 -52383 -250763 -105759 -183061 -186184
9900 -186184 -160018 81544 212795 -77363 -406387 -65772 -41480 105206 -125526 -280171 -101195
9888 44800 -123933 -37792 168575 -87249 -305653 66238 41087 -105148 103781 -56157 292064
9876 -103870 -50991 96826 169382 -18303 875 -93122 -228760 -104865 67872 -68389 -95237 -164432
9864 -164432 -78372 -216003 -58972 -132975 -425482 -191217 -21825 5832 61468 -189031 -209785
9853 -209785 98617 -207431 -148912 218513 69437 189300 9211 -18755 60986 -99568 -285999
9842 -285999 325401 -125178 -408609 163411 -39733 150750 -174943 270457 372863 250408
9832 250408 -303249 133275 -315949 -334839 27973 35057 -386547 -88270 197927 -40785 -81167
9821 -81167 -148745 237517 328828 363821 -258139 -87669 180610 195238 -45949 -23062 -83512
9810 -83512 -80130 -244641 -42716 -409480 -42297 -25065 -361659 -107537 -83538 -227426 -50870
9798 -111179 -34791 235126 -8244 -322677 -105994 228863 -4898 -134950 -297018 181552 -104718
9786 148998 -78555 -323498 -211207 22184 -101972 -9596 54432 48451 125208 -161224 -117770
9775 -117770 152723 7248 151996 -103304 -328467 -299458 100730 -225341 22838 -158205
9764 -196323 -9462 22674 -323060 -299417 -76985 -38770 -39923 479424 -24318 201816 -222985
9752 121716 -36416 -23396 207830 345424 -110007 -249871 27942 20571 -176899 -24826 -280573
9741 -280573 -407388 -40747 89958 -196693 -207402 -293988 -119539 69306 -42268 -215264 48731
9729 -300268 -224018 83756 57014 -51855 -26275 76559 -234419 74339 285323 32295 151329
9718 151329 -23920 48637 34055 55112 55765 96578 319430 -34066 -40722 -65962 -307772 192513
9705 -85302 -140466 -191948 210867 -292285 -48712 60628 88116 -105004 4281 -12264 -39461
9694 -39461 -281065 -236594 -57374 8593 -52742 129737 187231 113117 58919 -208688 -364010
9683 -364010 28156 -252341 -276278 -193135 -143438 133221 -23929 -57239 -85026 48054 -115527
9671 -37170 -106919 -241082 -87556 -167344 -320713 -63530 -18531 -97552 -99829 -245750 -319877
9660 -319877 -90693 65100 -77920 97455 -280187 -116119 -8705 -2687 -57066 11473 327834
9649 327834 58886 12715 -162930 -233958 275486 224621 342624 -27517 -31676 -340418 17600
9637 -79018 -27590 52993 -36875 125934 -20868 195327 -189322 91403 -286641 49587 -238790
9625 -215690 -316000 -153545 -121672 93616 -198512 -313373 -73654 -195978 -251815 -329897 219168
9613 -117937 -301991 -303050 10074 -54705 -62512 -35939 -185292 112197 161480 174736 -243815
9601 -257953 -206006 -97113 69300 18413 -347539 -229229 176822 309029 -57997 -69621 71113
9589 -437378 -155305 -124890 -232972 -310748 -47005 -115122 -12057 108778 -177965 76908 -303132
9577 383322 -245000 -72907 16700 -244383 -304083 -20830 -105774 129463 -22649 39617 -136140
9565 164472 -73005 -95727 -359359 -53018 1165 -226321 20908 -348635 -81024 -6168 -81983
9554 -81983 -189439 -244833 69417 -145060 -206577 -204242 -263450 -113993 -133638 274795 -477558
9542 340882 -61465 -65050 -285870 39652 -148111 157736 -219251 -306174 -241847 154265 38279
9530 -100558 -105537 -53014 214243 48252 -84542 -10528 -47084 -130322 112386 -365960 -94672
9518 -155885 -134419 106246 78227 14806 -10012 268402 -6442 -66445 -405474 115831 -118029
9506 -137730 -47029 -254860 269277 -262977 39615 -37779 123007 57952 -9294 -66154 41271
9494 -247067 -12179 -83162 212567 -47436 63394 83512 -153815 -73738 -360346 -56293 -241400
9483 -241400 -282174 -80720 -72235 -81115 241222 -181902 -119674 165824 90642 254849 -36237
9471 -191025 41834 7908 480727 -150619 -27590 -38963 17116 165951 -22253 -75694 -255100
9460 -255100 -203887 -405275 -32051 -66518 -433708 21553 63954 -390769 90182 -1718 -301063
9449 -301063 -335824 183799 92909 -147853 169432 -112837 -295568 -83080 -223990 -273048
9439 -273048 181953 -11236 182109 -190024 206208 -65314 481735 161852 238950 34994
9428 -106700 -279132 18592 -112563 -65708 17889 -88681 -42859 -242223 -175124 -166028 -59426
9416 -26880 69840 -88439 -27649 116904 93927 11521 -92756 -270643 116770 -324834 -23651
9404 -275681 -398838 -21774 -161536 88606 143028 -71046 -84133 -22151 37293 -456948 261076
9392 26948 87232 -58344 -112147 -125448 45371 -108464 72766 -81823 29873 -144544 38969
9380 -426418 78597 -54952 174356 -389556 -26755 -499786 -153058 -289996 81021 -216290
9369 236221 -47108 169778 -120151 -374268 -272420 -280145 -99501 -105595 -35415 -27819 -259499
9358 -259499 67805 -221591 -115287 153179 -86771 -272057 -206603 -89060 -252267 -150793
9348 -150793 -34353 122496 -2955 -86778 -30961 -370254 109228 66743 60161 -247487 -211622
9337 -211622 -281249 153878 71131 -91792 134989 196913 -35897 -77894 -172275 101268 -46001
9325 -233631 -170905 5693 145492 17327 -149793 91074 101355 156576 84646 -145167 -336585
9314 -336585 -83920 56475 -407007 -41392 -47933 -253793 143644 260679 -80163 -37956 -207789
9303 -207789 67356 -82975 -150207 -351550 372307 -346695 157511 -462328 -355044 -21046
9292 -89341 209833 138417 -264233 -217606 160364 -9064 -97663 -49817 -57339 -237434 323526
9280 -181604 -136098 79575 -9692 -148540 -105163 243395 -20025 -105285 18140 -84917 -175713
9269 -175713 96451 -51969 108573 -192239 -85483 -118460 177562 -78785 -8884 -158850 217631
9257 -247845 -39058 46790 -130624 108391 -231299 -85099 127677 53617 -69931 74147 -257060
9245 106532 -103062 -352536 -106771 12795 -299421 244661 -250841 -231234 -407750 229522
9234 -277164 -200681 -84093 -217892 -330970 -232840 -272836 -160502 -172920 -7017 51938 274379
9223 274379 -168715 -329776 -319876 -150149 -117928 -266837 74509 217349 41400 144081 88021
9212 88021 259970 -307165 -111614 -217020 -392249 -471159 276575 -194085 -93403 38606
9201 209593 -139471 -142081 -216494 128389 105725 -189316 -219729 -119225 -95035 -91901 -13305
9189 -18837 -7675 57332 -125023 -301233 -181352 -293428 -387689 57307 -137688 59068 -88397
9177 -360238 -183816 -63344 23091 303621 -162883 96578 61222 40149 -133698 -386514 -146020
9165 -315298 52147 186290 14576 17810 -49782 -1232 114886 -178757 -34023 -76128 111191
9153 -312306 -425026 -117284 -270319 -149317 326927 230810 -264146 -186045 51473 55984 -40654
9141 -51875 150456 77647 -13972 -445454 -101256 -251479 174091 -113089 -4694 -52051 176302
9129 -267811 226803 60216 -45354 171489 -261552 -148016 -176033 -229516 -58912 -207065 72375
9117 -104294 -72307 -16545 9460 -140812 94914 -40049 -104817 -996 -151593 107576 -220112
9105 -280875 -269405 165594 -32516 -79782 -272462 161512 55198 -102365 -88536 -219415 -154706
9094 -154706 -240256 -228540 108108 -209462 -298784 230264 -93626 -63630 6539 -192260 -21303
9082 -379459 -51645 56569 74945 -8355 183626 62023 -329613 -222795 164212 141141 -9719
9070 231873 192599 34161 95535 -56699 9059 -233498 23598 -8631 266056 -166590 -233133
9059 -233133 -130085 222228 -17071 -34604 121295 -244171 -68716 -51526 83663 -220025 -197881
9048 -197881 -211670 -225371 -79203 256859 -524122 -138642 -86595 -231354 -200126 -128129 -98032
9037 -98032 423467 -329743 -7244 -104413 85739 -146914 324224 -85592 62171 55493 -118335
9025 242186 -198161 23338 -89289 -75349 -25342 -357693 -7508 -92674 361299 150752 196872
9014 196872 54179 -53954 -23024 20494 -140032 -150480 -360107 -168509 -427141 -175071 -116803
9003 -116803 -41299 -60180 14229 -33627 4292 -155710 -301693 -346154 21866 -235721 -124497
8992 -124497 -14179 -71281 205302 -106895 -45463 162722 -398988 -56462 -31541 -369596 -52151
8980 -228243 199564 -169376 -192794 -115748 -131358 -96338 -232038 -171244 215440 123798 110094
8969 110094 -207636 138609 -50081 -193646 -180632 -37303 -63615 -50772 -80344 -207358 -19035
8957 -61919 181940 -178631 279991 -208851 158898 -32202 -4197 193990 -123483 -229040
8947 -229040 -321076 94053 -228013 -82955 -49813 35985 40118 -179909 -190515 -48090 2157 118157
8935 118157 -296582 181770 87360 298650 -148646 -191167 -118163 55203 217521 7902 93028
8924 93028 170795 18909 151713 1808436 6167724 10127602 5472174 2216132 563494
8914 173276 117293 18796 375069 -59551 -602 -42343 78657 191904 135840 116409 -98663 -296597
8902 -296597 107368 -206545 -98511 82114 56428 -70054 -257586 55539 -42747 -77122 -64667
8891 -64667 54506 -22658 5648 -76161 -176308 -7272 169760 -74818 -265534 34816 -172230
8879 -54538 72054 228054 -325765 -257139 94924 18719 -141073 -173163 -108860 -208092 -107110
8868 -107110 -232104 186215 169005 -105312 94249 80222 105100 -70030 -30271 18185 -244146
8856 136129 -220340 -125527 -52166 -307432 -135739 89728 -97361 -88039 -70303 1775 -10697
8844 -59220 -73198 -90109 141793 -189131 -173009 -267515 78243 -90221 -122138 -20117 -200904
8833 -200904 73566 -167103 -42695 -192439 -32673 -90481 73261 270861 -246374 -188491 141814
8821 -139041 -237274 82214 -203155 -61265 -123357 107834 83418 -297414 87274 -403995 81376
8809 -177144 -103946 -135767 144240 26450 -144100 -43885 313189 169218 68900 -25856 60120
8797 5983 26721 11260 27910 26315 361997 27244 -416575 -312458 -3186 -392922 -247156
8786 -247156 117595 -96096 -205635 126043 -298008 57682 -521356 -236977 258501 -33198
8775 -194740 -171698 -233117 -2370 -391655 -286363 -189407 135280 -44332 205123 -206739 261489
8763 116780 219897 -285545 398230 -178215 18038 110167 -48159 9174 -70273 -77004 738 -28714
8750 -190314 -97172 -89286 -12276 -263100 226265 -323117 -101401 35045 -33084 -23720 136282
8738 431329 136941 151408 -19019 -205013 -103300 140716 22337 -100753 -156985 -226567 152822
8726 170039 -83684 -133061 -94071 -364319 -192055 -109736 100467 70371 -10043 -401688 232798
8714 102129 -134699 -19916 76436 232829 -342823 -38377 326202 86211 118044 -146642 -119809
8703 -119809 15591 -240729 309909 -122782 20917 -252805 18795 -20253 -36181 -289596 -118167
8691 186163 -113668 47572 165490 -72925 -16216 274818 -52167 166985 -363248 158655
8680 -265452 -85275 90435 79858 -233642 -185111 139803 -2 -65125 211758 -3137 -565846 35544
8667 -23456 205150 135783 -400451 71536 -62491 -139452 -83309 50847 -56915 -167489 -65748
8655 91646 195444 299658 -150861 -108370 109766 50328 312493 120460 -82447 -136295 -101507
8644 -101507 38011 168386 -246077 163944 -143197 210185 -151238 -32260 140584 -72082
8633 -169235 -283167 -338575 90122 -273594 -69865 -59198 -195223 -137198 -273028 -5488 157936
8621 -5780 -157492 -98515 200174 42603 -181079 64326 -219720 122106 27817 -126512 282719
8609 -140711 108510 -36238 269408 140123 -215115 5686 -323170 -117556 218192 -115068
8598 -88834 377707 -56809 153070 -13553 -239416 128573 134206 -92401 -190443 -83473 413231
8586 53653 -108038 -8277 -4687 -150861 -222335 113597 28226 -229600 -294712 162734 -210316
8574 -139558 -113339 -168228 -69339 -193508 -206220 258441 127975 -33327 -112160 88936 -18038
8562 -13345 -151971 -212253 -351437 -446293 83883 89009 -101964 78233 50004 117720 -264794
8550 7592 82017 -48370 -285960 -176274 67874 620 213399 -150674 -111899 -50222 191024
8538 -210496 49604 -76269 -12972 42048 -84086 242706 41305 192167 182076 -197904 22768
8526 -337045 -36461 78876 77095 32814 -87216 23437 -194669 10742 -168295 86023 259 200602
8514 200602 -37852 -456654 24082 -277213 -35321 -33665 44383 -313134 -45469 77987 -22132
8502 -225117 -133715 -46970 -224329 -208986 -487483 11591 -190010 -262567 133657 -222717 143965
8490 42094 -23473 -40421 -56267 195595 -47035 -184876 235190 40178 10143 -182625 -183533
8479 -183533 -53202 -157313 -69858 -272051 -131937 -173966 -100025 -305321 91880 77170 189708
8468 189708 103542 -135850 -28945 -70361 -161767 135440 11861 69337 -124092 71287 -125778
8456 -166324 45821 54741 47824 -148469 -103492 -276402 -258088 121490 -181166 -236376 -126317
8445 -126317 -304185 52211 7939 -230210 -283334 19646 153293 -99148 119151 47340 234583
8434 234583 -6144 -59038 29190 40994 -171756 67906 -19344 92676 -288369 -142590 25641
8422 -142266 -53162 -101368 -75339 -207830 -223895 -134587 -213690 -39005 75652 -467955 -217440
8410 3789 -129688 -100304 -215345 213433 -163512 2162 123849 81970 -36993 -31274 1771 -119286
8397 -330163 159382 5291 16552 -251618 -279997 -225892 51421 92261 34824 75357 49587
8386 49587 -317001 80710 254023 -12567 39539 84572 -166140 24465 313473 206231 -95618
8374 184007 -84528 107643 82071 -287292 196864 -76031 -193637 -344223 171462 -51725
8363 264612 -189099 -224986 -86221 -34176 -141801 27058 -69958 203249 76497 37120 -82409
8351 33545 92298 -159939 -274887 -13910 119042 -24901 -17165 -201912 -274114 -170408 98444
8339 -242676 -105816 96775 76670 -86326 -7725 35853 185593 8909 -65249 -149279 -114265 312996
8326 141954 11836 -163216 -262718 -163764 -112280 133351 -407503 30143 -304626 41509 -157618
8314 100050 -82461 -213451 -67430 20514 -54243 -132306 167495 -133563 -114681 256835 -128628
8302 103088 -17255 272230 -103190 -25004 272152 -227189 -390901 22152 148749 -81584
8291 -60399 46273 -253694 -240130 237226 -4432 316369 113933 164091 -84948 -398457 66365
8279 -193966 -352420 -149423 -392634 -113989 40651 -183124 -261440 -63387 -64075 34846 -184159
8267 215746 95146 -47191 22829 -4339 -116856 -40509 124291 56815 -296340 -95927 -53564
8256 -53564 87164 -40959 -228940 -16349 -135189 91084 192878 -67595 -91349 34444 -123022
8244 62601 201588 198637 93444 -3223 197959 -106798 -188674 137426 14796 -105125 46965
8232 -164920 -5263 109597 -94629 -137734 134447 -10070 104856 -223417 94045 -157046 -247538
8221 -247538 193811 -116382 90663 -204341 133338 -6629 32579 -184623 130860 5891 -207661
8209 157872 16478 -142995 -168804 -198630 41924 60535 -122876 -234208 -44110 -142090 -56084
8197 -473282 -406107 57980 78097 -204787 234237 -11502 -53772 -5788 -121032 41746 -120405
8185 -20586 -129211 74829 -140790 -167705 -51214 -261504 -22091 -117036 -104944 44756 -38202
8173 -312799 -82057 -277427 -144889 -61357 -180902 103924 -187347 57596 -143240 -192363
8163 -192363 218989 -111306 -59237 49655 67521 -162375 -203712 -158317 -59261 218898 285079
8152 285079 104473 230299 208761 -72110 -124089 145272 27116 -33635 -87326 -172668 -10094
8140 214925 -228855 -239759 108762 -158704 -95116 113851 -144870 -119463 -102146 -247724
8130 -247724 -91727 72570 112630 141317 -87683 36660 200022 -149662 -263610 405684 -189081
8118 -324997 -332906 -51517 301036 -112943 129609 -7346 -423671 143900 -196475 90807 -25819
8106 -18561 -356861 -110542 99062 98809 -137879 -249611 -161622 -97653 94003 -240879 -412436
8095 -412436 82292 -54042 15753 95855 9976 330937 -199699 -21552 189362 -78850 -187801
8084 -187801 178088 -48308 -6559 -251857 -224113 104336 149911 5700 -122494 342871 228167
8073 228167 -300366 161158 106932 550972 -287656 -70489 -393391 141284 -177800 -65615
8062 -26638 -145964 -252641 -84787 -61797 167404 -350839 -96135 8468 -166813 101852 -19833
8050 53514 -73706 29781 -132451 -282346 78267 -19833 195237 124931 -396 -23791 -148483
8039 -148483 194135 26501 -128696 -101964 -84309 -160366 -111833 -273977 22370 -132828 -140282
8028 -140282 -86305 129360 -255762 -87069 -119066 70757 -102032 -35528 -228689 80237 -5067
8016 -33854 124724 71818 -199125 43815 9319 -247662 -86189 -101419 227337 -305617 293201
8004 -356464 138209 -166112 70676 69990 -238375 -190450 -30184 12926 -49735 -183024 22120
7992 -22020 -153634 161741 60806 68946 190303 140512 -379378 -92442 73445 43977 -97863
7980 208382 -223435 136481 -287335 103809 -49940 -137557 -274629 -21442 -187847 51387
7969 -20289 1385 134710 -22875 -74078 -166495 180066 -12241 -146383 193992 -61215 8493
7957 -31707 -12183 91945 -120140 201844 -781 226146 -44563 52327 57419 -50654 44855 -189297
7944 20044 -128424 -221356 134276 -50881 -196943 43884 -176739 -127283 -257492 -5233 22294
7932 45559 -183602 98811 7134 149831 -311047 228450 -254721 -231429 2154 -73196 -102771
7921 -102771 -134084 -137906 -122133 -256696 -220418 172157 -494607 -97394 178521 -107810 -133026
7910 -133026 -43920 257501 32890 -85238 146554 -293633 -84561 -143569 131660 -101944 -37445
7898 120254 -70418 154227 136159 26419 -333410 134417 -56129 28623 -120252 69785 -348174
7886 -10526 97657 -524036 -82542 -6505 -470662 -14540 53854 -93653 86306 -190961 -351854
7875 -351854 8576 -205295 -212264 -35587 118515 205263 -168616 -333410 -26889 -231 19761 -166010
7862 -211458 -207005 82505 61326 -8792 -243420 -325964 119786 -180508 132382 -249272 149186
7850 147142 7138 -6449 -141649 -120090 -196298 -77266 -165647 68185 -126202 -96146 4526 -70170
7837 87605 -54613 127952 -332924 61075 -132263 -62316 -158486 243568 -146994 94878 -244369
7825 -153977 145262 26636 -224540 284721 -237672 -16393 5151 -13166 161849 166890 5670
7813 -429888 -152855 -243300 -171050 -165985 38394 -245370 18994 -174062 9514 -243430 -179457
7802 -179457 51448 106898 -234229 1580 -244081 77471 -107795 -164621 40736 151373 124145
7791 124145 -17739 -118773 -102504 -93418 -58333 29901 27404 6864 71737 -258424 -99283 -246574
7779 -246574 -89522 32988 -23262 125017 -83865 -377312 347373 203335 371196 107777
7768 -348342 -178840 -110313 75203 371336 -193673 53831 -205765 -236162 4869 -185689 -31728
7756 137847 123832 -64457 -282470 -15630 1167 78233 -34438 -12923 343802 114790 -56336
7744 257758 -34213 -96201 -41851 -204672 263244 203511 -181428 36333 307143 -101600 -23842
7732 58423 19038 -23538 53320 -41654 288864 -37870 9186 22072 -65443 61082 14975 72336
7720 72336 -87788 -997 59047 -178034 -65205 14177 -3568 -176150 -55000 -222722 -116887 391333
7707 138005 26956 -264820 -46412 -63933 183374 -30437 -277152 -81007 334316 -249937 -79008
7695 106553 -277428 -75430 92989 187203 -20044 -29278 -12327 -276947 -88084 26505 -152088
7683 132957 13743 -25533 318656 95604 -1974 101639 304053 -254167 68896 -450392 71618
7671 19154 -66687 -18166 -70833 -121493 -344440 -50664 -125743 150415 48935 -18633 -178884
7660 -178884 -256195 -89712 80531 22930 -241669 -115358 11298 53195 -145362 229996 251309
7649 251309 120122 -175479 -37554 -64646 94894 -38006 15362 -116609 -220052 71468 -104442
7637 -24722 173162 -209092 214384 -8953 -227064 -28292 -207913 162576 -263118 243290
7626 -215448 226183 -220326 315283 -213082 238709 -67947 -40738 -218510 -122930 -88256
7616 -88256 -34659 -16338 -92637 -180064 -37328 -66392 146264 -107012 82341 61812 -152684
7604 -345732 -125562 31514 -210237 -162800 -270048 -47364 195392 106452 125665 57682 -234035
7592 -198020 -34167 181060 98557 79650 280674 176951 -178097 54410 124974 10136 85762
7581 85762 22371 -69308 -190614 180106 -267566 -9574 -16722 -164177 27229 -161251 19586
7569 88317 -392415 89392 99333 -261026 -3117 29143 6384 -58495 37406 69864 42606 -50848
7556 -118447 427757 -241013 114139 -204301 57414 -133589 -348330 225567 153065 -15298
7545 199843 -67153 7394 28435 -55174 152282 -628262 -87097 -201491 100318 -125801 -289080
7534 -289080 22345 -118871 -72629 -125777 -12300 460520 -39076 -240283 100196 -327459 272546
7522 -40800 -587617 15584 141831 -208936 -153691 -363317 -156361 -25980 17948 206204 61853
7510 365187 -115891 -49415 527479 126453 -7470 13394 -70678 -287019 -169574 45530 -195999
7498 223717 -16084 -96079 -319681 -156522 194097 70059 18696 112736 64148 -185736 -189004
7487 -189004 207940 -162842 -101383 -175751 -196497 106049 -117959 9333 -33797 104213 73291
7476 73291 -142067 -191095 -291767 -292667 253328 -159518 38097 5693 -17825 143605 -141433
7464 122816 -54042 150415 -54398 223408 77903 -7853 -184338 -461193 -154237 -78019 -163889
7453 -163889 1282 3533 199243 -69745 176625 17549 77526 -80702 211240 -87078 -107566
7442 -107566 -23343 -370763 -288414 119622 -7932 -27338 -99646 -118408 -132662 281714 275039
7431 275039 -146873 -161094 36276 31312 -362854 23767 135076 -79422 -246903 -284901 82818
7419 67108 -84492 223793 -63558 8918 97118 -83049 -167948 225807 22235 58677 -334292
7407 -138589 -123956 -305902 -298998 -175348 -110119 213760 -213850 -43102 22817 -265472 -35907
7395 34309 65557 -46538 199176 -72235 -435493 -110418 -53694 -336210 -89191 70125 34031
7383 -41792 -38385 89390 -129742 -29095 -106552 237842 150166 157547 -125804 41198 127706 234728
7371 234728 -52954 228809 -150169 -270065 43628 -199861 -7774 -287998 130263 233767
7361 233767 -198725 -14413 98148 -40966 73759 116168 38673 214914 -205830 -28424 -111672
7350 -111672 -237324 -61501 252445 168644 125212 27927 -24621 44904 230470 45659 -53868
7338 -5845 -167981 -122024 -47262 137874 -92356 31095 -327250 -24970 -277753 -15376 -377678
7327 -377678 -38709 -255245 -243875 -391865 -19011 23000 -246253 22988 -282724 18503 -232656
7315 101870 131508 -194353 185454 -119337 -62434 -368485 159013 -214975 -176831 -162295
7305 -162295 -60384 -299292 -61375 -253319 -256113 31359 312073 -58603 94178 352484 -199175
7293 72819 117004 131036 80685 -68690 -102119 -255327 40567 24273 -306548 -32122 273723
7281 -273819 50781 -153071 238941 -96773 142055 -10717 -208439 -52691 -90692 123618 -284976
7269 -88742 226255 43619 -178901 297182 -272433 -17168 -191711 170716 -44306 10870 155421
7258 155421 187335 266675 102084 136266 -148610 -311782 -74726 -248132 -37087 -6714 17487
7246 213304 -1935 -239101 -5114 -321216 -125445 -165287 142221 180668 -16374 33090 143408
7235 143408 -263422 -113318 -77862 -24934 51134 -40217 -223480 -155143 170194 -350205 -270960
7224 -270960 -29527 315006 -53257 -185716 98568 -338773 -209797 26037 -31048 108193 246923
7213 246923 -87319 27513 -208449 482215 197817 -124635 -6885 -73687 -90857 65052 126672
7202 126672 127679 481652 -123108 277603 -234195 434090 -111799 72402 -83275 -21159 153840
7190 127658 -2432 -13493 -68874 -30995 187771 -295388 227474 44171 35724 40640 -141587
7178 -8959 118652 -165555 -269864 163268 101495 9823 253057 9025 -296260 -213774 -332918
7167 -332918 -23826 -219837 -120506 -102709 -77420 -344534 209528 -383028 -22097 65195 -108709
7155 23359 63968 -72091 102087 62609 13611 118478 -121710 -140914 -43160 257738 6684
7143 76639 -306775 290182 -438463 173655 -82663 -87763 119587 -33217 104173 55152 156259
7132 156259 -127954 -84227 -179913 -272544 55712 35737 -95330 -268405 105362 38027 -33560
7120 -207782 -91523 245996 -170384 79263 -330095 99049 33834 25137 22919 -7388 -42615 -30616
7108 -30616 125345 -25195 234128 206225 109512 164905 207179 169879 -54705 -184377 -139866
7097 -139866 -16320 62548 143242 90386 -101383 -52100 -47636 -211026 -174476 47143 -280480
7085 95714 -201868 35618 294338 197106 -149607 -124481 -57080 387092 -108172 -144970 -85253
7074 -85253 -369697 -157004 -335237 -29627 159063 -83846 -12319 -272343 -117663 228101
7063 143548 -340661 -185901 -130594 199661 -195916 331411 -399677 -215738 -119410 195492
7052 -84983 26335 -129781 65502 201109 33911 -208564 -84598 -33607 201708 247444 -121560
7040 -7548 -221230 123780 -77596 -406760 68302 -306159 2282 101796 32215 -183951 92505
7028 -98180 77089 132637 -209636 321638 -66411 46588 -204232 85514 -358587 245254 178682
7017 178682 23637 -124676 -5998 -86847 -174663 163088 -111589 177701 293181 -166949 158438
7005 194505 251098 243299 -80431 94082 -24424 -218359 34052 142610 -222874 66260 115098
6994 115098 -108146 -12216 -168239 338680 -172338 -73925 -231392 137420 64132 -33635
6983 -183579 132455 304874 -145184 -422995 -28795 -229230 -203515 -89042 -143869 -132123 -178583
6972 -178583 63438 -204906 24474 -253862 155213 -24361 -114735 -79028 -113697 225465 21005
6960 -388563 545869 9669 98781 152561 -207887 -58309 -136782 3986 28591 -41296 -277104
6949 -277104 -298325 117874 -62671 126689 95778 -372058 -515800 228306 -151312 55731
6938 -137552 -214534 -185755 100436 -179394 160068 -439534 -126214 269738 173595 -353796
6927 -31561 -91413 -232855 -374797 195148 -147373 236171 -22301 -27209 28162 124294 93267
6916 93267 164037 -28637 -228455 -62387 121962 113356 -24551 207724 -155514 220241 -125616
6904 -468039 70125 106083 257430 338114 -96001 64991 -26970 7058 6779 8550 -273244 -13252
6891 -100427 409761 -57715 47025 -325930 -44860 388073 -100920 -52219 101278 -93948 -69243
6880 -69243 -46646 -191769 -18240 -170857 172560 58944 -101501 -104019 -213861 -6579 361228
6868 265744 -116137 327130 -60155 -177793 43080 81366 -185695 -26702 -201203 227646
6857 8325 4872 30467 106604 70797 -126911 217732 -175553 -382060 -6308 -181275 -5269 175922
6844 -68740 -11075 10269 86912 50950 -26266 92489 251616 -139791 -19583 -83737 132106
6832 -66446 -195643 27999 343563 9948 271104 -244400 -139579 -222801 -8875 -242629 123019
6820 -63926 -35670 254370 127154 -304590 201590 -126591 5371 -62290 127534 -162265 -86229
6809 -86229 240473 36108 141883 99070 93169 -237829 272844 58771 129909 -42860 58921
6797 248183 -56197 -373145 -57679 -33432 -155245 353116 -101398 -108883 -128558 220020 99882
6785 193508 -96855 -30229 122062 -130791 9890 -295583 207705 -95099 206583 -358671 -6124
6773 -243533 -161745 -349956 -250547 100089 232793 336692 -136419 88196 -34705 -98174 404599
6761 33783 -148332 17037 118507 169354 -187539 72184 55726 47006 -290945 120813 -98195
6749 9547 91416 -45741 147321 12856 -439072 363087 -33471 170816 -235288 109149 126514
6738 126514 -267286 -111808 -79759 -64392 116370 -103515 -33989 -128976 -209229 -128814 97982
6726 79901 -126228 92808 -185962 10126 -217437 236314 239442 128303 -166048 -122119 194478
6714 -23714 205475 137425 86754 -40559 -306590 -156772 -278644 -43534 -126183 -283689 139130
6702 -141276 100353 52671 117561 -296778 15681 298020 -43480 168444 245422 -144471 -40881
6690 -147695 115118 27699 -12689 155038 -106391 73753 251870 81153 250397 273313 7720
6678 -75561 -607124 82508 -127625 98173 57591 35024 292978 68013 -77706 163268 -104223
6666 -213392 -138089 -142575 65174 -303629 25946 -116047 -240312 -232535 -62609 -151347 -129495
6655 -129495 -53082 -27207 72239 145176 -103931 -199501 -154554 -145219 204695 -179519 40180
6643 -107031 -19016 170048 -114240 -295535 33181 64402 -124202 -125992 -190530 -67893 47301
6631 -17444 328243 317106 -225278 313850 -126202 46097 199350 57838 -112058 166134
6620 -395318 -92257 -210977 66449 213797 -107904 148202 -181607 50583 14648 136196
6610 136196 88220 -153066 -273520 -67004 18589 -34905 -202417 -124936 127496 237028 -168589
6598 5635 -174919 147337 -244018 335794 -94693 -158528 126016 80662 52869 -79896 268935
6586 -11189 -23912 231933 214580 -870 -167057 426814 -302439 -187967 162118 114089 -61499
6574 -57748 192241 -107520 140539 -312912 -143662 234288 -139773 3080 -185081 338296
6563 -250522 -13609 115122 135342 33406 -122379 197719 -143609 142975 -121948 -23202
6552 -225011 232091 -42942 56099 135614 -125700 139133 137345 -46090 -130969 127155 -63034
6540 -78835 57575 -104846 129911 52953 -49842 -156986 -80805 -362487 -221475 133587 -37483
6528 343550 -204550 328783 -122612 -112958 -132346 354272 113105 -107139 -13680 24462 -213453
6516 -35287 -196824 -106584 -145030 -237465 156323 181819 55412 -334265 -74951 -408814 -51122
6504 164574 -221385 163013 -55969 223056 131778 32491 117005 -147724 -97594 -112911 -40947
6492 -201184 300794 -245432 -275528 24964 -121828 -247347 -22451 117789 -70511 27126 -57565
6480 -139747 51140 -255313 -85395 77584 -167205 -91471 170510 -128802 122803 94183 183139
6469 183139 5223 -70975 283752 45795 -149693 287946 -165043 -130999 -544715 -314346 -96968
6457 131337 -217291 -113717 -9030 -86473 -66486 -43558 312801 -75488 254590 -113936 -112712
6446 -112712 -207610 -32678 -99810 -515301 -172304 -63236 124458 -21553 -132416 80793 33255
6434 -183378 143657 13418 147459 323546 -38054 -250105 -190982 37852 -30552 -72460 -89723
6423 -89723 281820 -230341 -171043 -115394 -88357 -33583 -160744 -22417 -122244 85373 -341379
6411 -6176 -206689 -209337 -205671 65749 -145719 -19459 150650 -268881 23640 -225830 14044
6399 126609 -217303 148915 -253183 139303 -113198 43652 66635 68993 -140775 41226 97550
6388 97550 -84502 124356 -12594 228127 -302508 -3932 79706 -171501 -67416 126161 61025
6376 -70755 295547 -75850 122331 49433 -258691 -57385 40276 63305 136521 -42944 -120696
6365 -120696 -73704 -38265 79062 -280129 -109635 259480 -171340 -318841 -22300 146070
6354 -241318 -31625 -56821 -89475 31345 -278864 -108141 -65128 -237928 95373 189119 28853
6342 -78821 84718 38649 -34845 -305829 -161889 186761 -446969 -227708 201107 105574 -16391
6330 138907 -37287 -229073 -142405 -405410 -107240 154852 24952 9779 216266 363065 -16575
6318 -238614 32994 159151 -202231 -192965 -8034 -162836 68615 -351918 -127462 302910 62643
6306 -56886 68225 -126651 -109468 169513 -145616 201862 -5010 78498 66423 115191 -32057
6294 96583 140075 -253378 -115984 85479 -124041 309581 59125 -40677 132369 -72012 -137352
6283 -137352 -322313 64844 75412 -25986 48724 -107180 61194 163100 300827 -181709 26121
6271 392962 -120719 -188567 209243 -120910 424224 -183317 33441 307083 -195875 310675
6260 -78808 96248 -162165 145309 -197654 -38686 194282 -256827 95366 60811 -41359 7531
6248 -99870 -332325 243240 -224200 149434 -119992 -719 250829 -324365 78433 124888 112787
6237 112787 263888 49830 119766 111126 70900 -102318 451675 11789 73891 120318 265870
6226 265870 -289808 -37290 123306 -192832 -3478 -198894 117916 -198988 211313 23669
6215 -63222 -184481 -92228 -338475 164567 -378149 -339447 64285 -297293 -61403 -83386 -274377
6204 -274377 -251088 46434 -48949 -38940 189898 340567 195658 -176754 -33941 -167224 -127162
6193 -127162 -447936 228304 -128341 -300058 113468 -103079 -29173 -322363 16033 -125667
6182 26432 -162977 -58440 323004 -514421 176291 24517 -112299 36634 246597 -53499 167708
6170 58095 -83710 -10314 -166296 101865 -83912 -251952 362941 52047 -15602 -144350 -191396
6159 -191396 239931 -48939 -623 -127037 -14065 92471 114497 158265 195558 -358134 10627
6147 -66986 -38663 -190704 158417 -185918 -46569 -24818 85461 33047 71994 -56322 -339342
6136 -339342 163173 -43690 -148582 -130524 -45054 77753 -8285 80681 73732 -121580 -31396
6124 -62700 -182925 271480 -56178 -2765 64625 -216715 -55059 -106484 82192 194458 183097
6113 183097 -152123 -269317 -136963 -277030 -308902 -36595 -253994 -46296 311455 -8495 75159
6101 87409 334464 57279 -193931 217829 168781 -38575 -226748 120828 86 -70657 -133592
6090 -133592 255271 -240467 106217 295326 -10072 -301944 -151437 88195 -565 -61609 -91135
6079 -91135 259382 -213715 -392286 471293 15516 186819 -223806 170536 87576 251310
6069 251310 262222 -241261 -26191 25956 -195181 -52376 150775 -343386 -16438 -115924 77273
6057 -72994 45620 138535 -301028 -173437 181879 66938 -45701 -296001 -228384 -108981 206720
6045 68328 -170741 73802 372809 50561 -287045 166297 61642 -187839 -118927 118441 -83093
6033 1304 52920 50181 -7192 116563 94724 95442 -338188 60701 -316687 280230 168208 293493
6021 293493 13100 -126192 -242157 -11239 -314455 -138560 -128696 -68887 138484 -18916 -230143
6010 -230143 -200013 -76648 -33516 8896 38727 146578 271232 284261 -201648 -41899 203072
5998 56343 96670 -93528 297449 -105030 -14450 -61752 -110007 -15685 -298512 -100407 95075
5986 31689 -112690 192315 94343 -95303 -209788 -10485 -103351 326757 241552 -220180 271560
5974 -140734 158574 -38029 -159981 -101195 22320 148403 -73795 255599 192627 58159 450392
5963 450392 -93155 -131106 27429 32619 134409 37887 187141 10228 165385 -115587 -74752
5952 -74752 -351419 -261777 -258749 141729 255449 34684 130940 442115 -86281 280359 -131905
5940 -226987 -27503 212548 54685 274867 261377 -138967 -90436 59622 -110800 22246 -20016
5928 -172018 30176 -106599 -17664 -17237 289659 47546 168990 -107609 -55699 -2789 150479
5916 -126192 66846 86301 83647 87610 -264604 -278557 67515 224214 -132259 -12939 -160868
5905 -160868 19499 -157322 -145710 123239 264726 96783 -123430 -100167 210679 167792 -159831
5893 53828 -47994 101619 -330467 80249 309322 221200 -269026 397719 -176586 58209 252926
5882 252926 -113936 -15927 57351 327470 -80330 3382 -187388 -151279 -241292 -153983 -124488
5871 -124488 23163 12890 22944 -40434 125829 -199740 -282465 -2986 -52620 -81770 295239
5859 -270289 -123089 292726 101134 -251985 25808 144820 29668 41718 141613 46534 -361625
5847 -243162 -92856 -69424 -134346 -168419 82209 -162310 171338 -186469 63070 139365 -27906
5835 -41391 213505 314866 75741 -176337 -258958 55601 -161348 276612 -19126 50001 124087
5824 124087 -180236 -21690 218476 253390 -402985 184461 106212 -51049 155980 78245 15600
5812 -46745 -108206 -167510 297957 -227632 14170 -222226 112949 -90090 112192 96353 182035
5801 182035 90712 -218023 -111744 -137946 216101 124679 124657 -280323 -192658 122063 29993
5789 -32295 -116339 -133179 -5960 41604 61354 -156361 97549 232473 -294064 -7347 50279 64355
5777 64355 210272 -62814 -44206 12029 -90176 43016 64665 -104285 -376120 44194 158539
5766 158539 -70715 -154861 192211 283530 -266171 -52805 -176520 -54128 138090 -34500 -263102
5755 -263102 -3306 108320 -93992 210799 -218937 247251 117341 -254519 130979 224401
5745 224401 179037 163365 2136 109692 -85187 189155 377098 -37076 116022 47257 -161250
5733 -231253 -10917 51738 -15028 343551 94108 -283847 -25103 159597 126050 151101 75756
5722 75756 133647 -126973 -145620 -201786 28147 -154671 145070 -115045 339173 -48675 -232719
5711 -232719 135365 126042 65211 -26201 -51237 26758 -116069 167653 -186305 -23285 -78419
5700 -78419 137392 -50534 -98945 -107094 -232478 96586 -80335 -101225 91577 -22636 -31301 19756
5687 -401324 395 -104310 112697 146872 40743 -255720 250483 82082 26572 -506 -182065
5676 -182065 48905 -114998 93852 -111695 39245 179195 149234 -7271 18111 246802 46316
5664 -153606 -244163 101289 -94587 58369 -153156 -158516 -272699 -296361 120414 -49038 151012
5652 75366 19059 -150299 -64368 -166711 236696 331225 232527 -53984 274141 -43336 -81408
5641 -81408 3382 -8088 67951 -165928 -100241 -9995 -6415 -55134 185707 313642 -127579 115469
5628 -96645 90407 -233181 -158703 -72785 171706 135159 172644 -370190 -115281 86569 -182259
5616 -143753 40932 322486 -140301 -56012 54005 -114811 -1413 177414 87263 41326 -255630
5604 -73134 57771 -40128 -189411 -137908 -92101 20407 24901 -125059 310308 -199304 135339
5592 112797 59546 -70946 203452 208962 37253 -19059 -76401 -150006 206847 -196311 129524
5580 207330 21032 149655 -201758 85341 -51362 43764 183518 214244 -28863 -204072 131951
5568 -39744 -316317 71766 -141522 128835 -124716 222154 -236571 -62046 -33482 -428960
5558 -428960 358391 -128847 -271847 -160702 -49333 -20512 190781 -6554 116936 401517
5548 401517 -213989 -315294 -318985 8095 449406 217038 63384 -50076 -115639 96497 -240858
5536 -94281 408303 -447790 -103859 163970 -107966 180038 155693 283912 -36782 185770
5525 105404 -231113 73535 -378332 -18524 -79405 119019 -51698 -220204 427185 -110393
5514 -332894 -56428 9272 55012 118727 143382 94844 314034 -43348 -18433 -319992 -32202
5502 62332 -133959 -323423 174780 -248644 -9291 -41689 188000 -364928 -300730 -20253 -59062
5491 -59062 160459 -51870 105521 139560 244153 255780 152512 -223656 120446 -196216
5480 281104 -44391 61349 -229543 180911 275867 42907 -84020 -63626 294476 154647 -22418
5468 277690 -406469 -79022 120959 -214430 -275081 -15484 238742 316984 17825 40041 216946
5457 216946 -262455 212955 129796 118593 83013 9503 -478085 -57056 -120992 -36619 -60092
5446 -60092 -108466 -38002 -334153 -150094 85550 -174 -54954 -35561 -74769 20767 78240 241674
5434 241674 -56068 90953 89080 252006 -53849 -20216 -173633 126395 -74115 -80220 -8055 -38315
5422 -38315 206483 376274 419897 -150735 -150444 326814 167530 -172620 -201843 -18757 53702
5410 94053 -132757 -198316 -155747 19860 62725 -123853 79472 -555204 -310472 -177818 -39230
5398 267463 8998 29121 -130345 244017 32267 116824 24697 280039 -64807 -11788 -54246
5387 -54246 85459 398866 231156 -50908 28881 279152 -91530 -68022 -62826 -62171 -262971 58342
5374 77764 -41068 -99243 6559 -267999 -297523 254457 -90523 46040 222732 208797 81481
5362 -126380 177250 61689 64296 -123272 -170397 -18647 16538 177288 -280328 -182092 -78005
5350 272922 -77452 -81857 23092 -5553 222215 -108261 -18429 51781 353117 -101310 -18743
5338 9120 128925 -273472 278696 -2080 144516 96437 204256 94649 -60378 250523 -176878
5326 -107724 35445 -100834 -153326 120983 58341 -131875 40856 -197616 -42754 -17264 59872
5314 19141 -77695 57516 180558 843 160757 231108 30316 58068 280094 -83250 4296 668662
5302 668662 -117750 -13216 -11146 39041 34817 -232520 285307 134267 155036 -175392 -270694
5291 -270694 142851 407427 -62348 -92816 -175148 146020 114735 32367 -88225 60138 -282579
5279 -435277 -132943 -108412 20994 378843 -179380 -67331 -99639 -43198 -159348 -61203 -463308
5268 -463308 -95145 -156769 -28329 -88926 -37964 26197 19438 89259 25567 125707 256690
5257 256690 100570 89172 -83827 84203 -3993 133222 99593 -2535 -164206 146592 -216911
5245 355827 224124 -29867 239149 -59310 62765 245892 -54551 -338352 79254 156746 -82942
5233 -60594 9552 -404296 -98121 -61492 30525 82037 -249859 146353 77554 71822 -43735 234998
5220 -36030 -278180 88002 -47325 -134234 165471 -77388 32220 217752 -178839 278758 235547
5209 235547 -318228 150647 67699 230368 341770 18494 -45482 368966 340682 -4131 262026
5197 153185 419380 -113811 -323246 -5914 -64834 192238 -122335 173240 -191826 -74274
5186 4511 -237961 155103 -177011 -172113 4533 140442 189915 46348 18387 164798 -37409
5174 -90281 41486 172979 -6686 -223104 -47335 2694 -111472 -99213 -206914 -76972 35342
5162 26181 -83155 16077 -34991 -131468 -8579 -82990 -94171 -202826 22820 -81407 -104500 -246703
5150 -246703 58253 239899 60642 4032 44669 285060 134728 -110137 110542 -206343 39729
5138 -248447 160458 -149358 16028 -196730 -85335 31714 111229 524718 93565 87067 -177896
5126 69066 -132719 45399 -243349 -114705 -25545 26799 -86476 213372 -173307 -215337 58384
5114 229019 165171 250867 45872 14080 183830 84766 -102176 46206 -151932 -233312 -176074
5103 -176074 -160623 113540 68131 -19195 127146 -16112 125248 -205593 82721 74323 47361
5092 47361 -38236 59220 388237 177 -157516 -652 -182120 39881 20113 -116242 470561 120609
5079 194786 43941 1260 193448 -174362 -204444 -25300 -207294 -270679 292584 175509 -121553
5067 24891 -10147 345324 -6762 155170 -265203 -301913 31787 -162409 91935 48024 16134
5055 -123492 -109163 -215642 -49743 -57946 -137065 43301 -47698 -417431 14595 -306415 -159889
5044 -159889 113224 297948 -144116 210776 -68385 -263716 447291 -138457 -72000 197219
5033 16574 -112366 -355065 -117660 163886 144679 40077 -68247 -45308 138690 -171728 -72224
5021 -188640 147137 -30140 113034 19429 149280 -233253 172721 209762 34697 205103
5011 205103 -232246 -282169 -317144 261193 146772 149237 -56483 142438 -197422 -66811 127300
4999 160501 -361728 26605 -119170 -348812 161664 -81705 -72905 363214 153051 155283 -69353
4987 -30275 -88765 242337 -13706 249000 -16908 -146700 -13068 -62882 112760 442477 -184462
4975 -287015 309366 154751 46875 -90155 135984 332265 -235569 -57407 -6731 -94353 17911
4963 -161467 149385 -91141 157216 -38297 219959 105593 -158620 24072 32432 -16988 -274699
4952 -274699 17203 -109484 143959 -91674 65505 21237 79474 -125769 191273 285610 174427
4941 174427 319997 70265 45605 -101651 -229487 -46673 -17775 -137454 46119 -146693 345699
4929 -136228 380832 -166518 -190541 72741 286624 -268803 -24042 -48673 142624 374943
4919 374943 -40134 222771 -229232 47463 28922 455179 2770 -146354 103898 -252570 231981
4907 -54992 25079 32959 -172171 -44948 142956 33140 199039 -296918 5616 -109653 94767
4895 -51382 -119417 -48745 161598 -37509 176639 -259830 -225910 38476 -351517 185749 66101
4883 -311110 70269 28955 -213434 -49441 -199123 -17604 114992 106066 66463 100036 -264395
4871 -69896 -52742 -400753 -187345 104520 87014 -39377 302935 208470 67840 -53329 222836
4859 8632 -353967 190087 177719 -225574 299578 -71692 -43912 164824 2387 345187 77750
4847 121767 101642 -219549 -116574 44035 190501 -6194 308505 -351260 -141181 311459
4836 195664 194537 142080 34406 42214 319105 16968 -90065 -209118 253756 -71234 -199545
4825 -199545 -223386 98992 129397 100911 150509 309097 98532 -75801 -148536 119647 405357
4814 405357 -227390 -301289 -8055 -199431 339895 -87032 -221215 -48047 416149 -253774 -105491
4802 114187 127404 -67439 21037 6048 -290053 155325 -19328 19029 -247645 74509 243904
4791 243904 -17670 155240 -161861 143921 25670 -59825 -2478 -388085 -83435 130583 -217464
4779 -293760 -12672 92258 -29373 -117980 26860 -253908 -157001 179267 85198 -222459 19319
4767 69486 243899 72368 -132487 -60886 -170853 -228090 366729 31730 -10509 -275819 -171927
4756 -171927 71806 -102755 -100209 -155638 -15663 -44960 -165222 -162186 314305 -3764 -226669
4745 -226669 -70614 15189 23904 -345376 -121734 86266 204805 -125105 73829 -313951 -35844
4733 142691 -312332 -51978 45659 -25695 168842 -205625 115897 115095 269039 26923 164066
4722 164066 -71308 26929 -47993 -134683 -129898 69830 79875 -2525 -4555 -41461 -135406 -151814
4710 -151814 -5222 71719 268468 64209 233587 -108677 230896 -16366 135849 56214 222727
4699 222727 -14815 -98983 -109641 84188 -21288 101696 -25075 -62663 -124463 240367 -108582
4687 144498 41944 1028 -181034 21106 -38198 2017 -146910 319671 207437 250250 81996
4675 -110719 -396678 -184531 75727 322263 1629 -135687 -268050 40394 57877 335415 -4282
4663 -100891 181664 -132286 -412370 56459 7018 -156600 -187679 -114376 -8141 111049 -58648
4651 -241426 -37625 196124 63584 1970 146294 -112326 -142766 80309 18542 97389 339542
4640 339542 75333 284792 88994 -31950 -229981 160020 -189652 -153730 161997 1616 -337536
4628 -151101 114410 -179357 -165390 -27297 32364 75623 -230194 44708 59613 17009 69597
4617 69597 231866 291348 -72419 377792 74118 71736 -63767 -213293 459246 -135180 252272
4605 -111393 250604 120461 99479 -92614 -148180 -35094 -3982 -139587 -7963 -197482 -51462
4593 -16640 488668 -246169 193299 464486 423108 -168823 -36252 81282 104479 382541 -86147
4581 -131044 98643 68373 104957 -65850 15196 98429 -178199 -146271 59719 -291277 152184
4569 -28090 -17765 -41787 -19004 -79885 -149630 -124460 201748 -41041 135900 170861 -85770
4557 -5162 170333 281746 -51272 -112308 -289290 -122190 160555 178168 120908 25168 -235377
4545 52479 -78843 254444 89908 -39936 175965 -140747 -98316 244206 173136 349077 -79224
$$ [...]
##END NTUPLES=NMR SPECTRUM
##END=
