
##TITLE=AC1168_Tolima-ibague-TPAAH12002_7165937_Ki5kZcvc1U
##JCAMPDX= 6.0         $$ Bruker NMR JCAMP-DX V2.0
##DATA TYPE= NMR SPECTRUM
##DATA CLASS= NTUPLES
##ORIGIN= BRUKER
##OWNER= Administrator
$$ 1.72 TOPSPIN		Version 2.1
$$ 2012-12-01 22:04:16.977 -0500  Administrator@X
$$ Compression mode = diff/dup
##.OBSERVE FREQUENCY= 400.02188249412
##.OBSERVE NUCLEUS= ^1H
##.ACQUISITION MODE= SIMULTANEOUS (DQD)
##.ACQUISITION SCHEME= undefined
##.AVERAGES= 64
##.DIGITISER RES= 22
##SPECTROMETER/DATA SYSTEM= spect
##.PULSE SEQUENCE= noesygpps1d.comp
##.SOLVENT NAME= COFFEE_meoh
##.SHIFT REFERENCE= INTERNAL, COFFEE_meoh, 1, 14.96238
##AUDIT TRAIL= $$ (NUMBER, WHEN, WHO, WHERE, PROCESS, VERSION, WHAT)
$$ ##TITLE= Audit trail, TOPSPIN		Version 2.1
$$ ##JCAMPDX= 5.01
$$ ##ORIGIN= Bruker BioSpin GmbH
$$ ##OWNER= Administrator
$$ $$ E:\/data/COFFEE/nmr/AC1168_Tolima-ibague-TPAAH12002_7165937_Ki5kZcvc1U/12/pdata/1/auditp.txt
$$ ##AUDIT TRAIL=  $$ (NUMBER, WHEN, WHO, WHERE, PROCESS, VERSION, WHAT)
(   1,<2012-12-01 22:04:11.086 -0500>,<Administrator>,<X>,<go>,<TOPSPIN 2.1>,
      <created by zg
	started at 2012-12-01 21:52:41.336 -0500,
	POWCHK enabled, PULCHK disabled,
       configuration hash MD5:
       86 BA 57 50 F2 9D 5C 9B 26 00 A9 28 5F 66 2E 89
       data hash MD5: 64K
       DC 86 0D 80 48 A9 EF 99 10 39 BB 3B 58 45 BC 88>)
(   2,<2012-12-01 22:04:14.227 -0500>,<Administrator>,<X>,<proc1d>,<TOPSPIN 2.1>,
      <Start of raw data processing
       efp LB = 0.3 FT_mod = 6 PKNL = 1 PHC0 = 0 PHC1 = 0 SI = 128K 
       data hash MD5: 128K
       BB 5F 65 C2 32 6A 6E 06 02 B9 59 EE 86 88 0C 99>)
(   3,<2012-12-01 22:04:15.305 -0500>,<Administrator>,<X>,<proc1d>,<TOPSPIN 2.1>,
      <pk PHC0 = -80.07385 PHC1 = 0 
       data hash MD5: 128K
       F0 8F 39 8E 96 4B D1 6F D7 63 41 A4 93 9C E4 5B>)
(   4,<2012-12-01 22:04:15.992 -0500>,<Administrator>,<X>,<proc1d>,<TOPSPIN 2.1>,
      <abs ABSG = 1 
       data hash MD5: 128K
       F8 88 0A 33 F1 6D 95 AA DE E5 3B 6B 2C C0 0F CC>)
(   5,<2012-12-01 22:04:16.196 -0500>,<Administrator>,<X>,<proc1d>,<TOPSPIN 2.1>,
      <abs ABSG = 2 
       data hash MD5: 128K
       70 4E 21 10 ED 5D 19 73 28 82 06 57 D2 0D 88 DA>)
(   6,<2012-12-01 22:04:16.367 -0500>,<Administrator>,<X>,<proc1d>,<TOPSPIN 2.1>,
      <abs ABSG = 3 
       data hash MD5: 128K
       00 B5 3C 8A 65 6C 37 6D EB F8 87 70 8D 8A 91 7D>)
(   7,<2012-12-01 22:04:16.524 -0500>,<Administrator>,<X>,<proc1d>,<TOPSPIN 2.1>,
      <abs ABSG = 4 
       data hash MD5: 128K
       BE 0F E9 27 3A E5 5D BB E4 EE EC 7A D2 8C 60 16>)
(   8,<2012-12-01 22:04:16.680 -0500>,<Administrator>,<X>,<proc1d>,<TOPSPIN 2.1>,
      <abs ABSG = 5 
       data hash MD5: 128K
       73 71 C0 CC 6E BD 3D 52 C5 5F 55 06 38 A3 DF 76>)
$$ ##END=
$$ 
$$ $$ hash MD5
$$ $$ 4C 79 87 98 8D BB 14 8A 9A 53 E1 71 15 77 93 AE
##$RELAX= 
##$RELAX= 
##$RELAX= 
##$RELAX= 
##$RELAX= 
##$RELAX= 
##$RELAX= 
##$RELAX= 
$$ Bruker specific parameters
$$ --------------------------
##$DU= <E:\>
$$ [...]
##$TP07= 0
##$TPNAME0= <>
##$TPNAME1= <>
##$TPNAME2= <>
##$TPNAME3= <>
##$TPNAME4= <>
##$TPNAME5= <>
##$TPNAME6= <>
##$TPNAME7= <>
##$TPOAL= (0..7)
0.5 0.5 0.5 0.5 0.5 0.5 0.5 0.5
##$TPOFFS= (0..7)
0 0 0 0 0 0 0 0
##$TUNHIN= 0
##$TUNHOUT= 0
##$TUNXOUT= 0
##$USERA1= <user>
##$USERA2= <user>
##$USERA3= <user>
##$USERA4= <user>
##$USERA5= <user>
##$V9= 5
##$VALIST= <valist>
##$VCLIST= <CCCCCCCCCCCCCCC>
##$VD= 0
##$VDLIST= <DDDDDDDDDDDDDDD>
##$VPLIST= <PPPPPPPPPPPPPPP>
##$VTLIST= <TTTTTTTTTTTTTTT>
##$WBST= 1024
##$WBSW= 4
##$XGAIN= (0..3)
0 0 0 0
##$XL= 0
##$YL= 0
##$YMAX_a= 8428894
##$YMIN_a= -18156694
##$ZGOPTNS= <>
##$ZL1= 120
##$ZL2= 120
##$ZL3= 120
##$ZL4= 120
##$ABSF1= 14.96238
##$ABSF2= -5.595801
##$ABSG= 5
##$ABSL= 3
##$ALPHA= 0
##$AQORDER= 0
##$ASSFAC= 0
##$ASSFACI= 0
##$ASSFACX= 0
##$ASSWID= 0
##$AUNMP= <proc_prof1d_extract.lims>
##$AXLEFT= 0
##$AXNAME= <>
##$AXNUC= <1H>
##$AXRIGHT= 0
##$AXTYPE= 0
##$AXUNIT= <>
##$AZFE= 0.1
##$AZFW= 0.1
##$BCFW= 0
##$BC_mod= 0
##$BYTORDP= 0
##$COROFFS= 0
##$CY= 15
##$DATMOD= 1
##$DC= 0
##$DFILT= <>
##$DTYPP= 0
##$F1P= 0
##$F2P= 0
##$FCOR= 0.5
##$FTSIZE= 131072
##$FT_mod= 6
##$GAMMA= 0
##$GB= 0
##$INTBC= 1
##$INTSCL= 1
##$ISEN= 128
##$LB= 0.3
##$LEV0= 0
##$LPBIN= 0
##$MAXI= 10000
##$MC2= 0
##$MEAN= 0
##$ME_mod= 0
##$MI= 0
##$NCOEF= 0
##$NC_proc= -2
##$NLEV= 6
##$NOISF1= 0
##$NOISF2= 0
##$NSP= 0
##$NTH_PI= 0
##$NZP= 0
##$OFFSET= 14.96238
##$PC= 1
##$PHC0= -80.07385
##$PHC1= 0
##$PH_mod= 1
##$PKNL= yes
##$PPARMOD= 0
##$PPDIAG= 0
##$PPIPTYP= 0
##$PPMPNUM= 2147483647
##$PPRESOL= 1
##$PSCAL= 4
##$PSIGN= 0
##$PYNMP= <proc.py>
##$REVERSE= no
##$SF= 400.020009083332
##$SI= 131072
##$SIGF1= 0
##$SIGF2= 0
##$SINO= 400
##$SIOLD= 131072
##$SPECTYP= <>
##$SREGLST= <1H.CDCl3>
##$SSB= 0
##$STSI= 131072
##$STSR= 0
##$SW_p= 8223.68421052631
##$SYMM= 0
##$S_DEV= 0
##$TDeff= 65536
##$TDoff= 0
##$TI= <>
##$TILT= no
##$TM1= 0
##$TM2= 0
##$TOPLEV= 0
##$USERP1= <user>
##$USERP2= <user>
##$USERP3= <user>
##$USERP4= <user>
##$USERP5= <user>
##$WDW= 1
##$XDIM= 131072
##$YMAX_p= 396213938
##$YMIN_p= -11244
##$CURPLOT= <Network HP LaserJet P1505>
##$CURPRIN= <$Network HP LaserJet P1505>
##$DFORMAT= <normdp>
##$LAYOUT= <+/1D_H.xwp>
##$LFORMAT= <normlp>
##$PFORMAT= <normpl>
##$SURQMSG= 1
$$ End of Bruker specific parameters
$$ ---------------------------------
##NTUPLES= NMR SPECTRUM
##VAR_NAME=  FREQUENCY,     SPECTRUM/REAL,   SPECTRUM/IMAG
##SYMBOL=    X,             R,               I
##VAR_TYPE=  INDEPENDENT,   DEPENDENT,       DEPENDENT
##VAR_FORM=  AFFN,          ASDF,            ASDF
##VAR_DIM=   131072,        131072,          131072
##UNITS=     HZ,            ARBITRARY UNITS, ARBITRARY UNITS
##FACTOR=    0.0627417313425164, 1,          1
##FIRST=     8223.62146879497, -572,         -61857
##LAST=      0,             1309,            -62125
##MIN=       0,             -11244,          0
##MAX=       8223.62146879497, 396213938,    0
$$ Real data points
##PAGE= N=1
##DATA TABLE= (X++(R..R)), XYDATA
$$ [...]
67389 98633 99299 100080 100395 99846 98604 97321 96685 96986 97926 98867 99357 99400 99199 98773 98003 96964 96015 95559
67371 95559 95837 96829 98155 99172 99442 99159 98933 99092 99368 99285 98789 98379 98675 99788 101181 102222 102847 103425
67353 103425 104038 104280 103928 103366 103022 102773 102302 101761 101582 101878 102522 103592 105287 107488 109858 112172 114098
67336 114098 114994 114580 113609 113128 113249 113374 113442 113917 114580 114478 113457 112708 113232 114576 115665 116113 116047 115389
67318 115389 114144 113007 112804 113512 114408 114989 115220 115133 114752 114341 114277 114760 115854 117551 119516 121157 122252
67301 122252 123188 124235 125095 125561 126050 126860 127425 127072 126177 125740 125985 126201 125882 125334 125116 125524 126581 127906
67283 127906 128569 127761 125815 124086 123671 124575 126097 127556 128603 129269 129861 130525 130975 130937 130667 130632 130861 131111
67265 131111 131438 132048 132749 133253 133926 135452 137685 139600 140514 140706 140649 140398 140019 139889 140167 140543 140934 141926
67247 141926 144029 146807 149132 150048 149240 147142 144909 143845 144445 146195 148416 150849 153186 154698 154922
67232 154922 154335 153840 153821 154116 154594 155210 155739 155970 156091 156412 156798 156858 156665 156865 158012 160069 162536 164792
67214 164792 166358 167158 167546 167898 168220 168313 168224 168207 168339 168473 168587 168872 169517 170605 172236 174416 176740 178449
67196 178449 179017 178656 178169 178337 179358 180779 181951 182615 183068 183795 185050 186773 188666 190245 191105 191344
67180 191344 191543 192095 192775 193241 193718 194755 196437 198290 199961 201488 202856 203814 204424 205282 206750 208272
67164 208272 208953 208723 208419 208683 209291 209762 210270 211551 213999 217145 220012 221825 222429 222297 222171 222535 223381
67147 223381 224527 226074 228271 230945 233404 235125 236305 237556 239243 241338 243719 246223 248482 250120
67133 250120 251275 252606 254585 256937 259016 260633 262255 264295 266417 267818 268227 268372 269306 271400 274230
67118 274230 277229 280076 282532 284450 286125 288167 290773 293508 296034 298580 301303 303755 305588 307362
67104 307362 309889 312990 315702 317641 319358 321286 323146 324603 325838 327184 328820 331057 334293 338279
67090 338279 342019 344794 346803 348477 349788 350799 352336 355283 359388 363439 366577 368993 371418 374351
67076 374351 377767 381191 384142 386781 389974 394376 399645 404874 409563 413674 417009 419236 420662 422344
67062 422344 425133 428875 432775 436342 439764 443494 447627 451745 455419 458857 462777 467536 472610 477199
67048 477199 481114 484777 488557 492512 496680 501134 505753 510298 514783 519468 524424 529360 533938 538038
67034 538038 541772 545471 549609 554450 559766 565184 570736 576759 583277 589871 596211 602395 608674 615151
67020 615151 621806 628567 635293 641928 648717 655977 663651 671310 678562 685225 691289 697172 703876 712204
67006 712204 721664 730761 738584 745612 752713 760031 767311 774766 782883 791623 800477 809260 818340 828105
66992 828105 838632 849868 861700 873745 885392 896227 906330 916170 926278 936867 947677 958324
66980 958324 968909 979939 991451 1002652 1012939 1022929 1033836 1045968 1058499 1070701 1082647 1094620
66968 1094620 1106601 1118712 1131514 1145357 1159878 1174598 1189630 1205224 1220973 1236119 1250568
66957 1250568 1265008 1280003 1295468 1311138 1327078 1343529 1360541 1377970 1395613 1413170 1430251
66946 1430251 1446613 1462392 1478009 1493881 1510204 1526940 1543996 1561436 1579404 1597825 1616326
66935 1616326 1634589 1652575 1670262 1687430 1703983 1720337 1737112 1754571 1772664 1791390 1810636
66924 1810636 1829811 1848229 1865891 1883329 1900692 1917660 1934410 1951848 1970433 1989410 2007714
66913 2007714 2025086 2041770 2057704 2072793 2087600 2102908 2118674 2134154 2148936 2163177 2176893
66902 2176893 2189867 2202357 2215049 2228020 2240402 2251470 2261494 2271161 2280637 2289655 2298093 2305998
66890 2305998 2313342 2320270 2327365 2335113 2343107 2350193 2355471 2358941 2361197 2362763 2363784 2364148 2363790 2362880 2361714
66875 2361714 2360403 2358747 2356421 2353148 2348686 2342870 2335857 2328184 2320470 2313020 2305696 2297954 2289007 2278236
66861 2278236 2265730 2252328 2238989 2226112 2213461 2200576 2187189 2173342 2159260 2145054 2130548
66850 2130548 2115451 2099616 2083001 2065515 2047198 2028517 2010126 1992214 1974416 1956448 1938463
66839 1938463 1920611 1902604 1884066 1865115 1846256 1827759 1809398 1790764 1771679 1752359 1733287
66828 1733287 1714891 1697194 1679779 1662123 1643928 1625214 1606178 1587013 1567781 1548557 1529713
66817 1529713 1511784 1494801 1478030 1460773 1443256 1426220 1409853 1393730 1377721 1362135 1346895
66806 1346895 1331380 1315413 1299648 1284579 1269855 1255076 1240589 1226814 1213296 1199176 1184313
66795 1184313 1169262 1154375 1139610 1125039 1110947 1097449 1084480 1072075 1060238 1048665 1037005
66784 1037005 1025226 1013364 1001159 988405 975450 962865 950769 939002 927714 917224 907454
66773 907454 898042 888875 880002 871143 861899 852303 842682 833132 823694 814763 806554 798361 789221 779299
66759 779299 769791 761336 753373 745170 736611 727748 718491 709221 700825 693491 686091 677458 667923 658949
66745 658949 651519 645410 639847 634300 628635 622863 616906 610589 603980 597622 592082 587213 582270 576849
66731 576849 571268 565884 560557 555056 549521 544124 538678 533005 527412 522406 518124 514300 510529 506315
66717 506315 501260 495604 490304 486079 482548 478732 474251 469639 465561 462141 459078 456018 452740 449205
66703 449205 445563 442014 438650 435508 432688 430239 427976 425533 422645 419310 415687 411872 407783 403339
66689 403339 398786 394627 391084 387781 384236 380568 377356 374858 372707 370352 367482 364085 360481 357224
66675 357224 354550 351965 348896 345641 343055 341278 339534 337318 334950 332666 329987 326517 322713 319277
66661 319277 316373 313936 312146 310911 309404 306932 303900 301191 298904 296473 293781 291340 289442 287919
66647 287919 286710 285951 285459 284770 283773 282748 281759 280550 279117 277726 276257 274169 271350 268507 266372
66632 266372 264907 263553 261910 259872 257377 254391 251143 248197 246209 245429 245318 244841 243453 241636 240148
66617 240148 238932 237262 234928 232640 231120 230283 229548 228564 227298 225748 223941 222130 220669 219622 218563
66602 218563 216925 214648 212483 211397 211540 212042 212003 211324 210277 208724 206461 204032 202438 201968 201969 201837 201591
66585 201591 201359 200985 200435 199953 199468 198396 196471 194328 192806 192049 191659 191369 191102 190759 190497 190970 192635
66568 192635 194846 196217 195971 194620 193245 192475 192199 191908 191128 189704 187868 186001 184325 182775 181081
66553 181081 178950 176340 173654 171510 170182 169452 169141 169416 170278 171058 170942 169929 168763 167910 167127 166195
66537 166195 165491 165366 165323 164413 162429 160145 158278 156665 154809 152809 151231 150198 149186 147849 146542
66522 146542 145747 145374 144997 144475 143899 143179 142194 141223 140581 139892 138406 136196 134389 133821 134101 134437 134821 135717
66504 135717 136935 137652 137516 137064 136910 137058 137128 136818 135964 134621 133297 132725 133127 134008 134815 135458 135942 135967
66486 135967 135349 134536 134145 134084 133656 132540 131195 130218 129718 129520 129583 129898 130230 130279 130003 129568 129071 128543 128063
66467 128063 127673 127264 126761 126331 126123 125887 125207 124142 123262 122922 122793 122341 121561 120971 120959 121353 121612 121304 120461
66448 120461 119556 119068 118964 118732 118053 117295 117089 117478 117750 117227 116031 114923 114445 114375 114085 113383 112825 113078
66430 113078 114105 115251 116046 116565 116869 116611 115586 114401 113970 114413 114951 115023 114993 115469 116302 116713 116313 115605
66412 115605 115358 115729 116168 116154 115823 115728 116002 116026 115100 113319 111495 110297 109719 109377 108948 108207 106984 105389
66394 105389 103931 103154 103166 103632 104113 104284 103999 103382 102798 102523 102438 102174 101538 100661 99754 98913 98156 97485 96878
66375 96878 96374 96185 96477 96935 96770 95521 93768 92693 92842 93582 93972 93866 93773 93869 93707 93036 92352 92299 92856
66356 92856 93496 93948 94324 94656 94787 94720 94590 94293 93594 92737 92370 92597 92603 91665 90189 89183 88945 88891 88632 88522
66336 88522 88919 89441 89409 88751 88036 87674 87477 87081 86486 85980 85660 85302 84742 84219 84210 84926 86112 87385 88605
66317 88605 89785 90678 90744 89676 87907 86382 85694 85553 85195 84300 83348 83058 83624 84662 85715 86526 86843
66300 86843 86307 84821 82867 81194 80157 79527 78938 78350 77977 77939 78135 78390 78618 78799 78881 78740 78249 77397
66282 77397 76385 75554 75166 75204 75402 75449 75204 74766 74406 74382 74713 75137 75401 75618 76151 77031 77689 77555 76863 76511
66262 76511 77009 77900 78466 78722 79326 80541 81740 82086 81414 80246 79100 78063 76965 75745 74575 73708
66246 73708 73257 73091 72951 72703 72431 72270 72270 72498 73128 74189 75245 75600 74996 73997 73519 74055 75397 76929
66228 76929 77979 78061 77123 75647 74287 73360 72814 72605 72739 72889 72492 71529 70863 71370 72926 74663 76001
66211 76001 76918 77338 76972 75947 75023 74818 75200 75680 76047 76278 76220 75815 75481 75803 76882 78223 79198 79376
66193 79376 78651 77388 76359 76123 76509 76972 77346 77885 78625 79186 79307 79162 78937 78448 77480 76314 75573 75584
66175 75584 76093 76666 77196 77837 78544 78925 78736 78332 78278 78511 78306 77248 75855 74922 74597 74473 74332 74223 73943
66156 73943 73079 71721 70659 70591 71386 72266 72577 72284 71962 72337 73586 75053 75815 75564 74645 73392 71895
66139 71895 70469 69749 69934 70294 69891 68637 67312 66629 66595 66770 66839 66815 66822 66804 66542 65962 65343 65068 65167 65273
66119 65273 65088 64729 64589 64991 65961 67155 67974 67962 67186 66119 65216 64749 64869 65451 65962 65968 65914 66866 69165
66100 69165 71757 73187 73039 72046 71079 70492 70287 70399 70711 71071 71410 71707 71838 71631 71101 70475 69972 69616
66082 69616 69217 68528 67556 66770 66782 67662 68721 69191 68964 68427 67751 66722 65341 64258 64341 65792 67743 68855
66064 68855 68486 67332 66804 67653 69286 70468 70517 69713 68710 67837 66990 66016 65064 64523 64581 64966 65270 65435
66046 65435 65693 66044 66202 66155 66354 67013 67539 67123 65836 64754 64964 66632 68942 70658 70882 69666 68017
66029 68017 67026 66902 67034 66962 66889 67115 67335 66928 65872 65048 65466 67301 69701 71515 72233 72348 72873 74418
66011 74418 76618 78472 79329 79528 79958 81000 82060 82246 81354 80003 78895 78122 77218 75771 73998 72702
65995 72702 72542 73293 74051 74243 74118 74057 73910 73485 73277 73882 74848 74959 73805 72275 71234 70550 69836 69403
65977 69403 69753 70647 71466 72230 73524 75554 77827 79730 80883 81014 80043 78392 76839 75955 75879 76448 77242
65960 77242 77673 77494 77127 77130 77503 77889 78224 78617 78759 78169 77084 76394 76579 77259 77977 78748 79574 80072 80104 80253
65940 80253 81126 82433 83286 83247 82665 82125 82017 82495 83405 84179 84183 83303 82002 80778 79782 78952 78281 77796 77422
65921 77422 76976 76265 75248 74236 73907 74855 76978 79415 81210 82016 82120 81938 81710 81575 81656 81963 82341 82606
65903 82606 82647 82370 81800 81299 81398 82101 82609 82096 80649 79016 77542 75907 74018 72517 72023 72311 72690 72908
65885 72908 73174 73520 73664 73531 73420 73518 73563 73141 72202 71181 70623 70659 70820 70498 69658 68910 68799 69261 69924 70611
65865 70611 71310 72001 72873 74373 76531 78433 78989 78187 77082 76535 76457 76340 76000 75639 75559 75971 76753 77329
65847 77329 77189 76609 76375 76655 76653 75727 74343 73491 73531 74077 74745 75413 75818 75544 74651 73932 74237 75662 77592
65828 77592 79384 80798 81803 82337 82434 82444 82751 83265 83479 83176 82818 83015 83870 85080 86415 87707 88566 88665
65810 88665 88321 88252 88617 88712 87847 86220 84685 83932 84032 84558 84908 84769 84445 84540 85156 85710 85728 85474 85439 85569
65790 85569 85527 85543 86276 87749 88953 88880 87606 86037 84903 84442 84784 85984 87551 88589 88790 88912 89790
65773 89790 91135 91881 91615 91030 90882 91091 91159 90854 90065 88430 85730 82478 79563 77434 75975 75024 74468
65756 74468 73976 73228 72503 72421 72932 73037 71853 69700 67842 67240 67756 68451 68559 68149 67829 67851 67831 67489 67272
65737 67272 67781 68796 69480 69485 69251 69173 69048 68588 67934 67386 67003 66738 66610 66560 66444 66390 66780 67673 68658 69534
65717 69534 70625 72026 72962 72556 71063 69769 69603 70256 70749 70525 69835 69293 69290 69753 70249 70243 69348 67628 65744
65698 65744 64548 64248 64163 63672 63174 63615 65095 66589 67206 67121 66966 66899 66767 66761 67283 68314 69377 70076 70290
65679 70290 69945 69002 67706 66496 65611 64954 64382 63942 63844 64266 65129 65983 66301 66015 65600 65467 65478 65241 64647
65660 64647 63857 62909 61698 60309 59092 58360 58181 58481 59174 60132 61132 61900 62284 62445 62800 63585 64476 64944
65642 64944 64964 65096 65753 66750 67686 68371 68634 68139 66864 65511 64942 65288 65950 66315 66128 65308 63993 62847
65624 62847 62809 64190 66216 67674 67922 67201 66154 65259 64639 64152 63567 62748 61843 61305 61588 62713 64184
65607 64184 65378 65910 65603 64386 62544 60905 60342 61016 62333 63552 64143 63684 62035 59785 58047 57490
65591 57490 57840 58501 59299 60384 61745 63100 64068 64240 63381 61744 59980 58586 57731 57591 58262 59136 59080
65574 59080 57783 56392 56192 57084 58052 58745 59696 61105 62332 62836 62899 63042 63257 63233 62986 62813 62795 62686 62321
65555 62321 61916 61811 62016 62131 61843 61376 61256 61659 62244 62667 62927 63057 62874 62345 61953 62278 63271 64231 64470
65536 64470 63878 62929 62300 62358 62853 63231 63317 63490 64125 65109 66035 66581 66609 66186 65612 65044 64098 62413 60743
65517 60743 60694 62889 66060 68562 70130 71497 72925 74112 75160 76473 77785 78226 77527 76406 75718 75884
65501 75884 77105 79303 81757 83562 84660 85731 86923 87487 86942 85860 85055 84580 83965 83021 81980 81183
65485 81183 80929 81315 81957 82252 82145 82292 83212 84680 86204 87703 89361 91144 92891 94641 96541 98577
65469 98577 100667 102827 105001 106882 108144 108787 109154 109661 110478 111241 111080 109353 106436 103435 100964 98643
65453 98643 95990 93360 91523 90625 90017 88993 87366 85368 83378 81755 80656 79938 79340 78750 78190 77615
65437 77615 76922 76159 75558 75258 75077 74669 73886 72848 71566 69718 67172 64698 63646 64579 66535 67999
65421 67999 68343 67931 67123 65882 64379 63329 63377 64414 65697 66498 66609 66412 66492 67026 67579 67621 67098 66310
65403 66310 65521 64984 65038 65690 66361 66652 67130 68650 70961 72781 73327 73035 72638 72363 72331 72981 74507 76384
65385 76384 77926 78969 79666 80002 79950 79787 79841 80183 80875 82226 84408 87007 89263 90674 91263 91514 92198
65368 92198 93977 96989 100973 105783 111382 117390 123242 129017 135555 143392 152061 160740 169092 177031
65354 177031 184097 189549 192831 193659 192041 188595 184463 180431 176413 172075 167584 163250 158879 154122
65340 154122 149255 145038 141855 139410 137182 134813 132183 129424 126762 124100 121042 117582 114400 111996
65326 111996 109846 106983 103227 99288 95782 92735 90057 87907 86401 85286 84117 82587 80671 78610
65312 78610 76673 74862 72957 70946 69119 67566 65975 64289 63122 63033 63640 64082 64209 64645 65650 66518
65296 66518 66315 64913 63076 61754 61369 61571 61637 61191 60452 59778 59227 58816 58843 59553 60635 61499 61972 62332
65278 62332 62757 63170 63569 64101 64742 65280 65622 65856 66027 66103 66092 65937 65398 64400 63359 62810 62768 62910 63280 64330
65258 64330 66190 68334 70104 71199 71601 71434 71041 70859 71010 71309 71792 72918 75022 77768 80416 82504
65242 82504 84081 85373 86429 87104 87284 87008 86357 85344 84072 82954 82459 82464 82121 80646 78127 75378 73112
65225 73112 71474 70183 68892 67524 66482 66350 67127 67926 67738 66430 64717 63371 62716 62710 63032 63139 62721
65208 62721 62129 62059 62740 63690 64296 64366 64116 63813 63499 62964 62131 61476 61716 62839 63876 64076 63942 64513 65925
65189 65925 67368 68269 68692 68556 67386 65153 62654 60657 59269 58453 58500 59406 60277 60092 58897 57616 56805
65172 56805 56149 55242 54274 53739 53839 54492 55676 57339 59014 59877 59478 58294 57395 57563 58791 60470 61811
65155 61811 62214 61674 60947 60989 62011 63319 64186 64553 64772 65086 65601 66346 66994 66966 66208 65470 65292 65152 64300
65136 64300 63087 62619 63198 64019 64448 64777 65425 66179 66660 66987 67525 68303 69081 69763 70384 70852 70952 70544 69701
65117 69701 68752 68177 68233 68662 68981 68996 68793 68433 68096 68328 69538 71232 72366 72618 72739 73480 74713 75889
65099 75889 76805 77556 78220 79012 80375 82536 85204 88049 91177 94806 98730 102578 106440 110880 116307
65084 116307 122545 128965 134890 139959 144203 147782 150742 153198 155479 157671 159112 158955 157300 155109
65070 155109 152802 149632 144935 139355 134166 129701 125188 120001 114457 109335 105053 101484 98214 94861
65056 94861 91313 87724 84287 81084 78210 75819 73926 72323 70880 69711 68889 68251 67652 67162 66791 66292
65040 66292 65552 64908 64676 64594 64160 63449 63122 63596 64555 65331 65485 64928 63802 62449 61349 60850 60878 60945 60531
65021 60531 59593 58745 58738 59710 61073 62172 62817 63073 62892 62288 61657 61490 61730 61781 61205 60189 59173 58299 57459
65002 57459 56780 56721 57501 58621 59282 59317 59408 60159 61203 61571 60809 59354 57860 56615 55714 55327 55433 55634
64984 55634 55579 55482 55952 57301 59220 61023 62095 62199 61600 60882 60477 60340 60112 59604 59049 58882 59290 60026
64966 60026 60713 61332 62198 63373 64325 64426 63664 62643 62000 62024 62698 63737 64633 64949 64595 63682 62333 60880
64948 60880 59908 59630 59448 58701 57629 57024 57080 57364 57774 58623 59677 60043 59374 58405 57935 57946 58106 58364 58675
64929 58675 58786 58798 59194 59836 59677 58128 56017 54515 53779 53431 53634 54660 55957 56776 57434 58797 60675
64912 60675 61918 62126 62148 62654 63215 63136 62379 61258 59995 59023 58995 59976 61103 61575 61564 61639 61680 60974 59292
64893 59292 57389 56307 56453 57419 58575 59690 60882 62066 62777 62733 62295 61995 61823 61463 61067 61168 61715
64876 61715 61815 60820 59287 58479 59055 60518 61850 62489 62693 63019 63570 63932 63908 63906 64218 64246 63126 61093 59466
64857 59466 59063 59269 59123 58763 59119 60408 61651 61797 60931 60076 60049 60707 61297 61349 61106 61040 61183 61138 60765 60511
64837 60511 60873 61714 62359 62380 62057 62008 62504 63250 63737 63654 62961 61806 60496 59428 58858 58762 59052 59814 61091
64818 61091 62488 63320 63256 62603 61920 61597 61836 62710 63980 65109 65646 65496 64829 63988 63457 63499 63669 63144 61747
64799 61747 60221 59258 58710 58138 57630 57586 58070 58879 59937 61125 62012 62306 62282 62214 61762 60609 59417 59281
64781 59281 60360 61793 62909 63635 63747 62740 60834 59216 58743 59041 59392 59928 61255 63270 65066 65936
64765 65936 65978 65691 65418 65287 65422 65939 66727 67347 67362 66899 66692 67299 68338 68843 68362 67417 66808 66764 66879 66596
64745 66596 65657 64296 63108 62643 63038 64067 65361 66455 66881 66601 66185 66216 66637 66995 67158 67347 67623 67903
64727 67903 68404 69479 70932 72001 72128 71419 70354 69439 68991 68771 67981 66267 64567 64172 65002 65730 65703
64710 65703 65697 66434 67410 67838 67830 67864 67755 67053 66032 65408 65342 65455 65613 65972 66362 66278 65531 64502 63810 63998 65231
64689 65231 66871 67703 67168 66143 65966 66897 68163 69233 70223 71092 71382 71015 70672 70891 71329 71342 71000 71035
64671 71035 71884 73209 74400 75262 76006 76660 76787 75979 74457 72915 71808 71145 70985 71600 72847 73824 73648
64654 73648 72404 70988 70231 70484 71705 73393 74616 74764 74361 74598 75882 77243 77354 75903 73838 72444
64638 72444 72285 72854 73176 72727 71692 70384 68839 67232 66197 66168 66646 66784 66591 66837 67797 68860 69626
64621 69626 70603 72375 74636 76625 78059 79057 79491 79133 78356 77969 78224 78507 78235 77624 77245 77141 76781 75799
64603 75799 74446 73228 72375 71791 71438 71519 72209 73242 73941 73774 72906 72117 72111 72908 73942 74646 74796 74404 73578
64584 73578 72645 72189 72620 73686 74621 74911 74759 74763 75269 76093 76754 76876 76425 75702 75126 74978 75312 75954 76513
64565 76513 76472 75557 74083 72782 72232 72504 73305 74236 74887 75046 74994 75381 76536 77978 78805 78541 77443 76107
64547 76107 74980 74221 73794 73558 73379 73293 73563 74418 75655 76584 76611 75939 75453 75742 76472 76972 77153 77378 77617
64528 77617 77374 76574 75894 75935 76481 76908 76949 76690 76214 75719 75699 76492 77714 78581 78734 78414 77930 77374 76811 76266
64508 76266 75473 74034 72050 70314 69677 70341 71785 73156 73721 73240 72148 71233 70965 71194 71518 71781 72090
64491 72090 72513 72980 73424 73798 73983 73894 73811 74375 75941 77940 79172 78920 77624 76377 75908 76235 76981 77713
64473 77713 78077 78027 77903 77989 78116 78045 78034 78447 78949 78853 78361 78565 79814 80914 80623 79292 78203 77777 77416
64454 77416 76931 77062 78315 80089 81341 81664 81450 81312 81601 82211 82669 82587 82067 81488 80994 80466 79930 79565
64436 79565 79308 78925 78522 78553 79180 80031 80722 81248 81640 81717 81488 81466 82210 83751 85751 88009 90482 93003
64418 93003 95360 97615 99978 102373 104461 106202 108119 110755 113975 116931 118711 118974 118077 116785 115883
64403 115883 115775 116197 116401 115829 114637 113328 111889 109688 106374 102538 99169 96660 94654 92717 90774
64388 90774 88957 87432 86404 85983 85946 85859 85532 85156 84988 85102 85432 85817 85967 85640 84969 84446 84512 85229 86319
64369 86319 87307 87671 87160 86107 85233 85037 85482 86255 87110 87846 88218 88087 87688 87647 88630 90786 93420 95387
64351 95387 96010 95557 94676 93577 92068 90235 88653 87845 87859 88406 89143 89802 90351 91093 92331 93864 95046
64334 95046 95329 94538 92802 90715 89469 90106 92383 94835 96266 96764 97059 97484 98016 98827 100125 101673
64318 101673 103046 104225 105506 106951 108379 109757 111083 111961 111869 110909 109782 108933 108195 107364 106563 105819
64302 105819 104827 103553 102640 102707 103516 104343 105036 106139 107956 109999 111502 112160 112236 112281 112887 114331 116265
64285 116265 118027 119465 121175 123703 126851 130097 133323 136621 139694 142097 144011 146059 148339 150345
64271 150345 152012 154089 156991 159900 161597 161824 161258 160429 159220 157267 154354 150581 146588 143422 141657
64256 141657 140787 139959 139057 138413 137729 136223 133953 132066 131360 131332 131081 130503 130025 129648 128962 127919 126981 126546
64238 126546 126654 127235 128363 130256 133170 137077 141302 144799 147224 149491 152802 157165 161374 164502 166927
64223 166927 169691 173153 176669 179454 181397 182858 183872 183891 182466 179964 177329 175140 173129 170647 167354
64208 167354 163417 159316 155622 152772 150858 149741 149387 149873 150957 151952 152271 151926 151365 151048 151396 152795
64192 152795 155269 158186 160658 162244 163149 163896 165022 166829 169073 170942 171719 171464 170786 170085 169403 168942
64176 168942 169133 169939 170591 170453 169957 170186 171544 173200 174050 174003 174040 175045 176814 178430 179466 180540 182547
64159 182547 185562 188746 191338 193534 196377 200891 207310 214963 222842 230429 238151 247008 257663 269843
64145 269843 282590 295071 307135 319152 331358 343325 353967 362082 367018 369027 368977 367609 364960
64132 364960 360530 354043 345936 336996 327692 318095 308310 298648 289285 280111 271134 262795 255659 249921
64118 249921 245451 242133 239854 238206 236577 234681 232772 231272 230365 230028 230173 230535 230640 230230 229702 229846
64102 229846 231122 233433 236624 240810 245939 251340 256218 260678 265838 272678 281014 289860 298678 307920
64088 307920 318265 329609 341068 351920 362259 372561 382687 391637 398404 402895 405791 407632
64076 407632 408321 407469 404817 400241 393705 385552 376662 367987 359932 352348 345064 338242 332230 327174 322812
64061 322812 318670 314559 310808 307863 305762 304323 303759 304538 306547 308993 311465 314559 319021 324769 331266
64046 331266 338339 345988 353872 361859 370772 381615 394119 407026 419833 433295 447989 463346
64034 463346 478534 493477 508453 523302 537590 551082 563544 574487 583566 590959 597050 602152
64022 602152 606835 611973 617955 624243 630147 635646 640986 645971 650164 653421 655693 656673 656260 654971 653259
64007 653259 650770 647108 643005 639893 638342 637775 637729 638546 640670 644087 648798 655134 663169 672379 682379
63992 682379 693677 707216 723381 741738 761621 782705 805183 829615 856505 885854 917197
63981 917197 950156 984861 1021856 1061870 1105685 1153862 1206372 1262720 1322628 1386437 1454724
63970 1454724 1527807 1605947 1689943 1781255 1881581 1992561 2116041 2254523 2411254 2589981
63960 2589981 2794870 3030844 3303889 3620779 3988367 4413194 4901513 5458949 6089537
63951 6089537 6795059 7575338 8428630 9351092 10335986 11373764 12452580 13557765 14670647
63942 14670647 15768733 16827804 17823966 18734272 19537032 20213211 20747953 21130457 21352579
63933 21352579 21408194 21294240 21012222 20568938 19976375 19251068 18412906 17483539 16485105
63924 16485105 15439600 14368396 13291538 12227061 11190725 10195898 9253295 8370861
63916 8370861 7554095 6806458 6129319 5521740 4980823 4502519 4082032 3713704 3391235
63907 3391235 3108590 2860744 2643477 2452782 2284841 2136392 2004751 1887486 1782379
63898 1782379 1687634 1601787 1523432 1451342 1384814 1323496 1266825 1213864 1163657 1115354 1068115
63887 1068115 1021448 975746 931925 890338 850527 812169 775589 740997 707965 676250 646509
63876 646509 619394 594322 570049 546317 524101 504280 486826 471346 457563 444969 432768
63865 432768 420657 409197 398994 389901 381407 373439 366286 359974 354236 349060 344807 341724 339590
63852 339590 337947 336559 335666 335913 337908 341674 346475 351343 355773 359808 363558 366857 369463 371341 372506
63837 372506 372683 371351 368158 363157 356558 348466 339019 328631 317857 307053 296321 285772 275597
63824 275597 265960 257032 249063 242138 235931 230059 224693 220355 216988 213709 209731 205126 200397 195804
63810 195804 191464 187698 184693 182083 179410 176822 174755 173064 171054 168378 165336 162233 159015 155731
63796 155731 152852 150795 149380 148046 146487 144941 143958 143953 144884 146247 147383 147727 146888 144847 142318 140540
63780 140540 140237 140852 141178 140648 139683 138874 138290 137582 136396 134626 132554 130710 129343 128126 126654 125056
63764 125056 123719 122707 121968 121888 122853 124342 125272 125411 125645 126595 127729 128265 128305 128488 129037 129725 130427 131121
63746 131121 131583 131544 131056 130310 129403 128644 128815 130543 133501 136665 139358 141672 143985 146540 149567 153424
63730 153424 158399 164558 171835 180092 189033 198226 207325 216206 224895 233398 241613 249335 256302 262195
63716 262195 266575 268996 269425 268455 266789 264492 261058 256296 250697 244741 238311 231212 223986 217621 212487
63701 212487 208015 203501 198844 194352 190153 186090 182045 178069 174149 170132 166051 162406 159821 158327
63687 158327 157227 155839 154251 153174 153269 154870 158109 162809 168214 173371 178058 183056 189304 197008 205708
63672 205708 214872 224121 233116 241653 249844 257874 265461 271755 275948 277978 278485 277978 276122 272069 265518
63657 265518 257174 248047 238660 229244 220304 212405 205597 199627 194601 190713 187339 183221 177983 172824
63643 172824 169240 167500 166796 166446 166379 166690 167379 168551 170476 173331 176992 181040 184906 188248 191330 194822
63627 194822 199120 204156 209922 216748 224751 233422 242226 251383 261680 273701 287579 303299 320823
63614 320823 340005 360673 382723 405907 429685 453524 477123 500023 521186 539335 553681
63603 553681 564106 570877 574436 575348 574169 571504 568292 565601 563712 561693 558337 553347 547179 540078
63589 540078 531845 522414 512021 500796 488739 476059 462999 449368 434894 420096 406124 393473
63577 393473 381520 369679 358436 348751 340850 334186 328321 323260 318945 315005 311203 307863 305714
63564 305714 305426 307357 311465 317262 323955 330934 338313 346987 358049 372036 388693 407355 427468
63551 427468 448784 471290 495087 520215 546358 572619 597668 620204 639404 655071 667480
63540 667480 677122 684584 690598 695957 701202 706400 711378 716094 720580 724582 727400 728042 725345 718206
63526 718206 706141 689668 669772 646989 621380 593337 563877 534005 504385 475792 449197
63515 449197 425001 402670 381678 362373 345509 331205 318852 307776 297592 288204 279884 273054
63503 273054 267609 262823 258261 254355 251586 249683 248267 247734 248602 250418 252339 254580 258185 263399 269338
63488 269338 275399 281971 289495 297814 306798 316676 327239 337619 347474 357636 368816 380256 390357
63475 390357 398217 403825 407134 407849 406009 402067 396312 388749 379633 369688 359659 349897 340418 331169
63461 331169 322236 313985 306931 301348 297141 294135 292192 290877 289374 287188 284733 282850 281794 281058
63447 281058 280098 278858 277602 276593 276073 276331 277674 280410 284815 290962 298597 307313 316898 327467 339325
63432 339325 352751 367800 384209 401663 420207 440184 461645 484095 507080 530835 556003
63421 556003 582902 611368 641129 671848 702737 732552 760082 784388 804543 819572 828966 833061
63409 833061 832773 829081 822924 815327 807294 799409 791582 783114 773083 760833 746210 729321 710159
63396 710159 688684 665230 640494 615012 588955 562671 537092 513193 491213 470800 451843
63385 451843 434764 419992 407550 397229 388739 381633 375515 370602 367673 367243 369097 372854 378494
63372 378494 385942 394671 404375 415689 429434 445316 462229 479921 499461 521813 546690 573254
63360 573254 601238 630753 661363 691933 721170 747942 771344 790905 806565 818179 825341 828033
63348 828033 827084 823540 817888 810373 801698 792769 783902 774816 765255 754976 743294 729349 712961
63335 712961 694661 674833 653360 630268 606195 581985 558147 534811 511968 489778 468951
63324 468951 450651 435435 422369 409866 397521 386461 377721 370944 365078 359707 355162 351711 349222
63311 349222 347423 346100 345144 344671 344881 345560 345975 345564 344528 343482 342701 341962 340946 339501 337643 335540
63295 335540 333441 331515 329854 328606 327775 326832 325015 322305 319713 318300 318172 318729 319479 320240 320926 321671
63279 321671 322907 324751 326530 327496 327896 328700 330338 332353 334396 336792 339781 342801 345083 346587 347867
63264 347867 349243 350620 352010 353632 355420 356959 358197 359873 362787 366780 370815 374109 376802 379446
63250 379446 382220 385032 388082 391847 396529 401972 408195 415555 424113 433272 442510 452251 463466 476483
63236 476483 490691 505529 521258 538468 557325 577807 600370 625631 653272 681885 710227
63225 710227 738179 766120 793855 820845 847229 873884 901320 929176 956995 984910 1013149
63214 1013149 1041372 1068960 1095671 1121481 1145882 1167799 1186161 1200261 1209634 1213912 1212819 1206097
63202 1206097 1193537 1175231 1151662 1123394 1090903 1055009 1017206 979209 942277 907200 874658
63191 874658 845166 818848 795718 776090 760348 748509 740413 736124 735655 738479 743930 751955 762899
63178 762899 776572 792124 808880 826749 845834 866209 888076 911519 935977 960509 984654
63167 984654 1008500 1031867 1054113 1074866 1094252 1112126 1127687 1140111 1148942 1153640 1153379 1147739
63155 1147739 1137098 1122034 1102829 1079842 1053888 1025817 996142 965322 934013 902815 872269
63144 872269 843278 816869 793252 771736 751918 734235 718920 705169 692012 679426 667939
63133 667939 657701 648656 641151 635508 631259 627581 624311 621883 620405 619453 618723 618300 618336 618876 620022
63118 620022 621930 624670 628296 632768 637644 642250 646458 650906 656099 661781 667503 673261 679088 684616
63104 684616 689683 694849 700648 706755 712543 717940 723037 727446 730970 734432 738745 743474 747352 750011
63090 750011 752124 753956 754968 754943 754427 753811 752938 751877 751198 751235 751835 753067 755380 758803 762751 766961
63074 766961 771886 777850 784458 791209 798150 805663 814175 824258 836335 850049 864531 879602 896060
63061 896060 914549 934789 956229 978789 1002651 1027984 1055311 1085501 1118983 1155520 1195013
63050 1195013 1237815 1283812 1332030 1381793 1433593 1488089 1544768 1602394 1660307 1718449 1776475
63039 1776475 1833750 1890197 1946379 2002672 2058933 2114999 2171006 2227117 2283306 2339464 2395345
63028 2395345 2450292 2503126 2552262 2595842 2631943 2658893 2675288 2679675 2670655 2647657 2611399 2563368
63016 2563368 2505144 2438496 2365671 2289044 2210617 2132213 2055869 1983460 1916002 1853792 1797234
63005 1797234 1747207 1704599 1669804 1642713 1623024 1610568 1605431 1607597 1616452 1630943 1650364 1674554
62993 1674554 1703084 1734726 1768223 1803196 1839795 1877784 1916597 1956001 1995905 2035547 2073568
62982 2073568 2108985 2141415 2170159 2193699 2210457 2219693 2221306 2215096 2200476 2176700 2143187 2099906
62970 2099906 2047760 1988465 1923789 1854916 1782606 1707875 1632399 1558301 1487459 1420848 1358519
62959 1358519 1300302 1246415 1197162 1152185 1110527 1071624 1035872 1003964 975926 951127 929044
62948 929044 909608 892811 878344 865739 854604 844531 834980 825561 816390 807872 800061 792486 784727
62935 784727 776923 769468 762397 755390 748208 740771 732921 724591 716239 708569 701656 694847 687731 680696
62921 680696 674172 667913 661560 655475 650283 645835 641410 636835 632607 628838 624858 620156 615103 610374
62907 610374 606129 602162 598429 595028 591955 589273 587234 585903 584901 583860 582899 582280 581904 581565 581427
62892 581427 581667 581798 581014 579158 576781 574171 571046 567426 564084 561681 559920 558081 555963 553739 551254
62877 551254 548253 545246 543319 542927 543433 544017 544469 544770 544540 543456 541930 540812 540480 540608 540672 540295 539266
62860 539266 537713 536220 535275 534522 532967 530132 526623 523450 521160 519780 519154 518928 518491 517420 515952
62845 515952 514659 513675 512532 510761 508431 506101 504431 503859 504374 505516 506756 507891 508948 509786 510093
62830 510093 509927 509882 510486 511528 512218 511971 510888 509581 508699 508573 509037 509516 509438 508567 506938 504635 501945
62813 501945 499627 498521 498697 499351 499787 500209 501229 502932 504873 506809 508900 511238 513748 516662 520604
62798 520604 525956 532478 539745 547656 556349 565933 576546 588420 601652 616177 632048 649446 668254
62785 668254 688079 709042 732143 758425 788038 820569 856031 895075 938429 986694 1040588
62774 1040588 1100840 1167691 1240863 1320027 1404959 1495248 1590199 1688987 1790494 1892877 1993592
62763 1993592 2089908 2179267 2259326 2328031 2383655 2424505 2448801 2455336 2444298 2417052 2375122
62752 2375122 2319804 2252642 2175713 2091202 2001078 1907247 1811543 1715415 1620020 1526757 1437256
62741 1437256 1352579 1272816 1197728 1127493 1062605 1003351 949644 901146 857377 817884 782407
62730 782407 750668 722004 695585 671115 648933 629257 611721 595864 581671 569335 558764
62719 558764 549617 541645 534777 529106 524920 522475 521542 521474 521986 523583 526964 532226 538865 546386 554752
62704 554752 564465 576415 591353 609297 629597 651761 676073 703426 734785 770811 811509 856196
62692 856196 904353 956636 1014424 1078033 1145971 1216433 1288893 1363568 1439760 1515448 1588228
62681 1588228 1655866 1716089 1766706 1806243 1834025 1849496 1851888 1840734 1816435 1780129 1733173
62670 1733173 1676872 1612652 1542465 1468874 1394469 1321006 1249277 1179814 1113318 1050256 990539
62659 990539 934001 880859 831392 785519 743138 704505 669809 638636 610359 584739 561680
62648 561680 540703 521337 503756 488266 474301 460736 447267 434722 423801 414217 405364 397196
62636 397196 389984 383598 377533 371487 365633 360356 355880 352050 348452 344825 341319 338168 335232 332164
62622 332164 328951 325899 323132 320523 318176 316575 316088 316657 318097 320349 323255 326387 329333 332036 334709
62607 334709 337613 340974 344973 349736 355475 362555 371141 380757 390607 400491 411233 424022 439447
62594 439447 457261 476974 498651 523174 551618 584284 620528 659736 702122 748148 797433
62583 797433 848794 901282 954449 1007442 1058430 1105234 1146169 1180142 1206432 1224658 1234637 1236007
62571 1236007 1228381 1212073 1188237 1158080 1122409 1082284 1039504 995817 951934 907956 864587
62560 864587 823280 785129 750106 717489 686684 657609 630621 606183 584322 564383 545542
62549 545542 527546 510656 494937 480053 465768 452195 439379 427071 415246 404474 395362 387809
62537 387809 381182 375032 369291 363924 358966 354885 352363 351485 351557 351922 352597 353862 355706 358108 361527
62522 361527 366535 373080 380622 388849 397737 407038 416455 426482 438377 452932 469798 488378 508894
62509 508894 532152 558677 588668 622414 660056 700983 744034 788354 833577 879111 923655
62498 923655 965519 1003118 1035140 1060646 1079183 1090535 1094250 1089686 1076711 1056203 1029745 998944
62486 998944 965070 929112 891938 854394 817275 781214 746621 713802 683033 654462 627996
62475 627996 603455 580836 560346 542176 526258 512224 499682 488696 479887 473773 469943 467272
62463 467272 465092 463762 463836 465083 466751 468508 470691 473721 477696 482481 487860 493659 499980 507245 515724
62448 515724 525134 534960 544960 555067 565020 574494 583462 591947 599516 605387 608976 609970 608020 602864
62434 602864 594785 584522 572629 559216 544302 528188 511528 495221 480024 466001 452637 439766
62422 439766 428027 417961 409147 400896 393415 387452 383079 379821 377852 377929 379983 382810 385535 388537
62408 388537 392521 397502 403192 409574 416517 423482 430250 437391 445345 453534 461016 467630 473791 479481
62394 479481 484175 487654 490176 491803 492102 490729 487979 484616 481243 477854 473947 469142 463729 458436
62380 458436 453738 449712 446500 444462 443709 444017 445418 448427 453412 460209 468677 479185 492122 507393
62366 507393 524883 545103 568875 596597 628261 663908 703557 746811 793039 841907 893377
62355 893377 947201 1002646 1058499 1113075 1164417 1210818 1251081 1284216 1309328 1326134 1335163 1336991
62343 1336991 1331614 1319042 1300133 1276166 1247776 1215005 1178354 1139181 1098980 1058804 1019410
62332 1019410 981423 945134 910486 877493 846435 817536 790617 765156 740646 717020 694804
62321 694804 674622 656396 639394 623315 608882 596858 586890 578007 569957 563222 557819 553060 548649
62308 548649 545159 543007 541672 540386 539033 537829 536517 534500 531563 527970 523934 519414 514376 508976
62294 508976 503533 498549 494585 491836 489887 488184 486727 486105 486899 489228 492776 496989 501314 505510 509781
62279 509781 514456 519618 525258 531623 539046 547403 556160 565084 574510 584714 595471 606673 619049
62266 619049 633661 650679 669221 688554 709061 731859 757851 787426 820728 857833 898766
62255 898766 943567 992136 1043803 1097234 1150952 1203646 1253678 1298708 1336425 1365619 1386160
62244 1386160 1398097 1401338 1396118 1383156 1363153 1336560 1303958 1266321 1224812 1180667 1135312 1090102
62232 1090102 1045855 1003028 962404 925064 891498 861315 833999 809470 787687 768364 751509
62221 751509 737678 727157 719269 712966 707768 703629 700286 697372 694912 693022 691225 688722 685433 682281
62207 682281 680296 679742 680200 681169 682473 684266 686760 689947 693690 698070 703374 709638 716572 724197 733232
62192 733232 744524 758374 774740 793674 814960 837616 860471 883339 907090 932374 958602
62181 958602 984199 1007560 1027736 1044586 1058463 1069717 1078577 1085638 1092134 1099341 1107805 1117520 1128775
62168 1128775 1142378 1159025 1178861 1201757 1227740 1256951 1289274 1323909 1359209 1393117 1424027
62157 1424027 1451162 1474064 1492138 1505089 1513364 1517548 1517482 1512728 1503826 1492304 1479230 1464352 1447024
62144 1447024 1427467 1406746 1385875 1365405 1345742 1327474 1311298 1297635 1286198 1275971 1265939
62133 1265939 1256005 1247014 1239753 1234130 1229424 1225137 1221378 1218565 1216942 1216408 1216792 1218265 1221377 1226579
62119 1226579 1233833 1242867 1253613 1266059 1279786 1294140 1309042 1325204 1343287 1363060 1383653 1404489
62107 1404489 1425726 1447841 1471041 1495171 1520095 1545993 1573177 1601610 1630825 1660496 1690965
62096 1690965 1722990 1757021 1792957 1830641 1870333 1912566 1957551 2004739 2052822 2100249 2146008
62085 2146008 2190163 2233658 2277584 2322591 2368782 2415893 2463486 2511082 2558271 2604716 2650005
62074 2650005 2693436 2734126 2771592 2806394 2839957 2873525 2907461 2941876 2977560 3015610 3056167
62063 3056167 3098352 3141701 3186895 3234458 3283250 3330962 3375874 3417613 3456452 3492525 3525684
62052 3525684 3555593 3581918 3604762 3624821 3642710 3658238 3670703 3679858 3686183 3690323 3692615 3693183
62040 3693183 3692132 3689660 3686172 3682189 3677971 3673509 3669086 3665375 3662509 3659444 3654889 3648684 3641634 3634214
62026 3634214 3626160 3617241 3607635 3597433 3586384 3574273 3561130 3547060 3532414 3518077 3504956 3493132
62014 3493132 3482059 3471549 3461884 3453053 3444806 3437696 3433125 3431941 3433684 3437630 3443825 3452580 3463665
62001 3463665 3476765 3492199 3510363 3530686 3551867 3572997 3593750 3613458 3630679 3643983 3652786
61990 3652786 3657123 3656849 3651397 3640391 3624276 3604108 3580698 3554204 3524743 3493178 3460918 3428901
61978 3428901 3397014 3364550 3331023 3296591 3261957 3227781 3193944 3159477 3123585 3086681 3050024
61967 3050024 3014510 2980288 2947474 2916437 2887067 2858352 2829196 2799521 2770282 2742534 2716612
61956 2716612 2692134 2668686 2646508 2626299 2608161 2591156 2574430 2558450 2544386 2532415 2521554
61945 2521554 2511337 2502732 2497002 2494401 2494475 2496941 2501607 2507895 2515173 2523374 2532794 2543453 2555052 2567429
61931 2567429 2580685 2594906 2610028 2625986 2642865 2660995 2680871 2702724 2726228 2751075 2777835
61920 2777835 2807859 2842364 2882222 2928739 2983849 3049210 3125735 3214430 3317106 3435831 3572368
61909 3572368 3728921 3908996 4116846 4356291 4630710 4944033 5301155 5707416 6167984
61900 6167984 6687200 7267291 7906749 8599105 9331984 10086048 10834591 11544978 12181721
61891 12181721 12710042 13099516 13327898 13384285 13270108 12997520 12586343 12061160 11449256
61882 11449256 10779076 10078279 9371079 8676183 8006902 7372855 6781015 6235317 5736588
61873 5736588 5283817 4875327 4508607 4179994 3885649 3622730 3388998 3181677 2997451
61864 2997451 2833395 2687130 2556277 2438704 2333457 2240635 2160036 2090444 2030432 1979183
61854 1979183 1936079 1900014 1869724 1844651 1824905 1810364 1800201 1793486 1789905 1789435 1791336 1793901
61842 1793901 1795515 1795701 1794821 1792965 1789645 1784500 1777771 1770056 1762141 1755110 1749942 1746745 1744994 1744775 1747141
61827 1747141 1752781 1760879 1769795 1778326 1785812 1791613 1795336 1797258 1797730 1796320 1792255 1785626 1777530 1769041
61813 1769041 1760605 1752454 1745055 1739106 1735494 1735221 1738932 1746504 1757478 1771892 1790428 1813865 1842735
61800 1842735 1877345 1917679 1963345 2014079 2070260 2132577 2201325 2276450 2358206 2447323 2544589
61789 2544589 2650704 2766556 2893240 3031885 3183809 3350892 3535556 3740546 3968994
61780 3968994 4224491 4510830 4832088 5193551 5602247 6066022 6592424 7189273 7866040
61771 7866040 8633452 9501082 10475138 11557426 12743988 14022565 15370097 16751495 18119564
61762 18119564 19416490 20578297 21542278 22254934 22677962 22791919 22597862 22116308 21383186
61753 21383186 20444330 19350473 18153250 16901519 15638019 14397263 13205173 12079925
61745 12079925 11033069 10070349 9192583 8397191 7680063 7036515 6460920 5946428 5486116
61736 5486116 5074531 4707671 4381477 4091032 3831459 3599059 3391272 3205881 3040611
61727 3040611 2893238 2761724 2644280 2539371 2445506 2360910 2283543 2211599 2143938 2080079
61717 2080079 2019967 1963673 1911066 1861731 1815314 1771871 1731579 1694150 1658892 1625428 1594122
61706 1594122 1565631 1540104 1516778 1494317 1471676 1448855 1426684 1405702 1385440 1365073 1344504
61695 1344504 1324359 1305048 1286355 1267924 1249712 1231874 1214542 1197818 1181686 1165946 1150459
61684 1150459 1135428 1121102 1107375 1094053 1081399 1069964 1059912 1051024 1043329 1037170 1032487 1028567
61672 1028567 1024752 1021051 1017893 1015520 1013732 1011983 1009674 1006613 1003138 999571 995765 991592 987563 984280
61658 984280 981405 977944 973629 969202 965159 961096 956715 952674 949797 947932 946279 944483 942777 941314
61644 941314 940019 938999 938478 938248 937701 936608 935536 935272 935965 937114 938443 940610 944733 951171 959042
61629 959042 967199 975389 984121 993614 1003429 1013095 1022501 1031560 1039922 1047203 1053050 1056860 1057969 1056440
61615 1056440 1053304 1049651 1045680 1040862 1034698 1027097 1018258 1008557 998383 987899 977028 965771 954358
61602 954358 943003 931762 920710 910001 899680 889699 880175 871294 862864 854435 846083 838638 832846
61589 832846 828586 825248 822588 820849 820300 821045 823170 826711 831530 837442 844494 852988 863370 876134
61575 876134 891607 909517 928961 949121 970038 992503 1017164 1043897 1072046 1101160 1131395
61564 1131395 1163175 1196555 1230973 1265642 1299973 1333556 1365957 1396798 1425946 1453409 1479187
61553 1479187 1503437 1526559 1548802 1569826 1588870 1605180 1618100 1627200 1632826 1636179 1638141 1638117 1634647
61540 1634647 1627086 1615993 1602030 1585412 1566637 1546818 1526827 1506763 1486767 1467770 1450905
61529 1450905 1436509 1424166 1413427 1404119 1396269 1390176 1386502 1386071 1389659 1397866 1410845 1428111 1449136
61516 1449136 1474257 1504598 1541037 1583860 1633611 1691568 1759042 1836757 1925338 2025943 2140024
61505 2140024 2268929 2414111 2577248 2759706 2962024 3183976 3424353 3680229 3946857
61496 3946857 4218499 4488639 4748979 4989224 5198959 5369834 5495980 5573611 5601639 5582375
61486 5582375 5520534 5421345 5290160 5133341 4958279 4772048 4580502 4388610 4200992 4021747
61476 4021747 3854059 3699970 3560323 3435116 3324356 3228484 3147745 3081536 3028887 2989285
61466 2989285 2962495 2947918 2944790 2952687 2971002 2998151 3032263 3072650 3119578 3172355 3228586 3285785
61454 3285785 3342990 3400269 3457313 3513224 3567360 3619734 3670703 3720644 3769870 3818551 3866783
61443 3866783 3914996 3964084 4014758 4066688 4118475 4168590 4216263 4261478 4304217 4343785 4378949
61432 4378949 4408628 4432285 4449645 4460348 4464159 4461310 4452220 4436917 4415098 4386868 4353140 4315232
61420 4315232 4274314 4231449 4187935 4145279 4104779 4067263 4033309 4003600 3978885 3959518 3945106
61409 3945106 3934698 3927261 3921914 3917860 3914298 3910374 3905067 3897232 3886038 3871305 3853201 3831772 3807226
61396 3807226 3780629 3753841 3728753 3707072 3690783 3682092 3682658 3693532 3716171 3752898 3805974 3876852
61384 3876852 3966753 4077285 4209829 4364936 4543041 4745170 4971866 5221572 5490764 5775243
61374 5775243 6070107 6368436 6661058 6938057 7190044 7408259 7584838 7714041 7793158 7822087
61364 7822087 7802478 7737366 7630852 7487418 7311586 7108245 6882754 6640353 6385775 6123715
61354 6123715 5859196 5596902 5340222 5091284 4851823 4623623 4408169 4206303 4018445
61345 4018445 3844971 3686186 3542051 3412182 3296195 3193837 3104653 3027798 2962567 2909076
61335 2909076 2867946 2839137 2821455 2813417 2814304 2824147 2842998 2870453 2905545 2946728 2992219 3040759
61323 3040759 3091855 3144980 3198846 3251856 3303022 3351993 3398429 3441844 3481929 3518553 3551634
61312 3551634 3581458 3608834 3634280 3657215 3676626 3692393 3705155 3714844 3720221 3720145 3714559 3703873
61300 3703873 3687996 3666444 3639037 3606054 3567995 3525444 3478930 3428743 3375195 3319155 3261845
61289 3261845 3203935 3145464 3087075 3030721 2978512 2931195 2888402 2850076 2816828 2788889 2765583
61278 2765583 2746179 2730610 2718812 2709703 2701454 2692697 2683006 2672230 2660001 2646212 2631540 2616975
61266 2616975 2602972 2589521 2576943 2566136 2557951 2552755 2550742 2552242 2557525 2566691 2580079 2598622
61254 2598622 2623620 2656440 2698560 2751492 2816250 2893191 2982592 3084899 3199815 3325265 3457590
61243 3457590 3592430 3724935 3849400 3959424 4048706 4111617 4143575 4141781 4105893 4037722 3940393
61232 3940393 3818128 3676522 3522043 3360748 3197567 3036594 2881371 2734548 2597602
61223 2597602 2471115 2355111 2249167 2152627 2064967 1985826 1914717 1851072 1794564 1745040 1702061
61212 1702061 1664860 1632812 1605599 1582834 1563916 1548513 1536931 1529792 1527434 1529660 1535895 1545490
61200 1545490 1558028 1573379 1591434 1611922 1634516 1658785 1683644 1707139 1727323 1743447 1755940
61189 1755940 1765261 1771185 1773233 1771347 1766016 1757998 1747987 1736260 1722638 1706975 1689619 1671113
61177 1671113 1651630 1631119 1609826 1588101 1565780 1542392 1518089 1493688 1469518 1444763 1418325
61166 1418325 1389988 1360416 1330309 1299884 1269013 1237562 1205710 1174094 1143487 1114271 1086397
61155 1086397 1059898 1035131 1012332 991233 971335 952369 934255 916644 898739 879678 859217
61144 859217 838071 817484 798264 780308 763132 746734 731696 718553 707329 697674 689249 682073
61132 682073 676627 673485 672644 673399 675067 677590 681190 685753 691024 697164 704668 713840 724645 736759
61118 736759 749386 761434 772523 783586 795823 809298 823214 837253 851719 866502 880972
61107 880972 895057 909410 924075 937782 949064 957506 963540 967649 970233 971678 971973 970595 967264
61094 967264 962544 957248 951464 944562 936108 926428 916316 906263 895948 884487 871363 857086 842769
61081 842769 829161 816354 804181 792423 780685 768719 756908 745958 736055 726811 718049 710032
61069 710032 702849 696250 690305 685547 682118 679368 676728 674536 673516 673730 674458 674954 675069 675291 676283 678165
61053 678165 680180 681371 681664 681906 682748 683879 684552 684421 683639 682429 680907 679292 678105 678137 680008 683609
61037 683609 688235 693576 700285 709134 719948 731897 744576 758052 772105 786280 800675 815803
61025 815803 831546 847029 861730 875972 890107 903925 917091 929566 941349 952421 963203
61014 963203 974582 987244 1001354 1016864 1033649 1051417 1070170 1090716 1114105 1140627 1170028
61003 1170028 1202511 1238601 1278148 1320450 1365387 1413420 1464567 1518590 1576326 1639646 1709868
60992 1709868 1787396 1873187 1969352 2077795 2199156 2333373 2480555 2641695 2820077 3022134
60982 3022134 3255822 3528850 3850580 4235587 4703832 5279436 5993776 6888395 8006784
60973 8006784 9379446 11021706 12944578 15146570 17567785 20048280 22357514 24296119
60965 24296119 25784654 26861179 27610411 28114916 28466982 28782644 29152437 29558459 29853982
60956 29853982 29844601 29398703 28490071 27161022 25474612 23506669 21358632 19150384 16991903
60947 16991903 14962850 13112477 11466378 10029681 8791418 7733297 6836060 6079553
60939 6079553 5442116 4903374 4446474 4056848 3721184 3428984 3173208 2948012 2747298
60930 2747298 2566376 2403112 2256052 2122816 2001401 1891378 1792201 1701478 1616364 1535789
60920 1535789 1460005 1388776 1321348 1257575 1197805 1141997 1089920 1041845 998189 958782 923172
60909 923172 891162 862421 836091 811579 789249 769585 752072 735707 720320 706589 694909
60898 694909 684920 676086 668144 660958 654375 648351 643065 638948 636558 636165 637435 639826 643280 648155
60884 648155 654501 661951 670247 679171 687885 695193 700792 705548 710173 714304 717279 719107 720072 719949 718213
60869 718213 714718 709694 703443 696388 689021 681410 673212 664568 656462 649650 643707 637755 631824 626776
60855 626776 623109 620515 618700 617983 618835 621130 624214 627695 632002 638038 646317 656652 668731 682628
60841 682628 698395 715458 732963 750631 768668 786803 804038 819515 833190 845525 856914
60830 856914 867607 877822 887708 897312 906532 914888 921583 926251 929474 932057 934031 934972 935067 935033 935025 934528
60814 934528 933392 932093 930761 928775 925601 921280 915793 908720 899934 889927 879067 867077 853677
60801 853677 839197 824294 809611 795870 783564 772266 761028 749821 739817 731799 725079 718601
60789 718601 712445 707594 704765 704078 705374 708249 712124 716822 722688 729828 737765 746290 756044 767630
60775 767630 780657 794249 808060 822147 836307 850182 863716 876909 889477 901273 912701
60764 912701 924048 934791 944157 952149 959402 966316 972881 979110 985020 990399 995120 999497 1003846 1007988
60750 1007988 1011753 1015675 1020454 1025825 1030568 1033701 1035171 1035487 1035151 1034466 1033440 1031782 1029205 1025644 1021022
60735 1021022 1015114 1007988 1000324 992867 985723 978493 970823 962470 953234 943399 933980 925886 918927 912249
60721 912249 905638 899798 895311 891907 888949 886207 883960 882605 882314 882836 883498 883490 882244 879576 875669 871029
60705 871029 866191 861274 856030 850475 845208 840820 837297 834401 832381 831842 832935 835096 837611 840154
60691 840154 842700 845155 847192 848387 848458 847268 844503 839483 831684 821503 810147 798521 786508 773502
60677 773502 759363 744606 729940 715898 702751 690562 679361 669422 661225 655100 651009 648555
60665 648555 647055 645834 644909 645192 647465 651175 654850 657658 659872 661862 663583 665240 667443 670211 672683
60650 672683 674384 676009 678292 680859 683002 684996 687705 691223 694750 697663 699999 702050 704079 706366
60636 706366 709009 711839 714900 718766 723977 730378 737433 744905 752913 761698 771726 783651 797631
60623 797631 813014 829129 845977 863738 882061 900318 918120 935045 950444 964177 976969
60612 976969 989267 1000166 1008319 1013552 1016765 1018600 1019124 1018559 1017328 1015401 1012453 1008612 1004287 999306
60598 999306 992991 984955 975106 963088 948736 933098 917987 904261 891367 878777 866979 856685
60586 856685 847791 839710 832384 826537 823067 822251 823305 824782 825714 826184 826465 826012 824130 821420 819547
60571 819547 819365 820116 820759 821341 822608 824868 827804 831061 834535 838214 842052 845933 849666 853084 856090
60556 856090 858451 859720 859727 859018 858435 858311 858417 858576 858903 859613 861080 864025 869077 876243 885394 897233
60540 897233 913150 934031 959822 990397 1026213 1067793 1114870 1166110 1219231 1271288 1319317
60529 1319317 1360860 1393705 1415431 1424109 1419697 1404154 1379898 1348711 1312346 1273430 1235005 1199335
60517 1199335 1167595 1140536 1118988 1103623 1094514 1091044 1092195 1096855 1103897 1112191 1120936 1130107 1140254
60504 1140254 1151658 1164071 1177629 1193645 1213918 1239513 1270776 1308411 1353947 1409148 1475471
60493 1475471 1554147 1646234 1752491 1873540 2010203 2163537 2334880 2526437 2741599 2984064
60483 2984064 3256537 3560371 3895457 4258545 4640645 5026332 5395828 5727769 6000982
60474 6000982 6196139 6298368 6299959 6201636 6012010 5745669 5420577 5055718 4669677 4279637
60464 4279637 3899905 3540581 3207713 2904614 2632672 2391303 2178327 1991046 1826831
60455 1826831 1682920 1556574 1445828 1349519 1266208 1193589 1129357 1072273 1022072 978629 941480
60444 941480 909777 882328 857832 835299 814224 794400 775849 758868 743750 730297 717811
60433 717811 705536 692911 679686 666283 653904 643657 635522 628523 621830 615217 608668 602333 596808
60420 596808 592782 590287 588917 588695 589923 592126 594130 595452 596841 599102 602158 605575 609209 612849
60406 612849 615943 618309 620584 623437 626773 630134 633413 636703 639909 643053 646651 651324 657184 663820
60392 663820 670561 676614 681467 685517 689822 694880 700070 704586 708364 711702 714514 716515 717720 718181
60378 718181 717550 715492 712352 708918 705589 702135 698218 693898 689724 686493 684751 684346 684628 685065 685434
60363 685434 685536 685293 685217 686206 688596 691836 695253 698614 701778 704510 707045 710233 714661 719983 725502
60348 725502 730998 736745 743194 750891 760122 770217 779769 787965 795147 801704 807177 811088 813919 816371
60334 816371 818171 818531 817450 815644 813445 810808 808392 807579 809037 811940 814981 817737 820700 824296 828178
60319 828178 831417 833170 833181 831646 828764 824719 820054 815596 811685 807870 803747 799792 796890 795231 794171
60304 794171 793162 792332 792031 792112 791946 791093 789884 789217 789737 791297 793346 795633 798184 800809 803183 805403
60288 805403 807929 810936 814194 817660 821472 825263 828230 830193 831947 834222 836938 839839 843091 846712
60274 846712 850122 852920 855636 859038 863176 867714 872694 878285 884327 890894 898898 909239 921628 935066
60260 935066 949271 964833 982234 1001683 1023858 1049731 1079441 1112127 1147177 1184954 1226076
60249 1226076 1270746 1319344 1373161 1433874 1502301 1578066 1660559 1750023 1847457 1953458 2067319
60238 2067319 2187512 2312797 2442295 2574435 2706574 2836078 2961221 3080488 3191474
60229 3191474 3291267 3377721 3449793 3506882 3548534 3574772 3586109 3583156 3566678 3538041 3499252
60218 3499252 3452651 3400928 3347161 3294218 3244037 3197892 3157308 3124238 3100435 3087137 3085449
60207 3085449 3096632 3121905 3162208 3218007 3289072 3374524 3473382 3584747 3707060 3837450 3972387
60196 3972387 4108682 4243280 4372352 4491516 4597149 4686924 4759054 4811747 4843626 4854115
60186 4854115 4843192 4811270 4759539 4690022 4605160 4507802 4401723 4291466 4181197 4073950
60176 4073950 3972295 3879277 3798266 3731962 3681874 3648627 3632449 3633364 3651091 3684854 3733382
60165 3733382 3795182 3868721 3952016 4041997 4134597 4225671 4311753 4389919 4457402 4511813 4551808
60154 4551808 4577193 4588180 4584744 4567044 4536580 4496741 4451997 4406597 4363983 4327025 4298216
60143 4298216 4279687 4273512 4282084 4307745 4351890 4414874 4497088 4599833 4725053 4874683 5050505
60132 5050505 5254050 5486144 5746787 6035834 6353387 6698954 7070339 7463626 7873935
60123 7873935 8295722 8722632 9147703 9563782 9963457 10338743 10681402 10983803 11239604
60114 11239604 11443893 11592983 11683928 11714117 11681694 11586732 11431793 11221305 10960939 10657962
60104 10657962 10321508 9961671 9588337 9211069 8839421 8482284 8146775 7838178 7560790
60095 7560790 7318301 7113549 6948457 6824189 6740915 6697580 6692299 6722752 6785580 6875617 6986383
60084 6986383 7111319 7244038 7377685 7505073 7619888 7717486 7794550 7848488 7877272 7879499
60074 7879499 7854600 7803262 7727487 7629720 7511881 7375535 7222713 7055991 6877861 6690578
60064 6690578 6496645 6298955 6100620 5905136 5716504 5538326 5372634 5220189 5082079
60055 5082079 4960499 4857877 4775736 4714539 4674183 4654538 4655922 4679116 4724523 4791375 4878102
60044 4878102 4983128 5104508 5238803 5381222 5527116 5672566 5813310 5943955 6058960
60035 6058960 6154101 6226613 6274403 6295664 6289129 6254353 6191959 6103835 5993012 5863150 5718257
60024 5718257 5562742 5401214 5237921 5076616 4920984 4774687 4640602 4520221 4414129
60015 4414129 4322947 4247715 4189587 4149549 4128367 4126592 4144601 4182798 4241837 4322557 4425578
60004 4425578 4550793 4697157 4862833 5045294 5241087 5445631 5653590 5859480 6057699
59995 6057699 6242257 6407263 6547986 6661101 6743990 6794596 6812297 6798024 6752910 6677497
59985 6677497 6573072 6443307 6293774 6130235 5958103 5783038 5610829 5446464 5293867
59976 5293867 5156358 5036678 4936656 4857516 4800438 4766242 4754756 4765204 4797027 4849504 4920760
59965 4920760 5007952 5108378 5219585 5338495 5461391 5584934 5706467 5823312 5932667 6032346
59955 6032346 6120896 6196835 6258598 6305552 6338487 6358948 6368654 6369700 6364765 6357026 6350374 6349603 6359674
59942 6359674 6384794 6428841 6496545 6593230 6723282 6889633 7094806 7341446 7631463 7965306
59932 7965306 8342064 8759105 9210922 9688752 10181408 10675698 11155998 11604627 12003689
59923 12003689 12336727 12589328 12750026 12812138 12774882 12642781 12424387 12131352 11777326 11376653
59913 11376653 10943839 10493565 10039768 9594050 9165420 8761356 8388010 8049288 7747130
59904 7747130 7483357 7260280 7079049 6938726 6837962 6776695 6755401 6773553 6829726 6922342
59894 6922342 7049130 7206190 7388401 7590215 7805151 8024761 8238848 8436531 8606888
59885 8606888 8739570 8826080 8860608 8839498 8760771 8625140 8437061 8203829 7933630 7634784
59875 7634784 7316023 6986133 6652972 6323121 6002151 5694567 5403670 5132054 4882060
59866 4882060 4655239 4451629 4270194 4109899 3970004 3849586 3747352 3661731 3590701 3531668
59856 3531668 3481855 3438622 3399301 3361397 3323601 3286289 3250392 3215997 3182475 3149752 3118934
59845 3118934 3091882 3070410 3055347 3045787 3039430 3034008 3028064 3020154 3008103 2989804 2964402 2932071
59833 2932071 2893172 2848387 2799361 2748319 2697089 2647053 2599783 2557028 2520089 2489680 2466257
59822 2466257 2449996 2440726 2438372 2443236 2455267 2473431 2496471 2524164 2557237 2596306 2641578 2693335
59810 2693335 2751762 2816077 2884451 2954917 3025845 3095405 3161138 3220451 3271450 3313245 3345682
59799 3345682 3368880 3383053 3388855 3387807 3382071 3373663 3364218 3355534 3349788 3348952 3354555 3368282 3392223
59786 3392223 3428115 3477015 3540308 3620520 3720633 3843284 3991444 4169266 4381205 4630430
59776 4630430 4918879 5248297 5619558 6029869 6470415 6926037 7376200 7796459 8160996
59767 8160996 8446377 8635388 8719536 8699628 8584485 8388627 8130120 7828869 7504485 7173745
59757 7173745 6849368 6540843 6255537 5998426 5771587 5575137 5408700 5271529 5161860
59748 5161860 5077354 5016325 4977872 4960976 4964216 4986460 5027147 5085937 5162671 5257698 5371648
59737 5371648 5504842 5657515 5830552 6025486 6243843 6487102 6757354 7057487 7390733
59728 7390733 7760413 8169837 8621636 9116983 9655914 10238137 10862617 11525939 12221392
59719 12221392 12939658 13669941 14400627 15119995 15817364 16484204 17115022 17708329 18267341
59710 18267341 18799479 19314885 19824996 20341537 20875283 21434625 22024594 22646271 23295855
59701 23295855 23963699 24634610 25289704 25908590 26470899 26957373 27351114 27639222 27814585
59692 27814585 27877103 27833431 27695346 27478154 27200009 26881306 26543183 26205913 25888360 25608133
59682 25608133 25381329 25222078 25142706 25154251 25266540 25488095 25826410 26287928 26876868 27593562
59672 27593562 28433503 29386794 30437053 31560010 32722840 33884361 34996036 36004558
59664 36004558 36856470 37503329 37905793 38036932 37885361 37456943 36773540 35869695 34789129
59655 34789129 33581079 32295742 30980014 29675200 28415851 27227746 26125512 25112130
59647 25112130 24180424 23314673 22492239 21687016 20874780 20037875 19167330 18262784 17331079
59638 17331079 16383888 15435304 14500418 13594334 12730350 11917871 11161981 10464751 9826409
59629 9826409 9245526 8719233 8244057 7816561 7433351 7090964 6785878 6514420 6272929
59620 6272929 6058519 5869449 5704210 5560443 5435329 5326790 5233499 5153765 5085068 5024633
59610 5024633 4969732 4917415 4864726 4809313 4749417 4683432 4610196 4529688 4442768 4350253 4252886
59599 4252886 4152079 4049852 3947958 3847744 3750770 3658726 3572603 3492655 3419319 3353524
59589 3353524 3296013 3247068 3206916 3175717 3153010 3137896 3129840 3128654 3133710 3143935 3158639 3177528
59577 3177528 3199753 3223811 3248626 3274004 3299836 3325676 3351388 3377420 3404111 3431492 3460228
59566 3460228 3492098 3528964 3571694 3620449 3675606 3738013 3808695 3888786 3979649 4082820 4199811
59555 4199811 4331835 4479526 4643166 4823483 5021901 5239558 5476444 5731984 6005936
59546 6005936 6297723 6605098 6924327 7251557 7583057 7914390 8240559 8557302 8861467
59537 8861467 9150186 9420725 9671267 9900741 10107549 10289456 10445270 10576040 10684501
59528 10684501 10774207 10849549 10915850 10978991 11045204 11120863 11211273 11319130 11444486 11585791
59518 11585791 11739685 11899528 12055231 12195047 12307139 12379936 12402860 12367848 12269904 12106394
59508 12106394 11877146 11585582 11238561 10844454 10412161 9951978 9475687 8994513 8517501
59499 8517501 8052156 7605412 7183013 6788636 6424368 6091490 5790399 5520582 5281195
59490 5281195 5070913 4887090 4726387 4587043 4469586 4374572 4300648 4245550 4207995 4187609
59480 4187609 4183954 4196775 4226621 4274267 4340010 4424215 4527921 4652139 4797231 4963683 5152682
59469 5152682 5364905 5599236 5853357 6124775 6410175 6704254 7000121 7290358 7566822
59460 7566822 7820008 8039944 8217872 8346846 8421559 8438757 8397793 8300309 8149823 7952082
59450 7952082 7714921 7446635 7154668 6846281 6529488 6212027 5899620 5596042 5304368
59441 5304368 5027227 4766280 4522458 4296548 4088807 3898465 3724586 3567076 3425946
59432 3425946 3300034 3187447 3087032 2998469 2921148 2853945 2795985 2746791 2705801 2672447 2646472
59421 2646472 2627446 2614297 2606086 2602817 2604704 2611148 2621452 2636041 2655731 2680122 2708016 2739114
59409 2739114 2773698 2810484 2846370 2878982 2908442 2936258 2963653 2991733 3022357 3057846 3100127
59398 3100127 3150723 3211129 3282466 3364737 3456750 3557036 3665092 3782113 3910585 4053151
59388 4053151 4212246 4391166 4594938 4829216 5098326 5405037 5752074 6142828 6580130
59379 6580130 7064724 7594948 8167039 8775077 9410866 10064220 10723412 11375723 12008505
59370 12008505 12610742 13173993 13692274 14161697 14580635 14949882 15271875 15549180 15783399
59361 15783399 15975211 16124906 16232188 16295212 16310358 16273752 16183230 16038730 15841406 15593599
59351 15593599 15300093 14968618 14608352 14227980 13834963 13435424 13033611 12631447 12228960
59342 12228960 11825077 11418057 11005994 10587660 10162970 9732842 9299386 8866423 8438925
59333 8438925 8021224 7616214 7226567 6855795 6507353 6183213 5883990 5609839 5360531
59324 5360531 5135157 4932580 4751905 4592032 4451274 4328015 4221279 4130115 4053123 3989233
59314 3989233 3938230 3899719 3872234 3854303 3845768 3847106 3858047 3877923 3906796 3945023 3992003 4046530
59302 4046530 4108080 4176608 4251203 4330062 4411741 4495366 4579619 4662472 4741999 4816658 4884930
59291 4884930 4945557 4998182 5043071 5080486 5111142 5136963 5160339 5182816 5205549 5230880 5262310
59280 5262310 5302872 5354415 5418389 5496115 5588046 5693664 5812217 5942590 6082291 6227414
59270 6227414 6373711 6516825 6651306 6770357 6867047 6935565 6971923 6974748 6945681 6888143 6805606
59259 6805606 6701721 6581773 6452568 6320449 6190254 6066116 5951795 5849660 5760390 5684354
59249 5684354 5622485 5575324 5542036 5520974 5510448 5508442 5512339 5519715 5529147 5539955 5551748 5564649
59237 5564649 5579496 5597469 5620015 5649437 5689006 5742155 5812086 5902503 6018131 6163948 6344056
59226 6344056 6561330 6817481 7112871 7446316 7815021 8213985 8634919 9065904 9492342
59217 9492342 9898316 10267506 10584043 10833516 11003753 11085369 11072624 10964346 10763964 10478731
59207 10478731 10119221 9699076 9233942 8739481 8229936 7717924 7214605 6729413 6269581
59198 6269581 5839850 5442491 5077947 4746035 4446523 4178349 3938851 3724604 3532927
59189 3532927 3361934 3209447 3072877 2950264 2840526 2742477 2654343 2574483 2501952 2436127
59179 2436127 2376395 2322446 2274265 2231580 2193726 2160222 2131073 2106417 2086280 2070697 2059628
59168 2059628 2052707 2049491 2049943 2054334 2062816 2075446 2092352 2113376 2137974 2166068 2198561 2236099
59156 2236099 2277701 2321660 2367730 2417369 2471902 2531492 2595980 2665556 2740208 2819459 2903015
59145 2903015 2990983 3083105 3178324 3275272 3372596 3468655 3561531 3649486 3731009 3804549 3868788
59134 3868788 3923013 3966645 3998784 4019137 4029079 4030789 4025613 4014430 3999322 3983469 3969393 3958675
59122 3958675 3953471 3956648 3970041 3994008 4029321 4078134 4142432 4222772 4319420 4433638 4566930
59111 4566930 4719812 4892105 5083644 5293836 5521031 5762882 6016636 6278276 6541738
59102 6541738 6799375 7042818 7263355 7452544 7603415 7711136 7772757 7787342 7756721 7685273
59092 7685273 7578439 7441891 7281991 7105580 6918333 6723695 6523780 6320573 6115889
59083 6115889 5910978 5706755 5503932 5302608 5102426 4903449 4706350 4511713 4320015
59074 4320015 4132427 3950578 3775162 3605786 3442561 3286820 3139750 3001303 2871022
59065 2871022 2749031 2635592 2530531 2433663 2345046 2264275 2190292 2122347 2060435 2004476 1953920
59054 1953920 1908469 1868131 1832186 1799162 1768206 1739354 1711969 1684318 1655398 1626000 1597075
59043 1597075 1568253 1538871 1509348 1480502 1452562 1425896 1401757 1381105 1363486 1348169 1335622
59032 1335622 1326743 1321333 1318528 1318174 1320637 1325685 1332670 1341560 1352808 1366277 1380939 1395437 1408574
59019 1408574 1419662 1428843 1436507 1442107 1444400 1443300 1440566 1438106 1436577 1436157 1437451 1440697 1445251 1450924
59005 1450924 1458807 1469581 1481991 1494210 1505853 1517248 1527605 1535415 1540268 1542866 1543626 1542528 1539990
58992 1539990 1536657 1532554 1527587 1522587 1518752 1516278 1514601 1513782 1514644 1517656 1522533 1528696 1535453 1542117
58978 1542117 1548793 1556561 1566088 1576611 1587191 1598343 1611350 1626516 1643295 1661675 1682225 1705073
58966 1705073 1729994 1757222 1787047 1818854 1851654 1885325 1920231 1955908 1991315 2026228 2061241
58955 2061241 2096472 2131384 2165898 2200727 2236631 2274253 2314537 2358436 2406174 2457551 2512756
58944 2512756 2572233 2636184 2705138 2780476 2863321 2953268 3049448 3152557 3264543 3386488 3518156
58933 3518156 3659706 3812485 3977894 4156694 4349869 4559246 4786870 5034612 5304749
58924 5304749 5600276 5924361 6279910 6669776 7096857 7563954 8073970 8630106 9235260
58915 9235260 9891079 10597636 11353322 12154098 12992766 13859034 14739462 15616553 16468602
58906 16468602 17271622 18001543 18634649 19147768 19520696 19739584 19798203 19697223 19443802
58897 19443802 19051398 18538023 17923733 17229640 16477901 15690300 14885917 14080538 13287694
58888 13287694 12518871 11782668 11085035 10430498 9822123 9260376 8743408 8268944 7835071
58879 7835071 7439178 7077338 6745291 6439379 6156397 5893467 5648408 5419605 5205342
58870 5205342 5003866 4814183 4636198 4470036 4315724 4173311 4042517 3922314 3811484
58861 3811484 3709503 3616299 3531494 3454546 3385291 3323461 3268113 3218464 3174979 3138595 3109192
58850 3109192 3085870 3068395 3057195 3052197 3052956 3059820 3073705 3094723 3122191 3155998 3196715 3244395
58838 3244395 3298624 3359935 3429842 3509093 3597046 3693102 3797658 3911245 4033832 4165660
58828 4165660 4307983 4462512 4630616 4813396 5011978 5227610 5462050 5717959 5998389
58819 5998389 6305889 6642740 7011995 7417620 7863622 8353521 8890348 9476303 10112331
58810 10112331 10798322 11532884 12311681 13126000 13963465 14809387 15646205 16452147 17202165
58801 17202165 17870787 18434101 18870632 19163112 19300742 19279774 19102750 18778481 18322092
58792 18322092 17753075 17092405 16361565 15582726 14777229 13963169 13155178 12365800 11605108
58783 11605108 10879162 10190887 9542817 8937484 8375250 7854042 7371822 6927617 6519668
58774 6519668 6144490 5798639 5479829 5185585 4912428 4657471 4419629 4198371 3992423
58765 3992423 3800383 3621399 3454422 3297971 3151480 3015800 2891561 2777916 2673588
58756 2673588 2578108 2491261 2412290 2340485 2275810 2218191 2166852 2120900 2079856 2043124 2009716
58745 2009716 1979030 1951196 1926264 1903768 1883432 1865501 1849936 1836027 1823080 1810813 1798914
58734 1798914 1786989 1775038 1763145 1750712 1737024 1722512 1708291 1694356 1679499 1663121 1645731
58723 1645731 1627438 1607373 1584939 1560294 1533308 1503562 1471805 1439901 1408623 1376908 1343961
58712 1343961 1310726 1278562 1247756 1218169 1190109 1163625 1138019 1112916 1089033 1067230 1047642
58701 1047642 1030161 1014790 1001053 988034 975441 963649 952464 941132 929803 919590 910734
58690 910734 902225 893732 886397 881078 877371 875061 874892 876876 879285 880428 880245 879255 877183 873613 868866
58675 868866 863313 856915 850174 844327 839780 835580 831235 827710 825823 824981 824461 824600 825724 827180 828406
58660 828406 829652 830714 830366 828100 825085 822347 819451 816063 813267 812031 811839 812205 814032 817955 822840
58645 822840 827685 833729 842788 854572 867550 881587 897776 916251 936064 956908 979385 1003908
58633 1003908 1030686 1060430 1093745 1130198 1169163 1211217 1257677 1309337 1366737 1431018 1503314
58622 1503314 1583889 1673068 1772479 1884277 2009740 2149810 2306357 2481562 2676264 2889814
58612 2889814 3120979 3367815 3626887 3893294 4160802 4421140 4663943 4878503 5055438
58603 5055438 5186713 5265907 5290151 5261192 5183537 5062260 4903470 4715473 4507615 4288173
58593 4288173 4064140 3841910 3626539 3420690 3225518 3042176 2871651 2714004 2569017
58584 2569017 2437078 2318455 2212407 2117976 2034844 1962463 1899263 1843846 1796045 1755633 1720832
58573 1720832 1689393 1660381 1633762 1609011 1585334 1562500 1540276 1517786 1494531 1471196 1448306
58562 1448306 1424935 1399928 1373531 1346675 1319559 1292072 1264691 1237675 1210335 1182283 1154504
58551 1154504 1128073 1102936 1079168 1058121 1040776 1026002 1012040 998807 987293 977627 969258 962102
58539 962102 956076 950394 944716 939959 936624 933504 929489 925270 921581 917122 910235 901501 892650 883890
58525 883890 874282 863723 852505 839858 825066 809241 793981 779073 763526 747995 734016 721584
58513 721584 709686 698520 689061 681083 673786 667727 663913 661606 659236 656942 655952 656013 655762 655238 655666
58498 655666 657051 658282 659489 661975 665837 669701 672786 675464 677920 680099 682668 686262 690098 693044
58484 693044 695486 698402 701306 703113 704293 706098 708430 710671 713755 718900 725009 729982 734050 739050
58470 739050 744811 749153 751316 752544 753248 752344 749660 746365 742674 737447 730401 722582 714535 706080 697816
58455 697816 690661 684040 676783 669591 664167 660168 655642 650319 645803 642481 639102 635560 633296 632541
58441 632541 631876 631046 631636 634474 638736 644014 650861 658826 666315 672795 678945 684435 687990 689774 691244
58426 691244 692441 692024 690121 688454 687398 685779 683981 684307 687579 692143 696957 702979 710749 719218 727852
58411 727852 737407 747831 757765 766813 775955 785109 792823 798959 805185 812094 818288 822881 826408 828610
58397 828610 827957 824120 818495 811682 802966 792854 783391 775282 767319 759295 752774 748273 744431 740703
58383 740703 738124 736686 734796 732223 730856 731732 734008 737547 743519 751536 759158 765304 771459 778651
58369 778651 786119 793813 803061 813688 823500 831772 840361 850248 859993 868647 877148 885636 892569 897859
58355 897859 903848 911776 920141 927785 935564 943664 950421 955350 960360 966485 972184 976228 979374 981957
58341 981957 982877 982334 982550 984378 986080 986620 987173 988383 989473 991103 995549 1002764 1009913 1016162 1024165
58326 1024165 1035322 1047360 1058393 1069606 1082067 1094572 1106572 1119664 1134347 1148829 1162624
58315 1162624 1177621 1194016 1209250 1222732 1237369 1254444 1271208 1285687 1299544 1313941 1326902
58304 1326902 1337267 1346975 1356942 1365009 1370655 1377400 1387675 1399419 1410468 1422115 1435616 1449472
58292 1449472 1462949 1478084 1495555 1512942 1529565 1548310 1570065 1591448 1610900 1631738 1656053
58281 1656053 1681110 1705216 1731457 1761748 1792879 1822702 1854658 1891635 1930731 1968771 2007691
58270 2007691 2049570 2091589 2130963 2169884 2210615 2250703 2288066 2325804 2367021 2410014 2453377
58259 2453377 2500357 2552965 2607396 2660732 2716545 2778467 2844071 2910743 2981458 3058706 3138855
58248 3138855 3218848 3302339 3392858 3487238 3582420 3682106 3789833 3902273 4016559 4137207
58238 4137207 4268251 4405844 4546575 4695537 4857721 5029136 5205373 5391168 5592200
58229 5592200 5805469 6027546 6264155 6521323 6795520 7083256 7391709 7728640 8090946
58220 8090946 8475009 8888879 9341899 9832453 10359213 10933726 11567729 12259569 13008678
58211 13008678 13831637 14747574 15760656 16875344 18116019 19512926 21084113 22853331
58203 22853331 24871431 27199036 29888036 33008813 36680877 41054825 46294634 52620766
58195 52620766 60362062 69952169 81921923 96919407 115635182 138582620 165961569
58188 165961569 197749831 233655254 272504777 311495959 346394406 373001226 388765134
58181 388765134 393201126 387135505 371913051 349248258 321314967 290503500 258952581
58174 258952581 228286312 199625242 173645598 150616656 130510892 113160811 98336901
58167 98336901 85752398 75099541 66113958 58580758 52295460 47067816 42761974 39293637
58159 39293637 36592854 34608707 33341612 32819500 33034552 33943579 35523734 37745174
58151 37745174 40425324 43137431 45331083 46578464 46718072 45802781 43969606 41377009
58143 41377009 38220769 34743371 31191022 27756806 24562187 21674812 19125516 16911303
58135 16911303 15002972 13364765 11966919 10780646 9772597 8912012 8177542 7551259
58127 7551259 7011870 6540043 6124949 5758917 5430209 5127477 4846968 4588659 4348920
58118 4348920 4123209 3912304 3719284 3543101 3380863 3233297 3102029 2984196 2875337
58109 2875337 2774767 2682747 2595428 2508369 2422277 2339761 2259213 2177546 2096294 2019268 1946556
58098 1946556 1876361 1810235 1750737 1696164 1643297 1593365 1549694 1511446 1475185 1440768 1410087
58087 1410087 1381820 1353119 1324931 1300001 1276955 1251902 1224715 1198270 1172606 1145354 1117140
58076 1117140 1091116 1067641 1044506 1021892 1002111 984827 967399 949684 933921 920166 906346
58065 906346 892446 880279 869567 858607 848285 840859 835174 827651 817833 808479 800373 791614 782049
58052 782049 773734 766612 758113 747690 737720 729366 721375 713489 707195 702442 697172 690796 684893 680065
58038 680065 675393 671314 669573 669867 669837 668890 668812 670184 671409 671815 672632 674332 675950 677452 679850 682610
58022 682610 683870 683559 683398 683597 682656 680689 679671 679825 678972 676229 673265 671006 668049 663323 657681 651831
58006 651831 645208 637810 630831 624614 618216 611654 606353 602737 599523 595977 592691 589697 586065 581825
57992 581825 577980 574126 568393 560274 551335 542693 534165 526404 521301 519392 519023 518948 519719 521797 524349
57977 524349 526800 529757 533628 537843 541960 545971 549317 551308 552607 554486 556527 557045 555833 554406
57963 554406 553447 552159 550250 548316 546082 542563 538211 534572 531596 527622 522282 516969 512142 506784
57949 506784 500984 496408 493577 491220 489040 488498 489992 491833 492989 494397 496487 497870 497738 497318 497658
57934 497658 497993 497465 496400 494715 491122 485188 478298 471398 463619 454313 444531 435282 426133 416779 408291
57919 408291 401539 395995 391216 388007 387011 387672 389495 392698 396886 400931 405104 411360 420455 430702
57905 430702 440607 450672 461336 471306 479528 486909 494406 501074 505689 508749 511185 512526 512058 510494
57891 510494 508903 507081 504449 501302 497783 492896 486075 478597 471965 465995 459855 453809 448457 443432
57877 443432 438412 434328 431976 430343 427931 424973 422819 421819 421239 420745 420734 421718 424322 429230 436164
57862 436164 443658 450617 457271 463838 469502 473696 477205 480856 484180 486453 487899 488716 488139 485784 482809
57847 482809 480351 477876 474420 470376 466578 462671 457997 453195 449237 445615 441174 436218 432215 429793
57833 429793 428341 427091 425332 422031 416634 409916 402959 395746 387785 379404 371236 363043 354335 345602
57819 345602 337680 330380 322959 315485 308616 302458 296760 291651 287082 282147 276213 270279 265938 263401
57805 263401 261688 260265 259234 258375 257329 256591 257104 259034 261894 265665 270851 277662 285900 295258 304977
57790 304977 313758 320951 327291 333586 339275 343292 345703 347429 348875 349898 350561 350863 350234 348375 346035
57775 346035 343918 341401 337503 332445 327114 321556 315352 308979 303466 299034 295267 292236 290260 288962
57761 288962 287759 286906 286927 287457 287836 288358 289645 291248 292184 292583 293466 295203 297366 299836 302846 306218
57745 306218 309667 313460 317751 321823 325152 328518 332718 336968 340201 343171 347372 352367 356309 358841
57731 358841 361372 364496 367386 370038 373966 379978 386998 393856 400759 408370 416812 426260 437114 448885
57717 448885 460111 470154 480040 490963 502971 515726 529478 544539 560587 577221 594661 613441
57705 613441 633875 656052 679852 704972 731536 760586 793254 829617 869281 912789 961361
57694 961361 1015476 1075025 1140813 1214590 1297609 1390533 1494899 1613168 1747118 1897604 2066196
57683 2066196 2255334 2466145 2697235 2946003 3209547 3483387 3760402 4031870 4288869
57674 4288869 4522694 4725748 4893299 5023770 5117069 5173979 5197394 5191777 5159242 5096800 4998764
57663 4998764 4861668 4686528 4477998 4243181 3990853 3730130 3469239 3215478 2975410
57654 2975410 2753902 2553174 2373464 2214391 2075238 1954636 1851005 1763186 1690045 1629675
57644 1629675 1579653 1538075 1504078 1477634 1459086 1448494 1445175 1448204 1457416 1473392 1496345 1525844
57632 1525844 1561988 1606094 1659869 1724597 1801454 1891692 1995955 2114181 2246775 2395112
57622 2395112 2560215 2741539 2937480 3146016 3363797 3585128 3802636 4008439 4193970
57613 4193970 4349639 4466303 4537602 4560773 4535935 4465619 4354638 4209218 4035817 3840952
57603 3840952 3631676 3415332 3198590 2986851 2784094 2592632 2413234 2246122 2091832
57594 2091832 1950813 1822538 1705703 1599236 1502613 1415310 1336403 1264741 1199268 1139312
57584 1139312 1084777 1035797 991949 952128 915511 882257 852837 826932 803461 781503 760807
57573 760807 741574 724095 708468 694407 681493 669715 659495 650986 643815 637755 633162 630353
57561 630353 629019 628690 629452 631654 635228 639793 645274 651945 660001 669452 680345 692739 706547 721594
57547 721594 737759 755084 774014 795550 820584 848935 879610 912370 948506 989680 1036587
57536 1036587 1089312 1148525 1215613 1291770 1377565 1473345 1579627 1697157 1826884 1969751
57526 1969751 2126033 2294612 2472641 2655605 2837720 3012715 3174475 3316817 3432996
57517 3432996 3516443 3562590 3569848 3539001 3472522 3374677 3251305 3108632 2952451 2788492 2622557
57506 2622557 2459363 2301662 2151089 2009435 1878472 1758969 1650657 1553017 1465584 1387800
57496 1387800 1319169 1259396 1207930 1163652 1125506 1093217 1066868 1045991 1029616 1017091 1008441
57485 1008441 1004006 1004001 1008287 1016335 1027666 1042568 1062072 1087028 1117613 1153942 1196594 1246175 1302938
57472 1302938 1367422 1441016 1525355 1621446 1729789 1850902 1985068 2131690 2289179 2455043
57462 2455043 2625576 2795608 2958814 3108064 3235616 3334038 3397911 3424603 3413384 3364649
57452 3364649 3280524 3165562 3025988 2868400 2699239 2524540 2349248 2177065 2011212 1854621
57442 1854621 1708838 1573640 1448505 1333837 1230066 1136495 1052012 976182 908600 847912
57432 847912 792713 742863 698677 659336 623384 590382 560640 533606 508022 483675 461550
57421 461550 442072 424448 407974 392781 378923 365793 352900 340413 328591 317378 306823
57410 306823 297263 288885 281640 275513 270245 264978 259040 253007 248042 244272 240829 237418 234650 232688
57396 232688 230784 228489 226255 224452 222784 221100 219787 218865 217680 216028 214694 214206 213911 212999 211754
57381 211754 210982 210731 210392 209721 209044 208629 208428 208344 208324 208266 208042 207517 206522 205116 203843 203239 202937 201829 199380
57362 199380 196328 193847 192411 191770 191540 191467 191354 191075 190582 189875 189132 188782 189064 189587 189774 189625 189543 189520 189144
57343 189144 188421 187876 187735 187647 187371 187160 187285 187764 188675 190152 191946 193566 195002 196738 198942 201238 203329
57326 203329 205202 206684 207596 208475 210313 213292 216539 219369 221993 224723 227337 229654 231933 234268 236307
57311 236307 238069 240342 243722 247897 252305 256899 261746 266530 271043 275654 280757 286275 292130 298633
57297 298633 305869 313265 320357 327482 335211 343618 352655 362710 374133 386659 399920 414135 429671
57284 429671 446369 463948 482734 503306 525656 549405 574660 602089 632128 664461 698067
57273 698067 731340 762388 789716 812646 830937 844280 852426 855474 853744 847657 837965 825722
57261 825722 811670 796059 779275 762230 745823 730509 716698 704995 695609 688099 682197 678321
57249 678321 676683 676491 676823 677898 680647 685228 690813 696781 703344 710818 718897 727024 735308 744795 756664
57234 756664 771037 786756 802685 819127 837417 858165 880654 904158 928951 955522 983608
57223 983608 1012694 1042885 1074444 1106818 1138930 1170258 1201041 1231583 1261964 1292335 1322919
57212 1322919 1353673 1384202 1413934 1442232 1468612 1493117 1516283 1538680 1560834 1583582 1607799
57201 1607799 1633462 1659615 1685652 1712080 1739646 1768434 1798317 1829624 1862634 1896887 1931548
57190 1931548 1966025 1999753 2032048 2062905 2093489 2125077 2157836 2191148 2224655 2258332 2292093
57179 2292093 2326161 2361550 2399340 2439594 2481503 2524379 2568051 2612616 2658260 2705026 2752384
57168 2752384 2799486 2846206 2893306 2941130 2988904 3035914 3082624 3129835 3177524 3225385 3273868
57157 3273868 3323640 3374498 3425690 3476855 3527790 3577873 3626735 3675017 3723495 3771927 3819724
57146 3819724 3867229 3915263 3963912 4012911 4062740 4113964 4165776 4216458 4265099 4311634 4355339
57135 4355339 4394580 4428103 4455603 4477200 4493527 4506240 4517296 4527718 4537989 4549389 4563769
57124 4563769 4582201 4605206 4634266 4671665 4718560 4774260 4837423 4906698 4980047 5054831 5129330
57113 5129330 5203742 5279835 5360541 5449796 5551527 5668354 5801848 5953958 6127612 6326668
57103 6326668 6556889 6827437 7151067 7543706 8025293 8620795 9359361 10273011 11397174
57094 11397174 12770995 14434266 16422883 18766433 21485830 24586882 28052301 31837898
57086 31837898 35872927 40063117 44302185 48493973 52566757 56456553 60069169 63263579
57078 63263579 65880578 67788870 68905147 69184096 68610030 67207420 65052849 62267457
57070 62267457 58993959 55375640 51544499 47615179 43683005 39826780 36112868 32595550
57062 32595550 29314340 26292949 23541453 21059339 18837995 16863255 15117946 13583270
57054 13583270 12238977 11063571 10035396 9134194 8342321 7645005 7029594 6484667 5999823
57045 5999823 5565978 5175417 4821667 4499641 4205782 3937587 3692893 3469657 3265918
57036 3265918 3079366 2907121 2746494 2595950 2454961 2323158 2200187 2086172 1981576
57027 1981576 1886467 1800374 1722764 1653106 1590468 1533707 1482182 1435831 1394443 1357250 1323335
57016 1323335 1292018 1262843 1235639 1210717 1188598 1169445 1153029 1139316 1128798 1122198 1120228 1123801
57004 1123801 1134408 1154421 1187199 1236644 1306192 1398238 1514466 1655375 1817196 1987959
56994 1987959 2147428 2273108 2348629 2368379 2336055 2260241 2151282 2020445 1879352 1738310
56984 1738310 1604704 1482857 1374755 1280157 1196490 1120090 1048417 980910 917736 858514 802671
56973 802671 750397 702555 659879 622715 591185 565100 543930 527376 515824 509849 509387 513729
56961 513729 522175 534381 550251 569796 592850 618468 644603 668634 688231 701803 708567 708648
56949 708648 702896 692314 677737 660162 641037 621948 604217 588890 576656 567520 560990 556985
56937 556985 556242 559566 567117 578851 595247 616939 643681 673904 704974 733543 756051 769689
56925 769689 773203 766925 752362 731745 707304 680462 651937 622745 594472 568200 543815 521030
56913 521030 500596 483737 470650 460291 451511 443880 437488 432546 429186 427219 426109 425465 425475 426527
56899 426527 428558 431034 433486 435900 438792 442952 448757 455656 462755 469990 478115 487454 497529 508216
56885 508216 520141 533104 544847 552417 554346 550809 542322 529352 512913 494416 474898 455088
56873 455088 436077 419198 405355 395094 389177 388433 393220 403742 420674 444802 476239 514793
56861 514793 560814 614639 674846 737422 796712 846900 883312 903572 908029 898755 878165 848795
56849 848795 813783 776461 739364 704289 673186 648245 630964 621802 620920 628932 647046 676909
56837 676909 720173 777646 848822 932340 1025992 1125145 1221399 1304238 1364945 1399172 1406504 1388876
56825 1388876 1349677 1293352 1224922 1149563 1072247 997125 927116 864363 810826 767948 736026
56814 736026 714655 703828 704126 716069 739992 776466 825793 886473 954131 1021871 1081671 1126273
56802 1126273 1151080 1154897 1139060 1106165 1059659 1003653 942072 878099 814817 755589 702879
56791 702879 657141 617928 585684 561462 545411 536871 535827 542893 557886 579654 607314 640061
56779 640061 675202 707654 732230 745976 748253 739724 721836 696405 664954 628843 590130 551461
56767 551461 514717 480453 448927 420864 396696 375826 357262 340535 325655 312672 301601
56756 301601 292291 284172 276695 270207 265671 263222 261662 259768 257453 255241 253273 251377 249625 248267
56742 248267 247422 247189 247693 248644 249202 248687 247214 245383 243477 241240 238343 234967 231930 230074 229310 228561
56726 228561 226993 224944 223178 221650 219759 217499 215412 213521 211360 209145 207945 208295 209402 210031 209620
56711 209620 208283 206340 204167 202088 200191 198553 197524 197322 197539 197660 197871 198588 199390 199350 198349 197102
56695 197102 195841 194066 191741 189696 188524 187958 187645 187628 187731 187379 186480 185758 185843 186660 187942 189627 191500
56678 191500 193210 194903 197085 199660 201917 203631 205302 207079 208423 209189 210098 211611 213173 214046 214146
56663 214146 213629 212462 210860 209449 208497 207591 206382 205000 203513 201823 200330 199783 200083 200116 199178 197709
56647 197709 196200 194377 192042 189791 188238 187224 186402 185890 185778 185640 185051 184001 182467 180303 177882
56632 177882 175997 174733 173346 171669 170655 170948 171943 172928 174139 175865 177493 178378 178953 180005 181418
56617 181418 182512 183105 183428 183415 182909 182238 181944 182185 182857 183890 185030 185790 186058 186286 186731 187062 186984 186653
56599 186653 186221 185650 185296 185893 187591 189754 191945 194230 196266 197228 197096 196987 197641 198564 199158 199593 199923
56582 199923 199586 198595 198129 199006 200488 201506 202133 202935 203838 204640 205837 207893 210371 212709 215149 218090
56566 218090 221308 224642 228655 233682 239123 244567 250728 258236 266338 273876 280753 287366 293457 298726
56552 298726 303829 309508 315313 320369 324810 329251 333357 336207 337693 338496 338955 338957 338508 337472 335199 331331
56536 331331 326552 321703 316726 311300 305882 301121 296878 292709 288729 285077 281287 277184 273597 271125
56522 271125 268999 266347 263688 261834 260057 256959 252662 248675 245844 243789 241999 240254 238174 235640
56508 235640 233365 231999 230967 229303 227211 225641 224692 223647 222266 220908 219637 218264 216952 215822
56494 215822 214455 212764 211689 211905 212562 212567 212388 213072 214204 214530 214205 214629 216239 218128 219765 221516 223413
56477 223413 224930 226149 227855 230345 233252 236519 240390 244519 248199 251457 254842 258336 261516 264565
56463 264565 267983 271572 274877 278292 282535 287333 291859 296114 300543 304675 307608 309572 311505 313323
56449 313323 314093 313829 313612 313994 314687 315699 317274 318765 319088 318331 317564 317117 316464 315737 315738 316351 316437 315502 314165
56430 314165 312923 311692 310555 309617 308150 305334 301831 299141 297350 295017 291387 287256 283441 279861
56416 279861 276329 272913 269294 265017 260562 256925 254081 251114 247830 244930 242651 240670 239312 239304 240261
56401 240261 240893 240830 240797 240951 240561 239506 238631 238437 238731 239579 241238 243243 244999 247018 249974 252806 253733
56384 253733 253086 253068 254615 256542 257996 259589 261600 263167 264009 265085 266866 268640 270132 272076 274598
56369 274598 276716 278090 279614 281758 284062 286744 290853 296136 300708 303684 306278 309376 311933 313000
56355 313000 313588 315108 317319 319037 319744 319518 318550 317713 318375 320690 323115 324435 325138 326080 327079 327749 328540
56338 328540 330014 332009 334274 336990 340140 343364 346860 351266 356277 360726 364500 368948 374834 381333
56324 381333 387688 394408 402055 410237 418556 427387 436994 447023 457319 468040 478569 487721 495488
56311 495488 503073 510784 517464 522504 526678 530397 532872 533823 534319 535024 535196 534226 532685 531042 528915
56296 528915 526426 524699 524194 524077 524024 525062 527828 531636 536126 542103 549795 557965 565830 574343 584563
56281 584563 596278 609142 623609 639819 657111 675522 696206 719586 744830 771971 802651
56270 802651 837733 876103 917003 961674 1011483 1066347 1126394 1193396 1269025 1353293 1446183
56259 1446183 1549327 1664622 1792505 1932784 2085684 2250863 2426832 2612362 2806871
56250 2806871 3008343 3212513 3415159 3613333 3803252 3979146 4135766 4270320 4380678
56241 4380678 4463883 4518244 4545101 4546798 4524593 4480266 4417895 4341980 4255198 4159621 4058393
56230 4058393 3954283 3848021 3739921 3631659 3524553 3417506 3308601 3197589 3085064
56221 3085064 2970544 2853288 2734021 2614174 2494327 2374765 2256476 2140299 2026325
56212 2026325 1915226 1808783 1707995 1612341 1522003 1438835 1363678 1294716 1230092 1170262 1116217
56201 1116217 1067393 1023120 984062 950219 919418 889812 862106 837417 814933 793845 775573
56190 775573 761638 750840 740847 731065 721910 712925 703876 696224 691313 688464 686739 686884 689604 693745
56176 693745 698266 704170 712336 721455 730389 740511 753219 767127 780418 794031 809660 826298
56164 826298 841673 855574 868942 881131 890900 898840 906086 911937 915268 916928 918222 918619 917580
56151 917580 917010 919156 923548 928759 935558 945542 958289 972916 990955 1014750 1044400 1079290 1121296
56138 1121296 1173522 1237159 1312314 1400305 1502026 1615251 1736350 1863052 1992712 2119805
56128 2119805 2238758 2348219 2449658 2543333 2628629 2706490 2777789 2840465 2891453 2930229 2957569
56117 2957569 2972675 2974884 2966445 2949941 2924316 2886710 2836539 2774292 2698359 2607178 2503239
56106 2503239 2391282 2274036 2153418 2034125 1921702 1818122 1722977 1637552 1563771 1500613
56096 1500613 1445688 1399034 1361403 1330341 1302234 1276900 1255983 1238255 1220807 1203567 1188252
56085 1188252 1174185 1159495 1145179 1133626 1124398 1115672 1108297 1104129 1102031 1100020 1099475 1102500 1107078
56072 1107078 1110009 1112766 1118996 1127950 1135973 1142947 1151513 1161342 1170102 1178878 1190651 1204379 1216465
56059 1216465 1227140 1239570 1253706 1266995 1280191 1296314 1314696 1332112 1348884 1367739 1387661
56048 1387661 1405269 1421351 1439627 1459970 1479376 1498622 1521160 1546365 1570818 1595376 1623790
56037 1623790 1655138 1684962 1713299 1744208 1778020 1811550 1845322 1882766 1922855 1961414 1999317
56026 1999317 2041312 2087245 2132640 2177601 2226596 2279742 2332929 2386402 2444435 2506592 2568256
56015 2568256 2629671 2695417 2765102 2833920 2902325 2975603 3053990 3132944 3212978 3299117 3390896
56004 3390896 3483428 3578092 3681194 3792336 3905492 4021341 4146612 4281457 4420050 4563638
55994 4563638 4719876 4889000 5064297 5246604 5444236 5658008 5881056 6114191 6366136
55985 6366136 6637682 6921588 7219247 7540941 7888558 8255563 8645239 9070582 9534917
55976 9534917 10032150 10567686 11158418 11810495 12519303 13293381 14154890 15114585 16172120
55967 16172120 17344024 18664642 20157443 21836127 23738515 25928680 28464286 31400284
55959 31400284 34832784 38905782 43778349 49639034 56770575 65572032 76537853 90274898
55951 90274898 107493482 128828661 154614270 184897732 219553250 257918408 297920146
55944 297920146 335697889 366639311 387244573 396213938 394042018 382011464 361726850
55937 361726850 335206150 304827889 272906380 241299919 211327528 183836314 159246988
55930 159246988 137632337 118867875 102744950 88991709 77292067 67349235 58918626
55923 58918626 51777450 45707015 40523643 36093660 32301938 29033388 26195805 23730463
55915 23730463 21585342 19700771 18030526 16551699 15241891 14067783 13005225 12049075
55907 12049075 11192901 10417831 9709889 9069241 8492991 7966138 7478158 7032018 6628363
55898 6628363 6256316 5908069 5587686 5297261 5028208 4774110 4539140 4326167 4128760
55889 4128760 3941995 3769331 3611995 3463047 3318630 3184148 3062865 2948943 2837991
55880 2837991 2734166 2640559 2552351 2465719 2384241 2310613 2240883 2172515 2109355 2053199 1999020
55869 1999020 1943959 1892646 1848219 1806190 1762570 1720176 1681620 1643665 1603936 1565916 1532172
55858 1532172 1499641 1466687 1437940 1417098 1401378 1387758 1378032 1372851 1367205 1356873 1343522 1328914
55846 1328914 1310134 1285286 1258153 1232544 1207401 1181737 1158813 1140907 1125261 1109516 1096033
55835 1096033 1086559 1077807 1066624 1054651 1043593 1030709 1013281 993180 972986 951847 928835 906056
55823 906056 884811 862909 839116 815897 794637 772828 749260 727144 708707 691539 673796
55812 673796 658010 645976 634895 622670 612304 606743 603818 600623 598589 599827 602519 604427 607146
55799 607146 612458 618007 620956 622507 624534 625104 621643 615435 608729 600362 588462 574737 562005 549972
55785 549972 537215 524790 514222 504472 494408 485726 480016 475587 470583 466410 464602 463028 458874
55772 458874 452764 446336 438402 427292 414635 403068 392376 381337 371165 363552 357423 351046 345310
55759 345310 341575 338439 334052 329515 326600 324150 320224 315867 313230 311703 309182 305498 301467 296349
55745 296349 289493 282783 278254 274852 270570 266021 262802 260147 256397 252216 249187 246773 243740 240999
55731 240999 239980 239732 238666 237597 237961 238523 237013 233691 230230 226413 221056 214982 210011 206054 201932
55716 201932 197962 195008 192294 188889 186052 185336 185745 185549 185561 187747 191906 196595 202012 208947 216108
55701 216108 221536 225617 229814 233573 235435 236071 237170 238354 238281 237888 239348 242568 245731 248605 252349
55686 252349 256622 259930 262361 265097 267613 268186 266917 265662 265198 264860 264509 264424 263726 261375 258328 256311
55670 256311 254979 252624 249216 246338 244589 243382 242826 243469 244646 245332 246134 248254 251129 253313 255006
55655 255006 257334 259889 261428 262353 263922 265615 265875 264936 264233 263457 260898 256500 251905 247557 242335
55640 242335 235995 229477 222772 214871 206036 197886 191056 184722 178481 172718 167224 161342 155362 149936
55626 149936 144478 138112 131742 127009 123593 119849 115794 113024 111848 110894 109662 109038 109077 108542 107078
55611 107078 105850 105629 105968 106472 107172 107541 106794 105228 103711 102060 99579 96901 95417 95044 94443 93306
55595 93306 92552 92341 91794 90632 89407 88209 86857 86041 86478 87264 86956 85901 85505 85642 84992 83692 83246
55578 83246 83890 84385 84451 85117 86412 87008 86545 86222 86704 87418 88217 89763 91881 93486 94591 96485 99480
55561 99480 102233 103768 104469 104700 104133 102891 101785 100990 99836 98073 95993 93387 89959 86649 84721
55546 84721 83557 81270 77624 74417 72800 72186 72084 73001 75004 77152 78962 80925 83192 85242 87139
55531 87139 89582 92516 95205 97759 100956 104540 107491 110065 113594 118023 121602 123398 124163 124313 123082
55516 123082 120341 117393 115078 112599 109000 104490 99703 94919 90483 86804 83640 80512 77796 76094
55502 76094 74742 72599 70080 68517 67642 65844 62999 60760 59698 58452 56275 54181 52833 51435 49642
55487 49642 48510 48574 48754 48164 47328 46764 46030 45029 44565 44688 44130 42296 40280 39121 38613 38570 39473 40926
55469 40926 41200 39472 37014 35151 33616 31936 30795 30732 30910 30500 30125 30636 31572 31998 31931 31870 31789 31519
55451 31519 31292 31108 30417 29107 27922 27388 27291 27569 28469 29441 29361 28392 28151 29322 30623 30912 30763 31072
55433 31072 31613 32018 32734 33883 34436 33663 32250 31035 29867 28716 28597 30198 32666 34830 36568 38033
55417 38033 38756 38658 38790 39880 41125 41514 41358 41384 41399 41060 41025 42033 43632 44950 46027 47279 48326 48535
55399 48535 48138 47891 48046 48380 48636 48343 46959 44767 42827 41461 39800 37461 35481 34759 34708 34448 34259
55382 34259 34752 35554 35944 36061 36402 36782 36773 36537 36350 35953 35187 34558 34391 34145 33335 32424 32005 31773 31020 29491
55362 29491 27238 24441 21922 20878 21453 22442 22977 23490 24448 25342 25639 25633 25596 25232 24671 24770 25620 26077 25687
55343 25687 25649 26844 28293 28750 28530 28427 28145 27275 26653 27179 28208 28610 28587 29034 29938 30761 31602 32588 32983
55324 32983 32317 31580 31848 32547 32567 32219 32477 32989 32597 31334 30210 29429 28450 27447 27109 27175 26709 25703
55306 25703 25059 25088 25323 25591 26000 26122 25517 24898 25497 27365 29455 31188 32706 33808 33983 33498 33211 33238
55288 33238 32912 32058 31253 30808 30439 29982 29459 28594 27223 26126 26395 27938 29505 30278 30618 31223 32270
55271 32270 33481 34462 34992 35351 36023 36769 36665 35645 35152 36311 38218 39139 38797 38257 38088 37965 37742 37532
55253 37532 36952 35545 33908 33124 33139 32841 31779 30648 29952 29269 28106 26661 25519 25195 25946 27384 28428
55236 28428 28360 27764 27714 28316 28835 28949 28919 28765 28251 27659 27692 28600 30056 31683 33014 33321 32444 31540 32057
55217 32057 34035 36223 37635 38122 37711 36453 34921 33929 33718 34086 35108 36923 38983 40425 41135 41741
55201 41741 42649 43778 45004 46127 46661 46425 46037 46092 46186 45538 44224 42916 41848 40952 40602 41088 41740 41653
55183 41653 41106 41159 42085 43277 44443 45695 46568 46232 44792 43396 42845 42868 42740 41902 40186 38195 37139
55166 37139 37476 38114 37944 37603 38446 40251 41409 41235 40565 40029 39255 38053 37077 36855 37193 37839 38805 39885
55148 39885 40710 41338 41924 41930 40751 39032 38175 38509 39135 39526 40011 40588 40779 40920 42095 44274 45886 45912
55130 45912 45251 45299 46256 47593 49233 51327 53503 55151 56151 56883 57895 59799 62897 66594 69679 71495
55114 71495 72338 72612 72193 70911 69023 66969 65091 63671 62724 61782 60488 59368 59277 60083 60708 60609 60423
55097 60423 60904 61906 62686 62715 62012 61121 60782 61196 61708 61611 60998 60332 59693 59153 59389 60916 63091 64856
55079 64856 66131 67406 68402 68469 68018 68133 68881 69392 69550 70116 71060 71396 70942 70756 71440 72394 73197 74287
55061 74287 75778 76959 77592 78417 79711 80620 80642 80578 81178 81933 82104 81995 82275 82808 82993 82671 82047 81295 80750
55042 80750 80784 81036 80535 79098 77835 77755 78657 79933 81529 83400 84791 84882 83740 82120 80732 79995 79908
55025 79908 79847 79127 78007 77409 77534 77668 77542 77746 78438 78809 78392 77812 77609 77416 76969 76795 77036 76675 75015
55006 75015 73034 72166 72381 72582 72356 72282 72845 73934 75192 76111 76089 74983 73355 71731 70107 68548 67640
54989 67640 67684 68074 68148 68092 68340 68607 68311 67616 67291 67702 68477 68985 68829 68181 67829 68501 69950 71289 72311
54970 72311 73714 75760 77701 78960 79953 81133 82177 82819 83641 85188 87059 88751 90736 93781 97701
54955 97701 101702 105608 109985 115323 121729 129076 136973 145010 153452 163147 174253 185742 196616 206797
54941 206797 216187 223763 228554 230757 230859 228323 222327 213360 202958 192074 180746 169175 158078
54928 158078 147959 138772 130338 122509 115105 108348 103132 100119 98609 96927 93991 90203 86938 85450
54914 85450 85983 87556 88880 89821 91566 95068 99855 104768 109365 114142 119965 127728 137937 149953
54900 149953 162125 173228 183285 192557 200463 206139 209327 209930 207430 201672 193685 184757 175153 164609
54886 164609 153581 143053 133477 124809 117218 110826 105163 99799 95174 91838 89290 86632 84033 82363
54872 82363 81582 80729 79540 78866 79223 79947 80110 79460 78141 76217 73932 71916 70783 70691 71335 72091 72254
54855 72254 71575 70546 69832 69512 69120 68276 66987 65614 64828 65192 66363 67104 66541 65050 63487 62121 60840
54838 60840 59855 59428 59324 59227 59310 59735 60098 60092 60192 60811 61352 61113 60671 61229 62847 64455 65487 66350 67323
54819 67323 68119 68654 69286 70049 70509 70515 70371 70201 69884 69703 70283 71765 73676 75705 77923 80283 82636 85319
54801 85319 88969 93561 98276 102561 106830 111994 118688 126951 136235 145800 155447 165676 176794 188290
54787 188290 199576 210690 221454 230466 236054 238001 237307 234569 229757 223417 216689 209941 202600 194640
54773 194640 187092 180656 174801 168801 162865 157744 153880 151310 149789 148662 147271 145793 145129 145782 147471
54758 147471 149941 153371 157751 162707 168355 175559 184891 195996 208474 222700 239248 257938 277899
54745 277899 298096 317404 334668 349122 360360 367584 369480 365398 356297 344025 329901 314370
54733 314370 297662 280239 262647 245372 228891 213669 200075 188332 178384 169831 162161 155086
54721 155086 148549 142533 137127 132650 129328 126897 124830 122900 121199 119756 118551 117758 117479 117372 117025
54706 117025 116607 116572 116806 116725 116212 115839 116003 116426 116651 116570 116347 116264 116678 117629 118469 118411 117535 116681 116357 116342 116452
54685 116452 117024 118348 120127 121734 122658 122639 121837 121009 121041 122172 124058 126498 129469 132494 134775 136259
54669 136259 137886 140390 143375 146036 148384 151315 155672 161557 168364 175227 181506 186969 191553 195179
54655 195179 197956 200265 202358 204152 205826 208183 211789 216044 219911 223413 227664 233526 240991 249816
54641 249816 259950 271229 283508 297213 312989 330590 348713 366072 381954 395606 405813
54630 405813 411370 411556 406186 395906 382384 367339 351231 333598 314701 295953 278594 262868
54618 262868 248683 236131 225016 214803 205470 197660 191675 187092 183596 181322 180114 179459 179531 181171
54604 181171 184248 187065 188147 187770 187016 186192 184987 183355 181309 178438 174579 170440 166764 163315 159457
54589 159457 155202 150839 146075 140508 134659 129606 125683 122278 118762 115034 111353 108236 106173 104906
54575 104906 103345 100897 98433 97147 96817 96143 94579 92853 91666 90858 90067 89406 89097 88984 88725 88176
54559 88176 87403 86644 86345 86933 88391 90238 91883 92815 92627 91319 89571 88410 88471 89729 91845 94454
54543 94454 97131 99439 101190 102611 104194 106390 109367 113036 117329 122322 127893 133560 139068 144994
54529 144994 152108 160116 167787 174593 181399 189009 196658 202696 206358 208131 208580 207528 204422 199067
54515 199067 191972 184288 177159 170800 164367 157113 149430 142326 136173 130601 125514 121447 118719 116804
54501 116804 114897 112793 110824 109068 107061 104456 101717 99789 99076 99052 99127 99473 100567 102195 103550 104303
54485 104303 104964 106037 107410 108706 109672 110023 109525 108637 108544 110065 112836 115835 118346 120131 121179 121825
54469 121825 122750 124401 126536 128610 130304 131409 131582 130666 129033 127248 125585 124146 123114 122507 121943
54454 121943 121006 119715 118382 117187 116149 115370 115021 115164 115649 116062 115908 115132 114310 113804 112923 110661 107231
54437 107231 104000 101786 100187 98825 98136 98333 98587 98051 96953 95888 94783 93521 92924 93968 96275
54422 96275 98360 99283 99307 99135 99267 100026 101472 103290 105192 107247 109369 110942 111590 111994 113223 115482
54406 115482 118189 120973 123798 126346 128183 129569 131361 134054 137452 141221 145188 149152 153008 157009
54392 157009 161331 165520 168930 171604 174082 176420 178047 178557 178101 177003 175523 173926 172216 169954 166828
54377 166828 163292 160047 157135 154172 151189 148428 145468 141542 136793 132333 128902 126253 123943 121881
54363 121881 119865 117504 115061 113580 113590 114258 114321 113420 112045 110670 109532 108922 109067 109795 110745 111855 113294
54346 113294 114983 116586 118020 119753 122345 125863 129828 133764 137616 141560 145546 149315 152744 155852
54332 155852 158458 160268 161380 162185 162580 161878 159820 157115 154451 151555 147955 144171 141227 139111 136591
54317 136591 132674 127573 122105 116794 111840 107491 104056 101623 99888 98192 95953 93245 90727 88789
54303 88789 87073 85108 83041 81280 79817 78454 77340 76679 76175 75398 74489 73887 73594 73353 73262 73534 73898
54286 73898 74025 74272 75146 76164 76215 75044 73556 72656 72564 73228 74399 75284 75031 73854 72878 72731 73137 73951
54268 73951 75572 78065 80823 83510 86457 89732 92654 94659 95850 96298 95719 94399 93556 94016 95162
54253 95162 95848 95749 95171 94201 92840 91466 90346 89072 87203 85119 83549 82600 81996 81849 82328 82760 82077
54236 82077 80244 78505 78018 78806 80162 81448 82260 82383 82000 81657 81681 81795 81607 81353 81821 83420 85534
54219 85534 87059 87557 87626 88003 88619 88919 88878 89099 89860 90616 90744 90385 90212 90625 91510 92601 93731 94782
54201 94782 95585 95875 95359 93968 92052 90103 88277 86420 84580 83103 82135 81439 80933 81021 81983 83252 83739
54184 83739 82903 81304 80078 79942 80655 81366 81474 81103 80674 80211 79392 78155 76885 75959 75498 75617 76488 77944
54166 77944 79320 79958 79711 78838 77651 76403 75355 74717 74582 74942 75612 76214 76497 76677 77216 78238 79406
54149 79406 80318 80764 80702 80360 80278 80749 81260 80992 79975 79200 79412 80342 81270 81788 81654 80497 78275 75715
54131 75715 73785 72806 72409 72133 71674 70733 69091 67015 65279 64605 64995 65625 65451 64095 62201 60852 60675
54114 60675 61565 63053 64635 65838 66410 66533 66590 66729 66870 67003 67090 66770 65714 64300 63412 63445 64002 64623
54096 64623 65289 66035 66634 66993 67437 68218 69126 69819 70242 70481 70534 70486 70543 70653 70432 69816 69380 69644 70308 70580
54076 70580 70137 69377 68796 68430 67990 67333 66663 66224 65917 65481 65136 65632 67265 69159 70135 70183 70431 71654
54058 71654 73477 75168 76540 77788 79031 80381 82026 83861 85337 86004 86014 85993 86633 88365 90943 93316
54042 93316 94444 94429 94410 95277 96965 99035 101248 103425 105440 107684 110888 115179 119871 124510 129416 134899
54026 134899 140614 146267 152228 158822 165472 171249 175895 179823 183442 187044 190948 195197 199318 202813
54012 202813 205590 207621 208691 208967 209272 210104 210671 209647 206770 203153 200082 197929 196134 193829 190534
53997 190534 186524 182453 178587 174698 170756 167165 164097 161161 158080 155161 152730 150711 149099 148129
53983 148129 147460 145982 143165 139945 137426 135401 133083 130756 129423 129101 128680 127544 126297 125696 125809
53968 125809 126417 127438 128596 129354 129529 129575 129974 130763 131773 132970 134343 135766 137107 138269 139157 139808
53952 139808 140525 141638 143236 145279 147719 150226 152182 153389 154489 156172 158275 160283 162466 165764
53938 165764 170552 176189 181836 187171 192206 196922 201261 205066 207892 209213 208915 207407 205275 203072
53924 203072 201257 199976 198914 197712 196477 195680 195713 196823 199200 202767 206998 211268 215273 218977 222584
53909 222584 226778 232419 239471 246712 253028 258563 264062 269693 275243 280857 286585 291554 294764 296448
53895 296448 297604 298296 297656 295533 292884 290245 286981 282541 277484 272670 268161 263488 258333 252459 245575
53880 245575 237831 230050 222985 216660 210732 205079 199693 194450 189350 184646 180439 176462 172534 168866
53866 168866 165644 162616 159353 155656 151568 147344 143522 140606 138405 136077 133073 129759 126877 124730
53852 124730 123087 121550 119781 117674 115535 113874 112867 112223 111603 110823 109647 107866 105788 104209 103602
53837 103602 103645 103764 103818 104001 104377 104794 105054 104948 104352 103466 102781 102641 102970 103531 104233 105093 106071 107014 107649
53818 107649 107695 107197 106655 106534 106773 107099 107646 108748 110209 111361 111906 112155 112344 112329 112210 112718 114631 118050
53800 118050 122468 127223 131715 135591 139019 142548 146580 151150 156219 161775 167581 173228 178501 183372
53786 183372 187632 191107 194230 197725 201481 204368 205645 206024 206851 208542 210274 210997 210316 208513 206107
53771 206107 203429 200453 197075 193512 190218 187320 184466 181369 178292 175840 174385 173770 173395 172629 171329
53756 171329 169918 168789 167781 166540 165111 163684 161923 159295 156088 153423 151985 151317 150612 149765 149294
53741 149294 149542 150224 150614 150126 148960 148094 148267 149077 149488 149037 148013 146653 144996 143484 142791 142885 143064
53724 143064 143082 143365 143887 143832 142849 141764 141459 141778 142143 142498 142972 143225 142933 142491 142568 143345 144719 146731 149174
53705 149174 151204 152092 152146 152327 153274 155117 157835 161126 164335 167173 170249 174250 178816 182869 185897
53690 185897 188363 190978 194058 197428 200536 202850 204532 206481 209377 212998 216798 220637 224480 227948
53676 227948 230835 233618 236689 239559 241528 242747 243765 244460 244399 243906 243632 243230 241661 238914 236240 234401
53660 234401 232820 230888 229056 227914 226999 225356 222815 220004 217496 215539 214361 214029 214090 213921 213505 213427
53644 213427 214005 214741 214833 214080 213134 212840 213361 214002 213941 213049 211905 211074 210569 210134 209865 210293 211692 213450
53626 213450 214437 214230 213729 214249 216135 218638 221028 223240 225365 227273 229069 231331 234394 237816 241006
53611 241006 243929 246720 249170 251254 253745 257401 261787 265792 269230 272995 277525 282086 285914 289325
53597 289325 293139 297543 302098 306540 311016 315709 320608 325642 330758 335883 340959 346005 351061 356180
53583 356180 361482 367032 372538 377346 380938 383476 385703 388227 390911 393058 394213 394646 394921 395196 395303
53568 395303 395404 396030 397309 398647 399456 399828 400194 400664 401096 401467 401779 401856 401654 401509 401662 401852 401833 401981 402810
53549 402810 404119 405262 406124 407154 408467 409580 410143 410358 410562 410944 411784 413427 415779 418207 420169 421755
53533 421755 423517 426024 429528 433689 437655 440795 443407 446347 449999 454072 458399 463406 469614 477088
53519 477088 485536 494651 504253 514395 525353 537198 549510 561930 574900 589230 604881 620886
53507 620886 636708 653043 670908 690451 711049 732146 753568 775350 797677 820821 844831
53496 844831 869548 895136 922241 951243 981559 1012080 1042117 1071609 1100661 1129318 1157746
53485 1157746 1186230 1214836 1243276 1271174 1298386 1325059 1351531 1378143 1405113 1432503 1460237
53474 1460237 1488026 1515349 1541661 1566669 1590308 1612577 1633601 1653747 1673282 1691900 1708935
53463 1708935 1724170 1738116 1751346 1763800 1774934 1784278 1791626 1796829 1799666 1799905 1797401 1792193 1784560
53450 1784560 1774891 1763531 1750813 1737129 1722738 1707461 1690759 1672128 1651316 1628325 1603521
53439 1603521 1577679 1551551 1525319 1498704 1471581 1444184 1416698 1389051 1361226 1333559 1306631
53428 1306631 1281049 1257235 1235168 1214476 1195196 1178226 1164353 1152832 1141679 1129737 1117895
53417 1117895 1107927 1100601 1095308 1091146 1087876 1086047 1086536 1089772 1095146 1101444 1108097 1115745 1125335 1137098
53403 1137098 1150749 1166356 1184413 1205137 1228119 1252675 1278290 1304818 1332578 1362215 1394251
53392 1394251 1428775 1465634 1504789 1546319 1590264 1636618 1685244 1735658 1787195 1839628 1893404
53381 1893404 1949065 2006717 2066264 2127748 2191008 2255306 2319744 2383899 2447700 2510932 2573323
53370 2573323 2634884 2695622 2755002 2812161 2866572 2917924 2965414 3007838 3044620 3076325 3103859
53359 3103859 3127496 3146802 3161225 3170466 3174534 3173684 3168228 3158287 3143767 3124597 3100849 3072708
53347 3072708 3040483 3004522 2964848 2920984 2872540 2819986 2764467 2706939 2647954 2588348 2529383
53336 2529383 2471819 2415327 2359298 2303823 2249374 2195894 2142928 2090517 2039234 1989240 1940057
53325 1940057 1891570 1844649 1800278 1758430 1718383 1679970 1643959 1611094 1581228 1553596 1527603
53314 1527603 1503013 1479572 1456838 1434561 1413045 1392974 1374854 1358651 1343951 1330333 1317592
53303 1317592 1305768 1295146 1286161 1279079 1273703 1269610 1266711 1265365 1265754 1267447 1269867 1273020 1277383 1283222
53289 1283222 1290446 1299130 1309710 1322514 1337465 1354409 1373431 1394607 1417793 1442838 1469730 1498264
53277 1498264 1527862 1557917 1588034 1617716 1646279 1673601 1700583 1728176 1755948 1782138 1805192
53266 1805192 1824835 1841738 1856694 1870231 1882511 1893251 1902011 1908723 1913700 1916987 1917998 1915994
53254 1915994 1910789 1902842 1892746 1880715 1866488 1849813 1831029 1810940 1789812 1766815 1740991 1712714
53242 1712714 1683546 1654589 1625611 1596014 1565968 1536058 1506332 1476372 1446127 1416108 1386748
53231 1386748 1358072 1330088 1303148 1277695 1253734 1230680 1207769 1184764 1162299 1141344 1122138
53220 1122138 1103796 1085164 1066015 1047214 1029791 1014075 999683 986074 972949 960198 947635
53209 947635 934892 921596 907539 892629 876804 860165 843147 826291 809777 793418 777177
53198 777177 761460 746756 733145 720268 707639 694859 681736 668381 655098 642010 628870
53187 628870 615347 601398 587177 572694 557806 542622 527730 513794 500861 488207 475112
53176 475112 461729 448961 437367 426539 415787 405134 395181 386199 377892 370023 362762 356242 350197
53163 350197 344272 338301 332145 325642 318969 312697 307155 301996 296751 291566 286994 283126 279324 274900
53149 274900 269903 265136 261449 259012 257255 255489 253492 251372 249118 246630 244128 242051 240428 238770
53135 238770 236771 234710 232928 231278 229501 227888 227088 227248 227672 227438 226274 224771 223759 223469 223455 223469
53119 223469 224102 226038 228833 231171 232572 234111 236970 240827 244330 246827 248915 251393 254316 257141
53105 257141 259275 260344 260307 259551 258636 257797 256769 255088 252458 248909 244741 240322 235871 231556 227732
53090 227732 224711 222063 218587 213465 207273 201470 196972 193656 190995 188613 186156 183290 180174 177518
53076 177518 175795 174573 172992 170773 168460 166684 165524 164699 164074 163663 163227 162284 160676 158849 157338
53061 157338 156166 155018 153739 152288 150450 148184 146145 145233 145511 146192 146765 147453 148286 148562 147794 146562
53045 146562 145712 145218 144557 143866 143829 144540 145260 145396 145087 144728 144430 144018 143192 141668 139607 137803 137027 137192
53027 137192 137619 137964 138274 138260 137343 135609 133972 133099 132765 132586 132717 133269 133528 132476 130048 127371 125774
53010 125774 125700 126458 126858 126266 125295 125225 126578 128508 129821 130272 130478 130832 131061 130827 130260 129740 129540 129868
52992 129868 130963 132808 134801 135966 135651 134073 132250 131363 132017 133877 135954 137386 138109 138763 139920
52977 139920 141494 143055 144612 146733 149781 153332 156601 159307 161812 164563 167716 171307 175449 180225
52963 180225 185590 191417 197511 203510 208947 213494 217038 219498 220759 220840 220039 218819 217598 216638 215959
52948 215959 215284 214231 212680 210918 209383 208267 207378 206323 204828 202913 200767 198481 196011 193437 191020
52933 191020 188847 186637 184194 181952 180671 180511 180785 180790 180577 180636 181036 181238 180761 179699 178511 177580 177101
52916 177101 177209 177905 178898 179758 180286 180614 180884 181028 180884 180437 179876 179577 179986 181240 182770 183657 183603 183225
52898 183225 183144 183268 183414 184123 186000 188436 189988 190180 190035 190541 191428 191976 192243 192828 193885 195092 196230
52881 196230 197181 197654 197552 197346 197547 198019 198367 198733 199527 200570 201183 201109 200720 200359 200053 199867 199915 199969 199638
52862 199638 199044 198831 199449 200923 203281 206580 210340 213553 215549 216462 216752 216814 217204 218578 220978 223618
52846 223618 225789 227632 229667 232015 234562 237674 242076 247962 254560 260693 265634 269353 272145 274165
52832 274165 275341 275642 275194 273986 271654 267869 262918 257654 252896 249029 246010 243401 240433 236558 232139
52817 232139 228252 225558 223511 220850 216773 211607 206507 202586 200128 198530 196960 195063 193013 191133
52803 191133 189668 188677 187851 186644 184930 183366 182628 182395 181559 179427 176358 173243 170754 169101 168073
52788 168073 167253 166453 165858 165496 164911 163796 162617 161902 161244 159881 158066 156784 156135 155163 153563 152331
52772 152331 152161 152286 151697 150531 149350 147852 145492 142849 141167 140704 140569 140173 139887 140139 140687 141029 140918
52755 140918 140230 138796 136651 134121 131523 129008 126688 124635 122739 120862 119144 117875 117097 116551 115954
52740 115954 115109 113904 112513 111438 110877 110199 108543 106019 103801 102929 103380 104401 105279 105612 105279 104554
52724 104554 104006 103996 104360 104753 105105 105473 105679 105480 105067 105000 105460 105871 105468 104120 102399 100902 99742 98702
52706 98702 97664 96807 96520 97116 98424 99697 100250 100349 101084 103180 106280 109750 113667 118398 123490 127814
52690 127814 130829 133049 135181 137438 139821 142353 144698 146106 146116 144966 143081 140723 138350 136683 135855
52675 135855 135000 133254 130834 128567 126658 124538 121789 118644 115576 112804 110170 107261 103765 99938
52661 99938 96526 93973 92063 90622 90094 90777 91857 92000 90850 89230 87855 86536 84912 83343 82635
52646 82635 83120 84303 85325 85623 85274 84852 84856 85303 85848 86193 86285 86294 86616 87722 89702 92053 94184 96025
52628 96025 97906 99926 101765 103016 103409 102777 101114 98735 96175 93889 92138 91002 90340 89876 89492 89316
52612 89316 89398 89553 89667 89827 89908 89456 88416 87567 87677 88477 89090 89275 89574 90314 91190 91906 92569 93252 93763
52593 93763 94096 94566 95281 95920 96336 96927 98063 99476 100562 101080 101257 101401 101742 102517 103944 106041 108557
52576 108557 111081 113255 115000 116532 118030 119350 120230 120706 121068 121453 121771 122023 122406 123053 123982 125281
52560 125281 127031 128984 130636 131695 132252 132469 132470 132584 133268 134613 136254 137878 139501 141041 142046 142146
52544 142146 141611 141163 141409 142564 144428 146341 147442 147412 146952 147195 148575 150409 151542 151325 150011 148453
52528 148453 147454 147355 148127 149678 151879 154349 156511 158043 159114 160081 161034 161715 161747 160857 159107 157087 155679
52511 155679 155355 155672 155640 154662 153097 151860 151514 151745 151729 150975 149779 148798 148334 148156 147924 147600 147396 147485 147789
52492 147789 148001 147866 147545 147558 148201 149112 149684 149871 150224 151144 152428 153703 154964 156415 157983 159285 160004
52475 160004 160149 159976 159790 159819 160188 160998 162414 164515 167032 169380 171089 172142 172804 173270 173604 173900 174265
52458 174265 174634 174771 174497 173809 172749 171324 169703 168340 167691 167822 168442 169371 170714 172554 174685 176789
52442 176789 178607 179708 179483 177900 176079 175509 176579 178376 179946 181174 182250 182990 183156 182946 182633 182089
52426 182089 181157 180167 179550 179154 178535 177712 177061 176589 175921 174956 173982 173085 171961 170398 168546 166645 164896
52409 164896 163598 162970 162783 162574 162272 162205 162445 162619 162474 162234 162256 162676 163491 164657 166006 167314 168485 169410
52391 169410 169779 169509 169238 169795 171089 172088 172072 171362 170700 170491 170858 171830 173080 173985 174408 175029 176510 178674
52373 178674 180891 182869 184642 186143 187330 188551 190231 192269 194166 195702 197112 198606 200106 201521
52359 201521 203045 205032 207683 210838 214034 216827 219188 221492 224102 227093 230354 233735 236986 239856
52345 239856 242404 244990 247805 250611 253095 255232 257144 258868 260548 262568 265174 268083 270705 272678
52331 272678 274035 275111 276486 278788 282131 285817 288920 291216 293312 295878 299018 302385 305714 309087
52317 309087 312767 316905 321430 326157 330915 335575 340136 344878 350299 356706 363965 371796 380144 389035
52303 389035 398276 407683 417532 428339 440267 453130 466893 481688 497355 513510 530154 547647
52291 547647 565998 584783 603897 623757 644461 665422 686206 707092 728312 749322 769479
52280 769479 789006 808595 828316 847550 865832 883209 899822 915625 930473 944090 956089
52269 956089 966349 975211 982998 989589 994789 998752 1001582 1002831 1002011 999393 995773 991669 987354 983369
52255 983369 980194 977485 974493 971281 968691 966896 964921 962109 959369 958267 959293 961685 964730 968531
52241 968531 973457 979555 986870 995943 1007374 1020780 1034606 1047365 1058988 1070651 1083267 1096608
52229 1096608 1109957 1123056 1135982 1148497 1160159 1170909 1181010 1190404 1198679 1205673 1211575 1216289
52217 1216289 1219224 1220037 1219179 1217361 1214652 1210439 1204209 1196105 1186795 1176891 1166551 1155550 1143650 1130818
52203 1130818 1117081 1102468 1087337 1072622 1059322 1047646 1036884 1026165 1015216 1004395 994266
52192 994266 985201 977168 969857 963122 957286 952787 949545 946970 944578 942338 940341 938487 936694 935108
52178 935108 933837 932558 930686 927902 924457 920973 918021 915737 913741 911495 908820 905983 903290 900775
52164 900775 898391 896228 894266 892071 889144 885636 882385 880051 878472 877084 875676 874284 872515 869652
52150 869652 865668 861542 858118 855103 851804 848469 845971 844182 841642 837267 831693 826382 821879 817586
52136 817586 812908 807961 803263 799245 796100 793637 791270 788423 784994 781235 777349 773507 770024 767137
52122 767137 764663 762205 759557 756588 752971 748639 744457 741801 741246 742085 743279 744449 745775 747454 749725
52107 749725 753129 758178 764735 772119 779928 788558 798729 810653 823917 838191 853715 870863 889494
52094 889494 909198 930083 952757 977305 1002784 1028137 1053290 1078919 1105337 1132034 1158127
52083 1158127 1182841 1205747 1227034 1247464 1267566 1286777 1303783 1317806 1329254 1339049 1347615 1354609
52071 1354609 1359450 1362019 1362965 1363136 1362555 1360174 1354948 1346978 1337272 1326642 1315397 1303900 1292709 1282020
52057 1282020 1271525 1261022 1250760 1241046 1231910 1223332 1215497 1208668 1203104 1199108 1196778 1195621 1194877
52044 1194877 1194448 1195148 1197810 1202353 1207889 1213491 1218757 1223912 1229524 1235962 1243073 1250544 1258423 1266952
52030 1266952 1275972 1284965 1293577 1301542 1308167 1312722 1315525 1317862 1320387 1322239 1322247 1320388 1317508 1314075 1309960
52015 1309960 1305080 1299447 1292645 1284024 1273560 1261996 1249945 1237212 1223225 1207845 1191550 1174894
52003 1174894 1157948 1140273 1121431 1101443 1080622 1059032 1036451 1012885 988730 964243 939283
51992 939283 913860 888516 863651 838781 813068 786455 759763 733697 708365 683802 660311
51981 660311 637993 616380 594964 573826 553441 534022 515385 497304 479694 462493 445725
51970 445725 429763 415241 402519 391354 381250 372059 364056 357460 352041 347275 342717 338153 333444
51957 333444 328368 322663 316287 309698 303763 299147 295662 292373 288467 283940 279403 275422 272171 269493
51943 269493 267063 264669 262513 261053 260356 259794 258674 256977 255178 253549 252028 250616 249436 248463 247540
51928 247540 246610 245541 243939 241680 239476 238226 237787 237168 236087 235467 235932 236573 235928 233708 230931 228592
51912 228592 226876 225477 224042 222247 219928 217296 214720 212260 209656 206789 203946 201610 200108 199426
51898 199426 199230 199089 198766 198280 197665 196858 195835 194700 193573 192594 192015 191944 191941 191292 189890 188466 187695 187440
51880 187440 187157 186654 186065 185414 184675 183998 183511 183137 182954 183402 184646 186031 186732 186732 186609 186550 186346 186207 186769
51861 186769 188117 189535 190510 191347 192432 193476 193999 194162 194613 195682 197220 199057 201234 203817 206816
51846 206816 210252 213976 217449 219984 221328 221862 222181 222597 223044 223288 223142 222595 221712 220396 218356 215534
51830 215534 212591 210635 210321 211382 213114 215073 217027 218566 219327 219575 220002 220735 221084 220618 220005 220260
51814 220260 221442 222728 223625 224390 225228 225857 226088 226275 226745 227278 227542 227684 228012 228390 228411 228025 227548 227201
51796 227201 227048 227311 228229 229524 230457 230607 230331 230241 230446 230530 230203 229701 229448 229393 228954 227765 226331 225625 226040
51777 226040 227076 228141 229217 230497 231754 232575 233049 233739 234901 236159 237095 237904 239176 241147 243377
51762 243377 245279 246827 248537 250705 252931 254658 256036 257771 260141 262678 265029 267621 271078 275330
51748 275330 279852 284626 290345 297629 306450 316403 327214 338723 350421 361172 369580 374851 377295
51735 377295 377789 376782 374179 370269 366176 362980 360749 358910 357286 356208 355750 355479 355042 354498 353952 353240
51719 353240 352197 350955 349831 349081 348811 348930 349088 348827 347849 346098 343638 340602 337164 333435 329494 325644
51703 325644 322423 320056 318108 315956 313448 310776 307866 304397 300361 296106 291823 287516 283606 281035
51689 281035 280369 281118 282283 283414 284848 286989 289707 292556 295379 298456 302003 305693 308897 311329 313140
51674 313140 314318 314415 313184 311210 309532 308828 309251 310760 313090 315585 317678 319590 322055 325241 328452
51659 328452 331001 332905 334510 335909 337099 338273 339451 339948 338634 334815 328717 321160 312914 304393
51645 304393 295809 287510 280023 273696 268354 263455 258577 253683 249010 244886 241599 239171 237251 235400
51631 235400 233476 231562 229624 227523 225390 223679 222689 222220 221812 221188 220403 219698 219265 219069 218847 218338 217489
51614 217489 216433 215346 214413 213738 213176 212432 211492 210767 210533 210515 210281 209812 209336 208824 208156 207567 207412 207596
51596 207596 207857 208549 210431 213559 216996 219902 222375 225000 228084 231601 235391 239069 242170 244803 247845
51581 247845 252080 257412 263196 269020 274736 280091 284838 289038 292733 295398 296248 295216 293189 291063
51567 291063 288849 285959 282241 278398 275325 273219 271548 269826 268125 266762 265832 265364 265672 267124 269590
51552 269590 272490 275388 278197 280913 283663 287013 291580 297087 302342 306534 310079 313773 317473 320240
51538 320240 321616 322187 322767 323492 323957 323988 323956 324264 324770 324950 324660 324461 324992 326254 327820 329538 331551 333709
51520 333709 335524 336829 338055 339645 341546 343319 344364 343963 341720 338193 334607 331608 328697 325147
51506 325147 320947 316459 311670 306402 300948 295898 291510 287716 284584 282271 280634 279323 278246 277517
51492 277517 277037 276486 275703 274742 273652 272541 271785 271836 272795 274385 276245 277975 279122 279527 279640 280170 281416
51475 281416 283216 285449 288225 291561 295154 298541 301414 303946 306919 311244 317071 323606 330047 336359
51461 336359 342784 349076 354821 360166 365484 370549 374801 378340 381738 384865 386833 387344 387198 387051 386545
51446 386545 385284 383921 383480 384027 384823 385504 386330 387438 388539 389393 389959 390063 389493 388513 387681 386938 385370
51429 385370 382186 377597 372399 366997 361211 354890 348280 341767 335561 329734 324442 319919 316229 313031
51415 313031 309678 305687 301196 296889 293464 291191 289906 289248 288857 288582 288697 289784 292172 295568 299381
51400 299381 303298 307298 311205 314611 317314 319492 321345 322784 323610 323719 322918 320836 317299 312638 307347
51385 307347 301589 295329 288733 282053 275174 267754 259919 252407 245858 240203 234936 229789 224995 220984
51371 220984 217923 215463 212942 210030 207138 204921 203324 201396 198263 194100 189932 186609 184093 181687
51357 181687 178791 175458 172217 169424 166947 164594 162602 161315 160555 159742 158632 157460 156345 155182 154325
51342 154325 154663 156467 158598 159546 159094 158367 158346 158920 159476 159817 160148 160552 160969 161677 163321 166168 169486
51325 169486 172015 173192 173687 174636 176633 179723 183911 189036 194324 198876 202771 206981 211928 216804 220692
51310 220692 223693 226322 228412 229456 229667 229717 229526 228187 225280 221482 217544 213354 208452 203009 197711
51295 197711 192912 188470 184386 181075 178752 176844 174439 171312 168194 165882 164335 162927 161357 159824
51281 159824 158406 156821 154966 153179 151632 149927 147692 145290 143489 142637 142510 142762 143114 143304 143280 143329
51265 143329 143589 143580 142677 141016 139561 139246 140305 142236 144106 144991 144656 143777 143212 143174 143456 144160 145547 147261
51247 147261 148471 148941 149297 149971 150509 150340 149703 149243 148979 148306 146992 145604 144753 144233 143259 141517 139659
51230 139659 138607 138597 139144 139830 140636 141495 142007 141929 141566 141359 141382 141536 141867 142303 142504 142452 142767 143807 144849
51211 144849 144974 144540 144774 145949 146971 147042 146816 147426 149028 150886 152347 153237 153562 153370 152833 152209 151821
51194 151821 152023 152922 154071 154818 154970 154788 154427 153934 153667 154029 154737 155083 155065 155361 156003 156099 155366 154930 155848
51175 155848 157659 159282 160577 161922 162848 162424 160852 159468 159047 159089 158937 158652 158452 158088 157264 156174 155223
51158 155223 154531 153892 152950 151342 149101 146927 145549 144731 143490 141435 139288 137774 136677 135463 134320
51143 134320 133930 134488 135524 136573 137550 138512 139490 140524 141503 141985 141607 140798 140762 142528 146029 150125 153410
51126 153410 155054 155209 154767 154657 155194 156004 156420 155950 154527 152613 150997 150232 150130 149974 149265 148104 146852
51109 146852 145702 144749 144149 143899 143642 143049 142325 141985 142100 142185 141922 141655 141950 142945 144348 145885 147490 149168
51091 149168 150992 153079 155382 157552 159236 160433 161373 162151 162708 163097 163436 163666 163637 163456 163467 163833 164319
51074 164319 164541 164248 163452 162506 161983 162155 162619 162774 162672 162986 164097 165655 167237 168941 170940 172803 173782
51057 173782 173684 173091 172674 172626 172874 173621 175421 178658 182990 187437 191164 194122 196869 199811 202805 205457
51041 205457 207560 209183 210537 211849 213247 214654 215851 216640 216870 216471 215674 215021 214800 214552 213521 211593
51025 211593 209421 207650 206434 205710 205407 205238 204838 204267 203892 203618 202887 201691 200874 200985 201516 201895 202573
51008 202573 204276 206706 208920 210773 212984 215829 218796 221622 224751 228358 231783 234441 236748 239577
50994 239577 243231 247431 251973 256893 262189 267861 274086 280941 288079 295093 302185 310113 319405 329888
50980 329888 341013 352401 364098 376653 391067 408347 428760 451607 476029 502083 530889
50969 530889 563658 600729 641629 685912 733767 785835 842640 904185 969964 1039197 1111117
50958 1111117 1185036 1260204 1335740 1410778 1484478 1555641 1622430 1682886 1735867 1781267 1819286
50947 1819286 1849843 1872818 1888421 1896989 1898714 1894002 1883989 1870402 1854948 1839006 1823596 1809191
50935 1809191 1795640 1782644 1770230 1758309 1745871 1731251 1713413 1692534 1669037 1642422 1611466
50924 1611466 1575366 1534271 1488811 1439527 1386841 1331250 1273349 1213782 1153385 1093302 1034823
50913 1034823 979033 926677 878280 834115 793930 756913 722327 690275 661579 636738 615228
50902 615228 595956 578253 562208 548246 536709 527763 521319 516841 513436 510342 507344 504757 503088
50889 503088 502689 503486 504943 506356 507341 508088 509172 511140 514216 518270 522962 527988 533268 538938 545168
50874 545168 551954 559137 566655 574761 583942 594510 606321 618948 632126 646054 661375 678925
50862 678925 699296 722401 747592 774505 803850 837191 875928 920716 971759 1029296 1093718
50851 1093718 1165526 1245426 1334270 1432746 1541214 1659812 1788459 1926759 2074197 2230402
50841 2230402 2394727 2565390 2739398 2913392 3084114 3247980 3400945 3539353 3660546
50832 3660546 3762285 3842287 3899099 3933222 3946686 3941813 3921022 3887576 3845496 3798537 3749797
50821 3749797 3702323 3659225 3622695 3593240 3570022 3551461 3535317 3518760 3498927 3473389 3439994
50810 3439994 3396532 3340950 3271849 3188773 3092162 2983130 2863230 2734460 2599537 2461871
50800 2461871 2324768 2190571 2060686 1936197 1818114 1707253 1604510 1511265 1428851 1357422
50790 1357422 1295812 1242725 1197683 1160710 1131582 1109612 1093747 1082735 1075619 1072277 1072997 1077253
50778 1077253 1083410 1089898 1096063 1101516 1105324 1106586 1105377 1102345 1097590 1090623 1081322 1070219 1057868
50765 1057868 1044617 1031033 1017736 1004480 990049 973639 956047 939046 923769 910155 897817
50754 897817 886954 878226 872102 868639 867846 869992 875481 884495 896862 912226 930255 950775 973832
50741 973832 999683 1028578 1060428 1094759 1131139 1169731 1211410 1257372 1308623 1365840 1429637
50730 1429637 1500811 1580039 1667182 1760999 1859759 1962079 2066935 2172948 2278014 2379769
50720 2379769 2476116 2565037 2644122 2710689 2762458 2798012 2816671 2818292 2803439 2773763 2732016
50709 2732016 2681514 2625508 2566920 2508470 2452705 2401727 2357037 2319667 2290182 2268234 2252205
50698 2252205 2239618 2227956 2214985 2198517 2176409 2146978 2109229 2062671 2007297 1943887 1873982
50687 1873982 1799328 1721487 1642108 1563260 1487111 1415281 1348565 1287077 1230641 1179415 1134451
50676 1134451 1097359 1069052 1048899 1035398 1027592 1025537 1029647 1040141 1057179 1080892 1110858 1145730
50664 1145730 1183770 1223658 1264562 1305551 1345353 1382800 1417236 1448348 1475886 1499878 1520963
50653 1520963 1540077 1557636 1573297 1586619 1597765 1607399 1616236 1624930 1634212 1644707 1656692 1670334
50641 1670334 1686110 1704679 1726264 1750550 1777267 1806610 1838832 1873556 1909698 1946064 1981986
50630 1981986 2017373 2052181 2085866 2117394 2145706 2169932 2189275 2203180 2211924 2216627 2218253 2216888
50618 2216888 2212489 2206002 2199150 2193347 2189558 2188980 2192842 2201320 2213433 2228319 2245874 2265770 2286626
50605 2286626 2306669 2324617 2339462 2350009 2355271 2354785 2347886 2333121 2309133 2275825 2233995 2184141
50593 2184141 2126417 2061598 1991253 1917011 1840315 1762763 1685906 1610520 1536761 1465122 1396632
50582 1396632 1331961 1271085 1214114 1161825 1114842 1072735 1034418 999270 967499 939631 916013
50571 916013 896680 881385 869665 861016 855023 851409 850131 851459 855683 862671 871941 883238 896848
50558 896848 913109 931878 952740 975697 1001430 1030800 1064142 1101068 1140926 1183370 1228384
50547 1228384 1275798 1325074 1375706 1427526 1480231 1532750 1583558 1631630 1676804 1719312 1759474
50536 1759474 1797997 1836023 1874503 1913736 1953835 1995395 2039343 2086259 2136150 2188857 2244350
50525 2244350 2302595 2363510 2427270 2494532 2566024 2641808 2721036 2802505 2885281 2968549 3050995
50514 3050995 3130775 3206240 3276305 3339756 3394512 3438006 3468238 3484090 3484844 3470022 3439817 3395229
50502 3395229 3337713 3269133 3192098 3109733 3024789 2939443 2856209 2778487 2709668 2651930 2606333
50491 2606333 2573628 2554321 2548082 2553773 2570040 2595267 2626782 2660660 2692695 2719316 2737420 2743802
50479 2743802 2735370 2710065 2667496 2608756 2535797 2450922 2356592 2255458 2150364 2044099 1938954
50468 1938954 1836425 1737306 1642145 1551755 1467303 1389819 1319513 1255747 1197832 1145695 1099587
50457 1099587 1059363 1024493 994715 970141 950482 934626 921446 910912 904006 901509 903138 907880
50445 907880 914878 923840 934808 947785 962607 979094 997254 1017317 1039550 1063989 1090343 1118122
50433 1118122 1146923 1176681 1207603 1239760 1272745 1305906 1338939 1371990 1405017 1437340 1468112
50422 1468112 1497085 1524596 1550898 1575902 1599517 1621855 1643103 1663589 1684070 1705423 1727861
50411 1727861 1750978 1774970 1801353 1831814 1866471 1903745 1941840 1979830 2017429 2054422 2090633
50400 2090633 2125932 2159841 2191340 2219357 2243225 2262324 2275440 2280935 2277632 2265368 2244524 2215175
50388 2215175 2176837 2129069 2072232 2007705 1937455 1863511 1787813 1712267 1638731 1568920 1504393
50377 1504393 1446481 1396113 1353780 1319779 1294453 1278047 1270442 1271077 1278902 1292175 1308458 1325253
50365 1325253 1340679 1353447 1362345 1366161 1364073 1355739 1340956 1319650 1292310 1260145 1224610 1186958
50353 1186958 1148191 1109115 1070310 1032280 995712 961259 929057 898807 870460 844461 821128
50342 821128 800176 781100 763703 748005 733879 721088 709590 699630 691686 686352 683928 683994 685731
50329 685731 688775 693399 699732 707354 715937 725758 737097 749585 762735 776811 792526 810024 828685
50316 828685 847859 867299 886954 906872 927283 948387 970047 992061 1014644 1038151 1062306
50305 1062306 1086114 1108658 1129651 1149202 1167358 1183985 1198782 1211323 1221299 1228753 1233963 1237182
50293 1237182 1238611 1238320 1235976 1231011 1223522 1214706 1205715 1196165 1184423 1169357 1151178 1130624 1108186
50280 1108186 1084395 1060052 1035641 1010994 986058 961556 938401 916740 896085 876134 856940
50269 856940 838407 820203 802254 784955 768828 754272 741681 731363 723106 716016 709185 702617
50257 702617 697369 694633 694679 696749 699873 703589 707772 712099 716036 719405 722634 726231 730143 733763 736600
50242 736600 738795 740873 742961 744438 744514 743078 740691 737752 734070 729386 723929 718172 712354 706531 700818
50227 700818 695213 689474 683635 678386 674472 671794 669598 667400 665262 663360 661947 661638 663032 665971
50213 665971 669711 673822 678249 682567 686076 688977 692544 697619 703569 709232 714227 718627 721957 723478
50199 723478 723266 722179 720737 718680 715641 711615 706691 700894 694525 688221 682383 676843 671308 665826
50185 665826 660570 655372 649825 643806 637582 631382 625062 618350 611284 604164 597084 589793 582191 574839
50171 574839 568733 564529 562083 560690 559692 558991 559132 560722 563516 566174 567223 566202 563626 559955 555039
50156 555039 548606 540865 532432 523940 515839 508323 501329 494802 488967 484057 479837 475825 472090 469276
50142 469276 467580 466138 463877 460705 457472 454958 453248 452058 451222 450719 450445 450214 450074 450513 452104 454794
50126 454794 457795 460505 463344 467302 472777 479302 486350 493732 501086 507586 512631 516499 520104 524332
50112 524332 529685 536104 542854 549013 554326 559295 564282 568999 573130 576882 580469 583567 585804 587486
50098 587486 589193 590865 591920 592217 592445 593448 595518 598414 601877 606036 611300 617723 624558 630793 636268
50083 636268 641888 648545 656316 664866 674074 683750 693221 701860 709866 718050 727049 737131 748503 761228
50069 761228 774989 789349 804111 819084 833780 847848 861608 875622 889864 903811 917254
50058 917254 930520 943936 957538 971199 984595 997108 1008261 1018237 1027592 1036498 1044709 1052142
50046 1052142 1058950 1065019 1069837 1072943 1074098 1073116 1070035 1065534 1060679 1056079 1051606 1047013 1042405 1037992
50032 1037992 1033720 1029445 1025384 1022294 1021204 1022873 1027470 1034978 1045949 1061416 1081846 1106648 1135131
50019 1135131 1167425 1203815 1243539 1284942 1326532 1367101 1405026 1438547 1466977 1490957 1511335
50008 1511335 1528390 1542314 1553831 1564007 1573834 1583996 1594334 1603346 1608772 1608977 1603361 1591344
49996 1591344 1571682 1543274 1506269 1462032 1412350 1358832 1302753 1245145 1187202 1130622 1077162
49985 1077162 1027703 982026 939525 899853 862968 829102 798741 772101 748508 726840 706721
49974 706721 688735 673306 659940 647829 636657 626530 617564 609872 603543 598421 594190 590677 587631
49961 587631 584277 579865 574755 570117 566254 562047 556477 549883 543160 536536 529864 523500 518001 513323
49947 513323 509027 505053 501690 498992 496745 494722 492603 490015 487212 485284 485131 486522 488612 490914
49933 490914 493210 495112 496560 498414 501697 506435 511925 517882 524550 531963 539975 548911 559275 570868
49919 570868 582917 595120 607830 621326 635770 651841 670444 691629 714668 739437 766838
49908 766838 797651 831946 870113 913574 963684 1020346 1082205 1147674 1215190 1282961 1349190
49897 1349190 1412487 1471769 1526128 1575212 1619490 1659771 1696758 1731322 1764685 1797654 1829879
49886 1829879 1860292 1887941 1911736 1929717 1939502 1939668 1930137 1911091 1882196 1843356 1795773 1741661
49874 1741661 1682964 1620720 1555663 1488986 1422195 1356306 1291558 1227974 1166062 1106751 1050824
49863 1050824 998645 950350 905969 865321 828113 794292 764036 737268 713470 692135 673044
49852 673044 655865 639809 624179 609091 595218 582887 571827 561730 552485 543799 535147 526385
49840 526385 518019 510434 503162 495382 487036 478994 472076 466232 460807 455287 449613 443965 438530 433476
49826 433476 429007 425322 422421 419963 417490 414988 413175 412832 413789 414872 415102 414727 414764 415747 417351 419199
49810 419199 421546 424912 429307 434120 438657 442532 445640 448077 450252 452892 456599 461302 466362 471400
49796 471400 476867 483555 491632 500621 510357 521433 534330 548624 563679 579952 598871 621422
49784 621422 647451 676543 708946 745265 785681 829819 877079 926590 976899 1025975 1071587
49773 1071587 1111778 1145400 1172476 1193886 1210581 1223444 1233920 1244092 1255467 1267864 1279919
49762 1279919 1290403 1298521 1303110 1302360 1294615 1279126 1255802 1224609 1185576 1139470 1088255 1034688
49750 1034688 981198 929082 878841 831152 787093 747332 711622 679517 651177 627005 606717
49739 606717 589291 573774 559728 547105 536212 527625 521530 517150 513342 509778 506945 505050 503612
49726 503612 502312 501473 501305 501303 500878 500104 499296 498204 496273 493512 490553 487920 485714 483986 482888 482346
49710 482346 481965 481519 481259 481488 481947 481839 480527 478157 475593 473770 473105 473487 474660 476434 478512 480301
49694 480301 481150 480932 480394 480779 482805 485906 488697 490395 491562 493225 495558 497858 499672 501293 503103
49679 503103 505039 506965 509016 511198 513030 514024 514224 513951 513370 512680 512391 512785 513367 513507 513484 514202 515799
49662 515799 517314 517970 518172 518837 520227 521870 523264 524110 524191 523643 523250 523845 525303 526550 526727 525977 524990
49645 524990 524174 523499 522814 521987 520889 519561 518293 517337 516664 516219 516265 517141 518731 520477 521948 523180 524393
49628 524393 525578 526449 526702 526290 525628 525440 526230 527867 529843 531795 533580 535061 536269 537687 539839 542528
49612 542528 545090 547461 550414 554399 558835 563027 567198 571978 577356 582846 588403 594423 601081 608426
49598 608426 616945 627075 638137 648736 658509 668663 680366 693342 706531 719475 732442 745677
49586 745677 759357 774106 790843 809983 831100 853355 876061 899027 922748 948176 975994
49575 975994 1006071 1037709 1070311 1103639 1137739 1172871 1209319 1246978 1285345 1324235 1364315
49564 1364315 1406492 1450906 1496879 1543706 1590992 1638304 1685173 1731655 1778421 1825854 1873196
49553 1873196 1918866 1961552 2000886 2037108 2070262 2099697 2124347 2143489 2157225 2166251 2171241 2172481
49541 2172481 2169893 2163240 2152465 2138075 2121237 2103299 2085151 2067033 2048764 2030056 2010845 1991670
49529 1991670 1973678 1958028 1945310 1935676 1929283 1926266 1926509 1929927 1936852 1947533 1961228 1976515 1992828
49516 1992828 2011211 2033159 2059083 2088257 2119750 2152785 2186468 2219948 2252888 2285246 2316491
49505 2316491 2345503 2371370 2393773 2412373 2426310 2434744 2437510 2434740 2426070 2410846 2389185 2362262
49493 2362262 2331209 2296056 2256099 2211179 2162202 2110414 2056526 2000809 1943822 1886623 1830062
49482 1830062 1774084 1718047 1661837 1606392 1552978 1502148 1453757 1407762 1364427 1323627 1284558
49471 1284558 1246608 1210159 1175977 1143995 1113415 1084007 1056558 1031666 1008722 986590 964992
49460 964992 944656 926315 910129 895944 883413 871683 859648 847013 834829 824538 816517 809893
49448 809893 803681 797739 792499 788092 784092 780107 776268 772882 769718 766075 761689 757267 753784 751450
49434 751450 749827 748878 749294 751523 754958 758555 762009 765954 771151 778045 787023 798571 812960 830138
49420 830138 849999 872262 895758 918238 937401 952061 962111 967751 969361 968034 965466 963008
49408 963008 961163 960172 960585 962887 966947 972386 979282 987998 998384 1009714 1021521 1034017 1047476
49395 1047476 1061520 1075354 1088466 1100830 1112569 1123648 1133865 1142987 1150989 1158234 1165285 1172356
49383 1172356 1179145 1185410 1191522 1198127 1205408 1213015 1220710 1228654 1236965 1245414 1253878 1262844 1273124 1285078
49369 1285078 1298312 1312155 1326349 1341334 1357929 1376629 1397081 1418354 1439852 1461850 1485020
49358 1485020 1509640 1535553 1562742 1591508 1622030 1654104 1687477 1722108 1757942 1794734 1832389
49347 1832389 1871195 1911493 1953362 1996980 2042971 2091791 2142817 2194746 2247122 2300966 2357639
49336 2357639 2417537 2480239 2545400 2612821 2681863 2751639 2821982 2893680 2967371 3042515 3117803
49325 3117803 3192377 3266282 3339832 3412931 3485127 3555935 3624721 3690339 3751337 3806751 3856520
49314 3856520 3900865 3939414 3971295 3996027 4013925 4025553 4031197 4031061 4025571 4015070 3999610 3979505
49302 3979505 3955895 3930247 3903407 3875605 3847327 3819634 3793562 3769714 3748508 3730263 3714874
49291 3714874 3701951 3691590 3684569 3681445 3681947 3685623 3692661 3703574 3718397 3736777 3758566 3783728
49279 3783728 3811740 3841778 3873510 3907108 3942299 3977917 4012616 4045542 4075961 4102673 4124311
49268 4124311 4140098 4149936 4153788 4151350 4142367 4126955 4105399 4077701 4043508 4002554 3955185 3902407
49256 3902407 3845447 3785300 3722700 3658307 3592714 3526274 3459203 3392012 3325653 3261083 3198709
49245 3198709 3138398 3079984 3023649 2969844 2918967 2871191 2826517 2784873 2746117 2709980 2676140
49234 2676140 2644464 2615077 2588025 2562862 2538764 2515213 2492417 2470898 2450755 2431557 2412950
49223 2412950 2395055 2378189 2362391 2347435 2333196 2319809 2307535 2296619 2287151 2278827 2270853 2262373
49211 2262373 2253079 2243285 2233349 2223286 2213050 2202893 2193229 2184242 2175865 2168034 2160745 2153927 2147464
49198 2147464 2141385 2135895 2131241 2127662 2125306 2124020 2123356 2123058 2123515 2125443 2129119 2134095 2139668 2145388 2151129
49183 2151129 2156975 2163137 2169771 2176806 2184078 2191686 2200026 2209521 2220537 2233475 2248554 2265514 2283876
49170 2283876 2303578 2324888 2347596 2370777 2393684 2416460 2439647 2463420 2487728 2512852 2539214
49159 2539214 2566760 2595074 2624116 2654374 2686252 2719700 2754503 2790569 2827783 2865861 2904563
49148 2904563 2943914 2984150 3025591 3068476 3112616 3157133 3200787 3242735 3282818 3321079 3357263
49137 3357263 3391009 3422390 3452011 3480543 3508205 3534674 3559457 3582411 3604023 3625174 3646518
49126 3646518 3668010 3689050 3709141 3728329 3746936 3764881 3781586 3796650 3810362 3823273 3835471
49115 3835471 3846691 3856983 3866753 3876145 3885021 3893666 3902788 3912465 3921810 3930301 3938827 3948604 3959444
49102 3959444 3970112 3980278 3991086 4003605 4017600 4032185 4046800 4060993 4073946 4085182 4095453
49091 4095453 4106173 4117907 4129952 4141413 4152148 4162485 4172597 4182627 4193160 4204953 4218022
49080 4218022 4231350 4243822 4255344 4266737 4278675 4291117 4303813 4316815 4330163 4343446 4356137
49069 4356137 4368075 4379191 4389039 4397152 4403730 4409252 4413424 4415176 4413959 4410365 4405215 4398606 4390232
49056 4390232 4379976 4367607 4352388 4333815 4312578 4290046 4266778 4242225 4215984 4188676 4161232
49045 4161232 4133833 4106070 4077833 4049511 4021357 3993225 3965173 3937934 3912418 3888849 3866730
49034 3866730 3845678 3825974 3808137 3792264 3778086 3765560 3755064 3746984 3741295 3737624 3735563 3734839
49022 3734839 3735349 3737120 3740154 3744317 3749439 3755536 3762819 3771478 3781518 3792741 3804824 3817489 3830709
49009 3830709 3844580 3858842 3872722 3885543 3897254 3908002 3917401 3924808 3930269 3934484 3937666 3939059
48997 3939059 3937911 3934317 3928658 3920770 3910361 3897906 3884337 3869891 3853973 3836195 3816911 3796518
48985 3796518 3774861 3751753 3727566 3702749 3676969 3649336 3619522 3588197 3556235 3523870 3490870
48974 3490870 3457183 3423016 3388441 3353401 3318163 3283373 3249490 3216439 3184017 3152380 3121926
48963 3121926 3092892 3065280 3039068 3014306 2991242 2970454 2952515 2937213 2923404 2910147 2897775
48952 2897775 2887405 2879621 2874196 2870936 2870030 2871538 2875163 2880727 2888260 2897484 2907831 2919216 2932180
48939 2932180 2946984 2963121 2980089 2998020 3017124 3037175 3058167 3080914 3106194 3133628 3162163
48928 3162163 3191473 3222102 3254309 3287551 3321199 3355116 3389347 3423839 3458740 3494535 3531619
48917 3531619 3570051 3609873 3651282 3694172 3737835 3781577 3825644 3871220 3919402 3970294 4023201
48906 4023201 4077589 4133607 4191637 4251628 4313201 4376147 4440316 4505127 4569919 4635033 4701822
48895 4701822 4771030 4841554 4911365 4979300 5045494 5110435 5174370 5237424 5299455 5359685 5417093
48884 5417093 5471242 5522263 5569959 5613564 5652459 5686563 5715786 5739646 5757747 5770228 5777452
48873 5777452 5779562 5776606 5768749 5756066 5738339 5715377 5687425 5655070 5618865 5579158 5536159 5489979
48861 5489979 5440693 5388480 5333731 5277047 5219191 5160838 5102177 5042848 4982475 4921133 4859086
48850 4859086 4796352 4732994 4669696 4607546 4547306 4489259 4433662 4380631 4329609 4279623 4230391
48839 4230391 4182713 4137534 4095095 4055178 4017757 3983044 3951254 3922498 3896648 3873231 3851913
48828 3851913 3833088 3817414 3804621 3793495 3783381 3775008 3769388 3766536 3765875 3767298 3771147 3777533 3786378
48815 3786378 3797784 3811675 3827382 3844309 3862850 3883873 3907424 3932647 3958923 3986403 4015404
48804 4015404 4046020 4078460 4113009 4149351 4186496 4223702 4261112 4299278 4338396 4378222 4418339
48793 4418339 4458300 4497739 4536527 4574572 4611515 4647014 4681451 4715842 4750844 4786190 4821264
48782 4821264 4855856 4890168 4924476 4958995 4993684 5027968 5061126 5093239 5125286 5157882 5190389
48771 5190389 5221614 5250927 5278080 5302493 5323581 5341578 5357012 5369291 5376670 5377971 5373585 5364383
48759 5364383 5350314 5330705 5305446 5275075 5239898 5199720 5154534 5104913 5051554 4994861 4935174
48748 4935174 4873076 4809202 4743903 4677361 4609997 4542661 4476374 4411822 4349064 4287816 4228214
48737 4228214 4171197 4117949 4069019 4024283 3983685 3947587 3916280 3889640 3867554 3850242 3837737
48726 3837737 3829317 3823973 3821305 3821499 3824497 3829714 3836611 3845091 3855195 3866821 3879892 3894396 3910076
48713 3910076 3926477 3943578 3961987 3982119 4003357 4024436 4044609 4064062 4083224 4101928 4119337
48702 4119337 4134603 4147657 4159434 4171228 4183662 4196361 4208764 4221027 4233915 4248027 4263582
48691 4263582 4280886 4300515 4322793 4347507 4374428 4403901 4436604 4472878 4512686 4556208 4603997
48680 4603997 4656318 4712713 4772600 4836137 4904022 4976378 5052282 5130627 5211021 5293459 5377395
48669 5377395 5461657 5545141 5626971 5705919 5780324 5848993 5911720 5968497 6018447 6059973 6091784
$$ [...]
##END NTUPLES=NMR SPECTRUM
##END=
