
##TITLE=AC1168_Tolima-ibague-TPAAH12002_7165251_EIQV43ZHFW
##JCAMPDX= 6.0         $$ Bruker NMR JCAMP-DX V2.0
##DATA TYPE= NMR SPECTRUM
##DATA CLASS= NTUPLES
##ORIGIN= BRUKER
##OWNER= Administrator
$$ 1.72 TOPSPIN		Version 2.1
$$ 2012-12-01 18:16:33.410 -0500  Administrator@X
$$ Compression mode = diff/dup
##.OBSERVE FREQUENCY= 400.02188249412
##.OBSERVE NUCLEUS= ^1H
##.ACQUISITION MODE= SIMULTANEOUS (DQD)
##.ACQUISITION SCHEME= undefined
##.AVERAGES= 64
##.DIGITISER RES= 22
##SPECTROMETER/DATA SYSTEM= spect
##.PULSE SEQUENCE= noesygpps1d.comp
##.SOLVENT NAME= COFFEE_meoh
##.SHIFT REFERENCE= INTERNAL, COFFEE_meoh, 1, 14.96106
##AUDIT TRAIL= $$ (NUMBER, WHEN, WHO, WHERE, PROCESS, VERSION, WHAT)
$$ ##TITLE= Audit trail, TOPSPIN		Version 2.1
$$ ##JCAMPDX= 5.01
$$ ##ORIGIN= Bruker BioSpin GmbH
$$ ##OWNER= Administrator
$$ $$ E:\/data/COFFEE/nmr/AC1168_Tolima-ibague-TPAAH12002_7165251_EIQV43ZHFW/12/pdata/1/auditp.txt
$$ ##AUDIT TRAIL=  $$ (NUMBER, WHEN, WHO, WHERE, PROCESS, VERSION, WHAT)
(   1,<2012-12-01 18:16:27.512 -0500>,<Administrator>,<X>,<go>,<TOPSPIN 2.1>,
      <created by zg
	started at 2012-12-01 18:04:58.714 -0500,
	POWCHK enabled, PULCHK disabled,
       configuration hash MD5:
       86 BA 57 50 F2 9D 5C 9B 26 00 A9 28 5F 66 2E 89
       data hash MD5: 64K
       34 9C 44 5D 48 9F 31 E3 C5 B1 B1 B5 28 5C F9 05>)
(   2,<2012-12-01 18:16:30.558 -0500>,<Administrator>,<X>,<proc1d>,<TOPSPIN 2.1>,
      <Start of raw data processing
       efp LB = 0.3 FT_mod = 6 PKNL = 1 PHC0 = 0 PHC1 = 0 SI = 128K 
       data hash MD5: 128K
       10 E5 5E 7F B7 A0 89 A4 3F E3 92 D8 14 42 36 B9>)
(   3,<2012-12-01 18:16:31.599 -0500>,<Administrator>,<X>,<proc1d>,<TOPSPIN 2.1>,
      <pk PHC0 = -81.29333 PHC1 = 0 
       data hash MD5: 128K
       BE 57 58 F7 04 FE EC C9 AD 3C F8 CE 60 86 73 FF>)
(   4,<2012-12-01 18:16:32.323 -0500>,<Administrator>,<X>,<proc1d>,<TOPSPIN 2.1>,
      <abs ABSG = 1 
       data hash MD5: 128K
       09 6B 7A 7C F9 B1 25 DE 1D F5 EB 16 A4 3D 3A 7D>)
(   5,<2012-12-01 18:16:32.504 -0500>,<Administrator>,<X>,<proc1d>,<TOPSPIN 2.1>,
      <abs ABSG = 2 
       data hash MD5: 128K
       01 12 07 0B DE 21 33 96 08 2A F5 67 73 18 B1 6F>)
(   6,<2012-12-01 18:16:32.655 -0500>,<Administrator>,<X>,<proc1d>,<TOPSPIN 2.1>,
      <abs ABSG = 3 
       data hash MD5: 128K
       1E 57 9C D1 5D C6 E6 36 D8 18 C5 6A 79 B5 2D BC>)
(   7,<2012-12-01 18:16:32.821 -0500>,<Administrator>,<X>,<proc1d>,<TOPSPIN 2.1>,
      <abs ABSG = 4 
       data hash MD5: 128K
       9D FD 85 F6 39 A1 A3 9A FE 37 5B CE 5F 84 D3 1B>)
(   8,<2012-12-01 18:16:33.012 -0500>,<Administrator>,<X>,<proc1d>,<TOPSPIN 2.1>,
      <abs ABSG = 5 
       data hash MD5: 128K
       DE 52 FE 5D 25 71 54 B8 17 34 70 01 76 72 B6 D7>)
$$ ##END=
$$ 
$$ $$ hash MD5
$$ $$ 7F 62 0E 22 C6 97 E9 5C 37 3D 7D 9F 59 B1 00 5B
##$RELAX= 
##$RELAX= 
##$RELAX= 
##$RELAX= 
##$RELAX= 
##$RELAX= 
##$RELAX= 
##$RELAX= 
$$ Bruker specific parameters
$$ --------------------------
##$DU= <E:\>
$$ [...]
##$TP07= 0
##$TPNAME0= <>
##$TPNAME1= <>
##$TPNAME2= <>
##$TPNAME3= <>
##$TPNAME4= <>
##$TPNAME5= <>
##$TPNAME6= <>
##$TPNAME7= <>
##$TPOAL= (0..7)
0.5 0.5 0.5 0.5 0.5 0.5 0.5 0.5
##$TPOFFS= (0..7)
0 0 0 0 0 0 0 0
##$TUNHIN= 0
##$TUNHOUT= 0
##$TUNXOUT= 0
##$USERA1= <user>
##$USERA2= <user>
##$USERA3= <user>
##$USERA4= <user>
##$USERA5= <user>
##$V9= 5
##$VALIST= <valist>
##$VCLIST= <CCCCCCCCCCCCCCC>
##$VD= 0
##$VDLIST= <DDDDDDDDDDDDDDD>
##$VPLIST= <PPPPPPPPPPPPPPP>
##$VTLIST= <TTTTTTTTTTTTTTT>
##$WBST= 1024
##$WBSW= 4
##$XGAIN= (0..3)
0 0 0 0
##$XL= 0
##$YL= 0
##$YMAX_a= 6119841
##$YMIN_a= -11919239
##$ZGOPTNS= <>
##$ZL1= 120
##$ZL2= 120
##$ZL3= 120
##$ZL4= 120
##$ABSF1= 14.96106
##$ABSF2= -5.597122
##$ABSG= 5
##$ABSL= 3
##$ALPHA= 0
##$AQORDER= 0
##$ASSFAC= 0
##$ASSFACI= 0
##$ASSFACX= 0
##$ASSWID= 0
##$AUNMP= <proc_prof1d_extract.lims>
##$AXLEFT= 0
##$AXNAME= <>
##$AXNUC= <1H>
##$AXRIGHT= 0
##$AXTYPE= 0
##$AXUNIT= <>
##$AZFE= 0.1
##$AZFW= 0.1
##$BCFW= 0
##$BC_mod= 0
##$BYTORDP= 0
##$COROFFS= 0
##$CY= 15
##$DATMOD= 1
##$DC= 0
##$DFILT= <>
##$DTYPP= 0
##$F1P= 0
##$F2P= 0
##$FCOR= 0.5
##$FTSIZE= 131072
##$FT_mod= 6
##$GAMMA= 0
##$GB= 0
##$INTBC= 1
##$INTSCL= 1
##$ISEN= 128
##$LB= 0.3
##$LEV0= 0
##$LPBIN= 0
##$MAXI= 10000
##$MC2= 0
##$MEAN= 0
##$ME_mod= 0
##$MI= 0
##$NCOEF= 0
##$NC_proc= -2
##$NLEV= 6
##$NOISF1= 0
##$NOISF2= 0
##$NSP= 0
##$NTH_PI= 0
##$NZP= 0
##$OFFSET= 14.96106
##$PC= 1
##$PHC0= -81.29333
##$PHC1= 0
##$PH_mod= 1
##$PKNL= yes
##$PPARMOD= 0
##$PPDIAG= 0
##$PPIPTYP= 0
##$PPMPNUM= 2147483647
##$PPRESOL= 1
##$PSCAL= 4
##$PSIGN= 0
##$PYNMP= <proc.py>
##$REVERSE= no
##$SF= 400.020009613206
##$SI= 131072
##$SIGF1= 0
##$SIGF2= 0
##$SINO= 400
##$SIOLD= 131072
##$SPECTYP= <>
##$SREGLST= <1H.CDCl3>
##$SSB= 0
##$STSI= 131072
##$STSR= 0
##$SW_p= 8223.68421052631
##$SYMM= 0
##$S_DEV= 0
##$TDeff= 65536
##$TDoff= 0
##$TI= <>
##$TILT= no
##$TM1= 0
##$TM2= 0
##$TOPLEV= 0
##$USERP1= <user>
##$USERP2= <user>
##$USERP3= <user>
##$USERP4= <user>
##$USERP5= <user>
##$WDW= 1
##$XDIM= 131072
##$YMAX_p= 465662743
##$YMIN_p= -99356
##$CURPLOT= <Network HP LaserJet P1505>
##$CURPRIN= <$Network HP LaserJet P1505>
##$DFORMAT= <normdp>
##$LAYOUT= <+/1D_H.xwp>
##$LFORMAT= <normlp>
##$PFORMAT= <normpl>
##$SURQMSG= 1
$$ End of Bruker specific parameters
$$ ---------------------------------
##NTUPLES= NMR SPECTRUM
##VAR_NAME=  FREQUENCY,     SPECTRUM/REAL,   SPECTRUM/IMAG
##SYMBOL=    X,             R,               I
##VAR_TYPE=  INDEPENDENT,   DEPENDENT,       DEPENDENT
##VAR_FORM=  AFFN,          ASDF,            ASDF
##VAR_DIM=   131072,        131072,          131072
##UNITS=     HZ,            ARBITRARY UNITS, ARBITRARY UNITS
##FACTOR=    0.0627417313425164, 1,          1
##FIRST=     8223.62146879497, 1336,         -55500
##LAST=      0,             2627,            -55496
##MIN=       0,             -99356,          0
##MAX=       8223.62146879497, 465662743,    0
$$ Real data points
##PAGE= N=1
##DATA TABLE= (X++(R..R)), XYDATA
$$ [...]
$$ plain form
63965 450655 464639 480037 497383 516680 537309 558693 581093 605708 634026 667028 704893
63954 704893 747442 795031 849108 911821 985087 1070104 1167695 1278775 1404294 1544802 1700143
63943 1700143 1869394 2051016 2243283 2444712 2653830 2868273 3084251 3297007 3501598
63934 3501598 3692997 3865880 4015100 4136731 4228564 4289626 4319485 4317959 4285001 4220612 4125213
63923 4125213 4000553 3850275 3679451 3493416 3296927 3094070 2888607 2684298 2484901
63914 2484901 2293772 2113316 1944858 1789108 1646698 1518185 1403601 1302245 1213045 1134963
63904 1134963 1066924 1007550 955396 909599 870001 836348 807569 782213 759472 739339 721709
63893 721709 705802 690662 675813 661105 646386 631826 618300 606811 597491 589674 582989 577890
$$ packed form
63965D50655J3984J5398J7346J9297K0629K1384K2400K4615K8318L3002L7865
63954G04893M2549M7589N4077O2713P3266Q5017R7591J11080J25519J40508J55341
63943A700143J69251J81622J92267K01429K09118K14443K15978K12756K04591
63934C501598J91399J72883J49220J21631R1833O1062K9859j526l2958o4389r5399
63923D125213j24660j50278j70824j86035j96489k02857k05463k04309j99397
63914B484901j91129j80456j68458j55750j42410j28513j14584j01356q9200p8082
63904A134963o8039n9374n2154m5797l9598l3653k8779k5356k2741k0133j7630
63893G21709j5907j5140j4849j4708j4719j4560j3526j1489r320p817o685n099
$$ plain form
63881 577890 574939 574082 575039 578111 584113 593549 606130 621168 638167 656925 677282 699077 722405
63868 722405 747621 774747 802896 830671 857273 882868 907570 930479 950382 967239 982245
63857 982245 996136 1008010 1016200 1019900 1019430 1015210 1007151 995070 979227 960207 938593 914939 889844
63844 889844 863734 836586 808046 777944 746688 715118 683955 653404 623293 593592 564748
63833 564748 537508 512443 489614 468605 448785 429659 411129 393464 377017 361982 348408
63822 348408 336332 325753 316414 307791 299440 291403 284125 277909 272541 267558 262789 258427 254595 251125
63808 251125 247856 244888 242357 240164 238152 236353 234764 233049 230872 228445 226303 224501 222489 219974
63794 219974 217393 215172 212889 209767 205871 202292 199998 198935 198461 198330 198829 200013 201203 201455 200404
$$ packed form
63881E77890k951q57R57L072O002R436J2581J5038J6999J8758K0357K1795K3328
63868G22405K5216K7126K8149K7775K6602K5595K4702K2909J9903J6857J5006
63857I82245J3891J1874Q190L700m70m220q059j2081j5843j9020k1614k3654k5095
63844H89844k6110k7148k8540l0102l1256l1570l1163l0551l0111k9701k8844
63833E64748k7240k5065k2829k1009j9820j9126j8530j7665j6447j5035j3574
63822C48408j2076j0579r339q623q351q037p278o216n368m983m769m362l832l470
63808B51125l269k968k531k193k012j799j589j715k177k427k142j802k012k515
63794B19974k581k221k283l122l896l579k294j063m74j31M99J184J190K52j051
$$ plain form
63779 200404 198505 196555 195162 194605 194879 195654 196316 196327 195626 194637 193872 193510 193266 192628 191410 190171 189867
63762 189867 190835 192300 193118 192925 192270 191793 191710 192020 192650 193244 193320 192935 192801 193403 194326 194868 195085 195752 197399
63743 197399 199802 202402 204831 206895 208406 209266 209667 210050 210889 212418 214442 216440 217969 219032 219979
63728 219979 221186 222943 225562 229314 234147 239589 245011 249954 254229 257854 260980 263851 266748 269827
63714 269827 272881 275223 275994 274757 271782 267806 263591 259739 256598 254134 251985 249876 247965 246663
63700 246663 246225 246627 247701 249155 250617 251942 253426 255460 257988 260637 263358 266577 270603 275129 279519
63685 279519 283380 286698 289580 292034 293882 294792 294517 293253 291618 290119 288745 287277 285880 285143 285540
63670 285540 287036 289232 291672 293937 295663 296712 297307 297767 298038 297585 295818 292613 288400 283834 279492
$$ packed form
63779B00404j899j950j393n57K74P75O62J1p01r89p65l62k44o38j218j239l04
63762A89867R68J465Q18j93o55m77q3L10O30N94P6l85j34O02R23N42K17O67J647
63743A97399K403K600K429K064J511Q60M01L83Q39J529K024J998J529J063R47
63728B19979J207J757K619L752M833N442N422M943M275L625L126K871K897L079
63714B69827L054K342P71j237k975l976m215l852l141k464k149k109j911j302
63700B46663m38M02J074J454J462J325J484K034K528K649K721L219M026M526M390
63685B79519L861L318K882K454J848R10k75j264j635j499j374j468j397p37L97
63670B85540J496K196K440K265J726J049N95M60K71m53j767l205m213m566m342
$$ plain form
63655 279492 275722 272496 269337 265626 261241 256914 253716 252144 251710 251435 250664 249448 248256 247506 247360
63640 247360 247862 249044 250788 252719 254505 256317 258735 262094 266050 269993 273755 277715 282328 287846
63626 287846 294471 302421 311615 321460 331265 340941 351168 362763 375929 390278 405651 422671 442213
63613 442213 464349 488164 512701 537785 563678 590259 616935 643148 668406 691652 711121
63602 711121 725244 733626 737024 736462 732635 726170 718141 709991 702775 696549 690620 684281 677021 668047
63588 668047 656130 640396 621144 599586 576904 553898 531346 510071 490407 472086 454921
63577 454921 439341 426007 415142 406540 400029 395591 393090 392193 392663 394592 398291 403949 411379 420086
63563 420086 429659 440026 451162 462613 473723 484510 496009 509380 524779 541488 559131 578446
$$ packed form
63655B79492l770l226l159l711m385m327l198j572m34k75p71j216j192p50j46
63640B47360N02J182J744J931J786J812K418L359L956L943L762L960M613N518
63626B87846O625P950R194R845R805R676J0227J1595J3166J4349J5373J7020J9542
63613D42213K2136K3815K4537K5084K5893K6581K6676K6213K5258K3246J9469
63602G11121J4123Q382L398n62l827o465q029q150p216o226n929o339p260q974
63588F68047j1917j5734j9252k1558k2682k3006k2552k1275j9664j8321j7165
63577D54921j5580j3334j0865q602o511m438k501q97M70J929L699N658P430Q707
63563D20086R573J0367J1136J1451J1110J0787J1499J3371J5399J6709J7643J9315
$$ plain form
63551 578446 600754 626921 657081 691172 729150 770040 810699 846123 871748 885768 889230 884280
63539 884280 872920 857343 840330 824419 810836 799667 790805 784166 779176 774686 769518 762654 752861
63526 752861 738686 719212 694704 666455 636191 605561 575740 547190 519906 493999 469897
63515 469897 447892 427775 409123 391811 376093 362269 350394 340271 331594 324140 317839 312626
63503 312626 308267 304436 300873 297338 293557 289537 285862 283295 281966 281301 280863 280830 281422 282249 282667 282599
63487 282599 282595 283154 284349 286098 288380 291091 293957 296749 299475 302330 305550 309287 313407 317353 320421
63472 320421 322310 323284 323634 323138 321249 317904 313949 310524 307983 305579 302351 298224 294014 290456 287568
63457 287568 285088 283210 282522 283349 285350 287749 289883 291750 294243 298589 305231 313398 322075 331257 341815
$$ packed form
63551E78446K2308K6167L0160L4091L7978M0890M0659L5424K5625J4020L462m950
63539H84280j1360j5577j7013j5911j3583j1169q862o639m990m490n168o864r793
63526G52861j4175j9474k4508k8249l0264l0630k9821k8550k7284k5907k4102
63515D69897k2005k0117j8652j7312j5718j3824j1875j0123q677p454o301n213
63503C12626m359l831l563l535l781m020l675k567j329o65m38l3N92Q27M18o8
63487B82599mN59J195J749K282K711K866K792K726K855L220L737M120L946L068
63472C20421J889R74L50m96j889l345l955l425k541k404l228m127m210l558k888
63457B87568k480j878o88Q27K001K399K134J867K493M346O642Q167Q677R182J0558
$$ plain form
63442 341815 354333 368727 385092 404276 427251 454314 485131 518932 554038 587479 615858
63431 615858 636868 649929 655737 655782 652208 647487 643804 642842 646000 654285 667867 686211 708925 736113
63417 736113 767594 802062 837390 871483 902438 928104 946278 955750 957082 952274 943758 933608
63405 933608 923209 913286 904117 895708 887673 878998 868229 854158 836288 814616 789167 760068
63393 760068 728119 694995 662601 632148 603877 577558 553073 530512 509930 491343 474925
63382 474925 460973 449524 440215 432709 427162 423979 423148 424100 426312 429821 434955 441670 449458 457936
63368 457936 467435 478873 493000 509704 528097 547356 567523 589496 614281 642264 673103 705995
63356 705995 739979 774084 807315 838444 865849 887854 903445 912611 915972 914279 908443 899704
$$ packed form
63442C41815J2518J4394J6365J9184K2975K7063L0817L3801L5106L3441K8379
63431F15858K1010J3061N808M5l574m721l683r62L158Q285J3582J8344K2714K7188
63417G36113L1481L4468L5328L4093L0955K5666J8174R472J332m808q516j0150
63405I33608j0399r923r169q409q035q675j0769j4071j7870k1672k5449k9099
63393G60068l1949l3124l2394l0453k8271k6319k4485k2561k0582j8587j6418
63382D74925j3952j1449r309p506n547l183q31R52K212L509N134O715P788Q478
63368D57936R499J1438J4127J6704J8393J9259K0167K1973K4785K7983L0839L2892
63356G05995L3984L4105L3231L1129K7405K2005J5591R166L361j693n836q739
$$ plain form
63344 899704 889372 878345 867203 856643 847314 838962 830008 818335 802517 782276 758054 730590
63332 730590 701009 670952 642166 615814 592178 571087 552594 537255 525924 519360 517718 519887
63320 519887 523140 523853 519133 508029 491368 470921 448929 427808 409246 393260 378629 364521
63308 364521 351360 339969 330473 322499 316009 311252 307962 305222 302256 298967 295641 292493 289710 287555
63294 287555 286085 284868 283277 281068 278533 276100 273965 272154 270747 269812 269123 268213 266931 265836 265693
63279 265693 266506 267385 267503 266973 266503 266395 266237 265498 264180 262846 262237 262842 264564 266765 268781 270441 271981
63262 271981 273595 275347 277447 280213 283612 287125 290197 292658 294739 296957 300077 304690 310529 316434
63248 316434 321444 325801 330625 336703 343942 351990 360891 370912 381931 393408 405056 417416 431586
$$ packed form
63344H99704j0332j1027j1142j0560r329q352q954j1673j5818k0241k4222k7464
63332G30590k9581l0057k8786k6352k3636k1091j8493j5339j1331o564j642K169
63320E19887L253P13m720j1104j6661k0447k1992k1121j8562j5986j4631j4108
63308C64521j3161j1391r496p974o490m757l290k740k966l289l326l148k783k155
63294B87555j470j217j591k209k535k433k135j811j407r35o89r10j282j095j43
63279B65693Q13Q79J18n30m70j08j58p39j318j334o09O05J722K201K016J660J540
63262B71981J614J752K100K766L399L513L072K461K081K218L120M613N839N905
63248C16434N010M357M824O078P239Q048Q901J0021J1019J1477J1648J2360J4170
$$ plain form
63235 431586 448322 467428 488010 509216 530692 552518 574983 598357 622556 646907 670478
63224 670478 692781 714030 734673 754982 775248 796067 817987 840888 864060 886987 909811
63213 909811 932826 955476 975909 991635 1000821 1003085 999072 989388 974202 953793 929030 901030
63201 901030 870620 838448 805375 772453 740735 711413 685821 664697 647553 633374 621999
63190 621999 614209 610389 609841 611775 616260 623605 633364 644796 658082 674161 693224 714099 735394
63177 735394 756667 778126 799727 821182 842565 864281 886409 908439 929640 949299 966656
63166 966656 981131 992733 1001791 1007977 1009906 1006074 995977 980022 958644 932097 901121 867226
63154 867226 832053 796643 761487 726996 693689 662072 632500 605112 579832 556675 536140
$$ packed form
63235D31586J6736J9106K0582K1206K1476K1826K2465K3374K4199K4351K3571
63224F70478K2303K1249K0643K0309K0266K0819K1920K2901K3172K2927K2824
63213I09811K3015K2650K0433J5726R186K264m013r684j5186k0409k4763k8000
63201I01030l0410l2172l3073l2922l1718k9322k5592k1124j7144j4179j1375
63190F21999p790l820n48J934M485P345R759J1432J3286J6079J9063K0875K1295
63177G35394K1273K1459K1601K1455K1383K1716K2128K2030K1201J9659J7357
63166I66656J4475J1602R058O186J929l832j0097j5955k1378k6547l0976l3895
63154H67226l5173l5410l5156l4491l3307l1617k9572k7388k5280k3157k0535
$$ plain form
63143 536140 518997 505363 494209 484104 474407 465427 457550 450691 444685 439727 436056 433420 431206
63130 431206 429060 427075 425393 423962 422833 422412 423076 424612 426356 427981 429840 432348 435302 438138 440725
63115 440725 443538 447009 451076 455404 459718 463745 467158 469849 472043 473999 475701 477048 478071 478847
63101 478847 479391 479855 480526 481349 481773 481437 480736 480229 479717 478551 476822 475589 475711 476905 478225 479064 479419
63084 479419 479554 479764 480359 481564 483496 486369 490525 496072 502567 509250 515582 521546 527555 534155 541665
63069 541665 549971 558754 567911 577639 588143 599471 611718 625165 640220 657386 677258 700184
63057 700184 725875 753759 783845 816830 853104 892151 933348 976989 1023866 1073963 1126205
63046 1126205 1179538 1233709 1288805 1344478 1399992 1454794 1508761 1561992 1614689 1667203 1720006
$$ packed form
63143E36140j7143j3634j1154j0105r697q980p877o859o006m958l671k636k214
63130D31206k146j985j682j431j129m21O64J536J744J625J859K508K954K836K587
63115D40725K813L471M067M328M314M027L413K691K194J956J702J347J023P76
63101D78847N44M64O71Q23M24l36p01n07n12j166j729j233J22J194J320Q39L55
63084D79419J35K10N95J205J932K873M156N547O495O683O332N964O009O600P510
63069E41665Q306Q783R157R728J0504J1328J2247J3447J5055J7166J9872K2926
63057G00184K5691K7884L0086L2985L6274L9047M1197M3641M6877N0097N2242
63046A126205N3333N4171N5096N5673N5514N4802N3967N3231N2697N2514N2803
$$ plain form
63035 1720006 1773473 1827679 1882284 1936461 1988896 2037985 2082158 2120033 2150245 2171173 2180960
63024 2180960 2177937 2161123 2130464 2086878 2032217 1968983 1899700 1826435 1751003 1675569 1602701
63013 1602701 1534632 1472545 1416718 1367228 1324478 1289142 1261778 1242476 1230831 1226250 1228242 1236366
63001 1236366 1250036 1268624 1291699 1318917 1349656 1383012 1418186 1454628 1491832 1529399 1567398
62990 1567398 1606245 1645970 1685865 1725001 1762714 1798334 1830892 1859411 1883060 1900546 1909756
62979 1909756 1908720 1896880 1874929 1843565 1802995 1753609 1696480 1633103 1565223 1495083 1425149
62968 1425149 1357076 1291212 1227468 1166436 1109381 1057356 1010672 969032 931759 897928 866666
62957 866666 837497 810345 785178 761752 739694 718697 698587 679308 660935 643637 627528
$$ packed form
63035A720006N3467N4206N4605N4177N2435M9089M4173L7875L0212K0928R787
63024B180960l023j6814l0659m3586n4661o3234o9283p3265p5432p5434p2868
63013A602701o8069o2087n5827m9490m2750l5336k7364j9302j1645m581J992Q124
63001A236366J3670J8588K3075K7218L0739L3356L5174L6442L7204L7567L7999
62990A567398L8847L9725L9895L9136L7713L5620L2558K8519K3649J7486R210
62979A909756j036j1840k1951l1364m0570m9386n7129o3377o7880p0140o9934
62968A425149o8073o5864o3744o1032n7055n2025m6684m1640l7273l3831l1262
62957H66666k9169k7152k5167k3426k2058k0997k0110j9279j8373j7298j6109
$$ plain form
62946 627528 612470 598134 584364 571394 559542 548698 538417 528514 519226 510622 502218 493609
62934 493609 485230 478009 472310 467626 463368 459538 456513 454462 453129 452036 450825 449562 448660 448305 448058
62919 448058 447320 446025 444499 442721 440347 437526 435017 433191 431482 429266 426799 424726 423013 421022
62905 421022 418548 416103 414107 412306 410238 407914 405801 404323 403534 403064 402287 400768 398802 397404 397467
62890 397467 398877 400590 401594 401700 401353 400882 400123 398779 396933 395113 393974 393946 395032 396751 398370 399462
62874 399462 400214 401049 401981 402564 402466 401783 400739 399391 397816 396394 395597 395501 395673 395569 394999 394285 394005 394556
62856 394556 395891 397651 399489 401236 402882 404540 406363 408321 410131 411563 412689 413578 413942 413551 412901
62841 412901 412872 413530 413865 413033 411364 409734 408380 406930 405342 404140 403689 403725 403742 403517 403179 403038 403443 404594
$$ packed form
62946F27528j5058j4336j3770j2970j1852j0844j0281r903r288q604q404q609
62934D93609q379p221n699m684m258l830l025k051j333j093j211j263r02l55k47
62919D48058p38j295j526j778k374k821k509j826j709k216k467k073j713j991
62905D21022k474k445j996j801k068k324k113j478p89m70p77j519j966j398O3
62890C97467J410J713J004J06l47m71p59j344j846j820j139k8J086J719J619J092
62874C99462P52Q35R32N83r8o83j044j348j575j422p97r6J72j04n70p14k80N51
62856C94556J335J760J838J747J646J658J823J958J810J432J126Q89L64l91o50
62841D12901k9O58L35q32j669j630j354j450j588j202m51L6J7k25l38j41M05J151
$$ plain form
62823 404594 406421 408710 411207 413517 415193 416272 417507 419636 422564 425750 429259 433777 439536 445868
62809 445868 452042 457942 463618 468856 473787 479425 486799 495699 504975 514065 523512 533860 544746 555555
62795 555555 566487 578413 591929 607101 624063 643333 665386 690331 718231 749441 784463
62784 784463 823764 868001 918124 974801 1037792 1106269 1179747 1258311 1341889 1429700 1520556
62773 1520556 1613244 1706214 1797124 1882984 1960740 2027597 2081141 2119575 2141914 2147791 2137279
62762 2137279 2111103 2070764 2018001 1954233 1880971 1800658 1716455 1630958 1545474 1460702 1377630
62751 1377630 1297462 1221062 1148860 1081177 1018317 960451 907651 859915 817005 778445 743872
62740 743872 713182 686077 661737 639352 618843 600682 585070 571659 560015 549909 541141 533520
$$ packed form
62823D04594J827K289K497K310J676J079J235K129K928L186L509M518N759O332
62809D45868O174N900N676N238M931N638P374Q900R276R090R447J0348J0886J0809
62795E55555J0932J1926J3516J5172J6962J9270K2053K4945K7900L1210L5022
62784G84463L9301M4237N0123N6677O2991O8477P3478P8564Q3578Q7811R0856
62773A520556R2688R2970R0910Q5860P7756O6857N3544L8434K2339N877j0512
62762B137279k6176m0339n2763o3768p3262q0313q4203q5497q5484q4772q3072
62751A377630q0168p6400p2202o7683o2860n7866n2800m7736m2910l8560l4573
62740G43872l0690k7105k4340k2385k0509j8161j5612j3411j1644j0106q768p621
$$ plain form
62728 533520 527091 521996 518025 514746 512186 510924 511212 512535 514425 517296 521931 528396 535999 544196
62714 544196 553025 562730 573573 586089 600995 618647 638955 661944 688028 717598 750823 788071
62702 788071 830053 877125 928783 984243 1043315 1106383 1173797 1245696 1322070 1402315 1484692
62691 1484692 1566717 1646084 1720828 1788633 1846679 1892446 1924294 1941112 1941980 1926668 1896239 1852741
62679 1852741 1798336 1734921 1664286 1588193 1508323 1426448 1344630 1264911 1188732 1116773 1049350
62668 1049350 986727 929080 876444 828750 785704 746633 710800 678067 648965 623807 601908
62657 601908 582018 563500 546719 532182 519591 508021 496834 486134 476336 467530 459358 451387
62645 451387 443530 436129 429645 424230 419678 415817 412778 410687 409258 408018 406875 406043 405375 404226 402214
$$ packed form
62728E33520o429n095l971l279k560j262K88J323J890K871M635O465P603Q197
62714E44196Q829R705J0843J2516J4906J7652K0308K2989K6084K9570L3225L7248
62702G88071M1982M7072N1658N5460N9072O3068O7414P1899P6374Q0245Q2377
62691A484692Q2025P9367P4744O7805N8046M5767L1848J6818Q68j5312l0429m3498
62679A852741n4405o3415p0635p6093p9870q1875q1818p9719p6179p1959o7423
62668A049350o2623n7647n2636m7694m3046l9071l5833l2733k9102k5158k1899
62657F01908j9890j8518j6781j4537j2591j1570j1187j0700r798q806q172p971
62645D51387p857p401o484n415m552l861l039k091j429j240j143q32o68j149k012
$$ plain form
62630 402214 399744 397444 395456 393614 392080 391265 391227 391574 391966 392338 392704 393153 394090 396048 399157 403046
62614 403046 407317 411785 416246 420428 424393 428713 434045 440611 448123 456091 464348 473565 485118 499980
62600 499980 517786 537488 558918 583035 610540 641076 674222 710485 750499 793635 838184
62589 838184 882724 926626 969245 1009310 1045232 1075542 1098911 1114231 1120884 1118679 1107539 1087760
62577 1087760 1060727 1028844 994205 957485 918464 877437 835689 794616 754956 717083 681597
62566 681597 649066 619365 591942 566818 544692 525727 508895 493196 479046 467589 458817 451305
62554 451305 443830 436327 429079 422059 415578 410583 407425 405016 402134 399080 397110 396580 396685 396868 397436
62539 397436 398608 399869 400564 400529 399913 398973 398279 398554 400024 402338 405299 409263 414639 421458 429645 439285
$$ packed form
62630D02214k470k300j988j842j534q15l8L47L92L72L66M49R37J958L109L889
62614D03046M271M468M461M182L965M320N332O566P512P968Q257R217J1553J4862
62600D99980J7806J9702K1430K4117K7505L0536L3146L6263M0014M3136M4549
62589H38184M4540M3902M2619M0065L5922L0310K3369J5320O653k205j1140j9779
62577A087760k7033l1883l4639l6720l9021m1027m1748m1073l9660l7873l5486
62566F81597l2531k9701k7423k5124k2126j8965j6832j5699j4150j1457q772p512
62554D51305p475p503p248p020o481m995l158k409k882l054j970n30J05J83N68
62539C97436J172J261O95l5o16r40o94K75J470K314K961L964N376O819Q187R640
$$ plain form
62523 439285 450429 463096 477700 494980 515186 537734 562044 588370 617432 649574 684729
62512 684729 722950 764386 808630 854462 900416 945442 988929 1030132 1067654 1099597 1124323
62501 1124323 1141039 1149633 1150186 1142918 1128457 1107795 1082058 1052701 1021793 991488 962979 936439
62489 936439 912178 891338 875099 863663 856528 853493 854873 860813 870838 884144 899963 917482
62477 917482 935488 952226 965792 974920 979460 979925 976570 969031 956785 939515 917002 889264 857159
62464 857159 822495 787040 751559 716117 681071 647335 615789 586855 560666 537306 516806
62453 516806 499130 484196 471820 461689 453524 447144 442222 438202 434762 432261 431390 432420 435012
62440 435012 438688 443168 448249 453685 459348 465232 471121 476399 480315 482372 482400 480389 476391 470599 463404
$$ packed form
62523D39285J1144J2667J4604J7280K0206K2548K4310K6326K9062L2142L5155
62512F84729L8221M1436M4244M5832M5954M5026M3487M1203L7522L1943K4726
62501A124323J6716Q594N53p268j4461k0662k5737k9357l0908l0305k8509k6540
62489I36439k4261k0840j6239j1436p135l035J380N940J0025J3306J5819J7519
62477I17482J8006J6738J3566R128M540M65l355p539j2246j7270k2513k7738l2105
62464H57159l4664l5455l5481l5442l5046l3736l1546k8934k6189k3360k0500
62453E16806j7676j4934j2376j0131q165o380m922m020l440k501q71J030K592
62440D35012L676M480N081N436N663N884N889N278L916K057K8k011l998n792p195
$$ plain form
62425 463404 455314 446746 437909 428899 419931 411354 403413 396098 389308 383082 377562 372708 368206 363756
62411 363756 359433 355643 352626 350048 347292 344239 341492 339662 338653 337961 337538 337848 339088 340845 342724
62396 342724 344902 347735 351071 354228 356551 357771 358060 358029 358530 360091 362472 364949 367059 369052 371626
62381 371626 375323 380090 385422 390918 396671 403000 409965 417424 425492 434491 444390 454726 465236 476249
62367 476249 488252 501486 516173 532729 551411 572139 595082 621054 650847 684448 721492
62356 721492 762287 807699 857902 911647 966744 1020806 1071449 1116380 1153810 1182833 1203387
62345 1203387 1216025 1221717 1221516 1216088 1205466 1189225 1167009 1139119 1106713 1071235 1033566 994046
62333 994046 953518 913881 877043 843565 812933 785024 760605 740270 723522 709159 696048
$$ packed form
62425D63404q090q568q837r010q968q577p941p315o790o226n520m854m502m450
62411C63756m323l790l017k578k756l053k747j830j009o92m23L10J240J757J879
62396C42724K178K833L336L157K323J220K89l1N01J561K381K477K110J993K574
62381C71626L697M767N332N496N753O329O965P459Q068Q999R899J0336J0510J1013
62367D76249J2003J3234J4687J6556J8682K0728K2943K5972K9793L3601L7044
62356G21492M0795M5412N0203N3745N5097N4062N0643M4931L7430K9023K0554
62345A203387J2638N692k01n428j0622j6241k2216k7890l2406l5478l7669l9520
62333I94046m0528l9637l6838l3478l0632k7909k4419k0335j6748j4363j3111
$$ plain form
62322 696048 683197 669615 654747 638907 622835 606794 590413 573384 555994 538901 522682
62311 522682 507769 494559 483211 473252 463710 453939 444280 435692 428751 423264 418805 415198 412307
62298 412307 409748 407237 404961 403279 402205 401610 401704 402812 404652 406387 407588 408789 410837 413963 417677
62283 417677 421400 425009 428850 433308 438334 443414 448116 452586 457344 462686 468568 475026 482343 490697
62269 490697 499967 510014 520992 533284 547375 563891 583563 607023 634700 666895 703693 744817
62257 744817 789912 839092 892870 951239 1013026 1076268 1138990 1199330 1255163 1304112 1344154
62246 1344154 1374135 1393781 1403478 1404132 1396940 1382909 1362353 1334914 1300195 1258379 1210223 1156663
62234 1156663 1098875 1038821 979224 922437 869342 819636 773160 730589 692842 660206 632182
$$ packed form
62322F96048j2851j3582j4868j5840j6072j6041j6381j7029j7390j7093j6219
62311E22682j4913j3210j1348r959r542r771r659q588o941n487m459l607k891
62298D12307k559k511k276j682j074n95R4J108J840J735J201J201K048L126L714
62283D17677L723L609L841M458N026N080M702M470M758N342N882O458P317Q354
62269D90697R270J0047J0978J2292J4091J6516J9672K3460K7677L2195L6798M1124
62257G44817M5095M9180N3778N8369O1787O3242O2722O0340N5833M8949M0042
62246A344154K9981J9646R697O54p192j4031k0556k7439l4719m1816m8156n3560
62234A156663n7788o0054n9597n6787n3095m9706m6476m2571l7747l2636k8024
$$ plain form
62223 632182 607903 586566 567668 550963 536171 522778 510377 499096 489353 481120 473795 466930
62211 466930 460763 455822 452277 449855 448150 446766 445335 443722 442176 441148 440985 441811 443487 445573 447513
62196 447513 449113 450819 453401 457420 462939 469615 476982 484880 493686 503911 515376 526977 537511
62183 537511 546722 555438 564668 574652 584684 593749 601347 607742 613472 618861 624158 629992 637308 646887
62169 646887 659258 675040 694922 719128 747269 778870 813760 851670 891724 932449 972045
62158 972045 1008460 1039644 1064134 1081392 1091539 1095178 1093515 1087985 1079207 1066603 1049516 1028325
62146 1028325 1003934 976582 946119 913412 880633 849839 821773 796297 773399 753382 736508
62135 736508 722935 712862 706292 702653 700839 699727 698674 697700 697258 697716 699067 701220 704477 709328
$$ packed form
62223F32182k4279k1337j8898j6705j4792j3393j2401j1281r743q233p325o865
62211D66930o167m941l545k422j705j384j431j613j546j028j63Q26J676K086J940
62196D47513J600J706K582M019N519O676P367P898Q806J0225J1465J1601J0534
62183E37511R211Q716R230R984J0032R065P598O395N730N389N297N834P316R579
62169F46887J2371J5782J9882K4206K8141L1601L4890L7910M0054M0725L9596
62158I72045L6415L1184K4490J7258J0147L639j663n530q778j2604j7087k1191
62146A028325k4391k7352l0463l2707l2779l0794k8066k5476k2898k0017j6874
62135G36508j3573j0073o570l639j814j112j053r74m42M58J351K153L257M851
$$ plain form
62121 709328 715761 723115 730651 737823 743830 747517 748337 747191 745786 745146 745111 745057 744407 742288 737343 728561
62105 728561 716247 701890 687128 673008 660075 648732 639349 632180 627358 624858 624395 625456 627598
62092 627598 630755 635162 640897 647518 654248 660562 666590 672844 679608 686665 693703 700851 708666 717675
62078 717675 728069 739870 753266 768616 786127 805524 826066 846979 867978 889286 911089
62067 911089 933121 955039 977045 999825 1023851 1049050 1075157 1101826 1128072 1151961 1171450
62056 1171450 1185571 1194623 1199387 1200502 1198455 1193640 1186223 1176124 1163124 1146846 1126702 1102210
62044 1102210 1073480 1041241 1006475 970217 933520 897154 861264 825704 790805 757503 726652
62033 726652 698548 673095 650005 628674 608401 589071 571291 555583 541795 529570 518947
$$ packed form
62121G09328O433P354P536P172O007L687Q20j146j405o40l5n4o50k119m945q782
62105G28561j2314j4357j4762j4120j2933j1343r383p169m822k500m63J061K142
62092F27598L157M407N735O621O730O314O028O254O764P057P038P148P815R009
62078G17675J0394J1801J3396J5350J7511J9397K0542K0913K0999K1308K1803
62067I11089K2032K1918K2006K2780K4026K5199K6107K6669K6246K3889J9489
62056A171450J4121R052M764J115k047m815p417j0099j3000j6278k0144k4492
62044A102210k8730l2239l4766l6258l6697l6366l5890l5560l4899l3302l0851
62033G26652k8104k5453k3090k1331k0273j9330j7780j5708j3788j2225j0623
$$ plain form
62022 518947 510026 502312 494874 487073 478780 470062 461114 452348 444109 436305 428705 421514 415250 410125
62008 410125 406016 403059 401720 402153 403963 406859 411091 416905 423880 431154 438134 444647 450563 455614
61994 455614 459520 462089 463213 463018 461950 460440 458451 455545 451387 446044 439842 433160 426392 419850
61980 419850 413563 407349 401154 395198 389689 384595 379836 375545 371877 368644 365419 362088 359093 356950
61966 356950 355630 354567 353262 351755 350458 349648 349279 349262 349713 350729 352079 353367 354575 356136 358381
61951 358381 361171 364316 368094 373032 379254 386408 394177 402574 411843 422482 435271 450732 468389
61938 468389 486964 505500 523959 542623 561413 580048 598382 616190 633024 648657 663318
61927 663318 677060 689216 698884 705620 709273 709640 706968 702401 697091 691038 683582 674993 666792 660470
$$ packed form
62022E18947q921p714p438p801q293q718q948q766q239p804p600p191o264n125
62008D10125m109k957j339M33J810K896M232N814O975P274O980O513N916N051
61994D55614L906K569J124j95j068j510j989k906m158n343o202o682o768o542
61980D19850o287o214o195n956n509n094m759m291l668l233l225l331k995k143
61966C56950j320j063j305j507j297q10l69j7M51J016J350J288J208J561K245
61951C58381K790L145L778M938O222P154P769Q397R269J0639J2789J5461J7657
61938D68389J8575J8536J8459J8664J8790J8635J8334J7808J6834J5633J4661
61927F63318J3742J2156R668O736L653L67k672m567n310o053p456q589q201o322
$$ plain form
61913 660470 656623 655402 656931 661036 667285 675662 686653 700346 715964 732472 749016 764502 777448
61900 777448 786790 792419 794557 793121 788097 779982 769330 756217 740660 723193 704591 685396 666174
61887 666174 647834 631078 615782 601432 587930 575470 563896 552731 541704 530770 519795
61876 519795 508753 498107 488528 480269 473205 467290 462575 458896 455984 453766 452253 451349 451146 452141
61862 452141 454667 458423 463095 469137 477242 487297 498642 511348 526450 544758 566100 589836
61850 589836 615487 642683 671134 700899 732161 764437 796446 826951 855285 880868 902730
61839 902730 919921 932049 939084 940925 937513 929249 917123 902699 888065 875391 866023 860070 857089
61826 857089 857122 860820 868654 880200 894264 909512 924781 938689 949189 954048 952022 943336 928871
$$ packed form
61913F60470l847j221J529M105O249Q377J0991J3693J5618J6508J6544J5486J2946
61900G77448R342N629K138j436n024q115j0652j3113j5557j7467j8602j9195j9222
61887F66174j8340j6756j5296j4350j3502j2460j1574j1165j1027j0934j0975
61876E19795j1042j0646r579q259p064n915m715l679k912k218j513r04k03R95
61862D52141K526L756M672O042Q105J0055J1345J2706J5102J8308K1342K3736
61850E89836K5651K7196K8451K9765L1262L2276L2009L0505K8334K5583K1862
61839I02730J7191J2128P035J841l412q264j2126j4424j4634j2674r368n953k981
61826H57089L3L698P834J1546J4064J5248J5269J3908J0500M859k026q686j4465
$$ plain form
61813 928871 909278 885233 858016 829064 799037 767995 736404 705311 675514 647330 621296
61802 621296 598361 578953 562427 547824 534753 523229 513148 504319 496631 489740 483023 476277
61790 476277 470203 465620 462366 459441 456155 452707 449608 446980 444573 442222 440001 437883 435503 432518
61776 432518 429253 426663 425366 424923 424433 423583 422626 421568 420123 418558 417759 418167 419288 420576 422223 424593
61760 424593 427450 430269 432922 435558 438133 440540 442848 444960 446394 446933 447064 447180 446743 444995 442235
61745 442235 439537 437322 435127 432777 430854 429693 428710 427261 425545 424191 423378 422926 422923 423671 425041 426335
61729 426335 426873 426593 426143 426550 428584 432089 435931 438863 440522 441555 442816 444624 446733 448775 450609
61714 450609 452320 454019 455685 457191 458462 459549 460468 461010 460784 459461 456976 453528 449493 445328 441438
$$ packed form
61813I28871j9593k4045k7217k8952l0027l1042l1591l1093k9797k8184k6034
61802F21296k2935j9408j6526j4603j3071j1524j0081q829p688o891o717o746
61790D76277o074m583l254k925l286l448l099k628k407k351k221k118k380k985
61776D32518l265k590j297m43m90q50r57j058j445j565p99M08J121J288J647K370
61760D24593K857K819K653K636K575K407K308K112J434N39J31J16m37j748k760
61745D42235k698k215k195k350j923j161r83j449j716j354q13m52lP48J370J294
61729D26335N38k80m50M07K034L505L842K932J659J033J261J808K109K042J834
61714D50609J711J699J666J506J271J087R19N42k26j323k485l448m035m165l890
$$ plain form
61699 441438 437966 434679 431111 426968 422451 418135 414458 411304 408150 404707 401340 398704 396916 395312
61685 395312 393130 390279 387193 384103 380843 377340 373820 370392 366937 363604 360915 358953 356949 354301
61671 354301 351652 350195 350015 349924 348982 347431 345922 344619 343481 342788 342761 343022 342989 342587 342178 342024 342238 343015
61653 343015 344389 345910 347074 348072 349662 352235 355377 358411 361102 363733 366703 370203 374103 378018
61639 378018 381536 384346 386232 387081 387090 386697 386105 384891 382353 378221 372895 367062 361272 355867 351081 347152
61623 347152 344346 342798 342265 342205 342191 342127 341969 341564 340927 340435 340301 340086 339139 337436 335523 333648 331411 328422
61605 328422 324821 320934 316768 312205 307473 303026 298985 295023 290813 286396 282094 278252 275133 272871
61591 272871 271367 270362 269708 269438 269423 269155 268231 267054 266622 267377 268548 268944 268192 266851 265477 264045 262354
$$ packed form
61699D41438l472l287l568m143m517m316l677l154l154l443l367k636j788j604
61685C95312k182k851l086l090l260l503l520l428l455l333k689j962k004k648
61671C54301k649j457j80r1r42j551j509j303j138o93k7K61l3m02m09j54K14P77
61653C43015J374J521J164R98J590K573L142L034K691K631K970L500L900L915
61639C78018L518K810J886Q49Rl93n92j214k538m132n326n833n790n405m786l929
61623C47152k806j548n33o0j4o4j58m05o37m92j34k15r47j703j913j875k237k989
61605C28422l601l887m166m563m732m447m041l962m210m417m302l842l119k262
61591B72871j504j005o54k70j5k68r24j177m32P55J171L96p52j341j374j432j691
$$ plain form
61574 262354 260576 259210 258653 258920 259626 260232 260528 260790 261252 261517 260942 259545 258113 257282 256983 256900 257011 257435
61556 257435 258186 259326 260947 262779 264288 265443 266862 268830 270659 271582 271818 272121 272686 273253 273982 275279
61540 275279 276769 277330 276468 275009 274123 274183 274868 275884 277181 278750 280620 282856 285233 287074 287770 287409
61524 287409 286643 285907 285051 283790 282313 281166 280581 280227 279769 279427 279645 280301 280692 280396 279738 279236 278901 278377
61506 278377 277533 276624 276071 276255 277296 278779 279950 280429 280464 280291 279688 278508 277228 276421 276011 275600 275233
61489 275233 275214 275364 275210 274846 274899 275615 276635 277721 278988 280300 281162 281514 281965 282866 283688 283758 283182 282586
61471 282586 282331 282425 282914 283801 284666 284866 284261 283483 283388 284337 285993 287735 289222 290560 291945 293261 294167
61454 294167 294516 294530 294590 294983 295734 296557 297101 297405 297884 298703 299485 299971 300595 301853 303443 304697 305663 306950
$$ packed form
61574B62354j778j366n57K67P06O06K96K62M62K65n75j397j432q31k99q3J11M24
61556B57435P51J140J621J832J509J155J419J968J829R23K36L03N65N67P29J297
61540B75279J490N61q62j459q86O0O85J016J297J569J870K236K377J841O96l61
61524B87409p66p36q56j261j477j147n85l54m58l42K18O56L91k96o58n02l35n24
61506B78377q44r09n53J84J041J483J171M79L5j73o03j180j280q07m10m11l67
61489B75233j9J50j54l64N3P16J020J086J267J312Q62L52M51R01Q22P0n76n96
61471B82586k55R4M89Q87Q65K00o05p78r5R49J656J742J487J338J385J316R06
61454B94167L49J4O0L93P51Q23N44L04M79Q19P82M86O24J258J590J254R66J287
$$ plain form
61436 306950 308626 310171 311618 313782 317014 320560 323634 326406 329420 332646 335720 338597 341319 343572
61422 343572 345084 346164 347223 348089 348438 348622 349317 350443 351194 351203 351055 351392 351994 352029 350998 349161 347114
61405 347114 345131 342968 340346 337452 334694 332030 329013 325658 322764 320998 320065 319283 318655 318825 320095
61390 320095 322018 323868 325079 325312 324615 323561 322821 322570 322627 323046 324125 325804 327566 329017 330156 331025
61374 331025 331563 332003 332964 334789 337052 338985 340323 341494 343088 345220 347371 348863 349641 350542 352545
61359 352545 355748 359343 362644 365823 369535 374107 379349 384980 391045 397959 406146 415451 424855 433006
61345 433006 439202 443677 446945 449257 450882 452525 454904 458027 461278 464222 466857 469041 470158 469741
61331 469741 468172 466367 464771 462951 460217 456397 451918 447408 443415 440341 438323 437179 436655 436760 437688
$$ packed form
61436C06950J676J545J447K164L232L546L074K772L014L226L074K877K722K253
61422C43572J512J080J059Q66L49J84O95J126P51Rj48L37O02L5j031j837k047
61405C47114j983k163k622k894k758k664l017l355k894j766r33p82o28J70J270
61390C20095J923J850J211K33o97j054p40k51N7M19J079J679J762J451J139Q69
61374C31025N38M40R61J825K263J933J338J171J594K132K151J492P78R01K003
61359C52545L203L595L301L179L712M572N242N631O065O914Q187R305R404Q151
61345D33006O196M475L268K312J625J643K379L123L251K944K635K184J117m17
61331D69741j569j805j596j820k734l820m479m510l993l074k018j144n24J05R28
$$ plain form
61316 437688 439421 441573 443684 445549 447268 449191 451899 455966 461555 468339 475970 484506 494249 505224
61302 505224 516920 528411 538608 546667 552424 556366 558931 559936 559034 556686 554167 552341 550692 547974
61288 547974 543716 538738 534069 529710 524779 518760 512221 506139 500874 496159 491939 488730 486985 486516
61274 486516 486825 487797 489664 492395 495429 498089 500068 501513 502888 504807 507748 511733 516367 521314 526733
61259 526733 533158 540941 549810 558856 566950 573323 577952 581433 584404 587038 589081 590297 590748 590516 589320
61244 589320 586729 582849 578480 574338 570278 565630 560259 554924 550461 546933 543716 540174 536093 531775
61230 531775 527975 525543 524801 525294 526342 527688 529433 531578 533985 536627 539497 542347 545024 548108 552683
61215 552683 559259 567180 575334 583087 590298 596758 602088 606075 608725 610054 610278 610258 611311 614282 618961
$$ packed form
61316D37688J733K152K111J865J719J923K708M067N589O784P631Q536R743J0975
61302E05224J1696J1491J0197Q059N757L942K565J005r02k348k519j826j649k718
61288E47974m258m978m669m359m931o019o539o082n265m715m220l209j745m69
61274D86516L09R72J867K731L034K660J979J445J375J919K941L985M634M947N419
61259E26733O425P783Q869R046Q094O373M629L481K971K634K043J216M51k32j196
61244E89320k591l880m369m142m060m648n371n335m463l528l217l542m081m318
61230E31775l800k432p42M93J048J346J745K145K407K642K870K850K677L084M575
61215E52683O576P921Q154P753P211O460N330L987K650J329K24k0J053K971M679
$$ plain form
61200 618961 624619 630988 638548 647984 659577 673104 688107 704247 721417 739436 757489 774030
61188 774030 787579 797710 805046 810349 813940 816130 817691 819397 821129 821828 820390 816514 810701 803683
61174 803683 795864 787175 777499 767284 757502 748687 740194 730810 720071 708558 696877 684882 672158
61161 672158 658848 645563 632694 620193 608018 596489 586146 577410 570377 564882 560793 558270
61149 558270 557495 558079 558922 558914 557640 555180 551421 545973 538872 530932 523149 515862 508792 501891 495877 491756
61133 491756 489928 489975 491262 493453 496389 499883 504023 509492 517121 527070 538777 551757 566106 582058
61119 582058 599373 617459 635976 655131 675474 697497 721245 746154 771323 796025 819929
61108 819929 842827 864442 884577 903241 920464 936059 949654 960783 968898 973458 974199 971233
$$ packed form
61200F18961N658O369P560R436J1593J3527J5003J6140J7170J8019J8053J6541
61188G74030J3549J0131P336N303L591K190J561J706J732O99j438l876n813p018
61174H03683p819q689r676j0215r782q815q493r384j0739j1513j1681j1995j2724
61161F72158j3310j3285j2869j2501j2175j1529j0343q736p033n495m089k523
61149E58270p75N84Q43qj274k460l759n448p101p940p783p287p070o901o014m121
61133D91756j828M7J287K191K936L494M140N469P629R949J1707J2980J4349J5952
61119E82058J7315J8086J8517J9155K0343K2023K3748K4909K5169K4702K3904
61108H19929K2898K1615K0135J8664J7223J5595J3595J1129Q115M560P41k966
$$ plain form
61096 971233 964889 955592 943876 930227 914835 897704 879044 859256 838512 816775 794391 772235
61084 772235 751005 730750 711413 693474 677599 663876 651813 640875 630651 620706 610912 601922
61072 601922 594800 590001 587015 585099 584062 584184 585714 588655 592928 598476 605164 612653 620496 628456
61058 628456 636723 645661 655252 665042 674825 685178 697035 710827 726332 743276 761704 781704
61046 781704 803129 825897 850366 877030 905810 935982 967066 999562 1034390 1071686 1110660
61035 1110660 1150875 1193033 1238027 1285622 1334718 1384547 1434824 1485007 1534583 1584394 1636765
61024 1636765 1693908 1756895 1826506 1904107 1990986 2087459 2193464 2309764 2438312 2582308
61014 2582308 2746817 2939132 3168166 3444066 3778660 4185021 4675718 5263089 5963344
$$ packed form
61096I71233o344r297j1716j3649j5392j7131j8660j9788k0744k1737k2384k2156
61084G72235k1230k0255j9337j7939j5875j3723j2063j0938j0224r945r794q990
61072F01922p122m799k986j916j037J22J530K941M273N548O688P489P843P960
61058F28456Q267Q938R591R790R783J0353J1857J3792J5505J6944J8428K0000
61046G81704K1425K2768K4469K6664K8780L0172L1084L2496L4828L7296L8974
61035A110660M0215M2158M4994M7595M9096M9829N0277N0183M9576M9811N2371
61024A636765N7143O2987O9611P7601Q6879R6473J06005J16300J28548J43996
61014B582308J64509J92315K29034K75900L34594M06361M90697N87371P00255
$$ plain form
61005 5963344 6800466 7805995 9016696 10469676 12182454 14108893 16094986 17887613
60997 17887613 19223682 19954275 20114636 19892472 19533240 19256536 19212222 19449453 19881885
60988 19881885 20285275 20371660 19919153 18872348 17346029 15545905 13676003 11886179 10263357
60979 10263357 8843950 7630768 6608492 5754499 5043961 4452412 3958648 3546378 3202683
60970 3202683 2915543 2673537 2466994 2288262 2131322 1992017 1868056 1757661 1658343 1567672
60960 1567672 1484844 1410490 1345052 1288041 1238617 1195849 1158197 1123425 1089473 1055328 1021131
60949 1021131 987726 956054 926607 899403 874471 852054 832101 813960 796906 780639 764928
60938 764928 749181 733011 716858 701324 686022 669908 652844 636107 621013 607604 594991
$$ packed form
61005E963344Q37122J005529J210701J452980J712778J926439J986093J792627
60997A7887613J336069P30593J60361k22164l59232k76704m4314K37231M32432
60988A9881885M03390Q6385m52507j046805j526319j800124j869902j789824j622822
60979A0263357j419407j213182j022276q53993p10538n91549m93764m12270l43695
60970C202683k87140k42006k06543j78732j56940j39305j23961j10395r9318r0671
60960A567672q2828p4354o5438n7011m9424m2768l7652l4772l3952l4145l4197
60949A021131l3405l1672k9447k7204k4932k2417j9953j8141j7054j6267j5711
60938G64928j5747j6170j6153j5534j5302j6114j7064j6737j5094j3409j2613
$$ plain form
60927 594991 582558 570393 558863 548342 539226 531750 525633 520223 515185 510797 507381 504654 502020
60914 502020 499411 497423 496478 496303 496491 497201 498813 501075 503149 504555 505635 507003 508850 510884 512688
60899 512688 514026 515000 515941 516980 517835 518184 517977 517127 515246 512232 508825 505920 503451 500645 497192 493292
60883 493292 488612 482291 474300 465843 457951 450539 443315 436689 430987 425487 419194 412252 405821 400790
60869 400790 397211 394701 392764 390950 389295 388437 388821 390055 391434 392713 393847 394454 394264 393813 393928 394712
60853 394712 395671 396621 397683 398598 398942 399057 399902 401766 403845 405382 406619 408281 410571 412972 414740 415325
60837 415325 414567 412717 410220 407490 404964 403128 402142 401594 400943 400067 399032 397611 395619 393572 392283
60822 392283 391752 391145 390033 389007 388698 388679 387794 385363 381802 378185 375318 373124 370787 367647 363948 360585
$$ packed form
60927E94991j2433j2165j1530j0521r116p476o117n410n038m388l416k727k634
60914E02020k609j988r45j75J88P10J612K262K074J406J080J368J847K034J804
60899E12688J338R74R41J039Q55L49k07q50j881l014l407k905k469k806l453l900
60883D93292m680o321p991q457p892p412p224o626n702n500o293o942o431n031
60869D00790l579k510j937j814j655q58L84J234J379J279J134O07j90m51J15P84
60853C94712R59R50J062R15L44J15Q45J864K079J537J237J662K290K401J768N85
60837D15325p58j850k497k730k526j836r86n48o51q76j035j421j992k047j289
60822C92283n31o07j112j026l09j9q85k431l561l617k867k194k337l140l699l363
$$ plain form
60806 360585 358214 356799 355851 354722 352778 349766 346062 342276 338661 335270 332453 330556 329105 327014
60792 327014 323894 320564 317967 316091 314374 312705 311452 310722 310156 309440 308651 308029 307646 307427 307363 307647 308513
60775 308513 309966 311763 313810 316370 319585 322956 325775 328114 330886 334729 339241 343584 347452 351044
60761 351044 354401 357235 359333 360781 361751 362387 362872 363294 363336 362424 360399 357948 356155 355603 356050 356888 357718
60744 357718 358357 358554 358040 356816 355042 352575 348896 343709 337359 330518 323634 316932 310719 305382 301152
60729 301152 298090 296103 294772 293389 291531 289493 287791 286358 284730 282971 281921 282258 283600 284765
60715 284765 284833 283864 282700 282110 282073 281943 281358 280815 281158 282691 285004 287517 289880 292007 294056 296345 299005
60698 299005 301796 304482 307209 310132 312864 314833 316134 317555 319656 322253 324906 327488 330100 332720
$$ packed form
60806C60585k371j415r48j129j944l012l704l786l615l391k817j897j451k091
60792C27014l120l330k597j876j717j669j253p30n66p16p89o22l83k19o4K84Q66
60775C08513J453J797K047K560L215L371K819K339K772L843M512M343L868L592
60761C51044L357K834K098J448R70O36M85M22M2r12k025k451j793n52M47Q38Q30
60744C57718O39J97n14j224j774k467l679n187o350o841o884o702o213n337m230
60729C01152l062j987j331j383j858k038j702j433j628j759j050L37J342J165
60715B84765O8r69j164n90l7j30n85n43L43J533K313K513K363K127K049K289K660
60698B99005K791K686K727K923K732J969J301J421K101K597K653K582K612K620
$$ plain form
60684 332720 335166 337318 339334 341663 344612 347734 349947 350608 350224 349696 349245 348648 348143 348140 348126 346858 343885
60667 343885 340070 336342 332765 329216 326120 323807 321741 319134 316058 313365 311685 310969 310882 311244 312183
60652 312183 314072 317138 320927 324440 327025 328877 330529 332212 333922 335576 336733 336598 334799 331900
60638 331900 328732 325512 322051 318469 315166 312278 309700 307488 305762 304380 303196 302547 302974 304439 306274
60623 306274 307915 309298 310503 311423 311928 312051 311923 311695 311562 311675 312014 312439 312794 312869 312489 311873 311650 312117
60605 312117 312684 312501 311554 310667 310361 310225 309637 308742 308384 309246 311296 313999 316812 319395 321483 322766 323106
60588 323106 322849 322687 323009 323494 323489 322724 321563 320691 320730 321959 324157 326704 329054 331171 333439 336278 339973
60571 339973 344739 350678 357668 365454 373862 382894 392695 403448 415093 426940 437689 445978 450917
$$ packed form
60684C32720K446K152K016K329K949L122K213O61l84n28m51n97n05lj4j268k973
60667C43885l815l728l577l549l096k313k066k607l076k693j680p16q7L62R39
60652C12183J889L066L789L513K585J852J652J683J710J654J157j35j799k899
60638C31900l168l220l461l582l303k888k578k212j726j382j184o49M27J465J835
60623C06274J641J383J205R20N05J23j28k28j33J13L39M25L55P5l80o16k23M67
60605C12117N67j83r47q87l06j36n88q95l58Q62K050K703K813K583K088J283L40
60588C23106k57j62L22M85np65j161q72L9J229K198K547K350K117K268K839L695
60571C39973M766N939O990P786Q408R032R801J0753J1645J1847J0749Q289M939
$$ plain form
60558 450917 452158 449853 444825 438485 432175 426637 422183 419073 417316 416491 416331 417374 420453 425543 431711
60543 431711 438347 445824 454689 464805 475763 487810 501730 517837 535472 553389 570194 584387
60531 584387 594514 599737 600275 597150 591548 584451 576702 569096 562209 556132 550467 544746 538918 533438
60517 533438 528815 525195 522503 520876 520575 521401 522607 523731 525273 528122 532533 538240 545533 555447 568684
60502 568684 584986 604056 626559 653611 685612 722122 762566 806384 852655 900300 948561
60491 948561 996582 1042360 1082674 1114195 1134368 1141491 1134791 1114748 1082856 1040900 990911 935733
60479 935733 878797 822940 769861 720733 676571 637644 603302 572854 546126 522845 502191
60468 502191 483518 466961 452716 440241 428820 418491 409763 402696 396871 391981 387921 384485 381458
$$ packed form
60558D50917J241k305n028o340o310n538m454l110j757q25j60J043L079N090O168
60543D31711O636P477Q865J0116J0958J2047J3920J6107J7635J7917J6805J4193
60531E84387J0127N223N38l125n602p097p749p606o887o077n665n721n828n480
60517E33438m623l620k692j627l01Q26J206J124J542K849M411N707P293R914J3237
60502E68684J6302J9070K2503K7052L2001L6510M0444M3818M6271M7645M8261
60491I48561M8021M5778M0314L1521K0173P123o700k0043l1892m1956m9989n5178
60479I35733n6936n5857n3079m9128m4162l8927l4342l0448k6728k3281k0654
60468E02191j8673j6557j4245j2475j1421j0329q728p067n825m890m060l436l027
$$ plain form
60455 381458 378765 376136 372996 369152 365223 361848 358888 355956 353261 351236 349710 348237 346889 345953
60441 345953 345144 344044 343090 343122 343946 344298 343347 341443 339305 337272 335506 334124 332839 331099 328814 326477
60425 326477 324588 323492 323721 325630 328580 331295 333201 334688 336031 337007 337827 339307 341573 343447 343856
60410 343856 343142 342403 342153 342309 342865 343772 344577 344993 345525 346865 348891 350900 352592 354217 355918 357630
60394 357630 359531 361930 364575 366597 367382 367299 367488 368989 371952 375497 378448 380292 381261 381588 381221 380458
60378 380458 380226 381199 383039 384998 386897 389006 391313 393574 395833 398254 400587 402439 403946 405559 407236
60363 407236 408538 409495 410662 412178 413506 414425 415763 418733 423828 430629 438343 446252 453914 461293 468521
60348 468521 475316 480723 483689 483888 481918 478750 475006 470660 465404 459337 453203 447829 443457 439823
$$ packed form
60455C81458k693k629l140l844l929l375k960k932k695k025j526j473j348r36
60441C45953q09j100r54L2Q24L52r51j904k138k033j766j382j285j740k285k337
60425C26477j889j096K29J909K950K715J906J487J343R76Q20J480K266J874M09
60410C43856p14p39k50J56N56R07Q05M16N32J340K026K009J692J625J701J712
60394C57630J901K399K645K022P85q3J89J501K963L545K951J844R69L27l67p63
60378C80458k32R73J840J959J899K109K307K261K259K421K333J852J507J613J677
60363D07236J302R57J167J516J328R19J338K970N095O801P714P909P662P379P228
60348D68521O795N407K966J99j970l168l744m346n256o067o134n374m372l634
$$ plain form
60334 439823 436720 434160 432110 430465 429229 428280 426953 424380 420474 416197 412631 410120 408420 407246
60320 407246 406325 405292 404035 403040 403033 404330 406814 410405 415263 421569 429333 438383 448368 458848 469516
60305 469516 480273 491027 501671 512299 523028 533245 541445 546366 548014 546934 542742 534296 521525
60292 521525 506288 491009 477011 464558 453793 444929 437837 432181 427854 424760 422378 420063 417686
60279 417686 415371 412773 409339 405304 401716 399194 397315 395510 393903 392836 392067 391059 389734 388406
60265 388406 387162 385880 384718 384048 383901 383891 383753 383609 383640 383810 383967 383994 383841 383605 383601 384148 385315 386956 388894
60246 388894 390909 392740 394294 395672 396766 397173 396896 396798 397732 399386 400638 401058 401372 402294 403617 404786
60230 404786 405802 407096 408877 411005 413226 415161 416364 416791 417044 417828 419298 421167 423231 425450 427755
$$ packed form
60334D39823l103k560k050j645j236r49j327k573l906m277l566k511j700j174
60320D07246r21j033j257r95pJ297K484L591M858O306P764R050R985J0480J0668
60305D69516J0757J0754J0644J0628J0729J0217Q200M921J648j080m192q446j2771
60292E21525j5237j5279j3998j2453j0765q864p092n656m327l094k382k315k377
60279D17686k315k598l434m035l588k522j879j805j607j067p69j008j325j328
60265C88406j244j282j162o70j47j0j38j44L1J70J57K7j53k36mN47J167J641J938
60246C88894K015J831J554J378J094M07k77r8R34J654J252M20L14R22J323J169
60230D04786J016J294J781K128K221J935J203M27K53P84J470J869K064K219K305
$$ plain form
60215 427755 430152 432923 436395 440554 445147 450096 455537 461506 467806 474144 480220 485846 491196 496783
60201 496783 502840 508768 513533 516650 518571 520174 522137 524712 527691 530440 532260 532909 532606 531503 529373
60186 529373 525971 521550 516838 512607 509263 506630 503987 500504 495939 490914 486327 482535 479265 476275
60172 476275 473819 472341 471854 471846 471695 471091 470137 469273 469036 469589 470367 470419 469313 467592 466189 465578 465659 466234
60154 466234 467192 468284 469140 469672 470268 471437 473293 475364 476781 476861 475815 474847 475200 477084 479832 482995
60138 482995 486762 491297 496341 501822 508225 515761 523503 530041 534894 538719 542163 545104 547151 548415
60124 548415 549431 550523 551515 551968 551611 550636 549648 549215 549395 549753 549801 549323 548322 546913 545350 543958 542815
60107 542815 541551 539620 536819 533553 530542 528210 526345 524347 521793 518731 515516 512557 510260 508947
$$ packed form
60215D27755K397K771L472M159M593M949N441N969O300O338O076N626N350N587
60201D96783O057N928M765L117J921J603J963K575K979K749J820O49l03j103k130
60186E29373l402m421m712m231l344k633k643l483m565n025m587l792l270k990
60172D76275k456j478m87qj51o04r54q64k37N53P78N2j106j721j403o11Q1N75
60154D66234R58J092Q56N32N96J169J856K071J417Q0j046r68L53J884K748L163
60138D82995L767M535N044N481O403P536P742O538M853L825L444K941K047J264
60124E48415J016J092R92M53l57r75r88m33J80L58M8m78j001j409j563j392j143
60107E42815j264j931k801l266l011k332j865j998k554l062l215k959k297j313
$$ plain form
60093 508947 508608 508825 509165 509564 510151 510829 511315 511617 512116 513009 513882 514110 513643 513174 513435 514442 515526 516016
60075 516016 515783 515146 514401 513514 512137 509805 506208 501428 495900 490004 483797 477314 470989 465418 460628
60060 460628 455897 450536 444660 439016 434191 430195 426704 423522 420807 418975 418302 418594 419397 420645 422906
60045 422906 426768 432099 438070 443831 448957 453378 457204 460650 463890 466891 469475 471506 472868 473290
60031 473290 472497 470671 468543 466818 465514 463985 461548 457993 453537 448547 443444 438669 434423 430360
60017 430360 425816 420481 414632 408617 402384 395842 389437 383896 379433 375616 372101 369098 366958 365642
60003 365642 364801 364142 363540 363028 362840 363272 364337 365719 367121 368477 369733 370754 371520 372196 372914 373803 375230
59986 375230 377518 380232 382292 383189 383695 384918 386950 388832 389591 388924 387176 385146 383671 382922 382223 380916
$$ packed form
60093E08947l39K17L40L99N87O78M86L02M99Q93Q73K28m67m69K61J007J084M90
60075E16016k33o37p45q87j377k332l597m780n528n896o207o483o325n571m790
60060D60628m731n361n876n644m825l996l491l182k715j832o73K92Q03J248K261
60045D22906L862N331N971N761N126M421L826L446L240L001K584K031J362M22
60031D73290p93j826k128j725j304j529k437l555m456m990n103m775m246m063
60017D30360m544n335n849o015o233o542o405n541m463l817l515l003k140j316
60003C65642q41o59o02n12j88M32J065J382J402J356J256J021P66O76P18Q89J427
59986C75230K288K714K060Q97N06J223K032J882P59o67j748k030j475p49o99j307
$$ plain form
59970 380916 379193 377703 376707 376195 376502 378010 380275 382197 383198 383684 384297 385282 386699 388624 390849 392825
59954 392825 394145 394816 394997 394870 394798 395083 395391 394929 393402 391387 389532 387845 386051 384234 382742 381732
59938 381732 381052 380356 379178 377273 375128 373761 373725 374566 375489 376204 376861 377567 378466 380023 382763 386754 391606
59921 391606 396844 402105 407220 412306 417457 422085 424936 425234 423603 421492 419921 419183 419395 420661 422770
59906 422770 425310 428189 431572 435328 438959 442149 444922 447188 448622 449143 449122 449014 449102 449717 451242 453657
59890 453657 456457 459259 462186 465437 468878 472369 476193 480771 486157 492144 498646 505549 512381 518601
59876 518601 524147 529214 533515 536293 537198 536653 535127 532501 528564 523758 518925 514533 510599 507340 505272
59861 505272 504479 504197 503488 502133 500684 499860 500165 501914 505256 510151 516537 524424 533393 541976 548063
$$ packed form
59970C80916j723j490r96n12L07J508K265J922J001M86O13R85J417J925K225J976
59954C92825J320O71J81j27p2K85L08m62j527k015j855j687j794j817j492j010
59938C81732o80o96j178j905k145j367l6Q41R23P15O57P06Q99J557K740L991M852
59921C91606N238N261N115N086N151M628K851K98j631k111j571p38K12J266K109
59906D22770K540K879L383L756L631L190K773K266J434N21k1j08Q8O15J525K415
59890D53657K800K802K927L251L441L491L824M578N386N987O502O903O832O220
59876E18601N546N067M301K778R05n45j526k626l937m806m833m392l934l259k068
59861E05272p93k82p09j355j449q24L05J749L342M895O386P887Q969Q583O087
$$ plain form
59846 548063 550391 549573 547446 545513 544275 543830 544435 546084 547856 548148 545737 540539 533469 525776 518494
59831 518494 512213 507154 503386 500931 499559 498656 497610 496365 495294 494453 493330 491524 489274 486970 484440
59816 484440 481239 477427 473471 469395 464687 459196 453492 448065 442755 437422 432728 429575 427905 426669
59802 426669 425008 423063 421626 421290 421996 423066 423622 423232 422218 421235 420616 420315 420301 420622 421127 421480 421543 421438
59784 421438 421269 421086 421102 421532 422105 422193 421577 420754 420219 419892 419555 419497 420224 421712 423458 425259 427417 430023
59766 430023 432479 434034 434687 435283 436746 439387 442918 446933 451183 455476 459491 462911 465761 468564 472071
59751 472071 476764 482573 489019 495605 502051 508222 513986 519265 524187 529027 533995 539129 544369 549556
59737 549556 554388 558599 562215 565362 567782 568939 568777 567993 567207 566253 564772 563192 562370 562350 562198 561228
$$ packed form
59846E48063K328q18k127j933j238m45O05J649J772K92k411n198p070p693p282
59831E18494o281n059l768k455j372r03j046j245j071q41j123j806k250k304k530
59816D84440l201l812l956m076m708n491n704n427n310n333m694l153j670j236
59802D26669j661j945j437l36P06J070N56l90j014r83o19l01j4L21N05L53O3j05
59784D21438j69j83J6M30N73Q8o16q23n35l27l37n8P27J488J746J801K158K606
59766D30023K456J555O53N96J463K641L531M015M250M293M015L420K850K803L507
59751D72071M693N809O446O586O446O171N764N279M922M840M968N134N240N187
59737E49556M832M211L616L147K420J157j62p84p86r54j481j580q22k0j52r70
$$ plain form
59721 561228 559704 558058 556108 553605 551009 549017 547498 545640 543106 540482 538368 536588 534625 532512
59707 532512 530890 530217 530205 530101 529384 528167 526991 526284 526015 525873 525708 525713 526118 526814 527382 527545 527453 527510 527956
59688 527956 528682 529379 529761 529711 529355 528988 528758 528395 527397 525573 523216 520667 517904 514763 511351 507940 504485
59671 504485 500555 495837 490503 485029 479859 475304 471590 468757 466562 464646 462873 461503 461023 461773 463683
59656 463683 466328 469244 472228 475404 478916 482473 485257 486542 486602 486694 487781 489346 489898 488565 485719
59641 485719 482056 477814 473220 469032 465964 463851 461978 460021 458180 456608 455258 454177 453422 452750 451852
59626 451852 450742 449392 447161 443365 438477 434039 431072 429094 426906 423851 420027 415823 411665 407907
59612 407907 404581 401503 398864 397472 398072 400540 403895 406925 408766 409246 408940 408699 408982 409730 410813 412201
$$ packed form
59721E61228j524j646j950k503k596j992j519j858k534k624k114j780j963k113
59707E32512j622o73j2j04p17j217j176p07k69j42j65NM05O96N68J63r2N7M46
59688E27956P26O97L82n0l56l67k30l63r98j824k357k549k763l141l412l411l455
59671E04485l930m718n334n474n170m555l714k833k195j916j773j370m80P50J910
59656D63683K645K916K984L176L512L557K784J285O0R2J087J565N52j333k846
59641D85719l663m242m594m188l068k113j873j957j841j572j350j081p55o72q98
59626D51852j110j350k231l796m888m438k967j978k188l055l824m204m158l758
59612D07907l326l078k639j392O00K468L355L030J841M80l06k41K83P48J083J388
$$ plain form
59596 412201 413670 414837 415706 416768 418371 420335 422346 424303 426022 427083 427336 427181 427023 426816 426468 426253
59580 426253 426350 426348 425775 424858 424182 423738 422950 421613 420245 419398 419030 418717 418213 417603 417090 416651 415886 414328 412094
59561 412094 410056 409098 409312 410166 411303 412765 414476 415938 416727 417097 417869 419682 422345 425051 427287 429491
59545 429491 432557 436753 441569 446775 453222 462256 474757 491173 511939 536720 562865 585288 598799
59532 598799 601043 593508 580126 565033 551198 540258 532843 528832 527511 527893 529051 530237 530994 531388
59518 531388 531974 533117 534327 534562 533175 530220 525929 520416 513932 506850 499170 490587 481311 472336 464514
59503 464514 457843 451959 446753 442033 437175 431869 426831 423015 420325 417896 415531 414061 414099 415134 416168
59488 416168 416727 416988 417301 417983 419360 421628 424595 427678 430310 432422 434450 436788 439390 442181 445566
$$ packed form
59596D12201J469J167Q69J062J603J964K011J957J719J061K53j55j58k07l48k15
59580D26253R7kn73r17o76m44p88j337j368q47l68l13n04o10n13m39p65j558k234
59561D12094k038r58K14Q54J137J462J711J462P89L70P72J813K663K706K236K204
59545D29491L066M196M816N206O447R034J2501J6416K0766K4781K6145K2423J3511
59532E98799K244p535j3382j5093j3835j0940p415m011j321L82J158J186P57L94
59518E31388N86J143J210K35j387k955m291n513o484p082p680q583r276q975p822
59503D64514o671n884n206m720m858n306n038l816k690k429k365j470L8J035J034
59488D16168N59K61L13O82J377K268K967L083K632K112K028K338K602K791L385
$$ plain form
59473 445566 449912 454500 457883 459638 461010 463264 466121 468586 470589 472742 474935 476415 477208 478260
59459 478260 479990 481851 483716 486665 491731 498564 505996 513452 521073 528777 535924 541950 546894 551107
59445 551107 554603 556823 557069 555159 551505 546513 540245 532913 525290 518127 511399 504769 498619 493898
59431 493898 490998 489538 489329 490715 493692 497456 501312 505552 511071 518543 528204 539885 553000 567107
59417 567107 582846 601641 624040 649047 675742 704698 736485 768722 795635 811072 812041 799929
59405 799929 779392 756203 735170 719036 708929 705593 709735 720847 735734 748508 752667 744258
59393 744258 724084 697082 669114 643775 621785 602749 586766 574312 565262 558643 553355 548805
59381 548805 544820 541200 537687 534348 531776 530646 531061 532501 534359 536359 538365 540127 541476 542684
$$ packed form
59473D45566M346M588L383J755J372K254K857K465K003K153K193J480P93J052
59459D78260J730J861J865K949N066O833P432P456P621P704P147O026M944M213
59445E51107L496K220K46j910l654m992o268p332p623p163o728o630o150m721
59431D93898k900j460k09J386K977L764L856M240N519P472R661J1681J3115J4107
59417E67107J5739J8795K2399K5007K6695K8956L1787L2237K6913J5437R69j2112
59405G99929k0537k3189k1033j6134j0107l336M142J1112J4887J2774M159q409
59393G44258k0174k7002k7968k5339k1990j9036j5983j2454r050o619n288m550
59381E48805l985l620l513l339k572j130M15J440J858K000K006J762J349J208
$$ plain form
59367 542684 544337 546767 549716 552582 554948 556865 558735 560993 563937 567747 572521 578202 584589 591610
59353 591610 599564 608897 619647 631255 643079 655081 667870 681986 697162 712428 726938 740575
59341 740575 753561 765694 776312 785008 791901 797060 800080 800460 798023 792631 783971 772186 758449
59328 758449 744319 730561 717080 703761 690757 678040 665406 653108 641883 632131 623498 615484
59316 615484 607996 601150 594975 589562 585107 581539 578520 576089 574998 576131 579869 586240 595283 606717
59302 606717 619224 630249 636702 636187 628133 614010 596382 577675 559822 544393 532151 522434
59290 522434 513850 505929 499482 495117 492150 489501 487017 485259 484490 484556 485459 487332 490015 493252 497247
59275 497247 502525 509313 517441 526717 536971 547873 559148 570783 582562 593592 602926 610673 617878
$$ packed form
59367E42684J653K430K949K866K366J917J870K258K944L810M774N681O387P021
59353E91610P954R333J0750J1608J1824J2002J2789J4116J5176J5266J4510J3637
59341G40575J2986J2133J0618Q696O893N159L020L80k437n392q660j1785j3737
59328G58449j4130j3758j3481j3319j3004j2717j2634j2298j1225r752q633q014
59316F15484p488o846o175n413m455l568l019k431j091J133L738O371R043J1434
59302F06717J2507J1025O453n15q054j4123j7628j8707j7853j5429j2242r717
59290E22434q584p921o447m365k967k649k484j758p69O6R03J873K683L237L995
59275D97247N278O788Q128R276J0254J0902J1275J1635J1779J1030R334P747P205
$$ plain form
59262 617878 625144 631831 636804 639569 640378 639581 637246 633369 628197 622257 616091 609972 603923 597998 592416
59247 592416 587343 582726 578581 575298 573462 573309 574545 576691 579505 583113 587798 593592 599947 605937
59233 605937 610925 614994 618618 622027 625056 627452 629005 629334 627789 623858 617717 610294 602606 595020
59219 595020 587269 579174 571042 563182 555416 547479 539722 532857 527076 521960 517261 513170 509720 506579
59205 506579 503691 501465 499939 498263 495608 492267 489392 487842 487648 488294 489081 489439 489367 489485 490324 491717
59189 491717 493193 494727 496746 499559 503116 507187 511446 515533 519371 523329 527811 532834 538162 543625
59175 543625 549019 554026 558568 563031 567792 572777 577784 582930 588337 593663 598384 602361 605721 608417
59161 608417 610372 611756 612633 612513 610777 607367 602573 596448 589087 581208 573634 566207 558040 548994 540130
$$ packed form
59262F17878P266O687M973K765Q09p97k335l877n172n940o166o119o049n925n582
59247E92416n073m617m145l283j836j53J236K146K814L608M685N794O355N990
59233F05937M988M069L624L409L029K396J553L29j545l931o141p423p688p586
59219E95020p751q095q132p860p766p937p757o865n781n116m699m091l450l141
59205E06579k888k226j526j676k655l341k875j550j94O46P87L58p2J18Q39J393
59189D91717J476J534K019K813L557M071M259M087L838L958M482N023N328N463
59175E43625N394N007M542M463M761M985N007N146N407N326M721L977L360K696
59161F08417J955J384Q77j20j736l410m794o125p361p879p574p427q167r046q864
$$ plain form
59146 540130 532455 525851 519591 513313 507103 501014 494997 489085 483307 477541 471715 466102 461335 458070
59132 458070 456522 456109 455705 454623 453323 452817 453393 454322 454877 455223 456161 458388 462165 467333 473353 479568
59116 479568 485739 492270 499766 508394 517718 527081 536124 545017 554138 563489 572555 580837 588340 595369
59102 595369 602067 608465 614703 620687 625632 628520 629153 628403 627231 625786 623621 620560 617136 614269 612557
59087 612557 611805 611253 610311 608942 607270 605122 602200 598438 593813 588089 581244 574033 567578 562330 557779
59072 557779 553131 547928 542127 536097 530546 526003 522257 518652 514885 511104 507401 503808 500771 498934
59058 498934 498182 497430 495655 492811 489583 486660 484435 482953 481912 480927 479960 479226 478701 478119 477536 477372
59042 477372 477739 478196 478366 478363 478415 478492 478598 478971 479701 480475 481042 481609 482582 484280 487104 491528 497480 504089
$$ packed form
59146E40130p675o604o260o278o210o089o017n912n778n766n826n613m767l265
59132D58070j548m13m04j082j300n06N76R29N55L46R38K227L777N168O020O215
59116D79568O171O531P496Q628R324R363R043Q893R121R351R066Q282P503P029
59102E95369O698O398O238N984M945K888O33p50j172j445k165l061l424k867j712
59087F12557p52n52r42j369j672k148k922l762m625n724o845p211o455n248m551
59072E57779m648n203n801o030n551m543l746l605l767l781l703l593l037j837
59058D98934p52p52j775k844l228k923k225j482j041r85r67p34n25n82n83j64
59042D77372L67M57J70lN2P7J06L73P30P74N67N67R73J698K824M424N952O609
$$ plain form
59024 504089 510569 517211 525145 535224 547374 560765 574282 586999 598543 608965 618043 624898
59012 624898 628598 629003 626777 622721 617403 611390 605448 600307 596304 593334 591235 590298 591237 594452 599382
58997 599382 604888 610237 615326 619962 623518 625680 627048 628525 630268 631638 632061 631576 630532 629104 627150
58982 627150 624420 620896 617084 613907 612131 611886 612858 614901 618294 623322 629756 636999 644818 653705 664151
58967 664151 675622 686791 697020 707100 718084 729712 740625 749904 757703 764436 770113 774575
58955 774575 777637 778712 776953 772184 765246 757077 747800 736982 724355 710007 694355 678373 663391
58942 663391 650159 638319 627193 616850 608038 601341 596745 593712 591278 588406 584828 581413 579253
58929 579253 578447 578194 577920 577826 578340 579443 580627 581205 580675 579033 576755 574315 571850 569498 567802 567254
$$ packed form
59024E04089O480O642P934J0079J2150J3391J3517J2717J1544J0422R078O855
59012F24898L700M05k226m056n318o013n942n141m003k970k099r37R39L215M930
58997E99382N506N349N089M636L556K162J368J477J743J370M23m85j044j428j954
58982F27150k730l524l812l177j776k45R72K043L393N028O434P243P819Q887J0446
58967F64151J1471J1169J0229J0080J0984J1628J0913R279P799O733N677M462
58955G74575L062J075j759m769o938q169r277j0818j2627j4348j5652j5982j4982
58942F63391j3232j1840j1126j0343q812o697m596l033k434k872l578l415k160
58929E79253q06k53k74r4N14J103J184N78n30j642k278k440k465k352j696n48
$$ plain form
58913 567254 567514 567621 567134 566638 566937 568142 569955 572568 576759 583022 590980 599850 609231 619219 629860
58898 629860 640844 651723 662154 671920 681047 690052 699730 710487 722187 734866 749148 765479
58886 765479 783276 801447 819510 837505 854954 870671 883718 893822 900727 903911 903323 899720
58874 899720 893728 885086 873409 859395 844686 830605 817445 804904 792857 781702 772125 764522
58862 764522 758593 753550 748700 743652 738133 732029 725624 719353 713177 706577 699187 691015 682055 672323
58848 672323 662441 653551 646241 640024 634160 628441 622803 616777 609902 602401 594888 587649 580552 573431
58834 573431 566244 559082 552310 546369 541246 536500 532049 528401 525850 524013 522567 521910 522581 524559 527592
58819 527592 531673 536561 541376 545412 548997 552884 557118 561222 565181 569359 573653 577477 580553 582990
$$ packed form
58913E67254K60J07m87m96K99J205J813K613M191O263P958Q870R381R988J0641
58898F29860J0984J0879J0431R766R127R005R678J0757J1700J2679J4282J6331
58886G65479J7797J8171J8063J7995J7449J5717J3047J0104O905L184n88l603
58874H99720n992q642j1677j4014j4709j4081j3160j2541j2047j1155r577p603
58862G64522n929n043m850n048n519o104o405o271o176o600p390q172q960r732
58848F72323r882q890p310o217n864n719n638o026o875p501p513p239p097p121
58834E73431p187p162o772n941n123m746m451l648k551j837j446o57O71J978L033
58819E27592M081M888M815M036L585L887M234M104L959M178M294L824L076K437
$$ plain form
58805 582990 584626 584955 583775 581363 578125 574517 571197 568574 566241 563367 559593 554996 549422 542643
58791 542643 535218 528458 523296 519644 516916 514715 512914 511648 511373 512449 514556 516881 519001 521204
58777 521204 523878 527048 530577 534363 538103 541158 542806 542483 539854 534982 528458 521096 513442 505719
58763 505719 498074 490685 483836 478152 474455 472949 472866 473380 474589 476979 480242 483409 486021 488336 490385
58748 490385 491696 492195 492612 493623 495117 496667 498277 500322 503098 506721 511172 516152 521107 525635 529775
58733 529775 533882 538393 543683 549907 556877 564225 571562 578390 584177 588843 592946 596985 600862 604437
58719 604437 608217 612789 617891 622924 628227 634840 642877 651111 658488 665221 671878 678139 683061 686110
58705 686110 687319 686668 683861 678672 671183 661636 650182 636761 621318 604282 586680 569522 553271
$$ packed form
58805E82990J636L29j180k412l238l608l320k623k333k874l774m597n574o779
58791E42643p425o760n162l652k728k201j801j266k75J076K107K325K120K203
58777E21204K674L170L529L786L740L055J648l23k629m872o524p362p654p723
58763E05719p645p389o849n684l697j506q3N14J209K390L263L167K612K315K049
58748D90385J311M99M17J011J494J550J610K045K776L623M451M980M955M528M140
58733E29775M107M511N290O224O970P348P337O828N787M666M103M039L877L575
58719F04437L780M572N102N033N303O613Q037Q234P377O733O657O261M922L049
58705F86110J209o51k807n189p489r547j1454j3421j5443j7036j7602j7158j6251
$$ plain form
58692 553271 538244 525182 514734 506510 499410 492920 487338 482599 477764 472123 466181 461029 457072
58679 457072 453792 450509 447015 443728 441405 440536 440886 441855 443284 445537 448797 452792 457309 462540 468775
58664 468775 476229 485263 496252 508933 522180 534491 544435 550777 552882 551194 546831 540677 533338
58651 533338 525847 519429 514328 509703 505032 500805 497446 494463 491327 488408 486236 484423 482215 479773
58637 479773 478050 477544 477843 478286 478534 478611 478946 480250 482868 486283 489704 493035 496921 502013 508709 517572
58621 517572 529549 545581 566069 590497 617157 643321 666043 683082 693298 696624 694013 687170
58609 687170 677894 667529 656989 646966 637862 629660 622172 615450 609887 605971 603814 602693 601162
58596 601162 598099 593674 588931 584437 579955 575478 571769 569481 568422 568250 569355 572359 577132 582958
$$ packed form
58692E53271j5027j3062j0448q224p100o490n582m739m835n641n942n152l957
58679D57072l280l283l494l287k323q69L50R69J429K253L260L995M517N231O235
58664D68775P454R034J0989J2681J3247J2311R944O342K105j688m363o154p339
58651E33338p491o418n101m625m671m227l359k983l136k919k172j813k208k442
58637D79773j723n06K99M43K48P7L35J304K618L415L421L331L886N092O696Q863
58621E17572J1977J6032K0488K4428K6660K6164K2722J7039J0216L326k611o843
58609F87170r276j0365j0540j0023r104q202p488o722n563l916k157j121j531
58596F01162l063m425m743m494m482m477l709k288j059j72J105L004M773N826
$$ plain form
58582 582958 589466 596775 604864 613385 622081 630900 639626 647707 654548 659915 664265 668743 674493 681614
58568 681614 689120 696316 703917 713436 725827 741144 759142 779453 801303 823853 846923 870742
58556 870742 894735 917027 935524 949247 958465 963835 965760 964489 960523 954751 948185 941564 935168
58543 935168 928900 922410 915174 906598 896125 883269 867754 849922 830884 811880 793435 775525
58531 775525 758561 743613 731374 721398 712869 705788 700801 697950 696183 694334 692146 690050 688142
58518 688142 685826 682603 678890 675628 673068 670390 666778 662535 658717 655896 653685 651302 648159 644075
58504 644075 639450 635215 632101 629994 628390 627313 627156 627745 628342 628655 629061 629741 630403 631116 632575 635095
58488 635095 638017 640600 642962 645690 649144 653623 659696 667756 677562 688649 700846 714045 727885
$$ packed form
58582E82958O508P309Q089Q521Q696Q819Q726Q081O841N367M350M478N750P121
58568F81614P506P196P601R519J2391J5317J7998K0311K1850K2550K3070K3819
58556H70742K3993K2292J8497J3723R218N370J925j271l966n772o566o621o396
58543I35168o268o490p236q576j0473j2856j5515j7832j9038j9004j8445j7910
58531G75525j6964j4948j2239r976q529p081m987k851j767j849k188k096j908
58518F88142k316l223l713l262k560k678l612m243l818k821k211k383l143m084
58504F44075m625m235l114k107j604j077j57N89N97L13M06O80O62P13J459K520
58488F35095K922K583K362K728L454M479O073Q060R806J1087J2197J3199J3840
$$ plain form
58475 727885 742001 756153 769780 781851 791464 798137 801324 800418 795740 788860 781333 773556 765381
58462 765381 757206 749823 743732 739323 737211 737625 739892 743364 748500 756139 765948 776469 786565 795875
58448 795875 803851 809363 811678 811242 809081 805739 801133 795274 788908 783365 779752 778228 778126 778679 779399
58433 779399 779996 780519 781699 784431 788623 793068 796852 800355 804506 809613 815341 821267 826855 831415 834767
58418 834767 837587 840449 842748 843160 840917 836182 829477 821400 812687 803998 795627 787722 780536 774202
58404 774202 768547 763468 759194 755949 753793 753034 754267 757557 762053 766767 771273 775384 778846 781791
58390 781791 784815 788071 790993 793397 796052 799567 803603 808006 813776 821799 831318 840849 850059 859538
58376 859538 869134 877926 885712 893244 900890 908184 914922 921862 929976 939552 950093 960675 970457 979363
$$ packed form
58475G27885J4116J4152J3627J2071R613O673L187r06m678o880p527p777q175
58462G65381q175p383o091m409k112M14K267L472N136P639R809J0521J0096R310
58448G95875P976N512K315m36k161l342m606n859o366n543l613j524j02N53P20
58433G79399N97N23J180K732M192M445L784L503M151N107N728N926N588M560L352
58418H34767K820K862K299M12k243m735o705q077q713q689q371p905p186o334
58404G74202n655n079m274l245k156p59J233L290M496M714M506M111L462K945
58390G81791L024L256K922K404K655L515M036M403N770Q023R519R531R210R479
58376H59538R596Q792P786P532P646P294O738O940Q114R576J0541J0582R782Q906
$$ plain form
58362 979363 988170 997580 1007510 1017638 1028126 1039072 1049723 1059125 1067321 1075100 1082636 1089068 1093436
58349 1093436 1095566 1096238 1096885 1098798 1102183 1106255 1110510 1115373 1121352 1128383 1136545 1146505 1158595 1172250
58335 1172250 1187083 1203555 1221665 1240001 1257266 1273922 1291106 1308571 1324967 1339487 1351973
58324 1351973 1361953 1369069 1374129 1378516 1382752 1386647 1390403 1394466 1398786 1403332 1408837 1416008 1424549 1433998
58310 1433998 1444750 1457056 1469910 1482395 1495379 1510262 1526785 1543708 1560967 1579385 1598795
58299 1598795 1618323 1638067 1658672 1679572 1699526 1718594 1737849 1757492 1777037 1796962 1818217
58288 1818217 1840454 1862716 1885589 1910558 1937495 1965024 1993224 2023668 2056721 2091079 2126162
58277 2126162 2162680 2200583 2238722 2276994 2316586 2357583 2398506 2439012 2481139 2527058 2577065
$$ packed form
58362I79363Q807R410R930J0128J0488J0946J0651R402Q196P779P536O432M368
58349A093436K130O72O47J913L385M072M255M863N979P031Q162R960J2090J3655
58335A172250J4833J6472J8110J8336J7265J6656J7184J7465J6396J4520J2486
58324A351973R980P116N060M387M236L895L756M063M320M546N505P171Q541R449
58310A433998J0752J2306J2854J2485J2984J4883J6523J6923J7259J8418J9410
58299A598795J9528J9744K0605K0900J9954J9068J9255J9643J9545J9925K1255
58288A818217K2237K2262K2873K4969K6937K7529K8200L0444L3053L4358L5083
58277B126162L6518L7903L8139L8272L9592M0997M0923M0506M2127M5919N0007
$$ plain form
58266 2577065 2630299 2685862 2742851 2800804 2860508 2923013 2987908 3054010 3121488 3191438 3263672
58255 3263672 3337062 3411921 3489831 3571094 3654579 3740124 3828862 3921185 4016615 4115674 4219613
58244 4219613 4328446 4441590 4560220 4686440 4820418 4961022 5108896 5265930 5432149
58235 5432149 5606492 5790419 5987167 6197436 6419507 6653748 6903221 7169607 7452522
58226 7452522 7753359 8075922 8422824 8795194 9196375 9631837 10105087 10617954 11175219
58217 11175219 11784496 12451421 13180062 13978537 14859254 15833469 16911442 18108391 19444221
58208 19444221 20936970 22603664 24469643 26572091 28955676 31673660 34795121 38404373
58200 38404373 42594784 47475667 53192455 59940268 67966722 77574909 89118018 102973579
$$ packed form
58266B577065N3234N5563N6989N7953N9704O2505O4895O6102O7478O9950P2234
58255C263672P3390P4859P7910Q1263Q3485Q5545Q8738R2323R5430R9059J03939
58244D219613J08833J13144J18630J26220J33978J40604J47874J57034J66219
58235E432149J74343J83927J96748K10269K22071K34241K49473K66386K82915
58226G452522L00837L22563L46902L72370M01181M35462M73250N12867N57265
58217A1175219O09277O66925P28641P98475Q80717R74215J077973J196949J335830
58208A9444221J492749J666694J865979K102448K383585K717984L121461L609252
58200C8404373M190411M880883N716788O747813Q026454R608187J1543109J3855561
$$ plain form
58192 102973579 119530436 139234437 162664320 190546234 223641678 262449247 306598635
58185 306598635 353950018 399914985 437891659 461200942 465662743 451189925 421428230
58178 421428230 381932232 338200828 294513978 253641370 217037642 185200037 158032051
58171 158032051 135127665 115946617 99917932 86511701 75275805 65832743 57864955
58164 57864955 51111606 45365090 40455554 36238257 32594760 29433607 26679966 24267452
58156 24267452 22141803 20263787 18601742 17125115 15807928 14631758 13580046 12633785
58148 12633785 11776631 10999655 10296936 9659942 9079244 8547614 8057989 7602051 7174285
58139 7174285 6774514 6403584 6059402 5739440 5443567 5171358 4919499 4684683 4466579
$$ packed form
58192A02973579J6556857J9704001K3429883K7881914L3095444L8807569M4149388
58185C06598635M7351383M5964967L7976674K3309283M461801j4472818k9761695
58178D21428230l9495998m3731404m3686850m0872608l6603728l1837605k7167986
58171A58032051k2904386j9181048j6028685j3406231j1235896r443062p967788
58164E7864955o753349n746516m909536m217297l643497l161153k753641k412514
58156B4267452k125649j878016j662045j476627j317187j176170j051712r46261
58148A2633785q57154p76976p02719o36994n80698n31630m89625m55938m27766
58139G174285l99771l70930l44182l19962k95873k72209k51859k34816k18104
$$ plain form
58130 4466579 4265342 4078643 3903601 3739327 3585276 3439381 3300214 3168933 3046823
58121 3046823 2932721 2824900 2723549 2629386 2541588 2459125 2382435 2311854 2245913 2182958 2122974
58110 2122974 2066135 2011109 1956526 1902742 1850494 1799223 1748317 1698705 1651520 1606298 1562009
58099 1562009 1518822 1477408 1437510 1398561 1360840 1324828 1290303 1257125 1226002 1197511 1171300
58088 1171300 1147072 1125275 1105914 1087816 1069997 1052704 1036190 1019541 1001665 982477 962330
58077 962330 941329 919965 899318 879748 860349 840398 820319 800668 781438 763056 746730
58066 746730 732893 720412 708156 696252 685134 674634 664787 656226 648855 641386 632993 624177 615252
58053 615252 605451 594576 584011 574839 566271 557244 548354 540710 533951 526868 519186 511364 503388 495119
$$ packed form
58130D466579k01237j86699j75042j64274j54051j45895j39167j31281j22110
58121C046823j14102j07821j01351r4163q7798q2463p6690p0581o5941o2955n9984
58110B122974n6839n5026n4583n3784n2248n1271n0906m9612m7185m5222m4289
58099A562009m3187m1414l9898l8949l7721l6012l4525l3178l1123k8491k6211
58088A171300k4228k1797j9361j8098j7819j7293j6514j6649j7876j9188k0147
58077I62330k1001k1364k0647j9570j9399j9951k0079j9651j9230j8382j6326
58066G46730j3837j2481j2256j1904j1118j0500r847q561p371p469q393q816q925
58053F15252r801j0875j0565r172q568r027q890p644o759p083p682p822p976q269
$$ plain form
58039 495119 487193 480264 473831 466923 459486 452164 445294 438963 433395 428359 422871 416303 409129 401856
58025 401856 394110 385637 377163 369259 361320 352873 344964 338930 334508 330469 326504 323150 320417 317831
58011 317831 315501 313923 312982 312237 311814 311969 312145 311591 310639 310240 310505 310773 310947 311650 313059 314526 315476
57994 315476 315967 316400 317198 318622 320376 321646 322014 321935 321801 321084 319065 315961 312592 309343 306093 302731
57978 302731 299053 294617 289348 283835 278496 273068 267509 262597 258831 255573 252227 249507 248360 248321 248189
57963 248189 247842 248115 249217 250527 251786 253312 255173 257150 259296 261492 262711 261869 259274 256174 253050
57948 253050 249457 245417 241699 238654 235914 233430 231841 231636 232833 235547 239945 245552 251519 257728
57934 257728 264801 273007 282016 291715 302086 312074 319729 324016 325635 325595 323791 319553 312951 304917
$$ packed form
58039D95119p926o929o433o908p437p322o870o331n568n036n488o568p174p273
58025D01856p746q473q474p904p939q447p909o034m422m039l965l354k733k586
58011C17831k330j578r41p45m23J55J76n54r52l99K65K68J74P03J409J467R50
57994C15476M91M33P98J424J754J270L68p9j34p17k019l104l369l249l250l362
57978C02731l678m436n269n513n339n428n559m912l766l258l346k720j147l9j32
57963B48189l47K73J102J310J259J526J861J977K146K196J219q42k595l100l124
57948B53050l593m040l718l045k740k484j589k05J197K714M398N607N967O209
57934B57728P073Q206R009R699J0371R988P655M287J619m0j804m238o602q034
$$ plain form
57920 304917 296432 288021 279745 271359 262755 254453 247377 241997 237969 234601 231386 228139 225116 223004
57906 223004 222287 222516 222687 222389 222215 222981 224916 227613 230384 232728 234863 237734 242039 247313 252415 256756
57890 256756 260486 263595 265667 266710 267564 269083 271209 273065 273678 272568 269968 266626 263198 259775 256066
57875 256066 251885 247257 242267 237096 232007 227052 222069 217237 213248 210515 208591 206815 205114 203696
57861 203696 202515 201764 202384 205182 209664 214673 219954 226190 233592 241366 248697 255417 261609 267262 272416
57846 272416 276977 280397 282165 282608 282505 281991 280624 278458 276176 274090 271859 269373 267019 264831 262205
57831 262205 258758 254801 250699 246490 242404 239028 236558 234492 232475 230927 230493 231257 232768 234403 235464
57816 235464 235298 233501 229799 223841 215660 206202 196721 187616 178532 169542 161394 154478 148410 142855
$$ packed form
57920C04917q485q411q276q386q604q302p076n380m028l368l215l247l023k112
57906B23004p17K29J71k98j74P66J935K697K771K344K135K871M305N274N102M341
57890B56756L730L109K072J043Q54J519K126J856O13j110k600l342l428l423l709
57875B56066m181m628m990n171n089m955m983m832l989k733j924j776j701j418
57861B03696j181p51O20K798M482N009N281O236P402P774P331O720O192N653N154
57846B72416M561L420J768M43j03n14j367k166k282k086k231k486k354k188k626
57831B62205l447l957m102m209m086l376k470k066k017j548m34P64J511J635J061
57816B35464j66j797l702n958q181r458r481r105r084q990q148o916o068n555
$$ plain form
57802 142855 137981 133858 130227 127138 125034 123860 122892 121774 120923 120554 120219 119821 120197 122009 124753 127547
57786 127547 130227 132920 135182 136465 137135 138253 140532 144071 148765 154332 160094 165372 169992 174046
57772 174046 177412 179964 181950 183622 184703 184650 183260 180587 176489 170770 163643 155632 147042 137773 127598
57757 127598 116422 104518 92664 81737 72033 63539 57255 55640 60947 73163 90014 108797
57745 108797 127743 145860 162278 176124 186824 194406 199477 202788 204663 205034 204092 202555 201039
57732 201039 199516 197766 196132 195379 195878 197303 199173 201439 204508 208696 213623 218220 221591 223804 225516
57717 225516 226908 227523 227257 226840 226963 227405 227442 226670 224967 222078 217864 212799 207706 203032 198629 194122
57701 194122 189225 183900 178472 173387 168704 164121 159668 155897 152972 150075 146324 142011 138329 136020
$$ packed form
57802A42855m874m123l631l089k104j174r68j118q51l69l35l98L76J812K744K794
57786A27547K680K693K262J283O70J118K279L539M694N567N762N278M620M054
57772A74046L366K552J986J672J081n3j390k673m098n719p127q011q590r269j0175
57757A27598j1176j1904j1854j0927r704q494o284j615N307J2216J6851J8783
57745A08797J8946J8117J6418J3846J0700P582N071L311J875L71r42j537j516
57732B01039j523j750j634p53M99J425J870K266L069M188M927M597L371K213J712
57717B25516J392O15k66m17J23M42L7p72j703k889m214n065n093m674m403m507
57701A94122m897n325n428n085m683m583m453l771k925k897l751m313l682k309
$$ plain form
57687 136020 134836 134234 133964 133922 133990 134211 134899 136392 138889 142566 147677 154433 162870 172845 184299 197704
57671 197704 214232 235224 261480 293426 331938 378243 432162 490223 545402 588773 612204
57660 612204 611344 587529 547014 497752 446371 397309 353277 315368 283158 255749 232898 214712
57648 214712 200535 188958 179011 170729 164366 159571 155580 151873 148385 145273 142694 140752 139519 138992
57634 138992 138894 138656 137890 136897 136299 136074 135507 134362 133484 133689 134550 134891 134214 132912 131294 129215 126755
57617 126755 124583 123341 122991 122944 122545 121392 119485 117252 115262 113866 113181 113262 114086 115417 116896 118206
57601 118206 119039 119084 118222 116576 114249 111202 107631 104168 101462 99675 98511 97414 95617 92515 88404
57586 88404 84509 81904 80624 80064 79772 79443 78678 77384 76073 75201 74459 73253 71573 69789 67922 65795
$$ packed form
57687A36020j184o02k70m2O8K21O88J493K497L677N111O756Q437R975J1454J3405
57671A97704J6528K0992K6256L1946L8512M6305N3919N8061N5179M3371K3431
57660F12204q60k3815m0515m9262n1381m9062m4032l7909l2210k7409k2851j8186
57648B14712j4177j1577r947q282o363m795l991l707l488l112k579j942j233n27
57634A38992r8k38p66r93n98k25n67j145q78K05Q61L41o77j302j618k079k460
57617A26755k172j242l50m7l99j153j907k233j990j396o85Q1Q24J331J479J310
57601A18206Q33M5q62j646k327l047l571l463k706j787j164j097j797l102m111
57586H8404l895k605j280n60k92l29p65j294j311q72p42j206j680j784j867k127
$$ plain form
57570 65795 63670 62039 60929 59985 59043 58003 56441 54133 51756 50257 49610 48995 48093 47342 46886 46254
57554 46254 45312 44703 45010 46056 47338 48604 49810 51032 52545 54470 56314 57471 58243 59631 62026
57539 62026 64817 67508 70381 73747 77318 80699 83857 86723 89044 91055 93676 97500 102114 106909
57525 106909 111975 117658 123815 130206 137265 145733 155629 166109 176232 185471 193655 200821 207025 211984
57511 211984 215060 215917 215029 213285 211236 208871 205789 201376 195146 187271 178559 169643 160503 150983 141322
57496 141322 131759 122033 111855 101688 92566 85186 79482 74906 70738 66314 61430 56530 52217 48659
57482 48659 45745 43577 42379 41996 41854 41432 40540 39274 38043 37513 38092 39388 40446 40601 39889 38723
57466 38723 37426 36161 35048 34184 33577 33078 32414 31391 30121 28905 27832 26676 25238 23558 21676
$$ packed form
57570F5795k125j631j110r44r42j040j562k308k377j499o47o15r02p51m56o32
57554D6254r42o09L07J046J282J266J206J222J513J925J844J157P72J388K395
57539F2026K791K691K873L366L571L381L158K866K321K011K621L824M614M795
57525A06909N066N683O157O391P059Q468R896J0480J0123R239Q184P166O204M959
57511B11984L076Q57q88j744k049k365l082m413o230p875q712q916r140r520r661
57496A41322r563r726j0178j0167r122p380n704m576m168m424m884m900m313l558
57482D8659k914k168j198l83j42m22q92j266j231n30N79J296J058J55p12j166
57466C8723j297j265j113q64o07m99o64j023j270j216j073j156j438j680j882
$$ plain form
57451 21676 19508 17180 15257 14300 14280 14624 14728 14257 13142 11594 10040 8802 7859 7055 6439 6211 6409
57434 6409 6861 7435 8192 9246 10472 11343 11223 10036 8559 7770 7950 8744 9886 11248 12264 12219 11433
57417 11433 11330 12675 14368 14696 13343 11387 9671 8129 6574 5225 4266 3565 3060 2894 2990 2984 2768
57400 2768 2646 2829 3182 3641 4365 5250 5808 5892 6095 6930 7901 7956 6870 5644 5359 6005 6763 7263 8127
57381 8127 10023 12530 14385 14865 14477 14158 14257 14646 15327 16302 17011 16604 14917 12722 10932 9920 9610
57364 9610 9685 9559 8702 7306 6237 6006 6162 6080 5976 6614 8167 9940 11252 12155 13133 14438 15900 17208
57346 17208 18169 18781 19152 19390 19589 19954 20777 22096 23428 24133 24157 24201 24984 26460 27987 29120 29921 30484
57328 30484 30625 30277 29922 30133 30750 30945 30226 28999 27940 27187 26534 26181 26724 28354 30471 32237 33243
$$ packed form
57451B1676k168k328j923r57k0L44J04m71j115j548j554j238r43q04o16k28J98
57434F409M52N74P57J054J226Q71j20j187j477p89J80P94J142J362J016m5p86
57417A1433j03J345J693L28j353j956j716j542j555j349r59p01n05j66R6ok16
57400B768j22J83L53M59P24Q85N58Q4K03Q35R71N5j086j226k85O46P58N00Q64
57381H127J896K507J855M80l88l19R9L89O81R75P09m07j687k195j790j012l10
57364I610P5j26q57j396j069k31J56q2j04O38J553J773J312R03R78J305J462J308
57346A7208R61O12L71K38J99L65Q23J319J332P05K4M4P83J476J527J133Q01N63
57328C0484J41l48l55K11O17J95p19j227j059p53o53l53N43J630K117J766J006
$$ plain form
57311 33243 33496 33132 32337 31343 30190 28660 26685 24762 23688 23864 25066 26779 28476 29577 29605 28682
57295 28682 27642 27346 27951 29013 30114 31074 31698 31780 31511 31499 32156 33309 34660 36351 38755 41835 45133
57278 45133 48414 51964 56202 61280 67177 73922 81516 89791 98448 107115 115333 122684 129106 134937
57264 134937 140522 145893 150935 155637 159949 163638 166624 169343 172334 175395 177568 178216 177855 177647 178254
57249 178254 179510 181069 182935 185217 187744 190188 192408 194508 196664 199086 201939 205133 208313 211321
57235 211321 214486 218221 222521 227206 232439 238428 244671 250226 254911 259683 265484 272267 279524 287181
57221 287181 295378 303808 311956 319796 327559 334978 341444 346957 352338 358382 365286 372941 381225 389850
57207 389850 398455 407088 416275 426419 437424 449057 461319 474251 487649 501122 514304 526967
$$ packed form
57311C3243K53l64p95r94j153j530j975j923j074J76J202J713J697J101K8r23
57295B8682j040k96O05J062J101R60O24Q2k69j2O57J153J351J691K404L080L298
57278D5133L281L550M238N078N897O745P594Q275Q657Q667Q218P351O422N831
57264A34937N585N371N042M702M312L689K986K719K991L061K173O48l61k08O07
57249A78254J256J559J866K282K527K444K220K100K156K422K853L194L180L008
57235B11321L165L735M300M685N233N989O243N555M685M772N801O783P257P657
57221B87181Q197Q430Q148P840P763P419O466N513N381O044O904P655Q284Q625
57207C89850Q605Q633R187J0144J1005J1633J2262J2932J3398J3473J3182J2663
$$ plain form
57195 526967 539217 551607 564727 578612 592796 606978 621336 636123 651324 666806 682524
57184 682524 698431 714471 730727 747330 764245 781417 799076 817545 836770 856450 876550
57173 876550 897192 918115 938883 959722 981456 1004397 1027942 1051623 1075978 1101929 1129696
57162 1129696 1158748 1188490 1218694 1249630 1282086 1316871 1353867 1391832 1429496 1466607 1503667
57151 1503667 1540953 1578104 1614384 1649037 1681688 1712677 1742685 1771714 1798726 1822628 1843322
57140 1843322 1861490 1877728 1892419 1906281 1920424 1935592 1951540 1967270 1982017 1996030 2010332
57129 2010332 2025573 2041415 2057323 2073624 2091137 2109998 2129633 2149926 2171570 2195006 2219710
57118 2219710 2244770 2269576 2293782 2317411 2341403 2367456 2397024 2431071 2471038 2519303 2578375
$$ packed form
57195E26967J2250J2390J3120J3885J4184J4182J4358J4787J5201J5482J5718
57184F82524J5907J6040J6256J6603J6915J7172J7659J8469J9225J9680K0100
57173H76550K0642K0923K0768K0839K1734K2941K3545K3681K4355K5951K7767
57162A129696K9052K9742L0204L0936L2456L4785L6996L7965L7664L7111L7060
57151A503667L7286L7151L6280L4653L2651L0989L0008K9029K7012K3902K0694
57140A843322J8168J6238J4691J3862J4143J5168J5948J5730J4747J4013J4302
57129B010332J5241J5842J5908J6301J7513J8861J9635K0293K1644K3436K4704
57118B219710K5060K4806K4206K3629K3992K6053K9568L4047L9967M8265N9072
$$ plain form
57107 2578375 2650385 2737763 2843729 2971760 3125260 3308120 3524979 3780939 4082235 4437780
57097 4437780 4859205 5358936 5949071 6642425 7453557 8398243 9492612 10752012 12187777
57088 12187777 13802896 15590587 17535730 19614487 21791600 24020266 26243859 28392207
57080 28392207 30375231 32091539 33458897 34442715 35051973 35306128 35208437 34749246 33926741
57071 33926741 32760497 31291323 29575987 27681557 25678040 23631140 21599000 19631516
57063 19631516 17768119 16034930 14445305 13003523 11707788 10551590 9525255 8617823
57055 8617823 7817878 7113794 6494654 5950902 5473555 5053500 4682467 4354120 4063127
57046 4063127 3803681 3569905 3357178 3161956 2980746 2810565 2650365 2501015 2363775
$$ packed form
57107B578375P2010Q7378J05966J28031J53500J82860K16859K55960L01296L55545
57097D437780M21425M99731N90135O93354Q11132R44686J094369J259400J435765
57088A2187777J615119J787691J945143K078757K177113K228666K223593K148348
57080B8392207J983024J716308J367358R83818O09258K54155r7691m59191q22505
57071C3926741j166244j469174j715336j894430k003517k046900k032140j967484
57063A9631516j863397j733189j589625j441782j295735j156198j026335r07432
57055H617823p99945p04084o19140n43752m77347m20055l71033l28347k90993
57046D063127k59446k33776k12727j95222j81210j70181j60200j49350j37240
$$ plain form
57037 2363775 2239413 2128492 2031568 1949043 1881450 1829722 1794154 1772496 1758896 1744680 1720721
57026 1720721 1680758 1624000 1554760 1479192 1402326 1327683 1258071 1195347 1139815 1090822 1047808
57015 1047808 1010261 977273 947999 922216 899746 879721 861180 843963 828255 813662 799596
57004 799596 786175 773817 762197 750461 738299 726009 713732 701488 689791 679309 669926 660881
56992 660881 651855 643248 635494 628780 623345 619363 616615 614920 614829 617266 622465 629546 636816 641942 642448
56977 642448 637051 626537 612721 596819 579449 561707 545074 530320 517448 506619 498222 492072
56965 492072 487591 484900 484788 487485 492415 499391 509129 522171 538083 555960 574856 593082 607762
56952 607762 615857 615718 607600 593172 574780 554690 534566 515513 498415 483852 471810 461983
$$ packed form
57037B363775j24362j10921r6924q2525o7593n1728l5568k1658j3600j4216k3959
57026A720721l9963n6758o9240p5568p6866p4643o9612o2724n5532m8993m3014
57015A047808l7547l2988k9274k5783k2470k0025j8541j7217j5708j4593j4066
57004G99596j3421j2358j1620j1736j2162j2290j2277j2244j1697j0482r383r045
56992F60881r026q607p754o714n435l982k748j695r1K437N199P081P270N126N06
56977F42448n397j0514j3816j5902j7370j7742j6633j4754j2872j0829q397o150
56965D92072m481k691j12K697M930O976R738J3042J5912J7877J8896J8226J4680
56952F07762Q095j39q118j4428j8392k0090k0124j9053j7098j4563j2042r827
$$ plain form
56940 461983 454400 449421 447241 447846 451353 457885 467273 479458 495109 515128 539437 566561 594031
56927 594031 618444 635550 641713 635939 620065 596958 569223 539435 510266 483563 459879 439286
56915 439286 422042 408115 396796 387320 379451 373068 367752 363226 359709 357389 355913 354821 354162 354356
56901 354356 355795 358843 363806 370526 378339 386817 396291 407341 420053 434011 448713 463784 479101
56888 479101 494993 512076 530664 550440 570586 589716 605595 615619 618035 612539 599757 580819
56876 580819 557724 533372 510466 490476 473875 460948 451976 447019 446096 449437 457223 469350 485853
56863 485853 507404 535003 569305 610541 658725 713065 770536 824943 867897 891759 893005 873691
56851 873691 839881 798459 754967 713380 676537 646114 622586 605801 595610 592041 595307 605949
$$ packed form
56940D61983p583m979k180O05L507O532R388J2185J5651K0019K4309K7124K7470
56927E94031K4413J7106O163n774j5874k3107k7735k9788k9169k6703k3684k0593
56915D39286j7244j3927j1319r476p869o383n316m526l517k320j476j092o59J94
56901C54356J439L048M963O720P813Q478R474J1050J2712J3958J4702J5071J5317
56888D79101J5892J7083J8588J9776K0146J9130J5879J0024K416n496j2782j8938
56876E80819k3095k4352k2906j9990j6601j2927q972m957r23L341P786J2127J6503
56863D85853K1551K7599L4302M1236M8184N4340N7471N4407M2954K3862J246j9314
56851H73691l3810m1422m3492m1587l6843l0423k3528j6785j0191l569L266J0642
$$ plain form
56839 605949 624720 652091 688165 733290 788516 855094 933362 1021595 1114766 1203651 1275709
56828 1275709 1318585 1324799 1294770 1236223 1160403 1077592 994825 916573 846322 786687 738485
56817 738485 700796 672427 652882 641967 639286 644647 658491 681509 714043 756134 807643 867631
56805 867631 933095 997884 1052740 1087451 1094845 1073964 1029668 969397 900620 830249 764039 705085
56793 705085 653512 608635 570966 541575 520294 505750 496842 493275 494864 501371 513106 530866
56781 530866 554939 584512 617743 651587 681410 701709 708051 698672 674661 639286 597164 553124
56769 553124 510807 471935 436857 405609 378360 355028 334926 317098 301045 286924 274930
56758 274930 264698 255628 247613 240982 235654 230836 225757 220325 214891 209780 205372 202187 200372 199231
$$ packed form
56839F05949J8771K7371L6074M5125N5226O6578P8268Q8233R3171Q8885P2058
56828A275709M2876O214l0029n8547p5820q2811q2767p8252p0251n9635m8202
56817G38485l7689k8369j9545j0915k681N361J3844K3018L2534M2091N1509N9988
56805H67631O5464O4789N4856L4711P394k0881m4296o0271o8777p0371o6210n8954
56793G05085n1573m4877l7669k9391k1281j4544q908l567J589O507J1735J7760
56781E30866K4073K9573L3231L3844K9823K0299O342r379k4011l5375m2122m4040
56769E53124m2317l8872l5078l1248k7249k3332k0102j7828j6053j4121j1994
56758B74930j0232r070q015o631n328m818n079n432n434n111m408l185j815j141
$$ plain form
56744 199231 197700 195256 192202 189175 186631 184648 182911 180932 178489 175827 173383 171410 169923 168747
56730 168747 167565 166158 164703 163565 162728 161762 160461 159147 158158 157453 156936 156745 156907 157090 157083 157147 157504 157768
56712 157768 157399 156547 155961 156108 156748 157353 157675 157845 158107 158476 158595 157990 156509 154430 152239 150503 149781
56695 149781 150208 151199 152057 152884 154347 156536 158763 160617 162432 164352 165819 166507 167037 168051 169223 169929
56679 169929 170349 171012 171688 171705 171179 170995 171553 172296 172525 172039 170901 169231 167346 165621 164082 162451 160598
56662 160598 158624 156712 155337 155363 157231 160168 162898 165219 168184 172597 178003 183419 188449 193264 197964
56647 197964 202445 206648 210470 213509 215290 215858 215970 216588 218109 220080 221614 222053 221275 219545 217349
56632 217349 215242 213518 211948 210077 207854 205670 203819 202371 201579 201756 202516 202729 201680 199791 197870
$$ packed form
56744A99231j531k444l054l027k544j983j737j979k443k662k444j973j487j176
56730A68747j182j407j455j138q37r66j301j314r89p05n17j91J62J83pO4L57K64
56712A57768l69q52n86J47O40O05L22J70K62L69J19o05j481k079k191j736p22
56695A49781M27R91Q58Q27J463K189K227J854J815J920J467O88N30J014J172P06
56679A69929M20O63O76J7n26j84N58P43K29m86j138j670j885j725j539j631j853
56662A60598j974j912j375K6J868K937K730K321K965M413N406N416N030M815M700
56647A97964M481M203L822L039J781N68J12O18J521J971J534M39p78j730k196
56632B17349k107j724j570j871k223k184j851j448p92J77P60K13j049j889j921
$$ plain form
56617 197870 196172 194653 193522 192898 192397 191749 191439 191990 192923 193282 192964 192728 192939 193119 192827 192323 192250 193132
56599 193132 195107 197639 199576 200142 199853 199873 200553 201270 201619 201893 202312 202607 202708 203112 204102 205186 205774 206031
56581 206031 206578 207612 208680 209244 209217 209073 209512 210874 212832 214759 216320 217464 218008 217735 216969 216624 217466
56564 217466 219589 222655 226306 230256 234388 238939 244305 250394 256379 261251 264557 266456 267207 266817 265284
56549 265284 263121 261358 260750 261045 261404 261503 261701 262061 261894 260730 259095 257788 256831 255798 254783 254247 254060
56532 254060 253458 251959 249817 247613 245892 244984 244634 243938 242279 240205 238862 238676 239154 239766 240338 240744
56516 240744 240923 241113 241358 240936 239107 236391 234209 233191 232706 232153 231803 232049 232593 232822 232386 231151 229169
56499 229169 226996 225425 224610 223947 223091 222557 223048 224653 226860 228897 229928 229573 228531 228130 229011 230676
$$ packed form
56617A97870j698j519j131o24n01o48l10N51R33L59l18k36K11J80k92n04p3Q82
56599A93132J975K532J937N66k89K0O80P17L49K74M19K95J01M04R90J084N88K57
56581B06031N47J034J068N64k7j44M39J362J958J927J561J144N44k73p66l45Q42
56564B17466K123L066L651L950M132M551N366O089N985M872L306J899P51l90j533
56549B65284k163j763o08K95L59R9J98L60j67j164j635j307r57j033j015n36j87
56532B54060o02j499k142k204j721r08l50o96j659k074j343j86M78O12N72M06
56516B40744J79J90K45m22j829k716k182j018m85n53l50K46N44K29m36j235j982
56499B29169k173j571q15o63q56n34M91J605K207K037J031l55j042m01Q81J665
$$ plain form
56483 230676 232437 234126 235634 236518 236520 236028 235639 235612 235980 236684 237384 237686 237792 238384 239554 240447 240388 239838 239816
56464 239816 240737 242200 243535 244271 244371 244269 244354 244359 243708 242555 241802 241898 242247 242147 241701 241438 241621 242223 243044
56445 243044 243474 242821 241276 239975 239670 239960 240265 240826 242104 243795 245163 245876 245829 244697 242547 240552
56429 240552 240153 241511 243425 244725 245167 245080 244808 244607 244622 244791 244978 245133 245144 244754 243930 243129 242806 242846 242846 242757
56409 242757 242891 243360 243887 244167 244179 244229 244841 246376 248525 250369 251178 251053 250618 250265 249886 249151 247870 246246
56391 246246 244929 244571 245246 246515 248076 249943 252010 254029 256297 259873 265799 274536 286378 301762
56377 301762 320534 341168 361220 378438 391315 399113 402010 400994 397195 391400 384420 377443 371461
56364 371461 366564 362268 358408 355253 352873 350914 349074 347450 346300 345673 345425 345551 346335 347932 349754
$$ packed form
56483B30676J761J689J508Q84Km92l89k7L68P04P00L02J06N92J170Q93n9n50k2
56464B39816R21J463J335P36J00j02Q5No51j153p53R6L49j00m46k63J83O02Q21
56445B43044M30o53j545j301l05K90L05N61J278J691J368P13m7j132k150j995
56429B40552l99J358J914J300M42q7k72k01J5J69J87J55J1l90q24q01l23M0%q9
56409B42757J34M69N27K80J2N0O12J535K149J844Q09j25m35l53l79p35j281j624
56391B46246j317l58O75J269J561J867K067K019K268L576N926Q737J1842J5384
56377C01762J8772K0634K0052J7218J2877P798K897j016l799n795o980o977n982
56364C71461m897m296l860l155k380j959j840j624j150o27k48J26P84J597J822
$$ plain form
56349 349754 350612 349852 348077 346306 344723 342926 341113 340060 339857 339689 339196 339121 340094 341581 342658 343213
56333 343213 343794 344790 346295 348330 350658 352775 354476 355999 357268 357635 356884 355924 355900 357046 358861 360890
56317 360890 362800 364242 365295 366592 368429 370180 371145 371495 371845 372455 373471 375423 378663 382650 386474
56302 386474 389730 392391 394403 396115 398468 401874 405403 408013 410177 413211 417354 421722 426026 431075
56288 431075 437350 444093 450167 455106 459057 462432 465955 470496 476471 483638 491576 499995 508559 516890
56274 516890 525007 533511 543204 554594 567679 582014 597073 612735 629261 646714 664787 683445
56262 683445 703318 725168 749399 776467 807287 842668 882639 926883 975609 1029584 1089661
56251 1089661 1156714 1231709 1315354 1407856 1509344 1620024 1739513 1866426 1998973 2135412
$$ packed form
56349C49754Q58p60j775j771j583j797j813j053k03j68m93p5R73J487J077N55
56333C43213N81R96J505K035K328K117J701J523J269L67p51r60k4J146J815K029
56317C60890J910J442J053J297J837J751R65L50L50O10J016J952L240L987L824
56302C86474L256K661K012J712K353L406L529K610K164L034M143M368M304N049
56288D31075O275O743O074M939L951L375L523M541N975P167P938Q419Q564Q331
56274E16890Q117Q504R693J1390J3085J4335J5059J5662J6526J7453J8073J8658
56262F83445J9873K1850K4231K7068L0820L5381L9971M4244M8726N3975O0077
56251A089661O7053P4995Q3645R2502J01488J10680J19489J26913J32547J36439
$$ plain form
56241 2135412 2273447 2409967 2542020 2667417 2783594 2886583 2972076 3037142 3080165 3099893
56231 3099893 3095828 3069234 3022511 2957645 2876299 2781179 2676017 2563921 2446713 2326080 2204465
56220 2204465 2084503 1968202 1856876 1751269 1651560 1557735 1470104 1389116 1314756 1246515
56210 1246515 1183868 1126396 1073763 1026000 983430 945747 911630 879946 850896 825131 802166
56199 802166 780710 760337 741769 725555 711486 699383 689474 681706 675431 670033 665344 661309 657743
56186 657743 654458 651307 648179 645273 643070 641614 640226 638469 636893 636154 635908 635406 634730 634535 634950 635686
56170 635686 636845 638657 640760 642786 645381 649513 655026 660977 667214 674412 682678 691273 699723 708167
56156 708167 716651 725196 734497 745413 757791 770921 785209 802192 822848 847057 874881 907143
$$ packed form
56241B135412J38035J36520J32053J25397J16177J02989Q5493O5066M3023J9728
56231C099893m065k6594m6723o4866q1346r5120j05162j12096j17208j20633j21615
56220B204465j19962j16301j11326j05607r9709r3825q7631q0988p4360o8241
56210A246515o2647n7472n2633m7763m2570l7683l4117l1684k9050k5765k2965
56199H02166k1456k0373j8568j6214j4069j2103r909p768o275n398m689m035l566
56186F57743l285l151l128k906k203j456j388j757j576p39k46n02o76j95M15P36
56170F35686J159J812K103K026K595M132N513N951O237P198Q266Q595Q450Q444
56156G08167Q484Q545R301J0916J2378J3130J4288J6983K0656K4209K7824L2262
$$ plain form
56144 907143 944557 987540 1037276 1095755 1164169 1242027 1328087 1421119 1519125 1618423 1713951
56133 1713951 1800334 1873368 1931978 1979290 2020834 2060967 2100866 2139140 2172978 2198795 2213431
56122 2213431 2215906 2207887 2192448 2172772 2151352 2128791 2102720 2068661 2022447 1961943 1887375 1801398
56110 1801398 1708804 1614893 1523759 1438500 1362229 1297251 1243313 1198207 1160338 1129492 1105158
56099 1105158 1085719 1069823 1057284 1048105 1041681 1037439 1035314 1035160 1036444 1038718 1041667 1044673 1047252
56086 1047252 1049970 1053977 1059668 1066623 1074626 1083648 1093043 1102033 1110904 1120563 1131071 1141822 1152925
56073 1152925 1164994 1177729 1190192 1202398 1215214 1228821 1242780 1257365 1273126 1289257 1304257
56062 1304257 1318307 1333241 1349997 1367789 1385882 1404379 1423107 1441488 1459729 1478451 1497034
$$ packed form
56144I07143L7414M2983M9736N8479O8414P7858Q6060R3032R8006R9298R5528
56133A713951Q6383P3034N8610M7312M1544M0133L9899L8274L3838K5817J4636
56122B213431K475q019j5439j9676k1420k2561k6071l4059m6214o0504p4568q5977
56110A801398r2594r3911r1134q5259p6271o4978n3938m5106l7869l0846k4334
56099A105158j9439j5896j2539r179o424m242k125j54J284K274K949L006K579
56086A047252K718M007N691O955Q003R022R395Q990Q871R659J0508J0751J1103
56073A152925J2069J2735J2463J2206J2816J3607J3959J4585J5761J6131J5000
56062A304257J4050J4934J6756J7792J8093J8497J8728J8381J8241J8722J8583
$$ plain form
56051 1497034 1514180 1530130 1546427 1563443 1580291 1597227 1615798 1636228 1657024 1677787 1700188
56040 1700188 1725492 1753171 1782528 1813588 1845727 1877569 1909001 1941438 1975577 2010867 2047505
56029 2047505 2086703 2128507 2171634 2215909 2262451 2310951 2359400 2407234 2456194 2507357 2559835
56018 2559835 2613190 2668568 2726654 2787010 2850173 2917807 2990190 3066220 3146351 3232381 3323804
56007 3323804 3417771 3513506 3613287 3718146 3826390 3937557 4054061 4177380 4306335 4440672
55997 4440672 4582610 4733221 4891052 5056025 5230782 5416473 5611271 5815022 6031234
55988 6031234 6262494 6508249 6769222 7049561 7352242 7676909 8024763 8401120 8810645
55979 8810645 9254731 9736019 10260573 10833206 11456104 12134949 12880976 13704535 14612906
$$ packed form
56051A497034J7146J5950J6297J7016J6848J6936J8571K0430K0796K0763K2401
56040A700188K5304K7679K9357L1060L2139L1842L1432L2437L4139L5290L6638
56029B047505L9198M1804M3127M4275M6542M8500M8449M7834M8960N1163N2478
56018B559835N3355N5378N8086O0356O3163O7634P2383P6030Q0131Q6030R1423
56007C323804R3967R5735R9781J04859J08244J11167J16504J23319J28955J34337
55997D440672J41938J50611J57831J64973J74757J85691J94798K03751K16212
55988F031234K31260K45755K60973K80339L02681L24667L47854L76357M09525
55979H810645M44086M81288N24554N72633O22898O78845P46027Q23559R08371
$$ plain form
55970 14612906 15617621 16737627 17992472 19399783 20983398 22777162 24818250 27146155
55962 27146155 29813123 32887897 36447162 40576114 45386035 51027692 57693442 65625920
55954 65625920 75125845 86526864 100157317 116358922 135563725 158334012 185307144
55947 185307144 217054636 253756085 294498820 336377137 374203682 401652331 413592986
55940 413592986 408193830 387399682 355681583 318146421 279138152 241686840 207545386
55933 207545386 177474888 151585036 129622455 111157229 95692597 82742948 71882126
55926 71882126 62750412 55042867 48507474 42945378 38196618 34123864 30611799 27571352
55918 27571352 24932119 22631730 20616471 18845342 17285158 15904172 14674775 13577317
$$ packed form
55970A4612906J004715J120006J254845J407311J583615J793764K041088K327905
55962B7146155K666968L074774L559265M128952M809921N641657O665750P932478
55954F5625920R499925J1401019J3630453J6201605J9204803K2770287K6973132
55947A85307144L1747492L6701449M0742735M1878317L7826545K7448649J1940655
55940D13592986n399156k0794148l1718099l7535162l9008269l7451312l4141454
55933B07545386l0070498k5889852k1962581j8465226j5464632j2949649j0860822
55926G1882126r131714p707545o535393n562096m748760m072754l512065l040447
55918B7571352k639233k300389k015259j771129j560184j380986j229397j097458
$$ plain form
55910 13577317 12595397 11710941 10908429 10179511 9518248 8915323 8361430 7852556 7386986
55901 7386986 6960074 6566308 6203529 5870752 5564332 5280232 5017664 4776890 4555708
55892 4555708 4351385 4163575 3992007 3833635 3685227 3546396 3416791 3292600 3169241
55883 3169241 3045855 2924335 2805853 2691222 2582699 2482301 2389612 2303600 2224843 2153540
55873 2153540 2087162 2022760 1960071 1900052 1842084 1785134 1729995 1677775 1627557 1578055 1530279
55862 1530279 1486113 1445383 1406550 1369145 1333363 1298468 1263764 1230108 1198500 1168303 1138708
55851 1138708 1110713 1085635 1062862 1040909 1019461 998469 976668 953251 929858 908626 889210
55840 889210 869829 850284 831748 814393 797387 780598 764321 748013 731272 715438 702235
$$ packed form
55910A3577317r81920q84456q02512p28918o61263o02925n53893n08874m65570
55901G386986m26912l93766l62779l32777l06420k84100k62568k40774k21182
55892D555708k04323j87810j71568j58372j48408j38831j29605j24191j23359
55883C169241j23386j21520j18482j14631j08523j00398r2689q6012p8757p1303
55873B153540o6378o4402o2689o0019n7968n6950n5139n2220n0218m9502m7776
55862A530279m4166m0730l8833l7405l5782l4895l4704l3656l1608l0197k9595
55851A138708k7995k5078k2773k1953k1448k0992k1801k3417k3393k1232j9416
55840H89210j9381j9545j8536j7355j7006j6789j6277j6308j6741j5834j3203
$$ plain form
55829 702235 691276 680729 669918 659525 649836 640664 632483 625698 619089 610788 600604 589794 578852
55816 578852 567164 554630 542023 529837 518173 507584 498696 491186 484394 478670 474877 472862 471725
55803 471725 471300 472138 474324 477562 482107 488369 495856 503565 510995 517614 521934 522648 520425 517128 513438
55788 513438 508678 502848 497340 493302 490313 486721 480461 469860 454845 437463 420350 404777 390900
55775 390900 379344 371258 367000 366009 367844 372088 377177 380487 379953 375013 366294 355381 344586 335606
55761 335606 328087 320430 312093 304178 297732 292459 287391 281979 276232 270422 264943 260072 255815 252371
55747 252371 250455 250492 251655 252447 252175 251294 250453 249954 249961 250398 250529 249347 246588 242950 239305 236059 233178
55730 233178 230397 227526 224859 223025 222024 220792 218202 214209 209560 204891 200641 197278 194763 192191
$$ packed form
55829G02235j0959j0547j0811j0393r689r172q181o785o609q301j0184j0810j0942
55816E78852j1688j2534j2607j2186j1664j0589q888p510o792n724l793k015j137
55803D71725m25Q38K186L238M545O262P487P709P430O619M320P14k223l297l690
55788E13438m760n830n508m038k989l592o260j0601j5015j7382j7113j5573j3877
55775C90900j1556q086m258r91J835M244N089L310n34m940q719j0913j0795q980
55761C35606p519p657q337p915o446n273n068n412n747n810n479m871m257l444
55747B52371j916L7J163P92k72q81q41m99PM37J31j182k759l638l645l246k881
55730B33178k781k871k667j834j001j232k590l993m649m669m250l363k515k572
$$ plain form
55716 192191 188799 185128 182424 181217 181299 182754 185963 190609 195541 199753 202899 204923 205917 206341 206699
55701 206699 206857 206142 204091 200740 196341 191305 186247 181577 177131 172651 168423 165029 162632 160978 159835
55686 159835 159037 158402 158071 158645 160526 163387 166719 170516 174991 179989 185118 190037 194240 197041 198202
55671 198202 198035 196555 193378 188968 184975 182482 180754 178653 176384 174794 173766 172738 172165 173018 175155
55656 175155 177572 179982 182797 185760 188057 189763 191872 194730 197591 199794 201282 201901 201349 199910 198167
55641 198167 195870 192169 187075 181611 176307 170712 164598 158614 153355 148722 144563 141043 138044 135000
55627 135000 131711 128669 126312 124603 123484 123028 122972 122768 122183 121297 120026 118427 117241 117071 117090 115733
55611 115733 112762 109519 106965 104695 102190 99781 97812 95944 93936 92211 91054 90068 88947 87977 87302
$$ packed form
55716A92191l392l671k704j207Q2J455L209M646M932M212L146K024R94M24L58
55701B06699J58p15k051l351m399n036n058m670m446m480m228l394k397j654j143
55686A59835p98o35l31N74J881K861L332L797M475M998N129M919M203K801J161
55671A98202j67j480l177m410l993k493j728k101k269j590j028j028n73Q53K137
55656A75155K417K410K815K963K297J706K109K858K861K203J488O19n52j439j743
55641A98167k297l701n094n464n304n595o114n984n259m633m159l520k999l044
55627A35000l289l042k357j709j119m56n6k04n85q86j271j599j186j70J9j357
55611A15733k971l243k554k270k505k409j969j868k008j725j157r86j121r70o75
$$ plain form
55596 87302 86488 85296 84077 82896 81194 78933 77206 76968 77866 79020 80267 81865 83557 84678 84849
55581 84849 84006 82300 80505 79834 80638 81800 82157 82034 82607 84266 86439 88691 91034 93249 94790 95500
55565 95500 95845 96294 96821 97020 96376 94486 91346 87461 83475 79783 76644 74375 73163 72814 72921 73148
55549 73148 73264 73181 73085 73206 73299 72729 71307 69633 68312 67179 65686 63799 62127 61246 61136 61211 60778 59660
55531 59660 58323 57194 55933 53864 51099 48567 46723 44824 41787 37241 31358 24257 16057 7069
55516 -2697 -13967 -27513 -43111 -59482 -75007 -88056 -96798 -99356 -94540 -82501 -64869 -44270
55504 -44270 -23347 -3809 13764 29310 42701 53738 62265 68122 71334 72484 72607 72581 72828 73587
55490 73587 74962 76569 77668 77980 77967 78078 78170 78011 77899 78343 79379 80614 81696 82471 82939 83420 84490
$$ packed form
55596H7302q14j192j219j181j702k261j727k38Q98J154J247J598J692J121J71
55581H4849q43j706j795o71Q04J162L57j23N73J659K173K252K343K215J541P10
55565I5500L45M49N27J99o44j890l140l885l986l692l139k269j212l49J07K27
55549G3148J16q3r6J21R3n70j422j674j321j133j493j887j672q81j10P5m33j118
55531E9660j337j129j261k069k765k532j844j899l037m546n883p101q200G069
55516b697j1270j3546j5598j6371j5525j3049q742k558M816J2039J7632K0599
55504d4270K0923c809A3764J5546J3391J1037Q527N857L212J150J23k6K47P59
55490G3587J375J607J099L12j3J11R2j59j12M44J036J235J082P75M68M81J070
$$ plain form
55473 84490 86411 88761 90905 92577 93777 94357 94054 92791 90702 88034 85231 82867 81212 79964 78567
55458 78567 76641 74107 71239 68750 67427 67404 68046 68678 69157 69567 69824 69864 69893 70127 70568 71240 72277 73510
55440 73510 74341 74375 73868 73250 72538 71578 70615 70205 70709 72136 74206 76326 77786 78368 78598 79049 79623 79832
55422 79832 79614 79469 79791 80339 80453 79801 78954 79055 80635 82859 84386 84852 84950 85075 84701 83402 81664 80198
55404 80198 79008 77728 76446 75580 75295 75588 76567 78111 79482 79882 79283 78285 77336 76449 75536 74628 73925
55387 73925 73838 74677 76094 77252 77857 78481 79406 79777 78670 76560 74885 74347 74438 74584 74933 75859 77296 78768
55369 78768 79763 79992 79632 79302 79530 80278 81243 82331 83442 84081 83766 82704 81499 80325 78947 77495 76531
55352 76531 76212 75960 75236 74262 73757 74209 75529 77185 78527 79175 79172 78829 78506 78578 79265 80257 80773 80338 79240
$$ packed form
55473H4490J921K350K144J672J200N80l03j263k089k668k803k364j655j248j397
55458G8567j926k534k868k489j323k3O42O32M79M10K57M0K9K34M41O72J037J233
55440G3510Q31L4n07o18p12r60r63m10N04J427K070K120J460N82K30M51N74K09
55422G9832k18j45L22N48J14o52q47J01J580K224J527M66R8J25l74j299j738j466
55404H0198j190j280j282q66k85K93R79J544J371M00n99r98r49q87r13r08p03
55387G3925q7Q39J417J158O05O24R25L71j107k110j675n38R1J46L49R26J437J472
55369G8768R95K29l60l30K28P48R65J088J111O39l15j062j205j174j378j452r64
55352G6531l19k52p24r74n05M52J320J656J342O48ll43l23P2O87R92N16m35j098
$$ plain form
55333 79240 77986 76701 75443 74634 74557 74751 74634 74525 75202 76562 77571 77681 77489 77727 78292 78609 78405 77723
55315 77723 76693 75678 75262 75582 75921 75361 73711 71557 69627 68412 68190 68964 70298 71514 72177 72344
55299 72344 72299 72221 72123 72036 72092 72343 72587 72523 72135 71788 71909 72660 73905 75321 76515 77275 77783 78326 78732 78406
55279 78406 77094 75289 73736 72844 72785 73685 75324 76938 77794 77810 77345 76731 76309 76470 77095 77311 76500 75314
55261 75314 74986 75743 76644 76974 77004 77238 77635 77987 78483 79411 80567 81361 81412 80807 79864 78765 77474 76042
55243 76042 74972 74983 76144 77572 78333 78467 78675 79303 80177 81225 82466 83398 83216 81966 80793 80611 80998
55226 80998 80891 80055 79327 79546 80600 81596 81739 80986 79978 79394 79445 79934 80543 80911 80677 79833 78934 78602 78844
55207 78844 79145 79191 79197 79557 80398 81451 82160 82100 81502 81119 81271 81381 80900 80261 80237 80673 80726 80222 79847 79920 79922 79522
$$ packed form
55333G9240j254j285j258q09p7J94j17j09O77J360J009J10j92K38N65L17k04o82
55315G7723j030j015m16L20L39n60j650k154j930j215k22P74J334J216O63J67
55299G2344m5p8r8q7N6K51K44o4l88l47J21P51J245J416J194P60N08N43M06l26
55279G8406j312j805j553q92n9R00J639J614Q56J6m65o14m22J61O25K16q11j186
55261G5314l28P57R01L30L0K34L97L52M96R28J156P94N1o05r43j099j291j432
55243G6042j070J1J161J428P61J34K08O28Q74J048J241R32j82j250j173j82L87
55226H0998j07q36p28K19J054R96J43p53j008n84N1M89O09L68k34q44q99l32K42
55207G8844L01M6OL60Q41J053P09o0n98l83J52J10m81o39k4M36N3n04l75P3Km00
$$ plain form
55185 79522 79212 79496 80148 80733 81272 81929 82546 82915 83108 83158 82856 82218 81720 81652 81726 81703 81946 82863 84211 85485
55165 85485 86600 87599 88037 87381 85903 84559 83961 83924 83944 83683 83020 82117 81487 81593 82242 82667 82287 81198
55147 81198 79932 78958 78447 78333 78483 78869 79495 80180 80598 80675 80726 81070 81746 82766 84279 86094 87296 86904
55129 86904 84941 82458 80466 79142 78159 77416 77212 77842 79248 80992 82486 83251 83119 82283 81204 80359
55113 80359 79941 79751 79498 79213 79262 79925 81134 82643 84255 85776 86929 87546 87786 88026 88525 89260 90047 90801
55095 90801 91694 93026 94836 96703 98033 98544 98366 97767 96970 96127 95269 94274 93160 92332 92312 93240 94855
55078 94855 96781 98557 99576 99559 99013 98679 98507 97830 96616 95846 96298 97596 98867 99755 100258 100144 99259
55061 99259 98125 97493 97378 97092 96214 95050 94176 93917 94258 94891 95275 94983 94050 92821 91601 90648 90292 90671
$$ packed form
55185G9522l10K84O52N85N39O57O17L69J93N0l02o38m98o8P4k3K43R17J348J274
55165H5485J115R99M38o56j478j344n98l7K0k61o63r03o30J06O49M25l80j089
55147H1198j266r74n11j14J50L86O26O85M18P7N1L44O76J020J513J815J202l92
55129H6904j963k483j992j324r83p43k04O30J406J744J494P65j32q36j079q45
55113H0359m18j90k53k85M9O63J209J509J612J521J153O17K40K40M99P35P87P54
55095I0801Q93J332J810J867J330N11j78n99p97q43q58r95j114q28k0R28J615
55078I4855J926J776J019j7n46l34j72o77j214p70M52J298J271Q88N03j14q85
55061I9259j134o32j15k86q78j164q74k59L41O33L84k92r33j229j220r53l56L79
$$ plain form
55043 90671 91429 92076 92594 93337 94332 95049 94955 94032 92699 91431 90466 89705 88880 87941 87207 86965 87040 87025 86861
55024 86861 86913 87527 88733 90323 91952 93212 93889 94122 94101 93710 92806 91765 91360 91989 93302 94642 95627
55007 95627 96228 96604 96964 97397 97760 97928 98131 98737 99600 100016 99592 98898 98882 99738 100685 100882 100272 99431 98861
54988 98861 98674 98843 99424 100398 101551 102672 103750 104792 105552 105765 105643 105826 106737 108186 109697 110947 111766
54971 111766 111983 111592 110952 110544 110554 110762 110801 110425 109675 108935 108700 109099 109684 109854 109434 108759 108254 108041 107920
54952 107920 107641 107179 106719 106332 105811 105024 104323 104247 104861 105731 106553 107385 108177 108549 108245 107383 106059 104245
54934 104245 102383 101550 102474 104730 107404 110105 112790 115004 116192 116656 117387 118862 120692 122644 125262
54919 125262 129114 133880 138676 143000 146981 150778 154015 155908 155879 154058 151163 147863 144379 140672 136818
$$ packed form
55043I0671P58O47N18P43R95P17r4r23j333j268r65p61q25r39p34k42P5j5j64
55024H6861N2O14J206J590J629J260O77K33k1l91r04j041m05O29J313J340R85
55007I5627O01L76L60M33L63J68K03O06Q63M16m24o94j6Q56R47J97o10q41n70
54988I8861j87J69N81R74J153J121J078J042P60K13j22J83R11J449J511J250Q19
54971A11766K17l91o40m08J0K08L9l76p50p40k35L99N85J70m20o75n05k13j21
54952A07920k79m62m60l87n21p87p01p6O14Q70Q22Q32P92L72l04q62j324j814
54934A04245j862q33R24K256K674K701K685K214J188M64P31J475J830J952K618
54919A25262L852M766M796M324L981L797L237J893k9j821k895l300l484l707l854
$$ plain form
54904 136818 133007 129411 126253 123712 121563 119193 116331 113479 111226 109498 108000 107055 107244 108349 109448
54889 109448 110084 110613 111329 112042 112808 114235 116595 119235 121412 123304 125667 128834 132557 136558 140709
54874 140709 144804 148628 152192 155548 158394 160112 160200 158499 155193 150842 146301 142242 138705 135267 131594
54859 131594 127679 123684 119840 116534 114273 113385 113689 114441 114724 114050 112617 110911 109105 107067 104812
54844 104812 102621 100666 98927 97536 96825 96878 97368 98044 98936 99817 99900 98600 96365 94350 93397 93681 94997
54827 94997 96799 98125 98308 97897 98173 99440 100422 99897 98415 97652 98278 99377 100083 100860 102488 104445 105320
54810 105320 104765 104101 104642 106130 107372 107854 108000 108167 108203 108017 107906 108107 108501 108894 109172 109111 108548 107895 107905
54791 107905 108626 109087 108463 107106 105980 105428 105031 104483 103997 103860 104058 104393 104737 105138 105906 107448 109717
$$ packed form
54904A36818l811l596l158k541k149k370k862k852k253j728j498r45J89J105J099
54889A09448O36N29P16P13P66J427K360K640K177J892K363L167L723M001M151
54874A40709M095L824L564L356K846J718Q8j701l306m351m541m059l537l438l673
54859A31594l915l995l844l306k261q88L04P52K83o74j433j706j806k038k255
54844A04812k191j955j739j391p11N3M90O76Q92Q81Q3j300k235k015r53K84J316
54827I4997J802J326J83m11K76J267R82n25j482p63O26J099P06P77J628J957Q75
54810A05320n55o64N41J488J242M82J46J67L6j86j11K01L94L93K78o1n63o53J0
54791A07905P21M61o24j357j126n52l97n48m86j37J98L35L44M01P68J542K269
$$ plain form
54774 109717 111974 113533 114680 116463 119467 123172 126671 129720 132881 136846 141822 147476 153249 158720
54760 158720 163670 167834 170739 171933 171315 169078 165411 160485 154732 148794 143111 137766 132872 128863
54746 128863 126150 124622 123741 123140 122852 122912 122980 122648 122011 121651 121934 122618 123268 123804 124368 124885 125182 125459 126110
54727 126110 127059 127830 128535 130183 133504 137839 141860 145171 148536 152480 156379 159226 160797 161604 161963
54712 161963 161560 159925 157008 153198 148984 144725 140629 136831 133420 130395 127642 125029 122617 120719
54698 120719 119656 119350 119237 118676 117503 116036 114543 112945 111210 109777 109212 109490 109999 110270 110312 110196 109864
54681 109864 109574 109973 111289 112770 113458 113286 112974 112992 113136 112996 112376 111298 110068 109321 109471 110082 110282 109919
54663 109919 109752 110349 111343 112060 112410 112742 113195 113623 113937 114100 113896 113110 111888 110636 109628 108919 108576 108681
$$ packed form
54774A09717K257J559J147J783L004L705L499L049L161L965M976N654N773N471
54760A58720M950M164K905J194o18k237l667m926n753n938n683n345m894m009
54746A28863k713j528q81o01k88O0O8l32o37l60K83O84O50N36N64N17K97K77O51
54727A26110R49P71P05J648L321M335M021L311L365L944L899K847J571Q07L59
54712A61963m03j635k917l810m214m259m096l798l411l025k753k613k412j898
54698A20719j063l06j13n61j173j467j493j598j735j433n65K78N09K71M2j16l32
54681A09864k90L99J316J481O88j72l12J8J44j40o20j078j230p47J50O11K00l63
54663A09919j67N97R94P17L50L32M53M28L14J63k04p86j222j252j008p09l43J05
$$ plain form
54645 108681 109120 109575 109768 109646 109379 109313 109727 110459 110892 110598 109899 109503 109613 109726 109393 108829 108522 108451 108065
54626 108065 107105 106115 105853 106321 106713 106438 105879 105863 106655 107815 108862 109589 109808 109428 108961 109325 110703 112055
54608 112055 112215 111139 109651 108339 107329 106910 107549 109140 110853 112017 112704 113291 113829 114092 113966 113484
54592 113484 112700 111727 110792 110087 109678 109604 109908 110502 111168 111684 111789 111121 109620 108022 107473 108374 109878 110791
54574 110791 110707 110065 109452 109151 109128 109064 108583 107763 107302 107848 109244 110718 111688 112147 112379 112675 113194 113800 114054
54555 114054 113665 112891 112233 111927 112037 112853 114599 116723 118102 118244 117883 118135 119353 121077 122782 124302
54539 124302 125683 126979 128234 129458 130540 131195 131020 129707 127419 124947 123263 122782 123155 123749 124126 124042
54523 124042 123361 122164 120760 119478 118567 118301 118839 119874 120791 121380 122087 123268 124508 125032 124546 123321
$$ packed form
54645A08681M39M55J93j22k67o6M14P32M33k94o99l96J10J13l33n64l07p1l86
54626A08065r60r90k62M68L92k75n59j6P92J160J047P27K19l80m67L64J378J352
54608A12055J60j076j488j312j010m19O39J591J713J164O87N87N38K63j26m82
54592A13484p84r73r35p05m09p4L04N94O66N16J05o68j501j598n49R01J504R13
54574A10791q4o42o13l01k3o4m81q20m61N46J396J474R70M59K32K96N19O06K54
54555A14054l89p74o58l06J10Q16J746K124J379J42l61K52J218J724J705J520
54539A24302J381J296J255J224J082O55j75j313k288k472j684m81L73N94L77q4
54523A24042o81j197j404j282r11k66N38J035R17N89P07J181J240N24m86j225
$$ plain form
54507 123321 121693 119944 118569 118116 118587 119360 119792 119717 119308 118743 118120 117524 117069 116888 116998 117076 116570 115374
54489 115374 114272 114271 115439 116795 117464 117539 117596 117756 117662 117222 116869 117020 117617 118379 119273 120489 122029 123575
54471 123575 124844 125856 126750 127547 128315 129392 131012 132721 133597 133266 132339 131616 131218 130853 130551 130584 130855
54454 130855 130949 130754 130527 130357 130130 129990 130215 130437 129731 127833 125699 124297 123390 122116 120430 119148 118670
54437 118670 118469 118064 117854 118545 120121 121823 123030 123841 124785 126155 127686 128775 129058 128765 128464 128454 128510
54420 128510 128264 127728 127326 127457 128122 128973 129620 129883 129846 129762 129898 130385 131128 131887 132523 133147 133996 135176 136610
54401 136610 138192 139826 141274 142144 142216 141750 141302 141246 141565 142101 142816 143710 144629 145309 145617 145603 145284 144535 143363
54382 143363 142195 141616 141725 141972 141798 141325 141159 141597 142254 142571 142440 142277 142567 143448 144630 145655 146352 147080
$$ packed form
54507A23321j628j749j375m53M71P73M32p5m09n65o23n96m55j81J10P8n06j196
54489A15374j102jJ168J356O69P5N7J60r4m40l53J51N97P62Q94J216J540J546
54471A23575J269J012Q94P97P68J077J620J709Q76l31r27p23l98l65l02L3K71
54454A30855R4j95k27j70k27j40K25K22p06j898k134j402r07j274j686j282m78
54437A18670k01m05k10O91J576J702J207Q11R44J370J531J089K83k93l01j0N6
54420A28510k46n36m02J31O65Q51O47K63l7q4J36M87P43P59O36O24Q49J180J434
54401A36610J582J634J448Q70P2m66m48n6L19N36P15Q94R19O80L08j4l19p49j172
54382A43363j168n79J09K47j74m73j66M38O57L17j31j63K90Q81J182J025O97P28
$$ plain form
54364 147080 148471 150825 153834 156908 159717 162398 165277 168459 171607 174210 176095 177584 178885 179481
54350 179481 178472 175623 171716 167726 163986 160350 156772 153310 149870 146508 143831 142465 142053 141391 139870
54335 139870 138290 137804 138376 138828 138341 137367 136915 137351 138212 138970 139589 140257 140845 140885 140110 138943 138271 138628
54317 138628 139619 140274 140040 139314 138890 139055 139413 139494 139212 138636 137691 136355 135007 134247 134331 134952 135590 135973 136180
54298 136180 136443 136838 137127 136933 136191 135327 134882 135035 135629 136508 137551 138468 138978 139268 139921 141230 142794 143965
54280 143965 144441 144308 143804 143275 143100 143296 143336 142669 141417 140277 139793 139960 140553 141507 142789 144125 145063 145354
54262 145354 145218 145241 145959 147417 149075 150246 150690 150770 150990 151483 152007 152414 152916 153727 154525 154551 153406 151570
54244 151570 149860 148493 147026 145218 143558 142672 142481 142322 141779 141087 140672 140575 140479 140148 139666 139312 139309 139721
$$ packed form
54364A47080J391K354L009L074K809K681K879L182L148K603J885J489J301N96
54350A79481j009k849l907l990l740l636l578l462l440l362k677j366m12o62j521
54335A39870j580m86N72M52m87r74m52M36Q61P58O19O68N88M0p75j167o72L57
54317A38628R91O55k34p26m24J65L58Q1k82n76r45j336j348p60Q4O21O38L83K07
54298A36180K63L95K89j94p42q64m45J53N94Q79J043R17N10K90O53J309J564J171
54280A43965M76j33n04n29j75J96M0o67j252j140m84J67N93R54J282J336R38K91
54262A45354j36K3P18J458J658J171M44Q0K20M93N24M07N02Q11P98K6j145j836
54244A51570j710j367j467j808j660q86j91j59n43o92m15r7r6l31m82l54lM12
$$ plain form
54226 139721 140445 141220 141715 141812 141795 142111 142829 143535 143812 143639 143149 142341 141364 140748 140827 141037 140468 139117 137970
54207 137970 137642 137613 137162 136461 136214 136608 137136 137240 136671 135481 134144 133434 133756 134741 135899 137333 139281
54190 139281 141240 142294 142175 141340 140061 138266 136311 135088 134967 135288 135268 134873 134482 134259 134292 134863 135988
54173 135988 137078 137567 137640 137824 138121 138066 137510 136769 136075 135419 134975 135109 135819 136582 136994 137220 137609 138126 138504
54154 138504 138760 139281 140382 141942 143457 144329 144209 143232 141985 141099 140786 140740 140492 139860 139096 138668 138927 139911
54136 139911 141371 142956 144352 145332 145768 145703 145388 145078 144717 144000 142905 142106 142474 144141 146316 148177 149634
54119 149634 150961 152017 152365 152052 151764 152038 152711 153325 153718 153968 154084 154102 154328 155076 156201 157108 157308 156836
54101 156836 156191 156006 156683 158149 159973 161844 163908 166485 169561 172827 176195 180015 184651 190029 195717
$$ packed form
54226A39721P24P75M95R7j7L16P18P06K77j73m90q08r77o16P9K10n69j351j147
54207A37970l28k9m51p01k47L94N28J04n69j190j337p10L22R85J158J434J948
54190A39281J959J054j19q35j279j795j955j223j21L21k0l95l91k23L3N71J125
54173A35988J090M89P3J84K97n5n56p41o94o56m44J34P10P63M12K26L89N17L78
54154A38504K56N21J101J560J515Q72j20r77j247q86l13m6k48o32p64m28K59R84
54136A39911J460J585J396R80M36o5l15l10l61p17j095p99L68J667K175J861J457
54119A49634J327J056L48l13k88K74O73O14L93K50J16J8K26P48J125R07K00m72
54101A56836o45j85O77J466J824J871K064K577L076L266L368L820M636N378N688
$$ plain form
54086 195717 201192 205837 208802 209247 206923 202491 197190 192132 187820 184177 180936 177975 175315 172921
54072 172921 170641 168428 166549 165418 165224 165779 166754 167954 169309 170669 171742 172260 172176 171806 171848 173150
54056 173150 176180 180645 185717 190743 195632 200547 205415 209893 213701 216731 218847 219801 219531 218500 217630
54041 217630 217789 219207 221318 223281 224847 226751 230105 235262 241351 247033 251670 255628 259455 263000
54027 263000 265550 266725 266959 267063 267544 268407 269358 269994 269995 269430 268679 267840 266352 263621 259871 255911 252077
54010 252077 247923 243051 237699 232302 226982 221848 217298 213586 210400 207338 204467 201954 199412 196249
53996 196249 192622 189469 187568 186880 186803 186705 186238 185527 185031 184940 184853 184365 183739 183480 183439 183017 182188 181610 181579 181592
53976 181592 181161 180448 179802 179230 178738 178675 179293 180307 181268 182080 182846 183528 184118 184881 186101 187835 190153 193300
$$ packed form
54086A95717N475M645K965M45k324m432n301n058m312l643l241k961k660k394
54072A72921k280k213j879j131j94N55R75J200J355J360J073N18q4l70M2J302
54056A73150L030M465N072N026M889M915M868M478L808L030K116R54k70j031q70
54041B17630J59J418K111J963J566J904L354N157O089N682M637L958L827L545
54027B63000K550J175K34J04M81Q63R51O36Jn65p51q39j488k731l750l960l834
54010B52077m154m872n352n397n320n134m550l712l186l062k871k513k542l163
53996A96249l627l153j901o88p7r8m67p11m96r1q7m88o26k59m1m22q29n78l1J3
53976A81592m31p13o46n72m92o3O18J014R61Q12P66O82N90P63J220J734K318L147
$$ plain form
53958 193300 197330 201986 207199 213326 220556 228544 237117 246849 258331 271083 283685 294602 302371
53945 302371 305579 303780 298414 291882 285520 279140 272554 266600 262331 260018 259463 260654 263471 267138
53931 267138 270602 273321 275356 277024 278857 281586 285599 290488 295486 300163 304398 307992 310898 313722
53917 313722 317390 322281 328095 334526 341458 348455 354737 359956 364473 368501 371508 372929 373038 372507 371455
53902 371455 369676 367588 366004 364761 362462 358115 352470 347114 342578 337942 332075 324603 315780 306158
53888 306158 296614 288145 281188 275297 269658 263829 257897 252229 247241 243190 239952 237077 234188 231210
53874 231210 228195 225122 221998 218975 216186 213621 211290 209332 207783 206405 204986 203653 202635 201816
53860 201816 200816 199480 197987 196431 194602 192389 190171 188542 187682 187228 186759 186226 185800 185514 185281 185140
$$ packed form
53958A93300M030M656N213O127P230P988Q573R732J1482J2752J2602J0917P769
53945C02371L208j799n366o532o362o380o586n954m269k313n55J191K817L667
53931B67138L464K719K035J668J833K729M013M889M998M677M235L594K906K824
53917C13722L668M891N814O431O932O997O282N219M517M028L007J421J09n31j052
53902C71455j779k088j584j243k299m347n645n356m536m636n867p472q823r622
53888C06158r544q469o957n891n639n829n932n668m988m051l238k875k889k978
53874B31210l015l073l124l023k789k565k331j958j549j378j419j333j018q19
53860B01816j000j336j493j556j829k213k218j629q60m54m69n33m26k86k33j41
$$ plain form
53844 185140 185193 185291 185070 184426 183727 183453 183792 184698 185994 187244 187840 187586 187001 186757 187010 187606 188577 189887
53826 189887 190952 191117 190592 190261 190560 191231 192194 193860 196245 198538 200056 201091 202333 203917 205606 207485
53810 207485 209888 212809 215809 218419 220398 221918 223766 226936 231562 236606 241010 244843 248858 253328
53796 253328 257939 262471 266860 270719 273509 275272 276688 278408 280646 283255 285732 287256 287213 285653 282917
53781 282917 279140 274575 269964 265803 261499 256141 249939 244027 238888 234030 229258 225145 221815 218387
53767 218387 214293 210285 207315 205084 202586 199697 197289 195931 195256 194661 194059 193788 194122 194957 195764 195871
53751 195871 195006 193528 192048 190938 190280 189970 189677 188988 187948 187179 187172 187662 188089 188437 189162 190346 191380
53734 191380 191596 190986 190159 189757 189948 190439 190959 191642 192804 194382 195943 197300 198764 200556 202331 203595
$$ packed form
53844A85140N3R8k21o44o99k74L39R06J296J250N96k54n85k44K53N96R71J310
53826A89887J065J65n25l31K99O71R63J666K385K293J518J035J242J584J689J879
53810B07485K403K921L000K610J979J520J848L170M626N044M404L833M015M470
53796B53328M611M532M389L859K790J763J416J720K238K609K477J524m3j560k736
53781B82917l777m565m611m161m304n358o202n912n139m858m772m113l330l428
53767B18387m094m008k970k231k498k889k408j358o75n95o02k71L34Q35Q07J07
53751A95871q65j478j480j110o58l10k93o89j040p69pM90M27L48P25J184J034
53734A91380K16o10q27m02J91M91N20O83J162J578J561J357J464J792J775J264
$$ plain form
53718 203595 204318 204886 205655 206896 208882 211528 214141 215965 217007 217932 219246 220949 222934 225247 227888
53703 227888 230768 233963 237597 241341 244444 246598 248430 250833 253960 257263 260418 263716 267371 270823
53689 270823 273122 273928 273767 273284 272617 271680 270691 270014 269650 269316 268961 268748 268578 268116 267388 266852 266683 266483
53671 266483 265887 264965 263728 261870 259500 257541 256688 256411 255785 255023 255193 256491 257847 258553 259322 261122
53655 261122 263631 265528 265989 265316 264268 263319 262554 261928 261531 261654 262454 263505 264069 264007 264046 264823 266086 267252
53637 267252 268367 269887 271783 273599 275315 277354 279632 281428 282523 283810 286273 289863 293846 297798
53623 297798 301714 305538 309258 313228 317717 322273 326267 329946 334169 338997 343366 346406 348404 350064
53609 350064 351500 352569 353659 355416 357905 360616 363198 365749 368480 371435 374406 376842 378150 378464
$$ packed form
53718B03595P23N68P69J241J986K646K613J824J042R25J314J703J985K313K641
53703B27888K880L195L634L744L103K154J832K403L127L303L155L298L655L452
53689B70823K299Q06j61m83o67r37r89o77l64l34l55k13j70m62p28n36j69k00
53671B66483n96r22j237j858k370j959q53k77o26p62J70J298J356P06P69J800
53655B61122K509J897M61o73j048r49p65o26l97J23Q00J051N64o2L9P77J263J166
53637B67252J115J520J896J816J716K039K278J796J095J287K463L590L983L952
53623B97798L916L824L720L970M489M556L994L679M223M828M369L040J998J660
53609C50064J436J069J090J757K489K711K582K551K731K955K971K436J308L14
$$ plain form
53595 378464 378781 379823 381149 381969 382500 383628 385422 386913 387438 387242 386588 385219 383118 381006 379505 378374
53579 378374 377055 375388 373346 370719 367643 364879 362855 360986 358731 356836 356477 357352 357776 356767 355118
53564 355118 354020 353546 353059 352529 352706 354113 356374 358613 360205 361077 361422 361223 360208 358367 356408 355391
53548 355391 355814 357189 358625 359684 360642 362006 363951 366261 368804 371868 375757 380102 384007 387107 390130
53533 390130 394016 398795 403765 408654 413985 420263 427327 434762 442565 451156 460903 471846 483732 496179
53519 496179 508932 522006 535526 549418 563422 577463 591879 607304 624395 643514 664407
53508 664407 686227 708160 730047 752227 774835 797558 820002 841966 863262 883659 903131
53497 903131 921871 939931 957156 973665 990145 1007373 1025496 1043928 1061914 1079155 1095945
$$ packed form
53595C78464L17J042J326Q20N31J128J794J491N25j96o54j369k101k112j501j131
53579C78374j319j667k042k627l076k764k024j869k255j895l59Q75M24j009j649
53564C55118j098m74m87n30J77J407K261K239J592Q72L45j99j015j841j959j017
53548C55391M23J375J436J059R58J364J945K310K543L064L889M345L905L100L023
53533C90130L886M779M970M889N331O278P064P435P803Q591R747J0943J1886J2447
53519D96179J2753J3074J3520J3892J4004J4041J4416J5425J7091J9119K0893
53508F64407K1820K1933K1887K2180K2608K2723K2444K1964K1296K0397J9472
53497I03131J8740J8060J7225J6509J6480J7228J8123J8432J7986J7241J6790
$$ plain form
53486 1095945 1112746 1129618 1146177 1162152 1177754 1193237 1208415 1223064 1237685 1253158 1269431
53475 1269431 1285098 1298603 1309557 1318546 1326021 1331819 1335637 1337506 1337708 1336327 1332942 1326773 1317365
53462 1317365 1305217 1291549 1277419 1263285 1249369 1235838 1222383 1208171 1192763 1176706 1160678
53451 1160678 1144298 1126485 1106958 1086764 1067177 1048554 1030454 1012416 994385 976730 960181
53440 960181 945506 932994 922379 913421 906288 901108 897400 894318 891418 888880 887044 886089 886195 887577
53426 887577 890180 893612 897717 903021 910258 919503 930045 941206 953051 966167 980937 997139 1014190
53413 1014190 1031677 1049736 1069006 1090121 1113188 1137822 1163691 1190860 1219566 1249912 1281881
53402 1281881 1315472 1350700 1387624 1426449 1467333 1509991 1553863 1598940 1645914 1695098 1745619
$$ packed form
53486A095945J6801J6872J6559J5975J5602J5483J5178J4649J4621J5473J6273
53475A269431J5667J3505J0954Q989P475N798L818J869K02j381l385o169r408
53462A317365j2148j3668j4130j4134j3916j3531j3455j4212j5408j6057j6028
53451A160678j6380j7813j9527k0194j9587j8623j8100j8038j8031j7655j6549
53440I60181j4675j2512j0615q958p133n180l708l082k900k538j836r55J06J382
53426H87577K603L432M105N304P237R245J0542J1161J1845J3116J4770J6202J7051
53413A014190J7487J8059J9270K1115K3067K4634K5869K7169K8706L0346L1969
53402A281881L3591L5228L6924L8825M0884M2658M3872M5077M6974M9184N0521
$$ plain form
53391 1745619 1796276 1846868 1897911 1949277 2000067 2049892 2099285 2148482 2196678 2243030 2287594
53380 2287594 2330663 2371789 2410229 2445810 2478519 2507593 2531972 2551527 2566950 2578505 2585738
53369 2585738 2588457 2586942 2580815 2568609 2549156 2522876 2491107 2454654 2413741 2369132 2322414 2274971
53357 2274971 2227175 2178805 2129912 2081067 2033017 1986343 1941339 1897932 1855686 1814122 1773188
53346 1773188 1733378 1695150 1658154 1621265 1583636 1545701 1508918 1474527 1442744 1413051 1384901
53335 1384901 1358004 1332343 1308233 1286179 1266428 1248803 1233204 1219956 1209180 1199929 1190506 1179835
53323 1179835 1168145 1156169 1144069 1131477 1118287 1104926 1091951 1079795 1068994 1060213 1053741 1049079
53311 1049079 1045289 1041796 1038808 1037005 1036877 1038318 1040774 1043757 1047239 1051581 1057172 1064248 1072969 1083478
$$ packed form
53391A745619N0657N0592N1043N1366N0790M9825M9393M9197M8196M6352M4564
53380B287594M3069M1126L8440L5581L2709K9074K4379J9555J5423J1555P233
53369B585738K719j515o127j2206j9453k6280l1769l6453m0913m4609m6718m7443
53357B274971m7796m8370m8893m8845m8050m6674m5004m3407m2246m1564m0934
53346A773188l9810l8228l6996l6889l7629l7935l6783l4391l1783k9693k8150
53335A384901k6897k5661k4110k2054j9751j7625j5599j3248j0776r251r423j0671
53323A179835j1690j1976j2100j2592j3190j3361j2975j2156j0801q781o472m662
53311A049079l790l493k988j803j28J441K456K983L482M342N591P076Q721J0509
$$ plain form
53297 1083478 1095790 1109822 1125639 1143520 1163597 1185474 1208401 1231826 1255678 1280077 1304883
53286 1304883 1329507 1353146 1375189 1395492 1414230 1431517 1447256 1461367 1473905 1484772 1493472
53275 1493472 1499344 1501968 1501202 1497116 1490200 1481401 1471383 1459735 1445414 1428065 1408425 1387241 1364394
53262 1364394 1339523 1313056 1286050 1259203 1232566 1206076 1179796 1153624 1127327 1101046 1075369
53251 1075369 1050656 1026619 1002800 979152 955910 933123 910702 888793 867634 847009 826207
53240 826207 804807 783288 762616 743314 725190 707945 691633 676322 661650 647159 633067
53229 633067 620293 609649 601226 594536 588771 582798 575512 566724 557425 548682 540378 531498 521441
53216 521441 510423 498675 486086 472938 460282 448998 438878 429191 419853 411392 403828 396351
$$ packed form
53297A083478J2312J4032J5817J7881K0077K1877K2927K3425K3852K4399K4806
53286A304883K4624K3639K2043K0303J8738J7287J5739J4111J2538J0867Q700
53275A493472N872K624p66m086o916q799j0018j1648j4321j7349j9640k1184k2847
53262A364394k4871k6467k7006k6847k6637k6490k6280k6172k6297k6281k5677
53251A075369k4713k4037k3819k3648k3242k2787k2421k1909k1159k0625k0802
53240H26207k1400k1519k0672j9302j8124j7245j6312j5311j4672j4491j4092
53229F33067j2774j0644q423o690n765n973p286q788r299q743q304q880j0057
53216E21441j1018j1748j2589j3148j2656j1284j0120r687r338q461p564p477
$$ plain form
53204 396351 388336 380170 372742 366385 360694 355173 349695 344348 339169 334146 329257 324325 319005 313162
53190 313162 307232 301981 297709 293813 289378 284212 279141 275147 272380 270146 267715 264911 261927 258922
53176 258922 255969 253202 250747 248565 246617 245159 244519 244471 244141 242829 240781 238817 237274 235701 233650
53161 233650 231332 229256 227587 226244 225403 225369 225968 226547 226739 226887 227471 228386 229029 228935 228036 226451 224346
53144 224346 222028 219951 218514 217886 217974 218427 218761 218677 218262 217758 217249 216736 216419 216610 217411 218703 220450 222623
53126 222623 224787 226205 226641 226731 227265 228344 229544 230676 231921 233398 235036 236797 238570 239821 239888 238758
53110 238758 237178 235824 234738 233732 232837 232040 230993 229478 227884 226770 226114 225511 224952 224880 225437 226203
53094 226203 226844 227532 228415 229034 228714 227455 226111 225616 226237 227581 229111 230474 231374 231439 230498 228933 227467
$$ packed form
53204C96351q015q166p428o357n691n521n478n347n179n023m889m932n320n843
53190C13162n930n251m272l896m435n166n071l994k767k234k431k804k984l005
53176B58922k953k767k455k182j948j458o40m8l30j312k048j964j543j573k051
53161B33650k318k076j669j343q41l4N99N79J92J48N84R15O43r4q99j585k105
53144B24346k318k077j437o28Q8M53L34q4m15n04n09n13l17J91Q01J292J747K173
53126B22623K164J418M36R0N34J079J200J132J245J477J638J761J773J251O7j130
53110B38758j580j354j086j006q95p97j047j515j594j114o56o03n59p2N57P66
53094B26203O41O88Q83O19l20j259j344m95O21J344J530J363R00O5r41j565j466
$$ plain form
53077 227467 226488 225847 225462 225717 226886 228358 229010 228362 226940 225462 224082 222593 220920 219149 217354 215654
53061 215654 214261 213308 212819 212882 213608 214750 215742 216338 216845 217452 217660 216887 215390 214119 213734 214158 215025 216056
53043 216056 216926 217234 216876 216192 215580 215134 214832 214823 215280 216050 216660 216719 216199 215363 214517 213900 213759 214347 215647
53024 215647 217110 217870 217429 216135 214911 214562 215285 216680 218123 219240 220166 221292 222700 224067 225200
53009 225200 226432 228167 230171 231627 231867 230824 228832 226309 223738 221670 220547 220493 221277 222463 223694
52994 223694 224926 226283 227597 228298 227993 226961 225810 224788 223806 222941 222433 222235 222086 222081 222613 223594 224319
52977 224319 224446 224629 225689 227549 229539 231442 233616 236162 238616 240563 242006 242969 243264 242933 242499 242374
52961 242374 242330 241959 241438 241298 241535 241472 240624 239223 237702 236126 234479 233125 232457 232224 231714 230612 229227
$$ packed form
53077B27467r79o41l85K55J169J472O52o48j422j478j380j489j673j771j795j700
53061B15654j393r53m89O3P26J142R92N96N07O07K08p73j497j271l85M24Q67J031
53043B16056Q70L08l58o84o12m46l02rM57P70O10N9n20q36q46o17j41N88J300
53024B15647J463P60m41j294j224l49P23J395J443J117R26J126J408J367J133
53009B25200J232J735K004J456K40j043j992k523k571k068j123n4P84J186J231
52994B23694J232J357J314P01l05j032j151j022r82q65n08j98j49nN32R81P25
52977B24319J27J83J060J860J990J903K174K546K454J947J443R63K95l31m34j25
52961B42374m4l71n21j40K37o3q48j401j521j576j647j354o68k33n10j102j385
$$ plain form
52944 229227 227895 226652 225576 224908 224591 224180 223540 223187 223488 223966 223992 223835 224328 225578 226768 227258 227211 226944
52926 226944 226368 225426 224525 224038 223748 223245 222585 222134 221993 222064 222445 223238 224073 224378 224193 224163 224602 225037 224944 224534
52906 224534 224402 224647 224750 224320 223531 222809 222390 222312 222558 222951 223142 222966 222801 223289 224617 226276 227555 228148
52888 228148 228273 228395 228868 229620 230103 229825 229048 228642 229046 229733 229994 229900 230015 230444 230794 231009 231543 232627 233925
52869 233925 235117 236296 237527 238560 239287 240052 241074 241947 242096 241436 240193 238437 236285 234259 232830
52854 232830 231698 230141 228005 225858 224161 222838 221727 220834 219937 218471 216201 213681 211686 210414 209512
52839 209512 208670 207874 207206 206736 206558 206685 206895 206874 206515 206007 205640 205578 205752 205893 205824 205722 205915 206297 206250 205390
52819 205390 204193 203554 203867 204867 206262 208028 210105 212325 214771 217710 220833 223070 223609 222801 221555
$$ packed form
52944B29227j332j243j076o68l17m11o40l53L01M78K6j57M93J250J190M90m7k67
52926B26944n76r42r01m87k90n03o60m51j41P1L81P93Q35L05j85l0M39M35r3m10
52906B24534j32K45J03m30p89p22m19p8K46L93J91j76j65M88J328J659J279N93
52888B28148J25J22M73P52M83k78p77m06M04O87K61r4J15M29L50K15N34J084J298
52869B33925J192J179J231J033P27P65J022Q73J49o60j243j756k152k026j429
52854B32830j132j557k136k147j697j323j111q93q97j466k270k520j995j272r02
52839B09512q42p96o68m70j78J27K10k1l59n08l67o2J74J41o9j02J93L82m7q60
52819B05390j197o39L13J000J395J766K077K220K446K939L123K237N39q08j246
$$ plain form
52804 221555 220101 218057 215592 213700 213001 212910 212416 211280 210015 209051 208415 207978 207504 206508 204628 202259
52788 202259 200403 199790 200305 201233 201782 201509 200666 200182 200916 202789 204995 207016 208944 210696 211602 211191 209974
52771 209974 208884 208162 207294 205988 204714 204151 204405 204956 205253 205256 205423 206125 207067 207463 206848 205604 204578 204298
52753 204298 204668 205270 205790 206259 206990 208222 209817 211441 212992 214513 215742 216249 216257 216772 218462 220801 222845
52736 222845 224454 226131 227923 229269 229920 230241 230462 230363 229982 229958 230694 231578 231597 230490 228911 227589 226734
52719 226734 226156 225604 224932 224200 223605 223219 222785 221969 220763 219527 218641 218275 218439 219097 220140 221380 222581
52702 222581 223512 223944 223761 223157 222701 223001 224127 225402 225959 225592 224956 224828 225335 226001 226360 226322 226015 225557
52684 225557 225029 224486 223961 223488 223112 222800 222477 222206 222177 222356 222408 222202 222143 222687 223627 224291 224294 223754 222926 222152
$$ packed form
52804B21555j454k044k465j892o99r1m94j136j265r64o36m37m74r96j880k369
52788B02259j856o13N15R28N49k73q43m84P34J873K206K021J928J752R06m11j217
52771B09974j090p22q68j306j274n63K54N51K97LJ67P02R42L96o15j244j026k80
52753B04298L70O02N20M69P31J232J595J624J551J521J229N07QN15J690K339K044
52736B22845J609J677J792J346O51L21K21r9l81k4P36Q84J9j107j579j322q55
52719B26734n78n52o72p32n95l86m34q16j206j236q86l66J64O58J043J240J201
52702B22581R31M32j83o04m56L00J126J275N57l67o36j28N07O66L59l8l07m58
52684B25557n28n43n25m73l76l12l23k71k9J79N2k06n9N44R40O64Ln40q28p74
$$ plain form
52664 222152 222052 223125 225046 226903 228241 229388 230708 232185 233926 236323 239267 241821 243250 243863 244279
52649 244279 244362 243577 241994 240175 238298 236274 234580 234099 234954 236257 237207 237775 238117 238118 237983 238629 240744
52632 240744 243767 246457 248413 250499 253716 258100 262754 266586 268783 268860 266676 262620 257675 253035 249389
52617 249389 246561 243964 241396 239232 237861 237215 236994 237052 237318 237490 237160 236263 235183 234328 233740 233219 232702
52600 232702 232349 232289 232428 232655 233120 234106 235561 236983 237956 238680 239677 241102 242626 243947 244980 245489 245043
52583 245043 243737 242548 242460 243362 244327 244911 245571 246645 247506 247263 245975 244666 244119 244109 243915 243267 242499 241982
52565 241982 241654 241174 240398 239627 239346 239733 240459 241026 241208 241022 240354 238964 237033 235422 235018 235782 236744 236991
52547 236991 236462 235680 235004 234393 233792 233420 233609 234437 235544 236306 236351 236013 236174 237472 239627 241728 243120
$$ packed form
52664B22152j00J073J921J857J338J147J320J477J741K397K944K554J429O13M16
52649B44279Q3p85j583j819j877k024j694m81Q55J303R50N68L42Jj35O46K115
52632B40744L023K690J956K086L217M384M654L832K197P7k184m056m945m640l646
52617B49389k828k597k568k164j371o46k21N8K66J72l30q97j080q55n88n21n17
52600B32702l53o0J39K27M65R86J455J422R73P24R97J425J524J321J033N09m46
52583B45043j306j189q8R02R65N84O60J074Q61k43j288j309n47j0j94o48p68n17
52565B41982l28m80p76p71k81L87P26N67J82j86o68j390j931j611m04P64R62K47
52547B36991n29p82o76o11o01l72J89Q28J107P62M5l38J61J298K155K101J392
$$ plain form
52530 243120 243811 244080 244016 243608 243008 242431 241955 241587 241409 241394 241209 240537 239614 239108 239350 240001 240615 241263 242298
52511 242298 243761 245387 247124 249198 251610 253972 255959 257635 259089 260052 260196 259611 258678 257570 256250
52496 256250 254896 253931 253471 253063 252154 250677 248954 247223 245464 243669 242073 240957 240296 239760 239202 239052
52480 239052 239907 241669 243452 244603 245472 246695 248021 248608 248395 248277 248684 248852 248154 247404 247950 249858 251990
52463 251990 253712 255565 258094 260953 263545 265828 267951 269563 269992 268873 266328 262862 259372 256802
52449 256802 255323 254139 252503 250622 249128 248022 246804 245443 244442 243949 243530 242993 242698 242743 242488 241452
52433 241452 240240 239875 240456 241063 240992 240525 240404 241042 242423 244331 246333 247822 248454 248505 248560 248915 249527 250463
52415 250463 252058 254585 257997 262080 266649 271557 276838 283038 291102 301448 313159 324311 333126
$$ packed form
52530B43120O91K69o4m08o00n77m76l68j78j5j85o72r23n06K42O51O14O48J035
52511B42298J463J626J737K074K412K362J987J676J454R63J44n85r33j108j320
52496B56250j354r65m60m08r09j477j723j731j759j795j596j116o61n36n58j50
52480B39052Q55J762J783J151Q69J223J326N87k13j18M07J68o98p50N46J908K132
52463B51990J722J853K529K859K592K283K123J612M29j119k545l466l490k570
52449B56802j479j184j636j881j494j106j218j361j001m93m19n37k95M5k55j036
52433B41452j212l65N81O07p1m67j21O38J381J908K002J489O32N1N5L55O12R36
52415B50463J595K527L412M083M569M908N281O200Q064J0346J1711J1152Q815
$$ plain form
52402 333126 338627 340390 338290 332832 325378 317529 310193 303430 297100 291406 286744 283293 280910 279333
52388 279333 278333 277688 277140 276485 275692 274836 273873 272651 271317 270528 270890 272195 273644 274966 276843 279905
52372 279905 283778 287678 291600 296177 301442 306579 311042 315175 319345 323156 326029 328057 329629 330589
52358 330589 330523 329706 329028 328981 329313 329704 330163 330626 330839 330914 331456 332830 334743 336913 339676 343478 348068 352717
52340 352717 356984 360814 364203 367398 371333 377110 384882 393749 402911 412464 422858 434171 446302
52327 446302 459472 474027 489928 506867 524789 543870 563988 584603 605241 625768 646122
52316 646122 666120 685721 705206 724782 744098 762426 779332 794971 809698 823634 836778
52305 836778 849345 861675 873773 885210 895650 905261 914327 922599 929340 934045 936817 937972 937551
$$ packed form
52402C33126N501J763k100n458p454p849p336o763o330n694m662l451k383j577
52388B79333j000o45n48o55p93q56r63j222j334p89L62J305J449J322J877L062
52372B79905L873L900L922M577N265N137M463M133M170L811K873K028J572R60
52358C30589o6q17o78m7L32L91M59M63K13P5N42J374J913K170K763L802M590M649
52340C52717M267L830L389L195L935N777P772Q867R162R553J0394J1313J2131
52327D46302J3170J4555J5901J6939J7922J9081K0118K0615K0638K0527K0354
52316F46122J9998J9601J9485J9576J9316J8328J6906J5639J4727J3936J3144
52305H36778J2567J2330J2098J1437J0440R611R066Q272O741M705K772J155m21
$$ plain form
52292 937551 935410 931529 926020 918958 910458 900893 890934 881403 873059 866248 860663 855826 852038 850462
52278 850462 851814 855276 859342 863549 868700 875475 883710 893286 904744 918314 932866 946662 958910
52265 958910 969988 980462 990764 1001695 1014192 1028164 1042207 1054995 1066533 1077644 1088606
52254 1088606 1098879 1107921 1115707 1122425 1128094 1132583 1135662 1136951 1136097 1133119 1128310 1121691 1112844 1101502
52240 1101502 1088201 1074137 1060384 1047367 1035023 1023242 1012074 1001652 992023 983092 974691 966735
52228 966735 959320 952680 947015 942382 938731 936072 934547 934300 935211 936818 938534 940031 941428 943097 945359
52213 945359 948381 952297 957217 963029 969249 975273 980799 985884 990577 994653 997895 1000579 1003442 1007073
52199 1007073 1011404 1015856 1019933 1023682 1027642 1032377 1037994 1043980 1049533 1054095 1057592 1060180 1061896 1062611
$$ packed form
52292I37551k141l881n509p062q500r565r959r531q344o811n585m837l788j576
52278H50462J352L462M066M207N151O775Q235R576J1458J3570J4552J3796J2248
52265I58910J1078J0474J0302J0931J2497J3972J4043J2788J1538J1111J0962
52254A088606J0273R042P786O718N669M489L079J289q54k978m809o619q847j1342
52240A101502j3301j4064j3753j3017j2344j1781j1168j0422r629q931q401p956
52228I66735p415o640n665m633l651k659j525k47R11J607J716J497J397J669K262
52213I45359L022L916M920N812O220O024N526N085M693M076L242K684K863L631
52199A007073M331M452M077L749L960M735N617N986N553M562L497K588J716P15
$$ plain form
52185 1062611 1062244 1060805 1058243 1054380 1049148 1042731 1035284 1026640 1016662 1005998 996133 988278 982262 976892
52171 976892 971408 966185 961983 958966 956801 955288 954430 954120 954302 955336 957619 960793 963854 966224 968240
52156 968240 970450 972921 975488 978163 980808 982846 983864 984264 984793 985641 986566 987742 989761 992643 995450
52141 995450 997136 997394 996564 995223 994147 994193 995777 998578 1002069 1006191 1011397 1018301 1027466 1039237 1053499
52126 1053499 1069796 1087956 1108323 1131116 1155847 1181752 1208536 1236182 1264224 1291741 1318125
52115 1318125 1343372 1367578 1390668 1412723 1434044 1454550 1473477 1489955 1503653 1514631 1522911
52104 1522911 1528651 1532521 1535368 1537435 1538239 1537298 1534641 1530499 1524820 1517296 1507655 1495659 1481019 1463733
52090 1463733 1444615 1425198 1406788 1389653 1373304 1357586 1343276 1331470 1322473 1315529 1309704 1304892
$$ packed form
52185A062611l67j439k562l863n232o417p447q644r978j0664r865p855o016n370
52171I76892n484n223m202l017k165j513q58l10J82J034K283L174L061K370K016
52156I68240K210K471K567K675K645K038J018M00N29Q48R25J176K019K882K807
52141I95450J686K58q30j341j076M6J584K801L491M122N206O904R165J1771J4262
52126A053499J6297J8160K0367K2793K4731K5905K6784K7646K8042K7517K6384
52115A318125K5247K4206K3090K2055K1321K0506J8927J6478J3698J0978Q280
52104A522911N740L870K847K067Q04r41k657m142n679p524r641j1996j4640j7286
52090A463733j9118j9417j8410j7135j6349j5718j4310j1806q997o944n825m812
$$ plain form
52078 1304892 1301800 1301043 1302490 1305668 1310607 1317946 1328098 1340553 1354268 1368603 1383595 1399404 1415871
52065 1415871 1432746 1449899 1466961 1483037 1497232 1509488 1520544 1531049 1541044 1550298 1558650 1565743
52053 1565743 1570784 1573039 1572509 1569727 1564845 1557215 1546015 1531112 1513204 1493295 1472208 1450474 1428390
52040 1428390 1406010 1383241 1360168 1337365 1315777 1296114 1278349 1261885 1246271 1231635 1218294
52029 1218294 1206054 1194119 1181724 1168712 1155392 1142020 1128651 1115387 1102498 1090174 1078427
$$ packed form
52078A304892l092p57J447L178M939P339J0152J2455J3715J4335J4992J5809J6467
52065A415871J6875J7153J7062J6076J4195J2256J1056J0505R995R254Q352P093
52053A565743N041K255n30k782m882p630j1200j4903j7908j9909k1087k1734k2084
52040A428390k2380k2769k3073k2803k1588j9663j7765j6464j5614j4636j3341
52029A218294j2240j1935j2395j3012j3320j3372j3369j3264j2889j2324j1747
$$ [...]
##END NTUPLES=NMR SPECTRUM
##END=
