
##TITLE=AC1169_Tolima-ibage-TGAAH12004_5890996_8qJEQRyVzN
##JCAMPDX= 6.0         $$ Bruker NMR JCAMP-DX V2.0
##DATA TYPE= NMR SPECTRUM
##DATA CLASS= NTUPLES
##ORIGIN= BRUKER
##OWNER= Administrator
$$ 1.72 TOPSPIN		Version 2.1
$$ 2012-04-02 19:30:58.531 -0500  Administrator@TOPSPIN
$$ Compression mode = diff/dup
##.OBSERVE FREQUENCY= 400.13188235
##.OBSERVE NUCLEUS= ^1H
##.ACQUISITION MODE= SIMULTANEOUS (DQD)
##.ACQUISITION SCHEME= undefined
##.AVERAGES= 8
##.DIGITISER RES= 22
##SPECTROMETER/DATA SYSTEM= spect
##.PULSE SEQUENCE= zg30
##.SOLVENT NAME= COFFEE_meoh
##.SHIFT REFERENCE= INTERNAL, COFFEE_meoh, 1, 14.98061
##AUDIT TRAIL= $$ (NUMBER, WHEN, WHO, WHERE, PROCESS, VERSION, WHAT)
$$ ##TITLE= Audit trail, TOPSPIN		Version 2.1
$$ ##JCAMPDX= 5.01
$$ ##ORIGIN= Bruker BioSpin GmbH
$$ ##OWNER= Administrator
$$ $$ C:\Bruker\TOPSPIN/data/COFFEE/nmr/AC1169_Tolima-ibage-TGAAH12004_5890996_8qJEQRyVzN/10/pdata/1/auditp.txt
$$ ##AUDIT TRAIL=  $$ (NUMBER, WHEN, WHO, WHERE, PROCESS, VERSION, WHAT)
(   1,<2012-04-02 19:30:50.562 -0500>,<Administrator>,<TOPSPIN>,<go>,<TOPSPIN 2.1>,
      <created by zg
	started at 2012-04-02 19:29:43.609 -0500,
	POWCHK enabled, PULCHK disabled,
       configuration hash MD5:
       1A 1E CE 29 27 FD 77 03 67 4E F0 E3 C4 B2 CB 90
       data hash MD5: 64K
       97 C6 D4 CF D3 C8 A3 41 21 ED 46 16 81 89 45 55>)
(   2,<2012-04-02 19:30:53.453 -0500>,<Administrator>,<TOPSPIN>,<proc1d>,<TOPSPIN 2.1>,
      <Start of raw data processing
       efp LB = 0 FT_mod = 6 PKNL = 1 PHC0 = 0 PHC1 = 0 SI = 32K 
       data hash MD5: 32K
       B0 BC 3A 00 94 87 93 C4 AE 6E 65 57 4D 41 E0 FA>)
(   3,<2012-04-02 19:30:53.937 -0500>,<Administrator>,<TOPSPIN>,<proc1d>,<TOPSPIN 2.1>,
      <pk PHC0 = 212.9755 PHC1 = 0 
       data hash MD5: 32K
       EC 77 24 66 E9 7B E9 BC 87 22 50 D8 E9 8B 73 90>)
(   4,<2012-04-02 19:30:54.062 -0500>,<Administrator>,<TOPSPIN>,<proc1d>,<TOPSPIN 2.1>,
      <abs ABSG = 1 
       data hash MD5: 32K
       A4 DC F6 63 03 30 7D 45 C6 9F B2 58 80 67 99 05>)
(   5,<2012-04-02 19:30:54.109 -0500>,<Administrator>,<TOPSPIN>,<proc1d>,<TOPSPIN 2.1>,
      <abs ABSG = 2 
       data hash MD5: 32K
       58 09 C6 87 69 D4 F5 2F 0F B9 9D 42 7D 3D 2E CF>)
(   6,<2012-04-02 19:30:54.140 -0500>,<Administrator>,<TOPSPIN>,<proc1d>,<TOPSPIN 2.1>,
      <abs ABSG = 3 
       data hash MD5: 32K
       54 48 9D 38 EC FC 13 97 40 08 4A AB 94 B2 9B C3>)
(   7,<2012-04-02 19:30:54.171 -0500>,<Administrator>,<TOPSPIN>,<proc1d>,<TOPSPIN 2.1>,
      <abs ABSG = 4 
       data hash MD5: 32K
       47 2C 79 C1 65 48 00 D8 B8 4F 59 52 E3 36 78 A6>)
(   8,<2012-04-02 19:30:54.218 -0500>,<Administrator>,<TOPSPIN>,<proc1d>,<TOPSPIN 2.1>,
      <abs ABSG = 5 
       data hash MD5: 32K
       C5 50 D0 EA 7C 2F 41 CA 26 3D 4F 23 FA E7 FB 96>)
$$ ##END=
$$ 
$$ $$ hash MD5
$$ $$ B1 A0 F5 76 70 9C EB 70 8C 7D 20 54 FD 35 E4 A3
##$RELAX= 
##$RELAX= 
##$RELAX= 
##$RELAX= 
##$RELAX= 
##$RELAX= 
##$RELAX= 
$$ Bruker specific parameters
$$ [...]
##$TP= (0..7)
150 150 150 150 150 150 150 150
##$TP07= 0
##$TPNAME0= <>
##$TPNAME1= <>
##$TPNAME2= <>
##$TPNAME3= <>
##$TPNAME4= <>
##$TPNAME5= <>
##$TPNAME6= <>
##$TPNAME7= <>
##$TPOAL= (0..7)
0.5 0.5 0.5 0.5 0.5 0.5 0.5 0.5
##$TPOFFS= (0..7)
0 0 0 0 0 0 0 0
##$TUNHIN= 0
##$TUNHOUT= 0
##$TUNXOUT= 0
##$USERA1= <user>
##$USERA2= <user>
##$USERA3= <user>
##$USERA4= <user>
##$USERA5= <user>
##$V9= 5
##$VALIST= <valist>
##$VCLIST= <CCCCCCCCCCCCCCC>
##$VD= 0
##$VDLIST= <DDDDDDDDDDDDDDD>
##$VPLIST= <PPPPPPPPPPPPPPP>
##$VTLIST= <TTTTTTTTTTTTTTT>
##$WBST= 2048
##$WBSW= 25
##$XGAIN= (0..3)
0 0 0 0
##$XL= 0
##$YL= 0
##$YMAX_a= 531464
##$YMIN_a= -650718
##$ZGOPTNS= <>
##$ZL1= 120
##$ZL2= 120
##$ZL3= 120
##$ZL4= 120
##$ABSF1= 14.98061
##$ABSF2= -5.57192
##$ABSG= 5
##$ABSL= 3
##$ALPHA= 0
##$AQORDER= 0
##$ASSFAC= 0
##$ASSFACI= 0
##$ASSFACX= 0
##$ASSWID= 0
##$AUNMP= <proc_prof1d_extract_pilot.lims>
##$AXLEFT= 0
##$AXNAME= <>
##$AXNUC= <1H>
##$AXRIGHT= 0
##$AXTYPE= 0
##$AXUNIT= <>
##$AZFE= 0.1
##$AZFW= 0.1
##$BCFW= 0
##$BC_mod= 0
##$BYTORDP= 0
##$COROFFS= 0
##$CY= 15
##$DATMOD= 1
##$DC= 0
##$DFILT= <>
##$DTYPP= 0
##$F1P= 0
##$F2P= 0
##$FCOR= 0.5
##$FTSIZE= 32768
##$FT_mod= 6
##$GAMMA= 0
##$GB= 0
##$INTBC= 1
##$INTSCL= 1
##$ISEN= 128
##$LB= 0
##$LEV0= 0
##$LPBIN= 0
##$MAXI= 10000
##$MC2= 0
##$MEAN= 0
##$ME_mod= 0
##$MI= 0
##$NCOEF= 0
##$NC_proc= -8
##$NLEV= 6
##$NOISF1= 0
##$NOISF2= 0
##$NSP= 0
##$NTH_PI= 0
##$NZP= 0
##$OFFSET= 14.98061
##$PC= 1
##$PHC0= 212.9755
##$PHC1= 0
##$PH_mod= 1
##$PKNL= yes
##$PPARMOD= 0
##$PPDIAG= 0
##$PPIPTYP= 0
##$PPMPNUM= 2147483647
##$PPRESOL= 1
##$PSCAL= 4
##$PSIGN= 0
##$PYNMP= <proc.py>
##$REVERSE= no
##$SF= 400.13
##$SI= 32768
##$SIGF1= 0
##$SIGF2= 0
##$SINO= 400
##$SIOLD= 32768
##$SPECTYP= <>
##$SREGLST= <1H.CDCl3>
##$SSB= 0
##$STSI= 32768
##$STSR= 0
##$SW_p= 8223.68421052632
##$SYMM= 0
##$S_DEV= 0
##$TDeff= 65536
##$TDoff= 0
##$TI= <>
##$TILT= no
##$TM1= 0
##$TM2= 0
##$TOPLEV= 0
##$USERP1= <user>
##$USERP2= <user>
##$USERP3= <user>
##$USERP4= <user>
##$USERP5= <user>
##$WDW= 1
##$XDIM= 32768
##$YMAX_p= 470337622
##$YMIN_p= -727487
##$CURPLOT= <Network HP LaserJet P1505>
##$CURPRIN= <$Network HP LaserJet P1505>
##$DFORMAT= <normdp>
##$LAYOUT= <+/1D_H.xwp>
##$LFORMAT= <normlp>
##$PFORMAT= <normpl>
##$SURQMSG= 1
$$ End of Bruker specific parameters
$$ ---------------------------------
##NTUPLES= NMR SPECTRUM
##VAR_NAME=  FREQUENCY,     SPECTRUM/REAL,   SPECTRUM/IMAG
##SYMBOL=    X,             R,               I
##VAR_TYPE=  INDEPENDENT,   DEPENDENT,       DEPENDENT
##VAR_FORM=  AFFN,          ASDF,            ASDF
##VAR_DIM=   32768,         32768,           32768
##UNITS=     HZ,            ARBITRARY UNITS, ARBITRARY UNITS
##FACTOR=    0.250966925370066, 1,           1
##FIRST=     8223.43324360095, -109363,      -57305
##LAST=      0,             -103290,         -8625
##MIN=       0,             -727487,         0
##MAX=       8223.43324360095, 470337622,    0
$$ Real data points
##PAGE= N=1
##DATA TABLE= (X++(R..R)), XYDATA
$$ [...]
19450a62813k07378a53526j72323Q5678f0152j86990j45415f7520j32020B4129
19439b75931a07403m02090F015b47992Q1512j37590D730h7523D3044Q8002i0671
19427B21018a63441r8414J05601l3725F7084i6874k24210J38331k5351G9334i5195
19415I717b7653n6933A41950a06160G8590h6846j66072g7707A37613e1846P362
19404d4484m79406i9547E3560J35466P4953c4339H2078b23452k1985A65144a97891
19392a41019e7302D42311D7773b03727A96479b06663l4169J2059P4075m941D227
19380A47489C1496i6812G1076a02791J5624A19587e5378A50030a38959b3272B87640
19368D6236d86035a06498j54982J8564H5368a15043j80381p8750a78251c3232
$$ plain form
19450 -162813 -370191 -153526 -325849 -240171 -60152 -247142 -392557 -67520 -199540 24129
19439 -275931 -107403 -509493 6015 -247992 -166480 -304070 4730 -87523 43044 131046 -90671
19427 221018 -163441 -261855 -156254 -189979 67084 -96874 -321084 -182753 -208104 79334 -95195
19415 9717 -27653 -84586 141950 -106160 78590 -86846 -252918 -77707 137613 -51846 -44484
19404 -44484 -523890 -99547 53560 189026 263979 -34339 82078 -223452 -245437 165144 -197891
19392 -141019 -57302 442311 47773 -203727 196479 -206663 -240832 -228773 -154698 -159639 4227
19380 147489 31496 -96812 71076 -102791 -87167 119587 -55378 150030 -138959 -23272 287640
19368 46236 -486035 -106498 -261480 -242916 85368 -115043 -295424 -374174 -178251 -33232
19357a98541B50658J32625b3481G8257a73952B14002a23503D0821a47122j79772
19347c26894h5942j46323P6695j92479C7073J94003e5667j36380C20850a51433
19336F2841J07332c35267A11212b7640E1519M8082c57706f6084D1385L79194a74372
19324H1818a99241j1638I4073b0829I6294g0338j51333f660k3103m74853a7175
19312I6404C1381a95923P9276d0994C9456e4123p2546m1742F4746j245Q0884a49598
19299A33905M9311d3673j21880j12917e2907A35905f9221j24071j08542l7732
19289c39566A08324Q023e5371e050k60551B50469a39437A41270a39130j3907N2270
19278a00767k01359a5398A36309h1840n7816I3987e8663k5836A25403c7657E8654
$$ plain form
19357 -198541 250658 383283 -23481 78257 -173952 214002 -123503 40821 -147122 -326894
19347 -326894 -85942 -232265 -155570 -348049 37073 231076 -55667 -192047 320850 -151433
19336 62841 170173 -335267 111212 -27640 51519 99601 -357706 -66084 41385 420579 -174372
19324 81818 -199241 -210879 94073 -20829 96294 -70338 -221671 -6660 -29763 -504616 -17175
19312 96404 31381 -195923 -116647 -40994 39456 -54123 -126669 -168411 64746 63501 144385 -149598
19299 133905 183216 -43673 -165553 -278470 -52907 135905 -69221 -193292 -301834 -339566
19289 -339566 108324 116347 -55371 -5050 -265601 250469 -139437 141270 -139130 -153037 -100767
19278 -100767 -302126 -15398 136309 -81840 -139656 93987 -58663 -84499 125403 -37657 58654
19266F5896a07069A71353f6322k1645b090B4838b16997B91517i6625K3597j5200
19255h8228A03199a27023A19877J62467I9189a71112k21315J62465c4880j64586
19245a99466R2845N768c9891A81773a17289A39580a15022e4324j86191p6467F502
19233A67914a6889B45828e6108l42680H3540b07107H3228a76795O8415q3524P5854
19222a16050k36427A19381f4051r3015d4317n2204C3185c86403A77922B2255J25864
19211A48119a55633l11791b2235g398A41195E5366b50339J18739b3106f986k45713
19200b52699b1344F6837c7071o6611o9764G2110c8708A87707a34732I1818a54706
19188c07030R4929H4798R8385b13627L2078A89162a62132G0410a5948C0189e3342
$$ plain form
19266 65896 -107069 171353 -66322 -87967 -2090 24838 -216997 291517 -96625 -73028 -88228
19255 -88228 103199 -127023 119877 282344 99189 -171112 -392427 -229962 -34880 -199466
19245 -199466 -106621 -100853 -39891 181773 -117289 139580 -115022 -54324 -240515 -316982 6502
19233 167914 -16889 245828 -56108 -398788 83540 -207107 83228 -176795 -108380 -191904 -116050
19222 -116050 -352477 119381 -64051 -157066 -44317 -96521 33185 -386403 177922 22255 148119
19211 148119 -155633 -467424 -22235 -7398 141195 55366 -250339 -131600 -23106 -6986 -252699
19200 -252699 -21344 66837 -37071 -103682 -173446 72110 -38708 187707 -134732 91818 -154706
19188 -307030 -212101 84798 183183 -213627 -181549 189162 -162132 70410 -15948 30189 -53342
19176c28240n8524B78070b16242J06630n9358F3656c46832a31988b0458A4258
19165b6576j50853n9951a1317k59142C70125a44582C2625J50473a81241D304d9491
19153D5161J09345a18750O646G1043j4433j706i1062K5177C3316c7347A70236
19141B39949J543D5829j6654c30692g5536l7485j93700J45841M0941A18170N255
19130A23425a94531K4970l9087D28365a9928j67438k8477K3109k0483j26580C9177
19118B090d34221a86491A10100J5644i5004B7012J60365b61288N242Q8569f1011
19106a30633A8469Q6042a6529k73851E6340L6535K2947E1590P9996E6559a83202
19094A10062a32982B35430b27419K1084N1087F637c13752N2669P5743B5018i5479
$$ plain form
19176 -328240 -386764 278070 -216242 -109612 -168970 63656 -346832 -131988 -20458 14258
19165 -26576 -177429 -237380 -11317 -270459 370125 -144582 32625 183098 -181241 4304 -49491
19153 45161 154506 -118750 -112104 71043 56610 54904 -91062 -65885 33316 -37347 170236
19141 239949 241492 45829 29175 -330692 -75536 -113021 -306721 -160880 -119939 118170 123425
19130 123425 -194531 -169561 -208648 428365 -19928 -187366 -215843 -192734 -213217 -339797 39177
19118 2090 -434221 -186491 110100 125744 -95004 27012 187377 -261288 -256046 -167477 -61011
19106 -130633 18469 104511 -16529 -290380 56340 92875 115822 51590 131586 56559 -183202
19094 110062 -132982 235430 -227419 -206335 -155248 6637 -313752 -261083 -185340 25018 -95479
19082A31191E5617J12887L9189h4781p6469R823F1241b56312N6563B5686k484
19071B3202b00741A35431a16158I6632R68a37818m49217b29690A19862c18675
19060d4552B8172c13675M0290h9072A53993a44636b6495r2674E1745a36288k3431
19049a59719A11242L28932b03331B39313a56377A12868d03258e4136G332J1552
19039A8884K0494b48893D1336q965R0401e2295n0871B4814r507L85895b0800j60522
19027a81322p5423h756k61120O4578J00997L9974J4717k85929A58996E5995K19135
19016B75130p845c7088j45643F6357a9033B664O2680K00911I0429O8241A0304
19004a74305j53254L9964e0736J543k07972Q219B42697a94016c5623A25806C0878
$$ plain form
19082 131191 55617 168504 207693 -84781 -161250 -151427 61241 -256312 -199749 25686 23202
19071 23202 -200741 135431 -116158 96632 97600 -137818 -587035 -229690 119862 -318675
19060 -44552 28172 -313675 -273385 -89072 153993 -144636 -26495 -119169 51745 -136288 -159719
19049 -159719 111242 440174 -203331 239313 -156377 112868 -403258 -54136 7332 18884
19039 18884 39378 -248893 41336 32371 122772 -52295 -103166 24814 15307 401202 -20800 -181322
19027 -181322 -256745 -8756 -269876 -205298 -104301 -64327 -49610 -335539 158996 55995 275130
19016 275130 267285 -37088 -182731 66357 -19033 2664 65344 266255 90429 158670 10304
19004 -174305 -327559 -287595 -50736 -49193 -257165 -248946 242697 -194016 -35623 125806 30878
18992C62131a13505C7688a7586j45815P769E0472b2953I1410a97196A34773a6223
18980a39983B81645a47113O0857q7929j5381e1258l47560B29040h9541B31020
18969a96598R0617c2834l9347j55927i7851D4245a93381C7174N4803P4666L3088
18958A99731J66085j8881n0808J03967j49298F4990a43250f7288j70539A87485
18947c3912k22468j36603a62052i120l37019a8284D4295a55214L5239A09911c54508
18935D1793a30706G3597k7853b44205g4436B3953h0465A24168c09295D758P5198
18924G9956P6558E0496d3471F3488B0514b55812C6666a43362e4927B04545J12479
18913C17024a41748d8796A71196b27057A21431c50618J61157g5010n2264A8969
$$ plain form
18992 362131 -113505 37688 -17586 -163401 -155632 50472 -22953 91410 -197196 134773 -16223
18980 -139983 281645 -147113 -86256 -174185 -189566 -51258 -398818 229040 -89541 231020
18969 -196598 -105981 -32834 -72181 -228108 -97851 44245 -193381 37174 91977 166643 199731
18958 199731 365816 346935 296127 400094 250796 64990 -143250 -67288 -237827 187485
18947 -33912 -256380 -392983 -162052 -9120 -346139 -18284 44295 -155214 -119975 109911 -354508
18935 41793 -130706 73597 45744 -244205 -74436 23953 -80465 124168 -309295 4758 79956
18924 79956 156514 50496 -43471 63488 20514 -255812 36666 -143362 -54927 204545 317024
18913 317024 -141748 -48796 171196 -227057 121431 -350618 -189461 -75010 -127274 18969
18902a64586H5604J20833o6602J9289G8573l2165L16093J32381j25553N3872K1466
18891D44667C3098a39689L0802k9952A70771e1436A9946a28063A4076i4327A71874
18879b7879B35553h7491j93041a09933b7528A44945b07321k7860E5035h7702j24661
18868b12363m4859B14423d18332B2624b37914b6438p0930A8121R6433E2717h6523
18856C450a9143A13518h9366k94299a25501Q792E9459j3751j1678O5561a82966
18844F9023a22340A59558h2133B17401k0927p8570m0833b75395B50710a49425
18833A41739o4725i8828B1567a01510I8102a32825j66117a04469A02588b86392
18822E6687a45641j15601a22853j86179I271c09531F6160i3005B52378c81749
$$ plain form
18902 -164586 85604 206437 139835 159124 78573 46408 362501 494882 369329 423201 444667
18891 444667 33098 -139689 -108887 -138839 170771 -51436 19946 -128063 14076 -94327 171874
18879 -27879 235553 -87491 -280532 -109933 -27528 144945 -207321 -235181 55035 -87702 -212363
18868 -212363 -257222 214423 -418332 22624 -237914 -26438 -97368 18121 114554 52717 -86523
18856 3450 -19143 113518 -89366 -383665 -125501 -116709 59459 45708 34030 99591 -182966
18844 69023 -122340 159558 -82133 217401 196474 117904 77071 -275395 250710 -149425
18833 141739 77014 -98828 21567 -101510 98102 -132825 -298942 -104469 102588 -286392
18822 56687 -145641 -261242 -122853 -309032 9271 -309531 66160 -93005 252378 -381749
18811B2598A1024c45364I3399M1265K24948C834L5243a6437B60298c5329l86419
18800d21748I6568K27421a70008L1819A3583J80751j3885c9001B65773e6071D0279
18788A27761M5024a61998A56069d2889j97009e0490A6832a9568G549a71779j96867
18777c68646D9560a48851M1909A42718a85012F204J19675g2692d55B63866p3236
18766A90630a71231P7207A96403b40248c2502A70475a10433b905H6546i6660i164
18754A5078b29046j2779C1726c7116j77642K577b1479n3999B30678k7230I6721
18742B93835a28048K3059j59007a27361A63279a3566A41541K95746A02495b51831
18731d95344a68888n9674A83871a08378m266e1202k65937a37373K3682G7012J07923
$$ plain form
18811 22598 11024 -345364 93399 134664 359612 3834 39077 -16437 260298 -35329 -421748
18800 -421748 96568 323989 -170008 -138189 13583 194334 180449 -39001 265773 -56071 40279
18788 127761 172785 -161998 156069 -42889 -239898 -50490 16832 -19568 7549 -171779 -368646
18777 -368646 49560 -148851 -106942 142718 -185012 6204 125879 -72692 -455 263866 190630
18766 190630 -171231 -94024 196403 -240248 -32502 170475 -110433 -2905 86546 -96660 -9164
18754 15078 -229046 -241825 31726 -37116 -214758 -212181 -21479 -75478 230678 203448 96721
18742 293835 -128048 -104989 -263996 -127361 163279 -13566 141541 437287 102495 -251831
18731 -495344 -168888 -228562 183871 -108378 -112644 -51202 -317139 -137373 -113691 77012 184935
18720A84935e7651D8498d9176j1091A60864a17807L9192j62342a06712L5186c3017
18708b4852I7384h0932g022F4520C1764K26088B7195c9354B37811h5394m1232
18697a26626C29754g49j85069A30013b23712h8289B92191A30056g1095p5261A6301
18685e8163j41473c0860G7521a62474f676j07188e621lA20366b45718d0207B11156
18672a38420j57721R9143e2687r2797k7085b2160l35013J45438G0524a51078l4285
18661a85363l30020F5562e7405A2227a62412H6510b9218k19465k5051G9376a23970
18649B9863b31557a02636A09775d2400j34857n0482B7771c89853M6494H9379b14161
18637A30579a97793p3201G8904J10543d1771j02831B89447E4476a98767e8907
$$ plain form
18720 184935 -57651 48498 -49176 -60267 160864 -117807 -78615 -240957 -106712 -71526 -33017
18708 -24852 97384 -80932 -7022 64520 31764 257852 27195 -39354 237811 -85394 -126626
18697 -126626 329754 -749 -185818 130013 -223712 -88289 292191 130056 -71095 -146356 16301
18685 -58163 -199636 -30860 77521 -162474 -6676 -113864 -5621 -5624 120366 -245718 -40207 211156
18672 -138420 -296141 -196998 -52687 -145484 -172569 -22160 -357173 -211735 70524 -151078 -185363
18661 -185363 -515383 65562 -57405 12227 -162412 86510 -29218 -248683 -273734 79376 -123970
18649 29863 -231557 -102636 109775 -42400 -177257 -227739 27771 -389853 -343359 89379 -214161
18637 130579 -197793 -270994 78904 189447 -41771 -144602 289447 54476 -198767 -58907
18626A24825C0605K9620f8442L0468A64473a79686i760A96535E6846J20423C2758
18614B84123B5975a34949N236a1238B606c09060a0902A30630d27684a83692j4957
18603a98649L0855m9780a04637A50952b73005h6533A05408a18713n6789F9434
18592a97440g7861A3620N8148b69004Q2920K1361B70189G9076G809b18831J02303
18581a16528k71972E105b49547J24452L1364A39362j0362a31859B1233f8766j24087
18570a92853P0834D3938d526A35280J66454A50113b68980d0553b0062h182j44612
18559a52794k27399A83614h1868b4258j20172k6941K1045f9238j25902a3099j24598
18548a37697o6981A15080e4309A17462b35206f6209b6989l46249a57547k55059
$$ plain form
18626 124825 30605 60225 -68442 -37974 164473 -179686 -9760 196535 56846 177269 32758
18614 284123 25975 -134949 -129713 -11238 2606 -309060 -10902 130630 -427684 -183692 -198649
18603 -198649 -167794 -217574 -104637 150952 -273005 -86533 105408 -118713 -175502 69434
18592 -197440 -77861 13620 71768 -269004 -186084 -164723 270189 79076 7809 -218831 -116528
18581 -116528 -388500 5105 -249547 -125095 -93731 139362 129000 -131859 21233 -68766 -192853
18570 -192853 -122019 43938 -4526 135280 301734 150113 -268980 -40553 -20062 -8182 -152794
18559 -152794 -380193 183614 -81868 -24258 -144430 -171371 -150326 -69238 -195140 -13099 -137697
18548 -137697 -204678 115080 -54309 117462 -235206 -66209 -26989 -373238 -157547 -412606
18538d12606J72891e1926C4205K833J13006b6871G3376J86302b1290j24774A90437
18526a95505C27513G9494a01052A39468b78463B62337b55608H3094j6232l1003
18516C5859b20108p7132A42167m2345d19835c1807A039O5202B8659M8a61361f5298
18503B64840J0297D1128Q3264d72483b5392B45376g114G9501a49136L0818o2287
18492a80605j48063d3490K0015B33475a43864A5268J77771G5884g3642j43049
18482b16691k4393A45144f832j82719D0522a00511A58028b18150b7589A19491
18471a77241A7231O1710p265N4191e55A62320J17742a4904j25221L5907A0589
18459B323N6889h1581j54234O0752C6709a84065a3727r2250o8306B7437d1227
$$ plain form
18538 -412606 -239715 -51926 34205 37038 150044 -26871 73376 259678 -21290 -146064 190437
18526 -195505 327513 79494 -101052 139468 -278463 262337 -255608 83094 66862 35859
18516 35859 -220108 -297240 142167 99822 -419835 -31807 1039 66241 28659 28707 -161361 -65298
18503 264840 275137 41128 124392 -472483 -25392 245376 -7114 79501 -149136 -118318 -180605
18492 -180605 -328668 -43490 -23475 233475 -143864 15268 193039 75884 -73642 -216691
18482 -216691 -241084 145144 -6832 -189551 40522 -100511 158028 -218150 -27589 119491
18471 -177241 17231 78941 71676 125867 -555 162320 280062 -14904 -140125 -104218 10589
18459 2323 59212 -81581 -235815 -175063 36709 -184065 -13727 -105977 -174283 27437 -41227
18447A88485f6353E8381a48326B39467b07467j30490a42228j19493c3944n13453
18437e47397A0354a77145B64193b30052J905q0657J32344G0064B4912a29841B8582
18425B00966c24309A7653c88758A34156a08123j55007A07031c35007k3285I5610
18414a45287l22690b6882H864f6597p4506b7062E71096a59894d4116J4851l75505
18403d04770a47328f3515j23540L8047l3577N4148M7997j36223D8646N40Q432
18392E7618a3269o0922A50057a46021n3121a6232k28939k8708C67357F5049a18047
18380H6238P9211a02655A69103J22332A41139j1939a97352M4545O0281d585A05838
18368a04799D3966M4774b06038A36996a64397M3979O139A46839f7179D6331M0229
$$ plain form
18447 188485 -66353 58381 -148326 239467 -207467 -337957 -142228 -261721 -33944 -547397
18437 -547397 10354 -177145 264193 -230052 -228147 -308804 -176460 70064 24912 -129841 28582
18425 200966 -324309 17653 -388758 134156 -108123 -263130 107031 -335007 -358292 95610
18414 -145287 -467977 -26882 8864 -66597 -141103 -27062 571096 -159894 -44116 -29265 -404770
18403 -404770 -147328 -63515 -187055 -149008 -182585 -128437 -80440 -216663 48646 49186 57618
18392 57618 -13269 -74191 150057 -146021 -199142 -16232 -245171 -273879 367357 65049 -118047
18380 86238 165449 -102655 169103 291435 141139 129200 -197352 -152807 -92526 -4585 105838
18368 -104799 43966 88740 -206038 136996 -164397 -120418 -114279 146839 -67179 46331 86560
18357H6560J06200F4497c30662J57825E5469e3644A6718P2228h935k16920A93633
18345G204b36394B91027n8719j5879b07138J0994A68252N3972a00271B14175b85288
18333b4123D6217g2581K7496B78816J75887H329K93512a53577r1705M4887n5926
18322b56321b7713o2504A39040a08240n6195E2524a09428B11819H6585a46393
18311C9278J5138a38928A32545a40105j78383N8616J9282J00378B80196a38532
18300b11956n8545G7040b01979h6950q7091q2817k04673e6390C07702a99045l1973
18289b31018J13452d0937k40693B21654b37997A56340n1885a95161P343j39852
18279c27670A4859O5321b2326o5867K4250B00584c96060c7796b110p1506A27007
$$ plain form
18357 86560 192760 64497 -330662 -172837 55469 -53644 16718 88946 -8935 -225855 193633
18345 7204 -236394 291027 232308 216429 -207138 -196144 168252 222224 -100271 214175 -285288
18333 -24123 46217 -72581 -45085 278816 454703 8329 301841 -153577 -245282 -200395 -256321
18322 -256321 -27713 -90217 139040 -108240 -164435 52524 -109428 211819 86585 -146393
18311 39278 54416 -138928 132545 -140105 -318488 -259872 -240590 -140212 280196 -138532
18300 -211956 -270501 77040 -201979 -86950 -174041 -256858 -461531 -56390 307702 -199045 -231018
18289 -231018 -117566 -40937 -281630 221654 -237997 156340 104455 -195161 -187818 -327670
18279 -327670 14859 80180 -22326 -88193 -63943 200584 -396060 -37796 -2110 -73616 127007
18267A0480e8728j40452E2951E008J82143j2733h8658m7017j49714A85244q6218
18256I9026b0307A2190a93982C04480a26841p6484F036L4054A5563b15887C7113
18244A92218c305B06741b01527D0568b51542k14060d1537A21344E7170A5365a31082
18232c7011A83118q3430f0095n9495H0428a21058g445o0953j38884J4451C0752
18220A39212d6946j1915A03854C7686J07285d09782a7391C59983A0389c67496
18209b00783G950J8024i5170C27035g3624K1681B26324d5962B28810L8817a57327
18197b56699j95586C3932j0195L5524c0455q9814A37525L2212a22340n3818A47835
18185e8269A71918G2860J4181c3875D9183b19271O8286B291R9807A3035a30101
$$ plain form
18267 10480 -58728 -199180 52951 5008 187151 174418 -88658 -135675 -285389 185244 99026
18256 99026 -20307 12190 -193982 304480 -126841 -203325 6036 40090 15563 -215887 37113
18244 192218 -3305 206741 -201527 40568 -251542 -465602 -41537 121344 57170 15365 -131082
18232 -37011 183118 99688 -60095 -119590 80428 -121058 -7445 -68398 -207282 -192831 30752
18220 139212 -46946 -58861 103854 37686 144971 -409782 -17391 359983 10389 -367496
18209 -200783 7950 25974 -95170 327035 -73624 -51943 226324 -45962 228810 267627 -157327
18197 -256699 -452285 33932 23737 59261 -30455 -120269 137525 169737 -122340 -176158 147835
18185 -58269 171918 72860 87041 -33875 49183 -219271 -150985 2291 102098 13035 -130101
18173C5084d5523j07861A59834a91072I3508c57359C66209q9964I1418e4722n7860
18162a12582c2474H3388I819g9346E5431e7740j62096B00014a40944p7995D4177
18150b16873J03727r0312A07544g5668A7087a60697B66494E4090d16553a98330
18139G5675e8916j17967A21548a56364N799c587m37433A92977D8541e8948r1118
18128a50066D3797K102J98737j15513m3653b07531a01275F9180N9952C3589a41008
18116C35873i3222n2184C12155c12871a1760A22669g9615A2008R3642K28160I0052
18104B61052H8435p117B2788N9823P0614b70247C6448K03221j06644o4254O7104
18093A35875b36128N6778N7795A2929a18314c4789H8086h3085r6019c2339B91000
$$ plain form
18173 35084 -45523 -153384 159834 -191072 93508 -357359 366209 276245 91418 -54722 -112582
18162 -112582 -32474 83388 9819 -79346 55431 -57740 -219836 200014 -140944 -218939 44177
18150 -216873 -113146 -203458 107544 -75668 17087 -160697 266494 54090 -416553 -198330
18139 75675 -58916 -176883 121548 -156364 -150565 -3587 -441020 192977 48541 -58948 -150066
18128 -150066 43797 45899 244636 129123 85470 -207531 -101275 69180 129132 33589 -141008
18116 335873 -93222 -145406 312155 -312871 -11760 122669 -79615 12008 105650 333810 90052
18104 261052 88435 81318 22788 82611 153225 -270247 36448 239669 133025 68771 135875
18093 135875 -236128 -179350 -121555 12929 -118314 -34789 88086 -83085 -179104 -32339 291000
18081a1971r2590B18283a55847e9088K1638m518j55650N1035A39666o0274P17
18070H0109J2207J63700B5128d59109C10051i206C15516a03573a9975j87236I9080
18058F1745K11819e1229L687F441a37793B35683b96022Q7436E4141K77024A08002
18046b3674B08359B4501f0129A72069b54371C23940A01003b39323d2853l77076
18036d19929e8924F4343k1957a64904O1505c0088H2482k3041B0166P1706M756
18025I6628b07824b7365B4708c8535j13143q4977e1378A91868a21318q3234H3289
18013A20188A94c3960E7057c65709c1214A48466a76137n0301c010j40282K1146
18002a22146A31854a46563a7443J724A51578a17127M4997j68625l612j03549f2764
$$ plain form
18081 -11971 -104561 218283 -155847 -59088 -37450 -41968 -197618 -146583 139666 79392 80109
18070 80109 92316 256016 25128 -459109 310051 -9206 315516 -103573 -19975 -207211 99080
18058 61745 273564 -51229 -47542 6441 -137793 235683 -296022 -208586 54141 331165 108002
18046 -23674 208359 24501 -60129 172069 -254371 323940 101003 -239323 -42853 -419929
18036 -419929 -58924 64343 42386 -164904 -103399 -30088 82482 59441 20166 91872 96628
18025 96628 -207824 -27365 24708 -38535 -151678 -236655 -51378 191868 -121318 -204552 83289
18013 120188 194 -33960 57057 -365709 -31214 148466 -176137 -226438 -3010 -143292 -122146
18002 -122146 131854 -146563 -17443 -15719 151578 -117127 -72130 -240755 -244367 -347916 -62764
17990g5758r7367A9216J13207e6086A95936J12896I6043M847m9497j0092N2010
17979I3311a14712j71768D4781b59095J13973k06418B0007c1979j06954E0657
17968b27261C88861d480A45532M3255l6687B5336c07673A00498K3315J03379a59328
17956I6430g3332B38973N1152f2015l4286D0887j6953b34152H1070d9766A39715
17944F2973A7741a52307C6930b3274P606j56392K4017A23964a61294B8495a21080
17932a13536c4914D4636a8966B1873a3636A03567l9685h1338j61536B9132O7336
17921I6468K5971C9829a14372K7814A54720a20196G470A883R839P363a68627I6957
17908A310c18992G8935b63302e2251L446M322G5271B0855P7721L29737j82069
$$ plain form
17990 -75758 -173125 19216 132423 -56086 195936 308832 96043 100890 51393 41301 93311
17979 93311 -114712 -286480 44781 -259095 -145122 -351540 20007 -31979 -138933 50657
17968 -227261 388861 -4480 145532 188787 152100 25336 -307673 100498 123813 227192 -159328
17956 96430 -73332 238973 290125 -62015 -96301 40887 23934 -234152 81070 -49766 139715
17944 62973 17741 -152307 36930 -23274 -15668 -172060 -148043 123964 -161294 28495 -121080
17932 -113536 -34914 44636 -18966 21873 -13636 103567 63882 -81338 -242874 29132 96468
17921 96468 122439 39829 -114372 -86558 154720 -120196 7470 1883 11722 19085 -168627 96957
17908 1310 -318992 78935 -263302 -52251 -48805 -44483 75271 20855 98576 428313 246244
17897B46244A6081e1776b0596G9572A6116J2203b1278j69392f5116B53067A25573
17885A65969b50252A4566K09682j04500a23027p804d8706A09394a99246A87381
17874B63270a09521D07742a56345K6198b8517C36257E5628K27515A07286J48653
17864B55939R5205D5940L67371a05940h94j43792C04726c6234C02333q4287k6661
17853A91385a78245A23961K53893I9941k3785a71158B9485K57900G9066l7427
17843D1639a0281j11042H4183f9723a0346B5003J54903K38849A46979E4934Q6347
17832A41281K4191b08257E5059B1426J7881d37105I6171d576A40223J6134n9992
17821I6365c21244a26388C50538a2497C6319O4434A7157J25192a31083A53443
$$ plain form
17897 246244 16081 -51776 -20596 79572 16116 28319 -21278 -190670 -65116 253067 125573
17885 165969 -250252 14566 224248 119748 -123027 -130831 -48706 109394 -199246 187381
17874 263270 -109521 407742 -156345 -130147 -28517 336257 55628 283143 107286 255939
17864 255939 351144 45940 413311 -105940 -894 -144686 304726 -36234 302333 218046 191385
17853 191385 -178245 123961 377854 99941 76156 -171158 29485 287385 79066 41639
17843 41639 -10281 -121323 84183 -69723 -10346 25003 179906 418755 146979 54934 141281
17832 141281 165472 -208257 55059 21426 39307 -437105 96171 -4576 140223 156357 96365
17821 96365 -321244 -126388 350538 -12497 36319 100753 17157 142349 -131083 153443
17810E8600c8881B31474J01068C4565N7477K81340a28548B4242O6615b07882R4388
17799a13494A04524a43603G7435K26235b00911A14497j242b5866p4917F8901M5073
17788A13974J364O2112H0327j3404c1421h500C5113b81284H2533J85966r7820
17777A70679J62429a58675H2804L25987M0212l1531A27371J15727G1100Q4160
17767A55260c98708B63964A10245M39495c9124B88969c21454A81890a82529h5660
17756A89546J19717B762c17642A17132E7649a98786B11420H8147M706b9999B90111
17744i3775m9432O0436B6910L50028j02894a04414E2648J43863a2948o8413E68062
17732A78367d7521j9686k4227A64184J59674l1850A37108B5059J44136J31247
$$ plain form
17810 58600 -38881 231474 332542 34565 92042 373382 -128548 24242 90857 -207882 -113494
17799 -113494 104524 -143603 77435 303670 -200911 114497 113255 -25866 -100783 68901 113974
17788 113974 115338 177450 80327 66923 -31421 -8500 35113 -281284 82533 268499 170679
17777 170679 333108 -158675 82804 408791 449003 417472 127371 243098 71100 155260
17767 155260 -398708 263964 110245 549740 -39124 288969 -321454 181890 -182529 -85660
17756 189546 309263 2762 -317642 117132 57649 -198786 211420 88147 92853 -29999 290111
17744 -93775 -143207 -82771 26910 376938 274044 -104414 52648 196511 -12948 -81361 568062
17732 178367 -47521 -67207 -91434 164184 323858 292008 137108 25059 169195 300442
17722C00442L6817b35730J15917E9299B1222a63101H7870m368C4379J5420k806
17711D6993P2601C9030L73025g491j56611A30053k1607J14725J879K04905j00162
17700C29793A55950J86080a25739f0943D63933A65661J11167a59526F8446N4304
17690A22750J40049l9162o7686o6264P8572J14952e7206j27410A41875c5758l4203
17679f9961A29995n8517G261Q5645D1073O4665D0336K96347c0415B3507a9285
17667B14615q4798O219J81632a17413B10188E8598b47011A8571N54149A46594
17656c52531H3394J32679E8543b18933A02437j3707k0922K28906b17324D19650
17645G5821J85838E3899L75644d2076A17874P9144M3201h4656B13369h7527C9007
$$ plain form
17722 300442 337259 -235730 -119813 59299 21222 -163101 87870 83502 34379 49799 46993
17711 46993 119594 39030 412055 -7491 -164102 130053 108446 223171 225050 429955 329793
17700 329793 155950 342030 -125739 -60943 463933 165661 276828 -159526 68446 122750
17690 122750 262799 223637 155951 89687 168259 283211 -57206 -184616 141875 -35758 -69961
17679 -69961 129995 71478 7261 92906 41073 105738 40336 336683 -30415 23507 -19285
17667 214615 129817 136036 317668 -117413 210188 58598 -247011 18571 572720 146594
17656 -352531 83394 216073 58543 -218933 102437 88730 67808 296714 -217324 419650
17645 75821 261659 53899 429543 -42076 117874 197018 240219 -84656 213369 -87527 39007
17633H7984J29556m7895K34844I4435O9049P2530H1095g7931b5432D73899A50068
17621A53081a55338A03361D4097g7193p4497B87551k9689J47532r0590b52323
17610A56320o4939K43856A01429D8366L06756m1840m7740n6399F4845L12944a3558
17598B74963G1398P5188g641B14041i5954A69846R6638R3428F8770M5385J70584
17587B84739O728b52294A70669O4542b80346b4927D8878a72194M9254C29077j00083
17576B28994b36181B64422a08292E6361Q8493b2033D4337J41334a28144B17151
17565A18300N6058I748L14669D4309a82251B45153p0431M9785H8886N4672g6776
17553A28894J62723a24455C58663A62933A0087M22383K6935j78885k2494I9043
$$ plain form
17633 87984 217540 169645 404489 94435 163484 236014 81095 -77931 -25432 473899 150068
17621 153081 -155338 103361 44097 -77193 -151690 287551 257862 405394 314804 -252323
17610 156320 91381 335237 101429 48366 355122 313282 265542 209143 64845 377789 -13558
17598 274963 71398 146586 -7641 214041 -95954 169846 266484 359912 68770 114155 284739
17587 284739 291467 -252294 170669 235211 -280346 -24927 48878 -172194 -122940 329077 228994
17576 228994 -236181 264422 -108292 56361 144854 -22033 44337 185671 -128144 217151
17565 118300 174358 9748 324417 44309 -182251 245153 174722 224507 88886 143558 -76776
17553 128894 291617 -124455 358663 162933 10087 432470 459405 280520 258026 99043
17542B06593r1176L48248j10327a7680G6140R8065l3859J97428j12016N1214p1336
17531B05636K36954D9613a40159B84223n7188k1204c0019C70542n1059I3565L0013
17520A23578m2301J35739O7045J88138L71520l34501j84568n9885M97958P8092
17510H40815L49377n09136M24678j26691j95649l47149R0198J77534j22238q4651
17500D97088k11374L94574j30039L63522k11707L88054P2727P5248l12768k06152
17490G19173r6581J17857j45145m7363p5137A82027J53822J56636j9338B30919
17479B14908L19062j60259j73336Q3969Q9279G2767K25792N16L49318A52579P4001
17468B26580J8168L276K60877k23138L39929B44295p5331M1069L49981k45333
$$ plain form
17542 206593 115417 463665 353338 -17680 76140 174205 140346 337774 225758 276972 205636
17531 205636 442590 49613 -140159 284223 227035 205831 -30019 370542 319483 93565 123578
17520 123578 81277 217016 284061 472199 843719 509218 324650 264765 762723 840815
17510 840815 1190192 681056 1105734 979043 783394 436245 526443 703977 581739 497088
17500 497088 285714 680288 550249 913771 702064 1090118 1162845 1238093 925325 719173
17490 719173 622592 740449 595304 547941 472804 182027 335849 492485 473147 230919
17479 214908 533970 373711 200375 284344 373623 72767 298559 299075 648393 152579 226580
17468 226580 244748 248024 508901 285763 625692 244295 168964 210033 560014 314681
17458C14681R1892j03711E205K77128L80531B58145K14702A69697J9915K33231
17448D22843K2845n5184f1509E90808A97821K57231j73723L38007r5242k06579
17438C17515Q2831f8440C75493O4073G9046J68812J46590K41587n6263j84659
17428C95113A88721J94298K00690Q1216B75778P3631q1627m4132K68759k03025
17418B89384K45759A05548M05527G0081J60531b60335D64534B18671J00990k471
17408C17190K34571J03486B38853J80526r7988J82645j55666J18324j876R5193
17398E60011P5184k39788J9169J60342r2999A76810J57176p2003L01284A31676
17387A33951j7528J52253a33769B6917K62048j10720q1828K84097A26694L7836
$$ plain form
17458 314681 406573 302862 5205 282333 662864 258145 472847 169697 189612 422843
17448 422843 445688 390504 -61509 590808 197821 455052 281329 619336 524094 317515
17438 317515 400346 -68440 375493 439566 79046 247858 394448 636035 579772 395113
17428 395113 188721 383019 583709 664925 275778 349409 267782 223650 492409 289384
17418 289384 535143 105548 511075 70081 230612 -260335 464534 218671 319661 317190
17408 317190 551761 655247 238853 419379 321391 504036 348370 466694 464818 560011
17398 560011 635195 395407 414576 574918 481919 176810 333986 261983 563267 131676
17387 133951 116423 268676 -133769 26917 288965 178245 96417 380514 126694 164530
17377A64530O6091C5075M03070P2455A53931P7578d0306G0685L09806m8407M7123
17366C79207c1677C69709f3140H1967J15224J50387A22158P9956P0187K2563M0042
17355C34906N1803n4668A15397O2242K91558j32052Q323L66700a4625C05569a5744
17343B88960g5124A63153K12002J68733j54358N388j01777D3695L34819j88577
17333A89937m9937L71579B01423L08294B22332q4737Q6063b3819B26304o6705
17323A59599D7194k3252Q6044L81774j99999q878K41805A56090L48242j87711
17313C16621j28532L3198h0490E4262J25376I374M11531c3393B24525n2219N97214
17302G69520B58667J98349A51338M0086J1770L60871A32939K55815j63230P4654
$$ plain form
17377 164530 230621 35075 438145 510600 153931 231509 -40306 70685 380491 332084 379207
17366 379207 -31677 369709 -63140 81967 197191 347578 122158 202114 272301 294864 334906
17355 334906 386709 332041 115397 177639 469197 337145 345468 712168 -14625 305569 -15744
17343 288960 -75124 163153 375155 543888 389530 394918 293141 43695 378514 189937
17333 189937 140000 511579 201423 509717 222332 137595 223658 -23819 226304 159599
17323 159599 47194 23942 109986 491760 291761 282883 524688 156090 504332 316621
17313 316621 188089 221287 -80490 54262 179638 9374 420905 -33393 224525 172306 769520
17302 769520 258667 457016 151338 191424 203194 564065 132939 388754 225524 300178
17292C00178J09711j46661G5231L77239A99272J90932q9813P1542o0094j55311
17282A56528K40569m185n4501A17352L3103J37413m9589Q7638K5356j641o517
17271C43115l8248J15781G3789L35767A83689J93318j88443N08148j06433k36041
17261C54238o7903Q2243A57466L7016Q7469J39407J85917j00890k35595k1870
17251B48920N4765A44518K49461A15864J61667J50303A83543j3823M04213P8913
17241F52846D6063J58419R4285N6997J83285K06602j36489k73605A50659L99967
17231E50626O2742k57306M1491K40387j90963B7103M38829p1234K6316j07576
17221C13438K77946J16855A68988J67567J47904B39704K80979p7986I0804L67418
$$ plain form
17292 300178 409889 263228 75231 452470 199272 390204 300391 371933 311839 156528
17282 156528 397097 392912 338411 117352 150455 287868 238279 325917 351273 349632 343115
17271 343115 304867 420648 73789 409556 183689 377007 188564 696712 590279 354238
17261 354238 286335 368578 157466 194482 281951 421358 607275 506385 270790 248920
17251 248920 303685 144518 393979 115864 277531 427834 183543 169720 573933 652846
17241 652846 46063 204482 298767 355764 539049 745651 609162 335557 150659 550626
17231 550626 613368 356062 397553 637940 446977 27103 465932 394698 421014 313438
17221 313438 591384 708239 168988 336555 484459 239704 520683 442697 90804 458222
17211D58222l6849j96457K80392r4637J98992M3868B57439J51682J19946J84598
17201G13665l33511J84606k76036J48960o1298j7749P3432Q932m9168J0376j911
17190D00298q6053n9529K57433A35192J36421M24811j48546j19431o6633m8757
17180C13057L29761n2928k9530K3079k05813l2048O939P3683K67967B99974J26897
17169D26871N3847k2065j16562N01781C15834L5325Q1071L32610k86117k28565
17159B50158L16452j62549L30283C66155J69674J71114l16779L9990J6269K43575
17149F89998C16078K81875O0785R1580k57966j77914J92483Q4260j97378A68831
17138E96495M2571Q6364j59047j35877N7862j33661N10265m05211N8738A94031
$$ plain form
17211 458222 421373 224916 505308 410671 609663 653531 257439 409121 529067 713665
17201 713665 380154 564760 288724 437684 376386 358637 432069 441001 391833 402209 400298
17190 400298 314245 254716 512149 135192 271613 696424 547878 428447 361814 313057
17180 313057 642818 589890 560360 583439 377626 345578 352517 426200 694167 299974 426871
17169 426871 480718 458653 342091 843872 315834 351159 432230 764840 478723 250158
17159 250158 566610 404061 734344 366155 535829 706943 390164 430154 446423 689998
17149 689998 316078 597953 658738 750318 492352 314438 506921 591181 393803 168831
17138 596495 639066 725430 566383 430506 488368 354707 864972 459761 518499 194031
17127D54593J05660j97356R9255J88071K1237k20839M1588K46644j11286k04276
17117D23291J44293K07593k76948M03757B63271M23116C04511L20746j66818L4083
17107D92522K77869l45727J24194p7401P3868L07735k76356J28282J56203k06857
17097F54332J26042k08304J08057O538k871l41252L42136n8104L02358l39840
17087E89092K81076j9604j62196k90779K18542J8463J01649M518J73828j08939
17077H05650M5756r648l90390K00159L1001K16056N4685p9672j44846n7378j06805
17066E64568K57828C80727M19373J46987Q8545B90283O07284j45921p4729L20465
17056I97382l42708M40189m45384J76791K47422j87410K24678D36454L17842L5011
$$ plain form
17127 454593 560253 362897 462152 650223 671460 450621 492209 738853 627567 423291
17117 423291 567584 775177 498229 901986 263271 686387 304511 625257 458439 492522
17107 492522 770391 424664 548858 471457 545325 853060 576704 704986 861189 654332
17097 654332 780374 572070 680127 686665 683794 342542 684678 626574 928932 589092
17087 589092 870168 850564 688368 397589 616131 634594 736243 740761 914589 805650
17077 805650 851406 841758 451368 651527 682528 898584 953269 873597 728751 671373 564568
17066 564568 822396 380727 800100 947087 1035632 290283 897567 751646 676917 997382
17056 997382 654674 1094863 649479 826270 1073692 886282 1110960 436454 754296 789307
17046G89307q0279j17200K45216j44087K75545J03102k0413l33522L19723j22061
17036I15331K80143k25160D78591K58493L60328k26930L66221j86528Q3903j67377
17026I66701l2027p8735J01514m3400p9337K19734J6641J96635m28303K60675
17016A100098J89814l44993K33482K52702n30710J84776r9520o9552r7581P3482
17006H91998J03765l09566M69104o845j29762O91991n63918r017K51156k10340
16996A178566j5515K47963r3019Q4997k50770M9957J38844l99183M79238k26554
16986A194524m2551L56508m77106J16412K71061k29849L30927k39206j70603K77802
16976A387919O1639J50445K46622o80762L05351J1061N4302k15365K68545l17333
$$ plain form
17046 789307 709028 591828 837044 692957 968502 1071604 1051191 717669 1037392 915331
17036 915331 1195474 970314 478591 737084 1097412 870482 1236703 1050175 1134078 966701
17026 966701 934674 855939 957453 914053 834716 1054450 1071091 1267726 839423 1100098
17016 1100098 1289912 944919 1178401 1431103 900393 1085169 985649 916097 818516 891998
17006 891998 995763 686197 1155301 1148456 1018694 1710685 1146767 1137750 1388906 1178566
16996 1178566 1163051 1411014 1317995 1402992 1152222 1202179 1341023 941840 1421078 1194524
16986 1194524 1151973 1508481 1031375 1147787 1418848 1188999 1519926 1280720 1110117 1387919
16976 1387919 1449558 1600003 1846625 1165863 1471214 1482275 1536577 1321212 1589757 1272424
16966A272424K52451j47915J30150K7147j57624K75888l69250L05989m5348j2234
16956A531678k7881J63186J88810l03745J85319k23462M9774l5433O4332J16565
16946A709143J22045m84397k2588Q8570M71315j91810m7009L63483m11931L9533
16936A636354K63849j65405K49164k60253J92852K4645J96444l76783K87301K68971
16926B317139m21811k9535L56615k95481m7072L21182J58069m95162M74037j00134
16916B237847j07232k6923L38437j69748K74523m09815J44997k54001M37457K82867
16906B748409l09075k01962j23095N64247m27987K64316L93771m96031K29620
16897B642213J18655k96105l47718Q31344k76864L08493j31543j29351L68400
$$ plain form
16966 1272424 1524875 1376960 1507110 1534257 1376633 1652521 1283271 1589260 1543912 1531678
16956 1531678 1503797 1666983 1855793 1552048 1737367 1513905 1563679 1528246 1592578 1709143
16946 1709143 1831188 1346791 1324203 1412773 1884088 1692278 1645269 2008752 1596821 1636354
16936 1636354 1900203 1734798 1983962 1723709 1916561 1941206 2137650 1760867 2048168 2317139
16926 2317139 1895328 1865793 2222408 1926927 1879855 2201037 2359106 1863944 2337981 2237847
16916 2237847 2130615 2103692 2442129 2272381 2546904 2137089 2282086 2028085 2465542 2748409
16906 2748409 2439334 2237372 2114277 2678524 2250537 2514853 2908624 2412593 2642213
16897 2642213 2760868 2464763 2117045 2948389 2671525 2980018 2848475 2719124 3087524
16888C087524K02196l14363m2025j94422K30453J502j34127L79119j34759j83779
16878B897319J35459L1984L05551r4564k4843J45411Q1978p165L15997k05885
16868C581242K54813j23107q371J28903M59051l99273K4775J22766j96345L4717
16858C879171O0639J67064p0230N64638l97487J93419K07264K97874m31763o1735
16848D408854J63820K03893j75877M1441K76985M52856k72578O3795L99565J27692
16838E690446k60679O7982K40615P9720J14289Q9452K913l88517M44036m746N05575
16827F581086n2716j6893J00276L12320k61220K42432K66361O0096m70194J073293
16817G834841n10605J99691L52977J319L57485k40566K54643J53346k1208L51166
$$ plain form
16888 3087524 3289720 2975357 2933332 2738910 2969363 2970865 2836738 3215857 3081098 2897319
16878 2897319 3032778 3064762 3370313 3275749 3250906 3396317 3478295 3471130 3787127 3581242
16868 3581242 3836055 3712948 3704577 3833480 4292531 3893258 3918033 4040799 3844454 3879171
16858 3879171 3939810 4106874 4036644 4601282 4203795 4397214 4604478 4902352 4470589 4408854
16848 4408854 4572674 4776567 4600690 4642131 4919116 5371972 5099394 5163189 5562754 5690446
16838 5690446 5429767 5497749 5738364 5818084 5932373 6021825 6024738 5636221 6080257 6075511 6581086
16827 6581086 6528370 6511477 6611753 6924073 6662853 6905285 7171646 7231742 6761548 7834841
16817 7834841 7324236 7523927 7876904 7878223 8235708 7995142 8249785 8403131 8381923 8733089
16807H733089K52516K13252J64503K35108K1015O31294l53574L60475P1238L85633
16797A0714549O84M09934L34413L04936M7221N53862J4795M2708N55420K84970
16787A3263492K03639K81420L71062M81286k25129P34335O51170K60511M07423
16778A6429209O03303r8567P80901M78935L32836M85868L49827Q59547N36499
16769B0758358M56076K61385J065367N00274O81159N19121R81477M47798J045055
16760B6716070O75918O30171J235015M38142J005317J417677J107351Q44591J023936
16751C5094188J358167J020961J448577J549847J038007J661230J360965J689791
16743D6221733J589967K102143J540346K026799J372025K588579J702887K429087
$$ plain form
16807 8733089 8985605 9198857 9363360 9598468 9619483 10250777 9897203 10257678 10328916 10714549
16797 10714549 10715233 11125167 11459580 11764516 11811737 12365599 12380394 12423102 12978522 13263492
16787 13263492 13467131 13748551 14119613 14600899 14375770 15110105 15761275 16021786 16429209
16778 16429209 17032512 16933945 17714846 18193781 18526617 19012485 19362312 20221859 20758358
16769 20758358 21214434 21475819 22541186 23041460 23722619 24241740 25223217 25671015 26716070
16760 26716070 27391988 28022159 29257174 29695316 30700633 32118310 33225661 34070252 35094188
16751 35094188 36452355 37473316 38921893 40471740 41509747 43170977 44531942 46221733
16743 46221733 47811700 49913843 51454189 53480988 54853013 57441592 59144479 61573566
16735F1573566J895863L052021K160704K435465K611902K703820L013147K948389
16727H2394877K517322K757027L307397K812103K739323L124099L087040K758823
16719A05498011K929437K358676K949757K435641K024611K127113J823411J588804
16711A23735461J019998J006069O34249J58506J10898j19651j012937j194125
16703A24338468j075338j334636k407752j913600k253994k264859k752312k693453
16695A07642524k976965k865143k795592l204562k925322l184626l152499k690730
16687H3847085l067357k720576k776410k857841k694791k663128k367096k293993
16679F2405893k249058k427746j700590k527102j811935j896907j642241j752010
$$ plain form
16735 61573566 63469429 66521450 68682154 71117619 73729521 76433341 79446488 82394877
16727 82394877 84912199 87669226 90976623 93788726 96528049 99652148 102739188 105498011
16719 105498011 108427448 110786124 113735881 116171522 118196133 120323246 122146657 123735461
16711 123735461 124755459 125761528 126395777 126554283 126665181 126545530 125532593 124338468
16703 124338468 123263130 121928494 119520742 117607142 115353148 113088289 110335977 107642524
16695 107642524 104665559 101800416 99004824 95800262 92874940 89690314 86537815 83847085
16687 83847085 80779728 78059152 75282742 72424901 69730110 67066982 64699886 62405893
16679 62405893 60156835 57729089 56028499 53501397 51689462 49792555 48150314 46398304
16671D6398304j831398j726177j397648j610324j128512j422785j442011r05437
16663C4934012j035912j651239p05134j245158q88892q69811q12221j218256m69468
16654B6037921q85076j038749m12438r09476m33248n07401r49398l17477q57925
16645A9726733m18145m57330o97497j29543n57494o36130m02180l20061j70467
16636A5937886l62792o46326m68650k62330k50722l53924l2259q51099k63789
16627A2445995k93697J05779n64305k51586j45056j72218m65476l38612L3238
16618A0354062j35424n28292Q3230j58359l25039k19056k54994M02329l72092
16609H846365p0299k37325p27189J34085K99848m45775l88079K08208j59366o06772
$$ plain form
16671 46398304 44566906 42840729 41443081 39832757 38704245 37281460 35839449 34934012
16663 34934012 33898100 32246861 31541727 30296569 29407677 28537866 27725645 26507389 26037921
16654 26037921 25152845 24114096 23701658 22792182 22358934 21851533 20902135 20584658 19726733
16645 19726733 19308588 18851258 18153761 18024218 17466724 16830594 16428414 16108353 15937886
16636 15937886 15575094 14928768 14460118 14197788 13947066 13593142 13560883 12709784 12445995
16627 12445995 12152298 12258077 11693772 11442186 11297130 11124912 10659436 10320824 10354062
16618 10354062 10218638 9690346 9773576 9615217 9290178 9071122 8816128 9218457 8846365
16609 8846365 8776066 8538741 7811552 7945637 8245485 7799710 7411631 7619839 7460473 6853701
16599F853701J24575j00660l35530K77554j38442K87423p46082j10447N0178j81062
16589E981208n11650K61248M2231l38401L92798o03060K2699k5982J00523j12252
16579E209362m9160Q0369k55628k4507l80886K95392K57267l71888k62448j68750
16569D329123q9985J48396j78922K30422k19566k56349K98695l01725j64477l0396
16559C765216J6302k49377k39062M53900l09835M74208o04973L29088K4740l00582
16549C359625l1895J15936j03635j10807k03974J19932j17035n000j84517k26335
16539B612295K56705Q1580q5222L77300l51377k11427J25186k57424K24924p4350
16529B698190O5414l05514K75324l53150l640K77022l87650L54944k39669j34193
$$ plain form
16599 6853701 6978276 6877616 6542086 6819640 6681198 6968621 6222539 6112092 6162270 5981208
16589 5981208 5469558 5730806 5773037 5434636 5827434 5224374 5247073 5221091 5321614 5209362
16579 5209362 5160202 5240571 4984943 4960436 4579550 4874942 5132209 4760321 4497873 4329123
16569 4329123 4239138 4387534 4208612 4439034 4219468 3963119 4261814 3960089 3795612 3765216
16559 3765216 3781518 3532141 3293079 3746979 3437144 3911352 3306379 3635467 3660207 3359625
16549 3359625 3327730 3443666 3340031 3229224 3025250 3145182 3028147 3023147 2838630 2612295
16539 2612295 2869000 2950580 2865358 3242658 2891281 2679854 2805040 2547616 2772540 2698190
16529 2698190 2763604 2458090 2733414 2380264 2376624 2653646 2265996 2620940 2381271 2247078
16519B247078J37680N0340j07344K10997j15383k02536j45245J065J38347L0382
16509B245381M0142j2062N9071k69769j09006j6581K76985j36854q4869P6069
16499B068507j67927K27240m77149L59193q8747R6953q1352j87026J13557R209
16489A872458j44184J56066j82821J25437k83263K19988m24662K59601J37199
16480A735819K29479l81537j23902L57322m00626K13957o0949L7100j68574M7006
16470A485095J69162k03725J29641j9511r4005l8428o3547K49692o8598k52343
16460A293433L66635m14343L33376k02989k58867L72230j58116k75502N24946
16451A580803p5014k59927J50791m8397o2875m9555O458O1209l08723R3822j64777
$$ plain form
16519 2247078 2384758 2435098 2327754 2538751 2423368 2220832 2075587 2076652 2214999 2245381
16509 2245381 2285523 2273461 2332532 2062763 1953757 1937176 2214161 2077307 1992438 2068507
16499 2068507 1900580 2127820 1650671 2009864 1921117 2018070 1936718 1749692 1863249 1872458
16489 1872458 1728274 1884340 1701519 1826956 1543693 1763681 1339019 1598620 1735819
16480 1735819 1965298 1583761 1459859 1817181 1416555 1630512 1569563 1606663 1438089 1485095
16470 1485095 1654257 1450532 1580173 1560662 1466657 1428229 1364682 1614374 1545776 1293433
16460 1293433 1660068 1245725 1579101 1376112 1117245 1489475 1331359 1055857 1580803
16451 1580803 1505789 1245862 1396653 1348256 1285381 1235826 1242284 1303493 994770 1088592 923815
16440I23815J53265o5365K17728K4545o195l2946j24183j36334p7407J78055j27475
16429I27503L26327J10235p4716n39003K09913M40740n26107L80868k39103K02705
16419A219362j82371r6351k714k63845J61245q0372K11176j36454j24090L60815
16409A066401K77248n51767Q4661K2108n7005J42731k25227L38147q9340j51478
16399H56479J29055r0459j6073J18994M1600l54583Q1280k3008J93795m49549
16389D87531Q2857L99473r680n9289m8969j02397K25183j52942q5574k68589J7625
16378D85229L14798k25051j2668K80852j62075J6558k43993K65323n0586P1485
16368G39872K4222j0170K5882J13192N1483l2696k72708J56503k6098j51231p0613
$$ plain form
16440 923815 1077080 1011715 1229443 1253988 1247793 1214847 1090664 954330 876923 1054978 927503
16429 927503 1253830 1364065 1289349 750346 960259 1400999 874892 1255760 1016657 1219362
16419 1219362 1036991 940640 937926 674081 835326 754954 966130 829676 705586 1066401
16409 1066401 1343649 791882 876543 898651 841646 984377 759150 1097297 1007957 856479
16399 856479 985534 895075 879002 997996 1039596 685013 766293 743285 937080 487531
16389 487531 570388 969861 960181 900892 851923 749526 974709 821767 736193 467604 485229
16378 485229 800027 574976 562308 843160 681085 697643 453650 718973 668387 739872
16368 739872 764094 753924 779806 892998 944481 911785 639077 795580 769482 618251 547638
16357E47638M504K30087K43559D95432K25088O7837o0926J86396k29103B84960
16346F68609L2626C24240J71175J44139J66263k11802J62653j54789k34169L03245
16336F70955k71139K69120J58731j65512k87144K69688Q6336k11767N8570q3097
16326D94741K14423k31047K43222r2898B87027L32898K67739N6333k85145K3388
16316F82240p4259j32289R6589J5042j78926M6440K18632J22582L2727l23855
16306E04923R3784J29425k29619k0078q4612M4837j03891L17520j00960L36157
16296H87486C45891J39598m1845j98594K53855q2744l4020Q9233j16204M01427
16286G56597j90147B09374L20260J10530j01285j95375O3430M7266m8659k5608
$$ plain form
16357 547638 552142 782229 1025788 495432 720520 788357 727431 913827 684724 284960
16346 668609 701235 324240 495415 639554 805817 594015 756668 601879 367710 670955
16336 670955 399816 668936 827667 662155 375011 644699 731035 519268 577838 494741
16326 494741 709164 478117 721339 628441 287027 619925 887664 943997 658852 682240
16316 682240 607981 475692 572281 587323 408397 454837 673469 796051 828778 504923
16306 504923 598707 728132 498513 478435 393823 438660 334769 652289 551329 887486
16296 887486 345891 485489 443644 245050 498905 416161 382141 471374 355170 756597
16286 756597 566450 209374 529634 640164 538879 343504 406934 454200 405541 379933
16276C79933J81020k67294R2298j02916J03856H0762h7414D61836j19139J57607
16266E00304B26928J80077b5942G5005L52464A92334K71423j30816K5632K68538
16256F27111B19282Q7451M255M1378j39060J12972J85094A63403N62580B31915
16245F49676A29736K94141j78142P4348O1704j11848K75872D0879J00156J14471
16235B55506J62428O6126j6455B08859J57590k2210j10077M8228J10983A64714
16224I2172L18781A98705O491J29764A31064P7542p8846J30344J82415A53408
16213i720A98355P3686Q9996J41463o1259D0865L68294j32299J89974K4980k03199
16202B88615D2882L09475A03634R6839K40432B07755K8465G3733J53018J12954
$$ plain form
16276 379933 560953 293659 385957 283041 386897 80762 -87414 461836 342697 500304
16266 500304 226928 407005 -25942 75005 427469 192334 463757 332941 358573 627111
16256 627111 219282 306733 310988 352366 213306 326278 511372 163403 725983 231915
16245 649676 129736 423877 245735 320083 381787 269939 545811 40879 141035 255506
16235 255506 417934 484060 467605 208859 366449 344239 234162 282390 393373 164714
16224 92172 410953 198705 205196 334960 131064 208606 129760 260104 442519 153408
16213 -9720 198355 272041 362037 503500 442241 40865 409159 276860 466834 491814 288615
16202 288615 42882 352357 103634 200473 440905 207755 236220 73733 226751 339705
16192C39705G0724J11311n4638M12681k65107J46140d1797B49345M51868k86153
16182D15060j97807k8545o6709M161K45518j37407b01107B69806A050K85596A35639
16170A65296P5328A11594J01627i6763A34839J46938B5113K98553q9219F9071
16159i8681A84751E3795K66091A33725a10014C00324D1071K51003r8672m3278
16149A50124M707c1869C34049J82237B27056H1844J32318m2538B8073e3788A46223
16137A28004l9626J87068E3737J79174d2435D00562j54947m8256l4545a7152B22444
16125A99310K65122A88182E7216K41274A32973J08446a27311A50154J36324j08253
16115A78225J17357h687o0999D13950a21130H4031R308g6058C61892Q4933A91700
$$ plain form
16192 339705 70724 182035 127397 540078 274971 421111 -41797 249345 701213 415060
16182 415060 217253 188708 121999 126160 371678 234271 -201107 269806 1050 286646 135639
16170 165296 240624 111594 213221 -96763 134839 281777 25113 323666 234447 69071
16159 -98681 184751 53795 319886 133725 -110014 300324 41071 292074 193402 150124
16149 150124 154831 -31869 334049 516286 227056 81844 214162 171624 28073 -53788 146223
16137 128004 88378 275446 53737 232911 -42435 400562 245615 197359 162814 -17152 222444
16125 199310 464432 188182 57216 298490 132973 241419 -127311 150154 286478 178225
16115 178225 295582 -8687 -69686 413950 -121130 84031 93339 -76058 361892 446825 191700
16103A66876L31743D6000f6976B41877o2639M6586F3516a48925A39930A8237a13222
16091B84478m9371a12693B32431e106B41082F8525f841A3651c24E35593A00590
16079c96439E3047a37058B94093j38740P5117c4524D32932a03403D8596J24641
16069A73237K8397h0867H2155K44306o0390B6473K52960I4937A1359h8238B19069
16057d0806H1350B0782J54080a99299G6318J22646a83532B16132b65790a21461
16046g4677B22319e9860C34270j51862J54099a59679c4841B13826b0632j14984
16036a35616A42238o6584h1318B43566j08111E8661N5275n0288M4900g0189p2886
16025a43075n8413A62418N9619e7989C36098j11335a39960d0517Q975A51285L7134
$$ plain form
16103 166876 498619 46000 -66976 241877 179238 225824 63516 -148925 139930 18237 -113222
16091 284478 235107 -112693 232431 -5106 241082 68525 -6841 13651 -324 535593 100590
16079 -396439 53047 -137058 294093 155353 230470 -34524 432932 -103403 48596 173237
16069 173237 201634 -80867 82155 326461 266071 26473 279433 94937 11359 -88238 219069
16057 -40806 81350 20782 174862 -199299 76318 198964 -183532 216132 -265790 -121461
16046 -74677 222319 -59860 334270 182408 336507 -159679 -34841 213826 -20632 -135616
16036 -135616 142238 75654 -81318 243566 135455 58661 113936 63648 108548 -70189 -143075
16025 -143075 -201488 162418 222037 -57989 336098 224763 -139960 -40517 -31542 151285 188419
16014A88419r0078C530J10886J41824F862J50814D4393K16764n0695D0440K09193
16003B49633E6949J8292i309C8807a70204c6138B059a68484A50045i5148c7550
15991b9981D54018A17160k2377m4028L6110K09384c01961A73120j4363H555J37294
15980A45849J23209F2602b4824F909J39846J97436O9848q7943L23475J89271P44987
15969A583829F71726M21250n01923m4148j57492A86423K406f4778L0797j6885
15959e0866F4789J3787P4810P0783p8306p1076C533J11494n4676a58080A24596
15947A72859I725c45003B52472r0881b78515i5057H0605J2963a52959A4719a22501
15935B09468b08604Q3367D07841i1378C50318j47179D5659J72233g5656l05450
$$ plain form
16014 188419 98341 3530 114416 256240 6862 157676 44393 261157 210462 40440 249633
16003 249633 56949 75241 -9309 38807 -170204 -36138 2059 -168484 150045 -95148 -37550
15991 -29981 454018 117160 94783 50755 86865 296249 -301961 173120 158757 8555 145849
15980 145849 269058 62602 -24824 6909 146755 344191 414039 326096 649571 838842 1583829
15969 1583829 671726 1092976 591053 546905 389413 186423 188829 -64778 -33981 -50866
15959 -50866 64789 78576 153386 224169 145863 74787 3533 115027 60351 -158080 124596
15947 172859 9725 -345003 252472 161591 -278515 -95057 80605 93568 -152959 14719 -122501
15935 209468 -208604 -125237 407841 -91378 350318 203139 45659 217892 -75656 -381106
15925c81106A26570e7232A40577d24665J47011a17023C305P6062C4536b13156
15914E0917J46501N5053a00117C64443e9710j03306K6543B74670c71764G9479
15903A25347e2995A5144J73093a73655k865K8026E7034R9888p3581b57259a01608
15891d0782j74713J06295j59668J20002l5674A33813l925d7739I9556b46623E4502
15879A12481a93391A32139j1388b96148J45675A16106c60032a06500K6467A20888
15868A35021N2907n9155a82685H084b2153A80602b17319C779L9320L2899A7704
15856b85749B64357B1639a79195B48209b03096i8486B53186a42318q2602M9276
15846a75644e447B80448J09352A42704h4851j61395A89844h942A46903b43869
$$ plain form
15925 -381106 126570 -57232 140577 -424665 -277654 -117023 3305 79367 34536 -213156
15914 50917 197418 252471 -100117 364443 -59710 -163016 -136473 274670 -371764 79479
15903 125347 -52995 15144 188237 -173655 -176520 -148494 57034 156922 83341 -257259 -101608
15891 -40782 -215495 -109200 -268868 -148866 -184540 133813 129888 -47739 99556 -246623 54502
15879 112481 -193391 132139 120751 -296148 -150473 116106 -360032 -106500 -80033 120888
15868 135021 187928 128773 -182685 8084 -22153 180602 -217319 3779 43099 75998 17704
15856 -285749 264357 21639 -179195 248209 -203096 -98486 253186 -142318 -224920 -175644
15846 -175644 -5447 280448 389800 142704 -84851 -246246 189844 -8942 146903 -243869
15835a12240m3777n3486g2938j24344B17195a5236j4041A1579a16162L8977j5077
15824i2262A25681c4083I6506O3439b52604B01077j9504h3686B13872A03456Q7012
15813A90468f9815D07252B9301a69993j6260D3958L24993B9852b22090f5892L1816
15802c4076p8681A53082b78768h1965B2814a39939B9632b48240f0939o3083C45231
15790h4706a6507B37265N4872j1150b1997A94161a39322D15623A20197m3830d6449
15778C5351a65397G6283K55776a15058p6258B85639c8340G8791a51807a2202E292
15766B00026c3829q3595A7560J3756d05564f7318B4749J04378M3142C1294K7826
15755E9120c7527j34914Q4546E6125a26498a3562j03146B8515K80108a7104k30662
$$ plain form
15835 -112240 -156017 -209503 -72938 -197282 217195 -15236 -29277 11579 -116162 -77185 -92262
15824 -92262 125681 -34083 96506 159945 -252604 201077 181573 -83686 213872 103456 190468
15813 190468 -69815 407252 29301 -169993 -186253 43958 368951 29852 -222090 -65892 -34076
15802 -34076 -112757 153082 -278768 -81965 22814 -139939 29632 -248240 -60939 -124022 345231
15790 -84706 -16507 237265 292137 280987 -21997 194161 -139322 415623 120197 76367 -46449
15778 35351 -165397 76283 332059 -115058 -191316 285639 -38340 78791 -151807 -12202 5292
15766 200026 -33829 -117424 17560 31316 -405564 -67318 24749 129127 172269 31294 59120
15755 59120 -37527 -172441 -87895 56125 -126498 -13562 -116708 28515 308623 -17104 -247766
15744b47766p186B63031H7642c80295b1013B31135A15310L1287a26559A25748
15733b11323k93263B6542J05995l6864g573m76602a65682j0169q9407i3524I1198
15721E905N9432a57056o4327C9560j4962a57535i477j24160A27516C2877g8483
15709b73893a29760k36279B67235H0692c04308J06291i7956A19395B5336c0190
15698d0123A29054N6278a96829A87580p5766C3241i1201D3572a80613g0980E4578
15686b8487p1250d0918j0855C5878a72941A40087h6390j07181b0803B80939j31125
15675A49814g2745E8398L13648c9131l968C9805N3450J1720b91062h6351A7825
15663c08183d2669k53019B51231a48899m2999A17827J12472E9084B0732e7335
$$ plain form
15744 -247766 -254952 263031 87642 -380295 -21013 231135 115310 146597 -126559 125748
15733 -211323 -504586 26542 132537 95673 -7573 -484175 -165682 -175851 -265258 -93524 91198
15721 5905 65337 -157056 -221383 39560 24598 -157535 -9477 -133637 127516 32877 -78483
15709 -273893 -129760 -366039 267235 80692 -304308 -198017 -97956 119395 25336 -30190
15698 -40123 129054 185332 -196829 187580 111814 33241 -91201 43572 -180613 -70980 54578
15686 -28487 -99737 -40918 -51773 35878 -172941 140087 -86390 -193571 -20803 280939 149814
15675 149814 -72745 58398 372046 -39131 -43099 39805 93255 104975 -291062 -86351 17825
15663 -308183 -42669 -295688 251231 -148899 -191898 117827 230299 59084 20732 -57335
15652A03786J5085b09913h465A31421A5952a09470j2095j55722I6006b53936a1293
15640A71165c55679J52728F0771B1329d04461h2843G931Q9322f8727E9433k6968
15629C2465i1978A16331h7934A4305m576K00899C192b4970B29298j02568d73155
15617a24323D24997a60121A38793j474B4306i6108A24319a04331I56Q5669b36878
15605a53047A49739a1466k32511A0196Q2059J73167N8775c699E6301j3008J98618
15594B41911a84694d8975j49374c5487j51087h7478p9479B3799N5639c91056c9357
15582A15408b06058D6891a66697P6847D015M1457b2971C31549j56617J62010J18605
15571D55547c8787F0438b43831P5539b8535j68069Q1868P409A73399a98217I8165
$$ plain form
15652 103786 118871 -209913 -8465 131421 15952 -109470 -121565 -277287 96006 -253936 -11293
15640 171165 -355679 -202951 60771 21329 -404461 -82843 7931 97253 -68727 59433 32465
15629 32465 -91978 116331 -87934 14305 9729 210628 3192 -24970 229298 126730 -473155
15617 -124323 424997 -160121 138793 137319 24306 -96108 124319 -104331 956 86625 -236878
15605 -153047 149739 -11466 -243977 10196 92255 265422 324197 -3699 56301 43293 241911
15594 241911 -184694 -48975 -198349 -35487 -186574 -87478 -166957 23799 79438 -391056 -39357
15582 115408 -206058 46891 -166697 -89850 4015 45472 -22971 331549 174932 336942 455547
15571 455547 -38787 60438 -243831 -168292 -28535 -196604 -114736 -107327 173399 -198217 98165
15559E2815L57632A05566B5750h266A32249N4895g3348r0125C5811a13962b0144
15547B3355a29960N7553K7607k0228A11463k3156K639K8051c2622A05337i7416
15535A6631P9159Q7342a50180L9418C1462b27908r9967B838b00844C19347a61039
15523a63786m6816d0938A42542a7585A58754B70b8845A25591B6948K0786a24203
15511B8560O9312h0291G4741a49257A94597a5698o375j61638f5041B75428A24988
15499A02540K99060j10332a56638B11866L6860g5931D51544I7234Q6115g6251
15488a3668A85758K13308j32098b09560E9125Q7020J20935J71097C2460L7020
15478F9480K85746E1638g4112c6160B40301d2373B37216O1345j35401P966N8910
$$ plain form
15559 52815 410447 105566 25750 -8266 132249 187144 -73348 -163473 35811 -113962 -20144
15547 23355 -129960 -72407 -44800 -65028 111463 88307 90946 118997 -32622 105337 -97416
15535 16631 95790 183132 -150180 -110762 31462 -227908 -327875 2838 -200844 319347 -161039
15523 -163786 -210602 -40938 142542 -17585 158754 270 -28845 125591 26948 47734 -124203
15511 28560 97872 -80291 74741 -149257 194597 -15698 -22073 -183711 -65041 275428 124988
15499 102540 401600 291268 -156638 211866 248726 -75931 451544 97234 183349 -76251
15488 -13668 185758 399066 266968 -209560 59125 146145 267080 438177 32460 69480
15478 69480 355226 51638 -74112 -36160 240301 -42373 237216 298561 163160 171126 230036
15467B30036o1421F9739f7568k3011B68832e224D88875B29911K44107j80489K84320
15456E77849j55380j23455n8460q9495k9300L21200I2472N2161M9678l4679f9490
15444a46178e5805m29273a7130E6316B661K82685A23563N1660Q8859f6318B2457
15432D48824l1020F5094O00439k44538L68487l78112N12081K01910M6865n77674
15422E94552k11753A49161K75347G4222j8984O4730N7809k4339L1841C301O7627
15411G0928J1661P9879c85432A51996b23610n1275a30864B97088e7973m2318B28575
15399C5188m25c90626A11632f2150j58982I5921B8902b21028f1602p4488a3128
15387B87493A20286K7146o9508M7554A1237K08370m226B5666c5304l1708C08539
$$ plain form
15467 230036 168615 69739 -67568 -90579 268832 -5224 488875 229911 474018 293529 577849
15456 577849 422469 299014 240554 151059 121759 442959 92472 144633 194311 159632 -69490
15444 -146178 -55805 -485078 -17130 56316 2661 285346 123563 175223 264082 -66318 22457
15432 448824 417804 65094 665533 420995 789482 411370 923451 1125361 1172226 594552
15422 594552 382799 149161 424508 74222 55238 119968 177777 153438 185279 3301 70928
15411 70928 82589 162468 -385432 151996 -223610 -274885 -130864 297088 -57973 -100291 228575
15399 35188 34763 -390626 111632 -62150 -221132 95921 28902 -221028 -61602 -136090 -13128
15387 287493 120286 147432 77924 125478 11237 219607 215381 25666 -35304 -67012 308539
15375B02400b17603K1735C68772j48562j02005a26039F1601A1868J71995a95064
15364B75237h8322B1786J38294b70175B35288e929A11803J84429n2657M6523b054
15352C03640a28087I4593c1930p8806b9643H4579l1554A1550J55986J80067r7446
15341B50157n2697m0256K23838L4650b63218e6839k4378B70462B7529K46234F3623
15329I0574L268O731R9792L28291B28776n5075H3678K80817N808A61301i4467
15317B33097A8206L28634I3618K01590j6810a67965N8349B00376E0553f3708A86942
15305B06054J0058E0966J87383b2989F2796K3698P5890F7590K60915E7346J08680
15294A66026J0967F4270R4829J4838J25200H2161K1787K98391a21646e914B0314
$$ plain form
15375 202400 -217603 -195868 368772 220210 118205 -126039 61601 11868 183863 -195064
15364 275237 -88322 21786 160080 -270175 235288 -5929 111803 296232 243575 290098 -2054
15352 303640 -128087 94593 -31930 -110736 -29643 84579 53025 11550 167536 347603 250157
15341 250157 197460 157204 381042 415692 -263218 -56839 -81217 270462 27529 273763 63623
15329 90574 93842 100573 200365 528656 228776 173701 83678 364495 370303 161301 -94467
15317 233097 18206 346840 93618 295208 278398 -167965 -109616 200376 50553 -63708 186942
15305 206054 216112 50966 238349 -22989 62796 86494 162384 67590 328505 57346 166026
15294 166026 176993 64270 159099 173937 299137 82161 103948 402339 -121646 -5914 20314
15282a97431H7767J17328b4343B17323H4449i3089k94623B69843N0602a75721
15271g5951j2557d3623k4144m7253N6909d963k2884C57317a52652A58L7911d7112
15258A65046l0970F3434a37165e7676a6788G672b8345m8349A65703N2385e122
15246A6222J52768a32331f2555I3646J50511A00636k1835K4514h4358k49884C63317
15234A91733R0124J43635a12339B64013N1040L72536L14688Q4880N88911n99276
15224A076792M53247k93718l73896k20867k28437a51538C75365j33050B1956J53785
15214A75741J62027a7456r3856C10520A02270a890m2916F35K87106H0283B2746
15202f5174k3095B74708f5920R098B33341a45339A57560A2609K53847B0101c9320
$$ plain form
15282 -197431 87767 205095 -24343 217323 84449 -93089 -387712 269843 320445 -175721
15271 -75951 -88508 -43623 -67767 -115020 -58111 -4963 -27847 357317 -152652 158 38069 -47112
15258 165046 134076 63434 -137165 -57676 -16788 7672 -28345 -76694 165703 218088 -5122
15246 16222 168990 -132331 -62555 93646 244157 100636 78801 103315 -84358 -334242 363317
15234 191733 281857 425492 -112339 264013 315053 687589 1002277 1087157 1676068 1076792
15224 1076792 1530039 1236321 862425 641558 413121 -151538 375365 242315 21956 175741
15214 175741 337768 -17456 -111312 310520 102270 -1890 -44806 635 287741 80283 22746
15202 -65174 -88269 274708 -65920 -56822 233341 -145339 157560 12609 266456 20101 -39320
15190D09657F1089J26524d7702F0589R4630i1468D05534A27532m8751J22829f0277
15178A56018m7636L16120j5034j55102J46387j59464E4430M3769i1068B27277
15167h9052A95834a82048H8797a17970C253d033A07796L27899k00053j10592J67424
15156B92474c156j77157Q4899D0749O853K39905k4347F2997K6750J14530r5511
15145A08766i4374B66199F9793J34914B5173c3452A98048c9313n8149C75285j02740
15134B72545j704H5978a36833D7764g4870c6686C32450o093a01019H4932O0038
15123A44970j5045f0927a3597N884B51558r7807Q4596k3418r9931B4929Q1301
15112A06230b4959B56598a16598A61488o2310J03066L69963k62755p6965M6234
$$ plain form
15190 409657 61089 187613 -47702 60589 155219 -91468 405534 127532 78781 201610 -60277
15178 156018 108382 424502 409468 254366 400753 241289 54430 98199 -91068 227277
15167 -89052 195834 -182048 88797 -117970 3253 -4033 107796 435695 235642 125050 292474
15156 292474 -3156 -180313 -95414 40749 47602 287507 263160 62997 89747 204277 108766
15145 108766 -94374 266199 69793 204707 25173 -33452 198048 -39313 -97462 375285 272545
15134 272545 270841 85978 -136833 47764 -74870 -36686 332450 326357 -101019 84932 144970
15123 144970 129925 -60927 -13597 -7713 251558 153751 238347 214929 114998 24929 106230
15112 106230 -24959 256598 -116598 161488 99178 202244 572207 309452 232487 278721
15102B78721J79398B10880D3173r596b93826f8673C50100Q0640A2405K86147C9807
15090C3346f5880b8509D2209K40172B4561a72158A20015J53428j34533e689A72036
15078E5530a4210C54798b27279C37749D7427c3673B78697J13450A8821R0846J42470
15067B52137j8886b74452D26422j54753a24065D01322A98601g8426E3479P1519
15057A24998Q4736a22665b4971f040A04935b7030D12970A64601K10213D6848J23310
15046A70158P3843p8763a0844n0075B18254k8063K37935r3857J82450B21257O1231
15035B82488K26622B50774L13029j50773A28003K10664H7553M28999B44614Q3168
15025C27782j27596K02412j78699K70011P7493B54604J42698J93216l9816M4058
$$ plain form
15102 278721 458119 210880 43173 33577 -293826 -68673 350100 430740 12405 298552 39807
15090 33346 -65880 -28509 42209 282381 24561 -172158 120015 273443 138910 -5689 172036
15078 55530 -14210 354798 -227279 337749 47427 -33673 278697 392147 18821 109667 252137
15067 252137 233251 -274452 426422 271669 -124065 401322 198601 -78426 53479 124998
15057 124998 209734 -122665 -24971 -6040 104935 -27030 412970 164601 374814 46848 170158
15046 170158 244001 165238 -10844 -60919 218254 190191 428126 334269 516719 221257 282488
15035 282488 509110 250774 563803 413030 128003 338667 87553 516552 244614 327782
15025 327782 200186 402598 223899 493910 571403 254604 397302 590518 550702 594760
15015E94760J54939j04488M4278P618k74026o7194M07214j90346k18564K06710
15005E60901L19621C46706j5318m1350Q7049F7414Q7576M46762j08521N6615A54626
14993D32925Q7680o7437J27087n6444M8508k37806L21195B77682J76727m9J34639
14982E88999o7785r4164p6004L44376k50958J64319k80638N3978J28167K5974
14972E36264k58996J62416j82904N01385J9369j49037J80387L46611m82938R2188
14962G64745B99953K28888K13040q1343j83976K8490n5170J03597j9355r8269
14952D35855G1986K78636L92738B48783q8176J58666J91686A77237R538N84984
14942G71759B72317K14850A43134Q1888N66497C45833P6862J40048j51327K66622
$$ plain form
15015 594760 749699 645211 689489 697107 423081 355887 763101 572755 354191 560901
15005 560901 880522 346706 331388 290038 377087 67414 154990 601752 493231 549846 154626
14993 432925 520605 453168 580255 523811 572319 334513 655708 277682 454409 454360 588999
14982 588999 521214 427050 351046 695422 444464 608783 328145 382123 510290 536264
14972 536264 277268 439684 256780 758165 777534 628497 808884 1155495 672557 764745
14962 764745 299953 528841 741881 660538 476562 505052 449882 553479 534124 435855
14952 435855 71986 350622 743360 248783 160607 319273 510959 177237 186775 771759
14942 771759 272317 487167 143134 225022 791519 345833 422695 562743 411416 678038
14932F78038k13812R2696l2181L79548B69523Q21098D77210q3773j097K14938
14922F07278j88336K77375k01972L30967j18144L97128j15195J10442J55318O8825
14912A323686K71666o0182n0826N43630l43783l47856k4127K58066l59593P19684
14902A930365p1825N15733k80906k07967k45331k49437j30929l41004j94502j38811
14892E85386M27903m42627J50883B85278J64765N77660m64023k20570L92329j91194
14882E44245J01808o2922r2239B10904L65282J975r434k81202K44167q3003L86652
14871H35341j74530J80770k36333L95561j77099k3951n0150M08444k99889j97321
14861F60843M8449k8131p1172k56341J4578J29038j36897L60516j61738O9351
$$ plain form
14932 678038 464226 556922 524741 904289 269523 1090621 477210 393437 392340 607278
14922 607278 418942 696317 494345 825312 707168 1104296 989101 1099543 1254861 1323686
14912 1323686 1595352 1535170 1484344 2027974 1684191 1336335 1312208 1570274 1210681 1930365
14902 1930365 1858540 2374273 2093367 1885400 1640069 1390632 1259703 918699 724197 585386
14892 585386 1013289 570662 721545 285278 450043 1027703 563680 343110 735439 544245
14882 544245 646053 583131 490892 210904 576186 578161 568727 287525 531692 448689 835341
14871 835341 660811 841581 605248 1000809 823710 799759 749609 1158053 858164 660843
14861 660843 709292 681161 609989 353648 368226 497264 360367 720883 559145 628496
14851F28496L60675k02483J09331k52777K73806k50383L3349r4945J9474L1759
14841F56302B30683L25136B54653L55715o776n8503r3029J05660R2350K58426
14831I08496j90592Q3827K83931J69895j26927m5524M99868o93556J17712J07450
14821A114580k49627j92042l8393j45590K38249J1521o9169J4883L27676l09328
14811G02760q7736m3599K64631k58380J57752k73523L32905n3571L405J53686
14801H98330J65490k72966M60662n11393J227J31944k36379L02790j27070k1182
14791G91453P1144n3609L75720k2253k10815j60814J54828k99211q3255l1619
14781E31569K5026J46238n6867l02370P3302L37826J49118k13997l1537J0983
$$ plain form
14851 628496 989171 786688 896019 643242 917048 666665 700014 605069 624543 656302
14841 656302 230683 555819 254653 610368 603592 545089 452060 557720 650070 908496
14831 908496 717904 801731 1085662 1255557 1128630 1083106 1582974 889418 1007130 1114580
14821 1114580 864953 672911 634518 488928 727177 738698 669529 684412 1012088 702760
14811 702760 615024 571425 836056 577676 735428 461905 794810 741239 744644 898330
14801 898330 1063820 790854 1251516 740123 741350 873294 636915 939705 812635 791453
14791 791453 862597 808988 1184708 1162455 951640 790826 945654 646443 563188 531569
14781 531569 556595 702833 645966 343596 416898 754724 903842 689845 658308 669291
14771F69291L67078p0328l05153J7124J54198j20865j6645N7719J24852O1575
14761I38846K24063j81151J86987j37853O1209l62530l86J80615j27695j27322
14751F54783J37258k55467J66968m9971P5220C64369K55932L88036m12933j50647
14741D44757L18483p6383m1887j5379M46971D63293K15642k24951r4633K67022
14731F26373R6836L0027A79891O16937j56782L0068o3577K66546J487N5818q5596
14720H44792L3691K39634k90544Q3190K11912M4627r5157J50279K69762J10908
14710A603094J51245K84213n27329j83273l33597j82207L5331M84126l90308P324
14700I48619m14191O50583l58304K12677R959o6474J83398j4617K3368j44477
$$ plain form
14771 669291 1036369 966041 660888 678012 832210 711345 694700 752419 877271 938846
14761 938846 1162909 981758 1168745 1030892 1092101 729571 729185 909800 782105 654783
14751 654783 792041 536574 703542 653571 728791 364369 620301 1008337 595404 444757
14741 444757 763240 686857 644970 629591 1076562 463293 678935 453984 359351 626373
14731 626373 723209 753236 179891 796828 640046 670114 606537 873083 874570 930388 844792
14720 844792 878483 1118117 827573 910763 1122675 1167302 1072145 1222424 1492186 1603094
14710 1603094 1754339 2038552 1511223 1327950 994353 812146 847477 1331603 941295 948619
14700 948619 534428 1185011 826707 1039384 1049343 982869 1166267 1151650 1175018 1030541
14690A030541J93962K52516k3069j70204L94096p0K64761j84583m41526R7409
14680A413833l46723K9798k79266M35641l11429L78285j05428n45312M16544J35386
14670A221329l29463K08447j33923j49241J80710O145j78991J36728J59016m1751
14660A079006j20972J66779K6015j10345n1726j7389O3624N8002l98566K51480
14650I45908r370J19614J24966j43019J93407k64511J23383L2955N2732p9017
14640A097048m4851O233K16498J67086m1534K6026K26761m65967j45651L7093
14630A078742Q7981J91600k13998K75966j36216J97311m88003M51594J46678j95858
14620A395797l9112J13577l39501q5989K06983J307n4951J89152o1945Q294r1409
$$ plain form
14690 1030541 1224503 1477019 1453950 1283746 1677842 1677772 1942533 1757950 1316424 1413833
14680 1413833 1067110 1096908 817642 1253283 941854 1320139 1214711 669399 1085943 1221329
14670 1221329 891866 1100313 966390 817149 997859 1004004 825013 961741 1120757 1079006
14660 1079006 958034 1124813 1150828 1040483 988757 971368 1034992 1092994 694428 945908
14650 945908 936538 1056152 1181118 1038099 1231506 966995 1090378 1123333 1176065 1097048
14640 1097048 1052197 1058430 1274928 1442014 1400480 1426506 1653267 1187300 1041649 1078742
14630 1078742 1166723 1358323 1144325 1420291 1284075 1481386 993383 1444977 1591655 1395797
14620 1395797 1356685 1470262 1130761 1044772 1251755 1253062 1198111 1387263 1325318 1333612 1242203
14609A242203Q0265J48891j84217J12930J6528J65634j90464K17993n1083M5685
14599A604365k18987L6307J66786k7606j11370L25328l17707K56516r9471Q024
14589A622185l75893L81095J25801j1413L8047m55176L34592M54810l06666k61552
14579A545830N31868l34163k6733m0832K12574r2586L64990j29093n1623n4125
14569A926107l01176N86190l08394j85302k2697K70010p038J96171j83332J54326
14559B124865P8470m77730M03674M21484l98894M0769L00915k391J24894k74062
14549B341994L50733j58474L06995O1450k7773O6004K97272K78220K33215Q1840
14539C831476M32841Q00052J50226J025479J353796K040380M201077O395286J0895759
$$ plain form
14609 1242203 1322468 1471359 1287142 1400072 1416600 1582234 1391770 1609763 1558680 1604365
14599 1604365 1385378 1421685 1588471 1560865 1449495 1774823 1457116 1713632 1614161 1622185
14589 1622185 1246292 1627387 1753188 1741775 1779822 1324646 1659238 2114048 1807382 1545830
14579 1545830 2077698 1743535 1716802 1675970 1888544 1795958 2160948 2031855 1980232 1926107
14569 1926107 1624931 2211121 1902727 1717425 1694728 1964738 1957700 2153871 1970539 2124865
14559 2124865 2203335 1725605 2129279 2550763 2151869 2192638 2493553 2491162 2616056 2341994
14549 2341994 2692727 2534253 2841248 2902698 2874925 2940929 3238201 3516421 3749636 3831476
14539 3831476 4264317 5064369 5214595 6240074 7593870 9634250 13835327 20230613 31126372
14530C1126372K156333j3759890q287881m479023k027625p23785m93945L96435
14522C906991P12817m4406j115619n92571p7562j13214J797k95569R5523M48417
14512B926604l46997r8130k07350m811J36655o3235J19915j65132r4646M22518
14502B625391k47535L71756j26577q686J88283m6787l30963M14172L4591q4640
14492B789005q3913K80968J28077J52808l66065N38565m51482L89369p8371n5274
14482C243687p7763K07824j25159K18246P8483k19571p6279K42645L11397m42148
14472C361362K14525J89806j89681M69539j2644k6980k58046O03636n17519N54632
14462D388630l50610k28673L81015k01273N76349n4489j02266K14289l51766K90865
$$ plain form
14530 31126372 33282705 19522815 11234934 6755911 4728286 4004501 3510556 3906991
14522 3906991 4619808 4575402 3459783 2867212 2789650 2676436 2678233 2382664 2478187 2926604
14512 2926604 2579607 2481477 2274127 2269316 2405971 2342736 2462651 2297519 2202873 2625391
14502 2625391 2377856 2749612 2623035 2614349 2802632 2755845 2424882 2839054 2873645 2789005
14492 2789005 2705092 2986060 3114137 3266945 2900880 3439445 2987963 3377332 3298961 3243687
14482 3243687 3165924 3373748 3248589 3466835 3545318 3325747 3249468 3492113 3803510 3361362
14472 3361362 3575887 3765693 3576012 4045551 4032907 4005927 3747881 4351517 3833998 4388630
14462 4388630 4038020 3809347 4190362 3989089 4565438 4510949 4408683 4622972 4271206 4562071
14452D562071J04950Q174q0235K73330j75927J57488j76392J24592O5448K36782
14442E100281k60769M74573J03882r0013p6142L49106K30581m03068J85896J31262
14432E745589K04729k42397R7373K05251j58036K91243j20837Q3155K65221k8542
14422F342749K13289p0753M06532j03489j77961J04789L89653m5574J53417j42444
14412G070208O28269k20881K64350N49912l44966j03507J84371O30461J32725
14403H790942j76321M80041k87899L69757j79342L97892k86410j5821P42719m87255
14393I348303J77164N87067J06853Q6675K50956K8124O2943J56929M42475j28076
14383A1119413L95594K1942K28211l3278N85927K8865j15366N22428j22856J11236
$$ plain form
14452 4562071 4667021 4675195 4594960 4868290 4692363 4849851 4673459 4798051 4863499 5100281
14442 5100281 4839512 5314085 5417967 5327954 5251812 5600918 5831499 5428431 5614327 5745589
14432 5745589 5950318 5707921 5805294 6010545 5852509 6143752 6022915 6106070 6371291 6342749
14422 6342749 6556038 6485285 6891817 6788328 6610367 6715156 7104809 7059235 7212652 7070208
14412 7070208 7698477 7477596 7741946 8291858 7946892 7843385 8027756 8658217 8790942
14403 8790942 8614621 9094662 8806763 9176520 8997178 9395070 9108660 9092839 9835558 9348303
14393 9348303 9525467 10112534 10219387 10306062 10557018 10585142 10648085 10805014 11247489 11119413
14383 11119413 11515007 11536949 11765160 11731882 12317809 12346674 12231308 12753736 12630880 12742116
14373A2742116L99263M30753m7063L62079M67817K21431M76115M67334m0286N84507
14363A6064066r7252J49504K86766N49704n0463O21170L8974M02103L41953P99925
14353A9106450K55579L57460M02407N52144L64607N34097K50851O78197K88410
14344B2790202M22925O30688K92897L92507N60539Q92931O34223R27069L82178
14335B7926159N90196O96587N17225J259870P75138Q15455J139415Q39098L61660
14326C4920803J291228J250908Q73012J445968P04072J207545J663736J325269
14318D4682541J042319J344465J544434J797150J516115J716419J702989K250448
14310E7596880J847843K016459J962391K425920K299684K096119L076637K500331
$$ plain form
14373 12742116 13141379 13572132 13525069 13887148 14354965 14576396 15052511 15519845 15479559 16064066
14363 16064066 15966814 16116318 16403084 16952788 16902325 17523495 17562469 17964572 18306525 19106450
14353 19106450 19362029 19719489 20121896 20674040 21038647 21572744 21823595 22501792 22790202
14344 22790202 23213127 23843815 24136712 24529219 25089758 25982689 26616912 27543981 27926159
14335 27926159 28516355 29212942 29730167 30990037 31765175 32580630 33720045 34559143 34920803
14326 34920803 36212031 37462939 38335951 39781919 40485991 41693536 43357272 44682541
14318 44682541 45724860 47069325 48613759 50410909 51927024 53643443 55346432 57596880
14310 57596880 59444723 61461182 63423573 65849493 68149177 70245296 73321933 75822264
14302G5822264K759905K860933L305822K785128L958531L582302M114219M095470
14294A03284574M182642M728162N098468N380347N842103N629396O585055O467184
14286A47197931P207955P697167Q097363Q386209Q891013R904223R814387J0620601
14278B17816849J1464725J1530813J2609468J3282379J3647457J3724778J4368862
14271C08445331J4253311J4293482J4296434J4649604J3798385J3306370J1853570
14264D04896487J1708853J0879652J0025904Q867431Q131688P407141M427937
14257D66345093J731273M65178J796078j370991o836417m919768p684238j1513863
14249D38012345j2055920j3166479j4031594j3726044j4384587j4545938j4621745
$$ plain form
14302 75822264 78582169 81443102 84748924 87534052 91492583 95074885 99189104 103284574
14294 103284574 107467216 112195378 117293846 122674193 128516296 134145692 140730747 147197931
14286 147197931 154405886 162103053 170200416 178586625 187477638 197381861 207196248 217816849
14278 217816849 229281574 240812387 253421855 266704234 280351691 294076469 308445331
14271 308445331 322698642 336992124 351288558 365938162 379736547 393042917 404896487
14264 404896487 416605340 427484992 437510896 446378327 454510015 461917156 466345093
14257 466345093 468076366 468541544 470337622 468966631 462130214 457210446 449526208 438012345
14249 438012345 425956425 412789946 398758352 385032308 370647721 356101783 341480038
14242C41480038j3967684j3669867j3900873j3825795j3158388j2599784j1973551
14235B48384096j2072711j1585900j1020565j0411726j0271495r939469r078807
14228A74003423q462155p974910p612466p114179o611101o292566n560103n693925
14220A18682018n395560m569604m670887m287144l694527m246707l454458l737089
14212H4626042l081687l571185k829785k496970k754206k341445k690727j765066
14204F3094971k216277k404631j348680k071531j912816j636273j073562j813839
14196D8617362j235595j867496r66402j287434q23476j487404r16281j038770
14188C8994504j378991r52938m97083j152784r04381j086753p52235r38538o69155
$$ plain form
14242 341480038 327512354 313842487 299941614 286115819 272957431 260357647 248384096
14235 248384096 236311385 224725485 213704920 203293194 193021699 183082230 174003423
14228 174003423 165541268 157566358 149953892 142839713 136228612 129936046 124375943 118682018
14220 118682018 113286458 108716854 104045967 99758823 96064296 91817589 88363131 84626042
14212 84626042 81544355 77973170 75143385 72646415 69892209 67550764 64860037 63094971
14204 63094971 60878694 58474063 57125383 55053852 53141036 51504763 50431201 48617362
14196 48617362 47381767 45514271 44547869 43260435 42436959 40949555 40033274 38994504
14188 38994504 37615513 36662575 36165492 35012708 34108327 33021574 32269339 31330801 30661646
14179C0661646o51985p41893r17754m89971p42830q47647n25180p36374m41222
14170B4566790l66870l95658p25408l98402l50795m60824m97139n53094n76590
14161B0242010k08274l11605p76590J757m54455p60555J12047o65172m09862R4239
14151A6863540k36186p35214k88964o4000k98764n8503n27834l38889j41397j74851
14141A3998938k27785m24097n4211k60367k21340J84427n76083k29509j00639
14132A2089334n53829L02015l15453k24179m18119j34323K9824l26264k60544
14123A0188462J3749j09145J0499m35926K64658n54502M18338n93049K3784j06031
14113I120837l93796k30018p0325J37208j48451L5750q5926j36081j63324J12
$$ plain form
14179 30661646 30009661 29267768 28350014 27860043 27117213 26269566 25744386 25008012 24566790
14170 24566790 24199920 23804262 23078854 22680452 22329657 21868833 21371694 20818600 20242010
14161 20242010 20033736 19722131 18945541 18947298 18492843 17732288 17844335 17179163 16769301 16863540
14151 16863540 16627354 15892140 15603176 15539176 15240412 15181909 14654075 14315186 14173789 13998938
14141 13998938 13771153 13347056 13292845 13032478 12811138 12995565 12419482 12189973 12089334
14132 12089334 11535505 11837520 11522067 11297888 10879769 10745446 10775270 10449006 10188462
14123 10188462 10202211 10093066 10103565 9667639 9932297 9377795 9796133 9203084 9226868 9120837
14113 9120837 8727041 8497023 8426698 8563906 8415455 8451205 8365279 8229198 8065874 8065986
14103H065986l71109K42736l20899m07748M56568n87898K3601K45310l94264M4039
14093F996322k94497j2662r1577r1326k5253m5874L0572k01719J57101j17890
14083F303197k73385O7711q9455M9069n25507m176J46356L7013j68125k01748
14073E340950j37623J3719K22171o46783M07010j55003L5534j15995K01190j14178
14063E050992k17946K33288k15645k91100K12493j43926j18759J38569j46991
14054D500975Q7824l76766m1237Q7318L08533j85918k91098R7955J82064k40517
14044D129133J42624L7395n8281l33838R5904n6240M6183l17987J63453n81864
14034C266482L29203k50440L46416n23818L86288N1060q5858K3368j71261J57836
$$ plain form
14103 8065986 7694877 7937613 7616714 7208966 7665534 7077636 7101237 7346547 6952283 6996322
14093 6996322 6701825 6689163 6597586 6506260 6481007 6435133 6465705 6263986 6421087 6303197
14083 6303197 6029812 6097523 6008068 6057137 5531630 5527454 5673810 5710823 5542698 5340950
14073 5340950 5203327 5217046 5439217 4792434 5199444 5044441 5079975 4963980 5165170 5050992
14063 5050992 4833046 5066334 4850689 4559589 4772082 4628156 4509397 4647966 4500975
14054 4500975 4588799 4212033 4170796 4258114 4566647 4380729 4089631 4187586 4369650 4129133
14044 4129133 4271757 4309152 4250871 3917033 4012937 3956697 4002880 3684893 3848346 3266482
14034 3266482 3595685 3345245 3691661 3167843 3554131 3605191 3519333 3542701 3371440 3529276
14024C529276O128m11216K45412O7822l77969K98412j79319k70884L71374l45506
14014B933530M68462m17430J13231j23768K72106o9506m58974L80109k79584l29169
14004B489007N87643n46455K71844j16109q7601J04236m89929O80345k06257k22024
13994B464700k14950N42225n03985J37348N8542k01528j46336L65390l45967L35230
13984B490669J38615j66824M1473Q5888L00155j40449M42736L20551K99033J015564
13974D827411J387062K982022N708059J0798433R096627j0978962q138519n450538
13966A0231595k977395j164625j019757q56065k89440k16o55742J62921n86966
13957B844310K56975k64326j75404J4733j0608M41085p82824O2489l2247J48857
$$ plain form
14024 3529276 3535404 3124188 3369600 3437422 3059453 3357865 3178546 2907662 3279036 2933530
14014 2933530 3401992 2984562 3097793 2974025 3246131 3176625 2717651 3097760 2818176 2489007
14004 2489007 3076650 2530195 2802039 2685930 2598329 2702565 2212636 2892981 2686724 2464700
13994 2464700 2249750 2791975 2287990 2425338 2483880 2282352 2136016 2501406 2155439 2490669
13984 2490669 2629284 2462460 2503933 2589821 2889976 2749527 3192263 3512814 3811847 4827411
13974 4827411 6214473 9196495 14904554 25702987 34799614 23820652 15682133 10231595
13966 10231595 7254200 6089575 5069818 4213753 3924313 3924097 3268355 3431276 2844310
13957 2844310 3101285 2836959 2661555 2676288 2665680 3106765 2323941 2386430 2354183 2503040
13947B503040l63638o8481P6278j76215K91493j96157j00311j49101M31850k44243
13937B004515K48914j74166l94898K86974M0304k51820L46279k48251n100Q2036
13927A934787Q8933j50246k54570K03125j20196J32864j30135K77408j87096J12118
13917A906992K1037l84292P3144j85014M95129l16096N9724j82244N07693l42472
13907A653601k21001J70590p5199J0710J91043m5747J875J08344M5359l15090
13897A524485J18870J07529j14152O7974k54763p4692n0179K77917k91647K19293
13887A530635l29747L32954n71815M60204p3194j92552K09608k237M4276k41975
13877A166157M33611j77214k09200q5067J22248J34813J23289m78303L21647J02495
$$ plain form
13947 2503040 2139402 2070921 2147199 1970984 2262477 2066320 1966009 1816908 2248758 2004515
13937 2004515 2253429 2079263 1684365 1971339 2011643 1759823 2106102 1857851 1852751 1934787
13927 1934787 2023720 1873474 1618904 1822029 1701833 1834697 1704562 1981970 1794874 1906992
13917 1906992 1928029 1543737 1616881 1431867 1926996 1610900 1670624 1488380 1996073 1653601
13907 1653601 1432600 1603190 1527991 1538701 1729744 1683997 1685872 1794216 1839575 1524485
13897 1524485 1643355 1750884 1636732 1704706 1449943 1375251 1325072 1602989 1311342 1530635
13887 1530635 1200888 1533842 962027 1422231 1349037 1156485 1366093 1363856 1408132 1166157
13877 1166157 1599768 1422554 1213354 1128287 1250535 1385348 1508637 1030334 1351981 1454476
13867A454476k73680Q0471l5121k21027J68543R2541K0854p7863p896M4277l49259
13856H96316K53411j1512k44074K22014R0157p1662j40094K67477J56668l87310
13846A031391j85023J43888M19387o01771M00102m15114K56871o8715k03431m358
13836G73227L68968J66295k22862j40384K46077j880J188k14512J5728j45891
13826H45954L84884k37385N3586j50817L04818l34240J62354R5015l38489K66354
13816A052034J3488j39490Q6335k53053K00542k16915j14611P09566F54639L05817
13806I60456J19499l85332N4726L17379l03418M74511L6057o06766N16187l91336
13796G91963J15706n257J9021j0820J35848r6866k6279j05356k50756N3778L28972
$$ plain form
13867 1454476 1180796 1261267 1226146 1005119 1173662 1266203 1287057 1209194 1201298 1245575 896316
13856 896316 1149727 1138215 894141 1116155 1206312 1134650 994556 1262033 1418701 1031391
13846 1031391 846368 990256 1409643 807872 1207974 792860 1049731 981016 777585 773227
13836 773227 1142195 1308490 1085628 945244 1191321 1189441 1190629 976117 991845 845954
13826 845954 1230838 993453 1047039 896222 1201040 866800 1029154 1124169 785680 1052034
13816 1052034 1065522 926032 1012367 759314 959856 742941 628330 1337896 654639 960456
13806 960456 1079955 694623 749349 1066728 763310 1237821 1273878 667112 1183299 791963
13796 791963 907669 902412 921433 910613 1046461 949595 923316 817960 567204 620982 949954
13785I49954k12163J62191k99227J97768R2883l22355J97934L27367n21483J42793
13775G15662k63503P44703n18978M05013l10588M9401J97093l77309K97705p2792
13765H66407j72335O5378j4182L26558k62645k15887L98291k41216l35770l9577
13755C75022L12391m5867N5839j3309L8001k10763N53965E02398K43155o1780
13745F83773j48258J25077j81185L60534j78215j97025J86500L9859K76823D39524
13734F02696j51382K23535R207o6966m2916j01931k6109K05027M0689K4014J1620
13723G27484j48668L65141k98826Q9034K06783l79099J32100J68729k63250k5443
13713E73985O9726J3213j78669j13851j4560M21638j03423P5997j95498j4316
$$ plain form
13785 949954 737791 899982 600755 798523 891406 569051 766985 1094352 572869 715662
13775 715662 452159 1196862 677884 1082897 772309 821710 1018803 641494 939199 866407
13765 866407 694072 759450 745268 1071826 809181 593294 991585 750369 414599 375022
13755 375022 687413 641546 697385 684076 722077 511314 1065279 502398 745553 683773
13745 683773 535515 660592 479407 839941 661726 464701 651201 691060 967883 439524
13734 602696 451314 674849 684056 617090 574174 472243 446134 651161 691850 715864 727484
13723 727484 578816 943957 645131 734165 940948 561849 693949 862678 599428 573985
13713 573985 643711 656924 478255 364404 349844 771482 668059 744056 548558 534242
13703E34242L25313A75487K66452L36074q8006J07172A96758M3742M78023C14253
13692D61434r902J88650j58795j9209J58465p3268L2629L49428m19313k50642
13682B59477J53503Q1925j49356O2787R8321K75166j26147k42901K39934j11712
13672E40997J57583l01021J8464K93205j63975J43767j91120M9397j15616j18865
13662C12816K07629j45060Q0139K23674j40060j47988N9828K64277D2525N42281
13652E84806J82260k13064Q0337A27084M58737k2853j92518L9057N2181q9074
13642C72614K87490k63996O1618L29196C31698o4398M31742l07357J01321p756
13632D85250B28026K81978K63682C33193J85291j74456G0871M18360N2413k08687
$$ plain form
13703 534242 859555 175487 441939 778013 690007 797179 196758 240500 718523 314253
13692 461434 451532 640182 481387 462178 620643 547375 580004 929432 510119 259477
13682 259477 412980 494905 345549 408336 506657 781823 655676 412775 652709 540997
13672 540997 698580 397559 416023 709228 545253 689020 497900 547297 431681 312816
13662 312816 520445 375385 455524 679198 539138 391150 450978 715255 42525 584806
13652 584806 767066 554002 634339 127084 585821 562968 370450 409507 461688 372614
13642 372614 660104 396108 457726 786922 331698 267300 699042 391685 493006 485250
13632 485250 228026 510004 773686 333193 518484 344028 70871 489231 541644 332957
13622C32957K38616A89490J07804J24480o9199K29866l5571m5066j75978L7278
13612C63104Q0615k4682K70241l33955J27828j88920J44694Q3501Q0544k98328
13602C04642M2566j66856J74048A23133O02801I4761O48686C2388L08653m2977
13592B98064O3241j7219P3853K9493m0289j463l5736l2636K54712A89498J67888
13581C57386L2224j60286N113K23179K9521C1947M23846R299j18851j27356M6674
13570B65559M7128o8846Q8872P6690I8593J68661O9143i5036E39070B06613q6357
13559A20256J28770l6537J64406L5324n3652n8050L56117B43409K10336P83K6473
13548D81001M7536A13249M69298A34015D2411O7226M58027k76755p5193J66256
$$ plain form
13622 332957 571573 189490 297294 421774 352575 582441 546870 501804 325826 363104
13612 363104 443719 419037 689278 355323 483151 294231 438925 522426 602970 304642
13602 304642 347208 180352 354400 123133 725934 94761 743447 32388 341041 298064
13592 298064 361305 344086 417939 447432 407143 405680 369944 337308 592020 189498 357386
13581 357386 389610 229324 234437 457616 487137 31947 455793 465092 346241 218885 265559
13570 265559 312687 243841 332713 409403 98593 267254 336397 -95036 539070 206613 120256
13559 120256 249026 212489 376895 412219 358567 300517 656634 243409 453745 454528 481001
13548 481001 528537 113249 582547 134015 42411 109637 567664 290909 215716 381972
13538C81972A12455E5308J19012Q6280n6186L00664o38j20567j35566B286N20627
13527E22913L7217l1781D6535L48555A63559C5529M75362C3949M39724J12036
13517E85709B24832K05037G2729N7810F4178J60916J60592A80010J25947A32665
13506c1315B4591N00976A27393K42700B6171N69222A46040h996C19750G1608M45368
13495E16976r0568j45075J13221K21195D574K02735J87466j10891o536A29612
13484C70181L02330A81431J2033J2874k7752L40162k58363a8460B42487p1670
13474A70817k892L05943E7351J5290J89179J89267N4110k378J0735k21104l081
13463B89369H0649j9134J84276O585O8482m0738a8973B25489r2205K19181k5899
$$ plain form
13538 381972 112455 55308 174320 260600 204414 505078 504440 383873 248307 2286 522913
13527 522913 560130 528349 46535 395090 163559 35529 510891 33949 473673 585709
13517 585709 224832 429869 72729 130539 64178 225094 385686 180010 305957 132665
13506 -31315 24591 525567 127393 370093 26171 595393 146040 -8996 319750 71608 516976
13495 516976 426408 281333 394554 615749 4574 207309 394775 283884 277348 129612
13484 370181 672511 181431 193464 206338 178586 518748 260385 -18460 242487 170817
13474 170817 167925 473868 57351 72641 261820 451087 505197 502819 513554 292450 289369
13463 289369 80649 61515 245791 252376 320858 280120 -18973 225489 133284 352465 326566
13452C26566j25384J96378O9749B22261J0401J29887k0103J26286r1597b3959
13441a44979A24097L66797j6617B08448J28314d8241C59316i165B38987B1768
13430C71274q3967L5978q9852a86456C12583A22332B1049K35168j12081K86946
13420D31082j04000A03684K58273K0276b32905B20308b42264C23533J03018j28115
13410B98436A18186J12852J8682j09007g1504C83032j08329k138E7093J64941
13400B22034j6738n6762B1190K66465G6979N2440k0986m5649h4451C88516p1513
13389C17003A41430Q94J71400A00044a26209C73502A25319b2559A90417g3512
13378C14898F7040M4852e8628B19358L71p8413j1662K494K47834I8006L93488
$$ plain form
13452 326566 201182 397560 467309 222261 232662 362549 342446 468732 377135 -23959
13441 -144979 124097 490894 474277 208448 336762 -48241 359316 -9165 238987 21768
13430 371274 287307 323285 233433 -186456 312583 122332 21049 256217 144136 431082
13420 431082 327082 103684 361957 382233 -232905 220308 -242264 323533 426551 298436
13410 298436 118186 231038 249720 140713 -71504 383032 274703 272565 57093 222034
13400 222034 205296 148534 21190 287655 76979 129419 108433 62784 -84451 388516 317003
13389 317003 141430 142324 313724 100044 -126209 373502 125319 -22559 190417 -73512
13378 314898 67040 111892 -58628 219358 219729 141316 129654 132148 379982 98006 491494
13367D91494k17344m5816m0468b15703B35309r3686L82459j97833n7239K05343
13357D74353j77340j45082O3538E0335K1511O4419K17280j14836N2630J67008
13347D58347j35905a07233B82191j40636K5836G6324a39376A81456L12032j54025
13337C39463q8434b742B78623n136a21785A50886J26300j27946b1324A77113K47238
13326D24351j38379j8068L48753A54872O5785J02145A43474J97106J49070j89142
13316C00508C5994L19682j7408A66356J18556q6072R5806c6155B36117H9014d5063
13304E3326K98458a41879b9284A52374B0755K34329B2397P2790J78360K2281e0737
13292A02185N10765A45873N3874G7895K45725R2766M6470A78841n1137c9531A77552
$$ plain form
13367 491494 274150 228334 187866 -215703 235309 141623 524082 326249 269010 474353
13357 474353 297013 151931 215469 50335 71846 136265 353545 238709 291339 458347
13347 458347 322442 -107233 282191 141555 167391 76324 -139376 181456 493488 339463
13337 339463 251029 -2742 278623 273487 -121785 150886 277186 149240 -21324 177113 424351
13326 424351 285972 267904 616657 154872 220657 322802 143474 340580 489650 300508
13316 300508 35994 355676 338268 166356 284912 198840 294646 -36155 236117 89014 -45063
13304 53326 351784 -141879 -29284 152374 20755 255084 22397 95187 273547 295828 -50737
13292 102185 612950 145873 199747 77895 323620 416386 462856 178841 127704 -39531 177552
13280H1401K49862J6037j47219K0078e4684A30583j3574J57946a5933j20990D37960
13268a71555A06522b82762A01384D6304J35745c0541E3958P8131B2344a71886
13257h5222B16470d3196D08008H8976K27086a07159C10393j24653Q2921c9757
13246A58849k9275k1418m6439K13863I0818A3355b3461C11646a90897A41066j6427
13235A24639j2225J78568C5574K14632L8216b24071f497A91026K39656G7972Q6858
13224A64830c0848k925a5595n6423b7246A26721h1576D9029J51425h8570H2459
13212b41122A45227F0634J23890H4618d2508A83573k3033b45888B43804A15833
13201F8040K2424J80810J44364F8204C2854a08433B8576h7741A8068K82053D3193
$$ plain form
13280 81401 331263 347300 200081 220159 -54684 130583 117009 274955 -15933 -136923 437960
13268 -171555 106522 -282762 101384 46304 182049 -30541 53958 132089 22344 -171886
13257 -85222 216470 -43196 408008 88976 316062 -107159 310393 185740 268661 -39757
13246 158849 129574 108156 61717 275580 90818 13355 -23461 311646 -190897 141066 124639
13235 124639 112414 290982 35574 250206 288422 -224071 -6497 191026 430682 77972 164830
13224 164830 -30848 -33773 -15595 -72018 -27246 126721 -81576 49029 200454 -88570 82459
13212 -241122 145227 60634 184524 84618 -42508 183573 160540 -245888 243804 115833
13201 68040 90464 271274 415638 68204 32854 -108433 28576 -87741 18068 300121 43193
13189A39535Q1004K229J6713j02803a36774B117Q0140L08771A66832J44691A15680
13177C26228B5338J44200d46817A47262a72573M5131E0015L6977L14195a14919
13166b07500d2011j9294A31302a81118E1566J1970j9891K8482k7445M1868m886
13155H1664K38636A09036l1464a25411A47431l7452b49681H3664c79641D94152
13144F1429h0915C3608O9997L1274B1187J13932a57713G5077K09067j8301F2505
13132c13843E8004R1931F7572N0708l9840J2799c9151C31465j6725b47977A32490
13120B35928j08800R989R5793J07765a76963m3590i6592H0622a17172H0550a02624
13108A30952f3223A05604J15831A00561K93240i7259r8915C10529r3423h2912
$$ plain form
13189 139535 220539 222768 239481 136678 -136774 2117 82257 391028 166832 311523 115680
13177 326228 25338 169538 -446817 147262 -172573 -127442 50015 86992 401187 -114919
13166 -207500 -42011 -61305 131302 -181118 51566 63536 43645 72127 44682 86550 81664
13155 81664 320300 109036 77572 -125411 147431 109979 -249681 83664 -379641 494152
13144 61429 -80915 33608 103605 134879 21187 135119 -157713 75077 284144 265843 62505
13132 -313843 58004 149935 67572 118280 78440 91239 -39151 331465 314740 -247977 132490
13120 235928 127128 137117 232910 340675 -176963 -220553 -96592 80622 -117172 80550 -102624
13108 130952 -63223 105604 221435 100561 393801 -97259 -196174 310529 217106 -82912
13097a70029l3446M2818A67378o8298m616c43078C66603A32059N6179E7068Q7462
13086A44530C9448J30227J94977b46229g7702o3369A62933N0207K46858C5910
13075A11299e9868C15338j20618A7403J73953B945a67386B09476E0485K2535O020
13064G9040J6190a2375A06708b69943C9981L5655K03786I6775j0776A0132J34230
13053A44362l695C5032a12407A24036J6056N194J05022a41270C49937H4319f8992
13041D62175a86888C37505f116B69070l4503b13410F1064c3752j16830A182L0807
13030C1989R0865f7901A66554a18871B48935j10770a18885I7595a34092B55605
13019C6982g2456r9798A50302n5884J30354A11853K8522b59895E0842O4724l2390
$$ plain form
13097 -170029 -203475 -160657 167378 99080 94464 -343078 366603 132059 188238 57068 144530
13086 144530 39448 169675 364652 -246229 -77702 -141071 162933 213140 459998 35910
13075 111299 -59868 315338 194720 17403 191356 2945 -167386 209476 50485 73020 79040
13064 79040 95230 -12375 106708 -269943 39981 75636 279422 96775 85999 10132 144362
13053 144362 140667 35032 -112407 124036 140092 145286 250308 -141270 349937 84319 -68992
13041 462175 -186888 337505 -6116 269070 234567 -213410 61064 -33752 -150582 1182 31989
13030 31989 122854 -67901 166554 -118871 248935 138165 -118885 97595 -134092 255605
13019 36982 -72456 -172254 150302 94418 224772 111853 140375 -259895 50842 115566 83176
13008H3176b1734A50494n7020a93936A4660L5178J96989K18147f3237F958J92703
12997A99661G1779J20610D1273L3575a63280B55125D3209g2674D04335i2469H2279
12985d2353B39707o8500K8046D5870Q4984b86430H5384k9756K44105L080H8381
12973B38735c05229J22351B1713K4617R1750O5934f0892G6267a99796q3108B17762
12961C63507b06022h9765C94548G1925J13676b0675k07807a02232D33274e1700
12950A40652m4011d6582G907a03637n4296o439A1931d3776k01651D19738C2034
12938F9127P5650c8392j4821C53108a79251A55268o4617j4892a39788c7507A17728
12926B07152j6131L1404a6970B91855j02577J1095I6168a67105C26882b10068
$$ plain form
13008 83176 -21734 150494 93474 -193936 14660 49838 246827 464974 -63237 6958 199661
12997 199661 71779 192389 41273 74848 -163280 255125 43209 -72674 404335 -92469 82279
12985 -42353 239707 171207 199253 45870 130854 -286430 85384 55628 299733 302813 88381
12973 238735 -305229 -182878 21713 46330 138080 204014 -60892 76267 -199796 -282904 217762
12961 363507 -206022 -89765 394548 71925 185601 -20675 -228482 -102232 433274 -51700
12950 140652 96641 -46582 7907 -103637 -157933 -164372 11931 -43776 -245427 419738 32034
12938 69127 144777 -38392 -53213 353108 -179251 155268 90651 75759 -139788 -37507 117728
12926 207152 191021 222425 -16970 291855 189278 200373 96168 -167105 326882 -210068
12915B8950c60455A02000D3202J8200J38511p5232c60632A39256c4330B58609
12904A60744a696j47302j93331D8950b63807B8470c12606A57108b54638f0798
12893A67008d2662j194p5224L6517B76942L890j08086p2000J61586a85628K9447
12882a56181N1041j72181E2393P2718b20795g1752E1603K37081f3260j35471Q568
12871a90163j3098B4240a20783B4245L3218N0981m7117L1794l0180e9001k09426
12860b68427b0382A15172A7758J06709a30681A63412d4156j6313A51247J84562
12850C35809a89998H8540k3438K03465A12842g814C8527a01032d3981F9312i0542
12838B02690a86637Q3660A77906q8876a47546G7337h0114A37371Q6211B210L141
$$ plain form
12915 28950 -360455 102000 43202 61402 199913 124681 -360632 139256 -34330 258609
12904 160744 -1696 -148998 -342329 48950 -263807 28470 -312606 157108 -254638 -60798
12893 167008 -42662 -43856 -119080 -82563 276942 280832 172746 100746 262332 -185628 -156181
12882 -156181 -105140 -277321 52393 125111 -220795 -71752 51603 288684 -63260 -198731 -190163
12871 -190163 -203261 24240 -120783 24245 57463 108444 61327 93121 62941 -59001 -268427
12860 -268427 -20382 115172 17758 124467 -130681 163412 -44156 -60469 151247 335809
12850 335809 -189998 88540 65102 268567 112842 -7814 38527 -101032 -43981 69312 -90542
12838 202690 -186637 -102977 177906 89030 -147546 77337 -80114 137371 223582 2210 5351
12827E351e14056A27646B5306L44470j08265q3746b01630A41985k5606a30682
12816b54121b1397l9928E0460K78339I5657a9881B2665h2507B21560k7318c6469
12804c6783r3182K3188p628l3256k1535o2329A93532B5996P964j4201R7885K31037
12792C48681E4616a746k0566k09624M4370K2316A6336L02145q6810a3612k54469
12781b68081a31491c9971C86675j20012g7604A01615a11742K8923A27006b06530
12770A52395j0064l1955a14815n810A03739J2673b43164h3234C537L763e7846
12758A11200Q521c47358A90407D1152d8964l05271A4676O4282K0596j7917a47539
12746b65822A11726m9241d9618j4990j1339A94614i576B84527A10159g7997o4687
$$ plain form
12827 5351 -514056 127646 25306 369776 261511 177765 -201630 141985 116379 -130682
12816 -254121 -21397 -61325 50460 328799 95657 -19881 22665 -82507 221560 194242 -36469
12804 -36783 -129965 -106777 -114405 -147661 -169196 -231525 193532 25996 33960 19759 117644 348681
12792 348681 54616 -1746 -22312 -231936 -187566 -165250 16336 318481 231671 -13612 -268081
12781 -268081 -131491 -39971 386675 266663 -77604 101615 -111742 -82819 127006 -206530
12770 152395 142331 110376 -114815 -120625 103739 116412 -243164 -83234 3537 7300 -57846
12758 111200 119721 -347358 190407 41152 -48964 -354235 14676 78958 99554 81637 -147539
12746 -265822 111726 62485 -49618 -64608 -75947 194614 -9576 284527 110159 -77997 -142684
12735a42684A58595l9440a26597H641d6153l5384I990a6196d463n6091E1293K79184
12723C30477H3763a21005C26839I3200J07108A8282L1814K34426A05930C0091
12712B38710A04340a76909b6739E9838b36491F0121M4199b11088d9680I6600c23004
12700a67788c4019j81013N7354P3155m5150D2567c8717B14039L1478n8638a03134
12688i552A61319c6451H4630R7362K91213b6788D29128j61569f2423j21581G3344
12676A23979b08007j21140H4733c744A90174B173J10093B0434J476J57085M7239
12665B26234m0440J70630j14668G0458b83619C97842h5648A33924b77171H2664
12654C63838G0513a2859C0552d24891B17000j06540a7035A73970b52669f6850
$$ plain form
12735 -142684 158595 119155 -126597 8641 -46153 -81537 9990 -16196 -4463 -60554 51293 330477
12723 330477 83763 -121005 326839 93200 200308 18282 50096 284522 105930 30091
12712 238710 104340 -176909 -26739 59838 -236491 60121 104320 -211088 -49680 96600 -323004
12700 -167788 -34019 -215032 -157678 -84523 -129673 42567 -38717 214039 245517 186879 -103134
12688 -9552 161319 -36451 84630 181992 473205 -26788 429128 267559 -62423 -184004 73344
12676 123979 -208007 -329147 84733 -3744 190174 2173 112266 20434 21910 178995 226234
12665 226234 185794 356424 241756 70458 -283619 397842 -85648 133924 -277171 82664
12654 363838 70513 -12859 30552 -424891 217000 110460 -17035 173970 -252669 -66850
12643B55329c9233H8534j982A571P6164g042F1003c68577h544E7813f4172A61996
12630e0978o7013J6086A35648L4338P0791C0146a2539j8189J5063E9028Q5956
12619A44984a90681D8603K09266J9492q5190q2154K1684J38493l2911a35243D0867
12607G8195j3455J23712a05698M0513k04790O2180b886m4963D0646a93521k4345
12596b17866F0732h2362A7929L0486A8460K54989F7636h8515o1892A21273K87158
12585D08431G3331a17451B87947c05760b0038k6377m7855j7258L9157k05847j02162
12574c80380C55114f3586H0568N6590J02328i1043M3451B0610J1221O272i7014
12562a6426B8567a515C19817A01431g5605n3118K8974A60160a63242B29433a27575
$$ plain form
12643 255329 -39233 88534 86552 1571 77735 -7042 61003 -368577 -8544 57813 -64172 161996
12630 -50978 -117991 -101905 135648 169986 240777 30146 -12539 -30728 -15665 59028 144984
12619 144984 -190681 48603 257869 277361 192171 110017 131701 270194 237283 -135243 40867
12607 78195 64740 188452 -105698 -65185 -269975 -207795 -2886 -47849 40646 -193521 -217866
12596 -217866 60732 -82362 17929 48415 18460 273449 67636 -88515 -150407 121273 408431
12585 408431 73331 -117451 287947 -305760 -20038 -46415 -94270 -111528 -72371 -278218 -380380
12574 -380380 355114 -63586 80568 137158 239486 -91043 -47592 20610 31831 38103 -97014
12562 -16426 28567 -1515 319817 101431 -75605 -128723 -99749 160160 -163242 229433 -127575
12550A43550R5955G6613h1972l7396L6807A52440m2106d4542B03674d4994B52942
12538b17740B29262c0411J3449C2687A1316J17319c6593A82758A1528K8897J37297
12527A77722a3041j36646B33717b07667B48248j11039A7632d8607q5277D9966
12516d2335k51788B3898a07364l5120E7031f3661A69137g8938k61290a3684B13912
12504c54503e6303q476B30964b65538J20142p8665Q6673A45943h9759I4516D107
12492a6227A3532g8392H3823b02745R7391D06631G9235J95596C5369a116k30399
12481b31515J3588A23183a48803o4212k02034a24731m8356m0056B84049c3385
12470C7684O6412M2672a02761a4266j76939Q5327B1637b33602B7930b7060A02506
$$ plain form
12550 143550 239505 76613 -81972 -119368 -82561 152440 110334 -44542 203674 -44994 252942
12538 -217740 229262 -30411 -16962 32687 11316 128635 -36593 182758 11528 40425 177722
12527 177722 -13041 -149687 233717 -207667 248248 137209 17632 -48607 -133884 49966
12516 -42335 -294123 23898 -107364 -142484 57031 -63661 169137 -78938 -340228 -13684 213912
12504 -354503 -56303 -64779 230964 -265538 -145396 -224061 -137388 145943 -89759 94516 4107
12492 -16227 13532 -78392 83823 -202745 -105354 406631 79235 274831 35369 -1116 -231515
12481 -231515 -217927 123183 -148803 -213015 -415049 -124731 -173087 -213143 284049 -33385
12470 37684 104096 146768 -102761 -14266 -191205 -105878 21637 -233602 27930 -27060 102506
12458a69293c5562A68578d2869B60751n5492e588o7611H2227J5889D2244h8075
12446B10535g6218I9184a15104a8440j0106l7564j63864F7188a23197e9755K3829
12435c5926k23224C00504g7372A75039e5972I1360a64771c2525B0251a14789B14032
12423a07801b182n1197A01752D7452c62717e5927H1376N1942B5135J51682h0275
12411b18550C69050d0981q4917l3997A14803J59796l1974I1553a63866j2594e8530
12399B14763a44079E6240a33479A50151h7813k47A04595b7791B68655G3121J12954
12388A86075c42924h3966q660q3114C28341h4077p3187j72531h0875F25829b60431
12376C07521M3523F4791j1199J93851G5809Q526i3381C5905K49434G3580h6305
$$ plain form
12458 -169293 -35562 168578 -42869 260751 205259 -5588 -73199 82227 98116 42244 -88075
12446 210535 -76218 99184 -115104 -18440 -28546 -66110 -229974 67188 -123197 -59755 -35926
12435 -35926 -259150 300504 -77372 175039 -55972 91360 -164771 -32525 20251 -114789 214032
12423 -107801 -2182 -53379 101752 47452 -362717 -55927 81376 133318 25135 176817 -80275
12411 -218550 369050 -40981 -125898 -159895 114803 274599 242625 91553 -163866 -176460 -58530
12399 214763 -144079 56240 -133479 150151 -87813 -88060 104595 -27791 268655 73121 186075
12388 186075 -342924 -83966 -92626 -175740 328341 -84077 -157264 -329795 -80875 625829 -260431
12376 307521 351044 64791 53592 247443 75809 84335 -93381 35905 285339 73580 -86305
12364A23633M5020L9937g1300A18232k2193L46193B812J22285L54864A74095B8013
12352a41220M2158B11459B112a88792i3501r2246F0249c14171J55396B12986J8640
12341B31626g528l43543I2095b0985E8246g7722j69832h5402D0173c11876a2030
12329I0044J2993a66485g4221A27742J42046d3007n0296H5493b53638I7101b05869
12317B06502E3957C638M0039M24310I9926b43139A25609J25653K13738B05343
12306B37588A03081J37600J64343K55q0100l2227h2928B67810G59L68920A51040
12294a77716C8339L76899a17529L2399A04852J89299c2809B563K7760e7504A39913
12282b30928A83700C4432N4490c16454B88300A26711O4212J37183D1057L60232
$$ plain form
12364 123633 168653 208590 -71300 118232 96039 442232 2812 125097 479961 174095 28013
12352 -141220 -99062 211459 2112 -188792 -93501 -185747 60249 -314171 -158775 212986 231626
12341 231626 -7528 -351071 92095 -20985 58246 -77722 -247554 -85402 40173 -311876 -12030
12329 90044 103037 -166485 -74221 127742 269788 -43007 -93303 85493 -253638 97101 -205869
12317 206502 53957 3638 43677 467987 99926 -243139 125609 251262 465000 205343
12306 237588 103081 240681 405024 405279 325179 292952 -82928 267810 759 369679 151040
12294 -177716 38339 415238 -117529 -85130 104852 294151 -32809 2563 30323 -57504 139913
12282 -230928 183700 34432 88922 -316454 288300 126711 190923 328106 41057 401289
12272D01289A24859L8574J04200H1669P8555K0822g0185L2177B84273d8850C77359
12260C31522D8036M8409O0380J4307K94170D85K70830B6766J67535n764J34822
12249C23359j42367J18082D7216J34145l7331J50450r4991J56137J70749A70979
12238D9769J2871Q5062g6564H9953L02446j77269F3815N7667n5740M9719c48417
12226E9857Q7636K21873E6784K25001G5601J0594C7996R1637l1693J84777a71033
12214a29049k07765a56062A45356J80292E8085a7117A06618K28635j11073a53578
12203C27258a33392E4152J74331p7368k2489a0727o7382A3473K5837M61J00949
12192A40720a97467B56227n1072p8651k5518k9262j5359c20455g8217C71906N5147
$$ plain form
12272 401289 124859 163433 267633 81669 160224 181046 -70185 -38008 284273 -48850 377359
12260 331522 48036 96445 156825 171132 465302 485 271315 26766 194301 188537 323359
12249 323359 180992 299074 47216 181361 144030 294480 199489 355626 526375 170979
12238 49769 62640 147702 -76564 89953 392399 215130 63815 121482 65742 115461 -348417
12226 59857 147493 369366 56784 281785 75601 86195 37996 129633 97940 282717 -171033
12214 -129049 -336814 -156062 145356 325648 58085 -17117 106618 335253 224180 -153578
12203 327258 -133392 54152 228483 151115 128626 -10727 -78109 13473 39310 39771 140720
12192 140720 -197467 256227 205155 126504 100986 71724 56365 -320455 -78217 371906 427053
12181D27053B10818f8579A48402K34904i3227C19712A50152E7502K38241G1985
12170D4178J32228B1828J79237k6086d273H9280a16828a4390A18658m8707c4055
12158A41235K55184d8787c905A03608K00799a8820A24907L51585j53771A13145
12147D49665J39060c6457B07839k5220K96330d1241A615M33995j28405L1079b15250
12135E49745a21619A45257F6416j1531R9556b16431J8082B8983K00406o5519R783
12124A73653f5747C09607r6741h3000A36525o5912K4663Q2055M1644a7404C5563
12112A35745P3791G9371h3955C87831f03682e069m4325m1016C50693A40863K5030
12101A65893n5299b00830F9148K16129A02211Q4258K18986p7098j19501o2703
$$ plain form
12181 427053 210818 -68579 148402 383306 -93227 319712 150152 57502 295743 71985
12170 44178 176406 21828 201065 174979 -4273 89280 -116828 -14390 118658 69951 -34055
12158 141235 396419 -48787 -3905 103608 304407 -18820 124907 476492 322721 113145
12147 449665 588725 -36457 207839 182619 478949 -41241 1615 435610 307205 338284 -215250
12135 549745 -121619 145257 66416 54885 154441 -216431 -198349 28983 229389 163870 173653
12124 173653 -65747 309607 212866 -83000 136525 70613 95276 177331 218975 -17404 35563
12112 135745 209536 79371 -83955 387831 -603682 -5069 -49394 -90410 350693 140863 165893
12101 165893 110594 -200830 69148 285277 102211 186469 405455 328357 208856 146153
12091A46153L4870C2142a47965E9740J68119d400j33997A43631K27271D7767a8160
12079G0351j8135M8628P178J20746j4617l5351J41085a3448p5563B07472e1671
12067B45799k8240k3818J25893j12565f8715B02850D5074o529M1880J1950a8329
12055A18280J2835E2730J32472j897e4555A33177q482n8800a58300A80619E5779
12043B66442k7041L548H632a74823O4963C0428L70783c91904C2306g1327A31758
12031b6670p2364H4607L35788a30687B0252b9555l6272j6304j80627a0300m714
12020a5014m228A69655l4106N6657C9250J99694I3169r224j6945b50649D02649
12008a54751B63340o5960A4602b1503k364B1843L5019b25938A22228e6114Q792
$$ plain form
12091 146153 181023 32142 -147965 59740 227859 -4400 -138397 143631 370902 47767 -18160
12079 70351 52216 100844 108022 228768 214151 178800 319885 -13448 -89011 207472 -51671
12067 245799 217559 193741 319634 207069 -68715 202850 45074 38545 80425 92375 -18329
12055 118280 131115 52730 185202 183305 -54555 133177 124695 65895 -158300 180619 55779
12043 266442 239401 242949 8632 -174823 -109860 30428 401211 -391904 32306 -71327 131758
12031 -26670 -99034 84607 420395 -130687 20252 -29555 -65827 -82131 -262758 -10300 -15014
12020 -15014 -19242 169655 135549 192206 39250 238944 93169 83945 67000 -250649 402649
12008 -154751 263340 197380 14602 -21503 -23867 21843 56862 -225938 122228 -56114 -47322
11997d7322A4105g4579A57634m0401P6915K33233j82887G833P5333A0183b37114
11985h5071c0017B15884B2449O2408a31710p6934L991B46491E6594h8705c9952
11973e2261A03505A7320J40714O1340o5477a63914B48983G7625b15274A24443
11962a59571A17682a80207A26527c6353l017C2526Q9350J60543a84664A4820K6089
11951D0909A4706R0736L52281a24448H7286A3971K45627G7794c0415A74319c61232
11939C5814M6944A2471c7838J7755A84865k6905a37859C253L3797a53707j4615
11928a68322K7651j59264f5112I6202k6515J9979L65852A29190b69848n8529A250
11916b25899G5482J23096q1338m6861J51069p9555i1829j78343A29425c97248
$$ plain form
11997 -47322 14105 -74579 157634 117233 194148 427381 244494 7833 83166 10183 -237114
11985 -85071 -30017 215884 22449 84857 -131710 -208644 -204653 246491 56594 -88705 -39952
11973 -52261 103505 17320 158034 219374 153897 -163914 248983 77625 -215274 124443
11962 -159571 117682 -180207 126527 -36353 -39370 32526 121876 282419 -184664 14820 40909
11951 40909 14706 105442 457723 -124448 87286 13971 259598 77794 -30415 174319 -361232
11939 35814 82758 12471 -37838 -20083 184865 157960 -137859 3253 37050 -153707 -168322
11928 -168322 -140671 -299935 -65112 96202 69687 89666 455518 129190 -269848 -328377 1250
11916 -225899 75482 198578 117240 70379 221448 141893 -91829 -270172 129425 -397248
11905B15007A6982c7351n9099j9914j59283D5804i1485A42364o9187L5620b12370
11893A00834i3549A7262Q7233a63633O1966c592n47A90886K0962a9265A17819
11881A45043F4093L24497e7495D8026L31099b13368E5416a68122C8237O7727B4479
11869a24746c8527A6982b60401J1347c2662M257G1193R5550c40132j34068B32270
11857a05209l7040j8054j91391D2943K868K69489F461g5323A61103g8234F8023
11845E9701g3916B35119b7879B8017g3605A69161a81771N6411e192I1188R155
11834A00343J19609A08361R0059A3068a58479A23198L39556a11548k73344m1255
11824d26147i4732A930J98147a22213b9733j23995g3754J8154j42943A86938a30672
$$ plain form
11905 215007 16982 -37351 -96450 -116364 -275647 45804 -91485 142364 73177 108797 -212370
11893 100834 -93549 17262 104495 -163633 -101667 -3592 -4139 190886 211848 -19265 117819
11881 145043 64093 388590 -57495 48026 379125 -213368 55416 -168122 38237 105964 24479
11869 -124746 -38527 16982 -260401 -249054 -32662 -28405 71193 166743 -340132 -474200 232270
11857 -105209 -142249 -160303 -351694 42943 45811 315300 6461 -75323 161103 -78234 68023
11845 59701 -73916 235119 -27879 28017 -73605 169161 -181771 -125360 -5192 91188 100343
11834 100343 219952 108361 198420 13068 -158479 123198 462754 -111548 -384892 -426147
11824 -426147 -94732 1930 200077 -122213 -29733 -153728 -73754 -55600 -198543 186938 -130672
11812H0374O557N153c83683A81396H6225J62759a95855q2119C9501a78388f4327
11800d33317J75636f6430a0001G4610L3411h2157c100p8382n1668j55077A08902
11788f6572K3343A29907F2035a72632M2499n6821l1014C00181I90h8227A48735
11776b09350Q1579j76805G4293K12811b39082K5936h5339H0486b96138J04160
11766a91978A33418b55886B96438d6988b1778A45458a78643I184b12237g3818
11755c13024A70510m6002b09372A7392n654d1604j7865j27272f6742E3713K40845
11744B94558d8144B492a48774G7408A9123J565a87162B0979b46157L5343l2858
11733b43672a7622E8948c7461C19124a97108F467R046d4878k28298i8866D4347
$$ plain form
11812 80374 86931 92084 -383683 181396 86225 248984 -195855 -277974 39501 -178388 -64327
11800 -433317 -257681 -66430 -10001 74610 108021 -82157 -3100 -81482 -133150 -288227 108902
11788 -66572 -43229 129907 62035 -172632 -130133 -186954 -217968 300181 990 -88227 148735
11776 -209350 -127771 -304576 74293 287104 -239082 -213146 -85339 80486 -296138 -191978
11766 -191978 133418 -255886 296438 -46988 -21778 145458 -178643 9184 -212237 -73818
11755 -313024 170510 124508 -209372 17392 11738 -41604 -59469 -186741 -66742 53713 294558
11744 294558 -48144 2492 -148774 77408 19123 20688 -187162 20979 -246157 -210814 -243672
11733 -243672 -17622 58948 -37461 319124 -197108 6467 15513 -44878 -273176 -98866 44347
11721a61777I6870f531m2330B8218b46266A6313N22930a6463r5006B07704e6879
11709c7602E0708c54173F3189J19082L28830a53530A48136C5048c97867E5033
11698b73822b1652B44895K03364k08267I1609j5349g243I7157D283d6388C74295
11686A04581D9931c12707A17760M0579n6291b91050A1590a16142B83298I8317
11675A75510c0924A43399F2217f20G9595J64237B0975J25208a44456c260B16561
11663B39928J6649E8696B1032a76390B87069D2776d3786q5514A54394d1553A28937
11651A7513c89899h5051A04066l5588O0903F2019K5343a47660M8772n5050k00894
11640c54832g468k23872B66156c35347B6704g7045j7630K9251B61962q5371F1675
$$ plain form
11721 -161777 96870 -6531 -48861 28218 -246266 16313 539243 -16463 -111469 207704 -56879
11709 -37602 50708 -354173 63189 182271 511101 -153530 148136 35048 -397867 55033
11698 -273822 -21652 244895 448259 239992 91609 76260 -7243 97157 4283 -46388 374295
11686 104581 49931 -312707 117760 158339 102048 -291050 11590 -116142 283298 98317
11675 175510 -30924 143399 62217 -620 79595 243832 20975 146183 -144456 -3260 216561
11663 239928 256577 58696 21032 -176390 287069 42776 -43786 -129300 154394 -41553 128937
11651 17513 -389899 -85051 104066 68478 129381 62019 87362 -147660 -98888 -153938 -354832
11640 -354832 -7468 -231340 266156 -335347 26704 -77045 -94675 -65424 261962 176591 61675
11628b48651A13634a9033j19403e9632k04813h8269D4585a02485E3247e748B54077
11616e9155f881A15751e2818j54753i6480o0323A13072a07677A33423a74849A00513
11604c23535E183L5639K25579n4857I9594b50200i3672A33858g3143B5566n74
11593B4992a76967A9783N0824L8433g9374C52064a79210g4887K1529j69387A09983
11581B90351G956J14396a5630B84016a00508B06647a0841B74217a52533o723A30280
11569b19519C90338a92382A59702M4828K02137j85437J6607c321A47278m7524
11559I9754J34048G4186K24036b2346q8040j5828L3554A88622B1110J82992N1787
11548B55889j00970d7788a0238C58402a84290B60982M0635A5478N3451k9081M8284
$$ plain form
11628 -248651 113634 -19033 -138436 -59632 -264445 -88269 44585 -102485 53247 -5748 254077
11616 -59155 -6881 115751 -52818 -207571 -96480 -156803 113072 -107677 133423 -174849 100513
11604 -323535 5183 40822 266401 211544 99594 -250200 -93672 133858 -73143 25566 24992
11593 24992 -176967 19783 70607 109040 -79374 352064 -179210 -74887 -53358 -222745 109983
11581 290351 7956 122352 -15630 284016 -100508 206647 -10841 274217 -152533 -159256 130280
11569 -219519 390338 -192382 159702 204530 406667 221230 237837 -3321 147278 99754
11559 99754 233802 74186 298222 -22346 -110386 -126214 -92660 188622 21110 204102 255889
11548 255889 154919 -47788 -10238 358402 -184290 260982 301617 15478 68929 39848 88132
11537H8132P644d5769B76633C0914M3286G157a60160H081h3181A00415J19661
11526B20076a38678H9709j8759K42433i0111E07391A94377b5381F3902Q6314l2506
11515A17710J24800P8329h0711C21395o8107J38593A45254K9878p0915f3198o4958
11504a28156q8073D4671M3578b10806C6361b91619M5076A21314a57196B57339
11493B29056A8854N9917a03261D37529A42365E2088a47075g1314A0399J32784
11483A43183A4652J34699a26123j22075A93999j4156l3106o0883b67605N6142
11473b11463h136A74574K3626D6356a00799L7787C75509F2710a13369A93281a68853
11461A3095l021J23641f7420D71J37285K17368A26120a0915A42974J82111r0968
$$ plain form
11537 88132 95776 -45769 276633 30914 74200 7157 -160160 8081 -83181 100415 220076
11526 220076 -138678 89709 70950 313383 -90111 507391 194377 -25381 63902 150216 117710
11515 117710 242510 320839 -80711 321395 253288 391881 145254 175132 104217 -63198 -128156
11504 -128156 -216229 44671 88249 -210806 36361 -291619 -246543 121314 -157196 257339
11493 229056 18854 78771 -103261 437529 142365 52088 -147075 -71314 10399 143183
11483 143183 14652 149351 -126123 -248198 193999 179843 146737 85854 -267605 -211463
11473 -211463 -8136 174574 198200 46356 -100799 -63012 375509 62710 -113369 193281 -168853
11461 13095 10074 133715 -67420 471 137756 355124 126120 -10915 142974 325085 234117
11450B34117K20220D2688M21281F1307P7320N445h53A1430J11187B5510K39247
11439B64757n5489a8892A24888j8592h0869B52370i9988A31518a7476l33859A11725
11427G6562a46542G9211a48627A16512e1901A6572b8012H8386B569a09286o0808
11416a70094C0933c60658B86986f186j31841b4972q4922j10482e3392l5684j15558
11405b04634a9853m6222r7996G5468K0869J21305m2585k8232j1627G683h7733
11393H0622a3784l5976D7147K36305D5041b13591C3959b0071E9232M9220n1683
11382E6769J65334p3104a94116C03143b0464j70721o8574j11074b9386n4637C136
11370e7538D2809J50620J9616f466D9150a09928K4557J6842r2601g6882C47321
$$ plain form
11450 234117 454337 42688 463969 61307 138627 144072 -853 11430 122617 25510 264757
11439 264757 209268 -18892 124888 106296 -80869 252370 -99988 131518 -17476 -351335 111725
11427 76562 -146542 79211 -148627 116512 -51901 16572 -28012 88386 2569 -109286 -170094
11416 -170094 30933 -360658 286986 -6186 -138027 -24972 -109894 -220376 -53392 -89076 -204634
11405 -204634 -19853 -66075 -164071 75468 96337 217642 175057 146825 135198 7683 -87733
11393 80622 -13784 -49760 47147 283452 45041 -213591 33959 -20071 59232 108452 56769
11382 56769 222103 148999 -194116 303143 -20464 -191185 -259759 -370833 -29386 -84023 3136
11370 -57538 42809 193429 213045 -6466 49150 -109928 -85371 -68529 -161130 -76882 347321
11358f8781E2527J38323i5195C4012A4279Q6710f9936j16346o9054M6736A39209
11346a45734j29543a10949J5234E9091K24694r2759a33553F2233J03295g7322
11335A24092b60828b8555k64965H637K48933a58356E3180P5641a69224e7793b472
11323b49297F9505d9031A98017e6000r2380j3069D8856K35977G1028f6964l26647
11312c93611a83412d4357A75628i2783A37733J25045a44299a2583j12295A2359
11301b6153F2590e3746I1610J54835c841k13561J03850A85825o2064h6752o6883
11290a53635M691b8851k5906A30879c06036i2452n0259A04751j2856J75014g0287
11278b38547m0447a13243r6384j10647j55417c7100o084p3538c2884l4475r9111
$$ plain form
11358 -68781 52527 190850 -95195 34012 14279 100989 -69936 -186282 -255336 -208600 139209
11346 -145734 -275277 -110949 -95715 59091 283785 191026 -133553 62233 165528 -77322
11335 124092 -260828 -28555 -293520 8637 257570 -158356 53180 128821 -169224 -57793 -2472
11323 -249297 69505 -49031 198017 -56000 -148380 -161449 48856 284833 71028 -66964 -393611
11312 -393611 -183412 -44357 175628 -92783 137733 262778 -144299 -12583 -124878 12359
11301 -26153 62590 -53746 91610 246445 -3841 -217402 -113552 185825 123761 -86752 -153635
11290 -153635 -148944 -28851 -54757 130879 -306036 -92452 -142711 104751 91895 266909 -70287
11278 -238547 -278994 -113243 -209627 -320274 -475691 -37100 -43184 -116722 -32884 -67359 -166470
11267a66470D1040L4705e3815m9426A96086c9169j92417A32247n7468i942p9638
11256h9580j88397g5237j22746A79275n9175f4369B4538a96166g3757K8090A32906
11244c24928I4930g3856I154K27125K0357j12463C5858b03196j7201D0334b88754
11232a31542B8408g7155A19227h017a444j50469L1860j38518J03580D6939L2603
11221G9542J44785b29453a10097I3413Q0090D3107J19505E1027b51436R6926o98
11210a55208d382A92160F5932a86386a4663m18044a4599B76574b54249e6609j10995
11199a67604B32303b03190p7500i7653c4439E8830J21076c42246J26045a2197
11188b05555c5361k32969B04551c1299k14978R0085G6964a55312E9078b16694
$$ plain form
11267 -166470 41040 75745 -53815 -103241 196086 -39169 -231586 132247 74779 -9942 -89580
11256 -89580 -277977 -75237 -197983 179275 120100 -64369 24538 -196166 -73757 -45667 132906
11244 -324928 94930 -73856 9154 236279 256636 144173 35858 -203196 -220397 40334 -288754
11232 -131542 28408 -77155 119227 -8017 -1444 -151913 -120053 -258571 -154991 46939 79542
11221 79542 224327 -229453 -110097 93413 173503 43107 162612 51027 -251436 -154510 -155208
11210 -155208 -4382 192160 65932 -186386 -14663 -432707 -14599 276574 -254249 -56609 -167604
11199 -167604 232303 -203190 -280690 -97653 -34439 58830 179906 -342246 -216201 -12197
11188 -205555 -35361 -268330 204551 -31299 -246277 -156192 76964 -155312 59078 -216694
11177A63528c23158A24556A4232b71754Q3438b3177j90253A27692e6388C3587
11166D6538J61949e91213a66675j25640B93061b47904B80675A17783e2634j4218
11156f6852j39799Q8882j99822I0748K24474d7592o6805C1960K7028J03127h7385
11144D0647d0892j61545P2299B27354g618r7633B4656d8679A7426M9228k0221
11133D6433a29153L3147l4507A14298a04509B42328h3921l05802C4880J07836
11123A42716a12528C4730h0286A76656b67020a19541K2800n4798n685I1084d3783
11111A9768f4212I2493a20307M6197I3729M2202h274j100k46462B20285M3634
11100B63919a23240B19694C2078K3032b80655A269M54525j20061j27841p4149
$$ plain form
11177 163528 -323158 124556 14232 -271754 -188316 -23177 -213430 127692 -56388 33587
11166 46538 208487 -591213 -166675 -292315 293061 -247904 280675 117783 -52634 -66852
11156 -66852 -206651 -117769 -317591 90748 315222 -47592 -114397 31960 58988 162115 -87385
11144 40647 -40892 -202437 -130138 227354 -7618 -105251 24656 -48679 17426 66654 46433
11133 46433 -129153 -96006 -130513 114298 -104509 242328 -83921 -389723 34880 142716
11123 142716 -112528 34730 -80286 176656 -267020 -119541 -96741 -151539 -157224 91084 -43783
11111 19768 -64212 92493 -120307 -74110 93729 135931 -8274 -9374 -255836 220285 263919
11100 263919 -123240 219694 32078 55110 -280655 1269 455794 335733 207892 133743
11090A33743b03035B23371B2961J09589p93a29558I3047j2670R7091a44695A50239
11078C8653j2404J48675a50177D06450g3896B56217i6232B09628a15568B54807
11067C48506Q9456D5763J75492g3894B19948R4200P896L657A39944J03335I1907
11055D24777j3772j84899K10651j52682K9002J66000j05477J76325k68214L6014
11045C17725A17183K02322G4801K71487K20401j90033M9399L26798j41163j5484
11035E96206j10167J46209j22040j59089K50083p3954p2097L4158l3131L45962
11025H02140j79756J87702k96464J67403L61370D89873r9460J19591n3452L38107
11015G94659j91176m2279J01193q7120Q2366k63802O6185k24626P92182k48632
$$ plain form
11090 133743 -203035 223371 22961 132550 131757 -129558 93047 80377 177468 -144695 150239
11078 38653 26249 174924 -150177 406450 -73896 256217 -96232 209628 -115568 254807
11067 348506 437962 45763 221255 -73894 219948 314148 322044 325701 139944 243279 91907
11055 424777 411005 226106 436757 284075 313077 479077 373600 549925 281711 317725
11045 317725 117183 319505 74801 346288 566689 376656 426055 752853 611690 596206
11035 596206 486039 632248 510208 351119 601202 527248 455151 489309 456178 802140
11025 802140 622384 810086 513622 681025 1042395 489873 390413 510004 456552 794659
11015 794659 603483 561204 662397 575277 657643 393841 460026 235400 1027582 778950
11005G78950r5714j50556J37941J09924I2655M99226K06656l59572J09411K176
10995E50552k50608O5910j03477L90157j57037L02400C74479R7339B25356J07980
10985C33336L38683k2975n1506P0707B36666P8070L68935j75824K27153j73185
10975E61815m6857l8426l528J83191k01406J46222k66914O56534J92453k95256
10965H87828j47225K35025N0803k64253M75322k44839J98907J03479o1397k6924
10955A206726M37451K80922J62635k12837O2136K37264k90060K25087j11351l67951
10945A630022k82857J97865m9718O1690Q9845M429J71807n76445L46939R2730
10935A686307m8916k64506k65099M0266q6696l81080J42776k55374j17999j7019
$$ plain form
11005 778950 683236 532680 670621 780545 92655 591881 798537 438965 548376 550552
10995 550552 299944 365854 262377 652534 495497 797897 374479 471818 225356 333336
10985 333336 672019 649044 597538 668245 236666 314736 683671 507847 735000 561815
10975 561815 514958 476532 473004 656195 454789 601011 334097 990631 1183084 887828
10965 887828 740603 975628 1026431 762178 1237500 992661 1191568 1295047 1233650 1206726
10955 1206726 1644177 1925099 2087734 1874897 1937033 2174297 1884237 2109324 1997973 1630022
10945 1630022 1347165 1545030 1495312 1557002 1646847 1651276 1823083 1246638 1593577 1686307
10935 1686307 1637391 1372885 1107786 1148052 1061356 680276 823052 567678 449679 432660
10925D32660K8112f5459F13011B73963l1739j16341B0774a8721C49217D2889J03942
10914A46831F2528k2215q058J196R8360a24083g529A86054E0657J09581n8066
10903A02172a08403k00264A90456b96142a40766l43193D101e99608C6613J00912
10893A37525b47249B38312A16249a13520j84836A02913f1270H4401b03890C0592
10882b69913g8734j9853n1558H9337J21625a99361R7011B03456G8316K89700e495
10870C4794a19003K2885r5350c6787j34673f5949j23845B1039b43223j09637B7771
10858B79702c54249a32241A08672K62490H5453c7084F5037a62645j74498O5542
10848b71601a5480A7922d1860p453j65868G909M265K00762E8299N3932J18534
$$ plain form
10925 432660 460772 -65459 613011 273963 242224 125883 20774 -18721 349217 42889 146831
10914 146831 62528 40313 32255 33451 131811 -124083 -7529 186054 50657 160238 102172
10903 102172 -108403 -308667 190456 -296142 -140766 -483959 4101 -599608 36613 137525
10893 137525 -247249 238312 116249 -113520 -298356 102913 -61270 84401 -203890 30592
10882 -269913 -78734 -98587 -150145 89337 210962 -199361 -102350 203456 78316 368016 -5495
10870 34794 -119003 -96118 -191468 -36787 -171460 -65949 -189794 21039 -243223 -352860 27771
10858 279702 -354249 -132241 108672 371162 85453 -37084 65037 -162645 -337143 -271601
10848 -271601 -15480 17922 -41860 -49313 -215181 7909 12174 212936 58299 112231 230765
10837B30765C685d0978A18893i0976B3440c5789G5613N8706a66113j73216A52623
10825A68400J01156b60624b9922k16301a05816k4082B40220o3586D7018J0116
10815E7134c32029l068H4548e3908J9886k67589D2052c3159k80205a34322j43129
10804b77451a2772j14216e4717f572I9842P5478p2903b23276D1755c22596A15731
10792a53456l36016b03613D33434a54325A32274C2844R0060J09097b52239J06522
10782a45717G1662J31503G0360a86059m2120h0929B68539a95377k6262A8694E328
10770c6887k08359J09758l10912d9144n1173L1533j68094A5376N6102c3108q1263
10759a14371b1106l3850k6648A56078B4796Q1628E0893A6769c2095e732j98637
$$ plain form
10837 230765 3685 -40978 118893 -90976 23440 -35789 75613 134319 -166113 -339329 152623
10825 168400 269556 -260624 -29922 -246223 -105816 -129898 240220 176634 47018 57134
10815 57134 -332029 -335097 84548 -53908 -34022 -301611 42052 -33159 -313364 -134322 -277451
10804 -277451 -12772 -126988 -54717 -6572 99842 175320 102417 -223276 41755 -322596 115731
10792 -153456 -489472 -203613 433434 -154325 132274 32844 122904 232001 -252239 -145717
10782 -145717 71662 203165 70360 -186059 -228179 -80929 268539 -195377 -221639 18694 5328
10770 -36887 -245246 -135488 -446400 -49144 -100317 -68784 -236878 15376 71478 -33108 -114371
10759 -114371 -21106 -54956 -81604 156078 24796 106424 50893 16769 -32095 -5732 -204369
10748b04369B42241j20355b8681H8508a53619N4552j01087A31009E5040b92814
10737a39517j55713B18235G6505B6336b92727R8726B8074c27491d0791a5632A37620
10725b90885g6446j07416F163b75739l5310H1536B2282b24208O7191A95221q6801
10714A08420a92872B8866J57768L4892E2019A915O6635J7769J96597A16758n6953
10703E9805J3636B1435a23440B9483c2144R439k61003O7747J05861Q687j6650
10692a18063K6144E9004c14382a07317j8055k65635J40550J14886A17223b37307
10681a730m8039A82288c18014D53173m4238b20288g3596p5744j58125A05336h0505
10669A8441b96360A70834K35882f8865j80598B0630a19714M3995l11749C665J44842
$$ plain form
10748 -204369 242241 121886 -28681 88508 -153619 -99067 -200154 131009 55040 -292814
10737 -139517 -295230 218235 76505 26336 -292727 -194001 28074 -327491 -40791 -15632 137620
10725 -290885 -76446 -183862 6163 -275739 -311049 81536 22282 -224208 -157017 195221 108420
10714 108420 -192872 28866 186634 221526 52019 1915 68550 86319 282916 116758 59805
10703 59805 73441 21435 -123440 29483 -32144 -22705 -283708 -215961 -110100 -101413 -118063
10692 -118063 -91919 59004 -314382 -107317 -125372 -391007 -250457 -135571 117223 -237307
10681 -1730 -49769 182288 -318014 453173 408935 -220288 -73596 -149340 -307465 105336 -80505
10669 18441 -296360 170834 406716 -68865 -249463 20630 -119714 -75719 -387468 3665 148507
10658A48507b71513g2228K7854j41003L3334q5289g6085A15285a92674I1135R4525
10647A85660d13253a04440o2342j84693J11152B05571b00072D46498c2697k9632
10637f2329C7032b8449l2209C5391I810g5134m8449A94319N7864c14366g9800
10625f1823q1092N6609J5966q1382O1366A03698b233D5174c57263G6068M4291
10614A20359b7035A61776E0506a04404C30581c8724A1570b31299d292p8432B04341
10602b819j19290l34564b8355A64438B8073a01046A15540a5391j38988G2518b19719
10590A26932e821l14239L6265A90326A7213b18307J02233N0363E5273b15724k24325
10579d40049G2109a13021j02461A6439a97918A01274b45345J452c9360m21609
$$ plain form
10658 148507 -271513 -72228 -44374 -185377 -152043 -237332 -76085 115285 -192674 91135 185660
10647 185660 -413253 -104440 -166782 -351475 -240323 205571 -200072 446498 -32697 -62329
10637 -62329 37032 -28449 -60658 35391 9810 -75134 -123583 194319 252183 -314366 -79800
10625 -61823 -142915 -86306 -70340 -151722 -90356 103698 -2233 45174 -357263 76068 120359
10614 120359 -27035 161776 50506 -104404 330581 -38724 11570 -231299 -4292 -82724 204341
10602 -2819 -122109 -456673 -28355 164438 28073 -101046 115540 -15391 -154379 72518 -219719
10590 126932 -5821 -320060 -283795 190326 17213 -218307 -116074 -65711 55273 -215724 -440049
10579 -440049 72109 -113021 -215482 16439 -197918 101274 -245345 -243893 -39360 -460969
10569d60969a57745J0362B7296J19719c0470n289D4378c5815h103q7188j22110
10558b17401j1845E1678c86444a40164J8356b0082B21758b47180j04385c7459
10547A27303O8980h9380j33069c0319o0589e994l22569E4541g9053a9797j15425
10536a35222B36201F2687B1346a42384A19566D9377f685l0830E3771J6345a73058
10524F7304c4850A59041D3032d24779A27309b31792N2427K4968I2824e1080k32444
10513b83524A87463g9532E3556J91156f9505j24480f8655B12938E0981R650J2204
10502G2835c25687b5177j3925G5719d7035a6912j77686i0975K8421j24855A62149
10490b09191Q234h4471A39427m5568O6637i0299k22186A46929d21259C6147b31905
$$ plain form
10569 -460969 -157745 -147383 27296 147015 -30470 -35759 44378 -35815 -8103 -95291 -217401
10558 -217401 -229246 51678 -386444 -140164 -121808 -20082 221758 -247180 -351565 -37459
10547 127303 196283 -89380 -222449 -30319 -90908 -5994 -328563 54541 -79053 -19797 -135222
10536 -135222 236201 62687 21346 -142384 119566 49377 -6685 -37515 53771 70116 -173058
10524 67304 -34850 159041 43032 -424779 127309 -231792 -179365 -154397 92824 -51080 -283524
10513 -283524 187463 -79532 53556 244712 -69505 -193985 -68655 212938 50981 60631 72835
10502 72835 -325687 -25177 -39102 75719 -47035 -16912 -194598 -90975 -62554 -187409 162149
10490 -209191 -200957 -84471 139427 93859 160496 -90299 -312485 146929 -421259 36147 -231905
10478a23366D4282J45712a11708e4896A70025a00506b5101k18027e794k02417
10468b08211I519J16362C6759j1267J12003a64624k1203D36728J39543j13867
10458D62404j18272q3534N7326p3530j20043C0614J17533L9864e7715p1331b0557
10446a51006k55856d6557l3196J4930K4327j26042M2471b3786B24771p5730m2107
10435A06934a30889b1661k11394B7070b3563k14700d5494k0519D0973f1813H0590
10423b53984C1584e61616G7094J18535b8167H346J45564b86580E1292J26599e13360
10411c62002a49243e9996B20848a47949M8905j92929J05343Q5228M2272k58290
10401c17420A33981m381c19717N7324A56358f9990h37A53124c5543H0053b31588
$$ plain form
10478 -123366 44282 189994 -111708 -54896 170025 -100506 -25101 -243128 -5794 -208211
10468 -208211 9519 125881 36759 25492 137495 -164624 -185827 436728 576271 462404
10458 462404 344132 260598 317924 244394 124351 30614 148147 188011 -57715 -129046 -20557
10446 -151006 -406862 -46557 -79753 -64823 -40496 -166538 -124067 -23786 224771 149041 106934
10435 106934 -130889 -21661 -233055 27070 -23563 -238263 -45494 -66013 40973 -61813 80590
10423 -253984 31584 -561616 77094 195629 -28167 8346 153910 -286580 51292 177891 -513360
10411 -362002 -149243 -59996 220848 -147949 -99044 -291973 -186630 -101402 -59130 -317420
10401 -317420 133981 129600 -319717 -262393 156358 -69990 -837 153124 -35543 80053 -231588
10389I8568a03353b0086C21044k3463a08537M5068A57304g9502D57531C3774J12400
10378A46174b51387J04893D2964b1559m60687E02308e0417A69486C0859i2554
10367B65942d7776I5174L69852E35M03876c34197A24332B7621K55618b60527G2693
10355B1280K75459r0374K2012A6482K22133K52202J61178A79102J44379K49593
10345E73074B29815G6869J45738J76840f0327D54200H8149b10777e0923A14688
10334C64392j43493a09340C22181k5893l4890J26762A52067J01222M9467R9412
10324D02168l0778J02662j18670Q808j15825B0826J83745J53092A33998M8906
10314A82904o6284B2624b2015B67922a23002F3805j9497J51665M9147g2981B05940
$$ plain form
10389 98568 -103353 -20086 321044 297581 -108537 -63469 157304 -79502 457531 33774 146174
10378 146174 -251387 -146494 42964 -21559 -482246 502308 -50417 169486 30859 -92554
10367 265942 -47776 95174 465026 535 404411 -334197 124332 27621 283239 -260527 72693
10355 21280 296739 206365 228377 16482 238615 490817 651995 179102 323481 573074
10345 573074 229815 76869 222607 399447 -60327 454200 88149 -210777 -50923 114688
10334 364392 220899 -109340 322181 296288 261398 388160 152067 253289 302756 402168
10324 402168 371390 474052 355382 364190 248365 20826 204571 357663 133998 182904
10314 182904 116620 22624 -22015 267922 -123002 63805 44308 195973 245120 -72981 205940
10302B73736A03754K46434a36688C23963A05983J52212h2407C91751j91832b32190
10291B2144F715b27900a05260A94346o9328J14988C7214A1926K08203a09859l16658
10280d26517B68817d6598A98610F4175j1207a17507D4627R918L2052i5307A25589
10268g1460j44603a3026j1163G9110K2578J39617o8976b22242M9864J743B2590
10256A88729a76153B8946a37324c7774A39176a8264K71k97400A27166b38674A88466
10244b87608c2703h880m11863R4678B51133G507K65890q8385m9861r308C0153
10232C35037m4124E9305L4077k3642A6427a18084A96065b88634b7555k32489j81830
10221d41874A1228M9227b07601C1585A0629a47758c0632k07656k2525G4456b6747
$$ plain form
10302 273736 103754 350188 -136688 323963 105983 258195 -82407 391751 199919 -232190
10291 22144 6715 -227900 -105260 194346 125018 240006 37214 11926 220129 -109859 -426517
10280 -426517 268817 -46598 198610 64175 52968 -117507 44627 54545 86597 -95307 125589
10268 -71460 -216063 -13026 -24189 79110 101688 241305 172329 -222242 -172378 -170635 22590
10256 188729 -176153 28946 -137324 -37774 139176 -18264 -17993 -315393 127166 -238674 188466
10244 -287608 -32703 -8880 -420743 -326065 251133 7507 273397 185012 135151 125843 30153
10232 335037 290913 59305 93382 69740 16427 -118084 196065 -288634 -27555 -260044 -441874
10221 -441874 11228 60455 -207601 31585 10629 -147758 -30632 -238288 -260813 74456 -26747
10209a07655k4718k838O1334b1644A07475R0689c92773a90663A02881D3954a95989
10197c7757l23610A65906e9536j42515N3432B25424q226I5489j37M535a57119
10185a9878A79451b49164a6978l16885a20087P765J7676j68402i4333F5515K5284
10174I0799c23080a54556A29264g2630o6001k1620k93338B30049e8661k32935
10164b91596A02607a4894j89800B2514b74500K2688J595K7250B89525F1165a62346
10152b57187j89269g6201I6672f5278L816k11601B56986a83475n4668k8017d710
10140a65835j02106A22310b86154a9921r154j68222D5799d5755G4212c4901k1013
10129e5914A32721P158c44986B6434b08434q5661k9540A12177a43417B311K5053
$$ plain form
10209 -107655 -132373 -135211 -73877 -21644 107475 198164 -392773 -190663 102881 43954 -195989
10197 -37757 -361367 165906 -59536 -202051 -148619 225424 217198 95489 95352 99887 -157119
10185 -19878 179451 -249164 -16978 -333863 -120087 -112322 -94646 -263048 -94333 65515 90799
10174 90799 -323080 -154556 129264 -72630 -138631 -160251 -453589 230049 -58661 -291596
10164 -291596 102607 -14894 -204694 22514 -274500 -251812 -250217 -222967 289525 61165 -162346
10152 -257187 -446456 -76201 96672 -65278 -61462 -273063 256986 -183475 -238143 -266160 -4710
10140 -165835 -267941 122310 -286154 -19921 -29075 -197297 45799 -45755 74212 -34901 -55914
10129 -55914 132721 139879 -344986 26434 -208434 -294095 -323635 112177 -143417 2311 27364
10118B7364c25717A1446a98302Q8159E388a5882k88677H913J27825l4148b29991
10106I9362e1269a1299j85998G0152f0901A63605a3711j4051j83770i6689R389
10095h7300K5112j4617j9130i922m7577j49657A36816f7682q8280j05811A01802
10083a58845D8372A3415a34350N1678j77632B417J06543L512a8321E1542i6083
10071A7466e1397B24648p7725h4629l67008A66007d3365A5888K05216J5551A12086
10059b4481r5470k36459J04436e3402j35213D5354a68807K167m2668L7220K8789
10048a43299B0867a2033e102A5255a90434G1316a13863A10774k63A6707N663J6582
10036C8952a40099A93203a50160j1994F4646a16893p0565A88034b37915A61492
$$ plain form
10118 27364 -325717 11446 -198302 -110143 5388 -15882 -304559 8913 136738 102590 -229991
10106 99362 -51269 -11299 -197297 70152 -60901 163605 -13711 -27762 -211532 -96689 -87300
10095 -87300 -62188 -76805 -95935 -9922 -57499 -207156 136816 -67682 -155962 -261773 101802
10083 -158845 48372 13415 -134350 -82672 -260304 2417 108960 112472 -18321 51542 -96083
10071 17466 -51397 224648 146923 -84629 -451637 166007 -43365 15888 221104 236655 112086
10059 -24481 -119951 -356410 -251974 -53402 -188615 45354 -168807 -166640 -209308 -172088 -143299
10048 -143299 20867 -12033 -5102 15255 -190434 71316 -113863 110774 110511 16707 22370 38952
10036 38952 -140099 193203 -150160 -162154 64646 -116893 -187458 188034 -237915 161492
10025a03989F4566A9693b21003A20328E9044c4745l2709A57769C9211e7803a0004
10013b22033C2867J75011c26035a31984j70761J13816A26985c77512J13351C5687
10002g9624l94393B4099M648b38455e7136K40A2626a38152M0634L1537m9637e6287
9989d9338B2525d80260K34146J6211g3556r1496K957k34682a86457R0438c6634
9977b50139K3953g5542j59126D1158g3585j15935p4064Q5194C9103a50161B698
9965d51770D5486a51729I5724a43975F4720k9415j2626b37270E5872J96220a80356
9953b60054a10518b6665D25787a79710C76227A01665b89250G0587a22006C691
9942d74065H0480J84229a32706e2855l3206j03999M4951B38473b64487p3264B19164
$$ plain form
10025 -103989 64566 19693 -221003 120328 59044 -34745 -67454 157769 39211 -57803 -10004
10013 -222033 32867 207878 -326035 -131984 -302745 -188929 126985 -377512 -264161 35687
10002 -79624 -474017 24099 28747 -238455 -57136 -56896 12626 -138152 -97518 -65981 -115618 -56287
9989 -49338 22525 -480260 -246114 -229903 -73556 -165052 -162095 -396777 -186457 -96019 -36634
9977 -250139 -226186 -75542 -234668 41158 -73585 -189520 -263584 -178390 39103 -150161 2698
9965 -451770 45486 -151729 95724 -143975 64720 35305 22679 -237270 55872 252092 -180356
9953 -260054 -110518 -26665 425787 -179710 376227 101665 -289250 70587 -122006 3691
9942 -474065 80480 264709 -132706 -52855 -86061 -190060 -145109 238473 -264487 -337751 219164
9930C2586c31836h6234r0494j48842A8712a34462j4218m21904f3049B85210R0713
9919C75923G5116J04376D3672a40299j26489A87727A0833c0832k46198I5624H488
9907b93937P3970C6946L6499K344b48118a01746L4106B38549g7147K1163C14400
9895c22307G5997O9991a03000j17800A38169D2942a9152q8582a8672n5430l841
9884g7943B9439a7660E3684b8598A78815q0116a71906a7151n7233j22163j10677
9873c07224Q5836C10930d65903A63451a71991f7479j52930k83605F2788b8566
9862i1141A33515h0598q3397k02998a68412j63342G2080c33433g7297j75166D9350
9850c03067L8578c7913k96904K4237d7373k6327l08144J75240H2801b16693I8624
$$ plain form
9930 32586 -331836 -86234 -176728 -325570 18712 -134462 -148680 -570584 -63049 285210 375923
9919 375923 75116 179492 43672 -140299 -266788 187727 10833 -30832 -277030 95624 8488
9907 -293937 -219967 36946 73445 75789 -248118 -101746 -67640 238549 -77147 -55984 314400
9895 -322307 75997 145988 -103000 -220800 138169 42942 -19152 -107734 -18672 -74102 -77943
9884 -77943 29439 -17660 53684 -28598 178815 98699 -171906 -17151 -74384 -196547 -307224
9873 -307224 -221388 310930 -465903 163451 -171991 -67479 -220409 -504014 62788 -28566
9862 -91141 133515 -80598 -163995 -366993 -168412 -331754 72080 -333433 -77297 -252463 49350
9850 -303067 -264489 -37913 -334817 -310580 -47373 -73700 -381844 -206604 82801 -216693 98624
9838B9451Q3158J12411b18611h8750k5185F1532e6136C16493f79j34571A95232
9826A32684B5636Q0900d6858p9523A82616a77324G4916b6639o9774A8729b96101
9814C872a21044A64697h703I4109a12349k0839A84151G8787e74439I2986K3735
9803A16721j4942O7002i8014E3732b8718k63436c535j58859A20195c2595I6293
9791a02488j6197N7279k65388G4565l1805J21043c24251g194k8060j00120A81762
9779G272P9315b39987f432j6630k34575A58251C3335b13496e9305j00412A19956
9767A37796a19716M3861K3239B02478a93165R020c469q8436k89224K6513a44067
9755e3599A52300F5895b87071C2561d53820a02549n2251E3313a47934r6024h3179
$$ plain form
9838 29451 112609 225020 -218611 -88750 -113935 61532 -56136 316493 -679 -135250 195232
9826 132684 25636 106536 -46858 -126381 182616 -177324 74916 -26639 -96413 18729 -296101
9814 3872 -121044 164697 -8703 94109 -112349 -133188 184151 78787 -574439 92986 116721
9803 116721 101779 168781 -98014 53732 -28718 -292154 -3535 -162394 120195 -32595 96293
9791 -102488 -118685 -61406 -326794 74565 42760 163803 -324251 -7194 -35254 -135374 181762
9779 7272 86587 -239987 -6432 -23062 -257637 158251 33335 -213496 -59305 -159717 119956
9767 137796 -119716 -75855 -52616 202478 -193165 -184145 -3469 -91905 -381129 -354616 -144067
9755 -53599 152300 65895 -287071 32561 -453820 -102549 -154800 53313 -147934 -243958 -83179
9743b62522n8707c7082n9036k64103j31506A97876h2247p2495M3043L150F0562
9731c19541M2784J22833f6067G4600a7697n6189l47662f3652m7725A29858c7518
9719a11248D5226c37023g5675B7286b03459c4855k57127D00123a21532e4891o943
9708f1834k29332d2087C5228a33802a1899m05481C09812a93649B3563d6463B0944
9696A30544a86669B37386l6445a52267L1170M9257a427A20465a37888A59330d18851
9684e13577a34517j87282B42987a03238l9914m794j23348J15034j52026A01589
9673A70493e2025n5712p2669I9384c611q5346L5799A6523a05249j1919j03747
9662b20915k121I6518K6726J70268j29673i6853j86329l7842B17350a27539J4135
$$ plain form
9743 -262522 -321229 -37082 -96118 -360221 -491727 197876 -82247 -154742 -111699 -108549 60562
9731 -319541 -276757 -153924 -66067 74600 -17697 -73886 -421548 -63652 -111377 129858 -37518
9719 -111248 45226 -337023 -75675 27286 -203459 -34855 -291982 400123 -121532 -54891 -61834
9708 -61834 -291166 -42087 35228 -133802 -11899 -417380 309812 -193649 23563 -46463 20944
9696 130544 -186669 237386 200941 -152267 -121097 -71840 -1427 120465 -137888 159330 -418851
9684 -513577 -134517 -321799 242987 -103238 -143152 -147946 -271294 -156260 -308286 101589
9673 170493 -52025 -107737 -180406 99384 -3611 -88957 -53158 16523 -105249 -117168 -220915
9662 -220915 -223036 96518 123244 293512 163839 -96853 -283182 -321024 217350 -127539 -113404
9651a13404e2483A0305J26718i940j23989j07761N3973H9010b04849h0278k29556
9640c09834a51829H1845k2723L2224a30781A9173a26241f256o4392b2372j08567
9629a30939N3264p9361B967b74129C2795b01635K5824A32739Q4637b22207k515
9618b24722D6589c06024A36225h3290k37035b5244E097b72225k90434C6539b29589
9606h0503c1706j82459J04529l3758A38220f17183a16339e7151j13931o2530C13382
9594D2265A0698L36572a66441J0734j47256A90189a62162L467A50001b26694F8088
9582b38504p3467D9676N8535b28244C21237R5514b72455F6243j3064J38931a93017
9570b13728m7585C51819a6821I003b58702B59985b5427A15033P6219e9399A50968
$$ plain form
9651 -113404 -52483 10305 137023 -9940 -133929 -241690 -187717 89010 -204849 -80278 -309834
9640 -309834 -151829 81845 59122 91346 -130781 19173 -126241 -6256 -70648 -22372 -130939
9629 -130939 -77675 -157036 2967 -274129 32795 -201635 -175811 132739 217376 -222207 -224722
9618 -224722 46589 -306024 136225 -83290 -320325 -25244 5097 -272225 -562659 36539 -229589
9606 -80503 -31706 -214165 -109636 -143394 138220 -617183 -116339 -57151 -171082 -233612 313382
9594 42265 10698 347270 -166441 -155707 -302963 190189 -162162 -158695 150001 -226694 68088
9582 -238504 -311971 49676 108211 -228244 321237 416751 -272455 66243 53179 192110 -193017
9570 -213728 -261313 351819 -16821 9003 -258702 259985 -25427 115033 191252 -59399 150968
9558b34699r7105J61165M1809A08636J43399b8963D4039J62262c63154N8741b8258
9546i9762j07756j91512f8012j14749B92639o380a31634L2294B7612b74507C4579
9534c0721r5143B62503A00876c16046b5302k08588p594A79752b16111m3457A63034
9522a43260c8515E1948A9014c95883a82667F7786J06108D6114M32765b56868a09007
9510b67332E6728B2086b05541k6827j4489Q9027j93575B0181J9719a89291B34059
9498a50135H6449a24710F8030J9234c76989a40291f0108B46242c7871k03627H2780
9486E26045c13710A72832M1402d3256k7841A10639e9462E7498K69860E1506G695
9474d74567N3956a82202G6123a73905d8273G9574b24655j64901J49122B63202
$$ plain form
9558 -234699 -331804 -170639 -128830 108636 252035 -28963 44039 206301 -363154 -304413 -28258
9546 -99762 -207518 -399030 -68012 -182761 292639 286259 -131634 -99340 27612 -274507 34579
9534 -30721 -125864 262503 100876 -316046 -25302 -233890 -241484 179752 -216111 -259568 163034
9522 -143260 -38515 51948 19014 -395883 -182667 67786 173894 46114 478879 -256868 -109007
9510 -267332 56728 22086 -205541 -232368 -246857 -157830 -351405 20181 39900 -189291 234059
9498 -150135 86449 -124710 68030 87264 -376989 -140291 -60108 246242 -37871 -241498 82780
9486 526045 -313710 172832 214234 -43256 -71097 110639 -59462 57498 327358 51506 7695
9474 -474567 -420611 -182202 76123 -173905 -48273 79574 -224655 -389556 -240434 263202
9463a63205N4120C8748e6710D8474J00121b80968a01082n5592C52045g2268A00115
9451I022a44377N5452k22287a00728I6126b24435K7770a5228l29572C7418d17681
9439A19169E1578a22910C8637J028a30883N7982G1920g5217l5066p338J1072L1036
9427g5513E8213b42418l1739E6537O091J42148E0314f165q455k1494j3554F7305
9414d49706a86683F8874B2224b37244i9074j26012P8924I3735a63371f5976k0092
9403h6068b8004j51322A01744e5162l81644A09126a07709j04567k7161G5461a4349
9391A20347b04556A05139f836D2942O832f4225D9794J50126i4819D5591a9217
9379A88713b66561j8546D17679c47765h4984B20218e7570n1852H7722c46633B03384
$$ plain form
9463 -163205 -109085 38748 -56710 48474 148595 -280968 -101082 -156674 352045 -72268 100115
9451 9022 -144377 -88925 -311212 -100728 96126 -224435 -196665 -15228 -344800 37418 -417681
9439 119169 51578 -122910 38637 39665 -130883 -72901 71920 -75217 -110283 -117621 -106549 -75513
9427 -75513 58213 -242418 -274157 56537 62628 204776 50314 -6165 -14620 -36114 -49668 67305
9414 -449706 -186683 68874 22224 -237244 -99074 -225086 -146162 93735 -163371 -65976 -86068
9403 -86068 -28004 -179326 101744 -55162 -436806 109126 -107709 -212276 -239437 75461 -14349
9391 120347 -204556 105139 -6836 42942 49774 -64225 49794 199920 -94819 45591 -19217
9379 188713 -266561 -285107 417679 -347765 -84984 220218 -57570 -109422 87722 -346633 203384
9367a08972B03565e5702m2273b4861H9490b04480o2399a13716j07860F0691b8727
9355e38048G6579l704F483J2765a74178A50625f5051j21498j45771H2889b99322
9343C0877b18766f3388J7202j31154c1875j67487K6879A49931c25991f9276l3580
9332a02856k41416g6461k56685D420P2727l753C4317a33892A33258B5482a1256
9320b5914j26872C7967M0703i3874b3771r2304k52482J35614f4802a5141A5a43194
9307f3356k93853J10098p5735R5593e1158q9249K0220C338a25069A82368F1448
9295b78263A81425a33592k20306b0549A85891e5699A48237c4414m7474q782j07543
9284a98213I5193a27854m4379B51004d3236B82241b9382q5083j66826E2876g6554
$$ plain form
9367 -108972 203565 -55702 -97975 -24861 89490 -204480 -266879 -113716 -221576 60691 -28727
9355 -538048 76579 72875 6483 19248 -174178 150625 -65051 -186549 -332320 82889 -299322
9343 30877 -218766 -63388 -46186 -177340 -31875 -199362 -172483 149931 -325991 -69276 -102856
9332 -102856 -344272 -76461 -333146 4420 77147 73394 34317 -133892 133258 25482 -11256
9320 -25914 -152786 37967 78670 -93874 -23771 -116075 -368557 -232943 -64802 -15141 15 -143194
9307 -63356 -357209 -247111 -322846 -227253 -51158 -140407 -120187 3338 -125069 182368 61448
9295 -278263 181425 -133592 -353898 -20549 185891 -55699 148237 -34414 -81888 -90670 -198213
9284 -198213 95193 -127854 -172233 251004 -43236 282241 -29382 -114465 -281291 52876 -76554
9272F4537c73950h5650k03654A05778a26507N650K3099B75280q5048G1663b15281
9260d31058C0485J305N7596c3173A94844c00677a00630j59318f1490H3753d33608
9248b53030a17614B79350q8548J72493E2578a6114q5208A05228f4362B6908M4062
9237G0970K8795b78448J34940J498M637j70914O2305J11638r6547m0350a15459
9225c38871E4162f1686l45489e4019G8653C569g6502A02019a12669B01033b09303
9213A5196e7297j24974q8006m5016c1388B13813b32975D8523e7854G5588h4442
9201F8423K97971I5980c6086k17890a1837l6112a6977H3454k8604a10368K4294
9190h6074J9649k96825H4876k6557c90345a3275l30827j5806B18169g2782B1701
$$ plain form
9272 64537 -373950 -85650 -289304 105778 -126507 -120857 -97758 275280 190232 71663 -215281
9260 -431058 30485 31790 89386 -33173 194844 -300677 -100630 -259948 -61490 83753 -433608
9248 -253030 -117614 279350 190802 363295 52578 -16114 -101322 105228 -64362 26908 70970
9237 70970 99765 -278448 -143508 -142010 -137373 -308287 -245982 -134344 -230891 -271241 -115459
9225 -338871 54162 -61686 -407175 -54019 78653 3569 -76502 102019 -112669 201033 -209303
9213 15196 -57297 -182271 -270277 -315293 -31388 213813 -232975 48523 -57854 75588 -84442
9201 68423 366394 95980 -36086 -253976 -11837 -47949 -16977 83454 54850 -110368 -86074
9190 -86074 -66425 -363250 84876 58319 -390345 -13275 -344102 -359908 218169 -72782 21701
9178a32411N7393B43154D4812b2934q3403I9801a76296L1270j9883I601i3982
9166h7245J8248o2019M3981j34784m7163K7867a07007A06368N6915E8544b43467
9154c83415n7268a46870m494A83124p4679h0581A41691E2063e4319E840Q90R4738
9142A01468a55259f0538j53405A38016i4187A17148g9865A39189C454a33602H1478
9130a06998l7696c9233m4758Q495E1152d72397I3166a9113A22622J6266D6491
9118A9786b49134B3226N273a79136G244a91202j22838c6931A2524b17902f9581
9106b34894e0845k4747F5006b14855i4002a1417C52003a03941j36355k0443F6495
9094d1036B6320h7559B3498b5693o2090q2287P9703q52C88061a86174e5689l46945
$$ plain form
9178 -132411 -75018 243154 44812 -22934 -106337 99801 -176296 -145026 -164909 9601 -93982
9166 -87245 -68997 -131016 -87035 -221819 -268982 -241115 -107007 106368 163283 58544 -243467
9154 -383415 -440683 -146870 -151364 183124 108445 -80581 141691 52063 -54319 5840 6730 101468
9142 101468 -155259 -60538 -213943 138016 -94187 117148 -79865 139189 3454 -133602 81478
9130 -106998 -144694 -39233 -83991 -75496 51152 -472397 93166 -19113 122622 138888 46491
9118 19786 -249134 23226 28499 -179136 7244 -191202 -314040 -36931 12524 -217902 -69581
9106 -234894 -50845 -75592 65006 -214855 -94002 -11417 352003 -103941 -240296 -260739 66495
9094 -41036 26320 -87559 23498 -25693 -87783 -170070 -90367 -91219 388061 -186174 -55689 -402634
9082d02634P9726a37260H2460a45386A1492c71327j4063A84066b551A90017a1707
9070h0057A59488c69361c2900A76229A4403b16948q760J08106L1294q8050A56381
9058A17973O846e2327H34d19877a14710q2739b5380l98995a87573p6373J24920
9047a39026A03435l4389c4101r7101C2373b22294j82535g4492A35862f9806J8900
9036e0906l3774k56921A03781d44393A53219a79681M0082e1423j09161A47324
9025e9091J5409j49987m9528c424B04119d55716k2594h2569G6536J43798E9094
9013c43490B627a17714B44534c28996b2625A03232g5332j7583j97136B12777F1953
9001a06577B35398C3911K16507H4165J16539b02737j16025a00837k21914c5152
$$ plain form
9082 -402634 -322908 -137260 82460 -145386 11492 -371327 -385390 184066 -2551 190017 -11707
9070 -80057 159488 -369361 -32900 176229 14403 -216948 -225708 -117602 -86308 -174358 156381
9058 117973 124819 -52327 834 -419877 -114710 -197449 -25380 -424375 -187573 -263946 -139026
9047 -139026 103435 69046 -34101 -131202 32373 -222294 -404829 -74492 135862 -69806 -50906
9036 -50906 -84680 -341601 103781 -444393 153219 -179681 -139599 -51423 -160584 147324
9025 -59091 -43682 -193669 -243197 -3424 204119 -455716 -478310 -82569 76536 220334 59094
9013 -343490 2627 -117714 244534 -328996 -22625 103232 -75332 -92915 -290051 212777 61953
9001 -106577 235398 33911 250418 84165 200704 -202737 -318762 -100837 -322751 -35152
8990c01037J44336A81396a30802d845j44125c5858j46850j33185B91822m5019
8980B46803e3839k22571B81344b65371A48510o2314K9121b1916j05264a1224A46392
8968a02764B1552f5645K3038j58280p0657D1760J15140b33621h622k05681j05485
8957c19788H7717c27217J08762h0677m9085r7266A3034L3167c97283a74497b3305
8945c20234a03245o7658G260b52466Q1057b4405A64111E3759a51668D0424a23488
8933a86686A92412e1901m338B721c1515I1275J9946a00209a5407A18802b93913
8921B3425O2111i2259k00876g3503B19121n3931L55533H6710a14184B09310J41014
8910C50324p8366J70740Q2639j3751P31235K76206J596147L200917k25135k733628
$$ plain form
8990 -301037 -156701 181396 -130802 -4845 -148970 -35858 -182708 -315893 291822 246803
8980 246803 -53839 -276410 281344 -265371 148510 86196 115317 -21916 -127180 -11224 146392
8968 -102764 21552 -65645 -42607 -200887 -271544 41760 156900 -233621 -8622 -214303 -319788
8957 -319788 87717 -327217 -218455 -80677 -129762 -227028 13034 46201 -397283 -174497 -23305
8945 -320234 -103245 -170903 7260 -252466 -171409 -24405 164111 53759 -151668 40424 -123488
8933 -186686 192412 -51901 -56239 2721 -31515 91275 111221 -100209 -15407 118802 -293913
8921 23425 85536 -92259 -293135 -73503 219121 165190 520723 86710 -114184 209310 350324
8910 350324 271958 442698 525337 511586 1242821 1519027 3115174 6316091 6090956 3357328
8900C357328A417812F67150j60003A60050J18988A9605h1001B71428a18560A42801
8889C08480R0919I3488K026K0544b83808R68g5503l6701d4299k79q4554L6766
8877i2366a9081j46066A58378a47810L033M1241B49657c52820f9561B44160b10496
8865H7714M8722J99074e714o51j46047j70303g5167R887C36565b29150c1576j48448
8853a80024F438c63433F5776M2608c29652a59261H288O2106a72087k563A64938
8841a36447A29608g50A04027j7921P0991G749b31746F1539g6490L2165B31867
$$ plain form
8900 3357328 1417812 667150 507147 160050 279038 19605 -81001 271428 -118560 142801
8889 308480 399399 93488 95514 116058 -283808 -282840 -75503 -112204 -44299 -44578 -129132 -92366
8877 -92366 -19081 -165147 158378 -147810 -144777 -103536 249657 -352820 -69561 244160 -210496
8865 87714 136436 335510 -5714 -6365 -152412 -322715 -75167 -65280 336565 -229150 -31576 -180024
8853 -180024 6438 -363433 65776 108384 -329652 -159261 8288 70394 -172087 -174650 164938
8841 -136447 129608 -750 104027 86106 157097 7749 -231746 61539 -76490 -44325 231867
$$ [...]
##END NTUPLES=NMR SPECTRUM
##END=
