
##TITLE=AC1169_Tolima-ibage-TGAAH12004_7165893_yIwC08t5dS
##JCAMPDX= 6.0         $$ Bruker NMR JCAMP-DX V2.0
##DATA TYPE= NMR SPECTRUM
##DATA CLASS= NTUPLES
##ORIGIN= BRUKER
##OWNER= Administrator
$$ 1.72 TOPSPIN		Version 2.1
$$ 2012-12-01 22:27:42.762 -0500  Administrator@X
$$ Compression mode = diff/dup
##.OBSERVE FREQUENCY= 400.02188249412
##.OBSERVE NUCLEUS= ^1H
##.ACQUISITION MODE= SIMULTANEOUS (DQD)
##.ACQUISITION SCHEME= undefined
##.AVERAGES= 8
##.DIGITISER RES= 22
##SPECTROMETER/DATA SYSTEM= spect
##.PULSE SEQUENCE= zg30
##.SOLVENT NAME= COFFEE_meoh
##.SHIFT REFERENCE= INTERNAL, COFFEE_meoh, 1, 14.98509
##AUDIT TRAIL= $$ (NUMBER, WHEN, WHO, WHERE, PROCESS, VERSION, WHAT)
$$ ##TITLE= Audit trail, TOPSPIN		Version 2.1
$$ ##JCAMPDX= 5.01
$$ ##ORIGIN= Bruker BioSpin GmbH
$$ ##OWNER= Administrator
$$ $$ E:\/data/COFFEE/nmr/AC1169_Tolima-ibage-TGAAH12004_7165893_yIwC08t5dS/10/pdata/1/auditp.txt
$$ ##AUDIT TRAIL=  $$ (NUMBER, WHEN, WHO, WHERE, PROCESS, VERSION, WHAT)
(   1,<2012-12-01 22:27:34.590 -0500>,<Administrator>,<X>,<go>,<TOPSPIN 2.1>,
      <created by zg
	started at 2012-12-01 22:26:28.558 -0500,
	POWCHK enabled, PULCHK disabled,
       configuration hash MD5:
       86 BA 57 50 F2 9D 5C 9B 26 00 A9 28 5F 66 2E 89
       data hash MD5: 64K
       8D B2 5D 10 C8 4F 75 C3 55 7A 8B 26 3C 8F 9E FF>)
(   2,<2012-12-01 22:27:37.621 -0500>,<Administrator>,<X>,<proc1d>,<TOPSPIN 2.1>,
      <Start of raw data processing
       efp LB = 0 FT_mod = 6 PKNL = 1 PHC0 = 0 PHC1 = 0 SI = 32K 
       data hash MD5: 32K
       4C 29 30 DD FA 45 7E 0A EA 1F 91 84 33 73 CC 14>)
(   3,<2012-12-01 22:27:38.121 -0500>,<Administrator>,<X>,<proc1d>,<TOPSPIN 2.1>,
      <pk PHC0 = 96.21826 PHC1 = 0 
       data hash MD5: 32K
       5D EB DB 8F 0A 6F 34 12 E7 F7 0E 15 B4 AF 8F 55>)
(   4,<2012-12-01 22:27:38.355 -0500>,<Administrator>,<X>,<proc1d>,<TOPSPIN 2.1>,
      <abs ABSG = 1 
       data hash MD5: 32K
       6F E0 A7 8D 21 70 D2 F5 ED 79 CA DD 3E A9 36 D9>)
(   5,<2012-12-01 22:27:38.512 -0500>,<Administrator>,<X>,<proc1d>,<TOPSPIN 2.1>,
      <abs ABSG = 2 
       data hash MD5: 32K
       8F BB FE BD 04 19 94 15 78 0B 49 83 F4 3C 97 3F>)
(   6,<2012-12-01 22:27:38.652 -0500>,<Administrator>,<X>,<proc1d>,<TOPSPIN 2.1>,
      <abs ABSG = 3 
       data hash MD5: 32K
       8A E2 73 B4 1A F0 E9 DC 18 76 C4 01 B6 27 36 AE>)
(   7,<2012-12-01 22:27:38.808 -0500>,<Administrator>,<X>,<proc1d>,<TOPSPIN 2.1>,
      <abs ABSG = 4 
       data hash MD5: 32K
       06 A5 E4 BD 35 B4 AE 1C 8B 0F A1 B4 DF B8 F8 A6>)
(   8,<2012-12-01 22:27:38.980 -0500>,<Administrator>,<X>,<proc1d>,<TOPSPIN 2.1>,
      <abs ABSG = 5 
       data hash MD5: 32K
       60 26 5F 48 92 09 C5 75 BD 8B 99 DA FA E3 B9 A6>)
$$ ##END=
$$ 
$$ $$ hash MD5
$$ $$ 5A 07 AB A2 C2 D4 16 82 5E 5B 7F AE F3 A5 56 6E
##$RELAX= 
##$RELAX= 
##$RELAX= 
##$RELAX= 
##$RELAX= 
##$RELAX= 
##$RELAX= 
$$ Bruker specific parameters
$$ --------------------------
##$DU= <E:\>
##$EXPNO= 10
$$ [...]
150 150 150 150 150 150 150 150
##$TP07= 0
##$TPNAME0= <>
##$TPNAME1= <>
##$TPNAME2= <>
##$TPNAME3= <>
##$TPNAME4= <>
##$TPNAME5= <>
##$TPNAME6= <>
##$TPNAME7= <>
##$TPOAL= (0..7)
0.5 0.5 0.5 0.5 0.5 0.5 0.5 0.5
##$TPOFFS= (0..7)
0 0 0 0 0 0 0 0
##$TUNHIN= 0
##$TUNHOUT= 0
##$TUNXOUT= 0
##$USERA1= <user>
##$USERA2= <user>
##$USERA3= <user>
##$USERA4= <user>
##$USERA5= <user>
##$V9= 5
##$VALIST= <valist>
##$VCLIST= <CCCCCCCCCCCCCCC>
##$VD= 0
##$VDLIST= <DDDDDDDDDDDDDDD>
##$VPLIST= <PPPPPPPPPPPPPPP>
##$VTLIST= <TTTTTTTTTTTTTTT>
##$WBST= 1024
##$WBSW= 4
##$XGAIN= (0..3)
0 0 0 0
##$XL= 0
##$YL= 0
##$YMAX_a= 662776
##$YMIN_a= -558391
##$ZGOPTNS= <>
##$ZL1= 120
##$ZL2= 120
##$ZL3= 120
##$ZL4= 120
##$ABSF1= 14.98509
##$ABSF2= -5.573092
##$ABSG= 5
##$ABSL= 3
##$ALPHA= 0
##$AQORDER= 0
##$ASSFAC= 0
##$ASSFACI= 0
##$ASSFACX= 0
##$ASSWID= 0
##$AUNMP= <proc_prof1d_extract_pilot.lims>
##$AXLEFT= 0
##$AXNAME= <>
##$AXNUC= <1H>
##$AXRIGHT= 0
##$AXTYPE= 0
##$AXUNIT= <>
##$AZFE= 0.1
##$AZFW= 0.1
##$BCFW= 0
##$BC_mod= 0
##$BYTORDP= 0
##$COROFFS= 0
##$CY= 15
##$DATMOD= 1
##$DC= 0
##$DFILT= <>
##$DTYPP= 0
##$F1P= 0
##$F2P= 0
##$FCOR= 0.5
##$FTSIZE= 32768
##$FT_mod= 6
##$GAMMA= 0
##$GB= 0
##$INTBC= 1
##$INTSCL= 1
##$ISEN= 128
##$LB= 0
##$LEV0= 0
##$LPBIN= 0
##$MAXI= 10000
##$MC2= 0
##$MEAN= 0
##$ME_mod= 0
##$MI= 0
##$NCOEF= 0
##$NC_proc= -8
##$NLEV= 6
##$NOISF1= 0
##$NOISF2= 0
##$NSP= 0
##$NTH_PI= 0
##$NZP= 0
##$OFFSET= 14.98509
##$PC= 1
##$PHC0= 96.21826
##$PHC1= 0
##$PH_mod= 1
##$PKNL= yes
##$PPARMOD= 0
##$PPDIAG= 0
##$PPIPTYP= 0
##$PPMPNUM= 2147483647
##$PPRESOL= 1
##$PSCAL= 4
##$PSIGN= 0
##$PYNMP= <proc.py>
##$REVERSE= no
##$SF= 400.02
##$SI= 32768
##$SIGF1= 0
##$SIGF2= 0
##$SINO= 400
##$SIOLD= 32768
##$SPECTYP= <>
##$SREGLST= <1H.CDCl3>
##$SSB= 0
##$STSI= 32768
##$STSR= 0
##$SW_p= 8223.68421052631
##$SYMM= 0
##$S_DEV= 0
##$TDeff= 65536
##$TDoff= 0
##$TI= <>
##$TILT= no
##$TM1= 0
##$TM2= 0
##$TOPLEV= 0
##$USERP1= <user>
##$USERP2= <user>
##$USERP3= <user>
##$USERP4= <user>
##$USERP5= <user>
##$WDW= 1
##$XDIM= 32768
##$YMAX_p= 474426381
##$YMIN_p= -650623
##$CURPLOT= <Network HP LaserJet P1505>
##$CURPRIN= <$Network HP LaserJet P1505>
##$DFORMAT= <normdp>
##$LAYOUT= <+/1D_H.xwp>
##$LFORMAT= <normlp>
##$PFORMAT= <normpl>
##$SURQMSG= 1
$$ End of Bruker specific parameters
$$ ---------------------------------
##NTUPLES= NMR SPECTRUM
##VAR_NAME=  FREQUENCY,     SPECTRUM/REAL,   SPECTRUM/IMAG
##SYMBOL=    X,             R,               I
##VAR_TYPE=  INDEPENDENT,   DEPENDENT,       DEPENDENT
##VAR_FORM=  AFFN,          ASDF,            ASDF
##VAR_DIM=   32768,         32768,           32768
##UNITS=     HZ,            ARBITRARY UNITS, ARBITRARY UNITS
##FACTOR=    0.250966925370066, 1,           1
##FIRST=     8223.43324360094, -88393,       -361571
##LAST=      0,             -295470,         -93185
##MIN=       0,             -650623,         0
##MAX=       8223.43324360094, 474426381,    0
$$ Real data points
##PAGE= N=1
##DATA TABLE= (X++(R..R)), XYDATA
$$ [...]
$$ plain form
19491 -139418 158735 -125064 -117717 -100372 123191 -170223 -261261 -133481 -44839 -180617
19481 -180617 -89131 -96017 13335 18237 -63608 -82269 -95811 -292652 -94149 37359 23817 -69408
19468 20073 -300503 -168523 -90568 12104 -161242 -115780 -205262 76825 -143445 -56368 -129462
19457 -129462 -387213 -163450 -299798 -52792 -43597 1323 74215 21186 -119301 59693 -362225
19445 -68229 -110252 -124192 -131458 -201177 105927 79647 -33733 -127026 -400123 -57500 -159392
19434 -159392 -170163 -51153 -150241 -354804 -24527 -64254 65258 24044 -125134 -42851 -26568
19423 -26568 228528 -216805 -361392 154171 -15653 -156948 131627 381205 -98692 -190189
19413 -190189 219596 518799 238956 29115 80698 -48028 -37219 -146590 -282393 -60696
$$ packed form
19491a39418A58735a25064P347J7345A23191a70223r1038J27780d4839j35778
19481a80617h9131o886A3335M902f3608j8661j3542j96841i4149C7359j3542f9408
19468B0073c00503J31980P7955A2104a61242M5462q9482G6825a43445e6368p3094
19457a29462k57751a63450j36348e2792R195A323P2892B1186a19301E9693c62225
19445f8229m2023j3940p266o9719A05927k6280c3733r3293k73097e7500j01892
19434a59392j0771e1153r9088k04563b4527l9727F5258B4044a25134d2851J6283
19423b6568B28528b16805j44587A54171a5653j41295A31627K49578i8692r1497
19413a90189B19596K99203B38956B9115N1583d8028J0809j09371j35803f0696
$$ plain form
19402 247549 -255172 87094 -306015 -5891 6737 -230950 -175155 77133 -461447 -122294 -303523
19391 -303523 -229273 -329661 -239111 410 -68237 -146982 -92936 -103252 -162515 -286084 -192553
19380 -192553 35860 -372685 20762 -1021 25097 -20042 -68434 235327 -76806 274635 -42975
19368 -102188 -20565 -217248 -206736 -237565 -48392 96908 223585 -94558 -14065 285030 59341
19356 -136551 195485 93734 -32152 -80543 -130662 -200839 -125234 185139 -391079 -159677 -214093
19345 -214093 -24788 192532 -122626 -293450 -76895 148310 53371 155673 -254967 226774
19334 83721 255112 115187 57182 -520 -189255 -13683 170736 -122666 145943 17313 -112502
19322 -165558 -221687 -12279 -160039 -26012 146038 -306473 -29948 -519940 -57274 61681 -350083
$$ packed form
19402B47549b55172H7094c06015e891F737b30950N5795G7133d61447a22294j81229
19391c03523P4250j00388R0550D10f8237p8745N4046j0316n9263j23569R3531
19380a92553C5860c72685B0762a021B5097b0042m8392B35327g6806B74635d2975
19368a02188b0565j96683J0512l0829d8392I6908J26677i4558a4065B85030E9341
19356a36551A95485I3734c2152m8391n0119p0177P5605A85139c91079a59677n4416
19345b14093b4788A92532a22626j70824g6895A48310E3371J02302b54967B26774
19334H3721J71391A15187E7182e20j88735a3683A70736a22666A45943A7313a12502
19322a65558n6129a2279j47760b6012A46038c06473b9948m89992e7274F1681c50083
$$ plain form
19310 -150829 30784 260387 -39563 23438 59025 -123915 -14563 -60466 -239790 -200197 -149080
19299 -149080 -178320 76126 -203542 -200105 6350 131501 141492 28678 -210254 -330682 -17109
19287 -85563 -17663 6632 -41196 -108100 139477 -366956 -104957 78398 -37967 -47203 381196
19275 20935 -168932 60161 208024 -64058 -130167 -101451 161528 -248370 327502 -100256
19264 -94905 -316588 -245659 -300389 176417 -44936 -41500 -187517 -63608 -102668 198140 -50786
19252 -135733 225608 -236192 68899 122349 96380 -181349 35954 25521 -262144 124590
19241 -233949 -256797 -119401 -299629 177578 -126364 -152992 22937 -66264 -48293 -84174 -87590
19230 -87590 -293567 184078 -108305 -149987 190436 70526 -37263 -44025 104204 98934 -3633
$$ packed form
19310a50829C0784K29603c9563B3438L5587a23915a4563m5903j79324L9593N1117
19299a49080k9240G6126b03542L437F350J25151R991B8678b10254j20428a7109
19287h5563a7663F632d1196o6904A39477c66956a04957G8398c7967r236C81196
19275B0935a68932F0161J47863f4058o6109K8716A61528b48370C27502a00256
19264i4905k21683P0929n4730A76417d4936L436j46017f3608l9060A98140e0786
19252a35733B25608b36192F8899N3450k5969a81349C5954j0433b62144A24590
19241b33949k2848a19401j80228A77578a26364k6628B2937f6264J7971l5881l416
19230h7590k05977A84078a08305m1682A90436G0526c7263o762A04204n270c633
$$ plain form
19218 80542 -112295 -32653 -119393 85369 -330533 -189502 188399 -74493 96468 -188402 -99088
19207 -99088 -650623 -106400 -365663 -27540 -237808 20873 -163006 -246254 -227657 -192052 -140082
19196 -140082 -103272 78262 -304504 95878 -259010 47138 -59299 35078 -477137 57029 -51671
19184 -166117 -66305 -108320 6490 17437 -188676 66524 -139954 -270647 -158053 -92750 76177
19172 -122299 -91395 -213933 -280943 36559 -27632 -117294 -202601 -93286 -35045 9290 -211862
19160 175607 171735 18184 134544 -574532 81192 -176626 -86894 -12392 -137515 157579 9912
19148 -195644 -73919 109209 180275 115019 -185745 28965 -69316 132952 31681 -37420 177665
19136 -257004 -269548 -45803 24796 -186712 -137420 89980 -23751 60341 -3283 49745 -15299
$$ packed form
19218H0542a12295c2653q6740H5369c30533J41031A88399g4493I6468a88402Q9314
19207i9088n51535a06400k59263b7540k10268B0873a63006q3248J8597L5605N1970
19196a40082L6810G8262c04504I5878b59010D7138e9299C5078d77137E7029e1671
19184a66117f6305m2015F490J0947a88676F6524a39954j30693J12594O5303G6177
19172a22299L0904j22538o7010C6559b7632q9662q5307i3286c5045I290b11862
19160A75607l872A8184J16360e74532H1192a76626h6894a2392j25123A57579I912
19148a95644g3919A09209P1066o5256a85745B8965f9316A32952C1681c7420A77665
19136b57004j2544d5803B4796a86712M9292H9980b3751F0341c283D9745a5299
$$ plain form
19124 -122835 1808 97643 -302523 -157776 -81527 -164580 80778 -311876 -119261 -51977 -12275
19112 44750 -1875 -170273 -57194 54263 43199 -309398 -194884 6259 -240884 -424973 -66 97079
19099 404867 45268 182300 65332 -300381 -3658 -232989 261018 22012 -144976 -450380
19089 -450380 -36528 81609 -23685 65164 126325 -406611 -128301 -170697 -173969 -65315 10723
19077 -42751 -35105 -287453 -91666 -352701 -31961 24642 51948 22155 -49035 24381 5810 -49231
19064 -44584 77001 25979 30046 -16370 -315018 126794 127741 5803 179007 -192859 -197453 109373
19051 7456 15186 18743 -21548 -245147 -13719 -180971 187956 -11971 -91879 -119616 -58988 172998
19038 -83446 172940 -102100 -151762 -188332 -142444 -61752 136300 -478285 -1627 -195060 -132878
$$ packed form
19124a22835A808R5835c02523J44747P6249q3053H0778c11876a19261e1977a2275
19112D4750a875j68398e7194E4263j1064c09398J14514F259b40884j84089f6I7079
19099D04867D5268J37032F5332c00381c658k29331B61018B2012a44976l05404
19089d50380c6528H1609b3685F5164O1161d06611a28301m2396l272f5315A0723
19077d2751P646k52348i1666k61035c1961B4642K7306B2155d9035B4381E810d9231
19064d4584G7001B5979M067a6370k98648A26794R47E803J73204a92859m594A09373
19051G456P730L557b1548k23599a3719j67252A87956a1971p9908k7737e8988A72998
19038h3446A72940a02100m9662l6570M5888f1752A36300d78285a627j93433O2182
$$ plain form
19027 -132878 424564 194886 417703 -10950 163231 95387 148023 -174687 -979 251041 -3643
19015 -65652 -256683 31451 -161584 63435 -5472 -83742 -180001 -107622 241661 -21512 -345519
19004 -345519 196325 190723 77591 258477 -3705 40434 -140347 -73448 -222110 -62396 -39642
18993 -39642 -189115 60628 -201564 -97093 -317866 -356586 -16017 -169958 -197351 63589 -155821
18981 -233719 -209452 86664 -5034 -53074 -105198 -286525 -19812 46075 172639 269524 452695
18970 452695 846495 650084 60248 436276 115529 -152362 245260 -533978 193801 68116
18959 -224423 -105336 -130976 -169736 -76419 125042 -196026 -41581 151628 13725 -168125
18948 -110403 49481 181403 -157982 -227263 79118 88367 -135273 -84211 -29818 -223835 -64726
$$ packed form
19027a32878D24564A94886K22817a0950A63231o7844N2636a74687i79B51041c643
19015f5652j91031C1451a61584F3435e472p8270r6259P2379B41661b1512l24007
19004c45519A96325n602G7591J80886c705D0434a40347O6899j48662f2396K2754
18993c9642j49473F0628b01564i7093k20773l8720a6017j53941k7393F3589a55821
18981b33719K4267H6664e034m8040n2124j81327a9812D6075J26564R6885J83171
18970D52695L93800j96411F0248L76028A15529a52362B45260e33978A93801F8116
18959b24423a05336k5640l8760g6419A25042a96026d1581A51628A3725a68125
18948a10403D9481J31922a57982o9281G9118R249a35273N1062b9818j94017f4726
$$ plain form
18936 -143432 -84196 -260443 -374955 -238661 31860 -51084 -119374 80490 -5666 -48797 -166529
18925 -166529 152583 -271243 38556 -295412 -205039 -102259 106169 -41447 208469 -491494
18914 223806 338071 76534 540121 54643 98392 173805 364831 482913 792725 412498
18904 412498 235508 -15441 244794 145410 -67093 181563 126368 -149968 -170891 -284203
18894 -284203 -133503 199708 113851 -219201 -21210 -70741 -235358 -171690 -9103 -206881 -56237
18882 203502 59003 -130544 -121041 -207861 -258897 -59855 -535045 -8821 -265401 15401 168279
18871 168279 135056 -160381 -257932 104706 -390162 -246791 45523 -70274 94882 -316932
18860 172637 -215257 247846 -54639 -177452 -184836 -141256 -141115 -348132 -243219 -122050 56749
$$ packed form
18936a43432N9236j76247j14512J36294C1860e1084o8290H0490e666m3131j17732
18925a66529A52583b71243C8556b95412R0373a02259A06169d1447B08469d91494
18914B23806J14265G6534M63587E4643M3749P5413J91026J18082L09812l80227
18904D12498j76990a5441B44794r9384f7093A81563n5195a49968k0923j13312
18894b84203a33503A99708q5857b19201b1210m9531j64617O3668i103j97778e6237
18882B03502E9003a30544R503q6820n1036e9855m75190h821k56580A5401J52878
18871A68279l3223a60381r7551A04706c90162J43371D5523g0274I4882c16932
18860A72637b15257B47846e4639j22813p384M3580J41k07017J04913J21169E6749
$$ plain form
18848 -169043 -68502 -18617 -17436 -57074 51735 -326327 127189 164244 33165 -298499 59253
18836 -239483 -33811 156993 172495 69556 -116561 -76446 -321215 -269303 45913 -11716 -276239
18825 -276239 112259 56586 -216320 -220083 -199979 -116277 -118077 -224605 357282 -78958 254390
18813 -47566 -129754 3304 20920 -46837 294443 217357 100542 305572 106130 -32702 -50082
18802 -50082 82210 -160948 243794 -172757 222499 13592 84001 -147869 -456514 -101086
18791 -288736 -260537 -112182 -210832 -66852 -163242 -346516 -188950 -225377 -152265 -143261 -147989
18780 -147989 -42201 -245271 370959 -156436 -138195 174549 -138904 -176096 -36289 -49273
18770 -49273 99194 95428 -397923 -69714 161392 216306 99579 -316358 -556043 -24958 -255090
$$ packed form
18848a69043f8502a8617J181l9638E1735c26327A27189L7055C3165b98499E9253
18836b39483c3811A56993J5502F9556a16561M0115k44769N1912D5913a1716k64523
18825b76239A12259n5673b16320l763K0104Q3702j800j06528C57282g8958B54390
18813d7566q2188C304J7616d6837B94443p7086A00542K05030A06130c2702j7380
18802e0082H2210a60948B43794a72757B22499A3592P0409a47869l08645a01086
18791b88736K8199a12182r8650f6852r6390j83274J57566l6427P3112R004m728
18780a47989d2201k03070C70959a56436J8241A74549a38904l7192c6289j2984
18770d9273I9194l766c97923f9714A61392N4914I9579c16358k39685b4958k30132
$$ plain form
18759 -255090 -4975 168647 161799 -218987 -42055 -44818 -105265 65048 -52859 -12267 67952 -154344
18746 -418471 75450 20874 -132376 412624 -188906 16048 -206896 113133 414564 -118285
18735 -142815 -199733 102285 -108337 237801 -38728 136522 101684 54172 142491 152510 -181306
18723 4786 -370597 56348 -114682 -24144 -199620 145156 -504868 202086 -350415 -242686
18713 -242686 -48894 -201692 -280187 -231874 -212519 -43338 -55724 -209016 -48457 -85065 9464
18701 -165979 -63446 -105875 -112946 -443312 59124 -48306 -75691 47940 137438 -51975 -165229
18690 -165229 171364 291475 -78036 235695 -516123 -294312 -92006 -14441 231000 -276946
18679 -53410 -72662 -52530 -124723 121348 288168 -275861 -490521 -46561 -207262 -104434
$$ packed form
18759b55090d975A68647o848b18987d2055k763o0447F5048e2859a2267F7952a54344
18746d18471G5450B0874a32376D12624a88906A6048b06896A13133L01431a18285
18735a42815n6918A02285a08337B37801c8728A36522l4838m7512Q8319J0019a81306
18723D786c70597E6348a14682b4144j75476A45156e04868B02086c50415J07729
18713b42686d8894j52798p8495M8313J9355d3338j2386j53292d8457l6608I464
18701a65979f3446m2429p071l30366E9124d8306k7385D7940Q9498e1975j13254
18690a65229A71364J20111g8036B35695e16123K21811i2006a4441B31000b76946
18679e3410j9252K0132p2193A21348J66820b75861k14660d6561j60701J02828
$$ plain form
18669 -104434 179974 -109629 74861 73420 18205 108522 -65518 111766 101938 46352 30021
18658 30021 23632 76721 -218989 -150851 -62529 30048 -75596 -320071 -60424 -109126 113763
18646 -46025 -230932 147759 -108733 -297609 -325649 85491 -28081 279812 -117291 7272 36954
18635 36954 -88949 -209741 -91644 -156081 365320 -163379 -11275 26113 38265 60603 -7584
18623 -25012 -3910 -163618 -53572 -99372 -29195 -295746 21216 121190 51512 157027 22586
18611 -62945 -133859 330501 118282 41070 -11311 -188591 -194083 -72798 82220 82582 39276 117427
18599 117427 -35490 -327316 -169323 166289 -174884 -265316 113733 -129466 -341422 -218264
18589 -218264 -37825 -95869 -290235 147914 45332 -31592 232265 -22815 -114183 -300192 215789
$$ packed form
18669a04434A79974a09629G4861j441A8205R0317f5518A11766r828D6352j6331
18658C0021o389N3089b18989O8138f2529C0048g5596k44475f0424m8702A13763
18646d6025j84907A47759a08733j88876k8040H5491b8081B79812a17291G272K9682
18635C6954h8949j20792i1644o4437C65320a63379a1275B6113J2152K2338g584
18623b5012c910j59708e3572m5800b9195k66551B1216R9974E1512J05515B2586
18611f2945p0914C30501A18282D1070a1311j77280n492g2798H2220L62C9276P8151
18599A17427c5490k91826J57993A66289a74884r0432A13733a29466k11956J23158
18589b18264c7825n8044j94366A47914D5332c1592B32265b2815r1368j86009B15789
$$ plain form
18577 -204297 -60774 -216451 155860 -178261 -39721 212254 -217987 250065 17941 -93914
18566 -398558 -323269 -24855 -33827 -55322 -127199 -23826 333429 174175 118468 -198917 -213879
18555 -213879 171267 118133 -293737 21144 213844 10635 -321528 3862 26685 -337808 11768
18543 -36075 -62835 -7533 -249127 -120790 159244 -349159 -102543 -384402 -189612 100131
18532 70951 27464 -240039 -39944 30457 170045 129247 -226473 -16488 39578 -46031 -15581
18520 117401 -120447 -100263 81592 -282505 41009 -176862 17674 -53936 190415 -237193
18509 -164583 -390771 -42485 -252705 134609 177535 -174243 -299171 -7603 -137884 -64364
18498 112347 -245263 -421248 -15244 200350 -92883 -297588 -48923 -15738 123494 54059
$$ packed form
18577b04297f0774j55677A55860a78261c9721B12254b17987B50065A7941i3914
18566c98558P5289b4855q972k1495p1877b3826C33429j59254n5707a98917j4962
18555b13879A71267n3134b93737B1144J92700A0635c21528C862K2823c37808A1768
18543c6075k6760g533k41594a20790A59244c49159a02543k81859a89612A00131
18532G0951B7464b40039c9944C0457J39588m0798b26473a6488C9578d6031a5581
18520A17401a20447K0184H1592b82505D1009a76862A7674e3936A90415b37193
18509a64583k26188d2485k10220A34609M2926a74243j24928g603j30281f4364
18498A12347b45263j75985a5244B00350i2883k04705d8923a5738A23494E4059
$$ plain form
18487 2599 19898 -49958 -122012 -127995 -81531 -61719 -26719 32587 307379 -283851 -321722 31212
18474 6169 103809 38328 -93719 -150762 75486 59389 53047 133354 -437358 86008 -128964 -65643
18462 -65643 371741 36112 82371 101311 -24924 -251555 -25463 71485 -171079 -62820 51000
18450 424995 -27292 -305844 -153793 -334998 67460 -88413 117450 -217632 -288315 -200806
18440 -200806 -201443 -122088 -224381 85562 -210038 -229263 -152169 130538 177655 72573 -116807
18428 -323892 -48719 281955 -239352 -86623 -351 233340 -1053 224996 -66238 103455 -324738
18416 -154415 -54479 -165592 -19633 286474 -277139 184108 1001 -96208 -307434 -95165 -55775
18405 -55775 126266 -67919 -192173 -247309 -725 170472 -64064 80762 -67583 -180770 186997
$$ packed form
18487B599J7299d9958p2054n983M6464J9812b6719C2587K74792b83851l7871C1212
18474F169R7640C8328i3719n7043G5486j6097o342Q0307d37358H6008a28964O3321
18462f5643C71741C6112M6259J8940b4924k26631b5463G1485a71079f2820E1000
18450D24995b7292k78552J52051j81205F7460h8413A17450b17632p0683Q7509
18440b00806o37P9355j02293H5562b10038j9225P7094A30538M7117G2573a16807
18428c23892d8719B81955b39352h6623c51B33340a053B24996f6238A03455c24738
18416a54415e4479j11113a9633B86474b77139A84108A001i6208k11226i5165L9390
18405e5775A26266f7919j24254n5136g25A70472f4064H0762f7583j13187A86997
$$ plain form
18393 -16946 -299373 122253 21931 16700 7745 16304 46241 -13220 144563 74940 -185633
18381 312133 -255338 272104 -354729 325752 -373470 -251961 -306269 -56676 235117 -102406
18370 -193585 -291054 38173 3835 -250027 -98255 -307233 -23065 -278251 -41 -74670 -5772 185317
18357 334610 49723 74149 -64128 128475 276483 -196546 75699 -248759 50661 244918
18347 244918 -279880 -59973 -450151 -309125 -281007 -152641 114651 190806 -151148 -358885
18337 -358885 31246 -146675 215169 -278015 145627 -220493 150094 -301484 -134950 125091
18326 81101 15855 -20007 74352 -334406 31846 -346089 125533 135042 -250135 -104831 -52645
18315 -52645 -171750 97826 116463 -108316 346756 91302 -193194 2724 -46820 119909 257012
$$ packed form
18393a6946k82427A22253B1931n231G745Q559K9937a3220A44563o9623a85633
18381C12133b55338B72104c54729C25752c73470J21509n4308e6676B35117a02406
18370a93585r7469C8173C835b50027i8255k08978b3065k55186d1p4629e772A85317
18357C34610D9723K4426f4128A28475J48008a96546G5699b48759E0661J94257
18347B44918b79880e9973l90178J41026K8118J28366A14651P6155a51148k07737
18337c58885C1246a46675B15169b78015A45627b20493A50094c01484a34950A25091
18326H1101A5855b0007G4352c34406C1846c46089A25533R509b50135a04831N2186
18315e2645j19105I7826J8637a08316C46756I1302a93194B724d6820A19909J37103
$$ plain form
18304 257012 -229597 -117929 -100510 -4505 -47159 -231203 -19132 -69544 269081 24522 -214758
18292 -39142 -145252 92305 136750 240960 92280 -41035 198498 -155139 -61090 -223926 -178348
18281 -178348 -100692 -348365 -360882 -98676 241120 1227 -96783 73298 116329 -351041 -217313
18270 -217313 197681 273379 -123913 -170845 -36610 234331 64478 -219973 46045 237492
18260 237492 -40487 157032 -8461 105793 -43778 -90396 153527 -324243 -137298 137437
18249 -117949 -267248 -69405 14840 -300935 -55577 222959 -163710 -63183 351177 -273805
18238 225232 -14083 1250 173463 181842 -47731 216364 -394211 -139427 354170 -178002 172193
18226 -159989 84542 94679 150642 195791 -139262 -244495 -6434 -150079 56856 -102524 -231809
$$ packed form
18304B57012b29597J11668J7419d505m2654j84044a9132n0412B69081B4522b14758
18292c9142j06110I2305M4445J04210I2280d1035A98498a55139f1090j62836M5578
18281a78348P7656k47673j2517i8676B41120A227i6783G3298M3031c51041J33728
18270b17313A97681P5698a23913m6932c6610B34331F4478b19973D6045J91447
18260B37492d0487A57032h461A05793d3778m6618A53527c24243a37298A37437
18249a17949j49299f9405A4840c00935e5577B22959a63710f3183C51177b73805
18238B25232a4083A250J72213Q379d7731B16364c94211a39427C54170a78002A72193
18226a59989H4542J0137N5963M5149a39262j05233f434j43645E6856a02524j29285
$$ plain form
18215 -231809 113368 37933 -49106 364675 -89149 54147 -32723 -144145 71586 -291679 -181102
18204 -181102 -183327 -222756 -322769 100757 42251 51822 55319 171024 -82274 -240255 94947
18192 -107650 -36519 -194564 -141814 88352 166008 -95267 -307864 -318107 -28741 180799 80081
18180 50508 47632 -7580 -89425 -10181 -224651 -101786 -159823 36831 -118484 -389421 160470
18168 -181639 29859 56948 71730 22318 180256 149692 -37149 -150432 -512469 167943 -224521
18156 -218973 -201783 72790 172065 -137613 -173870 109786 140005 -425510 -24577 179669 -326285
18144 -182327 -6608 59640 -922 -15071 -381792 131964 -192180 -60616 -250962 -41533 359664
18132 -29647 -44601 -175885 -59722 -43203 208132 -214407 66977 111387 307991 -162855 -81000
$$ packed form
18215b31809A13368C7933d9106C64675h9149E4147c2723j11422G1586b91679J10577
18204a81102k225l9429j00013A00757D2251R571L497J15705h2274j57981I4947
18192a07650c6519j58045N2750H8352P7656i5267k12597j0243b8741A80799H0081
18180E0508k876g580q1845a0181k14470a01786n8037C6831a18484k70937A60470
18168a81639B9859K7089J4782B2318J57938l0564c7149j13283l62037A67943b24521
18156b18973J7190G2790R9275a37613l6257A09786L0219d25510b4577A79669c26285
18144a82327f608E9640i22j4149l66721A31964a92180f0616j90346d1533C59664
18132b9647j4954j31284e9722J6519B08132b14407F6977M4410J96604a62855h1000
$$ plain form
18120 289855 75272 -139630 -114563 44621 86525 427067 20808 -221116 -450607 -130672
18109 -147700 -187931 -42697 -234450 233366 -144704 112223 10303 -275906 124640 -7552
18098 90533 94547 501 -306240 3323 191645 134636 -86153 -78997 -124016 -29466 138815 -85236
18085 54328 69187 29214 -45884 -92275 -468802 220816 273720 -104258 -100501 -163264 -323338
18074 -323338 18584 132624 220951 -105672 89640 43134 -137542 -233932 11113 71648 -56805
18062 -211067 62750 16263 -125093 290558 -172990 -190886 -76111 -34979 -219148 308809
18051 -31504 43765 -127578 -34005 7739 -172518 20998 257458 362247 138136 -381969 -35901
18039 152065 196674 3000 193064 -367684 -140819 -62226 -201939 -31905 -157126 10627 -35259
$$ packed form
18120B89855G5272a39630K5067D4621M1904L40542B0808b21116k29491a30672
18109a47700m0231d2697j91753B33366a44704A12223A0303b75906A24640g552
18098I0533M014E01c06240C323J88322n7009h6153P156m5019b9466A38815h5236
18085E4328J4859B9214d5884m6391l76527B20816N2904a04258L757o2763j60074
18074c23338A8584J14040Q8327a05672H9640D3134a37542r6390A1113O0535e6805
18062b11067F2750A6263a25093B90558a72990j7896g6111c4979j84169C08809
18051c1504D3765a27578c4005G739a72518B0998K36460J04789A38136c81969c5901
18039A52065M4609C000J90064c67684a40819f2226j39713c1905j25221A0627c5259
$$ plain form
18027 -61604 361050 -231897 -151359 60841 -179510 70698 -365687 244145 241855 -9772 275024
18015 294704 -58125 35805 108894 -50490 171095 2430 40857 1413 129084 -13820 -293788
18004 -293788 -144166 135258 -56088 178789 1814 -47786 184990 -32941 14734 62045 -594939
17992 -179099 -7889 145278 -302138 40660 -37967 -111153 113728 -185928 205611 -186591
17981 159425 260365 37257 213846 8459 52870 -83795 -14784 -277160 -279335 8365 52468
17970 52468 78768 171901 -332571 -44034 251704 -98799 46712 190240 64184 12944 228454
17959 228454 -6145 81124 6665 -393484 87301 -80211 -175731 -149301 -7633 424643 -298610
17947 -190680 67036 493590 -69155 -230734 122289 -183680 31773 -40780 -148039 -91908
$$ packed form
18027f1604C61050b31897Q0538F0841a79510G0698c65687B44145k290i772B75024
18015B94704e8125C5805P3089e0490A71095B430L8427A413J27671a3820k79968
18004b93788a44166A35258e6088A78789A814d7786A84990c2941A4734M7311e94939
17992a79099g889A45278c02138D0660c7967p3186A13728a85928B05611a86591
17981A59425J00940C7257J76589H459M4411h3795a4784k62376k175H365M4103
17970E2468K6300R3133c32571d4034B51704i8799D6712J43528F4184A2944K15510
17959B28454f145H1124F665c93484H7301h0211r5520K6430g633D24643b98610
17947a90680F7036M26554f9155j61579A22289a83680C1773d0780j07259N6131
$$ plain form
17937 -91908 -54300 283054 14769 -157566 -70572 -185914 -222758 -27679 -138983 -293137 -176842
17926 -176842 -70005 -110437 -184945 -230167 235253 -249643 152737 -162970 302103 106294
17915 174448 -212445 171596 -280558 -158196 -180355 300855 -66333 18357 212500 -208694
17904 52786 71309 -1987 223172 14144 -68184 -315978 -372775 -7442 102951 63597 -247350
17892 29284 -41899 -313208 212909 -4846 -55023 396577 279221 34461 202278 64930 408252
17881 408252 -81192 364333 -302659 96370 -125824 -230670 46747 -53207 97365 330172
17871 330172 29024 -72231 -121272 2101 74948 239073 -220639 242280 -141381 101593 -6420
17859 -19510 117169 -268937 45161 87473 127207 -182510 -26086 128127 346975 -147350
$$ packed form
17937i1908L7608B83054A4769a57566g0572j15342l6844b7679j11304j54154J16295
17926a76842g0005m0432p4508m5222B35253b49643A52737a62970C02103A06294
17915A74448b12445A71596b80558J22362k2159C00855f6333A8357J94143b08694
17904E2786J8523a987B23172A4144f8184k47794n6797g442A02951l9354b47350
17892B9284d1899k71309B12909d846n0177C96577j17356C4461J67817F4930L43322
17881D08252h1192C64333c02659I6370a25824j04846D6747e3207I7365K32807
17871C30172B9024g2231m9041B101P2847J64125b20639B42280a41381A01593f420
17859a9510A17169b68937D5161M2312L9734a82510b6086A28127K18848a47350
$$ plain form
17848 -33633 -18613 76364 122389 22240 166564 -68489 -98661 -166116 -305141 -51769 -293149
17837 -293149 82092 32830 -158423 -303842 350433 231208 -4952 8482 -83216 184094 256782
17826 256782 -64286 74522 281209 85779 -424011 -31663 259039 -229395 -884 -301342 156166
17814 -197061 35822 305091 -143766 25104 215631 144601 204744 211807 40761 285370 139454
17802 345025 118179 257245 -47989 248367 118238 -277357 292401 145655 105076 193834
17792 193834 26702 163016 143705 139884 -82161 44297 -116706 -37837 247345 163659 -198676
17780 10974 190197 -21283 16701 201815 -51332 247561 -25486 -5138 151744 -96666 -193375
17769 -193375 -62255 -12795 -144029 331349 7136 -164690 -3576 66302 -134715 11779 75171
$$ packed form
17848c3633J5020G6364M6025B2240J44324f8489l0172o7455j39025e1769k41380
17837b93149H2092C2830a58423j45419C50433j19225d952H482h3216A84094P2688
17826B56782f4286G4522K06687H5779d24011c1663B59039b29395h84l00458A56166
17814a97061C5822K69269a43766B5104J90527p1030O0143P063D0761K44609A39454
17802C45025A18179J39066d7989B48367A18238b77357B92401A45655m0579Q8758
17792A93834B6702J36314j9311l821h2161D4297a16706c7837B47345q3686a98676
17780A0974J79223b1283A6701J85114e1332B47561b5486e138A51744i6666r6709
17769a93375f2255a2795j31234C31349G136a64690c576F6302a34715A1779O3392
$$ plain form
17758 75171 176367 103605 -168635 -43842 -156270 -204320 -107896 -42627 171903 -135562 -146383
17747 -146383 285724 389238 -69986 101355 283273 54374 385327 112160 -144549 -11681
17736 -138260 108354 160923 56467 138527 107427 -41588 380095 -13491 288407 472172 467483
17725 467483 130792 24314 119015 -43241 -41861 -18854 -143657 8263 -21821 239989 196888
17714 196888 117969 255185 -106238 -358107 169077 -405421 60621 74059 -125661 133750
17703 33425 174040 -281434 -158667 -220853 303688 118503 -39466 146161 389885 -120459
17692 -280966 173864 -8056 -52535 179576 187074 257660 192363 214759 46124 66914 116579
17681 116579 -76695 -86199 366858 -141132 33007 142079 143885 -84169 -1415 -251964 282023
$$ packed form
17758G5171J01196p2762a68635d3842j12428m8050R6424d2627A71903a35562j0821
17747a46383B85724J03514f9986A01355J81918E4374L30953A12160a44549a1681
17736a38260A08354N2569E6467Q2060l1100d1588C80095a3491B88407J83765m689
17725D67483A30792B4314R4701d3241J380a8854j24803H263b1821B39989m3101
17714A96888p8919J37216a06238k51869A69077d05421F0621J3438a25661A33750
17703C3425J40615b81434J22767o2186C03688A18503c9466A46161K43724a20459
17692b80966A73864h056m4479A79576P498P0586o5297K2396D6124K0790M9665
17681A16579g6695r504C66858a41132C3007J09072J806h4169a415k50549B82023
$$ plain form
17669 221807 397019 38324 -138410 17163 81108 -212462 -50409 -24442 251018 -30772 37438
17657 341718 35545 14005 -154081 -85443 -176234 -242073 -82220 115465 95664 -191715 237872
17645 79691 75416 -10539 219784 -26243 189559 67000 150524 -273970 -132114 -34343 229485
17633 -77190 72454 143951 -111911 -23978 175226 40852 235787 102700 304088 -295082
17622 350934 -97646 -14019 335521 222553 -47457 53599 57467 142426 384657 76793 370587
17611 370587 340743 328142 163787 179010 318249 364068 133462 87602 249789 42657 213563
17600 213563 -160914 237801 311788 117268 62298 96064 -93027 306033 85149 -398955
17589 102220 230568 147110 -121301 161461 -50366 255628 -13703 1334 22 -14900 129522
$$ packed form
17669B21807J75212C8324a38410A7163O3945b12462e0409b4442B51018c0772C7438
17657C41718C5545A4005a54081O8638r0791o5839h2220A15465j9801a91715B37872
17645G9691m275a0539B19784b6243A89559F7000Q3524b73970a32114c4343B29485
17633g7190G2454P1497a11911b3978A75226D0852J94935A02700K01388b95082
17622C50934i7646a4019C35521j12968d7457E3599L868Q4959K42231G6793K93794
17611C70587k9844j2601A63787J5223J39239M5819A33462m5860J62187D2657J70906
17600B13563a60914B37801P3987A17268n4970L3766i3027C06033H5149c98955
17589A02220J28348q3458a21301A61461e0366B55628a3703A334B2a4900A29522
$$ plain form
17577 90981 32337 -122945 -33546 -237335 3758 -340693 -119699 369966 33629 16602 -56993
17565 -103266 317426 78430 219317 284625 142493 64836 564209 265698 217051 376221
17555 376221 169672 61367 207748 181797 -10013 94403 501229 -14980 194139 318167
17545 318167 193921 51677 245513 -223783 150161 68968 78381 146838 166045 78010 -370471
17533 367010 -6149 195944 533030 346490 415695 374985 327509 474050 665482 1055243
17523 1055243 1149492 894498 986555 876563 535157 282618 546844 431866 440308 479889
17513 479889 242971 375740 619184 868750 947966 1102924 1243517 973699 756152 373454
17502 303271 365105 517096 167234 723322 303521 -94390 353079 445395 285201 422063
$$ packed form
17577I0981C2337a22945c3546k03789C758c40693a19699C69966C3629A6602e6993
17565a03266C17426G8430J40887O5308j42132F4836M99373B65698m8647J59170
17555C76221A69672F1367J46381k5951a0013I4403M06826a4980A94139J24028
17545C18167j24246E1677J93836b23783A50161F8968R413O8457J9207G8010c70471
17533C67010f149A95944L37086j86540O9205m0710m7476J46541J91432L89761
17523A055243R4249k54994R2057j09992l41406k52539K64226j14978Q442L9581
17513D79889k36918J32769K43444K49566P9216J54958J40593k69818k17547C73454
17502C03271O1834J51991A67234N56088C03521i4390C53079R2316j60194J36862
$$ plain form
17492 422063 450362 118944 122007 104556 119069 516841 -282931 271911 205719 335321 72059
17480 273378 429372 363312 458395 116690 142261 654405 61783 363416 33924 218845
17470 218845 206578 400293 507873 135402 115739 -12801 -9973 154902 18370 230837 194642
17459 194642 307757 563193 262968 225807 170775 2036 181395 329380 343791 589832
17449 589832 303927 183205 403444 504483 313961 442760 209644 492424 540046 286736
17439 286736 462291 270955 417143 372663 539733 559390 524308 335190 394327 382896
17429 382896 302546 89641 246062 384171 187660 216280 436229 420035 447856 372212 291184
17418 291184 236473 343033 150613 401568 383505 345908 664805 671769 400465 572781
$$ packed form
17492D22063K8299A18944L063j7451J4513L97772b82931B71911o6192J29602G2059
17480B73378J55994o6060R5083A16690K5571N12144F1783L01633C3924J84921
17470B18845j2267J93715J07580A35402j9663a2801K828A54902A8370K12467l6195
17459A94642J13115K55436B62968l7161n5032B036J79359J47985J4411K46041
17449E89832k85905j20722K20239J01039j90522J28799B09644K82780M7622k53310
17439B86736J75555j91336J46188m4480J67070J9657l5082j89118N9137j1431
17429C82896q0350H9641J56421J38109A87660K8620K19949j6194K7821p5644q1028
17418B91184n4711J06560A50613K50955j8063l7597L18897O964k71304J72316
$$ plain form
17408 572781 285893 354346 244189 367408 313442 166859 75670 108626 403990 536441
17398 536441 307455 25783 215723 306663 -21767 48965 260276 -30520 358813 202561
17388 202561 489464 -286306 107687 420950 393866 68443 220519 252958 220027 334692
17378 334692 -48397 309597 95988 287225 59291 50813 427242 380008 352067 210312 439627
17367 439627 312461 293916 342521 347337 260739 67353 272975 135469 180430 140105 112483
17356 112483 277436 451351 361663 146205 618762 262529 372314 795816 221226 -51036
17345 370561 123481 151749 334120 126043 292502 341446 291961 344277 377206 228567
17335 228567 487980 98274 405531 421146 316321 -6882 265238 262867 59489 244102 267271
$$ packed form
17408E72781B85893O8453j10157J23219n3966j46583G5670L2956K95364J32451
17398E36441k28986B5783J89940R0940b1767D8965K11311c0520C58813j56252
17388B02561K86903b86306A07687L13263k7084F8443J52076L2439l2931J14665
17378C34692d8397C09597I5988J91237E9291q478L76429m7234k7941j41755K29315
17367D39627j27166j8545M8605M816q6598F7353K05622A35469M4961m0325k7622
17356A12483J64953J73915q9688A46205M72557B62529J09785M23502B21226e1036
17345C70561A23481K8268J82371A26043J66459M8944m9485N2316L2929j48639
17335B28567K59413I8274L07257J5615j04825f882B65238k371E9489J84613K3169
$$ plain form
17324 267271 429701 -19464 56911 402698 20526 165363 327031 15858 -131117 -36238
17313 -49811 378225 112639 210419 32595 140000 168550 227851 464140 444358 311516 192511
17302 192511 90804 234522 227944 247199 473355 241606 186717 137800 93415 135837 349382
17291 349382 466764 444222 323502 184208 86927 273062 138245 332705 597035 539779
17281 539779 76675 428400 428849 341229 547958 405850 391729 327215 557584 230426 233568
17270 233568 54004 151338 94397 667966 254948 362827 376505 381559 308423 332787 351041
17259 351041 248661 288972 487237 537087 227359 259656 231573 399960 76135 354983
17249 354983 521020 490523 412436 374495 282908 -17089 532830 117937 623774 277771
$$ packed form
17324B67271J62430a9464E6911L45787B0526J44837J61668A5858a31117c6238
17313d9811C78225A12639R7780C2595J07405K8550N9301K36289j9782j32842j19005
17302A92511I0804J43718o578J9255K26156k31749n4889m8917m4385M2422K13545
17291C49382J17382k2542j20720j39294H6927J86135j34817J94460K64330n7256
17281E39779G6675L51725M49q7620K06729j42108j4121o4514K30369B30426L142
17270B33568E4004R7334n6941N73569B54948J07879J3678N054p3136K4364J8254
17259C51041j02380M0311J98265M9850B27359L2297k8083J68387G6135K78848
17249C54983J66037l0497p8087l7941r1587a7089E32830A17937N05837B77771
$$ plain form
17238 192765 488656 448353 374679 455323 251995 748273 235495 431717 380556 151151
17227 448390 424154 324967 264769 315471 148468 204773 209757 280874 551841 667007 788320
17216 788320 206911 789775 389679 100839 551568 -3098 703283 210085 112924 297618
17206 297618 311591 492093 369333 497567 189794 414450 300879 552966 656849 591239
17196 591239 264363 334263 372885 318679 175150 610628 575478 266478 144361 427303
17186 427303 437603 265986 491204 355350 250090 258056 608815 347572 405392 331745
17176 331745 700924 181146 373773 518013 567842 452587 621880 579268 574645 474809
17166 474809 541354 527808 369303 285339 471706 417301 452748 503714 582688 570931 553656
$$ packed form
17238A92765K95891m0303p3674Q0644k03328M96278B35495J96222n1161A51151
17227D48390k4236r9187o0198N0702A48468N6305M984P1117K70967J15166J21313
17216G88320B06911N82864C89679A00839M50729c098G03283B10085r7161J84694
17206B97618J3973J80502j22760J28234A89794K24656j13571K52087J03883o5610
17196E91239B64363O9900L8622n4206j43529M35478l5150B66478j22117K82942
17186D27303J0300j71617K25218j35854j05260P966L50759k61243N7820p3647
17176C31745L69179A81146J92627J44240M9829j15255J69293m2612m623r9836
17166D74809O6545j3546j58505q3964J86367n4405L5447N0966P8974j1757j7275
$$ plain form
17155 553656 425441 503544 321865 437491 364451 468151 178077 720269 567567 626591
17145 626591 260929 774587 534526 700481 791241 685971 653231 553620 657862 540327
17135 540327 234814 353848 463200 547675 465056 479225 568096 408756 627098 888354
17125 888354 1009546 557968 758490 729692 588063 783098 606188 483384 703861 250459
17114 -85075 250485 390703 545181 671971 686846 593596 318203 502141 411287 569723
17104 569723 762133 819897 500852 487355 622167 301840 441289 714999 853651 698381
17094 698381 615786 666467 475664 276946 483106 705716 621194 511138 883743 970278
17084 970278 701471 731222 604124 295849 685588 758578 719522 785828 965894 728257
$$ packed form
17155E53656j28215P8103j81679J15626p3040J03700A78077N42192j52702N9024
17145F26591B60929N13658k40061J65955R0760j05270l2740r9611J04242j17535
17135E40327B34814J19034J09352Q4475q2619J4169Q8871j59340K18342K61256
17125H88354J21192m51578K00522k8798j41629J95035j76910j22804K20477B50459
17114h5075B50485J40218J54478J26790J4875r3250k75393J83938r0854J58436
17104E69723J92410N7764l19045j3497J34812C01840J39449K73710J38652j55270
17094F98381q2595N0681j90803j98718K06160K22610q4522j10056L72605Q6535
17084I70278k68807K9751j27098B95849L89739P2990l9056O6306J80066k37637
$$ plain form
17074 728257 830209 734375 452788 930790 843048 885083 795997 805481 739137 731986 780442
17063 780442 906789 616816 780388 458324 476059 577710 671710 669898 687015 929364
17053 929364 882589 789182 784670 796646 318703 988212 708810 669197 546853 729776 843783
17042 843783 908046 968282 645161 798979 795569 834218 883676 857900 732328 876937 757228
17031 757228 882091 948313 1284068 1256287 1335888 756480 987506 812237 1189381 822521
17021 822521 1183747 884617 1171356 1147341 1195259 917786 884391 1025745 1090315 1249733
17011 1249733 919854 1235377 1148688 1324223 463647 1363486 1028774 950538 1064970 1091412
17001 1091412 1160431 1279431 1230231 818292 1119521 1067238 1024183 1369865 795918 1207143
$$ packed form
17074G28257J01952r5834k81587M78002q7742M2035q9086R484o6344p151M8456
17063G80442J26347k89973J63572l22064J7735J01651R4000j812J7117K42349
17053I29364m6775r3407m512J1976C18703O69509k79402l9613j22344J82923J14007
17042H43783O4263O0236l23121J53818l410L8649M9458k5776j25572J44609j19709
17031G57228J24863O6222L35755k7781P9601n79408K31026j75269L77144l66860
17021H22521L61226k99130K86739k4015M7918k77473l3395J41354O4570J59418
17011A249733l29879L15523q6689J75535D63647Q99839l34712p8236J14432K6442
17001A091412O9019J19000m9200m11939L01229n2283m3055L45682n73947M11225
$$ plain form
16991 1207143 1602857 1243206 1062603 1306134 1353186 1331910 967323 1519829 1226822 1424817
16981 1424817 829291 1430380 1332652 1497297 1396393 1198664 1216305 1574112 1559070 1340835
16971 1340835 1365135 1048836 1666526 1856915 1695847 1493634 1477642 1234913 1670736 1300675
16961 1300675 1376450 1753417 1492297 1628044 1560250 1739832 1464855 1556844 1254984 1949813
16951 1949813 1824050 1689940 1820067 2020242 1688286 1760880 1801567 1988859 1894367 1722326
16941 1722326 1617115 1868863 1950295 1892571 1785156 1821980 1750431 1854064 2097859 1955881
16931 1955881 1916517 1955850 2086569 2116848 1775334 1954324 2379105 2217172 2491506 2067922
16921 2067922 2021054 2217091 2230134 2333045 2521993 2638589 2609886 2479340 2515923 2446492
$$ packed form
16991A207143L95714l59651j80603K43531M7052k1276l64587N52506k93007J97995
16981A424817n95526O01089r7728J64645j00904j97729J7641L57807j5042k18235
16971A340835K4300l16299O17690J90389j61068k02213j5992k42729M35823l70061
16961A300675P5775L76967k61120J35747o7794J79582k74977R1989l01860O94829
16951A949813j25763j34110J30127K00175l31956P2594M0687J87292r4492j72041
16941A722326j05211K51748Q1432n7724j07415L6824p1549J03633K43795j41978
16931A955881l9364L9333J30719L0279l41514J78990M24781j61933K74334m23584
16921B067922m6868J96037J3043J02911J88948J16596k8703j30546L6583o9431
$$ plain form
16911 2446492 2685712 2559239 2331854 2905817 2611056 2623743 2489763 2524425 2540847 2341518
16901 2341518 2844170 2591555 3093792 2733881 2997309 2898131 3239806 3027420 2893019 2894147
16891 2894147 2951181 3042116 3250166 2961226 3280095 3318927 3095288 3110383 3619886 3447062
16881 3447062 3235877 3486693 3566246 3288363 3438358 4005589 3612337 3871972 3626858 4095454
16871 4095454 4269177 3951624 3789930 4053278 4133909 3863293 4114445 4168071 4346808 4548691
16861 4548691 4625520 4632898 4712713 4527922 4954571 4809153 4837984 4699687 4872645 4978197
16851 4978197 5086640 5178795 5432797 5347257 5431185 5244042 5553176 5620652 5859960 5724458
16841 5724458 5560367 6005321 6141833 6139149 6249949 6722952 6185527 6629270 6507069 6408106
$$ packed form
16911B446492K39220j26473k27385N73963k94761J2687j33980L4662J6422j99329
16901B341518N02652k52615N02237l59911K63428r9178L41675k12386j34401J128
16891B894147N7034R0935K08050k88940L18869L8832k23639J5095N09503j72824
16881C447062k11185K50816P9553k77883J49995N67231l93252K59635k45114M68596
16871D095454J73723l17553j61694K63348Q0631k70616K51152N3626J78737K01883
16861D548691P6829P378P9815j84791M26649j45418K8831j38297J72958J05552
16851D978197J08443R2155K54002q5540Q3928j87143L09134O7476K39308j35502
16841E724458j64091M44954J36512k684J10800M73003n37425M43743j22201r8963
$$ plain form
16831 6408106 6837614 6928169 7007310 7231293 7503339 7644030 7616464 7837914 7915887 8333504
16821 8333504 7978303 8716705 8524246 8528845 8995849 9037487 9032909 9501656 9401591 9824350
16811 9824350 10003005 10324187 9837707 10695647 10799034 10973155 11001537 11202008 11777570 11840826
16801 11840826 12166898 12403225 12582126 12832547 13537030 13426103 14042691 13991909 14576643
16792 14576643 14977067 15041986 15689358 16200726 16342652 16823376 17272621 17824261 18197345
16783 18197345 18752229 19368831 19836169 20558780 20996415 21741070 22518258 22632101 23658413
16774 23658413 24544921 24903246 26090180 26658364 27637291 28179552 29243875 30111756 31523374
16765 31523374 32337696 33246196 34057620 35468352 36661319 38180317 39690424 40815420
$$ packed form
16831F408106M29508R0555P9141K23983K72046J40691k7566K21450P7973M17617
16821H333504l55201P38402j92459M599M67004M1638m578M68747j00065M22759
16811I824350J78655L21182m86480Q57940J03387J74121K8382K00471N75562O3256
16801A1840826L26072K36327J78901K50421P04483j10927O16588n0782N84734
16792A4576643M00424O4919O47372N11368J41926M80724M49245N51640L73084
16783A8197345N54884O16602M67338P22611M37635P44655P77188J13843J026312
16774B3658413Q86508L58325J186934N68184R78927N42261J064323Q67881J411618
16765C1523374Q14322R08500Q11424J410732J192967J518998J510107J124996
$$ plain form
16757 40815420 42230668 43594258 45424188 47307028 48791382 50665743 52646899 54685338
16749 54685338 56839963 58756003 61218783 63617075 66244187 68787762 71250301 74308636
16741 74308636 77317999 79764192 83144921 85838340 89202177 92370379 96055235 99008645
16733 99008645 102279430 105548462 108359359 111581900 114774628 117035940 120066195 122417290
16725 122417290 124402596 126323476 127853002 128995003 130029487 130332088 130246794 130064384
16717 130064384 129088654 128393379 126855464 125262205 123211312 120951783 118205271 115369608
16709 115369608 112367341 109276261 106406145 102919192 99914778 96675770 93092944 89717151
16701 89717151 86816984 83637120 80445611 77299407 74745978 71480441 69245075 66356580
$$ packed form
16757D0815420J415248J363590J829930J882840J484354J874361J981156K038439
16749E4685338K154625J916040K462780K398292K627112K543575K462539L058335
16741G4308636L009363K446193L380729K693419L363837L168202L684856K953410
16733I9008645L270785L269032K810897L222541L192728K261312L030255K351095
16725A22417290J985306J920880J529526J142001J034484L02601q5294j82410
16717A30064384r75730o95275j537915j593259k050893k259529k746512k835663
16709A15369608l002267l091080k870116l486953l004414l239008l582826l375793
16701H9717151k900167l179864l191509l146204k553429l265537k235366k888495
$$ plain form
16693 66356580 63758651 61136078 59310018 56720838 54515013 52541041 50434433 48714065
16685 48714065 46914890 44989709 43257908 41866267 40539038 38961623 37216824 35982286
16677 35982286 34725360 33539578 32627347 31519084 30306081 29433653 28421368 27141355
16669 27141355 26650351 25687290 24988156 24145817 23838046 22660763 22186633 21075881 20799723
16660 20799723 20034757 19702940 19231416 18220749 18256814 17559883 17346885 16479568 16483767 16054168
16650 16054168 15189116 14864775 14774543 14256520 13764852 13590595 13078171 12894688 12809363 12457804
16640 12457804 12123468 11824860 11387484 11364081 11188378 10796746 10391539 10448544 10226893 10074536
16630 10074536 9820909 9366930 9722229 9009753 8802316 8672943 8554384 8416701 8024654
$$ packed form
16693F6356580k597929k622573j826060k589180k205825j973972k106608j720368
16685D8714065j799175j925181j731801j391641j327229j577415j744799j234538
16677C5982286j256926j185782r12231j108263j213003q72428j012285j280013
16669B7141355m91004r63061o99134q42339l07771j177283m74130j110752k76158
16660B0799723p64966l31817m71524j010667L6065o96931k12998q67317M199m29599
16650A6054168q65052l24341r0232n18023m91668j74257n12424j83483q5325l51559
16640A2457804l34336k98608m37376k3403j75703l91632m05207N7005k21651j52357
16630A0074536k53627m53979L55299p12476k07437j29373j18559j37683l92047
$$ plain form
16621 8024654 7720842 7898337 7493102 7625568 7278561 7338067 7400834 6968439 6874541 6477188
16611 6477188 6248154 6256222 6473412 6401698 6300960 6500393 6206999 5858647 5753349 5846119
16601 5846119 5517293 5371129 5461564 5208745 5391979 4934436 5223989 5109127 4730287 4904314
16591 4904314 4749135 4461507 4385723 4538807 4609174 4530981 4182192 4058290 4002484 4067380
16581 4067380 3910315 4351645 3965833 3859675 3983122 3789940 3675075 3561940 3593626 3554838
16571 3554838 3937717 3539613 3260233 3047231 3594506 2955259 2926693 3147981 3072347 2830968
16561 2830968 3231465 3266906 3130848 2787804 2681206 2975123 2970420 2853017 2556442 2768258
16551 2768258 2202243 2884997 2719978 2797692 2411437 2757604 2623897 2467049 2319301 2476522
$$ packed form
16621H024654l03812J77495m05235J32466l47007N9506O2767m32395r3898l97353
16611F477188k29034Q068K17190p1714j00738J99433k93394l48352j05298R2770
16601E846119l28826j46164R0435k52819J83234m57543K89553j14862l78840J74027
16591D904314j55179k87628p5784J53084P0367p8193l48789j23902n5806O4896
16581D067380j57065M41330l85812j06158J23447j93182j14865j13135L1686l8788
16571C554838L82879l98104k79380k13002N47275o39247k8566K21288p5634k41379
16561B830968M00497L5441j36058l43044j06598K93917m703j17403k96575K11816
16551B768258n66015O82754j65019P7714l86255L46167j33707j56848j47748J57221
$$ plain form
16541 2476522 2333213 2647434 2469259 2099163 2471416 2122527 2431596 2545942 2298582
16532 2298582 2448694 1896196 2162503 2232422 2021580 2092807 2046470 1842310 1930203 1934136
16522 1934136 2105117 2130072 1816437 1866568 2254027 1757681 1498994 1668122 1862902 1603349
16512 1603349 1791577 1635215 1753578 1714935 1474034 1501952 1722836 1505222 1484799 1627811
16502 1627811 1638353 1678914 1506499 1825473 1277793 1784259 1557201 1334027 1315694 1519271
16492 1519271 1614086 968757 1512076 1479954 1495048 1441448 1180512 1046452 1548486 1232639
16482 1232639 1434692 1251540 1610131 1354648 1081999 1432437 1042565 1450725 1537719 1261029
16472 1261029 1343318 1227169 1252810 1565442 1179947 1255722 924675 1246690 1188855 966903
$$ packed form
16541B476522j43309L14221j78175l70096L72253l48889L09069J14346k47360
16532B298582J50112n52498K66307O9919k10842P1227m6337k04160Q7893L933
16522A934136J70981K4955l13635N0131L87459m96346k58687J69128J94780k59553
16512A603349J88228j56362J18363l8643k40901K7918K20884k17614k0423J43012
16502A627811J0542M0561j72415L18974n47680N06466k27058k23174j8333K03577
16492A519271R4815o45329N43319l2122J5094n3600k60936j34060N02034l15847
16482A232639K02053j83152L58591k55483k72649L50438l89872M08160Q6994k76690
16472A261029Q2289j16149K5641L12632l85495P5775l31047L22015n7835k21952
$$ plain form
16462 966903 1242560 1228944 1044038 869156 1068396 902395 1074404 1160262 1235403 1308651
16452 1308651 743663 1247096 1115856 981659 1282199 871035 1022180 1114721 816005 893820
16442 893820 521905 1159993 616391 929935 719236 1063680 804712 1128194 1191050 901708
16432 901708 1045823 1088300 788159 1092161 655026 759873 755509 877724 1173998 600734
16422 600734 1092873 420071 897243 617693 832475 693432 847256 720326 814737 1192483
16412 1192483 596139 892090 806276 886942 1007593 1151501 816148 707232 583123 667530
16402 667530 838049 835286 615222 1033427 938273 710968 889339 627815 890649 901952
16392 901952 377404 827886 590235 582967 638182 497762 506649 427830 538510 505112 527743
$$ packed form
16462I66903K75657j3616j84906j74882J99240j66001J72009Q5858P5141P3248
16452A308651n64988N03433j31240j34197L00540m11164J51145R2541k98716P7815
16442H93820l71915O38088n43602L13544k10699L44444k58968L23482O2856k89342
16432I01708J44115M2477l00141L04002m37135J04847m364J22215K96274n73264
16422F00734M92139D20071M77172k79550K14782j39043J53824j26930R4411L77746
16412A192483E96139K95951q5814Q0666J20651J43908l35353j08916j24109Q4407
16402F67530J70519k763k20064M18205r5154k27305J78371k61524K62834J1303
16392I01952C77404M50482k37651p268N5215j40420Q887p8819J10680l3398K2631
$$ plain form
16381 527743 656212 466465 434680 209735 602809 879717 680037 652029 279285 595519
16371 595519 582116 520326 453371 645101 510241 645552 331440 258630 473106 614563
16361 614563 741652 680825 889892 279802 789348 690674 776846 310176 443814 637540
16351 637540 304392 529467 642525 551914 432541 418363 318540 275866 387210 514397
16341 514397 -33758 491441 548221 227361 271022 211528 384436 436505 340957 593271 387113
16330 387113 546767 567684 436595 376309 535127 452326 321831 359203 404292 -20949 329243
16318 574155 442682 719232 397305 24485 591927 459794 893307 492325 261324 367846
16308 367846 291501 539676 366563 584785 660734 422487 311365 349679 409412 264328
$$ packed form
16381E27743J28469j89747l1785B09735L93074K76908j99680k8008B79285L16234
16371E95519j3403o1790o6955J91730j34860J35311l14112p2810K14476J41457
16361F14563J27089o0827K09067B79802N09546r8674Q6172C10176J33638J93726
16351F37540C04392K25075J13058r0611j19373j4178r9823m2674J11344J27187
16341E14397c3758D91441N6780B27361M3661n9494J72908N2069r5548K52314k06158
16330C87113J59654K0917j31089o0286J58818q2801j30495L7372M5089b0949C29243
16318E74155j31473K76550l21927B4485N67442j32133M33513m00982k31001J06522
16308C67846p6345K48175j73113K18222P5949k38247j11122L8314N9733j45084
$$ plain form
16298 264328 -42935 111019 193207 539199 294379 377227 529523 420308 357239 523547
16288 523547 229475 361806 34829 415166 300245 684695 -6648 485678 438770 812274
16278 812274 264296 447213 -62144 319542 343063 203797 155431 393670 441328 391784
16268 391784 -105718 -58127 121710 312650 239988 380039 233383 -23342 -122268 108577
16257 453980 263598 59827 148240 387408 611436 208200 233121 224851 -83182 275374 23896
16245 392457 157400 141786 246619 91101 -175512 447345 -168471 419848 311872 430835
16235 430835 396878 429845 150444 349940 6496 515825 388471 224207 50683 307878
16225 307878 146364 38779 274069 117121 404852 432996 13932 393906 322669 251435
$$ packed form
16298B64328d2935A11019Q2188L45992k44820Q2848J52296j09215o3069J66308
16288E23547B29475J32331C4829L80337j14921L84450f648D85678m6908L73504
16278H12274B64296J82917f2144C19542K3521j39266m8366K38239M7658m9544
16268C91784a05718M7591A21710J90940p2662J40051j46656b3342r8926A08577
16257D53980j90382E9827Q8413K39168K24028B08200K4921q270h3182B75374B3896
16245C92457A57400j5614J04833I1101a75512D47345a68471D19848j07976J18963
16235D30835l3957L2967A50444J99496F496N09329j27354j64264E0683K57195
16225C07878A46364C8779K35290A17121K87731K8144A3932L79974p1237p1234
$$ plain form
16215 251435 119407 324355 -200553 40912 78553 156634 255744 150717 67756 187116
16205 187116 -36808 107127 9248 14448 110071 463283 277078 217917 -141539 204071 -77072
16193 286920 216920 234402 314879 253660 34566 214898 239033 183188 95268 383217 96783
16181 100002 221243 172569 -28457 305841 -124735 99376 220097 100018 21819 311260
16171 311260 40354 91654 216905 307408 -116097 -16359 145365 153053 187462 217902 90273
16159 255681 258006 -33126 208878 206489 -65103 335174 -35201 216373 61021 220812 303077
16148 303077 -184045 315990 369864 -137594 213347 185050 26822 325247 253826 -49251
16137 54180 -1564 234387 -22327 -117691 -238142 -45423 -97409 252135 -95610 232175 -88007
$$ packed form
16215B51435A19407K04948b00553D0912L7641P8081R9110j05027F7756J19360
16205A87116c6808A07127I248N200R5623L53212j86205n9161a41539B04071g7072
16193B86920p0000J7482Q0477o1219C4566J80332K4135n5845q7920K87949I6783
16181A00002J21241m8674b8457C05841a24735I9376J20721A00018B1819K89441
16171C11260D0354N1300J25251R0503a16097a6359A45365P688L4409L0440I0273
16159B55681K325c3126B08878k389f5103C35174c5201B16373F1021J59791Q2265
16148C03077a84045C15990N3874a37594B13347k8297B6822K98425p1421d9251
16137E4180a564B34387b2327r5364j20451d5423n1986B52135i5610B32175h8007
$$ plain form
16125 281206 90099 -234997 -7220 134125 -95610 -130965 141118 42846 256365 216535 200005
16114 200005 93072 186971 17394 16847 -247789 186129 158092 262323 8115 -146411 201592
16102 -1688 -40008 -1084 252898 198234 60002 -89903 -26627 498018 66268 2412 411011 30613
16089 -383942 55194 175213 33007 35888 257438 -67767 160129 -141985 -219478 -122862 114621
16077 -2236 1367 352716 -168329 9327 35821 86831 133927 29969 -67179 -329070 104306
16065 111080 182416 -15090 10563 -11371 105794 315403 28890 300066 -51319 -175995 85483
16053 80773 -140927 -116411 -144060 71429 280464 -56536 119402 -196474 62444 -59145 136401
16041 147758 -179290 209785 82583 246823 178023 672 -110569 70939 -286606 241778 13276
$$ packed form
16125B81206I0099b34997g220A34125i5610l5355A41118D2846K13519l9830j6530
16114B00005I3072R3899A7394n47b47789A86129k8037J04231H115a46411B01592
16102a688l8320a084B52898n4664F0002h9903b6627D98018F6268B412M08599C0613
16089c83942E5194J20019C3007K881K21550f7767A60129a41985p7493R6616A14621
16077b236A367L51349a68329I327K6494N1010M7096B9969f7179k61891A04306
16065A11080P1336a5090A0563a1371A05794K09609B8890K71176e1319j24676H5483
16053H0773a40927K4516k7649G1429K09035e6536A19402a96474F2444e9145A36401
16041A47758a79290B09785H2583J64240o8800F72a10569G0939b86606B41778A3276
$$ plain form
16029 318074 40886 -107153 -163380 310179 -142249 305304 -108630 -149722 -246318 156440
16018 -107126 -22981 -56798 76712 255516 -267163 22205 -132468 -57673 -140445 -24279 4728
16006 70878 -337448 -80458 116412 141282 162700 236296 89508 138848 38930 -210958 63348
15994 -180698 30166 79874 130523 15593 141108 248644 460116 640240 901914 998086
15984 998086 1475187 1454821 993071 657822 321060 208232 267279 36024 -70639 -25737
15973 -217524 -160132 -183780 -36264 -142505 -16150 -129547 193639 -73222 -185433 112883
15962 -325640 7585 2716 -130671 117660 40371 -83348 -107165 140146 -16500 -24812 364824
15950 -57619 36662 82442 -132271 28540 -170109 7140 59209 -264871 114827 116059 -122630
$$ packed form
16029C18074D0886a07153n6227C10179a42249C05304a08630m1092r6596A56440
16018a07126b2981l3817G6712J78804b67163B2205a32468e7673q2772b4279D728
16006G0878c37448h0458A16412K4870K1418P3596H9508M9340C8930b10958F3348
15994a80698C0166M9708N0649A5593J25515J07536K11472J80124K61674R6172
15984I98086M77101k0366m61750l35249C21060j12828N9047C6024g0639b5737
15973b17524N7392k3648c6264j06241a6150j13397A93639g3222j12211A12883
15962c25640G585B716a30671A17660D0371h3348k3817A40146a6500q312C64824
15950e7619C6662M5780a32271B8540a70109G140N2069b64871A14827J232a22630
$$ plain form
15938 -398922 178763 142131 -111631 155996 -261443 -22846 23166 -45860 281319 143397
15928 143397 -34066 -153005 208654 -158896 168774 -158711 62461 -97625 241950 -83827
15917 223123 61695 191360 -159560 -185131 -272666 -57807 143004 -240700 56303 -109488
15906 98231 -271233 -131149 -242929 4277 -242023 174574 -106980 229974 7003 506781
15896 506781 7480 193411 128990 -40457 10626 121334 -147925 145303 -250052 266795
15885 64116 -151370 -294926 -240554 -85376 -438267 -101254 -18952 76536 45542 161983 -15794
15873 -184281 -115174 -166358 -98886 -21889 -83402 -20417 -47782 -66 -85348 -115502 313816 -65176
15860 39859 19080 -78912 -460577 -135270 177927 -258347 2906 -149419 137416 -189410
$$ packed form
15938c98922A78763l6632a11631A55996b61443b2846B3166d5860B81319j37922
15928A43397c4066j18939B08654a58896A68774a58711F2461i7625B41950h3827
15917B23123F1695J29665a59560k5571q7535e7807A43004b40700E6303a09488
15906I8231b71233a31149j11780D277b42023A74574a06980B29974G003M99778
15896E06781G480J85931o4421d0457A0626J10708a47925A45303b50052B66795
15885F4116a51370j43556N4372h5376l52891a01254a8952G6536l0994J16441a5794
15873a84281O9107n1184O7472b1889o1513b0417k7365f6q5282l0154C13816f5176
15860C9859A9080g8912l81665a35270A77927b58347B906a49419A37416a89410
$$ plain form
15849 68724 -143099 -41500 -194422 -205723 -55469 65617 -120556 -152698 -221317 51064 -240625
15837 -334994 136492 147696 -67918 -45801 -44677 53605 122819 54401 133729 80040 -87092
15825 114969 -390624 40674 -366538 36959 -88347 -20091 -79575 148956 196654 -154787 -177489
15814 -177489 282999 -43607 97825 -6799 -123387 -203438 -208851 26978 103306 89282 -55066
15802 -44012 133606 89688 -163466 63302 13334 20666 175916 112680 116930 -7736 -76728 -60343
15790 -60343 19778 17881 -97268 9947 -339197 45954 -125819 -250363 -43143 -250554 -34057
15778 -98964 -271088 -114171 159356 50915 32738 6582 -300535 336736 -367979 -198478
15768 -198478 93782 -150627 -153104 -142239 114855 50757 -259239 -82740 -136553 -21954 131895
$$ packed form
15849F8724a43099d1500j52922j1301e5469F5617a20556l2142o8619E1064b40625
15837c34994A36492J1204f7918K2117J124E3605O9214E4401P9328n3689h7092
15825A14969c90624D0674c66538C6959h8347b0091n9484A48956M7698a54787k2702
15814a77489B82999d3607I7825f799j16588q0051n413B6978P6328j4024e5066
15802d4012A33606m3918a63466F3302A3334P332J55250o3236M250g736o8992J6385
15790f0343A9778j897i7268I947c39197D5954a25819j24544d3143k07411c4057
15778i8964j72124a14171A59356E0915j8177F582c00535C36736c67979J69501
15768a98478I3782a50627k477J0865A14855E0757b59239h2740n3813b1954A31895
$$ plain form
15756 -194081 30810 21040 -162406 254503 130033 439290 -105812 -145342 146868 -418172
15745 -52437 -211762 -118224 241743 -97192 190616 44026 -86057 87190 82994 -139508 -339604
15734 -339604 59132 35265 -1917 -36455 -140201 -220670 -61145 -30814 7800 -234742 116460
15722 -93854 -317208 133989 6125 396944 -419389 3015 32234 -161686 344740 -26140 -285889
15711 -285889 -287503 221891 -122533 -194880 129193 -278357 -63393 -22234 -62013 -88240 -485669
15700 -485669 -72160 -17413 296686 88617 -148749 208309 16151 236319 12203 46750 -175337
15688 -58086 -113291 60979 37431 -322156 45858 -121086 270686 -120728 -89880 -187934 -54113
15676 -285397 267791 48739 20954 -197771 -96505 63277 387267 -84438 -4400 349606 -204008
$$ packed form
15756a94081C0810r770a62406B54503j24470L09257a05812l9530A46868d18172
15745e2437j59325R3538B41743i7192A90616D4026h6057H7190m196a39508k00096
15734c39604E9132k3867a917l4538j03746q0469f1145L0331G800b34742A16460
15722i3854k23354A33989F125L90819d19389C015K9219a61686C44740b6140k59749
15711b85889j614B21891a22533p2347A29193b78357f3393b2234l9779k6227l97429
15700d85669g2160a7413B96686H8617a48749B08309A6151K20168A2203L4547a75337
15688e8086n5205F0979k3548c22156D5858a21086B70686a20728L0848r8054e4113
15676b85397B67791D8739B0954a97771i6505F3277L23990h4438d400C49606b04008
$$ plain form
15664 57715 281876 78289 4858 49283 -240232 458208 -291916 -227243 -110351 -214311 67843
15652 -59249 -208782 -261368 -103392 -68340 186852 -31831 65421 224540 162843 10947 -81375
15640 -88882 220684 -206816 -62470 -186140 23579 -143027 -25918 -250134 -508072 -19729
15629 -15973 -204627 149663 105641 135187 6042 -20284 287032 173949 -116104 -169619 -85328
15618 -85328 -300768 289989 64297 -287694 234494 65820 193564 95129 -108919 159272
15607 50871 29839 -41814 -364409 -207129 -368244 -20341 -333231 -273146 -101150 -58801 -68221
15596 -68221 266509 -276079 -77841 -79465 -60921 -203602 46132 -109024 467362 156971 -225704
15584 -204301 129667 -356876 16578 7492 -37557 -259410 -156992 -49557 165418 38338 422288
$$ packed form
15664E7715K24161G8289D858M4425b40232D58208b91916O4673a10351j03960F7843
15652e9249j49533n2586a03392L5052A86852c1831F5421J59119o1697A0947h1375
15640h8882B20684b06816f2470j23670B3579a43027b5918k24216k57938a9729
15629a5973j88654A49663m4022K9546F042b0284B87032j13083a16104n3515Q4291
15618h5328k15440B89989F4297b87694B34494F5820J27744I5129a08919A59272
15607E0871k1032d1814l22595J57280j61115b0341l12890O0085a01150M2349r420
15596f8221B66509b76079g7841j624J8544j42681D6132a09024D67362A56971b25704
15584b04301A29667c56876A6578G492c7557k21853J02418d9557A65418C8338L83950
$$ plain form
15573 422288 -308743 -229961 148928 7035 -25169 -25569 156713 30695 92671 41952 232091
15562 232091 240900 115716 -57577 85383 162510 -31115 -144024 -118783 -59787 95504 -298180
15550 -52077 258680 96012 -62065 66614 54210 92813 82984 -47952 -111353 118322 156389
15539 156389 -46860 40625 -15941 -96023 -178794 -50018 7521 266284 213206 60416 184317
15528 184317 73208 -171354 -130393 -22249 18872 183006 -138374 54987 -230755 105939
15517 -236720 72549 82700 -18089 597177 -97671 284742 113147 -150912 25037 168642
15507 168642 197175 -5281 274113 83986 341144 -28962 164263 -50714 11297 368842 184008
15495 247565 319717 68204 40060 97624 -165658 379117 86742 120015 269543 -66988 192297
$$ packed form
15573D22288c08743P8782A48928G035b5169m00A56713C0695O1976D1952J90139
15562B32091Q809A15716e7577H5383P7127c1115j12909K5241N8996I5504b98180
15550e2077B58680I6012f2065F6614j2404L8603r829d7952o3401A18322L8067
15539A56389d6860D0625a5941q0082q2771e0018G521K58763n3078F0416J23901
15528A84317G3208a71354M0961b2249A8872J64134a38374E4987b30755A05939
15517b36720G2549J0151a8089E97177i7671B84742A13147a50912B5037J43605
15507A68642K8533e281B74113H3986K57158b8962A64263e0714A1297L57545A84008
15495B47565P2152F8204k8144N7564a65658C79117H6742L3273J49528f6988A92297
$$ plain form
15483 166394 305675 -90524 -81820 97009 186690 38578 -78756 254710 248882 224333 790138
15472 790138 817667 937055 478667 -185862 -140266 78418 95924 -93041 -72506 61841 -55225
15460 205223 205424 -115791 -39740 72035 26388 160064 50664 47672 377981 -433909 -34711
15448 95031 35229 108103 116727 161599 -36588 111931 465535 656263 1062993 1131363 1253940
15437 1253940 708804 609776 470347 184974 -15074 138261 -190314 -68254 10274 115705
15427 115705 -175237 205520 247529 -292482 150616 -11219 -102807 -14673 -418793 -164174
15416 -222425 138219 106243 -236034 337679 -71242 -93 31338 -113450 182785 -48387 170366
15404 -212399 -184086 51066 175195 -234868 -33304 -5511 78533 130888 -40060 183921 214854
$$ packed form
15483A66394J39281i0524Q704I7009Q9681C8578g8756B54710n828k4549N65805
15472G90138K7529J19388m58388a85862M5596G8418J7506i3041K0535F1841e5225
15460B05223K01a15791c9740G2035B6388J33676E0664k992L30309d33909c4711
15448I5031C5229P2874Q624M4872c6588A11931L53604J90728M06730O8370J22577
15437A253940n45136r9028j39429A84974a5074A38261a90314f8254A0274J05431
15427A15705a75237B05520M2009b92482A50616a1219r1588a4673m04120a64174
15416b22425A38219l1976b36034C37679g1242i3C1338a13450A82785d8387A70366
15404b12399K8313E1066J24129b34868c3304e511G8533N2355d0060A83921L0933
$$ plain form
15393 214854 169934 -279637 34053 192242 -1210 -50882 26450 -21628 -121798 -155004 -86923
15382 -86923 -1849 -88571 -151556 -1159 -220428 -220000 200295 -41793 219653 86779 -64911 155537
15369 283418 241857 547207 433777 -69787 305236 129333 282826 253142 180388 -5269 -5538
15358 -5538 254324 120374 170989 99613 110764 5234 -99357 159009 -139277 -25523 349797
15346 131049 237710 128865 92332 388792 -29974 417093 180720 385533 168859 95609
15336 95609 282830 143154 -25705 90217 -69751 197205 53289 516910 -15798 279142 41918
15324 189315 103590 61683 79390 118232 -189081 64823 112330 -57584 409846 223069 104926
15312 -1405 233668 -300675 -204036 183321 162374 180464 158006 78333 443873 290266 115381
$$ packed form
15393B14854m4920b79637C4053J58189a210m9672B6450b1628j00170l3206O8081
15382h6923a849q6722o2985a159k19269M28B00295d1793B19653H6779f4911A55537
15369B83418m1561L05350j13430f9787C05236A29333J53493k9684p2754e269k69
15358e538B54324A20374N0615p1376J1151E234i9357A59009a39277b5523C49797
15346A31049J06661j08845l6533K96460b9974D17093A80720K04813A68859p3250
15336I5609J87221j39676b5705I0217f9751A97205E3289M63621a5798B79142D1918
15324A89315q5725m1907J7707L8842a89081F4823M7507e7584D09846j86777A04926
15312a405B33668c00675R6639A83321k0947J8090k2458G8333L65540j53607A15381
$$ plain form
15300 -1777 145228 236 -239518 -189912 25312 125422 303028 43117 -125295 -105358 19637
15288 -48340 175981 102019 150241 50913 -113149 -81616 154484 -183135 150079 70375 -131681
15276 377824 -323664 242339 139372 -247892 -417109 -117773 178891 237441 -190564 313246
15265 -89050 -84482 120478 -4723 241929 151136 -49885 -242442 94034 244129 89367 -157326
15253 60879 473887 -246776 -106802 -320028 -34757 120404 259879 369809 91815 456181
15243 456181 483750 1002010 2261633 1165123 2021716 1471498 513330 255224 354111 -71085
15232 160384 -216438 -337553 -398216 434423 -2220 34066 -256655 -52065 206513 15333 -89522
15220 -65846 11985 -84208 45941 -173883 -61001 200780 537614 -114400 -139012 78896 167589
$$ packed form
15300a777A45228B36b39518M9606B5312J00110J77606D3117a25295J9937A9637
15288d8340A75981p3962M8222E0913a13149L1533A54484a83135A50079G0375a31681
15276C77824c23664B42339j02967b47892j69217a17773A78891N8550a90564C13246
15265h9050M568A20478d723B41929r0793d9885j92557I4034J50095H9367a57326
15253F0879M13008b46776a06802k13226c4757A20404J39475J09930I1815L64366
15243D56181K7569N18260J259623j096510Q56593n50218E13330B55224R8887g1085
15232A60384b16438j21115o0663D34423b220C4066b56655e2065B06513A5333h9522
15220f5846A1985h4208D5941a73883f1001B00780L36834a14400k4612G8896Q8693
$$ plain form
15209 167589 136337 -27767 52010 178355 160877 250816 -43215 167680 -21500 153484 67260
15197 409040 212703 90939 -225375 35226 127777 100255 303493 348345 -91260 -106874 93064
15185 147179 292787 237898 5124 15044 79144 94205 172348 -98096 -108115 126623 -259646
15173 -111620 492954 -73279 362160 236634 473915 194183 -96124 156721 321245 -104250
15162 -29595 -67568 265424 -130633 191011 3579 -105785 129720 37600 201057 107610 40343
15150 275083 166591 227108 125550 313719 387578 182213 -185446 179309 50250 158854
15140 158854 173589 115423 -46041 -127547 152251 -307112 -62043 10767 140803 -14543 -151512
15129 -151512 138530 -33726 -86282 -2628 237638 374228 198050 343759 73406 128066 556523
$$ packed form
15209A67589l1252b7767E2010J26345j7478Q9939d3215A67680b1500A53484F7260
15197D09040j96337I0939b25375C5226R2551k7522K03238M4852i1260j5614I3064
15185A47179J45608n4889E124R920O4100J5061P8143i8096j0019A26623b59646
15173a11620D92954g3279C62160j25526K37281A94183i6124A56721J64524a04250
15162b9595l7973B65424a30633A91011C579a05785A29720C7600J63457r3447D0343
15150B75083j08492O0517j01558J88169P3859A82213a85446A79309E0250J08604
15140A58854J4735n8166d6041q1506A52251c07112f2043A0767J30036a4543j36969
15129a51512A38530c3726n2556b628B37638J36590j76178J45709G3406N4660M28457
$$ plain form
15118 556523 373786 251971 50645 129804 439074 -7236 29167 353773 213608 89809 256890
15107 256890 196205 -186403 -137590 -122936 48878 169864 538615 31257 98200 -186817 -2887
15095 40520 109270 -104071 474432 -34550 71238 -142343 285687 178405 183490 188469 173136
15084 173136 -133719 204853 372941 293734 276402 -96041 -10858 333630 357003 -117711
15073 167664 366547 1678 178879 278189 158442 -128913 288922 -156816 393749 299069
15063 299069 98746 174042 -40505 338896 133721 203762 25526 315676 295864 -18076 357655
15051 347086 207667 176562 217457 340877 365438 249085 75249 184228 341015 323524
15041 323524 259735 -25075 28888 506974 143816 48627 333938 458252 198618 334582
$$ packed form
15118E56523j82737j21815E0645P9159L09270g236B9167L24606j40165H9809J67081
15107B56890o0685a86403M8813J4654D8878J20986L68751C1257O6943a86817b887
15095D0520O8750a04071D74432c4550G1238a42343B85687j07282N085M979j5333
15084A73136a33719B04853J68088p9207j7332i6041a0858C33630K3373a17711
15073A67664J98883A678J77201R9310j19747a28913B88922a56816C93749r4680
15063B99069I8746P5296d0505C38896A33721P0041B5526K90150j9812a8076C57655
15051C47086j39419l1105M0895J23420K4561j16353G5249J08979J56787j7491
15041C23524o3789b5075B8888M78086A43816D8627K85311J24314A98618J35964
$$ plain form
15031 334582 495325 597497 674582 962273 839512 671071 782912 390926 143988 308044
15021 308044 636059 441596 559579 567997 515837 528342 387686 204651 303913 141609
15010 262569 537000 504459 357440 442165 237116 322957 304614 499744 125556 291449
15000 291449 578114 514039 540170 305302 523433 428013 636243 346982 618608 318370
14990 318370 597583 214083 347285 759345 540685 327838 452735 561236 727011 446700
14980 446700 826668 661477 884586 791263 606716 441403 556598 543919 671856 632787
14970 632787 636642 471724 586060 252741 405019 414026 632824 499185 353947 444699
14960 444699 343962 10508 565508 548590 413436 618355 458282 393562 91368 447567
$$ packed form
15031C34582J60743J02172P7085K87691j22761j68441J11841C90926A43988J64056
15021C08044L28015j94463J17983Q418n2160J2505j40656j83035R9262A41609
15010B62569K74431l2541j47019Q4725k05049Q5841j8343J95130A25556J65893
15000B91449K86665o4075K6131k34868K18131r5420K08230k89261K71626l00238
14990C18370K79213B14083J33202M12060k18660k12847J24897J08501J65775k80311
14980D46700L79968j65191K23109r3323j84547j65313J15195j2679J27937l9069
14970F32787L855j64918J14336B52741J52278R007K18798j33639j45238R0752
14960D44699j00737A0508N55000j6918j35154K04919j60073o4720I1368L56199
$$ plain form
14950 447567 485283 556202 211718 391172 359949 452690 329203 281748 925859 811778
14940 811778 686564 387133 592638 270006 241104 559215 449640 556788 443186 637712
14930 637712 994147 1203491 940119 1387894 895438 1505599 1570902 2082773 1583283 1628144
14920 1628144 1521786 1365523 1689321 1759056 2265048 2541858 2396421 1989245 1393030 1600886
14910 1600886 1184662 1055463 426482 597029 497760 383053 261930 446806 269603 716618
14900 716618 291208 531472 366850 175158 266195 224491 497694 478638 486599 669452
14890 669452 629607 203198 377334 693233 692883 454450 485325 724185 728248 832484 514974
14879 514974 528295 1079215 563073 1184122 472738 377575 603840 553893 387018 407769
$$ packed form
14950D47567L7716P0919B11718J79454l1223R2741j23487m7455O44111j14081
14940H11778j25214k99431K05505B70006k8902L18111j09575J07148j13602J94526
14930F37712L56435K09344k63372M47775m92456O10161O5303N11871m99490M4861
14920A628144j06358j56263L23798O9735N05992K76810j45437m07176n96215K07856
14910A600886m16224j29199D26482J70547r9269j14707j21123J84876j77203M47015
14900G16618B91208K40264j64622A75158R1037m1704K73203j9056P961J82853
14890F69452l9845B03198J74136L15899l50k38433L0875K38860M063J04236l17510
14879E14974J3321N50920n16142O21049D72738r5163K26265m9947j66875K0751
$$ plain form
14869 407769 445872 645060 632004 756734 763140 839780 879371 676507 780143 354154 -140905
14857 100494 515511 206776 341714 383092 699237 228942 512879 641147 294543 54879
14846 680222 664118 427502 691474 875200 861469 1219036 1218986 1322916 1459546 1099609 986874
14835 986874 557412 788826 1020286 818420 565533 531219 597574 710971 381894 354230
14825 354230 699741 400202 517378 743687 867615 833264 626431 703795 681133 857425
14815 857425 947603 669413 544453 736623 733973 711267 715939 763920 464113 713059 898114
14804 898114 1115189 895892 1040208 606144 699770 786113 813632 314572 613071 622558
14794 622558 381439 440995 549270 481853 837989 639146 542315 542168 370066 737546 685937
$$ packed form
14869D07769L8103J99188j3056J24730O406P6640L9591k02864J03636C54154a40905
14857A00494M15017B06776J34938M1378L16145B28942K83937J28268B94543E4879
14846F80222j6104k36616K63972J83726j3731L57567n0J03930J36630l59937j12735
14835I86874m29462K31414K31460k01866k52887l4314O6355J13397l29077k7664
14825C54230L45511k99539J17176K26309J23928l4351k06833P7364k2662J76292
14815H57425R0178k78190j24960J92170k650k2706M672M7981k99807K48946J85055
14804H98114K17075k19297J44316m34064R3626Q6343K7519C14572K98499R487
14794F22558k41119N9556J08275o7417L56136j98843r6831j47j72102L67480n1609
$$ plain form
14783 685937 724437 755178 580978 692551 600451 622891 682158 976028 877964 781260 1069839
14772 1069839 905538 931130 1049324 807363 196662 520795 677542 515144 575789 518964
14762 518964 439437 465826 556766 789691 525263 642998 803355 481051 677661 1015827
14752 1015827 800488 503068 635127 517067 448070 937062 610086 615250 568066 484649
14742 484649 334826 523419 876745 516450 671352 893881 1001082 848131 935216 983607
14732 983607 1086486 876843 956044 1014600 1008215 1658731 1679270 1817903 1797820 1573919 1049132
14721 1049132 938610 836861 1160788 748954 1229588 927711 555372 917455 1054188
14712 1054188 741031 811036 931694 953477 1090144 902549 1434170 991725 1327758 1465794
$$ packed form
14783F85937L8500L0741j74200J11573r2100K2440N9267K93870r8064r6704K88579
14772A069839j64301K5592J18194k41961A96662L24133J56747j62398O0645n6825
14762E18964p9527K6389R0940K32925k64428J17735J60357l22304J96610L38166
14752A015827k15339k97420J32059j18060o8997M88992l26976N164m7184q3417
14742D84649j49823J88593L53326l60295J54902K22529J07201j52951Q7085M8391
14732I83607J02879k09643P9201N8556o385O50516K0539J38633k0083k23901n24787
14721A049132j10522j01749L23927m11834M80634l01877l72339L62083J36733
14712A054188l13157P0005J20658K1783J36667j87595N31621m42445L36033J38036
$$ plain form
14702 1465794 1257254 1577105 2099089 1900477 2206560 1332360 1152671 1187912 1138258 1053212
14692 1053212 1233147 990678 1086019 640097 811031 1064967 521132 1230108 842350 919880
14682 919880 552009 832797 947196 620407 995014 1007387 876824 622902 775260 798671
14672 798671 743633 1009873 1003072 1019207 1198180 947955 694451 971696 864852 1132328
14662 1132328 1110581 1239997 1117348 1283590 1084779 1042405 909758 1336518 833769 1275595
14652 1275595 971829 1563316 1591290 1413381 973103 1123047 1312999 1028230 1276283 890493
14642 890493 1280839 1178733 1283609 1138948 1293650 1183404 1029900 1213602 1150568 1264722
14632 1264722 1511005 1530079 1286763 1003086 1079519 1253532 1272343 972256 937514 1266332
$$ packed form
14702A465794k08540L19851N21984j98612L06083q74200j79689L5241m9654q5046
14692A053212J79935k42469R5341m45922J70934K53936E21132P08976l87758P7530
14682I19880l67871K80788J14399l26789L74607J2373j30563k53922J52358K3411
14672G98671n5038K66240o801J6135J78973k50225k53504K77245j06844K67476
14662A132328k1747J29416j22649J66242j98811m2374j32647M26760n02749M41826
14652A275595l03766N91487K7974j77909m40278J49944J89952k84769K48053l85790
14642H90493L90346j02106J04876j44661J54702j10246j53504J83702o3034J14154
14632A264722K46283J9074k43316k83677P6433J74013J8811l00087l4742L28818
$$ plain form
14622 1266332 1304866 1262080 1594719 1124835 1215649 1254584 1190089 1320200 1431956 1456201
14612 1456201 1460346 1335426 1328295 1358641 1641709 1459660 1297418 1429377 1372114 1355381 1285196
14601 1285196 1667071 1601527 1469391 1416035 1711502 1384534 1683900 1464395 1527614 1689992
14591 1689992 1515585 1565382 1281740 1794940 1937290 1816585 1956301 1697854 1752900 2064450
14581 2064450 2061286 1599924 1729963 1907346 1790808 2135816 2271454 2387157 2117569 2018953
14571 2018953 1945982 1959315 2153298 1967340 2055491 2206720 2122826 2301879 2527386 2722332
14561 2722332 2247215 2749961 2540923 2666980 2533395 3035190 3109094 3269265 3422473 3938155
14551 3938155 4212526 5027403 5934239 9074384 16221732 33164897 52712078 27031220
$$ packed form
14622A266332L8534m2786L32639m69884R0814L8935o4495J30111J11756K4245
14612A456201M145j24920p131L0346K83068j82049j62242J31959n7263j6733p0185
14601A285196L81875o5544j32136n3356K95467l26968K99366k19505O3219J62378
14591A689992j74407M9797k83642N13200J42350j20705J39716k58447N5046L11550
14581B064450l164m61362J30039J77383j16538L45008J35638J15703k69588r8616
14571B018953p2971J3333J93983j85958Q8151J51229q3894J79053K25507J94946
14561B722332m75117N02746k09038J26057j33585N01795P3904J60171J53208N15682
14551C938155K74371Q14877R06836L140145P147348J6943165J9547181k5680858
$$ plain form
14543 27031220 10759198 5029802 3277955 2715747 2413668 3393340 5045684 4565094
14535 4565094 2527801 1961902 1768608 2192809 2089238 1856256 1763877 2012042 2231277
14526 2231277 2273136 2197089 1842134 2259424 2176823 2249654 2137598 2402990 2598848 2613783
14516 2613783 2509130 2507551 2437624 2616249 2576895 2492230 2847790 2645889 2651741 2730142 2801465
14505 2801465 2751359 2487666 2864277 2802627 2873364 2834297 3170585 3073217 3115009 3394162
14495 3394162 3116491 3139914 3378489 3444281 3155233 3668543 3549345 3378168 3444415 3591284
14485 3591284 3628918 3737329 3615448 3733146 3770629 3609951 3765609 3709860 3572059 4062333
14475 4062333 3718550 4281373 4203733 4759517 4049272 4472366 4509549 4270686 4237436 4481805
$$ packed form
14543B7031220A0759198E029802j751847n62208l02079R79672J652344m80590
14535D565094k037293n65899j93294M24201j03571k32982r2379K48165K19235
14526B231277M1859p6047l54955M17290q2601P2831j12056K65392J95858J4935
14516B613783j04653j579o9927J78625l9354q4665L55560k01901N852P8401P1323
14505B801465n0106k63693L76611o1650P0737l9067L36288r7368M1792K79153
14495C394162k77671K3423K38575O5792k89048N13310j19198j71177O6247J46869
14485C591284L7634J08411j21881J17698L7483j60678J55658n5749j37801M90274
14475D062333l43783N62823p7640N55784p10245M23094L7183k38863l3250K44369
$$ plain form
14465 4481805 4283486 4635651 4833465 4671844 4487486 5117429 4638239 4630753 5152111 4983491
14455 4983491 4916616 5463148 5314192 5230592 5503779 5443963 5221905 5637105 5761148 5546146
14445 5546146 5923138 6023203 5719356 5886352 6385225 6012683 6023777 6244302 6139265 6384841
14435 6384841 6529359 6560017 6841013 6504904 6846967 7016649 7197768 7040103 7236268 7295457
14425 7295457 7493091 7503752 7567588 7992516 8072518 8106971 8544493 8790256 8872970 8795174
14415 8795174 8845139 9057867 8630514 8725277 9113650 9215416 9292659 9642865 9224921 10169010
14405 10169010 9895380 10139778 10403132 10289727 10447774 10593933 10706598 10992418 10851307
14396 10851307 11122439 11332387 11387929 11761885 12047754 12073977 12323940 12694117 12667435 13183618
$$ packed form
14465D481805j98319L52165J97814j61621j84358O29943m79190p486N21358j68620
14455D983491o6875N46532j48956q3600K73187n9816k22058M15200J24043k15002
14445E546146L76992J00065l03847J66996M98873l72542J1094K20525j05037K45576
14435F384841J44518L0658K80996l36109L42063J69682J81119j57665J96165N9189
14425G295457J97634J0661O3836M24928Q0002L4453M37522K45763Q2714p7796
14415H795174M9965K12728m27353R4763L88373J01766P7243L50206m17944R44089
14405A0169010k73630K44398K63354j13405J58047J46159J12665K85820j41111
14396A0851307K71132K09948N5542L73956K85869K6223K49963L70177k6682N16183
$$ plain form
14386 13183618 13564347 13741599 14105205 14145559 14485655 14684611 14795778 15556046 15479116 16163063
14376 16163063 15760532 16075996 16470899 16848326 16726302 17779930 17929860 18279160 18649351
14367 18649351 18906103 19525065 20022206 20714958 20742803 21136270 21425683 21886964 22274786
14358 22274786 22738575 23707992 23834849 24412711 25209439 25471108 26582559 26872410 27413009
14349 27413009 28166238 28818517 29555380 30665683 30971029 32098470 32892541 33914144 34539943
14340 34539943 35406462 36389097 37724941 38782200 40229653 41131509 42415510 43194617 44748086
14331 44748086 46242159 47943042 48961637 50992008 52687220 54081373 55777772 57974098
14323 57974098 59871706 62075194 64213036 66586603 69200760 71823054 74253836 77415241
$$ packed form
14386A3183618L80729J77252L63606M0354L40096J98956J11167P60268p6930O83947
14376A6163063m02531L15464L94903L77427j22024J053628J49930L49300L70191
14367A8649351K56752O18962M97141O92752K7845L93467K89413M61281L87822
14358B2274786M63789R69417J26857N77862P96728K61669J111451K89851N40599
14349B7413009P53229O52279P36863J110303L05346J127441P94071J021603O25799
14340C4539943Q66519R82635J335844J057259J447453R01856J284001P79107J553469
14331D4748086J494073J700883J018595K030371J695212J394153J696399K196326
14323E7974098J897608K203488K137842K373567K614157K622294K430782L161405
$$ plain form
14315 77415241 79762668 82754659 85976949 89207639 93136035 97016530 100933803 105310173
14307 105310173 110071445 114623186 120051202 125316803 131024834 137464627 143572033 150443112
14299 150443112 157929110 165535206 173698977 182545492 191528980 201681725 212017372 222924816
14291 222924816 234512950 246969230 259512142 273117935 286883459 301075499 315990149
14284 315990149 331143869 346518037 362134962 377677878 393089102 407662591 422264613
14277 422264613 435236175 447488412 457925384 466367502 472430111 474426381 473020460
14270 473020460 470719313 467796256 462515040 457499633 450932576 441711079 431366480 419630192
14262 419630192 405705138 390974297 375346296 359496043 343419379 327467947 311854956
$$ packed form
14315G7415241K347427K991991L222290L230690L928396L880495L917273M376370
14307A05310173M761272M551741N428016N265601N708031O439793O107406O871079
14299A50443112P485998P606096Q163771Q846515Q983488J0152745J0335647J0907444
14291B22924816J1588134J2456280J2542912J3605793J3765524J4192040J4914650
14284C15990149J5153720J5374168J5616925J5542916J5411224J4573489J4602022
14277D22264613J2971562J2252237J0436972Q442118O062609J996270j405921
14270D73020460k301147k923057n281216n015407o567057r221497j0344599j1736288
14262D19630192j3925054j4730841j5628001j5850253j6076664j5951432j5612991
$$ plain form
14255 311854956 296644524 282385064 268366238 254747766 242096914 229976196 218185005
14248 218185005 208047527 198967359 189077821 179612305 171546550 163208711 155403881 148421120
14240 148421120 141403487 135224159 129224105 124320049 118484064 113541137 108586134 103876678
14232 103876678 99473427 96230388 92662455 88459464 85128947 82121778 78741395 75973308
14224 75973308 73220862 70197165 68093796 65663000 63625547 61857956 59261287 57336038
14216 57336038 55278342 53664926 52270117 50811481 49165914 47336737 46354344 44811789
14208 44811789 43847415 42842746 41805726 40548299 39018966 38270647 37003198 36105301
14200 36105301 35581818 34508686 33725874 32635689 31697878 31017455 30208288 29533136 29074551
$$ packed form
14255C11854956j5210432j4259460j4018826j3618472j2650852j2120718j1791191
14248B18185005j0137478r080168r889538r465516q065755q337839p804830o982761
14240A48421120p017633o179328o000054m904056n835985m942927m955003m709456
14232A03876678m403251l243039l567933m202991l330517l007169l380383k768087
14224G5973308k752446l023697k103369k430796k037453j767591k596669j925249
14216E7336038k057696j613416j394809j458636j645567j829177r82393j542555
14208D4811789r64374j004669j037020j257427j529333p48319j267449q97897
14200C6105301n23483j073132p82812j090185r37811o80423q09167o75152m58585
$$ plain form
14191 29074551 28364382 27356661 26770633 25895633 25317907 25283568 24261439 23883936 23644104
14182 23644104 22740443 22466513 21858676 21552063 21214459 20594715 20048452 19798611 19526995
14173 19526995 19206766 18539546 18455255 17866980 17523265 17374453 16923871 16761145 16187297
14164 16187297 15987834 15516972 15256947 15169621 14707685 14567626 14357215 14271427 14046735 13444107
14154 13444107 13458701 12950739 13298482 12710629 12452008 12517249 12051748 12050266 11828692 11591125
14144 11591125 11560328 11156191 11317800 10947755 11046705 10521879 10593577 10273208 10312945 9986647
14134 9986647 10001936 9505566 9519946 9378768 9150366 9134657 8955317 8842503 8948966 8396768
14124 8396768 8512110 8364388 8420817 8017090 8137849 8017112 7751344 8057988 7624758 7486371
$$ packed form
14191B9074551p10169j007721n86028q75000n77726l4339j022129l77503k39832
14182B3644104r03661k73930o07837l06613l37604o19744n46263k49841k71616
14173A9526995l20229o67220q4291n88275l43715j48812m50582j62726n73848
14164A6187297j99463m70862k60025q7326m61936j40059k10411q5788k24692o02628
14154A3444107J4594n07962L47743n87853k58621O5241m65501j482k21574k37567
14144A1591125l0797m04137J61609l70045R8950n24826P1698l20369L9737l26298
14134I986647J5289m96370J4380j41178k28402j5709j79340j12814J06463n52198
14124H396768J15342j47722N6429m03727J20759j20737k65768L06644m33230j38387
$$ plain form
14114 7486371 7467398 7234072 7504101 7147390 6978174 6951470 7096118 6704786 6473001 6556974
14104 6556974 6719143 6522042 6336339 6307547 6102726 6118219 5898274 6229712 5864280 5827060
14094 5827060 5911035 5767696 5633845 5750587 5768303 5578435 5429388 5332754 5235458 5170462
14084 5170462 5094528 5262724 5245023 5077349 4947918 5107623 5002228 4672269 4773683 4661979
14074 4661979 5062673 4713974 4676801 4577149 4511236 4641113 4647671 3997498 4187231 4192235 4250302
14063 4250302 4393447 4310275 4218341 4362377 4516156 4378492 4232722 3931035 4095723 4091254
14053 4091254 3689240 3822399 3842780 3906077 3481328 3845942 3857769 3410532 3745540 3378410
14043 3378410 3423267 3704880 3297461 3230486 3447311 3340745 3604325 3138471 3552358 3059933
$$ packed form
14114G486371j8973k33326K70029l56711j69216k6704J44648l91332k31785Q3973
14104F556974J62169j97101j85703k8792k04821J5493k19945L31438l65432l7220
14094E827060Q3975j43339j33851J16742J7716j89868j49047r6634r7296o4996
14084E170462p5934J68196j7701j67674j29431J59705j05395l29959J01414j11704
14074D661979M00694l48699l7173r9652o5913J29877O558o50173J89733N004N8067
14063D250302J43145q3172r1934J44036J53779j37664j45770l01687J64688m469
14053D091254m02014J33159K0381O3297m24749L64614J1827m47237L35008l67130
14043C378410M4857K81613m07419o6975K16825j06566K63580m65854M13887m92425
$$ plain form
14033 3059933 3339684 3302315 3013680 3223389 3103659 3464030 3203799 2906138 2911569 3248543
14023 3248543 2741078 3076703 3155080 2727989 2844739 2823873 2535543 2722006 2606686 2599861
14013 2599861 2767252 2500916 2469188 2709614 2579601 2487773 2172474 2248346 2664131 2371687
14003 2371687 2446094 2400399 2078643 2132949 2296714 2019383 2368391 2212311 1939918 2074309
13993 2074309 1964030 2143603 2386092 2691014 2975535 4312126 9434418 24029862 50611390
13984 50611390 35528157 17246479 9858112 6818693 5359215 4762929 3876425 3304329
13976 3304329 3137286 3046005 2866758 2758026 2941081 2810472 2660347 2725633 2395443 2424835
13966 2424835 2501566 2382164 2548554 2030222 2555658 2416254 2385781 2214560 2285124 2209485
$$ packed form
14033C059933K79751l7369k88635K09709j19730L60371k60231k97661N431L36974
14023C248543n07465L35625P8377m27091J16750k0866k88330J86463j15320o825
14013B599861J67391k66336l1728K40426j30013r1828l15299P5872M15785k92444
14003B371687P4407m5695l21756N4306J63765k77331L49008j56080k72393J34391
13993B074309j10279J79573K42489L04922K84521J336591N122292J4595444K6581528
13984E0611390j5083233A7246479p388367l039419j459478n96286q86504n72096
13976C304329j67043r1281j79247j08732J83055j30609j50125O5286l30190K9392
13966B424835P6731j19402J66390n18332N25436j39404l0473j71221P0564p5639
$$ plain form
13956 2209485 2103211 2506364 2262102 2276449 1862746 1789258 2172388 2179348 2012104 2023129
13946 2023129 2011596 2107466 2072549 2052214 1747622 2180808 1661136 1638105 2118501 2017763
13936 2017763 1621079 1731639 1595274 1795663 1934746 1589026 1535910 1727997 1526342 1514408
13926 1514408 1526290 2107893 1551429 2055653 1411467 1668738 1728289 1744058 1855291 1591684
13916 1591684 1588187 1916492 1659367 1877263 1478365 1794844 1679255 1354941 1541088 1534674
13906 1534674 1607546 1576524 1574020 1491572 1293330 1666554 1237690 1541732 1385102 2001599
13896 2001599 1120825 1324610 1281674 1767609 1401342 1303455 1396053 1782131 1391745 1151005
13886 1151005 1178807 1199411 1558293 1383035 1704269 1419759 1264014 1657573 1444877 1493806
$$ packed form
13956B209485j06274M03153k44262J4347m13703p3488L83130O960j67244J1025
13946B023129j1533R5870l4917k0335l04592M33186n19672k3031M80396j00738
13936B017763l96684J10560j36365K00389J39083l45720n3116J92087k01655j1934
13926A514408J1882N81603n56464N04224o44186K57271N9551J5769J11233k63607
13916A591684l497L28305k57125K17896l98898L16479j15589l24314J86147o414
13906A534674P2872l1022k504q2448j98242L73224m28864L04042j56630O16497
13896B001599q80774K03785m2936M85935l66267r7887R2598L86078l90386k40740
13886A151005K7802K0604L58882j75258L21234k84510j55745L93559k12696M8929
$$ plain form
13876 1493806 1287559 1466621 934642 1487439 1028656 1016585 1454301 1146099 1386008 1373852
13866 1373852 1262959 934008 1482420 1378732 1193757 916156 1369998 877181 1040139
13857 1040139 1090896 1334262 1250856 1377231 916342 1105484 1235519 1055653 1346103 1108276
13847 1108276 888770 1111855 1190932 860653 1117957 1391676 1341223 1106387 1129990 1129681
13837 1129681 783912 1020747 1109817 1062014 1039044 959446 757340 1007818 776171 1027087
13827 1027087 1280400 943604 993249 1115336 897977 721460 944989 591683 905076 1026380
13817 1026380 891377 892032 689280 913699 797147 1089550 1013535 796506 906333 672181
13807 672181 1124307 878907 795127 911591 1017802 872811 790323 871220 739182 1001008
$$ packed form
13876A493806k06247J79062n31979N52797m58783j2071M37716l08202K39909j2156
13866A373852j10893l28951N48412j03688j84975k77601M53842m92817J62958
13857A040139N0757K43366q3406J26375m60889J89142J30035j79866K90450k37827
13847A108276k19506K23085P9077l30279K57304K73719n0453k34836K3603l09
13837A129681l45769K36835Q9070m7803k2970p9598k02106K50478k31647K50916
13827A027087K53313l36796M9645J22087k17359j76517K23529l53306L13393J21304
13817A026380j35003O55k02752K24419j16552K92403p6015k17029J09827k34152
13807F72181M52126k45400q3780J16464J06211j44991q2488Q0897j32038K61826
$$ plain form
13797 1001008 822145 698815 879830 934213 758414 488471 542047 1122521 887582 832711
13787 832711 1186128 893634 721854 962389 313518 1059954 704857 904219 733471 616274
13777 616274 777661 717713 755794 842638 1071305 752824 646995 938135 616677 790554
13767 790554 803077 816933 764628 1097778 558109 717468 389862 540348 773619 699685
13757 699685 916932 742740 396891 956965 911974 640060 743738 796347 698916 778839
13747 778839 624648 726016 760036 975960 647171 809384 814648 520487 756081 861891
13737 861891 702517 565567 731341 775926 890258 971115 667815 708132 735983 662351
13727 662351 413630 453761 580157 579050 877676 453878 522860 518754 421977 447823 711441
$$ packed form
13797A001008j78863j23330J81015N4383j75799k69943N3576N80474k34939n4871
13787H32711L53417k92494j71780K40535C13518P46436l55097J99362j70748j17197
13777F16274J61387n9948L8081Q6844K28667l18481j05829K91140l21458J73877
13767G90554J2523J3856n2305L33150n39669J59359l27606J50486K33271p3934
13757F99685K17247j74192l45849N60074m4991k71914J03678N2609r7431P9923
13747G78839j54191J01368L4020K15924l28789J62213N264k94161K35594J05810
13737H61891j59374j36950J65774M4585J14332Q0857l03300M0317K7851p3632
13727F62351k48721M0131J26396j107K98626m23798O8982m106r6777K5846K63618
$$ plain form
13716 711441 326002 458770 493577 728708 837571 581340 793710 198457 507279 361292
13706 361292 839225 787402 568259 541145 672803 412936 304227 462063 716445 395561
13696 395561 413055 426169 799928 653759 477507 530152 578798 490097 355332 513085
13686 513085 557987 650074 729290 248648 313769 565905 397479 729345 561507 458113
13676 458113 579571 495077 677129 492015 540166 428901 386264 573231 316043 294175
13666 294175 571905 376644 753698 362851 152613 744053 526757 200474 275981 753714
13656 753714 412168 393438 315717 489755 875230 652190 726350 -149680 429100 510472
13646 510472 523064 533148 6401 274686 637571 496192 449105 603143 208326 454002
$$ packed form
13716G11441C26002J32768L4807K35131J08863k56231K12370A98457L08822j45987
13706C61292M77933n1823k19143k7114J31658k59867j08709J57836K54382l20884
13696C95561J7494J3114L73759j46169j76252N2645M8646q8701j34765J57753
13686E13085M4902R2087P9216B48648O5121K52136j68426L31866j67838j03394
13676D58113J21458q4494J82052j85114M8151j11265m2637J86967k57188k1868
13666B94175K77730j95261L77054C62851A52613N91440k17296B00474P5507M77733
13656G53714l41546j8730p7721J74038L85475k23040P4160a49680D29100Q1372
13646E10472J2592J0084F401K68285L62885j41379m7087J54038B08326K45676
$$ plain form
13636 454002 448012 348522 304733 804059 350626 143412 391397 645407 559064 521424 438908
13625 438908 582763 252145 219442 513549 324593 430496 482507 328987 379714 326219
13615 326219 119241 217313 421289 458749 571716 206927 331973 547754 647313 598521
13605 598521 182208 487805 413799 124074 635519 600309 417456 670640 178682 444046
13595 444046 308553 553506 547896 267917 409975 216819 612810 8564 380119 313054
13585 313054 259322 81533 310457 331706 620683 604597 237310 342998 505865 463032
13575 463032 175156 294684 581889 398275 420285 333354 312377 479194 689874 350110
13565 350110 764668 218270 347591 369688 136322 258308 106325 366224 390236 161858
$$ packed form
13636D54002n990r9490m3789M99326C50626A43412K47985K54010q6343l7640q2516
13625D38908J43855B52145l2703K94107j88956J05903N2011j53520N0727n3495
13615C26219A19241R8072K03976L7460J12967B06927J25046K15781R9559m8792
13605E98521A82208L05597p4006A24074N11445l5210j82853K53184A78682K65364
13595D44046j35493K44953n610B67917J42058j93156L95991H564L71555o7065
13585C13054n3732H1533K28924K1249K88977j6086B37310J05688J62867m2833
13575D63032A75156J19528K87205j83614K2010q6931k0977J66817K10680l39764
13565C50110M14558B18270J29321K2097A36322J21986A06325K59899K4012A61858
$$ plain form
13554 276588 437254 200218 -8398 201704 -18187 29480 362381 396900 307315 334143 131938
13542 237087 225248 444525 506831 356988 144873 100405 194073 438766 366633 453285 260146
13531 260146 400732 300588 337985 420947 521163 167853 133155 82680 442024 533971
13521 533971 295740 121876 28043 147122 17868 222595 152082 294857 215253 358470
13511 358470 599741 199305 506160 385760 355305 325774 337161 385099 421567 357832 211995
13500 211995 454760 233632 254452 194349 493605 355109 59410 397046 455319 413067
13490 413067 360472 501977 417968 221736 383258 259029 119973 -128290 196128 389831
13480 389831 334739 145045 212159 263325 368467 10237 307506 302705 68433 434258 255785
$$ packed form
13554B76588J60666B00218h398B01704a8187B9480L32901L4519q9585K6828A31938
13542B37087j1839K19277O2306j49843A44873m4468R3668K44693p2133Q6652j93139
13531B60146J40586j00144L7397Q2962J00216A67853l4698n0475L59344R1947
13521E33971k38231A21876B8043J19079A7868K04727p0513J42775p9604J43217
13511C58470K41271A99305L06855j20400l0455k9531J1387M7938L6468o3735j45837
13500B11995K42765k21128K0820o0103K99256j38496E9410L37636N8273m2252
13490D13067n2595J41505q4009j96232J61522j24229A19973a28290A96128J93703
13480C89831n5092A45045O7114N1166J05142A0237K97269m801F8433L65825j78473
$$ plain form
13469 255785 490845 462890 146695 308417 283296 141007 116002 168247 84864 426822
13459 426822 172723 159454 -215065 221530 295051 180617 -89619 346255 243761 154621
13449 154621 315420 212023 163203 258852 80678 403066 284981 192266 311909 277239
13439 277239 245133 97980 260362 84551 397760 281505 242823 255667 472114 200826
13428 144063 63741 223110 -100222 403197 106122 401859 487390 367366 -25083 144187
13417 719423 79757 -33860 251532 83396 36547 330029 299495 154899 73003 353321 438144
13406 438144 136944 263114 214729 272236 -175848 423762 127928 402889 371937 309221
13396 309221 299536 108749 257161 -69953 82197 256448 318908 164196 88727 385953 294043
$$ packed form
13469B55785K35060k7955A46695J61722k5121A41007k5005N2245q3383L41958
13459D26822A72723j3269b15065B21530P3521j14434h9619C46255j02494q9140
13449A54621J60799j03397m8820R5649H0678L22388j18085r2715J19643l4670
13439B77239l2106I7980J62382H4551L13209j16255l8682J2844K16447B00826
13428A44063F3741J59369a00222D03197A06122K95737Q5531j20024b5083A44187
13417G19423G9757c3860B51532H3396C6547K93482l0534j44596G3003K80318Q4823
13406D38144A36944J26170m8385N7507a75848D23762A27928K74961l0952o2716
13396C09221r685A08749J48412f9953H2197J74251O2460j54712p5469K97226r1910
$$ plain form
13385 294043 379590 517615 343506 570969 -78 542989 422517 54494 -94848 213925 191290
13374 191290 112108 100319 313219 140291 166500 297389 204914 212726 275839 138348 301461
13363 301461 503929 39666 274300 370680 197444 327660 245238 423291 555599 114043
13352 41217 185556 -94831 483055 211048 88316 423595 339011 -54833 251543 324221 335332
13341 335332 233538 218197 401286 364841 410959 564956 350539 159015 356468 224372
13331 224372 172970 357822 541735 -19896 206720 -124842 77856 383440 12644 136809
13321 136809 348957 12100 327505 312618 689272 264353 -10564 396009 -74480 239181
13310 492093 322380 459017 179791 78501 367086 45966 -131661 59744 495960 12416
$$ packed form
13385B94043Q5547J38025j74109K27463g8E42989j20472E4494i4848B13925k2635
13374A91290p9182j1789K12900A40291K6209J30889r2475P812O3113j37491J63113
13363C01461K02468C9666K34634R6380j73236J30216q2422J78053J32308A14043
13352D1217J44339i4831D83055B11048H8316L35279q4584e4833B51543P2678J1111
13341C35332j01794j5341J83089l6445M6118J53997k14417A59015J97453j32096
13331B24372n1402J84852J83913a9896B06720a24842G7856L05584A2644J24165
13321A36809K12148A2100L15405j4887L76654B64353a0564C96009g4480B39181
13310D92093j69713J36637A79791G8501K88585D5966a31661E9744M36216A2416
$$ plain form
13299 -36270 432839 19616 254199 308322 247001 206154 159432 199616 129562 545076 209888
13287 93567 340192 132475 158534 99875 55313 229285 217306 72718 241464 365420 176381
13275 -70817 383783 220318 198009 152135 170495 50312 243773 114992 259623 -35723 154969
13263 -64056 66217 -107490 98593 296934 31742 231785 395687 237171 153289 179779 119953
13252 119953 -46011 -117843 180264 -42544 75321 162961 -101758 105354 210070 6171 -142004
13240 108693 -16370 -105074 212190 -146752 487326 -199949 144347 -13497 352770 106911
13229 -183868 -7828 274783 207450 -42238 20539 294197 177640 -30052 -88614 14410 -138969
13217 56368 77594 376284 -159200 -199028 163006 115381 190299 116977 287407 -79406 143370
$$ packed form
13299c6270D32839A9616K34583N4123o1321m0847m6722M0184p0054M15514B09888
13287I3567K46625A32475K6059n8659m4562J73972j1979G2718J68746J23956A76381
13275g0817C83783j63465k2309m5874J8360E0312J93461A14992J44631c5723A54969
13263f4056F6217a07490I8593J98341C1742K00043J63902j58516q3882K6490n9826
13252A19953d6011p1832A80264d2544G5321Q7640a01758A05354J04716F171a42004
13240A08693a6370q8704B12190a46752D87326a99949A44347a3497C52770A06911
13229a83868g828B74783o7333d2238B0539K73658j16557c0052n8562A4410a38969
13217E6368K1226K98690a59200l9828A63006m7625P4918p3322J70430g9406A43370
$$ plain form
13205 -40979 124630 151297 25271 3822 173610 432178 146552 -32853 153347 -6476 438295
13193 152740 96001 -360657 -117385 173633 -6579 286289 77773 70833 17098 -33264 13954
13181 221113 -74614 126804 7609 -105073 -62144 534763 158291 187054 100938 -146127 43609
13169 77889 101102 -73655 166249 251896 168082 327473 -35946 263338 472615 53441 -69199
13157 93287 411209 -92849 235321 14645 111154 -213235 127275 202450 -22146 -12141 55663
13145 58428 361642 -39510 -96354 123744 -235204 80047 323967 423475 305750 -216678
13134 173613 210501 -9886 132593 -50246 303042 253654 240039 -162576 90129 -8063 176037
13122 133758 114995 123668 -157669 314442 430837 325852 281275 -113585 91658 160085 113771
$$ packed form
13205d0979A24630K6667B5271C822J69788K58568A46552c2853A53347f476D38295
13193A52740n6739c60657a17385A73633f579B86289G7773o940A7098c3264A3954
13181B21113g4614A26804G609a05073M2929E34763A58291K8763q6116a46127D3609
13169G7889K3213g3655A66249Q5647q3814J59391c5946B63338K09277E3441f9199
13157I3287L17922i2849B35321A4645R6509b13235A27275P5175b2146J0005E5663
13145E8428L03214c9510n6844A23744b35204H0047K43920R9508j17725b16678
13134A73613L6888i886A32593e0246C03042m9388j3615a62576I0129h063A76037
13122A33758j8763Q673a57669C14442J16395j04985m4577a13585I1658O8427m6314
$$ plain form
13111 113771 35154 -103852 -259553 -38998 145788 -3672 73075 285423 -43043 95911 444970
13100 444970 228027 -14764 215217 61943 18954 334280 122040 146330 -11724 11823 -27175
13088 -144524 -83985 264906 242791 -76081 149141 -55951 -91842 186493 -92666 265809 237227
13077 237227 25451 142970 -183074 121343 189046 89697 128339 36615 205387 1300 442054
13066 442054 -8547 279151 -11820 118666 85679 -44113 317079 173541 175003 123005 101537
13055 101537 -452212 304928 3959 470861 179315 -174100 -80567 330223 183052 206319
13045 206319 99992 138718 324937 194094 -167512 -4113 186694 191040 -7434 128962 34969
13033 -74245 10 109162 194107 108528 298645 251432 206488 87345 160856 29869 257432 230833
$$ packed form
13111A13771C5154a03852j55701c8998A45788c672G3075K12348d3043I5911L49059
13100D44970k16943a4764B15217F1943A8954L15326A22040K4290a1724A1823b7175
13088a44524O0539B64906k2115g6081A49141e5951l5891A86493i2666B65809k8582
13077B37227B5451J17519a83074A21343O7703H9697L8642C6615J68772A300M40754
13066D42054h547B79151a1820A18666l2987d4113C17079j43538J462n1998k1468
13055A01537d52212C04928C959M66902A79315a74100h0567C30223j47171K3267
13045B06319I9992L8726J86219j30843a67512d113A86694M346g434A28962C4969
13033g4245A0J09152Q4945q5579J90117m7213m4944H7345P3511B9869K27563k6599
$$ plain form
13021 230833 46809 558570 -38694 55668 -2051 -12347 -42178 205048 60728 219899 46718
13009 115879 230861 20379 161008 77927 146190 469651 305980 195334 28992 61512
12999 61512 7272 -144585 85929 175400 -261247 279115 3164 -256239 73095 71291 -27611
12987 218951 138890 -113274 195454 44133 61402 -282535 -59935 196842 -224846 325337
12976 79350 68091 -13426 206913 -54061 -199445 168634 -181002 22082 -101407 330653
12965 341217 135180 82964 397902 -34096 241414 -36960 53038 263674 -12491 92730 69889
12954 69889 28824 -130219 255080 75948 199516 -27765 -65626 52630 275159 279608 -91657
12942 126828 153561 210377 -65509 142448 113793 59828 194288 57793 -146271 471438 189651
$$ packed form
13021B30833D6809N11761c8694E5668b051j0296k9831B05048F0728J59171D6718
13009A15879J14982B0379J40629G7927O8263L23461j63671j10646B8992L2520
12999F1512G272a44585H5929Q9471b61247B79115C164b56239G3095j804b7611
12987B18951q0061a13274A95454D4133J7269b82535e9935A96842b24846C25337
12976G9350j1259a3426B06913e4061j45384A68634a81002B2082a01407C30653
12965C41217A35180n2216L14938c4096B41414c6960E3038K10636a2491I2730k2841
12954F9889B8824a30219B55080G5948J23568b7765l7861E2630K22529M449i1657
12942A26828K6733N6816f5509A42448k8655n3965J34460E7793a46271D71438A89651
$$ plain form
12930 -172780 25248 -370381 382098 -96219 363862 246496 -544536 -200705 -182363 -91015
12919 -63131 57440 168613 -113712 -100873 144542 259001 248254 -105888 -330959 -21971
12908 -17268 -44281 4312 -1579 129673 26230 -126624 209085 -323135 171602 -99170 17133
12896 25563 -73753 -180848 153217 -228321 3527 180139 -107003 32240 -12324 -169745 85286
12884 182118 76436 76495 54344 390497 -172758 86054 91774 -74271 -18326 74704 -104381 349764
12871 185044 87774 44152 -75079 -195515 -55682 -181976 -90210 -248051 74578 -20345 -320873
12860 -320873 -347550 -27511 192492 246698 -84213 127899 191581 118132 3239 -36444 -123694
12849 -123694 63837 -86202 -62833 -50384 -78143 -31126 -173947 296957 108165 227859 95217
$$ packed form
12930a72780B5248c70381C82098i6219C63862j17366e44536b00705J8342i1015
12919f3131E7440J11173a13712J2839A44542J14459j0747a05888k25071b1971
12908a7268k7013D312a579A29673B6230a26624B09085c23135A71602i9170A7133
12896B5563g3753j07095A53217b28321C527J76612a07003C2240a2324j57421H5286
12884A82118G6436N9k2151L36153a72758H6054N720g4271a8326G4704a04381C49764
12871A85044H7774m3622g5079j20436e5682j26294i0210j57841G4578b0345l00528
12860c20873k6677b7511A92492N4206h4213A27899O3682p3449C239c6444q7250
12849a23694F3837h6202K3369J2449k7759c1126j42821B96957A08165J19694I5217
$$ plain form
12837 477863 23590 225428 -30118 213256 45840 95235 239187 301968 -113030 270515
12826 56333 536342 -164320 -13568 2415 -11702 -261469 114070 31506 -2739 -97258 -82735
12815 -82735 44917 -65227 30092 -239706 124521 108381 181215 -170056 154946 25061 -151371
12803 -156885 300198 165975 38448 66228 121464 -170920 82015 108374 -414255 -112216
12792 -86952 137702 129383 -37631 -100048 224321 182340 307085 -22007 -513381 68964 253111
12781 253111 -21465 -46582 73686 57557 147603 -87859 -307017 -211193 235790 31570 -136611
12769 37471 152265 133108 85142 84861 73125 -52448 268574 -184011 60604 -160918 186694
12757 110560 4622 -75962 -8001 231391 22191 359320 56818 175090 126179 -277423 -131033
$$ packed form
12837D77863B3590K01838c0118B13256D5840M9395J43952O2781a13030B70515
12826E6333M80009a64320a3568B415a1702k49767A14070C1506b739r4519J4523
12815h2735D4917f5227C0092b39706A24521j6140P2834a70056A54946B5061a51371
12803a56885C00198j34223C8448K7780N5236a70920H2015K6359d14255a12216
12792h6952A37702q319c7631o2417B24321m1981J24745b2007m91374F8964J84147
12781B53111b1465k5117G3686j6129R0046h7859k19158R5824B35790C1570a36611
12769C7471J14794j9157m7966k81j1736e2448B68574a84011F0604a60918A86694
12757A10560D622g5962h001B31391B2191L37129E6818J18272m8911b77423a31033
$$ plain form
12745 34122 164621 -52995 103295 -122820 -178751 165370 -44906 36398 121036 -126733 -149642
12734 -149642 -32367 -57293 -14737 178630 79984 95738 -92160 144852 90709 241274 -75989
12722 113124 134634 -216323 -294891 218349 74651 -1676 197374 135356 62979 55988 -252554
12710 -140496 359484 454721 358402 148679 98593 125675 -87901 -51549 -266628 24125 159964
12699 159964 61106 -179662 -74437 193242 -134905 298923 -143339 -29719 -87564 54801
12688 254080 16527 255193 329315 134192 181376 -66050 88912 18143 79165 86240 92106
12677 92106 101176 342117 -92224 277835 180683 73846 -200839 243280 110835 -59631 147768
12665 113403 154582 107539 64025 354769 -133970 22511 13757 -32953 30927 266724 117198
$$ packed form
12745C4122J30499e2995A03295a22820n5931A65370d4906C6398Q4638a26733k2909
12734a49642c2367k4926a4737A78630G9984J5754i2160A44852n4143J50565g5989
12722A13124K1510b16323p8568B18349G4651a676A97374o2018F2979o991b52554
12710a40496C59484R5237r6319A48679n0086K7082h7901L6352k15079B4125J35839
12699A59964F1106a79662g4437A93242a34905B98923a43339b9719n7845E4801
12688B54080A6527K38666P4122A34192M7184f6050H8912A8143O1022P075N866
12677I2106R070K40941i2224B77835r7152G3846b00839B43280A10835e9631A47768
12665A13403M1179m7043m3514K90744a33970B2511q754c2953C0927K35797A17198
$$ plain form
12653 -139166 302912 128663 -94400 52056 -43441 149965 -124690 146908 351494 -94624
12642 -454003 -172971 25067 132927 106113 -69633 -106395 92239 242451 -89707 278159 254008
12631 254008 37630 -136262 182623 471169 33067 -8226 219986 126447 102522 8516 58982
12620 58982 -77047 193587 -52525 15446 263994 -7831 113799 39859 -122837 152897 -140848
12608 -154950 371822 86558 77010 239927 147541 -132114 105739 372914 173306 181285 -8147
12596 116016 -93425 372404 -229840 8874 148472 114946 -448683 -281017 155073 -80622
12585 91335 -20443 29116 165485 -297159 163961 137935 248951 200637 247490 33093 198828
12574 198828 95665 251706 -43610 180029 -69093 -56239 166435 21171 82744 220205 165263
$$ packed form
12653a39166C02912A28663i4400E2056d3441A49965a24690A46908K04586i4624
12642d54003a72971B5067J07860k6814f9633l6762I2239J50212h9707B78159k4151
12631B54008C7630a36262A82623K88546C3067h226B19986r3539k3925H516N0466
12620E8982g7047A93587e2525A5446K48548g831A13799C9859a22837A52897a40848
12608a54950C71822H6558r548J62917r2386a32114A05739K67175A73306P979h147
12596A16016i3425C72404b29840H874J39598l3526d48683J67666A55073h0622
12585I1335b0443B9116J36369b97159A63961k6026J11016m8314M6853C3093J65735
12574A98828I5665J56041d3610A80029f9093J2854A66435B1171O1573J37461n4942
$$ plain form
12563 165263 -70586 157269 -107732 -1218 43595 52756 20536 -376453 -280762 -392759 236145
12551 51693 -111489 -6100 34290 -129883 66764 40408 240203 -6026 74417 214242 8058
12539 -145910 79001 129189 -216549 -265368 -182927 237034 1759 44707 43797 251376 257633 -26608
12526 92171 50432 -2117 42625 -173548 19091 -109313 -82221 108528 153536 189172 18213
12514 -213396 -52057 34990 69970 -63689 254968 97714 152368 118183 -131952 140634 406093
12503 406093 305955 -19871 -292207 -210921 230114 67054 -68269 -118891 -209911 -13469 75323
12491 -51882 -88403 249092 197226 106505 -22061 142064 -252640 -8722 -135008 246794 276659
12480 276659 -368701 162971 77734 66304 98986 316085 326587 143226 257563 -163472
$$ packed form
12563A65263g0586A57269a07732a218D3595R161B0536c76453R5691j11997B36145
12551E1693a11489f100C4290a29883F6764k6356J99795f026G4417J39825H058
12539a45910G9001N0188b16549m8819Q2441B37034A759M2948r10K07579O257b6608
12526I2171m1739b117D2625a73548A9091a09313K7092A08528M5008L5636A8213
12514b13396e2057C4990L4980f3689B54968I7714N4654l4185a31952A40634K65459
12503D06093j00138a9871k72336Q1286B30114F7054f8269n0622r1020a3469G5323
12491e1882l6521B49092n1866r0721b2061A42064b52640h722j26286B46794K9865
12480B76659c68701A62971G7734j1430L2682K17099J0502A43226J14337a63472
$$ plain form
12469 -120961 -270 -261434 29478 -36429 191727 35939 287371 46266 134557 -176486 -255203
12458 -255203 -64284 8273 171049 -122190 -87590 -95277 239143 289694 167911 -22286 -85940
12447 -85940 23351 -46085 114788 267606 -53336 87534 -108959 -290061 -162466 -6691 65425
12435 -38534 -96898 -53206 5859 -157511 421759 3340 380898 106181 -120863 70537 85859
12424 85859 43942 74920 424885 51472 -158277 62002 80528 321820 -474816 -83357 -114253
12413 -114253 -53298 -141634 13481 -329923 17153 145431 -185558 94820 57391 137880 -111525
12401 -241959 14586 -69530 -10587 -88910 88789 108840 120390 31141 119827 85053 -199117
12389 121310 165468 174439 -39248 -97516 254069 214430 250178 29010 93743 -90605 242826
$$ packed form
12469a20961b70k61164B9478c6429A91727C5939K51432D6266Q8291a76486p8717
12458b55203f4284H273J62776a22190L4600p687B39143N0551j21783b2286o3654
12447h5940B3351d6085A14788J52818e3336H7534a08959j81102J27595f691F5425
12435c8534n8364M3692E859a57511D21759C340L77558A06181a20863G0537J5322
12424H5859m1917L0978L49965E1472a58277F2002J8526K41292d74816h3357l0896
12413a14253e3298q8336A3481c29923A7153J28278a85558I4820l7429Q0489a11525
12401b41959A4586f9530a0587p8323H8789K0051J1550C1141Q8686l4774a99117
12389A21310M4158Q971c9248n8268B54069l9639L5748B9010O4733i0605B42826
$$ plain form
12377 27408 9928 -124038 -161993 70078 262095 65656 -154205 604695 186228 -22610 -227356
12366 -227356 -176802 5089 -113726 -18185 86166 237243 -292751 106105 -296553 -43895 -29059
12355 -29059 -154581 318736 121522 -141497 -71184 70295 -440673 -195618 183256 179713
12345 179713 -1373 -237589 -234449 165402 230589 -133085 -125323 148339 84904 111567 133831
12334 133831 61767 208392 -228831 424083 181636 146932 256862 331237 269869 232700
12324 232700 352954 187134 47979 293008 232255 14387 256867 2959 277405 285691 -44823
12312 -2882 84102 126603 307510 255930 100347 66267 253670 20152 242104 149690 242941
12301 242941 547125 323594 -170378 172804 226298 -161213 -88721 -122013 14527 176998
$$ packed form
12377B7408I928a24038l7955G0078J92017F5656a54205F04695A86228b2610k04746
12366b27356N0554E089a13726a8185H6166J51077b92751A06105b96553d3895J4836
12355b9059j25522C18736A21522a41497P0313G0295d40673a95618A83256l543
12345A79713a373k36216L140A65402O5187a33085P762A48339o3435K6663K2264
12334A33831F1767J46625b28831D24083A81636l4704J09930P4375o1368l7169
12324B32700J20254j65820D7979K45029o0753A4387K42480B959K74446Q286d4823
12312b882H4102M2501J80907n1580A00347l4080J87403B0152K21952r2414R3251
12301B42941L04184k23531a70378A72804N3494a61213P2492l3292A4527J62471
$$ plain form
12291 176998 552914 302269 176716 27515 311505 31558 -51776 -4665 226915 347036
12281 347036 40774 159962 145076 -69125 -5525 82763 -22868 14869 64298 104079 318220
12270 318220 385157 18387 338187 484205 221635 204607 138145 429312 110315 -61760
12259 139043 460 57727 -98138 429014 -161349 138314 206769 176144 198855 97875 58125
12248 58125 -11451 268109 -19398 53154 54707 317977 247058 12320 16175 59740 19428 71440
12236 71440 149363 151600 114545 -5376 250481 175625 -50229 213097 -138710 256725 37765
12224 359190 101684 145091 297242 403468 83323 351698 657672 339710 498907 96204
12213 122933 339203 370562 117269 409612 -75045 70021 302395 75617 345895 192313
$$ packed form
12291A76998L75916k50645j25553B7515K83990C1558e1776d665B26915J20121
12281C47036D0774J19188j4886f9125e525H2763b2868A4869M9429L9781K14141
12270C18220O6937A8387L19800J46018B21635j7028o6462K91167A10315f1760
12259A39043D60N7267i8138D29014a61349A38314O8455l0625K2711I7875l9750
12248E8125a1451B68109a9398E3154J553K63270p0919A2320L855M3565A9428N2012
12236G1440P7923K237l7055e376B50481p4856e0229B13097a38710B56725C7765
12224C59190A01684M3407J52151J06226H3323K68375L05974l17962J59197I6204
12213A22933K16270L1359A17269K92343g5045G0021K32374G5617K70278j53582
$$ plain form
12203 192313 158377 164747 10019 351731 26807 304946 -122169 87364 234656 172409 266341
12192 266341 -109574 372848 49815 448188 70874 377050 347485 294348 328849 290455 -54547
12180 332778 -188195 236568 77437 96996 28534 2694 381142 59707 57495 2730 117944
12169 117944 263756 423908 194526 624903 283726 119608 281480 251109 358843 42860
12158 284921 248707 -64091 397464 193877 538208 5633 279108 96623 -256095 -194918 -341585
12147 -341585 -44319 66300 -24462 -318378 108428 165465 -121901 -13568 -104844 -32253 136398
12135 81562 7268 410508 203548 431195 119388 260207 151180 288807 -59620 103907
12124 128073 45169 535725 179483 -81830 -25107 70828 125994 175268 58232 223997 267812
$$ packed form
12203A92313l3936O370A0019L41712B6807K78139a22169H7364J47292o2247R3932
12192B66341a09574C72848D9815L98373G0874L06176k9565n3137L4501l8394e4547
12180C32778a88195B36568G7437J9559B8534B694L78448E9707k212B730J15214
12169A17944J45812J60152A94526M30377B83726A19608J61872l0371J07734D2860
12158B84921l6214f4091C97464A93877L44331E633K73475I6623b56095O1177j46667
12147c41585d4319F6300b4462k93916A08428N7037a21901a3568r1276c2253A36398
12135H1562G268M03240B03548K27647A19388J40819j09027J37627e9620A03907
12124A28073D5169M90556A79483h1830b5107G0828N5166M9274E8232J65765M3815
$$ plain form
12113 267812 385233 -196668 202737 349097 256866 345452 -59309 321717 34075 137037
12103 137037 128199 -124272 70776 153247 180599 183422 99043 -217263 154866 -18055 416793
12091 264005 47224 -195553 -127496 36612 189986 255160 25990 327928 451389 310816
12081 310816 321806 342440 165502 7731 58875 284387 -78358 143168 291853 20867 47318
12070 47318 -71365 356019 321662 113808 -11529 424054 -36272 -128289 -5037 56930 244104
12059 244104 160376 76284 -232822 -237718 220833 210344 -88359 137217 46102 -151885 73657
12047 50007 -167007 -271289 -354203 -173178 -44121 -161121 61037 -31619 35052 -125780 279684
12035 165961 -5523 -140160 380074 46979 -128662 262903 325161 -102805 168046 13503
$$ packed form
12113B67812J17421a96668B02737J46360r2231Q8586e9309C21717C4075J02962
12103A37037q838a24272G0776Q2471K7352K823q4379b17263A54866a8055D16793
12091B64005D7224a95553O8057C6612J53374O5174B5990L01938J23461j40573
12081C10816J0990K0634A65502G731N1144K25512g8358A43168J48685B0867K6451
12070D7318g1365C56019l4357A13808a1529D24054c6272r2017e037E6930J87174
12059B44104q3728G6284b32822m896B20833j0489h8359A37217D6102a51885G3657
12047E0007a67007j04282q2914a73178d4121j17000F1037c1619C5052a25780B79684
12035A65961e523j34637C80074D6979a28662B62903O2258a02805A68046A3503
$$ plain form
12024 50727 11459 94037 293898 206218 -59118 84309 209152 -194361 331427 84669 129384
12013 129384 220525 -38952 -189832 101423 129792 125370 287092 -54211 136865 -6784 101508
12001 161118 83193 -203784 -82898 75086 142371 241247 115758 39070 303501 -106589 -75926
11990 -75926 -127082 198876 -162301 154661 54752 -7431 -171628 -180393 185322 324009 422780
11979 422780 -85590 -7937 116637 96428 -5830 -17325 -102525 -168677 -357512 -2398 91260 -165823
11966 -62569 -67989 -168215 -266272 -180808 100417 -164788 157409 -16867 44174 118311 -84210
11954 98463 50146 212012 -214062 -178510 223102 141166 -113840 -114375 28246 45826 -170365
11942 -75584 -97486 324148 70220 135576 46314 308297 151279 306312 -51913 222775 -129686
$$ packed form
12024E0727A1459Q2578J99861q7680e9118H4309J24843a94361C31427H4669M4715
12013A29384R1141c8952j50880A01423K8369m422J61722e4211A36865f784A01508
12001A61118p7925b03784h2898G5086O7285R8876A15758C9070K64431a06589L0663
11990g5926n1156A98876a62301A54661E4752g431j64197q765A85322J38687R8771
11979D22780h5590g937A16637k0209e830j1495q5200o6152j88835b398I1260a65823
11966f2569n420j00226r8057Q5464A00417a64788A57409a6867D4174P4137h4210
11954I8463m8317J61866b14062L5552B23102q1936a13840n35B8246J7580a70365
11942g5584k1902C24148G0220O5356D6314K61983A51279J55033e1913B22775a29686
$$ plain form
11930 89944 -100439 269383 -44488 -47319 28577 91778 -90249 -17934 60099 -18153 36753
11918 -141304 -118823 -140274 211834 276350 311865 140918 -51690 -52055 26062 -286720 -106996
11906 -77154 -215600 128945 -193127 -85517 254812 -10095 54801 -35498 -6604 326156 -54055
11894 -195056 30619 -62499 -259746 -111630 -227370 -115928 -212595 -23899 -104310 -70121 -133578
11883 -133578 -74033 -48613 -368634 124424 395565 179296 -21868 -70612 103119 -55342
11872 -19533 162142 237256 135923 31040 -304105 253752 116960 193634 191553 203481 -37649
11860 -40796 19287 -18260 -318558 126580 -188433 -38818 -83284 -253201 3714 -235402 183948
11848 -190291 -125935 -86015 -50558 29321 -133319 152169 504646 -39472 45284 46782 46091
$$ packed form
11930H9944a00439B69383d4488k831B8577O3201i0249a7934F0099a8153C6753
11918a41304K2481k1451B11834O4516L5515A40918e1690l65B6062b86720a06996
11906g7154j38446A28945a93127h5517B54812a0095E4801c5498f604C26156e4055
11894a95056C0619f2499j97247a11630j15740J11442r6667b3899q0411L4189o3457
11883a33578N9545K5420l20021A24424K71141A79296b1868m8744A03119e5342
11872a9533A62142P5114j01333C1040c04105B53752A16960P6674k081J1928c7649
11860d0796A9287a8260l00298A26580a88433c8818m4466j69917C714b35402A83948
11848a90291O4356L9920L5457B9321a33319A52169L52477c9472D5284J498o91
$$ plain form
11837 46091 -158503 -128956 -87615 -117175 -42468 252905 162047 -101138 200157 -287623 182542
11825 114547 -254104 -197431 4003 -32557 -78960 53889 41958 -47080 131253 -101623 -109030
11814 -109030 -186591 -292103 -99573 -30968 193257 -271995 -297789 -12456 -145542 -143881 -221645
11803 -221645 -97303 -268118 95115 -131588 73660 142207 8326 132794 -197499 114778 39139
11791 -319040 22218 -100636 -33004 -194946 -6911 -338644 98446 -10802 -60828 135654 -38827
11779 292315 4752 -44273 260026 144837 97581 254610 173590 -173776 41956 257996 335992
11768 335992 -23724 70565 -34955 6611 -79533 -132561 -234798 -204606 104792 23072 -132919
11756 -230131 -74185 127130 17869 -28263 -193365 143201 170729 250344 -6223 156709 16275
$$ packed form
11837D6091a58503K9547M1341k9560d2468B52905r0858a01138B00157b87623A82542
11825A14547b54104N6673D003c2557m6403E3889j1931d7080A31253a01623p407
11814a09030p7561j05512i9573c0968A93257b71995k5794a2456j33086J661p7764
11803b21645i7303j70815I5115a31588G3660O8547H326J24468a97499A14778C9139
11791c19040B2218a00636c3004j61942f911l31733I8446a0802n0026A35654c8827
11779B92315D752d4273B60026j15189m7256J57029q1020a73776D1956K16040P7996
11768C35992b3724G0565c4955F611g9533n3028j02237L0192A04792B3072a32919
11756b30131g4185A27130A7869b8263j65102A43201K7528P9615f223A56709A6275
$$ plain form
11744 -371193 -111760 -24141 -25061 168944 152539 50490 21606 -150064 -201054 116855 292182
11733 292182 57185 129552 22174 -181345 -118917 322564 364755 -56136 -190063 -131090 73512
11721 310083 219786 8213 336172 195619 -155030 66550 -18858 -106061 105661 -66498 -210443
11710 -210443 -17631 113655 123083 339470 -20817 -44689 -234142 -146551 241423 79102 80008
11699 80008 -3809 -121092 37980 94067 154624 -95425 160626 -222819 138092 94671 33429
11687 204718 -113124 -92594 -236964 -6096 84449 308920 -184178 128487 239203 171627
11677 171627 269103 67257 9863 -111795 -78911 -177139 103776 -38208 -226409 171328 -221449
11665 -219113 319535 124772 156069 128120 276088 70601 -104983 170051 91504 83583 -244344
$$ packed form
11744c71193a11760b4141r20A68944j6405E0490B1606a50064n0990A16855J75327
11733B92182E7185P2367B2174a81345O2428C22564M2191e6136j33927N8973G3512
11721C10083r0297H213L27959j40553a55030F6550a8858q7203A05661f6498j43945
11710b10443a7631A13655R428K16387b0817k3872j89453Q7591B41423G9102R06
11699H0008c809j17283C7980N6087O0557i5425A60626b22819A38092m3421C3429
11687B04718a13124K0530j44370f096H4449K24471a84178A28487J10716o7576
11677A71627R7476F7257I863a11795L2884r8228A03776c8208j88201A71328b21449
11665b19113C19535A24772L1297k7949J47968G0601a04983A70051p8547p921b44344
$$ plain form
11653 27402 408964 137531 -129917 -131090 103615 -201763 -142490 -162143 -176482 -46420 21429
11641 9334 98957 274350 755 -17731 19981 -3098 111256 -86995 -294002 -420594 52586 112203
11629 112203 109880 -74321 -167856 -59472 249421 -167493 -333663 7513 135954 -1994 177699
11617 257870 -68092 403314 -80420 103788 231223 76052 -84947 313669 -61665 25943 -75635
11605 170598 198377 -167739 235818 42647 -182202 415 -73504 -130171 -8425 -23972 -74113
11594 -74113 -3757 10631 64453 -191935 -99688 276139 218524 230481 207264 -43816 -171992
11583 -171992 -275088 214254 -136224 -151768 424020 545882 156816 -378527 70231 -24693
11572 213373 45758 -5970 -226042 196792 -33447 239451 128215 282378 183981 350985
$$ packed form
11653B7402L81562A37531a29917j173A03615b01763N9273j9653j4339d6420B1429
11641I334Q9623J75393G55a7731A9981c098A11256h6995k07007j26592E2586N9617
11629A12203k323g4321r3535e9472B49421a67493j66170G513J28441a994A77699
11617B57870f8092D03314h0420A03788J27435G6052h4947C13669f1665B5943g5635
11605A70598K7779a67739B35818D2647a82202D15g3504n6667h425j5547n0141
11594g4113c757A0631N3822a91935R2247B76139n7615J1957k3217d3816j28176
11583a71992j03096B14254a36224j5544D24020J21862A56816c78527G0231b4693
11572B13373D5758e970k20072A96792c3447B39451j11236J54163r8397J67004
$$ plain form
11562 350985 398642 -164001 -30250 251846 -99430 135976 208691 -253957 397570 -157988
11551 285250 139908 139052 303340 129435 -126233 240221 16370 -170040 -22107 163655
11540 1486 73810 141992 180687 92703 -88703 -219465 -139619 29397 209067 233080 -38457
11528 32404 50093 333519 39643 79856 124432 89865 -116391 -157412 88110 144128 121231
11517 121231 224713 284636 -115607 42209 178333 -33630 19224 -70336 317503 -94557 52707
11505 -111095 188436 -6152 65047 -128893 281852 34308 153258 -73174 136126 70889 72311
11494 72311 -18765 227488 23807 271767 256696 215568 -57769 -18882 414274 21481 -294935
11482 423238 547266 190727 348008 487945 142005 4060 237180 -8571 451902 137374
$$ packed form
11562C50985M7657a64001c0250B51846i9430A35976P2715b53957C97570a57988
11551B85250A39908q56J64288A29435a26233B40221A6370a70040b2107A63655
11540A486P2324O8182L8695q7984h8703j30762P9846B9397J79670K4013c8457
11528C2404J7689K83426C9643M0213M4576l4567a16391m1021H8110N6018k2897
11517A21231J03482N9923a15607D2209J36124c3630A9224g0336C17503i4557E2707
11505a11095A88436f152F5047a28893B81852C4308J18950g3174A36126o5237J422
11494G2311a8765B27488B3807K47960j5071m1128e7769a8882D14274B1481b94935
11482D23238J24028A90727J57281J39937A42005D060K33120h571D51902A37374
$$ plain form
11471 -134162 -137016 -9661 111926 93765 466350 213099 184244 451574 336127 358262 73817
11459 105127 139063 270405 245961 97298 317609 -310490 155667 5889 301787 -5666 207160
11447 126574 331359 105130 35666 44962 236261 265125 -211790 145714 8731 -35588 -81077
11436 -81077 417182 19583 -207311 -121944 55151 162822 26511 68728 101332 52234 142461
11425 142461 172015 -39780 113142 -8883 -233964 4743 311189 -220756 -32555 -125875 226713
11413 265651 74395 251153 -55641 52614 -228581 -299454 -56873 -32874 69840 -279094 -106480
11401 -155774 91349 -132394 79879 211503 -15628 282093 -215899 4715 191517 59529 73710
11390 73710 173882 -159532 -211377 28163 30240 147568 -43940 90976 162064 156032 -154831
$$ packed form
11471a34162k854i661A11926j8161L72585B13099k8855K67330j15447K2135G3817
11459A05127L3936J31342k4444I7298K20311c10490A55667E889K95898e666B07160
11447A26574K04785A05130C5666R296J91299K8864b11790A45714H731c5588m5489
11436h1077D17182A9583b07311Q5367E5151J07671B6511M2217L2604m9098R0227
11425A42461K9554c9780A13142h883k25081D743L06446b20756c2555r3320B26713
11413B65651G4395J76758e5641E2614b28581p0873e6873K3999F9840b79094a06480
11401a55774I1349a32394G9879J31624a5628B82093b15899D715J86802E9529J4181
11390G3710J00172a59532n1845B8163K077J17328d3940I0976P1088o032a54831
$$ plain form
11378 170078 109296 -56586 211132 33180 231503 -86389 -46484 -140524 -502778 -819 -125862
11367 -125862 -129567 -106848 241140 241142 -154556 -216613 -251144 34735 12826 -29135 69985 51308
11355 51308 78102 -57285 -4616 -299689 11049 -27680 -59360 104052 18458 -126897 -95624
11344 -95624 227612 133512 -66698 -184586 511454 225645 -180444 -173508 -229842 -127023 -78163
11333 -78163 -143711 182873 -10833 -98599 65773 14795 -482823 -271147 -102722 12305 129471
11322 129471 -227889 5441 -376204 432934 -91097 159395 -15211 -12730 9820 -16542 -87372
11311 -87372 -33609 -2079 -80528 -196655 59048 224808 243974 146045 8512 -190097 -81466
11299 65183 -200451 101133 -205223 -142128 -163315 -347532 -131507 91414 -31224 -89560 -63736
$$ packed form
11378A70078o0782e6586B11132C3180J98323h6389L9905r4040l62254h19j25043
11367a25862l705K2719B41140Ka54556o2057l4531C4735A2826b9135F9985j8677
11355E1308K6794e7285d616k95073A1049b7680l1680A04052A8458a26897L1273
11344i5624B27612r4100f6698j17888E11454B25645a80444O936n6334J02819M8860
11333g8163o5548A82873a0833q7766F5773A4795d82823K11676a02722A2305J17166
11322A29471b27889E441c76204D32934i1097A59395a5211K481I820a6542p0830
11311h7372c3609b079p8449j16127E9048J65760J9166r7929H512a90097h1466
11299F5183b00451A01133b05223O3095k1187j84217a31507I1414c1224n8336K5824
$$ plain form
11288 -63736 -34383 164151 -254342 65566 -104536 -239156 242097 168655 89437 -22385 160183
11276 30067 -44550 -111665 -31842 -269164 -58148 239695 -100257 337337 -135170 299292
11265 13442 42382 -201855 20205 -126714 198988 134523 152485 1174 114698 -277567 -89888
11253 129426 -165648 -166560 -244090 130077 -294199 -56097 -181259 -284761 -229347 -80732 5337
11241 -127045 92088 -347354 246634 219222 -243810 167397 -202542 9583 -195585 -234366
11231 -234366 163788 -240930 71685 47723 -172282 -83390 169314 397658 67099 -240794
11220 6943 -6462 -380012 -132211 -98788 1483 166340 -139216 87222 214074 -321335 70810
11208 61482 18387 -43219 4729 20465 -40158 -149499 18478 55886 -205953 -251813 308543
$$ packed form
11288f3736K9353A64151b54342F5566a04536j34620B42097p3442p9218b2385A60183
11276C0067d4550o7115c1842k37322e8148B39695a00257C37337a35170B99292
11265A3442K8940b01855B0205a26714A98988o4465J7962A174J13524b77567h9888
11253A29426a65648r12p7530A30077b94199e6097j25162j03502N5414h0732E337
11241a27045I2088c47354B46634k7412b43810A67397b02542I583a95585l8781
11231b34366A63788b40930G1685k3962a72282h3390A69314K28344F7099b40794
11220F943f462l73550a32211L3423A483J64857a39216H7222J26852c21335G0810
11208F1482A8387d3219D729J5736d0158j09341A8478L7408b05953m5860C08543
$$ plain form
11196 -343066 101526 587334 -11606 -270188 -75163 39351 152404 289994 57472 334916
11186 334916 -301145 -98640 -347777 -202727 -157461 -85935 -163248 60870 -333116 -67027 -309372
11175 -309372 8867 -92874 -103465 -204984 -108121 -308930 -101613 -82791 -74791 119915 -100593
11163 -119728 -121244 11281 -221699 133617 282308 -225607 204098 117476 212423 248865 32333
11151 66220 -280797 -129875 143310 341490 218716 -117830 -9503 76195 -332733 -257102
11141 -257102 -195400 -71397 -261026 -221987 -142081 56291 224337 -12354 66397 123180 386769
11130 386769 -135569 25892 245733 -25628 -67145 132712 -25944 378453 -135914 158782
11119 109948 166634 -36826 323678 83811 -57078 107987 24958 117236 -370411 399387 -61737
$$ packed form
11196c43066A01526M85808a1606k58582g5163C9351J13053J37590E7472K77444
11186C34916c01145i8640k49137J45050M5266P1526p7313F0870c33116f7027k42345
11175c09372H867i2874j0591j01519R6863k00809a01613J8822Q000A19915a00593
11163a19728j516A1281b21699A33617J48691b25607B04098q6622R4947L6442C2333
11151F6220b80797a29875A43310J98180j22774a17830i503G6195c32733P5631
11141b57102O1702g1397j89629L9039P9906E6291J68046a2354F6397N6783K63589
11130C86769a35569B5892K19841b5628m1517A32712b5944C78453a35914A58782
11119A09948N6686c6826C23678H3811e7078A07987B4958R2278c70411C99387f1737
$$ plain form
11107 -13566 117889 -100969 366196 40818 20293 -22805 -73222 49356 65567 91398 84303
11096 84303 452108 98731 186296 227302 209645 214463 85046 -17880 398976 212757 249056
11085 249056 306811 433289 466951 144175 143886 15863 233845 -2308 428108 197056 148433
11074 148433 339566 167265 213511 426856 31108 442590 88138 157750 307397 365482
11064 365482 369770 716558 370834 249169 622451 236084 443556 612546 368213 539699
11054 539699 298277 827676 525938 574907 648763 693884 992396 767696 419701 784939
11044 784939 820963 822122 1006852 1067214 709644 995878 862412 1010443 686836 951770
11034 951770 710973 685276 792097 1005006 459810 456220 851183 757932 702861 858703
$$ packed form
11107a3566A17889a00969C66196D0818B0293b2805n0417D9356J6211K5831p095
11096H4303L67805I8731Q7565M1006j7657M818H5046a7880C98976j86219L6299
11085B49056N7755J26478L3662A44175k89A5863K17982b308D28108A97056m8623
11074A48433J91133A67265M6246K13345C1108M11482H8138O9612J49647N8085
11064C65482M288L46788l45724j21665L73282B36084K07472J68990k44333J71486
11054E39699k41422N29399l01738M8969P3856M5121K98512k24700l47995L65238
11044G84939L6024J159J84730O0362l57570K86234j33466J48031l23607K64934
11034I51770k40797k5697J06821K12909D59810l590L94963r3251n5071J55842
$$ plain form
11024 858703 704428 693931 809890 771276 817972 1084775 957734 824639 651035 754304
11014 754304 545103 648755 360365 485776 402416 695535 1078467 588488 779951 633455
11004 633455 773937 649070 567556 528490 720813 521643 632920 484792 530884 722276
10994 722276 381211 740268 864724 940915 404276 980191 788369 266424 756062 574199
10984 574199 1111017 950054 702459 1220087 1097812 1096984 1328934 1544475 1584947 1461484
10974 1461484 1380174 1659452 1872575 2206447 2182890 2317100 2939070 3088510 3037260 3001247
10964 3001247 2729626 2584617 2294320 2212057 1715363 1405476 1733890 1863562 1665044 1540001
10954 1540001 1953215 1727529 1570841 1455506 1722547 1239750 1342958 1129076 979789
$$ packed form
11024H58703j54275j0497J15959l8614M6696K66803j27041j33095j73604J03269
11014G54304k09201J03652k88390J25411q3360K93119L82932m89979J91463j46496
11004F33455J40482j24867q1514l9066J92323j99170J11277j48128M6092J91392
10994G22276l41065L59057J24456P6191D04276N75915j91822B66424M89638j81863
10984E74199N36818j60963k47595N17628j22275q28K31950K15541M0472j23463
10974A461484q1310K79278K13123L33872k3557J34210O21970J49440n1250l6013
10964C001247k71621j45009k90297q2263m96694l09887L28414J29672j98518j25043
10954A540001M13214k25686j56688j15335K67041m82797J03208k13882j49287
$$ plain form
10945 979789 635072 687482 247510 498989 370786 417794 140105 372994 147420 96897
10935 96897 -218797 77928 309481 99951 62624 51416 263737 152357 528135 -162055
10924 -15558 -287402 -70298 -254179 -167593 49714 115607 6220 43443 60169 175457 139000
10913 139000 93002 93256 66147 -152242 119993 130853 -50582 -124960 104135 -49590 -36094
10902 -36094 215550 96590 73553 124631 -60216 176525 -71907 -370512 -1965 -165785 208341
10890 -5153 273708 270275 3463 73014 159700 -118159 -42218 -55832 116241 194018 18537 -55269
10877 -8188 -161442 182023 -190582 -13549 -105429 -32048 -32397 -19135 -79899 99300 -71688 423681
10864 -87105 117726 252606 11606 171879 147989 -37207 -68856 -13851 -298032 3550 -72064
$$ packed form
10945I79789l44717N2410B47510K51479j28203M7008A40105K32889A47420n0523
10935I6897b18797G7928K31553I9951l7327j1208K12321j11380L75778a62055
10924a5558k71844g0298j83881Q6586D9714O5893F220L7223J6726J15288l6457
10913A39000m5998K54k7109a52242A19993J0860e0582p4378A04135d9590J3496
10902c6094B15550I6590k3037N1078f0216A76525g1907k98605a965j63820B08341
10890e153B73708l433C463O9551Q6686a18159d2218j3614A16241P7777A8537e5269
10877h188j53254A82023a90582a3549r1880c2048l49J3262o0764I9300g1688D23681
10864h7105A17726J34880A1606J60273k3890c7207l1649a3851k84181C550g2064
$$ plain form
10852 -4885 196058 19754 277305 -290325 207347 58542 -128149 69064 206748 -146513
10841 43616 -244260 -615080 -192924 -329090 -108800 105785 234155 -230439 -194608 -103824
10831 -103824 -379489 -195974 -127910 -74840 -68459 294282 248667 -128618 133342 19872 -162497
10819 152619 60473 -255945 279374 -164228 -25366 43311 -281303 -13824 149824 96167
10809 96167 180559 -125163 4401 -106064 -121681 -175578 29448 85391 31192 -136362 211238
10797 -201037 128932 -70079 -184220 169988 51819 171067 -3007 28678 76534 -41467 -149320
10786 -149320 -182697 17702 53576 55537 175948 198078 19057 331400 -121476 -55314 -181312
10775 -181312 226916 132993 -211694 123158 -242130 32211 4895 173249 271816 60464 -11571
$$ packed form
10852d885A96058A9754K57551b90325B07347E8542a28149F9064J37684a46513
10841D3616b44260l70820a92924j36166a08800A05785J28370b30439L5831R0784
10831a03824k75665J83515O8064N3070O381B94282m5615a28618A33342A9872a62497
10819A52619F0473b55945B79374a64228b5366D3311b81303a3824A49824n3657
10809I6167Q4392a25163D401a06064j5617n3897B9448N5943C1192a36362B11238
10797b01037A28932g0079j14141A69988E1819J19248c007B8678M7856d1467j07853
10786a49320l3377A7702L5874J961J20411K2130A9057L12343a21476e5314j25998
10775a81312B26916r3923b11694A23158b42130C2211D895J68354R8567F0464a1571
$$ plain form
10763 -109287 -257646 -272206 -335902 213624 -226485 -255320 -311602 -19508 -88792 -184806 201304
10751 -140371 -173898 -11347 82545 186192 110912 225933 -490803 157151 224973 -81470 14768
10739 2804 4099 -20174 -1181 121522 -74879 188730 -101487 -88839 110101 109356 -76064 -203383
10727 -203383 -51623 147499 73206 -257432 -114186 26346 129508 169071 120997 291543
10717 291543 -10431 175830 112933 252736 -147315 -216834 -15118 25569 -39493 -81366 -250908
10706 -250908 -188171 -373862 271946 -285690 -137480 133798 -321191 -283881 34696 -48499
10695 -2414 -135543 -51310 -134151 -181479 -36253 -22335 79641 -56734 -37126 -196912 59435
10683 -36820 -78444 -312519 -18837 -72899 -34115 -155882 287793 -104514 -262648 -97135 10384
$$ packed form
10763a09287j48359j4560o3696B13624b26485k8835n6282a9508o9284r6014B01304
10751a40371l3527a1347H2545J03647p5280J15021d90803A57151O7822h1470A4768
10739B804J295b0174a181A21522g4879A88730a01487J2648A10101p45g6064j27319
10727b03383e1623A47499G3206b57432a14186B6346J03162L9563m8074J70546
10717B91543a0431A75830o2897J39803a47315o9519a5118B5569c9493m1873j69542
10706b50908O2737j85691B71946b85690a37480A33798c21191L7310C4696d8499
10695b414j33129e1310q2841m7328c6253J3918G9641e6734J9608j59786E9435
10683c6820m1624k34075a8837n4062c4115j21767B87793a04514j58134i7135A0384
$$ plain form
10671 -323961 -35486 191708 163719 156235 -10196 221836 -115758 -184537 298816 -213831 -120532
10660 -120532 89848 -15732 214415 -2399 -78844 -259562 -123378 -60508 -235364 -256848 254808
10648 90422 -4030 -124239 -233744 69095 100378 -16674 -35852 -159397 -291719 -20788 44443
10636 -386876 -103929 58790 -198154 -241745 -122450 35972 230847 -176656 47790 -192840
10625 99016 -213887 -305141 -250469 172973 -227226 -4840 -103015 -111441 -67595 -137882 97600
10613 -99597 -287394 -157328 -66481 132537 -18163 -215777 79681 -115006 -71393 -112718 99919
10601 -85533 -325989 -254698 -40118 -40923 -55299 -225198 -228723 169977 31328 247166 -287525
10589 -81136 -188600 -42358 -335948 -159590 1182 84917 182657 -19998 -322019 -46740 -34438
$$ packed form
10671c23961c5486A91708k7989p484a0196B21836a15758o8779B98816b13831R3299
10660a20532H9848a5732B14415b399p6445j80718a23378f0508j74856k1484B54808
10648I0422d030j20209j09505F9095L1283a6674j9178j23545j32322b0788D4443
10636c86876a03929E8790a98154m3591J19295C5972J94875a76656D7790a92840
10625I9016b13887r1254N4672A72973b27226d840r8175q426M3846p0287I7600
10613i9597j87797J30066f6481A32537a8163j97614G9681a15006M3613m1325I9919
10601h5533k40456P1291d0118q05j4376j69899l525A69977C1328K15838b87525
10589h1136j07464d2358k93590a59590A182Q3735R7740a9998l02021d6740J2302
$$ plain form
10578 -34438 151531 -119146 -218080 -124120 119928 -120054 -171930 -181173 200285 28722 107562
10567 107562 -219915 -23412 26796 192886 -73867 -14957 241825 11340 -297102 136643
10556 60828 -77790 134292 78815 -83304 -66690 163812 -87234 -161506 -12373 -131643 196832
10544 119715 98461 -219086 -97070 84219 -37791 -192641 -45585 -223997 -329084 -159432
10533 240824 194519 -96749 -94327 103901 -211978 4139 -127411 -136779 160014 -15256 -168476
10522 -168476 -254749 161858 -289960 293904 -74688 -108623 -56964 203547 -118562 -261106
10512 -261106 72241 60428 -171802 -227750 -76117 148928 11018 -351383 119312 7982 -67748
10500 -114322 -136076 -179741 203779 7229 -9927 14148 -53685 -1781 46087 -186329 -34839 171395
$$ packed form
10578c4438A51531a19146r8934R3960A19928a20054n1876r243B00285B8722P8840
10567A07562b19915b3412B6796J66090g3867a4957B41825A1340b97102A36643
10556F0828g7790A34292n5477h3304J6614A63812h7234p4272a2373j19270A96832
10544A19715k1254b19086i7070H4219c7791j54850d5585j78412j05087a59432
10533B40824m6305i6749K422A03901b11978D139a27411r368A60014a5256j53220
10522a68476q6273A61858b89960B93904g4688l3935N1659B03547a18562j42544
10512b61106G2241j1813a71802n5948g6117A48928A1018c51383A19312G982f7748
10500a14322k1754m3665B03779G229i927A4148e3685a781D6087a86329c4839A71395
$$ plain form
10487 81501 167109 7459 -163961 154535 157935 107584 18384 309740 437807 17459 27424
10476 27424 347795 485608 687178 624374 524916 112407 364570 138923 259508 -143840
10465 19172 -97167 220337 -90604 -189056 99029 146335 80049 -119183 -54621 -157282 52678
10453 -242745 -142692 -227931 -217385 -235069 28549 -64379 43737 118451 137257 -99631 -289840
10442 -289840 619 -85745 46539 -205976 -215155 -14819 -18885 -205272 -81122 -273811 -244957 -192200
10430 -192200 45662 219621 -126550 -80153 22145 120535 -90246 -169530 -193747 196144 -141529
10418 88790 -231438 252534 -225513 -57036 19896 -87723 -322880 -210414 105158 7227 -136573
10406 -324775 2803 -153266 -62552 66812 104274 -53804 -224107 91140 -45040 372431 123156
$$ packed form
10487H1501Q5608G459a63961A54535L400n0351A8384K91356J28067A7459R965
10476B7424L20371J37813K01570o2804r9458A12407K52163A38923J20585a43840
10465A9172i7167B20337i0604r8452I9029M7306o6286a19183e4621j02661E2678
10453b42745J00053q5239J0546j7684B8549f4379D3737P4714J8806i9631j90209
10442b89840F19h5745D6539b05976r179a4819m066j86387h1122j92689K8854N2757
10430a92200D5662J73959a26550M6397B2145R8390i0246p9284k4217A96144a41529
10418H8790b31438B52534b25513e7036A9896h7723k35157J12466A05158G227a36573
10406c24775B803a53266f2552F6812L7462e3804j70303I1140d5040C72431A23156
$$ plain form
10394 -109832 51615 -148913 139720 244707 140421 44802 -6754 -42904 276842 365194 5057
10382 151475 -37956 210127 210585 99169 15985 36719 225979 84723 247396 156147 -24670
10370 294996 27934 391659 433805 439053 193153 599290 176586 560205 600683 239094
10359 604039 190828 226345 445802 527620 361273 337812 397416 122292 455291 148466
10348 715764 425541 317809 484393 69869 392384 172345 556533 475927 498786 152942
10337 -158488 128206 479842 444883 -112974 550201 111818 118380 322324 93389 -257017
10326 66927 23120 39380 -46425 -113119 -55854 -10507 312658 334987 11237 281737 302763
10315 302763 -262259 165117 181608 82712 59752 -92938 -250950 -6560 -59946 -191191 6556
$$ packed form
10394a09832E1615a48913A39720J04987j04286D4802f754l6150B76842Q8352E057
10382A51475c7956B10127M58I9169A5985K0734J89260H4723J62673r1249b4670
10370B94996B7934L63725M2146N248A93153M06137A76586L83619M0478B39094
10359F04039A90828L5517K19457Q1818j66347k3461N9604A22292L32999A48466
10348G15764k90223j07732J66584F9869L22515A72345L84188q0606K2859A52942
10337a58488A28206L51636l4959a12974E50201A11818O562K03944I3389b57017
10326F6927B3120J6260d6425o6694e5854a0507C12658K2329A1237K70500K1026
10315C02763b62259A65117J6491H2712k2960i2938j58012f560n3386j31245F556
$$ plain form
10303 195666 309305 -198074 -262447 91591 -150396 -157265 122137 -28309 195295 -97060 -268209
10292 -268209 19063 123923 -387625 -305723 -291877 -334348 27746 -53565 -245418 102263 -104842
10280 -289696 -66931 -146123 -292793 22440 31827 -292945 222764 208287 -112133 226499 228933
10269 228933 56117 10017 94561 -91104 -195948 38601 -202295 -51868 -24431 -15760 -94266
10258 -94266 -175108 169707 -51603 -117846 38836 298789 341383 225959 82351 331936 61886
10246 214556 394017 -70881 -272231 -38959 212613 34640 -376338 5064 -316124 11942 60569
10235 60569 60096 -29906 179509 -2922 -38490 -291272 77875 -17848 227053 -186408 -13753
10223 50461 -7381 166799 -8037 178104 10034 -19992 -93474 192763 228553 -174954 60397
$$ packed form
10303A95666J13639a98074o4373I1591a50396o869A22137b8309A95295i7060j71149
10292b68209A9063J04860c87625Q1902J3846m2471B7746e3565j91853A02263a04842
10280b89696f6931p9192j46670B2440R387b92945B22764j4477a12133B26499K434
10269B28933E6117A0017Q4544i1104j04844C8601b02295e1868b4431Q671p8506
10258i4266q0842A69707e1603o6243C8836K59953M2594j15424H2351K49585F1886
10246B14556J79461g0881k01350c8959B12613C4640c76338E064c16124A1942M8627
10235F0569m73b9906A79509b922l5568k52782G7875a7848B27053a86408a3753
10223E0461g381A66799h037A78104A0034a9992p3482A92763L5790a74954F0397
$$ plain form
10211 -28850 -351367 215388 127899 -450883 132843 -122789 -19539 -96510 -116118 59868 -55684
10199 -141932 -14058 38027 -78093 -241202 50245 -277286 -191199 -193894 121416 -128832 34390
10187 -14919 -175456 -153618 -249334 186579 21413 -75365 320616 93223 -223298 394166 -181247
10175 -87180 -167989 -140083 220819 -134993 -74835 74410 -135234 127985 -80850 -41967 -165402
10164 -165402 58690 -192141 -149769 357046 -225465 -586166 -237727 -204584 -147353 324075
10153 -2752 112061 104127 27543 -34289 -74877 97244 -33470 -9301 10050 -160021 162495 -237114
10140 -39917 -238832 -227625 -26932 -378881 329512 -212864 102692 -452534 -107560 -122135
10130 -122135 59032 210885 -203421 21301 272350 -285393 -147471 -157314 -123263 287644
$$ packed form
10211b8850l22517B15388q7489d50883A32843a22789a9539p6971j9608E9868e5684
10199a41932a4058C8027g8093j63109E0245b77286Q6087k695A21416a28832C4390
10187a4919j60537K1838r5716A86579B1413g5365C20616I3223b23298C94166a81247
10175h7180q0809K7906B20819a34993O0158G4410a35234A27985h0850L8883j23435
10164a65402E8690a92141M2372C57046b25465l60701b37727L3143N7231C24075
10153b752A12061p934B7543c4289m0588I7244c3470i301A0050a60021A62495b37114
10140c9917j98915J1207b6932l51949C29512b12864A02692d52534a07560j4575
10130a22135E9032J51853b03421B1301K51049b85393J37922r843L4051B87644
$$ plain form
10119 22779 -964 364838 176812 -60763 212645 57666 -119237 -143079 197664 11896 -106806
10107 -320509 123024 -966 -245844 83134 -248623 -195290 58787 -23269 -778 -172830 -62065
10095 -14 71493 -218024 -76545 41923 -257835 -91740 -139123 131669 136277 -160229 -236471 57455
10082 -3167 117195 -140487 27786 -119837 -371312 -56614 -99936 -156568 -51492 39445 237
10070 -130499 -218475 -631 -64356 -111764 -20205 -33397 -310649 102071 -159817 -244540 -220604
10059 -220604 20910 112 -340312 45365 62073 -268146 186827 -34686 -231468 -16716 64379
10047 141341 -95715 56865 -1084 226051 -177007 -169906 -256648 -216609 22520 -287519 -50456
10035 -394497 45628 -110518 -238198 -287330 76750 -114473 -255827 5617 -264057 338739
$$ packed form
10119B2779i64C64838A76812f0763B12645E7666a19237k3842A97664A1896a06806
10107c20509A23024i66k44878H3134b48623N3333E8787b3269g78j72052f2065
10095a4G1493b18024g6545D1923b57835i1740m7383A31669M608a60229p6242E7455
10082c167A17195a40487B7786a19837k51475e6614m3322n6632e1492C9445B37
10070a30499q7976f31o3725m7408b0205j3192k77252A02071a59817q4723K3936
10059b20604B0910A12c40312D5365J6708b68146A86827c4686j96782a6716F4379
10047A41341i5715E6865a084B26051a77007P101q6742M0039B2520b87519e0456
10035c94497D5628a10518j27680m9132G6750a14473j41354E617b64057C38739
$$ plain form
10024 -185583 -297459 296661 -69884 -186609 -312041 -489700 64110 -58461 284735 -68207
10013 40816 -79724 92952 -324604 -218787 98467 95425 226828 11203 211173 33214 82964
10002 82964 178242 202945 -67717 -46640 -143381 -349592 225228 -28087 -52153 135909 81534
9991 81534 28932 147474 -38381 -35718 -245844 433124 -81074 -65625 -82419 -194840 173950
9979 -28690 -110392 -27858 -153325 -174125 -227922 -102528 2563 58841 -371564 154243 148708
9968 148708 -329757 -171477 -224550 -40836 -190135 67367 -150153 79807 -15589 41446 -112188
9956 16090 77226 277164 -344133 224071 -330291 -148210 -102201 -293317 -220662 -258082 -192163
9945 -192163 -23449 15853 221472 -262585 -133586 -141691 39173 340303 51842 -254302 175508
$$ packed form
10024a85583j11876B96661f9884j16725j25432j77659F4110e8461B84735f8207
10013D0816g9724I2952c24604J05817I8467l042J31403A1203J99970C3214M9750
10002H2964R5278K4703f7717K1077r6741k06211B25228b8087k4066A35909n4375
9991H1534B8932J18542c8381K663k10126D33124h1074J5449j6794j12421A73950
9979b8690q1702b7858j25467k0800n3797a02528B563N6278c71564A54243n535
9968A48708c29757J58280n3073d0836j49299F7367a50153G9807a5589D1446a12188
9956A6090O1136J99938c44133B24071c30291a48210M6009j91116P2655l7420O5919
9945a92163b3449A5853K05619b62585J28999q105C9173L01130E1842b54302A75508
$$ plain form
9933 -30085 103718 -10653 -42158 156817 142401 -91212 -235172 -599283 -16005 -41279 -115003
9922 -115003 -191741 -27732 -116158 -72768 200600 409728 -165970 78621 213748 -242376 -223475
9911 -223475 -55368 -154000 -165249 -126747 110723 -58998 -122129 -101828 380091 -211266 -35246
9899 -317821 174155 -75072 -261626 -92956 -144183 -237301 -52369 350810 -294447 -191248 89911
9887 -102868 -83463 -29571 -440589 -111587 -120604 -82190 -119926 -12577 -192336 89966 -162398
9875 144077 -12848 -362743 -76183 -333251 -16944 -177312 94132 -17611 15257 -105879 -178976
9864 -178976 200263 -107779 -155388 68414 15169 -87952 -25191 -203772 -179436 35102 -162543
9852 -2211 6105 -31578 69326 80907 -47665 97480 -105560 -733 -37890 -215647 -27722 -313726
$$ packed form
9933c0085A03718a0653l1505A56817j4416i1212j43960l64111a6005k5274p3724
9922a15003p6738b7732q8426M3390B00600K09128a65970G8621J35127b42376J8901
9911b23475e5368r8632j1249L8502A10723e8998o3131K0301C80091b11266c5246
9899c17821A74155g5072j86554i2956n1227r3118e2369C50810b94447J03199H9911
9887a02868J9405b9571m11018a11587r017L8414l7736a2577j79759H9966a62398
9875A44077a2848l49895g6183k57068a6944j60368I4132a7611A5257a05879p3097
9864a78976B00263a07779m7609F8414A5169h7952b5191j78581K4336C5102a62543
9852b211F105c1578F9326J1581d7665I7480a05560g33l7157j77757b7722k86004
$$ plain form
9840 -313726 -62046 -157037 -187170 -25944 93234 42154 -72819 -277068 77127 -59047 -60089 -410246
9828 -410246 -684 -118018 -173273 -244000 246033 -74628 -349040 -317722 86278 110929 -112097
9816 -149433 154248 -342120 -18915 -117484 -194913 198332 409 -58225 -41024 -166235 43998
9804 61935 6759 239782 -71942 -148094 -42605 -52566 -166976 -271746 -103107 103479 -12633
9792 -139381 -257344 108943 133657 76363 -24096 -58612 110340 49732 247010 -326278 34819
9780 -268124 -107290 -206339 -292531 -8112 -135325 -73893 132584 121129 17115 -29733 164743
9768 -139119 -35916 -115557 -381112 -128576 25512 -28989 -83877 -182300 -278602 172656 210692
9757 210692 -112424 62381 175633 53904 -419243 19602 -104789 -220644 -19301 -133397
$$ packed form
9840c13726f2046r4991l0133b5944I3234D2154g2819k04249G7127e9047j042l50157
9828d10246f84j17334n5255p0727B46033g4628k74412L1318H6278K4651a12097
9816a49433A54248c42120a8915r8569p7429A98332D09e8225J7201j25211D3998
9804F1935F759K33023g1942p6152d2605r961j14410j04770a03107A03479a2633
9792a39381j17963A08943K4714n7294b4096l4516A10340D9732J97278c26278C4819
9780b68124a07290r9049q6192h112j27213O1432A32584j1455A7115b9733A64743
9768a39119c5916p9641k65555a28576B5512b8989n4888r8423r6302A72656L8036
9757B10692a12424F2381J13252E3904d19243A9602a04789j15855a9301j14096
$$ plain form
9747 -133397 161097 104060 -20903 -34793 31150 33653 -56792 -177840 -72466 38760 224600
9736 224600 35005 1983 -316205 68151 -177946 -167059 121056 -32349 -256751 -295208 197189
9724 -6264 -112029 273600 242037 -5275 -247102 -112586 -26515 -307937 -61153 90160 -358235
9712 158190 -402627 8887 21925 -346185 -121737 37056 -25411 95353 140402 148967 134278
9701 134278 -576556 -70086 259066 -362100 -4190 -240191 53879 -245724 182526 129296 9768
9689 -120595 143047 125954 -18151 215142 -33877 170958 -151093 35702 -139123 -211355 -198201
9678 -198201 231978 -175465 -159055 -97679 -52442 -296997 20485 213529 4351 -350580 -133567
9666 47567 42475 -307309 8025 -20411 -124585 -82775 -113767 -339928 -66016 -291163 -103380
$$ packed form
9747a33397A61097n7037b0903j3890C1150K503e6792j21048g2466C8760J85840
9736B24600C5005A983c16205F8151a77946J0887A21056c2349k24402l8457A97189
9724f264j05765B73600l1563e275k41827a12586b6515k81422f1153I0160c58235
9712A58190d02627H887J3038c46185a21737C7056b5411I5353M5049Q565j4689
9701A34278e76556g0086B59066c62100d190k36001E3879b45724A82526n3230I768
9689a20595A43047j7093a8151B15142c3877A70958a51093C5702a39123p2232J3154
9678a98201B31978a75465J6410O1376M5237k44555B0485J93044D351c50580a33567
9666D7567n092c07309H025b0411j04174M1810l0992k26161f6016k25147a03380
$$ plain form
9654 -242241 357417 -248241 107480 -139407 124939 -48790 -289091 -216680 -86220 -16244
9643 4683 57742 110382 -156822 354599 118584 19028 266544 -179413 -276691 41264 177936
9632 177936 -159469 -253966 -182706 -239770 -140778 -153864 3544 -86434 -121972 -129110 -104254 -203073
9620 -203073 -160479 135978 -156287 147209 -215178 231632 -46872 -136679 -252634 -170796
9610 -170796 -58062 -105119 282619 -10217 -221589 -222224 -159761 83647 -9558 1683 59236 -226702
9597 -208697 52869 -108810 -119649 -311180 -212486 3053 -411391 -389696 137747 225134 -113171
9585 -8341 265388 -16379 809 -83493 130686 -510666 -320739 -120045 -82318 24970 11304
9573 -74626 143069 793 -253116 -445413 -242008 -3568 -77908 -100319 -138533 -184665 77877 -30624
$$ packed form
9654b42241C57417b48241A07480a39407A24939d8790k40301P2411h6220a6244
9643D683N3059N2640a56822C54599A18584A9028K47516a79413r7278D1264J36672
9632A77936a59469r4497P1260n7064R8992j3086C544h6434l5538p138K4856r8819
9620b03073M2594A35978a56287A47209b15178B31632d6872q9807j15955Q1838
9610a70796e8062m7057B82619a0217k11372o35O2463H3647i558A683N7553b26702
9597b08697E2869a08810j0839j91531R8694C053d11391K1695A37747Q7387a13171
9585h341B65388a6379H09h3493A30686e10666J89927a20045L7727B4970A1304
9573g4626A43069G93b53116j92297K03405c568p4340k2411l8214m6132G7877c0624
$$ plain form
9560 201432 62221 16119 -246487 192735 45098 -227061 173779 -150644 117258 -137624
9549 65827 -58699 14366 -45902 181248 -121790 -132669 -226663 -59385 -360828 -189199 -157598
9538 -157598 98752 -174215 -138767 31970 -279100 145954 -285258 165348 227966 -78804 -76880
9527 -76880 -440133 -64121 -48573 -15248 -182753 -8152 -53930 -11164 151064 -9570 -232289
9516 -232289 -384557 15500 -492988 200566 -291833 161909 39301 -249525 16855 4548 109999
9505 109999 78331 -138657 196433 -409239 -33717 -264052 -370165 -347143 -134151 -205334
9495 -205334 71125 22695 -121241 253033 -127627 -234599 247571 -148105 255104 -88826
9484 111548 31122 -110302 115421 -149559 8529 -322107 77686 -27560 -78918 33 -59301 -374626
$$ packed form
9560B01432F2221A6119b46487A92735D5098b27061A73779a50644A17258a37624
9549F5827e8699A4366d5902A81248a21790j0879r3994e9385l01443J71629L1601
9538a57598I8752a74215L5448C1970b79100A45954b85258A65348O2618g8804J924
9527g6880l63253f4121J5548a5248j67505h152m5778a1164A51064i570k22719
9516b32289j52268A5500d92988B00566b91833A61909C9301b49525A6855D548J05451
9505A09999l1668a38657A96433d09239c3717k30335j06113K3022a34151p1183
9495b05334G1125B2695a21241B53033a27627j06972B47571a48105B55104h8826
9484A11548C1122a10302A15421a49559H529c22107G7686b7560n1358C3e9301l15325
$$ plain form
9472 -374626 -282243 -195250 -240112 -180731 -193066 16188 49689 73227 134032 -210904 59080
9460 -242284 -222092 -15278 -242320 -245472 -268597 -215842 52654 -184059 -102873 -282967 -468204
9449 -468204 -120415 -213493 36220 35635 353735 -172816 -122623 90592 93541 -3291 -80419 -179822
9437 -179822 -40747 324353 -189852 96713 -173954 -62141 -125276 -115637 -310164 -139435 -38651
9425 205647 -219559 44176 -17512 -94834 20189 -67746 105252 137338 -152779 -349756 -135981
9413 -2237 -442902 25860 -27576 -52495 -29755 18001 172348 25808 -170495 47332 -56207
9401 -459092 -103110 -76558 152482 -331279 -85197 -106087 -53199 -87612 -23866 -322767 432878
9389 -82496 57967 -16781 26920 -229027 135424 -227433 -66808 119963 -46835 53121 -303240
$$ packed form
9472c74626R2383Q6993m4862N9381j2335A6188L3501K3538O0805b10904E9080
9460b42284K0192a5278k27042l152k3125N2755E2654a84059Q1186j80094j85237
9449d68204a20415r3078C6220n85L18100a72816N0193I0592K949c291p7128r9403
9437a79822d0747C24353a89852I6713a73954f2141o3135R639j94527a39435c8651
9425B05647b19559D4176a7512p7322B0189f7746A05252L2086a52779j96977a35981
9413b237m40665B5860b7576k4919K2740A8001J54347B5808a70495D7332e6207
9401d59092a03110K6552A52482c31279h5197k0890N2888l4413b3866k98901D32878
9389h2496E7967a6781B6920b29027A35424b27433f6808A19963d6835E3121c03240
$$ plain form
9377 -181725 -184765 -376900 20636 35438 9216 -144186 -105642 -103827 -272343 247179 -232541
9365 -376452 -174363 -22128 164757 -364188 -114698 253491 -242534 -306936 -122958 70259
9354 85144 -364944 58530 230852 202487 79613 87175 30589 -12235 -215824 -68706 -334271
9343 -334271 58344 137953 -16044 -86680 173107 40223 6831 81768 -276283 -86699 -4412 -103523
9331 -103523 -149952 -253654 160729 -368725 278479 -213775 -256404 212703 -524898 268717
9320 15410 -161003 -105719 167200 136819 165677 95740 -10628 -484855 -169724 7122 -136732
9308 -20952 91822 -160468 -196769 -299722 -67803 165794 -144933 -109345 -173016 269195 -57862
9296 -243972 31727 -189579 -182068 -169867 -216988 -114193 -156314 67374 -170822 -295604 -1504
$$ packed form
9377a81725l040j92135B0636J4802I216a44186L8544J815j68516B47179b32541
9365c76452a74363b2128A64757c64188a14698B53491b42534o4402a22958G0259
9354H5144c64944E8530J72322k8365G9613P562C0589a2235k03589f8706k65565
9343c34271E8344P9609a6044p0636A73107D0223F831P4937b76283h6699d412r9111
9331a03523m6429j03702A60729c68725B78479b13775m2629B12703e24898B68717
9320A5410a61003N5284A67200l0381K8858o9937a0628m74227a69724G122a36732
9308b0952I1822a60468l6301j02953f7803A65794a44933L5588o3671B69195e7862
9296b43972C1727a89579P511J2201m7121J02795m2121F7374a70822j24782a504
$$ plain form
9284 -108433 -43538 53572 217406 -207655 -88593 38040 -86344 41267 -472926 -51750 61937
9272 38277 66845 -92264 98157 -105988 10717 70224 -167190 -25148 241970 51701 -62655
9260 -135351 102992 130098 14648 -364341 -7016 143329 -91972 92846 -85513 -125797 -39084
9248 274214 -41714 244842 105863 -168420 -159207 -30647 -22645 141472 -155128 -106762 -78186
9237 -78186 121928 114623 -90559 -257880 -46102 -229527 1320 145923 -140026 -139396 50305 -71012
9224 34447 -134905 -8922 -19763 -61906 51679 291995 -219643 -170780 -17996 -70217 243316
9212 171493 -123487 -130273 -11530 305485 -176081 -45508 -83723 -40967 150011 -201839 -32602
9200 -26962 -204904 -219318 -213896 340861 -60102 47127 -139298 179059 -218906 -116229 -83796
$$ packed form
9284a08433d3538E3572J63834b07655h8593C8040h6344D1267d72926e1750F1937
9272C8277K8568i2264I8157a05988A0717N9507a67190b5148B41970E1701f2655
9260a35351A02992K7106A4648c64341g016A43329i1972I2846h5513m0284c9084
9248B74214d1714B44842A05863a68420R213c0647Q002A41472a55128M8366K8576
9237g8186A21928p305i0559j67321d6102j83425A320J44603a40026O30E0305g1012
9224C4447a34905h922j0841m2143E1679K40316b19643M8863a7996n2221B43316
9212A71493a23487o786a1530C05485a76081d5508l8215d0967A50011b01839c2602
9200b6962j77942j4414N422C40861f0102D7127a39298A79059b18906J02677L2433
$$ plain form
9189 -83796 -195003 -72792 -250059 207073 -1394 -293866 -183419 -1997 69116 177308 296749
9178 296749 -136884 -312862 -100206 -381817 243537 -290569 -329413 61851 -151374 170243
9167 -8833 194817 -357985 -144169 -174873 76843 -131490 2605 41959 243368 -45923 36720
9155 227794 -310076 -104020 -31465 130843 -53872 116351 -240654 -141528 53777 -203548
9144 363117 13962 -55565 62428 -183441 -134208 -210468 -104986 -289443 -260689 83346 17777
9132 -26912 64707 299952 -298660 -195946 173690 -54671 -204937 61866 201512 -51885 -217246
9121 -217246 53174 -29858 5 -250339 -140441 -329671 -60812 51759 -56702 -53400 -122682 -128584
9109 -128584 -116220 74682 -145108 -201618 -121012 -155368 -114552 -212111 -460739 -78517 16318
$$ packed form
9189h3796j11207g2792j77267B07073a394k92472J10447a997F9116J08192J19441
9178B96749a36884j75978a00206k81611B43537b90569l8844F1851a51374A70243
9167h833A94817c57985a44169l0704G6843a31490B605L9354K01409d5923C6720
9155B27794c10076a04020c1465A30843e3872A16351b40654R9126E3777b03548
9144C63117A3962e5565F2428a83441M9233p6260a04986j84457K8754H3346A7777
9132b6912F4707K35245b98660J02714A73690e4671j50266F1866J39646e1885j65361
9121b17246E3174b9858Eb50339J09898j89230f0812E1759e6702L302o9282n902
9109a28584J2364G4682a45108n6510Q0606l4356M0816r7559k48628g8517A6318
$$ plain form
9097 285637 -300387 -70902 237789 -361809 -4766 43091 -161418 -50812 130181 -295914 -258790
9086 -258790 350816 -134957 78992 -61578 -15088 -175164 195219 -388628 -101627 -253466
9076 -253466 -400479 56308 78589 -169335 232808 -112006 -77706 93449 -13576 -149441 -550812
9065 -550812 177225 -479314 59412 288302 -267179 -167142 -93933 395634 -177369 -261807
9055 -261807 65799 -168927 34474 331038 45532 -35078 -574971 135208 -58971 -364015 -140866
9043 188048 -186418 60181 -410286 -54250 34468 -194056 -406179 -131447 31152 -227470
9032 -186410 -475648 532705 164024 11767 -141686 -3537 -43983 269184 -85690 -158834 171377
9020 43014 17113 -202501 -19444 -141886 -147600 -79119 80172 -265246 -348741 -211320 26220
$$ packed form
9097B85637c00387g0902B37789c61809d766D3091a61418e0812A30181b95914L7124
9086b58790C50816a34957G8992f1578a5088j60076A95219c88628a01627j51839
9076b53466j47013E6308K2281a69335B32808a12006L4300I3449a3576j35865m01371
9065e50812A77225d79314E9412K28890b67179J00037P3209C95634a77369q4438
9055b61807F5799a68927C4474K96564D5532c5078n39893A35208e8971l05044a40866
9043A88048a86418F0181d10286e4250C4468a94056k12123a31447C1152b27470
9032a86410k89238E32705A64024A1767a41686c537m0446B69184h5690p3144A71377
9020D3014A7113b02501a9444j22442n714O8481H0172b65246q3495J37421B6220
$$ plain form
9008 -321107 21236 106464 60163 -229410 -167167 -198823 -413126 910 -117490 69790 -350528
8996 89430 14476 156582 371901 -226064 -93573 -51981 100846 82248 157870 199186 -280101
8984 -187987 -35553 -45401 -67782 -49257 -42387 134293 -7653 -85534 -245873 -179369 -93917 -41539
8971 -17776 24423 158386 -56650 -97314 332513 -550157 -923 -5555 172056 14514 -42870 -539096
8959 -539096 -32992 -181402 4365 116982 222044 64676 -171185 178442 -350294 -482960
8949 -482960 -182171 4489 411800 -350889 -14050 -112023 -198602 -216155 89304 73295 -317235
8937 -2503 -104913 -47165 -25359 87391 18865 860907 174253 -138397 -15493 277777 14615
8925 238170 207150 323593 397648 531582 1151833 4230952 13600839 4841968 1377140
$$ packed form
9008c21107B1236Q5228m6301b29410O2243l1656k14303I10a17490F9790c50528
8996H9430A4476J42106K15319b26064i3573M1592A00846j8598P5622M1316b80101
8984a87987c5553r848k2381J8525O870A34293g653p7881j60339O6504Q5452d1539
8971a7776B4423J33963e6650m0664C32513e50157i23m632A72056A4514d2870m96226
8959e39096c2992j48410D365J12617J05062F4676a71185A78442c50294j32666
8949d82960a82171D489M07311c50889a4050r7973q6579j7553H9304j6009c17235
8937b503j02410d7165K1806H7391A8865Q42042A74253a38397a5493B77777A4615
8925B38170l1020J16443P4055J33934O20251L079119R369887D841968A377140
$$ plain form
8915 646827 415670 202275 301404 279793 69446 88232 -3253 -547776 -129732 153376 255935
8904 255935 -211081 -84623 -25370 -40998 34839 187975 -55690 110011 -288345 -78010 863
8892 181907 -79497 -202081 -82096 317191 44657 -377858 208978 -140580 31234 16277 13573
8881 13573 66888 -49918 -26078 16927 -28712 -162726 -183894 -209359 41619 -5149 103719 -99226
8868 55436 -112713 -257057 -222476 43161 -75872 84303 49058 -62041 -33668 32672 -37097
$$ packed form
8915F46827k31157B02275R9129k1611F9446J8786c253n44523a29732A53376J02559
8904B55935b11081h4623b5370j5628C4839J53136e5690A10011b88345g8010H63
8892A81907g9497j22584h2096C17191D4657c77858B08978a40580C1234j4957k704
8881A3573N3315d9918K3840A6927b8712j34014k1168k5465D1619e149A03719i9226
8868E5436a12713j44344L4581D3161g5872H4303l5245f2041K8373C2672c7097
$$ [...]
##END NTUPLES=NMR SPECTRUM
##END=
