
##TITLE=AC1169_Tolima-ibage-TGAAH12004_7165893_yIwC08t5dS
##JCAMPDX= 6.0         $$ Bruker NMR JCAMP-DX V2.0
##DATA TYPE= NMR SPECTRUM
##DATA CLASS= NTUPLES
##ORIGIN= BRUKER
##OWNER= Administrator
$$ 1.72 TOPSPIN		Version 2.1
$$ 2012-12-01 22:40:45.810 -0500  Administrator@X
$$ Compression mode = diff/dup
##.OBSERVE FREQUENCY= 400.02188249412
##.OBSERVE NUCLEUS= ^1H
##.ACQUISITION MODE= SIMULTANEOUS (DQD)
##.ACQUISITION SCHEME= undefined
##.AVERAGES= 64
##.DIGITISER RES= 22
##SPECTROMETER/DATA SYSTEM= spect
##.PULSE SEQUENCE= noesygpps1d.comp
##.SOLVENT NAME= COFFEE_meoh
##.SHIFT REFERENCE= INTERNAL, COFFEE_meoh, 1, 14.96249
##AUDIT TRAIL= $$ (NUMBER, WHEN, WHO, WHERE, PROCESS, VERSION, WHAT)
$$ ##TITLE= Audit trail, TOPSPIN		Version 2.1
$$ ##JCAMPDX= 5.01
$$ ##ORIGIN= Bruker BioSpin GmbH
$$ ##OWNER= Administrator
$$ $$ E:\/data/COFFEE/nmr/AC1169_Tolima-ibage-TGAAH12004_7165893_yIwC08t5dS/12/pdata/1/auditp.txt
$$ ##AUDIT TRAIL=  $$ (NUMBER, WHEN, WHO, WHERE, PROCESS, VERSION, WHAT)
(   1,<2012-12-01 22:40:39.763 -0500>,<Administrator>,<X>,<go>,<TOPSPIN 2.1>,
      <created by zg
	started at 2012-12-01 22:29:10.043 -0500,
	POWCHK enabled, PULCHK disabled,
       configuration hash MD5:
       86 BA 57 50 F2 9D 5C 9B 26 00 A9 28 5F 66 2E 89
       data hash MD5: 64K
       88 37 B8 A7 78 00 6A D4 14 27 1A 1A 37 E5 AE F9>)
(   2,<2012-12-01 22:40:42.982 -0500>,<Administrator>,<X>,<proc1d>,<TOPSPIN 2.1>,
      <Start of raw data processing
       efp LB = 0.3 FT_mod = 6 PKNL = 1 PHC0 = 0 PHC1 = 0 SI = 128K 
       data hash MD5: 128K
       9D 6E 1D F0 94 C4 81 71 4B E9 06 7E 38 C4 BD 09>)
(   3,<2012-12-01 22:40:44.060 -0500>,<Administrator>,<X>,<proc1d>,<TOPSPIN 2.1>,
      <pk PHC0 = -81.79871 PHC1 = 0 
       data hash MD5: 128K
       78 66 23 E2 DD 73 C9 61 58 89 09 B4 23 8A BC 4A>)
(   4,<2012-12-01 22:40:44.732 -0500>,<Administrator>,<X>,<proc1d>,<TOPSPIN 2.1>,
      <abs ABSG = 1 
       data hash MD5: 128K
       12 A2 2A 66 AD ED 31 A9 3F AA 91 BB 56 13 EC 1D>)
(   5,<2012-12-01 22:40:44.951 -0500>,<Administrator>,<X>,<proc1d>,<TOPSPIN 2.1>,
      <abs ABSG = 2 
       data hash MD5: 128K
       1A E3 05 8C 06 59 4A 70 89 B6 4C 30 E0 44 BE 28>)
(   6,<2012-12-01 22:40:45.107 -0500>,<Administrator>,<X>,<proc1d>,<TOPSPIN 2.1>,
      <abs ABSG = 3 
       data hash MD5: 128K
       44 86 2B 37 52 CD 13 B7 FD 7B 44 86 CB 0C 2D D0>)
(   7,<2012-12-01 22:40:45.248 -0500>,<Administrator>,<X>,<proc1d>,<TOPSPIN 2.1>,
      <abs ABSG = 4 
       data hash MD5: 128K
       BF 32 4D 28 30 2D 0B 4E 33 D6 60 31 2F 08 21 56>)
(   8,<2012-12-01 22:40:45.435 -0500>,<Administrator>,<X>,<proc1d>,<TOPSPIN 2.1>,
      <abs ABSG = 5 
       data hash MD5: 128K
       BE B2 7B 2C CF 6B 62 8F B6 CF C9 AA 0F B1 6E 3F>)
$$ ##END=
$$ 
$$ $$ hash MD5
$$ $$ E4 82 9A 16 83 47 07 2E B0 1C 77 D6 4B 69 49 BD
##$RELAX= 
##$RELAX= 
##$RELAX= 
##$RELAX= 
##$RELAX= 
##$RELAX= 
##$RELAX= 
##$RELAX= 
$$ Bruker specific parameters
$$ --------------------------
##$DU= <E:\>
$$ [...]
##$TP07= 0
##$TPNAME0= <>
##$TPNAME1= <>
##$TPNAME2= <>
##$TPNAME3= <>
##$TPNAME4= <>
##$TPNAME5= <>
##$TPNAME6= <>
##$TPNAME7= <>
##$TPOAL= (0..7)
0.5 0.5 0.5 0.5 0.5 0.5 0.5 0.5
##$TPOFFS= (0..7)
0 0 0 0 0 0 0 0
##$TUNHIN= 0
##$TUNHOUT= 0
##$TUNXOUT= 0
##$USERA1= <user>
##$USERA2= <user>
##$USERA3= <user>
##$USERA4= <user>
##$USERA5= <user>
##$V9= 5
##$VALIST= <valist>
##$VCLIST= <CCCCCCCCCCCCCCC>
##$VD= 0
##$VDLIST= <DDDDDDDDDDDDDDD>
##$VPLIST= <PPPPPPPPPPPPPPP>
##$VTLIST= <TTTTTTTTTTTTTTT>
##$WBST= 1024
##$WBSW= 4
##$XGAIN= (0..3)
0 0 0 0
##$XL= 0
##$YL= 0
##$YMAX_a= 8462225
##$YMIN_a= -18131212
##$ZGOPTNS= <>
##$ZL1= 120
##$ZL2= 120
##$ZL3= 120
##$ZL4= 120
##$ABSF1= 14.96249
##$ABSF2= -5.595692
##$ABSG= 5
##$ABSL= 3
##$ALPHA= 0
##$AQORDER= 0
##$ASSFAC= 0
##$ASSFACI= 0
##$ASSFACX= 0
##$ASSWID= 0
##$AUNMP= <proc_prof1d_extract.lims>
##$AXLEFT= 0
##$AXNAME= <>
##$AXNUC= <1H>
##$AXRIGHT= 0
##$AXTYPE= 0
##$AXUNIT= <>
##$AZFE= 0.1
##$AZFW= 0.1
##$BCFW= 0
##$BC_mod= 0
##$BYTORDP= 0
##$COROFFS= 0
##$CY= 15
##$DATMOD= 1
##$DC= 0
##$DFILT= <>
##$DTYPP= 0
##$F1P= 0
##$F2P= 0
##$FCOR= 0.5
##$FTSIZE= 131072
##$FT_mod= 6
##$GAMMA= 0
##$GB= 0
##$INTBC= 1
##$INTSCL= 1
##$ISEN= 128
##$LB= 0.3
##$LEV0= 0
##$LPBIN= 0
##$MAXI= 10000
##$MC2= 0
##$MEAN= 0
##$ME_mod= 0
##$MI= 0
##$NCOEF= 0
##$NC_proc= -2
##$NLEV= 6
##$NOISF1= 0
##$NOISF2= 0
##$NSP= 0
##$NTH_PI= 0
##$NZP= 0
##$OFFSET= 14.96249
##$PC= 1
##$PHC0= -81.79871
##$PHC1= 0
##$PH_mod= 1
##$PKNL= yes
##$PPARMOD= 0
##$PPDIAG= 0
##$PPIPTYP= 0
##$PPMPNUM= 2147483647
##$PPRESOL= 1
##$PSCAL= 4
##$PSIGN= 0
##$PYNMP= <proc.py>
##$REVERSE= no
##$SF= 400.020009041668
##$SI= 131072
##$SIGF1= 0
##$SIGF2= 0
##$SINO= 400
##$SIOLD= 131072
##$SPECTYP= <>
##$SREGLST= <1H.CDCl3>
##$SSB= 0
##$STSI= 131072
##$STSR= 0
##$SW_p= 8223.68421052631
##$SYMM= 0
##$S_DEV= 0
##$TDeff= 65536
##$TDoff= 0
##$TI= <>
##$TILT= no
##$TM1= 0
##$TM2= 0
##$TOPLEV= 0
##$USERP1= <user>
##$USERP2= <user>
##$USERP3= <user>
##$USERP4= <user>
##$USERP5= <user>
##$WDW= 1
##$XDIM= 131072
##$YMAX_p= 454071311
##$YMIN_p= -13990
##$CURPLOT= <Network HP LaserJet P1505>
##$CURPRIN= <$Network HP LaserJet P1505>
##$DFORMAT= <normdp>
##$LAYOUT= <+/1D_H.xwp>
##$LFORMAT= <normlp>
##$PFORMAT= <normpl>
##$SURQMSG= 1
$$ End of Bruker specific parameters
$$ ---------------------------------
##NTUPLES= NMR SPECTRUM
##VAR_NAME=  FREQUENCY,     SPECTRUM/REAL,   SPECTRUM/IMAG
##SYMBOL=    X,             R,               I
##VAR_TYPE=  INDEPENDENT,   DEPENDENT,       DEPENDENT
##VAR_FORM=  AFFN,          ASDF,            ASDF
##VAR_DIM=   131072,        131072,          131072
##UNITS=     HZ,            ARBITRARY UNITS, ARBITRARY UNITS
##FACTOR=    0.0627417313425164, 1,          1
##FIRST=     8223.62146879497, -2756,        -66425
##LAST=      0,             -385,            -67438
##MIN=       0,             -13990,          0
##MAX=       8223.62146879497, 454071311,    0
$$ Real data points
##PAGE= N=1
##DATA TABLE= (X++(R..R)), XYDATA
$$ [...]
60957B8734603O93628L59536l44804j220503k000207k500113k687420k634717
60949A8400003k437382k169240j880764j605227j358606j142935r55990p96883
60941F052976o63923n52973m60561l85869l28000k83579k48565k20627j98301
60932B710578j79550j62719j47680j34569j22343j09891r7684q7003p8208p0967
60922A519964o5537o2509o1458o0956n9744n7288n3560m9078m4847m1442l8423
60911I25122l5155l1749k8607k5606k2540j9781j7657j5700j3395j1185r771q886
60899F85090p839o859o676p005o666n244l518k182j127o5J068K465M272N969O770
60884F58453O799O959P612Q203Q329Q219P941P052N324L088O26j999m419o096
$$ y = [28734603, 29428231, 29787767, 29442963, 28222460, 26222253, 23722140, 21034720, 18400003, 15962621, 13793381, 11912617, 10307390, 8948784, 7805849, 6849859, 6052976, 5389053, 4836080, 4375519, 3989650, 3661650, 3378071, 3129506, 2908879, 2710578, 2531028, 2368309, 2220629, 2086060, 1963717, 1853826, 1756142, 1669139, 1590931, 1519964, 1454427, 1391918, 1330460, 1269504, 1209760, 1152472, 1098912, 1049834, 1004987, 963545, 925122, 889967, 858218, 829611, 804005, 781465, 761684, 744027, 728327, 714932, 703747, 693976, 685090, 677251, 670392, 663716, 656711, 650045, 644801, 641283, 639101, 637974, 637909, 638977, 641442, 645714, 651683, 658453, 665252, 672211, 679823, 688026, 696355, 704574, 712515, 719567, 724891, 727979, 728605, 726606, 722187, 716091]
60870G16091p147q245r435r937r405q474p781p264o788o605o704o503n683m621
60856F11499l595k281m95J295K611L516M145M471M910O260Q495J0480J1554J2563
60842F75428J4552J7222J9534K1176K2391K2847K1834J9429J6591J4189J2492
60831H77685J1431J0745R967Q857P682O646N402L626J721L66l96r58j354j337
60817I40083j073j123j759k803l977n034n800o529p848r824j1464j1888j1577
60804H59384j1715j2497j3041j2879j2493j2289j1903j0940r652q466p334o018
60792G30157m595l293k020m90J328L114M526N505O299P248Q472R833J1192J2513
60778G89789J3673J4365J4490J4404J4507J4714J4684J4379J4038J3636J2779
$$ y = [716091, 708944, 700699, 691264, 681327, 671922, 663448, 655667, 648403, 641615, 635010, 628306, 621803, 616120, 611499, 607904, 605623, 605128, 606423, 609034, 612550, 616695, 621166, 626076, 632336, 640831, 651311, 662865, 675428, 689980, 707202, 726736, 747912, 770303, 793150, 814984, 834413, 851004, 865193, 877685, 889116, 899861, 909828, 918685, 926367, 933013, 938415, 942041, 943762, 944128, 943732, 942774, 941420, 940083, 939010, 937887, 936128, 933325, 929348, 924314, 918514, 911985, 904137, 894313, 882849, 870961, 859384, 847669, 835172, 822131, 809252, 796759, 784470, 772567, 761627, 751975, 743509, 736175, 730157, 725562, 722269, 720249, 719759, 721087, 724201, 728727, 734232, 740531, 747779, 756251, 766084, 777276, 789789, 803462, 817827, 832317, 846721, 861228, 875942, 890626, 905005, 919043, 932679, 945458]
60767I45458J1279R514Q109P445P492P919Q202P848O756N376M386M035L832L089
60753A040740J803P25M15N02L08k05n47n82o07o38l84O5J76l01j230k707m875
60736A032658o973p724p149o841p793q912q716p563o940p129p004n957m727m106
60722I35124l876l366k398j346o59m86n15k87J07pq47j605j615j556k513m165
60706I09990n063m737m315m771n527n394m141k548j331n93j24K32N05O20N18K19
60690H73540k90j104k202l397m719o595r253j2157j4437j5730j6214j6082j5511
60677G55849j4891j4475j3934j2840j1364r939q431o451m336k872k089j197J17
60664F53147J259J867K435L417M472N132N510N818N777N128M281L803L648L414
$$ y = [945458, 956737, 966251, 974360, 981805, 989297, 997216, 1005418, 1013266, 1020022, 1025398, 1029784, 1033819, 1037651, 1040740, 1042543, 1043268, 1043683, 1044185, 1044493, 1044288, 1043741, 1043159, 1042552, 1041914, 1041530, 1041595, 1041771, 1041470, 1040240, 1037533, 1032658, 1025685, 1017961, 1010812, 1003971, 996178, 987266, 978550, 970987, 964047, 956918, 949914, 943957, 939230, 935124, 931248, 927882, 925484, 924138, 923479, 922993, 922478, 922191, 922298, 922291, 921444, 919839, 918224, 916668, 914155, 909990, 904927, 900190, 895875, 891104, 885577, 880183, 876042, 873494, 872163, 871570, 871446, 871678, 872183, 872803, 873321, 873540, 873250, 872146, 869944, 866547, 861828, 855233, 845980, 833823, 819386, 803656, 787442, 771360, 755849, 740958, 726483, 712549, 699709, 688345, 678406, 669975, 663524, 659188, 656316, 654227, 653030, 653147, 654406, 656273, 658708, 662125, 666597, 671729, 677239, 683057, 688834, 693962, 698243, 702046, 705694, 709108]
60650G09108L112L074L285L449L574L981M642M998M608L702K948K810L224L785
60636G60300M146M281M433M897N834P193Q697J0039J1187J2366J3621J4637J5242
60623H76873J5821J6828J7998J8507J8001J6941J5793J4284J1801Q334M647J547
60611A037375p96k770m662o243p087p159o895o667o442o045n467m817m271m236
60597I63818n133o832q679j0370j2284j4516j6101j5898j3971j1416r001o713
60585H32904m508k680j363k80Q08J882K867L643L820L106J921J083Q56Q44Q52
60570H45755J191J964K746L268L824M607N130M819L818K803K128J537O53n54j848
60555H81841l101m445o000p491q402q591q386p892o640m383j844rJ200K827N528
$$ y = [709108, 712220, 715294, 718579, 722028, 725602, 729583, 734225, 739223, 743831, 747533, 750481, 753291, 756515, 760300, 764446, 768727, 773160, 778057, 783891, 791084, 799781, 809820, 821007, 833373, 846994, 861631, 876873, 892694, 909522, 927520, 946027, 964028, 980969, 996762, 1011046, 1022847, 1031181, 1035828, 1037375, 1036579, 1033809, 1029147, 1022904, 1015817, 1008658, 1001763, 995096, 988654, 982609, 977142, 972325, 968054, 963818, 958685, 951853, 943174, 932804, 920520, 906004, 889903, 874005, 860034, 848618, 839617, 832904, 828396, 825716, 824353, 824073, 824881, 826763, 829630, 833273, 837093, 840199, 842120, 843203, 844059, 844903, 845755, 846946, 848910, 851656, 854924, 858748, 863355, 868485, 873304, 877122, 879925, 882053, 883590, 884243, 883689, 881841, 878740, 874295, 868295, 860804, 852402, 843811, 835425, 827533, 820893, 816510, 814666, 814657, 815857, 818684, 824212]
60540H24212Q874J2149J5225J8470K2222K6589L1477L6636M1661M5758M7465M5236
60528A175974L8809K9599J9161P759m697j6882k6471l2297l4951l5155l2813k7992
60516A060044k1691j5040q538k554K267N641P964R476R842R084Q134P775P738
60503A080142P577P811R334J2148J5627J9672K4797L1199L8597M6957N6665O7856
60491A418382Q0062R2669J05414J18484J32461J48141J66089J86567K10099K37858
60481B896226K70847L08507L48156L85238M13442M24829M11160L66695K90709
60472F115809J88037O7666n9237j80799k85758l65180m14464m34294m29739m08016
60462C794025l76279l40135l03126k67212k33805k04063j78258j55505j34899
$$ y = [824212, 833086, 845235, 860460, 878930, 901152, 927741, 959218, 995854, 1037515, 1083273, 1130738, 1175974, 1214783, 1244382, 1263543, 1271302, 1266605, 1249723, 1223252, 1190955, 1156004, 1120849, 1088036, 1060044, 1038353, 1023313, 1014775, 1012221, 1014488, 1020129, 1028093, 1037569, 1047411, 1056495, 1064629, 1072404, 1080142, 1087719, 1095530, 1104864, 1117012, 1132639, 1152311, 1177108, 1208307, 1246904, 1293861, 1350526, 1418382, 1498444, 1591113, 1696527, 1815011, 1947472, 2095613, 2261702, 2448269, 2658368, 2896226, 3167073, 3475580, 3823736, 4208974, 4622416, 5047245, 5458405, 5825100, 6115809, 6303846, 6371512, 6312275, 6131476, 5845718, 5480538, 5066074, 4631780, 4202041, 3794025, 3417746, 3077611, 2774485, 2507273, 2273468, 2069405, 1891147, 1735642, 1600743]
60453A600743j16630j01391q8908p7970o7837n8799n1237m4917l9384l4456k9994
60442H89220k5891k2430k0015j8366j6679j4870j3831j4061j4758j4841j4239
60431F99239j3544j2972j2280j1332j0097q405o296m416l487l472l655l436k750
60418F03097j834r29j37N46J071J320J456K043L285M314M093K951K393L110M191
60403F30970M650M730N039N299M857L836K955K607K851L807N278O416O585O289
60389F96169O458P106P437P030O121M877L209J335j81j020j335j461j798k714
60375G31233m026m902m860m498m527m452l217j034N93Q09M08M34Q29J018J073
60360G04881J463K047K187J789J553K018K878L506L825M305N221O224O790O842
$$ y = [1600743, 1484113, 1382722, 1293814, 1215844, 1148007, 1089208, 1037971, 993054, 953670, 919214, 889220, 863329, 840899, 820884, 802518, 785839, 770969, 757138, 743077, 728319, 713478, 699239, 685695, 672723, 660443, 649111, 639014, 630609, 624313, 619897, 616410, 612938, 609283, 605847, 603097, 601263, 600334, 600197, 600743, 601814, 603134, 604590, 606633, 609918, 614232, 618325, 621276, 623669, 626779, 630970, 635620, 640350, 645389, 650688, 655545, 659381, 662336, 664943, 667794, 671601, 676879, 683295, 689880, 696169, 702627, 709733, 717170, 724200, 730321, 735198, 738407, 739742, 739561, 738541, 737206, 735745, 733947, 731233, 727207, 722305, 717445, 712947, 708420, 703968, 700751, 699717, 700310, 701119, 701527, 701961, 702790, 703808, 704881, 706344, 708391, 710578, 712367, 713920, 715938, 718816, 722322, 726147, 730452, 735673, 741897, 748687, 755529]
60346G55529O740O846P277Q019Q938R728J0078R943R469Q683P533O148M697L015
60332H62643Q23j613l475m113l501j967N5J981L397M534N865P111P304O094M184
60317H89322K134m27l747o905q681r070q990q830q110o587m794l367k433j880
60303H17635j724j920k121j886j120k11L33M94R46K326M286N680N870N437N345
60288H39370N797O229O027M962L274J732J252K030L188L651L144K168J331R94
60274H85149J200J549J469R80Q07J404K239K560K532L074M680O935R117J0832
60260I34527J2086J3107J4228J5819J8165K1264K4608K7468K9732L2320L6196
60249A179520M1175M6334N1415N6971O3146O9430P5823Q3149R1786J00967J09871
$$ y = [755529, 762269, 769115, 776392, 784411, 793349, 803077, 813155, 823098, 832567, 841250, 848783, 854931, 859628, 862643, 863466, 861853, 858378, 854265, 850764, 848797, 848852, 850833, 854230, 858764, 864629, 871740, 879044, 885138, 889322, 891456, 891029, 887282, 880377, 871696, 862626, 853636, 844806, 836696, 830109, 825315, 821948, 819515, 817635, 815911, 813991, 811870, 809984, 808864, 808653, 808986, 809480, 810426, 812752, 817038, 822718, 828588, 834025, 839370, 845167, 851396, 857423, 862385, 865659, 867391, 868643, 870673, 873861, 877512, 880656, 882824, 884155, 885149, 886349, 887898, 889367, 890347, 891154, 892558, 894797, 897357, 899889, 902963, 907643, 914578, 923695, 934527, 946613, 959720, 973948, 989767, 1007932, 1029196, 1053804, 1081272, 1111004, 1143324, 1179520, 1220695, 1267029, 1318444, 1375415, 1438561, 1507991, 1583814, 1666963, 1758749, 1859716, 1969587]
60238A969587J18337J25915J31364J34013J34778J34741J33363J29104J21355
60229C132557J10753R8037Q3579O7831N1372L4611J7960K001j2918k6811l9285
60218C519687m9298n6267o0704o3001o2446n8303n1237m2594l2844k1737r476
60207C011780L434J7039L1618M6717O1546P6016R0476J04648J17679J28827J37271
60196C827051J41819J41874J38267J31990J22576J08877R1052P0587M8735K6155
60186D848983L662j8084l9393o0537q0171r6104j07559j15185j19051j18280j12800
60175C985481j03842r2360p8425o2444m5479k8003r706R040K6980M3624N9671
60164C704537P5109Q8327R7790J03337J05066J02352R5021Q4330P1686N7200M0562
$$ y = [1969587, 2087924, 2213839, 2345203, 2479216, 2613994, 2748735, 2882098, 3011202, 3132557, 3243310, 3341347, 3424926, 3492757, 3544129, 3578740, 3596700, 3598701, 3585783, 3558972, 3519687, 3470389, 3414122, 3353418, 3290417, 3227971, 3169668, 3118431, 3075837, 3042993, 3021256, 3011780, 3015214, 3032253, 3063871, 3110588, 3172134, 3248150, 3338626, 3443274, 3560953, 3689780, 3827051, 3968870, 4110744, 4249011, 4381001, 4503577, 4612454, 4703506, 4774093, 4822828, 4848983, 4852645, 4834561, 4795168, 4734631, 4654460, 4558356, 4450797, 4335612, 4216561, 4098281, 3985481, 3881639, 3789279, 3710854, 3648410, 3602931, 3574928, 3565222, 3574262, 3601242, 3644866, 3704537, 3779646, 3867973, 3965763, 4069100, 4174166, 4276518, 4371539, 4455869, 4527555, 4584755, 4625317]
60153D625317K2618N016j1160k5493l7367m5897n0485n0889m6984l9092k8152
60142D317432j5107k83J6232L4026N2483P1180Q9884J08636J28103J49443J73384
60131E125413J99645K27477K56340K85930L15793L45106L72555L96534M15727
60122G940520M29344M36314M34808M23426M02678L74299L39223K97244K48630
60113A1326486J94853J37386P6918J4079m9979j14002j76690k35899k88724l32829
60103A0551599l66999l90280m01687m01214l90217l70297l42594l08586k70481
60094G309244k30198j88573j46048j03311o0906j9120K1171N8287R0772J17855
60084F849173J38586J51532J55857J51911J40353J21710R7307O9516M0324J0487
$$ y = [4625317, 4647935, 4652951, 4641791, 4616298, 4578931, 4533034, 4482549, 4431660, 4384676, 4345584, 4317432, 4302325, 4302042, 4318274, 4352300, 4404783, 4475963, 4565847, 4674483, 4802586, 4952029, 5125413, 5325058, 5552535, 5808875, 6094805, 6410598, 6755704, 7128259, 7524793, 7940520, 8369864, 8806178, 9240986, 9664412, 10067090, 10441389, 10780612, 11077856, 11326486, 11521339, 11658725, 11735643, 11749722, 11699743, 11585741, 11409051, 11173152, 10884428, 10551599, 10184600, 9794320, 9392633, 8991419, 8601202, 8230905, 7888311, 7579725, 7309244, 7079046, 6890473, 6744425, 6641114, 6580208, 6561088, 6582259, 6640546, 6731318, 6849173, 6987759, 7139291, 7295148, 7447059, 7587412, 7709122, 7806429, 7875945, 7916269, 7926756]
60074G926756j9447m8333p5287j00181j22639j41727j57448j71252j83940j94203
60064F712299k00486k03239k03929k02653j98268j90304j79281j65546j49268
60055E019325j31359j13045r4498p4996n4390l3315j2035R770L1960N3672P4327
60044D675416R4064J12840J29715J43212J52013J55295J52807J44763J31466J13270
60034F004861R0989O5886L8875J0222j9587m9222p7318j03303j26713j46264j60518
60023E527908j69166j72949j72539j68201j60210j48875j34451j17663r9983q2599
60013D101272o5407m7695k9419j0978P871K7828M8882P0279R1724J13636J36127
60002D444120J58370J79167J97438K11980K21308K24095K19650K08078J90266
$$ y = [7926756, 7907309, 7858976, 7783689, 7683508, 7560869, 7419142, 7261694, 7090442, 6906502, 6712299, 6511813, 6308574, 6104645, 5901992, 5703724, 5513420, 5334139, 5168593, 5019325, 4887966, 4774921, 4680423, 4605427, 4551037, 4517722, 4505687, 4515457, 4547417, 4601089, 4675416, 4769480, 4882320, 5012035, 5155247, 5307260, 5462555, 5615362, 5760125, 5891591, 6004861, 6095850, 6161736, 6200611, 6210833, 6191246, 6142024, 6064706, 5961403, 5834690, 5688426, 5527908, 5358742, 5185793, 5013254, 4845053, 4684843, 4535968, 4401517, 4283854, 4183871, 4101272, 4035865, 3988170, 3958751, 3947773, 3955644, 3983472, 4032354, 4102633, 4194357, 4307993, 4444120, 4602490, 4781657, 4979095, 5191075, 5412383, 5636478, 5856128, 6064206, 6254472]
59993F254472J67477J40638J10242P7197M3209R675k3363n6367q8697j18565j44357
59982F371561j65083j79702j87148j87338j81450j70830j56172j37863j16571
59973D889404r3108o8216m2750j7757N985K8364M9633O9737Q7966J03234J14773
59962E127265J22636J27382J29209J27607J22115J13165J01969Q9641P6574O2576
59952F200139M7544L2098J7583N173m950j3096j8859k0940j8258j0607J898J9274
59940F236999M1289O7302R6954J30491J68019K08930K52361K97632L43835L89430
59930H233242M32585M71272N02681N23212N29528N19081M89541M38879L66999
59921A2507020K76748J72795O0343n4475j64249k61981l43290m06457m50991m77133
$$ y = [6254472, 6421949, 6562587, 6672829, 6750026, 6793235, 6802910, 6779547, 6723180, 6634483, 6515918, 6371561, 6206478, 6026776, 5839628, 5652290, 5470840, 5300010, 5143838, 5005975, 4889404, 4796296, 4728080, 4685330, 4667573, 4673558, 4701922, 4751555, 4821292, 4909258, 5012492, 5127265, 5249901, 5377283, 5506492, 5634099, 5756214, 5869379, 5971348, 6060989, 6137563, 6200139, 6247683, 6279781, 6297364, 6302537, 6297587, 6284491, 6265632, 6244692, 6226434, 6215827, 6217725, 6236999, 6278288, 6345590, 6442544, 6573035, 6741054, 6949984, 7202345, 7499977, 7843812, 8233242, 8665827, 9137099, 9639780, 10162992, 10692520, 11211601, 11701142, 12140021, 12507020, 12783768, 12956563, 13016906, 12962431, 12798182, 12536201, 12192911, 11786454, 11335463, 10858330]
59911A0858330m86390m81355m64876m39741m08650l73631l35628k95219k53407
59902G319433k11186j68889j26662q5121m4743n188L4010P2369J08891J43111
59892G036025J74784K02792K25182K40063K45878K41120K24669J96221J55959
59883H942693J04346M3090k4102r2541j58175k17846k68754l08850l37547l55326
59873G326988l62973l61690l53298l39506l21312k99777k76440k52268k27038
59864D532686k00927j75726j53161j32778j13053r4016p7172o3249n1757m2540
59854C428307l6142l2541l1001l1200l3118l5806l7663l8011l7045l4386k9210
59843C052184k1978j4501q063k955Q3l44m466j0847j8336k7057l6815m5878n2445
$$ y = [10858330, 10371940, 9890585, 9425709, 8985968, 8577318, 8203687, 7868059, 7572840, 7319433, 7108247, 6939358, 6812696, 6727575, 6682832, 6677644, 6711654, 6784023, 6892914, 7036025, 7210809, 7413601, 7638783, 7878846, 8124724, 8365844, 8590513, 8786734, 8942693, 9047039, 9090129, 9066027, 8973486, 8815311, 8597465, 8328711, 8019861, 7682314, 7326988, 6964015, 6602325, 6249027, 5909521, 5588209, 5288432, 5011992, 4759724, 4532686, 4331759, 4156033, 4002872, 3870094, 3757041, 3663025, 3585853, 3522604, 3470847, 3428307, 3392165, 3359624, 3328623, 3297423, 3264305, 3228499, 3190836, 3152825, 3115780, 3081394, 3052184, 3030206, 3015705, 3007642, 3004687, 3004770, 3004426, 2999960, 2989113, 2970777, 2943720, 2906905, 2861027, 2808582]
59830B808582n6252n7886n7360n4310m8939m2006l4254k6318j8608j0959k940
59819B398750N098J1994J7006K0544K3489K6617L0784L6742M4301N2381O0120
59808B727826O7136P2588P5096P4122P0550O5406N8828N0746M1617L1930K1743
59797C357588J1362J876n559j0567j3270j3697j1878p955j900O397J6532K7725
59785C356654L9850N3710O9972Q8407J08602J30878J56170J85371K18880K56409
59775D664903K97104L40259L85468M31013M71925N00249N07316M85576M29551
59766H513364L37942K16433P7931o0906j84169k80030l43055l74980l82382l72396
59756G147752l50469l21117k88427k54852k20942j87278j55601j27147j01243
$$ y = [2808582, 2752330, 2694444, 2637084, 2582774, 2533835, 2491829, 2457575, 2431257, 2412649, 2401690, 2398750, 2403848, 2415842, 2432848, 2453392, 2476881, 2503498, 2534282, 2571024, 2615325, 2667706, 2727826, 2794962, 2867550, 2942646, 3016768, 3087318, 3152724, 3211552, 3262298, 3303915, 3335845, 3357588, 3368950, 3370826, 3365267, 3354700, 3341430, 3327733, 3315855, 3307900, 3306000, 3312397, 3328929, 3356654, 3396504, 3450214, 3520186, 3608593, 3717195, 3848073, 4004243, 4189614, 4408494, 4664903, 4962007, 5302266, 5687734, 6118747, 6590672, 7090921, 7598237, 8083813, 8513364, 8851306, 9067739, 9145670, 9084764, 8900595, 8620565, 8277510, 7902530, 7520148, 7147752, 6797283, 6476166, 6187739, 5932887, 5711945, 5524667, 5369066, 5241919, 5140676]
59747E140676p6737n3765l2932j3670N156K3657M1269N8262P5641R3817J12478
59736E373852J31606J51600J72563J94376K17441K42577K70276L00714L34292
59727G389297L71336M11366M53438M97190N42795N89671O35806O78400P14674
59718A2283973P41908P57344P58640P44735P16415O76349O28692N78663N32197
59709A8418916M95327M72963M67619M79114N05171N42075N85091O28957O68197
59700B3263430O96860P08462O97162O59419N94525N04179L92451K65957J32962
59691B7915407J682j20390k26268l10146l68806m01781m09953l94721l58419l04332
59681B5022273k35670j55000o4513L4086J40205K53863L74289M99789O28825P59806
$$ y = [5140676, 5063939, 5010174, 4977242, 4963572, 4968728, 4992385, 5033654, 5091916, 5167557, 5261374, 5373852, 5505458, 5657058, 5829621, 6023997, 6241438, 6484015, 6754291, 7055005, 7389297, 7760633, 8171999, 8625437, 9122627, 9665422, 10255093, 10890899, 11569299, 12283973, 13025881, 13783225, 14541865, 15286600, 16003015, 16679364, 17308056, 17886719, 18418916, 18914243, 19387206, 19854825, 20333939, 20839110, 21381185, 21966276, 22595233, 23263430, 23960290, 24668752, 25365914, 26025333, 26619858, 27124037, 27516488, 27782445, 27915407, 27917089, 27796699, 27570431, 27260285, 26891479, 26489698, 26079745, 25685024, 25326605, 25022273, 24786603, 24631603, 24567090, 24601176, 24741381, 24995244, 25369533, 25869322, 26498147, 27257953]
59671B7257953Q89239J011115J118282J203045J255863J265093J219524J111360
59663C6331474R37478P00488M10512Q5362k52518n79851q74724j118535j299227
59654C4340459j413335j464360j459508j408151j321583j211997j091155r70449
59646B3999921q61417p75006p20114p02508p23190p75736q45711r14897r67812
59637A6713530r95459r95185r69222r23248q64339p98638p30485o62949n98275
59628I175730n37801m82194m31806l86561l45763l08606k74794k44247k16610
59619E947348j91392j68298j46983j26909j07998r0949p6434o4367n4486m7155
59609D872377m2966m1828m3229m6980n3158o1416p0857q0368q8875r5588j00382
$$ y = [27257953, 28147192, 29158307, 30276589, 31479634, 32735497, 34000590, 35220114, 36331474, 37268952, 37969440, 38379952, 38465314, 38212796, 37632945, 36758221, 35639686, 34340459, 32927124, 31462764, 30003256, 28595105, 27273522, 26061525, 24970370, 23999921, 23138504, 22363498, 21643384, 20940876, 20217686, 19441950, 18596239, 17681342, 16713530, 15718071, 14722886, 13753664, 12830416, 11966077, 11167439, 10436954, 9774005, 9175730, 8637929, 8155735, 7723929, 7337368, 6991605, 6682999, 6408205, 6163958, 5947348, 5755956, 5587658, 5440675, 5313766, 5205768, 5114819, 5038385, 4974018, 4919532, 4872377, 4829411, 4787583, 4744354, 4697374, 4644216, 4582800, 4511943, 4431575, 4342700, 4247112, 4146730]
59598D146730j03529j04883j03881j00550r5863r0629q4665p7461o9012n9626
59588C256631m9735m0272l2271k5514j8468j0275j938N190J1051J6188K0346K3012
59576C153945K4625K6031K7189K7487K6905K5903K4609K3168K2533K3765K6791
59565C432951L0701L5092M0307M6651N4201O3106P3291Q4175R5341J07233J20573
59554D183622J35489J51797J69523J88412K07591K26573K45980K66260K86287
59545F061534L04228L19336L31698L40646L44661L42799L35268L22730L05966
59536I008866K86133K64490K41837K18619J95040J70489J43673J14561Q5949O2048
59526A0791705M5716L7657L7604M5010N8817P7742J00653J25753J49508J67394
$$ y = [4146730, 4043201, 3938318, 3834437, 3733887, 3638024, 3547395, 3462730, 3385269, 3316257, 3256631, 3206896, 3166624, 3134353, 3108839, 3090371, 3080096, 3078158, 3083348, 3094399, 3110587, 3130933, 3153945, 3178570, 3204601, 3231790, 3259277, 3286182, 3312085, 3336694, 3359862, 3382395, 3406160, 3432951, 3463652, 3498744, 3539051, 3585702, 3639903, 3703009, 3776300, 3860475, 3955816, 4063049, 4183622, 4319111, 4470908, 4640431, 4828843, 5036434, 5263007, 5508987, 5775247, 6061534, 6365762, 6685098, 7016796, 7357442, 7702103, 8044902, 8380170, 8702900, 9008866, 9294999, 9559489, 9801326, 10019945, 10214985, 10385474, 10529147, 10643708, 10729657, 10791705, 10837421, 10875078, 10912682, 10957692, 11016509, 11094251, 11194904, 11320657, 11470165, 11637559]
59516A1637559J75653J71818J54158J21854P5735J7956m8874j21607j96133k68194
59506A1719925l34573l92872m40688m76000m98135n07504n04882m91775m70853
59497G602643m44670m14277l80199l44203l08837k75410k43671k13402j85089
59488D792885j59231j35982j15300r6527p8133n9076m0061k2347n797J0758K7641
59477D118830M4375O1177P8811R7112J15273J33652J53744J76068J99462K22524
59467E401028K44535K64786K82310K96538L06886L11430L07106K91617K64408
59458G970644K25945J77264J20352N7832p874p4263j37905j95165k43826k83021
59448G609983l11981l30224l38752l39568l33969l22658l07212k89741k71096
$$ y = [11637559, 11813212, 11985030, 12139188, 12261042, 12336777, 12354733, 12305859, 12184252, 11988119, 11719925, 11385352, 10992480, 10551792, 10075792, 9577657, 9070153, 8565271, 8073496, 7602643, 7157973, 6743696, 6363497, 6019294, 5710457, 5435047, 5191376, 4977974, 4792885, 4633654, 4497672, 4382372, 4285845, 4207712, 4148636, 4108575, 4086228, 4080431, 4091189, 4118830, 4163205, 4224382, 4303193, 4400305, 4515578, 4649230, 4802974, 4979042, 5178504, 5401028, 5645563, 5910349, 6192659, 6489197, 6796083, 7107513, 7414619, 7706236, 7970644, 8196589, 8373853, 8494205, 8552037, 8544163, 8469900, 8331995, 8136830, 7893004, 7609983, 7298002, 6967778, 6629026, 6289458, 5955489, 5632831, 5325619, 5035878, 4764782]
59439D764782k51092k30524k11124j93365j76062j58552j41606j25866j11158
59430C165433r7653q6006p5776o5588n5321m6416l9347l2712k5567j8725j2782
59419B609540o783j19N963J0166J3109J6107J9295K2275K5434K9301L3460L7153
59407B814901L9848M0343L6836K9474K1642J7176J7162K0673K7363L7367M9567
59396C152352O2150P4599Q7262R9071J07708J12671J16893J24637J38441J58370
59386D234154J83284K12242K44929K81257L20843L63114M07844M54986N03715
59377G206368N52101N97734O37928O69148O87420O90143O77074O49319O08364
59368A2975599N56774M98792M38939L80375L25052K74715K30488J91751J56225
$$ y = [4764782, 4513690, 4283166, 4072042, 3878677, 3702615, 3544063, 3402457, 3276591, 3165433, 3067780, 2981774, 2905998, 2840410, 2785089, 2738673, 2699326, 2666614, 2641047, 2622322, 2609540, 2602757, 2602638, 2608601, 2618767, 2631876, 2647983, 2667278, 2689553, 2714987, 2744288, 2777748, 2814901, 2854749, 2895092, 2931928, 2961402, 2983044, 3000220, 3017382, 3038055, 3065418, 3102785, 3152352, 3214502, 3289101, 3376363, 3475434, 3583142, 3695813, 3812706, 3937343, 4075784, 4234154, 4417438, 4629680, 4874609, 5155866, 5476709, 5839823, 6247667, 6702653, 7206368, 7758469, 8356203, 8994131, 9663279, 10350699, 11040842, 11717916, 12367235, 12975599, 13532373, 14031165, 14470104, 14850479, 15175531, 15450246, 15680734, 15872485, 16028710]
59359A6028710J21178Q4165M3215k827n4118j10074j69258k28801k84697l33384
59349A5094109l72568m00486m15682m18604m12741m03116l93907l87819l86582
59340A1502604l90617l98581m08305m18149m26772m32160m32153m25903m14061
59331G755903l97588l77169l53666l28204l01649k74482k47296k20903j95885
59322E059061j72385j50388j29966j11193r3983p8072o3205m9503l7397k6824
59312D146145j6752o199M450J4058K2555L1021L9843M8037N4906O1049O6958P1729
59300D537800P4245P4679P3739P1026O5414N6704M5955L4385K2797J1929K515
59289E071188n007j0378j3338j3834j2100q038j043R163K1949L6391N1952O8166
$$ y = [16028710, 16149888, 16234053, 16277268, 16274441, 16220323, 16110249, 15940991, 15712190, 15427493, 15094109, 14721541, 14321055, 13905373, 13486769, 13074028, 12670912, 12277005, 11889186, 11502604, 11111987, 10713406, 10305101, 9886952, 9460180, 9028020, 8595867, 8169964, 7755903, 7358315, 6981146, 6627480, 6299276, 5997627, 5723145, 5475849, 5254946, 5059061, 4886676, 4736288, 4606322, 4495129, 4401146, 4323074, 4259869, 4210366, 4172969, 4146145, 4129393, 4123194, 4127644, 4141702, 4164257, 4195278, 4235121, 4283158, 4338064, 4399113, 4466071, 4537800, 4612045, 4686724, 4760463, 4831489, 4896903, 4953607, 4999562, 5033947, 5056744, 5068673, 5071188, 5066181, 5055803, 5042465, 5028631, 5016531, 5008493, 5007450, 5016613, 5038562, 5074953, 5126905, 5195071]
59277E195071Q4447J00753J17692J35197J51676J65244J75143J81273J82904J78682
59267F668082J67373J47832J19059Q1669L9112l514m2023p4207r9154j16723j27508
59256F759998j32308j31528j25673j16209j05082r3457q1634p0100n9757n1131
59246E793119m4085l8595l5175l4174l5006l6365l7114l6817l5434l2588k7441
59235E400325j9444q808M324K0824M1838O7177R5504J26254J60302J98229K39046
59224F325571K81287L24174L66762M06488M39608M62545M72197M65583M40396
59215I984611L95929L33053K53607J60352N7169n1243j59666k62394l53827m29746
59205I927845m87753n26526n45731n47094n34402n11506m80973m45008m06482
$$ y = [5195071, 5279518, 5380271, 5497963, 5633160, 5784836, 5950080, 6125223, 6306496, 6489400, 6668082, 6835455, 6983287, 7102346, 7184015, 7223127, 7219613, 7177590, 7103383, 7004229, 6887506, 6759998, 6627690, 6496162, 6370489, 6254280, 6149198, 6055741, 5974107, 5904007, 5844250, 5793119, 5749034, 5710439, 5675264, 5641090, 5606084, 5569719, 5532605, 5495788, 5460354, 5427766, 5400325, 5380881, 5372073, 5376397, 5397221, 5439059, 5506236, 5601740, 5727994, 5888296, 6086525, 6325571, 6606858, 6931032, 7297794, 7704282, 8143890, 8606435, 9078632, 9544215, 9984611, 10380540, 10713593, 10967200, 11127552, 11184721, 11133478, 10973812, 10711418, 10357591, 9927845, 9440092, 8913566, 8367835, 7820741, 7286339, 6774833, 6293860, 5848852, 5442370]
59196E442370l67928l30466k94708k61837k32714k06747j82951j61566j43390
59187C260063j28141j14751j02883r2867q4441p6771o9564o2999n6825n0586m4613
59176B375622l9689l5730l1739k7060k1897j6655j1536o667j990K781P556J1630
59164B204626J4785J8040K2423K7471L1945L5631L9364M3597M8086N2793N8002
59153B596763O3549O8913P4032P9198Q4290Q8887R2946R6528R9059R9791R8754
59142C542710R6347R2329Q6007P7266O6404N3374L8334K2660Q172m633j6368k6864
59130D035738l4803l9398m1198m0848l8171l2963k5738j7108p054M743J8221L2854
59118C814275M7913O2784P7491R2827J09468J27027J44589J61985J79715J97810
$$ y = [5442370, 5074442, 4743976, 4449268, 4187431, 3954717, 3747970, 3565019, 3403453, 3260063, 3131922, 3017171, 2914288, 2821421, 2736980, 2660209, 2590645, 2527646, 2470821, 2420235, 2375622, 2335933, 2300203, 2268464, 2241404, 2219507, 2202852, 2191316, 2184649, 2182659, 2185440, 2192996, 2204626, 2219411, 2237451, 2259874, 2287345, 2319290, 2354921, 2394285, 2437882, 2485968, 2538761, 2596763, 2660312, 2729225, 2803257, 2882455, 2966745, 3055632, 3148578, 3245106, 3344165, 3443956, 3542710, 3639057, 3731386, 3817393, 3894659, 3961063, 4014437, 4052771, 4075431, 4083603, 4078970, 4062602, 4035738, 4000935, 3961537, 3920339, 3879491, 3841320, 3808357, 3782619, 3765511, 3758457, 3763200, 3781421, 3814275, 3862188, 3924972, 4002463, 4095290, 4204758, 4331785, 4476374, 4638359, 4818074, 5015884]
59108E015884K15610K32711K49220K64754K77818K86510K89307K84969K72146
59099G388929K49570K16652J74063J23917O9258J3188m1454r1781j35180j70507
59089G796655j98398k19989k35947k47123k55141k61263k65272k66375k64658
59080E582489k60764k54825k46833k37568k27993k18030k07036j95152j83060
59071C551228j70883j58511j46731j36573j27688j18706j09214j00024r1458q2844
59061B308596p3964o5707n8658n2206m5584l9003l3102k7954k3171j8505j4000
59050A856742r919o875n680o891j0509j5975k2145k7711l2036l5396l7981l9235
59038A606389l8619l6504l3516k9631k4766j9743j5575j2190q842n434k430L29
$$ y = [5015884, 5231494, 5464205, 5713425, 5978179, 6255997, 6542507, 6831814, 7116783, 7388929, 7638499, 7855151, 8029214, 8153131, 8222389, 8235577, 8194123, 8102342, 7967162, 7796655, 7598257, 7378268, 7142321, 6895198, 6640057, 6378794, 6113522, 5847147, 5582489, 5321725, 5066900, 4820067, 4582499, 4354506, 4136476, 3929440, 3734288, 3551228, 3380345, 3221834, 3075103, 2938530, 2810842, 2692136, 2582922, 2482898, 2391440, 2308596, 2234632, 2168925, 2110267, 2058061, 2012477, 1973474, 1940372, 1912418, 1889247, 1870742, 1856742, 1846823, 1839948, 1834268, 1827377, 1816868, 1800893, 1778748, 1751037, 1719001, 1683605, 1645624, 1606389, 1567770, 1531266, 1497750, 1468119, 1443353, 1423610, 1408035, 1395845, 1387003, 1381569, 1379139, 1379468]
59026A379468L493P117J0611J3634J6037J7194J6493J4390J1914R295O115K666
59014A508427j01j979l635n180n652m191j018K945O706R554J1534J3464J5801
59001A546675J7672J7795J5996J3052R390N033N09l310o133q126r157r144q754
58988A581498q638q324p004n049l472k239n06J716L559M814O079P445Q377Q928
58974A587184R754J0955J2142J3530J5718J8470K1023K3507K6628L0117L2916
58963A801944L4893L6915L9209M1058M2116M2636M2501M1429M0014L8988L7758
58952B239461L5370L2727L1809L2749L3828L4579L6628M0870M6043N0915N5929
58941B670908O1758O8097P4851Q2917R2548J02456J11549J20368J29819J39815
$$ y = [1379468, 1382961, 1390078, 1400689, 1414323, 1430360, 1447554, 1464047, 1478437, 1490351, 1499646, 1505761, 1508427, 1508326, 1506347, 1502712, 1497532, 1491880, 1487689, 1486671, 1489616, 1496322, 1505876, 1517410, 1530874, 1546675, 1564347, 1582142, 1598138, 1611190, 1620580, 1625613, 1626122, 1622812, 1616679, 1608553, 1599396, 1590252, 1581498, 1572860, 1564536, 1557532, 1552483, 1549011, 1546772, 1546266, 1547982, 1551541, 1556355, 1562434, 1569879, 1578256, 1587184, 1596938, 1607893, 1620035, 1633565, 1649283, 1667753, 1688776, 1712283, 1738911, 1769028, 1801944, 1836837, 1873752, 1912961, 1954019, 1996135, 2038771, 2081272, 2122701, 2162715, 2201703, 2239461, 2274831, 2307558, 2339367, 2372116, 2405944, 2440523, 2477151, 2518021, 2564064, 2614979, 2670908, 2732666, 2800763, 2875614, 2958531, 3051079, 3153535, 3265084, 3385452, 3515271, 3655086]
58931C655086J50131J61440J74470J89162K05471K24089K45578K69672K96030
58922E571129L24772L55969L89589M26254M66788N10711N56522O03831O53615
58913I859180P05739P57710Q06420Q49437Q83753R04822R07952Q89489Q46035
58904A7410537P74190O72529N43034L90189K19990M0623j37783l05771m56603
58895A9150935n85583o89215p66148q17685q46021q53020q41501q16129p81492
58886A2154141p40004o92908o42333n91112n41217m93494m48440m06450l67882
58877G230301l33541l04345k80124k59693k42508k29001k18716k09534j99681
58868D953158j89284j79007j68486j57122j45274j33545j21937j10683j00779
$$ y = [3655086, 3805217, 3966657, 4141127, 4330289, 4535760, 4759849, 5005427, 5275099, 5571129, 5895901, 6251870, 6641459, 7067713, 7534501, 8045212, 8601734, 9205565, 9859180, 10564919, 11322629, 12129049, 12978486, 13862239, 14767061, 15675013, 16564502, 17410537, 18184727, 18857256, 19400290, 19790479, 20010469, 20051092, 19913309, 19607538, 19150935, 18565352, 17876137, 17109989, 16292304, 15446283, 14593263, 13751762, 12935633, 12154141, 11414137, 10721229, 10078896, 9487784, 8946567, 8453073, 8004633, 7598183, 7230301, 6896760, 6592415, 6312291, 6052598, 5810090, 5581089, 5362373, 5152839, 4953158, 4763874, 4584867, 4416381, 4259259, 4113985, 3980440, 3858503, 3747820, 3647041]
58859C647041r2606q5032p6999o8964o1716n4833m7607m0574l4719k9745k4374
58848C029872j7911j0653l206L852J0184J6169K2583K9358L5561M1009M6821N3804
58836C257443O1382O8840P6418Q4449R2595J00789J09740J19677J29835J39981
58826D241149J51229J64392J78814J93920K10677K30369K52947K77793L05112
58817F206402L35496L68958M05422M45333M88950N35827N85586O37937O91300
58808A0701211P42660P89511Q30283Q61928Q78780Q75174Q47838P94787P13724
58799A8035896O03595M66763L08481J35438m3976k19696l82407n25714o45268
58790A7733112p37608q01516q39219q54530q50563q30559p99211p61132p18805
$$ y = [3647041, 3554435, 3469403, 3392404, 3323440, 3261724, 3206891, 3159284, 3118710, 3083991, 3054246, 3029872, 3011961, 3001308, 2998102, 3001954, 3012138, 3028307, 3050890, 3080248, 3115809, 3156818, 3203639, 3257443, 3318825, 3387665, 3464083, 3548532, 3641127, 3741916, 3851656, 3971333, 4101168, 4241149, 4392378, 4556770, 4735584, 4929504, 5140181, 5370550, 5623497, 5901290, 6206402, 6541898, 6910856, 7316278, 7761611, 8250561, 8786388, 9371974, 10009911, 10701211, 11443871, 12233382, 13063665, 13925593, 14804373, 15679547, 16527385, 17322172, 18035896, 18639491, 19106254, 19414735, 19550173, 19506197, 19286501, 18904094, 18378380, 17733112, 16995504, 16193988, 15354769, 14500239, 13649676, 12819117, 12019906, 11258774, 10539969]
58781A0539969o73634o27977n84358n43414n04308m66593m30415l95861l63448
58772E949961l34412l09120k86250k64732k45300k28726k13935j99485j85577
58763C682424j72829j60449j47572j35194j24669j15289j05546r5754q7264p9891
58753B457967p2348o4628n7789n1889m6170m0857l6746l3386k9557k5243k1424
58742A977930j8369j5744j3919j3373j3320j2672j1871j2056j3017j3701j4165
58731A825723j5193j6496j7094j7141j7606j8576j9426k0204k1328k2481k3365
58720A616813k4768k7359l0177l2060l3532l5473l7025l6858l5618l4792l4062
58709A255089l2124k9368k7225k5427k2563j9055j6897j6518j6317j5336j4174
$$ y = [10539969, 9866335, 9238358, 8654000, 8110586, 7606278, 7139685, 6709270, 6313409, 5949961, 5615549, 5306429, 5020179, 4755447, 4510147, 4281421, 4067486, 3868001, 3682424, 3509595, 3349146, 3201574, 3066380, 2941711, 2826422, 2720876, 2625122, 2537858, 2457967, 2385619, 2320991, 2263202, 2211313, 2165143, 2124286, 2087540, 2054154, 2024597, 1999354, 1977930, 1959561, 1943817, 1929898, 1916525, 1903205, 1890533, 1878662, 1866606, 1853589, 1839888, 1825723, 1810530, 1794034, 1776940, 1759799, 1742193, 1723617, 1704191, 1683987, 1662659, 1640178, 1616813, 1592045, 1564686, 1534509, 1502449, 1468917, 1433444, 1396419, 1359561, 1323943, 1289151, 1255089, 1222965, 1193597, 1166372, 1140945, 1118382, 1099327, 1082430, 1065912, 1049595, 1034259, 1020085]
58698A020085j3158j1909j0758j0536j0786j0218q900q098p960p421o320n569
58686I08452n187m140k301p28O1L32k14k175m903o975q053q658q550p234n595
58671H44132m893m498k842l14J093Q05J46p6j82nJ031K301K661K503K851K791
58655H47504N16l187n401n175m377m079l048n45K069L572M554N844P286Q783J0776
58640H65092J3050J4786J6144J8089K0456K2130K3196K4840K7074K8855L0508
58629A104220L3616L8164M2342M5649M9775N5841O3117P1038Q0158R0520J01342
58618A775782J12908J26533J42135J58188J74593J93020K13702K34280K52576
58609C383717K67984K79303K83712K78893K64011K37933J99073J48262Q9499K6967
$$ y = [1020085, 1006927, 995018, 984260, 973724, 962938, 952720, 943820, 935722, 927762, 920341, 914021, 908452, 903265, 899125, 896824, 896096, 896157, 896489, 896275, 894100, 889197, 882222, 874169, 865511, 856961, 849727, 844132, 839239, 834741, 831899, 831585, 832678, 833483, 833629, 833553, 833371, 833366, 834397, 836698, 839359, 841862, 844713, 847504, 848020, 844833, 839432, 834257, 829880, 825801, 822753, 822208, 824277, 827849, 832403, 838247, 845533, 854316, 865092, 878142, 892928, 909072, 927161, 947617, 969747, 992943, 1017783, 1044857, 1073712, 1104220, 1137836, 1176000, 1218342, 1263991, 1313766, 1369607, 1432724, 1503762, 1583920, 1674440, 1775782, 1888690, 2015223, 2157358, 2315546, 2490139, 2683159, 2896861, 3131141, 3383717, 3651701, 3931004, 4214716, 4493609, 4757620, 4995553, 5194626, 5342888, 5432387, 5459354]
58599E459354l6400r6771j48852j89238k18283k37320k46448k46443k40408k31373
58589C567818k19894k05622j89640j73651j58177j43126j28876j15631j02781
58580B130420q9938p7582o6127n5555m6404l9500l4309k9331k4550k1606k0959
58569A624559k0923k0220j9495j9605k0274k1179k2441k3360k2694k0829j9736
58558A393803k0178k1048k1902k3691k6359k8177k8395k8100k7578k5404k1261
58547A121710j7167j4566j2595j0379q632p632o158l988l131m891p725r660j0825
58534A004361j2128j3319j3974j4605j5350j5226j3924j2675j2247j1909j1326
58523H57678j1425j2376j2847j2356j2174j2822j2940j1861j0953j1082j1079
$$ y = [5459354, 5422954, 5326183, 5177331, 4988093, 4769810, 4532490, 4286042, 4039599, 3799191, 3567818, 3347924, 3142302, 2952662, 2779011, 2620834, 2477708, 2348832, 2233201, 2130420, 2040482, 1962900, 1896773, 1841218, 1794814, 1755314, 1721005, 1691674, 1667124, 1645518, 1624559, 1603636, 1583416, 1563921, 1544316, 1524042, 1502863, 1480422, 1457062, 1434368, 1413539, 1393803, 1373625, 1352577, 1330675, 1306984, 1280625, 1252448, 1224053, 1195953, 1168375, 1142971, 1121710, 1104543, 1089977, 1077382, 1067003, 1058371, 1050739, 1044581, 1040593, 1037462, 1032571, 1024846, 1015186, 1004361, 992233, 978914, 964940, 950335, 934985, 919759, 905835, 893160, 880913, 869004, 857678, 846253, 833877, 821030, 808674, 796500, 783678, 770738, 758877, 747924, 736842, 725763]
58512G25763j0063r035q691p922n954l868k652j774r24r00j534j122P93K528L278
58497F77923M354O122O654N194M095N280P345Q181Q080Q213Q473Q700R778J1559
58483G79951J2052J0491Q798Q364P951O626N822O342O164L697N71j302k905n736
58469H46886q734j0351j1417j3262j4937j4993j4097j3502j2747j1206r918r698
58457G02024r361p934o496n862m821k799j702k688l779l118k043k189k254n56
58443F46422J649K485K809M190N763O172O556Q510J1045J2473J3380J4807J5505
58430G51766J3976J1298R071O579K841o20k029k261k665k239PK197K367J891K839
58415G95018M088L553K155K007K504J823O55R15K222K960L427M813O517P348P751
$$ y = [725763, 715700, 706665, 697974, 690052, 684098, 680230, 677578, 675804, 674880, 673980, 672446, 671324, 672117, 674645, 677923, 682277, 688399, 695053, 700247, 704342, 709622, 716967, 725148, 733228, 741441, 749914, 758614, 768392, 779951, 792003, 802494, 811292, 819656, 827607, 834233, 840055, 846397, 852561, 856258, 856829, 855527, 852622, 846886, 838152, 827801, 816384, 803122, 788185, 773192, 759095, 745593, 732846, 721640, 711722, 702024, 692663, 684729, 678233, 672371, 667550, 664751, 663049, 660361, 656582, 653464, 651421, 649232, 646978, 646422, 648071, 650556, 653365, 657555, 663318, 669490, 676046, 684556, 695601, 708074, 721454, 736261, 751766, 765742, 777040, 786111, 792690, 795531, 794911, 792882, 790621, 787956, 785717, 785724, 787921, 790288, 792179, 795018, 799106, 802659, 804814, 806821, 809325, 811148, 811803, 812718, 814940, 817900, 821327, 826140, 832657, 840005, 847756]
58400H47756Q150P105L859N39j072k558n620q488q942q293q735r221p831n837
58386H00812n502n955n168l936m003m316l063j331r75r80L11J609J195O49K052
58371G71399M009M446M793P073R458R319Q147Q774J0224J0061R376J0391J1570
58358H79040J0289Q025P706Q235P025N595O957R587R902Q818R819J2204J2238
58345I95440R699P417N534K085j939l808m257n871p619o562l650k115j509Q77
58331I83722M074M917M192N268P823Q853Q718J0143J2421J2777J2155J3569J5942
58318A104574J5864J4144J4263J5711J5384J4266J5896J9344K0525J9397J9094
58307A288462J9115J6348J1712Q828P270M186J174K086N248N597L506L674O361
$$ y = [847756, 855906, 863011, 866870, 867409, 866337, 863779, 858159, 849671, 840729, 832436, 823701, 814480, 806649, 800812, 795310, 789355, 784187, 780251, 776248, 771932, 768869, 767538, 766563, 765583, 765894, 767503, 768698, 769347, 771399, 775408, 779854, 784647, 791720, 801178, 810497, 818644, 827418, 837642, 847703, 857079, 867470, 879040, 889329, 897354, 905060, 913295, 920320, 925915, 932872, 942459, 952361, 961179, 970998, 983202, 995440, 1005139, 1012556, 1018090, 1020175, 1018236, 1014428, 1010171, 1004300, 996681, 990119, 986469, 984354, 982845, 983722, 987796, 992713, 996905, 1002173, 1009996, 1018849, 1027567, 1037710, 1050131, 1062908, 1075063, 1088632, 1104574, 1120438, 1134582, 1148845, 1164556, 1179940, 1194206, 1210102, 1229446, 1249971, 1269368, 1288462, 1307577, 1323925, 1335637, 1344465, 1351735, 1355921, 1357095, 1359181, 1364429, 1370026, 1373532, 1377206, 1383567]
58294A383567P661P556R516J2921J4023J3629J5681J9069J9285J7331J8252K1684
58282A560175K2754K1613K2912K6402K7381K6091K7285L0857L2390L2504L5890
58271A866254M1479M3568M2338M3120M5652M4649M0722L9772M1694M0825L7525
58260B327598L7897M1984M3837M3416M6425N2207N4208N2770N4706N9932O1689
58249B876669O0433O3724P1519P5842P6089Q0136Q8833R4396R5795J00563J09424
58238C793423J14732J16229J22449J34154J42632J46681J54580J67059J75731
58229E067670J80831J92356K10945K26427K37916K55617K80034L00165L15487
58220G267448L37931L68735L96243M20347M54952N01997N48512N93821O52702
$$ y = [1383567, 1391228, 1398784, 1408300, 1421221, 1435244, 1448873, 1464554, 1483623, 1502908, 1520239, 1538491, 1560175, 1582929, 1604542, 1627454, 1653856, 1681237, 1707328, 1734613, 1765470, 1797860, 1830364, 1866254, 1907733, 1951301, 1993639, 2036759, 2082411, 2127060, 2167782, 2207554, 2249248, 2290073, 2327598, 2365495, 2407479, 2451316, 2494732, 2541157, 2593364, 2647572, 2700342, 2755048, 2814980, 2876669, 2937102, 3000826, 3072345, 3148187, 3224276, 3304412, 3393245, 3487641, 3583436, 3683999, 3793423, 3908155, 4024384, 4146833, 4280987, 4423619, 4570300, 4724880, 4891939, 5067670, 5248501, 5440857, 5651802, 5878229, 6116145, 6371762, 6651796, 6951961, 7267448, 7605379, 7974114, 8370357, 8790704, 9245656, 9747653, 10296165, 10889986, 11542688]
58211A1542688P26817Q01841Q78480R75733J097616J229616J374929J558859J790127
58202B1976706K056876K370050K769301L276862L892433M645152N598327O788308
58194E3374015Q217217R927015J2022460J4605698J7761533K1621121K6321773
58187A63850832L1798546L7585206M2693412M5467005M3655393L5306267K0368806
58180D20725467J612478j6444762k9985500l7609805m0095836l9045337l5909885
58173B23246820l1795822k7498931k3460297j9821838j6621523j3893158j1615038
58166G8540213r701489q087510o751037n645490m689098l833492l076140k397476
58158C4358481j748268j102606m60881K03478R38601J746506K561413L266092
$$ y = [11542688, 12269505, 13071346, 13949826, 14925559, 16023175, 17252791, 18627720, 20186579, 21976706, 24033582, 26403632, 29172933, 32449795, 36342228, 40987380, 46585707, 53374015, 61591232, 71518247, 83540707, 98146405, 115907938, 137529059, 163850832, 195649378, 233234584, 275927996, 321395001, 365050394, 400356661, 420725467, 422337945, 405893183, 375907683, 338297878, 298202042, 259156705, 223246820, 191450998, 163952067, 140491770, 120669932, 104048409, 90155251, 78540213, 68838724, 60751214, 54000177, 48354687, 43665589, 39832097, 36755957, 34358481, 32610213, 31507607, 31046726, 31250204, 32188805, 33935311, 36496724, 39762816]
58150C9762816L652924L407597K293098M39218j619859l280086m238927m550333
58142C5866448m421847m043355l555442l057929k600320k192632j838596j543926
58134A2612401j301966j098278r28240p92526o81758n83477m98107m32041l81617
58125E914391l38327l02518k78112k60878k44476k30730k22284k12989j96819
58116C627258j78483j64522j51814j35255j18546j06926r7156q5009p5107p3244
58106B441196p5974p7129p7631p9945q0159p4654o7789o4354o1182n4360m7602
58095A680417m5081m3084l7328l1671l1001l2025k9761k6919k8124l0705k9805
58084A314913k7342k7595k8903k7739k6163k7491k9108k7156k3910k3387k3922
$$ y = [39762816, 43415740, 46823337, 49116435, 49555653, 47935794, 44655708, 40416781, 35866448, 31444601, 27401246, 23845804, 20787875, 18187555, 15994923, 14156327, 12612401, 11310435, 10212157, 9283917, 8491391, 7809633, 7226156, 6728049, 6296008, 5914391, 5576064, 5273546, 4995434, 4734556, 4490080, 4259350, 4037066, 3824077, 3627258, 3448775, 3284253, 3132439, 2997184, 2878638, 2771712, 2674556, 2589547, 2514440, 2441196, 2365222, 2288093, 2210462, 2130517, 2050358, 1975704, 1907915, 1843561, 1782379, 1728019, 1680417, 1635336, 1592252, 1554924, 1523253, 1492252, 1460227, 1430466, 1403547, 1375423, 1344718, 1314913, 1287571, 1259976, 1231073, 1203334, 1177171, 1149680, 1120572, 1093416, 1069506, 1046119, 1022197]
58073A022197k2142j9867k0188k0881j8546j5222j4339j4148j1555q471p974q180
58061H40684o153l968m713o340n627m436n879q021p625o527q113j0770j0970r638
58047G41904r630r941q258o248o572p596o461m593m717n429m091k192k430l244
58033F60502j717Q84J636J352K275L117J665l47j67Q23l2j267m7K238K461J473
58017F74849K064L425K951J477J515K146P81j749k779k833m199o185o450n515
58003F59498n448n711m765l970n300p053o325m155l599m465m513m133n105o233
57989E88723m993k273r14q03J29J414J063j77l9Q37J58j460j451J22J181J724
57973E83241L202M824M660L477L447M096L473K156K002K160O28j455j519m78j334
$$ y = [1022197, 1000055, 980188, 960000, 939119, 920573, 905351, 891012, 876864, 865309, 856838, 848864, 840684, 834531, 830563, 825850, 819510, 813883, 809447, 803568, 795547, 787922, 781395, 773282, 762512, 751542, 741904, 732274, 722333, 714075, 707827, 701255, 693659, 687198, 682605, 677888, 672459, 668368, 666176, 663746, 660502, 658785, 659669, 661305, 662657, 664932, 668049, 669714, 669367, 669200, 670023, 669991, 668724, 668677, 670915, 673376, 674849, 676913, 680338, 683289, 684766, 686281, 688427, 689208, 687459, 684680, 681847, 677648, 671463, 665013, 659498, 654050, 648339, 643574, 639604, 634304, 627251, 620926, 616771, 613172, 608707, 604194, 600061, 594956, 588723, 583730, 581457, 580543, 579740, 579869, 581283, 582346, 582169, 582130, 582967, 583125, 581665, 580214, 580336, 581517, 583241, 586443, 591267, 595927, 599404, 602851, 606947, 610420, 612576, 614578, 616738, 617366, 615911, 614392, 613914, 612580]
57958F12580l692m364k972k235k955l253k793l380n080n765m943m354m474l921
57944E58399k514j627j360n09O87Q11J34J88P52K48j282k516l513n045o111n455
57928E31287m676o299r464j1069j0671j0439j0816j0098q162o784o206m932l005
57915D28666k029j938j100L98J034J231K918N743P242P036P351R061J0573J0936
57901D87122J0873J0426Q720O444N436N575N052L747L196L183J819p52k134j660
57887E47047j283k085k997l582m873o785p626o904n967n427m625l934m627o108
57873D80224o145m277k239q20P31K122K044J122J571L466M575M412N013O929P929
57858E06657O738M879L645K295M29p63q83j238k211k412j486j030j690j981j203
$$ y = [612580, 608888, 604524, 601552, 599317, 596362, 593109, 590316, 586936, 581856, 576091, 571148, 566794, 562320, 558399, 555885, 554258, 552898, 552389, 553076, 553887, 554021, 554209, 554961, 555209, 553927, 551411, 547898, 542853, 536742, 531287, 526611, 520312, 510848, 499779, 489108, 478669, 467853, 457755, 449593, 442809, 436603, 431671, 428666, 426637, 424699, 423599, 423997, 425031, 426262, 429180, 434923, 442165, 449201, 456552, 465613, 476186, 487122, 497995, 508421, 517141, 523585, 529021, 534596, 539648, 543395, 546591, 549774, 551593, 550841, 548707, 547047, 545764, 543679, 540682, 537100, 532227, 525442, 517816, 510912, 504945, 499518, 494893, 490959, 486332, 480224, 474079, 469802, 467563, 466743, 467474, 469596, 471640, 472762, 474333, 477799, 482374, 486786, 491799, 498728, 506657, 513395, 518274, 521919, 524214, 524643, 523880, 522997, 521759, 519548, 517136, 515650, 514620, 512930, 510949, 509746]
57843E09746p66j401j727r57m25j040j633j317j129j969k997l467m009m862m959
57828D77088m091l853n148o737p475q044r143j0013r943r605r601r372q594p917
57814C67552p547o806n884o009p062p139n454l619k983k784k092j426j223o10
57800C06914Q56K048K215K457L941O168Q135R865J1587J2783J2932J2092J0160
57787D02153P000L665J841J577J311N04K05N79K60j116k102k104k513m102n594
57772D01564o091o644p989q817p937o312n438n213m854m309l582k210n85j40j002
57757C30441j194N89L077M567N197N815O219O019N805O113O422O307O161N956
57743C97494M912L316K774L595L880K473Q54N99R39O01K41J064K464L023K807
$$ y = [509746, 508980, 507579, 505852, 504895, 504470, 503430, 501797, 500480, 499351, 497382, 494385, 490918, 486909, 482047, 477088, 472997, 469144, 463996, 457259, 449784, 441740, 432597, 422584, 412641, 403036, 393435, 384063, 375469, 367552, 360005, 353199, 347315, 341306, 334244, 327105, 321651, 318032, 315049, 312265, 310173, 308747, 307524, 306914, 307770, 309818, 312033, 314490, 318431, 324599, 332734, 342599, 354186, 366969, 379901, 391993, 402153, 409153, 412818, 414659, 416236, 417547, 418051, 418256, 418835, 419095, 417979, 415877, 413773, 411260, 407158, 401564, 395473, 388829, 380840, 372023, 364086, 357774, 352336, 347123, 342269, 337960, 334378, 332168, 331583, 331443, 330441, 329247, 329836, 332913, 337480, 342677, 348492, 354711, 360730, 366535, 372648, 379070, 385377, 391538, 397494, 402406, 405722, 408496, 412091, 415971, 418444, 419298, 419897, 420836, 421437, 421678, 422742, 425206, 428229, 431036]
57728D31036K907L569M328N138O037O528O449O605P545Q653R328R907J0657J1088
57714E29775J1118J1591J2788J3838J4308J4875J5686J5860J5467J6051J8195
57703F89552K0509K2152K4227K7344L0115L1711L3797L7959M3077M7430N1694
57692A059567N7679O5413P3772Q2830R3500J05717J18896J33460J50149J68583
57682B109566J87961K08274K29365K49646K67021K80106K87319K85984K73852
57673D379094K50656K17372J75566J28840Q3230M4223J3980q211k5307m3944p3479
57662E142020j19469j77821k36781k84140l12124l18461l06395k83169k55729
57653B847931k27386j99175j72616j49131j28189j08603r0857p6124o3905n2822
$$ y = [431036, 433943, 437512, 441840, 446978, 453015, 459543, 465992, 472597, 480142, 488795, 498123, 508030, 518687, 529775, 540893, 552484, 565272, 579110, 593418, 608293, 623979, 639839, 655306, 671357, 689552, 710061, 732213, 756440, 783784, 813899, 845610, 879407, 917366, 960443, 1007873, 1059567, 1117246, 1182659, 1256431, 1339261, 1432761, 1538478, 1657374, 1790834, 1940983, 2109566, 2297527, 2505801, 2735166, 2984812, 3251833, 3531939, 3819258, 4105242, 4379094, 4629750, 4847122, 5022688, 5151528, 5234758, 5278981, 5292961, 5284750, 5259443, 5215499, 5142020, 5022551, 4844730, 4607949, 4323809, 4011685, 3693224, 3386829, 3103660, 2847931, 2620545, 2421370, 2248754, 2099623, 1971434, 1862831, 1771974, 1695850, 1631945, 1579123]
57643A579123m2867l4694k7546k0062j2527o104m80N620J2233J8489K4655L1706
57631A527546L9482M7298N5864O6469P8680R0938J03066J16249J30882J46332
57621B402806J62410J79101J95148K08667K18730K24527K23620K13012J91601
57612D219622J59840J17970O6983J0805m4924r6246j41204j77618k03289k18413
57602C693526k25341k25724k19956k09357j96462j82786j68394j53879j40639
57593A970988j28871j17364j05796r5354q6647p8780p0973o3516n6749n0632m5455
57582A070851m1478l7841l3473k9077k6380k5434k4553k2929k1183j9230j6061
57571G73212j2163r796r813j0309r459p898p029o627n529l597j651k15P10J247
$$ y = [1579123, 1536256, 1501562, 1474016, 1453954, 1441427, 1435323, 1434843, 1440463, 1452696, 1471185, 1495840, 1527546, 1567028, 1614326, 1670190, 1736659, 1815339, 1906277, 2009343, 2125592, 2256474, 2402806, 2565216, 2744317, 2939465, 3148132, 3366862, 3591389, 3815009, 4028021, 4219622, 4379462, 4497432, 4564415, 4575220, 4530296, 4434050, 4292846, 4115228, 3911939, 3693526, 3468185, 3242461, 3022505, 2813148, 2616686, 2433900, 2265506, 2111627, 1970988, 1842117, 1724753, 1618957, 1523603, 1436956, 1358176, 1287203, 1223687, 1166938, 1116306, 1070851, 1029373, 991532, 958059, 928982, 902602, 877168, 852615, 829686, 808503, 789273, 773212, 761049, 751253, 741440, 731131, 721672, 713774, 706745, 700118, 694589, 690992, 689341, 689126, 689836, 691083]
57557F91083J734K656L971N233O459Q156J0232J1904J2885J3711J4787J5960J7251
57544H16022J9004K1190K3517K6199K9688L3760L7906M2474M8181N4756O1398
57533A214095O8404P6768Q6269R5703J05073J15763J28196J40996J52979J64257
57523B348503J74662J82533J85732J82684J71835J51651J22092Q5194M3624l64
57513C648146m4115q4177j17684j43479j61440j71630j74668j72010j65206j55472
57503B258265j44168j32746j21795j10958j00138q9998q0982p2700o4588n6540
57493A283652m8716m1394l5013k9663k4650j9424j4569j0764p176k345L437Q262
57481A061637J1275J3740J7134K1564K6464L1605L6930M2487M8837N6584O5486
$$ y = [691083, 692817, 695473, 699444, 704677, 711136, 719292, 729524, 741428, 754313, 768024, 782811, 798771, 816022, 835026, 856216, 879733, 905932, 935620, 969380, 1007286, 1049760, 1097941, 1152697, 1214095, 1282499, 1359267, 1445536, 1541239, 1646312, 1762075, 1890271, 2031267, 2184246, 2348503, 2523165, 2705698, 2891430, 3074114, 3245949, 3397600, 3519692, 3604886, 3648510, 3648146, 3604031, 3519854, 3402170, 3258691, 3097251, 2925621, 2750953, 2578943, 2413737, 2258265, 2114097, 1981351, 1859556, 1748598, 1648460, 1558462, 1477480, 1404780, 1340192, 1283652, 1234936, 1193542, 1158529, 1128866, 1104216, 1084792, 1070223, 1059459, 1052283, 1049938, 1053375, 1061637, 1072912, 1086652, 1103786, 1125350, 1151814, 1183419, 1220349, 1262836, 1311673, 1368257, 1433743]
57470A433743P4975Q5347R7122J09503J21178J32510J44934J57973J68726J74772
57460B700783J75538J70289J56908J33967J02328O3834K0118k6114p0341j08441
57450C318869j38859j61596j76367j83068j83032j78344j70414j60133j48629
57441A818427j36804j24768j12586j01011r0703q1454p2964o5674n9907n4888
57431I17668m9552m3951l9039l5373l2567k9777k6437k2866k0264j9445j9546
57420E78851j8766j6547j4052j2343j1189j0082r158q560p903p044o529o643o825
57407D43210o587o148n788n285m518l755k986j834n29N0k94o84n59l60m45l70
57391D03118J07L95R4l45n39p57j011o23N80J618J637R83L85o1m60n61k52J09
$$ y = [1433743, 1508718, 1594065, 1691187, 1800690, 1921868, 2054378, 2199312, 2357285, 2526011, 2700783, 2876321, 3046610, 3203518, 3337485, 3439813, 3503647, 3523765, 3497651, 3427310, 3318869, 3180010, 3018414, 2842047, 2658979, 2475947, 2297603, 2127189, 1967056, 1818427, 1681623, 1556855, 1444269, 1343258, 1252555, 1171101, 1098137, 1032463, 972556, 917668, 868116, 824165, 785126, 749753, 717186, 687409, 660972, 638106, 617842, 598397, 578851, 560085, 543538, 529486, 517143, 505954, 495872, 486714, 478154, 470251, 463207, 456678, 450035, 443210, 436623, 430475, 424687, 419402, 414884, 411129, 408143, 406309, 405780, 405830, 405536, 404852, 404293, 403933, 403488, 403118, 403225, 403620, 403714, 403369, 402830, 402073, 401062, 400439, 401019, 402637, 404274, 405257, 405642, 405581, 405121, 404560, 404308, 404417]
57373D04417L68P52J090Q42K57L83J392K123J778R54L94o1o19q83p74q50j029
57356D10534k86J505K848K691J974K007K513K509J975J486J093P50R40J736K182
57341D36457J710J274J924L146L805L879M000M126L960L970M747N815O303O216
57327D91332O010N528M520L589L467L854M044M135M541M956M936M946N658O683
57313E58199P189P279P580P984P977P861Q336R218R665R597R689J0151J0589J0959
57299F82273J1697J2824J3830J4423J4838J5470J6703J8747K1078K2593K2979
57288H67455K3400K5053K7590K9784L1218L2285L3050L3264L3246L3626L4217
57277A204188L4084L2748L0609K8072K4963K0819J5376Q765J602n355j1865j8193
$$ y = [404417, 404785, 405537, 406627, 407469, 407726, 408109, 409501, 411624, 413402, 414356, 414750, 414689, 414070, 413187, 412413, 411563, 410534, 410248, 411753, 414601, 417292, 419266, 421273, 423786, 426295, 428270, 429756, 430849, 431599, 432539, 434275, 436457, 438167, 439441, 441365, 444511, 448316, 452195, 456195, 460321, 464281, 468251, 472998, 478813, 485116, 491332, 497342, 502870, 507390, 510979, 514446, 518300, 522344, 526479, 531020, 535976, 540912, 545858, 551516, 558199, 565388, 572667, 580247, 588231, 596208, 604069, 612405, 621623, 631288, 640885, 650574, 660725, 671314, 682273, 693970, 706794, 720624, 735047, 749885, 765355, 782058, 800805, 821883, 844476, 867455, 890855, 915908, 943498, 973282, 1004500, 1036785, 1069835, 1103099, 1136345, 1169971, 1204188, 1238272, 1271020, 1301629, 1329701, 1354664, 1375483, 1390859, 1399624, 1401226, 1395871, 1384006, 1365813]
57265A365813k4238k9193l2381l3897l4069l2950l0768k8138k5360k2164j8648
57254A054007j5613j3415j1302q516n382k631m70J086J858K228L343N648Q025
57241A018866R219R407R525R891J0389J1197J2332J3081J2925J2377J2067J1758
57229A153034J1121J0745J1313J2460J3464J4354J5344J5923J5652J5253J5711
57218A304374J6789J7513J7632J7538J7332J6990J7024J7864J9031J9787K0207
57207A502081K0682K1085K1269K1705K2605K3150K2678K1870K1597K1444K0685
57196A740851J9934K0259K1232K1473K0822K0411K0813K1520K2166K2859K3332
57185A975672K3095K2538K2729K4018K5798K7657K9681L1635L2818L2956L2464
$$ y = [1365813, 1341575, 1312382, 1280001, 1246104, 1212035, 1179085, 1148317, 1120179, 1094819, 1072655, 1054007, 1038394, 1024979, 1013677, 1005161, 999779, 997148, 996678, 997764, 999622, 1001850, 1005193, 1010841, 1018866, 1028085, 1037492, 1047017, 1056908, 1067297, 1078494, 1090826, 1103907, 1116832, 1129209, 1141276, 1153034, 1164155, 1174900, 1186213, 1198673, 1212137, 1226491, 1241835, 1257758, 1273410, 1288663, 1304374, 1321163, 1338676, 1356308, 1373846, 1391178, 1408168, 1425192, 1443056, 1462087, 1481874, 1502081, 1522763, 1543848, 1565117, 1586822, 1609427, 1632577, 1655255, 1677125, 1698722, 1720166, 1740851, 1760785, 1781044, 1802276, 1823749, 1844571, 1864982, 1885795, 1907315, 1929481, 1952340, 1975672, 1998767, 2021305, 2044034, 2068052, 2093850, 2121507, 2151188, 2182823, 2215641, 2248597, 2281061]
57174B281061L1725L0770K9675K8598K7444K6039K4567K3428K2782K2569K2689
57163B571347K2849K2689K2374K2523K3295K4158K4870K5864K7334K8903L0635
57152B846841L3247L6663L9536M1027M1980M3408M4860M5286M4655M3736M2986
57141C304225M2560M2621M2928M2931M2877M3826M5999M8276M9940N1590N3600
57130C811373N5173N5852N6463N7526N8292N8479N9480O2644O7743P4325Q2950
57119D500300R3768J05342J16229J26323J35563J42957J48334J53357J59584J67144
57109E848901J76636J90494K10923K38161K72061L13553L63426M21933M91014
57100H527102N74987O78224Q04825R61555J157888J401738J697945K051213K465559
$$ y = [2281061, 2312786, 2343556, 2373231, 2401829, 2429273, 2455312, 2479879, 2503307, 2526089, 2548658, 2571347, 2594196, 2616885, 2639259, 2661782, 2685077, 2709235, 2734105, 2759969, 2787303, 2816206, 2846841, 2880088, 2916751, 2956287, 2997314, 3039294, 3082702, 3127562, 3172848, 3217503, 3261239, 3304225, 3346785, 3389406, 3432334, 3475265, 3518142, 3561968, 3607967, 3656243, 3706183, 3757773, 3811373, 3866546, 3922398, 3978861, 4036387, 4094679, 4153158, 4212638, 4275282, 4343025, 4417350, 4500300, 4594068, 4699410, 4815639, 4941962, 5077525, 5220482, 5368816, 5522173, 5681757, 5848901, 6025537, 6216031, 6426954, 6665115, 6937176, 7250729, 7614155, 8036088, 8527102, 9102089, 9780313, 10585138, 11546693, 12704581, 14106319, 15804264, 17855477, 20321036]
57091B0321036K939040L463503M030341M630167N244851N847040O409191O903435
57083E9788604P291535P534123P622936P583403P412529P012644O218205M915650
57075A15379629L145299J095440r86840k885594m463147n669346o523193p075559
57067I2016689p375606p461032p364647p117721o748397o284767n759875n208647
57059C8695997m659894m133935l644882l199961k798154k434801k107928j817867
57051A3898575j563103j340645j149157r87744q52632p38620o42913n64345m99897
57042E559519m45343l98557l59138l25579k95733k69200k46464k26450k07548
57033B785507j90062j74976j61268j47105j32864j20360j09838j00151r1099q3248
$$ y = [20321036, 23260076, 26723579, 30753920, 35384087, 40628938, 46475978, 52885169, 59788604, 67080139, 74614262, 82237198, 89820601, 97233130, 104245774, 110463979, 115379629, 118524928, 119620368, 118633528, 115747934, 111284787, 105615441, 99092248, 92016689, 84641083, 77180051, 69815404, 62697683, 55949286, 49664519, 43904644, 38695997, 34036103, 29902168, 26257286, 23057325, 20259171, 17824370, 15716442, 13898575, 12335472, 10994827, 9845670, 8857926, 8005294, 7266674, 6623761, 6059416, 5559519, 5114176, 4715619, 4356481, 4030902, 3735169, 3465969, 3219505, 2993055, 2785507, 2595445, 2420469, 2259201, 2112096, 1979232, 1858872, 1749034, 1648883, 1557784, 1474536]
57023A474536p6149o8995o2255n6724n1843m6833m2308l8801l5149l0459k6162
57012I38858k3779k2035j8663j3738q707l369L566J1969K0913L0947M3621N9681
57000A019264P9666J05088J37211J75677K18251K57284K74188K44465J57731L3382
56990B702207q9308j78479k25661k39056k29816k06935j78013j48389j20148r4404
56980I91998p3651o0546n5603n6929o1185o4613o4798o2039n7922n2818m6184
56969C35710l8754l2152k6519k0556j3953p658j871M114J0149J5424K0323K5986
56957B70243L2022L6808L9788M1090L9022L0858J6775O59j3540k4254l0935l3032
56945D05504l1279k7900k4406k0642j6441j2459q873m991p45L117O708J1203J6902
$$ y = [1474536, 1398387, 1329392, 1267137, 1210413, 1158570, 1111737, 1069429, 1030628, 995479, 965020, 938858, 915079, 893044, 874381, 860643, 851936, 848567, 852133, 864102, 885015, 915962, 959583, 1019264, 1098930, 1204018, 1341229, 1516906, 1735157, 1992441, 2266629, 2511094, 2668825, 2702207, 2612899, 2434420, 2208759, 1969703, 1739887, 1532952, 1354939, 1206550, 1086402, 991998, 918347, 857801, 802198, 745269, 684084, 619471, 554673, 492634, 434712, 381894, 335710, 296956, 264804, 238285, 217729, 203776, 196118, 194247, 198361, 208510, 223934, 244257, 270243, 302265, 339073, 378861, 419951, 458973, 489831, 506606, 507265, 493725, 469471, 438536, 405504, 374225, 346325, 321919, 301277, 284836, 272377, 263504, 258513, 257768, 260885, 267593, 278796, 295698]
56932B95698K2827K8704L5449M2884M8356M8300M0340K4133K139k0139l6797m5450
56920D86444m7851m6644m3169l8331l3435k9172k5169k1218j7826j5219j3017
56909A55393j1148r896q948p705o510o154o199n367l545j922j096o76n90j005
56895H4632r96P92M048P145R597J2276J5245J7653K0000K4129L0297L6221L9628
56882C00667L9736L5823K6895J3991Q18r263j5567j8700j8775j6214j2612r345
56870C17454o248k619J547O167J1656J7983K4220K9969L6368M4818N5419O7103
56858F03837P8188Q5897Q6232P5578N2987K1507j2204m0397n8205o5794o6318
56847G61308o2363n5152m5956l6072k5643j4344l087O818J6002K6579L9338N3388
$$ y = [295698, 318525, 347229, 382678, 425562, 473918, 522218, 562558, 586691, 588830, 568691, 531894, 486444, 438593, 391949, 348780, 310449, 277014, 247842, 222673, 201455, 183629, 168410, 155393, 144245, 134349, 125401, 117696, 111186, 105032, 98833, 93466, 89921, 87999, 86903, 86227, 85637, 84632, 83636, 84428, 88476, 95621, 105218, 117494, 132739, 150392, 170392, 194521, 224818, 261039, 300667, 340403, 376226, 403121, 417112, 417930, 408667, 393100, 374400, 355625, 339411, 326799, 317454, 311206, 308587, 310134, 316301, 327957, 345940, 370160, 400129, 436497, 481315, 536734, 603837, 682025, 767922, 854154, 929732, 982719, 1004226, 992022, 951625, 893420, 827626, 761308, 698945, 643793, 597837, 561765, 536122, 521778, 518691, 525509, 541511, 568090, 607428, 660816]
56835F60816O8543Q5795J04884J23132J36580J40225J27740R4792M4598j1675
56825A575430o1488r7255j16959j22114j16767j06082r3471p9640o4907n0741
56815F66006l8146k6378j4467k502R487K2399L6691N1593O6468Q1229R4105J00288
56803A046773R4335P3585L9580k064m2686p3988r2349r9381r8200r0871p9502
56792F75232o7088n5607m4881l4551k5438j7901j0681k723N397J3157K1490L1081
56780D87487M0639M8104N2055N0725M1595K4031J431k0894l9164n1681n7660n7509
56768E19159n3420m8046m2783l7953l3629k9405k4571j9471j5673j3829j2676
56757A87703j1018r332q310p307n584l780k805k300j508o70l78n02p26j161j538
$$ y = [660816, 729359, 815154, 920038, 1043170, 1179750, 1319975, 1447715, 1542507, 1587105, 1575430, 1513942, 1416687, 1299728, 1177614, 1060847, 954765, 861294, 781654, 716747, 666006, 627860, 601482, 587015, 584513, 594000, 616399, 653090, 704683, 771151, 852380, 946485, 1046773, 1141108, 1214693, 1254273, 1252209, 1209523, 1135535, 1043186, 943805, 845605, 754734, 675232, 608144, 552537, 507656, 473105, 447667, 429766, 419085, 416362, 421759, 434916, 456406, 487487, 528126, 576230, 628285, 679010, 720605, 744636, 746067, 725173, 686009, 634328, 576668, 519159, 465739, 417693, 374910, 336957, 303328, 273923, 249352, 229881, 214208, 200379, 187703, 176685, 167353, 159043, 151736, 146152, 142372, 139567, 137267, 135759, 135089, 134711, 134209, 133483, 132322, 130784]
56742A30784j036J85O13m62j773k077j899k111k272j713r49o77n82l65o59j674
56726A13333k303j892j513k085k654k084j095r46j281r69o2O36J051J378J162
56711A00676J89o52p13p01j216j460q04k56p68j386q64R3L2q12j146p76l81L3
56693H9088P29J043L02p63j026o79m72k04N63J263J367J613K584L156K171O28
56677A01363K07N50J14j015j331m68M83R21J169J221P55J27j48m90j466k459k577
56660I6956k298k553k940k481j522j048p22M87K172K973K839K991L752M294M433
56645A07333M893N717N969N219M043K956J994J317J096R88N39j31p91j618k360
56630A37164j991l70Q39K77r86j119l57l73j506k475k506k008j380o95l23n11
$$ y = [130784, 129748, 129933, 130546, 130084, 128311, 126234, 124335, 122224, 119952, 118239, 117290, 116613, 116031, 115666, 115007, 113333, 111030, 109138, 107625, 105540, 102886, 100802, 99707, 98761, 97480, 96511, 96449, 97085, 98136, 99514, 100676, 100865, 100213, 99500, 98799, 97583, 96123, 95319, 95063, 94295, 92909, 92045, 92138, 92170, 91358, 90212, 89436, 89055, 89088, 89817, 90860, 91162, 90399, 89373, 88694, 88222, 88018, 88581, 89844, 91211, 92824, 95408, 98564, 100735, 101363, 101570, 102120, 102234, 101219, 99888, 99420, 99903, 100824, 101993, 103214, 103969, 104096, 103948, 103458, 101992, 99533, 96956, 94658, 92105, 89165, 86684, 85162, 84114, 83392, 83879, 86051, 89024, 91863, 94854, 98606, 102900, 107333, 112226, 117943, 123912, 129131, 133174, 136130, 138124, 139441, 140537, 141525, 142064, 141933, 141142, 139524, 137164, 135173, 134803, 135642, 135919, 134933, 133814, 133457, 133084, 131578, 129103, 126597, 124589, 123209, 122514, 122191, 121680]
56614A21680o67k40K80M07P85J849K418J296n36j315j175j500k219j941m38J031
56598A19715J691J793J442O24J51Q11J832J820Q59Q3l53j031j525q59M94J022
56582A28569M95J15M08O96N97M74M42L24M09R67J394J227J282K385L681L878L452
56565A50795L717M482M608M251M396M769M452M048M941O658P300O497N644N339
56551B21897M838M063L909M275L916K518J147N16L58M60O35K1j819l580l864l590
56535B35700m522o109o311n165m693n381n569m567l629l322k635j274m51o48q63
56520A80561o77r45j813k206j875j903k583k857k418k332k962l200k527j823j608
56505A48832j270o29m65q87r71m85k84o54r11r16j146j234m01O10K31j162j608
$$ y = [121680, 121013, 120773, 121053, 121460, 122245, 124094, 126512, 127808, 127272, 125957, 124782, 123282, 121063, 119122, 118684, 119715, 121406, 123199, 124641, 125265, 125416, 126227, 128059, 129879, 130738, 130821, 130468, 129437, 127912, 127053, 127547, 128569, 129064, 129179, 129587, 130283, 130880, 131354, 131796, 132120, 132529, 133496, 134890, 136117, 137399, 139784, 143465, 147343, 150795, 154512, 158994, 163602, 167853, 172249, 177018, 181470, 185518, 190459, 197117, 204417, 210914, 216558, 221897, 226735, 230798, 234707, 238982, 242898, 245416, 246563, 247079, 247437, 247897, 248532, 248553, 246734, 243154, 239290, 235700, 231178, 225069, 218758, 213593, 208900, 203519, 197950, 193383, 189754, 186432, 183797, 182523, 182072, 181424, 180561, 179884, 178939, 177126, 174920, 173045, 171142, 168559, 165702, 163284, 160952, 157990, 154790, 152263, 150440, 148832, 147562, 146933, 146468, 145581, 144610, 144125, 143841, 143187, 142276, 141360, 140214, 138980, 138579, 139189, 139420, 138258, 136650]
56488A36650q33o12j422j479N1J473J319M54K22N38R38J684K724L266L269L645
56472A51887M351M106K805K217L367M961N374M544L178J720Q33J272K564L370
56458A96549L448L669L915L121J626J147J860J915N95n33m56k81q42j136m29K33
56442B14401n5m69j50K85J71J7K10R1n90r03l91J16P4PMp37k120k798k380k172
56422B02611k886l566l543l504l774l507k464j652j377o67O23J209O37J0j81o99
56406A77270j358p86P83J125l79j454n53Q43J097R35J425J767J147O02J144J783
56390A85391J270J36n94j113j775j997j544j289j502j145R5R85R82J185K016K256
56374A83357J602J769L610N558O287O565P009O583M964L876M160M064K350O95
$$ y = [136650, 135817, 135205, 133783, 132304, 132355, 133828, 135147, 135601, 135823, 136361, 137299, 138983, 141707, 144973, 148242, 151887, 156238, 160344, 163149, 165366, 168733, 173694, 179068, 183612, 186790, 188510, 189343, 190615, 193179, 196549, 199997, 203666, 207581, 210702, 212328, 213475, 215335, 217250, 217845, 217312, 216856, 216575, 215733, 214597, 214168, 214401, 214346, 213877, 213727, 214012, 214183, 214200, 214410, 214501, 213911, 213008, 212617, 212733, 212807, 212814, 212818, 212081, 209961, 207163, 204783, 202611, 199725, 196159, 192616, 189112, 185338, 181831, 179367, 177715, 176338, 175671, 176294, 177503, 178140, 178150, 177969, 177270, 175912, 175126, 175909, 177034, 176655, 175201, 174648, 175491, 176588, 177523, 178948, 180715, 181862, 182464, 183608, 185391, 186661, 186797, 186203, 185090, 183315, 181318, 179774, 178485, 176983, 175838, 175933, 176918, 177900, 179085, 181101, 183357, 184959, 186728, 190338, 195896, 202183, 208748, 215757, 222340, 227304, 231180, 235340, 239404, 241754, 242449]
56360B42449Q21J578J187K15R8N09M92M27Q73J124P11N94J172J187K07o8J211
56343B54787K130J176q8K13J229J448J552K660L794L745L569M596N795N651M936
56328B97193N112N742N950O641Q671J0509J0385R238R003R531R676R852J0921
56315D08424J1977J1819J1143J0998J0566Q917P230O797O408M395J700J76o01
56302D99949k103l793m146l503l213l083k168r66m12J26J505K803K975L111M572
56287D91654O361O878O873Q059J0133J1691J2874J4591J6351J7349J8409K0515
56275F41738K2816K4375K6326K9921L4076L7327M0525M5011M9978N4356N9554
56264A066003O7290P6402Q4870R3472J04278J16956J29663J42349J56108J70363
$$ y = [242449, 243270, 244848, 246035, 246250, 246348, 246857, 247349, 247776, 248649, 249773, 250484, 251078, 252250, 253437, 253644, 253576, 254787, 256917, 258093, 258005, 258218, 259447, 260895, 262447, 265107, 268901, 272646, 276215, 280811, 286606, 292257, 297193, 302305, 308047, 313997, 320638, 329309, 339818, 350203, 359441, 368444, 377975, 387651, 397503, 408424, 420401, 432220, 443363, 454361, 464927, 473844, 481074, 487871, 494279, 498674, 500374, 500550, 499949, 497846, 494053, 489907, 486404, 483191, 480108, 477940, 476974, 476562, 476688, 478193, 480996, 483971, 487082, 491654, 498015, 504893, 511766, 519825, 529958, 541649, 554523, 569114, 585465, 602814, 621223, 641738, 664554, 688929, 715255, 745176, 779252, 816579, 857104, 902115, 952093, 1006449, 1066003, 1133293, 1209695, 1294565, 1388037, 1492315, 1609271, 1738934, 1881283, 2037391, 2207754]
56254B207754J83621J95925K07753K17627K23583K25734K24838K19644K08298
56245D114777J90943J68554J40927J08546P4462M1522R558k1836n0076p2290q9217
56234D615870j02964j13060j18291j20350j21816j22338j20632j18391j18217
56225C559811j19417j19855j20328j22938j26731j29132j30247j31551j31942
56216B427670j29461j25558j23001j20879j16202j09294j02906r7092q9753q1412
56206A332112p4570o8908o1972n4188m8400m4731m0511l5336l1585k9839k7983
56195H14089k5127k2434k0141j7400j4957j4235j4164j2523r839q226p344n433
56183F42266l369l274m065k852j11J251J241K546N419P498Q405R937J1972J2777
$$ y = [2207754, 2391375, 2587300, 2795053, 3012680, 3236263, 3461997, 3686835, 3906479, 4114777, 4305720, 4474274, 4615201, 4723747, 4798209, 4839731, 4849289, 4827453, 4777377, 4705087, 4615870, 4512906, 4399846, 4281555, 4161205, 4039389, 3917051, 3796419, 3678028, 3559811, 3440394, 3320539, 3200211, 3077273, 2950542, 2821410, 2691163, 2559612, 2427670, 2298209, 2172651, 2049650, 1928771, 1812569, 1703275, 1600369, 1503277, 1413524, 1332112, 1257542, 1188634, 1126662, 1072474, 1024074, 979343, 938832, 903496, 871911, 842072, 814089, 788962, 766528, 746387, 728987, 714030, 699795, 685631, 673108, 663269, 655043, 647699, 642266, 638897, 635623, 631558, 628706, 628595, 629846, 631087, 633633, 639052, 646550, 654955, 664892, 676864, 689641]
56169F89641J3001J4867J7665J8566J7481J6702J6277J4362J1533R979R008O207
56157H55289K384M56R5j321l202k669l31N21J47J962O160R480J1397J4704J9851
56142I14923K4490K8895L6099M6314N6956O8347Q3443J01519J17938J30770J41653
56131A751347J49764J51020J44233J32379J17358R9451Q2256P1507O7617O5127
56121B832059O0269N3305M3288K7617Q172q691j9993k8390l5992m2306m9311o1584
56109B778443p9496r8123j14169j28009j38183j40699j35262j25980j14708j00021
56099A603793q3374o9258n8213m6825l5549k8951k7059k4434j9485j6676j7641
56088A176328j8260j6756j6490j8185j7581j3668j1156j1820j1356p909n618o307
$$ y = [689641, 702642, 717509, 735174, 753740, 771221, 787923, 804200, 818562, 830095, 840074, 849082, 855289, 857673, 858129, 858224, 856903, 853701, 851032, 850701, 851222, 851369, 853331, 859491, 868971, 880368, 895072, 914923, 939413, 968308, 1004407, 1050721, 1107677, 1176024, 1259467, 1360986, 1478924, 1609694, 1751347, 1901111, 2052131, 2196364, 2328743, 2446101, 2545552, 2627808, 2699315, 2766932, 2832059, 2892328, 2945633, 2988921, 3016538, 3024710, 3016019, 2996026, 2967636, 2931644, 2889338, 2840027, 2778443, 2698947, 2600824, 2486655, 2358646, 2220463, 2079764, 1944502, 1818522, 1703814, 1603793, 1520419, 1451161, 1392948, 1346123, 1310574, 1281623, 1254564, 1230130, 1210645, 1193969, 1176328, 1158068, 1141312, 1124822, 1106637, 1089056, 1075388, 1064232, 1052412, 1041056, 1033147, 1027529, 1021222]
56076A021222n772j942J196J432K304N522P288N975N747Q609J0514R287Q701J0788
56062A090871J1830J0019R323J1704J3237J1967J1791J4470J5829J3980J3230
56051A228251J5664J7085J5493J5195J8170K0007J8739J8958K2573K4548K2563
56040A437246K1701K4581K6219K3969K3121K7014L0976L1689L3207L7934M1193
56029A758850M0529M0844M4574M6607M4733M4771M9443N2812N1832N2424N7646
56018B285065O1269N9938N9918O4587O7313O4330O2438O5826O7909O4768O3787
56007B987148O9910P6163P7242P9450Q7421R4475R6234J00159J10935J20366J22779
55996D022282J26209J36917J47442J51930J58211J72149J85457J92068K00707
$$ y = [1021222, 1015450, 1013508, 1014704, 1016136, 1018440, 1023962, 1031250, 1037225, 1042972, 1051581, 1062095, 1071382, 1080083, 1090871, 1102701, 1112720, 1122043, 1133747, 1146984, 1158951, 1170742, 1185212, 1201041, 1215021, 1228251, 1243915, 1261000, 1276493, 1291688, 1309858, 1329865, 1348604, 1367562, 1390135, 1414683, 1437246, 1458947, 1483528, 1509747, 1533716, 1556837, 1583851, 1614827, 1646516, 1679723, 1717657, 1758850, 1799379, 1840223, 1884797, 1931404, 1976137, 2020908, 2070351, 2123163, 2174995, 2227419, 2285065, 2346334, 2406272, 2466190, 2530777, 2598090, 2662420, 2724858, 2790684, 2858593, 2923361, 2987148, 3057058, 3133221, 3210463, 3289913, 3377334, 3471809, 3568043, 3668202, 3779137, 3899503, 4022282, 4148491, 4285408, 4432850, 4584780, 4742991, 4915140, 5100597, 5292665, 5493372]
55987E493372K17793K34348K43996K56775K80244L04561L21803L41587L71382
55978H065861M00978M23856M53308M98804N48046N92087O45221P18606P98664
55969A3145431Q75234R65708J085897J223809J370136J546528J773795K042572
55961B4029110K349250K729626L221167L827038M558281N473737O631443Q041366
55953F0861018R722012J1766104J4296584J7407503K1210966K5865974L1424187
55946A92554348L7597454M3604086M8007876M8603366M2937339K9832581J0934261
55939D54071311r449366k6558792l7636628m2610234m2976194m0439615l6360182
55932B18040300l1745161k7240513k3122644j9460242j6293991j3642139j1444878
$$ y = [5493372, 5711165, 5945513, 6189509, 6446284, 6726528, 7031089, 7352892, 7694479, 8065861, 8466839, 8890695, 9344003, 9842807, 10390853, 10982940, 11628161, 12346767, 13145431, 14020665, 14986373, 16072270, 17296079, 18666215, 20212743, 21986538, 24029110, 26378360, 29107986, 32329153, 36156191, 40714472, 46188209, 52819652, 60861018, 70583030, 82349134, 96645718, 114053221, 135264187, 161130161, 192554348, 230151802, 273755888, 321763764, 370367130, 413304469, 443137050, 454071311, 444621945, 418063153, 380426525, 337816291, 294840097, 254400482, 218040300, 186295139, 159054626, 135931982, 116471740, 100177749, 86535610, 75090732]
55925G5090732r613481q103512o885254n889746n043610m323354l727556l227840
55917B8276379k790268k414403k109252j855362j626786j426568j266552j133999
55909A3653189j009765q99029q13926p44179o73067o05370n53154n09746m62787
55900G382166m18035l86315l60792l29829k99198k79727k65403k44658k21838
55891D576371k07360j97319j82221j65803j56670j50686j39360j26668j20739
55882C129545j17508j08931r8997r5751r5449q9979q2352p9955p9816p4978o8382
55871B137447o6378o5460n9121n1137m8590m8269m3298l6847l6097l8525l7122
55860A606603l3568l3458l3922k8712k0637j6623j4950r426k073N3l234p447j3362
$$ y = [75090732, 65477251, 57373739, 50488485, 44598739, 39555129, 35231775, 31504219, 28276379, 25486111, 23071708, 20962456, 19107094, 17480308, 16053740, 14787188, 13653189, 12643424, 11744395, 10930469, 10186290, 9513223, 8907853, 8354699, 7844953, 7382166, 6964131, 6577816, 6217024, 5887195, 5587997, 5308270, 5042867, 4798209, 4576371, 4369011, 4171692, 3989471, 3823668, 3666998, 3516312, 3376952, 3250284, 3129545, 3012037, 2903106, 2804109, 2708358, 2612909, 2522930, 2440578, 2360623, 2280807, 2205829, 2137447, 2071069, 2005609, 1946488, 1895351, 1846761, 1798492, 1755194, 1718347, 1682250, 1643725, 1606603, 1573035, 1539577, 1505655, 1476943, 1456306, 1439683, 1424733, 1415307, 1413234, 1413287, 1410053, 1402606, 1389244]
55847A389244k3741l4046l7412l5559l4627l3863k8694k1272j7419j6168j2482
55836A093961p466o119p669p682p098r909j4535j6491j6972j9959k3592k3335
55824I33134k0974k1554k3945k3342k0681k0683k2654k2086j9502j9086k0185
55813F98442j8584j4727j2629j2079r712o333n419n840l661L21K224K663N190
55800F19856Q804R477P779P505Q055N574N39l073n084q437j2392j3603j2947j4196
55786E97857j6696j6443j3647j2276j2758j1957r835r271r695p702l691j443j410
55773D71033q32k02k968q771j3229j4629j5112j5294j3614j0867r579q996o259
55760C50681k312r36k244k878k359l305n556o092m907n094o820o896m773l451
$$ y = [1389244, 1365503, 1331457, 1294045, 1258486, 1223859, 1189996, 1161302, 1140030, 1122611, 1106443, 1093961, 1086495, 1080376, 1072707, 1065025, 1057927, 1048018, 1033483, 1016992, 1000020, 980061, 956469, 933134, 912160, 890606, 866661, 843319, 822638, 801955, 779301, 757215, 737713, 718627, 698442, 679858, 665131, 652502, 640423, 630711, 624378, 618959, 613119, 609458, 609779, 612003, 614666, 619856, 628660, 638137, 645916, 653421, 661476, 667050, 667589, 664516, 659432, 650995, 638603, 625000, 612053, 597857, 581161, 564718, 551071, 538795, 526037, 514080, 504245, 494974, 485279, 477577, 473886, 472443, 471033, 470201, 469999, 467031, 458260, 445031, 430402, 415290, 399996, 386382, 375515, 365936, 356940, 350681, 348369, 347433, 345189, 342311, 339952, 336647, 331091, 324999, 320092, 314998, 308178, 301282, 296509, 293058]
55746B93058m027m590m747o012p517o658m269l877n627o118m512l462l700l007
55732B24935j085k05m72N08K685L255J789P55N32j092l947n078m031l671m886
55717B09992n379m378l832m106l259j373r08j958j764K64J627J679K688N125O544
55702B00962O204O262P201O663M029J779J061J27j589k107q29K62M93J566L668
55687B35752M648M082M073M913M302K011Q90J857K131J40j908k104j620j659j355
55672B56153m27m68j868k728k215j769j787o73J660K877K182J643K317K580J664
55657B59141J211J892K035J013N56J245J319K90J60J505J972K61j887l242m954
55642B62517p328q407p606p172q143q424o877n743o729q087p933p288p509p641
$$ y = [293058, 289031, 284441, 279694, 273682, 266165, 259507, 255238, 251361, 245734, 239616, 235104, 231642, 227942, 224935, 223850, 223645, 223173, 223681, 226366, 229621, 231410, 232165, 232697, 231605, 227658, 222580, 218549, 214878, 209992, 204613, 200235, 196403, 192297, 189038, 187665, 186757, 184799, 183035, 183299, 184926, 186605, 189293, 194418, 200962, 207166, 213428, 220629, 227292, 231321, 233100, 234161, 234288, 232699, 230592, 229763, 230025, 230518, 232084, 235752, 240400, 244482, 248555, 253468, 257770, 259781, 260671, 262528, 264659, 264799, 262891, 260787, 259167, 257508, 256153, 255726, 255258, 253390, 250662, 248447, 246678, 244891, 244218, 245878, 248755, 250937, 252580, 254897, 257477, 259141, 260352, 262244, 264279, 265292, 265848, 267093, 268412, 268702, 268862, 270367, 272339, 272600, 270713, 267471, 262517, 255189, 246782, 239176, 232004, 223861, 215437, 208560, 202817, 196088, 188001, 180068, 172780, 165271, 157630]
55628A57630o741o000o287o263n078m243m723m911l634k450k777l363k793k048
55614I6319k294k565j853j179j494j726r54k52m84n18L84Q42j02r86n47K6n05
55597H2112j121p14l26j030j712j177m37o80r95k65N18O9p86p00j88l85r80j166
55579G0037j271j661j651j017r40j899k435j570n48n52o55K17J206J270J193J940
55563F1664K763K716K452K806L162K869K598K742K292Q05l54k82j40q95j511j118
55547H2569q46j686k474k005j169j052q23M14J610J658J481K111K564J768Q30
55532H4950J075J607J100M42J117K477K996K874L137L364K636J544J050M89j139
55517A09719l056l938m093m423m489l691l042l594m316l739k545k298k746k642
$$ y = [157630, 150889, 144889, 138602, 132339, 127261, 123018, 118295, 113384, 109750, 107300, 104523, 101160, 98367, 96319, 94025, 91460, 89607, 88428, 86934, 85208, 84254, 84002, 83518, 83000, 83384, 84226, 84124, 83138, 82591, 82617, 82112, 80991, 80277, 79951, 78921, 77209, 76032, 75595, 74915, 73920, 73655, 74173, 74242, 73456, 72756, 72568, 72183, 71203, 70037, 68766, 67105, 65454, 64437, 63497, 61598, 59163, 57593, 57045, 56493, 55838, 56055, 57261, 58531, 59724, 61664, 64427, 67143, 69595, 72401, 75563, 78432, 81030, 83772, 86064, 86869, 86515, 86233, 86093, 85198, 83687, 82569, 81723, 80037, 77563, 75558, 74389, 73337, 72514, 72928, 74538, 76196, 77677, 79788, 82352, 84120, 84950, 86025, 87632, 88732, 89174, 90291, 92768, 95764, 98638, 101775, 105139, 107775, 109319, 110369, 110858, 109719, 106663, 102725, 98632, 94209, 89720, 86029, 82987, 79393, 75077, 71338, 68793, 66495, 63749, 61107]
55503F1107k162k235k419j777r57j160j841j704j079j138j500r41J45L17m24q55
55487D1377q38j245j996k119j566j138r57o80p59j696k593k187r46l57n42l49
55471B1409M92J034P96K20l56q85r99m62Q6M0j13L03Q01N37j63l98j62r1l05n71
55451B1213q83r40j2J638K353J240l94j037j005j208j287o63l5j18q3Q58J569
55434B1206O53j047j712j310j052r42j07J173J810J835K051K263J713P46K91K42
55418B7813l3k64l6j17j209k219j752m85k8k10K88J284J432Q06Q10J673K141J647
55400C1541Q49J55n08p03NP94N34l42o44n28r02j370q33K31K59p92j483j332j124
55381B3807r13L8J303J430L41m46k10K01K41L64N49Jj205j854j440q39p06n96
$$ y = [61107, 58945, 56710, 54291, 52514, 51557, 50397, 48556, 46852, 45773, 44635, 43135, 42194, 42339, 42656, 42232, 41377, 40539, 39294, 37298, 35179, 33613, 32475, 31518, 30838, 30079, 28383, 25790, 23603, 22657, 22300, 21758, 21409, 21901, 22935, 23731, 23951, 23595, 22710, 21711, 21249, 21335, 21375, 21262, 21565, 22366, 22903, 22740, 22342, 22180, 22089, 21784, 21213, 20330, 19390, 19378, 21016, 23369, 24609, 24215, 23178, 22173, 20965, 19678, 19015, 18980, 18862, 18779, 19637, 21206, 21859, 20812, 19100, 17790, 16738, 15796, 15689, 16862, 18672, 20507, 22558, 24821, 26534, 27280, 27571, 27813, 27780, 27516, 27480, 27363, 26154, 23935, 22183, 21698, 21670, 21460, 21748, 23032, 24464, 25270, 26080, 27753, 29894, 31541, 32390, 32545, 32037, 31334, 31339, 32133, 32667, 32325, 31681, 31153, 30251, 28881, 28048, 28279, 28538, 27746, 26263, 24931, 23807, 22894, 22932, 24235, 25665, 26006, 25560, 25350, 25551, 25792, 26156, 26705, 26706, 25501, 23647, 22207, 21368, 20662, 20066]
55363B0066j03L85N10M38L56K94L56L37m64k044k971k167p16l51q57p45R5N00
55345A2919K99L73O70K86m51j44J217J948J180j48j002j321j142l26N54O16J40
55328A5668J71O90P44K85J76L72k9r39j273q85o75o41J27J399J676N45p36j356
55310A5319j786k117j585k76N09K73lK98N67M85O62J214J365J024J057J492J219
55293A9717J13l96L62J196J100O36L99j44j198j647p59M44O64N5n53r80j266j027
55275A6716k26L22N3n81j054j443j612r15N98J793J979J692J435Q69k5l42L00
55258A9559Q94N85lN0M83N36K30k6l23q38j169r45m97k45l2L58O23M61N2l46p19
55237A8688q55m05L92Q44Q83J084J400J019k42j426j806j603j059K3J351J903
$$ y = [20066, 19963, 20348, 20858, 21296, 21652, 21946, 22302, 22639, 22175, 20131, 17160, 14993, 14277, 13926, 13069, 12324, 12419, 12919, 13218, 13591, 14261, 14547, 14096, 13952, 15169, 17117, 18297, 18149, 17147, 15826, 14684, 14358, 14912, 15528, 15668, 15839, 16529, 17273, 17558, 17734, 18106, 18077, 17138, 15865, 14980, 14305, 13664, 13791, 15190, 16866, 17411, 16675, 15319, 13533, 11416, 9831, 9555, 10064, 10337, 10334, 10632, 11199, 11684, 12346, 13560, 14925, 15949, 17006, 18498, 19717, 19830, 19434, 19796, 20992, 22092, 22728, 23127, 22983, 21785, 20138, 19379, 19823, 20487, 20542, 19989, 19009, 17743, 16716, 16490, 16812, 16865, 16284, 15230, 13787, 12175, 11260, 11858, 13651, 15630, 17322, 18757, 19626, 19601, 19259, 19559, 20453, 21038, 21035, 21085, 21568, 22104, 22334, 22308, 21985, 21147, 19978, 19033, 18536, 18291, 18259, 18617, 19240, 19701, 19753, 19407, 18688, 17833, 17428, 17820, 18664, 19547, 20631, 22031, 23050, 22808, 21382, 19576, 17973, 16914, 16937, 18288, 20191]
55221B0191J345O25N70R37J216J334J082J56p47k87J423K424J527o2o86m46l12
55204C0290k58K25O76K23q68j455j099l94M7R2j19k24K58J257J963J724P75k46
55186C2867r53j116o39k4j42j056j776j608r76m83m8M86P58N31K53K48J45l24
55168B6143o39k58M76Q62P59M05r8o50r72r79r25q47n17q9r4m97n79j07K56L9
55148B1689l13k34J63N31Q10R49Q20O45P49P35p7j251j433l20P81Q17K54p5j75
55129B5065k15K10J271K243K466K182J835J384R14R61J579J950J596J074Q82O38
55113D6035O0k78L2L77J23m28p79j056j324j040o6O62L50n37j057r75m54M92J438
55094D1575J453M56k81J36R22J020P57J002J518J505J151J232J648J580R19M23
$$ y = [20191, 21536, 22161, 22731, 23668, 24884, 26218, 27300, 27456, 26709, 26422, 27845, 30269, 31796, 31734, 31048, 30602, 30290, 30032, 30257, 30933, 31156, 30288, 28833, 27734, 27340, 27387, 27479, 27360, 27136, 27394, 28651, 30614, 32338, 33113, 32867, 31914, 30798, 30159, 30135, 29993, 28937, 27161, 25553, 24577, 24094, 24046, 24532, 25290, 25821, 26074, 26322, 26467, 26143, 25504, 25246, 25722, 26584, 27343, 27748, 27650, 27000, 26028, 25049, 24124, 23277, 22760, 22671, 22577, 22080, 21501, 21394, 21650, 21689, 21376, 21142, 21305, 21836, 22646, 23595, 24415, 25060, 25809, 26544, 26467, 25216, 23783, 23463, 24244, 25061, 25315, 25240, 25065, 24850, 25060, 26331, 28574, 31040, 33222, 35057, 36441, 37355, 38316, 39895, 41845, 43441, 44515, 45397, 46035, 46095, 45817, 45849, 46226, 46349, 45921, 45142, 44086, 42762, 41722, 41656, 42318, 42668, 42131, 41074, 40099, 39645, 40137, 41575, 43028, 43484, 43203, 43339, 44261, 45281, 46038, 47040, 48558, 50063, 51214, 52446, 54094, 55674, 56593, 57016]
55078E7016N28Q63R24N90Q3j73J25O96Q95N73J70r8l95m59K76J480J963J319M11
55059F6787j48p17j282r61L08J077M46n29o86n79j086j582j085k20k28q62r58
55042E7695n01m14p25n88J04N27K88k03n59o39k50M46O22j20q85o96L0K83Q1J22
55022E4618L83K83j32l61l76l49K9Q85J389Q85J11O5L40j0n84k57P31J051M24
55003E9125j43j37NJ22M86O70j06j346j537l57Q22R35M77K49J88kj23K9J80J40
54983E9677J67L85M88L34K56M87Q00Q53N62J15o5N14J733K616K338J224K26k75
54965G2435m86m76j61K74O85J339K257K740K388K000K512L577M326M918O051P379
54949A11758P969Q086Q923J0657J2234J3234J4345J5695J6151J4824J2111Q679
$$ y = [57016, 57544, 58407, 59331, 59921, 60004, 59831, 59956, 60652, 61547, 62120, 62290, 62192, 61797, 61338, 61614, 63094, 65057, 66376, 66787, 66639, 65922, 64640, 63679, 63987, 65064, 65510, 64981, 64295, 63716, 62630, 61048, 59963, 59743, 59515, 58653, 57695, 57194, 56780, 56055, 55467, 55571, 56098, 56386, 56183, 55624, 54985, 54735, 55181, 55803, 55683, 54798, 54102, 54132, 54415, 54496, 54618, 55001, 55284, 55152, 54791, 54415, 54066, 54095, 54980, 56369, 57254, 57365, 57430, 57770, 57760, 57176, 56919, 57650, 58701, 59125, 58982, 58845, 58850, 58972, 59458, 60128, 60022, 58676, 57139, 56782, 57604, 58539, 59016, 59265, 59453, 59451, 59328, 59357, 59537, 59677, 59844, 60229, 60717, 61051, 61307, 61794, 62594, 63447, 64009, 64124, 64059, 64573, 66306, 68922, 71260, 72484, 72710, 72435, 71949, 71473, 71312, 71586, 72271, 73610, 75867, 78607, 80995, 82995, 85507, 89084, 93410, 98328, 104379, 111758, 119727, 127813, 136736, 147393, 159627, 172861, 187206, 202901, 219052, 233876, 245987, 254666]
54937B54666M566j48m725q518j1612j4191j5903j6318j5567j4126j2391j0653
54925A35080r125p859o924o499o370n701m070k343j679j869j678p01K28N52Q05
54910H1847J648L013M505N957P250Q264R228J0520J2062J3438J4529J5374J5516
54897B03151J4255J1589Q188M415J55m394q510j1642j3642j4421j4061j3164j2310
54884A49609j1336r877q425p823p859p465o311n096m198l201j957j043p51n94
54870G3673k59j95p42j410j518j094o74n89p01o50k31K18M2q33j576j494r70p72
54852F0225q59p73o73j021j527j455q37l64k54k10k76p08j207j277j098j060p90
54835D5836J10Q80N73j17L11J695K419K037J761K096J999R81J05J21L06J02K02
$$ y = [254666, 259232, 259084, 254359, 245841, 234229, 220038, 204135, 187817, 172250, 158124, 145733, 135080, 125955, 118096, 111172, 104673, 98303, 92602, 88532, 86189, 84510, 82641, 80963, 80262, 80490, 81042, 81847, 83495, 86508, 91013, 96970, 104220, 112484, 121712, 132232, 144294, 157732, 172261, 187635, 203151, 217406, 228995, 237183, 241598, 241753, 237359, 228849, 217207, 203565, 189144, 175083, 161919, 149609, 138273, 128396, 119971, 112148, 104289, 96824, 90513, 85417, 81219, 78018, 76061, 75018, 74267, 73673, 73414, 73219, 72477, 71067, 69549, 68455, 67781, 67192, 66491, 65841, 65610, 65828, 65870, 65037, 63461, 61967, 60997, 60225, 59366, 58593, 57920, 56899, 55372, 53917, 53080, 52716, 52462, 52252, 51976, 51268, 50061, 48784, 47686, 46626, 45836, 45946, 46826, 47399, 47282, 47593, 49288, 51707, 53744, 55505, 57601, 59600, 60581, 60686, 60807, 61113, 61215, 61417]
54818F1417R67J355O10l49m60k12m27n38L74J739K233J770J371J398J341J163
54802G3752J549K777M262N309N730N727N791O521Q004R537J0438J0950J1822J3277
54788A75446J4834J5969J6393J5813J3889J0513O052J240l122o661r533j1775
54776B39058j2844j2328j0903r820r436r093q387p600o766n354l344j637q33m06
54762A40307L61J382K229K905L630M416N341O664Q322R919J1546J3849J6804J9384
54748B47059K0996K2399K4368K6127K6100K3698J9476J3885O907j007q544j4398
54736D07066j8355k1201k3648k5413k5559k3882k1521j9693j8232j6134j3356
54725A80072j1001r666q674p335n985n241m994m755m375l939l419k902k726k994
$$ y = [61417, 62384, 63739, 64349, 64000, 63540, 63328, 62901, 62363, 62737, 64476, 66709, 68479, 69850, 71248, 72589, 73752, 75301, 78078, 82340, 87649, 93379, 99106, 104897, 111418, 119422, 128959, 139397, 150347, 162169, 175446, 190280, 206249, 222642, 238455, 252344, 262857, 268909, 270149, 267027, 260366, 250833, 239058, 226214, 213886, 202983, 193163, 183727, 174634, 166247, 158647, 151881, 146527, 143183, 141546, 140713, 140307, 140668, 142050, 144279, 147184, 150814, 155230, 160571, 167235, 175557, 185476, 197022, 210871, 227675, 247059, 268055, 290454, 314822, 340949, 367049, 390747, 410223, 424108, 431015, 430008, 421464, 407066, 388711, 367510, 343862, 318449, 292890, 269008, 247487, 227794, 209562, 193428, 180072, 169071, 159405, 150731, 143396, 137411, 132170, 127176, 122421, 118046, 114107, 110688, 107786, 105060, 102066]
54711A02066l330l347k927j970m53J156K152K372K161J598N47n18q06m13k43n22
54695I7523m67K89J042J180R76P86N38L70P06J186P18p84j910j655o95j7N33J424
54677A01743K204K205J673J225R51P69R87J651K189K404K941M001M633M302M021
54662A37899M799N904N992N198M668M639M419L907L771M218M724M929M949N007
54648B05023N379O415P919R069R693J0883J3513J6771J9260K0919K2660K4535
54636C72039K5587K5108K2930J8705J2124L954m233j1389j7363k2126k5424k7152
54624C72760k7355k6076k3780k1470j9679j7832j5343j2748j0858r368p487n461
54612A75303m212l750l209k282j464r07k15N70Q45M53m1k34l12n77j216k297l413
$$ y = [102066, 98736, 95389, 92462, 90492, 90039, 91195, 93347, 95719, 97880, 99478, 100025, 99507, 98701, 98288, 98045, 97523, 97056, 97345, 98387, 99567, 100543, 101329, 101867, 102237, 102943, 104129, 104847, 104063, 102153, 100498, 99803, 99786, 100319, 101743, 103947, 106152, 107825, 109050, 110001, 110770, 111757, 113408, 115597, 118001, 120942, 124943, 129576, 133878, 137899, 142698, 148602, 154594, 159792, 164460, 169099, 173518, 177425, 181196, 185414, 190138, 195067, 200016, 205023, 210402, 216817, 224736, 233805, 243498, 254381, 267894, 284665, 303925, 324844, 347504, 372039, 397626, 422734, 445664, 464369, 476493, 480447, 476214, 464825, 447462, 425336, 399912, 372760, 345405, 319329, 295549, 274079, 254400, 236568, 221225, 208477, 197619, 188251, 180764, 175303, 171091, 167341, 164132, 161850, 160386, 159479, 159264, 159834, 160679, 161132, 161091, 160857, 160545, 159968, 158752, 156455, 153042]
54595A53042l621k593j483j722l169m469m918m929m782m271l562l302l568l651
54581A03002l146k431j888j479j182j160j355j509j594j649j345m78L19J73p85
54566H3493j591j784j675j358m34J028K184K345J684Q42L07J84J67j38n24j82
54550H4548J076K178K111J330R52J098J167J216J794K651L003K995L534M663N416
54535A19732N413N435O166P463R013J0608J1655J1616J1009J0854J0950R961P407
54522B37282M231J150k162n806q938j0928j2098j2686j2296j1042j0028r832r593
54509A37254q410o778n678n104m433l566k795k114j429j040j138j324j187r00
54495I1358o56j74N99R82M89k21k05M42R42J097J334J728J879J690J576J831K284
$$ y = [153042, 149421, 146828, 145345, 143623, 140454, 135985, 131067, 126138, 121356, 117085, 113523, 110221, 106653, 103002, 99856, 97425, 95537, 94058, 92876, 91716, 90361, 88852, 87258, 85609, 84264, 83786, 84105, 84278, 83493, 81902, 80118, 78443, 77085, 76651, 77679, 79863, 82208, 83892, 84734, 85041, 85225, 85392, 85254, 84730, 84548, 85624, 87802, 89913, 91243, 92195, 93293, 94460, 95676, 97470, 100121, 103124, 106119, 109653, 114316, 119732, 125145, 130580, 136746, 144209, 153222, 163830, 175485, 187101, 198110, 208964, 219914, 229875, 237282, 241513, 242663, 240501, 234695, 225757, 214829, 202731, 190045, 177749, 166707, 156679, 146847, 137254, 128844, 122066, 116388, 111284, 106851, 103285, 100490, 98376, 96947, 95907, 94769, 93445, 92258, 91358, 90702, 90528, 91127, 92109, 92598, 92377, 92172, 92614, 93556, 94653, 95987, 97715, 99594, 101284, 102860, 104691, 106975]
54478A06975K612K579K052J185M97M33Q36J206J321J305J213R19M37M5l5L7j59
54461A23458p90j416j391p06j50l20q52j029q83j026j576j986j914j623j397j207
54445A05192j102j274j608j716j515j296j104p19k77k31n54o78m69n05j048j474
54429H9622j088k3J052J593J314J49j403k361k051p22O90J281P65j82m06M21J307
54412H9958J299R57J445K535K870K162J652K089K714K754K562K571K407J943K097
54397A22015L459N082N677N309M836M401L566K424J473P64Q1m34o36r45j723k490
54381A52859k628k392k428k696k818l032l735m393m024k703j569j335j671k050
54367A15385k281k164j535p76o13j168j850k207k272k027j312l76J67J98L03Q73
$$ y = [106975, 109587, 112166, 114218, 115403, 115900, 116333, 117169, 118375, 119696, 121001, 122214, 123133, 123570, 123615, 123580, 123617, 123458, 122668, 121252, 119861, 119155, 119005, 118685, 117833, 116804, 115921, 114895, 113319, 111333, 109419, 107796, 106399, 105192, 104090, 102816, 101208, 99492, 97977, 96681, 95577, 94858, 94581, 94350, 93796, 93118, 92649, 92144, 91096, 89622, 88534, 88511, 89563, 91156, 92470, 92619, 91216, 88855, 86804, 86082, 86772, 88053, 88818, 88636, 88230, 88651, 89958, 91257, 92214, 93659, 96194, 99064, 101226, 102878, 104967, 107681, 110435, 112997, 115568, 117975, 119918, 122015, 125474, 130556, 136233, 141542, 146378, 150779, 154345, 156769, 158242, 159006, 159087, 158653, 158017, 157072, 155349, 152859, 150231, 147839, 145411, 142715, 139897, 136865, 133130, 128737, 124713, 122010, 120441, 119106, 117435, 115385, 113104, 110940, 109405, 108629, 108016, 106848, 104998, 102791, 100519, 98492, 97180, 96804, 96971, 97169, 97472, 98345]
54351I8345J528J742J559J391J452J662J881K021K037K019K112K344K606K845
54337A25544L104L350L431L196K600J788J126R57J161J164N55m82j506k335l032
54322A40621l667m290m881n174m859m170l799l930l898l216k427k293k640k754
54308H8623k606k736l086k900j981j153j149j590j618j063n25m74o79o24k02J53
54292F6390M8l15l70KL01K04J15N53J246J370N96n38j307j497j368j219j059n89
54274F2563L95J471J777J009Kj56N51J158J100Q72J122J652J793J480J331J657
54258G9777J935J576Q42N07O98O47j43j075j301r83r80j439j569q98NM37N16P41
54240G9293J096J138O35k72j372k315k522j656k05P78O49k15p79l60O65J223P89
$$ y = [98345, 99873, 101615, 103174, 104565, 106017, 107679, 109560, 111581, 113618, 115637, 117749, 120093, 122699, 125544, 128648, 131998, 135429, 138625, 141225, 143013, 144139, 145096, 146257, 147421, 147976, 147494, 145988, 143653, 140621, 136954, 132664, 127783, 122609, 117750, 113580, 109781, 105851, 101953, 98737, 96310, 94017, 91377, 88623, 86017, 83281, 80195, 77295, 75314, 74161, 73012, 71422, 69804, 68741, 68216, 67742, 67063, 66439, 66237, 66390, 66438, 66123, 65753, 65755, 66056, 66260, 66375, 66928, 68174, 69544, 70140, 69602, 68295, 66798, 65430, 64211, 63152, 62563, 62958, 64429, 66206, 67215, 67217, 67061, 67612, 68770, 69870, 70742, 71864, 73516, 75309, 76789, 78120, 79777, 81712, 83288, 84130, 84637, 85335, 85982, 85839, 84764, 83463, 82480, 81500, 80061, 78492, 77594, 77599, 78036, 78552, 79293, 80389, 81527, 82162, 81890, 80518, 78203, 75681, 74025, 73820, 74598, 75247, 75032, 74253, 73893, 74558, 75781, 76570]
54223G6570j3l53l40n76q19j89J238K115J571L49l88m75l05J89J097J771J475
54206H2917N28j18j50M0K56N68O96K28n75j017r67r03j010r22m25J73M75K74n17
54187G9551j627k291j950j057n57o97r38r18p85o27l57j38k52n01m43j82k40n51
54169F5440m26L51J126J254P43r2q88j074k56R94J604J391J175J259R10j97j093
54152G2221r50m12m90q55m58N37Q21p1j024q87P2P39N79jl67l30j65k35n39o78
54132F7507l84P3K55J85K25L46L5q53j687j753j132n41m85q52j236j267p98j12
54114E7526R8o24j776k212j414j45M37J01l98l69Q7M23L22q6m11k84L47J095J498
54095E4215J509J394J237Q40K34j83j93q1j36j19L15Q95R40L09k87j58M25M96
$$ y = [76570, 76557, 76204, 75864, 75288, 74469, 74280, 75518, 77633, 79204, 79553, 79165, 78690, 78385, 78574, 79671, 81442, 82917, 83445, 83327, 83177, 83217, 83473, 84041, 84737, 84965, 84390, 83373, 82406, 81503, 80493, 79571, 79146, 79319, 79794, 80068, 79551, 77924, 75633, 73683, 72626, 72069, 71372, 70434, 69516, 68731, 68104, 67747, 67609, 67357, 66856, 66413, 66231, 65991, 65440, 65014, 65365, 66491, 67745, 68488, 68396, 67508, 66434, 66178, 67172, 68776, 70167, 71342, 72601, 73511, 73314, 72221, 71271, 70859, 70369, 69514, 69056, 69593, 70414, 70343, 69319, 68432, 68504, 69243, 69822, 69821, 69454, 69124, 68959, 68724, 68185, 67507, 67123, 67196, 67451, 67636, 67861, 68207, 68242, 67389, 65702, 63949, 62817, 62276, 61791, 60939, 59703, 58436, 57638, 57526, 57624, 57000, 55224, 53012, 51598, 51453, 51890, 51991, 51593, 51224, 51311, 51734, 52056, 51970, 51559, 51275, 51622, 52717, 54215, 55724, 57118, 58355, 59195, 59429, 59246, 59053, 58972, 58836, 58717, 59032, 59927, 60867, 61176, 60889, 60731, 61156, 61652]
54077F1652l46j307j271j99P53O92J00M2O51J070Q07L40K18L44M68P66J386J901
54059F8067J789J172O10L96M32N80O49L14m94j250j323o68K78J138J722J857J597
54042G6866J448J835K458K635K241J820J830K184K623L075L521L824L863L735
54028A13958L735M187N112O070O541O572O647O797O379N136L934L732M183M123
54014A87106L294K675K956L535L437K610J693R02k31j946l612m335m048l640l892
53999A86504m584m975m836m535m202l538k638k230k710l448l597l128k554k050
53985A37479j450q16m47m72q63j556k166k009r91m4p9p82j172j018q74r45p91
53968A21004j40P15J406J765J692J293J013J040Q48N8o00k04P20P03m37j165m13
$$ y = [61652, 61306, 59999, 58728, 58529, 59282, 59974, 60074, 60116, 60767, 61837, 62644, 62984, 63202, 63546, 64014, 64780, 66166, 68067, 69856, 71028, 71638, 72034, 72466, 73046, 73695, 74009, 73515, 72265, 70942, 70274, 70552, 71690, 73412, 75269, 76866, 78314, 80149, 82607, 85242, 87483, 89303, 91133, 93317, 95940, 99015, 102536, 106360, 110223, 113958, 117693, 121880, 126992, 133062, 139603, 146175, 152822, 159619, 165998, 171134, 175068, 178800, 182983, 187106, 190400, 193075, 196031, 199566, 203003, 205613, 207306, 208208, 207977, 206031, 202419, 198084, 194036, 190396, 186504, 181920, 176945, 172109, 167574, 163372, 159834, 157196, 154966, 152256, 148808, 145211, 142083, 139529, 137479, 136029, 135213, 134766, 134294, 133431, 131875, 129709, 127700, 126709, 126665, 126586, 125804, 124632, 123614, 122740, 121795, 121004, 120864, 121579, 122985, 124750, 126442, 127735, 128748, 129788, 130636, 130694, 130094, 129890, 130610, 131313, 130876, 129711, 129298]
53951A29298R46J446R84N86Q86J621K265K523K363K073K141K805L812M757N387
53936A63893N498N001M216L694L499L038J888L71q85j665k173k596k919k953k451
53921A75456j402k58M66Q10J285K135L107L919M517M810M700M442M494M845N040
53906B18366M991N202N948O753P002O610N849M855L646K281Q46m84j307j316q31
53891B68411n65p82j197j726k711m118n249n544n278n045n040n114n194n290n403
53876B10155n597n885n996n649n084m787m694m316l703l433l499l128k117j467
53862A50800j985l069l573l271k774k496k474k777l311l524l021k223j853j987
53848A12462k216k381k506k286j406k64K94l0p74j452j916k045j674r58l74k08
$$ y = [129298, 130244, 131690, 132674, 133260, 134146, 135767, 138032, 140555, 142918, 144991, 147132, 149937, 153749, 158506, 163893, 169391, 174392, 178608, 182302, 185801, 188839, 190727, 191098, 190213, 188548, 186375, 183779, 180860, 177907, 175456, 174054, 173796, 174262, 175072, 176357, 178492, 181599, 185518, 190035, 194845, 199545, 203987, 208481, 213326, 218366, 223357, 228559, 234507, 241260, 248262, 254872, 260721, 265576, 269222, 271503, 272349, 271865, 270558, 269242, 268411, 267846, 267064, 265867, 264141, 261430, 257312, 252063, 246519, 241241, 236196, 231156, 226042, 220848, 215558, 210155, 204558, 198673, 192677, 187028, 181944, 177157, 172463, 168147, 164444, 161011, 157512, 154384, 152267, 150800, 148815, 145746, 142173, 138902, 136128, 133632, 131158, 128381, 125070, 121546, 118525, 116302, 114449, 112462, 110246, 107865, 105359, 103073, 101667, 101403, 101697, 101667, 100893, 99441, 97525, 95480, 93806, 92848, 92474, 92266]
53832I2266k54r9M31J062J212N54m87j022p17j32J71L72Q82J496J645J220O29
53815I9229K17J06M01J004J399J189P58Q86J670K353K262J475N69J29N66J941
53799A16154L669M799M813M091L422L186L188L139L125L445M055M490M448M216
53785A70240M182M151L617K674K093K264K650K556K005J492J254J098P16j10j335
53770A99547k460k846k467j938j666j467j267j541k542l559l635k800j974j871
53756A67514k378k947l142k873k355j811j184m23N9j59o02l20N48N95q17k384
53740A47321k533j488o54o39j027j557k260k747k570k175k267k450j730l26M08
53725A23306K8l98q9M00M58N14J031J454J106L76J13L22L82J63J10L91P71J177
$$ y = [92266, 92012, 91913, 92344, 93406, 94618, 95172, 94685, 93663, 92946, 92814, 92985, 93357, 94239, 95735, 97380, 98600, 99229, 99446, 99552, 99953, 100957, 102356, 103545, 104303, 105189, 106859, 109212, 111474, 112949, 113518, 113647, 114213, 116154, 119823, 124622, 129435, 133526, 136948, 140134, 143322, 146461, 149586, 153031, 157086, 161576, 166024, 170240, 174422, 178573, 182190, 184864, 186957, 189221, 191871, 194427, 196432, 197924, 199178, 200276, 200992, 200882, 199547, 197087, 194241, 191774, 189836, 188170, 186703, 185436, 183895, 181353, 177794, 174159, 171359, 169385, 167514, 165136, 162189, 159047, 156174, 153819, 152008, 150824, 150401, 150460, 150301, 149699, 149379, 149927, 150522, 149705, 147321, 144788, 143300, 142646, 142007, 140980, 139423, 137163, 134416, 131846, 129671, 127404, 124954, 123224, 122898, 123306, 123334, 122936, 122847, 123247, 123705, 124219, 125250, 126704, 127810, 128186, 128299, 128621, 129003, 129166, 129276, 129667, 130438, 131615]
53707A31615J781K537L120L338L257L028K812K794K981L184L337L638M167M638
53693A76227M817M814M687M150L069J927J317J230J254J244J317J417J506J901
53679B10877K842L810L954L266K583K302J873Q79r8k72K26O33O10L49r8p87j290
53662B31659r46P8O72R5j093j764j552j033q71j197j621j622j015k15J44k8k57
53645B19434l82q29j678k082j355j82J36n58j174r26j57M72P08N40J01k2P84K153
53627B14983K856K268J052J32l03m31k36K36P07J197K073L183L695L325K898L076
53611B40711L425L447L615M431N233N133M522M392M646M405L706L537M184M868
53597C00255N088N194N367N301N110N439O206O389N612M942N379O286O215M824
$$ y = [131615, 133396, 135933, 139053, 142391, 145648, 148676, 151488, 154282, 157263, 160447, 163784, 167422, 171589, 176227, 181044, 185858, 190545, 194695, 197764, 199691, 201008, 202238, 203492, 204736, 206053, 207470, 208976, 210877, 213719, 217529, 221483, 224749, 227332, 229634, 231507, 232386, 232288, 232016, 232242, 232875, 233485, 233834, 233736, 232949, 231659, 230713, 230791, 231463, 231558, 230465, 228701, 227149, 226116, 225245, 224048, 222427, 220805, 219790, 219575, 219719, 219691, 219434, 219052, 218223, 216545, 214463, 213108, 212926, 213062, 212504, 211330, 210404, 210247, 210719, 211427, 211967, 212068, 212046, 212830, 214983, 217839, 220107, 221159, 221291, 220988, 220557, 220321, 220557, 221264, 222461, 224534, 227717, 231412, 234737, 237635, 240711, 244136, 247583, 251198, 255629, 260862, 265995, 270517, 274909, 279555, 283960, 287666, 291203, 295387, 300255, 305343, 310537, 315904, 321205, 326315, 331754, 337960, 344349, 349961, 354903, 360282, 366568, 372783, 377607]
53583C77607L184K488L007M166N071N079M218L113K313J909J725J657J607J463
53569D18607J302J297J328R86J82n80p16k19L96O07K92j98l57j01Q1k04o43o63
53551D21397l09j57l87n88m65j78J29N31R00R07O41P29J437K166K196J569R36
53534D31454Q28J345K260L100L336K856K137J884K510L907N475O445O549O381
53520D80467O708P541Q306Q852R632J0824J1946J2609J3042J3655J4515J5496
53508F13593J6514J7352J7767J7981J8563J9607K0574K1239K2142K3715K5549
53497H34596K7027K8157K9209L0021L0326L0376L0629L1009L1095L0850L0671
53486A163966L0814L1191L1613L1862L1664L1087L0755L1217L2156L2687L2368
$$ y = [377607, 380791, 383279, 386286, 390452, 395523, 400602, 404820, 407933, 410246, 412155, 413880, 415537, 417144, 418607, 419909, 421206, 422534, 423520, 423702, 423122, 422406, 422187, 422583, 423190, 423482, 423284, 422927, 422826, 422907, 422703, 422060, 421397, 421088, 420931, 420544, 419956, 419491, 419313, 419442, 419973, 420873, 421780, 422421, 423150, 424587, 426753, 428949, 430518, 431454, 432282, 433627, 435887, 438987, 442323, 445179, 447316, 449200, 451710, 455617, 461092, 467537, 474086, 480467, 487175, 494716, 503022, 511874, 521506, 532330, 544276, 556885, 569927, 583582, 598097, 613593, 630107, 647459, 665226, 683207, 701770, 721377, 741951, 763190, 785332, 809047, 834596, 861623, 889780, 918989, 949010, 979336, 1009712, 1040341, 1071350, 1102445, 1133295, 1163966, 1194780, 1225971, 1257584, 1289446, 1321110, 1352197, 1382952, 1414169, 1446325, 1479012, 1511380]
53475A511380L1524L0688L0093K9685K9217K8286K6703K4837K3347K2519K2044
53464A810323K1348J9966J7783J5277J3346J2494J2117J1029Q748O005L767K041
53452A954244j74l690q011j1597j3362j3862j4702j6786j9563k2053k4010k5695
53440A780739k7022k7735k8166k9025l0346l1325l1444l1207l1377l1930l2174
53429A448988l1636l0412k8782k6960k5167k3525k1845j9856j7741j6095j5120
53418A191849j4265j2913j1113r200p045m290j290J015K338L502N338P649R735
53405A161310J1437J3079J4817J6659J8838K1463K3972K5654K6677K7907K9772
53394A391585L1984L4367L7074L9855M1962M3200M4411M6496M9450N2724N5966
$$ y = [1511380, 1542904, 1573592, 1603685, 1633370, 1662587, 1690873, 1717576, 1742413, 1765760, 1788279, 1810323, 1831671, 1851637, 1869420, 1884697, 1898043, 1910537, 1922654, 1933683, 1942431, 1948436, 1952203, 1954244, 1954070, 1950380, 1942369, 1930772, 1917410, 1903548, 1888846, 1872060, 1852497, 1830444, 1806434, 1780739, 1753717, 1725982, 1697816, 1668791, 1638445, 1607120, 1575676, 1544469, 1513092, 1481162, 1448988, 1417352, 1386940, 1358158, 1331198, 1306031, 1282506, 1260661, 1240805, 1223064, 1206969, 1191849, 1177584, 1164671, 1153558, 1144358, 1137313, 1133023, 1131733, 1132748, 1135086, 1138588, 1143926, 1151575, 1161310, 1172747, 1185826, 1200643, 1217302, 1236140, 1257603, 1281575, 1307229, 1333906, 1361813, 1391585, 1423569, 1457936, 1495010, 1534865, 1576827, 1620027, 1664438, 1710934, 1760384, 1813108, 1869074]
53383A869074N8985O1422O3108O4501O6306O8680P1110P2888P3565P3201P2391
53372B615231P1855P1806P1935P1911P1431O9811O6292O1074N5457N0437M5742
53361C322982M0749L5792L1773K8760K5770K1849J6818J0977M696j594p487j2814
53349C518271j7618k2008k6306l1273l7651m5377n3405o0487o5985o9951p2563
53338C015647p3655p2935p0752o8380o7056o6748o6349o5204o3915o3279o3065
53327B274309o2310o0601n8441n6456n4730n2876n0475m7442m4116m0932l7946
53316A707984l4883l1705k8778k6391k4486k3048k2227k1811k1094j9697j8024
53305A435840j6422j4485j1760q799o681n681n158m519l695k697j421J2J266K217
$$ y = [1869074, 1928059, 1989481, 2052589, 2117090, 2183396, 2252076, 2323186, 2396074, 2469639, 2542840, 2615231, 2687086, 2758892, 2830827, 2902738, 2974169, 3043980, 3110272, 3171346, 3226803, 3277240, 3322982, 3363731, 3399523, 3431296, 3460056, 3485826, 3507675, 3524493, 3535470, 3540166, 3538572, 3531085, 3518271, 3500653, 3478645, 3452339, 3421066, 3383415, 3338038, 3284633, 3224146, 3158161, 3088210, 3015647, 2941992, 2869057, 2798305, 2729925, 2662869, 2596121, 2529772, 2464568, 2400653, 2337374, 2274309, 2211999, 2151398, 2092957, 2036501, 1981771, 1928895, 1878420, 1830978, 1786862, 1745930, 1707984, 1673101, 1641396, 1612618, 1586227, 1561741, 1538693, 1516466, 1494655, 1473561, 1453864, 1435840, 1419418, 1404933, 1393173, 1384374, 1377693, 1372012, 1366854, 1362335, 1358640, 1355943, 1354522, 1354534, 1355800, 1358017]
53291A358017L040L947N185P078R562J1888J3412J4566J6358J9033K1926K4636
53279A508648K7477L0511L2964L4103L4142L3844L3557L3166L2666L2318L2194
53268A865590L1874L0705K8379K5338K2450K0160J8045J5528J2797J0595R178
53257B090639Q007O481M457J870j521n692j0036j3891j7083j9766k2051k4103
53245A997311k6239k8580l0776l2483l3847l5191l6420l7137l7230l6978l6564
53234A625866l5953l5242l4682l4268l3616l2511l1289l0388k9728k8862k7684
53223A271643k6659k6249k6350k6423k6015k5019k3577k1858j9968j7995j6190
53212A015340j5028j4853j5381j5863j5861j5658j5672j5821j5837j5886j6350
$$ y = [1358017, 1361057, 1365004, 1370189, 1377267, 1386829, 1398717, 1412129, 1426695, 1443053, 1462086, 1484012, 1508648, 1536125, 1566636, 1599600, 1633703, 1667845, 1701689, 1735246, 1768412, 1801078, 1833396, 1865590, 1897464, 1928169, 1956548, 1981886, 2004336, 2024496, 2042541, 2058069, 2070866, 2081461, 2090639, 2098646, 2105127, 2109584, 2111454, 2109933, 2104241, 2094205, 2080314, 2063231, 2043465, 2021414, 1997311, 1971072, 1942492, 1911716, 1879233, 1845386, 1810195, 1773775, 1736638, 1699408, 1662430, 1625866, 1589913, 1554671, 1519989, 1485721, 1452105, 1419594, 1388305, 1357917, 1328189, 1299327, 1271643, 1244984, 1218735, 1192385, 1165962, 1139947, 1114928, 1091351, 1069493, 1049525, 1031530, 1015340, 1000312, 985459, 970078, 954215, 938354, 922696, 907024, 891203, 875366, 859480, 843130]
53201H43130j7126j7642j7609j7253j6880j6574j6364j6197j5799j5035j4364
53190F62287j4301j4453j3955j2891j2476j3425j5001j6131j6664j6952j6964
53179D99074j6572j6059j5525j4319j2020r558q358q554q974q758q096p465p021
53166C57795o912p332p973q091p386o384n780n727n883n756n058m052l443l554
53152B74464l829l640l320l573m155m030k933j781j386j543j743j966k317k554
53138B35694k444k153j915j665j358j138r74o44l05n08j244j617r85O6M87J28
53122B19425l08l29j03J11L01N60J045J980L293M317M353L557K791K535K441K117
53106B48086J803J876K062J662N65n93j351k028l054m100m463m183m067m506m904
$$ y = [843130, 826004, 808362, 790753, 773500, 756620, 740046, 723682, 707485, 691686, 676651, 662287, 647986, 633533, 619578, 606687, 594211, 580786, 565785, 549654, 532990, 516038, 499074, 482502, 466443, 450918, 436599, 424579, 415021, 406663, 398109, 389135, 380377, 372281, 364816, 357795, 350883, 343551, 335578, 327487, 320101, 313717, 307937, 302210, 296327, 290571, 285513, 281461, 278018, 274464, 270635, 266995, 263675, 260102, 255947, 251917, 248984, 247203, 245817, 244274, 242531, 240565, 238248, 235694, 233250, 231097, 229182, 227517, 226159, 225021, 224047, 223403, 223098, 222590, 221346, 219729, 218744, 218810, 219297, 219425, 219117, 218788, 218685, 218796, 219097, 219657, 220702, 222682, 225975, 230292, 234645, 238202, 240993, 243528, 245969, 248086, 249889, 251765, 253827, 255489, 256054, 255461, 254110, 252082, 249028, 244928, 240465, 236282, 232215, 227709, 222805]
53091B22805m607l882l448l468l588l619l649l602l357l154l329l617l386k546
53077A73553j719j391j423j462j374j112o70k83k81n97q48r21j075j336j389j090
53061A56582o47j93K69M39m0p99r64m05n7n53j260j289p13j59K14N36M97k81j362
53042A49815j831j497j019q29o48k37J12Q4j22j77j57m04j016j725k178k184j800
53025A34187j278r18q13p97o85m83l39l13k83j00J79L28J98j12m20o80r15j065
53007A25691j049r05o68k46L44P59O91M09M08O28N12l8l36J38R35J211Q07K53
52989A29544p3l07o36q71o53J05J085J815K005J707J152N73K40M48J180J917K166
52972A41397K142K466L190L631L376K894K855L246L601L772M056M643N323N679
$$ y = [222805, 218198, 214316, 210868, 207400, 203812, 200193, 196544, 192942, 189585, 186431, 183102, 179485, 176099, 173553, 171834, 170443, 169020, 167558, 166184, 165072, 164402, 164119, 163838, 163241, 162393, 161472, 160397, 159061, 157672, 156582, 155935, 155742, 156011, 156450, 156410, 155611, 154647, 154242, 154185, 153632, 152372, 151083, 150370, 150211, 150425, 150961, 151458, 151177, 149815, 147984, 146487, 145468, 144639, 143991, 143754, 143866, 143950, 143828, 143651, 143494, 143090, 142074, 140349, 138171, 135987, 134187, 132909, 131991, 131178, 130381, 129696, 129213, 128874, 128561, 128278, 128178, 128357, 128685, 128883, 128771, 128351, 127671, 126756, 125691, 124642, 123737, 123069, 122823, 123167, 123926, 124617, 125026, 125434, 126062, 126574, 126536, 126200, 126338, 127273, 128484, 129291, 129544, 129471, 129164, 128528, 127657, 127004, 127109, 128194, 130009, 132014, 133721, 134873, 135446, 135686, 136134, 137314, 139231, 141397, 143539, 146005, 149195, 152826, 156202, 159096, 161951, 165197, 168798, 172570, 176626, 181269, 186592, 192271]
52958A92271N369M320K895J643Q09K15k48m08l36o52j810l255l889l288k135j382
52942A90119j320j552j579j309j092j336k030k694k787k182j266o85q92j644j967
52927A65784j077N31J369O29q13j462r92l69l83o78m38M50J253J287O33n8l15
52910A65351j83M8K54M64O05N50L51J71L8q3q1J86N60P58P28N88K36m31j018r10
52890A68182j52N48Q32J100J691K268K364K017J475P87P6k55n2L05N08P65J241
52873A83700J532J267P56N19N80P06R70J395J522R73J95n9K65O77R57J158J070
52856A98183N26L4K59R36J197Q50N82P87J087J173J325J827K548L288M005M565
52840B23172M825N031N445N570M588K748J339R32O19m73j848k527k546k636k956
$$ y = [192271, 197640, 201960, 204855, 206498, 207307, 207522, 207274, 206866, 206530, 205878, 204068, 200813, 196924, 193636, 191501, 190119, 188799, 187247, 185668, 184359, 183267, 181931, 179901, 177207, 174420, 172238, 170972, 170287, 169395, 167751, 165784, 164707, 165238, 166607, 167236, 166423, 164961, 163969, 163600, 163217, 162539, 162101, 162551, 163804, 165091, 165724, 165666, 165351, 165168, 165216, 165470, 165934, 166539, 167089, 167440, 167611, 167649, 167566, 167485, 167671, 168231, 168989, 169717, 170305, 170541, 170110, 169092, 168182, 168030, 168578, 169410, 170510, 172201, 174469, 176833, 178850, 180325, 181112, 181188, 180933, 180881, 181186, 181694, 182459, 183700, 185232, 186499, 187255, 187774, 188354, 189060, 190030, 191425, 192947, 193920, 194115, 194056, 194321, 194998, 195955, 197113, 198183, 198709, 198743, 199002, 199938, 201135, 201985, 202567, 203354, 204441, 205614, 206939, 208766, 211314, 214602, 218607, 223172, 227997, 233028, 238473, 244043, 248631, 251379, 252718, 253650, 254269, 253796, 251948, 249421, 246875, 244239, 241283]
52825B41283l087k949k877k905k801k694k934l342l341k865k474k449k467k372
52811B01726k544l174l703l510k766k141j896j755j531j371j354j268r49o04o29
52796A72531j177j939k355k066j278o60p24j347j958k145j920j522j249j403k040
52781A48748k724k880k510k139j992j643q66k54m36j058j276j000r03j212j386
52766A26469j141r14r89r35m25K0k05p95j016q57r92j686k412k552j980r59L9
52749A08670M30r0j126j942k229k228k145j916j541j243j129j054r08p61o24m40
52733H9724l65o80j290j626j315o77k85k32j04L92J032J385J337J141J035R47
52717I0419O98L49J27J7k97r25j514j633j271p03j29L69O24N50L57L59N84Q08
$$ y = [241283, 238196, 235247, 232370, 229465, 226664, 223970, 221036, 217694, 214353, 211488, 209014, 206565, 204098, 201726, 199182, 196008, 192305, 188795, 186029, 183888, 181992, 180237, 178706, 177335, 175981, 174713, 173764, 173160, 172531, 171354, 169415, 167060, 164994, 163716, 163056, 162332, 160985, 159027, 156882, 154962, 153440, 152191, 150788, 148748, 146024, 143144, 140634, 138495, 136503, 134860, 133994, 133740, 133304, 132246, 130970, 129970, 129067, 127855, 126469, 125328, 124414, 123425, 122490, 122065, 122085, 121880, 121085, 120069, 119212, 118220, 116534, 114122, 111570, 109590, 108631, 108670, 109100, 109010, 107884, 105942, 103713, 101485, 99340, 97424, 95883, 94640, 93511, 92457, 91549, 90788, 90164, 89724, 89359, 88679, 87389, 85763, 84448, 83771, 83486, 83254, 83150, 83542, 84574, 85959, 87296, 88437, 89472, 90419, 91117, 91466, 91593, 91610, 91313, 90388, 88874, 87241, 85970, 85267, 85138, 85507, 86131, 86681, 87038, 87397, 87981, 88789]
52699H8789R13R75J139J569K389L404M085M141L921L922M017L662K764J869J389
52684A28948J098N60k87j148j775k152k398k597k681k514k141j832j772j854j924
52669A05531k000k098k024j710j483j652j986k032j772j562j537j594j781k159
52655H0141k308j636l35N63L71m56r38o24K19J045J347R26Q1n50n97k80NJ03L7
52636G7114j67l39j26O74J798K803L499L976M310M344L737K278K46j576k522k666
52620I7383k589k558k343j838j395j244j089o15j08q4m49o01l66k97p58j173o31
52603G9245Q46K146K316J587R00P25P86P03M14k3m91o39j96M16M40j2R1J104J893
52584I2251J404L15R6Q70J458J307J082J223J230Q72R01J826K847K893K105J451
$$ y = [88789, 89702, 90677, 91816, 93385, 95774, 99178, 103263, 107404, 111325, 115247, 119264, 122926, 125690, 127559, 128948, 130046, 130606, 130319, 129171, 127396, 125244, 122846, 120249, 117568, 115054, 112913, 111081, 109309, 107455, 105531, 103531, 101433, 99409, 97699, 96216, 94564, 92578, 90546, 88774, 87212, 85675, 84081, 82300, 80141, 77833, 76197, 75862, 76425, 76796, 76340, 75402, 74778, 74997, 76042, 77389, 78315, 78396, 77846, 77249, 76969, 76974, 77077, 77114, 76947, 76608, 76482, 77156, 78954, 81757, 85256, 89232, 93542, 97886, 101623, 103901, 104147, 102571, 100049, 97383, 94794, 92236, 89893, 88055, 86660, 85416, 84327, 83712, 83604, 83520, 83071, 82470, 82104, 81807, 81049, 79876, 79245, 80091, 82237, 84553, 86140, 87040, 87765, 88551, 89254, 89668, 89645, 89154, 88515, 88319, 88735, 89175, 89163, 89254, 90358, 92251, 93655, 93970, 94066, 94936, 96394, 97701, 98783, 100006, 101236, 102108, 103009, 104835, 107682, 110575, 112680, 114131]
52568A14131J295J196R25P83R43J155J191J069Q03M12K19O36J481J958J616R52
52552A30765P40J021J205J094J141J584J847J296K64k87mN10O42L68j51q63j376
52535A39796j032R1Q73N90j9J45Q67J159J010J325K143K259J004o73j509j397
52519A46632r91n11J94R38J194Q07J66k77m50o47j132j672j614p06L35N59k7o25
52501A42173p98q01p57l92K79P60Q42Q15P61M40J28N37J556K018J368O39R35J788
52483A52291J916J082J84r9J49N89Q77N94l56j319j507q69O1R32J641J972J730
52466A59868J119M99J6k03N7N78O00j69r30q82l32l6N8M21P76M75k03l76LJ43
52446A61482n9K09J184J972J950J679J754J736J030J09j00L20L72l76j144r72
$$ y = [114131, 115426, 116622, 117547, 118330, 119273, 120428, 121619, 122688, 123491, 123903, 124122, 124758, 126239, 128197, 129813, 130765, 131505, 132526, 133731, 134825, 135966, 137550, 139397, 140693, 140957, 140670, 140666, 141176, 141818, 142186, 142035, 141172, 139796, 138764, 138855, 139728, 140318, 140299, 140444, 141311, 142470, 143480, 144805, 146948, 149207, 150211, 149538, 148029, 146632, 145641, 145130, 145324, 146262, 147456, 148263, 148429, 148152, 147702, 147055, 145923, 144251, 142637, 141931, 142266, 142825, 142798, 142173, 141375, 140574, 139817, 139425, 139704, 140464, 141306, 142121, 142882, 143322, 143450, 143987, 145543, 147561, 148929, 149568, 150503, 152291, 154207, 155289, 155473, 155374, 155523, 156112, 156989, 157583, 157227, 155908, 154401, 153532, 153593, 154525, 156166, 158138, 159868, 160987, 161486, 161502, 161299, 161356, 161934, 162534, 162365, 161435, 160553, 160221, 160185, 160243, 160664, 161440, 161915, 161712, 161336, 161339, 161482, 161423, 161632, 162816, 164788, 166738, 168417, 170171, 171907, 172937, 173046, 172946, 173266, 173638, 173262, 172118, 171146]
52430A71146K7P37K64j061k028j882j167r82j601k225k144j625j452j904k452
52415A51651k341j275K96J465J576P99m8k83M0K86n8p89j110m88O48J342J335
52398A53046J354K002K774K750J865R59O84R15J199J193P26j07q20q60j33R80
52382A68527J995K482K146J232O01Q40J466J572J160J022J451J866J903K056K778
52367A93097L604L668K787J627J023J391K541L766M359M200L680L110K505J987
52353B33345J847J998J817R19j96o14O3J441K799L551L529L038K562K287K035
52338B60421J717J615J966K558K934K870K466J897J324R50R58J322J758J970J918
52323B88644J894K185K680K942K716K255J973J981K138K367K730L316M244N552
$$ y = [171146, 171173, 171910, 172174, 171113, 169085, 167203, 166036, 165054, 163453, 161228, 159084, 157459, 156007, 154103, 151651, 149310, 148035, 148331, 149796, 151372, 152171, 152123, 151840, 151880, 152166, 152108, 151319, 150209, 149721, 150369, 151711, 153046, 154400, 156402, 159176, 161926, 163791, 164750, 165434, 166349, 167548, 168741, 169467, 169360, 168540, 167680, 167547, 168527, 170522, 173004, 175150, 176382, 176983, 177823, 179289, 180861, 182021, 183043, 184494, 186360, 188263, 190319, 193097, 196701, 200369, 203156, 204783, 205806, 207197, 209738, 213504, 217863, 222063, 225743, 228853, 231358, 233345, 235192, 237190, 239007, 239926, 239730, 239116, 239179, 240620, 243419, 246970, 250499, 253537, 256099, 258386, 260421, 262138, 263753, 265719, 268277, 271211, 274081, 276547, 278444, 279768, 280718, 281676, 282998, 284756, 286726, 288644, 290538, 292723, 295403, 298345, 301061, 303316, 305289, 307270, 309408, 311775, 314505, 317821, 322065, 327617]
52309C27617O909P728P795P558P480P519P639Q295R772J1442J2430J2822J3423
52296D48429J4426J5253J5630J5990J6600J7207J7751J8598J9706K0381K0293
52285F40264K0006K0061K0146J9822J9420J9554K0120K0419K0048J9149J7940
52274H56949J6553J5103J3569J1699R487P503O391O074N759M682K704L40j593
52261I55220k570k794k929l383m074m876n776o528o691o231n605n026m226l232
52247H91279k616k493j946j49K371M386N487O239P096Q049R186J0716J2358J3474
52233I63437J3963J4413J5113J5551J5141J4006J2774J1906J1461J1183J0635
52222A109583R459P711N782L918K014nj876l286m317n393o780q248r259r631r858
$$ y = [327617, 334526, 342254, 350049, 357607, 365087, 372606, 380245, 388540, 398312, 409754, 422184, 435006, 448429, 462855, 478108, 493738, 509728, 526328, 543535, 561286, 579884, 599590, 619971, 640264, 660270, 680331, 700477, 720299, 739719, 759273, 779393, 799812, 819860, 839009, 856949, 873502, 888605, 902174, 913873, 923360, 930863, 937254, 943328, 949087, 953769, 956473, 956813, 955220, 952650, 949856, 946927, 943544, 939470, 934594, 928818, 922290, 915599, 909368, 903763, 898737, 894511, 891279, 888663, 886170, 884224, 884075, 886446, 890832, 896319, 902558, 909654, 917703, 926889, 937605, 949963, 963437, 977400, 991813, 1006926, 1022477, 1037618, 1051624, 1064398, 1076304, 1087765, 1098948, 1109583, 1119042, 1126753, 1132535, 1136453, 1138467, 1138462, 1136586, 1133300, 1128983, 1123590, 1116810, 1108562, 1099303, 1089672, 1079814]
52207A079814j0585j1748j2637j2972j3380j4422j5543j5703j4783j3695j3057
52196I31289j2497j1434r932q470p349o702o620o870o829o122n093m300l737k984
52182H32350j965j071n78m22n86j221k196k939l011k638k317k151j856j364r87
52167H07048r92j267j547j737j839j792j547j277j253j552k005k397k669k938
52153G82236l302l639l628l147k598k533k930l208l096l082l660m474m764m399
52139G33776l903l571l140k460j936k058k805l725m317m217l367k211j502j686
52125F92878k563l531m039l865l265k872l092l609l764l375k755j997q38O54J887
52110F55854K501K811L245L794M372N193O403P678Q662R483J0482J1739J3170
$$ y = [1079814, 1069229, 1057481, 1044844, 1031872, 1018492, 1004070, 988527, 972824, 958041, 944346, 931289, 918792, 907358, 897426, 888956, 881607, 874905, 868285, 861415, 854586, 848464, 843371, 839071, 835334, 832350, 830385, 829314, 828736, 828314, 827728, 826507, 824311, 821372, 818361, 815723, 813406, 811255, 809399, 808035, 807048, 806056, 804789, 803242, 801505, 799666, 797874, 796327, 795050, 793797, 792245, 790240, 787843, 785174, 782236, 778934, 775295, 771667, 768520, 765922, 763389, 760459, 757251, 754155, 751073, 747413, 742939, 738175, 733776, 729873, 726302, 723162, 720702, 718766, 716708, 713903, 710178, 705861, 701644, 698277, 696066, 694564, 692878, 690315, 686784, 682745, 678880, 675615, 672743, 669651, 666042, 662278, 658903, 656148, 654151, 653313, 653967, 655854, 658355, 661166, 664411, 668205, 672577, 677770, 684173, 691851, 700513, 709996, 720478, 732217, 745387]
52097G45387J4810J6601J8212J9487K0693K2017K3147K3812K4407K5475K6796
52086I80844K7505K7054K5642K3899K2523K1881K1544K0414J7975J5134J3213
52075A217628J2282J1160R049O314L655J251r36k684l761m391n073o139p602r207
52061A221546j0588j1561j2299j2932j3093j2349j1038j0086r805r447q285o637
52049A093426n371m753m218l148j430O17K529L864M432M505M642N211O129P117
52035A113552Q108R276J0603J1563J1481J0344Q974Q235Q164Q106P491O257M616
52022A226770K823J162j45j103j921k794l866n219o623p547p781p995r134j1248
52008A165379j3410j4836j5616j6205j6697j7023j7409j8244j9616k1277k2903
$$ y = [745387, 760197, 776798, 795010, 814497, 835190, 857207, 880354, 904166, 928573, 954048, 980844, 1008349, 1035403, 1061045, 1084944, 1107467, 1129348, 1150892, 1171306, 1189281, 1204415, 1217628, 1229910, 1241070, 1250119, 1256433, 1260088, 1261339, 1260403, 1257719, 1253958, 1249567, 1244494, 1238355, 1230753, 1221546, 1210958, 1199397, 1187098, 1174166, 1161073, 1148724, 1137686, 1127600, 1117795, 1108348, 1100063, 1093426, 1088055, 1083302, 1079084, 1075936, 1074506, 1075123, 1077652, 1081516, 1085948, 1090453, 1095095, 1100306, 1106435, 1113552, 1121660, 1130936, 1141539, 1153102, 1164583, 1174927, 1183901, 1192136, 1200300, 1208406, 1215897, 1222154, 1226770, 1229593, 1230755, 1230610, 1229507, 1227586, 1224792, 1220926, 1215707, 1209084, 1201537, 1193756, 1185761, 1176627, 1165379, 1151969, 1137133, 1121517, 1105312, 1088615, 1071592, 1054183, 1035939, 1016323, 995046, 972143]
51997I72143k4181k4859k4985k4959k5094k5294k5291k5052k4717k4317k3825
51986F99569k3318k2840k2261k1551k1042k1029k1188k0798j9568j7984j6658
51975D71332j5682j4771j3759j2697j1589j0359r117q234q008q302q535q082o788
51962C35409n212m310m576n477n945n509m708m231m011l590l036k853l033k939
51948B75979k321j809j923k234k058j585j536j951k161j945j899k361k756k439
51934B47001j688j330j661k202k445k360k201k139k187k264k201j807j039j27
51920B21350M74M23k19r36j179q53l70k12n09j017j389j498j536j788k293k825
51904B05623l197l387l226k385r85K7k35j441k263j902q53q9M5j72m04n15m78
$$ y = [972143, 947962, 923103, 898118, 873159, 848065, 822771, 797480, 772428, 747711, 723394, 699569, 676251, 653411, 631150, 609599, 588557, 567528, 546340, 525542, 505974, 487990, 471332, 455650, 440879, 427120, 414423, 402834, 392475, 383358, 375124, 367116, 358814, 350279, 342197, 335409, 330197, 325887, 321311, 315834, 309889, 304380, 299672, 295441, 291430, 287840, 284804, 281951, 278918, 275979, 273658, 271849, 269926, 267692, 265634, 264049, 262513, 260562, 258401, 256456, 254557, 252196, 249440, 247001, 245313, 243983, 242322, 240120, 237675, 235315, 233114, 230975, 228788, 226524, 224323, 222516, 221477, 221350, 221824, 222247, 222028, 221092, 219913, 219060, 218690, 218478, 217969, 216952, 215563, 214065, 212529, 210741, 208448, 205623, 202426, 199039, 195813, 193428, 192443, 192470, 192235, 190794, 188531, 186629, 185776, 185687, 185732, 185560, 185156, 184641, 184163]
51887A84163m10n50r39j295j401j354j262r61l98O4O0j85j20L56P93P81L51k02
51869A77491n60m58J59R49J425J422J134P16J81k76l00K13Q98J368J645K007K570
51852A90584L180L545L440K860K104J479R78M19n6q6J46j83j407k579k497j340
51836B00587m96p06j150p37L36R81O83Ok90l2M45P93R21R82J192J554J881K142
51818B09092K544L034L057K240J027J08n00j160j652j351m18J37j24m71k26J51
51802B15488m8n73o80l71k91o21r45j091j319j596j456p34J41P68J173J410J313
51785B10568R13O37P89J117J202J075J124J558K132K350J908J003K54J50O14J177
51769B28571J469J368R03L35J52O01J297J716J941K428L156L565L445L263L439
$$ y = [184163, 183753, 183203, 182264, 180969, 179568, 178214, 176952, 175991, 175593, 175657, 175717, 175532, 175412, 175768, 176561, 177342, 177693, 177491, 176931, 176473, 176632, 177581, 179006, 180428, 181562, 182278, 182459, 182183, 181883, 182096, 182994, 184362, 186007, 188014, 190584, 193764, 197309, 200749, 203609, 205713, 207192, 208170, 208589, 208533, 208447, 208593, 208410, 207003, 204424, 201927, 200587, 200091, 199385, 198235, 197498, 197834, 198815, 199498, 199504, 199214, 199182, 199627, 200420, 201341, 202323, 203515, 205069, 206950, 209092, 211636, 214670, 217727, 219967, 220994, 221102, 220602, 219442, 217790, 216439, 216021, 216158, 216034, 215563, 215337, 215488, 215440, 214867, 214187, 213816, 213525, 212904, 211959, 210868, 209549, 207953, 206497, 205763, 205904, 206672, 207845, 209255, 210568, 211481, 212118, 212907, 214024, 215226, 216301, 217425, 218983, 221115, 223465, 225373, 226376, 226630, 226780, 227394, 228571, 230040, 231408, 232311, 232646, 232798, 233399, 234696, 236412, 238353, 240781, 243937, 247502, 250947, 254210, 257649]
51754B57649L909M577N661P200Q689R591R902R883R540Q700P328N436L032L57
51740C51454k005l565m232m067l172k069j615k068k645k513j778j028k97P21J702
51725C22823J845J014J5m86o32q00r66r70r10r21q45n21p0K76L85J53m94j327
51707C17569j966k442l193m137m435l691k937l421m700n005l653k123k128l411
51693B70327m252l640k104o21L77Q57R08R11J426K473L393L769M065M953O274
51678B89116P135O873N580L829K212J137P32Q74J379K059K550K392J595P84L97
51663C28644L3r31k253k940k485j448p07n19n35m17l34r14k662n234p477q504
51647B91317q551q428q337p844o883o004n476m884l928l047k823l141l385l138
$$ y = [257649, 261558, 266135, 271796, 278996, 287685, 297276, 307178, 317061, 326601, 335301, 342629, 348065, 351097, 351454, 349449, 345884, 341652, 337585, 334413, 332344, 330729, 328661, 326016, 323503, 321725, 320697, 320400, 321121, 322823, 324668, 325682, 325697, 325211, 324579, 323779, 322813, 321843, 320933, 320012, 319167, 318646, 318576, 318852, 319237, 319390, 318896, 317569, 315603, 313161, 309968, 305831, 301396, 297705, 294768, 291347, 286647, 281642, 277989, 275866, 273738, 270327, 266075, 262435, 260331, 259710, 260087, 260944, 261852, 262763, 264189, 266662, 270055, 273824, 277889, 282842, 289116, 296251, 303124, 308704, 312533, 314745, 315882, 316614, 317488, 318867, 320926, 323476, 325868, 327463, 328247, 328644, 328677, 327746, 325493, 322553, 320068, 318620, 317913, 317394, 316859, 316442, 316108, 315194, 312532, 307298, 299821, 291317, 282766, 274338, 266001, 258157, 251274, 245270, 239794, 234910, 230982, 227935, 225112, 221971, 218586, 215448]
51633B15448k466j710j243j218j309j045m40n1k20o97j108j339j240n48N46J292
51617B02652J220O54L1p24j609j947j194j2L83j51n13P9J118J641J425J009Q48
51600B04910Q91Q16N00K47N56J557K796L737M367M998N686O161O332O386O402
51585B56342O223N880N729N985O364O405N995N340M539L400J725k59j906k670
51571C09092k645k462k525k574k189j530j203j443j785j635q75K29J443K591L392
51556B95881L592L393L389L970M870N526N754N792N686N086L850K499J670J367
51542C52325J065M80k83j137k023k482j943n58P61J411J674K002K233J982J348
51527C56855Q15O99R38J233J146M10o23j311j645k322l538m482m517m202m361
$$ y = [215448, 212982, 211272, 210029, 208811, 207502, 206457, 206017, 205966, 205746, 205049, 203941, 202602, 201362, 200814, 201360, 202652, 203872, 204526, 204557, 203833, 202224, 200277, 199083, 199071, 199454, 199303, 198790, 198869, 199987, 201628, 203053, 204062, 204910, 205801, 206617, 207117, 207364, 207920, 209477, 212273, 216010, 220377, 225375, 231061, 237222, 243554, 249940, 256342, 262565, 268445, 274174, 280159, 286523, 292928, 298923, 304263, 308802, 312202, 313927, 313668, 311762, 309092, 306447, 303985, 301460, 298886, 296697, 295167, 293964, 292521, 290736, 289101, 288226, 288455, 289898, 292489, 295881, 299473, 302866, 306255, 310225, 315095, 320621, 326375, 332167, 337853, 342939, 346789, 349288, 350958, 352325, 353390, 353870, 353587, 352450, 350427, 347945, 346002, 345444, 346205, 347616, 349290, 351292, 353525, 355507, 356855, 357670, 358369, 359307, 360540, 361686, 362096, 361473, 360162, 358517, 356195, 352657, 348175, 343658, 339456, 335095]
51512C35095m776m728m382m495m964m811l735k684k604l363m214m612m357l510
51498B77860k443j554p76J57R82J132P24N43Q33R56O15N60J435K572K699J595
51482B87890K63k83J18J049K009K630K813K811L014L612M518N460O108O296O272
51467C34580O476O998P452P542P393P157O707O018N430N097M549L296J710P11
51453D11116N74O25K52l02l48L33J341K150K457K161J381N56K53N70Q89M15j014
51436D23409k844m481n773o810p600q109q379q315p728o852o525p293q490q786
51422C25424p696n991m594l564k467j225k37K11K65L19O49J190J704K169K842
51407C08999L763M421M391M096M376N218N603M746K980J089o33k287l785m893
$$ y = [335095, 330319, 325591, 321209, 316714, 311750, 306939, 303204, 300520, 297916, 294553, 290339, 285727, 281370, 277860, 275417, 273863, 273087, 273244, 274226, 275358, 276082, 276625, 277458, 278414, 279029, 279589, 281024, 283596, 286295, 287890, 288153, 287870, 287988, 289037, 291046, 293676, 296489, 299300, 302314, 305926, 310444, 315904, 322012, 328308, 334580, 341056, 348054, 355506, 363048, 370441, 377598, 384305, 390323, 395753, 400850, 405399, 408695, 410405, 411116, 411690, 412315, 412567, 412265, 411917, 412250, 413591, 415741, 418198, 420359, 421740, 422296, 422549, 423119, 424008, 424423, 423409, 420565, 416084, 410311, 403501, 395901, 387792, 379413, 371098, 363370, 356518, 349993, 342700, 334210, 325424, 317728, 311737, 307143, 303579, 301112, 299887, 299650, 299861, 300126, 300445, 301094, 302284, 303988, 306157, 308999, 312762, 317183, 321574, 325670, 330046, 335264, 340867, 345613, 348593, 349682, 349049, 346762, 342977, 338084]
51393C38084n657o358p133p895q461q655q460q247q456q912q868q023p046o698
51379B29215o792o569n773m793l921l057k141j393j005r25r48q25l72K29L22o36
51363A90616k384m017m819m708l971k967k057j488j215j086j200j784k641l051
51349A53228k466j175m4L85L96O30J164J418J026N34P64J642K211J966J519J730
51333A64928K595L463L877L791L301K737K707L507M629N366N675N930O045N561
51319B24112M538L704L572L944M259L956K516j20l015m825n150m872m941n432
51305B22246o002o508o798o436n358m252l763l673l472l300l623m180m114l225
51291A57542k247j747j384p10p6j86j016j709j540o54K76P50P81O46M78J36n49
$$ y = [338084, 332427, 326069, 318936, 311041, 302580, 293925, 285465, 277218, 268762, 259850, 250982, 242959, 235913, 229215, 222423, 215854, 210081, 205288, 201367, 198310, 196169, 194776, 193771, 192846, 191898, 191073, 190701, 190930, 191252, 190616, 188232, 184215, 179396, 174688, 170717, 167750, 165693, 164205, 162990, 161904, 160704, 158920, 156279, 153228, 150762, 149587, 149543, 149928, 150324, 150954, 152118, 153536, 154562, 155096, 155860, 157502, 159713, 161679, 163198, 164928, 167523, 170986, 174863, 178654, 181955, 184692, 187399, 190906, 195535, 200901, 206576, 212506, 218551, 224112, 228650, 232354, 235926, 239870, 244129, 248085, 250601, 250481, 247466, 242641, 237491, 232619, 227678, 222246, 216244, 209736, 202938, 196502, 191144, 186892, 183129, 179456, 175984, 172684, 169061, 164881, 160767, 157542, 155295, 153548, 152164, 151454, 151378, 151192, 150176, 148467, 146927, 146273, 146549, 147299, 148080, 148726, 149204, 149340, 148791]
51274A48791j349j687j219l29J98M7k99k20K73N92L77o8j89J54N95P05M51J54
51256A46977Q5J61O8l14p57j006j154j467j944k264k222j940j592j177p23l88
51240A30343k80l34n32r01j175q76p1M32J16l87n0J104K061K192J790J216L69
51223A35017o82j286r60l1R27J814K600K743J746J07j024j067m23L16Q70J086
51207A41753Q46L87K54O40J168J426J432J399J387J364J257Q74P0q40j253j027
51191A51137o32l51J11Q96J448J303R46J167J782J869J206O24P55J184J199P57
51175A65401K76k5j57j14m5l31j062j729j850j668j758k180k541k708k836k836
51159A43837k445j830j488j479j299p45k77k58l75k40j00m48j103j275n39O11
$$ y = [148791, 147442, 145755, 144536, 144207, 144405, 144452, 144153, 143933, 144206, 144798, 145175, 145107, 144918, 145072, 145667, 146372, 146823, 146977, 147062, 147223, 147291, 146977, 146220, 145214, 144060, 142593, 140649, 138385, 136163, 134223, 132631, 131454, 130731, 130343, 130063, 129729, 129197, 128296, 127121, 126245, 126174, 126606, 126722, 126335, 126285, 127389, 129450, 131642, 133432, 134648, 135017, 134335, 133049, 132089, 132058, 132985, 134799, 137399, 140142, 141888, 141995, 140971, 139904, 139481, 139797, 140667, 141753, 142599, 142986, 143240, 143880, 145048, 146474, 147906, 149305, 150692, 152056, 153313, 154187, 154257, 153417, 152164, 151137, 150505, 150154, 150265, 151161, 152609, 153912, 154858, 156025, 157807, 159676, 160882, 161506, 162261, 163445, 164644, 165401, 165677, 165652, 165495, 165381, 165336, 165005, 163943, 162214, 160364, 158696, 156938, 154758, 152217, 149509, 146673, 143837, 141392, 139562, 138074, 136595, 135296, 134551, 134274, 134016, 133641, 133401, 133301, 132853, 131750, 130475, 129936, 130547]
51143A30547J315J197N95J06Q7N54J441K621L683L942L149J949J162O73l24j933
51127A50764l122l050k174j483j193q27k83l7l88j090j714j910j421m04L94L24
51111A32386k98o06l87j78j63J50R00J393J111N30L47M37K67q7p6M05R48J349
51093A38428J755K133K172J818J370J008P00N68Q47J385J663J451R83M24k78q65
51077A55562p52J23J010J314J287J230P39n40j771j678k87J021J284R02O27N08
51061A60579L87N42J157J674J507J024J092J831K504K615K420K328K381K500K690
51046A87231K853K707K084J072q9r83j046j42R27J095L11m54n81m35l77m0Q30
51029A94963J510J118j1o34j20R84J841K055J511K47j261k231k322j898j419r59
$$ y = [130547, 131862, 133059, 133654, 133760, 133847, 134401, 135842, 138463, 142146, 146088, 149237, 151186, 152348, 153021, 152697, 150764, 147642, 144592, 142418, 140935, 139742, 138915, 138632, 138595, 138207, 137117, 135403, 133493, 132072, 131668, 132062, 132386, 132088, 131482, 131095, 130917, 130754, 130904, 131804, 133197, 134308, 134838, 135185, 135622, 135889, 135802, 135726, 136131, 137079, 138428, 140183, 142316, 144488, 146306, 147676, 148684, 149384, 149952, 150799, 152184, 153847, 155298, 156281, 156705, 156427, 155562, 154810, 154933, 155943, 157257, 158544, 159774, 160513, 159973, 158202, 156524, 156237, 157258, 158542, 159444, 160071, 160579, 160966, 161508, 162665, 164339, 165846, 166870, 167962, 169793, 172297, 174912, 177332, 179660, 182041, 184541, 187231, 190084, 192791, 194875, 195947, 195858, 194875, 193829, 193687, 194614, 195709, 196020, 195566, 194985, 194550, 194173, 194133, 194963, 196473, 197591, 197580, 196946, 196826, 197810, 199651, 201706, 203217, 203464, 202203, 199972, 197650, 195752, 194333, 193374]
51013A93374m93k86n30r46j007n10L04J085J646J989K247K532K784K862K838L003
50997B10892L533M281M986N466N553N170M618M479M962N610N991O396P353Q629
50983B87919R367R320R292J0003J1138J2032J2890J4526J6922J8951J9903K0626
50971D52889K2540K5933K9863L3640L7538M1965M6599N0850N4766N8854O3164
50960I18601O7081P0037P2055P3434P4252P4330P3425P1228O7311O1420N3835
50949A677009M5322L6566K7789J8961J0260K094n268j1808j7433k1802k4674k6209
50937A710807k6642k5875k3890k1390j9539j8834j8807j8969j9582k1149k3614
50926A472516k6580k9977l3966l8315m2360m5616m8011m9635n0645n1295n1670
$$ y = [193374, 192881, 192595, 192065, 191119, 190112, 189602, 189906, 190991, 192637, 194626, 196873, 199405, 202189, 205051, 207889, 210892, 214425, 218706, 223692, 229158, 234711, 239881, 244499, 248978, 253940, 259550, 265541, 271937, 279290, 287919, 297286, 306606, 315898, 325901, 337039, 349071, 361961, 376487, 393409, 412360, 432263, 452889, 475429, 501362, 531225, 564865, 602403, 644368, 690967, 741817, 796583, 855437, 918601, 985682, 1055719, 1127774, 1201208, 1275460, 1349790, 1423215, 1494443, 1561754, 1623174, 1677009, 1722331, 1758897, 1786686, 1805647, 1815907, 1818001, 1812733, 1800925, 1783492, 1761690, 1737016, 1710807, 1684165, 1658290, 1634400, 1613010, 1593471, 1574637, 1555830, 1536861, 1517279, 1496130, 1472516, 1445936, 1415959, 1381993, 1343678, 1301318, 1255702, 1207691, 1158056, 1107411, 1056116, 1004446]
50915A004446n1353m9919m7603m4997m2125l8502l4314l0676k8308k6543k4228
50904E85878k1229j8332j5934j3598j0920q214o114m914m487m467m310l545k240
50891D67574j040l88N8R73K383L493L582K779J849J388J466J835K278K709L209
50876D94148L982N106O284P010P204P484Q579J0503J2523J3966J4764J5239J5663
50863F22455J6277J7506J9705K2695K5876K8983L2387L6567M1516M7020N3222
50852I64209O0396O8261P6164Q4122R3034J03445J14556J25094J34793J44290
50842A968364J53691J61999J68147J71886J73338J72142J67424J58307J44232
50833C439530J25252J02414P7573N2395K7692L859j8353l7859n3725o5324p2380
$$ y = [1004446, 953093, 903174, 855571, 810574, 768449, 729947, 695633, 664957, 636649, 610106, 585878, 564649, 546317, 530383, 516785, 505865, 497651, 491537, 486623, 482136, 477669, 473359, 469814, 467574, 466534, 466146, 466204, 467177, 469560, 473053, 476635, 479414, 481263, 482651, 484117, 485952, 488230, 490939, 494148, 498130, 503236, 509520, 516530, 523734, 531218, 539797, 550300, 562823, 576789, 591553, 606792, 622455, 638732, 656238, 675943, 698638, 724514, 753497, 785884, 822451, 863967, 910987, 964209, 1024605, 1092866, 1169030, 1253152, 1346186, 1449631, 1564187, 1689281, 1824074, 1968364, 2122055, 2284054, 2452201, 2624087, 2797425, 2969567, 3136991, 3295298, 3439530, 3564782, 3667196, 3744769, 3797164, 3824856, 3828715, 3810362, 3772503, 3718778, 3653454, 3581074]
50822C581074p5202p4550p0895o4146n4582m3772l3937k6588k2340k1701k5127
50811C068234l2164m1385n1529o2278p3652q5133r5805j04955j12239j17435j20350
50800B171309j20921j19178j15221j09307j01880r3460q4545p5507o6423n7123
50790A227744m7614l8345k9734k1625j3643n915J056P108J2430J6769J9409K0210
50778A147850J9984J9371J7857J4638J0112N733K383m78l706p072r525j0758j1906
50765A194483j4248j7548k0256k1368k1438k1478k1516k0897j9473j7662j5450
50754I83149j2328q371m563j748K08J859L407M785O084P427Q810J0272J1902J3522
50740A024415J4934J6703J9985K5084L0819L6060M1339M8070N6441O5097P3026
$$ y = [3581074, 3505872, 3431322, 3360427, 3296281, 3241699, 3197927, 3163990, 3137402, 3115062, 3093361, 3068234, 3036070, 2994685, 2943156, 2880878, 2807226, 2722093, 2626288, 2521333, 2409094, 2291659, 2171309, 2050388, 1931210, 1815989, 1706682, 1604802, 1511342, 1426797, 1351290, 1284867, 1227744, 1180130, 1141785, 1112051, 1090426, 1076783, 1070868, 1071924, 1079032, 1091462, 1108231, 1127640, 1147850, 1167834, 1187205, 1205062, 1219700, 1229812, 1235545, 1237928, 1237450, 1233744, 1226672, 1217147, 1206389, 1194483, 1180235, 1162687, 1142431, 1121063, 1099625, 1078147, 1056631, 1035734, 1016261, 998599, 983149, 970821, 962450, 957887, 956139, 956347, 958206, 961613, 966398, 972482, 979909, 988719, 998991, 1010893, 1024415, 1039349, 1056052, 1076037, 1101121, 1131940, 1168000, 1209339, 1257409, 1313850, 1378947, 1451973]
50729A451973Q0726Q9060R7622J04872J09670J12096J12718J11521J07840J01230
50719B479328R2012Q0813O7877N3058L6427J8522M7j8351l5925n1677o4461p3211
50707B584459p7301p6977p3371o7652o0285n1480m2117l3500k6263k0297j5831
50696B039385j3769j4628j7994k3361l0695l9591m8703n6733o3438o8886p2347
50685A589240p2769p0168o5724o0624n5412n0127m4460l7961l0657k3278j6403
50674A061657r748k823M228J1135J8311K6204L4273M1550M7996N4228O0057O4421
50662A411489O6719O7092O5424O1293N5219M8727M2745L6885L0796K5231K1110
50651A932730J8293J5907J3299J0159O405K466q60l370n661p956r524r794r271
$$ y = [1451973, 1532699, 1621759, 1719381, 1824253, 1933923, 2046019, 2158737, 2270258, 2378098, 2479328, 2571340, 2652153, 2720030, 2773088, 2809515, 2828037, 2828084, 2809733, 2773808, 2722131, 2657670, 2584459, 2507158, 2430181, 2356810, 2289158, 2228873, 2177393, 2135276, 2101776, 2075513, 2055216, 2039385, 2025616, 2010988, 1992994, 1969633, 1938938, 1899347, 1850644, 1793911, 1730473, 1661587, 1589240, 1516471, 1446303, 1380579, 1319955, 1264543, 1214416, 1169956, 1131995, 1101338, 1078060, 1061657, 1051909, 1049086, 1053314, 1064449, 1082760, 1108964, 1143237, 1184787, 1232783, 1287011, 1347068, 1411489, 1478208, 1545300, 1610724, 1672017, 1727236, 1775963, 1818708, 1855593, 1886389, 1911620, 1932730, 1951023, 1966930, 1980229, 1990388, 1996793, 1999259, 1998399, 1995029, 1989368, 1981412, 1971888, 1962094, 1952823]
50638A952823q481o798l307J633O743J1457J6097K0554K3908K5507K5553K4355
50626B090044K1804J7959J3545R395N749K446n43l009m686n225m193j398K914
50613B144802Q310J4509K1181K7554L2513L5254L5740L4452L1760K7640K2038
50602B435753J5198P510r04j0117j9977k9992l9695m8889n7515o5519p2830p9185
50590B033838q3912q6282q6277q4617q1953p8373p3948o9287o5045o1152n6997
50579A205995n2286m7308m2471l7970l3846l0027k6296k2501j8765j5210j1607
50568H67708p669l666l44J907L489N164P434J0356J3699J7050K0051K2678K5271
50555I83128K8147L1326L4616L7952M1516M5617N0346N5426O0354O4761O8473
$$ y = [1952823, 1944342, 1937544, 1934237, 1935870, 1942613, 1954070, 1970167, 1990721, 2014629, 2040136, 2065689, 2090044, 2111848, 2129807, 2143352, 2152747, 2158496, 2160942, 2160399, 2157390, 2152704, 2147479, 2143286, 2141888, 2144802, 2153112, 2167621, 2188802, 2216356, 2248869, 2284123, 2319863, 2354315, 2386075, 2413715, 2435753, 2450951, 2458461, 2457557, 2447440, 2427463, 2397471, 2357776, 2308887, 2251372, 2185853, 2113023, 2033838, 1949926, 1863644, 1777367, 1692750, 1610797, 1532424, 1458476, 1389189, 1324144, 1262992, 1205995, 1153709, 1106401, 1063930, 1025960, 992114, 962087, 935791, 913290, 894525, 879315, 867708, 860039, 856373, 856029, 857936, 861425, 866589, 874023, 884379, 898078, 915128, 935179, 957857, 983128, 1011275, 1042601, 1077217, 1115169, 1156685, 1202302, 1252648, 1308074, 1368428, 1433189, 1501662]
50544A501662P1213P2438P1763O9415O5981O1769N6699N0890M5116M0382L7083
50533B144411L4770L2787L1082L0142L0115L0354L0161K9817L0408L2569L5983
50522B492599M0203M5350N1533N7975O3395O7146O9515P0958P1418P0302O6774
50511C167168O0202N0740L9416K7259J4431O32j3822k8000m1317n3788o5185p4608
50499C083128q1230q4843q5387q2492p6031o6604n5038m1715k6995j1887K280
50488B473186J4686K4963L2615L7165L8759L7696L3328K4320J0426o658k4763
50477B695723m2897o0827p7601r1541j01706j08498j12606j14088j12759j08940
50467A764260j03281r6296q8563q0986p4177o7753o0908n3695m7013m1262l5788
$$ y = [1501662, 1572875, 1645313, 1717076, 1786491, 1852472, 1914241, 1970940, 2021830, 2066946, 2107328, 2144411, 2179181, 2211968, 2243050, 2273192, 2303307, 2333661, 2363822, 2393639, 2424047, 2456616, 2492599, 2532802, 2578152, 2629685, 2687660, 2751055, 2818201, 2887716, 2958674, 3030092, 3100394, 3167168, 3227370, 3278110, 3317526, 3344785, 3359216, 3359848, 3346026, 3318026, 3276709, 3222921, 3157736, 3083128, 3001898, 2917055, 2831668, 2749176, 2673145, 2606541, 2551503, 2509788, 2482793, 2470906, 2473186, 2487872, 2512835, 2545450, 2582615, 2621374, 2659070, 2692398, 2716718, 2727144, 2720486, 2695723, 2652826, 2591999, 2514398, 2422857, 2321151, 2212653, 2100047, 1985959, 1873200, 1764260, 1660979, 1564683, 1476120, 1395134, 1320957, 1253204, 1192296, 1138601, 1091588, 1050326, 1014538]
50456A014538l0051k4679k0604j7608j4506j0740o978l978j489J253M476P748
50444H97382J0774J3676J6489J8800K0266K1245K2563K4530K6468K7492K7649
50433A127334K8000K9428L1639L3558L4526L4814L4977L5053L4630L3527L2188
50422A489674L1270L0903L0480K9321K7446K5559K4248K3445K2815K2380K2530
50411A780071K3558K5395K7708L0056L2113L3880L5471L6527L6252L4386L1819
50400B127236K9584K7483K4484K0289J5624J0836N277j517q936j6312k4015l2703
50388B177330m1955n0673n8487o5740p2117p6402p7848p6955p4506p0541o4783
50377A447323n7463m9217m0464l1438k2543j4152o212J529Q876J5122J9604K1981
$$ y = [1014538, 984487, 959808, 939204, 921596, 907090, 896350, 889372, 885394, 883905, 885158, 889634, 897382, 908156, 921832, 938321, 957121, 977387, 998632, 1021195, 1045725, 1072193, 1099685, 1127334, 1155334, 1184762, 1216401, 1249959, 1284485, 1319299, 1354276, 1389329, 1423959, 1457486, 1489674, 1520944, 1551847, 1582327, 1611648, 1639094, 1664653, 1688901, 1712346, 1735161, 1757541, 1780071, 1803629, 1829024, 1856732, 1886788, 1918901, 1952781, 1988252, 2024779, 2061031, 2095417, 2127236, 2156820, 2184303, 2208787, 2229076, 2244700, 2255536, 2260813, 2259296, 2250360, 2234048, 2210033, 2177330, 2135375, 2084702, 2026215, 1960475, 1888358, 1811956, 1734108, 1657153, 1582647, 1512106, 1447323, 1389860, 1340643, 1300179, 1268741, 1246198, 1232046, 1225834, 1227363, 1236239, 1251361, 1270965, 1292946]
50365A292946K2044J9596J4716P967K11p807j5669k3097k9651l4710l7922l9613
50353A169011m0447m0664l9875l7841l5157l2812l1213k9873k8093k5664k2934
50342H04438k0381j8271j6553j5022j3572j2186j0712q825o388l787j633j26J071
50329F78053K398M000N850P929J0168J2336J4230J5807J7045J7776J7934J7879
50317H21405J8181J8981J9812K0217K0390K0952K2174K3680K4918K5670K5958
50306A062338K5743K4969K3791K2469K1104J9671J8168J6563J4638J2251R638
50295A271343P127M575J542j936n143p500r153j0527j1763j2940j4476j6806j9742
50282A174601k2585k4877k6695k8223k9371k9817k9283k7837k6093k4891k4480
$$ y = [1292946, 1314990, 1334586, 1349302, 1357269, 1357480, 1349673, 1334004, 1310907, 1281256, 1246546, 1208624, 1169011, 1128564, 1087900, 1048025, 1010184, 975027, 942215, 911002, 881129, 853036, 827372, 804438, 784057, 765786, 749233, 734211, 720639, 708453, 697741, 688916, 682528, 678741, 677108, 676982, 678053, 680451, 684451, 690301, 698230, 708398, 720734, 734964, 750771, 767816, 785592, 803526, 821405, 839586, 858567, 878379, 898596, 918986, 939938, 962112, 985792, 1010710, 1036380, 1062338, 1088081, 1113050, 1136841, 1159310, 1180414, 1200085, 1218253, 1234816, 1249454, 1261705, 1271343, 1278470, 1283045, 1284587, 1282651, 1277508, 1270008, 1260855, 1250328, 1238565, 1225625, 1211149, 1194343, 1174601, 1152016, 1127139, 1100444, 1072221, 1042850, 1013033, 983750, 955913, 929820, 904929, 880449]
50271H80449k4145k2992k1029j9142j8089j7802j7606j6754j4857j2214r812q554
50259F77453q306q004o803m868l022j802j017q2J233K402K657K010J386J483J918
50244F56638J959J669J564J481O96q16k173k856l301l975m607m834m843m912m872
50229F26818m541m227m272m496m550m380l955l076j887j065r74j095p61m7O25
50214E88117J269K118L060L936M974O213O911O387N092M104L719L362K585J458
50200F43305J05j297k265k547k728l464m323m394l868l919m914n906o064n594
50186E92127m959m279l808m021m676m788m064l498l914m820n377n641o022o216
50172E26044n630m414l253k444j856j436j009n7J522K822K922K195J693J541Q45
$$ y = [880449, 856304, 833312, 812283, 793141, 775052, 757250, 739644, 722890, 708033, 695819, 686007, 677453, 669147, 661143, 654340, 649472, 646450, 644648, 643631, 643549, 644782, 647184, 649841, 651851, 653237, 654720, 656638, 658597, 660266, 661830, 663311, 664007, 663191, 661018, 658162, 654861, 650886, 646279, 641445, 636602, 631690, 626818, 622277, 618050, 613778, 609282, 604732, 600352, 596397, 593321, 591434, 590369, 589395, 588300, 587539, 587492, 588117, 589386, 591504, 594564, 598500, 603474, 609687, 616598, 622985, 628077, 632181, 635900, 639262, 641847, 643305, 643410, 642113, 639848, 637301, 634573, 631109, 626786, 622392, 618524, 614605, 609691, 603785, 597721, 592127, 587168, 582889, 579081, 575060, 570384, 565596, 561532, 558034, 554120, 549300, 543923, 538282, 532260, 526044, 520414, 516000, 512747, 510303, 508447, 507011, 506002, 505945, 507467, 510289, 513211, 515406, 517099, 518640, 519485]
50157E19485q29k853m534n786o649o886o515o078o008o071n769m904l565j941
50143D51097m53L16J96k42l07L1K14o9m76m25K49J170J853K141K204K238K344
50126D62081K689L527M887O388P538Q150Q356Q281P924P362O910O902P265P460
50112E55720O980N973N117M752M405L496K236J352J129J276J614K133K340J466
50098E99989l57j838k045j513j234j130m01J017K218K549K327K294K892M088N493
50083F14349O572P044P108P061O924O792P127Q208R518J0335J0763J1451J2470
50070G25722J3227J3579J4121J5087J5727J5280J4052J2989J2517J2324J2135
50059H76760J2173J2803J3947J4983J5269J4729J3938J3488J3420J3395J3308
$$ y = [519485, 518656, 515803, 511269, 505483, 498834, 491948, 485433, 479355, 473347, 467276, 461507, 456603, 453038, 451097, 450644, 450960, 451156, 450914, 450607, 450638, 450852, 450783, 450307, 449882, 450131, 451301, 453154, 455295, 457499, 459737, 462081, 464770, 468297, 473184, 479572, 487110, 495260, 503616, 511897, 519821, 527183, 534093, 540995, 548260, 555720, 562700, 568673, 573790, 578542, 582947, 586443, 588679, 590031, 591160, 592436, 594050, 596183, 598523, 599989, 599632, 597794, 595749, 594236, 593002, 591872, 591471, 592488, 594706, 597255, 599582, 601876, 604768, 608856, 614349, 620921, 627965, 635073, 642134, 649058, 655850, 662977, 671185, 680703, 691038, 701801, 713252, 725722, 738949, 752528, 766649, 781736, 797463, 812743, 826795, 839784, 852301, 864625, 876760, 888933, 901736, 915683, 930666, 945935, 960664, 974602, 988090, 1001510, 1014905, 1028213]
50048A028213J3378J3746J4362J5251J6591J8399K0447K2582K5014K8191L2400
50037A248574L7421M2525M7021N0926N4702N8086N9544N7454N1604M3091L3148
50026A784096K2742J3022N168l21l576m514k852Q65M970P717Q064N353q51j0092
50012A829791k0873l1775m2287n2130o0335o5695o7839o7323o4964o1511n7674
50001A237385n3851m9951m5871m1957l8594l5652l2780k9970k7405k4992k2641
49990H33721k0743j9742j9251j8322j6660j4971j3968j3522j3048j2332j1596
49979F59566j1004j0406r580q523p517o876o578o188n283l931k651j876j545j260
49965E76348p24p0L07K47J40M90J163J422Q71L8l23j68j3k2J67P02J184J268J228
$$ y = [1028213, 1041591, 1055337, 1069699, 1084950, 1101541, 1119940, 1140387, 1162969, 1187983, 1216174, 1248574, 1285995, 1328520, 1375541, 1426467, 1481169, 1539255, 1598799, 1656253, 1707857, 1750948, 1784096, 1806838, 1819860, 1825028, 1824707, 1821131, 1816617, 1813765, 1814630, 1819600, 1827317, 1835381, 1840734, 1839883, 1829791, 1808918, 1777143, 1734856, 1682726, 1622391, 1556696, 1488857, 1421534, 1356570, 1295059, 1237385, 1183534, 1133583, 1087712, 1045755, 1007161, 971509, 938729, 908759, 881354, 856362, 833721, 812978, 793236, 773985, 755663, 739003, 724032, 710064, 696542, 683494, 671162, 659566, 648562, 638156, 628576, 620053, 612536, 605660, 599082, 592894, 587611, 583680, 581029, 579153, 577608, 576348, 575624, 575554, 575861, 576108, 576248, 576738, 577901, 579323, 580194, 580232, 579909, 579741, 579728, 579706, 579873, 580575, 581759, 583027, 584255]
49946E84255J539K166K606K637K739L599N314P220Q583R312R928J0879J2223J3884
49932F76884J5887J8089K0102K1830K3885K7053L1420L6412M1715M7739N5053
49921A016069O3646P2931Q2241R1078R8951J05106J08497J08203J04009R6628
49911A947359Q7203P6694O5895N5863M7811M2419L9438L8144L7871L7880L6960
49900B513537L3581K6630J5919K079j3906l1013m8174o4081p7226q6496r1917
49889B178933r4690r6196r6935r6551r4722r1799q8428q4898q1086p6877p2333
49878A204418o7450o2075n6234n0416m5279m1046l7372l3814l0377k7394k4972
49867G27989k2743k0348j7964j6076j4694j3282j1602j0264r968j0389j0435r657
$$ y = [584255, 585794, 587960, 590566, 593203, 595942, 599541, 604855, 612075, 620658, 629970, 639898, 650777, 663000, 676884, 692771, 710860, 730962, 752792, 776677, 803730, 835150, 871562, 913277, 961016, 1016069, 1079715, 1152646, 1234887, 1325965, 1424916, 1530022, 1638519, 1746722, 1850731, 1947359, 2034562, 2111256, 2177151, 2233014, 2280825, 2323244, 2362682, 2400826, 2438697, 2476577, 2513537, 2547118, 2573748, 2589667, 2591746, 2577840, 2546827, 2498653, 2434572, 2357346, 2270850, 2178933, 2084243, 1988047, 1891112, 1794561, 1699839, 1608040, 1519612, 1434714, 1353628, 1276751, 1204418, 1136968, 1074893, 1018659, 968243, 922964, 881918, 844546, 810732, 780355, 752961, 727989, 705246, 684898, 666934, 650858, 636164, 622882, 611280, 601016, 591048, 580659, 570224, 560567]
49855E60567q811q732r160r178q487p665p209o844o056m986m380m641n126m726
49841D64566l231j772j564k367k789k152j316j317j937k214j867j388j041o04
49827D39007l4M22Q06J403K094K428K407K475K678K632K483L055M641O449P735
49812D80681Q795J0182J1692J2841J3866J5362J7295J9227K1353K4503K9022L4374
49800F99193L9845M5188N0492N5973O1921O8268P4103P8023P9098P7100P1892
49789A401096O3230N1569L8517K6049J5470P385K283N80J966N147Q451J0556J0574
49776A642873P646R26r773k3526l8650n3465o6555p6564q2450q4143q2570p8802
49764A054947p3459o7139o0777n5088m9846m4314l8290l2320k6946k2292j8422
$$ y = [560567, 551756, 543024, 533864, 524686, 516199, 508534, 501325, 494481, 488425, 483439, 479059, 474418, 469292, 464566, 461335, 459563, 457999, 455632, 452843, 450691, 449375, 448058, 446121, 443907, 442040, 440652, 439611, 439007, 438973, 439395, 440201, 441604, 443698, 446126, 448533, 451008, 453686, 456318, 458801, 461856, 466497, 472946, 480681, 489476, 499658, 511350, 524191, 538057, 553419, 570714, 589941, 611294, 635797, 664819, 699193, 739038, 784226, 834718, 890691, 952612, 1020880, 1094983, 1173006, 1252104, 1329204, 1401096, 1464326, 1515895, 1554412, 1580461, 1595931, 1603316, 1605599, 1606179, 1608145, 1613292, 1621743, 1632299, 1642873, 1650519, 1651445, 1641672, 1618146, 1579496, 1526031, 1459476, 1382912, 1300462, 1216319, 1133749, 1054947, 981488, 914349, 853572, 798484, 748638, 704324, 666034, 633714, 606768, 584476, 566054]
49753E66054j5562j3704j2381j1121r860q728p582o137m550l508l471l949l896
49740D61605k888j573p92n80m89m50o62p86k03P95J045K20m02L52J753K103J028
49723D60076k03m92o3L15L31L9n07j126j435j249p76l46k36p90k059l290l356
49706D44833k035l66M90M28J25J54N88J201J604J472J026R95J795K932L572L498
49690D62312L147K860K564K226K174K697L563M159M091L503K798K245J872J629
49676E01840J410R89K49n63j043j192j396j685j454l17J097J753J433Q57O76Q94
$$ y = [566054, 550492, 536788, 524407, 513286, 503426, 494698, 487116, 480979, 476429, 472921, 469450, 465501, 461605, 458717, 457144, 456352, 455772, 455283, 454833, 454171, 453385, 453182, 453977, 455022, 455242, 454840, 455192, 456945, 459048, 460076, 459873, 459381, 459318, 459633, 459964, 460003, 459496, 458370, 456935, 455686, 454910, 454564, 454328, 453538, 451479, 448189, 444833, 442798, 442432, 442922, 443350, 443475, 443629, 444217, 445418, 447022, 448494, 449520, 450515, 452310, 455242, 458814, 462312, 465459, 468319, 470883, 473109, 475283, 477980, 481543, 485702, 489793, 493296, 496094, 498339, 500211, 501840, 503250, 504239, 504488, 503925, 502882, 501690, 500294, 498609, 497155, 496838, 497935, 499688, 501121, 501978, 502654, 503548]
$$ [...]
##END NTUPLES=NMR SPECTRUM
##END=
