
##TITLE=AC1170_Tolima-ibage-TCHAH12003_5890850_ekzEvXWs7J
##JCAMPDX= 6.0         $$ Bruker NMR JCAMP-DX V2.0
##DATA TYPE= NMR SPECTRUM
##DATA CLASS= NTUPLES
##ORIGIN= BRUKER
##OWNER= Administrator
$$ 1.72 TOPSPIN		Version 2.1
$$ 2012-04-02 17:33:54.828 -0500  Administrator@TOPSPIN
$$ Compression mode = diff/dup
##.OBSERVE FREQUENCY= 400.13188235
##.OBSERVE NUCLEUS= ^1H
##.ACQUISITION MODE= SIMULTANEOUS (DQD)
##.ACQUISITION SCHEME= undefined
##.AVERAGES= 8
##.DIGITISER RES= 22
##SPECTROMETER/DATA SYSTEM= spect
##.PULSE SEQUENCE= zg30
##.SOLVENT NAME= COFFEE_meoh
##.SHIFT REFERENCE= INTERNAL, COFFEE_meoh, 1, 14.98061
##AUDIT TRAIL= $$ (NUMBER, WHEN, WHO, WHERE, PROCESS, VERSION, WHAT)
$$ ##TITLE= Audit trail, TOPSPIN		Version 2.1
$$ ##JCAMPDX= 5.01
$$ ##ORIGIN= Bruker BioSpin GmbH
$$ ##OWNER= Administrator
$$ $$ C:\Bruker\TOPSPIN/data/COFFEE/nmr/AC1170_Tolima-ibage-TCHAH12003_5890850_ekzEvXWs7J/10/pdata/1/auditp.txt
$$ ##AUDIT TRAIL=  $$ (NUMBER, WHEN, WHO, WHERE, PROCESS, VERSION, WHAT)
(   1,<2012-04-02 17:33:46.921 -0500>,<Administrator>,<TOPSPIN>,<go>,<TOPSPIN 2.1>,
      <created by zg
	started at 2012-04-02 17:32:39.843 -0500,
	POWCHK enabled, PULCHK disabled,
       configuration hash MD5:
       1A 1E CE 29 27 FD 77 03 67 4E F0 E3 C4 B2 CB 90
       data hash MD5: 64K
       50 66 F6 D6 B9 FD 0D D6 7B 17 EC 14 EC 13 07 0B>)
(   2,<2012-04-02 17:33:49.843 -0500>,<Administrator>,<TOPSPIN>,<proc1d>,<TOPSPIN 2.1>,
      <Start of raw data processing
       efp LB = 0 FT_mod = 6 PKNL = 1 PHC0 = 0 PHC1 = 0 SI = 32K 
       data hash MD5: 32K
       D7 3A C5 3F 27 D4 64 AB 49 95 00 02 D8 2C F5 58>)
(   3,<2012-04-02 17:33:50.281 -0500>,<Administrator>,<TOPSPIN>,<proc1d>,<TOPSPIN 2.1>,
      <pk PHC0 = 210.7617 PHC1 = 0 
       data hash MD5: 32K
       F0 81 A0 9D 9A C9 20 B1 20 9E C9 C0 E0 A5 96 3A>)
(   4,<2012-04-02 17:33:50.359 -0500>,<Administrator>,<TOPSPIN>,<proc1d>,<TOPSPIN 2.1>,
      <abs ABSG = 1 
       data hash MD5: 32K
       B2 45 12 95 83 64 91 80 ED 3E E4 08 10 A9 18 65>)
(   5,<2012-04-02 17:33:50.390 -0500>,<Administrator>,<TOPSPIN>,<proc1d>,<TOPSPIN 2.1>,
      <abs ABSG = 2 
       data hash MD5: 32K
       2A A5 52 58 05 CA 95 F1 8C 08 30 AE 3F 59 B5 FC>)
(   6,<2012-04-02 17:33:50.421 -0500>,<Administrator>,<TOPSPIN>,<proc1d>,<TOPSPIN 2.1>,
      <abs ABSG = 3 
       data hash MD5: 32K
       C5 1A 71 01 61 4B 28 1C EE 7B BB 2B 91 FA E5 B1>)
(   7,<2012-04-02 17:33:50.468 -0500>,<Administrator>,<TOPSPIN>,<proc1d>,<TOPSPIN 2.1>,
      <abs ABSG = 4 
       data hash MD5: 32K
       51 66 88 F7 2A EB 70 1F 61 9B CF 45 7C 31 CC 17>)
(   8,<2012-04-02 17:33:50.531 -0500>,<Administrator>,<TOPSPIN>,<proc1d>,<TOPSPIN 2.1>,
      <abs ABSG = 5 
       data hash MD5: 32K
       11 DD 7A FF 3C 50 F5 18 9F D4 56 79 D7 9B 3B CB>)
$$ ##END=
$$ 
$$ $$ hash MD5
$$ $$ B2 7C D6 67 66 69 AF F2 C5 D0 DE 7F 58 E6 80 C0
##$RELAX= 
##$RELAX= 
##$RELAX= 
##$RELAX= 
##$RELAX= 
##$RELAX= 
##$RELAX= 
$$ Bruker specific parameters
$$ [...]
150 150 150 150 150 150 150 150
##$TP07= 0
##$TPNAME0= <>
##$TPNAME1= <>
##$TPNAME2= <>
##$TPNAME3= <>
##$TPNAME4= <>
##$TPNAME5= <>
##$TPNAME6= <>
##$TPNAME7= <>
##$TPOAL= (0..7)
0.5 0.5 0.5 0.5 0.5 0.5 0.5 0.5
##$TPOFFS= (0..7)
0 0 0 0 0 0 0 0
##$TUNHIN= 0
##$TUNHOUT= 0
##$TUNXOUT= 0
##$USERA1= <user>
##$USERA2= <user>
##$USERA3= <user>
##$USERA4= <user>
##$USERA5= <user>
##$V9= 5
##$VALIST= <valist>
##$VCLIST= <CCCCCCCCCCCCCCC>
##$VD= 0
##$VDLIST= <DDDDDDDDDDDDDDD>
##$VPLIST= <PPPPPPPPPPPPPPP>
##$VTLIST= <TTTTTTTTTTTTTTT>
##$WBST= 2048
##$WBSW= 25
##$XGAIN= (0..3)
0 0 0 0
##$XL= 0
##$YL= 0
##$YMAX_a= 530250
##$YMIN_a= -657650
##$ZGOPTNS= <>
##$ZL1= 120
##$ZL2= 120
##$ZL3= 120
##$ZL4= 120
##$ABSF1= 14.98061
##$ABSF2= -5.57192
##$ABSG= 5
##$ABSL= 3
##$ALPHA= 0
##$AQORDER= 0
##$ASSFAC= 0
##$ASSFACI= 0
##$ASSFACX= 0
##$ASSWID= 0
##$AUNMP= <proc_prof1d_extract_pilot.lims>
##$AXLEFT= 0
##$AXNAME= <>
##$AXNUC= <1H>
##$AXRIGHT= 0
##$AXTYPE= 0
##$AXUNIT= <>
##$AZFE= 0.1
##$AZFW= 0.1
##$BCFW= 0
##$BC_mod= 0
##$BYTORDP= 0
##$COROFFS= 0
##$CY= 15
##$DATMOD= 1
##$DC= 0
##$DFILT= <>
##$DTYPP= 0
##$F1P= 0
##$F2P= 0
##$FCOR= 0.5
##$FTSIZE= 32768
##$FT_mod= 6
##$GAMMA= 0
##$GB= 0
##$INTBC= 1
##$INTSCL= 1
##$ISEN= 128
##$LB= 0
##$LEV0= 0
##$LPBIN= 0
##$MAXI= 10000
##$MC2= 0
##$MEAN= 0
##$ME_mod= 0
##$MI= 0
##$NCOEF= 0
##$NC_proc= -8
##$NLEV= 6
##$NOISF1= 0
##$NOISF2= 0
##$NSP= 0
##$NTH_PI= 0
##$NZP= 0
##$OFFSET= 14.98061
##$PC= 1
##$PHC0= 210.7617
##$PHC1= 0
##$PH_mod= 1
##$PKNL= yes
##$PPARMOD= 0
##$PPDIAG= 0
##$PPIPTYP= 0
##$PPMPNUM= 2147483647
##$PPRESOL= 1
##$PSCAL= 4
##$PSIGN= 0
##$PYNMP= <proc.py>
##$REVERSE= no
##$SF= 400.13
##$SI= 32768
##$SIGF1= 0
##$SIGF2= 0
##$SINO= 400
##$SIOLD= 32768
##$SPECTYP= <>
##$SREGLST= <1H.CDCl3>
##$SSB= 0
##$STSI= 32768
##$STSR= 0
##$SW_p= 8223.68421052632
##$SYMM= 0
##$S_DEV= 0
##$TDeff= 65536
##$TDoff= 0
##$TI= <>
##$TILT= no
##$TM1= 0
##$TM2= 0
##$TOPLEV= 0
##$USERP1= <user>
##$USERP2= <user>
##$USERP3= <user>
##$USERP4= <user>
##$USERP5= <user>
##$WDW= 1
##$XDIM= 32768
##$YMAX_p= 469726211
##$YMIN_p= -683634
##$CURPLOT= <Network HP LaserJet P1505>
##$CURPRIN= <$Network HP LaserJet P1505>
##$DFORMAT= <normdp>
##$LAYOUT= <+/1D_H.xwp>
##$LFORMAT= <normlp>
##$PFORMAT= <normpl>
##$SURQMSG= 1
$$ End of Bruker specific parameters
$$ ---------------------------------
##NTUPLES= NMR SPECTRUM
##VAR_NAME=  FREQUENCY,     SPECTRUM/REAL,   SPECTRUM/IMAG
##SYMBOL=    X,             R,               I
##VAR_TYPE=  INDEPENDENT,   DEPENDENT,       DEPENDENT
##VAR_FORM=  AFFN,          ASDF,            ASDF
##VAR_DIM=   32768,         32768,           32768
##UNITS=     HZ,            ARBITRARY UNITS, ARBITRARY UNITS
##FACTOR=    0.250966925370066, 1,           1
##FIRST=     8223.43324360095, 68835,        -142738
##LAST=      0,             -64399,          -252224
##MIN=       0,             -683634,         0
##MAX=       8223.43324360095, 469726211,    0
$$ Real data points
##PAGE= N=1
##DATA TABLE= (X++(R..R)), XYDATA
$$ [...]
$$ plain form
19463 47857 317805 -344028 -395278 51857 -154995 61187 132004 -146250 65894 -124811 1024
19451 -52045 87510 -257964 -18781 -119432 -238321 -192466 98737 -87396 45325 229088 -48334
19439 -156101 -203764 -40549 49690 -35910 -129675 -164451 2660 -352544 -213619 82552 -129068
19427 -157606 77065 29001 -156307 -24301 -290407 85112 -163730 -478588 39204 63756 -225215
19415 -91380 -416923 47667 -354139 -200610 -108554 -125801 -121088 187231 -169260 -186574 -91079
19403 -127693 -147329 122890 -63541 -460930 -229559 168187 -232467 -141627 -48085 -85877
19393 -85877 10771 219835 239646 36336 -39203 -49488 36810 -277231 -402267 122135 -174438
19381 69971 -199875 -3243 -234070 75445 -213679 -256901 -42665 -14743 -159832 98377 -276397
$$ packed form
19463D7857K69948c44028n1250E1857a54995F1187P0817a46250F5894a24811A024
19451e2045H7510b57964a8781j00651j18889M5855I8737h7396D5325J83763d8334
19439a56101m7663d0549D9690c5910r3765l4776B660c52544J38925H2552a29068
19427a57606G7065B9001a56307b4301k66106H5112a63730l14858C9204K4552b25215
19415i1380l25543D7667c54139J53529R2056j7247M713A87231a69260j7314i1079
19403a27693j9636A22890f3541l97389b29559A68187b32467R0840d8085l7792
19393h5877A0771K09064J9811C6336c9203j0285C6810b77231j25036A22135a74438
19381F9971a99875c243k30827G5445b13679m3222d2665a4743j45089I8377b76397
$$ plain form
19369 -273211 125972 200706 72174 -53129 -2054 -52614 -178766 -97926 31728 -28766 165677
19357 -173468 111470 13292 88533 -27151 -94383 -334767 17898 -180959 -129782 -73391 -113341
19346 -113341 33327 -173779 -238198 -152287 -233839 -12620 1767 -73136 -107999 -232538 80789
19334 -229638 -29251 -137762 -94608 -212936 349977 136660 -36722 21589 114028 -415268
19323 11321 -179760 -44705 152993 -128830 -195423 -223544 -327317 -45616 -197808 -54574 -23239
19311 -5378 5731 -112688 -172068 -144105 -337733 -205548 -115780 238071 186451 60124 -180598
19299 -53687 -233241 137611 -18031 18101 16221 16974 -221447 -197513 -48894 -86070 -54662 -481524
19287 -481524 -30814 -317284 120015 109891 -283240 -211447 -85103 -39481 97419 -48418 -94820
$$ packed form
19369b73211A25972P4734G2174e3129b054n0560j26152Q0840C1728b8766A65677
19357a73468A11470A3292P5241b7151o7232k40384A7898a80959N1177N6391l9950
19346a13341C3327a73779o4419Q5911q1552a2620A767g3136l4863j24539H0789
19334b29638b9251j08511M3154j18328C49977A36660c6722B1589R2439d15268
19323A1321a79760d4705A52993a28830o6593k8121j03773d5616j52192e4574b3239
19311e378E731a12688n9380K7963j93628J32185Q9768B38071n1620F0124a80598
19299e3687j79554A37611a8031A8101j880P53b21447K3934d8894l7176L1408m26862
19287d81524c0814k86470A20015j0124b83240P1793h5103c9481I7419d8418m6402
$$ plain form
19276 -94820 -69382 -123000 162394 -255343 -266950 56313 -103868 -22180 -177429 -213430 -24296
19264 -163916 13053 -100147 -39994 130743 64337 -207843 -164945 -222007 81302 212127 -26789
19252 -242684 3358 -33704 198351 264320 9924 -10439 -394073 -154837 -348224 -196507 21828
19240 48707 -145141 -5694 -173620 -137350 -10272 -244292 -98022 132699 -342153 -182324 162848
19228 -181836 -159044 -384901 -151379 72721 -2535 134374 -254018 62392 -245549 -17571 47587
19216 -163494 -170776 -259150 -288020 -37073 -276697 217090 -56090 -65701 -92441 -243057 16134
19204 146701 -194382 15594 -314266 -81639 -141951 -102755 359700 -260212 96078 119031 -67578
19192 -63027 -161667 -97360 245648 38173 281007 20 110095 8529 -11414 -36993 45663 203605
$$ packed form
19276i4820K5438n3618A62394b55343j1607E6313a03868b2180j55249l6001b4296
19264a63916A3053a00147c9994A30743F4337b07843M2898n7062H1302J30825b6789
19252b42684C358c3704A98351O5969I924a0439l83634a54837j93387J51717B1828
19240D8707a45141e694j67926L6270a0272k34020i8022A32699c42153J59829A62848
19228a81836K2792k25857a51379G2721b535A34374b54018F2392b45549a7571D7587
19216a63494p282q8374k8870c7073k39624B17090e6090r611k6740j50616A6134
19204A46701a94382A5594c14266h1639o0312L9196C59700b60212I6078K2953f7578
19192f3027r8640O4307B45648C8173K42834B0J10075H529a1414k5579D5663J57942
$$ plain form
19180 203605 356954 -96944 -170195 -152251 138488 -221996 124286 -121679 -154590 -91430
19170 -91430 -147748 -164472 -144094 -248967 -1765 226653 20613 -257801 -181243 -156675 271695
19158 -301989 -130714 -52978 -272789 -62743 -42884 27061 179236 195565 128223 251488 99112
19146 -234456 -147276 -276399 30613 -265879 130228 -200276 -114825 102972 79550 -53651
19135 122928 -62519 -114308 7599 -93624 -89536 3961 -128945 92042 -134743 -37846 -160806
19124 -160806 -77376 17943 221566 -34362 121817 -161437 -169873 -53003 -339352 -162341 -90067
19113 -90067 55913 487230 -23566 -126684 124258 -80300 -199262 20874 -325346 -31368 -311623
19102 -311623 187361 254962 14620 -165243 -455277 -61704 126069 -40441 191256 34503
$$ packed form
19180B03605J53349i6944p3251J7944A38488b21996A24286a21679l2911O3160
19170i1430n6318j6724K0378j04873a765B26653B0613b57801P6558K4568B71695
19158c01989a30714e2978k19811f2743J9859B7061J52175J6329o7342J23265I9112
19146b34456Q7180j29123C0613b65879A30228b00276Q5451A02972k3422e3651
19135A22928f2519n1789G599i3624M088C961a28945I2042a34743c7846j22960
19124a60806g7376A7943K03623c4362A21817a61437q436e3003k86349a62341P2274
19113i0067E5913M31317b3566j03118A24258h0300j18962B0874c25346c1368k80255
19102c11623A87361O7601A4620a65243k90034f1704A26069d0441A91256C4503
$$ plain form
19091 -262337 -134578 -168665 -313823 165464 -21371 63996 -144728 145171 -206685 71671
19080 309870 127821 -283076 60178 -53058 -146122 -237501 -109224 -180394 14803 103910 -145857
19068 99858 -528451 -268824 249043 -303177 -172511 -125294 -352100 -405687 -220913 -339053
19058 -339053 -78433 -179865 -238542 -29779 326536 -172474 -149593 -91442 -206204 159633
19047 -9516 -289829 69631 -26219 -320189 -59223 -6284 -341503 -177191 251245 -205116 -155069
19036 -155069 167051 6125 14214 35762 -18218 29799 -132543 -347158 -31923 -338842 91690
19024 -91805 -161859 -183518 -215425 -40689 -315388 158284 170765 -70868 -103671 36239 165772
19013 165772 -58151 175971 -114755 -35485 35790 -45765 12453 -13463 -125350 -237912 -33921
$$ packed form
19091b62337J27759l4087j45158A65464b1371F3996a44728A45171b06685G1671
19080C09870A27821b83076F0178e3058r3064r1379a09224p1170A4803Q9107a45857
19068I9858e28451K59627B49043c03177J30666M7217k26806n3587J84774j18140
19058c39053g8433j01432n8677b9779C26536a72474K2881N8151j14762A59633
19047i516k80313F9631b6219k93970e9223f284l35219J64312B51245b05116N0047
19036a55069A67051F125Q089K1548a8218B9799a32543k14615c1923l06919I1690
19024i1805p0054k1659l1907d0689k74699A58284J2481g0868l2803C6239J29533
19013A65772e8151A75971a14755c5485C5790d5765A2453a3463j11887j12562c3921
$$ plain form
19001 201166 -47324 -214936 14704 -200271 -86630 -52278 -153443 178811 -269319 33621
18990 -64790 151422 -131864 78672 -254964 256881 -12050 -142772 129274 -89138 -90271 -89181
18979 -89181 101915 266022 136492 -137601 -51562 -683634 -27739 -81973 114317 -105762
18968 42184 -270047 111338 -15822 -113667 49340 20330 -55879 389052 126199 389507 109091
18956 586331 354656 -128296 266013 -7156 132994 -33153 -294873 -21862 189647 -114364
18945 -157317 81421 221876 -233664 138394 -232881 -38703 61712 -140637 40939 -32498
18934 -361709 -214057 -374510 -536222 49255 -72113 -77532 -84173 5802 55681 -155904 141806
18922 -140224 6746 -279685 78871 84682 -183876 293080 205373 11900 -195882 -12972 -142189
$$ packed form
19001B01166d7324j67612A4704b00271h6630L4352j01165A78811b69319C3621
18990f4790A51422a31864G8672b54964B56881a2050j30722A29274h9138j133J090
18979h9181A01915J64107j29530a37601e1562o32072b7739n4234A14317a05762
18968D2184b70047A11338a5822r7845D9340B0330e5879C89052A26199K63308A09091
18956E86331k31675a28296B66013g156A32994c3153k61720b1862A89647a14364
18945a57317H1421J40455b33664A38394b32881c8703F1712a40637D0939c2498
18934c61709J47652j60453j61712D9255g2113n419o641E802M9879a55904A41806
18922a40224F746b79685G8871N811a83876B93080q7707A1900a95882a2972j29217
$$ plain form
18911 -142189 -44657 55693 -2241 -115607 -62964 147012 -326366 -179555 139702 30573 -85060
18899 268595 130030 178185 238257 90124 340529 475154 212370 359032 138259 -24981
18888 -239188 -50847 -269838 52722 42851 241394 -60527 -10060 42174 -195603 83530 -126346
18876 133890 -92106 -315968 -105651 -75606 3275 86608 -404764 61252 26751 -110460 -46756
18864 -30541 151519 -221032 -324221 -20040 -149241 225654 -191996 22398 254354 -293175
18853 -80053 -122271 -130273 -60030 -43377 -72360 72108 -94644 268535 377247 -123343 -203649
18842 -203649 39942 74371 215916 -204744 -226039 -117143 -127367 92897 -277595 302136
18831 -123154 -65777 110439 116526 -31158 -14560 -215305 -113880 45609 -100016 167202 300631
$$ packed form
18911a42189d4657E5693b241j13366N2643A47012c26366J46811A39702C0573h5060
18899B68595A30030M8155O0072I0124K50405J34625B12370J46662A38259b4981
18888b39188e0847k18991E2722r871J98543f0527a0060D2174a95603H3530a26346
18876A33890i2106k23862a05651L0045C275Q3333d04764F1252B6751a10460d6756
18864c0541A51519b21032j03189b0040j29201B25654a91996B2398K31956b93175
18853h0053m2218q002f0030J6653k8983G2108i4644B68535J08712a23343q0306
18842b03649C9942L4429J41545b04744k1295J08896j0224I2897b77595C02136
18831a23154N7377A10439O087c1158a4560k00745J01425D5609a00016A67202J33429
$$ plain form
18820 300631 4770 -167106 -451740 -420739 -138693 -215206 70916 -171153 330559 239454 -214155
18808 -218134 -194420 224017 346218 55751 221644 -1513 -134571 254612 -370229 -237132
18798 -237132 -11901 91443 254250 67530 258216 288037 76640 -243481 163556 -135449
18787 -297009 -163725 -29183 -109118 -89415 219410 137348 188062 302618 -157960 5339 155929
18776 155929 -105286 -423919 -339565 -4532 -218929 25592 -59595 -146792 -37325 -218546 -162172
18765 -162172 -257894 66115 -200471 -62794 277971 -163678 -126935 -365655 169574 -160704
18754 -157313 148976 -167566 -231887 354398 -123490 128800 59804 -118905 -2625 -106577
18744 -106577 -127729 -170639 21515 123887 79813 -131433 -178122 -273680 -144641 74432 36069
$$ packed form
18820C00631D770a67106k84634L1001a38693p6513G0916a71153C30559r1105b14155
18808b18134K3714B24017J22201E5751J65893a513j33058B54612c70229J33097
18798b37132a1901I1443J62807F7530J90686K9821G6640b43481A63556a35449
18787b97009J33284b9183p9935J9703B19410q2062N0714J14556a57960E339J50590
18776A55929a05286l18633Q4354d532k14397B5592e9595q7197c7325j81221N6374
18765a62172r5722F6115b00471f2794B77971a63678L6743k38720A69574a60704
18754a57313A48976a67566o4321C54398a23490A28800E9804a18905b625j03952
18744a06577k1152m2910B1515J02372m4074a31433m6689r5558J29039G4432C6069
$$ plain form
18732 -199828 183025 59632 139982 -105068 2239 -30291 -144857 -93278 -266171 125850 -42568
18720 -36999 -208226 3249 -145780 -279927 -64237 356139 150846 157642 117448 105402 -69090
18708 -229602 -192647 3587 -417400 -147244 105139 151447 -103014 -293393 319 -286997 56052
18696 -69761 59146 -116600 96492 34591 42431 -107044 -252156 -354002 -12910 -276425 -295136
18685 -295136 87068 95562 22 71167 94015 -108579 -183220 -90300 195971 6631 7153 11248 -67538
18671 -33361 -161340 170570 140761 186389 1758 -75248 -168880 -103558 155221 -95099 -201995
18660 -201995 -46322 -191457 -70469 -95606 -2567 74173 -121744 429564 205527 5287 -21592
18648 149785 -239068 171303 -221993 -59174 1522 -75905 -330434 -162922 -219389 -237909 -263455
$$ packed form
18732a99828A83025E9632Q0350a05068B239c0291j14566N1579j72893A25850d2568
18720c6999j71227C249a45780j34147f4237C56139A50846O796m0194j2046f9090
18708b29602L6955C587d17400a47244A05139M6308a03014j90379C19b86997E6052
18696f9761E9146a16600I6492C4591P840a07044j45112j01846a2910k63515j8711
18685b95136H7068Q494B2P1145K2848a08579p4641i0300A95971F631N22M095f7538
18671c3361j27979A70570k9809M5628A758g5248r3632O5322A55221i5099j06896
18660b01995d6322j45135g0469k5137b567G4173a21744D29564B05527E287b1592
18648A49785b39068A71303b21993e9174A522g5905k54529a62922n6467j8520k5546
$$ plain form
18637 -263455 -328214 90879 77704 60393 200757 -89938 -224532 212908 117588 -151018 -122312
18626 -122312 39373 -64612 97830 -29267 -19112 74712 -303590 39214 49833 -156709 71278
18614 -23814 42588 106205 121948 -234508 -263934 -20553 -322310 -74926 -6723 -179843 -20541
18602 -403261 -244722 -223406 -56711 -181912 225123 42469 340610 -90434 -125393 16865 -21815
18590 -48380 220482 -59103 -75068 -260629 -132719 169303 -147577 -250147 -136205 -227734
18580 -227734 -19654 -273594 -200311 100257 -264779 4176 -134131 -187929 -108577 -124803 122173
18568 12316 2913 -159312 -50194 20929 87571 -1707 -49763 113935 37610 -365812 213306
18556 104326 -1740 56574 -284270 -73813 161751 -53198 -25545 115381 -169007 115354 -61760
$$ packed form
18637b63455o4759I0879j3175j7311J40364h9938j34594B12908r5320a51018K8706
18626a22312C9373f4612I7830b9267J0155G4712c03590C9214J0619a56709G1278
18614b3814D2588O3617J5743b34508k9426b0553l01757g4926f723j73120b0541
18602d03261J58539K1316e6711j25201B25123D2469K98141i0434l4959A6865b1815
18590d8380B20482e9103j5965j85561J27910A69303a47577j02570J13942r1529
18580b27734a9654k53940P3283A00257b64779D176a34131n3798P9352j6226A22173
18568A2316B913a59312e0194B0929O6642a707m8056A13935C7610c65812B13306
18556A04326a740E6574b84270g3813A61751e3198b5545A15381a69007A15354f1760
$$ plain form
18544 -47552 21003 -140704 -30239 -337871 63071 140577 -33704 138606 -345834 95305 -36301
18532 156847 85833 34395 57191 210203 57928 -186981 -144988 -96683 74180 -200799 128578
18520 -81426 -175691 324625 133281 251031 -162232 -40638 216865 -132720 -251610 59445
18509 -285000 -481025 127882 -41143 -7915 -96047 -21928 -244413 -53026 14045 -25634 2740
18497 -127541 -135199 119426 -95652 -131458 -258884 304676 -289492 17809 -177392 -192114 -211756
18486 -211756 11734 -131094 92850 -222801 108120 221546 -377503 -282645 -141463 -73203
18476 -73203 113501 -119068 -153708 88444 288738 58939 61671 72992 -183874 -443267 -133930
18464 139260 -363650 185038 123422 -303356 34700 262312 43626 -39990 142080 274665
$$ packed form
18544d7552B1003a40704c0239l07632F3071P7506c3704A38606c45834I5305c6301
18532A56847p1014C4395K2796J53012E7928a86981M1993M8305G4180b00799A28578
18520h1426r4265C24625A33281J17750a62232d0638B16865a32720j18890E9445
18509b85000j96025A27882d1143g915q8132b1928k22485e3026A4045b5634B740
18497a27541p658A19426i5652l5806j27426C04676b89492A7809a77392j4722j9642
18486b11756A1734a31094I2850b22801A08120J13426c77503R4858J41182O8260
18476g3203A13501a19068l4640H8444K00294E8939K732J1321a83874k59393a33930
18464A39260c63650A85038o1616c03356C4700K27612D3626c9990A42080J32585
$$ plain form
18454 274665 -236201 -38706 -136539 12119 201286 -91586 -97212 -313540 5988 83747 69620
18443 69620 -61788 -115447 -20447 52360 140207 86363 174119 198045 48576 179772 167609
18432 167609 -338659 137082 179187 55659 -20797 150814 -181654 -126188 80590 31218 -51312
18420 333879 -100414 120679 -81560 -108884 -297196 -46512 -203810 458 44009 -106976 94322
18408 196385 -117222 69052 -259413 -265995 -37086 175308 -294391 -178389 234977 -232091
18397 27579 277221 276723 -25704 189900 -160297 192970 98991 -297461 114382 -243201 -96492
18385 -10542 27027 -270057 413289 188624 -164970 -55249 177089 -248135 -47649 158644
18374 -379518 253072 314716 -72312 -222243 166539 128192 -103834 -191176 8904 91621 19121
$$ packed form
18454B74665b36201c8706r7833A2119J89167i1586n626k16328E988P7759j4127
18443F9620f1788n3659b0447E2360Q7847n3844Q7756K3926D8576J31196j2163
18432A67609c38659A37082M2105E5659b0797A50814a81654N5466H0590C1218e1312
18420C33879a00414A20679h1560k7324j88312d6512j57298D58M3551a06976I4322
18408A96385a17222F9052b59413o582c7086A75308b94391J16002B34977b32091
18397B7579K49642m98b5704A89900a60297A92970r3979b97461A14382b43201i6492
18385a0542B7027b70057D13289A88624a64970e5249A77089b48135d7649A58644
18374c79518B53072O1644g2312j49931A66539l8347a03834q7342H904Q2717A9121
$$ plain form
18362 -142682 -371321 -138224 -17245 -60017 69412 -439169 158287 53865 163077 -216920
18351 -40678 -186556 -146249 117477 44892 293129 87286 -118837 19977 103392 88674 -280148
18339 182369 -151685 86699 72537 -86993 75492 49395 74664 -58469 183897 -267201 -249540
18328 -249540 -198640 -246819 187892 322 40198 -300498 189375 -90555 -145763 102319 386978
18317 386978 1636 138865 145949 -221619 -15302 -127873 -38932 13801 209736 121968 -62479
18305 90994 -494201 -228680 -70744 -333439 -106075 50820 30218 47923 -263617 -49870 -191380
18294 -191380 -61878 -72781 -231169 22958 24691 71162 -99574 -48737 -92524 65842 194739
18283 194739 327317 74697 -127080 -249913 -187609 -259188 201026 -236927 -58195 -66160 -172181
$$ packed form
18362a42682k28639a38224a7245m2772F9412d39169A58287E3865J09212b16920
18351d0678j45878M0307A17477D4892K48237H7286a18837A9977Q3415j4718b80148
18339A82369a51685H6699j4162h6993G5492k6097K5269e8469A83897b67201J7661
18328b49540N0900m8179A87892C22L9876c00498A89375i0555n5208A02319K84659
18317C86978A636J37229P084b21619a5302j12571c8932A3801J95935q7768f2479
18305I0994d94201b28680g0744k62695a06075E0820k0602J7705b63617d9870j41510
18294a91380f1878j0903j58388B2958J733M6471i9574d8737m3787F5842J28897
18283A94739J32578G4697a27080j22833O2304p1579B01026b36927e8195p965j06021
$$ plain form
18272 -172181 -46375 156134 -250358 -46958 -371347 143747 -183152 159803 -14135 174994
18261 83958 -33240 -189276 -97352 -157549 -24017 -51147 110353 -45345 184248 20657 -216582
18249 335603 98923 156725 105830 89554 45152 162668 -7471 80959 -272318 -153356 141605
18237 -125224 -264953 -103449 85756 -166274 289927 -207047 -171468 -3546 -210161 47923
18226 -93549 -47888 -60375 61642 -8470 -66914 -30665 84245 176836 -62869 -147681 -360805 -146038
18213 -110620 -85318 26236 6573 -171005 -45472 -351454 72934 -97596 -377701 -153999 -160809
18202 -160809 225547 34544 242956 -23236 79790 -112752 -48108 7464 77448 -57224 11228
18190 -73014 -179759 -24330 -43823 83255 -66186 -297483 12361 -39291 35948 -217362 298155
$$ packed form
18272a72181d6375A56134b50358d6958l24389A43747a83152A59803a4135A74994
18261H3958c3240j56036R1924o0197b4017k7130A10353d5345A84248B0657b16582
18249C35603I8923N7802n0895j6276m4402J17516g471H0959b72318J18962A41605
18237a25224j39729a03449H5756a66274B89927b07047L5579c546k06615D7923
18226i3549M5661j2487F1642h470n8444c0665H4245R2591f2869q4812k13124a46038
18213a10620K5302B6236F573a71005d5472l05982G2934i7596k80105a53999o810
18202a60809B25547C4544K08412b3236G9790a12752d8108G464O9984e7224A1228
18190g3014j06745b4330j9493H3255f6186k31297A2361c9291C5948b17362B98155
$$ plain form
18178 40208 48101 220934 189835 -41913 -22492 -280601 -86125 296550 -148183 -196274 92783
18166 354614 200703 33538 -115091 -250489 -226475 116929 363258 -48323 24024 -205591
18155 83426 75517 -53383 -132269 94507 215650 -21428 293110 -61220 321390 104709 -80716
18143 -173090 195282 263048 38845 -250005 133541 -303795 -56929 -361509 37510 10956
18132 148253 145033 -35753 15646 -120322 -44907 127527 -125842 10151 62451 -26918 -322564
18121 -322564 50004 12061 11020 169275 29234 203035 -70070 -68979 207745 -35147 99207
18109 -369537 -281233 144521 288961 -181609 -156612 -26253 184218 -14721 -94890 134440
18098 -89821 132088 -449393 84772 -89165 -89293 321350 -69148 110566 -56533 239936 -153843
$$ packed form
18178D0208P893J72833l1099d1913J9421k58109h6125B96550a48183m8091I2783
18166C54614j53911C3538a15091j35398K4014A16929K46329d8323B4024b05591
18155H3426p909e3383p8886I4507J21143b1428B93110f1220C21390A04709h0716
18143a73090A95282O7766C8845b50005A33541c03795e6929l04580C7510A0956
18132A48253l220c5753A5646a20322d4907A27527a25842A0151N2300b6918k95646
18121c22564E0004A2061j041J58255B9234J73801g0070J091B07745c5147I9207
18109c69537Q8304A44521J44440a81609K4997b6253A84218a4721q0169A34440
18098h9821A32088d49393H4772h9165j28C21350f9148A10566e6533B39936a53843
$$ plain form
18086 -64976 268634 101758 73614 123584 147285 234892 -179390 -111928 130803 -40145 64281
18074 -50409 -108738 -394952 149327 -333862 31287 74276 402508 168809 191225 -15936 -26125
18063 -26125 166139 -66935 -78419 -255443 -101853 -49207 118078 182635 -183851 -89261 -83864
18052 -83864 -78323 126529 39611 -2920 -190952 -129616 116663 -140881 -245279 185254 53902
18040 160885 -211017 174245 170682 90183 364966 204899 -179003 -62277 -106836 133599
18029 135144 -68096 7971 49584 -349002 101049 103996 173357 -50061 -74362 47672 94712
18018 94712 63797 379906 -193231 -31788 22672 -284014 -275195 -107875 78058 86848 -133650
18006 105033 -256106 -1354 -107251 86176 27865 114223 -24044 -244754 -10530 -88685 -219871
$$ packed form
18086f4976B68634A01758k8144M9970K3701Q7607a79390O7462A30803d0145F4281
18074e0409n8329k86214A49327c33862C1287M2989L28232A68809K2416a5936j0189
18063b6125A66139f6935j1484j77024a01853d9207A18078O4557a83851h9261N397
18052h3864N541A26529C9611b920j88032O1336A16663a40881j04398A85254E3902
18040A60885b11017A74245l563q0499K74783j60067a79003f2277m4559A33599
18029A35144f8096G971M1613c49002A01049K947O9361e0061k4301D7672M7040
18018I4712l0915L16109a93231c1788B2672b84014Q819a07875G8058Q790a33650
18006A05033b56106a354j05897H6176B7865Q6358b4044k20710a0530p8155j31186
$$ plain form
17995 -219871 -145751 -267197 -295859 182509 80846 -121514 -252004 -191087 -37570 -210075
17985 -210075 -4125 217907 -49280 -245531 177728 -46879 -66296 -340847 -297719 -56131 145704
17973 117816 -91278 106986 -222151 -131825 206394 -27822 -28542 114113 -102976 128753 -77097
17961 121524 32236 -93448 173687 -209597 350727 -59244 246424 -381933 -164997 174878
17950 99655 437165 145285 27539 -9029 136780 53750 -120661 65447 176418 -57325 -101094
17939 -101094 93083 81431 -128356 268572 -54402 152569 5486 255946 130123 -331786
17928 -141897 68908 -11369 -286626 -28885 -463848 251042 -383295 -188742 104118 93381
17918 93381 -114931 -77777 -51165 124016 -71756 16009 -39867 -206262 -278738 148376 -255947
$$ packed form
17995b19871P4120j21446k8662A82509H0846a21514j30490O0917c7570j72505
17985b10075d125B17907d9280j96251A77728d6879j9417k74551M3128e6131A45704
17973A17816i1278A06986b22151R0326B06394b7822p20A14113a02976A28753g7097
17961A21524C2236i3448A73687b09597C50727e9244B46424c81933a64997A74878
17950I9655L37510A45285B7539i029A36780E3750a20661F5447J10971e7325m3769
17939a01094I3083j1652a28356B68572e4402A52569E486K50460j25823c31786
17928a41897F8908a1369k75257b8885m34963B51042c83295a88742A04118j0737
17918I3381a14931L7154K6612A24016g1756A6009c9867j66395p2476A48376b55947
$$ plain form
17906 -245644 -21922 189462 -8064 -147495 212322 30140 392180 129486 -211807 -54704
17895 396314 97101 129054 122972 -127618 12156 -277988 -59281 3763 152219 -102058 92973
17883 428413 156869 139866 67003 -68650 -97749 -262712 49380 55110 167454 -321842 -343288
17872 -343288 62999 165432 -14343 301949 145018 -57518 33071 90136 24000 111256 -123558
17860 39405 -70885 225859 -90596 225291 -58014 333916 135764 30653 100660 -89696 68202
17848 -85667 76971 241694 203723 -340076 -147595 76253 -29968 184845 -31472 320275 208107
17837 208107 -241308 -75129 -29185 95808 21023 159149 -273116 -362385 -70517 -150390 109517
17825 472461 -37528 -234496 -254800 227442 -99083 -43558 173532 -62623 172086 62536 -1307
$$ packed form
17906b45644b1922A89462h064j39431B12322C0140L62040A29486b11807e4704
17895C96314I7101L1953o082a27618A2156b77988e9281C763J48456a02058I2973
17883D28413A56869j7003F7003f8650k9099j64963D9380N730J12344c21842k1446
17872c43288F2999J02433a4343C01949A45018e7518C3071N7065B4000Q7256a23558
17860C9405g0885B25859i0596B25291e8014C33916A35764C0653P0007h9696F8202
17848h5667G6971J64723l7971c40076a47595G6253b9968A84845c1472C20275j12168
17837B08107b41308g5129b9185I5808B1023J38126b73116q9269g0517p9873A09517
17825D72461c7528j96968k0304B27442i9083d3558A73532f2623A72086F2536a307
$$ plain form
17813 238159 257224 76474 -26303 111143 -193079 -171984 90260 13625 338255 -130418 -10365
17801 107301 353081 147175 87254 -54973 -217242 -246843 244946 101062 -206443 -56006
17790 139403 -183208 226563 276027 -10457 -45835 61985 110681 -23178 95050 179215 422414
17779 422414 -57749 108392 -32367 -9912 -15799 -80760 37769 119920 -128200 405634 144973
17767 80670 29958 42964 -108263 -28205 155021 277799 -92985 182654 242294 -73169 -61274
17756 -61274 403079 243545 232206 -85332 -129590 112603 106911 236251 316820 -32426 -66745
17745 -66745 118580 -427677 114425 -9343 94294 -82409 -162744 176829 -188854 -37210 -48680
17734 -48680 -77180 288597 -15859 47979 70868 86504 -71326 -91028 -47670 -8248 -196339
$$ packed form
17813B38159J9065G6474b6303A11143a93079K1095I0260A3625L24630a30418a0365
17801A07301K45780A47175n9921e4973j62269k9601B44946A01062b06443e6006
17790A39403a83208B26563M9464a0457l5378F1985M8696b3178I5050Q4165K43199
17779D22414e7749A08392c2367i912n887o4961C7769Q2151a28200D05634A44973
17767H0670B9958J3006a08263b8205A55021J22778i2985A82654N9640g3169J1895
17756f1274D03079j59534j1339h5332m4258A12603n692J29340Q0569c2426l4319
17745f6745A18580d27677A14425i343I4294h2409q0335A76829a88854c7210j1470
17734d8680k8500B88597a5859D7979K2889J5636g1326j9702M3358h248j88091
$$ plain form
17723 -196339 -95595 -146737 26813 -49905 207273 115170 204170 -221259 -445724 73711 302264
17712 302264 180705 -31479 370094 -41652 193007 407044 70067 84623 -298218 150606
17701 -101787 459670 206325 190757 274537 438476 -59114 184588 23712 296238 114856
17690 124385 -160178 334465 252295 -63295 -28797 -137601 -22787 44390 78775 144420 241601
17679 241601 -9638 22451 -69166 67220 31376 299370 316140 189545 -257124 93423 -86035
17667 303463 165074 -65003 28103 55007 -197645 81981 258891 -212536 158397 131325
17657 131325 -16448 151355 -108070 209769 -92176 6599 -23807 -61027 256302 220233 -124806
17645 124311 -94116 241283 425428 17837 232666 -164290 -60001 91050 -113234 270726
$$ packed form
17723a96339i5595n1142B6813d9905B07273r2103Q9000b21259k24465G3711K28553
17712C02264j21559c1479C70094d1652A93007K14037G0067J4556b98218A50606
17701a01787D59670B06325j5568Q3780J63939e9114A84588B3712K72526A14856
17690A24385a60178C34465q2170f3295b8797j08804b2787D4390L4385O5645R7181
17679B41601i638B2451f9166F7220C1376K67994J6770j26595b57124I3423h6035
17667C03463j38389f5003B8103K6904a97645H1981J76910b12536A58397k7072
17657A31325a6448A51355a08070B09769i2176F599b3807l7220B56302l6069a24806
17645A24311i4116B41283J84145A7837K14829a64290f0001I1050a13234B70726
$$ plain form
17634 -138841 114410 85665 -60888 317806 127958 359648 137234 324101 -25634 83610
17623 182153 -40825 -125563 67257 183952 304200 -57170 -167451 299435 -9613 -107256 -52563
17611 312028 250548 31231 258742 31027 -44649 287245 -80651 -206909 -81360 311545 190764
17600 190764 145900 172648 -378 -142660 -54541 -262739 311649 160561 89819 102924 419262
17589 419262 -77845 -18866 20397 186731 15562 248654 157806 185824 138669 -60585 48423
17577 -32808 458233 80647 -76115 39767 317118 68807 176098 65633 259692 -71905 -105716
17566 -105716 -122427 -234422 246188 329450 -7604 -61179 219136 -57213 64784 43060 155784
17555 155784 -221043 256305 203301 -298487 509644 167197 280911 130630 133460 93680
$$ packed form
17634a38841A14410k8745f0888C17806A27958K31690A37234J86867b5634H3610
17623A82153d0825q4738F7257J16695J20248e7170j10281B99435i613r7643e2563
17611C12028o1480C1231K27511C1027d4649B87245h0651j26258h1360C11545j20781
17600A90764m4864K6748c78j42282e4541k08198C11649j51088p0742J3105L16338
17589D19262g7845a8866B0397J66334A5562K33092r0848K8018m7155f0585D8423
17577c2808D58233H0647g6115C9767K77351F8807J07291F5633J94059g1905l3811
17566a05716j6711j11995B46188Q3262g604n3575B19136e7213F4784k1724J12724
17555A55784b21043B56305n3004b98487E09644A67197J13714A30630K830l9780
$$ plain form
17545 93680 347295 134874 389840 391067 274823 279761 290068 310186 374326 174166 89752
17534 89752 132029 310927 321610 201430 14789 135084 197188 496438 -193128 18888 259541
17523 259541 261943 -30065 292562 382789 329740 500298 166801 241875 208900 745096 623481
17512 623481 520120 586454 1004564 1050254 828240 876876 542123 375314 67390 328993
17502 328993 594592 645525 497841 503591 455473 670035 787763 986614 960028 960194 650689
17491 650689 818864 738785 153259 557341 224830 119849 510021 43227 131063 141745
17481 141745 499287 303234 410499 387635 300342 372194 295975 266618 367878 456817 270317
17470 270317 418093 356404 248763 325956 332925 58814 383837 424532 154932 164980 299053
$$ packed form
17545I3680K53615A34874K54966J227j16244M938J0307K0118O4140A74166q4414
17534H9752M2277J78898J0683j20180A4789J20295O2104K99250a93128A8888K40653
17523B59541K402c0065B92562R0227n3049J70558A66801P5074l2975N36196j21615
17512F23481j03361O6334M18110M5690k22014M8636l34753j66809F7390K61603
17502C28993K65599N0933j47684N750m8118K14562J17728J98851k6586J66l09505
17491F50689J68175q0079A53259M04082B24830j04981L90172D3227Q7836J0682
17481A41745L57542j96053J07265k2864q7293P1852p6219k9357J01260Q8939j86500
17470B70317J47776o1689j07641P7193O969E8814L25023M0695A54932J0048J34073
$$ plain form
17459 299053 198903 325255 412452 -25033 200909 306161 297644 228661 310510 329738 182116
17448 182116 81697 474159 378773 649690 154710 419659 423306 366068 165539 296694
17438 296694 224751 96926 328976 329683 27031 113288 533668 595130 533568 44527 362290
17427 362290 649314 487255 436589 503238 417407 757023 386296 228529 462140 193082
17416 507479 416984 316581 559514 184815 -35158 108017 427960 336548 426431 -76853
17405 173132 344246 330504 433478 633973 279187 383653 203954 224421 457455 673500
17395 673500 351695 117827 172153 103550 118045 160451 317138 60607 776482 64241 186623
17384 186623 285457 132889 271648 -44874 78135 198278 194075 565814 67330 357220 56800
$$ packed form
17459B99053j00150J26352Q7197b5033B00909J05252q517o8983Q1849J9228j47622
17448A82116H1697L92462r5386K70917A54710K64949L647n7238A65539J31155
17438B96694p1943I6926K32050P07B7031Q6257M20380O1462o1562D4527L17763
17427C62290K87024j62059n0666O6649q5831L39616l70727j57767K33611A93082
17416E07479r0495j00403K42933A84815c5158A08017L19943r1412Q9883g6853
17405A73132J71114j3742J02974K00495B79187J04466j79699K0467K33034K16045
17395F73500l21805A17827N4326o8603J4495M2406J56687F0607P15875F4241J22382
17384A86623R8834A32889J38759d4874G8135J20143m203L71739F7330K89890E6800
$$ plain form
17372 480314 95916 98100 226721 20854 122729 513283 288666 61767 65038 209127 224222
17361 224222 158302 76893 160752 311296 93046 404134 438638 -779 109920 928254 404920
17349 648921 18557 395139 430806 -63773 211364 -11129 409376 160593 15528 172118
17339 172118 239350 455872 205180 265306 -31257 143483 367570 509892 192917 196156
17329 196156 363947 66760 380863 79831 159074 -89030 127522 346053 341771 386183 278418
17318 278418 28036 87188 196383 239720 393391 586593 387194 328443 553721 326664
17308 326664 484470 192343 376106 562935 60439 307708 -27020 672461 589354 235011
17297 541668 396038 355796 354563 245315 475030 312308 130959 290545 133491 215935
$$ packed form
17372D80314I5916K184J28621B0854J01875L90554k24617F1767L271J44089J5095
17361B24222o5920G6893Q3859J50544I3046L11088L4504g79A09920Q18334D04920
17349F48921A8557L76582L5667f3773B11364a1129D09376A60593A5528J56590
17339A72118O7232K16522B05180O0126c1257A43483K24087J42322A92917L239
17329A96156J67791F6760L14103G9831P9243h9030A27522K18531m282M4412j07765
17318B78418B8036N9152J09195M3337J53671J93202j99399n8751K25278k27057
17308C26664J57806A92343J83763J86829F0439K47269b7020F72461q3107B35011
17297E41668j45630m0242j233j09248K29715j62722A30959J59586A33491Q2444
$$ plain form
17287 215935 527492 369087 456452 602248 151096 305706 326471 7888 191278 568242
17277 568242 339380 186081 404741 288126 235475 218346 -129302 353839 303727 45508
17266 182009 399409 319974 21315 231132 458734 56825 582057 381391 88039 206042
17256 206042 400659 195375 227272 150279 337600 19415 376371 214631 528509 471085
17246 471085 194227 400955 91221 362306 594481 469442 274145 487361 530760 253602
17235 335610 736519 291709 177561 527387 404185 335853 252948 379932 210063 77748
17224 330896 374781 157149 233963 368803 285431 112294 -69856 392651 218905 408347
17214 408347 471916 660382 460498 328019 357518 530582 355433 314760 453108 489494
$$ packed form
17287B15935L11557j58405Q7365J45796A51096J54610K0765G888J83390L76964
17277E68242k28862j53299K18660j16615n2651j7129a29302C53839n0112D5508
17266A82009K17400p9435B1315K09817K27602E6825N25232k00666H8039J18003
17256B06042J94617A95375L1897p6993J87321A9415L56956j61740L13878n7424
17246D71085A94227K06728I1221K71085K32175j25039j95297K13216M3399B53602
17235C35610M00909B91709j14148L49826j23202o8332q2905J26984j69869G7748
17224C30896M3885A57149P6814J34840q3372A12294f9856C92651j73746J89442
17214D08347O3569J88466j99884j32479K9499J73064j75149m0673J38348L6386
$$ plain form
17204 489494 490159 342380 192972 -14323 493566 359159 556359 481593 132096 157227 326257
17193 326257 108386 393240 542760 426889 364674 300900 410832 728051 470473 169222
17182 239857 571832 216845 498896 189360 519419 318643 776302 582293 375793 392894
17172 392894 440104 298127 498935 460243 819791 551473 532871 683683 208494 453867
17162 453867 507243 224103 517663 569242 483374 166317 237016 630916 582521 409058
17152 409058 298818 311927 482760 437184 770504 688907 598993 588550 593779 226957 802417
17141 802417 854903 493677 341799 673781 399649 766400 584333 379739 568673 789346
17131 789346 163040 469789 655267 455976 502538 502537 521635 282994 344282 556122 645915
$$ packed form
17204D89494O65j47779j49408a4323D93566j34407J97200p4766A32096K5131J69030
17193C26257A08386K84854J49520j15871o2215o3774J09932L17219k57578A69222
17182B39857L31975B16845K82051A89360L30059k00776M57659j94009k06500J7101
17172C92894M7210j41977K00808l8692L59548k68318j8602J50812B08494K45373
17162D53867N3376B24103K93560N1579q5868A66317P0699L93900m8395j73463
17152D09058j10240J3109J70833m5576L33320q1597q9914j0443N229B26957N75460
17141H02417N2486l61226j51878L31982k74132L66751j82067k04594J88934K20673
17131G89346A63040L06749J85478j99291M6562jJ9098k38641O1288K11840Q9793
$$ plain form
17120 645915 509143 630156 752221 548921 424822 603868 841431 326530 506943 860752
17110 860752 954310 273146 881993 530185 184766 744288 472229 936993 880661 735225
17100 735225 695366 506796 370672 738828 758849 537113 259289 676664 786881 862829
17090 862829 891358 795351 661961 787918 689615 645531 900668 410244 781042 629141
17080 629141 969447 532748 912122 466452 670570 535020 763925 590602 715082 838065
17070 838065 723225 1123685 1003998 637726 1088244 497544 607909 544382 663779 938582
17060 938582 841370 955066 607676 865614 963475 673296 701505 731000 1021256 957687
17050 957687 446612 1097323 601996 1007299 880378 715628 880829 648670 830583 854732
$$ packed form
17120F45915j36772J21013J22065k03300j24099J79046K37563C26530J80413L53809
17110H60752R3558B73146O08847l51808A84766N59522k72059M64764n6332j45436
17100G35225l9859j88570j36124L68156K0021k21736B59289M17375J10217P5948
17090H62829K8529r6007j33390J25957r8303m4084K55137D10244L70798j51901
17080F29141L40306m36699L79374m45670K04118j35550K28905j73323J24480J22983
17070H38065j14840M00460j19687l66272M50518D97544J10365o3527J19397K74803
17060I38582r7212J13696l47390K57938R7861k90179K8209K9495K90256o3569
17050I57687D46612O50711m95327M05303j26921j64750J65201k32159J81913K4149
$$ plain form
17040 854732 592513 629365 698897 808904 999924 931124 836657 906494 920731 715940 959888
17029 959888 739207 891705 1328255 444777 1054231 753118 1172654 790980 1047272 677747
17019 677747 958434 1184031 1225729 851277 1062902 1338933 867767 832132 644099 1041094
17009 1041094 847579 959987 795807 1298757 898258 1053479 781166 1071536 870339
17000 870339 1234603 1295004 865196 1059855 1175171 1026324 1272025 1030310 1274930 1300883
16990 1300883 1138672 1167280 1550959 1176752 1213658 1328980 1312327 1281022 1168769 1226894
16980 1226894 1315827 1093286 1314227 1388814 1239178 927726 1145522 1128754 1355930 1502959
16970 1502959 1344046 1266326 1454456 1544619 1304408 1508777 1826603 1473512 1163857 1383226
$$ packed form
17040H54732k62219L6852O9532J10007J91020o8800r4467O9837J4237k04791K43948
17029I59888k20681J52498M36550D44777O09454l01113M19536l81674K56292l69525
17019F77747K80687K25597M1698l74452K11625K76031m71166l5635j88033L96995
17009A041094j93515J12408j64180N02950m00499J55221k72313K90370k01197
17000H70339L64264O0401m29808J94659J15316j48847K45701k41715K44620K5953
16990A300883j62211K8608L83679l74207L6906J15322j6653l1305j12253N8125
16980A226894Q8933k22541K20941P4587j49636l11452K17796j6768K27176J47029
16970A502959j58913p7720J88130R0163k40211K04369L17826l53091l09655K19369
$$ plain form
16960 1383226 1174333 1550641 1567994 1514970 1485257 1796138 1640535 1489373 1812078 1570773
16950 1570773 1453671 1600159 1416606 1464046 1137341 1468419 1783456 1461278 1578254 1513415
16940 1513415 1598685 1699360 2096019 1524086 1798527 1988398 1955428 1883912 1645526 1798867
16930 1798867 1542556 1972942 1863569 1970042 1841590 1952469 1948864 2148443 2109743 1871002
16920 1871002 2214071 2113594 1725788 2296642 1801011 2169129 1998906 1812013 2059085
16911 2059085 2444305 2137821 2328768 2242898 2074033 2273525 2137880 2224094 2045440 2324476
16901 2324476 2670071 2417949 2475436 2428982 2535546 2384089 2569720 2354548 2523940 2435697
16891 2435697 2824279 2804507 2867212 2755763 2486783 2882396 2728582 3062018 3243820 3349321
$$ packed form
16960A383226k08893L76308J7353n3024k9713L10881j55603j51162L22705k41305
16950A570773j17102J46488j83553M7440l26705L31078L15037l22178J16976o4839
16940A513415Q5270J00675L96659n71933K74441J89871l2970p1516k38386J53341
16930A798867k56311M30386j09373J06473j28452J10879l605J99579l8700k38741
16920A871002L43069j00477l87806N70854m95631L68118j70223j86893K47072
16911B059085L85220l06484J90947q5870j68865J99492j35645Q6214j78654K79036
16901B324476L45595k52122N7487m6454J06564j51457J85631k15172J69392q8243
16891B435697L88582j9772O2705j11449k68980L95613j53814L33436J81802J05501
$$ plain form
16881 3349321 2997188 3174362 3244159 2900942 2954553 3434463 3241261 3390132 3375891 3330285
16871 3330285 3293430 3351469 3395772 3475442 3536065 3559479 3960965 3801022 3735074 3946785 3780018
16860 3780018 3954092 4088644 3417881 4078692 4294538 4106649 4200751 4211435 4385647 4084769
16850 4084769 4583320 4638315 4683357 4673654 4550084 4751400 4615604 4862553 5018205 5144901
16840 5144901 4967322 5281084 5264944 5024960 5061400 5319026 5797517 5844826 5728382 5850561
16830 5850561 6072160 5927225 6444360 6212358 6290332 6506414 6505423 6525998 6758512 6840023
16820 6840023 7185891 7014521 7525896 7189626 7685528 7703493 7654646 7878140 8026128 8274252
16810 8274252 8380579 8418998 8534555 8503742 8686145 9364948 9298048 9319070 9723996 9589914
$$ packed form
16881C349321l52133J77174O9797l43217N3611M79910j93202J48871j4241m5606
16871C330285l6855N8039M4303P9670O0623K3414M01486j59943o5948K11711j66767
16860C780018J74074J34552o70763O60811K15846j87889R4102J0684J74212l00878
16850D084769M98551N4995M5042r703j23570K01316j35796K46949J55652J26696
16840E144901j77579L13762j6140k39984L6440K57626M78491M7309j16444J22179
16830E850561K21599j44935N17135k32002P7974K16082r91K0575K32514Q1511
16820F840023L45868j71370N11375l36270M95902J7965m8847K23494J47988K48124
16810H274252J06327L8419J15557l0813J82403O78803o6900K1022M04926j34082
$$ plain form
16800 9589914 9856688 10457849 10335151 10844304 11086035 10952479 11232724 11761019 12103111
16791 12103111 11952942 12377799 12700461 12779683 13123172 13589336 13776666 14147706 14501697
16782 14501697 14769270 15348302 15503596 15607785 16408134 16709448 17271778 17475224 18208983
16773 18208983 18683583 19051414 19630807 20158200 20537816 21167105 21732416 22229535 23172351
16764 23172351 23615378 24679468 25357503 26047736 26797103 27634305 28624072 29377779 30234505
16755 30234505 31261667 32234810 33466113 34572748 35654527 37113373 38257753 39693345
16747 39693345 40887079 42323773 44072674 45708346 47448772 48986829 50827643 52837087
16739 52837087 54672337 57012324 59124790 61190924 63589911 66240806 68724613 71201358
$$ packed form
16800I589914K66774O01161j22698N09153K41731j33556K80245N28295L42092
16791A2103111j50169M24857L22662P9222L43489M66164J87330L71040L53991
16782A4501697K67573N79032J55294J04189Q00349L01314N62330K03446P33759
16773A8208983M74600L67831N79393N27393L79616O29289N65311M97119R42816
16764B3172351M43027J064090O78035O90233P49367Q37202R89767P53707Q56726
16755C0234505J027162R73143J231303J106635J081779J458846J144380J435592
16747C9693345J193734J436694J748901J635672J740426J538057J840814K009444
16739E2837087J835250K339987K112466K066134K398987K650895K483807K476745
$$ plain form
16731 71201358 74054860 76922959 79979942 82349517 85721415 88843581 91611641 94947695
16723 94947695 98101515 101421454 104287966 107532574 110139309 113283587 115865150 118366333
16715 118366333 120725652 122680251 124817816 126559671 127463642 128369350 129037619 129197960
16707 129197960 129366972 128897373 128127464 127141594 125529066 123792010 121726927 119477842
16699 119477842 117248535 114570259 111753697 108674312 105737426 102703663 99329346 96378555
16691 96378555 93186519 90257205 87069632 83880646 80995831 77994497 75167393 72331007
16683 72331007 69795149 66999372 64714023 62084006 59986818 57241308 55710541 53196363
16675 53196363 51059059 49712366 47578409 45936372 44285693 42543219 40917462 39478512
$$ packed form
16731G1201358K853502K868099L056983K369575L371898L122166K768060L336054
16723I4947695L153820L319939K866512L244608K606735L144278K581563K501183
16715A18366333K359319J954599K137565J741855R03971R05708O68269J60341
16707A29197960J69012m69599p69909r85870j612528j737056k065083k249085
16699A19477842k229307k678276k816562l079385k936886l033763l374317k950791
16691I6378555l192036k929314l187573l188986k884815l001334k827104k836386
16683G2331007k535858k795777k285349k630017k097188k745510j530767k514178
16675E3196363k137304j346693k133957j642037j650679j742474j625757j438950
$$ plain form
16667 39478512 38127385 37016973 35732826 34695670 33311407 32391125 31396954 30229189
16659 30229189 29264603 28329327 26971197 26533376 25677946 24655568 24174568 23615793 22924274
16650 22924274 22591797 21412600 21155983 20295637 19958568 19397929 18770908 18242258 17752846
16641 17752846 17179617 17033085 16415607 15889563 15626139 15056419 14666749 13931160 14331388
16632 14331388 13906218 13488091 13245154 13071077 12305157 12341038 11797560 11922995 11794810
16623 11794810 10921831 11006280 10709658 10381377 10400617 9832447 9609609 9573065 9241358 9388200
16613 9388200 9270526 8786079 8572849 8543176 8233990 8423022 7705318 8135724 7635515 7574204
16603 7574204 7606957 7299200 7182315 7041726 6748503 6840026 6663596 6906829 6305439 6386105
$$ packed form
16667C9478512j351127j110412j284147j037156j384263r20282r94171j167765
16659C0229189r64586r35276j358130m37821q55430j022378m81000n58775o91519
16650B2924274l32477j179197k56617q60346l37069n60639o27021n28650m89412
16641A7752846n73229j46532o17478n26044k63424n69720l89670p35589M00228
16632A4331388m25170m18127k42937j74077p65920L5881n43478J25435j28185
16623A1794810q72979Q4449k96622l28281J9240n68170k22838l6544l31707J46842
16613I388200j17674m84447k13230k9673l09186J89032p17704M30406n00209o1311
16603G574204L2753l07757j16885j40589k93223R1523j76430K43233o01390Q0666
$$ plain form
16593 6386105 6453214 6180306 6104895 5973952 6108095 5778362 5898085 5601682 5478662 5695037
16583 5695037 5503118 5497713 5091528 5076351 4762301 4745663 4713827 4859342 4833973 4787140 4427469
16572 4427469 4496160 4706165 4145886 4363219 3968359 4697201 4104508 3940011 4207143 3995363
16562 3995363 3642647 3872800 3811204 3709104 3569166 3707366 3913177 3621473 3628146 3549311
16552 3549311 3329618 3375887 3248667 3491940 3162245 2966696 3603134 3003721 3348049 3072909
16542 3072909 3349146 3001099 2742983 2918092 3023480 2704509 2693936 3046547 2896463 2540767
16532 2540767 2878126 2838343 2602849 2637809 2776190 2737083 2528931 2139087 2540117 2414398
16522 2414398 2598313 2147124 2617128 2363005 2595785 2522865 2450694 2155474 2220252 2370909
$$ packed form
16593F386105O7109k72908p5411j30943J34143l29733J19723k96403j23020K16375
16583E695037j91919n405m06185j5177l14050j6638l1836J45515k5369m6833l59671
16572D427469O8691K10005n60279K17333l94860P28842n92693j64497K67132k11780
16562C995363l52716K30153o1596j02100j39938J38200K05811k91704O673p8835
16552C549311k19693M6269j27220K43273l29695j95549O36438n99413L44328k75140
16542C072909K76237l48047k58116J75109J05388l18971j0573L52611j50084l55696
16532B540767L37359l9783k35494L4960J38381l9107k08152l89844M01030j25719
16522B414398J83915m51189M70004k54123K32780p2920p2171k95220O4778J50657
$$ plain form
16512 2370909 2222490 2120450 2079028 2087263 1752194 2067212 2033640 2395684 2040822 2142436
16502 2142436 1975180 2132467 2204182 1842123 1865641 1851898 2079811 1966196 1984897 1887731
16492 1887731 1742585 1902471 1909376 1757774 1685266 1868785 1869806 1709021 1624785 1635655 1437334
16481 1437334 1545155 1722280 1742425 1701948 1646916 1531012 1693311 2073383 1742196 1593021
16471 1593021 1650298 1296172 1712088 1541791 1426700 1131813 1469147 1858243 1216451 1524148
16461 1524148 1549440 1375455 1342319 1599614 1485327 1421300 1372701 1544786 1643047 1296946
16451 1296946 1254445 1199371 1401332 1295687 1063153 1285924 1103255 1301633 1250083 1138208
16441 1138208 1074113 1646395 1137940 1109686 653024 1320383 1421205 1190897 1340967 696486
$$ packed form
16512B370909j48419j02040m1422Q235l35069L15018l3572L62044l54862J01614
16502B142436j67256J57287P1715l62059K3518j3743K27913j13615J8701r7166
16492A887731j45146J59886O905j51602p2508J83519J021j60785q4236J0870j98321
16481A437334J07821J77125K0145m0477n5032j15904J62299L80072l31187j49175
16471A593021N7277l54126M15916j70297j15091k94887L37334L89096o41792L07697
16461A524148K5292j73985l3136K57295j14287o4027m8599J72085R8261l46101
16451A296946m2501n5074K01961j05645k32534K22771j82669J98378n1550j11875
16441A138208o4095N72282n08455k8254m56662O67359J00822k30308J50070o44481
$$ plain form
16431 696486 1222740 1093799 1083297 1142485 1181014 764209 1158685 1461891 1072538 1376423
16421 1376423 1117230 1030775 973776 1083984 1023152 1365707 908383 1045008 761541 815881
16411 815881 1132488 633029 826945 1124177 879109 1092532 729676 927716 952184 785570
16401 785570 598100 716924 744936 1157470 837819 1023880 729780 765063 918960 934437
16391 934437 955791 885302 933982 596370 817555 869650 715504 791856 913087 953114 643527
16380 643527 804533 1008669 698769 871301 817478 781605 1063862 691148 687263 811415
16370 811415 903272 759748 816973 934612 844955 667769 533466 723815 758881 682433
16360 682433 474696 665561 482200 674082 510667 255811 1076597 693652 252349 647581
$$ packed form
16431F96486N26254j28941j0502N9188L8529m16805L94476L03206l89353L03885
16421A376423k59193q6455n6999J10208o0832L42555m57324J36625k83467N4340
16411H15881L16607m99459J93916K97232k45068K13423l62856J98040K4468j66614
16401G85570j87470J18824K8012M12534l19651J86061k94100L5283J53897J5477
16391I34437K1354p0489M8680l37612K21185N2095j54146P6352J21231M0027l09587
16380F43527J61006K04136l09900J72532n3823l5873K82257l72714l885J24152
16370H11415R1857j43524N7225J17639q9657j77186j34303J90349L5066p6448
16360F82433k07737J90865j83361J91882j63415k54856Q20786l82945B52349L95232
$$ plain form
16350 647581 455810 685835 642709 675569 695867 648714 686910 358160 860484 634568
16340 634568 730554 291869 560282 514273 589826 618110 860998 497044 777754 556255
16330 556255 411989 661102 604412 696450 554558 891224 393689 434616 736655 768439
16320 768439 511835 429948 885376 403369 637834 630451 316630 570387 798814 428708
16310 428708 313115 290365 672668 459749 547273 323942 484267 482839 456341 758366
16300 758366 135991 275412 613176 716414 578287 318217 592755 756678 375888 290858
16290 290858 366655 620013 371976 619960 647713 731427 497927 478852 482407 286606 504910
16279 504910 758969 639313 697848 359557 458071 296488 638599 86981 349614 728244
$$ packed form
16350F47581j91771K30025m3126L2860K0298m7153L8196l28750N02324k25916
16340F34568R5986B91869K68413m6009P5553K8284K42888l63954K80710k21499
16330E56255j44266K49113n6690R2038j41892L36666C93689M0927L02039L1784
16320G68439k56604q1887M55428D03369K34465p383l13821K53757K28427l70106
16310D28708j15593k2750L82303k12919Q7524k23331J60325j428k6498L02025
16300G58366A35991J39421L37764J03238j38127k60070K74538J63923C75888q5030
16290B90858P5797K53358k48037K47984K7753Q3714k33500j9075L555j95801K18304
16279E04910K54059j19656N8535l38291R8514j61583L42111H6981K62633L78630
$$ plain form
16269 728244 340429 342392 469598 342037 489103 415409 282776 164748 341394 291161
16259 291161 468290 403185 577553 373101 465694 8489 461601 359681 252519 563768
16249 563768 408604 390629 414341 184210 573253 302582 506480 361955 653465 435443
16239 435443 453354 340720 157741 554847 389939 398054 561311 329155 386496 254123
16229 254123 417415 471372 359294 354161 424248 30102 175800 78116 207711 383198 299789
16218 299789 174812 75472 101437 764914 275472 476785 216327 51903 289753 123798
16207 158135 155147 399184 263146 190383 -46745 576221 -7102 371566 172428 303781 45665
16195 459391 118357 93800 209252 433687 137818 495985 272397 465647 207937 228356
$$ packed form
16269G28244C40429J963J27206j27561J47066p3694j32633j18028J76646n0233
16259B91161J77129o5105J74368k04452R2593H489M53112j01920j07162L11249
16249E63768j55164j7975K3712A84210L89043k70671K03898j44525K91510k18022
16239D35443J7911j12634A57741L97106j64908Q115J63257k32156N7341j32373
16229B54123J63292N3957j12078n133P0087C0102J45698G8116J29595J75487q3409
16218B99789j24977G5472K5965O63477B75472K01313B16327E1903K37850A23798
16207A58135k988K44037j36038p2763d6745E76221g102C71566A72428J31353D5665
16195D59391A18357k4557J15452K24435A37818L58167k23588J93250B07937K0419
$$ plain form
16185 228356 334411 487235 393299 293179 260078 142612 391966 56480 406355 199378
16174 89036 472741 197607 451652 334704 547161 218402 368529 -157096 60166 275377
16164 275377 13627 463554 137990 220190 108959 278750 84264 98096 -53146 215362
16153 149631 99941 -45604 345104 12043 217589 -108909 334120 141616 217538 192702
16143 192702 107863 268293 -7302 207714 24981 106864 292238 167986 -105484 263113
16132 56963 -110382 447335 497598 72701 216936 -90370 -126476 -33713 448666 293011 205350
16121 205350 320199 217032 566411 504768 11115 138683 241126 301420 34319 71895
16111 71895 -32884 146619 30132 492831 222630 363156 241729 199810 262696 71590 424493
$$ packed form
16185B28356J06055J52824r3936j00120l3101j17466K49354E6480L49875A99378
16174H9036L83705A97607K54045j16948K12457B18402J50127a57096F0166K15211
16164B75377A3627M49927A37990Q2200A08959J69791H4264J3832e3146B15362
16153A49631m9690d5604C45104A2043K05546a08909C34120A41616P5922k4836
16143A92702q4839J60430g302B07714B4981Q1883J85374j24252a05484B63113
16132E6963a10382D47335N0263G2701J44235i0370l6106c3713D48666j55655q7661
16121B05350J14849j03167L49379o1643A1115J27568J02443O0294C4319L7576
16111G1895c2884A46619C0132M62699B22630J40526j21427m1919O2886G1590L52903
$$ plain form
16100 424493 -257824 -100277 383946 94452 302584 -284708 -156262 152371 136686 -201158
16089 88933 361234 333575 390622 105889 247929 34496 -3236 158324 339065 113179 -138518
16077 302397 120259 53270 144503 24653 484966 -79694 172914 -86256 167290 144548 262650
16066 262650 -2747 43155 -14119 -206324 -35618 212789 314565 211337 -77357 124307 126669
16055 126669 20353 -269351 -66388 -310873 398388 362530 -111575 226246 121833 152646
16045 152646 205040 213292 37126 284014 187218 -80445 72532 100351 -125575 286731 -153859
16033 202120 -98153 24705 -5959 276136 -65020 98551 9985 -56086 212682 185990 40878
16021 48938 96591 33994 -200799 -1278 26291 56154 33719 -483615 93635 187048 136489
$$ packed form
16100D24493b57824a00277C83946I4452K08132b84708J28446A52371j5685b01158
16089H8933K72301k7659N7047A05889J42040C4496c236A58324J80741A13179a38518
16077C02397A20259E3270R1233B4653M60313g9694A72914h6256A67290k2742J18102
16066B62650b747D3155a4119j92205c5618B12789J01776j03228g7357A24307K362
16055A26669B0353b69351f6388k44485C98388l5858a11575B26246j04413L0813
16045A52646N2394Q252C7126K46888r6796h0445G2532K7819a25575B86731a53859
16033B02120i8153B4705e959B76136f5020I8551I985e6086B12682k6692D0878
16021D8938M7653C3994b00799a278B6291K9863k2435d83615I3635R3413n0559
$$ plain form
16010 136489 185254 -37768 331366 -105608 14268 -62714 44875 91971 163292 84210 -77460
15998 157416 -81057 225753 -113635 -66016 66481 314335 185372 131948 5750 -156042 319774
15986 156075 95768 301556 362956 -25479 -75832 -227565 -176191 -28175 329515 75805 368007
15975 368007 240810 195514 292449 580574 716583 1159680 1241685 789597 906989 532996
15965 532996 302883 212974 56796 129622 25136 -98296 167194 273511 -88470 69528 58660
15954 58660 -72869 59655 15263 187364 63518 198611 209881 31133 211093 -24007 127676
15942 280167 -61382 -93123 -23099 -140973 -108694 89363 198827 -13566 -31979 166969 -110081
15930 76322 112081 68096 33975 -295790 -348847 267474 -225339 -67979 37534 85251 -147790
$$ packed form
16010A36489M8765c7768C31366a05608A4268f2714D4875M7096P1321p9082g7460
15998A57416h1057B25753a13635M7619F6481K47854j28963n3424E750a56042C19774
15986A56075o0307K05788O1400b5479n0353j51733N1374b8175C29515G5805K92202
15975C68007j27197m5296R6935K88125J36009M43097Q2005m52088J17392l73993
15965E32996k30113q9909E6796P2826B5136i8296A67194J06317h8470F9528j0868
15954E8660g2869E9655A5263J72101F3518J35093J1270C1133J79960b4007A27676
15942B80167f1382l1741b3099j17874L2279H9363J09464a3566j8413A66969a10081
15930G6322L5759m3985C3975b95790n3057B67474b25339f7979C7534M7717a47790
$$ plain form
15918 -137150 -28875 -350737 59425 -142213 -57007 235049 -336679 35039 58962 124323 -189770
15906 -505181 64909 171043 -36599 108723 191454 87850 202929 -102105 -3618 105933 -92777
15894 -244105 -114558 214607 -170431 102280 -380042 -101019 206789 -8467 195335 194181
15884 194181 -107713 86799 -5119 -154059 102327 98323 114793 -255265 -89035 -169179 -43570
15872 -250325 184560 65375 -172157 -111611 -86376 -85235 -221890 -346323 -49407 218550 -157640
15860 -29449 -310488 134961 51198 -56391 17677 72589 182379 107484 104728 19004 -186115
15848 37337 217588 35838 190019 -26139 143181 -66112 -75710 -10883 120788 -38998 72690
15836 1697 -83804 44957 166483 274781 -173826 109639 -129023 -258393 25373 200876
$$ packed form
15918a37150b8875l21862E9425a42213e7007B35049c36679C5039K3923O5361a89770
15906e05181F4909J06134c6599A08723Q2731H7850J15079a02105c618A05933i2777
15894b44105a14558B14607a70431A02280c80042a01019B06789h467A95335j154
15884A94181a07713H6799e119j48940A02327m004J6470b55265h9035q0144d3570
15872b50325A84560F5375a72157O0546K5235J141j36655j24433d9407B18550a57640
15860b9449k81039A34961E1198e6391A7677N4912J09790p4895k756A9004a86115
15848C7337J80251C5838J54181b6139A43181f6112r598a0883A20788c8998G2690
15836A697h3804D4957J21526J08298a73826A09639a29023j29370B5373J75503
$$ plain form
15826 200876 -109013 47548 30611 10386 103466 192464 153333 72927 -101047 165589 126260
15815 126260 81513 -114806 -225069 17429 -114291 32515 -299488 -109431 -262587 -133946
15805 -133946 148035 -112809 -76389 74917 23329 75822 -4289 -119954 51872 55175 -182253
15793 118567 -84542 -2317 36738 79700 -59951 336973 -24009 47592 -82439 -108662 -123736
15782 -123736 -113983 46704 -71787 269126 193940 -53069 179505 185869 70361 123348 -13747
15770 -166710 -192103 -64082 1834 113879 -64058 -195965 -237082 97160 165155 71192 -19562
15758 28453 -239674 -230988 -190452 37095 -81427 -184423 -38158 -90553 -43377 6542 -31207 31833
15745 -298027 3230 105271 -250028 -76716 127094 28991 -85108 170229 172874 117043 -164422
$$ packed form
15826B00876a09013D7548j6937A0386R3080Q8998l9131G2927a01047A65589l9329
15815A26260m4747a14806j10263A7429a14291C2515b99488a09431j53156J28641
15805a33946A48035a12809L6420G4917B3329N2493d289j15665E1872L303a82253
15793A18567h4542b317C6738M2962e9951C36973b4009D7592h2439k6223j5074
15782a23736R753D6704g1787B69126p5186e3069A79505O364G0361N2987a3747
15770a66710k5393f4082A834J12045f4058j31907m1117I7160O7995G1192a9562
15758B8453b39674Q686M0536C7095h1427j02996c8158n2395d3377F542c1207C1833
15745b98027C230J02041b50028g6716A27094B8991h5108A70229K645n5831a64422
$$ plain form
15733 214711 -10026 -144782 33367 5423 428752 99321 -11334 -15018 -166665 -108780 327391
15721 -26504 -317128 294897 29033 35593 14318 -280345 219470 -210265 54343 -92180 -74268
15710 -74268 258851 29451 66875 270312 -55729 -74370 121580 191740 -118270 -376825 -32476
15698 -9549 159311 -54764 -57181 481845 -462127 -349563 -72760 200207 -47355 71389 13361
15686 -140598 -231424 -46177 -71096 97086 -73170 68002 -80482 -321651 74651 -306186 -93446
15674 153189 216266 342445 102542 97355 142603 457775 184165 -36681 -84339 66035 -84063
15662 -208214 -148611 -73035 -124361 340372 -124061 -270441 213533 57855 207330 -21722
15651 100021 -92056 76251 -259761 -232828 -236364 -23580 -322945 -338505 93599 -89479 -52319
$$ packed form
15733B14711a0026j34756C3367E423M23329I9321a1334l684j51647N7885C27391
15721b6504k90624B94897B9033O560A4318b80345B19470b10265E4343i2180J7912
15710g4268B58851B9451L7424K03437e5729j8641A21580P0160a18270k58555c2476
15698i549A59311e4764k417D81845d62127J12564g2760B00207d7355G1389A3361
15686a40598r0826d6177k4919I7086g3170F8002h0482k41169G4651c06186i3446
15674A53189O3077J26179A02542n187M5248L15172A84165c6681m7658F6035h4063
15662b08214N9603g3035n1326C40372a24061j46380B13533E7855J49475b1722
15651A00021i2056G6251b59761K6933l536b3580k99365j5560I3599h9479L7160
$$ plain form
15640 -52319 156534 -76071 -59522 -61978 -185596 186902 -162444 -172752 -66200 -262840 190777
15628 -80502 -3734 152127 29560 -176312 -123063 37617 -32955 -161381 -76958 -42986 -136954
15617 -136954 3466 -215561 83755 -185511 124112 20977 -367088 97235 -164970 -43185 -13292
15605 -264963 -180914 152238 -109139 -66144 -257009 -278425 120914 163866 -14323 5154 266844
15594 266844 -113065 -221010 5955 97478 148634 125533 35941 -62639 -144852 -443087 -126139
15582 -209638 -319763 -20481 -101515 -131983 -296965 72784 211036 -183270 204283 -379504
15571 -89653 -77857 -564528 -142333 9044 -5160 -15322 -191548 -28446 -116182 -86032 181138
15559 1402 57187 -18121 -353644 124744 130040 24884 7090 -6334 70834 23157 54689 374757
$$ packed form
15640e2319A56534g6071J6549k456j23618A86902a62444j0308f6200j96640A90777
15628h0502c734A52127B9560a76312N3249C7617c2955j28426g6958L3972r3968
15617a36954C466b15561H3755a85511A24112B0977c67088I7235a64970d3185a3292
15605b64963Q4049A52238a09139M2995j90865k1416A20914M2952a4323E154K61690
15594B66844a13065j07945E955R1523N1156k3101C5941f2639q2213k98235a26139
15582b09638j10125b0481q1034l0468j64982G2784J38252a83270B04283c79504
15571h9653J1796m86671a42333I044e160j0162j76226b8446q7736L0150A81138
15559A402N5785a8121l35523A24744N296B4884G090f334G0834B3157L1532L20068
$$ plain form
15547 374757 143021 10312 -76884 -966 105689 -90320 -21815 44578 550523 -9410 63112
15535 -193190 -193548 -15070 -280876 131265 -87832 290137 223283 -119103 -123611 -35615 -13657
15523 -149319 364611 -67246 67851 99607 -65647 -179757 70583 127659 20442 -3799 -235354
15512 -235354 -63800 -78946 108876 -153068 11628 -161368 204540 76049 -46830 148781
15501 340579 7755 193003 189098 120657 355419 8502 -153302 129400 33287 139144 267087
15490 267087 243541 134552 165413 289426 83749 434546 166136 -2243 286886 -158036
15479 226250 104549 131654 171113 137075 -288418 -225021 -86520 339807 260127 -920 -75250
15468 -75250 -142310 197002 193188 -21793 192416 52299 166858 280021 263876 404578 734974
$$ packed form
15547C74757A43021A0312g6884i66A05689i0320b1815D4578N05945i410F3112
15535a93190l58a5070k65806A31265h7832B90137o6854a19103m508c5615a3657
15523a49319C64611f7246F7851L1756f5647j14110G0583N7076B0442c799k31555
15512b35354f3800j5146A08876a53068A1628a61368B04540G6049d6830A48781
15501C40579G755J85248l905o8441K34762H502a53302A29400C3287J05857J27943
15490B67087k3546j08989L0861J24013H3749L50797A66136b243B86886a58036
15479B26250A04549K7105L9459l4038b88418O3397h6520C39807p9680i20p4330
15468g5250o7060A97002l814b1793A92416E2299J14559J13163j6145J40702L30396
$$ plain form
15457 734974 466510 246168 536664 285623 22102 -145331 251235 42981 -37687 43879
15446 107024 131551 17268 136560 4634 256121 -11265 220568 -11078 -233436 -21607 -96652
15435 -96652 -11970 173282 173063 -139333 30392 82337 356265 129116 681249 726103 950987
15424 950987 1062133 647045 528315 493025 118979 15769 140894 230151 -3137 -94925 55054
15412 323400 38565 -188196 -103220 174889 64106 297720 43403 248557 -11603 -100780 374619
15400 -344051 121458 -114277 -59920 -240216 100228 47621 -174917 134212 340118 -110067
15389 192497 180108 -149558 -80796 69085 62925 -308677 159409 -387507 32922 -234179 118522
15377 8351 141710 487425 -31476 -46509 35427 205743 39430 76094 -23590 87296 306920
$$ packed form
15457G34974k68464k20342K90496k51041B2102a45331B51235D2981c7687D3879
15446A07024K4527A7268J19292D634K51487a1265B20568a1078k22358b1607p5045
15435i6652a1970A73282k19a39333C0392N1945K73928A29116N52133M4854K24884
15424I50987J11146m15088j18730l5290A18979A5769J25125Q9257c137r1788E5054
15412C23400C8565a88196Q4976A74889F4106K33614D3403K05154a1603q9177C74619
15400c44051A21458a14277N4357j80296A00228D7621a74917A34212K05906a10067
15389A92497j2389a49558O8762F9085o160c08677A59409c87507C2922b34179A18522
15377H351J33359L45715c1476j5033C5427J70316C9430L6664b3590H7296K19624
$$ plain form
15366 306920 139271 41081 86829 112827 -15891 36933 174804 238436 149252 187972 256990
15355 256990 300665 60350 79953 12987 138980 178111 496770 -130228 -108103 211921 272796
15344 272796 114501 -156166 380332 471297 76981 482475 124303 64 350238 269591 354273
15333 354273 39947 -108750 183345 163539 281541 381124 202294 554331 337218 366526
15323 366526 237805 338379 460464 201241 158623 78722 220919 7661 231204 40393
15312 312759 558894 61079 571213 160527 191523 355776 260516 56880 -173575 167799
15301 352945 369460 217626 -104787 -120348 222934 67619 182799 338152 35487 132870
15291 132870 262166 -130905 113489 -165039 -111290 265364 30534 27382 224877 -158195
$$ packed form
15366C06920A39271D1081M5748K5998a5891C6933J37871O3632q9184L8720O9018
15355B56990M3675F0350J9603A2987J25993L9131L18659a30228K2125B11921O0875
15344B72796A14501a56166C80332R0965G6981M05494A24303F4L50174q0647Q4682
15333C54273C9947a08750A83345j9806J18002R9583j78830L52037k17113K9308
15323C66526j28721J00574J22085B01241m2618G8722J42197G661K23543D0393
15312C12759K46135F1079N10134A60527L0996J64253r5260E6880a73575A67799
15301C52945J6515j51834a04787j5561B22934F7619J15180J55353C5487R7383
15291A32870J29296a30905A13489a65039N3749B65364C0534l152J97495a58195
$$ plain form
15280 248612 121490 360959 242844 112342 124582 228755 132348 -81670 -48141 340609
15269 118182 -120176 5295 -84306 -98321 15427 68188 -41200 -139382 -87612 -158715 36047
15257 76394 -38249 19459 96618 26579 85571 168982 -8232 5939 -163296 -10272 -150406 50340
15244 100389 226243 73799 -39281 264088 -144694 29988 -76906 -27251 -12523 -304922 92332
15232 471772 250487 -55292 497407 433707 884361 1841846 1277775 973745 1122347 602403
15222 602403 43082 257102 152909 114993 270137 338889 -67682 79960 -44170 -14573 335339
15210 218366 -217653 29368 -155271 135362 -157775 132821 33189 335435 99336 -133330
15199 273661 159500 41920 123870 -175650 -23496 -3639 241219 348633 113045 222793
$$ packed form
15280B48612A21490K39469j18115A12342J2240J04173r6407h1670L3529C40609
15269A18182a20176E295h4306j4015A5427N2761d1200r8182N1770p1103C6047
15257G6394c8249A9459P7159B6579N8992Q3411h232E939a63296a0272j40134E0340
15244A00389J25854G3799c9281B64088a44694B9988g6906b7251a2523k92399I2332
15232D71772k21285e5292D97407o3700M50654R57485n64071l04030J48602n19944
15222F02403D3082K14020j04193l7916J55144O8752f7682G9960d4170a4573C35339
15210B18366b17653B9368a55271A35362a57775A32821C3189L02246I9336a33330
15199B73661j14161D1920Q1950a75650b3496c639B41219J07414A13045J09748
$$ plain form
15189 222793 191970 -275196 -286049 22376 505839 383465 125286 -184016 -197397 82898
15178 238003 113882 -145195 463384 92007 73851 -168946 -72662 152307 170612 245774
15168 245774 351038 167083 198570 -43917 322449 184436 73189 335713 -56157 -82678
15158 -82678 178920 38811 -64832 26790 17890 134648 141292 -151 636695 187125 -127617
15146 67951 37815 19889 212529 97523 190148 59885 322615 76633 65414 123906 -169696
15134 46918 13925 291085 91293 269319 270667 73122 303440 73464 253917 32674 7154
15122 157189 -161767 114043 246629 242195 59242 425278 52744 368262 23745 224134
15112 224134 -54542 24300 -53141 -109803 115250 156330 181679 390305 696791 504521 493484
$$ packed form
15189B22793l0823b75196j0853B2376M83463j22374A25286a84016j3381H2898
15178B38003A13882a45195D63384I2007j8156a68946g2662A52307J8305P5162
15168B45774J05264A67083L1487d3917C22449j38013G3189K62524e6157k6521
15158h2678A78920C8811f4832B6790q900J16758O644a51F36695A87125a27617
15146F7951l0136j7926J92640I7523R2625E9885K62730G6633j1219N8492a69696
15134D6918A3925K77160I1293J78026J348G3122K30318G3464J80453C2674G154
15122A57189a61767A14043J32586m434E9242L66036E2744L15518B3745K00389
15112B24134e4542B4300e3141n6662A15250M1080K5349K08626L06486j92270j1037
$$ plain form
15101 493484 307067 208944 -105840 47656 346003 122199 242832 354718 114878 204595
15091 204595 -29098 84080 318690 184990 -109326 182222 474166 -175261 65342 120961
15081 120961 -36335 92308 516552 403161 235047 298749 331849 45036 110715 -13110 44637
15069 234257 206842 7727 295595 49554 129415 47791 87443 -168920 316055 386406 198402
15058 198402 288346 168757 -78185 189602 372880 521644 129239 385137 -24415 -210951
15048 -210951 462488 429618 416327 394286 480146 238576 658770 348473 297174 298250 262391
15037 262391 504517 372416 616821 184435 406008 405270 304275 263025 -59959 148377
15026 36423 406435 288731 396198 422637 400124 315584 188126 543317 307419 299595 398998
$$ packed form
15101D93484j86417r8123a05840D7656K98347A22199J20633J11886A14878Q9717
15091B04595b9098H4080K34610j33700a09326A82222K91944a75261F5342N5619
15081A20961c6335I2308M24244j13391j68114O3702L3100D5036O5679a3110D4637
15069B34257k7415G727K87868D9554P9861D7791L9652a68920C16055P0351j88004
15058A98402Q9944j19589g8185A89602J83278J48764A29239K55898b4415j86536
15048b10951D62488l2870j3291k2041Q5860B38576M20194l10297n1299J076l5859
15037B62391K42126j32101K44405A84435K21573p38j00995m1250e9959A48377
15026C6423L70012j17704J07467K6439k2513q4540j27458L55191k35898p824R9403
$$ plain form
15015 398998 572365 927759 554401 492156 970303 399706 441675 459819 548169 458912
15005 458912 390007 554984 505278 290693 403323 224406 279308 286039 706268 457192
14995 457192 482724 470991 498494 721873 480083 167302 441218 443412 404315 297044 327387
14984 327387 374617 578459 706032 443277 408532 490373 428761 278633 414684 514256
14974 514256 369908 440966 737630 765084 454402 785262 609183 1049395 845608 607657
14964 607657 527186 985798 368565 669637 367994 639098 722240 493185 729876 679819
14954 679819 429089 374667 440685 440536 373688 529734 321659 535981 399751 307972 77349
14942 435645 463175 245245 226909 717163 795850 397765 332031 269570 545135 292716
$$ packed form
15015C98998J73367L55394l73358o2245M78147C99706M1969J8144Q8350q9257
15005D58912o8905J64977m9706k14585J12630j78917N4902O731M20229k49076
14995D57192K5532j1733K7503K23379k41790A67302K73916K194l9097j07271L0343
14984C27387M7230K03842J27573k62755l4745Q1841o1612j50128J36051R9572
14974E14256j44348P1058K96664K7454l10682L30860j76079M40212k03787k37951
14964F07657q0471M58612C68565L01072l01643K71104Q3142k29055K36691n0057
14954F79819k50730n4422O6018j49o6848J56046k08075K14322j36230r1779G7349
14942D35645K7530k17930j8336M90254P8687C97765o5734o2461K75565k52419
$$ plain form
14932 292716 278124 419045 500661 701598 309749 785546 657134 450352 388321 399374
14922 399374 299636 634142 242729 483036 626061 605217 747876 775119 1074859 1059712
14912 1059712 1092122 1643343 1705083 1789049 1334934 1728527 1691752 1421055 1501627 1804895
14902 1804895 2048689 2218714 1943305 1730112 1560330 1325488 1128396 1187078 800032 854622
14892 854622 647204 627850 567300 610882 448364 645306 626187 587256 646469 418619 548826
14881 548826 630169 404312 186346 420689 662073 659203 589427 444065 756266 903130
14871 903130 562811 516967 823688 929880 674229 1097876 716562 813082 963887 739618
14861 739618 883603 341976 695396 876039 550575 746045 373882 508169 265084 400817
$$ packed form
14932B92716j4592J40921Q1616K00937C09749M75797j28412k06782o2031J1053
14922C99374r9738L34506B42729K40307J43025k0844J42659K7243K99740j5147
14912A059712L2410N51221O1740Q3966m54115L93593l6775k70697Q0572L03268
14902A804895K43794J70025k75409k13193j69782k34842j97092N8682l87046N4590
14892H54622k07418j9354o0550M3582j62518J96942j9119l8931N9213k27850J30207
14881E48826Q1343k25857A86346K34343K41384k870o9776j45362L12201J46864
14871I03130l40319m5844L06721J06192k55651M23647l81314R6520J50805k24269
14861G39618J43985C41976L53420J80643l25464J95470l72163J34287k43085J35733
$$ plain form
14851 400817 815679 799582 816972 611790 538077 349905 477715 555910 499989 661753
14841 661753 571441 692860 537498 428016 218251 639706 458414 604553 509781 573938
14831 573938 546445 800355 770685 792315 761040 1069701 1314322 1118958 1112176 1322569 1055819
14820 1055819 795088 976633 676508 456617 475265 628969 601230 307545 292916 740507
14810 740507 524814 792132 653715 775048 854621 816429 845686 643384 778134 725771
14800 725771 881929 811639 740366 898975 685016 941066 740831 570432 774613 694314
14790 694314 1014969 1205033 975541 736726 943295 670917 742982 641743 642477 281219
14779 429096 943099 569641 588393 779387 751969 568743 460614 90979 506854 661784
$$ packed form
14851D00817M14862j6097J7390k05182p3713j88172J27810P8195n5921J61764
14841F61753r0312J21419j55362j09482k09765M21455j81292J46139r4772O4157
14831E73938k7493K53910k9670K1630l1275L08661K44621j95364o782K10393k66750
14820A055819k60731J81545l00125k19891J8648J53704k7739k93685j4629M47591
14810G40507k15693K67318j38417J21333P9573l8192K9257k02302J34750n2363
14800G25771J56158p0290p1273J58609k13959K56050k00235j70399K04181q0299
14790F94314L20655J90064k29492k38815K06569k72378P2065j01239P34B81219
14779D29096N14003l73458J8752J90994k7418j83226j08129I0979M15875J54930
$$ plain form
14769 661784 708725 598312 686732 729243 815442 691720 864577 966115 1104950 923586
14759 923586 980647 859346 895189 1138349 597878 834195 570354 940961 704932 606792
14749 606792 758334 782013 619057 278868 621345 748211 848467 559961 665828 498029
14739 498029 849000 507467 823408 847732 537296 365120 556117 419739 974711 488680
14729 488680 533783 664013 279241 660278 652254 777086 560542 905948 588650 788848
14719 788848 975911 851999 997269 1145982 1200387 1224993 1443699 1312128 1594306 1769786
14709 1769786 1592454 1469776 1094521 1171666 1135303 1255670 938550 869619 1117376 619073
14699 619073 778375 1067100 921508 1233080 969628 750345 720220 1111455 816472 1136522
$$ packed form
14769F61784M6941j10413Q8420M2511Q6199j23722J72857J01538J38835j81364
14759I23586N7061j21301L5843K43160n40471K36317k63841L70607k36029r8140
14749F06792J51542K3679j62956B78868L42477J26866J00256k88506J05867j67799
14739D98029L50971l41533L15941K4324l10436j72176J90997j36378N54972m86031
14729D88680M5103J30230B79241L81037q024J24832k16544L45406l17298K00198
14719G88848J87063j23912J45270J48713N4405K4606K18706j31571K82178J75480
14709A769786j77332j22678l75255P7145l6363J20367l17120o8931K47757m98303
14699F19073J59302K88725j45592L11572k63452k19283l0125L91235k94983L20050
$$ plain form
14689 1136522 1321880 1391419 1410110 1726696 1724598 1903604 1614689 1612068 1549154 1236336 1259503
14678 1259503 985276 1335352 911028 927384 1042890 748193 918482 1072195 962741 1142288
14668 1142288 722451 731745 867991 865928 918397 1031027 1120588 975220 1094233 821212
14658 821212 1065764 1057154 1038013 783258 1080798 1046268 1408383 857819 1448004 877633
14648 877633 1221122 1338242 976804 1022855 1326144 1057777 861012 1160151 1221901 1160924
14638 1160924 1326851 1441012 1378266 1863827 1243241 1213739 1034805 1405213 1134118 1337093
14628 1337093 1355377 1493611 804880 1014981 1304946 1191200 1402274 1360759 1257197 1172715
14618 1172715 1553089 1479800 1248339 849176 1600386 1189708 1307930 1453744 1214839 1346241
$$ packed form
14689A136522J85358O9539J8691L16586k098J79006k88915k621o2914l12818K3167
14678A259503k74227L50076m24324J6356J15506k94697J70289J53713j09454J79547
14668A142288m19837R294J36246k063N2469J12630Q9561j45368J19013k73021
14658H21212K44552q610j9141k54755K97540l4530L62115n50564N90185n70371
14648H77633L43489J17120l61438M6051L03289k68367j96765K99139O1750o0977
14638A160924J65927J14161o2746M85561o20586k9502j78934L70408k71095K02975
14628A337093J8284J38234o88731K10101K89965j13746K11074m1515j03562q4482
14618A172715L80374p3289k31461l99163P51210m10678J18222J45814k38905J31402
$$ plain form
14608 1346241 1263312 1530981 1172117 935995 1459965 1586886 1434396 1506536 1473128 1614980
14598 1614980 1572670 1226783 1834252 1515474 1524414 1432597 1786126 1689843 1816600 1476329
14588 1476329 1545601 1847099 1785711 1833671 1628436 1587635 1605752 1547632 1742661 1534903
14578 1534903 2167691 1868727 1576108 1887739 2207533 2038856 1732029 1686442 1769935 1496491
14568 1496491 1605722 1717949 2071561 1820713 2105146 1772678 1994610 1937787 2025279 2050178
14558 2050178 2419579 2271016 2128186 2431740 2397507 2354686 2279334 2221132 2545492 2483165
14548 2483165 2413212 2746229 2251188 2942218 3298991 3200104 3155355 3399273 3668298 3798502
14538 3798502 4402043 5086196 5870953 7263951 9728828 14331910 20581391 31612814
$$ packed form
14608A346241q2929K67669l58864k36122N23970J26921j52490P2140l3408J41852
14598A614980m2310l45887O07469l18778Q940r1817L53529r6283J26757l40271
14588A476329O9272L01498o1388M7960k05235m0801J8117n8120J95029k07758
14578A534903O32788k98964k92619L11631L19794j68677l06827m5587Q3493k73444
14568A496491J09231J12227L53612k50848K84433l32468K21932n6823Q7492K4899
14558B050178L69401j48563j42830L03554l4233m2821p5352n8202L24360o2327
14548B483165o9953L33017m95041O91030L56773r8887m4749K43918K69025J30204
14538C798502O03541O84153P84757J392998K464877M603082O249481J1031423
$$ plain form
14530 31612814 32807925 18796555 11553061 7237326 5374066 4732936 4792238 4978673
14522 4978673 4567803 3575098 2757713 2590234 2476180 2527838 2432975 2446841 2644623 2351844
14512 2351844 2436861 2474334 2482185 2477744 2568373 2447092 2514823 2750532 2210843 2653653 2831832
14501 2831832 2693691 2576213 2720655 2660744 3001243 2709403 2707269 2960541 2876546 3069641
14491 3069641 2983351 3257302 3150929 2978764 3372278 3009603 2879727 3349167 2983408 3265302
14481 3265302 3268779 3435857 3453452 3343268 3595841 3607218 3699057 3286718 3751039 3728733
14471 3728733 3793712 3692701 3733793 3897179 3780544 3793595 3789479 3974532 3909162 3833013 4070954
14460 4070954 4010808 4084495 4343241 4553440 4376642 4730718 4363993 4294174 5107395 4661009
$$ packed form
14530C1612814J195111j4011370p243494m315735j863260o41130N9302J86435
14522D978673m10870r92705q17385j67479j14054N1658r4863J3866J97782k92779
14512B351844Q5017L7473P851m441R0629j21281O7731K35709n39689M42810J78179
14501B831832j38141j17478J44442n9911L40499k91840k134K53272q3995J93095
14491C069641q6290K73951j06373j72165L93514l62675j29876M69440l65759K81894
14481C265302L477J67078J7595j10184K52573J1377R1839m12339M64321k2306
14471C728733O4979j01011M1092J63386j16635J3051m116J85053o5370p6149K37941
14460D070954o0146P3687K58746K10199j76798L54076l66725o9819Q13221m46386
$$ plain form
14450 4661009 4742459 4864720 4985363 4807528 4868914 4893111 5118230 4935721 4862430 5125695
14440 5125695 4955604 5408416 5436766 5608109 5566157 5681717 5502753 5609903 5636961 6229384
14430 6229384 6047401 5924738 6369876 5906374 6092688 6110481 6276573 6469361 6767053 6736351
14420 6736351 6777206 6837234 6996146 7017789 7516630 7343861 6988339 7241020 7737814 7472916
14410 7472916 7686981 8096324 7855781 7891023 8079529 8354862 8556619 8835766 8666794 9107854
14400 9107854 8994300 9129642 9396076 9055044 9528711 9305024 9714088 9676257 9640476 10233033
14390 10233033 10253563 10744615 11044938 10880598 11025512 11070090 11030847 11384170 11670412 11464638
14380 11464638 11681079 12105964 11890743 12554708 12757060 12884432 12748833 13167825 13471360
$$ packed form
14450D661009Q1450J22261J20643j77835O1386K4197K25119j82509p3291K63265
14440E125695j70091M52812K8350J71343m1952J15560j78964J07150K7058N92423
14430F229384j81983j22663M45138m63502J86314J7793J66092J92788K97692l0702
14420F736351M0855O0028J58912K1643M98841j72769l55522K52681M96794k64898
14410G472916K14065M09343k40543L5242J88506K75333K01757K79147j68972M41060
14400I107854j13554J35342K66434l41032M73667k23687M09064l7831l5781N92557
14390A0233033K0530M91052L00323j64340J44914M4578l9243L53323K86242k05774
14380A1464638K16441M24885k15221O63965K02352J27372j35599M18992L03535
$$ plain form
14371 13471360 13761215 13917759 14306342 14542895 14843162 15179194 15669072 15874933 16061701
14362 16061701 16407020 16402211 16930023 17220754 17451712 17894958 18158163 18711946 19126149 19092400
14352 19092400 19474562 20446512 20714571 21035777 21635020 22012670 22186313 22822767 23319767
14343 23319767 23863886 24301888 24794289 25484561 26054521 26764745 27222749 28153473 28739926
14334 28739926 29185447 30051860 30903873 31667176 32491705 33357448 33993102 35100704 36259784
14325 36259784 37108237 38178228 39353332 40733342 41660683 42605511 44091430 45285479
14317 45285479 46945129 48380176 49837502 51709689 53407210 55018341 56878587 58787766
14309 58787766 60914328 63240852 65548064 67814872 70235001 72979610 75638884 78379736
$$ packed form
14371A3471360K89855J56544L88583K36553L00267L36032M89878K05861J86768
14362A6061701L45319m809N27812K90731K30958M43246K63205N53783M14203l3749
14352A9092400L82162R71950K68059L21206N99243L77650J73643O36454M97000
14343B3319767N44119M38002M92401O90272N69960P10224M58004R30724N86453
14334B8739926M45521Q66413Q52013P63303Q24529Q65743O35654J107602J159080
14325C6259784Q48453J069991J175104J380010R27341R44828J485919J194049
14317D5285479J659650J435047J457326J872187J697521J611131J860246J909179
14309E8787766K126562K326524K307212K266808K420129K744609K659274K740852
$$ plain form
14301 78379736 81322702 84331036 87885701 91576108 95041712 99021279 103541585 107422407
14293 107422407 112491628 117380157 122679011 128451528 134482708 141163446 147664682 154831722
14285 154831722 162498390 170757989 179269638 187966385 197877700 207721265 218531277 229743463
14277 229743463 241762228 253816342 267231167 280990466 295379046 310293687 325215030
14270 325215030 340281039 355433188 369846395 384231344 398702841 412602020 425293687
14263 425293687 436601656 446012554 454619189 461968389 468038536 469726211 468834128 468709042
14255 468709042 469422415 465721841 457177520 449739406 441636960 430201734 418899996 406260376
14247 406260376 393100927 379375465 365005212 351002173 336626362 323252790 309362654
$$ packed form
14301G8379736K942966L008334L554665L690407L465604L979567M520306L880822
14293A07422407N069221M888529N298854N772517O031180O680738O501236P167040
14285A54831722P666668Q259599Q511649Q696747R911315R843565J0810012J1212186
14277B29743463J2018765J2054114J3414825J3759299J4388580J4914641J4921343
14270C25215030J5066009J5152149J4413207J4384949J4471497J3899179J2691667
14263D25293687J1307969R410898Q606635P349200O070147J687675q92083j25086
14255D68709042P13373l700574q544321p438114q102446j1435226j1301738j2639620
14247D06260376j3159449j3725462j4370253j4003039j4375811j3373572j3890136
$$ plain form
14240 309362654 295492331 281977537 269082066 256916887 244970018 234093988 222992371
14233 222992371 212673282 202010385 191238394 181587868 172511573 163968606 156008508
14226 156008508 148554744 141686204 134980439 128878743 123497347 118031080 112784136 107851190
14218 107851190 103455052 99121140 95571378 91533090 87722152 84273695 81229028 78068074
14210 78068074 74792753 72313802 69813815 67637808 64944114 62831575 60702999 58736528
14202 58736528 56735924 54826242 53316307 51447179 50277915 48522998 47213950 45613119
14194 45613119 44442666 43273634 42187737 41131207 40214092 38632320 37564271 36644558
14186 36644558 35864759 35010250 34251197 33172381 32183828 31475983 30566967 29785621 29364327
$$ packed form
14240C09362654j3870323j3514794j2895471j2165179j1946869j0876030j1101617
14233B22992371j0319089j0662897j0771991r650526r076295q542967p960098
14226A56008508p453764o868540o705765o101696n381396n466267n246944m932946
14218A07851190m396138m333912l549762m038288l810938l448457l044667l160954
14210G8068074l275321k478951k499987k176007k693694k112539k128576j966471
14202E8736528k000604j909682j509935j869128j169264j754917j309048j600831
14194D5613119j170453j169032j085897j056530r17115j581772j068049r19713
14186C6644558p79799q54509p59053j078816r88553p07845r09016p81346m21294
$$ plain form
14177 29364327 28506578 27635340 26985631 26622545 26258679 25163016 24740417 23952997 23399309
14168 23399309 22965785 22546270 22100285 21427226 21357768 20728214 20442500 19761191 19423949
14159 19423949 19072467 18723583 18386556 18211793 17743549 17136108 16687679 16610288 16121087
14150 16121087 16191552 15660903 15201408 15112507 14622169 14699526 14766920 14106896 13762485 13966253
14140 13966253 13416160 13647475 13057735 12928205 12382256 12116753 12286328 11939279 11581077
14131 11581077 11234413 11480906 11052759 10963297 10729013 10494440 10703183 10506776 10186010
14122 10186010 9889665 10081352 9768126 9516834 9420161 9179014 9385518 9181127 8771020
14113 8771020 9078245 8797008 9054864 8702700 8656062 8199974 8114930 7953884 7984301 7820878
$$ packed form
14177B9364327q57749q71238o49709l63086l63866j095663m22599p87420n53688
14168B3399309m33524m19515m45985o73059o9458o29554k85714o81309l37242
14159A9423949l51482l48884l37027j74763m68244o07441m48429p7391m89201
14150A6121087P0465n30649m59495q8901m90338P7357O7394o60024l44411K03768
14140A3966253n50093K31315n89740j29530n45949k65503J69575l47049l58202
14131A1581077l46664K46493m28147q9462k34284k34573K08743j96407l20766
14122A0186010k96345J91687l13226k51292r6673k41147K06504k04391m10107
14113H771020L07225k81237K57856l52164m6638m56088q5044j61046L0417j63423
$$ plain form
14103 7820878 7737680 7637593 7496504 7245054 7194926 7278535 7482103 6872852 6926033 6891459
14093 6891459 6700250 6812469 6823386 6721234 6271450 6568284 6283410 6594895 6347101 6254349
14083 6254349 6147186 6124585 5719365 6010012 5814972 5574760 5775368 5585112 5309659 5488748
14073 5488748 5242689 5611106 5321807 5315489 5067380 5233043 5130869 5109878 5206562 4923776
14063 4923776 4697987 4822336 5058158 4902379 4574603 4750826 4572633 4370871 4110426
14054 4110426 4535300 4242023 4544407 4086809 4252726 4194955 4072632 4167587 4112968 4181272
14044 4181272 4474925 4189329 4194119 3991574 3880616 3968023 3734973 3796277 3691165 3424561
14034 3424561 3650702 3658975 3718574 3551541 3622381 3656970 3268999 3316789 3330178 3429069 3241369
$$ packed form
14103G820878q3198j00087j41089k51450n0128Q3609K03568o09251N3181l4574
14093F891459j91209J12219J0917j02152m49784K96834k84874L11485k47794r2752
14083F254349j07163k2601m05220K90647j95040k40212K00608j90256k75453J79089
14073E488748k46059L68417k89299o318k48109J65663j02174k0991R6684k82786
14063D923776k25789J24349K35822j55779l27776J76223j78193k01762k60445
14054D110426M24874k93277L02384m57598J65917n7771j22323R4955n4619O8304
14044D181272K93653k85596M790k02545j10958Q7407k33050O1304j05112k66604
14034C424561K26141Q273N9599j67033P0840L4589l87971M7790J3389R8891j87700
$$ plain form
14023 3241369 3046447 3248561 3009375 3472907 3164848 3211085 3289082 3233668 2911076 3103373
14013 3103373 3352162 2784104 2527703 2584797 2911306 3125689 3131432 2882932 2535226 2799397
14003 2799397 2723322 2712797 2708289 2433612 2441572 2222075 2521055 2511946 2631405 2604129 2287995
13992 2287995 2577332 2516677 2302076 2532610 2236103 2563893 2019366 2112011 2146757 2373850
13982 2373850 2418679 2482404 2442280 2433708 2612961 3074586 3684461 4364495 6296233 9670074
13972 9670074 15097079 26393663 34956301 22830782 15482178 10516936 7937117 6240517
13964 6240517 4935133 4788679 4392184 4070569 3369161 3521154 3326546 2781079 2952637
13955 2952637 2792313 2839315 2752934 2578625 2594412 2734615 2461863 2543636 2536459 2154791
$$ packed form
14023C241369j94922K02114k39186M63532l08059M6237P7997n5414l22592J92297
14013C103373K48789n68058k56401N7094L26509K14383N743k48500l47706K64171
14003B799397p6075j0525m508k74677P960k19497K98980r109J19459k7276l16134
13992B287995K89337o0655k14601K30534k96507L27790n44527R2645L4746K27093
13982B373850M4829O3725m0124q572J79253M61625O09875O80034J931738L373841
13972I670074N427005J1296584Q562638j2125519p348604m965242k579819j696600
13964F240517j305384j46454l96495l21615p01408J51993j94608n45467J71558
13955B952637j60324M7002q6381j74309J5787J40203k72752Q1773p177l81668
$$ plain form
13945 2154791 2646911 2058503 2167667 2035022 2015262 2255309 2027452 2053509 1943699 1901442
13935 1901442 2079775 1851403 1757757 1987768 2268547 1970563 1688249 1889788 1885671 1655311
13925 1655311 1876428 1578827 1836626 1591298 1675101 1505426 1684349 1715638 1665860 1936764
13915 1936764 1205888 1787041 1720894 1474742 1718721 1444407 1402269 1684207 1738155 1487616
13905 1487616 1507144 1687063 1278480 1520743 1731258 1451214 1578648 1297382 1564869 1488975
13895 1488975 1301326 1380986 1502578 1368535 1134261 1424405 1393943 1697847 1667613 1350037
13885 1350037 1165363 1751491 1316064 1333391 1243644 1312783 1512332 1313555 1522657 931603
13875 931603 1396142 1312461 1270307 1343808 1192265 1439352 1313223 1120846 940884 1435718
$$ packed form
13945B154791M92120n88408J09164j32645j9760K40047k27857K6057j09810m2257
13935A901442J78333k28372r3646K30011K80779k97984k82314K01539m117k30360
13925A655311K21117k97601K57799k45328Q3803j69675J78923L1289m9778K70904
13915A936764p30876N81153o6147k46152K43979k74314m2138K81938N3948k50539
13905A487616J9528J79919m08583K42263K10515k80044J27434k81266K67487p5894
13895A488975j87649P9660J21592j34043k34274K90144l0462L03904l0234l17576
13885A350037j84674N86128m35427J7327q9747O9139J99549j98777K09102n91054
13875I31603M64539q3681m2154P3501j51543K47087j26129j92377j79962M94834
$$ plain form
13865 1435718 871500 868714 1091041 1138891 1371649 977550 1239094 1331464 1050626 934094
13855 934094 1543688 1318217 1191994 914808 1061672 1172124 1155231 1008142 1285583 1320161
13845 1320161 1231820 938556 875903 986680 758440 1252584 823636 1128762 869147 1238140
13835 1238140 753563 912396 1307467 945270 1065815 1042207 698445 765967 921469 691350
13825 691350 963479 872856 981424 734473 903673 972034 773807 825138 921545 1160702
13815 1160702 850089 897477 869236 1025087 1060444 636496 656335 860551 1250155 920316
13805 920316 1014006 802563 1030345 917376 834851 1143227 935872 796472 941204 934333
13795 934333 1159834 764187 910536 1192852 818416 976020 930874 662134 353189 931622
$$ packed form
13865A435718n64218k786K22327M7850K32758l94099K61544R2370k80838j16532
13855I34094O09594k25471j26223k77186J46864J10452j6893j47089K77441L4578
13845A320161q8341k93264o2653J10777k28240M94144m28948L05126k59615L68993
13835A238140m84577J58833L95071l62197J20545k3608l43762O7522J55502k30119
13825F91350K72129r0623J08568k46951J69200O8361j98227N1331R6407K39157
13815A160702l10613M7388k8241J55851L5357m23948J9839K04216L89604l29839
13805I20316R3690k11443K27782j12969q2525L08376k07355j39400J44732o871
13795I34333K25501l95647J46349K82316l74436J57604m5146k68740l08945N78433
$$ plain form
13785 931622 1100534 524514 614991 793296 739250 604934 825327 676657 889831 972438
13775 972438 1144085 1114933 606212 922748 422475 624927 784760 597010 899284 605177
13765 605177 849213 638116 650929 839030 619571 754172 894198 449383 680267 960079
13755 960079 773233 979637 968569 960052 881821 860254 829447 702204 754804 761028 960010
13744 960010 939570 729509 652349 818818 582150 531038 532162 628312 803363 717324 720996
13733 720996 523581 431227 375534 841324 1037321 657938 593117 577345 563715 738444
13723 738444 526807 914567 619634 565937 1035331 449551 343776 644856 342813 548970
13713 548970 545747 636931 401955 556411 558563 307710 464840 981142 748996 383895
$$ packed form
13785I31622J68912E24514R0477J78305n4046j34316K20393j48670K13174Q2607
13775I72438J71647k9152n08721L16536D22475K02452J59833j87750L02274k94107
13765F05177K44036k11097J2813J88101k19459J34601J40026m44815K30884K79812
13755I60079j86846K06404j1068q517p8231k1567l0807j27243N2600O224J98982
13744I60010k0440k10061p7160J66469k36668n1112J124R6150J75051q6039L672
13733G20996j97415r2354n5693M65790J95997l79383o4821j5772j3630J74729
13723G38444k11637L87760k94933n3697M69394D49551j05775L01080l02043K06157
13713E48970l223R1184k34976J54456K152k50853J57130N16302k32146l65101
$$ plain form
13703 383895 378171 340312 849962 635907 368296 611886 735697 630025 845216 521550
13693 521550 618986 654697 576106 556271 528404 444610 334715 478567 410335 448617 386830
13682 386830 663983 472508 413080 412700 501829 536304 547487 284489 458641 448095 632231
13671 632231 916463 447430 560856 292260 776024 509872 440512 421819 809184 380028
13660 336501 302923 322377 389177 720235 898593 752805 500540 499737 737934 269774 110886
13648 272919 293992 408930 530378 308771 438235 414977 646459 579496 443280 387318
13638 387318 449273 588602 390070 198300 497181 476403 493304 475937 511206 601049 413225
13627 413225 617168 401479 498386 319613 154526 347021 148835 439165 331932 410423
$$ packed form
13703C83895n724l7859N09650k14055k67611K43590J23811j05672K15191l23666
13693E21550R7436L5711p8591j9835k7867q3794j09895J43852o8232L8282o1787
13682C86830K77153j91475n9428l80Q9129L4475J1183k62998J74152j0546J84136
13671F32231K84232D47430J13426k68596M83764k66152o9360j8693L87365C80028
13660C36501l3578J9454O6800L31058J78358j45788k52265q03K38197B69774A10886
13648B72919K1073J14938J21448k21607J29464k3258K31482o6963j36216n5962
13638C87318O1955J39329j98532j91770K98881k0778J6901j7367L5269Q9843j87824
13627D13225K03943k15689R6907j78773A54526J92495A48835K90330j07233P8491
$$ plain form
13617 410423 240064 193424 434930 395775 584019 391839 584131 745711 603674 504939
13607 504939 408334 466472 492724 256434 382970 459608 489602 306173 627226 352673
13597 352673 636386 670411 133879 369259 221493 488658 325937 547047 335783 159024
13586 607999 399747 317641 703908 248811 274347 441315 88573 105334 247704 245798 346034
13575 346034 509248 84736 412712 252407 229622 72618 170050 278042 416845 380693
13565 380693 578390 229171 438722 365761 546825 385932 182676 325651 474692 165795
13554 593039 415839 213608 26245 207455 123972 467127 322028 530248 413030 380383
13544 380383 95264 252413 369550 132733 395277 480670 -84728 27660 701466 267003
$$ packed form
13617D10423j70359m6640K41506l9155J88244j92180J92292J61580j42037r8735
13607E04939r6605N8138K6252k36290J26536P6638K9994j83429L21053k74553
13597C52673K83713L4025A33879K35380j47766K67165j62721K21110k11264A59024
13586F07999k08252q2106L86267B48811K5536J66968H8573J6761J42370j906J00236
13575C46034J63214H4736L27976j60305k2785G2618R7432J07992J38803l6152
13565C80693J97697B29171K09551p2961J81064j60893A82676J42975J49041A65795
13554E93039j77200k02231B6245J81210q3483L43155j45099K08220j17218l2647
13544C80383I5264J57149J17137A32733K62544Q5393h4728B7660O73806B67003
$$ plain form
13533 376821 49966 303772 233346 193439 -93656 307147 392650 86246 329468 304125 20313
13521 193492 360245 396428 241790 448562 498603 381192 353363 306143 -147165 523149
13510 359442 143008 257035 574771 376297 451544 -92466 247012 250248 409206 71528
13499 69686 101662 289322 410188 339283 253823 116354 134053 34316 364440 334510 495253
13488 495253 436435 79092 336826 335037 438384 63861 233965 -43179 674379 125201 690077
13477 690077 349272 427377 199757 75628 234944 238599 -14722 431786 240314 304304 509389
13466 509389 31741 227107 333493 -180693 459398 180688 18826 34539 136392 163697
13456 163697 500067 196440 473022 175518 235530 287267 488975 350286 569462 438472
$$ packed form
13533C76821D9966K53806p0426l9907i3656C07147Q5503H6246K43222k5343B0313
13521A93492J66753L6183j54638K06772N0041j17411k7829m7220a47165E23149
13510C59442A43008J14027L17736j98474P5247i2466B47012L236J58958G1528
13499F9686L1976J87660J20866p0905q5460A16354J7699C4316L30124k9930J60743
13488D95253n8818G9092K57734j789J03347F3861J70104d3179F74379A25201N64876
13477F90077l40805P8105A99757G5628J59316L655a4722D31786j91472O3990K05085
13466E09389C1741J95366J06386a80693D59398A80688A8826J5713J01853K7305
13456A63697L36370A96440K76582A75518O0012N1737K01708j38689K19176j30990
$$ plain form
13446 438472 54634 -2786 30707 198203 130259 360185 286771 225509 254230 358289 19403
13434 317208 227851 426597 502031 168753 141224 200793 80230 313362 413923 190284
13423 296837 249120 34252 375631 247480 328639 299581 9091 -47831 -3194 391167 155320
13411 42517 32419 -74561 165929 403918 239630 260533 71784 -153957 10798 410242 -33286
13399 111898 294626 2565 311663 268847 381866 155823 409514 38272 -41363 266528
13388 86340 433480 158638 180514 144289 303016 142192 75008 383634 77139 16336 23650
13377 23650 558980 115078 66432 92229 225896 397560 107710 118748 487186 329403
13367 329403 2318 228867 219588 73893 133705 20235 102585 26051 385442 262799 398250
$$ packed form
13446D38472E4634b786C0707J67496o7944K29926p3414o1262K8721J04059A9403
13434C17208q9357J98746P5434A68753k7529N9569H0230K33132J00561A90284
13423B96837m7717C4252L41379j28151Q1159k9058I091d7831c194C91167A55320
13411D2517j0098g4561A65929K37989j64288K0903G1784a53957A0798L99444c3286
13399A11898J82728B565L09098m2816J13019A55823K53691C8272d1363B66528
13388H6340L47140A58638K1876l6225J58727A42192o7184L08626G7139A6336P314
13377B3650N35330A15078m8646K5797J33667J71664A07710J1038L68438j57783
13367C29403B318K26549r279G3893N9812B0235Q2350B6051L59391j22643J35451
$$ plain form
13356 398250 290334 330918 31512 303173 8936 144022 29744 75136 363384 201233 516333
13345 516333 161406 314251 206550 102418 204852 153619 413294 -133556 528363 41424
13334 282579 481178 109016 292014 285900 213995 93230 350053 167250 126938 217567 143403
13323 143403 295424 280387 -3092 218761 214163 277978 319029 154509 87905 94852 -49074
13311 -6229 226856 133012 230680 114742 321318 19609 598071 588631 48539 322351 444326
13300 444326 88362 161118 126482 214530 -2855 -120128 -71548 -139541 375475 114751 275511
13289 275511 440989 151398 426740 349412 153935 -26001 28984 117706 208229 250397 -216195
13277 -17092 290753 388249 38317 471043 118388 12118 28078 213229 312743 91776 231466
$$ packed form
13356C98250j07916M0584C1512K71661H936J35086B9744M5392K88248j62151L15100
13345E16333A61406J52845j07701A02418J02434n1233K59675a33556E28363D1424
13334B82579J98599A09016J82998o114p1905I3230K56823A67250m0312R0629p4164
13323A43403J52021j5037c092B18761m598O3815M1051A54509o6604O947d9074
13311f229B26856r3844R7668A14742K06576A9609N78462r440D8539K73812J21975
13300D44326H8362P2756l4636Q8048b855j17273M8580o7993C75475A14751J60760
13289B75511J65478A51398K75342p7328A53935b6001B8984Q8722R0523M2168b16195
13277a7092B90753R7496C8317M32726A18388A2118J5960J85151R9514I1776J39690
$$ plain form
13266 231466 153082 41896 44870 428842 -655 251644 512896 -505448 -35344 151329 -122375
13254 185187 226987 501155 374101 154671 -48793 645949 115252 -207595 -1865 268986
13243 230933 6694 252813 100931 95833 -14459 25526 162068 163105 -90789 -38159 422826
13231 201873 -34116 -25121 -13567 355526 176179 29186 129804 16567 -138344 14516 116097
13220 116097 193457 111750 136980 151069 -24100 71990 -104613 -55010 -150085 128866 231951
13209 231951 -177782 270231 298893 385818 -367932 -99817 102640 1809 342743 136381
13198 140513 252145 53292 297808 -210146 261233 121350 -69508 -19014 18618 79663
13188 79663 -11753 379387 250937 95038 167575 219689 116461 27804 -126508 -76286 116031
$$ packed form
13266B31466p8384D1896K974L83972f55B51644K61252e05448c5344A51329a22375
13254A85187M1800K74168j27054A54671d8793F45949A15252b07595a865B68986
13243B30933F694K46119A00931n098a4459B5526J36542J037i0789c8159D22826
13231B01873c4116Q995J1554C55526A76179B9186J00618A6567a38344A4516J01581
13220A16097P7360q1707K5230J4089b4100G1990a04613M9603r5075A28866J03085
13209B31951a77782B70231K8662Q6925c67932i9817A02640A809L40934A36381
13198A40513J11632E3292K44516b10146B61233A21350f9508a9014A8618O1045
13188G9663a1753C79387j28450I5038P2537N2114j03228B7804a26508N0222A16031
$$ plain form
13176 -49473 168275 266077 365914 206655 74463 150575 -534347 6642 89397 168804 -35633
13164 109856 56371 -65275 38171 203978 -10401 250657 262301 -102318 -116451 53432 261359
13153 261359 -543125 99143 201371 114820 -35220 220410 206012 73495 241846 -154078
13142 -87849 203766 172978 90635 220119 142016 180166 -76520 134615 -83615 -100271 122721
13130 226989 54055 -191620 109889 129157 261390 76493 7934 254115 119322 8390 -138578
13118 17578 21398 393481 180 -129864 227286 104271 29459 16507 160302 35666 -188948
13106 -69028 280491 130231 -37435 114549 107260 213881 136709 95360 283303 -33652 -215872
13095 -215872 4092 157 291470 256483 138249 -36987 -80049 -32465 223984 -78016 -98494
$$ packed form
13176d9473A68275R7802R9837j59259G4463P6112e34347F642Q2755P9407c5633
13164A09856n3485f5275C8171J65807a0401B50657J1644a02318j4133E3432K07927
13153B61359e43125I9143J02228q6551c5220B20410j4398G3495J68351a54078
13142h7849B03766l0788q2343J29484p8103L8150g6520A34615h3615j6656A22721
13130B26989E4055a91620A09889J9268J32233G6493G934K46181A19322H390a38578
13118A7578L820L72083A80a29864B27286A04271B9459j2952J43795C5666a88948
13106f9028B80491A30231c7435A14549p289J06621p7172m1349J87943c3652j82220
13095b15872D092A57K91313l4987j18234c6987m3062c2465B23984g8016k0478
$$ plain form
13084 -98494 163442 92224 242173 321973 -153603 -143434 191501 -103294 289050 -109797
13073 163525 401814 186151 268 111072 -112247 49308 -59246 112591 274710 -213219
13062 -33213 318515 83430 -77330 -126877 162945 -282507 -45092 -21914 -166698 110165 -78537
13050 -105795 42276 -62816 -270912 333285 4228 290836 -98366 218981 94566 38967 102135
13039 102135 244408 163843 416048 165317 99360 -66092 -127225 203356 207057 218775 -291396
13027 -46002 181366 -144995 -147229 263487 -276446 13960 54176 189722 114461 -289514 -87214
13015 209368 -114753 255733 -81029 -212368 -185823 149840 215597 343331 125498 3509
13004 196423 183190 93091 248021 89254 124236 -33727 34084 13136 185232 143135 77633
$$ packed form
13084i8494A63442p1218J49949P9800a53603J0169A91501a03294B89050a09797
13073A63525K38289A86151B68J10804a12247D9308e9246A12591J62119b13219
13062c3213C18515H3430g7330m9547A62945b82507d5092b1914j44784A10165g8537
13050a05795D2276f2816k08096C33285D228K86608i8366B18981I4566C8967O3168
13039A02135J42273q0565K52205A65317o5957f6092o1133B03356L701J1718b91396
13027d6002A81366a44995k234B63487b76446A3960M0216J35546p5261b89514h7214
13015B09368a14753B55733h1029j31339K6545A49840O5757J27734A25498C509
13004A96423j3233r0099J54930H9254L4982c3727C4084A3136J72096m2097o5502
$$ plain form
12993 77633 68126 158762 35542 211802 -47395 -13892 152213 -114 159696 151337 50295 65336
12981 65336 141181 130564 -193989 -39187 -49805 90775 -72065 12782 -66936 52228 176265
12970 176265 40846 187005 28203 4834 302126 -125684 -234185 150732 -77870 -283784
12960 -283784 -77546 -117810 134165 -233540 -240443 -88558 61200 36069 57528 234949 65595
12948 333878 -50264 -49058 186838 223714 15597 -68263 -104150 233876 -2023 205911 153656
12937 153656 36269 224538 140110 16931 133454 -190544 49986 252233 109647 -40446
12926 -416174 164714 81517 42917 131185 87165 -21363 34286 20901 68301 92261 1021
12914 -115145 -146744 37318 246841 -100913 184170 101936 -16876 -108383 84227 -151570 73546
$$ packed form
12993G7633r507R0636C5542J76260d7395a3892A52213a14A59696q359E0295J5041
12981F5336P5845j0617a93989c9187j0618I0775g2065A2782f6936E2228J24037
12970A76265D0846J46159B8203D834K97292a25684j08501A50732g7870k05914
12960b83784g7546m0264A34165b33540o903h8558F1200k5131K1459J77421F5595
12948C33878e0264J206A86838L6876A5597f8263l5887B33876b023B05911n2255
12937A53656C6269J88269q4428A6931J16523a90544D9986K02247A09647d0446
12926d16174A64714H1517l8600Q8268m4020b1363C4286j3385M7400K3960A021
12914a15145l1599C7318K09523a00913A84170q2234a6876r1507H4227a51570G3546
$$ plain form
12902 -276773 -114501 226453 -66004 -149358 103928 25456 -57744 -69181 -2036 -210650 -93714
12890 -195924 -183173 -162922 268918 52436 -55090 184462 18241 -71590 50711 198143 -14469
12878 -47935 340442 -29372 -114954 -466691 80021 -209841 27925 -70423 225364 -58020 -126965
12867 -126965 -14967 -88793 -59124 280282 195500 91263 -49883 116092 21705 46395 -193247
12855 -9757 21960 155627 218211 -252636 21348 -214052 110163 51963 -346315 -238378 -55692
12843 207449 -60731 360306 232601 -20764 -34708 67694 167945 -60880 -18365 -7 -34122 565870
12830 11110 98495 107440 63143 61409 -54868 -18615 -66375 -123731 -15552 -174034 295782 -141882
12817 -98566 -27567 7188 5264 -45978 -60938 -294019 205964 -272174 -176612 133836 70689
$$ packed form
12902b76773a14501B26453f6004q3354A03928B5456e7744j1437b036k08614i3714
12890a95924J2751K0251B68918E2436e5090A84462A8241g1590E0711J47432a4469
12878d7935C40442b9372q5582l51737H0021b09841B7925g0423B25364e8020o8945
12867a26965a4967p3826K9669B80282q4782I1263d9883A16092B1705K4690a93247
12855i757B1960J33667O2584b52636B1348b14052A10163E1963c46315J07937e5692
12843B07449f0731C60306j27705b0764j3944F7694J00251f0880a8365gl4115E65870
12830A1110Q7385Q945m4297j734e4868a8615m7760n7356a5552j58482B95782a41882
12817i8566b7567G188j924d5978j4960k33081B05964b72174R5562A33836o3147
$$ plain form
12806 70689 3549 -86621 -99115 -75443 182416 128791 217316 21005 147006 303838 52440
12794 41389 176166 -84068 313771 347433 -180551 -62143 299351 -338620 -246554 -25300 -19238
12783 -19238 430150 254997 -78296 -98089 212020 181751 -263104 -11352 8528 -118344 165194
12771 -27604 -121866 -53477 22966 43777 -69101 -64428 -42829 -162486 -202601 -9303 -197216 -27397
12758 50068 -25951 -148126 -88715 -52967 -260102 73068 -164373 99813 366184 -19239 144860
12746 -124646 13556 163437 -96746 46812 230256 64952 -207730 105305 -187506 190949
12735 45088 -174111 -70584 280474 180292 -291680 -171246 -218595 -61402 -4623 -324009 -26754
12723 -143358 160059 31616 -34523 177702 62810 -82110 -7674 250521 56007 -112800 -264949
$$ packed form
12806G0689C549h6621j2494K3672A82416n3625Q8525B1005J26001J56832E2440
12794D1389J34777h4068C13771L3662a80551f2143B99351c38620R2066b5300O062
12783a9238D30150j75153g8296j9793B12020l0269b63104a1352H528a18344A65194
12771b7604r4262e3477B2966K0811f9101M673K1599j19657m0115i303j87913b7397
12758E0068b5951j22175N9411L5748k07135G3068a64373I9813K66371a9239A44860
12746a24646A3556J49881i6746D6812J83444F4952b07730A05305a87506A90949
12735D5088a74111g0584B80474j00182b91680J20434m7349f1402d623l19386b6754
12723a43358A60059C1616c4523A77702F2810h2110g674B50521E6007a12800j52149
$$ plain form
12712 -264949 -1648 16226 32203 -505262 -42618 40018 -74772 82222 -211632 -59330 -19116
12700 -28435 105717 132248 242372 16615 85284 130397 401761 -153696 -50101 117108 186515
12689 186515 375971 200056 130102 131198 -126007 203897 25440 157248 -23845 -72059 -144678
12678 -144678 17995 150462 -5172 -80681 -43125 19002 87176 -69634 287573 189336 -428391
12666 37276 271007 68935 205882 -25690 -30811 -99682 102903 258885 232130 -273445 -26987
12654 212168 -76893 -37792 64428 -112958 11888 126673 242498 -310494 140884 83802
12644 83802 244291 38214 84710 167721 105521 407509 -49350 275068 349086 61193 330543
12633 330543 44552 -91378 323458 -48336 -6008 59490 345789 153615 235207 -196204 -332779
$$ packed form
12712b64949a648A6226J5977e05262d2618D0018g4772H2222b11632e9330a9116
12700b8435A05717K6531J10124A6615O8669M5113K71364a53696e0101A17108O9407
12689A86515J89456j75915o9954J096a26007B03897B5440J31808b3845m8214p2619
12678a44678A7995J32467e172p5509L7556A9002O8174f9634B87573r8237d28391
12666C7276K33731F8935J36947b5690n121o8871A02903J55982k6755b73445b6987
12654B12168g6893c7792F4428a12958A1888J14785J15825c10494A40884n7082
12644H3802J60489C8214M6496Q3011o2200L01988d9350B75068P4018F1193K69350
12633C30543D4552i1378C23458d8336f008E9490K86299A53615Q1592a96204j36575
$$ plain form
12622 -332779 62255 117532 111605 -11758 261944 519973 -345536 30602 -18471 243794 147776
12611 147776 431409 -10032 92395 221167 -27429 277852 -34845 295893 211951 55368 50601
12600 50601 -65368 15316 109101 -34712 -69049 -115512 -279416 43169 314651 -149195 -245
12588 -207318 195509 -490404 199073 240257 319775 -266579 -57675 185038 455453 -60293
12577 -170851 -65539 -184501 151498 -93539 147234 139543 -215901 -27009 269639 -80314 58003
12565 61281 -35250 31584 114203 -125931 -9453 73485 -14908 47615 20981 182013 -21994
12553 398430 -296693 125073 -162225 -43369 -134475 151287 -216860 -26360 -148182 125867
12542 73714 77876 -243682 98624 -54674 337177 24241 -54508 167571 67991 90952 -93544
$$ packed form
12622c32779F2255N5277n927a1758B61944K58029c45536C0602a8471B43794r6018
12611A47776K83633a0032I2395J28772b7429B77852c4845B95893q3942E5368m767
12600E0601f5368A5316R3785c4712l4337m6463j63904D3169K71482a49195b45
12588b07318A95509d90404A99073M1184P9518b66579e7675A85038K70415f0293
12577a70851f5539j18962A51498i3539A47234p691b15901b7009B69639h0314E8003
12565F1281c5250C1584Q2619a25931i453G3485a4908D7615B0981J61032b1994
12553C98430b96693A25073a62225d3369r1106A51287b16860b6360j21822A25867
12542G3714M162b43682I8624e4674C37177B4241e4508A67571F7991K2961i3544
$$ plain form
12530 37819 339837 -175184 18984 49647 -70911 -279558 -32441 18182 80758 -398292 -1111
12518 -105249 26996 219443 32409 -230495 22275 314888 23926 14840 -174284 60680 225289
12507 225289 -80963 -89580 -106223 -421699 92579 -116040 -347679 -291220 28868 -64145 -19647
12495 184553 146014 -132707 -234395 -142377 -136935 297421 201367 212698 -29634 -96310 276514
12483 -492099 132976 80667 -51509 -117769 49639 -189269 -83738 -57299 -47712 -271033 -115478
12471 -190852 -239610 -112771 -62548 -401701 90013 65175 -50692 -161946 -44212 165548 368739
12460 368739 66384 15299 -59279 -120400 38471 -133721 -1134 54963 39252 57186 -208730
12448 -116755 -7258 74440 -5353 -83655 -98729 -186740 38690 80587 -96446 -102578 -3816 -190679
$$ packed form
12530C7819L02018a75184A8984L0663g0911k08647c2441A8182O2576c98292a111
12518a05249B6996J92447C2409b30495B2275K92613B3926r086a74284F0680J64609
12507B25289h0963q617j6643l15476I2579a16040k31639N6459B8868f4145a9647
12495A84553l8539a32707j01688R2018N442B97421r6054J1331b9634o6676B76514
12483d92099A32976n2309e1509o6260D9639a89269h3738K6439R587k23321a15478
12471a90852m8758a12771N0223l39153I0013k4838e0692j11254d4212A65548K03191
12460C68739F6384A5299e9279o1121C8471a33721a134E4963j5711J7934b08730
12448a16755g258G4440e353p8302j5074q8011C8690M1897i6446o132c816j86863
$$ plain form
12436 -190679 -368259 112414 82873 -134866 177491 -106221 -28881 -114662 238869 -123057
12425 20531 -201310 -276067 -186407 335797 -188563 81429 101430 98566 -72472 60085 143902
12414 143902 -25459 -11384 -137242 152121 160357 184585 141057 41376 31193 309830 22950
12402 -102105 275157 48214 -17251 -152205 44148 37913 -48494 -73358 71358 -205944 -14107
12390 -359636 298958 66187 223592 -30292 21761 74102 -108948 385717 -222184 -177886
12380 -177886 -67459 18295 -170945 218909 -101115 -21980 -127863 104105 -39820 -19678
12369 124547 248119 284592 297425 -212809 -73507 -29666 54939 257978 123040 -10087 142052
12357 91609 156 80049 152259 -77044 -123102 14881 -53783 66580 -232821 -171467 204623 -217923
$$ packed form
12436a90679j77580A12414k9541a34866A77491a06221b8881q5781B38869a23057
12425B0531b01310p4757Q9660C35797a88563H1429K0001k864g2472F0085Q3817
12414A43902b5459a1384j25858A52121Q236K4228m3528D1376j0183K78637B2950
12402a02105B75157D8214a7251j34954D4148o235d8494k4864G1358b05944a4107
12390c59636B98958F6187J57405c0292B1761N2341a08948C85717b22184M4298
12380a77886f7459A8295a70945B18909a01115b1980j05883A04105c9820a9678
12369A24547J23572L6473J2833b12809g3507b9666E4939K03039A23040a0087A42052
12357I1609A56P9893P2210g7044m6058A4881e3783F6580b32821O1354B04623b17923
$$ plain form
12344 51670 -23664 81073 83867 -236777 136986 211495 236547 12308 138250 51720 68964
12333 68964 291468 -74032 -96747 200483 112660 24577 5448 132502 -177400 -50930 36644
12321 -169575 309868 91520 200483 174167 13192 160831 131535 -394111 -11308 -24444 141365
12309 254651 -94024 212520 278623 524769 375440 330952 19588 8782 172817 -155396 33754
12297 535514 88756 199476 182942 51505 81583 352814 231822 45027 -100155 -149945 -7515
12285 182463 -71877 13963 -31122 -149914 -11165 233298 40948 76473 180609 -35608 155138
12273 235151 -267287 74574 306490 69804 206627 71387 -13792 146115 177872 278328
12263 278328 30636 -8747 25739 410047 65389 251889 157318 348384 -258854 165344 231070
$$ packed form
12344E1670b3664H1073K794b36777A36986P4509K5052A2308J25942E1720J7244
12333F8964K22504g4032k2715B00483q7823B4577E448J27054a77400e0930C6644
12321a69575C09868I1520J08963k6316A3192J47639k9296c94111a1308j3136A41365
12309B54651i4024B12520O6103K46146j49329m4488A9588H782J64035a55396C3754
12297E35514H8756J10720j6534E1505L0078K71231j20992D5027a00155m9790g515
12285A82463g1877A3963c1122j18792a1165B33298D0948L5525J04136c5608A55138
12273B35151b67287G4574K31916F9804J36823G1387a3792A46115L1757J00456
12263B78328C0636h747B5739L84308F5389J86500r4571J91066b58854A65344O5726
$$ plain form
12252 231070 220993 55480 212153 12131 372394 191273 205238 308538 147406 181251
12242 181251 259883 196742 90698 54011 -208532 74549 95276 85697 288535 303533 107739
12230 476771 -13433 7211 422272 234351 -89824 167030 364925 -202971 -332086 -58741
12219 122375 10978 26707 225232 -223792 256004 9270 64734 -125708 353215 79237 108392
12208 108392 207672 191542 55891 140718 90396 49972 -15265 159017 72299 208974 -100829
12196 102651 -216450 279842 -96343 -11540 -447542 249923 17613 351366 381294 35609
12185 58484 27849 453311 168216 268625 445854 -58981 -31936 155669 250035 137588
12175 137588 230651 310963 257001 123953 417745 -289103 -26412 232902 276131 19745 -84520
$$ packed form
12252B31070j0077E5480J56673A2131L60263j81121J3965J03300A47406L3845
12242A81251P8632o3141I0698l6687b08532G4549K0727r579K02838J4998A07739
12230D76771a3433G211M15061j87921h9824A67030J97895b02971j29115e8741
12219A22375A0978J5729J98525b23792B56004I270N5464a25708C53215G9237K9155
12208A08392R9280j6130E5891Q4827n0322m0424a5265A59017G2299J36675a00829
12196A02651b16450B79842i6343a1540m36002B49923A7613L33753K9928C5609
12185E8484B7849M25462A68216J00409J77229e8981K7045A55669R4366j12447
12175A37588R3063Q0312n3962A23953K93792b89103b6412B32902M3229A9745h4520
$$ plain form
12163 146407 -212542 -99720 461537 238795 107211 -39526 245036 124048 -441622 103105
12152 58868 -97163 246527 527720 309795 272570 196073 255352 441181 96655 218523 223934
12141 223934 -69274 387407 90813 178767 88012 7989 56338 -237209 70220 67582 272109
12130 272109 99346 -27424 -152261 334061 -149228 -221768 213170 -53083 198113 161670
12120 161670 259034 -230787 132593 142015 176899 -52211 74738 -118477 -37062 461755 120976
12108 36158 432715 11063 146228 -3447 96150 58753 101348 156986 63043 130194 -13784
12096 -227228 -39515 123568 -13082 57954 160046 418438 -61104 -221199 -101157 116125
12085 -180425 207244 -208567 163109 74433 191660 93770 -59159 -86123 -179901 -57562 109081
$$ packed form
12163A46407b12542i9720D61537k22742A07211c9526B45036j20988d41622A03105
12152E8868i7163B46527K81193k17925l7225p6497N9279J85829I6655J21868N411
12141B23934f9274C87407I0813Q7954H8012G989M8349b37209G0220k638K04527
12130B72109I9346b7424j24837C34061a49228p2540B13170e3083A98113l6443
12120A61670R7364b30787A32593R422L4884e2211G4738a18477c7062D61755A20976
12108C6158L96557A1063J35165c447I6150l7397M2595N5638F3043O7151a3784
12096b27228c9515A23568a3082E7954J02092K58392f1104j60095a01157A16125
12085a80425B07244b08567A63109G4433J17227I3770e9159k6964r3778e7562A09081
$$ plain form
12073 -174775 214427 23477 181185 372198 173262 276916 54711 227617 49586 279894
12063 279894 81751 -56468 74790 334674 7939 50861 -21275 303876 234405 230963 82162
12051 129472 201984 131128 -41205 110675 -53721 10949 308378 -110188 193787 100716 43705
12039 61232 -105063 -12747 -308858 135243 207016 -45862 87168 -73392 345571 60440 -49647
12027 196213 77621 -170153 268434 167785 -158542 -68371 207562 -160641 -123784 22931
12016 21379 -291363 85097 -43089 191746 215325 -342187 54615 -217760 266435 1348 94536
12005 94536 75214 206297 -122132 -60008 -55902 346466 71573 -27556 -172162 307446 333860
11994 333860 183771 -12072 -144639 76764 126146 -70994 320239 -143035 274860 253137
$$ packed form
12073a74775B14427B3477J57708J91013A73262J03654E4711J72906D9586K30308
12063B79894H1751e6468G4790K59884G939M2922b1275C03876o9471l442H2162
12051A29472P2512p0856d1205A10675e3721A0949K97429a10188A93787r3071D3705
12039F1232a05063a2747k96111A35243P1773d5862H7168g3392C45571F0440d9647
12027A96213G7621a70153B68434j00649a58542f8371B07562a60641L6857B2931
12016B1379b91363H5097d3089A91746K3579c42187E4615b17760B66435A348R3188
12005I4536j9322J31083a22132f0008M106C46466G1573b7556j44606C07446K6414
11994C33860j50089a2072j32567G6764M9382g0994C20239a43035B74860k1723
$$ plain form
11984 253137 -2421 140899 -180566 -294872 79027 25138 -45315 272443 33081 -22334 25306
11972 90684 91397 -294234 4872 -16633 -211796 -17431 -43112 16412 -300309 -1680 137402 95359
11960 95359 67323 277779 -44289 -199653 50320 -323965 182941 -78112 -104271 -27774 -125374
11949 -125374 47760 52244 -92162 -105340 -98704 -366053 158526 -154654 -21760 526 176249
11938 176249 58922 -234827 -198258 188234 -190211 184837 -274612 -322000 -193274 -60660
11927 190975 -4906 -146847 -288576 112837 -287635 -244317 76529 -47240 265482 59347 162568
11916 162568 166142 -124900 131726 -315789 343833 99351 -181520 -216139 30647 -173447
11905 -394917 -190296 275124 94258 152313 -19215 210584 -269546 -132335 -68985 86174
$$ packed form
11984B53137b421A40899a80566j14306G9027B5138d5315B72443C3081b2334B5306
11972I0684P13b94234D872a6633j95163a7431k5681A6412c00309a680A37402m2043
11960I5359k8036K10456d4289j55364E0320c23965A82941g8112k6159b7774r7600
11949a25374D7760M484i2162j3178O636k67349A58526a54654b1760E26J75723
11938A76249E8922b34827L6569A88234a90211A84837b74612m7388J28726f0660
11927A90975d906j41941j41729A12837b87635M3318G6529d7240B65482E9347J03221
11916A62568L574a24900A31726c15789C43833I9351a81520l4619C0647a73447
11905c94917a90296B75124I4258N8055a9215B10584b69546a32335O3350H6174
$$ plain form
11894 336481 78891 -70697 -77154 114474 -169360 36326 -222508 322818 51521 251881 132833
11883 132833 35472 12092 -251364 -11713 353401 23845 118364 -185605 26392 6890 78283
11872 78283 185181 195205 12769 157492 -39184 -113303 83916 137795 170117 -1392 -98079
11861 -98079 -33113 -63743 157952 -204696 -46090 298301 74419 -109694 -22523 327145 -152713
11849 -146824 162714 27619 -96819 122396 82057 -74425 94203 141173 -310287 113814 -49738
11837 121504 174985 -200747 -44477 23723 -12038 -116384 -338128 -28498 -198402 -278523 -178387
11826 -178387 231428 -211135 -81218 123018 -113956 62769 -30580 108828 -249136 30390
11815 138593 26403 -60500 -14699 135438 252679 -42073 -313164 -26673 75790 90181 187445
$$ packed form
11894C36481G8891g0697o457A14474a69360C6326b22508C22818E1521K00360j19048
11883A32833C5472A2092b51364a1713C53401B3845R4519a85605B6392F890P1393
11872G8283J06898J0024A2769J44723c9184p4119H3916N3879L2322a392r6687
11861i8079c3113l0630A57952b04696d6090B98301G4419a09694b2523C27145a52713
11849a46824A62714B7619i6819A22396m0339g4425I4203M6970c10287A13814d9738
11837A21504N3481b00747d4477B3723a2038j04346k21744b8498j69904q0121J00136
11826a78387B31428b11135h1218A23018a13956F2769c0580A08828b49136C0390
11815A38593B6403f0500a4699A35438J17241d2073k71091b6673G5790J4391R7264
$$ plain form
11804 187445 -114499 103795 -130724 -50326 -141624 208950 -96335 226978 -133520 -515276
11794 -515276 -227554 -14631 73080 189501 -96893 -403210 -96423 16744 -56481 -336248 -139855
11782 -165573 -235701 139894 -30934 -92230 -49510 168277 -181009 -67286 15693 -213938 -117500
11771 -117500 113859 173285 -246076 24546 176116 -130919 -191999 -122493 31212 40807 -97368
11759 36327 71298 187486 -137809 -86434 -100037 -40835 -15203 -105058 -8269 360697 -118543
11747 -111643 -191528 -47943 -23280 155397 -259342 -65089 -386679 -190432 -261608 92892 292060
11736 292060 -296679 265802 187855 30415 229751 -106828 15232 -44787 218326 38710
11725 -119305 -9660 -265593 -66518 -204091 -51561 -205921 -458629 174433 -321976 -177174
$$ packed form
11804A87445a14499A03795a30724e0326r1298B08950i6335B26978a33520l81756
11794e15276b27554a4631G3080J16421i6893l06317i6423A6744e6481k79767a39855
11782a65573p0128A39894c0934o1296M2720A68277a81009f7286A5693b13938R6438
11771a17500A13859N9426b46076B4546J51570a30919o1080O9506C1212R595i7368
11759C6327L4971J16188a37809N1375j3603d0835a5203q9855h269C60697a18543
11747a11643p9885d7943b3280A55397b59342f5089l21590a90432p1176I2892J99168
11736B92060b96679B65802p7947C0415J99336a06828A5232d4787B18326C8710
11725a19305i660k55933f6518j37573e1561j54360k52708A74433c21976J44802
$$ plain form
11715 -177174 181885 383738 -207569 149748 -18768 180178 -78301 -164927 -228409 -173036
11705 -173036 267 205218 48928 -149645 -146904 10881 -72289 181279 40747 -136085 -116371
11694 -116371 8068 55283 58044 188696 88913 143935 -79981 329093 240245 43133 -44560
11682 -3437 115263 111946 138292 36428 229390 148203 -10720 -10714 -22460 -157749 91888 33967
11669 -220508 -115820 61858 -15870 16528 361403 -68488 143026 119025 -147964 -298055
11659 -298055 -184564 192546 446988 90738 -85810 30687 -76452 167223 -79377 -33055 248944
11647 -218761 74021 52397 41141 26064 -25496 247075 3281 -44823 -131659 37521 376929
11636 376929 8095 36249 80585 96429 -95192 -71617 141910 -66752 3295 611 6408 32511
$$ packed form
11715a77174A81885K01853b07569A49748a8768A80178g8301q6626o3482N5373
11705a73036B67K04951D8928a49645K741A0881g2289A81279D0747a36085J9714
11694a16371H068M7215K761J30652H8913N5022g9981C29093q8848D3133d4560
11682c437A15263l317K6346C6428J92962q1187a0720Oj1746j35289I1888C3967
11669b20508J04688F1858a5870A6528L44875f8488A43026k4001a47964j50091
11659b98055J13491A92546K54442I0738h5810C0687g6452A67223g9377c3055B48944
11647b18761G4021k1624j1256j5077b5496B47075C281d4823q6836C7521L39408
11636C76929H095K8154M4336J5844i5192K3575A41910f6752C295F11N797K6103
$$ plain form
11624 32511 -325871 -78301 -34329 -100836 -123900 275750 70032 79191 -307546 6138 -104441
11612 96858 -45395 13270 335086 -123721 77754 61053 2150 140787 -103178 213998 285012
11601 285012 -86080 108497 -347862 83828 -105956 -7259 106917 -289538 -117062 309538
11590 99260 372676 -112117 44571 152554 -391909 -133021 265234 53458 -25297 -2992 -11038
11579 -11038 343161 371476 326528 163131 -130637 -156119 -97441 198734 251070 78952 169929
11568 169929 231453 211785 158399 101200 190942 288071 -3542 393123 120763 -146625 147400
11556 -29609 258702 9481 -185984 386803 275485 47848 -88513 190394 -54344 174503 205472
11545 205472 73353 346370 -18251 75155 -96356 -93045 145453 30928 -226154 209323 -239972
$$ packed form
11624C2511c25871g8301c4329o6507k3064B75750G0032R159c07546F138a04441
11612I6858d5395A3270L21816a23721G7754j6701B150J38637a03178B13998P1014
11601B85012h6080A08497c47862H3828a05956g259A06917b89538a17062C09538
11590I9260K73416a12117D4571J07983c91909a33021B65234E3458b5297b992q046
11579a1038C43161K8315m4948A63131a30637k5482N8678A98734N2336G8952R0977
11568A69929O1524j9668n3386n7199Q9742R7129c542C93123A20763a46625A47400
11556b9609B58702I481a85984C86803j11318D7848h8513A90394e4344A74503L0969
11545B05472G3353K73017a8251G5155i6356L311A45453C0928b26154B09323b39972
$$ plain form
11533 169909 -118889 67852 -265101 -87333 -89473 24742 -180559 -110200 -104133 94801 137030
11522 137030 6613 -56060 422124 197562 -127727 332906 -124259 193077 139470 56466
11511 341353 56249 32015 351380 -239856 -10221 41807 139020 -31772 450930 276701 194850
11500 194850 11245 53921 -131046 152350 -209062 94559 121518 -16518 503565 -199637
11489 224132 174007 -157306 263051 191844 202660 -204965 362464 -63961 -15626 -29735 303996
11477 -77550 45709 77187 -91913 96448 -12066 9195 376345 -126190 156223 112830 16553
11465 287603 -32286 163558 108334 175221 -179864 -102986 360378 157616 143885 44354 310140
11454 310140 386476 317541 -228554 78543 147030 32832 149737 183419 66378 -301341 -55533
$$ packed form
11533A69909a18889F7852b65101h7333k140B4742a80559P0359O067I4801M2229
11522A37030F613e6060D22124A97562a27727C32906a24259A93077n3607E6466
11511C41353E6249k4234L19365b39856a0221D1807R7213c1772D50930j74229q1851
11500A94850A1245M2676a31046A52350b09062I4559K6959a6518E03565a99637
11489B24132n0125a57306B63051p1207J0816b04965C62464f3961a5626j4109C03996
11477g7550D5709L1478i1913I6448a2066I195L67150a26190A56223m3393A6553
11465B87603c2286A63558n5224O6887a79864P6878C60378A57616j3731D4354K65786
11454C10140P6336o8935b28554G8543O8487C2832J16905L3682F6378c01341e5533
$$ plain form
11442 248808 156169 267293 -46014 176160 82573 146091 151380 -26786 -49863 112531 -289179
11430 -28192 -286545 385966 42210 38858 88320 114223 18960 296269 278057 237525 113541
11418 108369 16123 59323 -237598 -250533 -13580 -116437 -137316 5067 -38483 152176 95103
11407 95103 -192004 -287407 -182861 -182869 275012 -67546 357979 268321 -181563 106951 -9560
11395 -128101 -117294 -94470 100172 173569 -57559 111174 -107400 -73460 75025 12801 95047
11384 95047 -141768 -129807 -86763 -58030 -55580 -33449 -53528 -298746 59301 -174476 -39475
11372 221922 53943 -345158 -148150 -195045 209001 125229 35001 -26353 -37449 228209 -43386
11360 -41399 -118167 -182675 -43448 88557 -25130 -101187 -170683 55833 65441 -69699 -66711 -96395
$$ packed form
11442B48808r2639J11124d6014A76160H2573O3518N289b6786k3077A12531b89179
11430b8192k58353C85966D2210l352M9462K5903A8960K77309j8212m0532A13541
11418A08369A6123M3200b37598j2935a3580j02857k0879E067c8483A52176n7073
11407I5103a92004r5403J04546qB75012f7546C57979q9658a81563A06951i560
11395a28101J0807K2824A00172P3397e7559A11174a07400L3940G5025A2801Q2246
11384I5047a41768J1961M3044K8733K450K2131k0079k45218E9301a74476c9475
11372B21922E3943c45158a48150m6895B09001q3772C5001b6353j1096B28209d3386
11360d1399p6768o4508d3448H8557b5130p6057o9496E5833R608f9699K988k9684
$$ plain form
11348 -96395 -11091 20924 -51010 84619 -75293 -285022 -393854 161109 76793 -364314 -135884
11336 151912 -117664 -97204 114926 88307 121514 76484 -103483 -226341 -89247 29997 279167
11325 279167 -224696 -333372 8860 217432 -115592 -141506 60217 -95045 -86977 -40097 -208962
11314 -208962 -372152 76608 -121308 -120883 -209938 -166431 130339 -155098 -290861 421297 -6020
11302 -98966 -172441 133556 148777 253273 -25383 -88251 188485 -47261 76809 13694 -111514
11290 -125307 -13293 -252751 -46851 -472194 -394919 -35820 104517 -39239 24319 -253597 -246797
11279 -246797 -39410 -94744 -20112 -415663 66487 79531 184419 105465 204240 -230187 21665
11267 61406 -68836 -96678 124599 -109905 45412 -20839 144920 281638 -170111 120099
$$ packed form
11348i6395a1091B0924e1010H4619g5293k09729j08832A61109G6793c64314a35884
11336A51912a17664K0460A14926k6619L3207m5030a03483j22858h9247B9997K49170
11325B79167b24696j08676H860K08572a15592k5914F0217i5045Q068d0097j68865
11314b08962j63190G6608a21308M25q9055M3507A30339a55098j35763D21297f020
11302i8966p3475A33556J5221J04496b5383o2868A88485d7261G6809A3694a11514
11290a25307a3293k39458d6851m25343P7275c5820A04517c9239B4319b53597O800
11279b46797c9410n5334b0112l95551F6487J3044J04888p8954R8775b30187B1665
11267F1406f8836k7842A24599a09905D5412b0839A44920J36718a70111A20099
$$ plain form
11256 -167936 115283 24607 -11009 -446347 -299265 61395 -268124 -145671 -186675 26921
11245 282247 707 91206 134316 -78548 124506 29006 4620 -601675 12658 148331 79478
11234 79478 -1498 98316 -197081 -269873 -144795 107338 -464463 -223135 -109271 27599 62460
11223 62460 -282258 305089 165983 236631 -128911 -76004 309938 -152419 153449 114406
11213 114406 -79635 -105107 -116013 191509 74597 95343 -152273 -144723 -287823 -369753 -227671
11202 -227671 -65359 249321 49227 126764 -255196 -59052 51826 48641 -198991 -264232 -283260
11191 -283260 -128682 -37707 -304180 109072 4569 1980 230213 103405 -547926 -286812
11181 -286812 -361711 -77425 -250207 -52135 -45286 -44802 -145012 266228 94627 -95112 55391
$$ packed form
11256a67936A15283B4607a1009m35338J47082F1395b68124J22453m1004B6921
11245B82247G07R0499M3110g8548A24506B9006D620f01675A2658J35673o8853
11234G9478a498I8316a97081p2792J25078A07338d64463b23135a09271B7599L4861
11223F2460b82258C05089j39106P0648a28911N2907C09938a52419A53449l9043
11213A14406g9635k5472j0906A91509G4597K0746a52273P550j43100q1930J42082
11202b27671f5359B49321D9227P7537b55196e9052E1826l185a98991o5241j9028
11191b83260a28682c7707k66473A09072D569A980K28233A03405e47926K61114
11181b86812p4899g7425j72782e2135O849M84j00210B66228I4627i5112E5391
$$ plain form
11169 101733 -35837 -219145 -1591 84555 -106541 -202972 -46834 201669 39839 90225 119535
11158 119535 44427 -263925 -246424 -61493 -52969 -272082 -79396 -77480 -66156 -29947 -223583
11147 -223583 -102282 -75489 -30691 217966 -334328 112928 -103466 19670 61504 -87550
11136 -37494 -150628 -75126 152813 72886 206725 51461 -280944 9641 -74656 -82400 -221913
11125 -221913 260304 415421 -10111 -77987 -221854 -83017 -40568 9509 -98368 61432 75719
11114 75719 -64758 258248 -77938 187224 249496 260206 55697 96223 89398 -195268 -48191
11102 110715 382730 -222130 -174284 82139 267339 432378 -222273 -93809 -34320 -255142
11092 -255142 -352839 -9637 -2983 291340 -154041 378504 248302 13070 528635 230522 223468
$$ packed form
11169A01733c5837j83308a591H4555a06541r6431d6834B01669C9839N0386K9310
11158A19535D4427b63925J7501f1493Q524k19113g9396J916J1324b9947j93636
11147b23583a02282K6793c0691B17966c34328A12928a03466A9670M1834h7550
11136c7494j13134g5126A52813G2886J33839E1461b80944I641g4656p744j39513
11125b21913B60304J55117a0111o7876j43867h3017d0568I509i8368F1432J4287
11114G5719f4758B58248g7938A87224O2272J0710E5697M0526o825a95268d8191
11102A10715K72015b22130M7846H2139J85200J65039b22273i3809c4320k20822
11092b55142r7697i637b983B91340a54041C78504j30202A3070N15565B30522p054
$$ plain form
11081 223468 265564 243368 373997 -228070 309970 127136 317693 303428 255257 -62282
11070 253211 -18962 -104916 -37636 -15709 287921 212866 103212 205527 -3168 251950 212919
11059 212919 340648 129376 397419 108423 68074 249559 168746 443170 240457 262832
11049 262832 100746 61491 111969 289229 419961 227691 162790 409969 710267 441400
11039 441400 559727 460236 571947 496977 636799 741563 734998 498438 613918 312180
11029 312180 306548 927418 319611 639588 654404 207337 231387 598579 821849 462376
11019 462376 735278 475290 849622 680716 396765 613844 379355 503448 523508 322133
11009 322133 215308 500368 654579 726537 292416 682836 369396 589982 499995 632211
$$ packed form
11081B23468M2096k2196J30629b28070C09970A27136J90557j4265m8171f2282
11070B53211a8962q5954c7636a5709B87921p5055A03212J02315c168B51950l9031
11059B12919J27729A29376K68043A08423m0349J81485q0813K74424k02713K2375
11049B62832A00746l9255N0478J77260J30732j92270o4901K47179L00298k68867
11039D41400J18327r9491J11711p4970J39822J04764o565k36560J15480l01738
11029C12180n632O20870C19611L19977J4816B07337K4050L67192K23270l59473
11019D62376K72902k59988L74332j68906k83951K17079k34489J24093K0060k01375
11009C22133j06825K85060J54211P1958B92416L90420l13440K20586q9987J32216
$$ plain form
10999 632211 288946 296498 528698 567454 674778 543636 702844 221788 582897 422623
10989 422623 571324 412503 457309 636080 558414 420779 315903 401621 452705 759034
10979 759034 542687 880225 477217 478985 613695 433078 481081 765851 444014 665538
10969 665538 658702 840748 327151 665390 789025 613962 762304 1036562 1246526 943952
10959 943952 1357380 1392033 1487396 1569420 1883126 1736849 2148511 1969344 1939278 1993173
10949 1993173 1782833 1705228 2033167 1745248 1863318 2023934 996087 1597327 1758152 1693309
10939 1693309 1357328 1570087 1956276 1529290 1601439 1605359 1134573 1363444 629075 1023641
10929 1023641 602340 478004 184832 352510 -83659 275903 372796 409037 209097 97647
$$ packed form
10999F32211B88946P552K32200L8756J07324j31142J59208B21788L61109j60274
10989D22623J48701j58821M4806J78771p7666j37635j04876Q5718N1084L06329
10979G59034k16347L37538m03008J768J34710j80617M8003K84770l21837K21524
10969F65538o836J82046C27151L38239J23635j75063J48342K74258K09964l02574
10959I43952M13428L4653R5363Q2024L13706j46277M11662j79167l0066N3895
10949A993173k10340p7605L27939k87919J18070J60616I96087O01240J60825o4843
10939A693309l35981K12759L86189m26986P2149L920m70786K28871F29075L94566
10929A023641m21301j24336A84832J67678h3659B75903R6893L6241j99940I7647
$$ plain form
10918 437622 230090 -111958 228727 237445 57993 145 45132 158243 200573 -154485 -492354
10907 -492354 -214004 -34074 -41763 -196654 123045 -115981 -133330 -161029 68904 -259273 286601
10895 -15172 274616 -400560 -301923 -170327 156045 179171 -213504 -97487 -1858 -163390 181040
10883 -2749 -3529 123145 194638 71283 -63831 111246 -23885 4385 84084 -402056 -12662 254885
10870 -1702 -32319 94645 -389757 -121750 -42475 127145 -89665 -325637 74700 72763 86719
10859 86719 292438 -53317 20741 11515 -247192 -24313 20155 -88821 -24539 -374122 319323
10847 131167 -74639 -69150 194972 34064 -239860 198172 321514 -244258 -178384 -103412 38835
10835 -115198 -177777 75754 4167 33318 66067 78987 -14772 -134337 90827 -119245 -148498
$$ packed form
10918D37622k07532a11958B28727Q718E7993A45M4987J13111M2330a54485l37869
10907d92354b14004c4074p689j54891A23045a15981j7349k7699F8904b59273B86601
10895a5172B74616d00560R8637J31596A56045K3126b13504i7487a858j61532A81040
10883b749p80A23145P1493G1283f3831A11246b3885D385P9699d02056a2662B54885
10870a702l0617I4645c89757a21750d2475A27145h9665k35972G4700j937J3956
10859H6719K05719e3317B0741r226b47192b4313B0155h8821b4539l49583C19323
10847A31167g4639N489A94972C4064b39860A98172J23342b44258O5874P4972C8835
10835a15198o2579G5754D167K9151L2749J2920a4772j19565I0827a19245k9253
$$ plain form
10824 -148498 -59908 -168584 -170062 198600 -17622 -21090 -380060 -123862 -178527 -30147 -282629
10813 -282629 -367757 -98929 -21084 195595 164771 244673 -109749 148054 12040 148270 -55582
10801 -27055 18229 116609 -39214 -277643 -156534 -214906 271479 -299407 -28645 118256 -274148
10789 -85186 12457 -196819 137882 -341216 -154132 69568 212302 -440739 -45043 -290679
10779 -290679 -414289 7791 -46721 33903 -82102 -138635 -392467 135258 -297949 -119998 -17516
10767 -73046 84040 186905 -109409 301216 195266 -56768 -133391 130191 -173452 -82168
10756 477259 296201 11943 -123089 -261516 183028 159907 -63421 318822 -111035 -346895
10746 -346895 -184410 -9447 251987 89471 -412958 -104779 -345437 -99802 -401760 22473
$$ packed form
10824a48498e9908j08676j478A98600a7622l468l58970a23862n4665c0147k52482
10813b82629q5128i8929b1084A95595l0824P9902a09749A48054A2040J36230e5582
10801b7055A8229R8380c9214k38429J21109n8372B71479b99407b8645A18256b74148
10789h5186A2457a96819A37882c41216a54132F9568J42734d40739d5043k45636
10779b90679j23610G791d6721C3903h2102n6533k53832A35258b97949a19998a7516
10767g3046H4040J02865a09409C01216j05950e6768p6623A30191a73452h2168
10756D77259j81058A1943a23089j38427A83028k3121f3421C18822a11035k35860
10746c46895J62485i447B51987H9471d12958a04779k40658i9802l01958B2473
$$ plain form
10735 -344931 -48806 -108851 -412449 -171586 154818 -282902 -328584 35687 -65684 -203492
10725 -203492 108428 -112655 -54950 434073 -270550 -390596 62359 228013 -372259 101732
10714 -117048 -109715 -124669 -44498 50971 284909 -229085 -128152 15009 251718 -139327 -127991
10703 -127991 -21634 -63119 305998 -17065 277643 -86434 -66413 -136883 89264 -203669 -68555
10691 -150545 -219594 -67198 29843 155511 59938 -436017 -48681 -85697 233816 -62342 -297201
10680 -297201 -172949 -395936 -392224 -47068 -225304 -262664 224534 112840 -152211 -237792
10670 -237792 10803 98356 -415773 32528 175888 -121918 -234711 -180059 -65155 -556867
10660 -556867 149156 -181784 -20119 -30835 -386105 -299357 -98426 -82507 101671 134972 -53704
$$ packed form
10735c44931d8806o0045l03598a71586A54818b82902m5682C5687f5684j37808
10725b03492A08428a12655e4950D34073b70550j20046F2359J65654c72259A01732
10714a17048P333j4954d4498E0971K33938b29085J00933A5009K36709a39327J1336
10703a27991b1634m1485C05998a7065B77643h6434K0021p0470H9264b03669f8555
10691a50545o9049f7198B9843J25668E9938d36017d8681l7016B33816f2342k34859
10680b97201J24252k22987L712d7068j78236l7360B24534j11694a52211q5581
10670b37792A0803Q7553d15773C2528J43360a21918j12793N4652f5155m91712
10660e56867A49156a81784b0119j0716l55270Q6748i8426J5919A01671L3301e3704
$$ plain form
10648 -24214 -48545 251919 382967 -97588 116794 -88649 -413807 -239341 -10405 96856 -124342
10636 -219322 -310661 -309582 -68781 63228 63281 -71830 266710 -231334 -174014 -503455 -38593 41036
10623 -424522 -125025 -424740 50931 -36434 186412 -88766 70940 -56985 -11803 -261984 -69173
10611 -285234 106479 168608 -54160 -341210 133652 -96189 -73015 -146361 -35183 30956 -118331
10599 -206774 -105725 -111194 295490 -241281 -291398 44974 82461 64967 -294355 200726 -34280
10587 -44993 -66733 -225736 -158529 15722 -129642 -39403 -79010 -29858 -173143 -124246 -227873
10576 -227873 88751 -89774 301163 -61954 -26996 15988 234110 -173462 -176643 123274 -181319
10564 -116996 94281 37103 55669 -195988 -324682 -70915 -173329 -67762 -142133 -181717 -4830
$$ packed form
10648b4214k4331B51919J31048i7588A16794h8649l25158J74466a0405I6856a24342
10636b19322r1339J079f8781F3228N3g1830B66710b31334N7320l29441c8593D1036
10623d24522a25025k99715E0931c6434A86412h8766G0940e6985a1803k50181f9173
10611b85234A06479O2129e4160k87050A33652i6189K3174p3346c5183C0956a18331
10599b06774J01049n469B95490b41281n0117D4974L7487j7494b94355B00726c4280
10587d4993k1740j59003O7207A5722a29642c9403l9607b9858j43285M8897j03627
10576b27873H8751h9774C01163f1954b6996A5988K18122a73462l181A23274a81319
10564a16996I4281C7103J8566a95988j28694g0915j02414f7762p4371l9584d830
$$ plain form
10552 -271622 47054 23482 187263 -926 -62712 -166973 37707 -2722 86038 -55149 97190 6962
10539 46594 43394 86585 -65397 -224977 169640 -300005 72049 187280 -291203 -22800 2153
10527 -16474 208614 92343 -95745 59363 -75063 -75193 -5624 282709 94290 -354215 16249 97336
10515 97336 -306588 -209357 21684 -138853 -328550 -377272 -72587 -159120 -162070 -93471 -180401
10504 -180401 -141281 15567 204290 -238831 -377669 -75260 -237440 -285135 -245873 -170119 48636
10492 -46908 92135 -97308 -238355 -146221 -24808 -233948 -97373 -72957 -59299 -14459 38401
10480 -44358 211443 -22416 161528 -285952 -156132 30482 -196578 69539 -225608 51485
10469 23868 139895 -24792 -33061 224087 83654 -41845 21065 33188 101629 249830 13235
$$ packed form
10552b71622D7054B3482J63781i26o1786j04261C7707b722H6038e5149I7190F962
10539D6594l200M3191f5397j59580A69640c00005G2049J15231b91203b2800B153
10527a6474B08614I2343i5745E9363g5063j30e624B82709I4290c54215A6249Q1087
10515I7336c06588R7231B1684a38853j89697m8722g2587q6533k950O8599q6930
10504a80401L9120A5567J88723b38831j38838g5260j62180m7695L9262P5754D8636
10492d6908I2135i7308j41047R2134b4808k09140i7373K4416J3658a4459C8401
10480d4358B11443b2416A61528b85952J29820C0482a96578F9539b25608E1485
10469B3868J16027b4792q269B24087H3654d1845B1065J2123O8441J48201A3235
$$ plain form
10457 215067 75187 493472 120196 67595 167624 110392 164438 136572 55464 198008 -56448
10445 -46774 112898 168628 258820 -116123 -161835 -96321 -135966 -25677 -55053 53859 281716
10434 281716 101656 51161 -12873 56791 367967 -240682 48265 -133126 32334 -134915
10423 -376962 -76656 14331 -220371 55046 -168516 -23141 -66518 -20598 133959 255357 -212311
10411 44580 348902 -149985 -39498 -87261 -147951 -126026 -65571 -73208 183588 96613 58468
10400 58468 64636 78440 156333 -65097 43803 291594 50648 -372365 -117897 63032 -261247
10388 141343 -307685 28228 304561 131847 204956 -24377 -87782 72509 -168951 178796
10377 56674 327341 -119089 -180142 182874 187764 -126280 97415 48120 381446 -55043 -105403
$$ packed form
10457B15067G5187M18285A20196n2601J00029n7232N4046k7866E5464J42544e6448
10445d6774A12898N5730R0192a16123m5712O5514l9645b5677k9376E3859K27857
10434B81716A01656n0495a2873E6791L11176b40682D8265a33126C2334a34915
10423c76962g6656A4331b20371E5046a68516b3141m3377b0598A33959J21398b12311
10411D4580L04322a49985c9498m7763o0690K1925O0455p637A83588q6975l8145
10400E8468O168J3804P7893f5097D3803K47791E0648c72365a17897F3032b61247
10388A41343c07685B8228K76333A31847P3109b4377o3405G2509a68951A78796
10377E6674K70667a19089o1053A82874M890a26280I7415D8120L33326e5043n0360
$$ plain form
10366 -105403 -504130 39506 376031 -72413 166975 25735 3230 305709 245125 88606 48975
10355 48975 458050 481907 -102916 149909 94929 585368 140781 193222 156615 328850
10345 328850 102800 -130081 303115 274750 58770 65277 131293 217808 131873 270763 126168
10333 75795 239178 205297 252617 75351 386317 213900 203970 468024 336525 323695 77521
10321 219948 112669 303300 282197 150368 74546 358727 156555 751839 250139 59580
10310 212109 -46241 -156219 149894 15733 -15131 156731 142975 170431 -95787 87789 72864
10299 72864 45442 80927 301525 50509 26659 44838 153424 -49739 -27806 -107898 -138964
10288 -138964 -91033 17231 -217398 -34892 -44353 -374579 116577 75949 -176186 -5535 94605
$$ packed form
10366a05403l98727C9506L36525g2413A66975B5735C230L02479o0584H8606l9631
10355D8975M09075K3857a02916A49909n4980M90439A40781N2441l6607J72235
10345C28850A02800a30081C03115k8365E8770O507O6016Q6515q5935J38890A26168
10333G5795J63383l3881M7320G5351L10966j72417r930K64054j31499j2830G7521
10321B19948j07279J90631k1103j31829G4546K84181A56555N95284B50139E9580
10310B12109d6241j09978A49894A5733a5131A56731j3756K7456i5787H7789j4925
10299G2864k7422L5485K20598E0509k3850J8179J08586d9739K1933q0092l1066
10288a38964M7931A7231b17398c4892r461l30226A16577m0628a76186e535I4605
$$ plain form
10276 -245502 -182306 -149700 -488969 21092 -332258 -62492 1858 203566 -199358 307138 -127651
10264 -300014 312190 -441584 -236459 199876 -413859 -69243 288582 90295 -239451 79649
10253 -180158 27775 -200453 9948 53493 -121431 13716 -73967 -104685 29688 -1058 156625
10241 -158038 -26453 121240 309040 194113 252149 402082 295065 125468 301403 -88308
10230 -460295 303144 -106074 155869 35543 71891 -348201 -169411 -15009 33892 206076
10220 206076 28496 240930 -227739 760 136015 -46362 -38386 150567 8665 95830 333246
10209 333246 8174 41744 -111787 92572 -162840 -123674 137856 -255821 -527947 -81706 -66212
10198 -66212 121439 -359820 53657 -199293 -214613 167700 6592 -136189 -540482 148606
$$ packed form
10276b45502O3196L2606l39269B1092c32258f2492A858K01708a99358C07138a27651
10264c00014C12190d41584K05125A99876d13859f9243B88582I0295b39451G9649
10253a80158B7775b00453I948M3545a21431A3716g3967l0718B9688a058A56625
10241a58038b6453A21240J87800j14927N8036J49933j07017A25468J75935h8308
10230d60295C03144a06074A55869C5543L6348c48201a69411a5009C3892J72184
10220B06076B8496K12434b27739G60J35255d6362P976A50567H665Q7165K37416
10209C33246H174L3570a11787I2572a62840L9166A37856b55821k72126h1706J5494
10198f6212A21439c59820E3657a99293j5320A67700F592a36189m04293A48606
$$ plain form
10187 -139101 -80379 256673 -8066 -105443 88788 -89534 -241547 100519 -141744 -81616 -90987
10176 -90987 -198858 123926 -274854 -23915 -118352 -202603 -212004 248381 -192525 12634 -210371
10164 143152 -55172 -345367 -196926 184308 -78012 -113846 -29891 30745 -13349 -288458 -125103
10152 -112969 -127726 61074 175253 102356 -164989 -38254 -46770 -180105 36771 30452 -36913
10140 -64953 -94367 -116215 -68832 -28482 -94214 -210503 260373 -144893 -182499 -643760 -67935
10128 -1615 112058 -359039 -96525 17967 76879 -133755 -217431 64476 -83552 4281 -136997
10116 -196921 -57569 212185 22684 -113218 -150087 -125374 -181452 42208 34236 -14182 281788
10104 -273227 -295205 12712 45901 -322084 -47324 -54169 -269114 -279455 121253 -202379 -2487
$$ packed form
10187a39101N8722B56673h066r7377H8788h9534j52013A00519a41744O0128r371
10176i0987j07871A23926b74854b3915r4437q4251r401B48381a92525A2634b10371
10164A43152e5172k90195J48441A84308g8012l5834b9891C0745a3349k75109a25103
10152a12969j4757F1074J14179p2897a64989c8254q516j33335C6771o319c6913
10140f4953k9414k1848M7383b8482o5732j16289B60373a44893l7606m61261f7935
10128a615A12058c59039i6525A7967N8912a33755q3676F4476h3552D281a36997
10116a96921e7569B12185B2684a13218l6869K4713n6078D2208p972a4182B81788
10104b73227k1978A2712L3189c22084d7324o845k14945j0341A21253b02379b487
$$ plain form
10092 -241732 -278955 116560 -220574 179321 -109929 4677 -317612 -142941 228214 -179630
10081 -58372 -83204 -271474 -155073 -123265 -31764 -19064 -150895 129130 79088 -157891 124878
10069 225366 -193156 -156260 67504 -84516 -50267 188600 -86168 -134875 31481 -257519 66456
10057 251617 14135 -219796 -288779 239240 -129849 100370 -346854 92910 87169 -12942 15990
10045 -301110 24346 -124198 -200424 31729 9315 18263 -170576 -69203 -383897 151362 -192309
10033 -136684 59367 102150 97895 23969 -122000 -302508 59743 -9239 217651 -375055 -116702
10021 -229818 -246201 -221148 -74749 210958 268954 112281 -363551 -234048 -116365 -135284
10011 -135284 -188497 -117027 188135 -244239 29628 -125427 -176473 -299351 25762 -34342 34222
$$ packed form
10092b41732l7223A16560b20574A79321a09929D677c17612a42941B28214a79630
10081e8372k4832j88270J16401L1808c1764J2700j31831A29130n0042a57891A24878
10069B25366a93156L6896F7504h4516L4249A88600h6168m8707C1481b57519F6456
10057B51617A4135b19796o8983B39240a29849A00370c46854I2910n741a2942A5990
10045c01110B4346a24198p6226C1729I315Q948a70576f9203l14694A51362a92309
10033a36684E9367M2783m255B3969a22000j80508E9743i239B17651c75055a16702
10021b29818j6383K5053g4749B10958N7996A12281c63551J29503a16365j8919
10011a35284n3213P1470A88135b44239B9628a25427n1046j22878B5762c4342C4222
$$ plain form
9999 225823 -135172 -160777 -189439 284539 -308632 -78756 26612 -23253 -61920 -91912 -44444
9987 -45938 82762 155823 -267381 -94177 40887 41122 -223457 21748 -61488 -28850 -80569 229832
9974 -226822 -110218 117733 -13374 146083 -195831 -188326 -64192 110197 8350 -354564 -296420
9963 -296420 27299 47016 -111125 103989 185825 -96237 155826 -96362 46525 22527 -198839
9951 101208 -6779 -292499 432289 -64539 105932 -148036 -324890 -257054 -90760 -7259 -14876
9940 -14876 94736 -186369 121579 23477 213558 -227297 -25135 116213 215234 -128749 78874
9928 208008 -316020 134664 -216381 -70334 191887 81374 639 -241817 -26570 193940 -105606
9916 -213594 -242234 -173070 248397 -178732 -45894 -102978 37918 -51568 -72445 -83659 154152
$$ packed form
9999B25823a35172k5605k8662B84539c08632g8756B6612b3253l8667k9992d4444
9987d5938H2762P3061b67381i4177D0887K35b23457B1748f1488b8850n1719B29832
9974b26822a10218A17733a3374A46083a95831P505f4192A10197H350c54564N8144
9963b96420B7299J9717a11125A03989Q1836i6237A55826i6362D6525B2527a98839
9951A01208f779k85720D32289f4539A05932a48036j76854O7836i0760g259p617
9940a4876I4736a86369A21579B3477J90081b27297b5135A16213R9021a28749G8874
9928B08008c16020A34664b16381g0334A91887H1374F39b41817b6570A93940a05606
9916b13594k8640O9164B48397a78732d5894n7084C7918e1568k0877j1214A54152
$$ plain form
9904 -261632 -136036 -23784 20493 370996 106542 247906 29348 86079 -195689 -318636
9894 -318636 -241782 -207426 -129924 -249701 -4491 -27133 93742 -2828 133198 -72700 -165290 -36101
9881 -281767 -79486 -307882 -59889 -148658 -257707 188140 -185154 -29813 -94803 -113961 -201092
9870 -201092 69342 -30026 -477081 -149701 -213870 -80273 -289539 -64432 15519 -333606 -18678
9858 -113351 -184294 89020 -93123 -202763 84581 -468968 110995 -144352 -75863 -361097 -87515
9846 -6197 -429215 228039 31543 97070 155498 231199 -308654 -217990 15333 -57481 -29933
9835 -29933 -381227 -272780 -356112 -154249 105774 103890 -392902 -250338 -184923 -96981 32157
9823 -62342 92472 -43323 -388651 -36237 -267280 -119142 246076 -48665 34989 -128659 -274341
$$ packed form
9904b61632J25596b3784B0493L50503A06542J41364B9348N6731a95689j22947
9894c18636P6854L4356P7502j19777d491k2642I3742b828A33198g2700r2590c6101
9881b81767g9486k28396e9889q8769j09049A88140a85154b9813o4990j9158q7131
9870b01092F9342c0026m47055a49701o4169h0273k09266f4432A5519c33606a8678
9858a13351p0943H9020i3123j09640H4581d68968A10995a44352O8489k85234h7515
9846f197m23018B28039C1543O5527N8428P5701c08654R0664A5333e7481K7548
9835b9933l51294J08447q3332a54249A05774j884c92902J42564O5415Q7942C2157
9823f2342I2472d3323l45328c6237k31043a19142B46076d8665C4989a28659j45682
$$ plain form
9812 -274341 15966 -3121 -429313 -71746 -93987 83964 -24443 -218610 -284969 -17831 -147814
9801 -147814 116037 -313592 -238522 79062 -257167 -188422 129281 136521 292761 -157033 -348774
9790 -348774 -291808 -64729 -54551 -205632 -214125 -26351 94365 265668 -39707 265481 447993
9779 447993 -223382 -159997 142463 -270949 -244740 130048 -114937 -72181 -44542 42772 -103801
9767 -300580 -43621 -310688 -357076 6604 -28461 167417 -11680 -211439 -17710 -119179 -172306
9756 -172306 168980 131735 29114 -77591 129104 -84953 96554 95779 -57911 56921 -262480
9744 -167980 -203745 54420 145160 -115031 26750 25695 48464 -159155 -181667 -131392 -126128 167060
9731 -61213 -87183 55213 321151 -253274 -33225 5359 159943 -273345 -244727 -40199 -140788
$$ packed form
9812b74341A5966c121m26192g1746k2241H3964b4443j94167o6359a7831j29983
9801a47814A16037c13592P5070G9062b57167O8745A29281P240J56240a57033j91741
9790c48774N6966f4729J0178j51081q493b6351I4365J71303c9707B65481J82512
9779D47993b23382O3385A42463b70949K6209A30048a14937M2756K7639D2772a03801
9767c00580d3621k67067m6388F604b8461A67417a1680j99759a7710j01469n3127
9756a72306A68980l7245B9114g7591A29104h4953I6554p75e7911E6921b62480
9744a67980l5765E4420R0740a15031B6750j055K2769a59155k2512N0275N264A67060
9731f1213k5970E5213K65938b53274c3225E359J54584b73345K8618d0199j00589
$$ plain form
9720 -140788 -259463 4936 142257 -156780 -44254 33015 -193243 158930 121494 -271115 -50232
9708 56698 -239411 -22904 53645 -91697 -280124 -107568 -140018 -78573 -130604 -278249 -282645
9697 -282645 -21951 -148053 -302147 52251 174239 -91917 287870 44785 -275031 42671 -16762
9685 151670 108065 -214017 199860 -110937 271480 79723 -198078 -274324 -319524 -275194 27984
9673 -17935 -326240 -247763 -99045 -137752 -85516 248339 2016 -272802 -47553 -194447 -184532
9662 -184532 129781 -18020 -166913 -179515 -261306 77294 -170997 -21005 92322 -103434 -239171
9651 -239171 -131822 -216311 -4862 -97732 -19738 258375 305814 -139698 135893 -150120 45357
9639 32486 24007 92701 -372280 29148 -33584 -166157 -70776 95547 -78591 29922 -149162
$$ packed form
9720a40788j18675D936J37321a56780d4254C3015a93243A58930l7436b71115e0232
9708E6698b39411b2904E3645i1697j88427a07568l2450O1445n2031j47645m396
9697b82645b1951j26102j54094E2251J21988i1917B87870D4785b75031D2671a6762
9685A51670m3605b14017A99860a10937B71480G9723a98078p6246m5200M4330B7984
9673a7935l08305P8477i9045l8707N2236B48339B016b72802d7553j46894R915
9662a84532A29781a8020j48893j2602q1791G7294a70997b1005I2322a03434j35737
9651b39171J07349q4489d862r2870a9738B58375M7439a39698A35893a50120D5357
9639C2486q479O8694c72280B9148c3584j32573g0776I5547g8591B9922a49162
$$ plain form
9627 106177 101624 -226191 -213712 -39383 -72761 -281270 -149578 -394835 -43139 23578 111446
9616 111446 100661 374877 64789 -64357 -185114 -298381 -97444 6054 237525 78141 68520
9605 68520 -157878 36678 307150 -136182 -53187 258410 -98822 -234399 150829 -146866
9594 54120 -126204 16532 -178142 6154 -117469 -114079 144330 219584 -297011 -462815 1329
9582 -301977 -200498 -37351 -15543 -115649 96044 -6862 43661 -213060 -93948 30254 -208912
9570 -117349 -209278 108358 -130590 65410 130754 -19714 136876 6561 -136088 -243514 -303495
9559 -303495 -20041 -115104 -475412 -283367 -334547 -125590 -420858 49504 -154463 -61494 -384274
9548 -384274 72743 -51319 -292394 -200380 14925 -71366 71353 -114752 -53500 -13595 -116911
$$ packed form
9627A06177m553b26191J2479c9383l3378k08509J31692k45257d3139B3578Q7868
9616A11446j0785K74216F4789f4357j20757j13267i7444F054K31471G8141r621
9605F8520a57878C6678K70472a36182e3187B58410i8822j35577A50829a46866
9594E4120a26204A6532a78142F154a17469L390A44330P5254b97011j65804A329
9582c01977J01479c7351a5543j00106I6044f862D3661b13060i3948C0254b08912
9570a17349r1929A08358a30590F5410O5344a9714A36876F561a36088j07426n9981
9559c03495b0041r5063l60308J92045n1180a25590k95268D9504a54463f1494l22780
9548c84274G2743e1319k41075R2014A4925g1366G1353a14752e3500a3595j03316
$$ plain form
9537 -116911 298594 266402 -55032 164991 -250282 -291021 -137585 25506 -98168 -295222 202548
9525 -235505 -274905 -143729 -442114 -16332 -67440 -57632 -184853 245112 -16943 -220408 -75171
9513 105631 14734 199960 84472 140722 -64916 90073 -123314 -248629 -104099 -181747 -162471
9502 -162471 104709 -25466 -10052 -100374 3241 -59124 24279 -205776 191818 -64462 -176866
9491 -176866 -77823 -540770 117277 -224319 -101021 54289 -286781 -35762 -87156 -116308 -161800
9480 -161800 -301293 19796 -273764 -60436 -116696 65958 211955 -216884 388225 -221962
9469 -151059 189674 -195047 -417063 112997 -58385 13521 -144685 -98819 -85177 411651
9458 -109292 -80064 -414323 -485990 4047 -51313 153972 -62135 -173235 360266 -25923 11984
$$ packed form
9537a16911B98594l2192e5032A64991b50282m0739a37585B5506i8168j97054B02548
9525b35505l9400J31176k98385a6332n1108R808j27221B45112a6943k03465g5171
9513A05631A4734J85226H4472N6250f4916I0073a23314j25315a04099p7648J9276
9502a62471A04709b5466a0052r0322C241e9124B4279b05776A91818f4462j12404
9491a76866g7823m62947A17277b24319a01021E4289b86781c5762n1394k9152m5492
9480a61800j39493A9796b73764f0436n6260F5958J45997b16884C88225b21962
9469a51059A89674a95047k22016A12997e8385A3521a44685M5866J3642D11651
9458a09292K9228l34259p1667D047e1313A53972f2135j11100C60266b5923A1984
$$ plain form
9446 -185310 145539 231739 107340 -291637 -287748 153520 98767 165257 -71160 161404 25715
9434 -153372 73114 -87061 -93057 -10883 -51675 69616 -1651 73115 -50381 -306561 48878 -113536
9421 56913 -59573 174390 -164630 60480 74547 -169618 30361 -206920 -170094 -18753 -33271
9410 -33271 -143273 -539182 -21093 -11904 211787 -314761 -65819 -107899 73062 -251414 -16180
9398 -290854 207882 110430 180066 11371 18853 -95449 -148744 191048 -333522 56843 -21749
9386 -323788 -117766 338386 144614 47301 -33960 -101677 109623 -131147 29216 38673 -115978
9374 -1353 361517 -29088 -131261 66756 -57331 1546 -164683 101762 96352 188475 -161015
9362 20898 -219945 -153424 27121 -119671 -156532 72001 -198114 -268526 -146312 233280 43248
$$ packed form
9446a85310A45539Q6200A07340b91637L889A53520n4753O6490g1160A61404B5715
9434a53372G3114h7061n996a0883m0792F9616a651G3115e0381k56180D8878a13536
9421E6913e9573A74390a64630F0480J4067a69618C0361b06920L6826a8753j4518
9410c3271j10002l95909b1093R189B11787c14761f5819m2080G3062b51414a6180
9398b90854B07882r7452O9636A1371P482i5449n3295A91048c33522E6843b1749
9386c23788a17766C38386A44614D7301c3960o7717A09623a31147B9216R457a15978
9374a353C61517b9088j02173F6756e7331A546a64683A01762n410R2123a61015
9362B0898b19945O6521B7121a19671l6861G2001a98114p0412J22214B33280D3248
$$ plain form
9350 -311744 -16975 6785 -35213 -56068 57564 45124 150895 297038 -232619 -152650 -119623
9339 -119623 -259219 131224 179236 -229020 216080 -169116 -133291 -44850 -287104 -143392
9328 75391 137399 19151 -134581 -35626 -313643 -178668 -157300 -129633 -345787 166733 4246
9316 -6628 232341 -354263 -108893 -318751 5109 -185657 -220232 -244091 -154357 -167940 106079
9304 -313030 156879 75492 -431002 -92537 228332 47216 -49575 -7793 -94535 -74767 140007
9292 -191747 -179122 -176181 157176 134173 123586 1374 -71990 233335 130980 -108600 410344
9280 -37977 154815 79925 -364339 73654 -215005 167563 -210064 -154375 -257125 -300200 68126
9268 -111380 31848 10361 -255842 74943 412299 -295633 31109 -337412 -62678 -378531 -87551
$$ packed form
9350c11744a6975F785c5213k0855E7564j2440J05771J46143b32619P9969L3027
9339a19623j39596A31224M8012b29020B16080a69116L5825d4850k42254a43392
9328G5391O2008A9151a34581c5626k78017J34975K1368K7667k16154A66733D246
9316f628B32341c54263a08893k09858E109a85657l4575k3859Q9734j3583A06079
9304c13030A56879G5492d31002i2537B28332D7216d9575g793q6742J9768A40007
9292a91747J2625K941A57176k3003j0587A374g1990B33335j02355a08600D10344
9280c7977A54815p4890c64339G3654b15005A67563b10064N5689j02750m3075F8126
9268a11380C1848A0361b55842G4943L37356b95633C1109c37412f2678l15853h7551
$$ plain form
9256 -301425 -75273 -133689 -317171 -82244 -311710 79381 -413482 67663 268535 -197404 -182845
9245 -182845 202080 17693 146214 -90335 -290306 -15329 -379949 -81014 68597 66975 -304370
9233 23536 -210452 256413 63485 172811 -24112 -290325 -37304 117222 -266792 47372 78987
9222 78987 -284217 -33315 -173110 117721 -189536 -15917 -75637 243761 -145209 119713
9211 -70994 2500 -112875 70466 17438 -128545 254292 -362254 48754 -51082 -125439 -73743
9200 -73743 -188501 110859 -175983 -640821 -263545 -175924 -131869 64233 -219669 11599 -188319
9188 142388 106556 -152766 17209 24070 -87304 -10384 49372 -126263 -195127 17640 26755 131055
9176 131055 66214 119697 -176332 -11835 170893 -243602 -196472 114193 -78047 29092 -148911
$$ packed form
9256c01425g5273n8416j83482h2244k29466G9381d13482F7663K00872a97404J4559
9245a82845B02080A7693J28521i0335j99971a5329l64620h1014F8597j622c04370
9233B3536b10452B56413F3485J09326b4112k66213c7304A17222b66792D7372L1615
9222G8987b84217c3315j39795A17721a89536a5917n9720B43761a45209A19713
9211g0994B500a12875G0466A7438a28545B54292c62254D8754e1082p4357N1696
9200g3743j14758A10859a75983m64838b63545Q7621M4055F4233b19669A1599a88319
9188A42388l5832a52766A7209O861h7304a0384D9372a26263o8864A7640R115J04300
9176A31055o4841N3483a76332a1835A70893b43602M7130A14193g8047B9092a48911
$$ plain form
9164 -15880 -95228 -141100 160260 273877 159800 35560 125550 -229357 -298417 -361700 -92103
9152 -86660 -191299 -262339 -268109 184524 -36281 -214836 521 140865 -117581 76769 166945
9141 166945 -13082 65054 308834 10400 32289 212872 -19384 -79797 250562 193828 -77750
9129 -80084 29793 -283502 -182153 -48069 238879 -237250 -412186 -203907 -330385 167916
9118 119327 -69690 -93772 -23861 -19478 -159408 -61994 66168 -80071 174411 -266113 -75406
9106 194510 34155 -192912 -89855 14567 120088 -18365 -259880 -524 -212775 -20766 -276 6192
9093 -291342 16791 26746 22397 109427 -65143 101100 -14767 -131922 54881 40361 256160
9082 256160 85337 -38806 -67022 115825 -344376 207603 -140058 -183778 -139140 -138764 -258454
$$ packed form
9164a5880p9348m5872A60260J13617j14077C5560Q9990b29357o9060o3283i2103
9152h6660j04639p1040n770A84524c6281j78555E21J40344a17581G6769R0176
9141A66945a3082F5054K43780A0400K1889J80583a9384o0413B50562n6734g7750
9129h0084B9793b83502J01349d8069B38879b37250j74936b03907j26478A67916
9118A19327f9690k4082b3861M383j39930f1994F6168h0071A74411b66113g5406
9106A94510C4155a92912h9855A4567J05521a8365k41515e24k12251b0766b76F192
9093b91342A6791R955m349Q7030f5143A01100a4767j17155E4881j4520K15799
9082B56160H5337c8806k8216A15825c44376B07603a40058m3720M4638L76j19690
$$ plain form
9071 -258454 -36350 -285258 -87094 -231796 53484 -27188 109870 -51176 -203251 332458 -72456
9059 -109046 -225624 -67839 -219362 378974 -256801 309436 -95890 261281 -167580 -23860
9048 -272002 84915 107679 -354743 113066 87525 -36992 -83906 -219498 168238 -342132 -87051
9036 37816 -182855 -367941 129450 -353227 24571 -87271 -56426 -127493 -128218 -19403 -48241
9025 -48241 -192291 -88268 62572 -63697 -11615 -143962 -237084 -25601 70799 -262245 -20271
9013 -922 -246365 -138913 -261586 -327537 1087 -149081 153278 -33437 47627 -21909 -30481 -111873
9001 -111873 -284537 270003 -222341 72799 -205184 43024 -139181 250539 -105002 44849
8990 415251 -290544 -390797 -10963 -25117 -40169 -206945 -13698 313550 -186693 278278
$$ packed form
9071b58454c6350k48908h7094j44702E3484b7188A09870e1176j52075C32458g2456
9059a09046j16578f7839j51523C78974b56801C09436i5890B61281a67580b3860
9048b72002H4915K2764c54743A13066k5541c6992m6914j35592A68238c42132h7051
9036C7816a82855j85086A29450c53227B4571h7271L0845p1067p25a9403k8838
9025d8241j44050h8268F2572f3697a1615j32347r3122b5601G0799b62245b0271
9013i22k45443J07452j22673o5951A087a49081A53278c3437D7627b1909q572q1392
9001a11873j72664B70003b22341G2799b05184D3024a39181B50539a05002D4849
8990D15251b90544j00253a0963j4154j5052j66776a3698C13550a86693B78278
$$ plain form
8979 171363 224027 247512 -78099 -68883 149420 -148 -98904 136468 -518341 -8979 -238528 -70459
8966 -83030 -124326 -516162 9295 -226713 -215916 171692 -420068 24272 -89195 432886 59511
8954 -457750 251805 -167202 92068 -65832 -138440 -234251 -104948 -267104 113318 5393 -13077
8942 43922 -74536 -7354 -13926 35690 -231809 29215 -21368 -186755 -33374 176188 -55259 -245257
8930 -245257 -20513 -296717 17159 181680 132469 -51447 -226016 -37932 -333079 83007 -20119
8918 216914 99295 347887 408301 -61864 154432 4525 -105866 86929 37491 283919 327879
8907 327879 407408 1483091 1945636 3641076 7830203 5025387 2778831 1411279 915426
8898 915426 749656 543010 406897 6938 153813 68916 48153 -84052 489452 233794 31972
$$ packed form
8979A71363N2664K3485g8099R216A49420a48r8756A36468e18341h979k29549g0459
8966h3030m1296l91836I295b26713J0797A71692d20068B4272h9195D32886E9511
8954d57750B51805a67202I2068f5832p2608r5811a04948j62156A13318E393a3077
8942D3922g4536g354o572C5690b31809B9215b1368j65387c3374A76188e5259j89998
8930b45257b0513k76204A7159J64521m9211e1447j74569c7932k95147H3007b0119
8918B16914I9295K48592O0414f1864A54432D525a05866H6929C7491K46428M3960
8907C27879P9529J075683M62545J695440M189127k804816k246556j367552m95853
8898I15426j65770k06646j36113F938J46875F8916k0763h4052D89452B33794C1972
$$ plain form
8886 146213 -38691 15605 -55229 -105389 99204 -126551 -201078 -212286 -170445 -96570 -60165
8875 -60165 -423851 -202264 7101 -439236 -86836 94478 8583 -141904 -58477 210443 -25596
8863 -93290 206953 -420196 20293 -220580 -41965 -112006 -69041 120084 -76797 100889 34604
8851 -233007 -219280 176540 103625 -4571 -124437 -196338 -54119 -30931 -23718 -281274 -80549
8839 -340290 -409663 -69442 -354398 -81321 -110892 -260932 -3693 31400 -112980 99891 -41221
$$ packed form
8886A46213c8691A5605e5229n0160I9204a26551p4527j1208M1841P3875L6405
8875f0165l63686b02264G101d39236h6836I4478H583a41904e8477B10443b5596
8863i3290B06953d20196B0293b20580d1965p0041M2965A20084g6797A00889C4604
8851b33007J3727A76540p2915d571j19866p1901e4119K3188P213k57556h0549
8839c40290o9373f9442k84956h1321k9571j50040c693C1400a12980I9891d1221
$$ [...]
##END NTUPLES=NMR SPECTRUM
##END=
