
##TITLE=AC1170_Tolima-ibage-TCHAH12003_5890850_ekzEvXWs7J
##JCAMPDX= 6.0         $$ Bruker NMR JCAMP-DX V2.0
##DATA TYPE= NMR SPECTRUM
##DATA CLASS= NTUPLES
##ORIGIN= BRUKER
##OWNER= Administrator
$$ 1.72 TOPSPIN		Version 2.1
$$ 2012-04-02 17:47:34.468 -0500  Administrator@TOPSPIN
$$ Compression mode = diff/dup
##.OBSERVE FREQUENCY= 400.13188235
##.OBSERVE NUCLEUS= ^1H
##.ACQUISITION MODE= SIMULTANEOUS (DQD)
##.ACQUISITION SCHEME= undefined
##.AVERAGES= 64
##.DIGITISER RES= 22
##SPECTROMETER/DATA SYSTEM= spect
##.PULSE SEQUENCE= noesygpps1d.comp
##.SOLVENT NAME= COFFEE_meoh
##.SHIFT REFERENCE= INTERNAL, COFFEE_meoh, 1, 14.96853
##AUDIT TRAIL= $$ (NUMBER, WHEN, WHO, WHERE, PROCESS, VERSION, WHAT)
$$ ##TITLE= Audit trail, TOPSPIN		Version 2.1
$$ ##JCAMPDX= 5.01
$$ ##ORIGIN= Bruker BioSpin GmbH
$$ ##OWNER= Administrator
$$ $$ C:\Bruker\TOPSPIN/data/COFFEE/nmr/AC1170_Tolima-ibage-TCHAH12003_5890850_ekzEvXWs7J/12/pdata/1/auditp.txt
$$ ##AUDIT TRAIL=  $$ (NUMBER, WHEN, WHO, WHERE, PROCESS, VERSION, WHAT)
(   1,<2012-04-02 17:47:28.812 -0500>,<Administrator>,<TOPSPIN>,<go>,<TOPSPIN 2.1>,
      <created by zg
	started at 2012-04-02 17:35:56.671 -0500,
	POWCHK enabled, PULCHK disabled,
       configuration hash MD5:
       1A 1E CE 29 27 FD 77 03 67 4E F0 E3 C4 B2 CB 90
       data hash MD5: 64K
       1C 5E D4 69 74 A9 73 43 E6 22 4D 1F 40 A4 B9 B3>)
(   2,<2012-04-02 17:47:31.968 -0500>,<Administrator>,<TOPSPIN>,<proc1d>,<TOPSPIN 2.1>,
      <Start of raw data processing
       efp LB = 0.3 FT_mod = 6 PKNL = 1 PHC0 = 0 PHC1 = 0 SI = 128K 
       data hash MD5: 128K
       23 8A B9 53 C7 4A B3 D9 33 BC C7 5D 6E 44 07 13>)
(   3,<2012-04-02 17:47:33.500 -0500>,<Administrator>,<TOPSPIN>,<proc1d>,<TOPSPIN 2.1>,
      <pk PHC0 = 32.93701 PHC1 = 0 
       data hash MD5: 128K
       33 07 D9 23 BE CF 99 41 31 B9 DB A2 1C 1F E7 8E>)
(   4,<2012-04-02 17:47:33.828 -0500>,<Administrator>,<TOPSPIN>,<proc1d>,<TOPSPIN 2.1>,
      <abs ABSG = 1 
       data hash MD5: 128K
       CB 50 52 54 32 46 83 6C CB 21 22 DB 07 2A 44 5B>)
(   5,<2012-04-02 17:47:33.921 -0500>,<Administrator>,<TOPSPIN>,<proc1d>,<TOPSPIN 2.1>,
      <abs ABSG = 2 
       data hash MD5: 128K
       D1 CD DA 1C 63 D9 A5 73 A4 A7 2F 92 35 98 7C 06>)
(   6,<2012-04-02 17:47:34.046 -0500>,<Administrator>,<TOPSPIN>,<proc1d>,<TOPSPIN 2.1>,
      <abs ABSG = 3 
       data hash MD5: 128K
       81 89 24 47 E0 93 EA C6 E3 0E B5 53 D9 53 6B 25>)
(   7,<2012-04-02 17:47:34.281 -0500>,<Administrator>,<TOPSPIN>,<proc1d>,<TOPSPIN 2.1>,
      <abs ABSG = 4 
       data hash MD5: 128K
       95 C6 6F 11 40 45 5C 01 E2 C9 71 55 37 2E 0E 36>)
(   8,<2012-04-02 17:47:34.359 -0500>,<Administrator>,<TOPSPIN>,<proc1d>,<TOPSPIN 2.1>,
      <abs ABSG = 5 
       data hash MD5: 128K
       46 AA BD DE 8A D7 A4 A1 2E 6A A7 AD D2 E2 BA 34>)
$$ ##END=
$$ 
$$ $$ hash MD5
$$ $$ AD 0E 2E 26 E3 A6 A9 9C BA 41 A1 47 D4 DF 1C F0
##$RELAX= 
##$RELAX= 
##$RELAX= 
##$RELAX= 
##$RELAX= 
##$RELAX= 
##$RELAX= 
##$RELAX= 
$$ [...]
##$TP07= 0
##$TPNAME0= <>
##$TPNAME1= <>
##$TPNAME2= <>
##$TPNAME3= <>
##$TPNAME4= <>
##$TPNAME5= <>
##$TPNAME6= <>
##$TPNAME7= <>
##$TPOAL= (0..7)
0.5 0.5 0.5 0.5 0.5 0.5 0.5 0.5
##$TPOFFS= (0..7)
0 0 0 0 0 0 0 0
##$TUNHIN= 0
##$TUNHOUT= 0
##$TUNXOUT= 0
##$USERA1= <user>
##$USERA2= <user>
##$USERA3= <user>
##$USERA4= <user>
##$USERA5= <user>
##$V9= 5
##$VALIST= <valist>
##$VCLIST= <CCCCCCCCCCCCCCC>
##$VD= 0
##$VDLIST= <DDDDDDDDDDDDDDD>
##$VPLIST= <PPPPPPPPPPPPPPP>
##$VTLIST= <TTTTTTTTTTTTTTT>
##$WBST= 2048
##$WBSW= 25
##$XGAIN= (0..3)
0 0 0 0
##$XL= 0
##$YL= 0
##$YMAX_a= 13666548
##$YMIN_a= -6320502
##$ZGOPTNS= <>
##$ZL1= 120
##$ZL2= 120
##$ZL3= 120
##$ZL4= 120
##$ABSF1= 14.96853
##$ABSF2= -5.584001
##$ABSG= 5
##$ABSL= 3
##$ALPHA= 0
##$AQORDER= 0
##$ASSFAC= 0
##$ASSFACI= 0
##$ASSFACX= 0
##$ASSWID= 0
##$AUNMP= <proc_prof1d_extract.lims>
##$AXLEFT= 0
##$AXNAME= <>
##$AXNUC= <1H>
##$AXRIGHT= 0
##$AXTYPE= 0
##$AXUNIT= <>
##$AZFE= 0.1
##$AZFW= 0.1
##$BCFW= 0
##$BC_mod= 0
##$BYTORDP= 0
##$COROFFS= 0
##$CY= 15
##$DATMOD= 1
##$DC= 0
##$DFILT= <>
##$DTYPP= 0
##$F1P= 0
##$F2P= 0
##$FCOR= 0.5
##$FTSIZE= 131072
##$FT_mod= 6
##$GAMMA= 0
##$GB= 0
##$INTBC= 1
##$INTSCL= 1
##$ISEN= 128
##$LB= 0.3
##$LEV0= 0
##$LPBIN= 0
##$MAXI= 10000
##$MC2= 0
##$MEAN= 0
##$ME_mod= 0
##$MI= 0
##$NCOEF= 0
##$NC_proc= -3
##$NLEV= 6
##$NOISF1= 0
##$NOISF2= 0
##$NSP= 0
##$NTH_PI= 0
##$NZP= 0
##$OFFSET= 14.96853
##$PC= 1
##$PHC0= 32.93701
##$PHC1= 0
##$PH_mod= 1
##$PKNL= yes
##$PPARMOD= 0
##$PPDIAG= 0
##$PPIPTYP= 0
##$PPMPNUM= 2147483647
##$PPRESOL= 1
##$PSCAL= 4
##$PSIGN= 0
##$PYNMP= <proc.py>
##$REVERSE= no
##$SF= 400.130004833685
##$SI= 131072
##$SIGF1= 0
##$SIGF2= 0
##$SINO= 400
##$SIOLD= 131072
##$SPECTYP= <>
##$SREGLST= <1H.CDCl3>
##$SSB= 0
##$STSI= 131072
##$STSR= 0
##$SW_p= 8223.68421052632
##$SYMM= 0
##$S_DEV= 0
##$TDeff= 65536
##$TDoff= 0
##$TI= <>
##$TILT= no
##$TM1= 0
##$TM2= 0
##$TOPLEV= 0
##$USERP1= <user>
##$USERP2= <user>
##$USERP3= <user>
##$USERP4= <user>
##$USERP5= <user>
##$WDW= 1
##$XDIM= 131072
##$YMAX_p= 519730620
##$YMIN_p= -499960443
##$CURPLOT= <Network HP LaserJet P1505>
##$CURPRIN= <$Network HP LaserJet P1505>
##$DFORMAT= <normdp>
##$LAYOUT= <+/1D_H.xwp>
##$LFORMAT= <normlp>
##$PFORMAT= <normpl>
##$SURQMSG= 1
$$ End of Bruker specific parameters
$$ ---------------------------------
##NTUPLES= NMR SPECTRUM
##VAR_NAME=  FREQUENCY,     SPECTRUM/REAL,   SPECTRUM/IMAG
##SYMBOL=    X,             R,               I
##VAR_TYPE=  INDEPENDENT,   DEPENDENT,       DEPENDENT
##VAR_FORM=  AFFN,          ASDF,            ASDF
##VAR_DIM=   131072,        131072,          131072
##UNITS=     HZ,            ARBITRARY UNITS, ARBITRARY UNITS
##FACTOR=    0.0627417313425165, 1,          1
##FIRST=     8223.62146879498, -259,         -98723
##LAST=      0,             3420,            -99238
##MIN=       0,             -499960443,      0
##MAX=       8223.62146879498, 519730620,    0
$$ Real data points
##PAGE= N=1
##DATA TABLE= (X++(R..R)), XYDATA
$$ [...]
60671A746647j1435j1693j1975j2230j2197j1881j1380j0681r911r389r123q608
60659A616144p418n736m024k385o17J292K980L930L651J813j368m904p509q543
60645A587306q370p818p479p431p345o805n877n210n114m628k420J098L569L344
60631A526820J441k45j761m483q109j0425j0495j0161j1344j3534j5287j6819
60619A425598j9198k1743k2323k0317j7676j6574j7066j7495j6428j3829j0815
60608A232134q512o988n517l941l071l113k651l63K871M919N063M330L467K279
60594A220907J064R13K004L066L211L118L629M271M122L274K580K547L107L949
60580A261762M493M174L285K853L271L891M507O208R708J3575J5456J4869J3689
$$ plain form
60671 1746647 1735212 1723519 1711544 1699314 1687117 1675236 1663856 1653175 1643264 1633875 1624752 1616144
60659 1616144 1608726 1602990 1598966 1596581 1595964 1597256 1600236 1604166 1607817 1609630 1608262 1603358 1595849 1587306
60645 1587306 1578936 1571118 1563639 1556208 1548863 1542058 1536181 1530971 1525857 1521229 1518809 1519907 1523476 1526820
60631 1526820 1528261 1528016 1526255 1521772 1513663 1503238 1492743 1482582 1471238 1457704 1442417 1425598
60619 1425598 1406400 1384657 1362334 1342017 1324341 1307767 1290701 1273206 1256778 1242949 1232134
60608 1232134 1223622 1216634 1211117 1207176 1204105 1200992 1198341 1197978 1200849 1205768 1210831 1215161 1218628 1220907
60594 1220907 1221971 1222884 1224888 1227954 1231165 1234283 1237912 1242183 1246305 1249579 1252159 1254706 1257813 1261762
60580 1261762 1266255 1270429 1273714 1276567 1279838 1283729 1288236 1294444 1304152 1317727 1333183 1348052 1361741
60567A361741J3873J5551J7599J9280K0766K2354K3800K4741K5539K7061K9338
60556A601643L0996L0748K9089K7730K7449K7330K6068K3184J8922J3961R359
60545A866479N800K614j543o792j1688j5133j7531j9748k1945k3859k5264k5582
60533A705808k4229k1903k0397k0404k0492j9084j6378j3445j0623p959o183n825
60521A518886n987n392m158l358l245l184l001l132l521l440k488r64O32J828
60507A479476K312K531L700O389R475J1374J1863J1781J1565J1229J1283J2216
60495A585194J3268J3030J1328R421Q445Q751J0495J3465J6276J7267J6665J6707
60483A740312J9142K3599K8668L3477L7661M0933M3456M6035M9170N2259N3884
$$ plain form
60567 1361741 1375614 1391165 1408764 1428044 1448810 1471164 1494964 1519705 1545244 1572305 1601643
60556 1601643 1632639 1663387 1692476 1720206 1747655 1774985 1801053 1824237 1843159 1857120 1866479
60545 1866479 1872279 1874893 1873350 1866558 1854870 1839737 1822206 1802458 1780513 1756654 1731390 1705808
60533 1705808 1681579 1659676 1639279 1618875 1598383 1579299 1562921 1549476 1538853 1530894 1524711 1518886
60521 1518886 1512899 1507507 1503349 1499991 1496746 1493562 1490561 1487429 1483908 1480468 1477980 1477016 1477648 1479476
60507 1479476 1481788 1484319 1488019 1494408 1503883 1515257 1527120 1538901 1550466 1561695 1572978 1585194
60495 1585194 1598462 1611492 1622820 1632241 1640686 1649437 1659932 1673397 1689673 1706940 1723605 1740312
60483 1740312 1759454 1783053 1811721 1845198 1882859 1923792 1967248 2013283 2062453 2114712 2168596
60472B168596N2375M6148L4656J9596M432q029j7295k4217k9272l2278l3035l1353
60460B150324k6926k0029j2172n153N93O093J2133J7951K2052K4119K5534K7760
60448B222279L0683L3177L5262L8661M4759N2777O0964O9087P8569R0316J03676
60437B860210J17840J33129J50223J68952J88643K09174K30907K53768K77096
60428D589942L00429L24057L48695L74909M02851M32179M61409M86467M99655
60419H220593M91048M52608L81883K82111J59508K1781j20807k54987l67603m50384
60409H815751n02067n26556n29665n17072m93714m63725m30397l96154l62450
60400D593951l29808k98372k68694k41754k18065j96923j77016j57831j40157
$$ plain form
60472 2168596 2220971 2267119 2301775 2321371 2325803 2317774 2300479 2276262 2246990 2214712 2181677 2150324
60460 2150324 2123398 2103369 2091197 2086044 2086637 2092730 2104863 2122814 2144866 2168985 2194519 2222279
60448 2222279 2252962 2286139 2321401 2360062 2404821 2457598 2518562 2587649 2666218 2756534 2860210
60437 2860210 2978050 3111179 3261402 3430354 3618997 3828171 4059078 4312846 4589942
60428 4589942 4890371 5214428 5563123 5938032 6340883 6773062 7234471 7720938 8220593
60419 8220593 8711641 9164249 9546132 9828243 9987751 10009532 9888725 9633738 9266135 8815751
60409 8815751 8313684 7787128 7257463 6740391 6246677 5782952 5352555 4956401 4593951
60400 4593951 4264143 3965771 3697077 3455323 3237258 3040335 2863319 2705488 2565331
60391B565331j25130j13039j03184r4482q6027p7365o8785o1144n5078n0432m6740
60380A683925m3941m2060m0467l8147l4857l1433k8841k7267k6199k4870k2703
60369A323140j9814j7141j5579j5023j4722j4290j3700j2578j0587q342o790n625
60357A168949l588n35K107L247L205K572J508P06J385L350M709M516M082M452
60343A200665M453L028J825L078N897P315O504N569O173P708R027R915J0379J0209
60329A291745R801R831R744Q050M675J505K0l27q16j792k981m262n347n509m471
60314A309866l040k370k882m073m822l990j483J328K992L530L880M245M222M156
60300A311559M749N470N118M074M208O092Q075Q770Q863R566J0710J1442J1733
$$ plain form
60391 2565331 2440201 2327162 2223978 2129496 2043469 1966104 1897319 1836175 1781097 1730665 1683925
60380 1683925 1639984 1597924 1557457 1519310 1484453 1453020 1424179 1396912 1370713 1345843 1323140
60369 1323140 1303326 1286185 1270606 1255583 1240861 1226571 1212871 1200293 1189706 1181364 1174574 1168949
60357 1168949 1165361 1164826 1166933 1170180 1173385 1175957 1177465 1178171 1179556 1182906 1187615 1192131 1196213 1200665
60343 1200665 1205118 1208146 1209971 1213049 1218946 1226261 1232765 1238334 1244507 1252215 1261242 1271157 1281536 1291745
60329 1291745 1301546 1311377 1321121 1329171 1333846 1335351 1335371 1335044 1334228 1332436 1329455 1325193 1319846 1314337 1309866
60314 1309866 1306826 1304456 1301574 1297501 1292679 1288689 1287206 1288534 1291526 1295056 1298936 1303181 1307403 1311559
60300 1311559 1316308 1321778 1326896 1330970 1335178 1341270 1349345 1358115 1366978 1376544 1387254 1398696 1410429
60287A410429J2155J2877J3595J3732J2577J0117P862P466Q334Q188O341M484
60275A528157L631K461k3k159j727R88L959O099P535Q222P985P326O697N669L994
60260A588814K559J850N63k576o445q808r327r447r809r717q874p795o599n167
60246A509222m294m773n485m350j401J074J816J992K796L662L845L930M457M535
60232A517026L316J828J844L523N477O655P022O828O379O350P213Q326Q486P497
60218A597770O442O348P160Q278R475J0987J2936J4929J6222J6369J5863J6056
60206A738835J7987K1279K4449K6511K8019L0336L4016L8291M2151M5610M9640
60195B097124N4934O1069O7007P2274P7462Q3612R1107R9314J07361J15312J24160
$$ plain form
60287 1410429 1422584 1435461 1449056 1462788 1475365 1485482 1493344 1500810 1509144 1517332 1523673 1528157
60275 1528157 1531788 1534249 1534226 1532067 1530340 1531328 1535287 1541386 1548921 1557143 1565128 1572454 1579151 1584820 1588814
60260 1588814 1591373 1593223 1593786 1591210 1584765 1575957 1566630 1557183 1547374 1537657 1528783 1520988 1514389 1509222
60246 1509222 1504928 1500155 1494670 1490320 1488919 1489993 1491809 1493801 1496597 1500259 1504104 1508034 1512491 1517026
60232 1517026 1520342 1522170 1524014 1527537 1533014 1539669 1546691 1553519 1559898 1566248 1573461 1581787 1590273 1597770
60218 1597770 1604212 1610560 1617720 1625998 1635473 1646460 1659396 1674325 1690547 1706916 1722779 1738835
60206 1738835 1756822 1778101 1802550 1829061 1857080 1887416 1921432 1959723 2001874 2047484 2097124
60195 2097124 2152058 2213127 2280134 2352408 2429870 2513482 2604589 2703903 2811264 2926576 3050736
60184C050736J34448J45279J55256J64131J72782J81459J88990J94072J96588
60175D583741J96909J94583J88653J79109J67101J53600J38510J21364J02391
60166F025961Q2460O2325M2317K2736M256j2191k5884l6542m4040m8078m8384
60155F024936m5222l9337l1286k1070q691N198J9607L4243M9865O7282Q6055J04605
60143F246185J21817J38186J54642J70301J82296J88331J88632J84828J77644
60134G752862J66676J51784J33361J11532Q6403N9059L1078L039k5108n2116p5633
60123H342937r4782j10850j24399j33378j35503j31393j23800j14379j02636q7507
60113G184310o8704m6782k3163J41K1856M2363O2514Q1877R9004J12866J22983
$$ plain form
60184 3050736 3185184 3330463 3485719 3649850 3822632 4004091 4193081 4387153 4583741
60175 4583741 4780650 4975233 5163886 5342995 5510096 5663696 5802206 5923570 6025961
60166 6025961 6108421 6170746 6213063 6235799 6240055 6227864 6201980 6165438 6121398 6073320 6024936
60155 6024936 5979714 5940377 5909091 5888021 5879330 5884528 5904135 5938378 5988243 6055525 6141580 6246185
60143 6246185 6368002 6506188 6660830 6831131 7013427 7201758 7390390 7575218 7752862
60134 7752862 7919538 8071322 8204683 8316215 8402618 8461677 8492755 8495794 8470686 8418570 8342937
60123 8342937 8248155 8137305 8012906 7879528 7744025 7612632 7488832 7374453 7271817 7184310
60113 7184310 7115606 7068824 7045661 7045802 7067658 7110021 7172535 7254412 7353416 7466282 7589265
60102G589265J28559J28879J24389J16239J04812Q9901P2344N4226L7232K1689
60092H467535P487m861j4203j9111j8374j2027j831J0271K4264M1686O3219Q7760
60080H631815J13990J41673J70966K01619K33484K66980L02294L38713L75288
60071A0776822M11607M47534M82729N16589N48155N75599N96513O09117O12676
60062A5577341O06638N90183N63178N26738M82119M29572L68965L01126K27813
60053A9673673J50679P0873j0586r2534j73462k51032l21930l82898m31907m68184
60043A7762692m91505n02104n00928m89193m67593m36708l98271l55147l09573
60034A3811670k61911k11832j60294j09658o1924j7765K2439N7475Q5908J07101
$$ plain form
60102 7589265 7717824 7846703 7971092 8087331 8192143 8282044 8354388 8408614 8445846 8467535
60092 8467535 8475022 8470161 8455958 8436847 8418473 8406446 8404615 8414886 8439150 8480836 8544055 8631815
60080 8631815 8745805 8887478 9058444 9260063 9493547 9760527 10062821 10401534 10776822
60071 10776822 11188429 11635963 12118692 12635281 13183436 13759035 14355548 14964665 15577341
60062 15577341 16183979 16774162 17337340 17864078 18346197 18775769 19144734 19445860 19673673
60053 19673673 19824352 19895225 19884639 19792105 19618643 19367611 19045681 18662783 18230876 17762692
60043 17762692 17271187 16769083 16268155 15778962 15311369 14874661 14476390 14121243 13811670
60034 13811670 13549759 13337927 13177633 13067975 13006051 12988286 13010725 13068200 13154108 13261209
60024A3261209J20795J26047J21888J09116R0201O6839L8700N578l0158o4596
60014A3845619r5504j23485j49977j75361j99239k21373k41485k58617k71531
60005A2109047k79787k84089k85367k83559k77375k65531k48284k27508k04998
59996I752549j81074j55157j27299r8442o9481m0685j2105J6089M3688P0427R5899
59985I294409J19725J41510J60156J73672J80453J80545J74844J63330J45170
59976A0733814J20581R1434N9749K6512p739m2259p6492j10174j42239j70413
59966A0482774j92689k08700k18970k23396k21479k13745k01836j87027j69455
59957H645477j49054j26630j03315p9241n3452k5541L207L1005N7801Q5325J14407
$$ plain form
60024 13261209 13382004 13508051 13629939 13739055 13829256 13896095 13934795 13940373 13910215 13845619
60014 13845619 13750115 13626630 13476653 13301292 13102053 12880680 12639195 12380578 12109047
60005 12109047 11829260 11545171 11259804 10976245 10698870 10433339 10185055 9957547 9752549
59996 9752549 9571475 9416318 9289019 9190577 9121096 9080411 9068306 9084395 9128083 9198510 9294409
59985 9294409 9414134 9555644 9715800 9889472 10069925 10250470 10425314 10588644 10733814
59976 10733814 10854395 10945829 11005578 11032090 11024351 10982092 10905600 10795426 10653187 10482774
59966 10482774 10290085 10081385 9862415 9639019 9417540 9203795 9001959 8814932 8645477
59957 8645477 8496423 8369793 8266478 8187237 8133785 8108244 8111451 8142456 8200257 8285582 8399989
59946H399989J43327J69881J94239K18125K41322K60741K73420K78762K77123
59937A0456929K67894K50491K26176J97162J64309J27275Q6750M5028L999l6156
59927A1789857p5712j13733j48230j77393k00064k15472k23092k22906k15497
59918A0197758k02026j83903j62202j37292j09383p9297m8417j7772J2234M1144
59908I310844O8072R2294J13798J32892J49544J63396J73950J80393J81727J77797
59898A0744707J70002J60363J49846J38141J24933J10706R6331Q2786P1566O4391
59888A1913772O1813O2854O6796P4692Q8212J07590J31985J61483J97109K38549
59878A3104855K83368L29279L75923M23569M71012N15980N56757N92110O19842
$$ plain form
59946 8399989 8543316 8713197 8907436 9125561 9366883 9627624 9901044 10179806 10456929
59937 10456929 10724823 10975314 11201490 11398652 11562961 11690236 11776986 11822014 11826013 11789857
59927 11789857 11714145 11600412 11452182 11274789 11074725 10859253 10636161 10413255 10197758
59918 10197758 9995732 9811829 9649627 9512335 9402952 9323655 9275238 9257466 9269700 9310844
59908 9310844 9378916 9471210 9585008 9717900 9867444 10030840 10204790 10385183 10566910 10744707
59898 10744707 10914709 11075072 11224918 11363059 11487992 11598698 11695029 11777815 11849381 11913772
59888 11913772 11975585 12038439 12105235 12179927 12268139 12375729 12507714 12669197 12866306 13104855
59878 13104855 13388223 13717502 14093425 14516994 14988006 15503986 16060743 16652853 17272695
59869A7272695O36602O38964O23800N88202N30571M52130L56218K46000J24144
59860B1469326m819j33200k52432l56482m42667n10054n58171n87177n98499n94813
59850A7431012n79279n54385n21367m80952m34651l84825l33325k80736k27329
59841A3634163j74076j22110p1739k2769K4484O9284J11219J49889J83675K09740
59831A3991760K25753K31017K25539K08556J78780J35969Q1598J7997n2386j26414
59821A5118169j99675k67546l27129l77630m18696m49143m67978m76077m75823
59812A1658472m68951m55685m36251m12384l86478l59769l32135l03497k74572
59803H228750k46255k19194j94238j72473j54164j38222j23579j10789j01361
$$ plain form
59869 17272695 17909297 18548261 19172061 19760263 20290834 20742964 21099182 21345182 21469326
59860 21469326 21464507 21331307 21078875 20722393 20279726 19769672 19211501 18624324 18025825 17431012
59850 17431012 16851733 16297348 15775981 15295029 14860378 14475553 14142228 13861492 13634163
59841 13634163 13460087 13337977 13266238 13243469 13267953 13337237 13448456 13598345 13782020 13991760
59831 13991760 14217513 14448530 14674069 14882625 15061405 15197374 15278972 15296969 15244583 15118169
59821 15118169 14918494 14650948 14323819 13946189 13527493 13078350 12610372 12134295 11658472
59812 11658472 11189521 10733836 10297585 9885201 9498723 9138954 8806819 8503322 8228750
59803 8228750 7982495 7763301 7569063 7396590 7242426 7104204 6980625 6869836 6768475
59794F768475r5569r1790q8292q4785q1615p8169p3182o6480n9529n3870m9507
59783E945687m5220m0355l6098l4780l7867m4531n2432n9795o6292p1895p5760
59772E380662p6814p4934p0726o4601n6840m8208l9521l0748k1508j2234l927
59761D880601L225R901J6530K3151L0364L8965M8545N7888O6956P6828Q7059R4873
59749E434886R8111R7637R5782R3655R0991Q7320Q1847P3544O2949N2821M5335
59738F314878L9631L3941K9167K8023L1191L6759M3569N2733O5274Q0407R7161
59727F852734J16036J37918J62547J89178K17954K49516K83689L19413L55790
59718H884775L92781M30770M69423N06816N39728N64680N77512N71251N35977
$$ plain form
59794 6768475 6672906 6581116 6492824 6408039 6326424 6248255 6175073 6108593 6049064 5995194 5945687
59783 5945687 5900467 5860112 5824014 5789234 5751367 5706836 5654404 5594609 5528317 5456422 5380662
59772 5380662 5303848 5228914 5158188 5093587 5036747 4988539 4949018 4918270 4896762 4884528 4880601
59761 4880601 4883826 4893727 4910257 4933408 4963772 5002737 5051282 5109170 5176126 5252954 5340013 5434886
59749 5434886 5532997 5630634 5726416 5820071 5911062 5998382 6080229 6153773 6216722 6269543 6314878
59738 6314878 6354509 6388450 6417617 6445640 6476831 6513590 6557159 6609892 6675166 6755573 6852734
59727 6852734 6968770 7106688 7269235 7458413 7676367 7925883 8209572 8528985 8884775
59718 8884775 9277556 9708326 10177749 10684565 11224293 11788973 12366485 12937736 13473713
59709A3473713M63673L54706K19465P4009o5495j85994k79208l42616l78506l91435
59699A2942312l86491l69094l44180l14564k80963k44181k06322j69294j33237
59690A0493986r7292o1197k5472R368M3097P5777J07977J40588J73926K07333
59680A1068091K40026K72170L05059L40485L79617M21976M65731N09630N54430
59671A4557215O01812O52524P06447P63559Q23232Q83051R40309R94639J047160
59662B1969948J096713J139014J170124J188739J194225J184763J159480J121260
59654C1224266J075764J028417R83624R45955R19956R08337R10865R24704R45326
59645C9867214R67645R86968R98812R97709R77454R33350Q64000P70915O57469
$$ plain form
59709 13473713 13937386 14292092 14511557 14585566 14520071 14334077 14054869 13712253 13333747 12942312
59699 12942312 12555821 12186727 11842547 11527983 11247020 11002839 10796517 10627223 10493986
59690 10493986 10396694 10335497 10310025 10319393 10362490 10438267 10546244 10686832 10860758 11068091
59680 11068091 11308117 11580287 11885346 12225831 12605448 13027424 13493155 14002785 14557215
59671 14557215 15159027 15811551 16517998 17281557 18104789 18987840 19928149 20922788 21969948
59662 21969948 23066661 24205675 25375799 26564538 27758763 28943526 30103006 31224266
59654 31224266 32300030 33328447 34312071 35258026 36177982 37086319 37997184 38921888 39867214
59645 39867214 40834859 41821827 42820639 43818348 44795802 45729152 46593152 47364067 48021536
59636D8021536N28753L91170K51144J14790j0892j17989k00242k55218k83354
59627D8439698k85774k63805k19507j55262p3097K4805J35466K55790L83424N16279
59617D8758017O51848P87574R21133J049399J167405J268700J346007J391109
59609E7341192J394944J348762J245106J078472Q47377N57500K22455j39109n06645
59600F3390054q58881j175414j440468j645617j788818j872198j901631j886432
59592E0820595j837130j763467j674938j581685j493683j420257j371055j354484
59584C8323896j371852j413702j464229j508973j537640j542849j521233j476071
59576B6487347j415154j344839j267911j186837j105520j026613r49920q75078
$$ plain form
59636 48021536 48550289 48941459 49192603 49307393 49296501 49178512 48978270 48723052 48439698
59627 48439698 48153924 47890119 47670612 47515350 47442253 47467058 47602524 47858314 48241738 48758017
59617 48758017 49409865 50197439 51118572 52167971 53335376 54604076 55950083 57341192
59609 57341192 58736136 60084898 61330004 62408476 63255853 63813353 64035808 63896699 63390054
59600 63390054 62531173 61355759 59915291 58269674 56480856 54608658 52707027 50820595
59592 50820595 48983465 47219998 45545060 43963375 42469692 41049435 39678380 38323896
59584 38323896 36952044 35538342 34074113 32565140 31027500 29484651 27963418 26487347
59576 26487347 25072193 23727354 22459443 21272606 20167086 19140473 18190553 17315475
59568A7315475q03720p37435o75544o16865n62217n13089m68728m26593l85498
59559A2125786l46739l12090k82056k56189k33854k14169j96205j80111j67687
59550I936686j60898j59639j61499j64075j66909j70755j75508j79906j83002
59541H414495j84741j84936j82935j78700j73033j66118j57006j45265j32053
59532F909708j18719j05544r2646q0758o9878n8481m5658l2910k2105j2740l009
59521F267260P250J6714K4944L2465L8898M3340M6495N0309N5397O0658O5392
59510F709122O9913P4319P8845Q5423R6256J10412J24368J36677J49691J65620
59500G800646J83421K01072K18816K38166K59394K81917L05867L31308L56881
$$ plain form
59568 17315475 16511755 15774320 15098776 14481911 13919694 13406605 12937877 12511284 12125786
59559 12125786 11779047 11466957 11184901 10928712 10694858 10480689 10284484 10104373 9936686
59550 9936686 9775788 9616149 9454650 9290575 9123666 8952911 8777403 8597497 8414495
59541 8414495 8229754 8044818 7861883 7683183 7510150 7344032 7187026 7041761 6909708
59532 6909708 6790989 6685445 6592799 6512041 6442163 6383682 6338024 6305114 6283009 6270269 6267260
59521 6267260 6274510 6291224 6316168 6348633 6387531 6430871 6477366 6527675 6583072 6643730 6709122
59510 6709122 6779035 6853354 6932199 7017622 7113878 7224290 7348658 7485335 7635026 7800646
59500 7800646 7984067 8185139 8403955 8642121 8901515 9183432 9489299 9820607 10177488
59491A0177488L81124M04392M27585M49554M67738M81134M90725M96839M97818
59482A4274397M91863M78873M59805M35481M07011L76542L46002L14961K80855
59473A7865790K42266K01759J64653J34902J12670R6029Q4086P7722P7974Q4760
59463A9142611R7057J13389J31902J50385J66210J75923J75416J61334J32342
59454B0446569Q8727L1354l8155j16715k00409k85661l69018m46381n13993n70140
59444A8026178o14618o46607o64487o68010o59299o41095o15081n82229n43876
59435A2390876n01937m58704m16401l76094l37072k98335k60518k25092j91862
59426I324861j58975j25688r3296o2760l3060k949K7133N6112Q4142J12241J40871
$$ plain form
59491 10177488 10558612 10963004 11390589 11840143 12307881 12789015 13279740 13776579 14274397
59482 14274397 14766260 15245133 15704938 16140419 16547430 16923972 17269974 17584935 17865790
59473 17865790 18108056 18309815 18474468 18609370 18722040 18818069 18902155 18979877 19057851 19142611
59463 19142611 19239668 19353057 19484959 19635344 19801554 19977477 20152893 20314227 20446569
59454 20446569 20535296 20566650 20528495 20411780 20211371 19925710 19556692 19110311 18596318 18026178
59444 18026178 17411560 16764953 16100466 15432456 14773157 14132062 13516981 12934752 12390876
59435 12390876 11888939 11430235 11013834 10637740 10300668 10002333 9741815 9516723 9324861
59426 9324861 9165886 9040198 8946902 8884142 8851082 8848133 8875266 8931378 9015520 9127761 9268632
59415I268632J69898J99246K28574K56810K82874L06508L27696L45789L59676
59406A1745703L68155L69504L61380L41943L10833K68619K15877J53413Q3015
59397A4218442P449o9868j45177k15098k77642l32039l77326m11925m35055m47816
59387A1513945m52359m50545m43711m32834m18194l99522l77079l52330l27044
59378G860327l02265k78514k56265k35641k16068j96812j77727j59204j41688
59369E896143j25376j10063r5295q0948o7536n5477m4406l3793k3780j4597n650
59358E239222L618J2348J9237K4638L0390L7779M6942N7637O8424P5454P5105
59347E690794O8648O2141O0693O4803P2857Q4302R8778J14647J30871J48506J68118
$$ plain form
59415 9268632 9438530 9637776 9866350 10123160 10406034 10712542 11040238 11386027 11745703
59406 11745703 12113858 12483362 12844742 13186685 13497518 13766137 13982014 14135427 14218442
59397 14218442 14225891 14156023 14010846 13795748 13518106 13186067 12808741 12396816 11961761 11513945
59387 11513945 11061586 10611041 10167330 9734496 9316302 8916780 8539701 8187371 7860327
59378 7860327 7558062 7279548 7023283 6787642 6571574 6374762 6197035 6037831 5896143
59369 5896143 5770767 5660704 5565409 5484461 5416925 5361448 5317042 5283249 5259469 5244872 5239222
59358 5239222 5242840 5255188 5274425 5299063 5329453 5367232 5414174 5471811 5540235 5615689 5690794
59347 5690794 5759442 5821583 5882276 5947079 6019936 6104238 6203016 6317663 6448534 6597040 6765158
59336F765158J87104K02085K13205K24044K38100K57342K83183L16112L54223
59327I040556L94192M34394M75936N20606N68999O20497O73845P27564P80478
59318A4237067Q31555Q78563R17513R44446R57293R55144R36839R01984Q52965
59309B2413369P94419P30413O63023N93189N22025M51479L84351L22743K65451
59300B7140462K07841J45776P9083R937o1077j35220k12450k90161l65026m34221
59290B6084944m94876n44553n83052o12519o35319o53001o67336o80598o94015
59281B0519675p07027p18340p26557p29575p25129p12852o94721o72709o47058
59272A4185707o17553n85233n51605n17031m81083m44133m07466l71981l37717
$$ plain form
59336 6765158 6952262 7154347 7367552 7591596 7829696 8087038 8370221 8686333 9040556
59327 9040556 9434748 9869142 10345078 10865684 11434683 12055180 12729025 13456589 14237067
59318 14237067 15068622 15947185 16864698 17809144 18766437 19721581 20658420 21560404 22413369
59309 22413369 23207788 23938201 24601224 25194413 25716438 26167917 26552268 26875011 27140462
59300 27140462 27348303 27494079 27573162 27583099 27522022 27386802 27174352 26884191 26519165 26084944
59290 26084944 25590068 25045515 24462463 23849944 23214625 22561624 21894288 21213690 20519675
59281 20519675 19812648 19094308 18367751 17638176 16913047 16200195 15505474 14832765 14185707
59272 14185707 13568154 12982921 12431316 11914285 11433202 10989069 10581603 10209622 9871905
59263I871905l04711k73408k43925k15606j87882j61390j37540j16893r8398q0471
59253H051681o2457m4627k7228j0381N417J9731L3142M6728O0436P3112Q4419
59242H229973R5298J06032J15274J21884J26273J28829J28558J24942J19700J14627
59232I411390J08745R9983Q9214Q0039P4409P0950O8122O6844O8719P3620Q0473
59221A0292508Q9233J00522J13922J27974J41588J54336J65417J73331J76877
59212A1535708J75894J70296J58483J37543J05982O6331K4284j5146n0096q0699
59202A2228580j07037j29039j46914j60048j66380j64681j56877j46328j34121
59193A0917155j19029j00908q1828o3374m5103k6722r911L496J3785K2295K9238
$$ plain form
59263 9871905 9567194 9293786 9049861 8834255 8646373 8484983 8347443 8230550 8132152 8051681
59253 8051681 7989224 7944597 7917369 7906988 7912405 7932136 7965278 8012006 8072442 8145554 8229973
59242 8229973 8325271 8431303 8546577 8668461 8794734 8923563 9052121 9177063 9296763 9411390
59232 9411390 9520135 9620118 9709332 9789371 9863780 9934730 10002852 10069696 10138415 10212035 10292508
59221 10292508 10381741 10482263 10596185 10724159 10865747 11020083 11185500 11358831 11535708
59212 11535708 11711602 11881898 12040381 12177924 12283906 12350237 12374521 12359375 12309279 12228580
59202 12228580 12121543 11992504 11845590 11685542 11519162 11354481 11197604 11051276 10917155
59193 10917155 10798126 10697218 10615390 10552016 10506913 10480191 10470280 10473776 10487561 10509856 10539094
59182A0539094L4130L7645M1419M6197N1634N7870O6061P7106R1041J08072J29258
59171A1279527J55418J85919K19362K55180K93683L34394L75223M13723M48502
59162A3960931M78530N01503N13811N12130M94040M57199L99627L21799K27510
59153A7867080J21663P894j10809k30068l44134m47588n36099o06207o56066o86510
59143A4379156p00156o99301o85613o61632o31005n96811n60567n23159m85539
59134H835373m48173m10950l74494l40634l10844k84713k60688k37895k16591
59125E950391j97133j79352j62995j48257j35431j24150j13309j02091r0891q0762
59115D616020p1959o3578n4826m5910l7362k9207k1313j3829o597J141R664J8013
$$ plain form
59182 10539094 10573224 10610869 10652288 10698485 10750119 10807989 10874050 10951156 11042197 11150269 11279527
59171 11279527 11434945 11620864 11840226 12095406 12389089 12723483 13098706 13512429 13960931
59162 13960931 14439461 14940964 15454775 15966905 16460945 16918144 17317771 17639570 17867080
59153 17867080 17988743 17996637 17885828 17655760 17311626 16864038 16327939 15721732 15065666 14379156
59143 14379156 13679000 12979699 12294086 11632454 11001449 10404638 9844071 9320912 8835373
59134 8835373 8387200 7976250 7601756 7261122 6950278 6665565 6404877 6166982 5950391
59125 5950391 5753258 5573906 5410911 5262654 5127223 5003073 4889764 4787673 4696782 4616020
59115 4616020 4544061 4480483 4425657 4379747 4342385 4313178 4291865 4278036 4271439 4272580 4282244 4300257
59103D300257K5226L1675L8230M4811N0925N7001O3780P0808P7092Q3051R0217
59092D933073R8815J07162J13880J19471J25240J31563J37636J42236J44654J45447
59082F199177J46017J46656J45448J40357J31853J21954J11045R7837Q2465O7340
59072G390149N4092M1849K9793J9555J3299J0697R805J0197J3456K0711L1240
59061G644843M3721N7621P3011Q9826J07856J26978J46961J67208J87172K07057
59051H852254K27714K49288K70092K87639L01202L12323L22023L28279L27437
59042A1478251L17418K98132K69339K30169J81018J24313O3061K07o0368j14402
59032A2787138j60007j98504k31482k58286k77604k90079k97881l02523l04718
$$ plain form
59103 4300257 4325483 4357158 4395388 4440199 4491124 4548125 4611905 4682713 4759805 4842856 4933073
59092 4933073 5031888 5139050 5252930 5372401 5497641 5629204 5766840 5909076 6053730 6199177
59082 6199177 6345194 6491850 6637298 6777655 6909508 7031462 7142507 7240344 7322809 7390149
59072 7390149 7444241 7486090 7515883 7535438 7548737 7559434 7569239 7579436 7592892 7613603 7644843
59061 7644843 7688564 7746185 7819196 7909022 8016878 8143856 8290817 8458025 8645197 8852254
59051 8852254 9079968 9329256 9599348 9886987 10188189 10500512 10822535 11150814 11478251
59042 11478251 11795669 12093801 12363140 12593309 12774327 12898640 12961701 12961908 12901540 12787138
59032 12787138 12627131 12428627 12197145 11938859 11661255 11371176 11073295 10770772 10466054
59023A0466054l05664l06782l08279l09225l09075l08079l06270l03117k98313
59014G711250k92228k85450k78294k70584k61496k50080k36665k23272k11731
59005E401450k01685j91389j80232j69211j58937j48542j37294j26096j16357
58996C971707j07986r9748r1435q4376p9400p5421p0983o6596o4123o3968o4224
58985C103447o3239o1762o1456o2033o1302n7836n2355m6410m0936l6513l3810
58974B525795l2859l2402l0725k7051k1889j6375j1616q215n913l828j387J034
58962B334569K535K568J452J63k47N91J974K708K258J211N92R23J999L379M847
58947B361522O379P904R285J0614J2169J3753J4487J3881J2775J2368J2371J1459
$$ plain form
59023 10466054 10160390 9853608 9545329 9236104 8927029 8618950 8312680 8009563 7711250
59014 7711250 7419022 7133572 6855278 6584694 6323198 6073118 5836453 5613181 5401450
59005 5401450 5199765 5008376 4828144 4658933 4499996 4351454 4214160 4088064 3971707
58996 3971707 3863721 3763973 3672538 3588162 3508762 3433341 3362358 3295762 3231639 3167671 3103447
58985 3103447 3040208 2978446 2916990 2854957 2793655 2735819 2683464 2637054 2596118 2559605 2525795
58974 2525795 2492936 2460534 2429809 2402758 2380869 2364494 2352878 2344663 2338750 2334922 2333535 2334569
58962 2334569 2337104 2339672 2341124 2341287 2341040 2341631 2343605 2346313 2348571 2349782 2350374 2351297 2353296 2356675 2361522
58947 2361522 2367901 2375805 2385090 2395704 2407873 2421626 2436113 2449994 2462769 2475137 2487508 2498967
58935B498967R686Q928J0210J2050J2695J2785J4120J6573J8112J7731J6683J6655
58923B665195J8024K0177K2439K4310K5619K6724K8138K9980L2283L5278L8739
58912B966906M1609M3313M4871M7514N0766N3239N4930N7147O0363O3790O7068
58901C551516P0647P4248P6572P7145P7231P8322Q0653Q3535Q6224Q8287R0155
58890D434535R3471R9737J08326J16929J24215J31095J39149J48849J59681J71125
58880E727112J83133J96199K10983K27387K44467K62055K81568L03856L27196
58871G963956L49424L71578L97165M27787M61682M96774N32957N70890O10931
58862A2183144O54106P01973P54306Q08484Q62106R14737R66456J016516J064362
$$ plain form
58935 2498967 2508653 2517581 2527791 2539841 2552536 2565321 2579441 2596014 2614126 2631857 2648540 2665195
58923 2665195 2683219 2703396 2725835 2750145 2775764 2802488 2830626 2860606 2892889 2928167 2966906
58912 2966906 3008515 3051828 3096699 3144213 3194979 3248218 3303148 3360295 3420658 3484448 3551516
58901 3551516 3622163 3696411 3772983 3850128 3927359 4005681 4086334 4169869 4256093 4344380 4434535
58890 4434535 4528006 4627743 4736069 4852998 4977213 5108308 5247457 5396306 5555987 5727112
58880 5727112 5910245 6106444 6317427 6544814 6789281 7051336 7332904 7636760 7963956
58871 7963956 8313380 8684958 9082123 9509910 9971592 10468366 11001323 11572213 12183144
58862 12183144 12837250 13539223 14293529 15102013 15964119 16878856 17845312 18861828 19926190
58853A9926190J109741J150206J180175J194101J189403J164756J116771J040447
58845B9071790R32561P93604O27099M38488K34577K3125j87256l87357n68953
58836C0977678p26989q59528r65465j043620j094531j121543j128952j119950
58828B2917100j096936j062618j019799r70959r18597q65027q11306p57565p04864
58819A4709429o55469o10691n69835n31946m97125m65443m36118m08703l83600
58810A0150499l60579l38324l16315k95487k75987k56220k35478k15619j98361
58801G658129j82574j66290j49973j35435j22515j09274r5173q1774p0119n9296
58791F485706m7939l5899k3871j2192m34J2109K5587L9264N2344O5105P8545R2956
$$ plain form
58853 19926190 21035931 22186137 23366312 24560413 25749816 26914572 28031343 29071790
58845 29071790 30004351 30797955 31425054 31863542 32098119 32121244 31933988 31546631 30977678
58836 30977678 30250689 29391161 28425696 27382076 26287545 25166002 24037050 22917100
58828 22917100 21820164 20757546 19737747 18766788 17848191 16983164 16171858 15414293 14709429
58819 14709429 14053960 13443269 12873434 12341488 11844363 11378920 10942802 10534099 10150499
58810 10150499 9789920 9451596 9135281 8839794 8563807 8307587 8072109 7856490 7658129
58801 7658129 7475555 7309265 7159292 7023857 6901342 6792068 6696895 6615121 6545002 6485706
58791 6485706 6437767 6401868 6377997 6365805 6365371 6377480 6403067 6442331 6494675 6559780 6638325 6731281
58779F731281J07728J22593J37794J53040J67739J82568J99249K18175K37894
58770H258061K57427K77471K98665L20630L43568L68984L97707M28980M62489
58761A1413982M99258N39375N80996O23310O68464P18485P72055Q26439Q80941
58752A7523305R36009R89961J039175J080861J113390J134047J138360J121755
58744B6076863J080748J012899R16668P91323O36960M56017K55475M5878j63015
58735C1109816l64388n51970p18256q57287r67472j049840j105242j135361j144569
58726B3215431j137906j118090j086570j046348j001340r53695r04037q53550
58718A5113895q03695p54604p05983o59107o15989n77016n41056n07370m75813
$$ plain form
58779 6731281 6839009 6961602 7099396 7252436 7420175 7602743 7801992 8020167 8258061
58770 8258061 8515488 8792959 9091624 9412254 9755822 10124806 10522513 10951493 11413982
58761 11413982 11913240 12452615 13033611 13656921 14325385 15043870 15815925 16642364 17523305
58752 17523305 18459314 19449275 20488450 21569311 22682701 23816748 24955108 26076863
58744 26076863 27157611 28170510 29087178 29878501 30515461 30971478 31226953 31272831 31109816
58735 31109816 30745428 30193458 29475202 28617915 27650443 26600603 25495361 24360000 23215431
58726 23215431 22077525 20959435 19872865 18826517 17825177 16871482 15967445 15113895
58718 15113895 14310200 13555596 12849613 12190506 11574517 10997501 10456445 9949075 9473262
58709I473262m46025m17921l92106l68336l44899l21070k98697k79427k62073
58700F342708k44803k28168k13250j98618j82446j66411j53911j45058j36736
58691D673307j27332j18062j09791j01780r3905q7037q0829p3993o7217o3023
58681C750338o1859o0942n8048n4234n1670n0600m9647m7806m5135m2357m0427
58670C187613l9827m0132m0793m1884m3334m4225m4101m4179m5774m8217m9957
58659B705190n0971n2348n3987n4531n3402n1414m9622m8640m8562m8476m6942
58648B146295m3893m0890l8641l6108l3149l1659l2212l2181k9674k6872k6383
58637A774633k6758k5259k2937k2724k3985k3458k0687j8155j6553j4286j1416
$$ plain form
58709 9473262 9027237 8609316 8217210 7848874 7503975 7182905 6884208 6604781 6342708
58700 6342708 6097905 5869737 5656487 5457869 5275423 5109012 4955101 4810043 4673307
58691 4673307 4545975 4427913 4318122 4216342 4122437 4035400 3954571 3880578 3813361 3750338
58681 3750338 3688479 3627537 3569489 3515255 3463585 3412985 3363338 3315532 3270397 3228040 3187613
58670 3187613 3147786 3107654 3066861 3024977 2981643 2937418 2893317 2849138 2803364 2755147 2705190
58659 2705190 2654219 2601871 2547884 2493353 2439951 2388537 2338915 2290275 2241713 2193237 2146295
58648 2146295 2102402 2061512 2022871 1986763 1953614 1921955 1889743 1857562 1827888 1801016 1774633
58637 1774633 1747875 1722616 1699679 1676955 1652970 1629512 1608825 1590670 1574117 1559831 1548415
58626A548415r790r148p222m023k031j696q49Q98J189p40k639l245m109o112p608
58611A491290p488p108p693q406q251p432n982l470p64M30L17P28J848K059J284
58596A441362J328K616L823N082Q013J1951J3896J3168J2548J3827J5925J8428
58584A561967K3033K9754L5535L8566M0696M3652M6209M7284M8666N2278N7337
58573B024977O2419O7910P4411Q1047Q7263R4194J02671J11966J21735J32889
58563B961482J45421J57957J70590J85346K02718K20697K38347K57017K76718
58554D816293K94911L10511L25344L39455L48595L48758L39752L21775K92202
58545G737596K49099J94950J33703O6832m251p4540j37878j91410k34725k66775
$$ plain form
58626 1548415 1538625 1529477 1522255 1518232 1516201 1514505 1513656 1514554 1515743 1515003 1512364 1509119 1505010 1498898 1491290
58611 1491290 1483802 1476694 1469001 1460595 1452344 1444912 1438930 1435460 1434696 1435126 1435443 1436171 1438019 1440078 1441362
58596 1441362 1442690 1445306 1449129 1454211 1462224 1474175 1488071 1501239 1513787 1527614 1543539 1561967
58584 1561967 1585000 1614754 1650289 1688855 1729551 1773203 1819412 1866696 1915362 1967640 2024977
58573 2024977 2087396 2155306 2229717 2310764 2398027 2492221 2594892 2706858 2828593 2961482
58563 2961482 3106903 3264860 3435450 3620796 3823514 4044211 4282558 4539575 4816293
58554 4816293 5111204 5421715 5747059 6086514 6435109 6783867 7123619 7445394 7737596
58545 7737596 7986695 8181645 8315348 8382180 8377929 8303389 8165511 7974101 7739376 7472601
58535G472601k87064k98202l03710l04168k98169k86122k70593k53816k36928
58526D933829k20563k04377j87214j69359j53016j39148j26036j12699j01243
58517C520174r3459q7491q0626p3490o8577o6220o4722o3180o1627n9568n6740
58506B744474n4257n3055n2369n1465n1240n2291n3156n2564n1600n1564n1422
58495B169491m9661m7029m5138m3811m1946l9595l7221l4406l1216k9150k8873
58484A741445k8714k7177k4988k2945k0174j6626j4687j5640j6916j5751j3472
58473A524355j2946j3720j3084j0620q370p356o850o409o140n692n052n402p395
58460A415319r767j1387j3042j5352j6887j6455j5391j5211j4952j3339j1620
$$ plain form
58535 7472601 7185537 6887335 6583625 6279457 5981288 5695166 5424573 5170757 4933829
58526 4933829 4713266 4508889 4321675 4152316 3999300 3860152 3734116 3621417 3520174
58517 3520174 3426715 3339224 3258598 3185108 3116531 3050311 2985589 2922409 2860782 2801214 2744474
58506 2744474 2690217 2637162 2584793 2533328 2482088 2429797 2376641 2324077 2272477 2220913 2169491
58495 2169491 2119830 2072801 2027663 1983852 1941906 1902311 1865090 1830684 1799468 1770318 1741445
58484 1741445 1712731 1685554 1660566 1637621 1617447 1600821 1586134 1570494 1553578 1537827 1524355
58473 1524355 1511409 1497689 1484605 1473985 1465615 1458259 1451409 1445000 1438860 1433168 1428116 1422714 1415319
58460 1415319 1405552 1394165 1381123 1365771 1348884 1332429 1317038 1301827 1286875 1273536 1261916
58449A261916j1626j2611j2732j2041j1562j0851r067o978n652m693l883m519
58437A155701o842q310p006m663l724l624k901k547m017n908o057n173n103n223
58423A084603l825j480J23J127K170J927p02l662m277l185k584k484j891j756
58409A064104l034l805k096K44M27l58Q31L277M020L438M577P458Q730P000M505
58394A099318L333L379M042M677L715L18l543n533o544q792j1525j2128j0566
58381A060151r182q828q578q461r025q981o818l996l139l885l964l390l866m841
58367I73197m095j862o36j045j191J4J843L696N408O203N879N938P091P340N370
58352A013150L796N692R712J2292J2869J3156J3170J2099J1376J2661J4274J3760
$$ plain form
58449 1261916 1250290 1237679 1224947 1212906 1201344 1190493 1181426 1174448 1168796 1164103 1160220 1155701
58437 1155701 1148859 1140549 1133543 1128880 1125156 1121532 1118631 1116084 1112067 1106159 1100102 1094929 1089826 1084603
58423 1084603 1080778 1079298 1079421 1080548 1082718 1084645 1083943 1080281 1076004 1072819 1070235 1067751 1065860 1064104
58409 1064104 1061070 1057265 1055169 1055413 1055840 1055482 1056313 1059590 1063610 1067048 1071625 1079083 1087813 1094813 1099318
58394 1099318 1102651 1106030 1110072 1114749 1118464 1118782 1115239 1109706 1103162 1094370 1082845 1070717 1060151
58381 1060151 1050969 1042141 1033563 1025102 1016077 1007096 1000278 996282 993143 989258 985294 981904 978038 973197
58367 973197 969102 967240 966604 965559 964368 964382 966225 969921 975329 981532 987411 993349 1000440 1007780 1013150
58352 1013150 1016946 1022638 1032350 1044642 1057511 1070667 1083837 1095936 1107312 1119973 1134247 1148007
58340A148007J2366J2803J4227J3910J2151J0959R571O140K253Q06Q88k64j778
58327A242039r95P23j17k528k179J356M251N025N992Q064R416R472R517R364P807
58312A307207N862N364N299M017L475O182R670R670P220O636P908P561N836O112
58298A398019P863P270M445L217L816K794K97L01L145M766M066M291O227O806
58284A457323N356M720N235M108J700J974N541Q507R243J0144J1928J2426J1796
58271A550001J2580J4083J3108J0657J1149J4636J6755J6819J8462K1742K2418
58260A722410K0037J8841J9452J7755J3564J2168J5136J7631J7147J7131J9395
58249A910667K0760K0090K1208K5680K9559L0201K9963L0791L1408L1875L4426
$$ plain form
58340 1148007 1160373 1173176 1187403 1201313 1213464 1224423 1233994 1240134 1242387 1243193 1244081 1243817 1242039
58327 1242039 1241044 1241767 1241650 1239122 1236943 1238299 1242550 1247575 1253567 1261631 1271047 1280519 1290036 1299400 1307207
58312 1307207 1313069 1318433 1323732 1327749 1331224 1337406 1347076 1356746 1363966 1370602 1378510 1386071 1391907 1398019
58298 1398019 1405882 1413152 1417597 1420814 1424630 1427424 1427721 1428022 1431167 1435933 1439999 1444290 1450517 1457323
58284 1457323 1462679 1467399 1472634 1476742 1478442 1480416 1485957 1494464 1503707 1513851 1525779 1538205 1550001
58271 1550001 1562581 1576664 1589772 1600429 1611578 1626214 1642969 1659788 1678250 1699992 1722410
58260 1722410 1742447 1761288 1780740 1798495 1812059 1824227 1839363 1856994 1874141 1891272 1910667
58249 1910667 1931427 1951517 1972725 1998405 2027964 2058165 2088128 2118919 2150327 2182202 2216628
58238B216628L8159L9282L7878L7689L8702L7409L4762L5524L9010L9355L5962
58227B630360L4576L6787L7927L6893L8178M2392M4712M4692M7363N2536N3693
58216C100109N0088M9098N3673N8192N9799O2782O8491P2113P3024P7112Q5322
58205C809803R1210R3256R7806J06429J12766J15605J22172J34399J45124J52215
58195D980785J62540J77271J87748J91463J97427K09818K21168K27990K37663
58186F793873K53003K65905K73854K86520L07719L27233L39314L52710L73091
58177I573222L92480M06178M22862M47393M70900M89135N13182N50289N91823
58168A3857464O31751O78709P37616P98476Q56006R20623R97230J074559J149344
$$ plain form
58238 2216628 2254787 2294069 2331947 2369636 2408338 2445747 2480509 2516033 2555043 2594398 2630360
58227 2630360 2664936 2701723 2739650 2776543 2814721 2857113 2901825 2946517 2993880 3046416 3100109
58216 3100109 3150197 3199295 3252968 3311160 3370959 3433741 3502232 3574345 3647369 3724481 3809803
58205 3809803 3901013 3994269 4092075 4198504 4311270 4426875 4549047 4683446 4828570 4980785
58195 4980785 5143325 5320596 5508344 5699807 5897234 6107052 6328220 6556210 6793873
58186 6793873 7046876 7312781 7586635 7873155 8180874 8508107 8847421 9200131 9573222
58177 9573222 9965702 10371880 10794742 11242135 11713035 12202170 12715352 13265641 13857464
58168 13857464 14489215 15167924 15905540 16704016 17560022 18480645 19477875 20552434 21701778
58159B1701778J238286J350500J471069J587808J710027J844509J980132K115260
58151C4999369K272165K463350K672732K891986L144208L448862L799128M200942
58143E9892742M695851N313812O042798O877408P852603Q994762J0293666J1762646
58135A21726288J3454761J5356068J7336205J9292509K1298888K3573264K6413068
58128B58451051L0175134L4908840L9486354M1177223L6872147K5485551R294732
58121D75851032p307531k0523021k8860654l2833102l3708626l2675113l0634552
58114B89308433k8181244k5604918k3018530k0517283j8190195j6054166j4084745
58107A43657352j2298301j0731033r354844q088136o886793n763401m722542l747054
$$ plain form
58159 21701778 22940064 24290564 25761633 27349441 29059468 30903977 32884109 34999369
58151 34999369 37271534 39734884 42407616 45299602 48443810 51892672 55691800 59892742
58143 59892742 64588593 69902405 75945203 82822611 90675214 99669976 109963642 121726288
58135 121726288 135181049 150537117 167873322 187165831 208464719 232037983 258451051
58128 258451051 288626185 323535025 363021379 404198602 441070749 466556300 475851032
58121 475851032 468543501 448020480 419159826 386326724 352618098 319942985 289308433
58114 289308433 261127189 235522271 212503741 191986458 173796263 157742097 143657352
58107 143657352 131359051 120628018 111273174 103185038 96298245 90534844 85812302 82065248
58099H2065248k856044k095687j428509p05477J47039R06201J113728M47049r57363
58090G6636185k573683l873212m631610m913752m875321m639957m302056l937674
58082D2888920l580531l227231k881950k569846k303493k069397j857357j674795
58074B2724320j522279j382096j243935j119158j017619r31231q51945p85688
58066A3870369p35815o90933o42037n95722n58672n24193m85672m48906m19655
58057H768764l92343l61997l34641l15344k98307k78952k63856k58466k56463
58048F008395k51124k46045k44916k41841k31858k20529k13275k05363j92160
58039C961284j79149j71795j65160j53631j41702j34983j29335j19160j08152
$$ plain form
58099 82065248 79209204 77113517 75685008 74979531 75126570 76032771 77146499 77593548 76636185
58090 76636185 74062502 70189290 65557680 60643928 55768607 51128650 46826594 42888920
58082 42888920 39308389 36081158 33199208 30629362 28325869 26256472 24399115 22724320
58074 22724320 21202041 19819945 18576010 17456852 16439233 15508002 14656057 13870369
58066 13870369 13134554 12443621 11801584 11205862 10647190 10122997 9637325 9188419 8768764
58057 8768764 8376421 8014424 7679783 7364439 7066132 6787180 6523324 6264858 6008395
58048 6008395 5757271 5511226 5266310 5024469 4792611 4572082 4358807 4153444 3961284
58039 3961284 3782135 3610340 3445180 3291549 3149847 3014864 2885529 2766369 2658217
58030B658217j01721r6588q8026p9863p7225p6256p1166o4939o3201o3434o0196
58019A815602n5526n4552n5550n3596m9722m7825m6609m2651l7465l4054l0669
58008A307383k5052k0365j9776j9848j6509j2776j3255j5609j5091j3059j3392
57997A122651j4569j3010j0574j1235j3650j4141j3777j5529j7595j6354j3076
57986I69141j1219j0044p082l951l579m536l930k902l631m211k148M95R83J257
57972I14643L721N657L773N18l40n36l274o250n577l233l646n916o355n803p370
57957H80012r545q782o620p172r514r490p278o444p098o790o540r153j2767j2931
57943G59888j0195r033j0015r548o958n451o019o281n506n404n860n006l475l783
$$ plain form
58030 2658217 2556496 2459908 2371882 2292019 2214794 2138538 2067372 2002433 1939232 1875798 1815602
58019 1815602 1760076 1705524 1649974 1596378 1546656 1498831 1452222 1409571 1372106 1338052 1307383
58008 1307383 1282331 1261966 1242190 1222342 1205833 1193057 1179802 1164193 1149102 1136043 1122651
57997 1122651 1108082 1095072 1084498 1073263 1059613 1045472 1031695 1016166 998571 982217 969141
57986 969141 957922 947878 940796 936845 933266 928730 924800 921898 918267 914056 911908 912403 913386 914643
57972 914643 918364 924021 927794 928312 927972 927436 924162 917912 912335 909102 905456 899540 893185 887382 880012
57957 880012 870467 861685 855065 847893 838379 828889 821611 815167 808069 801279 794739 785586 772819 759888
57943 759888 749693 740660 730645 721097 714139 708688 702669 696388 690882 685478 679618 674612 671137 667354
57929F67354n609o284n572n509o018n224l396k280j259J288L804L396J002O9R46
57914F36708J266R27J711K767J524j289k517k083k797m827n336l753k664l064
57900F16573l059j867j149j762k695l511m642n379m706l684l934m447l185r25
57886E71628n6m85k37Q65J662K506L959M069J102k367k458M4J152L6q23r51k408
57869E77238n281p377q256r205r606p743m867l879m256k791P42L300L820M120
57855E25959M672M155L348M682P527Q618P633P650R559J0663R670Q438P857O463
57841F26894M299L694M938N283L504J519L50j526m460o286o189o189p307p852
57827F10672p020o715q165r927j0716j1182j1576j0789q902p695p357n759k145
$$ plain form
57929 667354 661745 655461 649889 644380 638362 633138 629742 627462 626203 627491 631295 634691 635693 635762 636708
57914 636708 637974 638901 640612 643379 644903 643614 641097 639014 636217 631390 626054 622301 619637 616573
57900 616573 613514 611647 610498 608736 606041 602530 597888 592509 587803 584119 580185 575738 572553 571628
57886 571628 571572 571087 570850 571715 573377 575883 579842 583911 585013 582646 580188 580232 581384 581420 580597 579646 577238
57869 577238 571957 564580 556324 547119 537513 529770 524903 521024 516768 513977 514719 518019 521839 525959
57855 525959 530631 534786 538134 542816 550343 558961 566594 574244 583803 594466 604136 612574 620431 626894
57841 626894 631193 634887 639825 645108 648612 650131 650481 648955 644495 638209 632020 625831 618524 610672
57827 610672 603652 596937 588772 578845 568129 556947 545371 534582 525680 517985 510628 504869 502724
57814E02724J387L210L985M245L340J832J796L567N197O009P382R171R080O905
57800E69830N662O739P486N692L005J614O49j428l626m392m675o243q549r770
57786E61994r791r990j0885j1632j1318r619o964m708m258n486o963p806q129
57773D54445p940p155o503o654o847o246n945p234q699p959n783n109o245o676
57759C59450n786n786p341q210p444p185q666r800q583o048m081k951k500l048
57745B72021l672k362N42J842J07j878j096J692L933M943N601O236O811P591Q237
57730C10548P703O117N024M909M484L172K077J625P69m96n80O00P22j329l694
57715C41651m724n163n578m707k417j310k936m914m489k648j941k179j261J144
$$ plain form
57814 502724 504111 507321 511306 515551 518891 520723 522519 526086 531283 537292 544674 553845 562925 569830
57800 569830 575492 582231 589717 595409 598414 600028 600677 599249 595623 591231 586556 580313 571764 561994
57786 561994 552203 542213 531328 519696 508378 498759 491795 487087 482829 477343 470380 462574 454445
57773 454445 446505 439350 432847 426193 419346 413100 407155 399921 391222 383263 377480 372371 366126 359450
57759 359450 353664 347878 340537 332327 324883 317698 309032 299232 290649 284601 280520 277569 275069 272021
57745 272021 268349 265987 266529 268371 268478 266600 265504 267196 271129 276072 281673 287909 294720 302311 310548
57730 310548 318251 324368 329392 334301 338785 341957 344034 345659 346428 345932 345352 345952 346674 345345 341651
57715 341651 336927 331764 326186 321479 319062 317752 314816 309902 305413 302765 300824 298645 297384 298528
57701B98528L483M937N766N904N328N027N819O859O846N920N090M718M736N361
57687C74322O415P051P115P518Q410Q526P397O525P077Q005P753O411M974L935
57673D71434L766N242P959R979J0134R460R349R795J0458J1804J4020J6303J8183
57660F07886K0103K1873K2263K1126K0143K0636K2259K4481K7317L0039L1385
57649H69511L1927L3840L7508M0924M3122M5375M8038M9759N1182N5719O4339
57638A371244P2997P8001Q0901Q5321R1832R9154J07769J18737J30977J43119
57628B380052J56373J72334J89648K06046K22068K39428K57164K72795K85961
57619D381869K97320L04862L04876K96007K79053K53630K18704J76352J31572
$$ plain form
57701 298528 302011 306948 312714 318618 323946 328973 334792 341651 348497 354417 359507 364225 368961 374322
57687 374322 380737 387788 394903 402421 410831 419357 426754 433279 440356 448361 456114 462525 467499 471434
57673 471434 475200 480442 488401 498380 508514 517974 527323 537118 547576 559380 573400 589703 607886
57660 607886 627989 649862 672125 693251 713394 734030 756289 780770 808087 838126 869511
57649 869511 901438 935278 972786 1013710 1056832 1102207 1150245 1200004 1251186 1306905 1371244
57638 1371244 1444241 1522242 1603143 1688464 1780296 1879450 1987219 2105956 2236933 2380052
57628 2380052 2536425 2708759 2898407 3104453 3326521 3565949 3823113 4095908 4381869
57619 4381869 4679189 4984051 5288927 5584934 5863987 6117617 6336321 6512673 6644245
57610F644245Q8269M8172J2985j6442m3809p6471j18827j68187k17503k59826
57600E892606k89641l03358l01245k88062k69932k50541k30701k10473j90600
57591C558053j71909j54179j36348j18152j01109q6880p4902o3101n0909l9899
57581B560665l0918k2635j3738m571M557J4530K5463L5670M4443N3843O5692P8717
57569B811718R0842J02486J15057J28100J40727J54232J69992J85883J98187K06352
57559D303576K12583K17097K16975K09736J94868J71684J38764R6602M8442k154
57549E808173n2708j00440j41863j74839j99616k17250k28311k33471k33907k30611
57539C995157k24164k15247k04501j92296j79541j67966j58175j48398j36953
$$ plain form
57610 6644245 6732514 6780686 6793671 6777229 6733420 6656949 6538122 6369935 6152432 5892606
57600 5892606 5602965 5299607 4998362 4710300 4440368 4189827 3959126 3748653 3558053
57591 3558053 3386144 3231965 3095617 2977465 2876356 2789476 2714574 2651473 2600564 2560665
57581 2560665 2529747 2507112 2493374 2488803 2493360 2507890 2533353 2569023 2613466 2667309 2733001 2811718
57569 2811718 2902560 3005046 3120103 3248203 3388930 3543162 3713154 3899037 4097224 4303576
57559 4303576 4516159 4733256 4950231 5159967 5354835 5526519 5665283 5761885 5810327 5808173
57549 5808173 5755465 5655025 5513162 5338323 5138707 4921457 4693146 4459675 4225768 3995157
57539 3995157 3770993 3555746 3351245 3158949 2979408 2811442 2653267 2504869 2367916
57530B367916j25092j15389j07974j00683r2551q4744p8052p1897o6065o1208
57520A464261n7133n2654m7634m3367m0393l7627l4214l0630k7350k3967k0290
57509A049002j7047j4793j3155j1549r750p541m936k848k266k470j274K368O944
57496I70685J0097J1149J1544J3198J6554K0178K2514K4013K6668L1195L5968
57485A193763L9404M2039M5136M8783N2800N8028O4708P0942P5096P8831Q5183
57474A854713R4235J03336J11360J19900J29796J39307J46787J53135J60094J67395
57464C180058J72740J73868J69792J60502J46055J25809R8800O5217K7290j1910
57454D308221m9997q5142j15362j39158j56361j67473j72776j72949j69595j64060
$$ plain form
57530 2367916 2242824 2127435 2019461 1918778 1826227 1741483 1663431 1591534 1525469 1464261
57520 1464261 1407128 1354474 1306840 1263473 1223080 1185453 1151239 1120609 1093259 1069292 1049002
57509 1049002 1031955 1017162 1004007 992458 982708 975167 970231 967383 965117 962647 961373 963741 970685
57496 970685 980782 991931 1003475 1016673 1033227 1053405 1075919 1099932 1126600 1157795 1193763
57485 1193763 1233167 1275206 1320342 1369125 1421925 1479953 1544661 1615603 1690699 1769530 1854713
57474 1854713 1948948 2052284 2163644 2283544 2413340 2552647 2699434 2852569 3012663 3180058
57464 3180058 3352798 3526666 3696458 3856960 4003015 4128824 4227624 4292841 4320131 4308221
57454 4308221 4258224 4173082 4057720 3918562 3762201 3594728 3421952 3249003 3079408 2915348
57444B915348j56600j47676j38820j30811j22292j11919j00761r0672q1520p2091
57434A762186o2731n4690m7675m0443l3276k7313k1917j5194p095L99O271J1501
57422A470023J6983K2514K7942L3563L9301M5098N1814O0041O8584P6014Q3047
57411A994924R1255J00166J08244J16056J25580J36454J45848J52159J55946J56940
57401C283572J53026J42853J26806J04873P6094M0977K304l6993p4656j07871
57391C710985j34037j53437j68555j80068j86081j85924j81836j75976j68501
57382B176570j59708j51156j43281j34455j23972j13558j04459r5525q5943p7572
57372I86941p2355o9285o5838o1035n5375m9415m4142m1139m0511l9803l6804
$$ plain form
57444 2915348 2758748 2611072 2472252 2341441 2219149 2107230 2006469 1915797 1834277 1762186
57434 1762186 1699455 1644765 1597090 1556647 1523371 1496058 1474141 1458947 1451852 1452251 1458522 1470023
57422 1470023 1487006 1509520 1537462 1571025 1610326 1655424 1707238 1767279 1835863 1911877 1994924
57411 1994924 2086179 2186345 2294589 2410645 2536225 2672679 2818527 2970686 3126632 3283572
57401 3283572 3436598 3579451 3706257 3811130 3887224 3928201 3930505 3893512 3818856 3710985
57391 3710985 3576948 3423511 3254956 3074888 2888807 2702883 2521047 2345071 2176570
57382 2176570 2016862 1865706 1722425 1587970 1463998 1350440 1245981 1150456 1064513 986941
57372 986941 914586 845301 779463 718428 663053 613638 569496 528357 487846 448043 411239
57361D11239l2363k8909k7273k6516k5810k5052k4228k3458k3024k2638k1560
57350A30408j9989j9031j8707j7569j5200j3339A3242h39j3977j3231j2816j2412
57338e3275j1119r232p750o808n953n215m752m125k999j935j680k340l755n543
57324a26481o447n172k628j523k701l752k695j089j507l478m458l857l619m982
57310a74389o779p254o098m323l157l244m162m724m170k800j241J96J037N95q26
57295b21339j744j413r05j264j684r74Q9k80j993l006k230r31o84j245j359r19
57279b41881j176k789m637n059l869k385j512p11P55K511L749M515N352O231O820
57264b34086P375Q376R638J0802J2112J3659J4553J4133J3370J3590J4449J4744
$$ plain form
57361 411239 378876 349967 322694 296178 270368 245316 221088 197630 174606 151968 130408
57350 130408 110419 91388 72681 55112 39912 26573 13242 -839 -14816 -28047 -40863 -53275
57338 -53275 -64394 -73626 -81376 -88184 -94137 -99352 -104104 -108229 -111228 -113163 -114843 -117183 -120938 -126481
57324 -126481 -132928 -138100 -140728 -142251 -144952 -148704 -151399 -152488 -153995 -157473 -161931 -165788 -169407 -174389
57310 -174389 -181168 -188422 -194520 -198843 -202000 -205244 -209406 -214130 -218300 -221100 -222341 -222145 -221108 -220513 -221339
57295 -221339 -223083 -224496 -225401 -226665 -228349 -229323 -229234 -229514 -231507 -234513 -236743 -237674 -238358 -239603 -240962 -241881
57279 -241881 -243057 -245846 -250483 -255542 -259411 -261796 -263308 -264019 -263264 -260753 -257004 -252489 -247137 -240906 -234086
57264 -234086 -226711 -218335 -208697 -197895 -185783 -172124 -157571 -143438 -130068 -116478 -102029 -87285
57252h7285J4617J5026J5723J5731a0737E249J6732J6000J4006J2735J2925J3595
57240I1242J4561J6626J8986J9420J7786J6573J7176J8308J8985K0176K2221K3549
57228C15609K3619K4518K7660L1130L2430L1934L1671L2279L3169L4287L5881
57217F54187L7421L8250L8327L7425L4751L0211K4572J7738Q759j651j0681j6731
57205H92578k1138k5474k9209l1406l2551l3161l2526l0467k8339k6787k4456
57194E77064k0550j6522j3478j0071n162m86J657J762J811K118J802J023N27P1
57180E21566o48m68J683M677O507O915P196Q315J0605J4161J8053K0446K0857
57167F39865K0988K1874K1949J9569J5759J2581J0353Q465P432Q053R738J1707
$$ plain form
57252 -87285 -72668 -57642 -41919 -26188 -10737 5249 21981 37981 51987 64722 77647 91242
57240 91242 105803 122429 141415 160835 178621 195194 212370 230678 249663 269839 292060 315609
57228 315609 339228 363746 391406 422536 454966 486900 518571 550850 584019 618306 654187
57217 654187 691608 729858 768185 805610 840361 870572 895144 912882 921641 919990 909309 892578
57205 892578 871440 845966 816757 785351 752800 719639 687113 656646 628307 601520 577064
57194 577064 556514 539992 526514 516443 511281 510795 512452 514214 516025 518143 519945 520968 521495 521566
57180 521566 520918 520450 522133 526810 533317 540232 547428 555743 566348 580509 598562 619008 639865
57167 639865 660853 682727 704676 724245 740004 752585 762938 771403 778835 786888 796626 808333
57155H08333J4802K0235K7474L4941M1681M6966M9781N0322N0518N1336N1183
57144A247572M8642M5099M2598M0707L7621L3227K8978K5850K4116K3956K4792
57133A623158K5223K4994K5522K7319K8869K9420L0522L3064L5204L5285L4419
57122A952999L3969L2852K9919K6745K5260K4542K2730K0334J8896J8025J6557
57111B222828J5199J5481J7357K0032K3545K7373K9330K7962K4249J9113J1682
57100B454151K206o173j1167j4493j8722k3868k9650l7872m9098n9870o6944p1735
57088B066765p7103q2604q6827r1545r9146j08221j16113j23818j34230j47358
57078I99800j61287j76048j92646k10268C1501b15972k69408k91149l10355l29082
$$ plain form
57155 808333 823135 843370 870844 905785 947466 994432 1044213 1094535 1145053 1196389 1247572
57144 1247572 1296214 1341313 1383911 1424618 1462239 1495466 1524444 1550294 1574410 1598366 1623158
57133 1623158 1648381 1673375 1698897 1726216 1755085 1784505 1815027 1848091 1883295 1918580 1952999
57122 1952999 1986968 2019820 2049739 2076484 2101744 2126286 2149016 2169350 2188246 2206271 2222828
57111 2222828 2238027 2253508 2270865 2290897 2314442 2341815 2371145 2399107 2423356 2442469 2454151
57100 2454151 2456357 2450184 2439017 2424524 2405802 2381934 2352284 2314412 2265314 2205444 2138500 2066765
57088 2066765 1989662 1907058 1820231 1728686 1629540 1521319 1405206 1281388 1147158 999800
57078 999800 838513 662465 469819 259551 31501 -215972 -485380 -776529 -1086884 -1415966
57068a415966l50241l73003l95725m20184m48615m79920n13468n53072o02193
57059e552387o58597p18928p85234q61842r49498j047785j159403j286587j427590
57050a4447851j582545j758547j963494k200018k471223k786326l154391l579500
57042c3943895m069735m644334n325557o132680p091752q239049r601521j1179183
57034i0227706j2950769j4882067j6926242j9044374k1231199k3463987k5584949
57027b24311293k7303556k8430268k9106844k9674211l0217842l0282382k9106590
57020d28432986k6143971k1364222j5160911q101234p57119O371068J2899201
57013d80690174J8560206K3159623K6558992K8722990K9757194K9867064K9275934
$$ plain form
57068 -1415966 -1766207 -2139210 -2534935 -2955119 -3403734 -3883654 -4397122 -4950194 -5552387
57059 -5552387 -6210984 -6929912 -7715146 -8576988 -9526486 -10574271 -11733674 -13020261 -14447851
57050 -14447851 -16030396 -17788943 -19752437 -21952455 -24423678 -27210004 -30364395 -33943895
57042 -33943895 -38013630 -42657964 -47983521 -54116201 -61207953 -69447002 -79048523 -90227706
57034 -90227706 -103178475 -118060542 -134986784 -154031158 -175262357 -198726344 -224311293
57027 -224311293 -251614849 -280045117 -309151961 -338826172 -369044014 -399326396 -428432986
57020 -428432986 -454576957 -475941179 -491102090 -499203324 -499960443 -493589375 -480690174
57013 -480690174 -462129968 -438970345 -412411353 -383688363 -353931169 -324064105 -294788171
57006b94788171K8176681K6724983K5041370K3217520K1334476J9472507J7694887
56999a33125747J6028897J4472598J3015853J1649901J0367759R169001Q062207
56992e0359531P055732O149604N341058M631118M018356L491692L036824K645621
56984a3989526K312974K029402J784175J572282J391660J236498J099530R78414
56976a584591g10539G3756P04234O30638N61991M96257M33065L76056L28803K90037
56966C894837K56304K27171K04092J86030J69966J54470J39799J26039J13768
56957E472476J04725R9200R4587Q8854Q3206P8807P3229O3289M9608L5573K3312
56946F266866J2978M177m480j5181k7200l4834l2647k3513k0204l8497q7179j61207
$$ plain form
57006 -294788171 -266611490 -239886507 -214845137 -191627617 -170293141 -150820634 -133125747
56999 -133125747 -117096850 -102624252 -89608399 -77958498 -67590739 -58421738 -50359531
56992 -50359531 -43303799 -37154195 -31813137 -27182019 -23163663 -19671971 -16635147 -13989526
56984 -13989526 -11676552 -9647150 -7862975 -6290693 -4899033 -3662535 -2563005 -1584591
56976 -1584591 -710539 73756 777990 1408628 1970619 2466876 2899941 3275997 3604800 3894837
56966 3894837 4151141 4378312 4582404 4768434 4938400 5092870 5232669 5358708 5472476
56957 5472476 5577201 5676401 5770988 5859842 5943048 6021855 6095084 6158373 6207981 6243554 6266866
56946 6266866 6279844 6284021 6279541 6264360 6237160 6202326 6169679 6146166 6125962 6087465 6000286 5839079
56934E839079k42979l12778l60443l86843l95596l87703l65160l34489l02620
56925B750468k71711k41025k11597j85952j65077j48537j36179j27184j18964
56916A144242j09434r9388r0587q2853p4896o6527n8179m9611m0986l3727k8532
56905D09522k3903j8286j2138o346m43N885J1313J4820J7353J9544J9587J5598
56893D52506Q637J275n497j1770j6508j8349j7806j6566j5206j3172j0403p365
56881C29776m148q06K069M201O265Q864J1812J5039J8872K2853K5842K7736K8978
56868D97353K7928K1480R715k749j1775j7686k2469k5747k6124k4386k2527k0958
56856C82055j9076j7210j5596j2892q088k793P46K728M675O450O893O548P190
$$ plain form
56934 5839079 5596100 5283322 4922879 4536036 4140440 3752737 3387577 3053088 2750468
56925 2750468 2478757 2237732 2026135 1840183 1675106 1526569 1390390 1263206 1144242
56916 1144242 1034808 935420 844833 761980 687084 620557 562378 512767 471781 438054 409522
56905 409522 385619 367333 355195 348849 348406 354291 365604 380424 397777 417321 436908 452506
56893 452506 461143 462418 456921 445151 428643 410294 392488 375922 360716 347544 337141 329776
56881 329776 325628 324822 326891 331092 337357 346221 358033 373072 391944 414797 440639 468375 497353
56868 497353 525281 546761 556476 553727 541952 524266 501797 476050 449926 425540 403013 382055
56856 382055 362979 345769 330173 317281 309193 306400 307146 309874 314549 320999 327892 334440 341630
56843C41630R043J0531J0486Q973O643M777M984P188Q943Q472P218P409Q487Q369
56829D53153P319P851J0991J4950J7445J7433J4651R374K738l896r950j4959j7710
56816E09390j7462j5415j3397j1512q473l872J274N893R626J2574J5393J9044
56804E03063K3643K8217L2432L7332M3288M8345M9909M7027L9800K8198J3316
56793H94570j384j2271j8605k1886k3079k2132j9451j5999j2239q266m289J85
56781G35154O485J4700K2619K8483L3583M0140M7859N4796O0328O4340O4025N4951
56769A227463L6231J2409j0486k9054m2339m9972n2108n0172m6169m1267l5503
56758I19033k8661k1145j3815p050k72P024J4117J9845K4416K9223L4774M0129
$$ plain form
56843 341630 350673 361204 371690 380663 387306 392083 397067 404255 413198 421670 428888 436297 444784 453153
56829 453153 460472 468323 479314 494264 511709 529142 543793 553167 555905 552009 542059 527100 509390
56816 509390 491928 476513 463116 451604 443131 439259 440533 446426 456052 468626 484019 503063
56804 503063 526706 554923 587355 624687 667975 716320 766229 813256 853056 881254 894570
56793 894570 893186 880915 862310 840424 817345 795213 775762 759763 747524 739258 734969 735154
56781 735154 741639 756339 778958 807441 841024 881164 929023 983819 1044147 1108487 1172512 1227463
56769 1227463 1263694 1276103 1265617 1236563 1194224 1144252 1092144 1041972 995803 954536 919033
56758 919033 890372 869227 855412 848362 848090 855114 869231 889076 913492 942715 977489 1017618
56746A017618M4128M5292M0608K7351P364j2900k8153l8113m4423m6752m4449
56735I67571l9772l6093l3826l0749k5647j9427j3349q184m440j586J997O812
56723G63307J1205J4217J7561K2447K6063K4216J6445N839n138j5659k4281k9049
56711H27173l0049k9321k8184k6736k5395k4596k3407k0871j8224j7311j7357
56700E65722j6085j3568j2041j2020j1616r863p978o922o280n876o096o370n627
56687D45380m408m144m442l682k240k185l510l865k589j899k982l952l142j802
56673D00538j862l087m132m549m418l542k270j656j823j668r45q50j692j948p83
56658C65313M09K83l20rR07J435J872L058M302L813J119j963k974j149J680K645
$$ plain form
56746 1017618 1061746 1107038 1147646 1174997 1182361 1169461 1141308 1103195 1058772 1012020 967571
56735 967571 927799 891706 857880 827131 801484 782057 768708 760524 756084 754498 756495 763307
56723 763307 774512 788729 806290 828737 854800 879016 895461 901300 896162 880503 856222 827173
56711 827173 797124 767803 739619 712883 687488 662892 639485 618614 600390 583079 565722
56700 565722 549637 536069 524028 512008 500392 490529 482551 475629 469349 463473 457377 451007 445380
56687 445380 440972 436828 432386 428704 426464 424279 420769 416904 414315 412416 409434 405482 402340 400538
56673 400538 398676 395589 391457 386908 382490 378948 376678 375022 373199 371531 370586 369736 368044 366096 365313
56658 365313 365722 366005 365685 365676 366583 368018 369890 372948 377250 381063 382182 380219 377245 376096 377776 380421
56642C80421Q44j560j933l46J065J193P25K03n46j016j99J442K168J623J353K102
56626C87539K701K356K053K542K841K115J367J856K988L208K104M70r60j843j938
56611D09399j345o18j69Rj9k8O54K185L189K181K6p42O90K408K640J829J160P19
56593D24168J07m44n56l47N6O25P50k14j413j119N77J326l21k884m036l461k480
56576D10334k018k001k021j677q52j84n99k077l602m460m681m243l039j583m98
56561C76799N63K000K696J328q43j059Q03J683j80k776l572k931k676l145l483
56546C65207l396k969j984p40m84j703l132l494l094k593j659j42P29j17j878
56531C38551k990l053k531j549j91R06J373J678K053J907J141P46J160J460J249
$$ plain form
56642 380421 381265 379705 377772 377426 378491 379684 380409 380612 380066 379050 378851 380293 382461 384084 385437 387539
56626 387539 390240 392596 394649 397191 400032 402147 403514 405370 408358 411566 413670 414140 413180 411337 409399
56611 409399 408054 407436 407267 407276 407257 407229 407883 410068 413257 415438 415464 414722 415412 417820 420460 422289 423449 424168
56593 424168 424275 423831 423275 422928 422984 423609 424359 424145 422732 421613 422190 423516 423195 420311 416275 412814 410334
56576 410334 408316 406315 404294 402617 401765 401581 400982 398905 395303 390843 386162 381919 378880 377297 376799
56561 376799 377362 379362 382058 383386 382543 381484 382287 383970 383790 381014 377442 374511 371835 368690 365207
56546 365207 361811 358842 356858 356118 355634 353931 350799 347305 344211 341618 339959 339817 340546 340429 338551
56531 338551 335561 332508 329977 328428 328237 329143 330516 332194 334247 336154 337295 338041 339201 340661 341910
56516C41910J790L878O053O618O063N783N554M473L398M147O581Q546Q768Q033
56502D21595P342O643N823N558O345P517P991P685P580Q361R231Q619O240L835
56488E20365L097L356K606N86p72l46M30l46k428l987l864k445r68p49k396n074
56472E07065p059p533p224p090p156p036o720o355n970n646n401m892m041l612
56458D21330m097m361k994p06L72k32j025j278j835k773k749j460n68r82j398
56443C95244p24k1o38k097l192l636l412k142k87O26K11M9J122K173J907J028
56427C86211O68N08J25M68K271M356N184M867M156K976J501J088K435M113M634
56412D25561M553M957N377N033M613M855M855L840L160M273O102O665O169N928
$$ plain form
56516 341910 343700 347578 353631 360249 366312 372095 377649 382122 385520 389667 396248 404794 413562 421595
56502 421595 428937 435580 441403 446961 453306 460823 468814 476499 484079 492440 501671 510290 516530 520365
56488 520365 523462 526818 529424 530010 529238 528892 529322 528976 526548 522561 518697 516252 515284 514535 512139 507065
56472 507065 500006 492473 485249 478159 471003 463967 457247 450892 444922 439276 433875 428983 424942 421330
56458 421330 417233 412872 409878 409172 409544 409312 408287 407009 405174 402401 399652 398192 397624 396642 395244
56443 395244 394520 394499 393861 391764 388572 384936 381524 379382 379095 379721 379932 379981 381103 383276 385183 386211
56427 386211 386879 387387 387512 387980 390251 394607 399791 404658 408814 411790 413291 414379 416814 420927 425561
56412 425561 430114 435071 440448 445481 450094 454949 459804 463644 466804 471077 477179 483844 490013 495941
56398D95941N409L260O02K68K688N120N345M009K848K522K674K633J635m66k358
56383E32130k331m04J538J836N60j067j990k064j978k412l138l395l217l580m860
56368E05628o152o559o206n617n108n097n790o203n001k652j170j220j281l81
56354D47191M00nj005j793k497k876j856M28K083K147J762J671R14o76j341l51
56338D44196M91J06K29K033L438K328J06p14k60Q9O59K085K953J915M68O23J584
56321D62329J716J993M015O318O272M479L619L971L686K772L102M788N870N575
56307E20505M970M677M517M894N947O096M235K357L032N188N615L851K109J132
56293E79125j75j343m75J956L094K086J281K331M038M821M715M185L182K082J716
$$ plain form
56398 495941 501350 504610 505212 505480 508168 513288 518633 522642 525490 528012 530686 533319 534954 534488 532130
56383 532130 529799 529395 530933 532769 533329 532262 530272 528208 526230 523818 520680 517285 514068 510488 505628
56368 505628 499476 492917 486711 481094 475986 470889 465099 458896 453895 451243 450073 448853 447572 447191
56354 447191 447591 447586 446581 444788 442291 439415 437559 437987 440070 442217 443979 445650 446564 445888 444547 444196
56338 444196 444687 444793 445022 447055 450493 452821 452927 452213 451953 452042 452701 454786 457739 459654 460122 460745 462329
56321 462329 464045 466038 470053 476371 482643 487122 490741 494712 498398 501170 504272 509060 514930 520505
56307 520505 525475 530152 534669 539563 545510 551606 555841 558198 561230 566418 572033 575884 577993 579125
56293 579125 578950 577607 577132 579088 582182 584268 585549 587880 591918 596739 601454 605639 608821 610903 612619
56278F12619K077K471K848L423L674L397L868N849P706P837P697R524J2305J3187
56264F98482J2058J1303J1764J2334J2990J4679J6500J6503J5137J4579J4853
56253H51182J4034J2133J1162J1268J0508Q676P779Q252Q172O822N788N869N945
56240I67590N468N185M978L923K784L510N969Q107R431J1331J3869J5450J5944
56227A073539J6942J8786K0411K2053K4903K8075K9632L0536L3773L9282M3753
56216A381685M5930M8230N2386N7361O2379O8255P4829Q0717Q6467R4339J04296
56205B156874J13940J23027J33871J46579J58294J68402J80000J94589K09544
56196C585120K22719K35422K48693K60435K68539K73465K75547K73008K64707
$$ plain form
56278 612619 614696 617167 620015 623438 627112 630509 634377 640226 647932 655769 663466 672990 685295 698482
56264 698482 710540 721843 733607 745941 758931 773610 790110 806613 821750 836329 851182
56253 851182 865216 877349 888511 899779 910287 918963 926742 934994 943166 949988 955776 961645 967590
56240 967590 973058 978243 983221 987144 989928 993438 999407 1007514 1016945 1028276 1042145 1057595 1073539
56227 1073539 1090481 1109267 1129678 1151731 1176634 1204709 1234341 1264877 1298650 1337932 1381685
56216 1381685 1427615 1475845 1528231 1585592 1647971 1716226 1791055 1871772 1958239 2052578 2156874
56205 2156874 2270814 2393841 2527712 2674291 2832585 3000987 3180987 3375576 3585120
56196 3585120 3807839 4043261 4291954 4552389 4820928 5094393 5369940 5642948 5907655
56187E907655K51860K35156K13153J85213J52967J17603P9109L9754M313k5258
56177G161525n1762p7262r9311j15177j26289j35635j43754j50054j55314j60118
56167E946849j63280j64418j65796j69158j72933j74952j75820j77260j79158
56158D404074j80315j80422j79312j76033j70362j63714j57164j50201j42382
56149B904169j34296j26134j17434j08872j01899r6026q9152q1171p4264o9069
56139A905852o3689n7328n1665m7694m4294m0773l7692l4635l0556k6727k5443
56128A445356k5503k3259j8703j5736j5385j3963r631n546m204l469r50K142M164
56115A315313O141R063J1702J3358J5229J7376J8204J8389K0774K4765K5857K2711
$$ plain form
56187 5907655 6159515 6394671 6607824 6793037 6946004 7063607 7142716 7182470 7186783 7161525
56177 7161525 7109763 7032501 6933190 6818013 6691724 6556089 6412335 6262281 6106967 5946849
56167 5946849 5783569 5619151 5453355 5284197 5111264 4936312 4760492 4583232 4404074
56158 4404074 4223759 4043337 3864025 3687992 3517630 3353916 3196752 3046551 2904169
56149 2904169 2769873 2643739 2526305 2417433 2315534 2219508 2130356 2049185 1974921 1905852
56139 1905852 1842163 1784835 1733170 1685476 1641182 1600409 1562717 1528082 1497526 1470799 1445356
56128 1445356 1419853 1396594 1377891 1362155 1346770 1332807 1323176 1317630 1313426 1309957 1309007 1311149 1315313
56115 1315313 1321454 1330517 1342219 1355577 1370806 1388182 1406386 1424775 1445549 1470314 1496171 1518882
56103A518882J9507J9021J8751J6577J4613J4332J3345J0593R371J1434J3340
56092A679766J2725J2989J7176K2176K3933K4090K6631L1775L7878M5579N5362
56081A990080O4539P1281P8539Q9713J03571J17184J30434J43665J54438J60396
56071C103840J62226J60427J53080J40190J26140J14275J03272R2078Q3263P7407
56061D316198O9333N4614L5405J5719l931k2821l6751m4176n0688o1908p6425
56050D194569r0784j05903j22572j35949j41446j41749j41469j39156j31219j19569
56040B924753j08513r7812q5427p3472o4799n7336m8358m0665l7838l7112l3818
56029B239603k9273k7338k6723k3862k0165j9086j9102j6482j2358j0236r496
$$ plain form
56103 1518882 1538389 1557410 1576161 1592738 1607351 1621683 1635028 1645621 1654992 1666426 1679766
56092 1679766 1692491 1705480 1722656 1744832 1768765 1792855 1819486 1851261 1889139 1934718 1990080
56081 1990080 2054619 2125900 2204439 2294152 2397723 2514907 2645341 2789006 2943444 3103840
56071 3103840 3266066 3426493 3579573 3719763 3845903 3960178 4063450 4155528 4238791 4316198
56061 4316198 4385531 4440145 4475550 4491269 4487338 4464517 4427766 4383590 4332902 4270994 4194569
56050 4194569 4103785 3997882 3875310 3739361 3597915 3456166 3314697 3175541 3044322 2924753
56040 2924753 2816240 2718428 2633001 2559529 2494730 2437394 2389036 2348371 2310533 2273421 2239603
56029 2239603 2210330 2182992 2156269 2132407 2112242 2093156 2074054 2057572 2045214 2034978 2025482
56018B025482p715o274p095p345l967K15J579K852Q088J4638J7655J8703K2108
56005B078924K6489K7816K7398K8963L1253L1226L0917L3421L5918L4609L2487
55994B419421L4016L6450L5000L2254L3295L5805L4420L0985L0957L3451L4385
55983B790439L5350L9672M3937M3615M2750M7466N4218N5614N3541N4961N8802
55972C320365N9290N8638O3571P2251P7390P9843Q6496R6794J03905J07424J12811
55961D238778J20203J25599J30855J40536J51688J58539J64231J75498J89454
55952E595381J98513K04486K14388K26453K34537K41980K56113K73089K83855
55943G728795K91325L05711L26554L45473L62592L83594M04991M19783M33190
$$ plain form
56018 2025482 2017767 2011493 2004398 1997053 1993086 1993301 1994880 1997732 2005820 2020458 2038113 2056816 2078924
56005 2078924 2105413 2133229 2160627 2189590 2220843 2252069 2282986 2316407 2352325 2386934 2419421
55994 2419421 2453437 2489887 2524887 2557141 2590436 2626241 2660661 2691646 2722603 2756054 2790439
55983 2790439 2825789 2865461 2909398 2953013 2995763 3043229 3097447 3153061 3206602 3261563 3320365
55972 3320365 3379655 3438293 3501864 3574115 3651505 3731348 3817844 3914638 4018543 4125967 4238778
55961 4238778 4358981 4484580 4615435 4755971 4907659 5066198 5230429 5405927 5595381
55952 5595381 5793894 5998380 6212768 6439221 6673758 6915738 7171851 7444940 7728795
55943 7728795 8020120 8325831 8652385 8997858 9360450 9744044 10149035 10568818 11002008
55934A1002008M54941M81048N01981N23188N57302O01664O44862O89500P45811
55925A6202305Q08893Q66684R24670R97140J080152J160470J245130J352255J477776
55916B6115475J602144J725077J861627K009996K158654K319793K517723K748775
55908D3059264K992665L258702L578561L960201M397113M917539N571687O374049
55900G8109781P312272Q403249R675211J1104858J2650911J4345222J6266207
55893A57867711J8433792K0836270K3547159K6676405L0206976L4025132L8004200
55886C49597645M1597426M3124930L9974706L0338054J5097859k205676j7499516
55879E00025428k8368442l4544917l6980661l6867591l5241254l2872534l0199096
$$ plain form
55934 11002008 11456949 11937997 12439978 12963166 13520468 14122132 14766994 15456494 16202305
55925 16202305 17011198 17877882 18802552 19799692 20879844 22040314 23285444 24637699 26115475
55916 26115475 27717619 29442696 31304323 33314319 35472973 37792766 40310489 43059264
55908 43059264 46051929 49310631 52889192 56849393 61246506 66164045 71735732 78109781
55900 78109781 85422053 93825302 103500513 114605371 127256282 141601504 157867711
55893 157867711 176301503 197137773 220684932 247361337 277568313 311593445 349597645
55886 349597645 391195071 434320001 474294707 504632761 519730620 517524944 500025428
55879 500025428 471656986 437112069 400131408 363263817 328022563 295150029 264950933
55872B64950933k7397556k4576478k1862090j9337807j7024746j4949838j3157989
55865A26644429j1643485j0338393r185655q171724p283539o491367n785681n181248
55857F2563337m671997m222730l813543l453415l143113k862505k602426k374192
55849C5419416k179538k002496j837575j695897j577011j463205j348201j244865
55841B2070628j158812j079811j004701r43743q98100q54157q05882p61176p21479
55832A3842767o76984o26949n83620n50658n17794m81656m51906m31400m09755
55823I112045l82472l57983l39961l20524k97139k78996k69898k60846k46155
55814F358071k31866k21970k10882j96003j84128j79146j75848j71248j69639
$$ plain form
55872 264950933 237553377 212976899 191114809 171777002 154752256 139802418 126644429
55865 126644429 115000944 104662551 95476896 87305172 80021633 73530266 67744585 62563337
55857 62563337 57891340 53668610 49855067 46401652 43258539 40396034 37793608 35419416
55849 35419416 33239878 31237382 29399807 27703910 26126899 24663694 23315493 22070628
55841 22070628 20911816 19832005 18827304 17883561 16985461 16131304 15325422 14564246 13842767
55832 13842767 13165783 12538834 11955214 11404556 10886762 10405106 9953200 9521800 9112045
55823 9112045 8729573 8371590 8031629 7711105 7413966 7134970 6865072 6604226 6358071
55814 6358071 6126205 5904235 5693353 5497350 5313222 5134076 4958228 4786980 4617341
55805D617341j71596j70205j63105j56348j52019j44227j31578j21321j16302
55796C290640j10002r9633r2285r2404r4314r2778r0618r0291q7899q1173p4365
55785B284878p0101o5137n8379n4185n3509n0807m3966l8331l6806l4898k9953
55774A748806k6302k6671k7071k4807k3354k4687k4870k1830j9866k1902k4580
55763A482866k5157k6007k8435k9277k7491k6869k8598k8483k5109k3087k4472
55752A189881k4802k1651j9253k0104j9713j4666q838o398n299k657l36j58N34
55739A046540L617N963M839K225l6l788r373j2839j2400j1925j4078j5820j4792
55726I68133j4072j6029j7402j5291j2614j2607j3061j0969q125p279p238o517
$$ plain form
55805 4617341 4445745 4275540 4112435 3956087 3804068 3659841 3528263 3406942 3290640
55796 3290640 3180638 3081005 2988720 2896316 2802002 2709224 2618606 2528315 2440416 2359243 2284878
55785 2284878 2214777 2149640 2091261 2037076 1983567 1932760 1888794 1850463 1813657 1778759 1748806
55774 1748806 1722504 1695833 1668762 1643955 1620601 1595914 1571044 1549214 1529348 1507446 1482866
55763 1482866 1457709 1431702 1403267 1373990 1346499 1319630 1291032 1262549 1237440 1214353 1189881
55752 1189881 1165079 1143428 1124175 1104071 1084358 1069692 1060854 1054456 1049157 1046500 1046164 1046006 1046540
55739 1046540 1050157 1056120 1060959 1063184 1063148 1059360 1049987 1037148 1024748 1012823 998745 982925 968133
55726 968133 954061 938032 920630 905339 892725 880118 867057 856088 847963 840684 833446 826929
55714H26929p323j1361j5688j7297j7801j9470k0730j9853j8907j9691j9725j6719
55702F22364j3245j2560j3311j2652j1304j1256j1629j0821r955j0457j1011j0323
55690D83840r906j0936j1373r488p170o605o672n653m450m240m007l096l005m188
55676C93051m487l123k439l258k653P51L605L062J062J77o29k701m281m126m495
55661C69516o771q034n954l195k853l267j715K92%j434j446q45j662k671j487
55646C28474J062K714L837N864P733P591O067M627K864N93m3K053M054L368K060
55631C82918L417O593Q512Q794Q924Q602O817M793M213M232L412K703L332L963
55617D61225L197K562L529M027J611k075l786l558l334k807p01J591J682K36l29
$$ plain form
55714 826929 819606 808245 792557 775260 757459 737989 717259 697406 678499 658808 639083 622364
55702 622364 609119 596559 583248 570596 559292 548036 536407 525586 515631 505174 494163 483840
55690 483840 473934 462998 451625 442137 434967 428362 421690 416037 411587 407347 403340 400244 397239 393051
55676 393051 388564 385441 383002 379744 377091 377842 381447 384509 385571 385748 385119 382418 378137 374011 369516
55661 369516 362745 354711 348757 345562 342709 339442 337727 338019 338019 336585 335139 334294 332632 329961 328474
55646 328474 329536 332250 336087 341951 349684 357275 363342 367969 370833 371426 371383 373436 377490 380858 382918
55631 382918 386335 392928 401440 410234 419158 427760 434577 439370 443583 447815 451227 453930 457262 461225
55617 461225 464422 466984 470513 474540 476151 474076 470290 466732 463398 460591 459890 461481 463163 463399 463070
55602D63070K25O73J440L406N133M761L349L011L110J725n58j720j902k666l904
55587D79153m615n334o779p680p051o939r558j3312j5050j4670j4129j3507j1850
55574C48679j0355j0832j2069j1446r237p817p579p210p020q335j0233j0352q528
55561B27666o599n275m031l210l350l403k423j741k620l325j805K52k70k826m158
55546A82882l311j979q64M92J028p55l521m529l825l522l544j964Q92K586K689
55531A62755K989L610K682J68j533j355p02n13k36o4j024k468k358o66K77o39
55515A60923j924k049j118K77J730K454K057J661K330K992K310J578K982N588
55501A81791O261M241J771K59j072k678l787m198m433m068k484j042j706l720
$$ plain form
55602 463070 463295 463968 465408 468814 473947 478708 482057 485068 488178 489903 489345 487625 485723 483057 479153
55587 479153 474538 469204 462425 454745 447694 440755 431197 417885 402835 388165 374036 360529 348679
55574 348679 338324 327492 315423 303977 294740 286923 279344 272134 265114 256779 246546 236194 227666
55561 227666 221067 215792 211761 208551 205201 201798 199375 197634 195014 191689 189884 190136 189866 187040 182882
55546 182882 179571 177592 176728 177220 178248 177493 173972 169443 165618 162096 158552 156588 157480 160066 162755
55531 162755 165744 169354 172036 172204 170671 169316 168614 168101 167865 167801 166777 164309 161951 161285 161562 160923
55515 160923 158999 156950 155832 156109 157839 160293 162350 164011 166341 169333 171643 173221 176203 181791
55501 181791 188052 192293 194064 194323 193251 190573 186786 182588 178155 174087 171603 170561 168855 165135
55487A65135m483l557k769k523j281J107K739K816K513K379J768J216K222M105
55473A71387M110J583o91l41J930M245N724O009N049M117M746N989N087J603j577
55458B18970k249j568j681k828l983m648m839m608m397m678m913m225l179l280
55444A67894m567n426n002m120l631l388l076k556j567l59k54j930l846m200l658
55429A20314l954m568l577j202K90Q6n96j317k788m354m160k281q51n94p7J052
55413I1423J038p60k438k473j757j534j544j280j136j203p52J65L44o43j766k397
55397G3287l115m065m303l460k383j664r18J00J118K088K898K651R24p22n82M69
55381F2323M03m51j74R45O71j175k297j887j541j750q94J272K571K118J883L072
$$ plain form
55487 165135 160652 157095 154326 151803 150522 151629 154368 157184 159697 162076 163844 165060 167282 171387
55473 171387 175497 177080 176389 176048 177978 182223 187947 193956 199005 203122 207868 213857 218944 220547 218970
55458 218970 216721 215153 213472 210644 206661 202013 197174 192566 188169 183491 178578 174353 171174 167894
55444 167894 163327 157901 152899 148779 145148 141760 138684 136128 134561 134202 133948 132018 128172 123972 120314
55429 120314 116360 111792 108215 107013 107303 107389 106793 105476 102688 98334 94174 91893 91042 90448 90371 91423
55413 91423 92461 91701 89263 86790 85033 83499 81955 80675 79539 78336 77584 77749 78093 77450 75684 73287
55397 73287 70172 66107 61804 58344 55961 54297 53379 53479 54597 56685 59583 62234 63158 62436 61854 62323
55381 62323 62726 62275 62101 63046 63717 62542 60245 58358 56817 55067 54173 55445 58016 60134 62017 65089
55365F5089L893K667M19j262k487l472l148j080J172K197K338J932L41j936k606
55350F4057p69J374J701J001R29J244R57M11K21k31j436k218j381K94J094M37
55334F7685j143k728l018j234J096J182j167k865j877P9O41K33L76P57L71o5O55
55317E8978J721J343m33j985k465k192j370k00L66l89j551j552l38O53M08n73
55301E0421r84o7J484J879K17j995k477j147L7J53L11J240K024J995J943K396
55285E7430K480J519K21o46j249j652j394p90r69j929k393k062j909j796l56J979
55269D6484K758J458O46J640K193O08r75k39J124K91j725j684N51J934R99n08
55253E5555q42l67p6p5l1J97N83P91L65k86lJ235J840R49k10n80j063k392k993
$$ plain form
55365 65089 68982 71649 72068 70806 68319 64847 61699 60619 61791 63988 66326 68258 68599 66663 64057
55350 64057 63288 64662 66363 67364 68293 69537 70494 70905 71126 70895 69459 67241 65860 66154 67248 67685
55334 67685 66542 63814 60796 59562 60658 61840 60673 57808 55931 56010 56651 56884 57260 58017 58388 58323 58978
55317 58978 60699 62042 61609 59624 57159 54967 53597 53397 53763 53374 51823 50271 49933 50586 50994 50421
55301 50421 49437 49370 50854 52733 52950 50955 48478 47331 47368 47521 47832 49072 51096 53091 55034 57430
55285 57430 59910 61429 61650 61004 59755 58103 56709 55919 54950 53021 50628 48566 46657 44861 44505 46484
55269 46484 49242 50700 51346 52986 55179 55787 54812 54573 55697 55988 54263 52579 53130 55064 56063 55555
55253 55555 54713 54346 54270 54195 54164 54361 54944 55735 56100 55814 55811 57046 58886 59835 59625 59045 57982 55590 52597
55234E2597j297J181J632L1j061l22R90J331N58o73j588j384q2Q96K88j207j816
55217E0074j005K62J040J057L94l87l49N98J321J168J004J434J384L3j111j18
55201E6799K181L034J447q42j984j916j552j448j468r69N76K486K978J229j252
55186E9299k265j364K12J375J964K085J721P57r48k975l883k494P1J243L33o51
55170E4480j56R42J419J536J532M98j473k079M3K770L263J727K74m01p59l00J541
55153F4857L355L250J663M17j98r96j453l68J602K646K683K946L162J796q61k485
55137H2016j940n35K54M02K66k04p58q49n55l54o7O23J023K64j071j608j143m36
55119G5328K82J009R12n61k064j860m67J86k41n11l32n15q61k93Q10P68o50j791
$$ plain form
55234 52597 51300 52481 54113 54144 53083 52761 53751 55082 55640 54967 53379 51995 51913 52809 53097 51890 50074
55217 50074 49069 49331 50371 51428 51822 51435 51086 51684 53005 54173 55177 56611 57995 58028 56917 56799
55201 56799 58980 62014 63461 62619 60635 58719 57167 55719 54251 53282 53858 56344 59322 60551 59299
55186 59299 57034 55670 55882 57257 59221 61306 63027 63784 62836 59861 55978 53484 53555 54798 55131 54480
55170 54480 54324 55266 56685 58221 59753 60251 58778 56699 56742 59512 62775 64502 64776 64375 63616 63316 64857
55153 64857 68212 71462 73125 73542 73344 72348 70895 70527 72129 74775 77458 80404 83566 85362 84501 82016
55137 82016 80076 79541 79795 80197 80463 80259 79501 78652 78097 77743 77676 78299 79322 79586 78515 76907 75764 75328
55119 75328 75610 76619 77531 76970 74906 73046 72579 72765 72524 72013 71681 71166 70305 70012 70822 71590 70940 69149
55101F9149j703j194j038j009j006j266j354o03L33L11q5P65K523K947J313m44
55085F7639o15L46J422K506L342K948J088r42j907j820j097J24J346J716J151
55070G7247L49m44j398j900j130J60L04n77n13J162K606K187O94j10L90J752L232
55053H4011L703K240l77j925j291L94J601K004J792R15j54k95O56J344P45m23
55037I4940q41j96R14J724J479j5j535j242J067L464M142L194J848R82Q02R99
55021A11726R04L03Q9J004K034J631L68L56J775K265N51j516j763p14k59p49j053
55004A16952n45M26J386J920J529K44j140k023k497k526j616l3Q08P0j224j564
54988A10167q33L0M49M48J46j25K95J511K547K347R34q43k206k635j863k06J359
$$ plain form
55101 69149 67446 66252 65214 64205 63199 61933 60579 59976 60309 60620 60535 61300 63823 66770 68083 67639
55085 67639 67024 67370 68792 71298 74640 77588 78676 77734 75827 74007 72910 73034 74380 76096 77247
55070 77247 77596 77152 75754 73854 72724 72884 73188 72611 72098 73260 75866 78053 78747 78637 79027 80779 84011
55053 84011 87714 89954 89577 87652 86361 86755 88356 90360 92152 93067 92913 92618 93274 94618 95363 94940
55037 94940 94099 93903 94817 96541 98020 98005 96470 95228 96295 99759 103901 107095 108943 109925 110727 111726
55021 111726 112630 112933 113022 114026 116060 117691 118059 118415 120190 122455 123006 121490 119727 119013 118754 118005 116952
55004 116952 116407 116833 118219 120139 121668 121912 120772 118749 116252 113726 112110 112077 112885 112955 111731 110167
54988 110167 109334 109364 109813 110261 110407 110282 110577 112088 114635 116982 117916 117073 114867 112232 110369 110163 111522
54971A11522J963J375n7j481j643rK077K443O39j436j802l36J755L309L522K133
54955A23974rj240p34O93J689J611M60j377k921l035j714j89O81J303K229K972
54939A24393K666J261m70j770k366k451k384k016o27J832L845L823K281J194J180
54924A30391R40l48j634j769j107m82K54J561K956L455K862J861J129Q17N95j2
54908A41469r34j219o7J903L194L249K840K748L057L728M732N464N218M460M554
54893A84396O015Q003R742J1406J3406J5838J8664K1467K3055K2514K0562J8632
54881C73700J6797J3996R965N351J79n757j1094j3863j4469j5363j7305j8400
54869C23737j7579j6336j5802j4657j1717q514p148p176o720n475m599m442m181
$$ plain form
54971 111522 113485 114860 114803 113322 111679 111670 113747 116190 116829 115393 113591 113255 115010 118319 121841 123974
54955 123974 123965 122725 121991 122684 124373 125984 126444 125067 122146 119111 117397 117208 117889 119192 121421 124393
54939 124393 127059 128320 127850 126080 123714 121263 118879 116863 116236 118068 121913 125736 128017 129211 130391
54924 130391 131331 130983 129349 127580 126473 125991 126245 127806 130762 134217 137079 138940 140069 140886 141481 141469
54908 141469 140535 139316 139249 141152 144346 147595 150435 153183 156240 159968 164700 170164 175382 179842 184396
54893 184396 190411 198414 208156 219562 232968 248806 267470 288937 311992 334506 355068 373700
54881 373700 390497 404493 414458 419809 419988 414231 403137 389274 374805 359442 342137 323737
54869 323737 306158 289822 274020 259363 247646 239132 231984 224808 218088 212613 208014 203572 199391
54856A99391l336k174r10M83K055M002O393Q398Q885Q215Q161R525J1279J2714
54842B73081J4502J6768J7997J7227J5537J3751J0540M754j798o226q260r917
54830C57956j2223j4348j5568j6051j5803j4628j3149j2325j1937j0884r033p658
54818B04349p767q933r822r261o937l659q50O85J281J396P60r43l079m303l736
54803A49181j787j29m90k573l760k193L25M27k056l937l525k734l349m086l229
54788A16085j688j123j032j19J001R91L75M61P04l24k043k366p69J167K041J641
54772A15002J84j704k578j561J69Q50N63P16J691K719L492M175M230L056J421
54757A32425N64K94l65j040l38J848M083N263N418M914M253M243M977N313M654
$$ plain form
54856 199391 196055 193881 192971 193454 195509 199511 205904 214302 223187 231402 239563 249088 260367 273081
54842 273081 287583 304351 322348 339575 355112 368863 379403 384157 382359 376133 367873 357956
54830 357956 345733 331385 315817 299766 283963 269335 256186 243861 231924 221040 212007 204349
54818 204349 196582 187649 177827 168566 161629 157970 157120 157805 159086 160482 161242 160299 157220 152917 149181
54803 149181 147394 147265 146775 144202 140442 138249 138574 139001 136945 133008 129483 126749 123400 119314 116085
54788 116085 114397 113274 112242 112123 113124 114115 114490 114951 115655 115331 113288 110922 110153 111320 113361 115002
54772 115002 115186 113482 110904 109343 109512 110362 110925 111641 113332 116051 119543 123718 127948 131004 132425
54757 132425 132989 133283 132918 131878 131540 133388 137471 142734 148152 153066 157319 161562 166539 171852 176506
54742A76506M386N895Q266R869J1117J3205J5149J4991J3466J3352J5143J6475
54730C17820J6248J6239J7663J9020J8629J6793J4000R314K422m425q628j0353
54718D24742j1751j3853j5646j5834j4271j1921j0063r262q739p221m667k456
54706B99058j613j600j249j07J496L013L878L835L408L612N025P513J0713J4158
54692C51140J7150J9318K1116K2956K4250K4391K4246K5321K7377K8342K6711
54681F12318K2847J7720J1732N205j103o627j1392j5509j9017k2188k5220k7509
54669E41257k8184k7350k5860k4033k1703j9385j8026j7468j6537j4800j3105
54658C14806j2033j1217j0417r959r629q361n756k999j687k321m087n406m767
$$ plain form
54742 176506 180892 186787 195053 204922 216039 229244 244393 259384 272850 286202 301345 317820
54730 317820 334068 350307 367970 386990 405619 422412 436412 445726 448148 443723 435095 424742
54718 424742 412991 399138 383492 367658 353387 341466 331403 322141 313402 306181 301514 299058
54706 299058 297445 295845 294596 294489 295985 298998 302876 306711 310119 313731 318756 326269 336982 351140
54692 351140 368290 387608 408724 431680 455930 480321 504567 529888 557265 585607 612318
54681 612318 635165 652885 664617 669822 668719 662092 650700 635191 616174 593986 568766 541257
54669 541257 513073 485723 459863 435830 414127 394742 376716 359248 342711 327911 314806
54658 314806 302773 291556 281139 271180 261551 253190 247434 244435 242748 240427 236340 230934 226167
54645B26167k155K93K49j953l603k956j008L10L75k35q37r35l48L85N06J29n7
54628B14327r0n40r41j24J604K325J293J59M04J115O71o26j132k15J415L010M089
54611B26744L943K358O52O54K544M643N592N760O302P565Q930R856J0457J0962
54597C06962J0979R861P851O308O257P100P405O730N867N491N533N989P203R061
54583D08597J0720J1750J2834J4788J7344J9545K1036K2366K4111K6116K7788
54572F16995K8940K9950L0669K9449K4236J5073M741l828j0226j5850k1318k5845
54560G02986k8806l0565l1574l1682l0614k8430k5421k2162j9554j8078j7123
54549D18977j5701j3600j1220q741o396n002n098n892o256o318o712o787n282
$$ plain form
54645 226167 224012 224305 224554 222601 218998 216042 215034 215344 215719 215484 214647 213712 213364 213749 214255 214384 214327
54628 214327 214237 213697 212756 212632 214236 216561 217854 218013 218417 219532 220203 219577 218445 218230 219645 222655 226744
54611 226744 230687 233045 233697 234351 236895 241538 247130 252890 259192 266757 275687 285543 296000 306962
54597 306962 317941 327802 335653 341961 348218 355318 362723 369453 375320 380811 386344 392333 399536 408597
54583 408597 419317 431067 443901 458689 476033 495578 516614 538980 563091 589207 616995
54572 616995 645935 675885 706554 736003 760239 775312 780053 776225 765999 750149 728831 702986
54560 702986 674180 643615 612041 580359 549745 521315 495894 473732 454178 436100 418977
54549 418977 403276 389676 378456 369715 363319 358317 353219 347327 341071 334753 328041 321254 315972
54536C15972k777j570k619m363n096n084n454o321o970p129p117p225p422p372
54522B39453o610n188m144m437n523n908n156m296m092m059l550k750k083j458
54508A80199o93j21l15j493l211m356l788j559P42J615J222P35O81P84Q61P69
54492A72072J40o67j65K209M423M107J881M94J017K067K670L389M386M678M073
54477B06774L765M275M547M014L911N632Q805J1735J2890J1907J0150J0122J2872
54464C11399J6253J7311J5966J4425J3473J1781Q663M799J78n824j1880j5207
54452C81337j5365j4753j4665j3867j2017j1107j1945j2327j0699q739q251q140
54440B39462o836n188m570m417m093m896p355q710o258j639J290J550J057P11
$$ plain form
54536 315972 313195 311625 309006 304643 299547 294463 289009 282688 275718 268589 261472 254247 246825 239453
54522 239453 232843 227655 223511 219074 213551 207643 202487 198191 194099 190040 186490 183740 181657 180199
54508 180199 179506 179385 179070 177577 174366 170010 166222 164663 165405 167020 168242 168977 169658 170442 171303 172072
54492 172072 172212 171545 171380 173589 178012 182119 184000 184494 185511 187578 190248 193637 198023 202701 206774
54477 206774 210539 214814 219361 223375 227286 232918 241723 253458 266348 278255 288405 298527 311399
54464 311399 327652 344963 360929 375354 388827 400608 409271 414070 414248 408424 396544 381337
54452 381337 365972 351219 336554 322687 310670 299563 287618 275291 264592 255853 247602 239462
54440 239462 232626 227438 222868 218451 214358 209462 202107 193397 187139 185500 186790 188340 189397 190108
54426A90108k99j838k560k147j418l67J680M126N406N154M339L602L041L105L971
54411B15903M562L850K599K172K425K330J900J631Q75j159l498m428l929l187
54397B22046k428j155J09L61j78p41j749l728n342m810k809j642j939k457k667
54382A90871l045l065j619M57Q74p11k123j938j113q32q76q69j265k225k949k782
54366A66790j887o18N67P07o31k111k042q14j48j29Q45L063M688M395K962J779
54350A77416J420J967L070L591K837K103L033M706M820L588L561N164N718L957
54336B26951K323L064M800N139M379M159M315L578K124J017O4j496k917k870j976
54321B52654k260m079n560n359m264l578l259k521j355p27j387k983m350m637
$$ plain form
54426 190108 189809 187971 185411 183264 181846 181479 183159 187285 192691 197845 202184 205786 208827 211932 215903
54411 215903 220465 224315 226914 229086 231511 233841 235741 237372 238247 237088 233590 229162 225233 222046
54397 222046 219618 218463 218572 218933 218755 218014 216265 212537 207195 202385 199576 197934 195995 193538 190871
54382 190871 187826 184761 183142 183599 184473 183762 181639 179701 178588 177756 176880 176011 174746 172521 169572 166790
54366 166790 164903 164285 164852 165559 164928 162817 160775 159961 159813 159684 160529 163592 168280 172675 175637 177416
54350 177416 178836 180803 183873 187464 190301 192404 195437 200143 204963 208551 212112 217276 222994 226951
54336 226951 229274 232338 237138 242277 246656 250815 255130 258708 260832 261849 261913 260417 257500 254630 252654
54321 252654 250394 246315 240755 235396 231132 227554 224295 221774 220419 219692 218305 215322 210972 206335
54307B06335m068l441l009k295j105p5K4r30k468l840m174k981r05O16P99J93
54291A78676k23r0M72J332K216K558K021J061O63J533L467N325N797M593K777
54276B12178J694J712K292K749K520J341j40n01P32K054J679j83j894k815l780
54261B19638n280o571o750n728m059k600k175k690k919k209j789l020m930n375
54247A63543m230l383l571l463k347j540k156l308l582k962k261j800j593j788
54233A25559k161k123j797k053k840k671n78K362M184M023K550J194J196K469
54219A29314L270K044l41j489o46O08J003J019J236J187O95N34R18J004Q08J599
54203A42763L290L520J097j557j459P93K152J356k42j328j877j903j104L8L28
$$ plain form
54307 206335 202267 198826 195817 193522 192417 192342 192366 191436 188968 185128 180954 177973 177068 177684 178483 178676
54291 178676 178453 178363 178835 180167 182383 184941 186962 188023 188686 190219 193686 199011 204808 209401 212178
54276 212178 213872 215584 217876 220625 223145 224486 224346 223845 224577 226631 228310 228127 226233 223418 219638
54261 219638 214358 207787 201037 195309 191250 188650 186475 183785 180866 178657 176868 173848 168918 163543
54247 163543 159313 155930 152359 148896 146549 145009 142853 139545 135963 133001 130740 128940 127347 125559
54233 125559 123398 121275 119478 117425 114585 111914 111336 113698 117882 121905 124455 125649 126845 129314
54219 129314 132584 134628 134287 132798 132152 132760 133763 134782 136018 137205 137900 138434 139352 140356 141164 142763
54203 142763 146053 149573 150670 149113 147654 148447 150599 151955 151713 150385 148508 146605 145501 145539 145867
54188A45867m48j129o87O01J633J472k2j949k942k509j580j243j420j361q23j45
54172A33315L78O12N70P52J767L184L596K543J402J467K073J657K1j645k421k351
54156A46920j857j345j086q79k28O19O82j30l26J215L435M335L408J733K68q83
54140A55881j817k415k391j332P73K784L199K223J748K444K470L36k431l365k611
54125A55496k251k886l156k474j962k463l383l950m130l905k957j463k04M22O47
54110A21381N99K58O9N41J296J455R91P06R26J266J538J878J954J240R8m87l02
54093A35407j14l33m90j69M15Q39P83O5r34j190l36M32j97j676k491k549l005
54076A24457l857l643j905j88R0o65j333j521j215k46J024J623J366J342K149
$$ plain form
54188 145867 145419 144290 143603 144204 145837 147309 147287 145338 142396 139887 138307 137064 135644 134283 133460 133315
54172 133315 133693 134305 134875 135627 137394 140578 144174 146717 148119 149586 151659 153316 153337 151692 149271 146920
54156 146920 145063 143718 142632 141753 141525 142144 142826 142696 142370 143585 147020 151355 154763 156496 156764 155881
54140 155881 154064 151649 149258 147926 148699 151483 154682 156905 158653 161097 163567 163903 161472 158107 155496
54125 155496 153245 150359 147203 144729 142767 140304 136921 132971 128841 124936 121979 120516 120312 120734 121381
54110 121381 121980 122238 122307 122848 124144 125599 126590 127296 128222 129488 131026 132904 134858 136098 136196 135709 135407
54093 135407 135293 134960 134470 134301 134716 135555 136338 136403 135469 134279 133943 134375 134178 132502 130011 127462 124457
54076 124457 120600 116957 115052 114864 114954 114289 112956 111435 110220 109974 110998 112621 113987 115329 117478
54061A17478K701J815Q8r70j074j254k076k904k965k374j806j577j243k09J246
54046A04876J879R32n60q06M51J667J731J370J714K523K724K106J424J097P63
54031A23891M9q55j438j324n38M01P63L09n22j243j784k030j449J54J802K089
54015A18275Q82k93O6J740L071K763J088p40j884k245j865o96Q61J904K049J980
53999A26956K413K866K261O27o98n76Q16K465L404L090J672J96j39P39J779K260
53983A50131K547L142L781M031M126M451M768M679M456M586M785M434L895M384
53969B08196O283Q431R542R584R230Q641P645O659O441O944P260O906O352O025
53955C14139N586M747M026M006M331M276L862L501K844J171j171k858l327l357
$$ plain form
54061 117478 120179 121994 122082 121112 120038 118784 116708 113804 110839 108465 106659 105082 103839 103630 104876
54046 104876 106755 107687 107127 106321 106772 108439 110170 111540 113254 115777 118501 120607 122031 123128 123891
54031 123891 123940 123085 121647 120323 119785 120186 120949 121258 120736 119493 117709 115679 114230 114384 116186 118275
54015 118275 119157 118864 118930 120670 123741 126504 127592 126852 124968 122723 120858 120162 121023 122927 124976 126956
53999 126956 129369 132235 134496 135123 134425 133849 134665 137130 140534 143624 145296 145492 145353 146092 147871 150131
53983 150131 152678 155820 159601 163632 167758 172209 176977 181656 186112 190698 195483 199917 203812 208196
53969 208196 214479 222910 232452 242036 251266 259907 267552 274211 280652 287596 294856 301762 308114 314139
53955 314139 319725 324472 328498 332504 336835 341111 344973 348474 351318 352489 351318 348460 345133 341776
53941C41776l616l724l271k774k897l473m030m483m736m347l473l292m452n753
53927B87455n480l683j967j342j383j376j194r27o89r37k129l887n177n411m784
53912B47089l600j940q9J380K080J847O38r95j696o03J317K362K307K316K688
53897B55101K332R86J41P39J341K01j782j980L07K843L442K561K154L032M424
53882B75842N525O254O525N956M843M531N876P760Q177O737N118M833N524N906
53868C59407N487M561L296J758M08l48p97j265j208qJ589K009J001Q0O21K367
53852C78958M240N679O665P226P584Q247R306R984R548Q338P311O755O071M831
53838D80743L460K553J965J036l78j636k185k287k578l312m531o428q695r874
$$ plain form
53941 341776 338160 334436 331165 328391 325494 322021 317991 313508 308772 304425 300952 297660 293208 287455
53927 287455 281975 278292 276325 274983 273600 272224 271030 270103 269414 268477 266348 262461 257284 251873 247089
53912 247089 243489 241549 241460 242840 244920 246767 247405 246410 244714 244111 245428 247790 250097 252413 255101
53897 255101 257433 258419 258560 259299 260640 260841 259059 257079 257386 260229 263671 266232 268386 271418 275842
53882 275842 281367 287621 294146 300102 304945 309476 315352 323112 331289 338026 343144 347977 353501 359407
53868 359407 364894 369455 372751 374509 374917 374569 373772 372507 371299 371291 372880 374889 375890 375970 376591 378958
53852 378958 383198 388877 395542 402768 410352 418599 427905 437889 447437 455775 463086 469841 475912 480743
53838 480743 484203 486756 488721 489757 489379 487743 485558 483271 480693 477381 472850 466422 457727 447853
53824D47853q733o423n768p752j0103j0381r176q753r531r853q848p620p282p484
53810C30146p419p042o724o441n953n187m291l684l957n050n870n608n121n815
53796B51984p342p797o275l787j581%O59j44j892k916k452j606j428j445j113
53781B12865j330l058n307o006m454j825K52O68r06l402m509k833L18K394K608
53766A85475K304K559K761J891N6j645k193j344K43J460J796J854K315K755K213
53751B02500P65l98n27K0P47J803L328M737N148M305K893K153L092N453P553P776
53735B51348O321M883M559M920N231N572O231O790O641N809M675L300J778P68
53721C18826Q28J476J734J447J252J376J384J114Q99O50l20k124l758m290l959
$$ plain form
53824 447853 439120 432697 426929 419177 409074 398693 389517 380764 371233 361380 352532 344912 337630 330146
53810 330146 322727 315685 308961 302520 296567 291380 287089 283405 279448 274398 268528 262920 257799 251984
53796 251984 244642 236845 230570 226783 225202 225202 225861 225717 223825 220909 218457 216851 215423 213978 212865
53781 212865 211535 208477 203170 197164 192710 190885 191137 191805 190899 187497 182988 180155 180473 182867 185475
53766 185475 187779 190338 193099 194990 195046 193401 191208 189864 190107 191567 193363 195217 197532 200287 202500
53751 202500 203265 202867 202340 202360 203107 204910 208238 212975 218123 222428 225321 227474 230566 236019 243572 251348
53735 251348 257669 262552 267111 272031 277262 282834 289065 295855 302496 308305 312980 316280 318058 318826
53721 318826 319654 321130 322864 324311 325563 326939 328323 329437 330336 330986 330666 328542 324784 320494 316535
53706C16535l584l492l552l614l306k244j190k006n110p775o779k665N56L17j716
53691B70375k576j868j302j599j771j085p9N19O46M18k53j145j521q55M40J329
53675B59673J102P0o21j49Q76Q68r44l572n334n335l682j055J352K269J621P97
53659B47936R28J538J765K028L095M122L391R71j017j153l04N2j85k28J04L00
53643B63343R2k01q3P16J944K803K645J823J388J798K419K521K242K292K969L712
53627B92423L589K273P39N11J996L889M793M773M721M816M639M355M520M896M621
53612C47554L480K022N52q38j469o63Q84J634J238P45O39J92r52k022k507k887
53596C47602l400l341k347j199p24q48j307k120k862k736j936j593j741r04J262
$$ plain form
53706 316535 312951 309459 305907 302293 298987 296743 295553 293547 288437 280662 273883 271218 271774 272091 270375
53691 270375 267799 265931 264629 263030 261259 260174 260095 260614 261260 261678 261425 260280 258759 257904 258344 259673
53675 259673 260775 260845 260224 260075 260951 261819 260875 257303 251969 246634 242952 241897 243249 245518 247139 247936
53659 247936 248864 250402 252167 254195 257290 261412 264803 265774 264757 263604 263300 263352 263167 262939 263043 263343
53643 263343 263435 263234 263151 263867 265811 268614 271259 273082 274470 276268 278687 281208 283450 285742 288711 292423
53627 292423 296012 298285 299024 299535 301531 305420 310213 314986 319707 324523 329162 333517 338037 342933 347554
53612 347554 351034 353056 353608 352770 351301 350638 351522 353156 354394 355139 355778 355970 355018 352996 350489 347602
53596 347602 344202 340861 338514 337315 336591 335743 334436 332316 329454 326718 324782 323189 321448 320544 321806
53581C21806K642J420j109k248j452m26k56j86Q09K672M532N371M587K718J356
53566C42236J531K517K985K818K807L107L169K902K741K700K440K223K725L848
53552C80749M572M269L344K527K182K504L677N392O674O623N454M601N452P587
53538D45607Q635O611K476n31k80K325N058O773P476P189O093N122N221O194P073
53523E21042P329O968N888M083K300J503J799K389K592K368K029J974K372K794
53509E67430K445J231J22K7O95J294J625K141L029L745L422J767j38k63K270N664
53493E96506P169O263M673L420J924M71R59L828O421O310M532L539L681L947M695
53478F58338O797R082R508Q490Q261R129R118P470N935O002P165Q534J0016J1171
$$ plain form
53581 321806 324448 325868 324759 322511 321059 320633 320377 320191 321000 323672 328204 333575 338162 340880 342236
53566 342236 343767 346284 349269 352087 354894 358001 361170 364072 366813 369513 371953 374176 376901 380749
53552 380749 385321 389590 392934 395461 397643 400147 403824 409216 415890 422513 427967 432568 438020 445607
53538 445607 454242 460853 463329 462798 462518 464843 469901 476674 484150 491339 497432 502554 507775 513969 521042
53523 521042 528371 535339 541227 545310 547610 549113 550912 553301 555893 558261 560290 562264 564636 567430
53509 567430 569875 571106 571228 571255 571950 573244 574869 577010 580039 583784 587206 588973 588835 588572 590842 596506
53493 596506 603675 609938 614611 618031 619955 620426 621385 625213 631634 637944 642476 646015 649696 653643 658338
53478 658338 665135 674217 683725 692215 700476 709605 718723 726193 732128 738130 745295 753829 763845 775016
53464G75016J0969R671R185J0604J2847J4525J5649J6693J7486J7965J8736J9897
53452I49243K0502K0076J9660K0470K2439K4716K6666K7845K8014K7832K8458
53441A215921K9935L1077L1517L2554L5176L8424M0646M1340M0944L9966L9152
53430A616652L9360M0259M0269L8963L8171L9362M0989M0395L7659L5579L5933
53419B043591L7487L8062L7024L5189L3518L2640L2930L4082L4894L4206L2159
53408B425782L0162K9378K9388K8657K6371K3396K1023J9205J6804J3402R893
53397B673461P007M177N60l550p031r305j0751j1860j2724j3481j4812j7568k1703
53384B562420k5717k7632k6943k5327k4962k6352k8282k9695l0713l1826l3014
$$ plain form
53464 775016 785985 795656 804841 815445 828292 842817 858466 875159 892645 910610 929346 949243
53452 949243 969745 989821 1009481 1029951 1052390 1077106 1103772 1131617 1159631 1187463 1215921
53441 1215921 1245856 1276933 1308450 1341004 1376180 1414604 1455250 1496590 1537534 1577500 1616652
53430 1616652 1656012 1696271 1736540 1775503 1813674 1853036 1894025 1934420 1972079 2007658 2043591
53419 2043591 2081078 2119140 2156164 2191353 2224871 2257511 2290441 2324523 2359417 2393623 2425782
53408 2425782 2455944 2485322 2514710 2543367 2569738 2593134 2614157 2633362 2650166 2663568 2673461
53397 2673461 2680468 2684645 2685205 2681655 2674624 2665319 2654568 2642708 2629984 2616503 2601691 2584123 2562420
53384 2562420 2536703 2509071 2482128 2456801 2431839 2405487 2377205 2347510 2316797 2284971 2251957
53373B251957l3950l4370l3857l1842k8284k4120k0816j9410j9639j9791j8031
53362A967847j4611j2041j2062j3076j2040q540n072l274j933N61L738O248Q014
53349A903759R733J1316J2349J3362J5261J7852K0153K1930K3867K6361K9006
53338B104949L1256L2925L4260L5988L8936M3120M7492N1054N3816N6192N8074
53327B588062N9124N9654O0481O2168O4676O7470O9718P0888P1453P2307P3327
53316C319328P3523P2864P2588P2940P2063O8498O3695O0310N8701N6786N3104
53305D044400M8313M3591L9142L4635K9854K4492J8159J1013L784l029r350j5092
53293D269912k0239k5304l0806l6335m1015m4874m8701n2472n5159n6374n7104
$$ plain form
53373 2251957 2218007 2183637 2149780 2117938 2089654 2065534 2044718 2025308 2005669 1985878 1967847
53362 1967847 1953236 1941195 1929133 1916057 1904017 1895477 1890405 1887131 1885198 1885759 1889497 1895745 1903759
53349 1903759 1913492 1924808 1937157 1950519 1965780 1983632 2003785 2025715 2049582 2075943 2104949
53338 2104949 2136205 2169130 2203390 2239378 2278314 2321434 2368926 2419980 2473796 2529988 2588062
53327 2588062 2647186 2706840 2767321 2829489 2894165 2961635 3031353 3102241 3173694 3246001 3319328
53316 3319328 3392851 3465715 3538303 3611243 3683306 3751804 3815499 3875809 3934510 3991296 4044400
53305 4044400 4092713 4136304 4175446 4210081 4239935 4264427 4282586 4293599 4297383 4294354 4285004 4269912
53293 4269912 4249673 4224369 4193563 4157228 4116213 4071339 4022638 3970166 3915007 3858633 3801529
53282C801529n8188n9172n9405n9337n9742o0199n9505n7368n4797n2790n1455
53271C169571n0515m9896m9499m8960m8073m7039m5946m4370m2049l9579l7748
53260B665897l6221l3802l0259k6998k5346k4874k4193k2878k1690k1316k1942
53249B376378k3678k6104k7551k6296k2820j9521j7788j6701j5128j3450j2165
53238B155176j0330p007l275j072n44k38N11J193K067M588R147J3860J6615J7528
53224B198219J8488K0801K4077K7187K9507L1038L1814L1691L0858L0148L0298
53213B504126L0826L0363K8376K5956K4334K3169K1047J7388J3088R379O719M767
53201B739538K932Q65j354l586o156r484j3053j5638j7124j9043k2417k5956k7750
$$ plain form
53282 3801529 3743341 3684169 3624764 3565427 3505685 3445486 3385981 3328613 3273816 3221026 3169571
53271 3169571 3119056 3069160 3019661 2970701 2922628 2875589 2829643 2785273 2743224 2703645 2665897
53260 2665897 2629676 2595874 2565615 2538617 2513271 2488397 2464204 2441326 2419636 2398320 2376378
53249 2376378 2352700 2326596 2299045 2272749 2249929 2230408 2212620 2195919 2180791 2167341 2155176
53238 2155176 2144846 2137839 2134564 2133492 2132948 2132710 2133221 2134414 2136481 2141069 2150216 2164076 2180691 2198219
53224 2198219 2216707 2237508 2261585 2288772 2318279 2349317 2381131 2412822 2443680 2473828 2504126
53213 2504126 2534952 2565315 2593691 2619647 2643981 2667150 2688197 2705585 2718673 2728052 2734771 2739538
53201 2739538 2742470 2743335 2741981 2738395 2732239 2722755 2709702 2694064 2676940 2657897 2635480 2609524 2581774
53188B581774k7988k8498k9880l0889l0637k9784k9177k8889k8989k9915l1283
53177B255845l1674l0471k8886k8154k7676k6099k3602k1826k1711k2465k2814
53166A970467k2478k2105k2187k2358k1841k0468j8883j7579j6145j4096j2038
53155A760289j0998j0775j0240r347r404j0810j2035j1895j1522j2718j5240j7361
53143A617944j8469j9463k0767k1696k2008k2428k3145k3111k1579j9389j7944
53132A387945j7644j8078j8941k0023k0837k1220k1842k3298k4914k5326k4193
53121A151629k2603k1737k1821k2334k2623k2171k1006j9996k0159k1324k2143
53110I13712k1707k0623j9982j9853j9446j8337j6846j5388j4249j3855j4460
$$ plain form
53188 2581774 2553786 2525288 2495408 2464519 2433882 2404098 2374921 2346032 2317043 2287128 2255845
53177 2255845 2224171 2193700 2164814 2136660 2108984 2082885 2059283 2037457 2015746 1993281 1970467
53166 1970467 1947989 1925884 1903697 1881339 1859498 1839030 1820147 1802568 1786423 1772327 1760289
53155 1760289 1749291 1738516 1728276 1718929 1709525 1698715 1686680 1674785 1663263 1650545 1635305 1617944
53143 1617944 1599475 1580012 1559245 1537549 1515541 1493113 1469968 1446857 1425278 1405889 1387945
53132 1387945 1370301 1352223 1333282 1313259 1292422 1271202 1249360 1226062 1201148 1175822 1151629
53121 1151629 1129026 1107289 1085468 1063134 1040511 1018340 997334 977338 957179 935855 913712
53110 913712 892005 871382 851400 831547 812101 793764 776918 761530 747281 733426 718966
53099G18966j5405j5452j4121j2145j0476r463r263j0196j1992j3339j3059j1477
53087E72578r851q658p339n711m652m862n779o326o267o165o242o076n462m908
53073D84280m989n598o222o666p077p395p174o161m709l455k641j983j143k33
53059D18834K56l0q87j636j633p38N52J343Q90p69k508k849j455L28Q69J37m04
53042D10300K15J369K034K304K887L579L201J146j780m268n770o634p296p709
53028C93578p457o303m570k932j880j602k249l747n261n651m957m728o048p811
53014C28382q017o367m480l600l340k966k682k996l577l464k186k92R59M25j820
52999B83979m148m698l186r60O17J237J191P69K76k33j223k854l937l035p76M14
$$ plain form
53099 718966 703561 688109 673988 661843 651367 641904 632641 622445 610453 597114 584055 572578
53087 572578 562727 554069 546730 541019 536367 531505 525726 519400 513133 506968 500726 494650 489188 484280
53073 484280 479291 473693 467471 460805 453728 446333 439159 432998 428289 424834 422193 420210 419067 418834
53059 418834 419090 419060 418173 416537 414904 414166 414718 416061 416951 416182 413674 410825 409370 409698 410567 410704 410300
53042 410300 410515 411884 413918 416222 419109 422688 425889 427035 425255 420987 415217 408583 401287 393578
53028 393578 386121 379818 375248 372316 370436 368834 366585 362838 357577 351926 346969 342241 336193 328382
53014 328382 320365 313998 309518 305918 302578 299612 296930 293934 290357 286893 284707 284415 285374 285799 283979
52999 283979 279831 275133 271947 270987 271604 272841 274032 274801 275077 274844 273621 270767 266830 263795 263019 263433
52983B63433n11j822j693q06r00j868k046q78L15K10j186l047m503m760l437j144
52967B35357Q61J706J347K15j075j885j944j521r44l16M9m20j602k377k013j204
52951B24234q86p07J95J511K082J659R78L23n63j125j76K063L478K538L35q15
52935B35124j44J058J355O50k20o21m93n8M45P54P05N11O06R75J018N35L63J231
52917B43794K320K199J146J004K295L174K164N11L04J517K600L117L822M588M407
52902B78962L530L625N263O867O911N855N132N214N504N479N155M797M611M534
52888C51439M229L559K816K109R87o49j809j764j520k592m525n369m593l629l185
52873C35504k049L92K319J738n68k000j404J8O56M1j353k744l295k638j360m98
$$ plain form
52983 263433 262922 261100 259407 258601 257701 255833 253787 252909 253224 253434 252248 249201 244698 239938 236501 235357
52967 235357 236218 237924 239271 239486 238411 236526 234582 233061 232117 231801 231850 231430 229828 227451 225438 224234
52951 224234 223348 222641 222836 224347 226429 228088 229066 229389 228826 227701 227525 229588 233066 235604 235939 235124
52935 235124 234980 236038 237393 238043 237823 237202 236709 236651 237096 237850 238555 239066 239672 240647 241665 242200 242563 243794
52917 243794 246114 248313 249459 250463 252758 255932 258096 258607 258911 260428 263028 266145 269967 274555 278962
52902 278962 282492 286117 291380 298247 305158 311013 316145 321359 326863 332342 337497 342294 346905 351439
52888 351439 355668 359227 362043 364152 365139 364490 362681 360917 359397 356805 352280 346911 342318 338689 335504
52873 335504 333455 333847 336166 337904 337336 335336 333932 333950 334606 334647 333294 330550 327255 324617 323257 322759
52857C22759n02r98j414j463j101l85O35J992L577M793M792L260Q14j512k840
52842C32407k688j177P71J934J793Q07j96n25K32J834L216L458K894K442K009
52827C49211P10j196k024q73J094K281K514K400J933P95o22j607j957j627k67
52812C50765J974L805M133L471K908K311R24p42j274n69qj39J85J645K925K509
52796C74823R98K37O53Q97J14p11k10J455K892L198K668J990J563J671K600M058
52780C98896N044M912M247M068M351M176L302K617K795L273L264L011L229L606
52766D50791K880N60k168l618l386k544k308k928l910m878n808o551o693o078
52752D03361n138m374l865l706m478o503q724r231p328m488k758k621k938k706
$$ plain form
52857 322759 322257 321259 319845 318382 317281 316896 317531 319523 323100 327893 332685 335945 336759 335247 332407
52842 332407 329719 328542 329313 331247 333040 333847 333651 333126 333358 335192 338408 341866 344760 347202 349211
52827 349211 349921 348725 346701 345828 346922 349203 351717 354117 356050 356845 356223 354616 352659 351032 350765
52812 350765 352739 356544 360677 364148 367056 369367 370291 369549 368275 367706 367698 367559 367744 369389 372314 374823
52796 374823 375821 376058 376711 377608 377722 377011 376801 378256 381148 384346 387014 389004 390567 392238 394838 398896
52780 398896 403940 408852 413099 417167 421518 425694 428996 431613 434408 437681 440945 443956 447185 450791
52766 450791 453671 454231 452063 448445 445059 442515 440207 437279 433369 428491 422683 416132 409439 403361
52752 403361 398223 393849 389984 386278 381800 375297 366573 357342 350014 345526 342768 340147 337209 334503
52738C34503k139j915k021j899j473j431k244l434m238m557m659m343l236j827
52724B95087j081j029r14r14k157m272m783k449K28l0k763m564l999l048l277
52709B60035l315j488J090J880L76j613k570k689k781l018l025k600j952j442
52695B36888j248j320j658k354l176l556l413l540m495n530n538m633l794l328
52681A89305k889k629k829k615q75J490K082K75j857k475k073j787j525j007j002
52666A69589k010k839k151m97N11L47l42r95j294p85L79R50Q9j250j550p86r0
52649A57276L0l6r4k71l76j05M22J018J790K448K148R27K77J016J687O35j112
52632A67680r98J463M079M944M314L436L014L221L927M511M318L485K643J981
$$ plain form
52738 334503 332364 330449 328428 326529 325056 323625 321381 317947 313709 309152 304493 300150 296914 295087
52724 295087 294006 292977 292063 291149 288992 284720 279937 277488 277716 277686 274923 270359 266360 263312 260035
52709 260035 256720 255232 256322 258202 258578 256965 254395 251706 248925 245907 242882 240282 238330 236888
52695 236888 235640 234320 232662 230308 227132 223576 220163 216623 212128 206598 201060 196427 192633 189305
52681 189305 186416 183787 180958 178343 177468 178958 181040 181315 179458 176983 174910 173123 171598 170591 169589
52666 169589 167579 164740 162589 162092 162603 162950 162608 161613 160319 159534 159913 160863 160952 159702 158152 157366 157276
52649 157276 157306 157270 157176 156905 156529 156424 156846 157864 159654 162102 164250 165177 165454 166470 168157 168792 167680
52632 167680 166682 168145 172224 177168 181482 184918 187932 191153 195080 199591 203909 207394 210037 212018
52618B12018J417J306J898K353J560l07k082l316m434n455n855n669n483n354
52604A82597m953m522m384l783j885K10L50j523l007k584j418j061j236j098j094
52589A50609j980l030k862j445L0R21J491J819J474M84l41l16M24J245J729J947
52573A52199K232K711L026K690J865J487K387M286N745N187K235j749m643n409
52559A74249m764l942l297k583j919j657j602j279p57l82Q4J058K023J898O39
52544A57769n89r81q28n28K5P78J186J032P24L89l41j258j287K4J586K107J673
52527A61481J233J153J104R66J004J304J762K381L048L174K290R37L28J027K324
52512A85516L046K642J471L25j57K07J127K145K993L684M276M576M272L411K523
$$ plain form
52618 212018 213435 214741 216639 218992 220552 220245 218163 214847 210413 204958 199103 193434 187951 182597
52604 182597 177644 173122 168738 164955 163070 163280 163630 162107 159100 156516 155098 154037 152801 151703 150609
52589 150609 148629 145599 142737 141292 141322 142243 143734 145553 147027 147511 147170 146854 147278 148523 150252 152199
52573 152199 154431 157142 160168 162858 164723 166210 168597 172883 178628 183815 186050 184301 179658 174249
52559 174249 169485 165543 162246 159663 157744 156087 154485 153206 152449 152067 152151 153209 155232 157130 157769
52544 157769 157180 156199 155371 154843 154868 155646 156832 157864 158588 158977 158636 157378 156091 156115 157701 159808 161481
52527 161481 162714 163867 164971 165937 166941 168245 170007 172388 175436 178610 180900 181837 182165 183192 185516
52512 185516 188562 191204 192675 193000 192843 193050 194177 196322 199315 202999 207275 211851 216123 219534 222057
52497B22057J987J485N74l85m32P15K260L354L889M041L722K894J837P09m71j099
52481B47137k59J698K921K298J009P80J503J902J698J622J739J356M13l37l42
52466B65138N65K504M762N427L431M84p81r7Q34J373K137K434O07k463l290n08
52450B82557K748K915M00j866k399j747o35L76L81p00j243l7J497J122q17j846
52434B80706r49L42N18r4n58p85j053j270j267j097o30M11J661K178J640Q79Q50
52417B81482J604K643L635M320M180K929J234L41P60J685J964J496J258J934L012
52402C14477L443K966K260K006K180K206J494q5j901k880k502j235J74J435K309
52387C26347K175R04l70l60P77J849K190J780M71j415k250o81J952K867J661P85
$$ plain form
52497 222057 224044 225529 226103 225718 225286 226001 228261 231615 235504 239545 243267 246161 247998 248707 248236 247137
52481 247137 246878 248576 251497 253795 254804 255584 257087 258989 260687 262309 264048 265404 265817 265480 265138
52466 265138 265703 268207 272969 278396 281827 282311 281530 281433 282267 283640 285777 288211 288818 286355 283065 282557
52450 282557 285305 288220 288620 286754 284355 282608 281973 282349 282730 282030 280787 280750 282247 283369 282552 280706
52434 280706 279757 280099 280617 280523 279965 279180 278127 276857 275590 274493 273863 274274 275935 278113 279753 280632 281482
52417 281482 283086 285729 289364 293684 297864 300793 302027 302368 303128 304813 306777 308273 309531 311465 314477
52402 314477 317920 320886 323146 325152 327332 329538 331032 330947 329046 326166 323664 322429 322603 324038 326347
52387 326347 328522 329426 329056 328696 329473 331322 333512 335292 335763 334348 332098 331417 333369 336236 337897 338682
52371C38682J611K364J141j042j855q58N60J314J157J44r71p67Q82J817L11k079
52355C42411k312l4K132K383J784J991K801K931K129J316J067Q97J60q20r01M52
52339C58387K227K808J765Q2j254k043k163j309K5M25p55k347k743j590M29K535
52323C54479L788L194Q96j485k648k875k801k087m79J008J393J224J266Q09q80
52308C54802k306j194K116M843N296M413L673L370L278L393L493L286L201L812
52294C95476M413L724K141J714L399N865P441P909P718O941N835N241N578O242
52280D69637O566O458N766M215K610K728N068P695Q391P153N681N083N054M853
52266E46958M252L712M146O010Q347R477R056Q537R001R640R431R173J0294J2273
$$ plain form
52371 338682 340293 342657 343798 342756 340901 340043 340603 341917 343074 343218 342247 341480 342362 344179 344490 342411
52355 342411 340099 340065 342197 344580 346364 348355 351156 354087 356216 357532 358599 359496 359656 358836 357935 358387
52339 358387 360614 363422 365187 365269 364015 361972 359809 358500 358525 358950 358195 355848 353105 351515 351944 354479
52323 354479 358267 361461 362357 360872 358224 355349 352548 350461 349982 350990 352383 353607 354873 355682 354802
52308 354802 352496 351302 353418 358261 363557 367970 371643 375013 378291 381684 385177 388463 391664 395476
52294 395476 399889 403613 405754 407468 410867 416732 424173 432082 439800 446741 452576 457817 463395 469637
52280 469637 476203 482661 488427 492642 495252 497980 503048 510743 519134 526287 531968 537051 542105 546958
52266 546958 551210 554922 559068 565078 573425 582902 591958 600495 609496 619136 628567 637740 648034 660307
52252F60307J3141J2504J2241J3624J5394J5773J5288J6072J8743K1520K2631
52241H37238K2404K2257K2606K2864K3036K4045K6265K8794L0630L1779L2679
52230A124597L3265L3366L3455L4086L4833L4745L3772L2960L3089L3717L3781
52219A495666L2670L0596K8313K6537K5436K4532K3126K0790J7604J4404J2665
52208A752339J3270J5065J5586J3780J1046Q897O873L978J034k81j97n48j757
52195A839085k108n27J665K579J975R05L07Q85L238P045J0647J2484J2608J2239
52181A903027J2307J3051J4539J6802J9424K1544K2416K2041K1330K1370K2143
52170B109994K2289K0734J8172J6172J5125J4207J3000J1811J0370P854M529J796
$$ plain form
52252 660307 673448 685952 698193 711817 727211 742984 758272 774344 793087 814607 837238
52241 837238 859642 881899 904505 927369 950405 974450 1000715 1029509 1060139 1091918 1124597
52230 1124597 1157862 1191228 1224683 1258769 1293602 1328347 1362119 1395079 1428168 1461885 1495666
52219 1495666 1528336 1558932 1587245 1613782 1639218 1663750 1686876 1707666 1725270 1739674 1752339
52208 1752339 1765609 1780674 1796260 1810040 1821086 1829983 1836856 1840834 1841868 1841587 1841390 1840842 1839085
52195 1839085 1836977 1836450 1838115 1840694 1842669 1843574 1843881 1844766 1848004 1855049 1865696 1878180 1890788 1903027
52181 1903027 1915334 1928385 1942924 1959726 1979150 2000694 2023110 2045151 2066481 2087851 2109994
52170 2109994 2132283 2153017 2171189 2187361 2202486 2216693 2229693 2241504 2251874 2259728 2264257 2266053
52158B266053nk135n100p438q250r236j2415j6868j9907k0844k1502k2976k4137
52145B095240k3855k2847k2276k1914k0956j9735j9242j9397j9144j8241j7622
52134A870011j7651j7130j5021j2323j0987j1222j1156r544p360o083n577m930
52122A741027m513n493p556q728p835n832m290l700l770m436n749p345q585q777
52108A654418p279m291j658j654m350p309q432q055p489o880n751m593m328m765
52094A577584n044n221n986p073p423o863o181n562m433l023k604l543m482m231
52080A505915l351k937k811k083r06m16j129k450l734m875n678n555m317k761
52066A462912j899j944k377k799l291l955m565m753m309l138j189J296L516M531
$$ plain form
52158 2266053 2266048 2263913 2258813 2251375 2243125 2233889 2221474 2204606 2184699 2163855 2142353 2119377 2095240
52145 2095240 2071385 2048538 2026262 2004348 1983392 1963657 1944415 1925018 1905874 1887633 1870011
52134 1870011 1852360 1835230 1820209 1807886 1796899 1785677 1774521 1764977 1757617 1751534 1745957 1741027
52122 1741027 1736514 1731021 1723465 1714737 1706902 1701070 1696780 1693080 1689310 1684874 1679125 1671780 1663195 1654418
52108 1654418 1647139 1642848 1641190 1639536 1635186 1627877 1619445 1611390 1603901 1597021 1591270 1586677 1582349 1577584
52094 1577584 1572540 1567319 1561333 1554260 1546837 1539974 1533793 1528231 1523798 1520775 1518171 1514628 1510146 1505915
52080 1505915 1502564 1499627 1496816 1494733 1493827 1493411 1492282 1489832 1486098 1481223 1475545 1469990 1465673 1462912
52066 1462912 1461013 1459069 1456692 1453893 1450602 1446647 1442082 1437329 1433020 1429882 1428693 1429989 1433505 1438036
52052A438036M131L231L061M064N851Q167J1293J5043J8017J8899J8488J9374
52040A567655K2897K7307K9869L0277L0724L2759L5458L7148L7778L8657M0544
52029A931073M2764M4011M3539M1778M0057L9298L8859L7268L4257L1120K8768
52018B352792K6594K3944K1373J9258J6456J2013P320M512L241J156k466n813
52006B480380p614q884j0706j2376j3068j3748j5617j7787j8258j6670j4622j3544
51994B317486j3528j3957j4014j2833j0170o986m392k322j59J710K400K511L894
51981B249640O853R178Q985P454P322R236J1148J1241J0010R035Q834Q801Q488
51968B366225Q006P393O523N444M220K545K68j892l110m009o331j0675j5512j9014
$$ plain form
52052 1438036 1442167 1445398 1448459 1452523 1458374 1466541 1477834 1492877 1510894 1529793 1548281 1567655
52040 1567655 1590552 1617859 1647728 1678005 1708729 1741488 1776946 1814094 1851872 1890529 1931073
52029 1931073 1973837 2017848 2061387 2103165 2143222 2182520 2221379 2258647 2292904 2324024 2352792
52018 2352792 2379386 2403330 2424703 2443961 2460417 2472430 2479750 2484262 2487503 2488659 2486193 2480380
52006 2480380 2472766 2463882 2453176 2440800 2427732 2413984 2398367 2380580 2362322 2345652 2331030 2317486
51994 2317486 2303958 2290001 2275987 2263154 2252984 2245998 2241606 2239284 2239125 2240835 2243235 2245746 2249640
51981 2249640 2256493 2265671 2274656 2282110 2289432 2298668 2309816 2321057 2331067 2340102 2348936 2357737 2366225
51968 2366225 2374231 2381624 2388147 2393591 2397811 2400356 2400624 2398732 2395622 2391613 2385282 2374607 2359095 2340081
51954B340081k1009k2375k3413k3856k3971k4566k6054k8261l0891l3564l5695
51943B046426l7049l8072l9095l9718l9750m0013m1193m2498m2692m2050m1851
51932A602445m2262m2276m1645m1324m1674m1764m0917l9695l8708l7634l6069
51921A158477l4538l3888l4199l4741l4562l2989l0093k6761k3940k1934k0795
51910H30037k0729k1271k1023j9516j8446j9250k0171j8210j3767j0589j0776
51899F36289j2450j3188j2962j2387j0777q018o260p334r780j0729r749q769q850
51886E05036r082q447p121n879n373n824o756p356p511p679p404n475k322n10
51872D18297j537l722m776m763m645l749j197J402J606j53j221p49l43p53q12
$$ plain form
51954 2340081 2319072 2296697 2273284 2249428 2225457 2200891 2174837 2146576 2115685 2082121 2046426
51943 2046426 2009377 1971305 1932210 1892492 1852742 1812729 1771536 1729038 1686346 1644296 1602445
51932 1602445 1560183 1517907 1476262 1434938 1393264 1351500 1310583 1270888 1232180 1194546 1158477
51921 1158477 1123939 1090051 1055852 1021111 986549 953560 923467 896706 872766 850832 830037
51910 830037 809308 788037 767014 747498 729052 709802 689631 671421 657654 647065 636289
51899 636289 623839 610651 597689 585302 574525 566507 560247 552913 543133 532404 522655 513886 505036
51886 505036 495954 487507 480386 474507 469134 463310 456554 449198 441687 434008 426604 421129 418807 418297
51872 418297 416760 413038 408262 403499 398854 395105 393908 395310 396916 396763 395542 394793 394450 393697 392885
51857C92885j15j57j753l460l792l380l742n141o595p099o138l937j728q94j418
51842C43536j966j776j568k219l547m709m998m104k375j008r93j751j806q19L6
51827C09933j79j116j984k320j810n18N71L49q27j488j079l66J90Q91J358M68
51811C02073j579k794k060p25l96n57J13J161R86m99j586j209j18N66Q29J249
51795B95454J880K238J995J332P72Q81J907L386M338M212L647L754M425M068J763
51780C36052q32j072J237L415L455K318J736J427K32j218j333m14k97j193j285
51765C42228j3N97j130l974n477m776k698l16J377J362k68j693j101J157K988
51750C28263K927J394j44n82L1P05O20K01N96K002L173K961J632K34o88j196j372
$$ plain form
51857 392885 392770 392613 390860 387400 383608 380228 376486 371345 364750 357651 351513 347576 345848 344954 343536
51842 343536 341570 339794 338226 336007 332460 327751 322753 318649 316274 315266 314273 312522 310716 309897 309933
51827 309933 309754 308638 306654 304334 302524 302006 302577 302926 302099 300611 299532 299166 299356 300247 301605 302073
51811 302073 300494 297700 295640 294915 294519 293962 294075 295236 296222 295723 294137 292928 292810 293376 294205 295454
51795 295454 297334 299572 301567 302899 303671 304552 306459 309845 314183 318395 322042 325796 330221 334289 336052
51780 336052 335220 334148 335385 338800 342255 344573 346309 347736 347968 346750 345417 345003 344706 343513 342228
51765 342228 342215 342812 341682 337708 332231 327455 324757 324441 325818 327180 326912 325219 324118 325275 328263
51750 328263 331190 332584 332440 331858 331889 332594 333214 333415 334011 336013 339186 342147 343779 344013 343325 342129 340757
51733C40757j276j128j074j011r38j115j630k203k485k138o99J811M117M552L025
51718C38565J254O70R61J143J018Q60N59j03p68q49j99R17K054K592K211J641
51702C52526K082L470M367M073L656M106M602L794K008Q08R60J991L341M630N027
51687D01441L848J906J139K507N006P032P938Q031P742P409P476Q337R853J1328
51673D90993J2117J2277J2479J3202J4279J5344J6299J6878J6229J3745J0184
51662F44026P036M841K994J209n2p12j398k118k004j081r82k817n372o644o282
51647F30644n192l537q65K075L380K200k81k425l751m560m870m343l020j616j011
51632F02828j456k148j878l53J424K395K688L120L854M312M348M779O447R014
$$ plain form
51733 340757 339481 338353 337279 336268 335330 334215 332585 330382 327897 325759 325060 326871 330988 335540 338565
51718 338565 339819 340489 341450 342593 343611 344471 345030 344927 344159 343310 343111 344028 346082 348674 350885 352526
51702 352526 354608 358078 362445 366518 370174 374280 378882 382676 384684 385492 386452 388443 391784 396414 401441
51687 401441 405289 407195 408334 410841 415847 422879 430817 438848 446590 453999 461475 469812 479665 490993
51673 490993 503110 515387 527866 541068 555347 570691 586990 603868 620097 633842 644026
51662 644026 651062 655903 658897 660106 660054 659342 657944 655826 653822 652741 651759 648942 643570 636926 630644
51647 630644 625452 621915 621050 623125 626505 628705 628424 625999 622248 617688 612818 608475 605455 603839 602828
51632 602828 601372 599224 597346 596993 598417 600812 603500 606620 610474 614786 619134 623913 630360 639374
51618F39374J0938J0632P745L425q20m267o785p859o790m199k192k170l017k399
51604F31616L22L306M330L080J248P79K216M514O235O730O161M756K615Q6k340
51589F75654m521o460p685p714p138p257q419r673j0363j0918j1570j1495j0162
51576E62279q587q196r017r839r678q465o823n765n947o718o678n676n227o247
51562D59416p574p655o539n148l715k361k087l461n090n200m070l193k561r14
51548C99848J482K547J203j230k942l415k864j487J7M57m80j718k125j666q91
51533C86736j84K01J08j29M3O69J533K847M693N901N095K989K106L720O388Q038
51517D30754Q175P321N926M769N057O741P742O392L870K695L293L737K747J257
$$ plain form
51618 639374 650312 660944 668689 672114 671294 667027 660242 652383 645593 641394 639202 637032 634015 631616
51604 631616 631938 635244 639574 642654 643902 644681 646897 651411 657646 664376 670537 675293 677908 677994 675654
51589 675654 671133 664673 656988 649274 642136 634879 626460 616787 606424 595506 583936 572441 562279
51576 562279 553692 545496 536479 526640 516962 508497 501674 495909 489962 483244 476566 470890 465663 459416
51562 459416 451842 444187 437648 432500 428785 426424 424337 420876 415786 410586 406516 403323 400762 399848
51548 399848 401330 403877 405080 403850 400908 397493 394629 393142 393159 393616 393136 391418 389293 387627 386736
51533 386736 386552 386753 386861 386732 386775 387444 388977 391824 396517 402418 407513 410502 412608 416328 422716 430754
51517 430754 438929 446250 452176 456945 462002 468743 476485 482877 486747 489442 492735 496472 499219 500476
51503E00476N72M14k38j326j878j778k237m076o294p103o239n268n290n199l183
51488D51353N45L638M350L365K632L189M606N912O525O567O717P455Q290Q210
51474E23354P054N808N243M940M204L282K891K958K739K016J300P87lj225k132
51459E63216k092j660j815k344j934o7K030K937K811K772K960K477J241N78J340
51444E72450K429K156M44j260k027k380l242m716o197p145p420p040o016m646
51430E25390l879m780p049q548p347m148j482m83N5J036J379J22j476j624o34
51415D86532n4n0M31J550K593L705N488P160P248O219O204P712Q758P977O636
51400E58109O508P499Q476R069R512R881J0452J1781J3409J3607J1468Q336O262
$$ plain form
51503 500476 501048 501462 501224 499898 498020 496242 494005 489929 483635 476532 470293 465025 459735 454536 451353
51488 451353 451898 455536 459886 463251 465883 469072 473678 479590 486115 492682 499399 506854 515144 523354
51474 523354 530408 536216 541459 546399 550603 553885 556776 559734 562473 564489 565789 566576 566573 565348 563216
51459 563216 561124 559464 557649 555305 553371 553304 555334 558271 561082 563854 566814 569291 570532 571110 572450
51444 572450 574879 577035 577479 576219 574192 571812 568570 563854 557657 550512 543092 536052 530036 525390
51430 525390 521511 516731 509682 501134 493787 489639 488157 487674 487729 488765 490144 490266 488790 487166 486532
51415 486532 486478 486428 486859 488409 491002 494707 500195 507355 514603 520822 527026 534738 543496 551473 558109
51400 558109 564617 572116 580592 589661 599173 609054 619506 631287 644696 658303 669771 678107 684369
51387F84369N805O171O519O272N092L528K757K851K287K28j819j920l74R85J407
51372G24158J597J977K225K446L264M510M977L864J760k9o21j05M48l13k707n450
51356G42001o905o753o013n747o352p674r128j0016j0285j0633j1254j0980q664
51343F31597n098k491j985k662l057k864k762l191l743l692k887j940j362q08
51329E93055K14J078N37j241k377j698k69M05M85Q14R38j56j930k778k415k103
51313E82559k628l705n362q081j1140j2681j2115j0942j0509j0420j0052j0038
51301D74886j1031j2166j2273j1702j1492j1370j0197q123o676o626p073o960
51289C59197o347n759n213m550m040l967m003l564k589j596j109j311k038k795
$$ plain form
51387 684369 690174 696345 702864 709136 714228 717756 720513 723364 725651 725879 724060 722140 721766 722751 724158
51372 724158 725755 727732 729957 732403 735667 740177 745154 749018 750778 750749 750128 750023 750471 750158 747451 742001
51356 742001 735096 728343 722330 716583 710231 702557 693429 683413 673128 662495 651241 640261 631597
51343 631597 626499 624008 622023 619361 616304 613440 610678 607487 603744 600052 597165 595225 593863 593055
51329 593055 593269 594347 594884 593643 591266 589568 589299 589704 590189 591003 591941 591785 589855 587077 584662 582559
51313 582559 579931 576226 570864 562783 551643 538962 526847 515905 505396 494976 484924 474886
51301 474886 463855 451689 439416 427714 416222 404852 394655 386532 379856 373230 366157 359197
51289 359197 352850 347091 341878 337328 333288 329321 325318 321754 319165 317569 316460 315149 313111 310316
51275C10316k941k273j249m31J59O88P78j78j837k761k011l97M92K72R6R36K278
51258C01937K834K073P17k1N87K311M103M842M286L352L288M588O636Q282Q727
51243C58542P981O679N490M764M668N232N935N761M269K345J220R22M35p96k474
51228D10973m379o433p777p300n620m953o149p290o538m900m502n258n390m625
51214C29859m454n311n878n657n980p437q301o973m484k971k685k267j412j322
51200B64727k548l908m035k938j596p16l98n75j255k353l345l255j357J799M322
51185B42569M576K675J29j648k032q81J369L354L614K257J048J311K288K165L11
51170B63105k101l333k531k02K139L049K382J370J102J308J190R47J372K179K047
$$ plain form
51275 310316 307375 305102 303853 303422 303581 304269 305047 304869 303032 300271 298260 297863 298355 298627 298723 299659 301937
51258 301937 304771 306844 307561 307540 308127 310438 314541 319383 323669 327021 330309 334897 341533 349815 358542
51243 358542 366523 373202 378692 383456 388124 393356 399291 405052 409321 411666 412886 413808 414243 413447 410973
51228 410973 406594 400161 392384 385084 379464 374511 368362 361072 354534 349634 345132 339874 334484 329859
51214 329859 325405 320094 314216 308559 302579 295142 286841 279868 275384 272413 269728 267461 266049 264727
51200 264727 262179 258271 254236 251298 249702 248986 248588 248013 246758 244405 241060 237805 236448 238247 242569
51185 242569 247145 249820 249949 248301 246269 245388 246757 250111 253725 255982 257030 258341 260629 262794 263105
51170 263105 261004 257671 255140 254938 257077 260126 262508 263878 264980 266288 267478 268425 269797 271976 274023
51155B74023O56o17o50j37l49j176j493q71J48J122J875J979J153P0l67l23n29
51138B74514o49L46K050K576J174n88j217j352k202l094k327J35K324K702J667
51123B76059N20r1l99r26j818k503k095n24J011J264L04q42j537j860j983k095
51107B62485k667l880m876m447k531l68Q94J052N80J29K83R80J333O51n04j077
51091B48037r78q08m63N72J650J343l28j632j749k029l603n158m664k438p59q33
51075B26160j621j649o49Q36K266L115K886J728N64J72L62M16J33K02J459L661
51059B40041N192M402J598q23p61J291K939K749J620J180J737K263J925R09j15
51044B66147p66j031r32l92N91J747K555K592J869Q47L3l19j80L82J109J526J365
$$ plain form
51155 274023 274679 274062 273412 273275 272926 271750 270257 269386 269534 270656 272531 274510 275663 275733 275366 275043 274514
51138 274514 273865 274211 276261 278837 280011 279423 278206 276854 274652 271558 269231 269366 271690 274392 276059
51123 276059 276579 276488 276089 275163 273345 270842 268747 268223 269234 270498 270802 269960 268423 266563 264580 262485
51107 262485 259818 255938 251062 246615 244084 243716 244610 245662 246242 246371 246654 247634 248967 249618 249114 248037
51091 248037 247059 246251 245788 246360 248010 249353 249025 247393 245644 243615 240012 234854 230190 227752 226993 226160
51075 226160 224539 222890 222241 223077 225343 228458 231344 233072 233636 233808 234170 234586 234719 234921 236380 240041
51059 240041 245233 249635 251233 250410 249649 250940 253879 256628 258248 259428 261165 263428 265353 266262 266147
51044 266147 265381 264350 263418 263026 263617 265364 267919 270511 272380 273227 273260 272941 272761 273143 274252 275778 277143
51027B77143J001J148J962K800L112L171L421L426K306K74j176j104l67k92o87
51012B96138j93J480K743J932o89l123l541j753Q45K589K892K418J818P37j312
50997C02981l424l766j858M89J114j98j918k602j805J82K479L793L435K274J855
50982C03031K504L120K892K267J852J447Q89R58K327M105M683L981L533M193M924
50967C46706M493L255K321J826J243R10J703L208L596J935n01j858j853j394q09
50952C64781N29K957N713P481P309N257K598J173J863L733N171N773O424P604
50938D28366Q455Q026O931P059R521J3125J5427J5377J4547J5169J7369J9296
50926E78668J9984K0668K2584K4873K5907K5880K6605K9131L2873L6799M0100
$$ plain form
51027 277143 278144 279292 281254 284054 287166 290337 293758 297184 299490 299764 298588 297484 297117 296825 296138
51012 296138 295945 297425 300168 302100 301411 298288 294747 292994 293839 296428 299320 301738 303556 304293 302981
50997 302981 299557 295791 293933 294422 295536 295338 293420 290818 289013 289195 291674 295467 298902 301176 303031
50982 303031 305535 308655 311547 313814 315666 317113 318002 318960 321287 325392 330075 334056 337589 341782 346706
50967 346706 351199 354454 356775 358601 359844 360754 362457 365665 369261 371196 370695 368837 366984 365590 364781
50952 364781 365310 368267 373980 381461 388770 394027 396625 397798 399661 403394 408565 414338 420762 428366
50938 428366 436821 444847 451778 458837 468358 481483 496910 512287 526834 542003 559372 578668
50926 578668 598652 619320 641904 666777 692684 718564 745169 774300 807173 843972 884072
50915H84072M2078M2906M4475M8799N5416O1886O6996P1764P7017Q2049Q6536
50904A563994R1741R8358J04800J09320J12500J15829J18883J19936J18650J16059
50894B670070J12193J05904R7155Q7576P8215O8386N7365M5778L4581K3780J3007
50883C394010K527p054j5354k1933k6209k8264k9140k9741l0069k9982l0029l0814
50871C117948l2210l4075l7262m2846n0339n7719o3494o8069p2680p7654q2297
50860B499303q6135q9315r1687r2383r1077q8922q7146q4981q0454p3632o7422
50849A566149o4076o2138n8482n2467m6221m1220l6793l2202k8021k4711k1657
50838A098161j8673j6751j6036j4629j1085o929m668m202l226p76J749L134L774
$$ plain form
50915 884072 926150 969056 1013531 1062330 1117746 1179632 1246628 1318392 1395409 1477458 1563994
50904 1563994 1655735 1754093 1858893 1968213 2080713 2196542 2315425 2435361 2554011 2670070
50894 2670070 2782263 2888167 2985322 3072898 3151113 3219499 3276864 3322642 3357223 3381003 3394010
50883 3394010 3396537 3389483 3374129 3352196 3325987 3297723 3268583 3238842 3208773 3178791 3148762 3117948
50871 3117948 3085738 3051663 3014401 2971555 2921216 2863497 2800003 2731934 2659254 2581600 2499303
50860 2499303 2413168 2323853 2232166 2139783 2048706 1959784 1872638 1787657 1707203 1633571 1566149
50849 1566149 1502073 1439935 1381453 1328986 1282765 1241545 1204752 1172550 1144529 1119818 1098161
50838 1098161 1079488 1062737 1046701 1032072 1020987 1014058 1009390 1005188 1001962 1001186 1002935 1006069 1009843
50825A009843M180M023L465L779N600P808R250J0466J2591J5480J8219K0772K3685
50812A149161K6533K8222K8794K9653L1709L4412L7054M0006M3981M8742N3393
50801A551660N7671O2322O8169P5302Q3241R1603J00394J09810J20031J31238
50791B451441J43593J56889J70378J83370J96039K09098K22428K34740K45035
50782D213011K53718K61261K66272K66304K60710K51324K39633K24455K03501
50773F440189J76468J45418J12669P9667M7825J8713p141l0455n1205o7335p6645
50762F788168p9508p8642p6322p2944o8407o3657o0295n9414o1570o7227p6401
50751F023781q8210j01530j15909j31262j46982j62186j76631j90327k02241k10465
$$ plain form
50825 1009843 1014023 1018046 1021511 1025290 1030890 1038698 1047948 1058414 1071005 1086485 1104704 1125476 1149161
50812 1149161 1175694 1203916 1232710 1262363 1294072 1328484 1365538 1405544 1449525 1498267 1551660
50801 1551660 1609331 1671653 1739822 1815124 1898365 1989968 2090362 2200172 2320203 2451441
50791 2451441 2595034 2751923 2922301 3105671 3301710 3510808 3733236 3967976 4213011
50782 4213011 4466729 4727990 4994262 5260566 5521276 5772600 6012233 6236688 6440189
50773 6440189 6616657 6762075 6874744 6954411 7002236 7020949 7013808 6983353 6932148 6864813 6788168
50762 6788168 6708660 6630018 6553696 6480752 6412345 6348688 6288393 6228979 6167409 6100182 6023781
50751 6023781 5935571 5834041 5718132 5586870 5439888 5277702 5101071 4910744 4708503 4498038
50741D498038k14124k14137k11570k06170j97419j86318j74913j64292j53921
50732B775174j42960j31345j19578j08216r7824q8757q0810p3339o5961n8759
50722A807625n1886m5406l9513l4447l0109k6134k2406j9119j6446j4508j3498
50711A494153j3346j3442j3199j2673j1955j0501q094o097o178p659p831n529
50699A377649k774j778j661K33M616R533J3058J5162J6834J8724K1122K4333K8378
50686A523429L2755L6792M0135M3046M6423N1281N7633O4362P0758P7683Q6302
50675B130599R6009J04853J12071J18970J26934J35686J44105J51781J58816J64713
50665C444537J68359J68937J66197J60041J50599J38609J24921J09350R0743O8677
$$ plain form
50741 4498038 4283914 4069777 3858207 3652037 3454618 3268300 3093387 2929095 2775174
50732 2775174 2632214 2500869 2381291 2273075 2175251 2086494 2005684 1932345 1866384 1807625
50722 1807625 1755739 1710333 1670820 1636373 1606264 1580130 1557724 1538605 1522159 1507651 1494153
50711 1494153 1480807 1467365 1454166 1441493 1429538 1419037 1410943 1404846 1398668 1391009 1383178 1377649
50699 1377649 1374875 1373097 1371436 1371669 1376285 1385818 1398876 1414038 1430872 1449596 1470718 1495051 1523429
50686 1523429 1556184 1592976 1633111 1676157 1722580 1773861 1831494 1895856 1966614 2044297 2130599
50675 2130599 2226608 2331461 2443532 2562502 2689436 2825122 2969227 3121008 3279824 3444537
50665 3444537 3612896 3781833 3948030 4108071 4258670 4397279 4522200 4631550 4722293 4790970
50655D790970M4719K1317m25k1074m0875n8338p1582q0380q5710q7606q5041p8344
50643D247631p0219o3219n7304n1195m5432m2390m3377m7308n2637n9317o8142
50632C647091p9005r0656j01771j11516j19283j24450j26679j26320j24356j21604
50622B521451j17860j12199j04468r6057q8610q2251p5789o8450o0632n3069m6071
50611A615995l9726l4062k8740k3195j7353j1735o777k541P87K971M490O562R885
50598A476561J3648J6346J7455J8110K0037K3791K8087L1159L2832L4538L7168
50587A749732L9936M2132M4832M9302N4524N8268O0531O3862O9891P7265Q3711
50576B393986Q8423R1613R3274R3716R3995R4556R4258R1993Q8380Q4613Q0377
$$ plain form
50655 4790970 4835689 4857006 4856581 4835507 4794632 4736294 4664712 4584332 4498622 4411016 4325975 4247631
50643 4247631 4177412 4114193 4056889 4005694 3960262 3917872 3874495 3827187 3774550 3715233 3647091
50632 3647091 3568086 3477430 3375659 3264143 3144860 3020410 2893731 2767411 2643055 2521451
50622 2521451 2403591 2291392 2186924 2090867 2002257 1920006 1844217 1775767 1715135 1662066 1615995
50611 1615995 1576269 1542207 1513467 1490272 1472919 1461184 1454407 1451866 1452653 1455624 1460114 1466676 1476561
50598 1476561 1490209 1506555 1524010 1542120 1562157 1585948 1614035 1645194 1678026 1712564 1749732
50587 1749732 1789668 1831800 1876632 1925934 1980458 2038726 2099257 2163119 2233010 2310275 2393986
50576 2393986 2482409 2574022 2667296 2761012 2855007 2949563 3043821 3135814 3224194 3308807 3389184
50565C389184P4411O6635N8286N0066M1466L2033K2394J3801P273L130P80r11
50553C758548k523l499l063j316J014L323M987N067L162J87k675n526r469j5003
50539C733214k1690k9237l7909m7796n8465o9343p9724q8522r4904r9198j02326
50528C004100j04309j04261j01981r8599r5294r2090q8337q3785p8798p3916o9468
50517B013262o5255o0550n4837m8670m3188l8662l4172k9036k3881j9747j6548
50506A578716j3118q657l610J058N129R258J3810J7840J9880J9836J9686K1672
50494A681500K6001L0799L4207L5971L7018L8224L9909M2088M4627M7156M9099
50483B106599M9978M9791M9142M8947M9792N1601N3820N5863N7444N8887O1182
$$ plain form
50565 3389184 3463595 3530230 3588516 3638582 3680048 3712081 3734475 3748276 3755549 3758679 3759459 3758548
50553 3758548 3756025 3752526 3749463 3748147 3749161 3752484 3757471 3762538 3765700 3765887 3763212 3757686 3748217 3733214
50539 3733214 3711524 3682287 3644378 3596582 3538117 3468774 3389050 3300528 3205624 3106426 3004100
50528 3004100 2899791 2795530 2693549 2594950 2499656 2407566 2319229 2235444 2156646 2082730 2013262
50517 2013262 1948007 1887457 1832620 1783950 1740762 1702100 1667928 1638892 1615011 1595264 1578716
50506 1578716 1565598 1556941 1553331 1554389 1559518 1568776 1582586 1600426 1620306 1640142 1659828 1681500
50494 1681500 1707501 1738300 1772507 1808478 1845496 1883720 1923629 1965717 2010344 2057500 2106599
50483 2106599 2156577 2206368 2255510 2304457 2354249 2405850 2459670 2515533 2572977 2631864 2693046
50472B693046O5355P1501P8654Q5842R3026J00747J09265J18282J27195J35359
50462C678272J42410J48720J55087J61543J66774J69222J68480J65148J59598
50453E115254J51475J40222J25540J07398Q6180O2882L8773J4721r025l2461n5277
50442E745682p6412r4140j07155j15778j21511j25046j25280j20792j11602r8914
50432D649052q3820o7117m9867l3160j7493l199Q776J7149K1234K1039J6744Q573
50420D487911l302j9225l9530o2700q4971j03178j17491j29976j40963j48534
50410C638041j51415j50593j47747j43602j38257j31781j23962j14689j04972
50401B431023r6425q9220q1754p2961o3821n5866m9254m3097l6759l0038k2858
$$ plain form
50472 2693046 2758401 2829902 2908556 2994398 3087424 3188171 3297436 3415718 3542913 3678272
50462 3678272 3820682 3969402 4124489 4286032 4452806 4622028 4790508 4955656 5115254
50453 5115254 5266729 5406951 5532491 5639889 5726069 5788951 5827724 5842445 5833420 5800959 5745682
50442 5745682 5669270 5575130 5467975 5352197 5230686 5105640 4980360 4859568 4747966 4649052
50432 4649052 4565232 4498115 4448248 4415088 4397595 4394396 4403172 4420321 4441555 4462594 4479338 4487911
50420 4487911 4484609 4465384 4425854 4363154 4278183 4175005 4057514 3927538 3786575 3638041
50410 3638041 3486626 3336033 3188286 3044684 2906427 2774646 2650684 2535995 2431023
50401 2431023 2334598 2245378 2163624 2090663 2026842 1970976 1921722 1878625 1841866 1811828 1788970
50390A788970j5648r389m532m21L616P268J0029J2311J5040J8606K2832K7428
50378A876110L1807L5002L6630L7621L9325M1977M4528M5791M5460M4277M3341
50367B321869M3015M2476M0860L8715L7345L6616L4730L0698K5871K2230K0207
50356B694632J9122J8725J9203K0423K2312K5285K9271L3138L6321M0030M5313
50345C003775N0701N3643N3917N3491N3162N1681M8638M5800M4151M1549L5142
50334C535650K5117J4231M215n702j6944k9856m3928n8331p1779q2855r1030r6685
50322C082103r9747r9242r4844q8112q1231p4817o7835n9348m9386l8177k5859
50311B303505j3552l545K693O215R279J2454J3928J1727N768k472j1538k0765
$$ plain form
50390 1788970 1773322 1763933 1759401 1758980 1762596 1769864 1779893 1792204 1807244 1825850 1848682 1876110
50378 1876110 1907917 1942919 1979549 2017170 2056495 2098472 2143000 2188791 2234251 2278528 2321869
50367 2321869 2364884 2407360 2448220 2486935 2524280 2560896 2595626 2626324 2652195 2674425 2694632
50356 2694632 2713754 2732479 2751682 2772105 2794417 2819702 2848973 2882111 2918432 2958462 3003775
50345 3003775 3054476 3108119 3162036 3215527 3268689 3320370 3369008 3414808 3458959 3500508 3535650
50334 3535650 3560767 3574998 3579213 3573511 3556567 3526711 3482783 3424452 3352673 3269818 3178788 3082103
50322 3082103 2982356 2883114 2788270 2700158 2618927 2544110 2476275 2416927 2367541 2329364 2303505
50311 2303505 2289953 2286408 2289101 2295316 2304595 2317049 2330977 2342704 2348472 2346000 2334462 2313697
50299B313697k9951l8656m5922n0725n3031n4060n4960n5427n4419n2108m9995
50288A774443m8837m7545m4777m0746l6686l3258l0299k7649k5223k2532j8999
50277A397892j4750j0592p326n434m939n040m302k070N91K237L134M983Q563J2661
50263A375608J5710J7589J9189K0869K2146K2738K3182K4163K5574K6598K6726
50252A620092K6478K6739K7541K7891K7122K5897K5372K5546K5073K2768J8907
50241A899426J4861J1736R596P852O175M873M310M059K898k14n186j0704j4930
50228A934752j6525j5730j4428j4609j6496j8733k0433k2049k3947k5308k5453
50217A721041k5194k5539k5844k4868k3278k3192k4985k6403k5588k3439k1848
$$ plain form
50299 2313697 2283746 2245090 2199168 2148443 2095412 2041352 1986392 1930965 1876546 1824438 1774443
50288 1774443 1725606 1678061 1633284 1592538 1555852 1522594 1492295 1464646 1439423 1416891 1397892
50277 1397892 1383142 1372550 1365224 1359790 1354851 1349811 1345509 1343439 1344030 1346267 1349401 1354384 1362947 1375608
50263 1375608 1391318 1408907 1428096 1448965 1471111 1493849 1517031 1541194 1566768 1593366 1620092
50252 1620092 1646570 1673309 1700850 1728741 1755863 1781760 1807132 1832678 1857751 1880519 1899426
50241 1899426 1914287 1926023 1935619 1943471 1949646 1954519 1958829 1962888 1965786 1965572 1960386 1949682 1934752
50228 1934752 1918227 1902497 1888069 1873460 1856964 1838231 1817798 1795749 1771802 1746494 1721041
50217 1721041 1695847 1670308 1644464 1619596 1596318 1573126 1548141 1521738 1496150 1472711 1450863
50206A450863k0966j9610j7632j6180j5781j5502j4253j1939r055o038l374j664
50194A298869j089j115j024m22P83K443L934M418L769K883K655K840K451J107
50180A322502n39j690k275k750l406m126m633m802m877n390o737q639j0242j0896
50166A251500j0672j0053r266q157o624m910l384k071n80J362L234L996L381K602
50152A210358L089M661N807N803N473N415M780K855Q42M70J277R69j373m018n107
50137A241301n092n781p860j0357j2005j2282j1441j0272r713j0055j0666j0808
50125A124969j0511j0242r995r245p756o106n306n954p585q988r461r635j0503
50112A013682j1744j1873j0148p392m733k612j493k072l812m459k595N4M95j781
$$ plain form
50206 1450863 1429897 1410287 1392655 1376475 1360694 1345192 1330939 1319000 1309945 1303907 1300533 1298869
50194 1298869 1297780 1296665 1295641 1295219 1296002 1298445 1302379 1306797 1310566 1313449 1316104 1318944 1321395 1322502
50180 1322502 1321963 1320273 1317998 1315248 1311842 1307716 1303083 1298281 1293404 1288014 1281277 1272638 1262396 1251500
50166 1251500 1240828 1230775 1221509 1213352 1206728 1201818 1198434 1196363 1195783 1197145 1200379 1204375 1207756 1210358
50152 1210358 1213447 1218108 1223915 1229718 1235191 1240606 1245386 1248241 1249083 1249553 1250830 1251799 1250426 1246408 1241301
50137 1241301 1236209 1230428 1222568 1212211 1200206 1187924 1176483 1166211 1156498 1146443 1135777 1124969
50125 1124969 1114458 1104216 1094221 1084976 1077220 1071114 1065808 1059854 1052269 1043281 1033820 1024185 1013682
50112 1013682 1001938 990065 979917 972525 967792 965180 963687 961615 957803 953344 950749 950803 951298 949517
50098I49517m613o549q458j1221j3717j4257j2921j1259j0288r874r712r747r713
50085H17188r141p996o751n633m271k357m14M38m79k542m089l800j856L93J951
50070G70641K997L996M588M022K618J950L211N798Q049R089R483J0062J0767J1001
50056H58272J0689J0477J0867J1594J2115J2455J3198J4622J6081J6582J5885
50045A002837J4688J3591J2346J0540Q670P809Q194Q919R110Q638P543N691L571
50032A122147K426K753L393L157K568K927M212N396O400P996R801J0239Q951P686
50018A200052P960R201J0005J0093J0037J0179J0798J2574J5662J8885K0819K1314
50006A357579K1201K1046K1016K1403K2275K2999K2877K2088K1378K1177K1512
$$ plain form
50098 949517 944904 938355 929897 918676 904959 890702 877781 866522 856234 846360 836648 826901 817188
50085 817188 808047 800051 793300 787667 783396 781039 780625 781063 780584 778042 773953 770153 768297 768690 770641
50070 770641 773638 777634 782222 786244 788862 790812 794023 799821 807870 816959 826442 836504 847271 858272
50056 858272 868961 879438 890305 901899 914014 926469 939667 954289 970370 986952 1002837
50045 1002837 1017525 1031116 1043462 1054002 1062672 1070481 1078675 1087594 1096704 1105342 1112885 1118576 1122147
50032 1122147 1124573 1127326 1130719 1133876 1136444 1139371 1143583 1148979 1155379 1163375 1173176 1183415 1192366 1200052
50018 1200052 1208012 1217213 1227218 1237311 1247348 1257527 1268325 1280899 1296561 1315446 1336265 1357579
50006 1357579 1378780 1399826 1420842 1442245 1464520 1487519 1510396 1532484 1553862 1575039 1596551
49995A596551K2257K2841K2415K0975J9727J9448J9099J7018J3099Q937O089M880
49983A793336M429L228K65l690o623p774q737j1165j4426j6812j8034j8902j9359
49970A675736j8706j7436j6958j7548j8192j8282j7850j6401j3498j0473r420
49959A500972j0140j0165q278o013m849m050k520r28m24o51n80k60k26j91K47
49944A451944L60o90k169k633k067j787k478l619m765o033p268p834p565p073
49930A396323o840o667o087m886l160j309J09R57J788K952L812L526K404J600
49916A384522J497J373P70K32L34P87J211K017L784N917O808N429K267j466n105
49901A410377q815j2896j7269k1540k5321k8385l0720l2525l3996l5025l5240
$$ plain form
49995 1596551 1618808 1641649 1664064 1685039 1704766 1724214 1743313 1760331 1773430 1782367 1788456 1793336
49983 1793336 1797765 1800993 1801258 1797568 1790945 1783171 1774434 1763269 1748843 1732031 1713997 1695095 1675736
49970 1675736 1657030 1639594 1622636 1605088 1586896 1568614 1550764 1534363 1520865 1510392 1500972
49959 1500972 1490832 1480667 1472389 1466376 1461527 1457477 1454957 1454029 1453605 1452954 1452374 1452114 1451888 1451697 1451944
49944 1451944 1452304 1451614 1449445 1446812 1444745 1442958 1440480 1436861 1432096 1426063 1418795 1410961 1403396 1396323
49930 1396323 1389483 1382816 1376729 1371843 1368683 1367374 1367483 1368440 1370228 1373180 1376992 1380518 1382922 1384522
49916 1384522 1386019 1387392 1388162 1388394 1388728 1389515 1390726 1392743 1396527 1402444 1409252 1414681 1416948 1415482 1410377
49901 1410377 1401562 1388666 1371397 1349857 1324536 1296151 1265431 1232906 1198910 1163885 1128645
$$ [...]
##END NTUPLES=NMR SPECTRUM
##END=
