
##TITLE=AC1170_Tolima-ibage-TCHAH12003_7164977_dnJbvTW6tr
##JCAMPDX= 6.0         $$ Bruker NMR JCAMP-DX V2.0
##DATA TYPE= NMR SPECTRUM
##DATA CLASS= NTUPLES
##ORIGIN= BRUKER
##OWNER= Administrator
$$ 1.72 TOPSPIN		Version 2.1
$$ 2012-12-01 17:27:04.318 -0500  Administrator@X
$$ Compression mode = diff/dup
##.OBSERVE FREQUENCY= 400.02188249412
##.OBSERVE NUCLEUS= ^1H
##.ACQUISITION MODE= SIMULTANEOUS (DQD)
##.ACQUISITION SCHEME= undefined
##.AVERAGES= 8
##.DIGITISER RES= 22
##SPECTROMETER/DATA SYSTEM= spect
##.PULSE SEQUENCE= zg30
##.SOLVENT NAME= COFFEE_meoh
##.SHIFT REFERENCE= INTERNAL, COFFEE_meoh, 1, 14.98509
##AUDIT TRAIL= $$ (NUMBER, WHEN, WHO, WHERE, PROCESS, VERSION, WHAT)
$$ ##TITLE= Audit trail, TOPSPIN		Version 2.1
$$ ##JCAMPDX= 5.01
$$ ##ORIGIN= Bruker BioSpin GmbH
$$ ##OWNER= Administrator
$$ $$ E:\/data/COFFEE/nmr/AC1170_Tolima-ibage-TCHAH12003_7164977_dnJbvTW6tr/10/pdata/1/auditp.txt
$$ ##AUDIT TRAIL=  $$ (NUMBER, WHEN, WHO, WHERE, PROCESS, VERSION, WHAT)
(   1,<2012-12-01 17:26:58.749 -0500>,<Administrator>,<X>,<go>,<TOPSPIN 2.1>,
      <created by zg
	started at 2012-12-01 17:25:54.262 -0500,
	POWCHK enabled, PULCHK disabled,
       configuration hash MD5:
       86 BA 57 50 F2 9D 5C 9B 26 00 A9 28 5F 66 2E 89
       data hash MD5: 64K
       57 93 77 C5 0E 40 1A 99 13 91 85 6C 13 7C A3 EC>)
(   2,<2012-12-01 17:27:00.757 -0500>,<Administrator>,<X>,<proc1d>,<TOPSPIN 2.1>,
      <Start of raw data processing
       efp LB = 0 FT_mod = 6 PKNL = 1 PHC0 = 0 PHC1 = 0 SI = 32K 
       data hash MD5: 32K
       0E 58 1E D7 7B 79 AE 25 E9 C5 4C 62 B6 01 CF 7E>)
(   3,<2012-12-01 17:27:01.090 -0500>,<Administrator>,<X>,<proc1d>,<TOPSPIN 2.1>,
      <pk PHC0 = 99.28894 PHC1 = 0 
       data hash MD5: 32K
       5E 72 C8 29 C1 FA C5 23 5D CC DD 46 C5 57 FD 06>)
(   4,<2012-12-01 17:27:01.231 -0500>,<Administrator>,<X>,<proc1d>,<TOPSPIN 2.1>,
      <abs ABSG = 1 
       data hash MD5: 32K
       44 43 8C 2C 34 2B C8 82 88 BF 9B A0 F1 7C 69 05>)
(   5,<2012-12-01 17:27:01.342 -0500>,<Administrator>,<X>,<proc1d>,<TOPSPIN 2.1>,
      <abs ABSG = 2 
       data hash MD5: 32K
       82 D5 93 28 D1 7C 7A AD 3A 3C F6 50 ED F7 17 7A>)
(   6,<2012-12-01 17:27:01.433 -0500>,<Administrator>,<X>,<proc1d>,<TOPSPIN 2.1>,
      <abs ABSG = 3 
       data hash MD5: 32K
       23 14 62 65 6C A1 7D 47 26 3A F8 EA BF 1F 13 B0>)
(   7,<2012-12-01 17:27:01.554 -0500>,<Administrator>,<X>,<proc1d>,<TOPSPIN 2.1>,
      <abs ABSG = 4 
       data hash MD5: 32K
       31 2E 66 8F 6B CE 6A E5 73 53 64 B7 1B 64 9C 52>)
(   8,<2012-12-01 17:27:01.655 -0500>,<Administrator>,<X>,<proc1d>,<TOPSPIN 2.1>,
      <abs ABSG = 5 
       data hash MD5: 32K
       70 3B 36 71 86 CC 7E DE 4A 15 32 D5 A7 7C AE 7D>)
$$ ##END=
$$ 
$$ $$ hash MD5
$$ $$ FA 8D 6F 07 60 40 E0 EB C3 D6 5B E8 51 D6 2A 01
##$RELAX= 
##$RELAX= 
##$RELAX= 
##$RELAX= 
##$RELAX= 
##$RELAX= 
##$RELAX= 
$$ Bruker specific parameters
$$ --------------------------
##$DU= <E:\>
##$EXPNO= 10
$$ [...]
##$TP= (0..7)
150 150 150 150 150 150 150 150
##$TP07= 0
##$TPNAME0= <>
##$TPNAME1= <>
##$TPNAME2= <>
##$TPNAME3= <>
##$TPNAME4= <>
##$TPNAME5= <>
##$TPNAME6= <>
##$TPNAME7= <>
##$TPOAL= (0..7)
0.5 0.5 0.5 0.5 0.5 0.5 0.5 0.5
##$TPOFFS= (0..7)
0 0 0 0 0 0 0 0
##$TUNHIN= 0
##$TUNHOUT= 0
##$TUNXOUT= 0
##$USERA1= <user>
##$USERA2= <user>
##$USERA3= <user>
##$USERA4= <user>
##$USERA5= <user>
##$V9= 5
##$VALIST= <valist>
##$VCLIST= <CCCCCCCCCCCCCCC>
##$VD= 0
##$VDLIST= <DDDDDDDDDDDDDDD>
##$VPLIST= <PPPPPPPPPPPPPPP>
##$VTLIST= <TTTTTTTTTTTTTTT>
##$WBST= 1024
##$WBSW= 4
##$XGAIN= (0..3)
0 0 0 0
##$XL= 0
##$YL= 0
##$YMAX_a= 636199
##$YMIN_a= -543108
##$ZGOPTNS= <>
##$ZL1= 120
##$ZL2= 120
##$ZL3= 120
##$ZL4= 120
##$ABSF1= 14.98509
##$ABSF2= -5.573092
##$ABSG= 5
##$ABSL= 3
##$ALPHA= 0
##$AQORDER= 0
##$ASSFAC= 0
##$ASSFACI= 0
##$ASSFACX= 0
##$ASSWID= 0
##$AUNMP= <proc_prof1d_extract_pilot.lims>
##$AXLEFT= 0
##$AXNAME= <>
##$AXNUC= <1H>
##$AXRIGHT= 0
##$AXTYPE= 0
##$AXUNIT= <>
##$AZFE= 0.1
##$AZFW= 0.1
##$BCFW= 0
##$BC_mod= 0
##$BYTORDP= 0
##$COROFFS= 0
##$CY= 15
##$DATMOD= 1
##$DC= 0
##$DFILT= <>
##$DTYPP= 0
##$F1P= 0
##$F2P= 0
##$FCOR= 0.5
##$FTSIZE= 32768
##$FT_mod= 6
##$GAMMA= 0
##$GB= 0
##$INTBC= 1
##$INTSCL= 1
##$ISEN= 128
##$LB= 0
##$LEV0= 0
##$LPBIN= 0
##$MAXI= 10000
##$MC2= 0
##$MEAN= 0
##$ME_mod= 0
##$MI= 0
##$NCOEF= 0
##$NC_proc= -8
##$NLEV= 6
##$NOISF1= 0
##$NOISF2= 0
##$NSP= 0
##$NTH_PI= 0
##$NZP= 0
##$OFFSET= 14.98509
##$PC= 1
##$PHC0= 99.28894
##$PHC1= 0
##$PH_mod= 1
##$PKNL= yes
##$PPARMOD= 0
##$PPDIAG= 0
##$PPIPTYP= 0
##$PPMPNUM= 2147483647
##$PPRESOL= 1
##$PSCAL= 4
##$PSIGN= 0
##$PYNMP= <proc.py>
##$REVERSE= no
##$SF= 400.02
##$SI= 32768
##$SIGF1= 0
##$SIGF2= 0
##$SINO= 400
##$SIOLD= 32768
##$SPECTYP= <>
##$SREGLST= <1H.CDCl3>
##$SSB= 0
##$STSI= 32768
##$STSR= 0
##$SW_p= 8223.68421052631
##$SYMM= 0
##$S_DEV= 0
##$TDeff= 65536
##$TDoff= 0
##$TI= <>
##$TILT= no
##$TM1= 0
##$TM2= 0
##$TOPLEV= 0
##$USERP1= <user>
##$USERP2= <user>
##$USERP3= <user>
##$USERP4= <user>
##$USERP5= <user>
##$WDW= 1
##$XDIM= 32768
##$YMAX_p= 471862467
##$YMIN_p= -811167
##$CURPLOT= <Network HP LaserJet P1505>
##$CURPRIN= <$Network HP LaserJet P1505>
##$DFORMAT= <normdp>
##$LAYOUT= <+/1D_H.xwp>
##$LFORMAT= <normlp>
##$PFORMAT= <normpl>
##$SURQMSG= 1
$$ End of Bruker specific parameters
$$ ---------------------------------
##NTUPLES= NMR SPECTRUM
##VAR_NAME=  FREQUENCY,     SPECTRUM/REAL,   SPECTRUM/IMAG
##SYMBOL=    X,             R,               I
##VAR_TYPE=  INDEPENDENT,   DEPENDENT,       DEPENDENT
##VAR_FORM=  AFFN,          ASDF,            ASDF
##VAR_DIM=   32768,         32768,           32768
##UNITS=     HZ,            ARBITRARY UNITS, ARBITRARY UNITS
##FACTOR=    0.250966925370066, 1,           1
##FIRST=     8223.43324360094, -104369,      -263126
##LAST=      0,             -16850,          -5413
##MIN=       0,             -811167,         0
##MAX=       8223.43324360094, 471862467,    0
$$ Real data points
##PAGE= N=1
##DATA TABLE= (X++(R..R)), XYDATA
$$ [...]
23844 -298859 57973 -16369 26271 102643 114156 -60835 -30415 22157 206813 -228192 123821
23832 14817 30438 -176531 -137448 106851 -28541 -269102 69475 42157 62161 -13887 350775
23820 -111896 -117819 89449 -172735 -31645 421221 93732 227469 -25752 277016 63149 10166
23808 -152519 -80731 3740 -37382 -93084 -97993 124810 -101392 58202 -343253 -34342 206353
23796 -360885 97663 272172 -309957 106850 386984 -173005 -12098 18926 56652 -87361
23785 -347177 85171 116500 200762 -18015 106065 2849 -40154 -367685 42881 56566 -40254
23773 95105 97783 255529 199641 -47538 -185352 109486 -8380 141674 -230163 158664 -263503
23761 -218512 81871 -269404 -261831 -379661 57655 35554 -63476 -202796 -214813 -210198 458 -142276
23748 569554 1217 55815 50490 -31175 -3408 36879 -87970 -56873 -61877 173114 85691 148136
23736 148136 -66562 132620 -349834 119100 -177755 132757 310184 -282803 200917 -185260
23725 141554 265144 -245795 93156 -369349 118076 59320 96644 315208 -345132 -128220
23714 76849 305831 -298804 -2572 222683 21368 47801 3205 -95509 34152 13690 113319
23703 113319 102675 161415 -185811 -192638 -335642 -52993 8881 10599 -33165 77257 46552 1341
23690 -68001 83684 -222390 -51717 3826 -299478 103367 -133465 -56475 75558 -61678 -6491
23678 -48352 -140118 -71843 96044 -97265 170510 -197388 50554 -107861 109919 -189227 -146034
23667 -146034 211220 -27887 -276635 -213378 138244 172521 91293 40611 -254347 115850
23656 145076 -96329 101745 112213 108008 102365 -24794 -217344 -29006 -153206 150655 25865
23644 -84435 188016 34490 112926 -109318 320486 61633 3296 379351 -35437 178109 -209938
23632 -751 3504 150039 220904 -116836 71660 -48615 -27954 -127528 -247718 4271 301628 29717
23619 -259452 248669 -107898 -81072 17390 -95472 -82724 -237437 261764 80289 -46152 316388
23607 387565 -53785 53750 14058 -78332 88500 -57735 16131 -188114 -205816 -75345 3383
23595 -19394 12768 109913 -185860 144676 -389401 91457 75766 141397 115777 96640 -203512
23583 4854 -246644 -37676 -81551 411409 -186543 -73956 284924 -29658 35982 12159 68052
23572 68052 237875 -19530 -26361 121950 120844 1751 -325851 -41372 48217 -178318 -29910
23560 218102 -376871 127849 -95091 272790 -83351 129091 225119 -65958 69407 188119
23550 188119 -418333 104691 -5801 339187 -201352 123514 -178433 -125789 165420 114417
23540 114417 80293 -56295 231829 114980 -137725 -208501 387511 36974 -30115 -128256 -51341
23528 53617 -259624 93203 18108 -118552 198466 139670 -222145 19276 -326511 274044
23517 23474 -73904 -3546 46698 -164377 -89268 183745 -45694 451975 376551 -662 -235853
23506 -235853 -120098 -45619 -162089 5631 189880 31471 57419 -104866 -30238 -98789 -145305
23495 -145305 -133207 -122076 -466915 -59781 41657 -222372 -193096 -365302 -97999 230247 -303582
23483 -265192 228103 435824 -156663 273762 470724 -134485 28501 10525 -196525 151031
23472 48603 -251862 -118246 -6158 -107359 -221611 146490 -102835 -244325 -256770 76403
23461 220283 -85986 309149 -87503 198802 -236439 119882 72387 123143 -255259 -106578
23450 176306 315114 -177443 83907 -372848 -365650 161436 287354 -110657 221512 -277291
23439 -286994 -37587 11828 -8786 -356206 -208918 -157667 -21397 4943 119330 -67563 9609
23427 18809 -258151 -222588 56184 -240725 -185280 67677 -115371 -616763 -375679 234546
23416 -12967 -118069 34136 -94886 118750 151258 42645 -134204 148781 138557 203107 64867
23404 -21205 -91197 31229 182502 851 5558 -168805 98262 46587 342188 -28255 -2228 126176
23391 -118225 -109595 180084 -210500 63063 -245503 189178 150692 -86157 -138443 -285934 -115184
23379 218344 260446 122168 243552 378651 -345683 41858 -16040 334495 -13177 -85826
23369 -85826 358981 50755 6797 -184830 -73984 -110964 -120196 28592 20681 297630 105865
23357 -38723 -21690 -51769 13279 -411605 10661 43607 207326 -106785 156860 -90680 -94198
23346 -94198 -32812 92179 -81757 85831 95340 -157142 302096 -414962 75208 173968 198801
23335 198801 5878 -151469 -74218 67619 -51159 -77540 -88762 -321655 249941 106679 -281920
23323 -448654 -331166 164927 -150140 -383437 -7675 265012 -261740 -239168 -120653 -185944
23313 -185944 -80899 60014 -226489 -155198 -179116 -109487 257519 -152683 -205152 -138151 -35907
23301 3701 70006 77966 265768 187086 146709 -95659 74 -298363 -416107 26659 173636 89855
23289 89855 -35488 -163992 -451451 -17047 38805 -81128 41225 130656 39302 -194844 45543
23277 -251027 -168209 -162335 -410353 -106189 71427 138033 180615 -68188 -121474 -206826 -41946
23265 -142655 -289669 430509 -176085 142761 -29718 193101 232358 -480913 40343 -198872
23254 -144606 -146279 -190984 -142370 -224240 277640 94026 62576 224804 243447 -306132 -165665
23243 -165665 -26737 54202 -13397 -77042 -132077 -50799 -464049 -34069 -53598 -225937 214738
23231 35196 246846 -184915 -87523 239754 -266751 -125281 68389 -214988 101875 402688
23221 402688 -157462 162980 -126297 -128131 188858 -298164 106953 22995 217201 -123342
23210 -181627 -146126 29776 -69774 -324356 -66191 -166433 28661 -233661 54258 -81777 20829
23198 -224501 -140836 -252220 -155561 -93126 37426 181595 43523 263379 180676 -154864 -264869
23187 -264869 -40927 -43322 30750 17945 -160744 -134152 -118994 46018 -324128 103646 -139157
23175 51968 75546 137065 -11027 -406156 -27869 -71769 156300 63223 -49914 161941 -276085
23163 -64195 -218389 54429 2104 72431 -104709 160843 -208026 -240804 51506 258110 -235322
23151 -15391 -139167 1421 -17910 -131618 99971 199540 -115654 -188018 -266241 -459338 50693
23139 29925 146131 190036 -88143 170012 -28203 370247 -11475 125779 -163675 247598
23128 229644 4097 -254722 134543 -111041 40846 2770 -259262 85595 -54983 -436 171406
23116 72641 -235198 65516 27594 -200804 8221 -42435 -380015 -374916 35988 -316917 -78277
23104 169138 196037 283858 -38438 -191483 46950 166837 127088 143395 -150279 220437 211950
23093 211950 -250284 57957 -67332 46065 190098 51264 -24519 -125600 62751 11312 -134120
23081 -118258 -279613 108528 100036 113075 14717 52931 -216043 -144089 -9439 149509 -204124
23069 -615 54787 101326 39559 28334 298477 -74716 147597 -60954 -38306 176123 -102744
23057 -5862 -172833 -246036 175908 -57848 -18686 -150759 61707 -24330 -116170 -171370 37563
23045 -155966 48292 -43920 -75302 18486 243116 80417 45004 83633 136077 15921 21041
23034 21041 -123765 -304366 -27583 4480 137534 -19552 -180879 -69459 204961 -222002 201050
23022 -5479 -11100 10984 -57872 -24100 -393163 -2634 202523 46018 1098 -325736 120546 -83186
23009 95896 -154469 -134938 -133893 -329202 -304466 -80410 -329851 318334 -18509 -223918 69824
22997 -264842 188627 2327 104306 -170145 101555 -367335 -273210 198 97892 238772 -240013
22985 -98127 69147 -230739 72456 263739 -207731 -156963 169164 -296963 292741 -7906 50381
22973 -61541 -20664 180911 -46758 -122757 -42553 -71128 -95031 -99892 -299469 5965 -142835
22961 -185624 27429 248040 -49405 -54089 -306376 98352 -12024 70751 -176815 180502 230729
22950 230729 -169658 -151492 -264042 12768 54254 -197530 -67298 -164156 330170 374139 -102970
22938 75454 302276 44960 8437 190072 281672 -90114 53262 -320590 -200035 -72927 22004
22926 -297884 85519 -252798 45492 -95622 62576 232972 -179323 -208073 129575 15061 201832
22915 201832 -152735 -27216 154290 -133830 -33529 349492 -219602 -241256 83146 82707 -203143
22903 268414 -294709 162863 137759 -250611 -68171 8638 25545 -97283 191351 19383 -304849
22891 -81405 -198039 -73848 -97538 -97249 -184310 37014 -27167 1713 181419 100726 137364 115705
22879 115705 49192 46770 -70670 -439077 -191580 112140 418123 9619 -112896 -93384 15957
22867 35313 -66565 192180 21002 64440 80049 63829 234043 245328 151429 164247 77144
22855 318064 -96483 -22875 -21235 114602 23084 -110520 109456 -158201 -175317 -11252 -72660
22844 -72660 -264924 111244 270828 120471 151000 -116656 -171111 41433 -127816 -182217
22834 -182217 -322529 -466064 -292709 56993 -102244 -62404 -269892 -175528 65525 -508838
22823 -82006 -181423 -195931 251241 52896 -149480 -38909 -2052 -161211 59650 -14573 -35482
22812 -35482 371463 -11772 -7610 -42592 -77905 57900 16835 -86436 -115326 133171 -223281
22800 52915 -169092 -45858 -46039 -93689 -169583 -64415 101592 -35705 -373797 -22637 281196
22788 -316654 75075 -66173 -70462 -192797 -63049 -124907 115444 338568 -253643 33293 -50993
22776 -277200 6935 41219 -166849 -70612 133712 73993 -250602 5851 284712 -77914 -162887
22765 -162887 164365 -312868 160391 264207 -119886 5748 104760 75168 416421 185156
22754 -261526 -108303 -198316 212720 -165602 -195813 -207414 -81666 370073 237808 -229150
22743 163393 -142452 -323951 108351 188770 9108 -244101 -60869 -344076 68362 -381578
22732 110411 -218140 47186 89088 -374858 26283 25164 258019 -15147 201415 105224 -19139
22720 138012 -154565 228411 80420 -358642 173371 -3674 -183985 251929 -334841 -12606
22709 -169482 -273985 -62017 188992 -158971 -185770 40641 -203628 312546 64687 198268
22699 198268 84285 -178775 14437 -165011 -70024 63165 -77920 -47967 -259068 245811 -435969
22687 -418897 -193189 -140065 -186354 -57264 142381 52881 -486002 -121793 232617 -167832
22676 -289440 206507 -116999 201915 4373 39536 185049 199452 -82600 52212 105756 160112
22665 160112 -169970 -642431 292699 -1732 84576 133113 80919 -157508 48284 -71509 16652
22653 -120679 -335231 242122 -41070 -297268 -262840 85401 126547 -125374 161944 117984
22643 117984 273130 80527 -4401 -55950 114414 129085 -90648 -142351 39161 -104366 -177103
22632 -177103 142384 -169923 -45878 -233585 53529 39220 -6855 113535 80452 146942 -144837
22620 224822 -188721 115856 -16526 -164430 239479 -145190 258259 171247 -53242 33824
22609 69866 -223351 136320 -202782 -243994 -31468 -164129 14758 118860 -222392 -53106
22598 -128279 -68528 121976 -212877 35 -138806 -59441 -265086 -136008 160284 -70396 229322
22586 50661 -64066 -151573 -11323 -218381 -86126 -115685 -83098 -120246 -125158 18791 56425 -161636
22573 -222741 -56810 147703 157726 -28789 -175203 -222574 -87816 -259455 -192586 237059 -345270
22561 173536 -116950 386744 128609 113766 51024 -452179 -256609 147253 62241 -44885
22550 -80159 -168063 41545 -1138 17499 298929 138248 149049 149095 58101 6362 -59622 102881
22537 12429 -106082 786 125962 -96100 -117951 -96193 -73324 -45250 233302 -40357 -137536
22526 -137536 -124855 184923 -198534 -28905 49072 -210458 -136625 -21957 -235168 -238377 -47560
22514 -372700 -177496 -392381 173884 -2144 -233807 -82897 -170868 -53479 -68951 141827 23618
22502 89235 10485 3775 194632 -101506 287658 -235846 -10884 81569 -8722 -200682 -142467
22491 -142467 -56885 -20271 156521 -54018 -83084 61501 -104766 142688 -168241 244663
22480 -516155 -55445 -85034 -36565 -156875 123858 -439673 16302 406598 94162 167492 -311044
22468 -29041 -81324 236411 418594 -82179 138185 36484 301622 -11897 66323 17640 -30865
22456 -43739 26569 14601 151232 -231708 217262 -107585 -94823 -259091 -163585 9778 -4792
22444 -425789 -337593 15318 201640 -42536 -80023 370659 -61522 46351 -12611 -184832 -16423
22432 -70397 87784 -296707 156973 -119692 -345684 -130060 161490 -50647 -121234 -82077
22422 -82077 2642 12432 145572 -123915 -98963 88077 75253 270625 -8161 -183654 -298780
22411 -298780 35610 328577 -74348 114568 -22672 177874 57851 45381 47830 252919 -31751
22399 -371525 -211132 -149209 -215936 248126 -141703 31639 -238018 -218359 -242349 -230333 -81081
22387 84395 240793 -167795 -58140 -237205 -115412 -89934 -224984 323747 -70265 -14686
22376 125696 -50904 223929 -180835 206991 -93322 -188181 1539 130273 44613 -144625 -33925
22364 -43741 -432532 183467 -13133 -68194 -67550 254522 15091 128658 -58060 -16872 -334333
22353 -334333 -277549 74129 213196 14785 28045 -23652 69798 -107278 -160972 -177796 -173454
22342 -173454 -114574 -124520 -173927 263967 94760 -202329 -7988 260637 9531 58371 -154817
22330 107355 -276832 -17190 106649 -113192 -6616 -231076 -435213 -54004 302789 -302544
22319 -101694 -1067 -231418 -197180 114864 -107230 44284 -112386 -31068 208267 88740 -251001
22307 -17391 168542 181073 -117037 -258528 -39260 233680 239162 69026 -182422 -210766 35391
22295 -79378 440387 118566 -151597 152455 -101531 -186430 -215181 -130150 -141410 144373
22284 -210 139932 355862 -178379 -538666 -358710 -303442 213483 -28739 98904 224283 -303422
22272 -232805 79687 -180156 -164172 54305 -67494 102372 -38640 21127 -228053 -435878 -104699
22260 -254360 34916 32664 177448 175635 -35016 -72292 -21892 8756 97619 -58310 -25906 361465
22247 -287241 269075 201244 109162 23859 45452 -352767 -148936 220412 73437 -6506 -99800
22236 -99800 17416 29814 -209047 201420 37061 -109182 216084 -201034 -18646 -271616
22226 -271616 -84810 40819 -123606 125738 133899 -297176 155448 248928 219889 -702 178957
22214 -199879 106449 12868 135022 -274469 -126800 -151090 -88430 -27439 -77599 117965
22203 -31809 -271435 -62111 -445569 -126923 37439 -161573 112007 158085 -236875 -146557
22193 -146557 163732 67638 165595 -94807 -222641 61046 156518 -322687 37194 27598 -111110
22181 -37136 -10746 -39199 -181696 54952 -290938 71293 -66880 236653 48590 300494 939
22169 -84581 -96454 -88883 -38142 -122767 -9417 74207 -520016 -77759 -167477 -40431 -177375 -178853
22157 -178853 372282 3464 -24256 -80302 -127643 -399791 -3902 138213 -109751 124672 -132333
22145 -224095 208027 -97658 -170938 -124249 -1880 -152949 273045 -165697 -56502 -46370 14594
22133 -43269 -76846 55197 142042 -73284 84224 -74971 -546148 131713 -64017 73918 -29183
22121 -134129 67894 -111771 317732 340912 -68235 102395 -50973 -82158 -68515 -165714 -167687
22110 -167687 118552 110283 -101318 -260854 -83926 185935 -190834 -27982 -79217 -73045 107537
22098 -145442 84343 -13584 -220923 153033 49827 -56676 -142824 -295522 -229161 284077 156386
22087 156386 -295948 -19533 -54057 -59327 236630 7123 318727 -21634 40636 214248 83949
22075 106717 99720 -74104 286248 159888 -179313 157041 -47274 -381720 -323426 -267128 -235431
22064 -235431 143014 -161579 -39317 108636 108088 -36315 -297841 56531 -257246 -203856 170972
22052 33315 246304 -51220 19861 -125676 193127 -258251 158879 -149513 43539 -13881
22041 -39808 -112257 160881 -101769 -96085 -60095 -394958 -44750 -5893 41556 -234766 -97880
22029 191611 -45347 -130606 7125 64270 61860 260746 -202402 63888 -200384 110542 45329
22017 -48897 -337761 8173 -114121 -134598 -121292 211618 -29109 4633 245037 -179397 -20714
22005 176249 -196438 -17003 19330 242900 12795 -223498 -246305 -109080 -251762 -68949
21994 -159309 -149383 -150729 60955 -101535 34874 246772 -374455 -340865 22511 -207540 167805
21982 9448 201516 -307972 129625 80714 219545 -112425 91539 -474657 -318626 77084
21971 -255876 -50474 -121451 -162858 -176538 -225339 176733 -104274 418963 182102 -189377
21960 77474 261643 10481 -155448 -263131 83873 27319 130281 -58249 -140791 26845 -343059
21948 -19537 70129 -494809 95295 427822 108920 325576 113376 -106497 -144082 234440
21937 -21885 20919 166485 -65957 -43472 -149643 132987 -260898 268656 -291666 -94545
21926 -55826 -20743 -187533 42108 -22822 273536 35327 -361412 -232381 -300361 -21932 -212519
21915 -212519 42322 -256952 -45245 -33579 -17428 -36190 -76446 130095 -333669 65763 -5310
21903 -105827 -71149 -98244 -39067 -348077 -13477 -41063 68258 -191175 125119 -38796 65941
21891 122161 -115794 -106810 10177 -222512 -429623 60737 11381 -155425 679 -180631 -64939
21879 -107031 -36369 -300534 -152125 -38764 -268912 -251831 203492 -79446 109502 -137373
21868 -154472 -92589 -388216 73301 155462 101176 -371938 264344 96328 -39237 -146799 343061
21856 -401147 -347417 120718 -19106 19398 -138490 -389288 -163443 155070 -112638 -77970
21846 -77970 -71194 176954 103275 305076 -107503 402272 -145521 -195984 85831 119193 -253649
21834 -210848 -20621 23576 79545 99248 88872 -110400 -199277 -136208 -343552 -25188 -191575
21823 -191575 -35591 -123749 21612 -102552 93364 -86085 13788 -216122 150318 -105035 207043
21811 106944 60169 -249739 -152942 73285 -108045 -182626 -70411 38011 -7544 -195389 -126569
21800 -126569 -80873 -15459 100359 20317 44375 141871 64525 275617 -28955 271402 -156670
21788 -211964 65054 35068 183020 66119 165127 187461 -22695 61271 -240704 -155649 -105821
21777 -105821 -276556 82004 -50394 -105682 -124462 392508 76845 -42295 -66117 -71614 -18247
21765 -293482 -23838 210848 -31974 -169742 -83346 324312 -82139 -202327 97493 284587
21755 284587 -239564 -167222 12897 -332397 -33265 -287093 192810 -342223 -4149 -19556 -191823
21744 -191823 138135 -193765 156178 -106900 163358 90271 37994 157714 41526 23600
21734 23600 108751 -415542 -109441 -224191 458564 -145688 -126614 -253361 -210879 156671
21723 23278 -149866 89793 -61660 52038 -109589 30252 47338 123777 -11880 115361 10630
21711 -152760 30741 -128 76931 -112187 -112097 -2332 133718 -42322 -61514 -106304 -298479 191289
21698 93045 35273 38517 20474 -203667 -80440 198084 -168378 126421 61912 -157675 -66267
21686 10576 2115 139445 -16761 188650 -184555 84088 -216309 6082 -212796 -16182 -156885
21675 -156885 126499 277989 -354930 -98354 -335194 -3253 127315 -139561 -29442 -18661
21665 -18661 41716 -45581 -84602 16744 -116378 -19749 28110 -236661 -193752 -335244 -46652
21653 -292151 -54674 335502 -64141 -356640 -180225 409854 237226 -79549 70093 -13445
21642 153548 -144752 62601 335488 317253 184447 -148899 -24886 -274924 -116724 17038
21631 -17128 -136520 -16659 91198 -75289 116328 -208042 53830 255856 -17648 -54035 -202939
21620 -202939 -120140 -67355 -212652 197842 -406478 -156035 20161 37564 238946 -43192
21609 -100782 -292174 71985 -169604 -213234 -366249 -111421 28703 -127322 -116744 -257356
21599 -257356 -348484 173705 -246960 138399 -2044 -159654 73906 1151 13195 44710 -200400
21587 -268292 396732 23392 -220413 -242221 -290923 -156778 -207763 -82774 -82244 23144 -85066
21575 67405 -355406 172636 -110433 -151211 77520 120963 406619 -118369 -72694 -6217 -254859
21564 -254859 54505 -56592 -51573 -54703 -88355 -123009 -102171 27151 -304245 53872 -415929
21552 278210 -56932 35472 -164417 -168698 45712 -239083 156107 205585 98745 -68199 124301
21540 -281886 -258688 56876 -117804 -14886 -171446 -171109 41847 -28224 -175408 -84737 -394622
21529 -394622 -228129 -56565 -208912 239490 88490 22299 185720 -182602 -337697 77245
21518 -248402 -52993 205470 110327 -126372 -43350 58426 -122578 100577 -183873 -160502
21508 -160502 -39227 132078 -81859 -19881 28818 -46292 -6078 28283 -92968 -227758 -107212
21496 -185991 -61427 -293806 109483 73163 -146601 -34157 302081 -81704 7056 -7920 -307195
21485 -307195 -113220 -298911 -155466 89312 24635 110339 87001 2209 -146267 147228 78438
21474 78438 147104 -12517 -223600 -257619 546 -47344 -341942 -521512 33602 -252158 26641
21462 -276968 -19587 76923 -212808 -26018 -77233 -179719 -26513 -426147 -153235 -99423 233478
21450 108059 37485 176135 -299454 63932 368590 -149245 -162113 281595 251539 -183614
21439 294894 236049 -106892 204329 118995 224152 279161 -80803 -130199 -106398 -53183 -34705
21428 -34705 153612 95612 -58469 -284824 -20610 -102498 -51435 -373045 274248 35762 -183206
21416 127574 -72400 5340 330208 -50638 -31407 51585 35551 83591 -31873 -100806 -15303
21404 143445 18876 149311 164604 167517 -146667 30837 82355 17918 -339022 -95866 -166735
21393 -166735 4400 -58701 -146150 44708 -416351 74398 -119442 -1581 -87975 157950 -132070
21381 108073 -257011 -14206 15209 -202214 73260 107282 -25384 -7600 -74991 -88546 149596
21369 -87820 -30609 -265849 73856 42759 270023 -201301 -24146 -64125 41282 93832 -109315
21357 105949 -44018 -185694 -37340 -27000 -52973 -247463 -171258 32561 -48763 -22404 -105915
21346 -105915 68556 33087 -66037 -151547 -25894 -355654 168351 -151636 -65353 -192158 -203150
21335 -203150 -22655 33115 -149898 -24071 225793 -192969 -302278 -154919 -121262 230798
21324 -164144 -78302 256396 -278 351771 -75236 -308065 -66028 -185674 -248901 224292 -28279
21312 -108286 3158 41843 208263 -1415 -15728 -276936 -130611 -20462 65732 -129456 -271663
21301 -271663 136591 -108135 35765 38472 -74331 115098 -69772 -6080 -12866 -1433 -73606 -210065
21289 -210065 -319734 42084 4094 232194 -283335 -191797 -223425 -214114 -268090 -110965 173982
21277 -231707 47135 -24896 -119424 51220 -94261 -58869 -419362 -180572 -69950 -3476 5820
21265 -15175 -26436 106034 -46432 -92232 -373823 196037 -462866 1628 -124583 -283404 -143807
21254 -143807 -170872 -29151 -198735 134925 113920 -151232 59616 -367570 16436 128356
21244 128356 232074 -3629 3410 -57456 -288957 -339004 -91880 -190377 -92149 -10690 -54659
21233 -54659 -189582 -182500 -341088 -57499 -251633 -172565 -233111 -53552 94200 -359756 148178
21221 -40196 -43105 -26021 -34573 -173126 -317755 64759 115827 -58226 410113 -72797 -102744
21210 -102744 200555 -13656 -279681 302879 -87663 -137653 55747 174945 -14266 -191411
21200 -191411 -327337 15480 99422 23320 -135939 -32117 -55739 -128675 -72997 -154889 -63096
21188 -27360 162583 -138109 84253 -212984 -8006 -80267 7920 30347 -100587 -194171 -443881
21177 -443881 -9160 -57083 -103600 295962 64352 -123495 -300379 -85119 194341 -173329 -48950
21165 281431 -145163 -153181 91245 82668 -240210 148280 110214 -71415 -233119 -129350 273000
21153 -71019 -274164 -559034 103660 -201884 -121588 216564 -232469 209482 -110995 97060
21142 -251067 391195 36091 -44114 -182050 25926 94589 -137557 256711 -332052 32769
21131 49175 -77267 -73027 112828 84968 -23203 -289778 -85327 -45544 93960 -4647 29035 145418
21119 145418 96717 -294943 83133 104832 319348 -32664 -75850 -195396 -104966 -363815 -243089
21108 -243089 -319511 202914 105075 248923 -72351 -248948 53711 151928 -147718 -390537
21098 -390537 -91192 -276295 204670 -349278 -238201 135011 -287014 70052 -21456 -213660
21088 -213660 -171930 -26893 -15771 -84076 -162828 25682 -276214 146752 568612 209133 146005
21077 146005 -148816 333082 -185489 -14948 22693 -502465 -49507 267773 88367 118006
21067 118006 234636 -223309 -30037 185993 -258278 140317 67608 -125416 -109322 241366
21056 -50095 -283400 99153 9148 130671 -242192 9027 67626 -483015 -217959 -1074 -224070
21045 -224070 14188 184773 221871 -13853 -29521 -1528 -16313 102519 -424297 -52504 -326391
21034 -326391 170121 165104 -242465 5225 -221445 6243 145695 -186358 41767 -79137 152831
21022 54902 162928 -165989 65500 -9469 145581 44366 -111286 -300328 51231 -120422 86025
21010 -221880 -65028 -122491 -241436 19685 -193807 6494 238108 -50306 -156514 -115651 -140129
20999 -140129 115827 -22350 -394089 196717 -67321 -233711 -169186 429849 -133633 -213699
20989 -213699 39554 -42927 -252765 48474 -260054 95163 58682 9052 602 -205566 9246 -285573
20976 155128 -362985 333971 21028 -28927 186397 -3615 -79324 87375 142779 178831 -308883
20964 -114900 55984 329248 -160567 11209 -171699 103536 -124660 -294681 184751 -123475
20953 -228619 -7228 35396 -86533 29658 -32183 -247591 -187133 -249318 -87533 -178143 -305982
20942 -305982 331729 7153 12295 -35378 46787 24300 -195785 203408 -26232 -141162 -109342
20931 -109342 -211471 132426 -136628 260943 -258792 -284952 -193285 -491695 192772 142559
20921 142559 -302471 60322 191356 22329 -168916 -2748 -105402 -32146 -347707 -210159
20911 -210159 129589 40570 -231565 251281 152361 -102836 -244706 -389434 69877 -20061
20900 -368698 156199 167333 -141741 -177755 -67171 -37346 -199379 51582 -274574 -217343 141968
20888 -34514 -26645 41755 92723 -67820 105284 121954 -261577 430443 -245077 -20999 -266536
20877 -266536 -96316 405873 137910 260852 383689 -39366 174547 -24702 -28683 -82630 -71121
20866 -71121 -473974 -361160 -7924 -160098 -5807 30155 -125878 -18566 -234727 -570236 238269
20854 -198458 46112 223169 -259580 433543 95798 -129914 -29191 -191490 -179630 -320714
20844 -320714 -247902 -181816 -148998 141163 8393 -271308 -101906 -11340 4971 224424 -306258
20832 -136562 -396497 143801 -264218 42842 -68429 38720 -265463 -121689 -131308 -342535
20822 -342535 -133640 -78246 -67350 86952 -28828 15307 194548 52123 59942 -326694 -629172
20811 -629172 -1241 -61105 104897 -68794 -37899 -100360 158815 -232929 -402349 195820 104941
20800 104941 48343 -167540 -170649 -152187 -14911 -38995 -227528 330353 -208481 -153722 -25441
20788 -1313 -58021 -97330 18241 -34657 -60103 149419 -4676 -158854 -135810 407349 -24482
20776 -96998 -470087 -286386 -233121 -9647 -86742 120009 -310705 137007 481246 -158618
20765 158357 -168372 217617 121597 81292 -199910 -20667 -89297 -197458 115238 80045
20755 80045 -42466 316344 -98678 226609 80235 244195 -3917 109724 27919 36593 98889
20744 98889 -398572 -39334 -240731 -143485 83886 -123100 -88915 9523 -93882 -276220 -332213
20733 -332213 113341 -42525 5171 -61758 -100663 32008 63218 5009 -145912 56637 -280837
20721 -39194 19726 -22852 -90204 -195628 -12615 -256951 37158 30579 35210 -46712 116780
20709 237820 -9422 -114455 295544 -318018 31010 426479 96014 172729 12929 57559 -54645
20697 -20489 -153821 359344 159514 -132706 -10954 68216 -165880 -345043 -76681 189184
20686 -52404 123213 56482 -118107 -129220 44838 18128 -81686 196175 123735 -37093 -162878
20675 -162878 -113368 313092 80578 -77344 -322857 -231830 -306069 262201 21605 66540 222226
20664 222226 70496 -474285 216086 132560 54833 -258669 -142940 131575 -80760 -159727
20654 -159727 141424 -119863 -134565 -164928 68463 -380440 -215566 28880 61904 -11688 -357523
20643 -357523 -314469 -174105 -169342 224376 277878 -203316 2449 -177675 -119456 -48977 36177
20631 -119669 -89479 -6392 -19812 -198750 177418 120 -273972 -73168 -272516 -228980 118172
20619 130518 -220560 190682 -543606 -191081 -43045 -199629 -237325 -216502 207149 -76922
20608 -164103 13453 78289 -43886 -161644 -428748 117474 -73212 -231396 -268704 165007
20597 -107518 -35766 -102398 -53319 -3465 100260 -220511 -258112 114503 48548 -196338 -149386
20586 -149386 -182202 -128482 23386 10674 -1700 113120 -56599 194156 117047 -79822 24803
20574 -197540 -119186 -96614 46709 22734 -109497 91539 140906 -121872 -119267 -158683 -185260
20563 -185260 168506 -354625 -133186 106304 9597 -126127 136795 261826 -203544 -56791
20552 -157413 89199 206966 -48046 -25723 -43320 -151313 63828 -88266 -368480 88932 -12138
20540 -210055 -112803 -68019 -172764 -86422 -154863 -77500 218583 168067 -209083 232096 25991
20528 -153706 188364 -232553 -159370 -278490 176461 149162 -108908 65825 -426997 -158291
20517 39691 28812 -68276 -22617 102033 189981 -78709 175977 -111153 -126798 61830 152815
20506 152815 -229936 54396 56429 -332899 -254991 192937 132140 -53402 -57322 354379 147242
20494 -94793 -120240 -271242 53466 -227896 -140791 68510 -190121 -111541 -148610 74348 -54699
20482 -126902 -66201 -173766 -48258 96190 225717 -410593 182123 38307 2664 175233 -149357
20470 -28579 21064 223980 134831 208 106368 -21041 -22226 -25624 87602 260651 236668 -354942
20457 -338665 -23409 180390 153431 100982 9798 54460 -210128 -212705 -101060 -56185 12569
20445 -42984 121415 138066 295338 28595 211120 -344878 25357 50220 -205558 108761
20434 -656839 -133679 -13395 18250 -43042 -156107 45523 106007 60533 52981 -21918 -163211
20423 -163211 -221100 117980 99091 228371 180783 11676 -129355 -48071 -158106 91202 69478
20412 69478 -202307 -2658 51155 -76233 122038 -93065 -27181 -77593 -214223 -68131 -10906
20400 -152713 -47365 36004 -65718 -111652 -367896 -155305 170325 15329 -195375 242403
20389 -165502 -158548 221592 -154503 -107783 -120807 -64366 39719 1178 -164868 -381810 38157
20377 59298 -67913 194081 4436 -149257 232892 -49698 36766 -263958 -63964 -199072 -154813
20366 -154813 92169 -35549 -120148 -209746 157868 -58540 -135748 10833 -314253 -56560 96846
20354 153535 147589 26199 -2249 -213619 -196623 -163638 125656 -61942 -40072 -16173 -119433
20343 -119433 5361 -405114 109630 -16141 43431 -103451 -245777 -250270 -3462 -76825 -460822
20332 -460822 244359 66622 34799 -187505 32593 66456 15890 -380441 -221967 -403546
20322 -403546 -70763 178323 -33819 238425 -45524 -27626 215390 93028 -87063 -280926 106081
20310 -270796 65316 148000 16464 -529880 -108564 -25093 -250245 -156698 152841 -381742
20299 170215 76535 121613 -243768 -35433 29075 -171494 152677 -263604 -107013 -485586
20289 -485586 122706 -290905 -168812 113233 -38444 -224335 -169366 -180445 413127 36263
20278 -401239 108458 327489 169141 254088 -457819 -242668 24779 120149 -321724 -341952
20268 -341952 -69778 -104258 -69325 62187 -134866 -116753 47470 -24358 -25257 -152196 -260429
20257 -260429 -169529 -70869 -215789 57155 16369 -340698 -213925 -94487 -197372 -332851
20247 -332851 210243 -182755 8370 -163499 -6564 89658 41732 -151861 -10689 96579 193628
20236 193628 -309263 -334601 -206677 77983 -245085 -82335 227970 -74951 49408 -249191
20225 170883 -79936 48630 139796 -81238 -13069 80836 -62027 -302351 38656 262752 -89155
20213 -47037 60534 -193531 -190393 -317366 -10147 144445 -101040 -73662 44268 68771 -66527
20201 -11845 261498 -97227 17255 130108 78367 -213345 -132377 324531 157780 -198504
20190 106429 -58354 -410278 -164294 -307687 -110642 -297962 -64918 100238 -180179 174923
20179 30140 226633 -159243 -269493 -393319 -149461 -244007 167891 -68303 172284 71247
20168 -110467 -116500 -291957 20664 146449 -89709 61996 -158788 232492 -29762 199768 -77875
20156 -280479 -78166 105655 -28806 50856 -275727 9373 -147734 264834 -58043 -293188 49400
20144 -46924 -31221 419682 -115512 205829 -310680 -4305 -121932 -32756 146510 -122285
20133 302036 -115414 -236733 -550104 -245033 118863 -298710 118898 122499 235138 -31978
20122 -136187 -152112 300670 -30588 313987 31397 191164 154833 183381 -288992 197091
20111 -213752 -156569 135975 -67760 -285381 -145938 17688 -150512 303128 76092 172561
20101 172561 -116995 -16968 -102581 -31877 -350002 -10027 202612 -301745 -13514 21350 -100769
20089 -63880 -225840 -117857 191678 -333313 242276 -249958 -52655 40597 -116406 242838
20078 172811 -142858 -25880 -23508 -72678 -59866 -115631 -65637 55999 20342 126635 -108497
20066 96437 91195 -353204 -53071 -100453 88710 -431431 64550 -129396 9703 -185327 -56153
20054 -164299 -328659 -273730 -51401 -291544 -79990 -20428 -195826 -116221 -50478 -81035 -116062
20043 -116062 -300288 121296 -44507 -70692 39220 89330 6203 115214 41102 150906 13820
20031 -223367 -177527 2393 -450734 -374389 -63965 -80577 -105845 -59975 23026 177434 64982
20019 87757 350806 -190098 -106670 47596 -96802 -315118 -282396 -235550 204115 139265 59125
20007 -63867 -239959 -83546 33597 -131713 160711 98157 108289 -95242 -112395 86097 -129917
19995 -138640 -126581 -99360 136053 -248301 -120000 -86913 -59035 -122034 -1677 154812 -219656
19983 194929 -121669 221337 -148979 33824 -4309 -35755 120598 -102288 -110297 -22360 -378633
19972 -378633 -106431 -26284 37588 78581 248691 -110888 172803 292 -380938 182856 206039
19961 206039 -133616 -170838 -49719 334302 -331711 10325 -191652 -237044 15712 28941 -27936
19949 -183713 -143942 -57219 168461 309354 -208688 115423 -76473 -35706 183382 -615 -107131
19938 -107131 63835 9679 -69018 -125866 -83919 -111475 -36813 60077 131729 -55311 -350155
19927 -350155 72424 -142427 52938 -182847 298804 -198481 -256774 -171798 -63950 -249168
19917 -249168 -215675 -327523 -48928 -17271 -78579 -112596 222482 -176837 -120685 -139023 26537
19905 -268266 135105 -246210 -362338 -191593 190910 44303 285195 -84561 -303331 22109
19894 118998 -234695 115444 -134752 -361080 -233251 172411 59442 -94565 99949 -223521
19883 -166889 -51014 174930 181705 -159314 105272 -194948 -89423 411286 -3995 131376 156312
19872 156312 -151679 -156422 -128760 27236 -282825 96329 338900 -120413 123613 -310753
19861 -104833 35064 -25005 160541 -246915 -197051 12138 -114587 64274 75379 -119307 283237
19849 -327178 -70250 74606 18581 217306 -73369 84755 -127953 199043 -343182 -48424 -127502
19838 -127502 62933 69456 152950 -7295 208583 -483350 -221322 -151503 -412874 -262112 -249434
19827 -249434 112901 -141259 -118153 29493 56979 -128902 225374 -225602 -294670 -107354
19816 -179513 63834 252630 -161263 163536 -134570 -218030 -57604 -208785 -274287 237266
19805 -15670 -87236 114323 -407982 18005 -190108 99683 39012 -33622 193877 142767 -314596
19793 121115 -72375 -54227 -201845 -320285 -205148 109681 100309 -219254 236775 81649
19782 196459 151686 73705 -12999 114409 -211119 167587 -144593 111770 -103420 -135746
19772 -135746 173524 7237 -154038 -175056 32853 -176526 -30876 -247979 -164464 -228082 -4349
19760 3192 167947 -187742 -135913 283494 -395584 320792 -5133 78545 164402 -209680 -243744
19749 -243744 -94776 88064 185069 -53553 89591 -225898 -107681 -53066 -372530 150755 355065
19738 355065 72887 64313 -157249 159885 295046 -255380 -140554 69602 -29988 -389736
19728 -389736 -126465 211611 -166484 116155 329277 25717 -94234 -183864 -106257 -9005 -51367
19717 -51367 -55804 96870 19603 -4407 -260261 -214952 48536 -361121 -283256 -333702 -74156 -42743
19705 -42743 -72092 251836 -199032 -149871 147096 48816 -732251 71931 -240749 -192889 -76327
19693 -93468 41226 98674 142916 -56613 103126 -44350 -19702 -197315 -253909 -138291 -336454
19682 -336454 -332980 6024 200853 348235 -403483 305840 -46337 -220003 -102710 127125
19671 -263342 136851 159010 -104702 -322922 -167086 -10425 -220951 -243968 -154542 -78483
19661 -78483 125579 48639 -231824 117829 -262420 9905 -89719 -171763 -69867 -168758 120983
19649 -478548 -180274 -117425 7651 208353 -167646 -283289 166221 134821 -165129 -308039
19639 -308039 78482 -368021 -152539 -228540 198198 -189922 -112027 58746 -257899 -155702
19629 -155702 96959 -309191 108065 -19309 -66814 -67372 6933 -112774 -187927 -46465 253658
19617 181613 -152739 151058 190504 -98978 -253904 -39411 -109157 -313531 30580 -113321
19606 -65824 -73428 -323530 -56833 -128111 31638 11485 185459 277863 -381039 -106072 86421
19594 54369 -39672 -206815 -85729 -171885 -1540 289649 -254743 77110 321092 -49944 25027
19582 53908 -153573 -223522 93614 -249535 -209545 54362 91920 -295713 -106589 -26274 -25552
19571 -25552 131152 28080 -56919 -57661 -499980 -183598 106530 -32459 -56212 -224390 -123971
19560 -123971 -169271 -1986 -55953 -98994 152858 -235703 -364747 165857 87267 -234017 -19326
19548 23767 95808 -141228 -53888 209017 -327916 42084 19242 -67328 65561 18104 -116624
19536 29429 -223732 45383 473967 -203823 53419 256278 -110588 163313 32339 103667
19526 103667 -159230 553524 -120656 -156020 362 54329 -78485 -238196 -135389 -175065 65893
19514 -245431 -179543 -213515 -111368 -95102 -350721 -408258 118652 -132378 -181318 -162071 -125525
19503 -125525 -204841 -239781 176027 71518 -158671 10946 251401 -174099 80440 203108
19493 203108 63642 -4527 -280195 -290085 -13150 -147649 -183032 257372 -194274 -281850 25395
19481 -9429 -114316 -142593 -297191 72456 -174316 -151437 -82500 95790 -167295 -187284 -181511
19470 -181511 -253874 -123921 31187 -71939 -121529 -147220 -41951 -555024 394161 -235110 -234403
19459 -234403 81190 -92702 247092 27373 -121222 -14829 81343 -130710 51350 35330 -73091
19447 -138015 -36353 -184089 -226178 91661 109928 164943 49105 48842 82963 -335328 -2125 -66360
19435 -66360 348055 -146948 10932 24511 164761 -432910 -38803 -119948 -333499 -20846 232074
19423 -102741 -54266 -118201 -125641 -212774 -105916 -181585 -174663 -148828 -142163 72859 -206529 182269
19410 -47889 29648 74287 93904 46519 48686 -227163 -399593 -82583 -176386 248157 53473
19398 -390710 -303713 -26299 -43117 192385 -159416 190625 28899 -71421 -81261 118551 -311704
19386 -14361 13316 -192409 -393890 -180231 -22272 -64995 -111423 -135507 -59077 173376 29858
19374 -41488 130477 -305480 -344485 -68620 -141724 71851 -278103 -204257 19105 -2991 84399
19362 -23253 197972 -269702 -60578 -119167 -29612 -243686 300334 -155453 -266729 -136783
19352 -136783 161971 47757 -61579 30087 -145278 -201443 -17077 22613 -202281 -58035 -183005
19341 -183005 9961 -91638 -63943 -312414 -189822 -188743 -75194 -19109 13941 -54383 -3546 -322397
19329 -322397 -117319 331062 260304 -64979 319949 140567 -147352 169707 -104719 88065
19318 -37631 333897 -74636 -343714 87275 27139 12900 134492 -25100 -335651 -171184 6713
19306 14053 -18500 -387428 -66023 95192 101093 -7923 134378 -152093 84532 -35785 -72507
19295 -72507 -244607 -177355 -24899 -37961 -179380 -252320 -82336 -28337 -3107 108771 -147018
19283 182038 -199760 -313958 -45598 19177 90795 -105133 -107373 -96260 -54347 -4018 -75014
19272 -75014 -192284 -235266 -253308 188824 -75481 -153501 143004 -1819 -25688 141227 -303413
19260 278243 -18961 -195167 -11823 -196239 -279272 -127524 63382 260393 -268275 92726
19249 -114078 -67412 -8210 -157974 98496 -93263 -177297 -85353 -222961 -407854 10352 19960
19238 19960 51481 -71280 -47370 147032 378033 -275485 97457 -96306 -250535 -40595 179933
19226 409391 186016 179210 -195073 -2486 -342419 -60737 -166385 -268407 -162685 157754
19215 108143 -109563 91022 67062 232745 -101657 24169 -89255 -29332 -302695 -282023 -93038
19203 -207774 86363 256701 -205412 -376230 182192 -50251 61168 -16606 -170731 61024
19192 -210983 199138 -51235 -111276 148348 -14970 -57205 -227141 -184327 -167757 -210233 -175393
19181 -175393 -222555 -127029 167174 -299256 148357 65932 -69038 262400 72323 -352032
19170 -124364 66932 -144609 65228 167924 -351343 140559 -86991 -296797 -235424 -29551
19159 133685 -17666 75598 52975 69847 -263768 -355767 18692 -257322 221096 3358 -150975
19147 -117437 97420 -307612 -90442 -252970 -38346 -35201 363897 -72774 189303 -266908 -100817
19135 163752 -23084 33287 118320 -227200 -39100 135090 42539 -132052 -440686 27286 51565
19124 51565 46297 -354112 -26935 55578 102446 106911 -502646 -69436 -290225 -410059 -63660
19112 19581 -152755 162788 69915 -166877 -176134 298592 -281069 -17716 41741 -416534 43667
19100 -143527 -25496 -73202 392031 -236246 -15387 -265458 -122710 -131621 -241491 -48181 234316
19088 75318 -83869 -24636 -94138 180005 10234 -193144 -199237 -194061 -170641 -259039 146272
19076 -286520 236910 16481 -12204 -71283 -103143 -101156 370903 -244695 -136538 91593 68497
19065 68497 5574 -22432 -55168 123073 83394 249226 -195729 152399 146120 -177057 191904
19053 284354 -41724 -73330 89620 -81610 -158619 -491255 -6675 244546 411062 107773 -21051
19041 -81468 -96100 1519 -16198 -107249 84358 222934 -168852 -150647 -92273 51776 95227
19030 95227 255487 -176896 138446 -66189 4549 62509 -121136 201770 49920 254398 89338
19018 153131 150343 -133814 -177145 -354811 67387 196109 6869 347332 -145448 40330 -31230
19006 -472104 -45744 -34952 -460594 89569 -1896 -221394 -181385 -70886 -134755 122256 -371607
18994 -16878 -336657 -176103 357606 78988 8728 -291519 1212 -138935 -287044 -172707 128369
18982 -421881 -398499 -9975 -14499 -91114 -14381 -10766 -68659 -202104 180012 -28171 -268400
18971 -268400 -59026 -203749 -91772 -335170 -319257 -104182 158565 -134953 -157292 -85527
18961 -85527 216930 -17430 171777 -250572 143482 -320420 -422941 -160029 -267621 158166
18950 -10632 -90641 -12962 -164983 49569 -66370 -55713 -336573 48787 94333 108798 -106663
18938 29155 -308345 -126326 -74436 48837 -306486 -114355 -66181 114633 -80856 -165686 -13719
18926 -82496 -81975 -306625 37588 57886 36995 17386 -445171 -278546 -40042 -327918 -342949
18915 -342949 -146797 -98042 -318938 -240314 -128429 234856 -103002 -108679 -32654 7224 -63607
18903 -243260 -152787 145602 -424616 255017 55686 77350 132946 -44631 -162722 -203294 -67478
18891 -153723 -88692 91872 85591 -96407 -188605 -79539 -315205 -123034 -271530 290667 -14504
18879 -148374 1992 93696 28628 118267 -104797 180418 10763 -298020 67239 181223 -34743
18867 -150003 -246971 -99597 -222086 -274646 154344 -46422 198946 208758 144073 -242626 -113748
18855 9355 -451411 91340 80875 -159656 154586 375683 -34463 13464 110714 338267 176075
18844 176075 -195667 129592 -92624 236033 -54914 -118452 -29528 -275197 -149200 -37257
18833 -284437 -59775 295287 -119775 16276 139431 198868 -268171 -199743 -25593 170016
18822 -72816 23936 -67650 -58276 213680 221360 21941 291894 -88207 -222214 43753 117851
18811 117851 262597 238892 175793 124249 44613 523688 114060 185376 53868 -111764 214698
18799 113063 138513 -177910 -506331 87199 -56292 -12059 -197100 -125052 23046 -52077 -63401
18788 -63401 -91545 22708 -314621 -48542 -76304 -297009 289173 40566 -418764 -364458 -84253
18776 -285661 -127176 268381 -28476 -248397 204333 -312090 40971 -218706 -90225 91399
18765 -136768 -182645 -327928 -81886 293336 9767 30184 53551 37093 -529909 118751 -189729
18753 -283890 42226 -455024 106944 30723 -246719 29075 -114596 -205703 -105720 -168525 -62634
18741 102696 -49379 -32460 57787 -265 59978 -161597 97274 -186605 -347080 4609 27700
18730 27700 -310135 -77842 -69798 35445 206625 42206 261285 -294984 225634 -160845 240469
18718 -219128 -336051 -81184 -242163 138742 30883 -75686 217504 -295683 24574 -309586
18707 72813 -270286 13692 11587 -124518 -42062 -391116 -87782 98708 -214562 19215 -225198
18695 -215627 -55089 -101485 -167669 -80644 -461324 -175452 5931 -15719 47103 156927 187786
18684 187786 -99570 -136221 129398 -12832 -292362 72183 15454 163667 96411 96207 -52992
18672 82589 -334401 -43407 -422961 -185298 81128 191067 -334775 35279 -201023 -99279
18661 -261153 -225312 -116449 -343589 95431 175707 -183472 -78552 -175914 24013 -74320 -415
18649 -155876 -90500 -135326 -73626 32232 -162970 76427 -65649 -218518 -467644 57505 -480037
18637 -303673 -108990 136187 -283178 -144338 -109005 -248565 -162805 -136136 -6266 -40295 -26916
18626 -26916 -28809 -380743 -109212 235095 -58197 -106711 -68689 -211347 -44035 82408 73052
18615 73052 128086 135741 80980 63336 -187451 48419 -47912 -73550 214925 -136169 86595
18603 -224423 -224065 -37464 -153526 232024 -459434 -213141 -27818 -172656 -43217 111963 192649
18592 192649 -219574 -146 275708 -306626 194150 155302 235399 142165 115830 -320820 -92067
18580 -3086 -289037 -265075 -218468 -220562 401370 -211605 46797 -32913 296527 321253 121229
18568 -146214 -198712 -355207 -248363 -154321 9642 -184923 38388 27031 -246622 152748 -204486
18556 -193823 -230764 63193 -39867 -288571 94986 -110769 -62135 -285799 -96995 47593 -9322
18544 247311 69347 85488 8682 -200434 291490 -184249 -302301 -307913 118964 48758 290095
18533 290095 -26249 -70655 135826 103896 -206142 175483 -91329 -14658 48475 -240540 -111054
18521 -133067 169374 -352424 226259 -443568 49641 46118 222540 -182396 -39067 -196969
18511 -196969 11964 87506 -192581 -65022 -485515 123193 -294124 -244130 -181615 268689
18500 -40848 326612 -58515 -335627 201782 -311029 -130470 177207 -257549 -84105 -123603
18490 -123603 10068 168089 48526 -71380 259358 -4526 137672 -233024 -121710 194332
18479 153402 235019 25092 -92980 73986 -149605 -338605 -128680 13526 139925 272654
18469 272654 -280854 102673 144895 -135815 233818 270991 -34331 -317513 -215491 -83603
18458 -174199 -77171 19314 -194365 -116141 -234353 209089 -67710 -119666 -111015 -49525 -86281
18447 -86281 129765 208035 61812 -316911 -47910 72662 232648 -98603 -7855 -133556 -98946
18436 -98946 -264201 -298713 -195709 -131167 -61547 -278368 211218 -138154 -56267 430844
18425 -347128 113765 150746 -111645 -163328 89880 28077 -43440 251457 71529 62372 -220549
18413 -265449 13564 139638 44883 -10133 138392 -194259 83048 -240076 44444 125957 397104
18402 397104 -280904 94574 -219127 87039 -66770 42401 25132 -113047 -167611 -52648 -110597
18391 -110597 98304 -112043 -43889 10439 119483 84609 144573 -156944 4747 -80752 86432
18379 70298 39881 -214850 -189736 -92307 20553 -233071 -149450 -210958 -157475 -380859 -42608
18367 102926 -19841 -131909 158402 -271674 409350 81212 -57272 -136589 -340979 -79272
18356 -171199 -296163 75372 25654 -226317 71177 -103423 -17148 10146 -6256 376668 -17626
18344 -245811 110739 -226026 38874 -6546 44281 76543 -88336 81759 332058 276817 152656
18333 152656 158165 -305596 -225739 -262053 31935 -3560 50455 -110602 347871 -119910 29740
18321 -196998 -328487 38847 -125189 -196667 240651 24656 -185490 64425 -106312 25898
18310 77881 37486 66141 80879 -159435 41610 -38445 -38407 27297 -249582 -135396 -92082 -104025
18298 -104025 146977 -291170 -14703 216369 -210449 -104824 238231 55153 94718 -119793
18287 -175932 -248718 -263258 70104 -183084 -65125 -64150 -170188 62446 -77897 -410166 206538
18275 -60198 -18572 -174307 7335 167015 -215639 -12787 138395 126446 -160339 -379213 -55626
18263 -160266 36283 134109 -88544 -64900 121923 -233320 161320 -20409 -5295 -354006 148567
18251 -347663 242806 -22637 67982 -163128 80873 -251081 -330313 -169819 251074 59771
18240 -201906 -166802 24027 -191835 -123181 -14321 130369 -183065 -22512 32790 195723 45245
18228 105075 -320498 -185784 -163347 -160095 -200815 47198 12394 141897 -50268 50217 -344248
18216 -29608 68980 -40565 47126 -35516 394837 45196 -151666 -127131 72049 -11770 -59280
18205 -59280 206035 -64948 395 372632 33688 47212 161519 -172436 16571 125527 -219328
18193 230348 -413036 -124997 -9393 -124886 -23757 40475 21144 503440 193412 342386
18183 342386 102987 -22850 338761 -101767 -194491 62211 368689 -335714 -170577 -73607
18172 33410 147824 478957 -165110 195679 -184243 157692 -161711 149723 133872 153881
18162 153881 7589 -7754 -67879 63500 -279978 -166996 -61600 -89209 14948 -29754 261287
18150 -94310 -135889 262111 -26873 -269062 48661 -203370 -290143 -181915 175228 74713 -102012
18138 -169533 103675 106040 278065 -6693 191921 -42838 -142301 56079 -9413 -119119 286172
18126 -268331 -121620 31130 66480 -82929 -266162 118863 -87033 215133 230765 -123534
18115 -66038 -310135 -208927 21181 -237562 108400 40295 57860 -54574 56021 23616 87690
18104 87690 286367 -222731 -101797 105200 189669 66163 -97160 -171980 49629 15865 71921
18093 71921 -167194 137858 150258 123418 -127828 101864 25021 256194 -383 95740 -14499
18081 239052 -186009 8107 -108672 -175944 -304516 138862 294286 -172307 12875 -318802
18070 -325788 106643 108348 19330 -277343 -182683 -199443 53450 -118001 -22001 -38299 -244378
18059 -244378 -122810 395651 -167432 -174346 -74467 -157852 -117036 -205879 -140156 76373 -122371
18047 -176942 19338 191608 64552 102293 174687 -271054 -239415 -151497 82402 -278640 -72668
18035 -177531 322147 92557 -55114 -361991 -240448 -195321 17570 -92421 -125642 277900 -177437
18023 -259653 282499 -15907 -148237 -216633 -3854 -122353 101899 -248511 -32918 76638 55722
18012 55722 138449 -8080 -332018 -221391 140127 16588 114600 -46931 -103660 128450 133219
18001 133219 -175549 14099 111033 -66685 43307 64664 -197147 93330 161260 80057 211891
17990 211891 233595 -331165 219538 -115132 -112688 174441 -60689 87869 -280590 -171865
17980 -171865 -135351 2954 -210269 -92821 5079 -105682 279208 57662 -282911 -359773 -240598
17969 -240598 136531 256546 -94205 -78018 249982 -82806 -146013 -191826 -165307 -225380 32728
17957 -135716 21244 -119892 455609 -345251 -160219 -78945 -198250 -317121 85876 239838
17947 239838 -213629 -160329 8188 -57599 14639 -258160 -218297 168113 218458 111629 57866
17936 57866 -126883 -45433 -152750 -149614 -172479 104312 -15899 334888 -94432 58898 234128
17925 234128 -224712 -267995 311316 -24870 -1124 -56416 -211952 324878 -26825 -231916 -224209
17914 -224209 -147762 -22658 100942 -102182 138203 109354 -12769 30335 14069 -5015 445215
17902 -374312 632 -88198 -61885 330818 -185133 30545 -13712 76854 65955 30287 -36983
17890 -174835 218057 4364 -294221 73648 40718 93646 -151170 78970 -204262 141375 103307
17879 103307 97330 -40699 -174178 364310 298195 319751 187476 335180 23052 293272 -296368
17867 3547 65178 -56770 -69579 -234124 66916 -82826 -116144 -272643 208930 -179291 84683
17855 -55041 -375513 3605 74532 256480 32782 -89985 -84262 6948 -231522 -299396 19373 -205400
17842 -357698 -225799 46524 217801 215172 -4146 30521 155367 -692250 -345161 -14647 -113372
17831 -113372 196586 -64229 -228680 78272 -108995 73160 -78320 -302803 144095 -270624
17820 326099 358247 12472 -34291 -82052 30684 119689 187703 -48323 120273 -153461 -204400
17809 -204400 130971 191408 213037 124783 -181738 -15470 -89980 -222933 -318036 -248960 71273
17797 -334128 200826 -21689 -21921 -3176 51813 40673 14888 155690 5183 -64604 143108 384516
17785 384516 416721 -92375 -95354 -378633 -151966 -337586 -50856 -3688 -279769 -370892 158352
17773 -35160 -98041 -142441 -249337 29091 -20426 -16904 113295 159981 -8740 -53500 -133421 -163809
17761 -163809 -63321 219598 46442 370570 119095 223270 -7509 -48710 36266 315493 -216472
17749 15229 314015 -306120 -160549 -97498 -44733 -153934 451610 -89299 93839 -65581 -114780
17738 -114780 -96893 131276 262990 133956 44510 -16004 210870 -158569 -145720 104201
17727 137516 -86395 108453 -185299 -19017 52917 -101515 128293 89731 -64310 242157
17716 -87791 -311199 108340 144174 162965 -137707 -243793 86880 -20114 -35698 153036 -52171
17704 145589 -4334 -211306 -94402 317077 -186028 -252360 108110 27274 41980 -207896 -110694
17693 -110694 -148942 -315211 -75420 -3943 291866 81843 237526 -374259 -34144 -217188 -132819
17682 -132819 -110368 169916 384731 183139 -150840 -77988 -426061 -16083 203976 228147
17672 228147 -38205 -181358 -7100 216300 205011 79563 93037 -16944 73401 -2209 4719 154024
17660 154024 -68661 202555 29148 -201375 104331 -59146 -242081 -27298 -100181 -13912 -178403
17649 -178403 -343370 -11292 -56898 146146 86863 14445 101594 62554 -24352 200420 158662
17638 158662 -203271 -85671 21845 224365 212824 117172 -146021 -77519 -71924 -65174 35972
17626 287563 263872 166329 196182 -42123 -252652 85048 47142 -161387 22040 -129141 -32559
17614 -208400 -99199 -115518 -75263 233325 195730 -24541 5058 196507 -9145 -67557 -239476
17603 -239476 168242 198357 -43558 187899 -216509 -195450 246521 -183567 -58866 -231294
17593 -231294 -760 295278 56180 90205 84069 -159514 31879 -51361 -23677 141533 146258 167810
17581 167810 62850 -308662 -242526 -102934 -79689 10320 -126378 229362 82418 -126273
17570 370969 -27229 -80118 68335 55530 193388 135176 189596 -310244 206705 -146987 23099
17558 -12732 125011 172419 24821 133496 -322665 197770 217873 99012 -308284 -327156 -74966
17546 9020 -124575 -42196 84851 -86985 -26616 -206699 -355393 -101606 191432 -13535 92308
17534 -131659 -200348 199781 76475 -47873 106387 47885 10271 71719 -179694 107857 -72565
17522 299099 37015 400482 84166 -143217 38630 140083 -130314 217145 348055 362690
17512 362690 85700 90081 207451 303369 -79288 247541 -233657 204975 420281 141117
17501 -29791 -74326 44700 165789 144223 152887 -235588 -67605 178159 171161 -133937 273635
17489 99880 167130 7262 -67639 316137 -141863 19537 -39698 85487 43490 252638 -70764
17477 194220 220836 -56553 242078 302056 95735 296554 -90552 358510 79539 460815 -242780
17465 91876 288243 230447 203588 48927 76551 67036 15226 -49191 101209 102691 91434 43111
17452 -258311 204061 -159961 182766 -106449 443823 242296 373954 98948 466097 366101
17442 366101 313853 287189 105216 -85445 397455 470988 329094 -168028 536779 -45632
17431 -10814 318224 16366 -4468 400129 243731 146552 58016 -22121 297707 233890 72587
17419 19746 -101555 248774 96974 188129 149723 -19140 290484 -1802 -35534 -74664 299241
17407 112769 409482 237253 363023 286537 -30451 8295 351517 -16937 189696 226709 254045
17396 254045 -14523 199921 -138200 282146 275348 217502 20486 71275 266874 -45496 85689
17384 77053 -180037 428283 52304 -110752 -160834 133055 -66598 76463 236661 248920 51799
17372 254115 219761 170610 164848 337653 -12434 161922 261254 190942 -252799 -27595 77716
17360 26020 -123149 -30058 -79883 154158 73730 335848 36329 106823 133079 350296 -50028
17348 125500 -200810 44576 194215 350433 -32440 318752 144737 132923 268511 73933
17337 -62535 123954 182502 434682 77963 396081 224632 58698 9692 97961 360785 -147585
17325 -17007 288952 183799 -26321 -102038 -127068 59098 -85750 79112 -39458 97813 321479
17314 321479 41029 -33661 4325 -216936 163619 -47142 -10720 -260056 -39450 6167 69843
17303 69843 220753 -170173 -306412 128826 123118 231943 -261402 -107142 101097 9592
17292 376996 127276 -12116 340535 570374 236080 44981 172643 536059 178124 202117
17282 202117 238575 125429 -186137 -21265 -88079 78719 -75135 126688 86074 263201 40172
17270 95310 21703 462331 56461 319617 38709 39364 111234 402206 72687 294198 212402
17259 212402 485401 -68685 -162143 84157 117735 125656 -7215 -143271 260606 486386 228133
17247 134459 47777 186390 182832 44858 209498 98111 177149 285569 63357 298532 -48059
17235 305777 447345 82312 427909 251512 189926 -122730 66398 486257 376926 161038
17224 452207 216006 -20364 126673 163556 -8275 260048 75947 43092 226853 503578 404266
17213 404266 212185 168472 342503 261752 106852 148478 177950 54203 218491 -151373
17202 432369 173359 320894 151988 182218 265730 185486 238890 421144 296134 84757
17191 225498 173874 310888 115873 312949 678237 129948 -108073 190614 215384 343194
17181 343194 252670 221597 4734 170741 212312 122337 374826 145334 179777 -177353 289800
17169 513733 221179 -268766 370971 301155 418199 185879 2592 216238 409838 73883
17158 -111995 262559 521861 281855 190115 284236 232258 197316 491447 62902 135335 440420
17147 440420 343350 475848 306664 461009 252574 -30014 262934 610842 665441 197194
17136 303421 423437 339267 181415 238502 284512 611566 228988 251083 230447 170332 589454
17125 589454 168273 300483 347780 617391 299360 270186 269358 564999 186300 598697
17115 598697 428246 359630 253271 261989 398635 149747 609256 201892 461954 363220
17105 363220 363924 362533 256992 377670 381505 203478 423713 313444 459352 284433 475966
17094 475966 147888 42585 705079 112241 603329 449295 411693 145806 300611 380514
17084 380514 631141 66590 459759 541462 399154 88095 485417 373752 479561 280942
17074 280942 385810 184118 540909 -17947 453994 416030 327052 437194 303212 368376
17064 368376 463318 546876 734237 113439 281230 406840 476829 283444 375708 328775
17054 328775 606982 295314 858180 266030 862092 649554 691755 349479 549858 352662
17044 352662 346183 767362 662611 541823 277226 439821 525053 951810 534863 404707
17034 404707 743691 499391 827068 572211 598571 966131 787158 759146 765453 495597
17024 495597 574858 598144 960597 829490 785910 737091 543831 544135 760114 764124 595533
17013 595533 539138 578093 916807 535743 791935 322928 476546 752160 892720 916750
17003 916750 623170 334082 502952 732575 825876 641691 677064 854329 704523 745512
16993 745512 414808 926024 806585 294547 470224 880229 793880 855169 1053893 703697
16983 703697 690027 707095 754204 1123553 813569 795714 716721 639040 952632 679679 725729
16972 725729 815528 971048 972293 853548 609624 728352 995421 1053469 699208 1028544
16962 1028544 619249 940046 723950 1079164 1135921 992385 1125854 1487830 1118900 953223
16952 953223 1134242 1265991 1090307 1152487 1005835 564803 1029449 1150250 1230470 1333153
16942 1333153 1132714 1230025 1269762 1129056 1193980 1127258 1162218 1380301 975850 1262425
16932 1262425 1333037 1173984 1316267 854589 1410049 1485295 1219612 1546478 1218521 1547985
16922 1547985 1221149 1249002 1233546 1580089 1349090 1279664 1581727 1565388 1547760 1437368
16912 1437368 1641526 1659725 1582572 1472406 1264938 1379548 1217621 1620347 1756390 1508512
16902 1508512 1926815 1828284 1499890 2054699 1545226 1593214 1687896 1874041 1646727 1594801
16892 1594801 1996676 1715153 2028786 1686697 2073588 2287965 1721469 1525110 2206060
16883 2206060 1972281 2402408 1844604 1929062 2367666 2137747 2072922 1979147 1929348 2498344
16873 2498344 2124937 2237012 2706884 2463989 2521650 2209626 2433919 2851706 2714723 2633045
16863 2633045 2992866 2708623 2801110 3158869 2974732 2711148 3034700 2811464 2723095 2947940
16853 2947940 2975231 3343807 3224669 2952044 3551587 3339950 3488187 3221623 3538000 3316014
16843 3316014 3992687 3714518 3648797 3972238 3738707 3660020 3885597 4045618 4128303 4401199
16833 4401199 3992330 4399305 4390678 4296319 4166451 4663965 4681945 4706727 4687544 4587319
16823 4587319 4978438 5107102 4813287 5019630 5042082 5722907 5569811 5710171 5735728 5968514
16813 5968514 6233821 6157097 6202810 6170280 6661289 6789118 6668417 6934906 7076490 7057079
16803 7057079 7651976 7539236 7853909 7781740 8000932 8260265 8667654 8631334 8720654 9025626
16793 9025626 9100330 9293389 9773907 9797029 10320616 10681206 10810971 11137681 11571221 11514026
16783 11514026 12180172 12225999 12869329 13118840 13710494 14082911 14577831 15315641 15414512 15613107
16773 15613107 16432364 17187980 17294910 18124152 18825670 19462311 20013208 20847680 21737146
16764 21737146 22180986 22896134 24316063 24926208 26371818 26901037 28269214 29395840 30365184
16755 30365184 32222000 33280323 34646642 36072714 38235661 39691790 41892305 43628644
16747 43628644 46285613 48414698 50914624 53892002 56286244 59489486 62490893 65892130
16739 65892130 69663901 73659159 77548481 82199051 87037725 91799221 97032761 102628230
16731 102628230 109036736 114472319 120516050 126945936 133750993 140325942 146579082 152902470
16723 152902470 158822650 164281322 169164163 173219398 176356101 178243667 179896945 180206548
16715 180206548 179302963 177574644 174085400 170320297 166033449 160781270 155066261 148572121
16707 148572121 142698619 136173747 129159606 122523079 116606501 110042606 104698213 98657609
16699 98657609 93020147 87980145 83242094 78223701 74107291 69854329 66516461 63198484
16691 63198484 59537188 56503095 53623163 50893027 48297170 45840127 43430616 41495568
16683 41495568 39896691 37846625 35870481 34686361 32821857 31333240 30227415 29036959
16675 29036959 27759854 26575716 25614550 24635849 23730009 23271098 21687048 21103952 20211262
16666 20211262 19708072 18700973 18211947 17725229 16918780 16410786 16001539 15607470 14985801
16657 14985801 14618565 14166619 13662573 13006461 13234294 12476875 12139552 11567244 11632326
16648 11632326 11069772 10935449 10670979 10170755 10209061 9488267 9294536 9298629 9060300 8561563
16638 8561563 8824051 8202466 8092219 8047790 8029198 7515069 7443275 7132543 7328113 6825163
16628 6825163 6538288 6897735 6776292 6323842 6468608 5832024 5972696 5750004 5523578
16619 5523578 5425250 5457677 5258458 4992347 5149083 4908862 5008489 4922363 4869419 4830181
16609 4830181 4741815 4569102 4629202 4342424 4270130 4104125 3989297 3826808 4046160 3453949
16599 3453949 3465810 3966738 3831767 3665359 3534242 3372417 3172043 3092928 3267095 3239147
16589 3239147 3404781 2963429 3207368 3423047 2949522 2836666 2961933 2902039 2761803 2573620
16579 2573620 2995287 2829595 2634559 2736689 2390541 2360392 2931408 2507802 2171628 2423849
16569 2423849 2226960 2302288 1967065 2140971 2296860 2235571 2221925 2212657 2139491 2134691 2068857
16558 2068857 2377437 1949916 2166619 2011424 2126842 2086835 2134113 1930479 1485383 1826669
16548 1826669 2024816 2002807 1926583 1784160 1579046 1485910 1873293 2011417 1713281 1553960
16538 1553960 1715721 1461213 1504342 1329675 1529675 1661353 1819172 1540167 1793227 1461398
16528 1461398 1663696 894967 1655535 1352953 1248034 1547958 1471676 1387838 1086287 1467859
16518 1467859 1431678 1102941 1203415 1182976 1344003 1408840 1242464 1223563 1060273 791926
16508 791926 1409482 1236909 1087961 1091166 1108454 1285387 1144904 1205742 970872 1352494
16498 1352494 1035050 1056723 1098777 999076 1262615 696379 1253058 817918 1158245 1101690
16488 1101690 622117 984656 689599 792084 664155 331838 750950 800938 998243 1087825
16478 1087825 808393 792839 792117 831207 812015 782560 545062 774105 536338 1067616 898972
16467 898972 959190 741712 826163 926445 941767 961225 707776 506274 814525 726217
16457 726217 699011 744326 599560 527708 899185 546914 329498 716147 553425 862884
16447 862884 636389 603174 738800 470550 345682 433649 521461 724097 194983 853370
16437 853370 697482 561414 560082 611367 662787 432898 915100 660327 580935 860037
16427 860037 542388 646607 562486 615031 602866 427649 550630 838894 342487 642026
16417 642026 264209 571104 618748 467475 684547 387572 349309 548892 640404 559944
16407 559944 269621 465154 337437 460616 385148 772997 311520 277412 433088 592725
16397 592725 670613 299391 572861 383080 339718 619259 402877 386480 344432 576105
16387 576105 291761 342190 206757 460659 435513 514038 418271 193185 366746 499263
16377 499263 330902 308393 458524 257700 325638 356585 483847 626358 399002 252598
16367 252598 125100 16142 570290 447696 370808 377512 457770 440081 188942 144192 537065
16356 537065 579341 144738 230422 384007 318020 375291 371687 254294 455 356135 350077
16345 350077 297357 531927 471790 324464 7331 314726 193123 414003 615713 280195
16334 100225 507126 -13474 201454 519620 197447 347671 498146 462491 435551 23778
16323 704907 105458 497112 419669 312124 105857 397597 346157 256712 203058 305593
16313 305593 210933 471022 228025 91932 190663 355026 311599 -12820 321316 -16076 284282
16301 92500 186730 -163859 -26996 -142588 -39242 153178 272912 188300 75325 305338 153048
16290 153048 164714 288275 100641 287339 243667 421239 103854 298636 270014 144921
16280 144921 43379 267718 248607 -150965 430395 285841 72710 212518 -127073 5216
16269 -3465 85531 -70252 139162 193942 114154 320595 39773 -70364 147113 322 -273832
16257 287719 289555 145681 485474 -20141 527706 220099 155867 222769 455046 192536
16246 163355 347414 245507 118906 318448 313179 1019 -22924 498948 -131148 166580
16235 161922 320249 228726 332730 281937 377553 435835 -116654 238910 39498 152072
16225 152072 27659 150094 341854 -323702 49050 225322 170589 242864 -9632 -122483 191457
16213 132691 210962 95869 -66296 223681 220841 367783 331721 265020 78078 77421 316434
16202 316434 33968 264001 90324 16660 90236 -88057 -106798 66336 298623 -16527 365724
16190 313717 55682 35736 1582 126242 53241 33910 146956 161752 -200758 176416 275323
16179 275323 55177 163493 200269 200508 201411 127818 58503 139508 111597 27760 -52141 129067
16166 287875 235911 147103 -55878 346727 79839 -223969 127387 -271406 -108259 -155025
16156 -155025 134209 39123 176917 66562 35832 353264 56435 15245 241340 31824 -55165
16144 317800 136805 185967 217938 202434 -16282 -153353 -364795 77619 136512 111736 119423
16133 119423 10028 165084 12324 196917 -231945 -140801 285206 17645 20588 -80805 -142683
16122 -142683 -93475 -240035 87579 117189 76105 117556 373572 -12999 -34623 -21725 221498
16110 122082 208397 278210 316414 -107296 31177 72710 156587 111408 80106 68334 263521
16099 263521 367134 62885 -117750 300296 -310751 162409 -327063 -181743 55435 -90376
16088 163426 88813 -105094 388124 80060 100571 -121302 -15559 -306429 280035 24062
16077 -36151 377714 -71396 -27052 -34468 -359963 637262 113186 -169827 71762 -250815 -21
16065 -21768 204613 -60027 66243 -245048 121509 -109095 -204142 -104360 -43983 333083 -229256
16053 -236827 -83058 -110442 -94095 180306 274578 274177 -42738 -91889 195476 180263 -326317
16041 -84798 299130 -30823 307491 -331256 -14808 252922 74422 -90959 139900 105171 140978
16030 140978 -154941 -104247 -179284 61578 213832 318536 -1337 135370 172906 154420 -96155
16018 209279 221981 -438925 -100013 59530 -221279 24202 58561 166980 356382 -230230
16007 -341859 -27528 416679 -206521 -108719 261271 35691 29747 82972 -148712 82450 56593
15996 56593 170972 -122823 245032 30834 -156733 -86391 70645 118801 -12867 -248802 22002
15984 297893 -107227 141853 286234 488485 41354 207916 103539 146415 -19500 5727
15973 -180423 75168 152972 229904 -125302 9649 -531 -117116 60454 -99537 -64229 68976 73615
15961 73615 252052 -263594 -27130 153182 -91178 205340 87547 172309 42488 -409559 181045
15949 -279249 61341 -221331 -1845 211985 -22699 -247928 253989 -269995 129184 118200
15939 118200 -77552 154397 32082 -277862 113686 -19309 67497 -195203 157636 -230999
15928 -282718 -171172 -126486 134211 69676 -308497 144782 -271566 119569 3355 -54590
15917 -204478 -28377 -65845 -297536 55969 85593 6542 18458 130156 -74867 3396 -227774
15905 96124 13471 34880 -124408 216971 97782 -191526 68183 -203173 84584 -90618 -78758
15894 -78758 -65573 -10479 -25137 -221186 -106797 18226 -42038 -1385 23450 -272414 -196204
15883 -196204 195376 -129814 -44369 -221972 -114909 160732 -318192 41641 -238920 -153424
15873 -153424 48957 -73900 -90528 -133296 -1044 -5562 -378569 128004 -25355 141539 -159407
15861 202313 35292 164055 -31553 -165077 60243 -21342 -297955 -139725 310 -107502 -11216
15849 -96715 3436 26458 -46347 215810 7942 21736 -179680 -96790 163064 90984 226685
15838 226685 26978 125838 -64137 123753 56676 -436407 18742 -107808 213989 -91010 -34895
15826 -225091 -152949 -10989 -7284 -134046 323881 -29642 -103222 -111260 -224011 362727 200196
15815 200196 -191204 -193432 -60565 -173390 -132551 114312 -68150 59823 351397 235257 -67955
15803 -124093 -103499 85638 92568 33726 -352795 176164 -5736 -234442 -332162 -274649 42653
15791 -263379 114252 22774 -324896 -29785 129073 183422 -322705 -255544 2484 -160358 -183310
15780 -183310 -176411 14938 -65718 -108257 -65746 -103968 184758 -188336 -174627 -168627 -22834
15768 59814 -89458 -224065 358359 -16324 -16598 -31754 37592 -169558 -320217 -88762 42472
15756 89476 -17259 -329336 33874 224242 -29115 210720 -163018 -183243 80081 218 -346407
15744 -203428 -119460 -69911 6883 -31900 -30735 -94332 37301 -52603 -42066 111293 -214644
15732 -133204 -139764 -148506 155601 -41217 -301385 -153267 -295987 -61206 -50195 90579 220837
15721 220837 172852 -466803 -25609 -93524 77583 -43121 -108314 62686 52042 -235376 -34677
15709 293264 189360 406117 951 -191317 107681 -111069 234675 -143178 75319 -25870
15698 -102141 -228364 314 -298349 -46096 8221 16634 -288641 554900 86531 68874 -40208
15686 123644 -481971 51370 221284 57786 -133443 -20997 12091 -38944 106255 42147 -334041
15674 71445 46718 -202409 162939 124040 -169817 188616 36611 -80499 -83423 -45863 -117560
15663 -117560 217573 -49183 -40261 73397 2872 -108853 -78232 62686 -45124 -318321 234511
15651 -29683 -51565 62644 -112730 -127872 -169060 179981 -145363 -112503 386231 34287 -11054
15639 -284434 -39894 -87683 -121970 360278 8571 -46066 -149109 246271 193257 -28664 100688
15627 80815 444226 -145767 -139581 -86772 -101901 -1990 -76822 -202270 -105123 -108946 -179824 16452
15614 4230 52899 11218 278227 -343399 -62334 -189138 -147389 -51525 -234142 -22051 95827
15602 280282 90274 -73817 18116 -86134 -100227 -63171 48536 41341 -182077 -73946 -75130 106082
15589 -92528 -95171 -127451 40865 160020 -84644 -11642 12464 -70455 -252713 13413 34641
15578 34641 127860 200368 77279 -122112 11082 166489 112604 -116323 233331 192013 -66763
15566 -401105 -242929 -199210 -68392 137666 -8600 -124529 125613 151828 40463 257548 -329783
15554 -101560 -146053 140911 248620 -30475 -144820 -150614 60770 -124778 71935 207665 34337
15542 -82070 -64401 -178186 40291 -95445 79068 45459 5045 -193600 -128586 45719 143170
15531 143170 -170065 289161 -309316 262190 -17651 -214570 283212 97786 -222902 -122084
15521 -122084 -88773 -154065 33753 -161717 276961 -112383 -503 261536 -12103 132954 75211
15510 75211 52373 -19644 -179487 -50772 -20045 -240249 214024 -42579 194801 -234333 105611
15498 -193757 274816 -151 13394 -256779 -36809 -231964 42743 -286282 -86192 276794 -219016
15486 5467 -320119 60718 -79372 149305 271612 -17260 -144179 87194 -118362 17282 151219
15475 151219 -33541 79779 -101462 56251 -58412 -389157 50160 -168615 -142822 324348 333168
15464 333168 -150823 -289003 180654 -203369 -142655 144394 -146098 30912 -88107 -76255
15454 -76255 23382 45155 -50641 275436 -110321 -293037 -278266 -168067 -34086 -13902 -61493
15443 -61493 -425414 243470 17916 45254 94149 -426238 -331798 100789 -242445 164115
15432 171315 39861 63045 335128 9508 279681 49633 -314097 58149 -44122 -22243 15725
15420 179893 26419 -78743 275379 68302 205284 -14006 223511 -228811 -179428 165829
15409 251110 -16357 106053 178160 -39141 116638 85805 -66757 7758 -49828 36505 251357
15398 251357 101051 88449 -211390 106419 57879 -157188 -27129 234425 -121746 342067
15387 -194558 -306395 -103379 124067 -88181 -279002 50549 -36580 132166 83807 69009
15377 69009 -431925 92574 -9560 -66840 268660 201568 78066 10257 -131602 2030 -368429
15365 -296479 17027 87616 -3112 -244539 44584 -478316 -52804 -262711 -184249 176326 -68209
15353 -78863 48556 -42622 -153772 -122766 822 -241231 -230949 196825 46791 99850 138710
15342 138710 135107 -18785 52601 -14434 -57520 -43719 171177 -279447 -114619 -237390 130556
15330 -359288 229915 240288 92608 -228035 211599 -123545 -12227 179362 112426 -65111
15319 -156851 220392 6198 -40628 -507773 340291 149332 3440 179438 5653 -144465 96482
15307 -148522 58508 192687 -75624 -36224 -16346 146819 60583 420938 -237239 222088
15296 325189 380413 -79409 -96870 70901 -282808 11495 466519 243734 164854 -625 74704
15284 -23573 178893 67151 -324737 90172 -35842 9867 17035 24752 -180969 422613 -87264
15272 22022 164440 100391 339450 -154873 196850 -169437 499104 278286 63228 13169
15261 330030 -61557 35570 161030 77464 34187 47237 222389 -14844 432345 -213376 329501
15249 542663 1451210 884668 1021260 1632019 532948 328391 139007 135395 -235722 221534
15238 -17618 139172 -30295 -210990 150671 197936 42063 117095 74307 -214189 109906 -98654
15226 173060 16809 -72484 188852 1464 -57934 139548 157365 365674 27990 168290 461956
15215 461956 327097 81768 309520 357162 -67718 -77610 28424 133329 171494 88872 -4622
15203 -23930 107499 42598 135982 111819 238367 -20720 -134008 147752 599 -36545 3484
15191 23602 -162423 -38739 -71840 -4124 216178 222073 103921 86644 256921 -65665 119493
15179 125846 473194 -320870 119450 9365 213552 -271255 59779 -34758 -81426 240601
15168 149640 -159164 67490 -306520 111350 167878 -91729 25526 30852 83202 79009 188200
15157 188200 -196167 -149103 313763 203619 199942 74174 -231178 -134460 101580 132239 115487
15146 115487 8201 -51658 149932 -277607 -165807 -5318 78357 85550 282875 14574 44884
15135 44884 -228839 82066 563316 2211 124657 547532 102078 383164 322895 -29986 160701
15123 -39791 283586 52788 244439 147460 216157 -153009 41415 175765 -3720 5953 166227
15112 166227 -218520 14831 -34337 276420 -175206 117923 -140300 98022 310822 231404
15102 231404 313698 63482 233923 131033 242740 84315 95268 -75487 21593 42158 148667
15091 148667 -12441 7515 173873 40428 -61599 -139843 -95548 215278 -113463 268582 -308937
15079 -144467 90035 210591 -248797 163056 338774 271207 -183289 -216669 243470 138318
15069 138318 -9604 124779 260485 149337 146146 282095 383632 40506 120590 287052 241433
15058 241433 185804 206265 204589 -269024 -63788 -124044 328105 142421 -113767 430482 132866
15046 306681 34569 219081 67005 319937 129757 167955 444297 220638 -4751 266721
15035 301990 154271 233284 -41452 94650 106654 481375 136851 199101 300712 -305336
15024 325990 314323 -303555 -20839 3438 348638 -42195 172509 269586 67216 -90190 371534
15012 -171308 118220 213273 137070 109426 453072 78184 265106 357255 439286 150423 -22233
15000 196170 255493 224186 152614 5461 -366754 318473 593804 292582 512113 393390
14990 393390 99919 70082 -647 184952 -109754 314611 271428 331822 212743 3220 152901
14979 152901 269658 30411 136599 16766 -23163 174095 163927 5288 161938 182239 513005
14968 513005 205059 65132 173148 124741 93537 101207 349704 -5587 202583 204278 195689
14957 195689 5463 536525 146553 175123 231280 201038 102489 243058 203555 423017 279720
14946 279720 21255 544944 28174 555419 150103 225318 48801 147909 439153 431766 489854
14935 489854 286273 382799 528231 156110 345898 403242 364009 -27870 213123 351975
14925 351975 342408 340399 91191 353911 249094 493100 307539 153474 531951 334025
14915 334025 433187 119169 222359 378016 13982 107895 -132672 435460 127929 267803
14905 267803 204160 409409 -169092 280660 421743 141910 133090 396356 75965 282275
14895 282275 307327 265334 422472 234105 478569 357019 111496 219560 427066 282204
14885 282204 10016 440243 380479 333247 219911 167423 80005 344040 183263 346944
14875 346944 290044 189210 66820 520390 342006 361595 96863 286115 -45872 47052 358332
14864 358332 273767 215147 393548 649987 482651 250760 214062 249964 632901 237478
14853 663318 547996 202761 473140 152672 247354 150764 252634 -86867 408862 291030
14843 291030 484004 456818 322650 509784 657484 488337 468623 318548 185067 145891
14833 145891 496311 185251 410518 356183 328575 76556 390635 306865 428160 454788
14823 454788 350369 466536 391732 293395 354430 346638 244442 204685 490217 934108 306335
14811 310797 526753 533360 421061 521501 441221 276992 208655 646187 487763 44960
14800 613196 582039 700370 408098 318352 586851 371624 630068 391419 288464 317625
14790 317625 360362 475977 35224 410961 611091 687364 359108 556332 386405 492374
14780 492374 645255 672200 340341 339351 634329 682105 761245 528396 556989 348860 734103
14769 734103 832944 339909 806958 274114 236139 268894 553611 444357 359175 450511
14759 450511 570937 506497 613974 512584 536627 489863 329249 815764 472194 895512
14749 895512 791510 880824 955756 421263 802093 599843 912286 810407 746877 667582
14739 667582 730513 739871 860974 512388 846601 709568 980479 870238 592138 732421
14729 732421 456336 445346 700014 565532 490146 475256 836683 655605 903443 772159
14719 772159 1214656 904041 483372 673955 701538 653123 692757 609587 611661 1172444 727316
14708 727316 1026663 831026 330943 596285 1016664 1098591 823224 559666 1107805 910109
14698 910109 863689 500699 765553 789030 686464 944495 970309 593139 575114 897921
14688 897921 417780 1212985 950071 685912 749998 820433 869883 845999 438671 788668
14678 788668 932238 731969 1087257 924050 810422 836410 1143899 1151993 781765 794997
14668 794997 1072333 1041876 847257 1103324 837382 900592 973922 907101 1033785 968746
14658 968746 1101841 1098688 936944 1094675 1232770 1050291 924102 883744 805809 795672
14648 795672 1204710 1059721 650913 1123653 1046842 853161 1114236 1253451 1312519 1074150
14638 1074150 1269078 942184 1174998 1237761 1207832 1137602 1086655 1340926 972721 1545432
14628 1545432 1129526 1278392 1443455 1281360 1393646 1113637 1232114 1436278 932320
14619 932320 1338475 1348610 1210177 1239623 1298663 1224241 1554211 1331290 1423434 1810486
14609 1810486 1421353 1582107 1513217 1647339 1128649 1476914 1458230 1526554 1556266 1727650
14599 1727650 1347400 1335105 1608793 1585304 1993705 1602798 1667975 1675615 1482710 1445332
14589 1445332 1759718 1917958 1629183 1713579 1687330 1847257 1566942 1703248 1879612 1552457
14579 1552457 1707032 1969093 2041694 1899224 1795118 1971737 1901534 2124551 2119751 2055416
14569 2055416 1794918 2389836 2117715 2241909 2226899 2351929 2082207 2506138 2342484 2710361
14559 2710361 2629429 2645744 2604437 2479837 2630406 3153978 3643102 3992159 4264026 4852797
14549 4852797 6741987 10315921 18988675 35057921 48314708 24580613 9653782 4224302
14540 3085381 2179713 2069592 1618144 1680266 1908500 1817208 1742185 1883503 1748763 2038347
14530 2038347 1860877 2008586 2122380 2195022 1787786 2040957 2080700 2155888 2295794 2494413
14520 2494413 2145923 2522135 2366187 2490965 2287828 2207697 2226302 2661481 2536579 2535776
14510 2535776 2833308 2646864 2464284 2782417 2554967 2827000 2971487 2803738 2983446
14501 2983446 2742910 2815577 3003675 2443570 2858649 2959651 2813187 2995011 3107696 3316233
14491 3316233 3233889 3192712 3110024 3408149 3255727 3420789 3082632 3133617 3557705 3459678
14481 3459678 3317248 3479241 3690678 3607609 3669100 3709710 3805805 3715162 3797751 3898092
14471 3898092 4095901 3745520 4052383 3655777 4084403 4093055 4484754 4534919 4198977 4249512
14461 4249512 4479691 4216990 4902092 4666516 4845999 4784083 4965487 4806728 4990957 4879929
14451 4879929 4480006 5090662 5215878 4956085 5057865 5363165 5426715 5389768 5675706 5439608
14441 5439608 5581357 5752089 5958655 5931980 5755609 5993514 6222304 6249775 6034194 5890877
14431 5890877 6352486 6171528 6495947 6672543 6628145 6821963 6613053 6871598 6787384 7034215
14421 7034215 7078117 7145580 7654043 7519816 7958719 8011218 7699077 7860902 8082719 7885905
14411 7885905 8277389 8331746 8917927 8713428 8966748 9201121 8980792 9142199 9604506 9520894
14401 9520894 9585811 9859258 10043909 10185387 10721935 10461241 10969940 10559301 10994295 11267385
14391 11267385 11477678 11913934 11688997 12006131 12199705 12425775 12286115 12506800 12929768
14382 12929768 12847626 13275734 13622984 13783900 14058709 14168263 14435915 14780800 15384526
14373 15384526 15387572 15686604 16101384 16791288 16661341 17062980 17480107 17604576 18054284 18574868
14363 18574868 18797438 19253056 19789115 20338271 20483596 21125656 21666840 22249788 22593964
14354 22593964 23256050 23771731 24214486 24624945 25270095 25938611 26605525 27528288 27976122
14345 27976122 28904356 29553806 30272625 31062557 32184697 32667279 33949067 34540271 35890739
14336 35890739 36706739 37907519 38736887 39978236 40866332 42640274 43687205 45356110
14328 45356110 46573769 48007687 49970674 51465555 53063709 54864365 56907405 58984139
14320 58984139 60726385 63118712 65801242 67863605 70484000 73056490 75973863 78764015
14312 78764015 82678689 85706320 89367891 93054597 97084318 101421020 105891989 110437781
14304 110437781 115798028 121258811 126983383 132978047 139528204 146279795 153653413 161314133
14296 161314133 169696838 178450600 187859205 197821169 208325328 219479526 231579306
14289 231579306 243741090 256844727 270709701 285241937 300394096 315891629 331776514
14282 331776514 348226457 364312450 380712122 396794554 412316509 427034920 440523528
14275 440523528 452543886 462340816 469278466 471862467 471118251 469404330 469200892 467929381
14267 467929381 464309726 456810388 447337375 435841459 423128877 408499584 392895373
14260 392895373 376584097 359946635 343357375 326665074 311563822 296044803 280889026
14253 280889026 266711633 252756396 239822952 227436530 215763910 204746791 194075447
14246 194075447 184028868 175275416 166835823 158675370 150964688 143769501 137189121 130622245
14238 130622245 124778351 119189060 114359403 108778165 104084617 99375099 95766779 92034523
14230 92034523 88176171 84620383 81395942 78337639 75270622 72292401 69313946 66879394
14222 66879394 64463364 62383326 60365505 58608717 56170761 54356634 52738376 50804688
14214 50804688 49473950 48084813 46819606 45047028 43558984 42237943 41447849 40424447
14206 40424447 39824391 38094939 36962765 35798094 34675001 33877106 33583339 32533749
14198 32533749 31385440 30745361 29992598 29314754 28529940 27668818 27085318 26328282 25793808
14189 25793808 25691305 24214993 24015446 23444427 23068758 22594801 21945586 21333970 20814278
14180 20814278 20245780 19884542 19760195 18895254 18743030 18453210 18222611 17448088 17370553
14171 17370553 17203850 16684656 16539908 16127578 15550462 15656981 15152621 14761117 14713000
14162 14713000 14348448 14374711 13846778 13841432 13103506 12928888 12652654 12521666 12658552 11993568
14152 11993568 12234543 11937342 11490271 11328828 10942649 10976451 10777611 10774619 10412899 10166758
14142 10166758 10087748 9877879 9851035 9887002 9602891 9124529 9220310 9005845 8831292 8778512
14132 8778512 8723991 8894789 8720003 8451251 8388623 8517819 8092592 7763852 7936475 7840124
14122 7840124 7835764 7481702 7586965 7406754 7146347 6915028 7113873 7145465 6941338 6913612
14112 6913612 6565533 6908263 6782585 6451374 6231402 6029305 5866376 5906570 6070724 6316784
14102 6316784 6108852 5841667 5925767 5639534 5633828 5778942 5638407 5227250 5273820 5696844
14092 5696844 5441478 5308616 5378491 4985202 5111927 5354725 5086700 4973925 5095251 4700340
14082 4700340 4691406 4219847 4734607 4575496 4605980 3822797 4480067 4465200 4315077 4350229
14072 4350229 4230288 4120246 4300844 4078154 3698744 4231617 4060145 4111383 4233485 3811784
14062 3811784 3756881 3598203 3930925 3669358 3871737 3903875 3675222 3458343 3586707 3499331
14052 3499331 3676088 3586401 3504628 3349206 3354662 3219833 3221761 3626026 3223961 3371459
14042 3371459 3112606 3374202 2864754 3041818 2770803 2864711 3042078 3238299 2981711 3046138
14032 3046138 3073972 2805934 2812410 2837777 2659703 3346173 3007903 2519670 2359083 2896977
14022 2896977 2701497 2634957 2436929 2587491 2747403 2511230 2434499 2548472 2568583 2276383
14012 2276383 2225933 2262488 2277585 2083321 2565634 2400347 2329877 2394285 2561976 1965704
14002 1965704 2320219 2123845 1654895 2063399 2101013 1904009 1601095 1979094 2023129 1948503
13992 1948503 1789626 2290253 2114287 3492111 5487555 12497371 26567865 46246204
13984 46246204 30637343 14643996 8409581 5979944 4662293 3877903 3509664 3080853
13976 3080853 3052930 2905234 3095693 2751471 2384084 2753957 2514458 2102598 2390309 2116105
13966 2116105 2287916 2066235 2273200 2406678 2056929 2056699 1988561 2476693 1987959 2119869
13956 2119869 1823166 1830145 1692738 1838952 1828343 1942725 1684838 1926313 2048710 1681178
13946 1681178 2117812 1939295 1861462 1552441 1752108 1568750 1628331 1817569 1628888 1738113
13936 1738113 1589468 1805248 1774264 1532115 1588007 1582263 1639566 1750452 1600627 1711276
13926 1711276 1399367 1406731 1465667 1664458 1591312 1185775 1345688 1713615 1697398 1689833 1549170
13915 1549170 1449586 1676202 1371938 1635369 1235679 1568281 1333464 1640748 1622416 1135591
13905 1135591 1160383 1337241 1334592 959985 1172412 1266465 1074927 1331415 1210075 1312297
13895 1312297 1188088 1304793 1330614 1098640 1275973 1130614 1186244 1015479 1173855 1157428
13885 1157428 1278366 1259351 1320043 1283063 862629 1296542 1071096 1068527 1065969 1131234 1140096
13874 1140096 1079611 1313210 1478320 1334929 1143651 1326062 1417029 957727 994771 1095820
13864 1095820 1372233 1122128 1170448 1095667 978410 970208 853915 925767 1156190 990945
13854 990945 1064873 519402 954316 783165 1259672 1286503 968446 812838 836716 484517
13844 484517 766279 1170072 1168975 1138594 788814 895907 1089056 1202224 845852 872845
13834 872845 920075 905361 822533 792756 628730 1206965 840176 989469 988284 868295 806386
13823 806386 657789 913454 718246 748391 866952 972806 1015770 589959 844582 686160
13813 686160 786719 682696 693753 1043153 644988 676135 600102 592723 730838 890263
13803 890263 573517 943400 428981 685362 952423 909969 350967 745848 502977 930617
13793 930617 850792 1107870 833207 974368 497861 848047 380367 567060 916572 615225
13783 615225 533657 623553 774713 808950 802847 418204 854350 770494 506160 588167 720211
13772 720211 822916 644237 784166 632952 787672 668644 661496 532092 865198 757387
13762 757387 605604 686346 494963 881283 505558 771207 421360 742155 738222 566687
13752 566687 496034 779733 584997 639171 676413 465780 650455 636453 582418 543429 626193
13741 626193 539896 531506 777625 723752 462080 586568 604390 322906 907589 755626
13731 755626 219312 476338 811572 360658 413296 635298 350799 791348 520906 666566
13721 666566 511221 591616 815908 246008 109062 538742 487245 495367 515234 347078
13711 347078 289698 426047 337596 408672 631866 253999 560372 529742 437319 609760
13701 609760 576225 526005 338889 153865 334968 562661 602086 369321 478745 527090
13691 527090 342967 550299 747960 704176 747588 490413 454163 624793 738588 453582
13681 453582 336748 225764 246845 385878 611869 448578 345487 466278 479581 585729
13671 585729 444099 103158 740282 700379 199098 350477 248153 520068 513747 502737
13661 502737 504872 473407 203494 261202 67738 410890 447852 730587 449313 428614 564911
13650 564911 411433 451720 176696 361125 571929 545159 395202 548674 397758 245862
13640 245862 114523 449550 454606 465118 301988 674147 232593 383321 337393 118270
13629 181959 188824 471307 432604 581070 438481 419954 819265 485010 716923 315495
13618 418941 -7109 344034 518639 357443 330754 239873 278216 406959 760427 347386
13607 252210 590257 301021 209054 33959 392125 499905 398706 370146 364631 370806 578661
13596 578661 145458 528627 352180 88524 381234 513128 394790 144247 372330 389112
13586 389112 -228743 403938 92765 292499 575592 571261 365113 -239272 274883 164952
13576 164952 375363 379735 428510 291007 246180 158657 368959 -213768 215217 278878 279601
13565 279601 -74014 676325 297377 284261 378415 275293 207393 469591 244042 161914
13555 161914 451892 249349 489125 316660 300957 387159 215952 352567 427377 4224
13544 51865 -40598 382296 303257 139398 584645 629366 187477 223494 75443 559275 100702
13532 127617 24208 356906 437310 418994 -118431 236910 -64190 316753 249147 389853
13522 389853 -323857 364825 333717 256433 60460 424314 147723 20761 63363 204093
13512 204093 45753 543038 360468 395649 487963 459656 526699 67930 -89206 -168266 122063
13500 244175 212193 401336 132698 -8228 222059 239487 438596 297909 35724 124882 185414
13489 185414 385106 160167 23286 285613 317100 256114 134404 305982 351515 374904
13479 374904 253815 290546 69809 396190 40054 181984 -22349 172212 452868 200890
13468 305988 451284 361057 98601 27090 345153 88507 373760 -157834 -10726 251457
13457 284257 197805 571903 408847 35701 519433 -101153 158209 193452 88753 183480
13447 183480 315494 96738 -130464 323295 316076 91629 336350 564273 33361 370301
13437 370301 273612 250242 148848 397017 218536 364065 118438 374366 463734 -60004
13426 247274 67055 437234 -17492 245310 239836 336593 226452 381462 323407 389363 213428
13415 213428 3203 26619 250382 378226 260519 243609 171278 254927 367826 95547 150549
13404 150549 157658 519629 156844 369182 40031 192980 129658 236648 42792 175361
13394 175361 423896 -17653 -88005 -63066 23756 211881 -130873 308678 7494 160785 249863
13383 249863 74199 -129999 443968 103402 383329 41928 242230 -15845 439120 433980
13373 433980 247493 291075 475624 -165775 287776 -4579 197882 231336 205933 276171 286316
13362 286316 537819 149760 54005 343931 -51616 216857 420043 394453 474022 90659
13351 421114 151264 352140 44038 76081 -46952 353418 507171 378575 268036 203849
13341 203849 278607 190657 326568 350559 329636 255342 284694 -8835 247622 -108816 222549
13329 188325 -143008 57735 28770 203996 336077 123393 80631 273687 77119 -249342
13318 318582 225210 144635 177710 60006 43634 42819 360734 284635 -162142 201975 37807
13306 321533 88174 662453 -13874 317115 131910 382929 135503 264117 332868 217324
13296 217324 -63470 234583 -147809 216062 112873 216509 -20944 68844 377377 485546
13286 485546 127120 653926 207534 102892 126781 153541 237333 -333940 156733 336754
13276 336754 288367 -125249 64106 -94330 -1210 27920 -58376 168847 718 -12398 262074
13264 272665 80857 -84941 195818 306270 -98095 198024 138036 -14841 76879 102907 129502
13253 129502 -193885 -124485 74930 101677 -9304 111027 122446 48286 -72905 67715 83301
13242 83301 376735 242916 445213 156507 201461 211760 68601 216814 260250 229155 213808
13231 213808 -135498 265396 411922 128122 -155351 38487 31197 207062 114776 158587
13221 158587 115878 81717 354881 -109017 -23904 90272 -13266 160163 384871 -5892 98315
13209 48290 78474 59513 -21583 225521 25961 165195 -413223 86060 107582 282332 -190564
13197 256108 195771 510867 237031 312679 86755 82318 -85773 31539 -276986 123315 44590
13185 5338 43438 301404 231413 96516 106424 244890 379849 -85991 139843 -177504 460547
13173 -61093 -322559 -56118 12977 75753 456594 442731 -20614 163233 125560 16144 -261505
13161 -56724 -63893 273334 -119389 95481 200929 348195 79466 74165 165046 394589 356873
13150 356873 184537 384634 -476777 -40897 277029 -46953 -33746 208305 369846 -123194
13139 -108909 445713 26547 65737 -11310 -31099 89038 -160139 277170 29912 234406 360670
13128 360670 -108020 61054 -69408 -113913 -29102 178559 218267 -153262 35871 257928 250658
13117 250658 78747 166200 112502 102966 24199 -233935 22961 302745 116402 405473 190711
13105 108300 174906 248695 -75637 -213808 261480 345119 217960 190461 1530 -97523 -114912
13094 -114912 64868 267595 -28338 35432 8909 -18195 -159179 191305 253414 240921 37768
13082 187384 320807 5304 114475 199289 -185216 -125696 -182464 338728 235828 72493 -159548
13070 388197 -101483 39552 403701 -27926 157222 -109523 185806 -8861 136863 368670
13060 368670 3986 109546 235903 224110 -140267 37311 73772 53905 -301165 115484 135324
13049 135324 -72215 211026 30669 155296 191867 98402 550080 104225 -59718 -82830 185899
13037 151073 -112559 137735 114516 469458 252300 116165 183529 222063 41657 -215429
13026 239697 -49856 -221313 11630 -136551 125053 2772 331670 12240 267343 231189 190367
13015 190367 -120980 292340 -153029 95790 235382 378393 352628 -185718 -106557 47356
13004 -15055 390925 1587 -95364 114331 -106552 4721 130726 -27985 145202 -152989 -62130
12992 4206 20299 92197 4671 -50416 44455 163354 356913 11829 107227 -12859 -122310
12981 -122310 188468 6608 175908 161141 114521 170422 210533 132317 -46205 -59366 395066
12969 73152 48505 -100540 48521 -315331 -1480 -176629 26398 -422983 308623 33300 203876
12958 203876 23413 15732 108861 -246373 -121681 -106277 96647 56743 5138 107440 -55161
12946 -198954 -201395 202339 277950 100657 -167679 176918 -232656 82507 -113850 -233573
12936 -233573 155005 -212102 207405 151300 294625 115273 145395 164968 178464 -90341
12925 400920 -139213 44726 447885 50094 113693 -4871 -14773 64965 89539 36270 214536
12914 214536 275368 74262 -215376 -60506 244553 32877 -12729 31933 68682 340409 -82582
12902 31417 -51540 -29671 -301319 -23223 197223 243696 -57590 -189944 21530 -242639 -57486
12890 128218 159097 -210775 -219634 -92441 388861 152887 123936 -29045 -149721 18445 19325
12879 19325 246906 -83946 40910 -11725 7309 -43975 12754 -79269 202265 -224341 509367
12867 -29607 198749 261411 -64425 248596 261293 117136 92130 113168 -166921 316955 311668
12856 311668 -60063 111236 76618 -227674 71364 -69138 191176 -138012 98614 -128887
12845 163406 45395 134446 -155276 157548 -40318 -374306 -159954 160011 -70855 97963
12834 359771 146409 -37367 -37949 -103907 304080 -57793 -455846 41225 -242109 205735 127892
12823 127892 -226422 258464 -4581 -223601 -98667 297451 40915 -343717 212148 -59319
12812 158625 -96188 -41001 -229258 -116773 -35467 -111561 -58685 -63366 -342208 -232398 8782
12800 -40084 -67839 295350 315298 -16346 -134494 23548 -4020 31986 -140736 -126500 58014
12788 -6597 -141316 -163713 146891 48007 174196 252776 52506 82053 115972 -46624 -107132
12777 -107132 -80127 -181899 -269827 82605 204426 56417 -197415 189485 288533 -151667
12766 -32914 -47008 147113 51663 84562 -32905 284258 -430394 -311248 -92981 52623 112253
12755 112253 138317 232066 96608 -23996 5440 245824 237224 21065 -27543 -9372 174269 69657
12742 -229181 179391 -287041 106418 235134 217957 24560 228040 160031 131270 -123159
12731 370276 -330619 74707 155328 73068 -120976 67911 198183 185465 322230 -122150
12720 -204755 102505 1174 -198605 355128 -70313 113752 52823 -53330 -25185 -129221 301941
12708 398976 119901 514206 204084 234591 285496 231597 310759 350895 205361 462919
12698 462919 140054 -375556 298141 50600 -125625 74371 -155755 -292122 35482 218594
12688 218594 -125271 94724 132137 -27529 287915 233925 161005 -20836 36056 355021 -31414
12676 264920 472973 6448 203116 -229493 253017 -88449 194523 -44284 -128179 -72887 141558
12664 42538 270552 13787 -201728 -28493 -244952 -265293 478998 363197 284872 296885 213184
12653 213184 -101086 153138 -26994 64686 119140 19164 59378 89454 9190 324239 -3652
12641 207024 39810 -28792 -65409 222218 -186265 -339818 -59871 73055 200971 130764 139032
12630 139032 -114624 -88842 244987 157561 38617 222526 165411 -100354 102287 83647
12620 83647 261515 -35214 -55795 378341 41145 -8411 53118 274734 -39229 -24554 192033
12608 272478 95074 31620 -46113 -159217 62803 125071 257765 89251 -49372 32577 -163111
12596 309036 137211 -42898 192725 14416 -366279 254779 -264952 285135 31339 215331
12586 215331 203584 430713 197776 -59125 -96911 73934 29552 105864 -315562 -54354 234432
12574 62418 324960 130855 121378 159950 197486 330456 -52344 162013 50352 -19150 -345580
12563 -345580 -241907 -224281 285584 303294 -118402 -66416 164418 -78576 -56888 48504 70053
12552 70053 117085 269957 -124469 21587 1078 280218 151649 62205 -18901 -10798 278468
12540 16760 -100759 333284 69749 -41427 108868 17945 11666 -89793 -65318 266143 163538
12529 163538 73341 145813 267228 -82713 206738 -26982 -209935 -46897 61042 171885 -132876
12517 -253853 61825 -238531 140095 92931 -105516 -199373 248023 113364 225339 -199348
12506 -182976 -14403 -327 -154040 459203 -205354 -9093 36849 129997 209769 157388 111564
12495 111564 260507 -153220 -14005 -105221 -267230 -7989 427056 333711 -205502 261782
12484 -115771 61175 -345822 -336587 -40113 -51373 47243 3102 328947 -315299 75791 -277686
12472 -157505 -284348 257987 123085 -208917 434715 129711 -200151 -73033 274920 113666
12461 21985 219774 -132915 -157401 -283233 56174 124010 -370667 -152104 -21919 443479
12450 -200194 309500 214264 76614 156721 -6046 163346 188863 -177885 129899 315224 -323858
12438 313797 40529 -152208 344414 84894 364574 -118818 122635 34224 -310799 31685
12427 -49364 -100211 27068 -58901 -117330 199688 71266 -127360 -43372 320443 -244151 36461
12415 -196196 -26427 278337 -121759 153635 -234420 153163 -59179 -108186 -104522 -107719 54153
12403 129149 -264210 84957 -233149 -13634 -66755 240857 -225162 -100883 197701 37722
12392 -399074 55178 53085 105984 -403934 -352577 413270 91435 39510 146817 131078 -127024
12380 85612 -41482 -136679 -384708 38200 140149 -373101 304899 131024 19387 69412 282047
12369 282047 106259 -35838 69440 -115910 -8046 75377 -10982 -35221 -102661 177533 680
12357 -81780 -16146 -361913 64481 -83465 -112790 -218327 164852 -337545 16321 51607 172728
12346 172728 -120253 -76387 344988 -92 -106341 -1006 -66385 114330 117786 9511 279867 -36950
12333 170497 -51644 -13400 -14263 66499 30936 123841 494965 -186405 35376 -112447 -200160
12322 -200160 -28518 251523 70399 29374 -62271 -124624 298245 -133026 58092 -81920 215750
12310 468515 -19173 120037 -257912 86298 -57453 146898 -177630 67405 176912 421236
12300 421236 100729 -180116 -165065 171833 39592 54702 119154 -33529 71954 -80759 -183925
12289 -183925 -99141 -139156 200176 -219543 -88789 334353 380745 -105143 28643 81553 71466
12278 71466 -70020 -225680 253805 23204 -12931 177236 211595 325923 157433 -116946
12267 183347 177629 314759 151526 -126388 62693 306814 21530 275517 -86904 167594
12256 388143 -123432 -59828 442033 230577 -186560 59063 114471 433015 317812 87561
12245 -148264 38108 124489 210727 41069 100069 496257 555448 -134585 3305 247635 16635
12233 -3357 174473 56700 312647 147669 308157 25244 172782 27213 27356 351199 144343
12221 99950 93950 -43656 164265 429752 -23703 176948 245375 197822 275258 64501 96385
12210 96385 -505779 -203749 189363 -48576 156875 384041 259748 -20278 394293 232485
12200 232485 388664 189734 191443 38657 -94982 -29841 300467 39779 6997 106615 139085
12189 139085 277929 154299 89075 -190046 -18174 -120649 86205 -93118 136912 261241
12179 261241 483234 159815 32323 388829 169594 282808 119342 223523 41546 68630
12169 68630 234647 -166683 16970 148283 37514 -47311 -170432 -20345 81330 -17971 36607
12157 -267023 188723 323123 58585 -67301 348728 209250 131007 -61673 -47839 -183802
12147 -183802 420791 -204590 179670 -65848 85743 372647 73386 -9414 69816 -25664 207702
12135 95146 122694 204857 323539 57806 -553001 -103971 66059 -31973 109996 164270 64230
12123 -12294 -170205 64141 -315976 -213176 -121548 413676 -3766 171654 -83538 -153202 248931
12111 -132903 -210141 204750 -83696 115307 -10387 -460146 -316925 21928 152778 -245876
12100 -310341 19141 49696 35795 -1645 192889 22444 -30558 108357 -366613 172874 -336786
12088 127413 144342 -264266 -304272 -143821 43485 -6574 -270090 -9408 -187101 -27765 172292
12076 -8740 250392 1311693 2049912 537112 239886 316720 14772 -58060 -225867 175159
12065 -284660 330927 -201301 145376 -59142 294695 -149115 -357605 49352 32692 38343
12055 38343 92306 -130556 -18519 -267581 -146629 -64715 107637 -232698 109666 74786
12045 74786 -128666 -16277 159695 -131003 318950 159548 -103027 -272866 -249873 162684
12034 330817 110894 235178 118626 -50488 316642 -94576 -12694 -162212 -187281 -294763
12024 -294763 39306 -18564 -1743 -113897 -14551 -24681 -233107 46222 -131056 54083 -37013
12012 -17342 31446 379535 223544 -94169 -17913 -47940 -49863 135425 -194953 -11692 20309
12000 401755 32301 -56101 -159476 -82572 59466 150680 -27493 -102554 -198057 333255 35908
11988 -95615 -157619 -50114 -70127 459081 245276 -128978 -57825 -25220 -490854 30731 167528
11977 167528 93419 8541 -274028 85371 480785 -312473 41677 -13305 428149 -16974 4258
11965 -329295 69851 -135753 -580045 -77399 -8151 20866 291868 -46729 94683 -271897 63990
11953 -150985 255060 -293972 133532 -158 212239 124041 205815 -114164 143318 220656 190098
11942 190098 218155 -122997 91959 145914 86965 130484 206111 -143579 -1152 38669 -82032
11930 -211538 -171339 -45482 70077 -162688 -144788 -271618 88312 52927 -180643 300489 -125122
11918 -30762 79795 59863 78853 -22417 -140391 -293100 188305 188032 -4118 -309034 2891 176035
11906 176035 389629 -8056 -152955 115272 27670 123161 52246 -47755 -34937 315192 74017
11894 149723 86533 -12841 -54979 234187 17246 327062 -129771 -46348 95474 169645 164558
11883 164558 -78907 92595 -87020 -132390 -15008 86255 -44664 76272 26312 -87149 68156
11871 -159113 -166806 40010 -149486 -140861 294972 194764 -122695 209225 -145635 -95601 -174510
11860 -174510 43834 457 -39697 206031 -41204 197879 -164810 256861 -281227 46557 -81630
11848 -191958 185783 153311 -119889 20497 -96992 6463 -427151 137738 262265 -47855 -294385
11837 -294385 -129463 90465 437686 -98480 -59046 -342052 -50684 -44127 -240920 -34692 25793
11825 -201532 -123361 72573 7439 149039 112106 -198501 -25410 -105815 -147958 319441 -132477
11813 -315384 -24715 -60852 218978 -205970 121496 -107452 191347 -189048 -383200 198766
11802 342727 304588 -88903 114505 129944 -4804 -332264 242689 64345 50197 178422 -135185
11790 -175107 199690 -14772 87255 11957 -251530 1735 18592 -13322 11997 86623 382776
11779 382776 -70130 -73857 225242 -202568 -285302 -159331 71501 81090 -9044 199176 -278463
11767 -42336 -429607 242592 99333 64668 66960 270477 103635 78970 -60241 -427207 78460
11755 45464 325972 155600 32756 421002 137113 65888 40960 56923 -175668 -61857 218207
11743 -129086 63588 -314428 -97156 84486 311212 -298177 -170927 184398 -59590 135360
11732 -87610 216556 -4390 130661 33021 -360671 161869 38117 139360 26867 -90688 43962
11720 162502 364608 142316 -55124 200441 -90829 -97203 108400 171604 -155387 -75637 -137073
11709 -137073 -145962 119134 94579 142436 -23540 -250205 -20476 179098 21719 130899 -13465
11697 -216452 208831 -119865 217856 -244227 -211012 -27579 -115014 -171929 341019 15533
11686 183571 -118243 120820 -264076 79552 -7630 233736 319021 7665 106383 -180506 -76737
11674 -104259 237783 -56224 -23265 279067 -190794 -41913 -135423 16597 -129170 -215552 -204177
11663 -204177 -322302 -72791 258931 -195926 251763 -26638 70693 -292667 39225 31909 -73982
11651 -16666 -31193 -205015 -35781 216413 -12216 -148735 -61157 327513 70611 32913 265410
11640 265410 131470 66810 -186817 158327 371484 -152461 124403 -152823 -24205 -98697
11630 -98697 116705 186610 144159 58287 -99122 107390 85323 43085 -4921 -267079 -363872
11619 -363872 109249 404529 -182965 -1463 390115 -61913 410411 224039 10294 179312
11609 179312 258075 133442 19290 129387 -203715 -105173 -151785 146039 -232591 -75064
11598 89627 167931 218266 43890 -75144 319253 -219263 -259152 268915 152444 301961 -28481
11586 428194 7077 30436 99366 37677 -75636 -181054 78954 239919 -245834 64291 189575
11575 189575 234318 -293254 142071 -46947 52271 282938 30565 253274 55319 228611
11565 228611 2953 364370 215270 99283 82386 81099 33317 405592 149871 -80920 440419
11553 -368155 44765 -234393 249341 106225 147276 154822 66618 153812 -211277 -78828 297255
11541 233794 21101 246517 15891 -32417 48397 43072 111473 93312 63453 136112 146118
11530 146118 162359 341679 383270 35218 -14673 287689 384029 303534 -161613 119895 144978
11519 144978 135962 291879 109158 466236 343623 165968 79033 25770 293848 418100
11509 418100 -133639 -114600 34213 401907 -45927 -51534 -128173 58041 160192 -15622 261425
11497 60951 39649 -27768 -45373 105811 -50126 -21836 67202 194675 486871 370068 107086
11485 388669 -111388 273773 104640 51276 41490 59522 79930 70704 -456 -247722 226715
11473 103686 339611 37987 56433 263830 354364 14809 75284 -268083 -62753 140810 159256
11462 159256 237637 138210 212485 155325 144965 96039 -24029 310287 -5485 46268 349382
11451 349382 114135 11190 -246952 233285 443176 109980 124070 258120 309547 96147
11440 -222388 202520 22226 -217264 118652 29478 -17378 119984 -85322 -163421 124907
11429 -21120 -143902 -75585 -140797 -34015 265195 -107889 286300 -465405 113182 180409
11419 180409 -133539 -50798 120900 90474 -121952 288661 213835 -105237 439579 239480
11409 239480 303874 208714 90467 -213785 285791 323657 -4780 -274216 -169008 124285 -70624
11397 24415 173385 -180845 228646 -186704 -51902 -328580 143287 23340 -266505 20572
11386 -35267 3078 -84324 234951 -153638 -193599 47965 216338 -266965 48358 -136348 -277186
11375 -277186 266774 165083 -6847 8419 354175 2408 -77254 -167783 137881 293667 -127324
11363 270054 -252843 87122 250370 -200643 -371338 113495 17705 13047 -49048 98043 237341
11352 237341 199283 31321 -78342 -41489 -70552 124248 52164 98315 -309583 -64649 93892
11340 403033 -219434 -100465 -155016 96916 80463 -7610 -75113 -201689 181474 112815 -264852
11328 -231313 -204192 68363 -92536 392500 91585 -55277 -105043 79775 98209 52358 25469
11316 73836 148618 -177076 89212 -278192 -472556 77583 -22586 -74149 5744 -198347 374466
11304 -389036 -190317 -118394 10296 -250444 -179466 -251702 62531 11233 146140 167405 -97346
11292 -206464 -536410 -106998 13224 -149050 -35340 -75394 26503 -249093 -48510 71071 -215594
11280 106874 -422242 -370360 365033 -95523 121549 225225 -298907 -168322 -126549 121019
11269 192019 -160912 16038 -66256 158336 6078 -107839 34205 -325405 134177 -701 -31310
11258 -31310 113644 -986 -35401 -2245 -167953 183629 -90450 78575 56076 238397 53925
11246 -529121 85610 -121030 -20295 -7306 -191662 -387016 21201 -311606 -24184 30764 54276
11235 54276 48846 42789 -101764 208006 -197559 -217308 178073 -124178 -98448 -139510 145736
11223 21336 233301 -398889 -109989 218595 189663 -28372 -17930 177477 61611 -164474
11212 154366 -159678 -227305 91170 -275008 -183405 -22996 -47274 -87162 -160355 -358724 -116624
11200 -176539 -72664 -139322 -307454 247961 -175645 67362 -155533 -103390 134261 -33117
11189 -87245 130595 -172046 -191561 70425 -425331 -394577 128157 51699 51961 153600 -49242
11177 -50251 -127902 223447 -112392 -169338 -92789 127448 169553 106722 117968 55734 285257
11166 285257 89831 46916 145312 -243451 -168938 -29037 50077 -345615 55000 69227 -190239
11154 11718 355389 205280 -130650 -152816 65184 20319 -13169 160167 117269 234280 -101854
11142 37250 -66111 -46859 254856 310015 5411 230669 262476 -55634 84199 182006 -62659
11130 -36331 58274 169010 -153421 159125 148720 128251 -395926 25602 -72324 -118203 -4225
11118 -71344 96691 -66371 -16163 200972 -8770 150594 -73896 35955 -1920 139113 216634
11107 216634 161266 -399717 267946 18731 212670 -172162 -76948 -83651 75579 289148 -14095
11095 160016 54181 71317 320707 223034 285492 199344 332382 186271 106507 -171794 -40818
11083 44593 6040 -116345 -25523 232357 461641 222987 178126 -8081 75171 382284 224171
11072 224171 117299 155256 171368 146248 264117 648113 436547 451557 -138166 331041
11061 654262 474383 486324 656772 469877 647878 722708 656461 352992 465498 1019859
11051 1019859 249983 859268 869373 310822 1027783 253705 448208 839682 591431 757384
11041 757384 482683 902318 686555 842356 443388 473968 569005 507383 742999 407875
11031 407875 619345 443947 674882 777958 805554 518900 838513 600224 566528 590088
11021 590088 859683 891970 729396 398007 245413 439777 477242 269515 572790 783131
11011 783131 605783 653219 236451 565756 592043 690132 494359 211915 675700 487482
11001 487482 535836 795820 705041 591875 742616 681104 574011 647785 615248 780628
10991 780628 582380 871496 559560 860051 921205 1032839 1010865 914364 946304 1041175
10981 1041175 785009 1061150 1111841 1307455 1487892 1624791 1886456 2540062 2120221 2590041
10971 2590041 2669559 2751504 2658959 2158221 2290933 1740940 1746463 1398455 1379621 1613853
10961 1613853 1764751 1938092 1485169 1690876 1874568 1718868 1698096 1606320 1458690 952527
10951 952527 656163 974572 299292 674231 189916 605587 520598 366976 258724 530049
10941 530049 128459 338332 -65406 -1029 106820 -29942 -229507 112452 201522 31846 339146
10930 339146 138266 32154 4334 67953 125715 -72473 79343 153611 55564 55016 -86195 -2023
10917 318860 -8588 16162 -64753 431342 119517 -57229 -20019 156234 -95497 -208274 -105159
10906 -105159 296098 -81864 49594 -7415 -9098 120384 -194797 -266097 139810 69920 245913
10895 245913 132897 -50645 66257 183314 277055 292762 218654 -518 87711 -196762 -20226
10883 145394 287674 56615 -23477 129899 260755 -245686 4759 -202232 220478 -4139 -125846
10872 -125846 -245696 -100904 146804 -159243 -109833 46952 87075 -205940 -124656 36613
10861 -130172 244818 -36587 -83454 -24668 55067 -269169 115227 -374473 118228 -323319
10850 97281 -168185 120039 68164 -128392 233657 -8081 -86581 161733 78503 -6355 241945
10838 -214132 -53612 -208826 495651 -215193 36222 53781 -236452 92649 10273 29845 -8854
10826 49244 143537 -2211 142128 -101300 16340 -60964 168100 -845 -326998 -214037 93348
10814 -254769 195770 71209 10094 -110612 87606 -3689 -65141 36472 -25307 -88850 5384
10802 175046 -44302 -28903 -325774 88887 -92776 41033 106786 112691 34421 -38050 -218794
10791 -218794 -37550 -40566 -72729 -203648 -101061 219533 -73378 83979 51842 62113 -72186
10779 -288325 3463 -379365 42613 -106963 -221204 468225 -360598 281863 -107749 238985
10768 83362 93596 -123391 -182271 -171937 -219868 382315 75545 -100546 -39699 82989 -67230
10756 -23479 -36552 -232982 -277785 81380 -265505 102057 144196 -2440 -189083 -206467 -17649
10744 -307243 -28545 -27594 -20400 138716 -206471 96681 247296 32339 -82994 -264328 96613
10732 -171680 81207 -100138 78124 -9869 -31988 -159746 -303437 22404 76905 -55112 -113252
10721 -113252 -77525 -336974 -130453 143852 9469 212929 -390739 -77494 27772 -117773
10710 77450 -90256 119742 -165262 86658 68144 -48550 88806 -261145 4886 -265307 42060
10698 170943 55750 -134189 -64283 38449 198711 139917 302300 35081 -146909 -81071 209015
10686 162318 -279235 87273 50616 27070 -40618 -315165 59327 -219178 -56081 204964 111703
10675 111703 210552 184919 186876 -209927 -96234 -60634 -137994 -84591 161382 -237858 -98364
10663 -28901 119709 -120631 287496 145599 105382 -297909 11496 -44574 32878 -267781
10652 -118074 -36063 -184698 47854 -88350 -21693 -63772 -16909 32226 -74908 10049 -75789
10640 279185 -269621 -65312 -375969 134356 -249087 -145074 -192561 -4684 -143785 88888
10629 -88078 110991 -22732 -322962 -29855 -385395 -489200 -166335 -227063 -319626 -161214
10619 -161214 29411 -161642 -15417 56955 -30207 181529 164941 -100532 203617 -400916
10608 -107263 -212952 -134029 263404 -55591 34510 109621 195745 -418878 -32923 -130854 -110690
10597 -110690 -231821 -119032 -281901 -22929 -386164 -109091 -272250 66704 -186697 23339
10586 -301551 -85607 -142411 278986 398574 -123319 168619 103678 -158833 -91603 -61836
10576 -61836 -46391 119583 -89632 -68887 -169764 42823 -95413 -130481 26872 11903 -18669
10564 152167 -15377 128643 -30046 -47732 -3849 -383484 235945 -112846 -28049 -585510 139077
10552 -8143 324510 59890 -194875 -77920 -112878 -22402 -34786 -140906 -188738 141810 -178845
10540 -109570 10579 -25040 -79733 18590 36195 -23189 -21100 -232282 -299120 -225979 -334799
10529 -334799 50250 -85541 287196 -247931 30042 -75572 -359788 -143024 -38982 146198
10518 42237 218892 -26907 -39936 171061 -256704 121162 -240857 42504 266068 -9722 183103
10506 101905 3732 -5293 -52784 -196803 22203 -185554 -121646 -169730 142298 -69100 -153896
10495 -153896 -20683 149604 -213288 -207276 -57057 -137914 -222666 -271873 -114735 273205 401963
10484 401963 421754 432520 725107 522257 584860 176897 82252 351840 6078 36906 31141
10473 31141 131286 -278284 278444 -23381 -31405 12451 -129734 453990 -108917 -46043 151446
10461 -183466 39149 -47523 -51790 -64711 218520 32530 -142397 -48052 -227373 92372 -204118
10449 198857 -322333 -36082 9521 151594 109848 114811 -227218 -217212 -72854 -35673 334364
10437 -192676 -213279 444479 -433866 -333718 -185546 276431 160599 12041 -113794 -157936
10427 -157936 -120503 -12882 -300025 162786 -27187 -23365 86028 221356 20846 269417 -85174
10415 -454851 -219638 -293291 -357625 37629 224062 -141217 216893 -36137 184639 -143703
10404 -203633 123176 -103941 208880 180465 -98188 -163483 218270 144444 147014 -55289 -6051
10392 176413 25351 -82864 350322 99810 -197786 -339991 180538 -65014 -390392 302700
10381 69030 -29378 -94054 249819 168938 297546 -13946 104303 161359 35796 353138 13081
10369 284260 286719 345756 115159 297891 568176 560899 125110 402397 17646 184426 153116
10358 153116 -41057 120726 139280 113546 92467 -11509 196066 365054 963358 426705
10347 189748 335866 118430 125900 99279 650440 388858 -92455 200670 -35699 392991
10336 137367 91282 195071 83197 76037 343870 70906 -129662 35636 176340 -61973 103472
10324 284189 31212 172392 458828 -1247 230064 -47818 -55886 -132906 -249176 203337 -27792
10312 -89697 -40820 143151 -142021 51530 -284637 -132459 19039 14281 93180 391202 -475218
10300 16447 18082 -168706 68163 -107899 -59530 252245 -299984 -108571 168450 82796 222229
10289 222229 -46251 -175465 137134 -33927 203075 -76897 -186634 -257130 4712 98147 10946
10277 12150 -1178 115837 -288752 68730 -148971 28426 -397768 -4463 102319 -143342 -3072
10265 148230 -38264 18471 296222 -350847 236856 375004 254531 656459 429231 421938
10255 421938 376699 -17043 -16878 295478 -299809 19168 -320669 78431 -321450 -118687 -126067
10244 -126067 -100802 162293 -361846 44820 141735 -63527 -185609 -377885 148237 -107809
10233 312482 -262135 -261908 -48543 9181 100671 129592 -128311 312296 -143927 102731 81486
10222 81486 131670 -150859 6278 -394596 -186971 76738 -114584 131352 -57586 -148419 360016
10210 -284374 -121180 -68811 14451 -39881 182614 -305814 -93857 -203519 -24970 -344385
10200 -344385 78154 -100080 3156 -128967 -355347 -129549 89604 -5342 -323068 -90565 83816
10188 105702 -31628 -328786 373034 163139 95217 -261451 -109005 176260 56038 24216
10177 45644 -30719 69470 34508 -158454 -333396 -178929 87104 146466 13678 17950 34611
10166 34611 -122260 -40629 57407 61392 -28135 268846 -81269 -13063 -336854 -66850 -122318
10155 -122318 69776 -26638 116527 -262716 -330356 4587 -168954 -226184 89842 -237362 -137407
10144 -137407 -228987 -362035 -79660 -83868 -247110 212018 -158992 -193245 153229 195617 -162138
10132 616 50436 52911 -33742 158967 90178 -160526 -184402 -178246 -239608 -24499 57006 -124261
10119 112426 -32112 97738 -56852 -351745 -121720 -460776 -135533 35910 35297 -224686 -49265
10107 -173275 -245941 -15674 -301652 114257 15013 -78990 -110571 -343644 -75818 -220238 -32487
10095 -22381 -8329 -42864 -104008 85298 -200961 -133615 111149 149040 -82210 -83694 -135870 -157035
10083 -157035 -182141 24531 -213251 48569 237697 -166860 -64513 -29656 233773 -196327
10072 43083 -78502 -351164 54430 -286200 -182121 28551 -163718 -95747 2486 -144379 77982
10060 -81361 -354473 -289609 -239074 -209971 -13193 89261 -283991 -227069 -60031 40170 182626
10049 182626 -418000 -35698 -9093 -357 315715 -86486 -146935 12289 90374 -339497 -35054
10037 -46078 23269 -155835 293703 32756 90557 2050 59300 -485 -544637 -154803 11079
10025 -28583 183387 -173564 -427671 -183946 133859 -78856 -63850 -240992 -285211 -8239 118912
10013 50112 -453299 111655 172466 -136502 120647 -84271 -145296 -110019 10212 -216190 -126754
10002 -126754 -159059 -168869 -144970 -327680 2268 -179000 293794 150631 130219 182250 86255
9990 -224462 98568 26994 120479 -268036 -148401 -400629 -122787 -99282 -18403 238705 -121916
9978 -168146 -101423 204323 63755 -81341 67065 49775 -86000 -110290 -111698 -168899 -137019 -166203
9966 -166203 4685 -277486 -341892 120030 -292920 144916 -129531 -187657 76255 115962 -283486
9954 -425872 140651 10391 -21657 -240913 -183720 -50688 -100108 -45875 110126 -275841 -402940
9943 -402940 80624 -135899 -90067 153283 -292871 29510 -74750 186700 -264690 -87062 19923
9931 -129768 -243428 -91900 -55943 -131248 -112457 -24196 42876 -328062 -40280 3756 23825
9920 23825 -280350 -76271 138546 63403 50619 -56071 15177 -178374 -191888 60932 -64341
9908 20779 -316569 -210832 266473 15127 61035 -78352 -200711 -430423 -35860 -409810 -279047
9897 -279047 -57657 -124514 -242415 -66587 -97763 -193608 -20567 -525547 121449 -181042 -36827
9885 -73603 40855 -174246 132953 148805 -76991 6344 -145395 -36786 -180972 37850 21539
9874 21539 331916 1462 2684 -36402 -106963 -411662 -89185 -179990 -222865 8505 -373452 96144
9861 -46224 -133829 -75970 48133 -93188 -265440 -68908 -92166 -85700 -174733 -139686 -77491 -269120
9849 -269120 141221 -190753 120167 48077 -259514 -144287 -82997 221191 284892 -126825
9838 -29743 -346198 -139941 -191567 -65318 -195009 -288979 -164191 -56675 21004 -39040 -14316
9826 -319614 -108761 203142 -238448 -319246 -272637 -60521 -172560 -391252 -218298 -176548
9816 -176548 -238242 -102827 -213771 57797 -99914 -6020 99139 -77036 -112024 -226049 -18383
9804 1482 -66397 171673 18615 -221921 -166252 -138378 -10045 193436 139328 -335174 58045
9792 24190 131035 -27701 -188095 -103178 81120 -107043 16308 -124954 -199200 100104 99433
9781 99433 23698 -40450 -306490 -89718 234022 -159556 -123949 20689 -224810 100710 -43086
9769 -279814 -79822 -22848 208228 211252 -152411 -199836 -73699 142611 -134185 -339725 -119304
9757 179192 -63967 -410563 -52404 -168586 -182440 102703 154288 -69558 199918 -84857 39787
9745 -39070 -19058 386828 -232671 -25005 -149543 -47366 18516 99032 -91804 -289466 -257453
9734 -257453 -120215 10503 -108300 -303176 -16536 -55709 -239941 135805 -67582 -19908 -191099
9723 -191099 -83116 -202757 13386 -31985 -155598 -10736 27031 -144845 -1963 203090 -175617
9711 -218506 167093 -27991 -44117 94657 9944 199993 -252612 79068 39220 -54484 11932
9699 225790 -31515 -13544 244969 -174168 138215 -345056 -87631 -64108 -102539 31085 -3310
9687 -181554 -26533 29110 240099 -18533 -55599 -148879 -108497 -100649 -264571 -103185 -175224
9676 -175224 -113720 -147854 -387399 -334301 63802 72691 -211181 -201765 35447 -100047 -324404
9665 -324404 74105 -211070 -106590 -102077 -98439 -170536 -257425 -35471 57371 323333 36790
9653 84465 -200994 49716 -9578 -59595 -277456 -42463 -59700 81707 -95778 -72578 162847
9641 474516 -14152 -350285 -206835 -115898 217827 -139889 -302025 -6364 130404 491973
9631 491973 5888 -235217 -125597 -86258 -29432 69569 -95732 -175247 258875 -128218 -181934
9620 -181934 93677 -44887 -240565 197040 -77375 141484 258217 -122426 -426071 -48585
9609 -54909 77750 -341824 -210743 198761 51477 8725 314630 32664 -264802 102725 -48436
9597 -9016 123390 87011 -103010 -245760 -58925 -292881 -72115 -304094 86130 -84596 -292981
9586 -292981 181529 143491 82573 -76621 -40658 46756 -67743 -171856 -35461 -348266 225929
9574 -176539 58982 -7623 -180557 120031 -115049 -159025 434185 -106306 113135 -35799 -22687
9563 -22687 -13699 209588 350136 -317756 67542 -60538 -67890 -28257 -360213 -88503 20481
9551 -247027 -288392 81923 58596 54494 -181788 70369 190947 2646 96350 127740 -24260 90233
9538 -56145 -182564 5619 466 -134116 -47200 180032 -259420 -101369 -109052 -30398 124883
9526 -192183 -302071 -207831 -126256 -75215 -208107 -175884 -149669 -323699 -18567 -982 9988 -146166
9513 -238672 -165257 -152013 -29668 -113709 -320448 -161939 85530 -135332 93917 -267266 138623
9501 -190844 -287365 -39713 -259662 54482 -246457 -48214 -109485 -116521 214892 -149253 84129
9489 322368 55221 -132803 -51489 51867 -109971 -370189 -58385 118250 -186422 69202 -86574
9477 -155379 -119838 -80717 4733 -296604 57741 -153721 108391 -60300 -171016 -265042 -292360
9466 -292360 -328944 82123 -169024 143633 128106 -72969 -94673 139398 -27948 -198809 -169719
9455 -169719 55419 -214868 151999 17462 -20870 55916 -146109 325945 -184739 -2877 -77721
9444 -77721 -6907 337379 -259698 -207026 -227779 -188800 -142942 -287057 6610 12144 202625 267355
9432 267355 -217793 -206941 -280076 -85103 -98500 -258552 86249 -204530 -268214 -42951 -102448
9421 -102448 -89735 -165181 148499 -407442 -62910 -309856 -89013 42157 65449 -18367 402052
9409 -104246 85839 -4031 22911 -172367 -64725 8053 335794 -143220 -41580 -116692 58905
9397 34310 -105992 73336 21324 -204388 90855 -90464 161125 -71256 -211582 134792 -230063
9385 166278 206773 -254668 107061 -18469 89669 62858 83624 -200752 -28142 11018 30558
9374 30558 -71922 -221137 121907 -195761 102431 202817 239778 42396 172509 -217581
9363 -209231 -190732 119779 126132 -102955 125402 230667 168774 -198136 349508 -159929
9352 -132338 73995 -339909 -170538 -93097 -184739 421 -243164 27191 -187036 -223270 -352572
9341 -352572 339057 274627 -194137 -268342 132155 -195599 -237248 70983 98551 -41478 -179173
9330 -179173 -4396 -74247 -215814 -69579 239293 134885 101218 -131120 198774 -96050 -46167
9318 -195995 100730 -244988 167920 -68874 8071 -458557 -243076 -236758 -53799 -364146 -89499
9306 26901 25451 -238855 -147534 -104318 25162 -57036 140712 26484 240620 -37485 -266978
9295 -266978 190816 65466 -295736 35727 37399 -206556 48929 -196970 -47146 -72119 31788
9283 -441800 -158603 -558690 98949 140257 -31990 331219 -204874 -246622 -168323 64460 193898
9272 193898 -339252 -426100 166763 215231 -162693 250540 -121835 237708 -51594 53458
9261 -98430 -305543 -200221 -402554 -37195 -185918 -24011 -95839 -115600 -240208 -65907 146461
9249 -218472 -24002 -207677 169230 36036 -39459 119898 268044 -225245 -130528 -215327 60343
9237 7485 108742 2071 355941 -43314 8134 -132098 -147251 -42236 -59766 128063 75349 -57602
9224 -106735 -264860 -254683 -280635 21988 -288253 161577 322180 -98306 73940 9018 84032
9213 84032 -103800 -60544 -128248 -300099 -298286 340996 -172813 -135926 91040 68727 -27400
9201 -125407 -138353 -158366 207263 -97651 128863 -35635 -322019 -27630 -176244 129439 -161962
9189 -293259 -207591 159637 -144367 -43745 -77191 -44615 -155326 -234972 -438769 457300 -245127
9177 -416950 -278795 -44399 71165 -279 -115089 -208810 -167205 41954 -131065 -395425 5466
9165 -127704 -4001 239890 57941 -83086 20872 -314894 90277 322954 -153557 197291 74678
9153 223326 -104236 -114842 -226741 65681 -455982 -67165 -315129 -360847 -15461 326878 -38747
9141 -97995 -93120 -114890 213085 -314905 45274 -6512 2095 98079 -209079 413221 12959 104228
9129 104228 -85462 -47619 -78162 -552859 -411152 -169090 342102 -40614 -88495 -91996 -21459
9117 -54014 -159669 -44831 -318745 -123880 297670 2171 -82252 -18643 -54458 -318948 13710
9105 -2783 22872 -219947 -199048 -336515 -164294 -113335 -53888 -229473 275490 -148165 276842
9093 -521813 177645 -10644 221488 201807 215439 116490 -6524 -20890 84814 -183947 108294
9081 -90386 27011 -349873 187945 -278732 147612 149772 -14075 -42876 -299205 -126189 280025
9069 -197723 224080 -244689 126469 58337 -51027 -320553 57745 -274182 -233640 -84073 -65590
9058 -65590 22785 -138996 54184 -232080 190942 -126008 -468735 -32822 8442 -133274 -273537
9047 -273537 -165127 -4484 -6327 92594 13700 -147689 -425904 67346 -69347 -191153 9462
9035 -64366 33503 -19735 -120789 -3406 93049 -78012 -198860 -107111 8170 88134 34060 -290440
9022 -386112 39829 77583 -188045 272619 123571 -88665 21176 -13597 -154405 198578 84445
9010 -191263 -392582 143153 172506 -469934 -174274 8658 -17897 -131424 153392 -209879
8999 -7755 -11414 -139171 115864 -80763 22402 435586 -272171 -4149 -218705 -27779 -46676
8988 -46676 29644 -289436 -222154 54450 47703 -78055 -118006 -277115 61819 12407 69818 -70076
8975 -43968 -81209 -30848 -253302 31960 -124073 -303985 200174 -29650 -64451 -67959 -78373
8964 -78373 -356710 326591 -206680 119237 -92573 -105294 -180823 -183992 96949 104492 -82713
8952 -340284 -83159 155646 -20466 309311 -22687 52746 -53326 -152503 -234224 -39180 -86418
8941 -86418 -60620 9962 -206443 189650 -157358 -28623 66153 285147 34056 128679 -359766
8929 -108612 118301 -242278 45351 391475 279534 715090 1841318 6453777 13198091
8920 13198091 3467804 1106666 353995 60598 336029 97131 78214 -169473 45258 -55483
8909 -115205 112061 544398 169239 95136 303081 -88693 -135281 40529 54043 16882 83022
8898 83022 -228757 -103774 -339780 -466712 -136264 11064 -77362 -7591 -79460 -56460 -10452
8886 -119233 -130672 210294 252919 176759 -386613 -15615 -217868 -78850 -11667 -181376 -201946
8875 -201946 91884 53278 64417 -376962 -315383 -236527 -260017 -103930 -257779 -31960 113793
8863 -62379 -123988 -202255 -19645 30475 -173428 -290262 -64543 2480 -78716 -197571 -191776 3491
8850 235270 -76552 255329 52992 -6107 43742 -11827 -130109 -150307 187409 -99798 42704
8838 384622 -126323 -10813 -74968 -110305 -78897 219675 -12799 -81849 -214825 63303 -169496
8826 -102118 -282399 124829 19233 -188266 65868 -58002 110870 91156 -163485 -223262 -78460
8814 -286690 65962 -285761 50170 -108411 108243 -299232 -137644 196386 10911 -24859
8803 -67536 181011 85285 -153983 137237 126495 -75391 252847 310037 -144888 203319 -45612
8791 -199089 85 95272 -200639 -117667 54305 230342 56386 6706 239688 126410 115887 -294023
8778 100912 -353168 -82526 133305 55133 115770 63022 -65715 -135422 306150 -227530 -156551
8767 -156551 -203592 -160032 94084 32102 -149457 -185834 -134917 -86435 -272754 97051 233142
8756 233142 -120982 -161115 -226179 -128012 57925 157362 -397675 -61983 137934 27522 -216712
8744 -253360 -151214 95929 -96455 -325302 -123831 305811 -7831 85209 125480 204929 -204409
8732 -15816 -310130 -227070 -192190 114735 -82762 -503383 -468032 218885 98712 109534 -306965
8720 -318660 139659 -169866 -288055 -81012 -47961 108869 -196649 -339914 108480 -55093
8709 -41526 -127300 140711 -160453 -301547 195410 23637 16790 16111 -172450 121349 115741
8698 115741 17901 74384 -122682 436798 -233425 9552 -219452 -180396 -139214 -72317 234117
8686 -16666 -289971 -103070 124359 76754 189977 68783 -62051 -53275 -96608 -229864 225895
8674 252968 -74640 60810 -94170 -236427 -99923 59549 6737 -14332 153612 -48242 -124781
8663 -124781 78151 -300858 173117 -154290 -162826 126188 -320270 -1133 -75712 -86804 -159889
8652 -159889 84599 -299899 -191731 41940 -183004 -221444 200259 -39751 39752 61997 -187793
8640 -76776 127730 -306735 -120572 -91318 -33197 -13673 -166977 -41020 61312 -274064 1882
8628 -341014 100845 139607 -64730 -63083 -39389 117890 -1907 -10649 -180788 133730 -125048
8616 74108 -108136 -148069 242130 21717 40951 -148040 -136600 236028 -258015 33325 53107
8605 53107 97456 62954 192876 -113144 -65305 -131685 229257 -218112 -56606 -37897 -368144
8594 -368144 94380 -282294 -56095 54297 169114 -188987 -66639 -279208 -29209 -186186 147914
8582 -275029 -62988 -290970 42121 -51544 -157923 38447 63882 127558 -190809 -281095 164952
8570 -26298 -70205 -144241 -181919 155330 -150766 -38943 -250759 25024 16473 -170066 9391
8558 -338696 -224083 240014 212503 22324 -42467 71587 -93723 206133 -42486 -414200 -28551
8546 73916 286073 190794 2744 -433865 -236885 -50663 -86395 -101999 -239344 81697 -151884
8534 244797 363491 48178 -40664 -258112 -134725 133901 -102657 248645 -380830 -224954
8524 -224954 -297196 -75724 187954 -30452 -33000 66213 -112379 -201018 14536 -130442 286495
8512 62439 -187589 -70468 -381890 279084 323011 -598 -244258 -252580 -334566 -44297 -68054 78978
8499 -97233 80471 215180 33466 -120070 -3351 -120246 -90094 -307835 -138703 -98014 -33365
8487 -5142 -116912 74479 -56782 132988 -313378 -142336 118560 98663 -435080 -342299 -233862
8476 -233862 -84146 184663 -338547 -67721 -283787 167933 281752 -27972 88303 212366
8466 212366 12042 -12600 -96182 -163438 -33995 97312 380196 -19276 -190278 -142643 -191801
8455 -191801 65018 -12245 -260419 -45783 37868 113987 -11405 -199086 -233125 323960 -263361
8443 286148 -381179 -167647 339314 -255345 -219545 -84057 -11943 -105547 -143348 -266647 167622
8431 -139859 -29994 -283708 -217770 -7872 -213966 66366 45504 11241 -19595 -140341 -4252
8419 -387041 -211087 52946 199184 7228 -289909 -194125 284501 -5863 -144856 333763 40763
8407 26402 191437 54457 -141762 137195 -59197 387712 16768 -376762 -111582 -194142 31784
8395 133332 -241029 42164 54776 -178485 9434 -178100 96693 -115554 55827 134032 111613
8384 111613 149842 -120515 1155 -18751 6213 59403 -510981 237968 -77305 381010 -115649
8372 -232259 302459 -66204 -115913 -410743 -131207 -205514 -476133 345686 210491 238870
8362 238870 51396 42704 123042 -170821 -189608 128462 43079 328101 -248402 159844 97159
8351 97159 128917 139823 123241 -161729 311897 280843 -158719 -56064 19419 169404 -249560
8339 159326 -247949 191937 -100610 7447 -4692 66567 -358460 309166 281694 -116276 -161590
8328 -161590 -269167 -518628 238893 31288 -385403 95903 -31615 74433 -20569 164134 12306
8316 25171 244278 -64808 -296444 -178028 -182362 -131921 -200345 -301799 54999 -166230 137470
8304 268532 -355954 -119140 314071 -425494 -330977 43046 40120 -29086 -295703 147390 -9167
8292 -63364 223780 285651 134497 -136887 -28581 -167200 -236297 -147077 219809 -25905 -266624
8281 -266624 -158040 -141217 -63054 -209150 115880 -79396 -76988 -155944 -40228 -364454 -402910
8270 -402910 251617 -124340 85494 79427 -42476 128674 18245 32245 -87618 -115790 -151094
8259 -151094 -193585 -200255 45844 -8777 111070 -415780 -258624 -69725 187226 193720 233696
8248 233696 -175231 -140215 143443 -310250 -583 -227857 12761 -17738 -78699 -302648 -159342
8237 -159342 -500826 -70975 19311 -536661 -242405 3336 -96684 -83784 -225183 -42320 -251202
8226 -251202 -187113 141042 -284675 246291 -218775 60899 -184996 -322803 264236 158852
8216 158852 -75167 -176496 257541 -165751 280965 317389 -407593 -167447 -81571 388514
8205 -224251 -37514 -21020 -93082 -179087 -13146 19375 12297 -110677 270562 64934 -24671
8193 -166403 2736 -185917 -419427 -59823 5973 -107667 -191190 -163854 -407 -6125 248035 175303
8181 175303 148044 -74022 237903 54345 -87201 -203744 -82157 66226 -184235 -182719 -242106
8170 -242106 56202 -25305 -131925 -209104 19846 -12413 -152136 265934 4047 325311 -280047
8158 417101 212539 -30587 -129132 130048 -54230 -58459 32642 -187124 164528 -1047 -6512
8147 -6512 -30228 79050 -92906 -12266 -74797 -98367 106847 -26838 -18381 -102830 126857 -132356
8134 99420 118296 26078 -307555 -18760 -280147 -76789 201917 -121784 -33453 140607 300905
8123 300905 50974 -29549 -98470 -321436 77146 -20639 -66321 47785 -121500 -381241 -244113
8112 -244113 120302 -116899 -23420 -77154 -55191 -5314 -252224 -204149 -75071 8952 -113834
8100 -166350 343278 256506 121794 -106056 -134841 -32192 -292960 -216423 -52514 -424717 45100
8088 -43350 164494 -400291 -73743 -222409 755 -119376 -305341 -4865 195555 -124433 337896
8076 -2915 62882 97267 51907 -243596 -309367 -12684 31194 151136 -182885 159191 -94915
8064 -104177 79394 -46157 48822 -185749 -180268 -24898 -81803 -12656 -58191 233172 144120
8053 144120 -267080 -19085 -105148 -98029 184059 96349 -374910 234616 -119496 -60239 171993
8041 130624 -212707 -148742 285945 72028 -69679 -13830 229875 50056 -182027 8634 31425
8030 31425 171158 -27657 6735 254761 -36408 -173729 -50341 98811 -150145 -59724 -14023
8018 43749 68000 -247487 -109156 54127 -26775 -226375 191512 -2352 235755 -255762 -102266
8006 97681 -233893 -171382 -96158 -139032 -127550 -44525 174337 189801 279187 -222860 12511
7994 -122254 -167114 -41095 124293 281660 220563 -202142 133248 157918 43471 -159877 80439
7982 27862 -15815 -144911 309758 -52844 172787 28202 -207253 -223145 -326886 132354 -80520
7970 -449779 -271951 -21672 57435 57926 -116657 -52354 -238477 -163123 -253635 30001 305681
7959 305681 -94749 54049 -558011 -27459 -38313 33746 -206175 -109175 -102451 18934 86818
7948 86818 -111603 -169550 86860 44844 -216277 -304239 -262766 196211 263837 79559 -34142
7936 17034 175103 36931 114286 -82671 -79052 -120117 30897 109310 200918 -308101 160696
7924 -56846 -115913 206426 -34928 -16748 -67412 -31753 -121596 243610 -173149 193344 -92202
7912 186339 -271710 -268329 -118261 -43587 3222 459427 13492 -41117 -110375 110357 62018
7901 62018 -151416 -237830 -320101 -178404 -171309 22164 -242437 67011 126565 -40482 41339
7889 -160536 -49845 -194754 95541 200858 -175827 183778 -296014 206212 -141469 109816
7878 46234 -84485 -177950 112987 182178 146821 -149666 69167 -288683 -36791 82706 -6045
7866 7426 -22954 61419 -5643 -31490 82770 84633 -103745 -26851 -415304 -140149 -160035 -134933
7854 -134933 179794 -191554 -27867 -347289 -188589 261369 252863 -204530 -118053 138104
7843 -47307 13433 -180501 -257882 60354 -212262 -240061 -153714 -37433 89041 157475 -13420
7831 -115394 -238356 -165488 -88600 294079 -210943 77815 -70369 34247 -124171 -150566 38453
7819 -293642 -141703 140467 -70800 -51279 -294929 -153304 15654 -155061 -290791 238295
7808 165400 -14200 -127378 -206959 242251 -210746 -58923 109206 -25491 26489 68 173921
7797 173921 173696 318937 -209469 -44599 222171 11393 -71433 -284408 203575 -286517 53086
7785 -10825 -222052 -111680 211306 -139313 -101068 -47389 82359 163779 -400248 -347024 -27364
7773 -258297 -106999 -106526 -42316 253595 -31538 47873 229990 14448 115457 -177197 120896
7761 -281432 -296032 -107592 -95151 -88793 -15794 -223786 198855 -68995 324604 42419 336337
7750 336337 -5575 300276 -40310 -167419 -48293 119781 270591 44566 54585 -37077 -15017
7738 6487 -154 40909 -294760 -424529 -14725 31399 32129 -134627 -137769 -5220 -32771 -268046
7726 -268046 158826 14302 9028 145593 -212114 58302 41881 -197431 -28377 112727 188055
7715 188055 113499 -588579 -532812 -83138 -147993 651 204869 62011 43653 140650 -186194
7703 201214 -130454 122191 -349129 -113585 101194 -42189 -221292 144113 232558 -82856
7692 258069 61515 28380 -52361 -53513 -227205 -60037 -130842 -7571 -303876 66060 -345851
7680 -127767 -164180 -196735 -89101 139980 -9484 160434 -276981 120166 118506 -288893 225452
7668 -266845 -344058 -360130 6328 63577 125417 101698 -13962 -321811 -404869 75563 -222496
7656 134196 -38810 -43514 -53738 -48553 -118794 253574 -78866 149798 -201861 -23517 7618 62508
7644 62508 21566 184207 78858 -183247 -215700 80282 -51014 -125814 -150199 -105573 -279647
7633 -279647 -1936 -71679 215207 381811 -82522 -436215 330763 67586 52967 -142694 253141
7621 169354 73248 167005 -152663 -126291 -33273 43242 -138445 85700 161677 -31839 -69991
7610 -69991 338854 8282 -164559 222752 151335 -177935 -29249 -23171 74751 100653 12509
7598 194036 -184999 -157635 65155 -16356 -91633 -119521 -202210 114420 -156506 -298914 -267787
7587 -267787 23714 -35801 522037 212131 176877 33188 -82506 -110303 -301203 85407 -116061
7575 -82508 11955 -92568 56515 55122 -261824 -122127 125458 -185863 4962 -42907 -8781 -73170
7563 -73170 -158585 -82777 221472 77526 -353605 -133497 274679 -310754 -45614 121910 -73166
7551 39457 267768 172881 104424 -16367 -436175 106594 69901 -200870 116834 -199418 117300
7539 -99680 -299991 -52286 -170885 -270967 -61282 364098 -67409 276868 4369 -68869 -7482
7527 80721 -286064 -3024 -364120 -49727 -111869 144978 -61814 125885 -105821 118452 -78285
7515 64447 -118203 -246102 -450110 46491 -16883 -178067 66727 -76812 -46726 -50921 33725
7503 -250545 -202572 -28650 289011 -36402 67351 -9690 276119 184009 141603 -59695 39981
7491 -343664 -179244 33622 33767 24624 -310320 239834 -41227 4689 -69024 83720 -338573 -174892
7479 -174892 -185644 -135944 57651 23528 64904 -213879 328777 -15722 185009 -219977 20980
7467 -53092 -187430 -473424 -23188 -63980 -78997 -85344 33484 -124128 -33651 -222857 246466
7455 52107 -248250 139785 -40314 161248 350173 27960 -110833 -130693 -16652 -490293 111924
7443 5491 -173948 209445 -31300 10073 -125351 -283684 -127568 196217 -224941 11490 -54333
7431 648 -253321 -83604 260675 -23620 -23084 148620 8224 64705 -474971 299766 77046 -72557
7418 -17415 -12245 -37309 -68824 -4655 82823 -162851 165365 23710 144881 65637 124855 -68290
7405 -123513 48231 -196325 -164555 -180282 -67608 23386 38655 -61686 -251213 15482 -141647
7393 106694 -200966 -245081 -341496 -121394 175399 238230 -82781 -264854 -109604 146270
7382 88536 -196887 55781 -95051 -20428 -112380 -237261 -167861 293005 -137279 -373828 -200123
7371 -200123 -204667 23729 68433 -140386 -139219 47559 105501 130422 -564978 -35873 -69198 -74704
7359 -74704 110391 223154 55206 -183474 -73404 87222 154832 66176 -75461 -301880 -137214
7347 -9413 -288194 109363 182824 7531 167041 -5785 208224 -119880 70973 -248869 -64557
7335 -46296 -9261 -112279 58794 -174142 -202798 78891 349468 -143932 -100636 192880 297616
7324 297616 72683 -154530 -253513 193445 -76636 -19377 -343996 237075 43924 -79191 -119396
7313 -119396 -159539 5816 17820 343632 39640 -9399 130722 248508 -100892 115517 -304792
7301 317007 -169800 118522 -30363 -93145 -360165 -5949 -261488 48360 98725 5452 -95434
7289 -70321 4328 -252961 -373877 -122717 -177538 -50578 -130507 146690 -70894 -305603 -188168
7278 -188168 6327 241343 -75665 -2534 -275902 147417 -48377 -504853 50942 -359414 -59942
7266 123156 -5039 98074 -313270 98398 -307897 -97805 18155 15390 -286820 87440 131474
7255 131474 -161153 89534 110787 416 239971 -170718 51932 -40054 133568 5766 -152338
7243 -182540 474017 -84286 -139230 29021 -4436 113052 187554 70562 283930 -160211 9274
7231 -123861 106995 -211574 103377 -175811 -23882 -9286 -220862 -86673 -117587 28017 -181634
7219 -232196 -318542 5835 -82662 -124464 400226 192709 86292 233800 -135904 34097 185333
7208 185333 -264815 311918 14265 -199026 326611 150871 38699 -179580 -118851 -103296
7198 -103296 53957 38392 71267 -126390 -8930 75375 113341 -98261 -204269 -178650 192098
7186 -116499 -26446 136232 -423192 -225340 -60399 -183743 229533 325699 -84890 297943
7175 185437 -120962 -99250 -12611 76569 199927 -369997 84309 34196 91449 -137126 -138300
7164 -138300 -108373 -29255 -187937 -135191 217495 245516 -122149 33188 94024 -200597 -6584
7152 -80705 397539 -191065 83064 263794 -32267 -8749 -289377 -30262 156007 -61232 -109939
7141 -109939 174921 -200695 77708 20760 30460 -77941 -270579 -273491 -36228 144731 -67301
7129 62588 -144821 32425 -197157 -56373 -306268 -86619 -39510 -72032 -173752 21141 -121027
7117 -125642 324950 -25674 399974 -199535 -118432 -138453 -2351 -168232 -218610 103765 38145
7105 -119625 47949 -245684 92944 -69567 -5968 54121 -7303 47627 333758 131629 25211
7093 -430780 169644 10162 187618 -13783 171637 -224751 224106 180396 -58582 -56741 3335
7081 -39512 253088 -113334 -77150 -58764 -146747 -240951 -160439 93468 182620 31849 20942
7070 20942 -3717 51365 230928 -190046 424517 -315256 -172567 57088 139672 152523 -245927
7058 -276744 -17343 57792 -163684 55025 21338 -30125 90249 -57099 -91771 82456 205347
7047 205347 -161221 -139139 3822 -48897 203610 217993 137832 317141 95122 -61070 -195502
7036 -195502 -125525 61339 -121722 -368866 -225686 -139273 38937 -29486 -234729 -9287 236584
7024 171848 93010 81404 244295 -24240 1755 -274353 -66076 122086 -58788 183289 -205285
7012 77135 30032 -5724 -331970 -45432 15011 -34334 1906 -28042 -46465 8063 -44146 10633
6999 -192760 105500 -123825 -63419 -131294 67805 87826 -63369 -111002 -254325 72298 -307312
6987 -38147 32055 140199 21579 -241504 177408 148958 16047 91523 -3512 182783 -120504
6975 34056 -25484 -10866 202846 -67247 -175330 -236559 230232 -55003 1328 19055 156768
6964 156768 -170701 50952 -29487 -11947 -7451 204035 261837 -55173 284262 -39817 -130502
6953 -130502 -43106 310401 330948 22846 -346943 93396 12801 146787 -14729 -299656 63379
6941 -208360 -251106 -151983 -163975 120972 -129841 -59113 -9116 66470 226546 -108002 391993
6929 -71160 124538 -369094 108579 -93577 -130091 -9956 312123 -397776 308511 -213933 -87041
6917 -51036 231484 -289090 -51529 122615 214898 64897 -241139 -54574 -140665 -111563 89685
6905 518 195837 -17820 -26527 223662 -122365 -262393 170773 220444 -172689 -92259 134029
6893 -162125 -268202 -162070 -150019 -143887 -272085 -149037 1573 -76541 -75495 -89061 -228913
6882 -228913 -33584 102564 -14523 63339 -147833 -306119 -102930 -194231 -222402 101139 -112693
6870 -131279 -505032 73083 -185407 111536 -245642 37525 -45264 145320 -223679 35485
6859 -126729 -18869 -186501 138256 -126070 306231 127642 312343 247896 -41713 277341
6848 187033 -38448 347763 -56532 -67736 -5985 -83990 126724 59553 95993 -100057 159505
6836 4652 -62880 -95857 245441 334456 197464 -39976 -129785 120031 -349911 -268653 -17780
6824 -401075 -131566 -2297 282028 113969 -378285 -165074 122265 -19608 63573 101958 -199975
6812 -317502 147557 -272626 -49391 57003 -218982 138512 43446 259476 -373605 -438588
6802 -438588 -48908 -294728 153318 64274 -122830 -133944 63662 -243846 318803 -188084
6791 182501 34877 92034 -140295 -281519 -106608 -97710 -192792 -20303 -120386 -31284 -216411
6780 -216411 64021 179686 -118078 191677 200248 -118228 -132804 -156144 83149 255609 -157593
6768 -177833 174715 185746 -287899 -4822 26401 213843 -249653 87081 -75922 -1526 1099
6756 102700 281834 -37960 82162 89699 108656 158428 394014 42731 -141308 77196 158786
6745 158786 100430 21883 -76646 19971 -73872 -27908 -75183 -129449 39049 -300387 206568
6733 134618 -54277 105554 29498 133523 1338 -142689 110128 156396 309125 225952 -275467
6721 82290 -166365 12774 41864 128408 -149503 24142 282041 -149066 60761 110016 406802
6710 406802 40898 71682 40203 -648953 106840 -177624 101290 -144691 -50942 -49617 -226596
6699 -226596 -288082 125095 60828 -191753 -140721 194032 92661 254850 -148543 -115937 -206231
6688 -206231 -95305 -59474 170725 38858 -376158 -10851 -441199 196577 134788 -297699 105401
6676 -42142 158295 -64455 -76428 -76055 3739 186457 87934 281162 240397 349561 31750 139265
6664 139265 130670 141970 -94270 -89060 -69667 87137 15656 -85474 46126 -242159 123076 -138079
6651 -20460 -129977 -68680 -138868 14429 297942 -106890 -100949 29389 -148511 133851 145905
6640 145905 168000 -291383 -158109 -168593 169389 -170009 77350 -15085 107945 67147 87001
6629 87001 -77223 -130722 -180395 61058 315598 -65899 37931 -207314 -33276 -227621 -113610
6617 -53177 -204584 -78749 -148248 22773 100781 -3092 -48515 -21058 -96463 -284267 -98047 -121403
6605 -121403 -286717 -405954 354308 290529 299912 329054 107321 132468 -125579 -1771 -12084
6594 -12084 -178627 -166084 -14691 -107877 340656 -132460 -406917 -6167 -87339 123642 224533
6583 224533 -18673 128696 -40403 160037 -148385 -81699 -179775 -14889 40288 -148384 -210129
6572 -210129 145122 259900 52161 -266245 -214661 92897 163007 -133063 31036 216191 71279
6560 -180791 72827 -55697 -395602 -5636 -234108 -18895 -628063 192371 146539 22805 -179746
6548 -193451 -138170 258672 -140993 -40535 -130889 -83110 177230 -393784 184189 -90931 -28483
6536 256105 -146593 -48887 -136693 -55119 29100 -104931 21626 -22817 -170640 -370547 -68639
6524 -158753 -301885 -134603 69329 -122632 -341530 185533 6195 -23495 244483 148911 169251
6513 169251 -157602 -115165 -45503 -182007 -60639 -132520 20855 -30526 -321594 -70344 42461
6501 -158900 -23986 48537 -172703 44270 103180 -137460 -106917 58703 197232 131431 37651
6489 40241 35909 -86812 123845 68513 -135565 31393 -148816 -111137 42337 108302 344718
6478 344718 -55600 -111540 -189153 62836 -15272 -52046 -23953 -265340 -194731 137054 211463
6467 211463 -112480 -147859 -260646 -58447 -5784 151125 242989 -205699 99325 -162379 -220080
6456 -220080 334780 -102052 -119892 -305649 116571 64500 -255805 -93629 -18613 119956
6445 97985 134865 -168447 108104 169664 -6335 355758 -104546 75877 -135002 -97074 232210
6433 325028 601 -38421 -259591 96169 107002 -288490 -6726 35079 -178468 -352607 -182197
6422 -182197 -55619 384174 238634 -21544 -121242 -48164 -182540 230665 29962 -440461 253322
6410 -86715 -185299 -9361 261984 35649 223397 61809 -298698 61447 -102443 -100260 -114152
6399 -114152 -179220 -77834 -191224 -251395 -157702 -61695 -102815 96602 -247024 -55727 295071
6387 15078 25420 280091 -47342 -133700 -440425 32494 -102808 -6313 157890 86683 -130305
6375 91342 -135634 62677 194937 228433 375007 125130 220135 156956 112494 -161675 -149023
6364 -149023 -118940 -337899 -118274 82152 -344573 -227112 115984 137273 -233997 7746 330071
6353 330071 368188 -122584 -284562 -40744 56122 -74331 118214 124020 -389223 99216 -16042
6341 -36636 -75633 35647 68930 144970 -295604 65283 -4573 -68796 -99789 147978 82225 141871
6329 141871 293812 54207 -203380 -64575 -209286 -61015 -115522 -232163 -76291 103708 121692
6318 121692 99141 -242616 22238 148305 183614 -181466 85072 -39814 -183314 -320214 353980
6306 73122 218357 243020 59364 120280 130121 261028 -46513 -114129 -113299 -84744 109382 -39113
6293 -313794 -210045 94001 -260627 220344 98042 -54697 77849 151417 -129062 287034 157852
6282 157852 -332894 -76621 -99553 -270667 135816 2659 18007 56148 161381 -322397 -147662
6270 -118929 2291 243640 45919 -11965 25335 -23435 229171 58509 -91907 69374 -190886
6258 -51112 -237929 162144 -58073 -187623 -61760 240081 -110266 45628 275112 -170013
6247 -23425 249825 -219201 91761 -63345 -84080 -136089 101724 94196 371227 8239 -139569
6235 -8833 -126561 -14364 10088 -77855 192665 44203 57208 -34175 -33520 17305 -30821 95342
6222 308700 -71708 18474 46109 79765 -374835 5165 120884 -44418 -134667 61631 -196054
6210 -8074 99938 -84573 -2691 -258933 -7942 -99370 -152209 -141328 -227417 42718 -288561 -42635
6197 -5080 271288 -144808 -321821 -96415 62513 96749 227289 219131 -147875 -275243 37022
6185 18971 -55979 62632 -80840 -400418 -289929 131131 -704 30469 -108700 112532 8129
6173 126709 -227277 189828 -956 310930 -232433 -20115 -42 -277639 -70572 -180656 321930
6161 80613 -8628 234553 -26419 9490 -145757 -130576 -190977 156674 -210144 11039 381517
6150 381517 -77750 -156346 -156372 137878 163104 123299 207839 268391 -137185 -58573 -131439 -159389
6138 -159389 147962 -229836 -186675 81614 166858 -165183 -89300 26917 10440 -195314 259445
6126 266683 119139 50965 -232637 -249362 -93011 249212 -314970 -231467 288643 131076
6115 -318481 -31502 -80110 331818 -328010 303535 12992 208382 -26290 -361178 301170
6104 19031 -114363 -34055 -6348 148277 164567 -201711 99321 -215123 158558 -343171 116785
6092 -135439 -165647 -104340 298168 -194570 70038 -169216 116303 341883 278645 -136303
6081 44101 -187213 -174307 -48325 -56866 153841 99673 179608 193976 222755 91374 188285 93337
6068 -97655 -129482 -106184 -123755 74034 27735 -155729 242812 70062 113378 -20051 -92681
6057 -92681 70020 -290713 -92133 -176901 -90651 -109060 -7952 -282815 161648 324167 132689
6045 436830 92094 -40367 200242 114097 -10550 -130780 160385 27088 -55309 -169359 141873
6033 146408 -282888 -102425 94044 -159327 -34382 99012 -217709 156794 202186 -210463
6022 160102 -184676 -173938 143579 74591 -50912 81209 -5613 -181190 169790 50160 -199309
6010 55733 137444 279849 25051 -10851 296323 -33134 65140 -386647 258562 -257116 7931
5998 -69435 -105585 -84108 -123179 -4329 29780 -148060 -419199 -206543 147086 -206759 -215343
5987 -215343 -2514 169962 30819 -1215 -32480 -80859 -114160 -156522 -106779 -340048 68212 238825
5975 238825 214430 -197921 98595 -122460 408546 3587 33746 33578 -30439 70905 1463 -52730
5962 240452 -149408 190684 -153335 -90566 61390 -364821 149978 -5899 -353059 -7562 -47163
5951 -47163 -175323 -64641 -24455 172659 -360146 -386218 -272626 -427304 42940 136253 -169983
5939 205069 -118929 87065 -233538 69481 200628 127215 -43049 -227750 -176075 128085 307866
5928 307866 -21009 -106973 -86616 -105055 -438 -218858 415176 165460 11630 -275268 155064
5916 282755 325125 194371 -29826 232495 170746 -165436 127590 -176112 349787 -136658
5905 -50587 -149555 155496 4439 -138272 -102337 210494 160241 -72230 22150 157325 28600
5893 156936 332028 -72879 208614 119385 -329810 -69721 346812 31503 -11991 25015 -141455
5881 73456 -225636 -292716 -132584 87793 -110235 99894 -90404 1572 -3167 -131237 175954
5869 -59716 -18527 242780 -167721 -228942 74005 80173 68000 222636 -107383 -227811 -106615
5857 -86980 8512 316929 -174571 -102830 54092 -2144 -156289 -142510 -200071 118160 -175373
5845 108918 -219365 -105375 78061 -165646 15520 251466 74988 84843 -250261 1837 127666
5834 127666 -450 -5918 -180667 114749 -53014 -66133 267709 -7006 185420 -101648 -61143
5823 -61143 -141427 -159892 32300 40511 -98111 203015 77147 259954 85751 27786 215869
5812 215869 1005 37563 -116996 269572 -302860 -109326 273578 49332 -77725 -7716 -74476
5801 -74476 164239 170951 -317905 -345417 -573450 -171777 -181744 -129541 -38623 73958 111159
5790 111159 3943 -464 3152 -216819 -126737 365078 -122745 -72434 248967 -100902 -40178
5778 147 -6198 -136006 -41654 -37421 266725 -244932 -11117 -186944 284698 232971 -3019 17463
5765 -197542 2661 265911 -146253 -128213 -278156 19740 82582 264608 678495 8668 -35346
5753 -818 -114006 145777 -106596 -90166 212094 66334 129183 -159537 -228587 241565 -214774
5741 -16882 359928 184475 32220 -29169 -304444 150824 -91623 -27074 -74850 -211831 -132893
5730 -132893 256825 36109 167386 -259885 -89006 238699 -272399 90601 -106297 -28957
5719 -208435 66947 199989 -175674 -66427 13874 -105264 75021 132621 10759 -60284 -233961
5708 -233961 20849 219827 -346610 -268074 -33633 -246719 23044 -209801 114956 21899 -102978
5696 25707 -104505 -82067 -28458 -119188 265676 -224515 -103515 302706 -418576 -94211 -108421
5685 -108421 -56685 111211 -137118 87384 -296295 191858 71733 394250 -20023 47036 7218
5673 -259836 215860 -94084 242018 70586 264610 8151 -105553 -84057 -278918 60587 -254208
5661 108843 309567 -17249 -71869 49346 -212981 27740 -469145 -25433 79006 -117488 -242314
5650 -242314 -102260 13822 -93927 199865 -37471 124100 60783 -255408 -22106 60087 -22456
5638 239197 113128 56601 -123950 149861 -156250 -2664 -280297 78752 -16467 -208007 -274645
5627 -274645 -396479 -134519 -162891 72951 368091 41042 124079 160074 204654 167288 30140
5615 73801 -169223 242003 65147 121889 290067 -10766 -85598 -70412 89786 236440 32871
5603 -38360 -135286 -95758 235778 -170228 -72086 -155844 443 -244014 -4955 -213328 79968 228563
5591 228563 -127337 -44306 -39801 -139354 51473 8661 -331633 101733 -6403 -27930 165570
5579 -212415 161071 112273 213289 215374 88948 46479 68722 29719 -107322 104886 -213521
5567 -28796 73087 107665 56210 -154247 -110642 334816 1612 -14391 126817 -257928 -49495
5555 103506 -293104 232020 -1437 1955 -124961 146479 -145046 -57717 213378 279422 24912
5543 -116881 177802 68172 241932 -611252 -164224 -74683 -130973 -87567 -98525 -416076 -67012
5531 -82734 -61818 127967 192351 -856 -44486 -319728 11 161714 -46621 -273508 -114458 181112
5518 -310906 -4149 -5716 -71118 -38398 134107 -188975 -87170 196361 -248468 -14438 73016
5506 -31850 519 92855 8518 -15571 174042 23752 61980 -133016 -163290 -32103 -394181 301129
5493 -342026 -65228 34846 103169 23986 361527 -100144 14528 41070 -59549 229121 27244
5481 -51988 -240601 208840 231009 27152 -377543 128673 5942 46628 -65097 -19514 112823
5469 -183814 84149 -36497 155607 311984 177850 136490 -69942 34190 -159912 -313352 -96497
5457 -175440 73456 31304 -185016 59002 104923 66634 -64321 192543 86238 104684 129964
5446 129964 -135153 -192285 112558 -73244 -368034 120617 -6738 120091 -3984 202617 -24400
5434 -358500 212958 -229772 -136163 204158 -150668 132534 258208 17514 151537 240658
5424 240658 195353 -102240 -14133 -62725 217792 -197419 -309416 27876 -172488 -90385 192578
5412 -193241 -290491 -55026 82114 79018 -146379 101926 104570 42042 -57504 -33780 -50805 -60929
5400 -60929 110497 278856 30952 -22097 86 218896 -45969 227374 -134004 -14701 216468
5388 -32946 97828 -35770 -16394 -47726 -128828 -56761 33126 -121416 135123 9064 -53920 -90661
5376 -90661 283058 -63678 131495 -102140 178160 46314 124265 92936 58629 86896 -421583
5364 185062 -71468 -104345 191941 106779 -60104 30462 -36752 -182604 132743 -12404 39885
5352 -225821 204992 429674 94002 -255488 278208 -73996 -81269 -60232 -113028 -147948 -40178
5340 7425 -134920 -25638 90640 -306278 94529 165894 -356565 254724 -125823 152887 271766
5329 271766 59642 134070 133058 33521 148769 -305124 -336094 -382521 166878 -155662 -94867
5318 -94867 -67504 -241240 177195 102190 -9875 -96971 -7541 -25569 101589 53826 -46291 -92968
5306 -92968 23963 34899 -92577 -163428 183787 116281 -207439 39714 3490 -104920 -191341
5295 -191341 -139781 -545841 170426 -119052 56244 -195045 -102366 135475 -169036 49221
5284 -70524 245436 20157 158678 175590 -132949 90633 150991 234066 223643 -309428 -78956
5272 160726 -90325 51847 31255 -97579 -162802 135409 -365036 -44826 120966 -37339 233350
5260 -48428 -167492 11332 66573 66312 -27439 -322257 -386253 -10886 -110776 -113031 231277 -54105
5247 166592 -30431 220558 184872 -186724 -64480 -147179 323614 -49915 86159 11474 99327
5236 99327 -215384 -71307 81297 166159 -109522 346894 -157806 27249 -51246 237461 -108666
5224 84858 -213676 121032 185480 355108 107592 99343 144649 208288 112252 -100254 127081
5212 295189 65383 -159827 119211 113358 -211543 433087 -52951 44820 -80388 -48586 -134240
5201 -134240 -10748 -134577 246826 -16346 -62535 63440 -295811 -109373 -94952 6274 49003
5190 49003 85774 -85680 177683 113326 157765 267044 71769 144803 -102610 173364 201955
5179 201955 -331525 -115071 -14384 -228934 83644 -110758 -197571 -617946 155073 317521
5169 317521 146292 18484 -123004 -104958 263999 156563 -194121 -29055 170084 -74083
5158 30141 -220787 -197393 146874 32434 120695 162708 -81074 168491 -81548 75217 42126
5147 42126 -52274 -134099 91109 -134513 67156 -164660 41483 42626 -2123 -65929 -133996 208351
5134 -330178 -150184 240636 46202 295624 139282 253552 -98813 -28048 76765 -74723 232742
5122 -17624 -19937 -23593 -28243 175192 -171554 -63810 380821 -112169 167297 183611 -384796
5110 -49262 84169 27681 -29105 -517522 94845 -136327 -54062 -373494 175634 -282669 342192
5098 -136072 30147 -5966 -204474 -2113 126138 169917 82719 51294 -279990 -91338 76544
5086 -161552 229101 -110071 240350 -16112 21109 -18733 -404557 -85877 41086 -328272 -159904
5074 69959 -60614 272830 104641 47847 -125665 -59112 -171706 2162 -126192 144860 -121340
5062 171912 2204 319857 -141390 -193844 -27657 -159147 -121825 140799 61391 -32113 -379252
5051 -379252 -47073 -24479 -333269 109774 -337571 -414758 129224 -17263 67216 236863 146023
5040 146023 -38774 -6411 210855 209570 290421 970 -230247 -453111 -55179 180340 158473 -108501
5027 338590 -62118 -315865 -77931 234812 188 436074 -392804 -124706 -118661 31597 -253428
5015 309338 -46843 61765 -283453 20905 219344 74182 -84010 230712 30418 317053 -33217
5003 -203655 290481 -42081 227965 -69096 234558 -53018 -250989 179002 -27126 -203620
4993 -203620 14033 180837 151582 -140227 -210121 112326 156491 -384317 -163155 -101825 89337
4981 249760 -223530 88277 106627 -57418 -186179 -33373 -225923 132346 -310054 265598
4970 171153 -162647 101306 75556 51335 -273909 440876 52033 288222 -116208 -36113
4959 -18429 -75384 100631 120359 -284005 103342 -246971 -185632 57917 316396 -180705 66718
4947 -223044 -152272 -58303 113734 154102 -366492 -127574 -405225 38270 33304 -305867 25625
4935 54103 58525 207958 -101132 -118284 -53480 84897 197908 -472987 -22175 -31091 -7256 -135623
4923 -135623 -29382 61451 -282858 116661 125694 -88940 -319584 -12367 44848 -94737 -198864
4912 -198864 -93766 15031 62580 408200 -59452 10840 202801 64017 -171016 -62405 9677
4900 88949 -36988 -119299 -601665 12481 -85707 -246522 -217535 132005 117925 171501 -198502
4888 156818 392937 -79779 -591 -33924 9017 63463 145416 -53487 59006 76807 287841 -226466
4875 417132 152063 139484 74731 -144717 -232457 -419777 -105046 -261904 75675 90457 -271744
4863 -60804 -406566 -56210 226904 -34629 93332 85053 20427 -5225 170787 -28395 83559 125781
4851 125781 -127875 -168536 -53230 -72793 180783 -110093 57845 -256118 156288 139833 -192191
4839 380145 -52603 -5881 -207085 45 224832 -91337 -365 -201150 -24225 105512 102385 272088
4827 272088 -191322 -17024 83359 -231571 -96804 -84535 -288510 -13643 43993 -42348 -162575
4816 -162575 -190269 58196 3424 58569 -301432 368933 162323 -205267 -97031 -206083 -142209
4805 -142209 356893 -44146 -93901 229693 169917 224000 -129648 25195 -36723 -135627 39341
4793 84913 49788 6517 -124155 8323 283614 -125496 -97192 -58232 -309845 -77001 -105428
4782 -105428 19100 -10499 230191 67620 23320 -191251 -58051 -133535 -287090 -42139 331538
4770 66861 161362 152881 107371 -142412 81403 193490 -291682 177368 445140 -9248 -5227
4759 -5227 213076 -222461 -81410 256945 8247 -5030 14121 -293184 -28757 -101775 -167262 -401413
4747 -401413 -171114 -70071 316385 93354 -70299 -131455 -122336 29836 138332 49448 162327
4736 162327 -57356 -185396 -70061 -34646 191849 96029 -74533 234737 38630 93893 164015
4725 164015 -340511 -158222 -246530 -60419 -1542 150597 157057 -2465 114843 -41739 23068
4713 228472 111379 -119677 14508 63424 58139 29082 -254506 -3714 -54462 227606 42709
4701 67981 25396 102638 75100 -258019 -230903 -169158 110845 85908 -179974 445503 -83862
4689 74351 22153 201860 289816 251202 -81619 -122117 -172311 8170 -205290 267013 -40527
4677 143346 -106666 -220473 -7602 59515 -189339 276536 34796 3194 155370 -9674 37000
4665 190844 147799 -302562 -186174 -69506 101528 -206275 160869 15832 -124815 -142583
4655 -142583 -88546 -182019 -84236 -258029 -52153 -99621 501537 -84794 -125070 375103 209984
4644 209984 -198685 36527 34711 -69858 -34695 -157594 94760 155764 64398 277464 12053
4632 -274197 -197025 248076 -78212 -186905 81868 -48716 112214 -51162 -217132 -264622 344459
4620 125388 2355 -27022 21940 -54448 127423 -62660 -253724 114897 281339 40681 -4686
4608 -146433 -74337 155872 -154394 271827 337039 130082 375055 35147 -181714 200098
4597 108696 148968 112171 209628 159030 280589 -146732 -148989 -83254 -56450 -177905 -56599
4585 92214 60027 92845 77326 -163439 28617 12471 -38417 81267 188766 34411 228244
4574 228244 -241057 90702 -94979 172698 -263913 -101554 61570 68904 -88910 53984 -34072
4562 -113200 440674 -107468 -131648 -27056 50945 462872 237670 184845 36503 -142329 -84562
4551 -84562 -96070 -100684 484907 281883 220407 -291594 -185190 17284 -34888 -301402 -79255
4539 116323 -269673 -198777 -98403 -353833 -61026 227352 -14813 -182957 -494 85863 -196149
4527 -125369 -64521 -93762 56009 86101 36260 245575 -96004 -46 200376 94926 151689 151856
4515 151856 -195601 -215192 -28448 151478 -178732 384851 -133875 -132068 50275 -39862 198476
4503 104035 -169579 -43070 -240046 -143763 -141620 -27550 113280 -96809 -277625 -82838 -62328
4492 -62328 -318495 -94563 129899 -192600 258730 57434 139991 82221 63109 -17751 -134476
4481 -134476 -37362 -148356 -251777 -170756 26211 199606 157830 45316 81629 -394311 -118843
$$ [...]
##END NTUPLES=NMR SPECTRUM
##END=
