
##TITLE=AC1171_Tolima-ibage-TiCOAH12008_7165761_UmsBb4bDfb
##JCAMPDX= 6.0         $$ Bruker NMR JCAMP-DX V2.0
##DATA TYPE= NMR SPECTRUM
##DATA CLASS= NTUPLES
##ORIGIN= BRUKER
##OWNER= Administrator
$$ 1.72 TOPSPIN		Version 2.1
$$ 2012-12-02 00:16:44.923 -0500  Administrator@X
$$ Compression mode = diff/dup
##.OBSERVE FREQUENCY= 400.02188249412
##.OBSERVE NUCLEUS= ^1H
##.ACQUISITION MODE= SIMULTANEOUS (DQD)
##.ACQUISITION SCHEME= undefined
##.AVERAGES= 8
##.DIGITISER RES= 22
##SPECTROMETER/DATA SYSTEM= spect
##.PULSE SEQUENCE= zg30
##.SOLVENT NAME= COFFEE_meoh
##.SHIFT REFERENCE= INTERNAL, COFFEE_meoh, 1, 14.98509
##AUDIT TRAIL= $$ (NUMBER, WHEN, WHO, WHERE, PROCESS, VERSION, WHAT)
$$ ##TITLE= Audit trail, TOPSPIN		Version 2.1
$$ ##JCAMPDX= 5.01
$$ ##ORIGIN= Bruker BioSpin GmbH
$$ ##OWNER= Administrator
$$ $$ E:\/data/COFFEE/nmr/AC1171_Tolima-ibage-TiCOAH12008_7165761_UmsBb4bDfb/10/pdata/1/auditp.txt
$$ ##AUDIT TRAIL=  $$ (NUMBER, WHEN, WHO, WHERE, PROCESS, VERSION, WHAT)
(   1,<2012-12-02 00:16:36.673 -0500>,<Administrator>,<X>,<go>,<TOPSPIN 2.1>,
      <created by zg
	started at 2012-12-02 00:15:30.251 -0500,
	POWCHK enabled, PULCHK disabled,
       configuration hash MD5:
       86 BA 57 50 F2 9D 5C 9B 26 00 A9 28 5F 66 2E 89
       data hash MD5: 64K
       F4 7A DD 45 A5 1B 9D 36 08 05 1D F6 E6 43 18 7A>)
(   2,<2012-12-02 00:16:39.798 -0500>,<Administrator>,<X>,<proc1d>,<TOPSPIN 2.1>,
      <Start of raw data processing
       efp LB = 0 FT_mod = 6 PKNL = 1 PHC0 = 0 PHC1 = 0 SI = 32K 
       data hash MD5: 32K
       B8 AA 68 91 AE 74 F0 C3 51 F4 8C 2E 6C C9 CC 63>)
(   3,<2012-12-02 00:16:40.282 -0500>,<Administrator>,<X>,<proc1d>,<TOPSPIN 2.1>,
      <pk PHC0 = 99.08569 PHC1 = 0 
       data hash MD5: 32K
       D3 12 4A 9D 9D 39 E5 58 6C C5 A9 AB C3 49 A8 F0>)
(   4,<2012-12-02 00:16:40.517 -0500>,<Administrator>,<X>,<proc1d>,<TOPSPIN 2.1>,
      <abs ABSG = 1 
       data hash MD5: 32K
       72 54 FB 5D 99 1F 90 56 FA C3 F4 CD DE EB 3A 09>)
(   5,<2012-12-02 00:16:40.673 -0500>,<Administrator>,<X>,<proc1d>,<TOPSPIN 2.1>,
      <abs ABSG = 2 
       data hash MD5: 32K
       6E CA 1F C0 6A 34 02 E8 CB A9 5B 6E 32 9A F2 B0>)
(   6,<2012-12-02 00:16:40.814 -0500>,<Administrator>,<X>,<proc1d>,<TOPSPIN 2.1>,
      <abs ABSG = 3 
       data hash MD5: 32K
       0D 66 48 DD 90 60 4A AD 92 79 B8 AF BB BD 62 F7>)
(   7,<2012-12-02 00:16:40.986 -0500>,<Administrator>,<X>,<proc1d>,<TOPSPIN 2.1>,
      <abs ABSG = 4 
       data hash MD5: 32K
       6A A5 69 BA 38 9B A0 5F 98 61 5E 5B 3A D5 6C A4>)
(   8,<2012-12-02 00:16:41.126 -0500>,<Administrator>,<X>,<proc1d>,<TOPSPIN 2.1>,
      <abs ABSG = 5 
       data hash MD5: 32K
       5A AE BF 36 6C 39 68 39 7F 38 BC 1D 6D 45 9D 7E>)
$$ ##END=
$$ 
$$ $$ hash MD5
$$ $$ 6F 99 F2 C3 3F B8 A6 7D CB 12 EC 3D 6B 47 00 2D
##$RELAX= 
##$RELAX= 
##$RELAX= 
##$RELAX= 
##$RELAX= 
##$RELAX= 
##$RELAX= 
$$ Bruker specific parameters
$$ --------------------------
##$DU= <E:\>
##$EXPNO= 10
$$ [...]
150 150 150 150 150 150 150 150
##$TP07= 0
##$TPNAME0= <>
##$TPNAME1= <>
##$TPNAME2= <>
##$TPNAME3= <>
##$TPNAME4= <>
##$TPNAME5= <>
##$TPNAME6= <>
##$TPNAME7= <>
##$TPOAL= (0..7)
0.5 0.5 0.5 0.5 0.5 0.5 0.5 0.5
##$TPOFFS= (0..7)
0 0 0 0 0 0 0 0
##$TUNHIN= 0
##$TUNHOUT= 0
##$TUNXOUT= 0
##$USERA1= <user>
##$USERA2= <user>
##$USERA3= <user>
##$USERA4= <user>
##$USERA5= <user>
##$V9= 5
##$VALIST= <valist>
##$VCLIST= <CCCCCCCCCCCCCCC>
##$VD= 0
##$VDLIST= <DDDDDDDDDDDDDDD>
##$VPLIST= <PPPPPPPPPPPPPPP>
##$VTLIST= <TTTTTTTTTTTTTTT>
##$WBST= 1024
##$WBSW= 4
##$XGAIN= (0..3)
0 0 0 0
##$XL= 0
##$YL= 0
##$YMAX_a= 661297
##$YMIN_a= -558220
##$ZGOPTNS= <>
##$ZL1= 120
##$ZL2= 120
##$ZL3= 120
##$ZL4= 120
##$ABSF1= 14.98509
##$ABSF2= -5.573092
##$ABSG= 5
##$ABSL= 3
##$ALPHA= 0
##$AQORDER= 0
##$ASSFAC= 0
##$ASSFACI= 0
##$ASSFACX= 0
##$ASSWID= 0
##$AUNMP= <proc_prof1d_extract_pilot.lims>
##$AXLEFT= 0
##$AXNAME= <>
##$AXNUC= <1H>
##$AXRIGHT= 0
##$AXTYPE= 0
##$AXUNIT= <>
##$AZFE= 0.1
##$AZFW= 0.1
##$BCFW= 0
##$BC_mod= 0
##$BYTORDP= 0
##$COROFFS= 0
##$CY= 15
##$DATMOD= 1
##$DC= 0
##$DFILT= <>
##$DTYPP= 0
##$F1P= 0
##$F2P= 0
##$FCOR= 0.5
##$FTSIZE= 32768
##$FT_mod= 6
##$GAMMA= 0
##$GB= 0
##$INTBC= 1
##$INTSCL= 1
##$ISEN= 128
##$LB= 0
##$LEV0= 0
##$LPBIN= 0
##$MAXI= 10000
##$MC2= 0
##$MEAN= 0
##$ME_mod= 0
##$MI= 0
##$NCOEF= 0
##$NC_proc= -8
##$NLEV= 6
##$NOISF1= 0
##$NOISF2= 0
##$NSP= 0
##$NTH_PI= 0
##$NZP= 0
##$OFFSET= 14.98509
##$PC= 1
##$PHC0= 99.08569
##$PHC1= 0
##$PH_mod= 1
##$PKNL= yes
##$PPARMOD= 0
##$PPDIAG= 0
##$PPIPTYP= 0
##$PPMPNUM= 2147483647
##$PPRESOL= 1
##$PSCAL= 4
##$PSIGN= 0
##$PYNMP= <proc.py>
##$REVERSE= no
##$SF= 400.02
##$SI= 32768
##$SIGF1= 0
##$SIGF2= 0
##$SINO= 400
##$SIOLD= 32768
##$SPECTYP= <>
##$SREGLST= <1H.CDCl3>
##$SSB= 0
##$STSI= 32768
##$STSR= 0
##$SW_p= 8223.68421052631
##$SYMM= 0
##$S_DEV= 0
##$TDeff= 65536
##$TDoff= 0
##$TI= <>
##$TILT= no
##$TM1= 0
##$TM2= 0
##$TOPLEV= 0
##$USERP1= <user>
##$USERP2= <user>
##$USERP3= <user>
##$USERP4= <user>
##$USERP5= <user>
##$WDW= 1
##$XDIM= 32768
##$YMAX_p= 468976662
##$YMIN_p= -766439
##$CURPLOT= <Network HP LaserJet P1505>
##$CURPRIN= <$Network HP LaserJet P1505>
##$DFORMAT= <normdp>
##$LAYOUT= <+/1D_H.xwp>
##$LFORMAT= <normlp>
##$PFORMAT= <normpl>
##$SURQMSG= 1
$$ End of Bruker specific parameters
$$ ---------------------------------
##NTUPLES= NMR SPECTRUM
##VAR_NAME=  FREQUENCY,     SPECTRUM/REAL,   SPECTRUM/IMAG
##SYMBOL=    X,             R,               I
##VAR_TYPE=  INDEPENDENT,   DEPENDENT,       DEPENDENT
##VAR_FORM=  AFFN,          ASDF,            ASDF
##VAR_DIM=   32768,         32768,           32768
##UNITS=     HZ,            ARBITRARY UNITS, ARBITRARY UNITS
##FACTOR=    0.250966925370066, 1,           1
##FIRST=     8223.43324360094, -128780,      -136102
##LAST=      0,             119156,          -65332
##MIN=       0,             -766439,         0
##MAX=       8223.43324360094, 468976662,    0
$$ Real data points
##PAGE= N=1
##DATA TABLE= (X++(R..R)), XYDATA
$$ [...]
19492a90921c4558k37665q8433J43638c0519j2601k58240A09898a43058C9933
19481C6573L34170a02183k91946a2190B43074c45760B38137a7612j36140i947
19470F0784d57859a12363A33236B4815b42837E6280g4751j19958H7914l5211h9828
19458A68343a76956A68943b58221h4594j99205A16015O1848a56133C1730O9898
19448A01628b50865J08578m2775J9647I6017a60683g5710k43907a05659p8942
19438a84601l4649h5118o618n01361i4359E3318a57339d5800p2350F1577B2857
19426a35308K5435c0903m6676l32656B08196o4611a72910l39608K40942J22189
19416a49387A8192c4652m31908K20004I7093h043j5548E5232a01312A79421Q8524
$$ y = [-190921, -34558, -272223, -360656, -217018, -30519, -43120, -301360, 109898, -143058, 39933, 36573, 370743, -102183, -394129, -12190, 243074, -345760, 238137, -17612, -153752, -9947, 60784, -457859, -112363, 133236, 24815, -242837, 56280, -74751, -194709, 87914, 52703, -89828, 168343, -176956, 168943, -258221, -84594, -283799, 116015, 177863, -156133, 31730, 101628, -250865, -142287, -185062, -165415, 96017, -160683, -75710, -319617, -105659, -184601, -219250, -85118, -91736, -593097, -94359, 53318, -157339, -45800, -118150, 61577, 22857, -135308, -109873, -30903, -77579, -410235, 208196, 143585, -172910, -512518, -271576, -149387, 18192, -34652, -466560, -246556, 97093, -8043, -23591, 55232, -101312, 179421, 267945]
19405B67945d33925B24349A07022n2731A3539a74579P3510k2525j97232A16J50880
19394A50996L2269b63596J02503J5105j22352J17540A36009a42240j81698h842
19383c35672I9087C4709a32255E0272D729K59111b54746A68883H4016a77346j13347
19372b90693h7108L8917l8583E7275e39k04317j20724I4165b01470A11417b29151
19360H6845N287a3489D5604b77043n0147a5387k00821B94905A1658d9782j15025
19349a64807j01355P3581D22b72796M0787e7872n5289J8876I9375L4571j5994
19338A17952g0432L473n4501e8812j00445A44059a98850j22519F6029c00136a48483
19326h9927A24744a09281m22654a06387k0683G1190c36447A49680K1105a39401
$$ y = [267945, -433925, 224349, 107022, 54291, 13539, -174579, -101069, -123594, -320826, 116, 150996, 183265, -263596, -161093, -145988, -268340, -150800, 136009, -142240, -323938, -8842, -335672, 99087, 34709, -132255, 50272, 4729, 263840, -254746, 168883, 84016, -177346, -290693, -87108, -48191, -86774, 57275, -539, -204856, -325580, 94165, -201470, 111417, -229151, 86845, 92132, -13489, 45604, -277043, -327190, -15387, -216208, 294905, 11658, -49782, -164807, -266162, -192581, 422, -272796, -232009, -57872, -113161, -94285, 99375, 133946, 117952, -70432, -66959, -121460, -58812, -159257, 144059, -198850, -321369, 66029, -300136, -148483, -89927, 124744, -109281, -531935, -106387, -127070, 71190, -336447, 149680, 170785, -139401]
19315a24807k6109J6139l72451C7447c84752H262h2600C0748j717f6887k28228
19304b95115A8751b24888L883c1953k80124J02777d0467G1138a02070B8402b96932
19292a24789A54281b1442k05549i0754C33920C7000a98516a6266l57441f2729
19281a30385m6490k77404A72371a81965B41700r3499f0969F545L2394a11040k1631
19270a32671B5746J58343e8260j59961A6467P0376C387a40558D6286a92799k84130
19259d76929A47203a61579a4557j14394B0810a69408l8381A28181E1930a49130
19248e5663A29762d7447q6726c7155k25191c1079j37360f7431E1979b42109A56870
19236B03303h5707b3446B59501a43589k36760J30597p9901g2509B23547i5532
$$ y = [-124807, -150916, -134777, -507228, 37447, -384752, 8262, -82600, 30748, 29031, -66887, -295115, 18751, -224888, -221005, -31953, -312077, -209300, -40467, 71138, -102070, 28402, -296932, -124789, 154281, -21442, -226991, -90754, 333920, 37000, -198516, -16266, -373707, -62729, -130385, -176875, -454279, 172371, -181965, 241700, 148201, -60969, 6545, 38939, -111040, -132671, 25746, 184089, -58260, -218221, 16467, 86843, 3387, -140558, 46286, -192799, -476929, 147203, -161579, -14557, -128951, 20810, -169408, -207789, 128181, 51930, -149130, -55663, 129762, -47447, -134173, -37155, -262346, -31079, -168439, -67431, 51979, -242109, 156870, 203303, -85707, -23446, 259501, -143589, -380349, -249752, -329653, -72509, 223547, -95532]
19225a36674A51335E7756c6309A82437a2488B68057a74025g0956l5582N238r4104
19214a95404N4732K9923o7473D2319J37186a14850K3986B41128a22367L1537o173
19203i7003K1830q3645H0663d16852B24755a98082i0578G906b12438q4282K8798
19192b67922A30584B6769J00923d9850j28537P2415k7181I8572i6072k17528e8527
19180d24465A17069P2935a59734C9172P4845c9667C7710i7532O493j52550B22978
19168h4847J8137q266I2461c63583e1617j99158F7381a28521K2327B60344a08990
19156A44369g8044A25106b62124J11402f5576q269j11904D1211a83726C1830a90321
19144A72156a39494A62100e9559j74244f0969B1783a20865J2321A2041b95341
$$ y = [-136674, 151335, 57756, -36309, 182437, -12488, 268057, -174025, -70956, -106538, -101300, -195404, -140672, -110749, -178222, 42319, 179505, -114850, -90864, 241128, -122367, -90830, -97003, -75173, -158818, 80663, -416852, 224755, -198082, -90578, 7906, -212438, -296720, -267922, 130584, 26769, 127692, -49850, -178387, -105972, -133153, 98572, -96072, -313600, -58527, -424465, 117069, 190004, -159734, 39172, 114017, -39667, 37710, -97532, -91039, -243589, 222978, -84847, -66710, -74976, 92461, -363583, -51617, -250775, 67381, -128521, -106194, 260344, -108990, 144369, -78044, 125106, -262124, -150722, -65576, -73845, -185749, 41211, -183726, 31830, -190321, 172156, -139494, 162100, -59559, -233803, -60969, 21783, -120865, -108544, 12041, -295341]
19133a56619C8507b71768A04810k0899a73382A3144L0109d27512I342J93333Q342
19122B11017b28445F4929M1292c7390p4031j42809k0458D75790a43217b7225E6991
19110A21595g635F2596b16094K7552A3297L34362b08186H4689K92269A51277a57553
19098g9269F3377c70942K1585D8011a05162j99420J46346A09012m9913b26661
19087c4437j02284j62700A31547b0314B11806d74856d4868B07921G306i3524m7535
19076a41059A53600e5655j33597G9727c16988b202l2280B16546J93326D1902A5986
19064b04227p0711J31253R96A2451a46087C28178j09735b06421A51623n6816J69707
19053B64514A03871a18066j00568l1981d066k85443a43127A18929d12511A3799
$$ y = [-156619, 38507, -271768, 104810, 83911, -173382, 13144, 43253, -427512, 9342, 202675, 211017, -228445, 64929, 106221, -37390, -111421, -254230, -274688, 475790, -143217, -27225, 56991, 121595, -7635, 62596, -216094, -188542, 13297, 347659, -208186, 84689, 376958, 151277, -157553, -79269, 63377, -370942, -349357, 48011, -105162, -304582, -158236, 109012, 59099, -226661, -34437, -136721, -299421, 131547, -20314, 211806, -474856, -44868, 207921, 7306, -93524, -141059, 153600, -55655, -189252, 79727, -316988, -2202, -34482, 216546, 409872, 41902, 15986, -204227, -274938, -143685, -142689, 12451, -146087, 328178, 218443, -206421, 151623, 94807, 264514, 103871, -118066, -218634, -250615, -4066, -289509, -143127, 118929, -412511, 13799]
19042F6445k4643d34443a32038j56953A40199a37071k2B36645a77203M8473A10522
19030D6023c5515A5376i545k1423A122L01160J9534b03096j5913A45832f21j02761
19018a03382A92415F5238A813K78058j27593a05258K5117b1412l59230D6825o652
19007D0173K53301a76330F3591k6733c3442B21956f7164r8219k69998B1668c3852
18995a29063B26997e8989J219I409h9917m5438n7125L5196f6682k58604B3728
18983b59298a29016L3692J7570p3362E6399a31189B1956J08071i5459j53735A17757
18971B09318J74407k8577K66478B2962R6363B1997g1575F2180a57301k7786A63476
18959c2639o2164A24355b36425j12031N0879A20443e3082r9566L7561H1479j3109
$$ y = [66445, 41802, -434443, -132038, -288991, 140199, -137071, -137093, 236645, -177203, -128730, 110522, 46023, -35515, 15376, -9545, -30968, 1122, 302282, 321816, -203096, -219009, 145832, -621, -103382, 192415, 65238, 1813, 279871, 152278, -105258, -80141, -21412, -380642, 46825, 40173, 293474, -176330, 63591, 36858, -33442, 221956, -67164, -165383, -435381, 21668, -33852, -129063, 226997, -58989, -57770, 9409, -89917, -135355, -192480, -157284, -66682, -325286, 23728, -259298, -129016, -95324, -77754, -151116, 56399, -131189, 21956, 130027, -95459, -249194, 117757, 209318, 383725, 355148, 621626, 22962, 119325, 21997, -71575, 62180, -157301, -185087, 163476, -32639, -94803, 124355, -236425, -348456, -297577, 120443, -53082, -152648, -115087, 81479, 68370]
18948F8370b98635d5629q0054j66595g3912i826I97a75567O7783C1121K3659D195
18935i324M650A27830L965a55313M9586j7238C19439a19385I5041R7701C0971
18923A92004b28138f3371o5548A49179c65222C7052K00287A18540a46066G3952
18912b11177B86820b29940G9787R8866K48177K07920r7078j34616A40027a93422
18901b01763k604H4162i8306H6330d2990H9254a6063B7545c54614P3035a5287
18889B02893j0488P8020i4578r7591d3220j66225A40128K4667a30485l100d1704
18877I0347c76624i9932i459j01051L2622J8047m5258r121k20821h9366j21854
18866b11220h5281l00333H3608j8222b10956O4259H6071J49502c6518j5209j77368
$$ y = [68370, -298635, -45629, -125683, -292278, -73912, -9826, 997, -175567, -107784, 31121, 54780, 4195, -9324, -4674, 127830, 131795, -155313, -105727, -122965, 319439, -119385, 95041, 192742, 30971, 192004, -228138, -63371, -128919, 149179, -365222, 37052, 237339, 118540, -146066, 73952, -211177, 286820, -229940, 79787, 178653, 426830, 634750, 537672, 403056, 140027, -193422, -201763, -204367, 84162, -98306, 86330, -42990, 89254, -16063, 27545, -354614, -281579, -15287, 202893, 192405, 270425, -94578, -192169, -43220, -209445, 140128, 164795, -130485, -133585, -41704, 90347, -376624, -99932, -9459, -110510, -77888, -59841, -105099, -114220, -335041, -89366, -211220, -85281, -385614, 83608, 65386, -210956, -146697, 86071, 235573, -36518, -51727, -229095]
18855b29095B9455c881A17086j2956C3073b34790B6252P9980K5172m8263C2733
18843a2231k1956f379j49029a1268C6734b48683i2629H6347Q4720a83809L0186
18832a53623C98205p4532I9773g4726G0385b60803Q7802j32312A51736a53874
18821A44213b43817c8173J4488k00419j670B38812A13433j2467b04738j51575
18811c56313C04199a74142B31289B9748O3266d787B530b21751G6567g7281I957
18799b64546B62228H0449c6680D9808a1395A93323i7689j19370C6589g9357A86579
18787a41446j4999p1925d5421k45745B83368b68526B71922C8642J33296F7992
18776C06076a27210F5314a63903j23004j0280d4275F6177b36014a05004p1465
$$ y = [-229095, 29455, -3881, 117086, 104130, 33073, -234790, 26252, 106232, 131404, 83141, 32733, -12231, -34187, -6379, -155408, -11268, 36734, -248683, -92629, 86347, 171067, -183809, -153623, 398205, 323673, 99773, -74726, 70385, -260803, -173001, -305313, 151736, -153874, 144213, -243817, -38173, -23685, -224104, -225774, 238812, 113433, 100966, -204738, -356313, 304199, -174142, 231289, 29748, 93014, -4787, 2530, -221751, 76567, -77281, 9957, -264546, 262228, 80449, -36680, 49808, -11395, 193323, -97689, -217059, 36589, -79357, 186579, -141446, -156445, -228370, -45421, -291166, 283368, -268526, 271922, 38642, 171938, 67992, 306076, -127210, 65314, -163903, -286907, -297187, -44275, 66177, -236014, -105004, -176469]
18766a76469O5387B34118e0346l79023I1137c3378G4038g4957J5304A22861E4698
18754f2194Q986j00370o5835j71719a54027k80843J74561k97856g6756B73150
18743c00989B64051a2130C94360j89540b38585m2890C02798b83330C0873e7857
18732I1484c80753g0613j8292l43284b05582H170M5706d11768K6091a05356A14471
18720c04566F5735c93405a19723j15147h4348A87831b05488A00093d67130D7845
18709E3740b75866a28421e2984k6963D6510A6886J61086E5498B3711b07831a2630
18697h4065L1511j4503A26085d32917a11320b7641j2459B26314I450g1012j6045
18686h7057A43576b0112n8137A25234a67071l4155H6092b44905g2310h004A32242
$$ y = [-176469, -111082, 234118, -50346, -429369, 91137, -33378, 74038, -74957, -59653, 122861, 54698, -62194, -53208, -153578, -219413, -391132, -154027, -434870, -260309, -558165, -76756, 273150, -300989, 264051, -12130, 394360, 204820, -238585, -281475, 302798, -283330, 30873, -57857, 91484, -380753, -70613, -88905, -432189, -205582, 8170, 53876, -411768, -385677, -105356, 114471, -304566, 65735, -393405, -119723, -234870, -84348, 187831, -205488, 100093, -467130, 47845, 53740, -275866, -128421, -52984, -79947, 46510, 16886, 177972, 55498, 23711, -207831, -12630, -84065, -52554, -67057, 126085, -432917, -111320, -27641, -40100, 226314, 9450, -71012, -87057, 143576, -20112, -78249, 125234, -167071, -201226, 86092, -244905, -72310, -8004, 132242]
18674b6771j92592P8962l3368i921k7999j75080b4853I9452a25167j04193C6610
18662e7386H138a8626j25476C04654E0238a11491m0985d8839r7720M5081B73728
18650A38922A8821c2319N893D4578d38226a40900N9939D8604P6407n5093h3401
18638b84449a12895B2307O8655b77325B64874C2584Q9492e2677A9319a61510k36112
18627c97622E6526b27657M1542m7414B59005a69236A77338a35832k02864h6175
18616a32758m3142A44358b21973k530l3318g0206j540k69254A12191a78522g5051
18604c1612A52957b5720k77561m6392M1951A20001d0858G779d1370k05396B80573
18592a69340A59412a6841a558l02623C28856a9851j20734l723A03293a67783C36701
$$ y = [-26771, -219363, -140401, -173769, -9921, -37920, -213000, -24853, 99452, -125167, -229360, 36610, -57386, 8138, -18626, -144102, 304654, 50238, -111491, -152476, -48839, -146559, -101478, 273728, 138922, 18821, -32319, -26426, 44578, -438226, -140900, -80961, 48604, 125011, 69918, -83401, -284449, -112895, 22307, 90962, -277325, 264874, 32584, 122076, -52677, 19319, -161510, -397622, 56526, -227657, -186115, -233529, 259005, -169236, 177338, -135832, -338696, -86175, -132758, -175900, 144358, -221973, -224503, -257821, -70206, -71746, -341000, 112191, -178522, -75051, -31612, 152957, -25720, -303281, -349673, -307722, 120001, -40858, 7779, -41370, -246766, 280573, -169340, 159412, -16841, -1558, -304181, 328856, -19851, -140585, -144308, 103293, -167783, 336701]
18580A52145h9193j35114g2827j92596j2002N3189B07092b69489K9582b5125j72944
18569a98069A91827k1220q2683g3727j77188K9396H7573b26710j3391b9964m56528
18558d86492a07430k24270H6578b84879j32204B14226b26128O5269I7668a26725
18547b11161m9092A09604b94847C7888d66359B21534B4180c60235F0415a37589
18536A856J66170G6752a5365p3933A19985g3675n1631e7810k16849d6904J2100
18525c4804j36155J0684g2924k6649n4238A6271J78232J28440f7764k22169A5887
18513B05348F6847c9135C5863b26977o1404A38913b82344K9829J03372A72048
18502h8663k2393j66757j0108R4437F4036b09553H4048M7703i8579M7666A22060
$$ y = [152145, -89193, -224307, -72827, -265423, -277425, -224236, 207092, -269489, -239907, -25125, -198069, 191827, 170607, 87924, -73727, -250915, -221519, 87573, -226710, -240101, -29964, -486492, -107430, -331700, 86578, -284879, -417083, 214226, -226128, -160859, 97668, -126725, -211161, -260253, 109604, -294847, 37888, -466359, 221534, 24180, -360235, 60415, -137589, 1856, 168026, 76752, -15365, -89298, 119985, -73675, -125306, -57810, -274659, -46904, -34804, -170959, -160275, -72924, -99573, -153811, 16271, 194503, 322943, -67764, -289933, 15887, 205348, 66847, -39135, 35863, -226977, -288381, 138913, -282344, -252515, -149143, 172048, -88663, -111056, -277813, -287921, -193484, 64036, -209553, 84048, 131751, -98579, -50913, 122060]
18490D6959b31186f7748A45526a02562H3198A1191J24357a90312Q424j58307O6855
18479b73340e6567l6742k12110a41463A93279g2719b1340B75847a9258r5274p759
18468a22291A98722i2321I7716E401g6933k27351a50507r0511a10691A2779K41320
18457B54099h8222k86199e9702B2353c20866h4025A18203f0918D1545J69145o8531
18446A42159r901b4997l6775C8543i2806A79745N333a62145A12793f2335E2581
18434G1273a33137A36516e3386A18819K27967b27084c3765o4208k14478A83307
18423D1061M2571l7536a87076a3863j11710A8493c1470j58658G5134b37293d3086
18411a85159j32526B260b8600o6060m4937l4425G844d4850E30491b12009A47506
$$ y = [46959, -231186, -67748, 145526, -102562, 83198, 11191, 135548, -190312, -181888, -340195, -273340, -56567, -93309, -305419, -141463, 193279, -72719, -21340, 275847, -19258, -114532, -122291, 198722, -92321, 97716, 5401, -76933, -304284, -150507, -241018, -110691, 12779, 254099, -88222, -374421, -59702, 22353, -320866, -84025, 118203, -60918, 41545, 210690, 142159, 132258, -24997, -61772, 38543, -92806, 179745, 185078, -162145, 112793, -62335, 52581, 71273, -133137, 136516, -53386, 118819, 346786, -227084, -33765, -97973, -312451, 183307, 41061, 83632, 46096, -187076, -13863, -125573, 18493, -31470, -190128, 75134, -237293, -43086, -185159, -317685, 2260, -28600, -94660, -139597, -174022, 7844, -44850, 530491, -212009, 147506]
18399A6171a7196A53927L0140F5270a58428j19641c9824J087A86597L361b1770
18387i8538a7696A76856b87943F9396k0414M2234B3116a58800A40461F1727a66545
18375a15030j63420J01026K3798B13064a09000L0323B17255c97651A29150n8652
18365G0498c24430e0891A26285A3514E915L45733B5205J11514l2583D6597M9254
18354I5851g6117j79571A67114c6043j6033j20039j32257b0642q4037l12756i4841
18342e8853l6533M3199C38529D6152a20513q5825h3118A00500a00184p2310P9907
18331i2587C7640f9637j0378q764A7033i4490D1787a55282M4563p586A42259P4577
18319B16836a23304M9736j941J4687B0968N0733b0047B31721d43848A6226M0805
$$ y = [16171, -17196, 153927, 184067, 65270, -158428, -278069, -39824, -38737, 186597, 189958, -21770, -98538, -17696, 176856, -287943, 69396, 48982, 91216, 23116, -158800, 140461, 61727, -166545, -115030, -278450, -177424, -153626, 213064, -109000, -78677, 217255, -397651, 129150, 70498, -324430, -50891, 126285, 13514, 5915, 351648, 25205, 136719, 104136, 46597, 95851, -76117, -255688, 167114, -36043, -52076, -172115, -304372, -20642, -104679, -417435, -94841, -58853, -95386, -52187, 338529, 46152, -120513, -206338, -83118, 100500, -100184, -172494, -92587, 37640, -69637, -80015, -88779, 17033, -94490, 41787, -155282, -110719, -118305, 142259, 216836, -123304, -73568, -75509, -60822, 20968, 71701, -20047, 231721, -443848, 16226, 57031]
18308E7031J8131B9659J54835a43269O965b6111k8257J8019q3047A53288B4250
18296a723m5222G7132K5711a09734F7485b6831H7773J69495a58038B5542K46983
18285B72525a88971j66550B31877a05615I4016a74761D9284O0195J39438b34212
18274b04561i6724j36734A04769j3243K1160D5143b37941j13237B582O8364b00614
18262A06658k6747A3473L7933J4518a37986F6456J33988b61569F6781a72543n4954
18251b27497N9556n1939e8180l2396E7295Q4248b61953e9767G9091a03155d3645
18239D05626D4324o681a17892n2823K3624e4172k51660m1204a59524H1675a50909
18227B70554d8069B33013c35740K8322C02241a15805n4572N8923d3912m5248l2688
$$ y = [57031, 75162, 29659, 184494, -143269, -136304, -26111, -54368, -36349, -119396, 153288, 24250, -1723, -46945, 77132, 102843, -109734, 67485, -26831, 87773, 257268, -158038, 25542, 272525, -188971, -355521, 231877, -105615, 94016, -174761, 49284, 109479, 248917, -234212, -204561, -96724, -233458, 104769, 91526, 112686, 45143, -237941, -351178, 2582, 70946, -200614, 106658, 79911, 13473, 51406, 65924, -137986, 66456, 200444, -261569, 66781, -172543, -227497, -167941, -219880, -58180, -90576, 57295, 141543, -261953, -59767, 79091, -103155, -43645, 405626, 44324, 37643, -117892, -170715, -147091, -54172, -305832, -347036, -159524, 81675, -150909, 270554, -48069, 233013, -335740, -307418, 302241, -115805, -170377, -111454, -43912, -89160, -121848]
18216a21848k54171A63976n0425D0619N0789e6583B2119e2616C7477L46074c46193
18204C7041O4754b3661j43873P7158j28575A20889e3670D4103a49835k42392G2015
18192b1607E9176a20667j18168O8705A86811c4278C05862a76160Q2940j32850
18182b26070a03251A79794a37434A25587B8262d8331l0312i992H5780p708c3008
18170B5345i6253l16721A36913a49866A83511F428g690A1551i6460A00962c0957
18158f6316A81220B628J55263c359k05110j831F6347b4894j88148h2299k85449
18147c67748M6868B36827m1299i648B46871p1317K60660A2287a32000B52144c42866
18135a91722B45181E4693A9621b66646a20997C20459b00518I3204l780a64319
$$ y = [-121848, -376019, 163976, 113551, 40619, 91408, -56583, 22119, -52616, 37477, 383551, -346193, 37041, 101795, -23661, -167534, -90376, -218951, 120889, -53670, 44103, -149835, -392227, 72015, -21607, 59176, -120667, -238835, -170130, 186811, -34278, 305862, -176160, -93220, -226070, -103251, 179794, -137434, 125587, 28262, -48331, -78643, -9992, 85780, 78072, -33008, 25345, -96253, -412974, 136913, -149866, 183511, 6428, -7690, 11551, -96460, 100962, -30957, -66316, 181220, 2628, 157891, -3359, -208469, -210300, 66347, -24894, -213042, -82299, -367748, -320880, 236827, 195528, -9648, 246871, 175554, 436214, 12287, -132000, 252144, -342866, -191722, 245181, 54693, 19621, -266646, -120997, 320459, -200518, 93204, 89424, -164319]
18124a3276D8769J17876q0650a46509C92016j60863A05886R1268a02564b39o008
18113f247r8413C24884A55946E4984f4422p1152H5575J30905D6615c1145B0765
18101a26259A15279j8092e7090C9778a23483c7988B83942e6211l1132k92622A49982
18089b61434R3975B28431a50244d3017p8643I3528J65242D9875f4642N836q2308
18078a41114n0334A59196c59132b337j07466J722G7145J67441I6559J91462G8014
18066E7055e8494A4330K15146a22731A95815H2023a60779N4507B07672d10404
18055A55755C4641a9717E8198I674J81313b71213a31273G7212b75515A07824a42320
18043B22362j04849P5792m8158a57084H1806l6718O4905b36598A60358b05550
$$ y = [-13276, 48769, 166645, 85995, -146509, 392016, 231153, 105886, 197154, -102564, -239, -6247, -104660, 324884, 155946, 54984, -64422, -135574, 85575, 216480, 46615, -31145, 20765, -126259, 115279, 97187, -57090, 39778, -123483, -37988, 283942, -56211, -87343, -379965, 149982, -261434, -167459, 228431, -150244, -43017, -121660, 93528, 258770, 49875, -64642, -58806, -141114, -191448, 159196, -359132, -2337, -109803, -108081, 77145, 244586, 96559, 288021, 78014, 57055, -58494, 14330, 229476, -122731, 195815, 82023, -160779, -106272, 207672, -410404, 155755, 34641, -19717, 58198, 9674, 190987, -271213, -131273, 77212, -275515, 107824, -142320, 222362, 117513, 193305, 145147, -157084, 81806, 45088, 109993, -236598, 160358, -205550]
18032a47868a637B46618C5231J92053a02376n6286A70265O2693g6362n4904D25554
18020b11491n6881a00956F9124P5889b32735g0289b8588A21255K74862j65140
18010B30977f7525l0755q4720A26561b420m8102A71441b22864B11735D4458j0919
17999C3539J5385P1897a97363c6568P750j39289C4771J00633j8601k7191p279
17988H2333r959f5983J6715A79514l6271K8725A9309c07440g7270a8572j90933
17977b09505C8121N0227M4869c43791a35279B05444b36251D95750E3534e1318
17966D1126a07748C54880A0318i2659B41763b3924A48751A2451R9700a76852A48516
17954D7600a19778A50108J3448l1956C2681J81015F3855a95606i6778A54667j1980
$$ y = [-147868, -1637, 246618, 35231, 227284, -102376, -158662, 170265, 232958, -76362, -131266, 425554, -211491, -268372, -100956, 69124, 145013, -232735, -70289, -28588, 121255, 396117, 230977, -67525, -98280, -183000, 126561, -2420, -50522, 171441, -222864, 211735, 44458, 33539, 48924, 120821, -197363, -36568, -28818, -168107, 34771, 135404, 116803, 89612, 82333, 72374, -65983, -49268, 179514, 143243, 171968, 19309, -307440, -77270, -18572, -209505, 38121, 88348, 133217, -343791, -135279, 205444, -236251, 495750, 53534, -51318, 41126, -107748, 354880, 10318, -92659, 241763, -23924, 148751, 12451, 112151, -176852, 148516, 47600, -119778, 150108, 163556, 131600, 32681, 213696, 63855, -195606, -96778, 154667, 142687]
17943A42687G46d1590k43420P9694F5628b18659N8768f8140b7790B6482b56413
17931c6801j20311a0399n032C14382i3704M5810k45245E1177b15974A2687b96020
17919a85011F6337J0577f5215l5276B19940d65621H6661b40135L8716A39204a29648
17907A52661d8164J9992n4066n7615I8227C4027J09842D1132K20509b43292l2528
17896b75820a15441L2822j12689C93959C6147J61828f3242C00626A41952J36332
17886B78284a02525A12776c6549A32583l9390l1323K10624E629J38243J63173
17876C07045I10a09475m4771P2837m34746A89815l5383k2707N1963l2455h6133
17864D09224G0409b4310c858n533j04995B27014f4526k4361A86060E2215A2626
$$ y = [142687, 746, -41590, -285010, -205316, 65628, -218659, -159891, -68140, -27790, 26482, -256413, -36801, -157112, -10399, -15431, 314382, -93704, -47894, -293139, 51177, -215974, 12687, -296020, -185011, 66337, 76914, -65215, -100491, 219940, -465621, 86661, -240135, -201419, 139204, -129648, 152661, -48164, -28172, -82238, -139853, 98227, 34027, 143869, 41132, 261641, -243292, -275820, -115441, -82619, -195308, 393959, 36147, 197975, -63242, 300626, 141952, 278284, -102525, 112776, -36549, 132583, 93193, 61870, 272494, 5629, 143872, 307045, 910, -109475, -154246, -81409, -516155, 189815, 154432, 131725, 183688, 151233, -86133, 409224, 70409, -24310, -3858, -9391, -114386, 227014, -64526, -88887, 186060, 52215, 12626]
17852h1267G5926d1259B18597b604j17433j01440B7916b6816q1778c9620m81H1801
17839b38892B59837D976K47330D3069K21202h1425o2751H8689f7697A94601K43450
17828D38051g0185A01422a7716C9062h600p9598c5317C6486a13023B11243E0992
17816A43116c6045C11005F5045d2081F5900K30154c764j9953A55664d2350k19438
17805b61788J03529A90663k2125J76350a29174p6729M764D9280j3494K80660A3655
17793b36318g7960A48797a14384D1508P92a71657B33693J45596b12479C2117J39905
17782A72022F7022j3060c08089A73361c4512k31140G5079a84017A39003J20108
17772B59111I2995b4537A48945c52369B41889C1369a76590O8401A89485q7960
$$ y = [-81267, 75926, -41259, 218597, -2604, -120037, -221477, 27916, -26816, -108594, -39620, -40101, 81801, -238892, 259837, 4976, 252306, 43069, 264271, -81425, -144176, 88689, -67697, 194601, 438051, -70185, 101422, -17716, 39062, -8600, -88198, -35317, 36486, -113023, 211243, 50992, 143116, -36045, 311005, 65045, -42081, 65900, 296054, -3764, -23717, 155664, -42350, -261788, -158259, 190663, 168538, 344888, -129174, -205903, -201139, 49280, 35786, 316446, 13655, -236318, -77960, 148797, -114384, 41508, 42300, -171657, 233693, 379289, -212479, 32117, 172022, 67022, 53962, -308089, 173361, -34512, -265652, 75079, -184017, 139003, 259111, 92995, -24537, 148945, -352369, 241889, 31369, -176590, -108189, 189485, 101525]
17762A01525a38440A00803L9061B0700a28725B7809D805d7551j67580B3259b33095
17750A77354d5719G9627a34917j20204F7650M17077g8499C57499L4978B8044J00947
17739A28991k0149a15060a147A12435L7967J91943J04761a3082A48077l2066M4547
17728A60558j8338P5427f8706C68843B2057M08684j82340a38191F3779b20832
17717b40362R1981f6085B39152a29734F8267R4276c2508A65935n8292h2743A43595
17705C1605Q027K6851J02864e8174d134A7979a18196d7121C61816A48625N1838
17694B00463K19428a63334M8876C58682p4680a05796B47744j16262A0659b55464
17683B46629i7657q0309A10361m9165P1812j3752J47452e15437C46931i5804I3282
$$ y = [101525, -138440, 100803, 139864, 20700, -128725, 27809, 4805, -47551, -215131, 23259, -233095, 177354, -45719, 79627, -134917, -255121, 67650, 484727, -78499, 357499, 392477, 28044, 128991, 108842, -115060, -1147, 112435, 150402, 342345, 447106, -13082, 148077, 116011, 160558, 142220, 217647, -68706, 368843, 22057, 430741, 248401, -138191, 63779, -220832, -240362, -148381, -66085, 239152, -129734, 68267, 162543, -32508, 165935, 107643, -82743, 143595, 31605, 39632, 66483, 169347, -58174, -4134, 17979, -118196, -47121, 361816, 148625, 200463, 419891, -163334, -114458, 358682, 284002, -105796, 247744, 131482, 10659, -255464, 246629, -97657, -177966, 110361, 61196, 133008, 119256, 266708, -515437, 346931, -95804, 93282]
17671A31004a38644g529C06910J30392j82319B1585G490K74660E8470a50391I9208
17659B62626G4123R1666g8692C1696P2988L7627i274H0753A9638L32034c5489
17647B07620R910a78699A80244q3434J64704E5340c11086G5137B3033J15802B0429
17635B34953a68279E45220A28277K8057K3157d23343a06957m3619B13395K5401
17625B38796j15154O0674e7229A79329a67166f8416B91667a74877F12i9576B44076
17613A86969e1085B04796o2801d734l7501G069L14147j53867l8111B3710D381
17601B15991p1953R9801j894I1346O3108J84788D4740N05111a6891I8465J16960
17590B15425o0890J13997E0921R9369a21057B28480A4631f9542A50645b14079
$$ y = [131004, -138644, -7529, 306910, 437302, 254983, 21585, 7490, 282150, 58470, -150391, 99208, 262626, 74123, 165789, -78692, 31696, 104684, 142311, -9274, 80753, 19638, 351672, -35489, 207620, 217530, -178699, 180244, 96810, 261514, 55340, -311086, 75137, 23033, 138835, 20429, 234953, -168279, 545220, 128277, 156334, 179491, -423343, -106957, -150576, 213395, 238796, 123642, 184316, -57229, 179329, -167166, -68416, 291667, -174877, 612, -99576, 244076, 186969, -51085, 204796, 141995, -4734, -42235, 7069, 321216, 167349, 129238, 23710, 4381, 215991, 144038, 243839, 241945, 91346, 154454, 339242, 44740, 549851, -16891, 98465, 215425, 154535, 268532, 50921, 150290, -121057, 228480, 14631, -69542, 150645, -214079]
17579a57621B06352q8448r87Q3958E3728N3822b30850C65110j48133A01923O087
17568A08010b57517B3601K28449A07348B869Q7620K8487d3368B84437A41845a50818
17556B39720i7869A23151m1209e6967B8997J87866Q0094j39521J07907h4617D7596
17544C8404J62508o3885K13716J14024b2174C42147j46898P8053p5504l1643Q0520
17533B46675J67821j31848J92863n9996A39826J52926K93518k92156O26058j18795
17523H01377N96399l21415K6129k57623B20020L93657k72070L12183k20711D4524
17512E25101M1541J76271O6587J80749K51171j84607k17403j95661j72696m8789
17502D22264j4998j95558j2821K2091R7288j7109J31533R7060j37723A16489R6216
$$ y = [-157621, 206352, 117904, 116917, 200875, 53728, 107550, -230850, 365110, 216977, 101923, 108010, -257517, 23601, 252050, 107348, 2869, 90489, 118976, -43368, 284437, 141845, -150818, 239720, -97869, 123151, 81942, -56967, 28997, 216863, 296957, 157436, 265343, -84617, 47596, 38404, 200912, 137027, 350743, 464767, -22174, 342147, 195249, 273302, 197798, 166155, 246675, 414496, 282648, 475511, 415515, 139826, 292752, 586270, 294114, 920172, 801377, 1397776, 1076361, 1102490, 844867, 220020, 613677, 341607, 653790, 433079, 44524, 525101, 566642, 742913, 809500, 990249, 1241420, 1056813, 839410, 643749, 471053, 422264, 407266, 211708, 198887, 220978, 318266, 301157, 432690, 529750, 392027, 116489, 212705]
17491B12705R3452J41690P572A62186J38663r4572J60950j35463K47112o7618
17481D11258q2692j3514A2031Q4501h5987C76193k9350N157m4809g1831D42019
17469D45649J6620j79250b0270C33459r288p0308J35412A69661J63363B8348J73476
17458B01824K51494A73672D653J48077K72273K7946p5539A38259l7288B5166Q1958
17447A07124L56307r5347p5536P2335L0688q3597J52117k7289J68091o0727B07849
17435D49694A65988J4635K85170j3452A44461O83499B75911K14346k18065o5188
17425B07004J97394A24330J81552K6395K52557j50223j77227L13231B37366L81171
17415F18537B9453M81942B25805l1470K23894J27561k05347D8065K69034A38182
$$ y = [212705, 306157, 447847, 455419, 162186, 300849, 206277, 367227, 231764, 478876, 411258, 328566, 315052, 12031, 96532, -85987, 376193, 346843, 352000, 307191, -71831, 442019, 445649, 462269, 283019, -20270, 333459, 324171, 253863, 389275, 169661, 333024, 28348, 201824, 453318, 173672, 4653, 152730, 425003, 452949, 377410, 138259, 100971, 25166, 107124, 463431, 368084, 292548, 364883, 395571, 311974, 464091, 436802, 604893, 544166, 207849, 449694, 165988, 180623, 465793, 452341, 144461, 827960, 275911, 490257, 272192, 207004, 404398, 124330, 305882, 332277, 584834, 434611, 257384, 570615, 237366, 618537, 29453, 511395, 225805, 194335, 418229, 545790, 340443, 48065, 317099, 138182]
17404B23136K12821G3992K44635a38345A35576l3876L41023F0186J02831p4240
17394H8777M47274k10034K21065L9668A73142c2823B87110B3656J4896O01197
17384F39749B28216m9505n6655K81722j96416K84910F5862M07409k9288A81152
17373E07426k1073I080O2296N245M18340A10477C2239J85056q6898J81112j10363
17362B01146F5255J45199Q8170B4161K42620J66966j39892R2514I1277J44692
17352B35969P068M1016O9891J66047C0312K27474J71188k08884K16600q4759j43752
17341B08179K71646B29163j7408J22309A08651K95199j65634J92672A69146n0059
17331A19087N8554E8544J16537J0606K49419o6352p7376E3904K87266l7271j39664
$$ y = [223136, 435957, 73992, 318627, -138345, 135576, 101700, 442723, 60186, 163017, 88777, 536051, 326017, 547082, 586750, 173142, -32823, 287110, 23656, 38552, 639749, 228216, 178711, 122056, 403778, 207362, 492272, 65862, 473271, 443983, 181152, 507426, 486353, 9080, 71376, 76621, 494961, 110477, 32239, 217295, 130397, 311509, 201146, 65255, 210454, 298624, 24161, 266781, 433747, 293855, 386369, 91277, 235969, 243037, 284053, 353944, 519991, 30312, 257786, 428974, 220090, 436690, 351931, 208179, 479825, 229163, 211755, 334064, 108651, 403850, 238216, 430888, 169146, 119087, 177641, 58544, 175081, 185687, 435106, 368754, 291378, 53904, 341170, 303899, 164235]
17320A64235J46733a43987I6695N5676B5814K90268J73271B18713J34366A09013
17309E06481k32247K30535a27454d0165C54513p2377J94336j22441n3082J74390
17299D75339H3396J54373o7023l0355N4856J56051A07497J99315m3415K15038
17289D78435j7677D1896J40687J97021A09194M63867H9476J35626r783k0638P618
17278B02299K75529n5708k4105J15917j15411j12864N38898C24357n998o6867
17268B51492E6020R3389J26855J16533q9823A22870B6181N84971j66491A57503
17257C03316A24531J70589J82415k29077J89086j7542j79526R9453M0527n7359
17247C23097J52832A78336o0206J48241K00121J07992B41040P7560J45737J502
$$ y = [164235, 310968, -143987, 96695, 152371, 25814, 316082, 489353, 218713, 353079, 109013, 506481, 274234, 504769, -127454, -40165, 354513, 282136, 476472, 354031, 300949, 475339, 83396, 237769, 170746, 140391, 195247, 351298, 107497, 306812, 263397, 478435, 460758, 41896, 182583, 379604, 109194, 573061, 89476, 225102, 215319, 194681, 202299, 477828, 422120, 398015, 513932, 398521, 285657, 824555, 324357, 318359, 251492, 56020, 149409, 276264, 392797, 302974, 122870, 26181, 611152, 444661, 157503, 303316, 124531, 295120, 477535, 248458, 437544, 420002, 240476, 339929, 380456, 323097, 475929, 178336, 118130, 266371, 466492, 574484, 241040, 318600, 464337, 465839]
17237D65839B10082k311I9793N66257l15709m5935K44780H8395J59885H5880M13590
17226D99470j93330A19357O3320L29808q5883K24229A87085K37522K25550k38836
17216D11321g4385C66557J95562B28751J91647B3620N66682A75457L46004B02569
17205F31422r4621k54292A21338J77662J04657P4107l1789Q1189A05148K73692
17195C78840j55456J16938j55063L91970A23422L8439L61360B60761J20911p0390
17185C11282o9028k5163K23815j76033J14049K91348J25336l97201K47240p6635
17175E69010k8760K63256l55985k15297L5242L05971A32648N50783n3359B74887
17164G48494k52876L5307H3899N73757j85277Q9668m052M8956j38904j60764L87489
$$ y = [465839, 210082, 207771, 99793, 666050, 350341, 304406, 549186, 88395, 248280, 85880, 499470, 306140, 119357, 182677, 512485, 426602, 650831, 187085, 424607, 650157, 411321, -74385, 366557, 562119, 228751, 420398, 23620, 590302, 175457, 521461, 202569, 631422, 536801, 282509, 121338, 299000, 403657, 477764, 445975, 527164, 105148, 378840, 223384, 340322, 185259, 577229, 123422, 161861, 523221, 260761, 381672, 311282, 242254, 217091, 440906, 264873, 378922, 670270, 795606, 398405, 645645, 569010, 540250, 803506, 447521, 232224, 267466, 573437, 132648, 683431, 630072, 274887, 748494, 495618, 530925, 83899, 657656, 472379, 562047, 557995, 606951, 468047, 307283, 694772]
17153F94772C06768L19312m1012j46260l3211j64712N39675k27895j34031A73340
17142D87748R8510R8989H5564L26162M22087p4857l55621L1338O14653l49687
17132F99639l10532O7363O4256B19863K15267l6604J13719j30203K48558j49255
17122D81345J93298J50008C15828m8118K24405M50042l87974K02287J53828j10759
17112G99539k27883J30272j00045L4844k52205R8608J46761K66416j31959r0678
17102F73670M6844J63759k60569M282j96862M19764j08575A55511Q02813l04522
17092F53802j23485L60755k14669J4277j6177J15444l17111k9387M75111l99203
17082E19357J75474M5779K02355n3873k67050k4985Q1046k24083O12915m51222
$$ y = [694772, 306768, 626080, 585068, 438808, 405597, 240885, 780560, 552665, 418634, 173340, 487748, 586258, 685247, 85564, 411726, 833813, 758956, 403335, 434673, 1049326, 699639, 389107, 456470, 520726, 219863, 435130, 398526, 512245, 382042, 630600, 481345, 674643, 824651, 315828, 267710, 492115, 942157, 554183, 756470, 910298, 799539, 571656, 701928, 601883, 636727, 384522, 483130, 629891, 896307, 764348, 673670, 720514, 884273, 623704, 627986, 431124, 850888, 742313, 155511, 958324, 653802, 530317, 891072, 676403, 690680, 674503, 789947, 472836, 443449, 918560, 519357, 694831, 740610, 942965, 889092, 622042, 597057, 678103, 454020, 1066935, 615713]
17072F15713K71178k71722o8867J30389j78860L49124p5777o001J39022k40451
17062F63748Q7718k87664N09486j57534q4449K16993m5870J09325j38748r3423
17052G79582K16529R6492m15501M7657J98120J4004k28356K08571K8350q2612
17042H62836J0397j35913K67845m37075j1783L34193L1264Q1179j67797j7809
17032H17337M19488l30674L7646m0732J23464m16348M15556j31761M911M38380
17022A337267j95946k61916J73525j87421K94460p6047j26085R663J44132l90529
17012G21103K52801J4231m9099q2859J18987n4425M30225j35374J63800k11457
17002A167933o7091J67435O7897L6259k65321K16956o1716K5424J63226l04601
$$ y = [615713, 886891, 615169, 546302, 676691, 497831, 846955, 771178, 765177, 904199, 663748, 751466, 463802, 973288, 815754, 731305, 948298, 902428, 1011753, 873005, 779582, 996111, 1092603, 677102, 724759, 922879, 936883, 708527, 917098, 945448, 862836, 873233, 737320, 1005165, 568090, 556307, 890500, 921764, 1002943, 835146, 817337, 1236825, 906151, 943797, 903065, 1026529, 610181, 1025737, 893976, 898887, 1337267, 1141321, 879405, 1052930, 865509, 1159969, 1083922, 957837, 967500, 1111632, 721103, 973904, 988135, 939036, 856177, 975164, 920739, 1350964, 1215590, 1379390, 1167933, 1100842, 1268277, 1336174, 1372433, 1107112, 1324068, 1262352, 1287776, 1451002, 1146401]
16992A146401K31524l6087k07448L36754k67613n9202M87359m39569O19650m63191
16982A348578j49751K51935k46491J38236l5930J85028k80547M3469L14920R6914
16972A666361k21515J8960p4640J33900j35471J42563n7773q4749J88899L5272
16962A611807o0244j51216K53259k6399j6470K60736q6280j47468R516J13142
16952A760383k02296J6322J46692M576P5256k32727J33536M9703L6755k3388n4017
16941A710795m21000Q31665k48212j5135J72624j79793J76570J07010m73758L94164
16931B054930r0342n0103M47758j95729O02L33857m30228j35024M78060m50574
16921A963207L28517j31549J09810J657J17721r9689J04954K18272r1018J07085
$$ y = [1146401, 1377925, 1341838, 1134390, 1471144, 1203531, 1144329, 1631688, 1192119, 1811769, 1348578, 1198827, 1450762, 1204271, 1342507, 1306577, 1491605, 1211058, 1254527, 1569447, 1666361, 1444846, 1463806, 1389166, 1523066, 1387595, 1530158, 1472385, 1387636, 1576535, 1611807, 1551563, 1400347, 1653606, 1627207, 1610737, 1871473, 1785193, 1637725, 1647241, 1760383, 1558087, 1574409, 1721101, 1725677, 1800933, 1568206, 1701742, 1751445, 1788200, 1764812, 1710795, 1289795, 2121460, 1873248, 1858113, 2030737, 1850944, 2027514, 2134524, 1660766, 2054930, 1964588, 1914485, 2362243, 2166514, 2167116, 2500973, 2070745, 1935721, 2413781, 1963207, 2291724, 2160175, 2269985, 2271642, 2389363, 2289674, 2394628, 2612900, 2521882, 2628967]
16911B628967l90679J29294K42700J05193k13391M5273K33574j20688K76528k46748
16901B690023O2993J14428j52947J4993L05545l59770Q4312L82509N0596l63125
16891B829557M00223j74966j1014L18145j53945o3372K97111k10976K96833m51203
16881C076393K81213J99903O9421K29027j01392J78429M2068o1585l03900L05721
16871C915298P8701l11461K76170j86269K08356K70102R6246K45932p9058m4567
16861D469450j35422P1979K08535O0573M0088N875J08338p1663l9635L45653L14916
16850E378687j12918J51037p09571R36471P2526q9365O9038J25998m03L23489
16840F144989K32835k22057K16259N2778j04854J59067L11293j22890J55042M14611
$$ y = [2628967, 2238288, 2367582, 2610282, 2715475, 2502084, 2547357, 2780931, 2660243, 2936771, 2690023, 2753016, 2867444, 2714497, 2729490, 3035035, 2675265, 2759577, 3142086, 3192682, 2829557, 3229780, 3054814, 3043800, 3361945, 3208000, 3144628, 3441739, 3230763, 3527596, 3076393, 3357606, 3557509, 3626930, 3855957, 3754565, 3932994, 3975062, 3913477, 3609577, 3915298, 3993999, 3682538, 3958708, 3772439, 3980795, 4250897, 4347143, 4593075, 4514017, 4469450, 4334028, 4406007, 4614542, 4675115, 4715203, 4721078, 4829416, 4757753, 4718118, 5063771, 5378687, 5265769, 5416806, 4707235, 5643706, 5716232, 5626867, 5695905, 5821903, 5821500, 6144989, 6377824, 6155767, 6372026, 6424804, 6319950, 6479017, 6790310, 6667420, 6822462, 7237073]
16830G237073Q109P7202J42734J17535N0102P4657L29056K67592k8739J12392
16820H387713J84385M01099o5257M64235j84566L4650M90464J073L38550Q8196
16810A0140542J81701L58466K59787K18768K26640K02178K97058L47027K39550
16801A2471717o2976N55533L99663K60261J4516L32904M13265N26342M89204L18318
16791A5718747L91220L60794N28539J46278N31246M21380N58851P46402N87748
16782A9991205M45840P35833L51079Q08831M23468J045557M24153Q46526O50926
16773B5723418N18265R49455R94471Q86243O58711J273396R73980P52497R53052
16764C3683488J647048Q70260J364313J514950J301665J514946J112452J676279
$$ y = [7237073, 7245182, 7322384, 7465118, 7582653, 7632755, 7707412, 8036468, 8304060, 8275321, 8387713, 8572098, 8973197, 8907940, 9372175, 9187609, 9222259, 9712723, 9713796, 10052346, 10140542, 10322243, 10680709, 10940496, 11159264, 11385904, 11588082, 11885140, 12232167, 12471717, 12408741, 12964274, 13363937, 13624198, 13638714, 13971618, 14384883, 14911225, 15400429, 15718747, 16109967, 16470761, 16999300, 17145578, 17676824, 18098204, 18657055, 19403457, 19991205, 20437045, 21172878, 21523957, 22332788, 22756256, 23801813, 24225966, 25072492, 25723418, 26241683, 27191138, 28185609, 29071852, 29730563, 31003959, 31977939, 32730436, 33683488, 35330536, 36200796, 37565109, 39080059, 40381724, 41896670, 43009122, 44685401]
16756D4685401J590199K078694J331931K423828J619783K121155K233116J748964
16748E9833071K890543K262443K486736K219064K604758K927448L027206K687459
16740H0938728K848927L208169K955670L328581K456436L710036K723244K900613
16732A05070404L044735K687744K776538K174552K364835K387435J382935J344444
16724A23233622J522592N33917M76162J87631o0509n73745r38996j193877j453821
16715A21732976j983976k236114k136900k653219k787947k749378k794970l018797
16707A01371675l177344l104917l016386l101007l078071l026852l324723k365107
16699G7177268k891477k724750k792939k797460k070602k422387k574630k009580
$$ y = [44685401, 46275600, 48354294, 49686225, 52110053, 53729836, 55850991, 58084107, 59833071, 62723614, 64986057, 67472793, 69691857, 72296615, 75224063, 78251269, 80938728, 83787655, 86995824, 89951494, 93280075, 95736511, 99446547, 102169791, 105070404, 108115139, 110802883, 113579421, 115753973, 118118808, 120506243, 121889178, 123233622, 124756214, 125290131, 125766293, 125953924, 125893415, 125319670, 124380674, 123186797, 121732976, 119749000, 117512886, 115375986, 112722767, 109934820, 107185442, 104390472, 101371675, 98194331, 95089414, 92073028, 88972021, 85893950, 82867098, 79542375, 77177268, 74285791, 71561041, 68768102, 65970642, 63900040, 61477653, 58903023, 56893443]
16691E6893443k002633k339960k102555j399805k008583j570516j922753j767727
16683D1778911r48957j575560j217642j537719j236593j300698r55586j524971
16675C1481185j96165j601979m79467j225730j020214m45935j161872o86160p91411
16666B3872252n85153p68140n08706p62267n43656p12201l44645l66499q57948
16657A8423037m23056k63862o47051n64105l72266m62300k19107m16427o25155
16648A4429708O9156p29937m45290J00498p11535j86433j17670l03281m22070
16639A1683146j55709o05674J03924O9445o01567P2043l10648n91719K89966n76390
16629I376817L5520l04548k62149l82900p4875p9806N4148k34148j1733p74875
$$ y = [56893443, 54890810, 52550850, 50448295, 49048490, 47039907, 45469391, 43546638, 41778911, 40829954, 39254394, 38036752, 36499033, 35262440, 33961742, 33006156, 31481185, 31285020, 29683041, 29203574, 27977844, 26957630, 26511695, 25349823, 24663663, 23872252, 23287099, 22518959, 22010253, 21247986, 20704330, 19992129, 19647484, 19280985, 18423037, 17999981, 17736119, 17089068, 16524963, 16152697, 15690397, 15471290, 15054863, 14429708, 14498864, 13768927, 13323637, 13424135, 12712600, 12526167, 12408497, 12105216, 11683146, 11527437, 10921763, 11025687, 11095132, 10493565, 10565608, 10254960, 9663241, 9953207, 9376817, 9412337, 9107789, 8845640, 8462740, 8387865, 8308059, 8362207, 8128059, 8116326, 7341451]
16619G341451M21303n56590O3851n62222M01997l68852J62163k71779L15866l38112
16609F609076k94032m83967K93850L49173n51125n4197j05276j2306j17949O9374
16599E702621j42829n91000K51511L26637o73263K6232l7518j74884O1490j50839
16589D598158K80440l27588l17470P1444p9253J65359j24612O8433n70640K22109
16579C986380j72770J03394l42650J13791q4351j85139K61722j06399J58317m8306
16569C683989l71n10066J81857k7090J53292j84892J0041k98986J72059j49779
16559C030054P3002j10007J07225j98162m4549k09754q2549L2365j6767K01770
16549B782628J09731j50286l24882J59408K70524k4474l66285K0439K16930N4317
$$ y = [7341451, 7762754, 7206164, 7270015, 6707793, 7109790, 6740938, 6903101, 6631322, 6947188, 6609076, 6315044, 5831077, 6124927, 6474100, 5922975, 5868778, 5763502, 5751196, 5633247, 5702621, 5559792, 4968792, 5220303, 5546940, 4873677, 4899909, 4862391, 4687507, 4748997, 4598158, 4878598, 4551010, 4233540, 4304984, 4225731, 4391090, 4266478, 4334911, 3764271, 3986380, 3813610, 3917004, 3574354, 3688145, 3603794, 3418655, 3680377, 3573978, 3732295, 3683989, 3683618, 3173552, 3355409, 3328319, 3481611, 3296719, 3306760, 3007774, 3179833, 3030054, 3103056, 2993049, 3100274, 2902112, 2857563, 2647809, 2565260, 2597625, 2580858, 2782628, 2892359, 2742073, 2417191, 2576599, 2847123, 2822649, 2456364, 2476803, 2693733, 2748050]
16539B748050m92450J02692j11076J46432k34312L13694j12937k90750O2115j63662
16529A967796L93338k68120j31485K47040p2122r0420k47443J08769n5021J50837
16519B003169R2421p3953o7151j25723J65866k01700K86071J03863n38909J45789
16509A789743j54626L0263P9037j41177j27000L28604l04439N63404j86944k19754
16499A657111M8328l102Q272j33882m2389p5994K64872j95296l17527K68970q2238
16488A397125P6448K66045m53954Q146P6316P3002j23449J73749j95495j19399
16478A178534K26515j02200L2514k98905j92140M80734M0890J19481k70939l8263
16468A176221K69633j39939P4881P0362l3254k95206j04406l7604K06211J51659
$$ y = [2748050, 2255600, 2358292, 2247216, 2393648, 2159336, 2473030, 2360093, 2069343, 2131458, 1967796, 2361134, 2093014, 1961529, 2208569, 2136447, 2046027, 1798584, 1907353, 1852332, 2003169, 2095590, 2021637, 1954486, 1828763, 1994629, 1792929, 2079000, 2182863, 1643954, 1789743, 1635117, 1665380, 1744417, 1603240, 1476240, 1804844, 1500405, 2063809, 1876865, 1657111, 1705439, 1702337, 1710609, 1576727, 1534338, 1458344, 1723216, 1527920, 1210393, 1479363, 1397125, 1473573, 1739618, 1285664, 1293810, 1370126, 1443128, 1319679, 1493428, 1297933, 1178534, 1405049, 1302849, 1335363, 1036458, 844318, 1325052, 1365942, 1485423, 1214484, 1176221, 1445854, 1305915, 1380796, 1451158, 1417904, 1122698, 1018292, 980688, 1186899, 1338558]
16458A338558j99122j02556r8880J41377q7974K42449k05005j05039O7958l1377
16448I60389k00544M34103j26428K04491l84682M68077L85m89632L23552l83941
16438H05770J89135j28152j6466K07407j90871L00710l33239M8896P068L44078
16428A234336j63292l06719j42278L0833J23520k51050N67755l60394J91168D32108
16417H28102Q4177k59643J01524J96421K99094j75218k13528j14387j34308K83340
16407H95574j29449P5456C24314L92159K0665r23j06121J09077R7761O2665j54489
16396G45108J37287k73145J41768K82558D75143J27321k95479L48136q4552n1218
16386E19351J38598k04685r9804J22974K33114J66657p4044r9918P2713k40431
$$ y = [1338558, 1139436, 1036880, 938000, 1079377, 991403, 1233852, 1028847, 923808, 991766, 960389, 759845, 1193948, 1067520, 1272011, 887329, 1355406, 1355791, 866159, 1189711, 805770, 994905, 866753, 850287, 1057694, 866823, 1167533, 834294, 883190, 890258, 1234336, 1071044, 764325, 622047, 652880, 776400, 525350, 1093105, 732711, 923879, 432108, 828102, 912279, 652636, 754160, 950581, 1249675, 1074457, 860929, 746542, 612234, 895574, 766125, 841581, 324314, 716473, 737138, 736215, 630094, 739171, 836932, 899597, 745108, 882395, 609250, 751018, 1033576, 475143, 602464, 306985, 655121, 570569, 519351, 657949, 453264, 353460, 476434, 709548, 876205, 802161, 702243, 774956, 534525]
16376E34525l0571K14570q2799k07440J20268k64688L67929j05251p2048R9928
16366E74423o0772O9892J26067J59691r9080k12118o4198B29624O04163L8296
16356H72083k74770k26831n1798q2902L68671r7748q8801K09812m4139m5765R9725
16345F37537L7237J63119k75014q8815p5367K30676k35232J08374K27836Q3784
16335H14135l45917A89783L40594J8651k19537N29200D25884j1741J91869k105
16325F03907k92802k4542P2212K07097O6543J735k88347A10199O05653l00855
16315D14997J83567k78496L13818j94579j46301J78551A68754K14016p8890E0008
16304A13371L01372p5205k7366L27965H2650K58882Q7214K03253C04528L5871
$$ y = [534525, 503954, 718524, 635725, 428285, 548553, 283865, 651794, 546543, 474495, 574423, 513651, 583543, 709610, 869301, 770221, 558103, 493905, 229624, 833787, 872083, 597313, 370482, 318684, 235782, 604453, 506705, 417904, 627716, 583577, 537812, 637537, 674774, 837893, 562879, 474064, 398697, 629373, 394141, 502515, 730351, 814135, 468218, 189783, 530377, 549028, 329491, 858691, 425884, 414143, 606012, 603907, 311105, 286563, 358775, 565872, 632415, 634150, 345803, 110199, 715852, 414997, 598564, 320068, 633886, 439307, 293006, 471557, 168754, 382770, 303880, 50008, 113371, 414743, 339538, 312172, 640137, 82650, 341532, 428746, 631999, 304528, 340399]
16294C40399q0240K92739k46194K29263B57068J08855Q7907p7520J42370k7003
16284D91677d5751A63403K20902J87168j17607k10308P7566J08431j83440R7558
16274C43673P3135A87876J16729r6923K97593C0265J18691J86674C6092K65628
16264C01720P7414j15878K85891k39921J7351J81452j79249b3330G05633k70543
16254D35090L1010K49578B20696j9841q3043J29435J3448H6223J57259A11850
16243B00198o2021n278L08723D1788K67969j41774R0168q3916D2967J72440l648
16232B11759f3388D31828k08400L0642J33575F392O5678O6592A0762J20171e3250
16220C56265H4931K13270D5087L92810J05634B49862H2082K52171e6401B13702
$$ y = [340399, 260159, 552898, 306704, 535967, 257068, 365923, 453830, 376310, 518680, 491677, -45751, 163403, 384305, 571473, 453866, 243558, 321124, 429555, 246115, 343673, 416808, 187876, 304605, 207682, 505275, 30265, 148956, 335630, 36092, 301720, 379134, 263256, 549147, 309226, 326577, 508029, 328780, -23330, 705633, 435090, 466100, 715678, 220696, 200855, 117812, 247247, 260695, 86223, 243482, 111850, 200198, 138177, 132899, 441622, 41788, 309757, 167983, 258151, 174235, 42967, 215407, 211759, -63388, 431828, 223428, 254070, 387645, 6392, 72070, 138662, 10762, 130933, -53250, 356265, 84931, 298201, 45087, 437897, 543531, 249862, 82082, 334253, -56401, 213702]
16209A57089K26802j64638R2106J556n0155L3096A04613m1541L47368m2196o310
16198C61934m6023j33332b29380d5437B93959B7573B629K55624R544j09687L88692
16187E46802A96408m9279J59246m6680q5935L5177C0897K75169L19840a38733
16176i0195d4119I967a28969B84441r2827G0589R4933o472c1296B90512A12298
16164B19506A6216M86210c0647I5599J84935K14356j85716M7771j61950a60747
16153c9660d153l05821B06670E903R3192D5478M4744K40274q9766J728I7748K59314
16141C57062E8780a805B78891o8417i4409q4159C19661i8341E7813J10443A8762
16129C62733A11561p37o432K46166B2968K01172q7236E8355J96346g5196G4933
$$ y = [157089, 383891, 219253, 311359, 312915, 262760, 295856, 104613, 63072, 410440, 368244, 361934, 315911, 182579, -229380, -45437, 293959, 27573, 2629, 258253, 267797, 158110, 546802, 196408, 147129, 306375, 259695, 173760, 208937, 30897, 306066, 625906, -138733, -90195, -44119, 9967, -128969, 284441, 191614, 70589, 165522, 159050, -31296, 290512, 112298, 219506, 16216, 502426, -30647, 95599, 280534, 494890, 309174, 356945, 194995, -160747, -39660, -4153, -309974, 206670, 5903, 99095, 45478, 90222, 330496, 240730, 242458, 97748, 357062, 58780, -1805, 278891, 210474, -94409, -178568, 319661, -98341, 57813, 168256, 18762, 362733, 111561, 110824, 104392, 350558, 22968, 224140, 136904, 58355, 254701, -75196, 74933]
16117A54478O8036p8224a44235A7626a50449A1740K3940Q9369d5902I1886J28470
16106B20356o5499n5124g133B38639a64588N8505A45233c988A85072a02958A34482
16094c25334D87301E1909D262L0382a46599D5571c7007A58126b50240B39102f8428
16082b77953A40916a5191E7968B6851K10215b87040h5531E3544a52452B95329
16071I1728a71407B04029f7855B81102r143a82067B7478L3406J37400a89068A09875
16059C71463I4576L26871A43577a11743C0298K6318K28721f991k53088H7309A494
16047h0600j52559C882O1972K69575c4247A21512a87444e4630j01739A21630J14180
16036B35810b5429i18A59181h9519n79k21918A06073F39K62360B5002K34851e437
$$ y = [154478, 222514, 144290, -144235, 17626, -150449, 11740, 35680, 125049, -45902, 91886, 220356, 154857, 99733, -7133, 238639, -164588, -106083, 145233, -3988, 185072, -102958, 134482, -325334, 487301, 51909, 4262, 34644, -146599, 45571, -37007, 158126, -250240, 239102, -68428, -277953, 140916, -15191, 57968, 26851, 237066, -287040, -85531, 53544, -152452, 295329, 91728, -171407, 204029, -67855, 281102, 271959, -182067, 27478, 60884, 198284, -189068, 109875, 371463, 94576, 421447, 143577, -111743, 30298, 56616, 285337, -6991, -260079, 87309, 1494, -80600, -233159, 3882, 65854, 335429, -34247, 121512, -187444, -54630, -156369, 121630, 235810, -25429, -918, 159181, -89519, -90098, -312016, 106073, 639, 262999, 25002, 259853, -5437]
16023E3911R4480f4681E2810Q9841j4091J44201l2502A02354K52067d4102A07159
16011D71228b66712A50688a61710B64261j31146J69096k612r1604J65880b79072
16000D5949b2894B2920K56030H5619j2064L23542a57544H1956l545O5958E6922
15988C20910K17258k9090L25105L96813J79601k00968M2954m93713j18084j44488
15978D96298k34655H5550h4703B15766f2429r4701B41094a31664j95106b6793
15967b80830B32331f3458b9930C47730i5954C88535b78563A54403j5874a6746
15956A54047C8673b1572n0387B77378I170a93208B79060o6138a15109K2758B44412
15944A5298d5929J9242C2072F425f710o9915L2872C46104b11640O1707o4254A6322
$$ y = [53911, 148391, -64681, 52810, 142651, 128560, 272761, 240259, 102354, 354421, -44102, 107159, 471228, -266712, 150688, -161710, 264261, 133115, 302211, 299599, 207995, 373875, -279072, 45949, -22894, 22920, 278950, 85619, 73555, 397097, -157544, 81956, 78411, 144369, 56922, 320910, 538168, 509078, 834183, 1230996, 1410597, 1209629, 1252583, 758870, 640786, 496298, 261643, 85550, -84703, 215766, -62429, -157130, 241094, -131664, -326770, -26793, -280830, 232331, -63458, -29930, 347730, -95954, 388535, -278563, 154403, 138529, -16746, 154047, 38673, -21572, -71959, 277378, 9170, -193208, 279060, 212922, -115109, -92351, 244412, 15298, -45929, -26687, 32072, 6425, -6710, -76625, -43753, 346104, -211640, -149933, -214187, 16322]
15931a01045B55514f869k96048a10022j75653d2332D7261a66101f3557p7812k87782
15920d29151a30494j81119f7364D8256f0550k21434a32382G932h1102j44189B60153
15908b65181B22366g2575k45526g8932A23287d3128j16412K2196J4762C28316
15897C29465b15603F121a50222j7936G4218m434g2832n8655j20862B62741A31337
15885a36021A08565b89785A48846a32731D0528h1412K8424A13608h2264a831A45385
15873G6533B0566J29107L7235b32157B44367q4062a37510j68025A32913a42790
15862a09596A82406b47898A2374b03666G7898a20432b6488l50535M8926A39484
15851G6233c5141B29660a38456N3999J6685j37093J01887j18640B7908R5609b13776
$$ y = [-101045, 255514, -6869, -302917, -110022, -285675, -42332, 47261, -166101, -63557, -141369, -429151, -130494, -311613, -67364, 48256, -60550, -281984, -132382, 7932, -81102, -225291, 260153, -265181, 222366, -72575, -318101, -78932, 123287, -43128, -159540, -137344, -122582, 328316, 329465, -215603, 6121, -150222, -168158, 74218, 69784, -72832, -131487, -252349, 262741, 131337, -136021, 108565, -289785, 148846, -132731, 40528, -81412, -52988, 113608, -82264, -1831, 145385, 76533, 20566, 149673, 186908, -232157, 244367, 160305, -137510, -305535, 132913, -142790, -109596, 182406, -247898, 12374, -203666, 77898, -120432, -26488, -377023, -328097, 139484, 76233, -35141, 229660, -138456, -84457, -67772, -204865, -102978, -221618, 27908, 123517, -213776]
15839f0622A89035d0919F4942I956a09815A99449a24338j41766A14855M9506a97602
15827c15128a55542E1387g8256B85330j8668b50984A48830a2365B66479a72045
15816C19943b4320r2474B8740b6309n2035A74041a63103k16723a66001B6781b1409
15804A38853N7034c88259Q1718h420k62858B4667O0550i7250A79086a74831h2618
15792b60429f8208A65147a30551k30940a36435A62936c4020F6553h4168D8576
15781B17507g9583j79323C5015L5278b51710f8589A60922B6115J29619L1484a55611
15769E6732a89626H0126J00584m3543D5516a76224e7663A27747L1856B1925L6887
15758E8812M4747J15821J9491b73140F7790k7323h6138K475A40379B2587K37162
$$ y = [-60622, 189035, -40919, 64942, 9956, -109815, 199449, -124338, -266104, 114855, 164361, -197602, -315128, -155542, 51387, -78256, 285330, 266662, -250984, 148830, -12365, 266479, -172045, 319943, -24320, -116794, 28740, -26309, -78344, 174041, -163103, -379826, -166001, 26781, -21409, 138853, 195887, -388259, -306541, -8420, -271278, 24667, 85217, -97250, 179086, -174831, -82618, -260429, -68208, 165147, -130551, -361491, -136435, 162936, -34020, 66553, -84168, 48576, 217507, -79583, -258906, 35015, 70293, -251710, -68589, 160922, 26115, 155734, 187218, -155611, 56732, -189626, 80126, 180710, 137167, 45516, -176224, -57663, 127747, 159603, 21925, 58812, 103559, 219380, 238871, -273140, 67790, 40467, -86138, -83663, 140379, 22587, 259749]
15747B59749a72360k6764E95897A15599d2057G8664A2734a26966G7956e438k41157
15736b46595k458G4978g3860A1153L9449c1644Q398k31136A81760a01454a8309
15724a28877I5076B7880K7824g8207C64271c7468A63980M9798d13985B4586K32930
15713B57516e00016E1551e5821r6619a3903r3546d3444D8028b76281A62397a30041
15701D5775L9050C5779b10768c5811k50999Q8349R1812j35976D472a3191C07451
15689A80639m0577J78675o0537a25233m64815G4557b27366H1561J71628A18088
15678b62862E9523A5979f9065k90205C6019M1469a72547a4289j91156A4746J0807
15667B5553b30926e0637A0668g2144q5732C5426b21229g9708j4334G4662g779
$$ y = [259749, -172360, -199124, 595897, 115599, -42057, 78664, 12734, -126966, 77956, -5438, -246595, -249053, 74978, -73860, 11153, 50602, -31644, -23246, -254382, 181760, -101454, -18309, -128877, 95076, 27880, 55704, -78207, 364271, -37468, 163980, 213778, -413985, 24586, 257516, -500016, 51551, -55821, -152440, -13903, -107449, -43444, 48028, -276281, 162397, -130041, 45775, 84825, 35779, -210768, -35811, -286810, -198461, -106649, -242625, 4472, -13191, 307451, 180639, 140062, 318737, 258200, -125233, -590048, 74557, -227366, 81561, 253189, 118088, -262862, 59523, 15979, -69065, -359270, 36019, 77488, -172547, -14289, -205445, 14746, 25553, -230926, -50637, 10668, -72144, -157876, 35426, -221229, -79708, -94042, 74662, -7779]
15655a00206L656j3204J203k16506d7765A54231C0004a19460e997B70597D7500
15643i4367D75198k24512a69097G3361b08224e4259j51527L747E7658i9907j2053
15632a11960m4360c1804A3380b77191j24037A70397h6639A6825b32424M2946j615
15621a91093A66255o3216m3001b30812I9230M525a21811M0416a0603j8822i417
15609a98585e3301k37201C2267J03927O4943Q8545c14868E3891c20762C1340a9668
15597B2785N3030J62592b80563a03096C9700J2927M3237e653n9991k3471A21180
15585A63827j2476a04183j30571G5829f9979j0162A5806a29925A31852A9552M811
15574B4363c84547c6182A93784b18660G6696C3813c0554j39270B63274c12200
$$ y = [-100206, -96550, -109754, -108551, -325057, -47765, 154231, 30004, -119460, -5997, 270597, 47500, -94367, 475198, 250686, -169097, 73361, -208224, -54259, -205786, -202039, 57658, -99907, -111960, -156320, -31804, 13380, -277191, -401228, 170397, -86639, 16825, -232424, -189478, -191093, 166255, 103039, 60038, -230812, 99230, 103755, -121811, -81395, -10603, -29425, -9417, -198585, -53301, -290502, 32267, 136194, 201137, 289682, -314868, 53891, -320762, 31340, -19668, 22785, 75815, 238407, -280563, -103096, 39700, 52627, 95864, -5653, -65644, -89115, 121180, 163827, 151351, -104183, -234754, 75829, -69979, -80141, 15806, -129925, 131852, 19552, 24363, -384547, -36182, 193784, -218660, 76696, 33813, -30554, -169824, 263274, -312200]
15563A04596b38013C82583a63135H3285a10466A22973K7726a57075k26341B3530
15552a60487I195b81258R3776c7374D53060A10795J4533J69225H349e6625B79066
15540B36265c05715B79143f0627a6827A79975a72392H7524a3183A74474m623b52192
15528E757a56382B2383g7421B89290E2660L8207j8724J74434E1588A6962c4661
15516B64156A03455J72086p6372C0046a52994I5214K92376G3998J82651c7417
15505A04956J90594A19453K0548A8987K36827A02122B0377Q8392J88129h7801
15494C30421b04450b5926A66855n6794J7130J42934J4375r3710I456b37946G4513
15482c84863a5419j77838B83840h1426A02848Q1436F7108K51910M17672M01228
$$ y = [104596, -238013, 382583, -163135, 83285, -110466, 122973, 150699, -157075, -383416, 23530, -160487, 9195, -281258, -187482, -37374, 453060, 110795, 125328, 294553, 8349, -56625, 279066, 236265, -305715, 279143, -60627, -16827, 179975, -172392, 87524, -13183, 174474, 169851, -252192, 5757, -156382, 22383, -77421, 289290, 52660, 90867, 72143, 246577, 51588, 16962, -34661, 264156, 103455, 275541, 199169, 30046, -152994, 95214, 387590, 73998, 256649, -37417, 104956, 295550, 119453, 140001, 18987, 255814, 102122, 20377, 108769, 296898, -87801, 330421, -204450, -25926, 166855, 110061, 127191, 270125, 284500, 190790, 9456, -237946, 74513, -384863, -15419, -193257, 283840, -81426, 102848, 184284, 67108, 319018, 736690, 1137918]
15472A137918l50859l09311B12227k5721a33760H4165M3750M1890a63684j4844
15462a78528A57996g3745C39428b01764A28935K8930D0767N1836c7362a1821C40622
15450D07419a62888B21131j00008L62213g1798b2786A67944L52225N2099M17125
15440I89393L84402O5987F87315C31171b9003F2000K27332f8529R281B65612n9357
15429B06255a77925B11008c07686C1006c8287B40313f8847k2974R100B3587a66208
15417C6358a28470F47K20385N0491e1394A2714K85023b19445B45133p7267g1445
15405g656j17025B540a12081B07200M563n0340a09131A15512N9229b45995B22839
15393B28125G2712K0057D1099j7394R0381Q1846H956K932b57520f0048E1387J17010
$$ y = [1137918, 787059, 477748, 212227, 186506, -133760, 84165, 127915, 169805, -163684, -178528, 157996, -73745, 339428, -201764, 128935, 157865, 40767, 92603, -37362, -11821, 340622, 407419, -162888, 221131, 121123, 483336, -71798, -22786, 167944, 520169, 572268, 989393, 1373795, 1439782, 687315, 331171, -29003, 62000, 289332, -68529, -59248, 265612, 206255, -177925, 211008, -307686, 31006, -38287, 240313, -68847, -91821, -82721, 23587, -166208, 36358, -128470, 647, 221032, 271523, -51394, 12714, 297737, -219445, 245133, 167866, -71445, -7656, -124681, 2540, -112081, 207200, 211763, 161423, -109131, 115512, 174741, -245995, 222839, 228125, 72712, 92769, 41099, 23705, 114086, 195932, 8956, 11888, -257520, -60048, 51387, 168397]
15381A68397a04968b6404j57476A31706a15324H5269L1935D1119K19088r0945
15371A69262l4275J55107j18991j3955O6793D7068J34417G1385P0991L17938A13287
15359A96933q6429l4452j3491a99945A87162b69728B51869b7373B9702K39036
15349B68738j22784F356J2801b3052A75595r529F3783J67093J34930a2369B58309
15337A25208L3252G8094a17869C92677E3964b8855C54758j27101c3391A10646
15326A77736K53698a6962C10820j13980m5257a39171k071j30481f4386k8162K8370
15315f4178l9010C01579D1654J85416C0536K10228K28043B12070K8964K4828E2816
15303A11130K84494b68121A52848c2048k50927B41877d2720B62768a5154q8149
$$ y = [168397, -104968, -26404, -183880, 131706, -115324, 85269, 117204, 41119, 260207, 169262, 134987, 290094, 171103, 157148, 223941, 47068, 181485, 71385, 142376, 460314, 113287, 196933, 110504, 76052, 62561, -199945, 187162, -269728, 251869, -27373, 29702, 268738, 145954, 6356, 19157, -23052, 175595, 166066, 63783, 230876, 365806, -12369, 258309, 125208, 158460, 78094, -117869, 392677, 53964, -28855, 354758, 227657, -33391, 110646, 177736, 431434, -16962, 310820, 196840, 151583, -139171, -141242, -271723, -64386, -92548, -64178, -103188, 301579, 41654, 227070, 30536, 240764, 468807, 212070, 241034, 265862, 52816, 111130, 395624, -268121, 152848, -32048, -282975, 241877, -42720, 262768, -15154, -103303]
15293a03303a9549C90743a3560E9030K61540c85245a10437K9181k35393B7159
15282A07932a36198A05566a78792C4388l744e3885R320F6919L2064J07624p2800
15271A33807A1429a80367o764B96661D252Q003e0068l6075C39450b2727H0978
15259B06798a49697b4647I2967h7701L0388A26982d58r479B38550C8319O1313
15248I9632a54837D21002j65092H2792J20801L1158P81762Q56976l03096J35060
15238A705453K01726F82537B81045D1478L4894h8510b913A85868E9055J06389
15228A65444o0677l4749J34972c00967A63461o9857a00426L2372B36314c1333
15217D48785j60572A0349J07320j0878A2270P2387e9804C51779a49301f4781B15824
$$ y = [-103303, -19549, 390743, -13560, 59030, 320570, -385245, -110437, -81256, -316649, 27159, 107932, -136198, 105566, -178792, 34388, 30644, -53885, -44565, 66919, 98983, 206607, 133807, 11429, -180367, -187131, 296661, 4252, 12255, -50068, -86143, 339450, -22727, 80978, 206798, -149697, -24647, 92967, -87701, -57313, 126982, -458, -9937, 238550, 38319, 99632, -154837, 421002, 255910, 82792, 203593, 234751, 1016513, 1873489, 1570393, 1705453, 1907179, 682537, 281045, 41478, 76372, -88510, -2913, 185868, 59055, 165444, 104767, 70018, 204990, -300967, 163461, 93604, -100426, -68054, 236314, -31333, 448785, 288213, 10349, 117669, 106791, 12270, 84657, -59804, 351779, -149301, -64781, 215824]
15205A16679i8565B62247O5470j30857k6866a41271f0685K5388B38406E0228h7163
15193a05377D5060a98691A05675N9934a11675A70223J20017I7845L10356c68661
15182a42439B404J78806b42986A63873a32927G8535a62824G663i1785l6380d6680
15170C19833j33090d9526H6679K17310E5708J82481a39654C4116A1878O4559K578
15159G9015P8775p783P3536b36316B14182J5173J37253a38025A1024L79336d8393
15147B08315F6928Q2413K340m4967H773L01070C0618K74215i9689A5626K23434
15136B39060q2972E8454N7989J53182m5871l2076a41936G4879b10021r3956I6410
15124B98438a37695B81364R6191b13419D26364L4943j95261K05578J3243j88360
$$ y = [116679, -98565, 262247, 327717, 196860, 169994, -141271, -60685, -35297, 238406, 50228, -87163, -105377, 45060, -198691, 105675, 165609, -111675, 170223, 290240, 97845, 408201, -368661, -142439, 2404, 181210, -242986, 163873, -132927, 78535, -162824, 7663, -91785, -128165, -46680, 319833, 186743, -49526, 86679, 303989, 55708, 238189, -139654, 34116, 11878, 76437, 79015, 157790, 150007, 223543, -236316, 214182, 229355, 366608, -138025, 11024, 390360, -48393, 208315, 66928, 149341, 151681, 106714, 8773, 309843, 30618, 304833, -99689, 15626, 239060, 156088, 58454, 116443, 269625, 223754, 191678, -141936, 74879, -210021, -303977, 96410, 298438, -137695, 281364, 377555, -213419, 426364, 461307, 266046, 471624, 484867, 296507]
15114B96507j26599j8806h9267P04l61452a69065D4706L51750C9689J10771A9594
15102I5545a28424B25925b13146e3791b0581A95200b37649c2608A28371f3357
15091B36702J02484j49124J6813q0658k9219C6672N2200O4985C3221J40106a11975
15079C0472L17888j24003i00A09867j7640P5821a41123E11336B54731r3795G7603
15067C30132j06195p7058K18233a01339D3050L37610A03100K37625j04201K42244
15057D78768A34740L34866j75550A28887J92282m0273l7545K47976k02573J55604
15047D44358K38099B54807J78137G6365a18520B14492J06042G4262K43117j56054
15037A61325K71238l9379A08436K02575L02294j40494o491Q6773L24553j11254
$$ y = [296507, 169908, 151102, -89267, -88563, -450015, -169065, 44706, 396456, 39689, 150460, 19594, 95545, -128424, 225925, -213146, -53791, -20581, 195200, -237649, -32608, 128371, -63357, 236702, 339186, 190062, 206875, 126217, 96998, 36672, 88872, 153857, 33221, 173327, -111975, 30472, 348360, 224357, -900, 109867, 92227, 168048, -141123, 511336, 254731, 160936, 77603, 330132, 223937, 146879, 365112, -101339, 43050, 380660, 103100, 340725, 236524, 478768, 134740, 469606, 294056, 128887, 321169, 280896, 243351, 491327, 288754, 444358, 682457, 254807, 432944, 76365, -118520, 214492, 320534, 74262, 317379, 161325, 432563, 393184, 108436, 311011, 613305, 472811, 466320, 553093, 877646, 766392]
15027G66392L71934l99192k05216j08697E4685J08793M84378N5774k7737j63088
15017E12805B14227M2656O61760D13739H6270M87511j80931j62332K51964N81
15007D83063d1072D69689O6910A73754K26573q9541I2323N22979A07987N67769
14997F75756l32700J7634J05086j74708J41279L6365p3691N5188J13764K0302
14987E84275Q5170l13077J5285J16092M65111n3917Q9929k49717L74470D71966
14976F14197j85378K89791j25500L1531R0646K2524C65390L83535l44816J27505
14966E31614G4532R7464K39358k1423l1978d0258G02346B72101j13819L12204
14956D70486A53258K50585A21567Q823N1810R3738L34491r2526j09865J21152
$$ y = [766392, 1138326, 739134, 533918, 425221, 54685, 163478, 647856, 703630, 675893, 512805, 214227, 256883, 918643, 413739, 86270, 573781, 392850, 230518, 482482, 483063, -41072, 469689, 536599, 173754, 400327, 310786, 92323, 615302, 107987, 675756, 343056, 360690, 465776, 291068, 432347, 468712, 395021, 450209, 563973, 584275, 669445, 356368, 371653, 487745, 952856, 898939, 988868, 739151, 1113621, 471966, 614197, 428819, 718610, 593110, 624641, 715287, 737811, 365390, 748925, 404109, 531614, 74532, 171996, 411354, 389931, 357953, -40258, 702346, 272101, 158282, 470486, 153258, 403843, 121567, 130390, 182200, 275938, 610429, 517903, 408038, 529190]
14946E29190A43465F4797L29608K92621Q626q746J83565l92430O0117P9540P0445
14935F88143B85600J90293n4006K29365L34998q0714L64307R955J42897N7304
14925A479999R1275K60475J23235q5555m43089J91345k96821O97897k4085P42927
14915B737603m09035j90138o54771k97204k51237N9344j32618Q5280l88712j17921
14905D40591r5415J12938J51781k29458A69758J61756J54760k23171J61142N7575
14895D81820l7281L10419C38786q6102M4723L21596k13101l3870J84034j85368
14885C70698L11758O5254L75072m03468K68093J50362l09427K30281j46654J1260
14875I23229l96962R9287k09700j49213J3285J0139J08002J82642j15710J6002
$$ y = [529190, 143465, 64797, 394405, 687026, 695652, 686906, 870471, 478041, 538158, 617698, 688143, 285600, 475893, 421887, 651252, 986250, 905536, 1269843, 1279798, 1422695, 1479999, 1571274, 1831749, 1954984, 1869429, 1426340, 1617685, 1320864, 2018761, 1994676, 2737603, 2328568, 2138430, 1483659, 1186455, 935218, 994562, 861944, 947224, 558512, 440591, 345176, 458114, 609895, 380437, 169758, 331514, 486274, 263103, 424245, 481820, 444539, 754958, 338786, 252684, 297407, 619003, 405902, 372032, 556066, 370698, 682456, 747710, 1122782, 719314, 987407, 1137769, 828342, 1058623, 911969, 923229, 526267, 625554, 415854, 266641, 279926, 290065, 398067, 580709, 464999, 481001]
14865D81001K62718m805k01907J86144k70259j12784K80964l0442R9607k62358
14855D27879L63167k12972p5148R2936P5597j75885J42650p3864O7087k01885
14845D29562K04628J59068J10341J03416P120N5814K17024k43007K77455l77766
14835I43655J25372k85863j55370j33285r6523J45456J68615K49353m14153j05539
14825D41718J25675J85548k59701J44367m9098m3895j75152K16324K85902p2886
14815G98802j55375L69009k84744j79593J45341j32213L47170l0590k88386J66813
14805G56234M6769L5217j06915J68170o2368K10255C40599o0872M43622j78847
14795E44502M75637D73302j82479k5907K04489q9201N35385o565B97914M41777
$$ y = [481001, 743719, 738914, 537007, 723151, 452892, 340108, 621072, 590630, 690237, 427879, 791046, 578074, 502926, 595862, 671459, 495574, 638224, 564360, 631447, 429562, 634190, 793258, 903599, 1007015, 1014135, 1069949, 1286973, 1043966, 1321421, 943655, 1069027, 783164, 627794, 494509, 397986, 543442, 712057, 961410, 547257, 441718, 567393, 752941, 493240, 637607, 588509, 544614, 369462, 585786, 871688, 798802, 643427, 1012436, 727692, 548099, 693440, 561227, 908397, 877807, 589421, 756234, 803003, 838220, 731305, 899475, 837107, 1047362, 340599, 279727, 723349, 544502, 1020139, 473302, 290823, 264916, 469405, 380204, 915589, 909024, 297914, 739691]
14785G39691K93836m78673J10538L5334L17941m45488j08525K95399K27389D84763
14774A072943r1105J6667j28272J42716j31897j4509k12007k10372L34002C82892
14763E23233J16537J19606k0211j80282B71215K33294N11807k83444k10779K04353
14753G26446B77026K31792J78938J27393j5855k20741r6206K48003j53407n1988
14743E24955N05926m33278p237K74976j63916l5284k75766L58280P6522J5898
14733H41076J55308j70513J10141J39833j27439N33406L56195P6904L8520m0799
14723A912632l37799o29050n0876M24862j68713P675j3898k86089R599N718J08225
14712I82286j64371j37094K44089Q145j23586m8679Q2112L94850O2094K67563
$$ y = [739691, 1033527, 554854, 665392, 700726, 1018667, 573179, 464654, 760053, 987442, 484763, 1072943, 981838, 998505, 870233, 1012949, 881052, 866543, 654536, 444164, 778166, 382892, 523233, 639770, 759376, 739165, 558883, 271215, 504509, 1016316, 732872, 522093, 726446, 277026, 508818, 687756, 815149, 799294, 578553, 482347, 730350, 576943, 524955, 1030881, 597603, 590366, 865342, 701426, 666142, 390376, 748656, 825178, 841076, 996384, 825871, 936012, 1075845, 948406, 1481812, 1838007, 1914911, 1953431, 1912632, 1574833, 945783, 894907, 1319769, 1151056, 1158731, 1144833, 858744, 868343, 874061, 982286, 817915, 680821, 924910, 933055, 809469, 760790, 842902, 1237752, 1299846, 1567409]
14702A567409J30734J73972L4694O7931k79870m28879J22267m53578M122J69736
14692A108538j0336j00791N2634N2797n30745K67992M9827J94308l0429j25902
14682I27893M8538l030M47324l79474l55843N34687o4252p4597l5245k70025L83821
14671A159797k78835J31394j00829j77303K03057q9721K82919l47859j5768J6830
14661G83682M11894l34907M16388j62719j94141J70409j95066L11956N5645J82337
14651A445478K24972m80580L6788l06323J86439J25473q157J8060J64017k31964
14641A174203j54608j04727M51834n27498M20805k9831m2763J65917l91649j3531
14631I48152N36667k85970Q3524o1253l84460O26147l15898J25772L6857O5616
$$ y = [1567409, 1698143, 1872115, 1906809, 1974740, 1694870, 1265991, 1388258, 934680, 938802, 1108538, 1098202, 997411, 1050045, 1102842, 572097, 840089, 889916, 1084224, 1053795, 927893, 976431, 973401, 1420725, 1041251, 685408, 1220095, 1155843, 1081246, 1046001, 775976, 1159797, 880962, 1012356, 911527, 734224, 937281, 847560, 1130479, 782620, 766852, 783682, 1195576, 860669, 1277057, 1114338, 920197, 1090606, 895540, 1207496, 1263141, 1445478, 1670450, 1189870, 1226658, 920335, 1106774, 1232247, 1224090, 1242150, 1406167, 1174203, 1019595, 914868, 1366702, 839204, 1260009, 1230178, 1187415, 1353332, 961683, 948152, 1484819, 1198849, 1282373, 1221120, 836660, 1462807, 1146909, 1272681, 1309538, 1375154]
14621A375154k36842j27906R6445K41498j5522j7317M47K6440O0114l87640N23249
14610A538120k53790J28882l30366L23898r5340J29439j58250K27154O6275k40114
14600A335908L45504m98039K94695j6865l7062K66900O5853O0953l38523K07352
14590A686676J4902J11945j11n78078N44112j86424O81858k70631j93343J8572
14580A829478Q3645L65825L0699p8570k50061l90876N98482J31919j07854j59163
14570B053524l77133L04198L3254J65507R8754l31579N66728n7272J96281j63350
14560B488912L75700j68265K31472o9905K11941R7556L49739K42517J14489Q48791
14550D722947M06242J827086M017103R470673J7860522P704386B1411087H949278
$$ y = [1375154, 1138312, 1010406, 1106851, 1348349, 1332827, 1315510, 1315957, 1342397, 1402511, 1014871, 1538120, 1284330, 1413212, 1082846, 1406744, 1311404, 1440843, 1282593, 1509747, 1576022, 1335908, 1681412, 1183373, 1478068, 1461203, 1424141, 1691041, 1756894, 1817847, 1479324, 1686676, 1701578, 1813523, 1813412, 1235334, 1779446, 1593022, 2274880, 2004249, 1810906, 1829478, 1913123, 2278948, 2309647, 2231077, 1981016, 1590140, 2188622, 2320541, 2212687, 2053524, 1676391, 1980589, 2013843, 2179350, 2278104, 1946525, 2513253, 2455981, 2652262, 2488912, 2864612, 2696347, 2927819, 2857914, 3069855, 3167411, 3517150, 3759667, 3874156, 4722947, 5129189, 6956275, 10973378, 20444051, 38304573, 46008959, 21411087, 8949278]
14541D748237j758234p13706K30503Q08930J048905Q64416k162466j027635j62103
14532A876847k960K97039m15017K98533O2514j54227K78472M34851k47800o1599
14522B366653j97289M91242j9552N192N2205k73766p474L68548j17212j47250
14512B521297N27077n48370K66561k22321K36965K79362l60431J09897k82340
14503B527697J14172L14182l9607J73136l004O4212l1228j01044K41362o8807
14493C191071M76813j86718J10677m10881K69070K17166o7156k15201N07777Q6486
14483C979104r1822l55327J03493J70534j23501j15090J09549L30795j90159J82191
14473C999767L3860J80255l34366L04059K54224M1338k43267K62559M0288L8789
$$ y = [4748237, 2990003, 2276297, 2506800, 3315730, 4364635, 5229051, 3066585, 2038950, 1876847, 1873887, 2170926, 1755909, 2054442, 2116956, 1962729, 2241201, 2676052, 2428252, 2366653, 2169364, 2660606, 2641054, 2646246, 2698451, 2424685, 2417211, 2785759, 2668547, 2521297, 3048374, 2500004, 2766565, 2544244, 2781209, 3060571, 2700140, 2810037, 2527697, 2641869, 2956051, 2916444, 3089580, 3086576, 3150788, 3119560, 3018516, 3259878, 3191071, 3667884, 3481166, 3591843, 3180962, 3450032, 3667198, 3600042, 3384841, 3892618, 3979104, 3887282, 3531955, 3635448, 3805982, 3682481, 3567391, 3676940, 4007735, 3817576, 3999767, 4033627, 4213882, 3879516, 4183575, 4437799, 4479137, 4235870, 4498429, 4538717, 4577506]
14463D577506k52036L06890Q2368j9741l47287M30569L6148Q9834J86600j53019
14453D937832J83864n0614K27465l51448J79897J58153K01687k3471M2179j24982
14443E380562R9702K24580M4552J79885K26834j33195L08546m03047L13636J91533
14433F433588o0463N09295l70138K16161J03363L14707j74369L34702J54755P3419
14423G535020O1181j10216L32258L99088j35574P00205m88628L56140l05211J39507
14413H483770k1691M19578L5615m5240M1274K47662M71583J12805J10242K44603
14403A0100201J07402L33452j37183K14929k23439L99861K53533j20661K89082
14394A1217177O01247r0926m39817M81820K77575M55106j49319M31083L19166
$$ y = [4577506, 4325470, 4632360, 4714728, 4694987, 4347700, 4778269, 4814417, 4904251, 5090851, 4937832, 5121696, 5071082, 5298547, 4947099, 5126996, 5285149, 5486836, 5463365, 5505544, 5380562, 5480264, 5704844, 5749396, 5929281, 6156115, 6022920, 6331466, 5928419, 6242055, 6433588, 6373125, 6882420, 6512282, 6728443, 6831806, 7146513, 6972144, 7306846, 7461601, 7535020, 7596201, 7485985, 7818243, 8217331, 8081757, 8781962, 8293334, 8649474, 8344263, 8483770, 8462079, 8881657, 8917272, 8872032, 8913306, 9160968, 9632551, 9745356, 9855598, 10100201, 10207603, 10541055, 10403872, 10618801, 10395362, 10795223, 11048756, 10928095, 11217177, 11818424, 11727498, 11287681, 11769501, 12047076, 12502182, 12352863, 12783946, 13103112]
14385A3103112J74214M72032p4656O16316L17618K08581L77641m9598K17638N5824
14375A5418722K90161N98150J49763Q2724O98243L04717j6709N80485O28101M23571
14365A9157928N71002M69573J59530K93486J66252O47754L77712M41739N87662
14356B2872638K23603O56663N49652P67228P69888N32108N86422M76476P56168
14347B8190846O57778O35465R31498P58035M93441J126381P42734J189427Q82036
14338C5607641R62439J167657P80570J285041J087847J634260Q67339J481357
14330D4874151J364398J599209J478873J196904K076785J718085J875872J956928
14322E8141205K026970K243785J901729K529933K318791K398617K348962L068941
$$ y = [13103112, 13277326, 13749358, 13674702, 14291018, 14608636, 14817217, 15194858, 15145260, 15362898, 15418722, 15708883, 16307033, 16456796, 16539520, 17237763, 17542480, 17525771, 18106256, 18734357, 19157928, 19728930, 20198503, 20358033, 20651519, 20817771, 21465525, 21843237, 22284976, 22872638, 23096241, 23752904, 24302556, 25069784, 25839672, 26371780, 26958202, 27434678, 28190846, 28848624, 29484089, 30415587, 31173622, 31667063, 32793444, 33536178, 34725605, 35607641, 36570080, 37737737, 38518307, 39803348, 40891195, 42525455, 43392794, 44874151, 46238549, 47837758, 49316631, 50513535, 52590320, 54308405, 56184277, 58141205, 60168175, 62411960, 64313689, 66843622, 69162413, 71561030, 73909992, 76978933]
14314G6978933L023987L325737L328659L122865L932207M009835L850693M592440
14306A06165356M597505M912801N519356N287729N829850O295857O677254P076144
14298A52361852P647992P697141Q475941R452556R839697R897758J0226970J1246071
14290B26845978J2047074J2429103J2380834J3560623J4313034J4633373J4840314
14283C21050333J5406026J5500698J5411096J5534158J5144779J4539677J3706596
14276D26293363J2582826J1463154R248620O581953K806746j329532k064205Q04089
14268D66387014l695588l320580m635750p741431j0965752j2442574j3808942
14261D09776397j4510858j5363644j5767245j5971136j5902871j5803769j5292882
$$ y = [76978933, 80002920, 83328657, 86657316, 89780181, 93712388, 97722223, 101572916, 106165356, 110762861, 115675662, 121195018, 126482747, 132312597, 138608454, 145285708, 152361852, 160009844, 167706985, 176182926, 185635482, 195475179, 205372937, 215599907, 226845978, 238893052, 251322155, 263702989, 277263612, 291576646, 306210019, 321050333, 336456359, 351957057, 367368153, 382902311, 398047090, 412586767, 426293363, 438876189, 450339343, 459587963, 466169916, 468976662, 467647130, 465582925, 466387014, 462691426, 459370846, 454735096, 446993665, 436027913, 423585339, 409776397, 395265539, 379901895, 364134650, 348163514, 332260643, 316456874, 301163992]
14254C01163992j4658113j3851124j3866038j3153842j2308930j1993816j0604498
14247B10727631q782338j0040066r318182q554314q094957p984044p397588p001877
14239A43554265o406163o109048n262525n927659n158383n171087m280503m008394
14231A01230503l741366m057090l782794l607631l464976k931892l159447k742171
14223G3743136k752746k545844k191385k035173k191290k390676j974392j876887
14215E5784743j880984j178544j401828j737037j774560j335637j522486r50863
14207D4002804q05987j171467j240340j253010j469643r99631p66378n21465j198841
14198C4576042j092287r36601o36023o50255p99864q84110p14906q40396p56407
$$ y = [301163992, 286505879, 272654755, 258788717, 245634875, 233325945, 221332129, 210727631, 201945293, 191905227, 182587045, 174032731, 165937774, 157953730, 150556142, 143554265, 137148102, 131039054, 125776529, 119848870, 114690487, 109519400, 105238897, 101230503, 97489137, 93432047, 89649253, 86041622, 82576646, 79644754, 76485307, 73743136, 70990390, 68444546, 66253161, 64217988, 62026698, 59636022, 57661630, 55784743, 53903759, 52725215, 51323387, 49586350, 47811790, 46476153, 44953667, 44002804, 43196817, 42025350, 40785010, 39532000, 38062357, 37062726, 36296348, 35774883, 34576042, 33483755, 32547154, 31911131, 31260876, 30461012, 29576902, 28861996, 28021600, 27265193]
14189B7265193n95169k37227r39757n55034n77055k85689o95855o65779k39410
14180B2474218o63274m89433o22981j46283k97410o76745l63802j12900n59010
14171A8542380j88963k76696o76626m91437k28805l9345n12468m54684k14444
14162A5458912K31272n59667n43758l3291l83592j82323q5435m37801k64441k08892
14152A2990984k13696l02925J83112r3857m34417k33592l20716k70351l00660
14143A1003882P8850l82831K27525n50539j91834j71280O1375r2641p4164P8931
14133I987274k65396k61303k65656r5813R9512j12539j83565j04308l10062j44580
14123H343564j01782L2308l17386J69122n04089K48742J08572j10057m73666L4911
$$ y = [27265193, 26670024, 26432797, 25493040, 24938006, 24360951, 24075262, 23379407, 22713628, 22474218, 21810944, 21321511, 20698530, 20552247, 20254837, 19578092, 19214290, 19101390, 18542380, 18353417, 18076721, 17400095, 16908658, 16679853, 16640508, 16128040, 15673356, 15458912, 15690184, 15130517, 14586759, 14553468, 14169876, 13987553, 13902118, 13464317, 13199876, 12990984, 12777288, 12474363, 12657475, 12563618, 12129201, 11895609, 11574893, 11304542, 11003882, 11082732, 10699901, 10927426, 10376887, 10185053, 10013773, 10075148, 9982507, 9908343, 9987274, 9721878, 9460575, 9194919, 9099106, 9198618, 9086079, 8902514, 8798206, 8488144, 8343564, 8241782, 8274090, 7956704, 8125826, 7621737, 7870479, 7979051, 7868994, 7395328, 7430239]
14113G430239l81958J2943K2895M2190k16500k30246J18640J9088j44319j67079
14103F505893p3296q3067j05755J6335l59060M59098l98196k64677K10439J17170
14093F024884m56033K81719k60983j73792J9287K39002n80628K65129j53010l10163
14083D895412M93486k95707j55263M6891k19207K00067p9137k52472J0527M4622
14073D689219p1379K75903m43665J71176r2478r9820J09549K73333n57465P4822
14063D329195J5577K1465j02879L14225n7345k22759k89407L1093O6653Q1545
14053D187363l10791K11869k52587n5124j01680j6329p4121k0478Q2585j15837
14043C534870l4743Q5407j75475j03102M08100k16146l70974K62073j37918J59285
$$ y = [7430239, 7048281, 7061224, 7084119, 7126309, 6909809, 6679563, 6798203, 6817291, 6672972, 6505893, 6432597, 6349530, 6243775, 6260110, 5901050, 6360148, 5961952, 5697275, 5907714, 6024884, 5568851, 5850570, 5589587, 5415795, 5435082, 5674084, 5093456, 5358585, 5205575, 4895412, 5388898, 5093191, 4937928, 4984819, 4765612, 4965679, 4886542, 4634070, 4644597, 4689219, 4617840, 4893743, 4450078, 4621254, 4528776, 4428956, 4538505, 4811838, 4254373, 4329195, 4344772, 4366237, 4263358, 4577583, 4520238, 4297479, 4008072, 4039165, 4105818, 4187363, 3876572, 4088441, 3835854, 3780730, 3679050, 3662721, 3588600, 3568122, 3650707, 3534870, 3500127, 3585534, 3410059, 3306957, 3715057, 3498911, 3127937, 3390010, 3252092, 3411377]
14033C411377k32658k58685L44514l23998N99276m14013P2948l06809k18710J18419
14023B791661j24757L64054n58063K14447N59235o19787N1573k33499M17805j59385
14013B703284l61159K41630l65877M57277o0622m12873P8430j42630J63986l43617
14003A957829J45363j14519M28103j37060j05503j77582K48306j35133K32744
13994B342548l40957r3975L30124k75170M40397N95733K355917P443146J8011538
13985C0809301J6918486j7994902j4683553o102180k616313j610256m84697k07870
13977D028016n99264k86576L2941j50343l20558k08434J32017k20938K03837R0394
13967B701092l3486n19332K49026J21503R0841k26337j0787k09539j70092q485
$$ y = [3411377, 3178719, 2920034, 3264548, 2940550, 3539826, 3125813, 3198761, 2891952, 2673242, 2791661, 2666904, 3030958, 2472895, 2687342, 3246577, 2626790, 2678363, 2444864, 2862669, 2703284, 2342125, 2583755, 2217878, 2675155, 2614533, 2201660, 2280090, 2137460, 2301446, 1957829, 2103192, 1988673, 2416776, 2279716, 2174213, 1996631, 2244937, 2109804, 2342548, 2001591, 1907616, 2237740, 1962570, 2402967, 2998700, 5354617, 12797763, 30809301, 47727787, 29732885, 15049332, 8947152, 6330839, 4720583, 4235886, 4028016, 3428752, 3142176, 3175117, 3024774, 2704216, 2495782, 2627799, 2406861, 2610698, 2701092, 2667606, 2148274, 2397300, 2518803, 2609644, 2383307, 2372520, 2162981, 1992889, 1984404]
13957A984404J52976j62575L06088M2953m94704j03851K36929m1973J80533j66141
13947A934639j80005L43572J2884R349q1741j36253K7202J10602o29769L35077
13937A745557N9889J91547m74400L98039k13118p8680j4892L13220n4082l2539
13927A840541K30422n22228o1675M87741q5483k52374K5461r9582m7914o8000
13917A446909K82725k56578J7762k75322M06545j69778p8957K32415j53733K93480
13907A745468k40402j4285k83964K02564J48923J45197l10151J40537m0793l2274
13897A460820j73729J08634l74147L76164l84887R6528L59588m7024j04362l74662
13887I42923K21970K2095J91863K0346R9685k04535P8100j94142l1860o914R6846
$$ y = [1984404, 2137380, 1974805, 2280893, 2323846, 1829142, 1725291, 1962220, 1920247, 2100780, 1934639, 1754634, 2098206, 2111090, 2120439, 2038698, 1902445, 1929647, 2040249, 1410480, 1745557, 1805446, 1996993, 1522593, 1920632, 1707514, 1628834, 1613942, 1927162, 1873080, 1840541, 2070963, 1548735, 1487060, 1974801, 1889318, 1636944, 1662405, 1562823, 1514909, 1446909, 1729634, 1473056, 1490818, 1215496, 1622041, 1452263, 1373306, 1605721, 1451988, 1745468, 1505066, 1490781, 1206817, 1409381, 1558304, 1703501, 1393350, 1533887, 1493094, 1460820, 1287091, 1395725, 1021578, 1397742, 1012855, 1109383, 1468971, 1421947, 1317585, 942923, 1164893, 1186988, 1378851, 1399197, 1498882, 1294347, 1372447, 1178305, 1146445, 1139531, 1236377]
13876A236377r2246J07325K3065l86914J05844J52505J94023k92851M1501m0065
13866A048564j59380L39016O1388k51431R6221k6262J7780k91416R4599L02710
13856A231789N4517O8513m31445K28258J13019J8101q7062k5299R8625j35180
13846A133836P5123J38223k43599j66146K27108j2952J25333j42055k25219K71663
13836A181315N5794m13943Q853l2734M37419n5010k59494O1670N2837k84342L15893
13825A068258j06046r890P2103j39915J22568j55855L01826l89579J90229q5277
13815H68422C03304N23974K45596j45427K7051j46305J93689K1879k68034K50716
13805A006443k57116L8481K49616l90587O6027K37647r1316k87783M5973K63505
$$ y = [1236377, 1144131, 1251456, 1274521, 887607, 993451, 1145956, 1339979, 1047128, 1088629, 1048564, 889184, 1228200, 1289588, 1038157, 1134378, 1108116, 1125896, 834480, 929079, 1231789, 1286306, 1354819, 923374, 1151632, 1264651, 1282752, 1195690, 1170391, 1269016, 1133836, 1208959, 1347182, 1103583, 937437, 1164545, 1151593, 1276926, 1134871, 909652, 1181315, 1237109, 823166, 832019, 799285, 1236704, 1181694, 922200, 983870, 1036707, 752365, 1068258, 962212, 952322, 1024425, 884510, 1007078, 851223, 1153049, 763470, 953699, 868422, 303304, 827278, 1072874, 927447, 954498, 808193, 1001882, 1023761, 755727, 1006443, 749327, 787808, 1037424, 646837, 712864, 950511, 859195, 571412, 617385, 880890]
13795H80890J83668j78098P0944k45712j27218J84425M0245k19435J12215J3313
13785G15237K03154k97325L16901J12496J590j90561k3312J29378J32449l85851
13775G14156j18927K51510l9831j81823K33321j64512L7167N6774l02263J56646
13765F42218J47303M8284k92664j81234J57603L2951J82852j80732J041m3932
13755E13690L53525P4485m3341k04114k67184L70613k77459K57319q5290O4672
13745G56916o5251J51481k89287Q7442P3983j10546n7692n8702J56298N7260k09905
13734D91997J19852j90740K27879R7224j4215j76617L42178l30766j5455p2135
13724D79202R4124M143Q1010B70098M36796j7541o5497K02943C49396J2560K50811
$$ y = [880890, 1064558, 886460, 957404, 711692, 584474, 768899, 809144, 589709, 701924, 715237, 918391, 621066, 937967, 1050463, 1052053, 861492, 838180, 967558, 1100007, 714156, 595229, 846739, 806908, 625085, 858406, 693894, 731061, 787835, 485572, 642218, 789521, 837805, 545141, 363907, 521510, 554461, 737313, 556581, 557622, 513690, 867215, 941700, 898359, 694245, 427061, 797674, 520215, 777534, 692244, 756916, 691665, 843146, 553859, 641301, 715284, 604738, 547046, 488344, 644642, 701902, 491997, 611849, 421109, 648988, 746212, 731997, 555380, 897558, 566792, 551337, 479202, 573326, 577469, 658479, 270098, 706894, 689353, 623856, 826799, 349396, 361956, 612767]
13713F12767p0002m9735K6965K92707K90926m11527n7750O9625j38690M3893j69800
13702D39379J41862M8741k71888n3290K20757j19097K46211A62037J32495L05307
13692E99839j38659K41871k45360M04774C25187O10907m29026l2809K86103j01748
13682F58614j05553B35139K76397K10317C47117L192L60323B14542M12471J5277
13672F42290j57475j199P3521A98008M91519k30236K17251k27566K07092j78688
13662D77380j16443n4870K53624B20497J29281J99281A65460L44443J62023j60173
13652E11753K17456C00527J39920p4988L57518k23149K09546k63408j55386K60073
13642E50653j61784j55948m4451F9870K31986R094Q7902K4990K27529k15561A82707
$$ y = [612767, 542765, 493030, 519995, 812702, 1103628, 692101, 634351, 703976, 565286, 609179, 439379, 581241, 629982, 358094, 304804, 525561, 406464, 652675, 162037, 294532, 599839, 461180, 703051, 457691, 862465, 325187, 936094, 507068, 474259, 760362, 658614, 553061, 235139, 511536, 721853, 347117, 350309, 710632, 214542, 627013, 642290, 484815, 483616, 557137, 198008, 689527, 459291, 676542, 448976, 656068, 477380, 360937, 306067, 559691, 220497, 349778, 549059, 165460, 509903, 671926, 511753, 729209, 300527, 440447, 365459, 722977, 499828, 709374, 445966, 290580, 550653, 388869, 232921, 188470, 69870, 301856, 310950, 398852, 423842, 651371, 435810, 182707]
13630C14627L31066B28874M08435k00940J82116j55629j01198J8573P6189A42821
13619B50470j14031J53249J21205O5303Q1340j72352j50467K81201L9889j68195
13609C87612P9907o2168L4762L03310l03346Q0965k52893e0361C32103A46328
13598G64782j90146g2630D58446A30992O30843J09890k91232k78926J21074o5221
13588C57420K8824j05713M7148l1049J17641B02004K09225q9479J83102j1616
13578D93236k04615K69394j61020j84243M05620k22146F1980J49737p8231L49082
13568D82568H9860J81080J91256J7680A51217K78341n7120p1116j8237R6632r8363
13557B81354P1473J44999j39593G2358K65794J53938A17988L35606m8143l863
$$ y = [314627, 645693, 228874, 637309, 436369, 618485, 462856, 361658, 380231, 456420, 142821, 250470, 136439, 289688, 410893, 476196, 557536, 385184, 234717, 515918, 555807, 387612, 467519, 405351, 440113, 743423, 440077, 521042, 268149, -50361, 332103, 146328, 764782, 574636, -72630, 458446, 130992, 761835, 871725, 580493, 301567, 422641, 357420, 386244, 280531, 327679, 296630, 414271, 202004, 411229, 321750, 504852, 493236, 288621, 558015, 396995, 212752, 618372, 396226, 61980, 211717, 133486, 482568, 89860, 270940, 462196, 479876, 151217, 429558, 372438, 301322, 283085, 379717, 281354, 352827, 497826, 358233, 72358, 338152, 492090, 117988, 453594, 405451, 401588]
13547D01588q5037M9408M6941j71350L32135j97176p3349J31194m9512K4305J06927
13536E16074k50988P8543j10875b5145D95641A4386M97906k19148J72818J20754
13526E86716A16976J78408J39434a2234C03940l2527b02986A8712J52222J87716
13516C58650A76300P6549p6153N3825j4367J00989N859p5782M6715O143a11006
13504D01510j85844k7462b29592B97171O2835j12419J96232m5381R6382A02767
13493e7E0200i7432E88028B66346J25176o2308j28435L36874k58032k0262P7226
13482C36585j07348N4359M8731K5906A56054K82319j44744P7843G9278K5184J22001
13471B26463J94970A46669K74970f0352B94592L22613j39124H0357J19065L56817
$$ y = [401588, 316551, 365959, 412900, 241550, 573685, 376509, 303160, 434354, 384842, 409147, 516074, 265086, 343629, 232754, -25145, 495641, 14386, 512292, 293144, 465962, 586716, 116976, 295384, 434818, -12234, 303940, 271413, -202986, 18712, 170934, 358650, 176300, 252849, 176696, 230521, 216154, 317143, 323002, 247220, 293935, 300078, -111006, 401510, 215666, 188204, -229592, 297171, 360006, 247587, 443819, 398438, 494820, 102767, -57, 50200, -97432, 588028, 266346, 391522, 329214, 200779, 537653, 279621, 259359, 336585, 229237, 283596, 332327, 358233, 156054, 438373, 293629, 371472, 79278, 104462, 226463, 421433, 146669, 421639, -60352, 294592, 617205, 478081, 80357, 199422, 556239]
13461E56239A31121K3593K26984r0755K8735Q0606I2383Q294K45844J62440F5986
13449B76554J7433M3847C6099J67088J45425A58176L10244L1160a81310D57831
13438B17563n7517h8314A83465o6579a40761A63482R2900R7083A37055K48891
13428C85946A07782K4024K29043J22238A37519Q9055j1252G0120K67320l8699
13418B98741e7877b5035B86463J795A24382J80163A21834J14239R2533B8104L61066
13407C89170A58751G6042L33662n861B00378L0359J16862c7076A4845L33951A32976
13395D40666e049C1929d05247B83537a50108e38H5850a03998F7842M2676D4845
13383B32317L6995Q9371J3025B4590K35478o3338B1297J56649K53123e4133B71970
$$ y = [556239, 131121, 154714, 381698, 290943, 319678, 400284, 92383, 100677, 346521, 508961, 65986, 276554, 293987, 337834, 36099, 203187, 348612, 158176, 468420, 499580, -181310, 457831, 217563, 160046, -88314, 183465, 116886, -140761, 163482, 256382, 353465, 137055, 385946, 107782, 131806, 360849, 483087, 137519, 226574, 215322, 70120, 337440, 298741, -57877, -25035, 286463, 288258, 124382, 304545, 121834, 236073, 328606, 28104, 389170, 158751, 76042, 409704, 403843, 200378, 230737, 347599, -37076, 14845, 348796, 132976, 440666, -5049, 31929, -405247, 283537, -150108, -538, 85850, -103998, 67842, 110518, 44845, 232317, 269312, 358683, 371708, 24590, 260068, 196730, 21297, 177946, 431069, -54133, 271970]
13371B11003J7179J9700L81411A23343B1855M34542F7201K65345o3193a95843
13360A16516k5224M85067k27333J13484B26772N6917A07472K31948m8255b20715
13349B63867k3463R3115A50802J48502A9906K50544j6898J72100E7221L17222
13339C74443j01482J8702J77848A09514m5893J67395r4448K5964J40503A09209
13328B78713R943J61599D6355M9953i9978D2956L49531a6787D7482K11046p9238
13317A79290J47525q2414j14004K45997J03364B39159O0437m2437C4351K1631
13307E5982b8465A77201J2499E2923L07823B5538J14591L5238o9597b02235E0930
13295a2239C33555B4596K9034c6215H5985K61423j28043G290K80402a05861b0532
$$ y = [211003, 228182, 247882, 629293, 123343, 21855, 456397, 67201, 332546, 269353, -195843, 116516, 91292, 576359, 349026, 462510, 226772, 283689, 107472, 339420, 291165, -220715, 263867, 240404, 333519, 150802, 299304, 19906, 270450, 253552, 425652, 57221, 374443, 272961, 291663, 469511, 109514, 63621, 231016, 136568, 162532, 303035, 109209, 278713, 288656, 450255, 46355, 96308, -99978, 42956, 392487, -16787, 47482, 258528, 179290, 326815, 244401, 130397, 376394, 479758, 239159, 299596, 257159, 34351, 55982, -28465, 177201, 189700, 52923, 360746, 25538, 140129, 175367, 105770, -202235, 50930, -12239, 333555, 24596, 53630, -36215, 85985, 347408, 219365, 7290, 287692, -105861, -20532]
13283g5187A50206J47705B5310O7393r521K3113J57721q9918o7441J37117j17525
13272A26249N7821P212n3069a86801C26559j1920j34215c9578A76096R6446l2620
13261B39922n3696K39916F5858h1670F4947R354L9179Q8259Q4484j05140E4864
13249C35788a2081D2806a74383A10622J59993a2324B16289r753m0658p8104O4663
13238A52437J06822l7260h6906A97008B3204K76821j02636B8197B221f6862A05392
13226C97699r6102p2088L8893C0033f5597b6729F5190K58586h4860B87446G2178
13214A74280o7434J9766o1266R5806l0737o0357a60322e8010A55639o5163J83384
13203B73860b414G823K44073a65891f8229A28641e7323A74419J85197b01634e1314
$$ y = [-75187, 150206, 297911, 25310, 92703, 83182, 106295, 264016, 174098, 106657, 243774, 126249, 184070, 191282, 138213, -186801, 326559, 314639, 180424, -39578, 176096, 272542, 239922, 186226, 426142, 65858, -81670, 64947, 74301, 113480, 201739, 286223, 181083, 54864, 335788, -12081, 42806, -174383, 110622, 270615, -12324, 216289, 206536, 165878, 87774, 152437, 259259, 221999, -86906, 197008, 23204, 300025, 197389, 28197, 2221, -66862, 105392, 397699, 301597, 229509, 268402, 30033, -65597, -26729, 65190, 323776, -84860, 287446, 72178, 174280, 106846, 126612, 65346, 161152, 130415, 70058, -160322, -58010, 155639, 90476, 273860, -2414, 7823, 251896, -165891, -68229, 128641, -57323, 174419, 359616, -201634, -51314]
13191B01151H0564h0825A30190K29144C5493J45109b02832D77452F0580O2146
13181A22726b84807C9909A1066J99453Q5279p888B8769E328J91954C6667b54163
13169I1225J6998B4394J48363l9316Q5411m404G3364J85297a26438B26511a62527
13157B86512b27169G983e090k106E0047j9136L03275c31412B34064I9328J72316
13146B71644n6426M8652m042c0556l6454D21871F8978A4405J92609a63197I3224
13134a92094A654K70482A32233n9128R5831c9273B13052K2671b4839A8448J20481
13123A38929M209g4708j31898A67400a71630C33880b51325d2234A97279O6745
13113B64024A937K50436o0749p8101K45288b1858j09268b4516d717B71061A22365
$$ y = [201151, 80564, -80825, 130190, 359334, 35493, 180602, -202832, 477452, 60580, 122726, -284807, 39909, 11066, 210519, 295798, 287910, 28769, 5328, 197282, 36667, -254163, 91225, 108223, 24394, 172757, 133441, 218852, 214448, 73364, 258661, -126438, 226511, -162527, 286512, -227169, 7983, -5090, -7196, 50047, 30911, 334186, -331412, 234064, 99328, 271644, 215218, 263870, 259828, -30556, -67010, 421871, 68978, 14405, 207014, -163197, 93224, -192094, 1654, 272136, 132233, 73105, 168936, -39273, 213052, 235723, -24839, 18448, 138929, 143138, -74708, -206606, 167400, -171630, 333880, -251325, -42234, 197279, 264024, 1937, 252373, 191624, 113523, 358811, -21858, -131126, -24516, -4717, 271061, 122365]
13101C1257J80252H2321f447n5067n1521D60207a8426q5023F0986L4597l3515
13090F2068b48102I0229a32879l54446F9060a09163A1977e1415A36126g2351p2369
13079a44720j06356B22032c6922C63642e3029E8500K65301b06029A56140o4316
13069I1824B4569a7370E2009A5000M2665e6749B1702L56M396M9883J03189d5963
13056C06224j23524p7875m8193a98993B29584j4674C9130a63740E24902c2399
13045B9714j1687K3089f1677A81731J88638A76718J35357f280o248A51931b03451
13033f731j42036C8482a87307j14617A05045C565L75818A17012a86473l3267P010
13022b12730D3851a62045A95972R6856D2665a09820G4285K62141A24786K6901
$$ y = [31257, 211509, 82321, -6447, -61514, -113035, 460207, -18426, -103449, 60986, 95583, 62068, -248102, 90229, -132879, -487325, 69060, -109163, 11977, -51415, 136126, -72351, -144720, -251076, 222032, -36922, 363642, -53029, 58500, 323801, -206029, 156140, 91824, 24569, -17370, 52009, 15000, 57665, -56749, 21702, 22058, 26454, 76337, 179526, -45963, 306224, 182700, 104825, 56632, -198993, 229584, 214910, 39130, -163740, 524902, -32399, 29714, 18027, 41116, -61677, 181731, 370369, 176718, 312075, -6280, -12528, 151931, -203451, -6731, -148767, 38482, -187307, -301924, 105045, 3565, 379383, 117012, -186473, -219740, -212730, 43851, -162045, 195972, 292828, 42665, -109820, 74285, 336426, 124786, 151687]
13012A51687o8567J60475A05324K93987a27199e740F0310b17924i3827D01387
13001c2753k40300A26659j5067M2950i6349d5931q9811G2002b18388C04878B4922
12989B6908a14274B3013c21124A1319J38993b56119A90266d0661A14540f9215
12978B25047a99675e2390H5836b64866A02362d9070B96238I9606k71O4082c47674
12966E2657L4284j0369e5416A10560J4470J46760a37505E886b80159B30653F3112
12954a20558A63067a76821I0030I567J21358K1388J27338l0627G143a90111A23527
12942I78b03929B37062G1869c4180a2266l8012I8589c3333m7777A46247a78720
12930a78187B77933I7927J26161N3551h959H9220i8061k41448B59008b75320a09423
$$ y = [151687, 83120, 243595, 105324, 399311, -127199, -5740, 60310, -217924, -93827, 401387, -32753, -273053, 126659, 111592, 154542, -96349, -45931, -135742, 72002, -218388, 304878, 24922, 26908, -114274, 23013, -321124, 11319, 150312, -256119, 190266, -40661, 114540, -69215, 225047, -199675, -52390, 85836, -264866, 102362, -49070, 296238, 99606, 99335, 163417, -347674, 52657, 86941, 76572, -55416, 110560, 125030, 271790, -137505, 5886, -280159, 230653, 63112, -120558, 163067, -176821, 90030, 9567, 130925, 152313, 279651, 249024, 7143, -190111, 123527, 978, -203929, 237062, 71869, -34180, -12266, -50278, 98589, -33333, -81110, 146247, -178720, -178187, 277933, 97927, 224088, 277639, -8959, 89220, -98061, -339509, 259008, -275320, -109423]
12918A52125l4866a18296n260A37738K10222q6278M2117n7258A05207a36645p396
12907a44041D17412a57454A17995J42453l5269b02767B45902j5807i3061A0082
12896h0531A13448M0506c25676C02402k9378a29515A67247j9522p2996P0085K5669
12885A70483B6922a89389e467j49426C06059A43685o5344a93412j20255A21062
12874C37943A9557b57020A48390a56292B56979r6560b15963A02214J57552a62917
12863B49618f1025A32595g9936j71092E6599g4266A87216f4937K7672j36800B4343
12851b13351J05602H3113J84245c5343A55479a98834A55174f4946a543k7949A64524
12839I4504Q8016r0756A5644J19415a25697B997J33140a65945g8662j34968G987
$$ y = [152125, 117259, -118296, -123556, 137738, 347960, 261682, 303799, 246541, 105207, -136645, -144041, 417412, -157454, 117995, 260448, 225179, -202767, 245902, 230095, -93061, 10082, -80531, 113448, 153954, -325676, 302402, 273024, -129515, 167247, 147725, 74729, 144814, 170483, 26922, -189389, -5467, -154893, 306059, 143685, 78341, -193412, -313667, 121062, 337943, 19557, -257020, 148390, -156292, 256979, 160419, -215963, 102214, 259766, -162917, 249618, -61025, 132595, -79936, -251028, 56599, -74266, 187216, -64937, -37265, -174065, 24343, -213351, -107749, 83113, 267358, -35343, 155479, -198834, 155174, -64946, -1543, -29492, 164524, 94504, 182520, 91764, 15644, 135059, -125697, 2997, 136137, -165945, -78662, -213630, 7987]
12827A31260a9803j09215m906D29443d7017j13059O5574F5595P4199J14719l4551
12816B19962I5264b75593f8683j8373j01381A49673m5647g6951B60056I9265b723
12804a89712b6991j84276l9373B70030i6450L1530B31250G5705J4760l2358d4084
12792a27832A87032c20827C62990j78832i9717B44374H4695f8831J689H297d08876
12780b29560r7803H4771d63841A9898b39837g6843A06703d2133G4235O6083m8132
12769I2186Q9162a7740j05807q0657B82294a74549l6855c2441r3375G5487a37808
12757A07052J15654f3964C6154e8350b2769C89179A9483R8689a3934o6755k58197
12746c38886a05845C1747a18290o6719B52984J41865e6875A87389J37489J00928
$$ y = [131260, -19803, -129018, -133924, 429443, -47017, -160076, -94502, 65595, 139794, 254513, 219962, 95264, -275593, -68683, -87056, -188437, 149673, 104026, -76951, 260056, 99265, -2723, -189712, -26991, -211267, -250640, 270030, -96450, -64920, 231250, 75705, 90465, 58107, -44084, -127832, 187032, -320827, 362990, 184158, -99717, 244374, 84695, -68831, -67142, 8297, -408876, -229560, -327363, 84771, -463841, 19898, -239837, -76843, 106703, -42133, 74235, 140318, 92186, 181348, -17740, -123547, -204204, 282294, -174549, -211404, -32441, -125816, 75487, -137808, 107052, 222706, -63964, 36154, -58350, -22769, 389179, 19483, 118172, -13934, -80689, -338886, -105845, 31747, -118290, -185009, 252984, 394849, -56875, 187389, 324878, 425806]
12736D25806d4383C9426a66796A09898a67309A36855N5717J85565a00380H550
12725c21090A11579e4679I9385J48915M7515B0075a58230A22727b61072B9143
12714a41949J3329J2292F6298M3190o828K24235H3731K47001B4299K12409J6884
12703B53592Q7564q5797q8576Q5293d3672B82099a90504e6311k01816A06560i7939
12691B25625A09939l2499A8692a42073D9570J94885c29957B42457i6481L92I9524
12679i5683I2605K19937j18716o3499b64971f1071D60781A79831F2672a29273
12668A01682a31227l012I157a99962E7963c32536B72559b29806A10940J13218
12658B24158j00622h6939C19383m2010f4959E9012K13619a23937K5874c4269J4124
$$ y = [425806, -44383, 39426, -166796, 109898, -167309, 136855, 192572, 378137, -100380, 8550, -321090, 111579, -54679, 99385, 248300, 295815, 20075, -158230, 122727, -261072, 29143, -141949, -128620, -116328, 66298, 109488, 102660, 326895, 83731, 330732, 24299, 236708, 253592, 341156, 255359, 166783, 252076, -43672, 282099, -190504, -56311, -258127, 106560, -97939, 225625, 109939, 77440, 18692, -142073, 49570, 244455, -329957, 242457, -96481, -96089, 99524, -95683, 92605, 312542, 193826, 130327, -264971, -61071, 460781, 179831, 62672, -129273, 101682, -131227, -134239, 9157, -199962, 57963, -332536, 272559, -229806, 110940, 224158, 123536, -86939, 319383, 277373, -64959, 59012, 272631, -123937, -98063, -34269, -20145]
12647b0145A55138D9327K53281j29576D4429J47865F3786j7474e164k198A16916
12635B15353p1686C4980R8259f3899B72934a24267D35036k01396a75852C73787
12624G9524a27202B24424j11688K85470I6282c56B58142b81277j8024N8986A08349
12612b73561c2474B82392E1253J83842b93295H0467K88921a54876C2200a00527
12601A19672J53778e873A78551a1466F7947k1194L04213d94554B97193a15364
12590A52534B0722a50076E0405J04125b32813A41925d4887m1802A88508q1583
12580A06925J27871J8349j11437J11486d1854j20683e9970B15047a99381B41165
12569a76790k9405F0218a75758Q3536J4479B70670a59283F4994A3484P2694b69613
$$ y = [-20145, 155138, 49327, 302608, 173032, 44429, 192294, 63786, 46312, -5164, -7362, 116916, 215353, 143667, 34980, 133239, -63899, 272934, -124267, 435036, 233640, -175852, 373787, 79524, -127202, 224424, 112736, 398206, 96282, -356, 258142, -281277, -299301, -240315, 108349, -273561, -32474, 282392, 51253, 235095, -293295, 80467, 369388, -154876, 32200, -100527, 119672, 273450, -5873, 178551, -11466, 67947, 46753, 350966, -494554, 297193, -115364, 152534, 20722, -150076, 50405, 154530, -232813, 141925, -44887, -86689, 188508, 106925, 234796, 253145, 141708, 253194, -41854, -162537, -59970, 215047, -199381, 241165, -176790, -206195, 60218, -175758, -92222, -77743, 270670, -159283, 64994, 13484, 86178, -269613]
12557e775A11627b48468c8429j19611I2554b4731D9291j0073J05524n8718J5393
12546A01417a6642G0398d78412A33747b3586A96470a40533A03328a94768A20297
12535a45982A04921a81180I8011c15064h8207A79310e7494H2926i8434n397B02459
12523A91492b54182D0055J40942c66782N7711D1753J64853E5114K068K5781e6306
12511b00445B63046E9035A63h7247b4447j68364H1054R4372j4512g6885I4796
12499a67477b5518n5226C4942b02192i5517B93445J53902b54468f2218j6926H2298
12487E8683b26158A28173c2200J0795j03876b3789p7441A08673N3977i7435A8372
12475C7577L63203j30550A19266O6702H5510J35671O2669b24784r3836J41680
$$ y = [-5775, 111627, -248468, -38429, -158040, 92554, -24731, 49291, 39218, 144742, 86024, 101417, -16642, 70398, -478412, 133747, -23586, 196470, -140533, 103328, -194768, 120297, -145982, 104921, -181180, 98011, -315064, -88207, 179310, -57494, 82926, -98434, -103831, 202459, 191492, -254182, 40055, 180997, -366782, -309071, 41753, 206606, 55114, 57182, 82963, -56306, -200445, 263046, 59035, 163, -87247, -24447, -192811, 81054, 175426, 160914, -76885, 94796, -167477, -25518, -80744, 34942, -202192, -95517, 293445, 447347, -254468, -62218, -79144, 82298, 58683, -226158, 128173, -32200, -21405, -125281, -23789, -101230, 108673, 162650, -97435, 18372, 37577, 400780, 270230, 119266, 185968, 85510, 221181, 283850, -224784, -318620, -176940]
12465a76940I7509J83313A09761b36556H6113C2741b66473a08581A1331J40366
12455A51697i2907r6983Q4757k22643J41740e395j03099j8382k01191E010M261
12444I271h0278D5247L69146I117b87365R7822g4358A30966D9112L37458b6060
12432b40615Q8909c0144A00251M3335c7712C9396f1799A42079Q0829j02351a6577
12420C56787A12307O2827g3396l37380a06631a5721B83719a03272b8779l2753
12410f1532a4728B1213d7089m9766b3898A8773b19301A16630l4665J53167H9924
12398A11832c26673J04551M8108o1161A5535J48087f5161n3172q2618B42150E4529
12386A88571G6314B4918J29154J17531F5188L3110d2642A39280m6697Q5496a79861
$$ y = [-176940, 97509, 280822, 109761, -236556, 86113, 32741, -266473, -108581, 11331, 151697, -92907, -189890, -105133, -327776, -186036, -5395, -108494, -126876, -328067, 5010, 9271, -80278, 45247, 414393, 9117, -287365, -189543, -74358, 130966, 49112, 386570, -26060, -240615, -151706, -30144, 100251, 143586, -37712, 39396, -61799, 142079, 222908, 120557, -16577, 356787, 112307, 175134, -73396, -410776, -106631, -15721, 283719, -103272, -28779, -61532, -14728, 21213, -47089, -96855, -23898, 18773, -219301, 116630, 81965, 235132, 89924, 111832, -326673, -222122, -174014, -235175, 15535, 163622, -65161, -118333, -200951, 242150, 54529, 188571, 76314, 24918, 154072, 271603, 65188, 98298, -42642, 139280, 92583, 178079, -179861]
12374a68180h0824A66176a42851d9431j08760D41728d0569p2371C7805c0080H5473
12362a80935a9100A40146C33f7196p6810p2614A71035G8707a33842A27178m4357
12351H2821m0993R5670b7238k0729o4006B37770D2077b47176A45679c64274A01208
12339A09178a78362A61171M9492J88779A35581e2696q8089A67628m4088D8773
12328f0265E1500J30437F1755J34751F2734A625M06775A77998C5691b7298E65479
12316B4366H951L72958H6469J79650B2283K92752A12449n956a77578A10447m6780
12305F3667N9266f6516F5726J13056h839A30468c15168d6459A24319J06578D5856
12293E5001L86612c4785A26760l674a33113A58946N7611o7986G0467J67617J17585
$$ y = [-168180, -80824, 166176, -142851, -49431, -158191, 441728, -40569, -112940, 37805, -30080, 85473, -180935, -19100, 140146, 333, -67196, -144006, -216620, 171035, 78707, -133842, 127178, 82821, 41828, 137498, -27238, -47967, -111973, 237770, 42077, -247176, 145679, -364274, 101208, 109178, -178362, 161171, 210663, 399442, 135581, -52696, -140785, 167628, 123540, 48773, -60265, 51500, 181937, 61755, 196506, 62734, 1625, 408400, 177998, 35691, -27298, 565479, 24366, 8951, 381909, 86469, 266119, 22283, 315035, 112449, 106493, -177578, 110447, 63667, 122933, -66516, 65726, 178782, -8839, 130468, -315168, -46459, 124319, 230897, 45856, 55001, 441613, -34785, 126760, 123086, -133113, 158946, 216557, 148571, 70467, 238084, 355669]
12282C55669A64497c7674B36027O7617f2792G9637J03700C4835M47665D6628M1631
12271H8259J71093D1023J0424K84255G1266K79509J24891a6913q1380A34315O9126
12260B03441J95195j55408m8783h8628M837c8818j03833C71557g995C17264A01371
12248C63205G4813d501D17731F0780h859A78984l1875L5879J17731o7653j8775
12237B14291j3573a96058g9682a8092E9329B9232d3354H5123O8509B9293R008
12226C8301K37941b34919E5484a26476A77968K36557j78834J20884A7837b49099
12215A71136K6839O4118O7984q8413e8273C18061a28919B36618b9424B01798k6805
12204A74993R5246a5034j91683H1352K00345J69730A72459j4956J19594K02498
$$ y = [355669, 164497, -37674, 236027, 303644, -62792, 79637, 183337, 34835, 482500, 46628, 88259, 259352, 41023, 51447, 335702, 71266, 350775, 475666, -16913, -98293, 134315, 203441, 398636, 243228, 194445, -88628, -83791, -38818, -142651, 371557, -7995, 317264, 101371, 363205, 74813, -4501, 417731, 60780, -8859, 178984, 147109, 182988, 300719, 233066, 214291, 200718, -196058, -79682, -18092, 59329, 29232, -43354, 85123, 153632, 29293, 38301, 276242, -234919, 55484, -126476, 177968, 414525, 235691, 356575, 17837, -249099, 171136, 197975, 262093, 330077, 241664, -58273, 318061, -128919, 236618, -29424, 201798, 174993, 270239, -15034, -206717, 81352, 281697, 451427, 172459, 157503, 277097, 479595]
12194D79595j65056b1665C31618A47644J82486j16117L09609A79099N6041a49752
12183c4077j27739A03058O4675K05207A6560K06257F0642O7810b57598A22760
12172C43214r6416M2666f3137F18558B84629R0808j77351K48787n0938l6237B5481
12160B91562A5388K38337j5703k9635E9534K83022A32721o3954a75856C07098
12149A05661J4997J02193B4995N26606A48621f2483b6013A25380J46150b25536
12138C92752j05382a33091J9745A86725c97915B23282E8345R8452C7593Q8528
12128A26121K9501a4758B08860i1520B2253a80037A95274h043A73453G6297a40693
12116D03493j43975b81473a06874C4769d4904A20884L5049J51846H976O1606b59436
$$ y = [479595, 314539, -21665, 331618, 147644, 330130, 214013, 523622, 179099, 235140, -149752, -34077, -161816, 103058, 167733, 372940, 16560, 222817, 60642, 128452, -257598, 122760, 343214, 246798, 289464, -63137, 618558, 284629, 375437, 198086, 446873, 395935, 359698, 25481, 291562, 15388, 253725, 238022, 208387, 59534, 342556, 132721, 68767, -175856, 307098, 105661, 120658, 222851, 24995, 551601, 148621, -62483, -26013, 125380, 271530, -225536, 392752, 287370, -133091, -113346, 186725, -397915, 223282, 58345, 156797, 37593, 126121, 155622, -14758, 208860, -91520, 22253, -180037, 195274, -8043, 173453, 76297, -140693, 403493, 259518, -281473, -106874, 34769, -44904, 120884, 155933, 307779, 8976, 70582, -259436]
12104C748b00014c7015A93723K69716B13875a9313n6749A43955a9534G1241O0040
12093A31281b9214A00569J37848I3452J18671G2813K91787j18455G4184J15010
12083A89194r4286J24723P4316k0311H4772M2528M2316b25720A91449e1512A42038
12071H4190C6104L14336G0580J65237d7208A13616J28762r2103g3206c0340I5742
12059B95361b18951F8946C465a9814A00704a08073j44751A20497d3268B9137L08589
12048C37726b64613A51459b23176M9504I7394d8095k50820G6540j1564L04085
12038C69061A73016H6031J73466M5482a37253B33107j08201M0470l1061m1038
12028I3277J29134F4963a92471A276J28635b26068P0206O7464D0901J55410j1556
$$ y = [3748, -200014, -37015, 193723, 463439, 213875, -19313, -76062, 143955, -19534, 71241, 131281, -29214, 100569, 238417, 93452, 212123, 72813, 364600, 246145, 74184, 189194, 94908, 219631, 293947, 273636, 84772, 127300, 169616, -225720, 191449, -51512, 142038, 84190, 36104, 350440, 70580, 235817, -47208, 113616, 242378, 150275, -73206, -30340, 95742, 295361, -218951, 68946, 3465, -19814, 100704, -108073, -252824, 120497, -43268, 29137, 337726, -264613, 151459, -223176, -173672, 97394, -48095, -298915, 76540, 64976, 369061, 173016, 86031, 259497, 304979, -137253, 233107, 124906, 165376, 134315, 93277, 222411, 64963, -192471, 1276, 129911, -226068, -155862, -88398, 40901, 196311, 184755]
12017A84755N9575E3711O30832A69632j7513a09940d7600A24304f9593B02710
12006C2570a26898M4015j1231B17914d2669H0778P7608A642a55917H9028e8939
11994b05433K9202B53879b02871p2160e9988j0482r5811D4784b10960B92616A0608
11982C8807P8655h7191o779b2550j60A0012K2109J56207h0737a0134B72575a11670
11969a76198D5078L6066J52595a07481m7829A20602A4278J48026J87710A7947
11958b02316a2936o6242b2134j00221F8774B2562a40550j503A22608J67903Q8697
11947C79208A55617a08522j2874j3887B25569a9379B88343d7791j6956j18375
11937a83122B5948a03098B67344a38598e0557B5870K42975b22569Q728A22977
$$ y = [184755, 244330, 53711, 684543, 169632, 152119, -109940, -47600, 124304, -69593, 202710, 32570, -126898, -82883, -94114, 217914, -42669, 80778, 158386, 1642, -155917, 89028, -58939, -205433, -176231, 253879, -202871, -275031, -59988, -70470, -166281, 44784, -210960, 292616, 10608, 38807, 117462, -87191, -93970, -22550, -22710, 10012, 32121, 188328, -80737, -10134, 272575, -111670, -176198, 45078, 81144, 233739, -107481, -155310, 120602, 14278, 162304, 350014, 17947, -202316, -12936, -79178, -22134, -122355, 68774, 22562, -140550, -142053, 122608, 290511, 379208, 155617, -108522, -121396, -135283, 225569, -19379, 288343, -47791, -64747, -183122, 25948, -103098, 267344, -138598, -50557, 25870, 268845, -222569, -213841, 122977]
11926a13300K9558C9123e067k34054E4135h3427j97225M8370g5371F3038J09501
11915A72539F7029a88928j08421F8643c62558C20246A51321a7438G5348b64707
11904e841I9537c75871C46129b64894g7961k30082F9180b42237J09672M5238r7910
11893a85237I443d9890B19157r6157b46371H6976k3132a86962c334C3192a47686
11881D4040N3605f8456m07783a06849B315a8470A34517a99849h3239A77790b45691
11869B61097i9421L3892L1648j15256j84569p1298g6200B54273a50039k08587
11859c58626g4252c256k4380B17077a10795k97737B47934f8490C01246b52120
11848I4451j4791f8541j78247g5349A32085a22169k37976C52349j56282G1541
$$ y = [-113300, -83742, 39123, -5067, -239121, 54135, -83427, -280652, -232282, -75371, 63038, 172539, 67029, -188928, -297349, 68643, -362558, 320246, 151321, -17438, 75348, -264707, -5841, 99537, -375871, 346129, -264894, -77961, -308043, 69180, -242237, -132565, -87327, -185237, 9443, -49890, 219157, 123000, -246371, 86976, 63844, -186962, -3334, 33192, -147686, 44040, 97645, -68456, -476239, -106849, 2315, -18470, 134517, -199849, -83239, 177790, -245691, 261097, -99421, -65529, -33881, -149137, -333706, -405004, -76200, 254273, -150039, -358626, -74252, -3256, -27636, 217077, -110795, -408532, 247934, -68490, 301246, -252120, 94451, 79660, -68541, -246788, -75349, 132085, -122169, -360145, 352349, 196067, 71541]
11837C29012d489k01978e6060q9540n078A11898a56600c6806j7443k9963A74608
11825g7442B9779J82736d73639a43663l4238D2959K50212A28179b72328C26262
11814B22186A764f4186j57934j072i4160C9851a31279B28067c81511b8517q9829
11803a18346l19885B10066e7666n4998e50j88718A31078b4719a0620q6273d1803
11791b39722p3538F4118A1438M18239a31351K7382D6473J09002K1262d8790p4110
11780a22900I1751b60918J07056b3678k5472C37888a26817B92439l0002a45330
11769G9333d13185a99919G0566R899a12905q8879p3282g3031j50674r9426n7829
11758c80960i9083j85689J29353g1042K8448H5098e8209C73020q4904G1095K26718
$$ y = [329012, -4489, -206467, -56060, -145600, -150678, 111898, -156600, -36806, -54249, -84212, 174608, -77442, 29779, 212515, -473639, -143663, -177901, 42959, 293171, 128179, -272328, 326262, 222186, 1764, -64186, -222120, -223192, -94160, 39851, -131279, 228067, -381511, -28517, -118346, -438231, 210066, -57666, -112664, -550, -189268, 131078, -24719, -10620, -96893, -41803, -239722, -313260, 64118, 11438, 429677, -131351, -103969, 46473, 155475, 176737, -48790, -122900, 91751, -260918, -153862, -23678, -49150, 337888, -126817, 292439, 262437, -145330, 79333, -413185, -199919, 70566, 80465, -112905, -201784, -275066, -73031, -223705, -323131, -380960, -99083, -284772, -155419, -71042, -42594, 85098, -58209, 373020, 288116, 71095, 297813]
11747B97813h7373j20472F549J61335a59153A06305d0030k03922A14345e50j11068
11736a11618E8659K26344F9131L52648b09360B2047M0055c52534B53423a10754
11725f5229k18185R6731A47532B4082J22341a2932B1124c10422j17057B41960
11714E6361R0068p2914J42293h1070H7223a05443j3521e6462D9572J7711J22582
11703A89865E5752H679b46480G5353J61783A18259A3186J84659a04972B52066
11692a25037A5864b4011p1870B45919h3991L6007B37866o1161a36961A3436K26892
11681B40328A3483f1953k51208B21470l7783n9044a1212C7848P4501m2283O1092
11670A31158l04o0008b58040C29609d0312l26037a3518j10796B8889a86307P0538
$$ y = [297813, -87373, -207845, 6549, 167884, -159153, 106305, -40030, -243952, 114345, -550, -111618, 58659, 285003, 69131, 421779, -209360, 22047, 62102, -352534, 253423, -110754, -65229, -283414, -186683, 147532, 24082, 146423, -12932, 21124, -310422, -427479, 241960, 56361, 146429, 73515, 215808, -81070, 87223, -105443, -118964, -56462, 49572, 67283, 189865, 55752, 8679, -246480, 75353, 237136, 118259, 13186, 197845, -104972, 252066, -125037, 15864, -24011, -95881, 245919, -83991, -47984, 237866, 176705, -136961, 13436, 240328, 13483, -61953, -313161, 221470, 183687, 124643, -11212, 37848, 112349, 70066, 131158, 130854, 70846, -258040, 329609, -40312, -366349, -13518, -124314, 28889, -186307, -115769]
11659a15769B22306r5444b0833l09452A3397J0971e4223I0076B963a18325C22055
11647B22671a5840B88160a07751N0724A38577a64242j36334i3508b6380o7830
11637i4210j58434H4149a78801c8639r7931N4244D009g2190p592C0053J2800a41201
11624a87001G1943Q4133J41442a54697a7813C05859A21065l5369b50674B12953
11613D6932P9331b17234B34418C185b17815E1169J22650l4388c2356j00622D4810
11601B10926N3098b5973D45332b55139j2965A60969E2452L04639e7398F5433J80885
11590B46318I9374h8845A42174d352D5882L83279e8946C39540j06023h1145C21633
11578h8487A78068g9122C52225A5686K42069G0616a88863B5257Q6481D648b87735
$$ y = [-115769, 222306, 126862, -20833, -330285, 13397, 24368, -54223, 90076, 2963, -118325, 322055, 222671, -15840, 288160, -107751, -57027, 138577, -164242, -300576, -93508, -26380, -94210, -252644, 84149, -178801, -38639, -136570, -82326, 4009, -72190, -79782, 30053, 42853, -141201, -187001, 71943, 156076, 297518, -154697, -17813, 305859, 121065, 85696, -250674, 212953, 46932, 126263, -217234, 234418, 3185, -217815, 51169, 173819, 139431, -32356, -132978, 44810, 210926, 264024, -25973, 445332, -255139, -268104, 160969, 52452, 357091, -57398, 65433, 246318, 99374, -88845, 142174, -4352, 45882, 429161, -58946, 339540, 233517, -81145, 321633, -88487, 178068, -79122, 352225, 15686, 257755, 70616, -188863, 25257, 111738, 4648, -287735]
11566a09792A61453a08466D42184B14956K13334A43998K21350F9578M23920f2592
11555b34I3120a11888a8546j82400L1391A26547J8478b68343B97438c13927H1822
11543D48419d4884A81941H593b9827B70194A8747J03789D5051J47237a95797N7292
11532a38505E3323J17754E7379O9517D050a48364B77670a98258C22614J0513a71189
11520A52834b17329A52731K8531H3630K8039a27311m0583E56940A18220l3005
11510H5215P3772L03951b84097C9137K42771j10418N2622k5412g1069B91350a39091
11498D31096k07436A03760K934L16042d3708B89040a01326B41701a65590A75304
11487A99839P5141d006B99250b08735g4694D31899F2412K33530a79986B5216J60078
$$ y = [-109792, 161453, -108466, 442184, 214956, 428290, 143998, 365348, 69578, 493498, -62592, -234, 93120, -111888, -18546, -200946, -169555, 126547, 145025, -268343, 297438, -313927, 81822, 448419, -44884, 181941, 8593, -29827, 270194, 18747, 122536, 45051, 192288, -195797, -138505, 53323, 171077, 57379, 126896, 4050, -148364, 277670, -198258, 322614, 333127, -171189, 152834, -217329, 152731, 181262, 83630, 111669, -127311, -167894, 556940, 118220, 85215, 158987, 462938, -284097, 39137, 281908, 171490, 224112, 198700, -71069, 291350, -139091, 431096, 223660, 103760, 106694, 422736, -43708, 289040, -101326, 241701, -165590, 175304, 199839, 274980, -4006, 299250, -208735, -74694, 431899, 62412, 295942, -179986, 25216, 185294]
11476A85294J20018j41039o8313J8171L64442A5823J3551K48671b38069F3504
11465D32742j68752j12142G0928d2234K0809o8409E7074O3640M6424d8468I4163
11453b68294P1754f8163B54997b6056A77827r266E2444j4667K70481O3417A81193
11441a21050j71485I819e6424H4105l3923O7004C602a93714G6199L08P6157h212
11428A35483e6112C4425a2901k25931p9956a38059G5557d8059C61457i2722k63861
11417c56583A89953a03745A87211g3227C66352A43092m8726a24213A38102c37903
11406b16687A53820G0580A7829L87329a56807l22181D59227A43072C4031J67402
11396B01433r5026k2733J8968a23496l38212c2174o7472D7707c24817C6469a30382
$$ y = [185294, 305312, 164273, 95960, 114131, 478573, 15823, 29374, 278045, -238069, 63504, 432742, 263990, 151848, 70928, -42234, -21425, -89834, 57074, 120714, 167138, -48468, 94163, -268294, -196540, -68163, 254997, -26056, 177827, 168561, 52444, 37777, 308258, 371675, 181193, -121050, -292535, 9819, -56424, 84105, 50182, 117186, 3602, -193714, 76199, 76507, 152664, -8212, 135483, -56112, 34425, -12901, -238832, -318788, -138059, 75557, -48059, 361457, -92722, -356583, 189953, -103745, 187211, -73227, 366352, 143092, 94366, -124213, 138102, -337903, -216687, 153820, 70580, 17829, 405158, -156807, -478988, 459227, 143072, 34031, 201433, 106407, 83674, 102642, -123496, -461708, -32174, -99646, 47707, -324817, 36469, -130382]
11384A2121b18545i7378B5651K20414n1462J53080J15231a07817g107j90099B91348
11372c18859b8225F7933K6081k9285b49905I057b80287a09931j3723j57747g7187
11360A54792b0481B31599a21679H0728K0490f3812B61553a77168F5729f5126k78194
11349c43320J00906C04416c51760B78091a12792E4648b14628D9121a1216C12659
11338F53K0516o165K23521c2806k24738C61879b12014o9542l1084H3474J8019
11327A01493e9717a5124l14971A09173A146L28721E6542d8563a4635E4009L13076
11316C67085A50495J71613D1416d878A69987o8658b75342B4016i4825B83171A01925
11304c29269J08097Q2566j27005J1949J05632E047a04471a894o5423j95493h4337
$$ y = [12121, -218545, -97378, 25651, 246065, 194603, 347683, 462914, -107817, -7107, -197206, 291348, -318859, -28225, 67933, 94014, 64729, -249905, 9057, -280287, -109931, -123654, -281401, -77187, 154792, -20481, 231599, -121679, 80728, 101218, -63812, 261553, -177168, 65729, -65126, -343320, -242414, 304416, -351760, 278091, -112792, 54648, -214628, 49121, -11216, 312659, 653, 21169, 15004, 238525, -32806, -257544, 361879, -212014, -281556, -312640, 83474, 101493, -59717, -15124, -330095, 109173, 1146, 329867, 56542, -48563, -14635, 54009, 367085, 150495, 322108, 41416, -4878, 169987, 101329, -275342, 24016, -94825, 283171, 101925, -329269, -221172, -138606, -265611, -253662, -148030, 5047, -104471, -1894, -67317, -262810, -84337]
11292C55816b90039H5524a01151k95826J22751I5874J00963a18278j02614g3460
11281A65604f47998A71432b24284A25043f0827k84243J59361b6212D28491a21257
11270a18810J7755k55939J8421F7183P0865a52937B2614a80410N5891O143A47413
11258b06440P765l8129M3768B50975a61081d8022A01220g7203j40329A96627c25259
11246B8038R7977A5633b09035a399k91912E28a04824j25602R6073e3739C8332
11234i7582M578A03521e9452p1850k69456B61573b89881d2287j44931B20245B8356
11222a33201D7379A3770J71682H1125L9877b92323R2843L7786p8397f5772l89416
11211d55188g5284L2897b0815A77175C9150J04450N1576B2562J8761j2085q033
$$ y = [355816, -290039, 85524, -101151, -396977, -274226, 95874, 196837, -118278, -220892, -73460, 165604, -647998, 171432, -224284, 125043, -60827, -345070, -185709, -26212, 428491, -121257, -118810, -101055, -356994, -338573, 67183, 138048, -152937, 22614, -180410, -124519, -118376, 147413, -206440, -198675, -236804, -193036, 250975, -161081, -48022, 101220, -77203, -217532, 196627, -325259, 28038, 126015, 15633, -209035, -1399, -293311, 528, -104824, -230426, -134353, -53739, 38332, -97582, -93004, 103521, -59452, -131302, -400758, 261573, -289881, -42287, -187218, 220245, 28356, -133201, 47379, 13770, 185452, 81125, 121002, -292323, -199480, -161694, -240091, -65772, -455188, -75284, -42387, -20815, 177175, 39150, 143600, 195176, 22562, 41323, 29238, 21205]
11200B1205J54548M0604a64232b5781G616b0096j38615A77612F2648b37407C18471
11188b74139A0958a95625j7766J7791A06948A2452g1872l5675j55170A33524a23195
11176g380o4452G9203R1100a63252B4685q555L1735b52138a210k45180F6492a73108
11163a6824r4045c2831k22732B04482B9725a04351J1954p4648j80432c1310P867
11152b3443A17512c24321B1149J97983C3884J98000A0967a68850k1821J2654c9402
11140H4132j4588l0594e6677B23323b41985i951j02083j66472B85842o9749K2090
11129B38183b5654E8947L63050k05911a54208M8197C02106d5091n7251B91498
11118A96478R0259A15901a18997A04151P6210B5187J23433d5006a524A77422a18108
$$ y = [21205, 175753, 216357, -164232, -25781, 7616, -20096, -158711, 177612, 62648, -237407, 318471, -274139, 10958, -195625, -213391, -195600, 106948, 12452, -71872, -107547, -262717, 133524, -123195, -7380, -71832, 79203, 170303, -163252, 24685, 16130, 47865, -252138, -1210, -246390, 66492, -173108, -16824, -110869, -32831, -255563, 204482, 29725, -104351, -92397, -167045, -347477, -31310, -23443, 117512, -324321, 21149, 219132, 33884, 231884, 10967, -168850, -190671, -178017, -39402, 84132, 69544, 38950, -56677, 223323, -241985, -9951, -112034, -278506, 285842, 216093, 238183, -25654, 58947, 421997, 216086, -154208, -106011, 302106, -45091, -102342, 291498, 196478, 286737, 115901, -118997, 104151, 180361, 25187, 148620, -45006, -1524, 177422, -118108]
11106a01611M6911A95726n1900K8894e8777E69309k68925b70j29500c7941A43214
11094B03940D3182L00241j7306A60788J61998J01007I5097b81831E1823R4742
11084A46565F1090K36187j22448b93523D13239A00314J01063L3711l2507R6251
11074B98832A47630J85497m1382O1004A39005n8919J95713P5335j65146N12216
11064F98204l25635J92928A35968K15511J41961A77707J77948N7147L11589J20443
11054H44834m05300J53447r4961R4706j96896L62035l73584M38749C57284N32999
11044H90283l18115k5335J26290O4397Q3284r8627k383r9817K42736J7829j67767
11033G12775j86444P6509P804M84128l04515l47366J74625L2139L12047l57284
$$ y = [-101611, -54700, 195726, 143826, 172720, -58777, 569309, 300384, -270, -129770, -37941, 143214, 203940, 43182, 343423, 326117, 160788, 322786, 423793, 95097, -281831, 51823, 146565, 61090, 297277, 174829, -293523, 413239, 100314, 201377, 235088, 202581, 298832, 147630, 333127, 291745, 352749, 139005, 80086, 275799, 351134, 185988, 698204, 372569, 565497, 135968, 351479, 493440, 177707, 355655, 412802, 724391, 844834, 439534, 592981, 498020, 592726, 395830, 757865, 384281, 823030, 357284, 890283, 572168, 546833, 673123, 737520, 820804, 722177, 719794, 619977, 862713, 880542, 712775, 526331, 602840, 610644, 1094772, 790257, 442891, 617516, 649655, 961702, 604418]
11023F04418L40676M4877D78297J77866J81032N7207j79911k10173j29007K16491
11013E91802Q3003J01054o6816n5163k40679j24346L92348R9272k64820A91849
11002F57016j05652K16781q2444B23652N71000C59476O88524m51405J37575o4417
10992F69753B94724P9943L63177M1029N8330M6075j81710j23633O6220K46915
10982H91070J99539j50537q8116P3059K82953r5213R8052j2736K03765j0795M69234
10971A860275K89755K08503K80352l4102k26r1260J86926m06305k17778K2431
10961B098571j84535k49306j62046K31269p9779K9659k63476L13079j23130L54658
10951A964964m03203l65720K41349p0163n10199N4985j26394l86752q3268m990
$$ y = [604418, 945094, 989971, 478297, 656163, 837195, 894402, 714491, 504318, 375311, 591802, 674805, 775859, 709043, 653880, 413201, 288855, 681203, 780475, 515655, 191849, 657016, 551364, 768145, 685701, 223652, 794652, 359476, 1048000, 596595, 734170, 669753, 294724, 374667, 737844, 778873, 837203, 883278, 701568, 577935, 644155, 891070, 1090609, 940072, 851956, 925015, 1207968, 1112755, 1210807, 1198071, 1401836, 1391041, 1860275, 2150030, 2358533, 2638885, 2604783, 2604557, 2513297, 2700223, 2293918, 2076140, 2098571, 1914036, 1664730, 1502684, 1733953, 1654174, 1683833, 1420357, 1733436, 1610306, 1964964, 1561761, 1196041, 1437390, 1367227, 857028, 912013, 785619, 398867, 315599, 310609]
10941C10609A39510J3274J54749j25011Q3675q1729K57001A06821J04601i725
10930c23356B46339H0229J30323a1840A96065O0255d5837B25452k3669A6b13200
10918D8356f8670B03898p1034a44860A15980a66893N9747K7169A84272p0079K11730
10907C25923f5281m345r6164F5081A2261K1999c6307F0339i7492A24156J83118
10896C07274a95894i260k31388b8888n9699A17791c02307I8971J39444h9356A60128
10884E4575O8069c6023A77276n210d50037b1597r3987c4707j3786J0938k52312
10873b89867F5896h3988R468o1089j13697B67792G3710j9135c52061A57807J91396
10862C49203H9975Q3568J6276a24107h430B42718a59750G4426a41236E5600A4176
$$ y = [310609, 139510, 152784, 307533, 182522, 266197, 184468, 441469, 106821, 211422, -9725, -323356, 246339, 80229, 210552, -11840, 196065, 256320, -45837, 225452, 201783, 16, -213200, 48356, -68670, 203898, 132864, -144860, 115980, -166893, -107146, -79977, 184272, 114193, 325923, -65281, -69626, -165790, 65081, 12261, 34260, -36307, 60339, -97492, 124156, 307274, -195894, -9260, -240648, -28888, -88587, 117791, -302307, 98971, 238415, -89356, 160128, 54575, 122644, -36023, 177276, 172066, -450037, -21597, -115584, -34707, -48493, -37555, -289867, 65896, -83988, -74520, -135609, -249306, 267792, 73710, 54575, -352061, 157807, 349203, 89975, 173543, 189819, -124107, -8430, 242718, -159750, 74426, -141236, 55600, 14176]
10850A34877J63485c1885H3701b48689F1453L05488j06366p8509H6289b00026
10839A99660G935M5496h4787a3728j18053B36593a32897q9480e8242k43577B65829
10827a42611C9713L26212o2686b23545i0855A01662Q8807a53085D4196e3807B12161
10815H4547b32445f7301A90316c8102k54142M8705A310K6996a32055M7660j14953
10804a99348h3145A33529E799K0671a9331A29591B0926g4251j29530D1492g3079
10792a06945I3529l6763c18050f9965p3124A27728D3851a45989e4177n3476B0529
10780e5279k26487d7465j69686k8545a15651B5268f03402B31327j1649b47041
10769A70085C909g7517l20726C34407E0920a39466p2430b8412A89046d213l8942
$$ y = [134877, 298362, -31885, 83701, -248689, 61453, 366941, 260575, 182066, 86289, -200026, 199660, 7935, 53431, -84787, -13728, -131781, 236593, -132897, -222377, -58242, -301819, 265829, -142611, 39713, 365925, 303239, -223545, -90855, 101662, 190469, -153085, 44196, -53807, 212161, 84547, -232445, -67301, 190316, -38102, -292244, -243539, 1310, 28306, -132055, -84395, -199348, -83145, 133529, 5799, 26470, -19331, 129591, 20926, -74251, -203781, 41492, -73079, -106945, 93529, 56766, -318050, -69965, -143089, 127728, 43851, -145989, -54177, -107653, 20529, -55279, -281766, -47465, -217151, -245696, -115651, 25268, -603402, 231327, 219678, -247041, 170085, 3909, -77517, -398243, 334407, 50920, -139466, -211896, -28412, 189046, -4213, -43155]
10758d3155j63997f3114n3758a0958j70201K9503B80312B4434J61084a68920g7903
10746A317Q6669i292C92671A87941c28063A67797g1263G4621i0235j17496d5912
10734b46942h8574D9473J65475E8932c64322A14469Q1171f164D617J69167b017
10722i2993m9861A13265j818K3126N8218E163d13782J69631J10412B31144d50194
10710c28704J01785E0560J38597M2968G9820c46998Q9765M1852O2831E0901b31626
10698g0145j93254A97354b20717B58282C0303c0799B7567c5857k84553l8082P0948
10687b87544J20975k97762c2544j03461m3641B55288E8191A8890K95700b5719
10676A8737O9883b48908A98130A6889b32824f0032j52876j67047a08811C7332
$$ y = [-43155, -207152, -63114, -116872, -10958, -181159, -151656, 280312, 24434, 185518, -168920, -77903, 1317, 87986, -9292, 392671, 187941, -328063, 167797, -71263, 74621, -90235, -207731, -45912, -246942, -88574, 49473, 214948, 58932, -364322, 114469, 195640, -6164, 4617, 173784, -2017, -92993, -142854, 113265, 111447, 134573, 192791, 5163, -413782, -244151, -133739, 231144, -450194, -328704, -226919, 50560, 189157, 232125, 79820, -346998, -257233, -215381, -152550, 50901, -231626, -70145, -263399, 197354, -220717, 258282, 30303, -30799, 27567, -35857, -320410, -358492, -287544, -166569, -464331, -32544, -136005, -179646, 255288, 58191, 18890, 314590, -25719, 18737, 88620, -248908, 198130, 16889, -232824, -60032, -212908, -379955, -108811, 37332]
10665A44771b98646D729J5723a7012A50762b10275L1969A11950h640F435i2161
10653d8654C32599D2949J4468K41566a62841H3949B1347g3839B4319a66195H3960
10641B14831c58464E3087b55515f4871k31369G5467N4201m4429l7511J42386a39109
10629I2360n830K15391A20543b13826P3124k51425e8485j10321c1950k56652j9693
10618c08295B7384b9718G4533e56725a77835p9502A38459A7861a41350m71620
10608f12970c05116A18773b60900k8667G1103b44197A25937o0447a6480B27721
10597B46877I4462b10585l9538Q966C8578M597c06654I2048h5505c3884j12048
10586a45932c3881B68724F5635b59016R3437j21607D7671b23460Q7986B10067
$$ y = [144771, -298646, 4729, 20452, -17012, 150762, -210275, -178306, 111950, -8640, 6435, -92161, -48654, 332599, 42949, 57417, 298983, -162841, 83949, 21347, -73839, 24319, -166195, 83960, 214831, -358464, 53087, -255515, -64871, -296240, 75467, 129668, 85239, 47728, 190114, -139109, 92360, 86530, 301921, 120543, -213826, -140702, -392127, -58485, -168806, -31950, -288602, -308295, 27384, -29718, 74533, -556725, -177835, -257337, 138459, 17861, -141350, -612970, -305116, 118773, -260900, -289567, 71103, -244197, 125937, 65490, -16480, 227721, 246877, 94462, -210585, -250123, -241157, 38578, 43175, -306654, 92048, -85505, -33884, -145932, -33881, 268724, 65635, -259016, -165579, -287186, 47671, -223460, -135474, 210067]
10575a40303N7770n3090j73102A22497J84892a30580f5055o1720B34471J34992
10565C69463a21262j2308B29841K02990b39527i507k32964A2565L4176A405a14449
10553B40742J14238A39840b18050a05577G5058O9630J23990a25249o4852A72709
10542c21199P2281p1672A73942b7881A01169j9750f5638k32496E4675c91641A40030
10530D29836E9580J85181b83932B633c8119j78677H4595b18934j48825a10677
10519B22052h4220n8958a5359p9715l1838I2160a28076j28528i6893k27355O7556
10508b56692i2992J7149q6440A37114b33961A24793J4738J05291D9042b21631
10497B5774P7970d2674A07726a65285B8874a49195e1442k04994l5071a4284C2232
$$ y = [-140303, -82533, -135623, -308725, 122497, 307389, -130580, -65055, -126775, 234471, 369463, -121262, -133570, 229841, 432831, -239527, -9507, -242471, 12565, 46741, 1405, -114449, 240742, 354980, 139840, -218050, -105577, 75058, 144688, 268678, -125249, -190101, 172709, -321199, -248918, -320590, 173942, -27881, 101169, 81419, -65638, -298134, 54675, -391641, 140030, 429836, 59580, 244761, -283932, 2633, -38119, -216796, 84595, -218934, -367759, -110677, 222052, -84220, -143178, -15359, -95074, -126912, 92160, -128076, -256604, -96893, -324248, -256692, -92992, -75843, -162283, 137114, -233961, 124793, 139531, 244822, 49042, -221631, 25774, 103744, -42674, 107726, -165285, 28874, -149195, -51442, -256436, -291507, -14284, 32232]
10485b00768j1759j05125a1952A05104a87550k0030B03848K18575g7878A50640
10474B98485J72629J20614A54055K24195j04111J83743j87666a42394B70663h792
10463A59383a12424j9886N3856j49655c7164R67A0989K16132a22643k82102a50289
10451A87286B086b26221d4526j95459J09918A65318e655A77424K90317c99514
10440a03122j92233k380O7417j1404k752E7714M6836b11046b3977l47409A81179
10428B1434b56605A17254h8617L0634B6854a83080n6715b2727p5862k4883F5392
10416g4224m48722h1196j14478A16702c17779a02186L5285J3570C6484J43434
10406A79918J03441b82290A48120n5779P4357O8717a5218k84222i9612A47547
$$ y = [-200768, -212527, -317652, -11952, 105104, -187550, -207580, 203848, 422423, -77878, 150640, 298485, 471114, 591728, 154055, 378250, 274139, 457882, 270216, -142394, 270663, -8792, 159383, -112424, -132310, -78454, -228109, -37164, -36197, 10989, 227121, -122643, -404745, -150289, 187286, 2086, -226221, -44526, -239985, -130067, 165318, -5655, 177424, 467741, -399514, -103122, -295355, -297735, -230318, -241722, -244474, 57714, 104550, -211046, -23977, -371386, 181179, 21434, -256605, 117254, -88617, -57983, 26854, -183080, -239795, -22727, -98589, -123472, 65392, -74224, -522946, -81196, -195674, 116702, -317779, -102186, -66901, -53331, 36484, 179918, 283359, -282290, 148120, 92341, 166698, 235415, -15218, -299440, -99612, 147547]
10395D0700f9829j15904A41494a46077A53536i7813n4516D10061H6263L77831
10385D64094j62025I5737i912p6979k07910I7202L3362n7638l0152K62535o2915
10374B42394J33276j24963r7692G0647J37870D5872j4082K91046J4816Q2597J19307
10363E39556p0098P0889o1692j96490J30790r4361L8613q3973e6508B55848H3515
10351C41184j42800J724O89883m24615r8240a01493E18865j45696A54888L20811
10341D75699C501M75879j57985J31297J09314j82817j09840K1431J17520J67774
10331E76074d4891C4713K11857D7286N8258b50708R2334E0919K05434J4561b02541
10319b573A46959J85736A2714K24084f3878A8220J60628L9030I7291f4686j08863
$$ y = [40700, -69829, -185733, 141494, -146077, 153536, -97813, -152329, 410061, 86263, 464094, 302069, 95737, -9912, -86891, -294801, 97202, 130564, 72926, 42774, 305309, 242394, 375670, 250707, 153015, 70647, 208517, 45872, 31790, 322836, 337652, 420249, 539556, 469458, 540347, 478655, 282165, 412955, 318594, 357207, 273234, -56508, 255848, 83515, 341184, 198384, 200108, 889991, 465376, 367136, -101493, 518865, 373169, 154888, 475699, 3501, 479380, 321395, 452692, 562006, 379189, 269349, 290780, 408300, 576074, -44891, 34713, 246570, 47286, 105544, -250708, -158374, 50919, 256353, 270914, -202541, -2573, 146959, 332695, 12714, 236798, -63878, 18220, 178848, 217878, 97291, -64686, -173549]
10308a73549p6311B77260D7074i5599D6664j0399J44823K0276b9605C06312j2677
10297B93635I9898l9584P1406c1002j51832k5065c6114q7347e0457J5250k18045
10286b53252G1094f850m39133f863j28497A87093d566j36166r1484a11536k36126
10275c47662e5598A96904c36359I9960C7767c4098j2852C5241c29821f386j92296
10264a98682G6165c39814h5307E6733e6524a2681j60552b9547A26240K91315j18528
10253B99027J32069j49316Q2956A78943L47674B59759a35767D13515A93060J12337
10243C05397E3343H588R3982L4716O7051a09733D0857J93992n3396f7296A1981
10231b19169k07725a6491A82053A0133L46781f076o1901m7116F6419a58752I8830
$$ y = [-173549, -249860, 277260, 47074, -95599, 46664, 36265, 181088, 201364, -29605, 306312, 293635, 99898, 60314, 131720, -31002, -182834, -207899, -36114, -123461, -50457, -35207, -253252, 71094, -6850, -445983, -6863, -135360, 187093, -4566, -140732, -232216, -111536, -347662, -55598, 196904, -336359, 99960, 37767, -34098, -46950, 35241, -329821, -6386, -198682, 76165, -339814, -85307, 56733, -56524, -12681, -173233, -29547, 126240, 417555, 299027, 431096, 281780, 364736, 178943, 526617, 259759, -135767, 413515, 193060, 305397, 53343, 8588, 102570, 137286, 204337, -109733, 40857, 234849, 181453, -67296, 11981, -219169, -426894, -16491, 182053, 10133, 356914, -6076, -67977, -115093, 66419, -158752, 98830]
10219d40487i0261k38895I9507a19665M2758C76061b6056m9698G3983C6619K47221
10208B83840a30702G3657i9798b8093D588J93520b50161a2366l812j31015N3435
10197i3758L0174m6830p0681B1993a80867A24430l7346N5811O2981a627j63719
10186a65346J6735C582P8273b40465H2797e1202A95087a83373N7220f296E3085
10174a18421G392O0060J14946G7375a36619A75182h0606k79444b7710k29511j38278
10163c95499f1892k37559K5477i4931D8842e0081j85132k403A46727e4837A61565
10151d15996B60628I1586b31066D06518A27372n5403J04008a92337D6029c0648
10140A46498o7701a85838k49328D1675d20862a52975J9503A42016d8119j40348
$$ y = [-440487, -90261, -329156, 99507, -119665, -76907, 376061, -26056, -75754, 73983, 36619, 283840, -130702, 73657, -99798, -28093, 4588, 198108, -250161, -12366, -16178, -147193, -93758, -63584, -110414, -181095, 21993, -180867, 124430, 87084, 142895, 205876, -1627, -165346, -148611, 3582, 81855, -240465, 82797, -51202, 195087, -183373, -126153, -6296, 53085, -118421, 7392, 67452, 182398, 77375, -136619, 175182, -80606, -360050, -27710, -257221, -395499, -61892, -299451, -273974, -94931, 48842, -50081, -235213, -237616, 146727, -54837, 161565, -415996, 260628, 91586, -231066, 406518, 127372, 71969, 175977, -192337, 46029, -30648, 146498, 78797, -185838, -435166, 41675, -420862, -152975, -133472, 142016, -48119, -188467]
10130a88467j6181C25040A8261b73747h0065B30390a70039D8039a45011j58022
10120c03033J29335a8571l1532k45289i7913d3599l33549A75010b07985b2448
10109b62643h4690E9571L514a74553A57094h2093k26710E5467J8754a55790e6265
10097b087k2524I9669c01228o2744E150c615A36893K89921D7196a79629C0025
10085h6510K4538o7457j07075m9064J16244k1091C97886a00215p9793Q2878j69231
10074b66361H3693d53506a87982q786o2428a24364r3804C0478e2848j41221j7842
10063b11911A95415a45214a1184m39204a25393D0422M8849c5812k65646j24531
10053d25989a11153C469J25691C3905a12283d347m28606K06636h8275o6676F9338
$$ y = [-188467, -204648, 325040, 18261, -273747, -80065, 230390, -170039, 48039, -145011, -303033, -173698, -18571, -50103, -295392, -97913, -43599, -377148, 175010, -207985, -22448, -262643, -84690, 59571, 63085, -174553, 157094, -82093, -308803, 55467, 74221, -155790, -56265, -2087, -24611, 99669, -301228, -363972, 5150, -3615, 136893, 426814, 47196, -179629, 30025, -86510, -61972, -129429, -236504, -285568, -169324, -190415, 397886, -100215, -180008, -97130, -266361, 83693, -453506, -187982, -196768, -259196, -124364, -218168, 30478, -52848, -194069, -211911, 195415, -145214, -11184, -450388, -125393, 40422, 89271, -35812, -301458, -425989, -111153, 3469, 129160, 33905, -112283, -4347, -432953, -226317, -88275, -154951, 69338]
10041I064c35332A49011g282m60955a02582k8737q8949i2664m6832n7683n7828
10030b55007f2393J4145a3585k12947p6838a47664A94233b01564P1195G1298O6466
10019A37764o0185b99044J1294a06940r5813I1867M0373c08334i7700R359L3599
10008e4742B18277r6683L45278a87516j98179G978J22198a16930d4991j2647k72286
9997c29924a34167G0275b94444Q9093j11169Q1982B02358b23762l9416J17897
9987a45281d5702j4369m106l12682J62963j49250E1393f4545n3056q1394Q8298
9976a10697C54972c17966O5848B42457c18873P9516f8955p2931j93551b6080j37079
9965a63159A43186g2103P09m07683J48081R0228E1244A126b92200C3501b84159
$$ y = [9064, -335332, 149011, -7282, -468237, -102582, -131319, -220268, -92664, -139496, -197179, -255007, -62393, -48248, -13585, -226532, -303370, -147664, 194233, -201564, -130369, 71298, 137764, 77579, -299044, -287750, -106940, -202753, 91867, 132240, -308334, -97700, -88341, -54742, 218277, 121594, 466872, -187516, -385695, 7978, 130176, -116930, -44991, -57638, -329924, -134167, 70275, -294444, -205351, -316520, -234538, 202358, -223762, -263178, -145281, -45702, -60071, -64177, -376859, -213896, -363146, 51393, -64545, -117601, -198995, -110697, 354972, -317966, -252118, 242457, -318873, -239357, -68955, -141886, -335437, -26080, -163159, 143186, -72103, -71394, -479077, -330996, -240768, 51244, 1126, -292200, 33501, -284159]
9953A69632a96946j5901I8470l9250J14239a26168n9854h5637J1742H4479A6714
9941h801k87333a19567d2780N297G9380J1727N2316a58621A74055e23141e9196
9929A83335b05371K7640B17249c6734C6855M6551J5508j6505K4905a4140k09340
9918b23480Q2465l16936a57845A86813c08155A9991b46404e2428j4480p8980e4883
9906e5783k23218d3393M71D6446J60825b22023B04966d2054l8153A78133M6565
9895B24698c96235J78422Q5275j88438I51Q4075N5987c02770p5501h3260n7033
9884a40293D8899b96221m2068B99739H4421a57039H140b58470k7362H5787a68433
9872g1042d733A03372c5079m0635a6751B68515E7811a57457A5952b42234D0971
$$ y = [169632, -196946, -212847, 98470, 59220, 173459, -126168, -186022, -85637, -73895, 84479, 16714, -8801, -296134, -119567, -42780, -37483, 79380, 91107, 143423, -158621, 174055, -523141, -59196, 183335, -205371, -177731, 217249, -36734, 36855, 83406, 98914, 82409, 107314, -14140, -223480, -141015, -457951, -157845, 186813, -308155, 19991, -246404, -52428, -66908, -145888, -54883, -55783, -279001, -43393, -42922, 46446, 207271, -222023, 204966, -42054, -80207, 178133, 224698, -396235, -217813, -132538, -320976, 951, 85026, 141013, -302770, -378271, -83260, -140293, 48899, -296221, -338289, 299739, 84421, -157039, 8140, -258470, -285832, 85787, -168433, -71042, -4733, 103372, -35079, -75714, -16751, 268515, 57811, -157457, 15952, -242234, 40971]
9860i3328B58427f5965D09760a82580e9426j29970Q2691e0201o0787l12979B71267
9848e15989a50487A53041G4634b104B8916b9233J2967k19980j8282d4610l8197
9837h2807j315B34905n4524b28852i2438J5368q1134O0215C33653H8162B6545
9825b40931d6495r9330j3074n9194B28065f988k02242e9415o0890j77292A36764
9813h1331I7674Q8456a03966B86461g2992O494A9054i4411j62379I0666a87483
9801G073J9914K8061c56394b093k7840r643D37728b44145j20414r0021B5486f2108
9788f2205A25863Q1881a41600k24223A6980a3618A54100m5953g0839o0199E765
9776C37923i7543b4746k4722j72559g1054j08025J8815e8699o1510k8113P028
$$ y = [-93328, 258427, -65965, 409760, -182580, -59426, -189396, -106705, -50201, -110988, -423967, 271267, -515989, -150487, 153041, 74634, -2104, 28916, -29233, -16266, -236246, -254528, -44610, -82807, -84122, 234905, 180381, -228852, -92438, -77070, -158204, -97989, 333653, 88162, 26545, -240931, -46495, -145825, -158899, -218093, 228065, -6988, -209230, -59415, -120305, -297597, 136764, -81331, 97674, 186130, -103966, 286461, -72992, -66498, 19054, -94411, -256790, 90666, -187483, 7073, 26987, 55048, -356394, -2093, -29933, -39576, 437728, -244145, -364559, -454580, 25486, -62108, -62205, 125863, 207744, -141600, -365823, 16980, -13618, 154100, 108147, -70839, -131038, 5765, 337923, -97543, -24746, -49468, -222027, -71054, -179079, -160264, -58699, -120209, -148322, -141294]
9765a41294N6501A2898n911d9091a2089E52730h0768I2868b62390J01516O5201
9754i5673a3388o5170A17917D1658b06467g6188l52896B09119d50870c1908E8991
9742a47589B49486e89514A1154H63a86772A22121d6928r5245C11374n1865O0375
9731C19884C1212M3942b79241D042f1008k93974A238J37422i3235b2830j4167
9720c6997k07858J00992n8971a5214B66923e4702p6550j02166G0251J7145h3689
9708e8148H31a20841c3748l5990q9528j38100F6163M3093K1779L2242b34172e9059
9695a41534k56613B7493c1848k39626b2591q4029A05426a40334b1139k37906I4128
9683A32814g8710A50356a45622a054o1685k12476J18646b0254j84140J1641j27723
$$ y = [-141294, -84793, 12898, 6987, -49091, -12089, 552730, -80768, 92868, -262390, -160874, -95673, -13388, -78558, 117917, 41658, -206467, -76188, -429084, 209119, -450870, -31908, 58991, -147589, 249486, -589514, 11154, 863, -186772, 122121, -46928, -142173, 311374, 259509, 319884, 31212, 75154, -279241, 4042, -61008, -354982, 1238, 138660, -93235, -22830, -36997, -244855, -143863, -202834, -15214, 266923, -54702, -131252, -233418, 70251, 87396, -83689, -58148, 831, -120841, -33748, -69738, -159266, -297366, 66163, 109256, 131035, 163277, -234172, -59059, -141534, -398147, 27493, -31848, -271474, -22591, -106620, 105426, -140334, -21139, -259045, 94128, 132814, -78710, 150356, -145622, -1054, -62739, -275215, -156569, -20254, -204394, -192753, -320476]
9672c20476B65218C2055a27802K5436k10398C5084J11375f7856C3520f0603k45793
9661c06396J48481j73160E7093a29044j64358f7424r1193l5830D0137M9269j0840
9650G8566a77407b0037k83626A6685c5870p1019d6308g37k21639r9500H2861C7090
9637A35636E6485a80352L7417N84g0470D7180i7446b8661J806j25824A73263D4402
9624h2284A37843f4048I7057f2577q0780F4997P6170a2365I7807f6431k9343D0012
9611B8528a67276d6886r3816h687C453b60999B7749a2357j77935a5144A22301
9599a45282o5912D8188f7333A69976c04025a31786c6A84525F8935b94656B46528
9587A07907h3372k708j11115b0173r2146K7352j42202A69061c27634e0023b2187
$$ y = [-320476, 265218, 32055, -127802, -102366, -312764, 35084, 146459, -67856, 33520, -60603, -306396, -157915, -331075, 57093, -129044, -293402, -67424, -158617, -194447, 40137, 89406, 78566, -177407, -20037, -303663, 16685, -35870, -106889, -46308, -737, -222376, -321876, 82861, 37090, 135636, 56485, -180352, -142935, -142351, -70470, 47180, -97446, -28661, -26855, -152679, 173263, 44402, -82284, 137843, -64048, 97057, -62577, -143357, 64997, 141167, -12365, 97807, -66431, -95774, 40012, 28528, -167276, -46886, -140702, -8687, 3453, -260999, 27749, -12357, -190292, -15144, 122301, -145282, -211194, 48188, -67333, 169976, -304025, -131786, -36, 184525, 68935, -294656, 246528, 107907, -83372, -86080, -197195, -20173, -112319, -84967, -227169, 169061, -327634, -50023, -22187]
9575C98085d12410D9260c45369a37406I9300l9079L7422a76018B73467M855r8942
9564A79380F5445f8535G791J7108a69142e9751j90657j7506K1806e5395a2455
9552g3996K0946p1984A16371f6946J1567B98677n9336b88728e9937f7B0399J99028
9540B19427C5192N0013e3871o2521j22946A88353e5353j30139r5831L2841D3647
9528d16101a29224p4915p3975e4340I1386A832R3207a39312d9508a1979j12713
9517a24692A10239r767B1315b10605A63592b17690n7277B8960a73701L7239A12119
9505a22807l5188d3428q2262C2711P257J07137k1830f7751J4849j27967i524D1053
9492A77637c9598A74287G6919d1508j72013H5392h1849l5061f566l9156k40700
$$ y = [398085, -412410, 49260, -345369, -137406, 99300, 60221, 97643, -176018, 273467, 278322, 179380, 65445, -68535, 7791, 24899, -169142, -59751, -250408, -267914, -246108, -55395, -12455, -73996, -53050, -125034, 116371, -66946, -55379, 298677, 239341, -288728, -59937, -67, 20399, 219427, 35192, 85205, -53871, -116392, -239338, 188353, -55353, -185492, -281323, -248482, 43647, -416101, -129224, -204139, -278114, -54340, 91386, 1832, 95039, -139312, -49508, -11979, -124692, 110239, 100472, 21315, -210605, 163592, -217690, -274967, 28960, -173701, -136462, 112119, -122807, -157995, -43428, -125690, 32711, 39968, 147105, 125275, -67751, -52902, -180869, -9524, 41053, 177637, -39598, 174287, 76919, -41508, -213521, 85392, -81849, -116910, -6566, -45722, -286422]
9481b86422a19696j84396K064J9350C18042c62464J44827c6021I8525D8508b62833
9469a20335k643a4596k84165A36478b45537j2013c8932o6124a1244A21502a86884
9457b7468B29207I000a79920C76917A75657b05538B47022a41629l6607c2618A1035
9445b3447n3038g07E2147J8749e7675m5689P704B2586L2431J61745c80369A44959
9432F8338c0186C2905f2494p959j75130B6539a30363J897q9355c24j89676e7118
9419C3517a61074g4320j50449d6970B12698h2047k40167F7524L9220a74413N2072
9408a22341o5722P2653j3120c2245k800a6540j63513j37948J3840E2006a8063
9396a7866B6899J77280b64031h5092A06685K31696i9090o7751E462i3142p9990
$$ y = [-286422, -119696, -304092, -302028, -282678, 318042, -362464, -217637, -36021, 98525, 48508, -262833, -120335, -122978, -14596, -298761, 136478, -245537, -257550, -38932, -105056, -11244, 121502, -186884, -27468, 229207, 9000, -179920, 376917, 175657, -205538, 247022, -141629, -178236, -32618, 11035, -23447, -76485, -707, 52147, 70896, -57675, -103364, -95660, 22586, 55017, 216762, -380369, 144959, 68338, -30186, 32905, -62494, -70453, -245583, 26539, -130363, -128466, -217821, -324, -190000, -57118, 33517, -161074, -74320, -224769, -46970, 212698, -82047, -322214, 67524, 106744, -174413, -122341, -188063, -115410, -128530, -32245, -35045, -16540, -180053, -318001, -304161, 52006, -18063, -17866, 26899, 204179, -264031, -85092, 106685, 338381, -99090, -166841, 5462, -93142, -173132]
9385a73132c234k29694H8099K8412a51812l6156A08999A1586d77956g8214A43914
9373C01622j06102g3980n7466B39005a39875e9397k24292a17850k20202J61554
9363a76498P5312J2683q5990N430A30270F958k136N73673G7138a94396E7420c89686
9350b12A2657g5557A52470b16339A73057c5465j02462A44617c0683j38388B4327
9338a97924B92979f2364A56383R312c2859j02876M721j00287E8418b56403Q3636
9327a72767k3735L3862A43395a27425e4143j70269h625k25168A16362a13807i687
9315b70550a12178o1521A26263J3985C6549J43716P4691j7716E4387f9768k38562
9304c08330c6407m20179a52551k57342B21419b21086D7270a60399A57404C425
$$ y = [-173132, -3234, -232928, 88099, 116511, -151812, -187968, 108999, 11586, -477956, -78214, 143914, 301622, 195520, -73980, -131446, 239005, -139875, -59397, -283689, -117850, -338052, -176498, -101186, -88503, -174493, -169063, 130270, 6958, 4822, 578495, 77138, -194396, 57420, -389686, -212, 12657, -75557, 152470, -216339, 173057, -35465, -137927, 144617, -30683, -169071, 24327, -197924, 292979, -62364, 156383, 165695, -32859, -135735, -131014, -231301, 58418, -256403, -172767, -196502, -162640, 143395, -127425, -54143, -224412, -8625, -233793, 116362, -113807, -9687, -270550, -112178, -173699, 126263, 140248, 36549, 180265, 254956, 237240, 54387, -69768, -308330, -36407, -456586, -152551, -409893, 221419, -221086, 47270, -160399, 157404, 3425]
9293G9279M0260a71305k1689M5956A9237o418a00329J4486n2626O3495r267B1540
9280E1866K90829b34673f9826o577n6568l59772A43884c07703D6478A5226b34366
9268b52280D4316c35277C5348d2200j37424k61521C1481a96504m8808A4906a16514
9256e7876B11874H1433a04330D108d32489J97258B3847a0860j18285j28666i042
9244I9862l2874b3965l08214h3987m4873B48133a55647O8337j90847J433A30467
9232a29438k692J3860l81536a87883P7781M3605K2520B8232d35E997L0682a80205
9219a73094D0110c10352P9875L8549j75459C343K47966G6990M09490e24890a44262
9207b10375O2391A35837n1927C0328J46161D3506k0745J62192a67573I528a31745
$$ y = [79279, 119539, -171305, -192994, -147038, 19237, 12819, -100329, -85843, -138469, -74974, -84241, 21540, 51866, 342695, -234673, -69826, -76403, -132971, -492743, 143884, -307703, 46478, 15226, -234366, -252280, 44316, -335277, 35348, -42200, -179624, -441145, 31481, -196504, -245312, 14906, -116514, -57876, 211874, 81433, -104330, 4108, -432489, -235231, 23847, -10860, -129145, -257811, -9042, 99862, 66988, -23965, -332179, -83987, -128860, 248133, -155647, -87310, -278157, -276724, 130467, -129438, -132130, -118270, -499806, -187883, -110102, -66497, -43977, 28232, -435, 5997, 36679, -180205, -173094, 40110, -310352, -230477, -191928, -367387, 3343, 251309, 76990, 486480, -524890, -144262, -210375, -147984, 135837, 83910, 30328, 176489, 43506, 22761, 184953, -167573, 9528, -131745]
9195B33482f8381k83290D8352J12600a70319a2447j65703A77122a73562L9328
9185a34234A29289n1198J12217a37220K6300D175L3657g3132A9122c20873a14253
9173A94175e08196E3033Q7890a34865K4873p1178g3301k89313M9234Q0405B11447
9161c0176H8786d3043l60827h5671q8375P6225B41716a93458e0093A92746J59719
9150C52465A64509d6346a5775O927o52709B12072a39746C47634a72018j80500
9140c52518a54870c962k0082D88447a97023A91941M2371A9554f501m90286B7190
9128B281a81002O7518A47697B2338a57812d1280D2896a11350F3362B9818d56419
9116a39609A69284N8672E240b65561C31265D0344n127a5326l18415Q9394A719
$$ y = [233482, -68381, -351671, 48352, 160952, -170319, -12447, -178150, 177122, -173562, -134234, 129289, 78091, 190308, -137220, -110920, 4175, 37832, -73132, 19122, -320873, -114253, 194175, -508196, 53033, 140923, -134865, -109992, -181170, -73301, -362614, -313380, -232975, 211447, -30176, 88786, -43043, -403870, -85671, -174046, -97821, 241716, -193458, -50093, 192746, 352465, 164509, -46346, -15775, -8848, -661557, 212072, -139746, 347634, -172018, -352518, -154870, -3962, -24044, 488447, -197023, 191941, 234312, 19554, -6501, -496787, 27190, 2281, -181002, -113484, 147697, 22338, -157812, -41280, 42896, -111350, 63362, 29818, -456419, -139609, 169284, 227956, 5240, -265561, 331265, 40344, 35217, -15326, -333741, -244347, 1719]
9104d9180A5328M8196N9190K3366c07706f9061E8685h5706A19707A4393b06275
9092b18924G5988P9478a8404o5676C9206J36905O4855a34748f5696G9206a54309
9080a54600m3785A86552j8189A9931b09436F8359L14847e6994l76697a84355h4522
9068b02157C9037G083K4446a55499C8924K72161F2179A3932a68079n3855j29473
9057c51407a23024l8023K7536H1530a75490Q1745c4476k10366r2041a951j02956
9046a04907p3287N62d3425p0609F0148b36127F1294d5980q6222D65664A03248
9034b6558q872A8480a69794L8852A78067a12002j35344h735j28330l0673d0893
9022f9771j36357F3366k9277a48491K8854B223a95890r6239A26505n2818C2412
$$ y = [-49180, 15328, 63524, 122714, 146080, -307706, -69061, 58685, -85706, 119707, 14393, -206275, -218924, 75988, 155466, -18404, -84080, 39206, 176111, 240966, -134748, -65696, 79206, -154309, -154600, -198385, 186552, 168363, 19931, -209436, 68359, 383206, -56994, -433691, -184355, -84522, -202157, 39037, 7083, 31529, -155499, 38924, 311085, 62179, 13932, -168079, -221934, -351407, -123024, -161047, -133511, 81530, -175490, -93745, -34476, -244842, -336883, -1951, -104907, -178194, -177632, -43425, -114034, 60148, -236127, 61294, -45980, -132202, 465664, 103248, -26558, -35430, 18480, -169794, -130942, 178067, -112002, -247346, -8735, -137065, -167738, -40893, -69771, -206128, 63366, 34089, -148491, -119637, 2223, -195890, -292129, 126505, 73687, 32412]
9010b15371C3058c29991a50256b9129C2343b42970A06419a42085A69162E6659
8999E4894M971b23611B09152c30831B22042d86466B2356E805Q877R5480c12982
8987C0175a59556o0427R9446k5366q7193B3252e9656k97708f1495j9431A49957
8975b66131R5372j36777d1686C2242a1340A06930a25956D2552K4996a7590k2324
8964c9914B61881c85260D6325J56943d6671j37656B30795l4310a35739o4469B47973
8952A9853b35381a6859j29381j5269A43202b12916e8708K4110k4404k17585C49347
8940c78164J85250O6607j22090A04529a72679C9976J24919h5621D00695i057A80211
8928c22741E4668J18606a14902J1514A89561M08057N8019J149220M621034N009484
$$ y = [-215371, 33058, -329991, -150256, -29129, 32343, -242970, 106419, -142085, 169162, 56659, 54894, 59865, -223611, 209152, -330831, 222042, -486466, 22356, 5805, 14682, 110162, -312982, 30175, -159556, -219983, -120537, -145903, -233096, 23252, -59656, -357364, -61495, -80926, 149957, -266131, -170759, -307536, -41686, 32242, -11340, 106930, -125956, 42552, 67548, -17590, -39914, 261881, -385260, 46325, 203268, -46671, -184327, 230795, 196485, -135739, -200208, 247973, 19853, -235381, -16859, -146240, -161509, 143202, -212916, -58708, -34598, -59002, -276587, 349347, -378164, -192914, -126307, -248397, 104529, -172679, 39976, 164895, -85621, 400695, -9057, 180211, -322741, 54668, 173274, -114902, -103388, 189561, 597618, 655637, 1804857, 6425891, 11435375]
8918A1435375D036817A317626o18182k79173L2224k10302I7068M2813b08531d7894
8907A74734Q0831l6131r5842d3228j18308k63001a65069N9741B74701G1717A8584
8895b36472j84024B1355e7086D2012K5774a63298g5102j36287N8640k847a4716
8883B46859e1431C8011a19956n0159g014D4401J13413f2923k65942a50638C9464
8871b25630d6921k42412Q8691j25737A05132E2357L8265K23365b52378C0940J21422
$$ y = [11435375, 4036817, 1317626, 699444, 420271, 452495, 242193, 97068, 139881, -208531, -47894, 174734, 255565, 219434, 123592, -43228, -161536, -424537, -165069, -105328, 274701, 71717, 18584, -236472, -420496, 21355, -57086, 42012, 67786, -163298, -75102, -211389, -152749, -155596, -14716, 246859, -51431, 38011, -119956, -170115, -7014, 44401, 157814, -62923, -328865, -150638, 39464, -225630, -46921, -289333, -200642, -326379, 105132, 52357, 90622, 313987, -252378, 30940, 152362]
$$ [...]
##END NTUPLES=NMR SPECTRUM
##END=
