
##TITLE=AC1172_Tolima-ibage-TFiAH12005_7165075_biRkHNU73v
##JCAMPDX= 6.0         $$ Bruker NMR JCAMP-DX V2.0
##DATA TYPE= NMR SPECTRUM
##DATA CLASS= NTUPLES
##ORIGIN= BRUKER
##OWNER= Administrator
$$ 1.72 TOPSPIN		Version 2.1
$$ 2012-12-01 18:52:40.365 -0500  Administrator@X
$$ Compression mode = diff/dup
##.OBSERVE FREQUENCY= 400.02188249412
##.OBSERVE NUCLEUS= ^1H
##.ACQUISITION MODE= SIMULTANEOUS (DQD)
##.ACQUISITION SCHEME= undefined
##.AVERAGES= 64
##.DIGITISER RES= 22
##SPECTROMETER/DATA SYSTEM= spect
##.PULSE SEQUENCE= noesygpps1d.comp
##.SOLVENT NAME= COFFEE_meoh
##.SHIFT REFERENCE= INTERNAL, COFFEE_meoh, 1, 14.96229
##AUDIT TRAIL= $$ (NUMBER, WHEN, WHO, WHERE, PROCESS, VERSION, WHAT)
$$ ##TITLE= Audit trail, TOPSPIN		Version 2.1
$$ ##JCAMPDX= 5.01
$$ ##ORIGIN= Bruker BioSpin GmbH
$$ ##OWNER= Administrator
$$ $$ E:\/data/COFFEE/nmr/AC1172_Tolima-ibage-TFiAH12005_7165075_biRkHNU73v/12/pdata/1/auditp.txt
$$ ##AUDIT TRAIL=  $$ (NUMBER, WHEN, WHO, WHERE, PROCESS, VERSION, WHAT)
(   1,<2012-12-01 18:52:33.970 -0500>,<Administrator>,<X>,<go>,<TOPSPIN 2.1>,
      <created by zg
	started at 2012-12-01 18:41:06.253 -0500,
	POWCHK enabled, PULCHK disabled,
       configuration hash MD5:
       86 BA 57 50 F2 9D 5C 9B 26 00 A9 28 5F 66 2E 89
       data hash MD5: 64K
       AF 1C E9 D3 B9 B1 B7 4F C9 98 F1 79 11 0A CC FC>)
(   2,<2012-12-01 18:52:36.957 -0500>,<Administrator>,<X>,<proc1d>,<TOPSPIN 2.1>,
      <Start of raw data processing
       efp LB = 0.3 FT_mod = 6 PKNL = 1 PHC0 = 0 PHC1 = 0 SI = 128K 
       data hash MD5: 128K
       36 C4 B2 2A F1 B2 4A D5 BB 5C 68 25 71 F9 33 D8>)
(   3,<2012-12-01 18:52:38.404 -0500>,<Administrator>,<X>,<proc1d>,<TOPSPIN 2.1>,
      <pk PHC0 = -81.55701 PHC1 = 0 
       data hash MD5: 128K
       35 FD FB F9 76 A4 A2 C6 D8 D4 3F D4 9A AF 8A 2A>)
(   4,<2012-12-01 18:52:39.287 -0500>,<Administrator>,<X>,<proc1d>,<TOPSPIN 2.1>,
      <abs ABSG = 1 
       data hash MD5: 128K
       42 9D 72 24 4E 35 77 4C 43 2D 7E 0D D6 1C F6 74>)
(   5,<2012-12-01 18:52:39.483 -0500>,<Administrator>,<X>,<proc1d>,<TOPSPIN 2.1>,
      <abs ABSG = 2 
       data hash MD5: 128K
       60 22 29 40 31 CB D2 39 22 1A A9 55 3D A8 0F F5>)
(   6,<2012-12-01 18:52:39.646 -0500>,<Administrator>,<X>,<proc1d>,<TOPSPIN 2.1>,
      <abs ABSG = 3 
       data hash MD5: 128K
       91 7A CC E2 76 25 5F E0 FF 24 D5 3B A0 64 24 CA>)
(   7,<2012-12-01 18:52:39.810 -0500>,<Administrator>,<X>,<proc1d>,<TOPSPIN 2.1>,
      <abs ABSG = 4 
       data hash MD5: 128K
       95 14 BB 18 9D 72 71 4B 84 EF 0F DF 73 1E 27 A0>)
(   8,<2012-12-01 18:52:40.006 -0500>,<Administrator>,<X>,<proc1d>,<TOPSPIN 2.1>,
      <abs ABSG = 5 
       data hash MD5: 128K
       2D AC DA 82 D5 43 4C 16 32 23 DD 33 B4 21 23 98>)
$$ ##END=
$$ 
$$ $$ hash MD5
$$ $$ A6 53 D1 D9 85 3D 56 3A E1 B7 FB 68 DF 38 7C 8D
##$RELAX= 
##$RELAX= 
##$RELAX= 
##$RELAX= 
##$RELAX= 
##$RELAX= 
##$RELAX= 
##$RELAX= 
$$ Bruker specific parameters
$$ --------------------------
##$DU= <E:\>
$$ [...]
##$TP07= 0
##$TPNAME0= <>
##$TPNAME1= <>
##$TPNAME2= <>
##$TPNAME3= <>
##$TPNAME4= <>
##$TPNAME5= <>
##$TPNAME6= <>
##$TPNAME7= <>
##$TPOAL= (0..7)
0.5 0.5 0.5 0.5 0.5 0.5 0.5 0.5
##$TPOFFS= (0..7)
0 0 0 0 0 0 0 0
##$TUNHIN= 0
##$TUNHOUT= 0
##$TUNXOUT= 0
##$USERA1= <user>
##$USERA2= <user>
##$USERA3= <user>
##$USERA4= <user>
##$USERA5= <user>
##$V9= 5
##$VALIST= <valist>
##$VCLIST= <CCCCCCCCCCCCCCC>
##$VD= 0
##$VDLIST= <DDDDDDDDDDDDDDD>
##$VPLIST= <PPPPPPPPPPPPPPP>
##$VTLIST= <TTTTTTTTTTTTTTT>
##$WBST= 1024
##$WBSW= 4
##$XGAIN= (0..3)
0 0 0 0
##$XL= 0
##$YL= 0
##$YMAX_a= 8681873
##$YMIN_a= -18443686
##$ZGOPTNS= <>
##$ZL1= 120
##$ZL2= 120
##$ZL3= 120
##$ZL4= 120
##$ABSF1= 14.96229
##$ABSF2= -5.595892
##$ABSG= 5
##$ABSL= 3
##$ALPHA= 0
##$AQORDER= 0
##$ASSFAC= 0
##$ASSFACI= 0
##$ASSFACX= 0
##$ASSWID= 0
##$AUNMP= <proc_prof1d_extract.lims>
##$AXLEFT= 0
##$AXNAME= <>
##$AXNUC= <1H>
##$AXRIGHT= 0
##$AXTYPE= 0
##$AXUNIT= <>
##$AZFE= 0.1
##$AZFW= 0.1
##$BCFW= 0
##$BC_mod= 0
##$BYTORDP= 0
##$COROFFS= 0
##$CY= 15
##$DATMOD= 1
##$DC= 0
##$DFILT= <>
##$DTYPP= 0
##$F1P= 0
##$F2P= 0
##$FCOR= 0.5
##$FTSIZE= 131072
##$FT_mod= 6
##$GAMMA= 0
##$GB= 0
##$INTBC= 1
##$INTSCL= 1
##$ISEN= 128
##$LB= 0.3
##$LEV0= 0
##$LPBIN= 0
##$MAXI= 10000
##$MC2= 0
##$MEAN= 0
##$ME_mod= 0
##$MI= 0
##$NCOEF= 0
##$NC_proc= -2
##$NLEV= 6
##$NOISF1= 0
##$NOISF2= 0
##$NSP= 0
##$NTH_PI= 0
##$NZP= 0
##$OFFSET= 14.96229
##$PC= 1
##$PHC0= -81.55701
##$PHC1= 0
##$PH_mod= 1
##$PKNL= yes
##$PPARMOD= 0
##$PPDIAG= 0
##$PPIPTYP= 0
##$PPMPNUM= 2147483647
##$PPRESOL= 1
##$PSCAL= 4
##$PSIGN= 0
##$PYNMP= <proc.py>
##$REVERSE= no
##$SF= 400.020009119605
##$SI= 131072
##$SIGF1= 0
##$SIGF2= 0
##$SINO= 400
##$SIOLD= 131072
##$SPECTYP= <>
##$SREGLST= <1H.CDCl3>
##$SSB= 0
##$STSI= 131072
##$STSR= 0
##$SW_p= 8223.68421052631
##$SYMM= 0
##$S_DEV= 0
##$TDeff= 65536
##$TDoff= 0
##$TI= <>
##$TILT= no
##$TM1= 0
##$TM2= 0
##$TOPLEV= 0
##$USERP1= <user>
##$USERP2= <user>
##$USERP3= <user>
##$USERP4= <user>
##$USERP5= <user>
##$WDW= 1
##$XDIM= 131072
##$YMAX_p= 426844077
##$YMIN_p= -12579
##$CURPLOT= <Network HP LaserJet P1505>
##$CURPRIN= <$Network HP LaserJet P1505>
##$DFORMAT= <normdp>
##$LAYOUT= <+/1D_H.xwp>
##$LFORMAT= <normlp>
##$PFORMAT= <normpl>
##$SURQMSG= 1
$$ End of Bruker specific parameters
$$ ---------------------------------
##NTUPLES= NMR SPECTRUM
##VAR_NAME=  FREQUENCY,     SPECTRUM/REAL,   SPECTRUM/IMAG
##SYMBOL=    X,             R,               I
##VAR_TYPE=  INDEPENDENT,   DEPENDENT,       DEPENDENT
##VAR_FORM=  AFFN,          ASDF,            ASDF
##VAR_DIM=   131072,        131072,          131072
##UNITS=     HZ,            ARBITRARY UNITS, ARBITRARY UNITS
##FACTOR=    0.0627417313425164, 1,          1
##FIRST=     8223.62146879497, 5271,         -67446
##LAST=      0,             6638,            -66403
##MIN=       0,             -12579,          0
##MAX=       8223.62146879497, 426844077,    0
$$ Real data points
##PAGE= N=1
##DATA TABLE= (X++(R..R)), XYDATA
$$ [...]
67425 102371 103141 103227 102627 101563 100130 98477 96979 95928 95287 94931 94864 94909 94528 93450 92253 91740 91830 91727
67407 91727 91257 91274 92414 94158 95633 96721 97667 98096 97448 96268 95951 96941 97968 97560 95722 93681 92473
67390 92473 92315 92970 94055 95035 95437 95238 94825 94575 94606 94899 95495 96544 98087 99702 100548 100137 99008 98211
67372 98211 98071 98016 97723 97675 98225 98893 99233 99740 101014 102466 102889 102157 101353 101197 101315 101238 101095 100978 100528
67353 100528 99752 99523 100521 102164 103293 103632 103900 104687 105875 107143 108365 109402 109953 109909 109617 109605 110165
67336 110165 111237 112612 114131 115697 117120 118093 118526 118840 119636 120965 122241 122966 123216 123195 122646 121132
67320 121132 118747 116238 114487 114025 114811 116212 117409 118087 118591 119187 119549 119338 118923 118923 119290 119520 119648 120278
67302 120278 121579 123049 124478 126358 128863 131132 132210 132344 132685 133918 135762 137590 138915 139305 138518
67287 138518 136946 135476 134637 134150 133462 132439 131347 130434 129848 129803 130490 131738 132938 133450 133148 132573 132444
67270 132444 133002 133887 134709 135533 136611 137772 138513 138719 138880 139379 139887 139827 139235 138774 138969 139743 140682 141442
67252 141442 141876 142095 142502 143427 144565 145110 144733 144168 144460 145750 147137 147684 147230 146274 145519 145639 147007
67235 147007 149256 151340 152441 152796 153343 154602 156184 157367 157823 157652 157149 156831 157432 159325 161847 163577
67219 163577 163572 162212 160704 159929 160019 160848 162406 164498 166468 167618 167932 168055 168555 169361 170039 170456 170993 172085
67201 172085 173654 175081 175787 175771 175492 175339 175442 175978 177234 179140 181100 182650 184015 185561 186936 187445
67185 187445 187260 187510 188876 190684 191778 191869 191598 191651 192318 193554 194998 196115 196804 197655 199150 200861 202013
67168 202013 202620 203363 204461 205457 206205 207244 208883 210615 211857 212732 213631 214526 215231 216024 217391 219302
67152 219302 221235 222890 224454 226155 227873 229237 229981 230251 230620 231649 233318 235092 236596 237922 239208
67137 239208 240350 241470 243137 245663 248490 250794 252462 253920 255252 256154 256750 257824 260009 263108 266328
67122 266328 268929 270701 272096 273831 276049 278057 279262 280076 281369 283271 285251 287239 289757 292836
67108 292836 295698 297841 299654 301601 303577 305517 307874 310860 313886 316465 319077 322297 325528 327596
67094 327596 328409 329097 330588 332839 335484 338356 341163 343428 345123 346833 348989 351368 353616 355808 358251
67079 358251 361101 364433 368297 372391 375974 378508 380292 382202 384904 388429 392413 396583 401025 405952
67065 405952 411098 415534 418489 420332 422342 425447 429546 434151 439082 444244 449204 453533 457359 461161
67051 461161 465120 468998 472581 475954 479425 483364 487993 493165 498489 503803 509258 514738 519581 523296
67037 523296 526337 529715 533942 538740 543694 548645 553455 557896 562033 566387 571465 577215 583069 588464
67023 588464 593319 598104 603352 609082 614852 620492 626406 632835 639210 644848 650104 656114 663404 671439
67009 671439 679630 688012 696620 704985 712759 720312 728080 735789 743003 750132 758171 767570 777945 788723
66995 788723 799452 809585 818804 827656 837167 847548 857894 867433 876462 885690 895242 904880 914726
66982 914726 925090 935833 946623 957798 970220 984026 998024 1010745 1021924 1032661 1044178
66971 1044178 1056634 1069204 1081172 1092774 1104836 1117699 1130812 1143541 1156044 1168994 1182619
66960 1182619 1196503 1210344 1224432 1239184 1254580 1270365 1286466 1302903 1319490 1336025 1352721
66949 1352721 1370011 1387875 1405688 1422969 1439964 1457244 1474892 1492454 1509701 1527068 1545103
66938 1545103 1563718 1582296 1600491 1618584 1637012 1655878 1675009 1694209 1713204 1731654 1749584
66927 1749584 1767625 1786377 1805587 1824380 1842334 1859921 1877833 1896302 1915238 1934567 1954111
66916 1954111 1973487 1992484 2011301 2030096 2048593 2066528 2084236 2102281 2120609 2138584 2155900
66905 2155900 2172945 2190150 2207323 2223802 2238973 2252576 2264826 2276403 2288058 2300066 2312218
66894 2312218 2324357 2336593 2348831 2360444 2370769 2379795 2388098 2396154 2403887 2410857 2416747 2421659 2425927
66881 2425927 2429612 2432271 2433444 2433320 2432622 2431845 2430904 2429555 2427696 2425094 2421250 2415948 2409658 2403028 2396261
66866 2396261 2389275 2382136 2374800 2366633 2356852 2345490 2333419 2321361 2309304 2296945 2284150 2270772
66854 2270772 2256544 2241513 2226205 2210963 2195394 2178880 2161473 2143822 2126315 2108695 2090571
66843 2090571 2071928 2053000 2033957 2014910 1995947 1976897 1957209 1936355 1914465 1892366 1870956
66832 1870956 1850637 1831369 1813054 1795638 1778899 1762354 1745422 1727619 1708613 1688382 1667467
66821 1667467 1646861 1627365 1609005 1591234 1573602 1556026 1538426 1520464 1501834 1482673 1463476
66810 1463476 1444698 1426566 1409193 1392591 1376531 1360573 1344384 1327957 1311483 1295111 1278981
66799 1278981 1263401 1248741 1234980 1221460 1207287 1192110 1176460 1161278 1147046 1133398 1119557
66788 1119557 1105204 1090926 1077707 1065890 1054667 1042722 1029418 1015277 1001314 988101 975540
66777 975540 963321 951345 939664 928225 916829 905342 893952 883110 873155 863932 854872 845487
66765 845487 835729 825909 816380 807358 798871 790750 782731 774688 766690 758848 751214 743863 736854 729953
66751 729953 722627 714569 706090 697715 689543 681332 673127 665374 658334 651706 645031 638144 631088 623837
66737 623837 616433 609262 602887 597530 592877 588374 583669 578777 573939 569310 564703 559651 553810 547345
66723 547345 540846 534834 529299 523793 518001 512211 507076 502935 499455 496030 492360 488460 484285 479679
66709 479679 474735 469913 465593 461663 457740 453703 449846 446506 443719 441237 438781 436183 433299 429966
66695 429966 426141 422072 418147 414542 411113 407759 404700 402181 399987 397484 394199 390251 386215 382663
66681 382663 379774 377227 374476 371259 367845 364631 361627 358559 355448 352702 350540 348581 346225 343280
66667 343280 340080 337035 334212 331276 327816 323824 319866 316649 314333 312392 310214 307689 305172 303001
66653 303001 301197 299489 297518 295150 292728 290877 289909 289444 288795 287682 286389 285121 283441 280655 276804
66638 276804 273002 270471 269331 268638 267551 266022 264311 262435 260491 259014 258405 258269 257870 256991 255756
66623 255756 253894 251109 248090 246157 245587 245160 243820 242029 240863 240423 239883 238713 237060 235093 232705
66608 232705 229922 227137 224823 223188 222071 220983 219536 218013 217239 217523 218106 218019 217187 216164 215116 213721
66592 213721 211965 210368 209359 208873 208632 208406 207983 207253 206386 205634 204997 204364 203869 203710 203665 203200 202043 200378
66574 200378 198557 196960 195981 195685 195570 195052 194117 193053 191772 190032 188260 187397 187767 188627 189049 188760 187979
66557 187979 186922 185758 184680 183800 183154 182744 182215 180707 177693 174016 171373 170573 170891 171294 171494 171485 170890
66540 170890 169439 167587 165951 164520 162964 161409 160259 159507 158831 158238 157998 157987 157664 156768 155619 154599
66524 154599 153678 152652 151616 150958 150901 151166 151261 151100 151074 151262 150886 149143 146471 144322 143488 143330 142976 142587
66506 142587 142818 143533 143832 143153 141765 140204 138760 137621 137103 137482 138609 139716 139782 138423 136409 134835
66490 134835 133812 132606 131130 130383 130897 131664 131444 130487 129939 129986 129751 128932 128455 129245 131123 133095 134113
66473 134113 133517 131447 129054 127646 127398 127388 126993 126638 126945 127784 128530 128798 128580 128015 127311 126637 125911 124975
66455 124975 124031 123498 123321 122857 121672 120104 118852 118316 118446 118911 119296 119453 119726 120454 121291 121527 121142 120901
66437 120901 121224 121616 121512 121085 120794 120633 120292 119646 118666 117267 115718 114809 115047 115915 116420 116185 115629 115340
66419 115340 115661 116574 117491 117440 116027 114063 112741 112342 112246 112002 111721 111468 110965 110067 109018 108035 107104 106370
66401 106370 106263 106913 107772 108153 107985 107716 107611 107432 106872 106047 105395 105081 104669 103549 101721 99964 99134 99399
66383 99399 100281 101216 101899 102223 102180 101856 101351 100693 99892 99015 98160 97461 97130 97257 97512 97393 96955 96888 97482 97951
66363 97951 97344 95930 94934 94902 95063 94532 93541 93030 93432 94335 95142 95637 95947 96302 96880 97671 98464 99063 99480
66344 99480 99799 99924 99662 99062 98480 98202 98111 97855 97292 96594 95874 94954 93716 92512 91874 91777 91573 90834 89937
66325 89937 89522 89655 89903 89986 89879 89388 88236 86727 85765 85864 86495 86793 86661 86758 87488 88414 88767 88215 87032
66306 87032 85781 85018 85077 85773 86367 86084 84837 83301 82212 81799 82002 82871 84354 85913 86862 87176 87434
66289 87434 87886 88091 87776 87478 87818 88528 88785 88314 87527 86689 85644 84436 83545 83272 83347 83447 83686 84241 84824
66270 84824 84901 84316 83416 82651 82186 81846 81326 80540 79804 79527 79744 80168 80675 81361 82101 82531 82660 82996 83691
66251 83691 83990 83079 81256 79673 79036 79061 79183 79221 79175 78892 78309 77721 77488 77610 77810 77905 77852 77586 77141 76884
66231 76884 77287 78318 79261 79346 78501 77364 76673 76724 77312 77913 77974 77337 76535 76417 77296 78599 79505 79740 79544
66212 79544 79127 78591 78236 78420 79027 79503 79564 79444 79293 78753 77485 75852 74705 74637 75693 77526 79513 80942
66194 80942 81517 81583 81512 81063 79817 78116 76946 76842 77432 78230 79211 80303 80932 80685 80061 79877 80100 79935
66176 79935 79106 78353 78443 79228 80022 80450 80475 79955 78809 77521 76870 77029 77365 77295 76967 76853 77072 77413 77758
66157 77758 78061 78065 77499 76557 75794 75478 75322 74998 74600 74440 74554 74654 74486 74091 73746 73736 74131 74741 75278 75573
66137 75573 75592 75302 74680 73876 73174 72719 72362 71829 70997 70012 69264 69208 69988 71206 72210 72652 72676 72598 72619 72792
66117 72792 72977 72802 72048 71159 70964 71608 72160 71683 70415 69473 69554 70408 71450 72329 72770 72404 71140 69501
66099 69501 68337 68221 69118 70454 71383 71209 69836 67831 65963 64667 63967 63735 63882 64310 64853 65330 65599
66082 65599 65504 64907 63979 63415 64002 65702 67402 67991 67634 67497 68168 68947 69010 68677 68948 70128 71569 72659
66064 72659 73352 73725 73682 73312 73018 72988 72945 72681 72433 72421 72392 72003 71389 70946 70734 70468 70013 69518 69181 69184 69754
66043 69754 70886 72047 72571 72425 72255 72567 73172 73574 73546 73101 72214 70943 69731 69177 69415 69981 70418 70767
66025 70767 71290 71867 72062 71836 71852 72800 74571 76424 77902 79208 80558 81587 81756 81177 80660 80932 82016
66008 82016 83344 84183 84024 82929 81644 81044 81249 81509 81147 80353 79808 79771 79947 80111 80339 80584 80515 80046 79635
65989 79635 79726 80157 80492 80764 81431 82575 83586 83812 83330 82848 82977 83693 84421 84577 84120 83634 83737 84338 84620
65970 84620 83862 82192 80404 79175 78586 78386 78522 79223 80543 81949 82569 82007 80750 79596 78804 78095 77352
65953 77352 76870 76817 76873 76691 76417 76503 77191 78447 80109 81811 82958 83209 82880 82549 82357 82012 81335 80434 79385
65934 79385 78177 76990 76169 75865 75976 76428 77189 78043 78754 79478 80557 81816 82523 82254 81393 80583 80106 80029
65916 80029 80468 81273 81789 81443 80432 79453 78957 78979 79476 80283 80878 80776 80218 79990 80453 81186 81720 82131 82619
65897 82619 82964 82833 82368 81973 81630 80924 79768 78669 78150 78294 78983 80137 81364 81825 80999 79410 78038
65880 78038 77143 76302 75562 75689 76926 78360 79147 79726 81009 82790 83937 83931 83242 82181 80488 78343 76777
65863 76777 76504 77018 77423 77568 77748 77875 77691 77445 77603 78057 78276 78143 78023 78075 78019 77595 76831 75876 75005 74690
65843 74690 75192 76100 76706 76830 76846 76968 77012 76912 76958 77395 78209 79378 80931 82595 83769 84067 83642 82915 82250
65824 82250 81901 81907 81958 81672 81082 80570 80327 80285 80537 81287 82288 82840 82592 81940 81444 81288 81516 82267 83381 84209
65804 84209 84227 83617 82918 82347 81818 81375 81281 81756 82831 84216 85207 85081 83865 82384 81336 80780 80765 81772
65786 81772 83865 85911 86560 85873 85193 85404 86101 86568 86806 87214 87804 88222 88296 88213 88233 88404 88450 87929 86709
65767 86709 85256 84211 83705 83353 82878 82325 81665 80717 79630 78950 78888 78893 78316 77219 76190 75551 75132 74681
65749 74681 74170 73736 73618 74085 75170 76492 77510 77828 77153 75232 72215 68949 66468 65104 64341 63527
65733 63527 62438 61226 60261 60089 61033 62580 63556 63241 62055 60883 60046 59395 59079 59556 60775 61959 62431
65716 62431 62315 62199 62440 63010 63731 64358 64720 65048 65895 67397 68849 69404 69038 68404 67887 67297 66434 65394
65698 65394 64278 63095 62150 61998 62781 63978 65051 65887 66386 66131 65013 63812 63537 64328 65480 66436 67192
65681 67192 67738 67710 66873 65620 64718 64713 65641 67114 68559 69498 69760 69426 68656 67661 66766 66307 66462 67213 68319
65662 68319 69244 69357 68536 67415 66750 66612 66456 65870 64948 64067 63622 63824 64353 64373 63401 62090 61621 62318 63451
65643 63451 64396 65285 66324 67193 67501 67291 66706 65716 64572 64025 64529 65660 66850 68210 70021 71790 72586
65626 72586 72151 70988 69554 68077 67069 67118 68045 68948 69288 69333 69424 69485 69481 69602 69629 68843 67157 65747 65809 66996
65606 66996 67780 67184 65545 63763 62521 62243 63070 64545 65799 66387 66680 67279 68337 69642 70964 72041
65590 72041 72553 72486 72268 72121 71457 69471 66354 63402 61719 61170 60887 60467 60219 60403 60710 60609 59927 58988
65572 58988 58326 58301 58753 58982 58366 57113 56193 56321 57186 57868 57809 57152 56325 55703 55597 56159 57155 58139 59026
65553 59026 60227 61997 63855 64932 64900 64296 63929 64159 64838 65703 66532 66952 66490 65094 63458 62496 62437 62675
65535 62675 62568 62098 61625 61315 61164 61359 62172 63481 64724 65391 65405 65018 64634 64669 65245 65933 66095 65617 65013
65516 65013 64705 64535 64243 64068 64520 65705 67263 68912 70706 72726 74808 76714 78381 79876 81165 82004
65500 82004 82049 81100 79284 77066 75052 73772 73459 73903 74568 75088 75656 76677 78010 78902 78824 78073 77295 76687
65482 76687 76044 75387 75128 75589 76654 77952 79172 80209 81171 82228 83333 84261 85072 86224 87910 89522
65466 89522 90311 90455 90847 91846 92867 93418 93880 94885 96394 97881 99067 99944 100297 99765 98382 96619 94857
65449 94857 93118 91347 89602 87869 85946 83698 81354 79438 78392 78170 78117 77343 75439 72874 70637
65434 70637 69457 69312 69545 69409 68641 67610 66769 66030 64974 63768 63370 64435 66324 67700 67922 67397 66667
65417 66667 65766 64607 63463 62766 62718 63278 64301 65487 66450 67028 67388 67696 67875 67823 67684 67755 68240 69168 70372
65398 70372 71436 71901 71701 71287 71230 71840 73163 75028 76967 78375 79030 79281 79519 79684 79546 79305 79515 80418
65380 80418 81625 82508 82795 82808 83276 84860 87633 90999 94155 96680 98737 100879 103728 107595 112280 117385
65364 117385 122902 129204 136336 143645 150471 156955 163825 171557 180029 188694 196503 201821 203156 200280
65350 200280 194400 187112 179507 172190 165576 159820 154824 150579 147230 144564 141764 138010 133246 128152
65336 128152 123546 119957 117534 116010 114844 113604 112184 110586 108731 106707 104933 103661 102453 100497
65322 100497 97509 94029 90814 88190 86044 84152 82357 80657 79252 78331 77642 76466 74344 71794 69969
65307 69969 69476 69771 69996 70141 70922 72505 73913 74086 73169 72200 71684 71088 69872 68411 67477 67229 67140 66822
65289 66822 66414 66144 65882 65322 64446 63632 63338 63697 64404 64980 65153 64983 64657 64254 63737 63094 62430 61990 62056
65270 62056 62678 63552 64307 64891 65479 66025 66256 66140 66009 66071 66179 66275 66668 67544 68531 69117 69215 68947 68218 67040
65250 67040 66029 65876 66364 66577 66209 66059 66983 68886 71064 73046 74674 75729 76046 75922 75987 76584 77477
65233 77477 78176 78396 78243 78122 78377 78910 79172 78646 77335 75715 74257 73070 71941 70656 69274 68117
65217 68117 67422 67051 66641 65983 65097 63977 62583 61169 60352 60614 61875 63633 65382 66741 67381 67140 66184
65200 66184 64932 63782 62918 62255 61506 60462 59310 58510 58252 58210 57976 57541 57144 56817 56393 55921 55763 56194
65182 56194 57056 57863 58213 58107 57949 58157 58652 58821 58168 56974 56190 56622 58255 60368 62188 63477 64531
65165 64531 65613 66488 66638 65943 64890 64036 63479 62970 62314 61494 60751 60709 62034 64508 66745 67484 67020 66741
65147 66741 67239 67596 66818 65272 64182 64134 64682 65239 65702 66163 66485 66444 66090 65840 66193 67337 68859 69924
65129 69924 69952 69111 68006 66926 65699 64325 63390 63567 64876 66678 68335 69567 70243 70218 69656 69246 69690
65112 69690 70958 72293 73050 73298 73482 73815 74297 75119 76557 78429 80045 80963 81533 82432 83844 85428 87049
65095 87049 89135 92135 95840 99595 103151 107083 112122 118141 124042 128786 132454 136103 140582 145684
65081 145684 150465 154139 156491 157722 158259 158648 159173 159407 158445 155849 152150 148224 144361 140296 135985
65066 135985 131812 127934 123902 119214 113937 108450 102875 97258 92137 88302 85854 83992 81978 79929
65052 79929 78378 77412 76682 76019 75464 74760 73389 71322 69301 68119 67842 67953 67984 67753 67251 66648 66336 66574
65034 66574 67091 67302 66911 65999 64604 62716 60791 59711 59781 60162 59894 59244 59351 60501 61557 61477 60789 60931
65016 60931 62436 64404 65630 65690 64924 63965 63442 63666 64359 64980 65422 66011 66662 66606 65391 63761 62977 63414
64998 63414 64322 64883 65027 65155 65497 65974 66412 66728 67005 67396 67839 67933 67357 66338 65419 64726 63887 62787 61986
64979 61986 62083 62914 63757 64210 64484 64831 65082 64922 64404 63917 63741 63841 64085 64387 64512 64029 62765 61229 60257
64960 60257 60202 60724 61421 62291 63394 64411 64890 64762 64270 63522 62494 61423 60838 61034 61695 62139 61882 61042
64942 61042 60310 60418 61457 62800 63821 64489 65035 65372 65277 64961 64905 65176 65391 65384 65362 65401 65325 65224 65451 65922
64922 65922 65999 65428 64816 64731 64826 64452 63725 63294 63261 62996 62056 60724 59571 58944 58972 59666 60726 61525 61550 60825
64902 60825 59815 58959 58321 57697 57067 56889 57780 59872 62606 65182 66980 67617 67010 65610 64232 63368 62914
64885 62914 62672 62729 63055 63237 63054 62923 63221 63516 63130 62239 61718 61938 62449 62866 63415 64409 65748 67075 68021
64866 68021 68214 67575 66718 66485 66919 67167 66608 65518 64460 63638 63198 63501 64552 65603 65933 65726 65662 65895
64848 65895 65999 65724 65179 64301 62739 60528 58494 57704 58498 60125 61299 61254 60395 59853 60352 61598 62755
64831 62755 63214 62847 61922 61022 60755 61152 61592 61603 61451 61668 62275 62885 63315 63620 63755 63722 63879 64521 65270 65470
64811 65470 65146 64943 65058 64920 64151 63209 62740 62821 63243 64059 65303 66477 66897 66495 65831 65305 64730 63781 62622
64792 62622 61958 62480 64177 66130 67149 66816 65891 65515 66132 67237 68091 68466 68710 69190 69716 69594 68432
64775 68432 66824 65904 66105 66731 66956 66819 66875 67223 67488 67533 67608 67767 67774 67691 68020 68999 70197 71015 71245 70957
64755 70957 70288 69640 69596 70172 70506 69811 68413 67355 67148 67466 67931 68502 69053 69251 69165 69441 70430 71455 71372
64736 71372 69768 67399 65593 65340 66626 68453 69699 70210 70777 71857 72787 72694 71818 71206 71253 71328 71003 70850
64718 70850 71598 73005 74136 74482 74276 73785 72918 71653 70418 69747 69739 70128 70732 71548 72438 73075 73369 73730
64700 73730 74595 75764 76549 76619 76367 76260 76151 75558 74487 73608 73590 74500 75787 76679 76638 75734 74610 73889 73649
64681 73649 73645 73818 74223 74566 74399 73841 73560 73847 74155 73936 73474 73434 73837 74013 73516 72693 72271 72628 73472 74103
64661 74103 74042 73508 73165 73362 73814 74167 74454 74700 74502 73548 72396 72063 72771 73598 73532 72533 71416 71006 71596
64642 71596 72922 74438 75702 76602 77179 77344 77019 76458 76083 76001 75990 76002 76281 76895 77517 77843 77858 77574 76918
64623 76918 76164 75987 76668 77535 77679 77095 76659 77028 77957 78705 78814 78475 78398 79207 80669 81584 80869 78753 76554
64604 76554 75301 75030 75406 76304 77412 77888 77100 75507 74203 73699 73656 73789 74368 75572 76888 77550 77342
64587 77342 76641 75875 75299 75131 75498 76188 76783 77120 77402 77783 78066 77976 77598 77404 77883 79151 80839 82280
64569 82280 82915 82654 81836 80872 79970 79191 78579 78159 77854 77539 77163 76800 76566 76488 76429 76244 76042 76226 77113 78528
64549 78528 79907 80820 81232 81302 81116 80696 80154 79743 79780 80415 81341 81878 81644 81110 81152 81960 82741 82653 81773 80960
64529 80960 80999 82032 83605 85007 85735 85817 85648 85464 85152 84566 83695 82508 80992 79479 78474 77965 77399
64512 77399 76586 76110 76452 77276 78103 79112 80546 81803 82042 81453 80956 80721 80018 78632 77424 77120 77425
64495 77425 77811 78409 79467 80530 80885 80545 80181 80234 80546 80718 80466 79763 78925 78426 78361 78300 77880 77317 77041
64476 77041 77048 76942 76478 75818 75312 75264 75771 76599 77325 77683 77655 77193 76260 75262 75008 75890 77368 78601 79338 79920
64456 79920 80738 82023 83889 86087 87856 88491 88026 87083 86172 85414 84791 84320 84057 84180 84946 86322 87852
64439 87852 89096 89975 90394 89928 88395 86515 85396 85352 85674 85562 84920 84224 84021 84553 85569 86513 87140 87811
64421 87811 88883 90106 91061 91992 93513 95589 97488 98804 99871 101021 102078 102880 103683 104614 105193 104894
64405 104894 103897 102868 102173 101699 101263 100817 100276 99491 98459 97372 96365 95288 93820 91910 90125 89312
64389 89312 89724 90616 91008 90735 90398 90408 90579 90699 90930 91326 91412 90699 89411 88335 87959 88035 87965 87483 86892 86718
64369 86718 87122 87694 87860 87460 86820 86376 86424 87102 88281 89470 90092 89959 89387 88876 88786 89106 89292 88647 87277
64350 87277 86385 86999 88562 89530 89311 88708 88359 87790 86564 85447 85493 86533 87513 88095 89024 90813 92834
64333 92834 94021 94061 93670 93861 95025 96609 97704 98047 98300 99187 100563 101639 101959 101857 101976 102652 103738
64316 103738 104838 105700 106429 107254 108078 108527 108534 108544 108933 109566 110125 110509 110572 109947 108674 107644 107771 108845 109870
64297 109870 110447 111161 112556 114423 116329 118241 120181 121759 122581 122955 123666 125021 126473 127393 127988 129159
64281 129159 131446 134441 137451 140444 143862 147615 150928 153365 155382 157453 159239 160213 160618 161078 161491
64266 161491 161148 159868 158197 156435 154261 151590 149071 147291 145979 144453 142496 140401 138475 136852
64252 136852 135583 134551 133448 132090 130623 129247 127954 126754 125914 125712 126114 126968 128339 130336 132697
64237 132697 134865 136542 137959 139596 141759 144451 147502 150728 153982 157114 160046 162929 166087 169593
64223 169593 173064 176114 178920 181877 184658 186083 185246 182507 179061 175731 172468 168907 165040 161233
64209 161233 157796 154701 151782 149145 147247 146361 146142 145990 145840 146220 147431 149090 150685 152201 153827
64194 153827 155357 156385 157024 157910 159424 161256 162941 164485 166176 167914 169111 169327 168814 168243 167947 167677
64178 167677 167142 166501 166151 166178 166328 166427 166505 166523 166315 165933 165745 166048 166784 167783 168993 170310 171503 172547 173815
64159 173815 175594 177581 179252 180662 182512 185397 189317 194038 199588 206131 213566 221596 230212 239772
64145 239772 250414 261611 272652 283580 295233 308180 321916 335375 347967 359597 369837
64134 369837 377745 382694 384867 384655 382012 376816 369518 360961 351684 341813 331584 321475 311692 301851
64120 301851 291433 280528 270035 261019 253846 247971 242686 238053 234849 233551 233619 233968 233978 233887 234399
64105 234399 236031 238721 241857 244806 247483 250278 253442 256967 261165 266758 273946 281782 289096 295874
64091 295874 303180 311804 321562 331883 342415 352905 363040 372662 381767 390054 396863 401822 405164
64078 405164 407155 407467 405498 401068 394500 386220 376746 366985 358079 350659 344365 338242 331569 324368
64064 324368 317284 311071 306141 302458 299757 297844 296684 296291 296553 297261 298350 300079 302760 306244 309902
64049 309902 313383 317275 322748 330481 340124 350780 361725 372616 383346 394027 405026 416822
64037 416822 429705 443561 457820 471630 484268 495538 505723 515109 523641 531080 537284 542205
64025 542205 545757 547909 548899 549222 549438 550165 552217 556428 563071 571483 580581 589919 600024 611425 623485
64010 623485 634578 643530 650501 656214 660740 663523 664463 664362 664211 664457 665211 666740 669366 673022 677313
63995 677313 682083 687739 694943 704114 715291 728395 743511 760839 780467 802382 826751 853945
63983 853945 884073 916672 951251 988115 1028260 1072395 1120379 1171768 1226548 1285093 1347682
63972 1347682 1414552 1486303 1563951 1648520 1740868 1842025 1953593 2077811 2217376 2375309
63962 2375309 2555032 2760581 2996779 3269190 3583891 3947305 4366033 4846406 5393832
63953 5393832 6012434 6705022 7472636 8313410 9221767 10189052 11205051 12258647 13336896
63944 13336896 14423582 15498687 16539040 17519593 18414887 19200741 19856111 20364784 20716196
63935 20716196 20904889 20928877 20788128 20484320 20021934 19409776 18661962 17797957 16841486
63926 16841486 15818399 14754203 13672267 12593051 11533880 10508935 9529726 8606016
63918 8606016 7746319 6957317 6242783 5603185 5036202 4537472 4101170 3720678 3389432
63909 3389432 3101428 2851202 2633624 2443893 2277654 2131105 2001150 1885448 1782051
63900 1782051 1688945 1604217 1526670 1455827 1391010 1330826 1273987 1220329 1170392 1124037 1080035
63889 1080035 1037061 994572 952659 911670 872144 834487 798307 762561 726866 692340 660640
63878 660640 632414 607108 583931 562416 542221 523122 505293 489068 474300 460429 447223
63867 447223 434979 423856 413527 403708 394650 386722 379800 373361 367070 361079 355895 352021 349538
63854 349538 347930 346565 345442 345192 346284 348583 351792 355834 360487 365030 368760 371634 373996 375805
63840 375805 376560 375890 373813 370366 365361 358582 350078 340235 329770 319541 310079 301224 292387 283181
63826 283181 273732 264521 256120 248945 242899 237294 231363 224934 218425 212297 206804 202204 198746 196248
63812 196248 193990 191313 188239 185356 183178 181650 180170 178052 175082 171734 168796 166779 165698 165219
63798 165219 164795 163842 162186 160400 159315 159112 159182 159000 158695 158562 158393 157719 156446 154886 153300 151824 150648
63781 150648 149814 148868 147185 144712 142061 139839 138223 137202 136704 136307 135340 133648 131918 130923 130712 130913
63765 130913 131439 132290 132894 132408 130804 129123 128391 128760 129899 131687 134050 136434 138049 138615 138537 138384 138461
63748 138461 138823 139400 140084 140921 142151 143850 145608 146876 147660 148654 150636 153913 158274 163168 167999 172600
63732 172600 177554 183718 191360 200043 209419 219661 230928 242855 254975 267270 279768 291822
63720 291822 302361 310857 317515 322441 325156 325200 322814 318619 312922 305725 297303 288317 279256 270130
63706 270130 260878 251840 243550 236197 229512 223157 217041 211300 206144 201738 198015 194525 190709 186442
63692 186442 182201 178604 175940 174201 173301 173072 173229 173644 174528 176145 178512 181630 185806 191283 197671
63677 197671 204204 210697 217839 226462 236858 248875 262157 275985 289229 300919 310815 319227 326318
63664 326318 331698 334548 334027 329765 322178 312194 300652 288123 275324 263248 252602 243256 234548
63651 234548 226048 217874 210398 203816 197975 192572 187595 183507 180796 179450 179146 179795 181403 183455 185143
63636 185143 186361 187796 189789 191869 193809 196277 199768 203639 207197 211193 217108 225200 234332 243650
63622 243650 253317 263534 273963 284572 296134 309391 324336 340757 358878 378972 400724 423359
63610 423359 446078 468202 489347 509595 528847 545779 558277 565439 568511 569272 568191 564968 560209
63597 560209 555397 551342 547718 544148 540743 537265 532639 525844 516846 506220 494276 480980 466458
63584 466458 451114 435397 419829 405151 392043 380656 370607 361424 352821 344589 336558 328793
63572 328793 321649 315492 310469 306629 304094 302927 302914 303724 305274 307838 311836 317750 326127 337248 350613
63557 350613 365070 379810 395145 412147 431606 453428 476820 500877 525186 550062 575923
63546 575923 602192 627070 648687 666269 679967 690092 697202 702584 707742 713310 719154 725498 733133
63533 733133 742213 751525 759318 764336 765754 762735 754577 740961 721767 697092 667825 635755 602657
63520 602657 569520 536862 505317 475462 447527 421678 398259 377322 358454 341572 327366
63509 327366 316256 307326 299094 291059 283718 277314 271570 266636 263270 261695 261010 260165 259046 258260 258309
63494 258309 259416 261803 265684 270998 277365 284392 292028 300684 310893 322680 335421 348488 361827
63481 361827 375589 389480 402959 415856 428196 439445 448567 454911 458436 459027 456244 450038 441135
63468 441135 430322 417868 403996 389488 375252 361585 348397 336054 325487 317321 311162 305893
63456 305893 300623 295337 290640 286941 284032 281501 279297 277552 276109 274705 273606 273576 275120 278148 282414
63441 282414 287754 293753 299753 305573 311890 319587 328985 339925 352252 365965 381200 398249 417252
63428 417252 437646 458408 479225 501056 525080 551359 578972 607184 635934 665295 694907
63417 694907 723947 751319 775919 796925 813729 825471 831101 830313 824246 814861 803869 792542
63405 792542 782059 773154 765424 757610 748665 738115 725492 710039 691176 668862 643527 616141
63393 616141 588299 561525 536274 512136 489142 468213 449987 433944 419261 406057 395131
63382 395131 386807 380710 376561 374496 374533 376215 379053 382964 388155 394736 402577 411406 421088 431970
63368 431970 444859 460384 478335 497895 518565 540605 564510 590350 617788 646437 675787
63357 675787 704879 732429 757348 779007 796917 810462 819174 823180 823161 819858 813855 805809 796669
63344 796669 787383 778447 769856 761388 752718 743219 731906 717820 700587 680633 658929 636479 613938
63331 613938 591554 569383 547522 526174 505562 485879 467251 449716 433311 418270 405002
63320 405002 393666 383797 374735 366555 360279 356824 355729 355252 353874 351604 349677 349108 349745 350733 351600
63305 351600 352597 354064 355765 357033 357360 356627 354890 352278 349165 346206 343992 342703 342118 341867 341646 341402
63289 341402 341408 342072 343446 344984 345920 345951 345489 345247 345597 346354 347132 347809 348506 349136 349266 348678 347907 347800 348540
63270 348540 349513 350230 350871 351633 352099 351856 351445 351957 353653 355618 356969 357820 358811 360209 361848 363583 365306
63253 365306 366857 368422 370841 374978 380746 387191 393546 399868 406615 414038 422145 430948 440481 450743
63239 450743 461744 473493 485992 499473 514574 531892 551216 571576 592314 613826 637006
63228 637006 662209 689027 716841 745198 773692 801814 829036 854931 879320 902441 924912
63217 924912 947347 970067 993228 1016946 1041026 1064760 1087276 1107889 1125770 1139557 1147863 1150221
63205 1150221 1147007 1138362 1123753 1102836 1076321 1045648 1012172 976964 941081 905492 870825 837557
63193 837557 806471 778594 754715 735184 720130 709509 702881 699508 698912 701126 706179 713557 722569
63180 722569 733280 746614 763199 782289 802265 822200 842504 863824 885737 907054 927229
63169 927229 946928 967062 987669 1007882 1026639 1043142 1056862 1067463 1074641 1077961 1076936 1071410
63157 1071410 1061685 1048095 1030638 1009227 984206 956372 926630 895872 865126 835470 807606
63146 807606 781660 757468 735021 714550 696221 679840 664979 651494 639831 630547 623450 617470
63134 617470 611646 606088 601751 599250 598112 597282 596273 595746 596877 600089 604501 608775 612370 615686 619109
63119 619109 622462 625585 628823 632452 636041 639056 641849 645328 649645 653950 657600 660958 664587 668218
63105 668218 671096 673119 675032 677507 680475 683453 686127 688338 689756 690025 689312 688477 688431 689345 690633 691662
63089 691662 692249 692472 692345 691930 691580 691755 692626 694036 695770 697705 699852 702592 706714 712793 720446 728548
63073 728548 736386 744366 753485 764309 776627 789858 803612 817977 833426 850403 868873 888371
63061 888371 908518 929449 951690 975692 1001531 1029000 1058007 1088909 1122307 1158378 1196588
63050 1196588 1236343 1277709 1321163 1366703 1413765 1462039 1511829 1563362 1616152 1669352 1722415
63039 1722415 1775139 1827374 1879072 1930410 1981610 2032775 2084098 2135940 2188382 2240864 2292458
63028 2292458 2342159 2388595 2429819 2463845 2489177 2504376 2507564 2497277 2473856 2439267 2395319
63017 2395319 2342606 2281425 2213085 2139896 2064293 1988463 1914501 1844336 1779416 1720696 1668857
63006 1668857 1624336 1587259 1557604 1535347 1520277 1511787 1509194 1512196 1520733 1534338 1551844 1571848
62994 1571848 1593390 1616255 1640793 1667448 1696201 1726343 1756899 1787342 1817792 1848423 1878753
62983 1878753 1907610 1933710 1956113 1974120 1986890 1993329 1992429 1983611 1966656 1941357 1907433 1864939
62971 1864939 1814693 1758223 1697300 1633565 1568444 1503143 1438586 1375457 1314415 1256249 1201782
62960 1201782 1151643 1106063 1064824 1027420 993392 962598 935107 910790 889132 869538 851759
62949 851759 835845 821696 808827 796709 785271 774888 765807 757644 749569 741057 732348 724037 716279
62936 716279 708588 700448 691870 683178 674471 665635 656846 648679 641605 635558 630091 624723 619050 612798
62922 612798 606099 599628 594204 590210 587450 585471 583877 582426 581100 580084 579526 579241 578733 577516 575381
62907 575381 572459 569194 566128 563560 561371 559337 557533 556284 555790 555992 556736 557801 558746 559067 558634 557791
62891 557791 556920 556032 554858 553223 551257 549340 547793 546494 544802 542115 538531 534764 531439 528774 526903
62876 526903 526093 526340 527092 527648 527715 527418 526951 526413 525779 524859 523444 521655 519891 518275 516454 514226 512077
62859 512077 510676 510039 509601 508989 508296 507632 506891 506066 505426 505204 505289 505318 504954 504117 503093 502344 502006 501721 501190
62840 501190 500711 500775 501236 501410 500990 500380 499962 499502 498544 497071 495585 494740 494993 496215 497505 497773 496805 495439
62822 495439 494438 493594 492279 490558 489236 488940 489497 490150 490070 488886 487138 486071 486520 488018 489401 490227
62806 490227 491120 492709 494814 496990 499415 502829 507797 514351 522211 531013 540378 550075 560173 570885
62792 570885 582255 594216 607008 621305 637770 656545 677372 700122 725010 752273 781924
62781 781924 814091 849493 889268 934222 984444 1039710 1100026 1165585 1236344 1311903 1391809
62770 1391809 1475813 1563847 1655705 1750553 1846571 1941174 2031751 2116104 2192034 2256843 2307739
62759 2307739 2342756 2361040 2362332 2346693 2314785 2267961 2207814 2135993 2054638 1966543 1874445
62748 1874445 1780286 1685468 1591507 1499947 1411797 1327588 1248028 1174043 1106067 1043714 986428
62737 986428 934074 886597 843437 803757 767204 734024 704375 677837 653745 631823 612290
62726 612290 595381 580889 568098 556175 544708 534047 525060 518370 513662 509854 506151 502887 501145
62713 501145 501469 503262 505581 508257 511946 517238 524215 532842 543328 555933 570741 587828 607306
62700 607306 629092 653032 679533 709640 744058 782425 824061 869110 918295 971742 1028832
62689 1028832 1089259 1153341 1220871 1290259 1359284 1426239 1489879 1548638 1600487 1643484 1676098
62678 1676098 1697220 1706274 1703235 1688263 1661525 1623750 1576674 1522416 1462471 1397737 1329384 1259181
62666 1259181 1189006 1120512 1055173 993989 936952 883390 833089 786694 744817 707284 673474
62655 673474 642849 614759 588280 562914 539251 518378 500653 485376 471553 458585 446337
62644 446337 434976 424733 415516 406757 397895 388916 380124 371565 363118 355063 348046 342325 337491 333102
62630 333102 329208 326004 323330 320840 318509 316583 315089 313667 311991 310215 308902 308447 308645 308884 308838
62615 308838 308806 309225 310067 311021 312164 313998 316742 320092 323873 328510 334488 341625 349325 357369 366071
62600 366071 375788 386727 399208 413641 430089 448293 468345 491022 517163 546865 579580 614855
62588 614855 652671 693135 736171 781616 829333 878948 929505 979522 1027401 1071660 1110819
62577 1110819 1143306 1167755 1183437 1190242 1188279 1177680 1158860 1132727 1100399 1062904 1021424 977696
62565 977696 933643 890452 848299 807190 767722 730705 696339 664276 634458 607328 583081
62554 583081 561211 541118 522808 506546 492026 478381 465020 452009 439572 427688 416375
62543 416375 405893 396320 387282 378595 370922 365154 361120 357575 353672 349890 347165 345639 344813 344521
62529 344521 345005 346140 347398 348777 351112 355100 360492 366637 373446 381275 390109 399415 408796 418450
62515 418450 429055 441497 456618 474758 495508 518245 542923 570026 599768 631819 665876
62504 665876 701999 740116 779556 819236 857957 894321 926835 954511 977063 994119 1004542
62493 1004542 1007053 1001427 988656 970066 946672 919291 888692 855483 820228 783828 747582 712777
62481 712777 680342 650750 623897 599115 575815 554274 535488 520096 507719 497424 488481 480515
62469 480515 473312 466864 461454 457412 454763 453194 452307 451938 452345 454033 457134 460979 464650 468054 472136
62454 472136 477838 485148 493273 501450 509427 517497 526252 535965 546002 555230 563243 570768 578489 585868
62440 585868 591610 594944 595868 594432 590494 584206 576047 566179 554197 539811 523585 506869 491101
62427 491101 477069 464582 452864 441469 430737 421233 413071 406154 400782 397320 395311 393591 391518
62414 391518 389594 388691 389102 390608 393041 396413 400686 405755 411559 418081 425324 433323 442029 451175 460414
62399 460414 469516 478196 485910 492247 497457 502058 505910 508158 508225 506296 502740 497702 491545 485046 478730
62384 478730 472537 466600 461775 458742 456954 455192 452991 450975 449973 450427 452586 456668 462726 470780
62370 470780 481133 494218 510150 528743 549929 573882 600779 630800 664251 701350 741963
62359 741963 785867 833142 883873 937524 992967 1049003 1104441 1157801 1207468 1252097 1290450
62348 1290450 1320979 1342293 1354158 1357448 1353005 1341165 1322551 1298568 1270577 1239016 1203836 1165473
62336 1165473 1124938 1083228 1041219 1000019 960911 924758 891668 861275 833207 807265 783344
62325 783344 761317 741008 722252 704862 688532 672971 658335 645272 634254 625021 617071 610426
62313 610426 605382 601611 598317 595426 593790 593789 594355 594020 592468 590443 588447 586169 583117 579204 574688
62298 574688 569908 565143 560455 555660 550621 545447 540294 535246 530621 527032 524667 522844 520799 518724
62284 518724 517461 517329 517900 518951 520989 524573 529625 535599 541943 548222 554280 560589 568148 577641 588862
62269 588862 601173 614363 628791 644770 662175 680831 701239 724720 752590 785089 821302
62258 821302 860216 901713 946425 994952 1047501 1103805 1162680 1221757 1278345 1330677 1377771
62247 1377771 1418041 1448883 1468152 1475567 1472193 1459038 1436816 1406740 1370700 1330438 1287006 1241180
62235 1241180 1194104 1147246 1101896 1058792 1018164 980104 944960 913380 885914 862623 843211
62224 843211 827444 815251 806356 799985 795063 790764 786899 783802 781828 780894 780465 779976 779246 778564 778394
62209 778394 778896 779657 780023 779861 779832 780678 782437 784790 788109 793544 801809 812280 823709 835616 848643
62194 848643 863716 881229 900998 922684 946133 971397 998472 1027061 1056774 1087533 1119453
62183 1119453 1152132 1184330 1214569 1241820 1265400 1284568 1298735 1307968 1312929 1314439 1313464 1311392
62171 1311392 1309799 1309796 1311916 1316712 1325099 1338016 1355910 1378547 1405011 1433872 1463729 1493727 1523328
62158 1523328 1551630 1577238 1598931 1616120 1628662 1636698 1640842 1642090 1641120 1637942 1632454 1625023 1616167
62145 1616167 1606037 1594742 1583087 1572396 1563549 1556569 1551256 1547824 1546737 1548195 1552006 1557736 1564773
62132 1564773 1572386 1580003 1587504 1595209 1603617 1613152 1623996 1636028 1649048 1663170 1678887 1696653
62120 1696653 1716483 1738075 1761157 1785495 1810708 1836406 1862554 1889377 1916812 1944277 1971214
62109 1971214 1997607 2023798 2049917 2075804 2101368 2126818 2152532 2178885 2206108 2234136 2262740
62098 2262740 2292092 2323097 2356784 2393365 2432231 2472876 2515424 2560153 2606909 2655151 2704079
62087 2704079 2752544 2799439 2844764 2890026 2937117 2986986 3039724 3095351 3153599 3213019 3271283
62076 3271283 3326796 3379554 3430211 3478923 3525489 3570147 3613623 3656496 3698930 3740924 3782401
62065 3782401 3822948 3861723 3897855 3930910 3960918 3987863 4011203 4030018 4043708 4052354 4056185 4055029
62053 4055029 4048707 4037805 4023440 4006145 3985517 3961133 3933231 3902239 3868299 3831908 3794573
62042 3794573 3758007 3722732 3688139 3653998 3621314 3591498 3565152 3541961 3521420 3503310 3487659
62031 3487659 3474566 3464106 3456190 3450423 3446157 3442776 3439963 3437642 3435520 3432757 3428394 3422276 3415359
62018 3415359 3408784 3402781 3396699 3389914 3382317 3373972 3364843 3355075 3345179 3335651 3326645 3318234 3310728 3304433
62004 3304433 3299278 3295094 3292155 3290972 3291414 3292355 3292442 3290967 3287687 3281934 3272313 3257358 3236203 3208443
61990 3208443 3173680 3131624 3082673 3028199 2970206 2910785 2851722 2794228 2738865 2685859 2635573
61979 2635573 2588524 2544868 2504169 2465866 2429831 2396313 2365452 2337013 2310462 2285223 2261005
61968 2261005 2238052 2216852 2197400 2178946 2160779 2143071 2126602 2111776 2098312 2085790 2073980
61957 2073980 2062550 2051066 2039562 2028769 2019414 2011616 2005308 2000974 1999471 2001142 2005523 2012049 2020759
61944 2020759 2032225 2047004 2065338 2087169 2112253 2140208 2170590 2202963 2236966 2272349 2308958
61933 2308958 2346621 2385029 2423782 2462513 2500933 2538709 2575419 2610711 2644550 2677265 2709402
61922 2709402 2741645 2774962 2810800 2851053 2897807 2953185 3019377 3098678 3193296 3305218 3436341
61911 3436341 3588711 3764459 3965468 4193295 4449612 4736781 5057970 5416642 5815899
61902 5815899 6258172 6745403 7279247 7860584 8488209 9157131 9857086 10571414 11276378
61893 11276378 11941313 12530263 13005288 13331043 13480029 13437619 13205273 12800321 12252178
61884 12252178 11596808 10871636 10111840 9347716 8602954 7894196 7231947 6622104 6067218
61875 6067218 5567226 5120002 4721998 4368938 4056400 3780186 3536402 3321405 3131804
61866 3131804 2964691 2817789 2689254 2577328 2480350 2397124 2326994 2269379 2223387 2188100
61856 2188100 2163118 2148436 2143819 2148532 2161678 2182396 2209558 2241610 2277020 2314676 2353530 2392029
61844 2392029 2428183 2460168 2486603 2506332 2518357 2522244 2518512 2508578 2494377 2477987 2461383 2446379
61832 2446379 2434690 2427862 2426916 2432032 2442678 2457882 2476251 2495799 2514134 2528956 2538377 2540838
61820 2540838 2535090 2520420 2496908 2465440 2427504 2384851 2339015 2291132 2242365 2194505 2149899
61809 2149899 2110616 2077692 2051154 2030647 2016133 2008249 2008023 2016068 2032063 2055273 2085484 2123121
61797 2123121 2168454 2221151 2280836 2347685 2422166 2504530 2594949 2693992 2802540 2921334 3051095
61786 3051095 3193283 3350451 3525652 3721582 3940451 4184703 4457877 4764829 5111283
61777 5111283 5503281 5947090 6449436 7017553 7658937 8381040 9190791 10093543 11091695
61768 11091695 12183750 13363751 14619888 15931742 17267470 18582681 19821523 20919707
61760 20919707 21809766 22428964 22728812 22683642 22295635 21594748 20633268 19476582 18193357
61751 18193357 16847933 15495572 14179687 12930829 11767843 10700563 9732405 8861995
61743 8861995 8084398 7392460 6777955 6232369 5747720 5317313 4935630 4597371 4296933
61734 4296933 4029104 3789965 3576817 3387439 3219626 3071054 2939120 2821081 2714734
61725 2714734 2618801 2532251 2453419 2380261 2311313 2245753 2182585 2120498 2058760 1997652 1937681
61714 1937681 1878917 1821498 1766272 1714301 1666043 1621529 1581068 1545146 1513734 1486211 1461871
61703 1461871 1439998 1419627 1399969 1381146 1363815 1347936 1332554 1316974 1301415 1286152 1270741
61692 1270741 1254734 1238596 1223204 1208739 1194745 1180980 1167529 1154244 1140798 1127254 1113956
61681 1113956 1100830 1087458 1073915 1060921 1048978 1037829 1026970 1016219 1005666 995561 986418
61670 986418 978684 972013 965318 957915 950217 942975 936247 929595 923013 917122 912438 908788 905514 902199
61656 902199 899230 897678 898399 901237 905322 910139 915899 922853 930765 939246 948081 956939 965277 972933
61642 972933 980343 987767 994709 1000520 1005122 1008656 1010977 1012160 1013115 1014900 1017698 1021199 1025636 1031534
61628 1031534 1038614 1045984 1053398 1061259 1069178 1075562 1079098 1079678 1077379 1071449 1061164 1047024 1030243
61615 1030243 1011465 990908 969482 948720 929495 911554 894541 878843 865077 853210 842605
61604 842605 832716 823401 814697 806616 799186 792492 786631 781677 777656 774438 771729 769342 767537 766828
61590 766828 767305 768295 769013 769530 770784 773568 777815 783001 788915 795733 803633 812663 822839 833999 845758
61575 845758 857968 871155 886125 903213 922284 943335 966592 991985 1019001 1047155 1076181
61564 1076181 1105709 1135226 1164553 1193968 1223652 1253362 1282767 1311730 1340092 1367558 1393940
61553 1393940 1419153 1442843 1464504 1484170 1502487 1519767 1535445 1548762 1559507 1567621 1572596 1573869
61541 1573869 1571516 1565970 1557284 1545233 1530005 1512245 1492511 1471226 1449157 1427452 1407134 1388827
61529 1388827 1372934 1359726 1349243 1341469 1336576 1334828 1336333 1341187 1349705 1362209 1378785 1399703
61517 1399703 1425867 1458396 1497874 1544454 1598550 1660892 1732070 1812689 1903939 2007330 2123802
61506 2123802 2253789 2398287 2559115 2737741 2934376 3148462 3379240 3625118 3882740
61497 3882740 4146970 4411331 4667848 4906917 5118211 5292195 5421155 5499790 5525969 5501211
61487 5501211 5430032 5318694 5174516 5005592 4820047 4625043 4426672 4230613 4042125 3865023
61477 3865023 3701018 3550515 3413977 3292379 3186627 3096877 3022470 2962376 2915748 2882179
61467 2882179 2861452 2853005 2855702 2868231 2889685 2919669 2957825 3003292 3054612 3110110 3168327 3228183
61455 3228183 3288829 3349501 3409516 3468355 3525726 3581570 3635989 3689110 3741056 3792123 3842964
61444 3842964 3894415 3947044 4000866 4055427 4109918 4163111 4213468 4259620 4300790 4336719 4367303
61433 4367303 4392456 4412175 4426432 4434869 4436767 4431454 4418822 4399461 4374350 4344339 4309803 4270825
61421 4270825 4227808 4181978 4135248 4089519 4046083 4005599 3968567 3935746 3908047 3885896 3868783
61410 3868783 3855588 3845425 3838066 3833430 3830819 3828739 3825371 3819116 3808924 3794437 3775916 3753944
61398 3753944 3729275 3703049 3676971 3653008 3632911 3618143 3610182 3610727 3621732 3645486 3684421 3740413
61386 3740413 3814260 3906340 4017835 4150855 4307124 4486917 4689449 4913685 5158159 5420266
61376 5420266 5696304 5982018 6272252 6559754 6834779 7086469 7304817 7481685 7610831
61367 7610831 7687974 7711396 7682501 7605641 7487074 7333533 7151106 6944889 6719254 6478370
61357 6478370 6226695 5969172 5710857 5456125 5208207 4969568 4742462 4528742 4329247
61348 4329247 4143924 3972707 3815847 3673216 3543757 3426185 3320057 3225737 3143406 3072579
61338 3072579 3012614 2963226 2924229 2895097 2875173 2864265 2862694 2870527 2886928 2910480 2940153 2975706
61326 2975706 3016971 3062957 3111939 3162308 3212926 3262748 3310709 3356264 3399512 3440300 3477532
61315 3477532 3509993 3537714 3561979 3583969 3603947 3621827 3637862 3652274 3664472 3673057 3676650 3674626
61303 3674626 3667147 3654595 3636922 3613590 3584275 3549551 3510513 3467742 3421051 3370446 3316921
61292 3316921 3261949 3206412 3150497 3094622 3040107 2988766 2941895 2899670 2861493 2826931 2796335
61281 2796335 2770497 2749790 2733812 2721736 2712715 2705893 2700471 2695923 2691854 2687444 2681394 2672863 2662313
61268 2662313 2651146 2640653 2631626 2624780 2621048 2621296 2625922 2634737 2647120 2662408 2680423 2701609 2726513
61255 2726513 2755318 2788289 2826672 2872756 2928787 2995877 3073940 3162506 3261337 3370055 3487001
61244 3487001 3608444 3729129 3843606 3946756 4033040 4096004 4129300 4128348 4091115 4018086 3912473
61233 3912473 3780317 3629256 3466456 3297610 3127594 2961112 2802228 2653606 2516554
61224 2516554 2391520 2278344 2176409 2084978 2003407 1930948 1866701 1809943 1760288 1717307 1680231
61213 1680231 1648183 1620471 1596546 1576051 1559169 1546564 1538606 1534876 1534688 1537858 1544569 1554752
61201 1554752 1568043 1584234 1603303 1624952 1648465 1672964 1697481 1720768 1741467 1758671 1772160
61190 1772160 1782031 1788317 1791034 1790423 1786937 1780983 1772701 1761956 1748644 1732977 1715372 1696022 1674788
61177 1674788 1651715 1627356 1602322 1576628 1549831 1521744 1492651 1462787 1431957 1399807 1366354
61166 1366354 1332143 1297999 1264589 1232036 1199945 1167957 1136294 1105638 1076533 1049145 1023525
61155 1023525 999823 978163 958478 940499 923765 907682 891797 875992 860164 843818 826355
61144 826355 807823 788978 770527 752691 735747 720544 708026 698372 690891 684738 679561 675621
61132 675621 673488 673511 675475 678903 683761 690516 699300 709410 720022 731026 742673 754720 766684
61119 766684 778772 791734 805564 819171 831723 843714 856113 868890 881080 892076 902204
61108 902204 912024 921613 930593 938408 944416 948035 949056 947607 943813 937772 930006 921586 913563 906391
61094 906391 899993 894060 888047 881127 872617 862536 851546 840315 828992 817260 804707 791130
61082 791130 776651 761644 746491 731405 716574 702478 689921 679550 671267 664244 657649 651401
61070 651401 646049 641966 638969 636830 635730 635785 636431 636929 637380 638560 640625 642721 644186 645496 647467
61055 647467 650093 652811 655413 657941 659953 660884 661108 661829 663680 666154 668557 670875 673393 676134 679076
61040 679076 682494 686708 691881 698282 706253 715534 725220 734872 745267 757434 771343 786131 801348
61027 801348 817241 833941 851088 868285 885361 902103 918259 933873 949093 963557 976564
61016 976564 988085 999108 1010708 1023132 1036092 1049618 1064221 1080493 1098923 1120031 1144373
61005 1144373 1172432 1204626 1241318 1282642 1328376 1378103 1431433 1488139 1548397 1613153 1684029
60994 1684029 1762707 1850616 1949436 2061452 2188817 2332532 2492866 2671302 2872157 3102682
60984 3102682 3372425 3692989 4078000 4542659 5103158 5776635 6581572 7538198 8669000
60975 8669000 9999386 11557357 13370422 15457558 17812257 20373734 22995880 25442846
60967 25442846 27441031 28780867 29412073 29466525 29194107 28860449 28666313 28704929 28938668
60958 28938668 29192346 29191961 28664111 27454503 25591283 23255445 20690768 18118804 15697911
60949 15697911 13520578 11625793 10013621 8660624 7534162 6601077 5830247 5193228
60941 5193228 4665511 4226986 3860572 3551056 3285709 3055096 2852220 2671099 2506812
60932 2506812 2356466 2218991 2093711 1979544 1875461 1780961 1695688 1618864 1549076 1484276
60922 1484276 1422093 1360789 1300196 1241418 1185504 1132773 1083319 1037539 995788 957942 923623
60911 923623 892624 864888 840377 819107 800961 785288 771112 758002 746369 736630 728530 721633
60899 721633 716047 712047 709299 707021 704924 703493 703389 704844 707579 711006 714631 718527 723163 728396
60885 728396 733002 735777 736935 737763 738895 739519 738305 734479 727929 718971 708385 697208 686067 674946
60871 674946 663740 652675 642027 631912 622637 614746 608363 602908 597970 594091 592141 592109 593129 594610
60857 594610 596813 600250 605028 610946 617884 625889 635026 645294 656616 668988 682732 698420 716208
60844 716208 735326 754606 773606 792910 813183 834171 854702 873406 889285 901887 911309 918092
60832 918092 922973 926604 929398 931415 932368 931911 930075 927290 923900 919715 914205 907131 898885 890178 881392
60817 881392 872305 862502 851965 841103 830155 818840 806795 794098 781115 768033 754996 742617
60805 742617 731787 722806 715055 707723 700526 693632 687352 682203 678870 677591 677746 678492 679758 682223
60791 682223 686381 692017 698708 706480 715738 726674 738933 751937 765464 779771 795007 810658
60779 810658 825870 840323 854397 868397 882015 894831 906914 918576 929790 940281 949968 958953
60767 958953 967281 975071 982624 989983 996642 1002133 1006558 1009990 1011831 1011579 1009957 1008223 1006468 1003713
60753 1003713 999798 995876 992579 988967 984148 978979 974960 972058 968784 964209 958873 953682 948685 943053
60739 943053 935752 926318 915493 904945 895798 887592 879249 870819 863477 857943 853741 850128 846966 844443
60725 844443 842625 841582 841365 841607 841684 841512 841633 842225 842611 842167 841263 840794 841125 841878 842598 843251 844169 845672
60707 845672 847593 849120 849489 848875 848135 847467 845959 842822 838535 834136 829785 824681 818197 810431 801736
60692 801736 792263 782030 770957 758809 745579 731951 718938 706962 695610 684379 673265 662535
60680 662535 652357 642879 634301 626589 619384 612575 606757 602698 600357 598811 597356 596413 597088 599859
60666 599859 604025 608453 612655 616918 621612 626752 632205 637985 644105 650340 656328 661837 666862 671577
60652 671577 676301 681383 686935 692694 698253 703500 708833 715000 722548 731181 739761 747302 754044 761223
60638 761223 769690 779099 788651 798171 808120 818902 830665 843558 857609 872310 886767 900371
60626 900371 913033 924735 935224 944241 951717 957566 961449 962929 961809 958266 952750 945717 937366
60613 937366 927671 916830 905545 894611 884273 874324 864871 856697 850660 847018 845490 845759 847581
60600 847581 850453 853464 855563 855918 854059 849949 844040 837150 830017 822940 816036 809822 805236 802814
60586 802814 802072 802033 802300 803242 805270 808475 812976 818918 825795 832374 837821 842484 847012 851160 854222
60571 854222 856346 858483 860963 863011 863933 864009 863745 862845 860543 856639 851624 845933 839589 832580 825144
60556 825144 817501 809545 801036 792139 783653 776535 771201 767451 765207 764998 767344 771935 778026 785611
60542 785611 795566 808519 824266 842633 864284 890130 920408 954939 993888 1037497 1085078 1134877
60530 1134877 1184818 1232762 1275958 1311002 1334795 1345494 1342618 1326853 1300136 1265570 1226785
60519 1226785 1187214 1149807 1116893 1089860 1069100 1054481 1045789 1042528 1043507 1047090 1051975 1057663 1064145
60506 1064145 1071347 1078937 1086615 1094568 1103702 1115422 1131058 1151465 1177071 1208182 1245167 1288540
60494 1288540 1339156 1398282 1467189 1546478 1635934 1735243 1844773 1965529 2098374 2243576
60484 2243576 2401454 2573690 2764090 2977946 3220333 3494517 3801328 4138957 4502021
60475 4502021 4879646 5254046 5601366 5895002 6109912 6226381 6232706 6126809 5916556 5618555
60465 5618555 5255493 4852552 4433720 4019095 3623835 3258316 2928445 2635934 2379269
60456 2379269 2155497 1961534 1794122 1649445 1523752 1414437 1319925 1238454 1167635 1105523
60446 1105523 1051539 1005759 967555 935425 907942 884225 863439 844433 826310 809041 793076
60435 793076 778328 763840 748593 732478 716333 701171 687581 675782 665840 657507 650056 642690
60423 642690 635260 628412 622997 619416 617505 616738 616478 616266 616051 616033 616237 616510 616930 617900 619578 621537 623270
60406 623270 624804 626483 628362 630300 632534 635637 639741 644229 648379 652064 655654 659534 663956 669058
60392 669058 674717 680490 685989 691218 696336 701169 705270 708438 710932 713058 714710 715380 714475 711632 707024
60377 707024 701530 696395 692358 689073 685635 681733 678052 675410 673741 672282 670686 669519 669483 670489 671876
60362 671876 673351 675228 677686 680252 682358 684170 686477 689826 694067 698721 703460 708167 712884 717946
60348 717946 723943 731242 739558 748208 756715 765049 773361 781681 789875 797605 804282 809311 812527 814315
60334 814315 815247 815692 815813 815668 815171 814098 812401 810550 809359 809471 811036 813817 817444 821486 825387 828416
60318 828416 829781 828942 825914 821245 815645 809702 803942 798890 794807 791419 788126 784539 780710 776889
60304 776889 773214 769681 766286 763208 760897 759855 760176 761323 762604 763820 765296 767337 769930 772988
60290 772988 776531 780483 784478 788030 790839 792940 794796 797210 800813 805465 810400 815067 819583 824259
60276 824259 829111 834081 839322 844806 849986 854390 858423 862958 868190 873533 878817 884955 893016 903078
60262 903078 914474 926911 940859 956887 975135 995497 1018014 1042879 1070280 1100475 1134025
60251 1134025 1171757 1214354 1261894 1313911 1370119 1431155 1498402 1572999 1655152 1744514 1840943
60240 1840943 1944528 2055053 2171783 2293725 2419636 2547686 2675507 2800788 2921622
60231 2921622 3036201 3142521 3238579 3322578 3392788 3447654 3486451 3509535 3517547 3510711 3489472
60220 3489472 3455583 3411852 3360848 3304577 3245459 3186766 3131589 3081895 3039056 3004791 2981031
60209 2981031 2969206 2970249 2985025 3014180 3057737 3115474 3187605 3274441 3375218 3487773 3609448
60198 3609448 3737838 3870542 4004647 4136780 4263353 4380562 4484538 4571964 4640608 4689285
60188 4689285 4717481 4725053 4712020 4678558 4625478 4554793 4469492 4372675 4267310 4156981 4046345
60177 4046345 3940242 3842364 3755013 3679813 3618289 3571934 3542167 3530204 3536511 3560324 3600000
60166 3600000 3653927 3720750 3798674 3884885 3975982 4068760 4160345 4247612 4326880 4394456 4447618
60155 4447618 4485120 4506921 4513628 4506245 4486205 4455362 4415935 4370678 4323096 4277165 4236631 4204623
60143 4204623 4183940 4177315 4187079 4214710 4261014 4326762 4412963 4520637 4650685 4804066 4981925
60132 4981925 5185475 5415941 5674615 5962594 6279971 6625159 6995027 7385673 7792833
60123 7792833 8211477 8635196 9056324 9466704 9858282 10223115 10553450 10842357 11084293
60114 11084293 11274791 11409748 11485485 11499700 11452088 11343939 11177484 10955955 10684222 10369227
60104 10369227 10019955 9646992 9261709 8875190 8497401 8136852 7800556 7494120 7222046
60095 7222046 6988062 6794903 6643735 6534120 6464857 6434614 6441566 6482790 6554406 6652138 6771197
60084 6771197 6905613 7048087 7190738 7326083 7447556 7549665 7627996 7679244 7701373 7693905
60074 7693905 7657898 7595376 7508692 7400309 7272765 7128444 6969452 6798043 6617144 6430119
60064 6430119 6239980 6049002 5859243 5673318 5494622 5326707 5172233 5032362 4907404
60055 4907404 4798242 4706865 4635250 4584028 4552704 4540982 4549255 4577782 4626035 4693092 4778160
60044 4778160 4880154 4996918 5125182 5261234 5401359 5541605 5677294 5802997 5913207
60035 5913207 6003303 6070003 6111080 6124922 6110633 6068440 5999739 5906715 5792097 5659168 5511663
60024 5511663 5353534 5188969 5022637 4859530 4704221 4560124 4429428 4313612 4213961 4131603
60014 4131603 4067078 4020089 3990108 3977424 3983332 4009068 4054934 4120824 4207204 4314867 4443741
60003 4443741 4592457 4759044 4941345 5136509 5340544 5548527 5754814 5952960 6136158
59994 6136158 6298446 6435492 6544224 6622259 6668091 6681469 6663008 6613518 6534018 6426396
59984 6426396 6293927 6141265 5974093 5798475 5620181 5444578 5276947 5122315 4984507
59975 4984507 4865674 4767125 4690411 4637181 4608141 4602664 4619407 4656966 4713925 4788646 4879139
59964 4879139 4982933 5097062 5218376 5343811 5470201 5593965 5711476 5819870 5917310 6002458
59954 6002458 6074005 6130934 6173105 6201438 6217646 6223862 6222492 6216312 6208632 6203306 6204543 6216754
59942 6216754 6244519 6292444 6364880 6465904 6599543 6769621 6979001 7229101 7520364 7852790
59932 7852790 8225382 8635084 9076649 9543222 10025987 10512689 10987171 11431102 11826377
59923 11826377 12156178 12405232 12560912 12615115 12565300 12414380 12170566 11847168 11461111 11030154
59913 11030154 10570938 10099023 9629232 9174492 8744260 8344718 7980376 7654782 7369913
59904 7369913 7126201 6923885 6763765 6646180 6569913 6532936 6533907 6572207 6646670 6754951 6893969
59893 6893969 7060135 7248925 7454713 7671061 7890495 8103827 8300368 8469404 8601319
59884 8601319 8687487 8720148 8693579 8605667 8458216 8256093 8006426 7718189 7401549 7066858
59874 7066858 6723892 6381497 6047188 5726679 5423816 5141007 4879734 4640895 4425041
59865 4425041 4232464 4063003 3915837 3789612 3682754 3593540 3519924 3459538 3409950 3368844
59855 3368844 3333905 3302656 3272629 3241893 3209616 3176142 3142430 3109363 3077628 3048147 3022263
59844 3022263 3001239 2985592 2974946 2968282 2964096 2960340 2954512 2944012 2926609 2900859 2866442 2824218
59832 2824218 2775975 2724028 2670864 2618843 2569914 2525527 2486751 2454388 2428991 2410935 2400596
59821 2400596 2398243 2403523 2415099 2431112 2450307 2472790 2499676 2531988 2570032 2613840 2663839 2720538
59809 2720538 2783416 2850546 2919488 2988103 3054162 3114874 3167793 3212219 3248927 3278437 3300213
59798 3300213 3313705 3319411 3318567 3312542 3303081 3292646 3283875 3278984 3280081 3289565 3309533 3341090 3384926
59785 3384926 3442523 3516273 3608617 3721720 3857969 4020141 4210908 4432647 4687741 4978374
59775 4978374 5305453 5667667 6061336 6480254 6914596 7349193 7762536 8127840 8416695
59766 8416695 8604552 8676006 8627920 8469649 8220680 7906390 7553169 7184721 6820498 6475294
59756 6475294 6158898 5876235 5628873 5416930 5239656 5094892 4979293 4889753 4824338 4781762
59746 4781762 4760550 4759156 4776507 4812043 4865388 4936316 5024817 5130999 5255086 5397709 5560009
59735 5560009 5743259 5948641 6177688 6432700 6716347 7030886 7378006 7759407 8177262
59726 8177262 8634019 9131747 9671472 10252726 10873410 11529827 12216582 12926258 13649240
59717 13649240 14374156 15088806 15781280 16441251 17061595 17639970 18179435 18687647 19175259
59708 19175259 19654611 20138935 20641129 21171516 21735592 22333251 22959431 23604669 24254886
59699 24254886 24891542 25493156 26037459 26503119 26871299 27127787 27265090 27283263 27189428 26996942
59689 26996942 26724411 26394075 26029858 25655810 25294997 24968267 24693403 24485421 24357412
59680 24357412 24320505 24383131 24551270 24829875 25223601 25735817 26367339 27116176 27977319 28941263
59670 28941263 29991964 31105884 32252105 33392317 34480772 35465658 36292660 36909842
59662 36909842 37272815 37349841 37126326 36607410 35817501 34797007 33597577 32276923 30893436
59653 30893436 29500786 28143532 26855051 25657765 24564007 23576141 22686349 21877353
59645 21877353 21124376 20397881 19667222 18905661 18095703 17232432 16323399 15385667 14441463
59636 14441463 13513576 12621587 11779934 10997866 10280149 9627713 9038439 8508411 8033126
59627 8033126 7608139 7229175 6892018 6592339 6325811 6088737 5878590 5693529 5531307
59618 5531307 5389039 5264241 5155595 5062280 4982784 4914724 4855635 4803501 4756409 4711920 4666904
59607 4666904 4618137 4563251 4501191 4431694 4354564 4269842 4178527 4082471 3983328 3882173 3780440
59596 3780440 3680593 3585191 3495648 3412463 3336419 3268799 3210399 3160954 3119791 3086691 3061877
59585 3061877 3045361 3036503 3034188 3037430 3045860 3059497 3077958 3100075 3124506 3150498 3177740 3205634
59573 3205634 3233215 3259923 3286108 3312490 3339283 3366146 3393106 3421509 3453907 3492892 3540006
59562 3540006 3595765 3660529 3735058 3820313 3917240 4026915 4150495 4288744 4441902 4610418
59552 4610418 4795638 4999423 5223099 5466813 5729548 6009408 6304161 6611805 6930397
59543 6930397 7256965 7586837 7914488 8234826 8543304 8835310 9106609 9354730 9579276
59534 9579276 9780513 9957975 10110524 10237175 10337588 10412545 10464940 10500432 10526644 10551361
59524 10551361 10581307 10622127 10678810 10755628 10855430 10978666 11122650 11281475 11446550 11607203
59514 11607203 11751054 11864515 11934030 11947886 11897666 11778686 11589645 11332217 11010964 10633329
59504 10633329 10209297 9750652 9269994 8779794 8291682 7815986 7361336 6934160 6538431
59495 6538431 6176172 5848522 5556165 5298618 5073544 4877510 4707610 4562140 4439877
59486 4439877 4339327 4258797 4196673 4151464 4122220 4109301 4114093 4137411 4178606 4236766 4312328
59475 4312328 4406798 4521208 4655725 4810643 4986720 5184232 5402325 5639553 5894416 6164839
59465 6164839 6447336 6736864 7027060 7310294 7577719 7819691 8026336 8188215 8297343
59456 8297343 8348236 8338161 8266667 8135545 7949547 7716531 7446175 7148224 6831641 6504662
59446 6504662 6174828 5848810 5532280 5229714 4944078 4676883 4428863 4200560 3992120
59437 3992120 3802861 3631448 3476567 3337248 3212689 3102003 3004064 2917438 2840706 2773143
59427 2773143 2714906 2666116 2625869 2592641 2565664 2545359 2532164 2525395 2523673 2526178 2532995 2544275
59415 2544275 2559502 2577775 2598619 2622310 2649497 2680575 2715212 2752091 2788926 2823047 2852549
59404 2852549 2877341 2899259 2921120 2945715 2975518 3012888 3059954 3118108 3187796 3268831 3360523
59393 3360523 3461395 3569368 3683246 3804509 3937504 4087736 4260075 4458402 4686169
59384 4686169 4946608 5242558 5576657 5951636 6369872 6832370 7338443 7886257 8472937
59375 8472937 9093467 9739567 10400017 11062078 11712582 12338331 12926815 13467828 13955091
59366 13955091 14386601 14763478 15088301 15364134 15594465 15783119 15933277 16046138 16120581
59357 16120581 16154160 16144170 16087730 15981530 15822508 15609457 15344273 15032111 14680752 14299568
59347 14299568 13898255 13485493 13067996 12650046 12233382 11817453 11400295 10979839 10554993
59338 10554993 10126045 9694536 9263045 8835182 8415606 8009583 7621918 7256024 6914006
59329 6914006 6597530 6308090 6046297 5811459 5602414 5418502 5259248 5123352 5008718
59320 5008718 4913577 4836973 4777963 4734845 4705531 4688347 4682137 4685844 4698236 4717854 4742870 4771050
59308 4771050 4800052 4827761 4852284 4871792 4884557 4889102 4884285 4869533 4845162 4812252 4771934 4725012
59296 4725012 4672636 4617190 4561905 4509364 4460775 4416941 4379531 4350892 4332804 4326052 4331385 4350302
59284 4350302 4384443 4434522 4500385 4582070 4680260 4795540 4927538 5075125 5237262 5413287
59274 5413287 5602232 5801837 6008276 6216891 6423143 6622511 6809205 6975369 7112437
59265 7112437 7213818 7276488 7300532 7288043 7242695 7169492 7073861 6960623 6833768 6696838
59255 6696838 6553087 6405309 6255659 6105583 5955932 5807506 5661558 5519416 5381611
59246 5381611 5248015 5119136 4996675 4882454 4777526 4682924 4600561 4532486 4479633 4442244
59236 4442244 4421272 4418550 4435847 4474826 4537880 4627911 4747026 4896308 5077095 5291661 5542272
59225 5542272 5830221 6155944 6519034 6917302 7345943 7797689 8263018 8729755 9183089
59216 9183089 9606778 9984482 10300311 10539355 10689080 10740928 10691042 10540349 10294492 9963419
59206 9963419 9560501 9101691 8604708 8087576 7566725 7055931 6566319 6106213 5680634
59197 5680634 5291679 4939973 4625318 4345979 4098515 3879337 3686032 3516713 3368783
59188 3368783 3239226 3125659 3026309 2939317 2862915 2796104 2738305 2688472 2645251 2607991 2576914
59177 2576914 2552240 2533589 2520183 2511138 2505773 2504202 2507455 2516404 2530639 2548965 2570853 2596766
59165 2596766 2627259 2662608 2703361 2750285 2803381 2861535 2923518 2988887 3057621 3129335 3203153
59154 3203153 3277966 3352485 3425274 3494917 3559954 3618631 3669055 3709791 3740033 3759174 3766635
59143 3766635 3762348 3747116 3722309 3689439 3650121 3606114 3559145 3510851 3462911 3417001 3374546
59132 3374546 3336719 3304687 3279549 3262064 3252817 3252698 3262836 3283986 3316453 3360717 3417607 3487573
59120 3487573 3570239 3665086 3772305 3892635 4026648 4174615 4336886 4513931 4706025 4913153
59110 4913153 5135252 5372227 5623666 5888545 6165046 6450329 6740291 7029414 7310790
59101 7310790 7576371 7817475 8025295 8191099 8306533 8364632 8361188 8295278 8168699 7985490
59091 7985490 7752183 7477834 7172815 6847077 6509306 6167059 5826900 5494154 5172830
59082 5172830 4865953 4575832 4303999 4051105 3817071 3601399 3403435 3222443 3057419
59073 3057419 2906922 2769363 2643615 2529062 2424864 2329523 2241665 2161109 2088529 2023893
59063 2023893 1965698 1912060 1862233 1816712 1776077 1740174 1708395 1680307 1655828 1634913 1617195
59052 1617195 1601834 1587735 1574076 1560667 1547619 1534615 1520690 1504969 1487529 1469348 1451458
59041 1451458 1434297 1417890 1402406 1388461 1376908 1368457 1363403 1361575 1362411 1365121 1368946 1373563 1379358
59028 1379358 1387155 1397536 1410498 1425891 1443791 1464041 1485466 1506123 1524494 1540157 1553108
59017 1553108 1562891 1568781 1570670 1569420 1566478 1563360 1561333 1561145 1562974 1566824 1572910 1581447 1592191 1604567
59003 1604567 1618221 1632949 1647924 1661387 1671515 1677433 1679163 1676813 1670304 1659945 1646843 1632483
58991 1632483 1618022 1604113 1591154 1579371 1568781 1559474 1552010 1547152 1545015 1544806 1545689 1547657 1551228
58978 1551228 1556519 1563095 1570608 1579079 1588554 1599137 1611560 1627022 1645977 1667390 1689763 1712739
58966 1712739 1737250 1764191 1793443 1824238 1856028 1888736 1922399 1956858 1991728 2026572 2061076
58955 2061076 2095209 2129296 2163841 2199134 2235047 2271506 2309265 2349874 2394503 2442996 2494580
58944 2494580 2549350 2608501 2673110 2743452 2819760 2902912 2993872 3093011 3200501 3316921 3442804
58933 3442804 3577962 3722123 3876235 4042557 4223465 4420711 4635855 4870815 5127816
58924 5127816 5409190 5717425 6055070 6424530 6828206 7268904 7749730 8273383 8841656
58915 8841656 9455567 10115480 10820665 11568607 12354545 13171226 14008674 14853806 15690079
58906 15690079 16497550 17253745 17934996 18517565 18978681 19298421 19462354 19463435 19302253 18986600
58896 18986600 18531172 17956402 17285720 16542811 15750763 14932143 14107842 13295045 12506627
58887 12506627 11752302 11039480 10372935 9754645 9184653 8661884 8184193 7748454 7351169
58878 7351169 6988824 6657633 6353600 6073208 5813758 5572881 5348197 5137719 4940171
58869 4940171 4754683 4580577 4417682 4266317 4126548 3997688 3878767 3769153 3668479
58860 3668479 3576360 3492495 3416704 3348548 3287230 3232109 3183006 3139819 3102347 3070859 3046307
58849 3046307 3029368 3019517 3015596 3017090 3024324 3037602 3056762 3081676 3112681 3150301 3194858 3246524
58837 3246524 3305560 3372347 3447177 3530056 3620717 3718923 3824925 3939541 4063786 4198507
58827 4198507 4344414 4502359 4673583 4859933 5063890 5288055 5534409 5804310 6099409
58818 6099409 6422445 6776998 7166648 7594484 8063139 8574906 9131769 9735324 10386241
58809 10386241 11083212 11822056 12595707 13394823 14208026 15021311 15817139 16574226 17268553
58800 17268553 17875243 18370409 18732720 18945186 18997278 18886370 18617625 18202960 17660133
58791 17660133 17011552 16281980 15495932 14676390 13844615 13019332 12215165 11442198 10707211
58782 10707211 10014779 9367196 8764548 8205926 7690392 7216493 6781543 6382217 6015578
58773 6015578 5678924 5369046 5082488 4816530 4569298 4339032 4123916 3922698 3734970
58764 3734970 3560682 3399647 3251415 3115112 2989371 2872845 2764880 2665405 2574303 2491339
58754 2491339 2416646 2350535 2292506 2240912 2194087 2151654 2114355 2082754 2056407 2034233 2015349
58743 2015349 1999364 1986093 1975272 1966577 1959674 1954044 1948827 1943027 1935855 1926744 1915095 1900350 1882430
58730 1882430 1861938 1839780 1816658 1792960 1768869 1744393 1719303 1693189 1665575 1636108 1604766
58719 1604766 1571874 1537727 1502303 1465593 1428154 1390961 1354662 1319305 1284931 1252044 1221262
58708 1221262 1192703 1165920 1140288 1115439 1091590 1069567 1050231 1033668 1019110 1005665 992888
58697 992888 980564 968437 956448 945035 934877 926388 919515 913889 909081 904892 901432 898864 897162
58684 897162 896254 896114 896321 895803 893629 889889 885181 879416 872128 864043 857231 853148 851335 850592 850717 852346
58668 852346 855671 860103 864960 869746 873971 877240 879555 881216 882518 883657 884543 884515 882654 878739 873540
58653 873540 867964 862366 856951 852263 848866 847034 847075 849426 854064 860369 867969 877133 888028 900403
58639 900403 914452 931045 950424 971525 993434 1016684 1042202 1069883 1099392 1131619 1168006
58628 1168006 1208938 1254201 1304601 1361627 1425737 1496543 1574749 1662483 1761517 1872530 1996389
58617 1996389 2134755 2288914 2459142 2645694 2849223 3069484 3304452 3551161 3806315
58608 3806315 4065224 4320843 4564632 4787778 4981125 5134988 5240597 5292099 5287110 5226172
58598 5226172 5112767 4953779 4758941 4539053 4304308 4063533 3824018 3591463 3370012
58589 3370012 3162405 2970235 2794292 2634810 2491526 2363806 2250995 2152506 2067449 1994486
58579 1994486 1932457 1880771 1838662 1804381 1775879 1752152 1733144 1718316 1706164 1695247 1684898
58568 1684898 1674630 1663669 1651596 1638906 1626417 1614378 1602470 1590228 1577033 1561933 1543915
58557 1543915 1522306 1496835 1467560 1434997 1400180 1364425 1328989 1294810 1262322 1231528 1202456
58546 1202456 1175400 1150470 1127191 1104930 1083580 1063355 1044042 1024998 1005874 986919 968627
58535 968627 951481 935893 921932 909169 897244 886335 876564 867231 857397 847097 837222 828212
58523 828212 819572 810694 801413 791685 781377 770548 759426 748186 737295 727826 720611 715210 710538
58510 710538 706414 703512 701899 700837 700226 701046 703894 708064 712593 717376 722776 729013 736508 746052 757947
58495 757947 771454 785613 800189 815479 831745 849150 867663 886617 904829 921348 935620
58484 935620 946901 954381 958109 958836 956601 950434 939978 926435 911195 894367 875541 855348 835275
58471 835275 816242 798185 780985 765153 751453 740108 730404 721182 711888 703020 695178 688112 681449
58458 681449 675968 672950 672223 672136 671712 671591 672386 673407 673769 673748 674223 675621 678121 682091 687553 693965 701206
58441 701206 710071 721199 734323 749187 766238 785592 806199 826976 847916 869107 889279 906372
58429 906372 919061 926901 929617 927263 920662 910854 898483 884371 870000 856526 843846 831489
58417 831489 819895 809968 801958 795759 791816 790715 792222 795622 800685 807525 816000 826108 838520
58404 838520 853659 870577 887529 903334 917299 928306 935091 937271 935269 929462 920219 908473
58392 908473 895336 881294 866487 851452 836857 822870 809644 798045 788969 782194 776790 772455
58380 772455 769626 768529 768973 770943 774578 779637 785638 792390 799825 807594 815405 823433 831907 840726
58366 840726 850050 860620 872708 885315 897230 908345 919153 929655 939815 950522 962822 976487
58354 976487 990448 1004459 1019298 1035447 1052457 1069489 1085657 1100061 1112207 1122229 1130049 1134741
58342 1134741 1135393 1132181 1125935 1117253 1106796 1095853 1085665 1076735 1069534 1065150 1064307 1066438 1070722 1077242
58328 1077242 1086078 1096177 1106457 1117338 1129793 1143588 1157854 1172782 1189173 1206813 1224796
58317 1224796 1243128 1262564 1283214 1304695 1327239 1351213 1375901 1400128 1423559 1445946 1465652
58306 1465652 1480696 1490954 1497749 1501722 1502864 1502297 1502027 1502904 1504495 1506915 1511085 1517200 1524600 1533238
58292 1533238 1543758 1556198 1570161 1586137 1604937 1625873 1647230 1668624 1691251 1715769 1741615
58281 1741615 1768585 1797411 1828564 1861869 1897415 1935502 1975819 2018076 2063185 2112181 2164099
58270 2164099 2216451 2267621 2317200 2364320 2407591 2446667 2482223 2514598 2544081 2572245 2601184
58259 2601184 2631757 2664256 2700154 2741151 2787059 2836842 2891193 2951695 3017913 3087931 3161484
58248 3161484 3239970 3323571 3410940 3501588 3596070 3694111 3795303 3901336 4014713 4135477
58238 4135477 4262063 4394998 4536556 4687116 4845387 5012229 5190701 5382164 5585858
58229 5585858 5802569 6035096 6284782 6551221 6835751 7141652 7470580 7822537 8199707
58220 8199707 8606613 9046301 9520416 10033295 10591923 11201923 11868153 12599434 13408002
58211 13408002 14304379 15298227 16404912 17646365 19046120 20630684 22437933 24519916
58203 24519916 26939347 29773781 33129138 37146943 41999603 47885722 55031374 63690313
58195 63690313 74141981 86692165 101670007 119415953 140276352 164610500 192763383
58188 192763383 224938763 260951756 299871690 339590774 376515450 405822343 422629380
58181 422629380 423761995 409081802 381459122 345465098 305750627 266017387 228747665
58174 228747665 195339275 166340871 141712856 121088331 103966422 89815738 78134849
58167 78134849 68497098 60561540 54051950 48740840 44451743 41056438 38458395 36581921
58159 36581921 35374070 34804200 34856835 35528785 36826712 38744426 41210387 44017933 46770159
58150 46770159 48897167 49800079 49088177 46759363 43182446 38901709 34423857 30113175
58142 30113175 26187781 22748866 19811617 17340176 15278561 13564889 12136237 10936887
58134 10936887 9924945 9068672 8340085 7715743 7179078 6716278 6311896 5951786 5627142
58125 5627142 5331918 5059017 4802405 4560213 4332345 4117370 3914662 3726973 3557451
58116 3557451 3405766 3269576 3147642 3038963 2940937 2850818 2767124 2687422 2607021 2522538
58106 2522538 2435178 2348276 2263335 2180585 2101488 2028019 1960654 1899155 1844133 1795873 1752779
58095 1752779 1712837 1675550 1640839 1607335 1573500 1539350 1505427 1471120 1435495 1398869 1362154
58084 1362154 1325619 1289585 1255280 1223597 1193779 1164434 1135123 1106173 1077960 1051177 1026754
58073 1026754 1004690 984068 964779 947845 933377 919858 906321 893550 882149 871188 860054
58062 860054 849945 841989 835287 828348 821205 814546 807909 800281 791610 782364 772460 761907 751624
58049 751624 742314 733378 724075 714808 706152 697693 689124 681523 676112 672519 669587 667090 665344 663899
58035 663899 662037 660059 658803 658312 658061 657968 658067 657718 656251 654114 652450 651908 652495 654015 655908 657353
58019 657353 658291 659745 662400 665678 668880 672299 676275 680100 682902 684810 686175 686524 685433 683655 682158
58004 682158 680627 678159 674935 672072 670220 669264 668932 668709 667599 664927 660956 655976 649461 640973 631140
57989 631140 620767 609810 598357 587905 580292 575774 573280 572025 571747 571934 572236 573261 575689 578806
57975 578806 581141 582389 583620 585745 588833 592721 597176 601545 605193 608217 610959 613146 614373 615021
57961 615021 615667 616021 615546 614724 614430 614292 612999 610173 606609 602625 597527 591029 584074 577833 572737 568805
57945 568805 566116 564613 564059 564455 565911 568030 569996 571350 572118 572167 571056 568627 565166 560886 555661
57930 555661 549294 541614 532413 521720 510059 498044 485904 473799 462299 452042 443209 435769
57918 435769 429873 425479 422037 419201 417497 417688 419770 423213 427740 433301 439727 447086 455822 465843
57904 465843 476027 485409 494230 502958 511012 517569 522968 528088 532865 536735 540071 543689 547259 549692
57890 549692 550954 551947 552617 551809 549101 545329 541040 535953 530309 525210 521046 516880 512073 507349 503562
57875 503562 500491 497526 494590 491728 488703 485760 483967 484061 485617 487966 491212 495678 500995 506408 511481
57860 511481 515955 519396 521570 522774 523351 523312 522742 522044 521402 520479 518996 517084 514800 511925 508645 505837
57844 505837 504259 503952 504688 506279 508071 509014 508933 509037 510369 512279 513231 512720 511496 510105 508132 504988
57828 504988 500669 495392 488921 480692 470588 459350 448072 437324 426951 416778 407172 398591 390894
57815 390894 383599 376641 370328 364679 359375 354296 349561 345133 340996 337578 335230 333444 331471 329686
57801 329686 329308 330674 332898 335511 339265 344758 351365 358292 365735 374139 383015 391359 398699 404927
57787 404927 409656 412647 414508 416145 417747 418985 419851 420564 420860 420095 417961 414585 410113 404741 398912
57772 398912 392922 386564 379716 373011 367267 362448 357890 353482 349908 347673 346589 346409 347344 349569 352600
57757 352600 355608 358281 361095 364670 369067 373861 378806 384013 389291 393823 397102 399941 403684 408309
57743 408309 412190 414122 414820 415858 417772 419923 421755 423345 424889 426396 427963 429760 431694 433496
57729 433496 435313 437866 441847 447254 453449 459865 466645 474385 483244 492556 501732 511139 521438 532254
57715 532254 542455 551842 561642 572995 585848 599760 614819 631107 648120 665631 684509 705719
57703 705719 729047 753735 779952 808626 840102 874069 910795 951508 997486 1049570 1108632
57692 1108632 1175698 1251421 1336102 1430499 1536168 1654965 1788649 1938899 2107012 2293423
57682 2293423 2497992 2720712 2961346 3218081 3487049 3763230 4041060 4313581 4571644
57673 4571644 4804972 5004618 5164770 5282908 5358973 5394631 5392812 5356766 5288077 5184611
57663 5184611 5040752 4851001 4614971 4340200 4040931 3733995 3434433 3152927 2895683
57654 2895683 2665735 2464022 2289675 2140403 2013436 1906121 1815600 1738657 1672721 1616880
57644 1616880 1571305 1535673 1508592 1488436 1474281 1466019 1464036 1468828 1480562 1498976 1523930 1555961
57632 1555961 1595999 1644654 1702154 1768914 1845881 1934388 2035854 2151342 2281027 2424311
57622 2424311 2580846 2751098 2935380 3132371 3338813 3550139 3760659 3963327 4150063
57613 4150063 4312388 4441590 4529122 4568340 4556480 4494768 4387005 4238879 4058291 3854820
57603 3854820 3637814 3415082 3193114 2977455 2772137 2579304 2399918 2234536 2083244
57594 2083244 1945454 1820335 1707202 1605203 1512998 1429221 1353131 1284615 1223629 1169670
57584 1169670 1121530 1077617 1036923 999745 966943 938402 912711 888487 865464 843999 824146
57573 824146 805712 788858 774002 761215 750073 740154 731416 724058 718127 713312 709206 705801 703499
57560 703499 702455 702267 702733 704550 708583 714587 721449 728759 737291 747716 759619 772217 785476 800032
57546 800032 816555 835589 857498 882128 908952 938045 970493 1007439 1049201 1095898 1148437
57535 1148437 1208143 1275650 1350946 1434418 1527207 1630454 1744795 1870645 2008338 2157569
57525 2157569 2316936 2484272 2657117 2832439 3005797 3171019 3320903 3448289 3546529 3609503
57515 3609503 3632291 3612795 3552825 3457239 3332093 3183843 3019732 2847599 2674437 2505239
57505 2505239 2343209 2190552 2048756 1918673 1800745 1694917 1600234 1515189 1438922 1371696
57495 1371696 1313814 1264516 1222409 1186517 1156384 1131549 1111531 1096137 1085188 1078131 1074490 1074543
57483 1074543 1079002 1087995 1100943 1117506 1138249 1164277 1196470 1235155 1280267 1331812 1390362 1457076
57471 1457076 1533169 1619420 1716287 1824182 1943344 2073602 2214456 2365000 2523361 2686332
57461 2686332 2849756 3008976 3158543 3291797 3401363 3480221 3522447 3523789 3482728 3401389
57451 3401389 3285127 3140976 2976388 2798764 2615159 2431734 2253383 2083633 1924698
57442 1924698 1777710 1643149 1521054 1410824 1311301 1221425 1140560 1067942 1002263 942419
57432 942419 888390 840704 799097 762257 728796 697934 669275 642589 618062 596246 577435
57421 577435 561165 546376 532018 517717 504090 492095 481762 471914 461643 451584 443033 436135
57409 436135 429840 423453 417210 411326 405585 400160 395811 392726 389999 386859 383761 381613 380424 379377
57395 379377 377875 375955 374009 372591 372177 372575 372856 372480 372211 373300 375832 378442 379702 379351 378172 377084
57379 377084 376446 375949 375133 374083 373505 373866 374692 375070 374754 374369 374561 375267 375843 375595 374259 372334 370970
57362 370970 371101 372463 373736 373853 373024 372337 372583 373651 374912 375890 376503 376882 377163 377490 378122 379369 381343
57345 381343 383851 386596 389430 392305 395010 397173 398677 400010 401985 404942 408386 411630 414757 418552
57331 418552 423256 427823 430958 432770 434789 438196 442599 446934 451010 455543 460875 466418 471498 476181
57317 476181 480915 485781 490549 495294 500498 506489 513085 519830 526376 532566 538419 544257 550656 558120
57303 558120 566854 576904 588210 600295 612174 623065 633207 643688 655410 668550 682925 698389
57291 698389 714702 731469 748522 766128 784645 804225 824965 846977 870073 893743 917682
57280 917682 941999 966672 991310 1015735 1040170 1064258 1086416 1104898 1119144 1129338 1135027 1135169
57268 1135169 1129455 1118620 1103459 1084537 1063006 1040664 1018703 997120 975762 955269 936646
57257 936646 920561 907443 897525 890254 884358 879182 875416 873875 874121 875059 876444 878915 882779 887654
57243 887654 893290 899857 907260 914922 922584 930804 940221 950629 961154 971323 981663 993156 1006178
57230 1006178 1020083 1033922 1047461 1061321 1076175 1092115 1108872 1126319 1144533 1163553 1183246
57219 1183246 1203355 1223668 1244358 1266045 1289130 1313097 1337001 1360753 1385347 1411629 1439397
57208 1439397 1468029 1497437 1527920 1559496 1591815 1624398 1656625 1687945 1718541 1749435 1781444
57197 1781444 1814391 1847723 1881500 1916246 1952181 1989155 2027049 2065750 2105094 2145287 2186972
57186 2186972 2230225 2273852 2316356 2357314 2397213 2436246 2473976 2509923 2543723 2574930 2603360
57175 2603360 2629621 2654740 2679443 2704298 2730157 2757752 2787221 2818866 2854055 2894403 2940156
57164 2940156 2990195 3043437 3099274 3156877 3215209 3273931 3333370 3393450 3453474 3512941 3571655
57153 3571655 3628977 3683920 3736187 3786246 3834314 3880243 3924549 3968499 4012922 4057761 4102972
57142 4102972 4148743 4194494 4238735 4280423 4319620 4356503 4390663 4421908 4450855 4478155 4503839
57131 4503839 4527865 4550667 4572831 4594915 4617836 4642782 4670641 4702386 4740034 4786089 4841845
57120 4841845 4907298 4982832 5069663 5168226 5277258 5394642 5517816 5643265 5767534 5889716
57110 5889716 6012016 6138145 6273349 6426505 6609712 6834317 7108735 7440804 7840366
57101 7840366 8319099 8891037 9575693 10399449 11392858 12587862 14016450 15706375 17674303
57092 17674303 19924711 22455707 25261009 28323841 31613341 35087131 38686786 42325942
57084 42325942 45900477 49334443 52615093 55757566 58718875 61355643 63479680 64953992
57076 64953992 65732543 65821519 65222030 63912221 61871875 59120112 55740840 51882159 47728069
57067 47728069 43458860 39224710 35140597 31290300 27728612 24484373 21567750 18976615
57059 18976615 16697976 14709037 12981870 11488096 10199779 9089410 8131909 7306127
57051 7306127 6593624 5977591 5444050 4982357 4582926 4235434 3930139 3659594 3417848
57042 3417848 3199155 2998525 2812359 2637363 2469734 2306428 2146261 1988907 1833934
57033 1833934 1681878 1535015 1395741 1264906 1142821 1030891 930766 842417 764322 695210
57023 695210 634548 581681 535703 496085 462632 434845 411904 393094 377853 365841 357479 353875
57011 353875 355697 362606 374286 391408 415086 446208 486038 536681 600137 677658 771090 884126
56999 884126 1020638 1180914 1358584 1539048 1699691 1814145 1861367 1834396 1742063 1603267
56989 1603267 1439565 1270267 1109742 966267 843100 740961 659183 594954 543171 498286
56979 498286 456245 414702 372425 329282 286284 244864 206038 170375 138490 111156 89021
56968 89021 72310 60762 53993 52066 55475 64273 77516 94130 114024 137661 164665 193642
56956 193642 223339 252950 280848 303847 318439 322634 316563 301959 281554 258433 235157 213300
56944 213300 193870 177770 165530 156935 151442 148967 150032 155229 164805 178710 196847 219304 246429
56931 246429 278412 314358 351537 385621 411813 426147 426432 412728 387301 353919 316614 278515
56919 278515 241463 206576 174987 147843 125548 107338 91858 78172 66153 56055 47915 41329
56907 41329 35695 30703 26612 23897 22543 21836 20931 19509 17850 16571 16395 17791 20577 24093 28064
56892 28064 33153 40542 51203 65641 83941 105780 130667 158255 187818 217090 242339 260323
56880 260323 269959 271858 267001 256761 243583 230381 219166 210923 206515 206688 211369 220077 233154
56867 233154 251522 275147 303000 335066 373281 419695 474347 535469 600867 667860 732043
56856 732043 786969 825540 842157 834645 805182 759480 704627 647277 593000 545911 508049 479615
56844 479615 460493 451283 452612 464185 485404 516652 559179 613806 680344 758220 846983 945758
56832 945758 1051876 1159170 1256891 1331049 1368871 1363939 1318343 1240880 1143512 1038308 935311
56821 935311 841216 759248 690283 634289 591146 560705 542519 535721 539420 553322 577834 613396
56809 613396 659894 716780 783127 856679 932491 1002596 1057253 1087114 1085834 1052478 992276 914484
56797 914484 828627 742086 660231 587291 526030 476814 437923 407273 383900 367950 359805 359552
56785 359552 367043 381959 403644 431119 463460 499799 538438 575792 606506 624980 627229 612003
56773 612003 581043 538543 489752 439228 389939 343727 302088 266113 235929 210779 189789
56762 189789 172392 157977 145565 134265 124015 115543 109401 105194 101948 99170 97200 96445 96621
56749 96621 97071 97524 98096 98612 98466 97312 95578 94079 93323 93196 93110 92434 91063 89532 88329 87203 85572
56732 85572 83571 82043 81354 80889 79995 78828 77813 76813 75462 73919 72661 71669 70408 68542 66216
56717 66216 63696 61151 58795 56942 55873 55817 56782 58204 59018 58547 57133 55543 54002 52305 50649 49704
56701 49704 49814 50634 51596 52299 52464 52048 51545 51711 52768 54207 55486 56556 57605 58742 60183 62347
56685 62347 65344 68552 71104 72735 73906 75172 76731 78616 80949 83780 86802 89516 91692 93454
56671 93454 94905 95968 96785 97911 99725 101788 103247 103800 103784 103374 102357 100847 99529 98787 98145 97092
56655 97092 96018 95739 96300 96865 96656 95613 94225 93168 93009 93792 94881 95492 95427 95145 95198 95754 96430 96463
56637 96463 95351 93542 92076 91267 90215 88040 85142 82653 81100 80294 80140 80687 81513 81949 81938 81960 82105
56620 82105 81927 81325 80814 80763 81017 81522 82678 84799 87638 90720 93710 96244 97900 98646 99019 99592 100415
56603 100415 101085 101170 100583 99758 99399 99766 100307 100332 99816 99169 98535 97961 97928 98859 100162 100697 100349 100272 101352
56584 101352 103182 104875 106102 106918 107270 107206 107132 107458 108409 110329 113581 117824 122000 125394 128148 130495
56568 130495 132322 134037 137026 142407 149783 157961 166447 175450 184811 193956 202908 212410 222796 233324
56554 233324 242930 251268 258750 265820 272483 278527 283968 289044 293642 296975 298178 297267 295106 292403
56540 292403 289058 284580 278750 271708 263773 255370 246898 238560 230545 223209 216615 210048 202722 195011
56526 195011 188207 182934 178619 174784 171811 169861 167984 165185 161773 158820 156727 155036 153265 151172
56512 151172 148564 145577 142865 140842 139045 136848 134456 132464 130802 128960 127024 125615 124852 124122 122942
56497 122942 121488 120322 120083 121263 123636 126077 127579 128276 128931 129703 130203 130451 130839 131314 131583 132114 133824
56480 133824 136589 139140 140818 142443 144934 148031 151034 154050 157606 161520 165046 167948 170642 173356
56466 173356 175844 178116 180888 184973 190397 196362 201998 206963 211308 215025 218070 220764 223677 226752
56452 226752 228913 229046 227313 224999 223116 221652 220230 218943 218260 218459 219444 220936 222590 224083 225191
56437 225191 225761 225638 224852 223821 223086 222668 221921 220145 217300 214016 211063 208831 207205 205800 204279 202441
56421 202441 200117 197193 193752 189961 185802 181277 176928 173701 171949 170970 169846 168367 166748 164932
56407 164932 162856 161141 160705 161648 163100 164227 164891 165304 165591 165897 166472 167408 168422 168976 168501 166729 164112
56390 164112 161701 160275 159772 159901 160877 162874 165065 166144 165860 165312 165577 166766 168601 171111 174277 177611
56374 177611 180596 183304 186170 189433 193019 196774 200493 203935 206977 209700 212288 214943 217815 220769
56360 220769 223256 224824 225669 226369 227129 227729 228209 229064 230600 232474 233999 234669 234403 233640 233197 233672 234988
56343 234988 236812 239191 242281 245673 248719 251545 254973 259348 264117 268764 273447 278412 283428 288186
56329 288186 292772 297398 302193 307501 313909 321502 329531 337207 344488 351787 359312 367084 375315 384304
56315 384304 394045 404136 413949 422893 430792 438066 445170 451793 457029 460376 462046 462286 461080 458806
56301 458806 456385 454305 452037 449002 445696 443269 442326 442650 443862 445796 448335 451381 455060 459677 465439
56286 465439 472368 480422 489596 500024 511988 525656 540827 557225 575121 595309 618379 644232
56274 644232 672386 702461 734402 768635 806016 847322 892837 942808 998171 1060281 1130046
56263 1130046 1207986 1295086 1392742 1501680 1621729 1752880 1895737 2050534 2216399 2391977
56253 2391977 2576084 2767266 2963235 3161089 3357420 3547758 3726592 3888640 4029860
56244 4029860 4147068 4237398 4298872 4331070 4334801 4311607 4264099 4196150 4111999 4015320 3909391
56233 3909391 3797546 3682816 3567361 3452628 3339584 3228378 3118299 3008586 2899021
56224 2899021 2789524 2679789 2569730 2459600 2349244 2238044 2126232 2015553 1907862
56215 1907862 1803653 1702697 1605488 1513132 1426289 1345084 1269732 1200424 1136870 1078624 1025537
56204 1025537 977337 933266 892854 856506 824512 796026 769919 746117 725097 706474 689258
56193 689258 673256 659088 646901 636073 626166 617294 609552 602915 597647 593998 591634 590145 589864
56180 589864 591279 593837 596465 599247 603433 609668 617289 625595 634778 645258 656996 669863 683858
56167 683858 698526 712887 726345 739102 751351 762663 772545 781023 788333 794455 799239 802628 804568
56154 804568 805166 805133 805610 807304 810245 814565 821130 831138 845439 864474 888608 918337 954387 997744
56140 997744 1049503 1110781 1182902 1267347 1365000 1475437 1597210 1728441 1866466 2006931
56130 2006931 2143936 2271551 2385411 2483507 2566314 2636282 2696589 2749790 2797114 2838136 2870481
56119 2870481 2890461 2895204 2884682 2861514 2828996 2789508 2743996 2691742 2630405 2557016 2469488
56108 2469488 2367454 2252424 2128025 1999811 1873887 1755160 1646799 1550690 1467671 1397516
56098 1397516 1339360 1292169 1254495 1224277 1199538 1179046 1161794 1146407 1131789 1117882 1104912
56087 1104912 1092344 1079468 1066534 1054256 1042603 1031222 1020699 1012113 1005480 999978 995651 993581
56075 993581 994214 996764 1000535 1005622 1011952 1018727 1025384 1032285 1040046 1048859 1058735 1069703 1081508 1093711
56061 1093711 1106305 1119671 1133834 1148358 1163022 1177981 1193309 1208976 1225192 1242150 1259522
56050 1259522 1276854 1294250 1312094 1330491 1349668 1370382 1392967 1416411 1439437 1462033 1484893
56039 1484893 1507917 1530612 1553466 1577506 1602821 1628990 1656587 1686661 1718973 1752471 1787369
56028 1787369 1824981 1865403 1907134 1949186 1992030 2036349 2082508 2131317 2183580 2238564 2294602
56017 2294602 2351521 2410877 2473583 2538970 2606498 2676641 2749652 2825089 2903036 2984297 3069000
56006 3069000 3156459 3246628 3340217 3437311 3537579 3641911 3752104 3868746 3991202 4119700
55996 4119700 4255660 4400041 4553241 4716445 4890869 5075985 5270990 5477835 5700110
55987 5700110 5939099 6193948 6465712 6757934 7072899 7410737 7772791 8162467 8582211
55978 8582211 9033307 9519682 10048338 10625137 11253988 11941515 12698865 13537748 14468764
55969 14468764 15505597 16667612 17977424 19460649 21151017 23093844 25345518 27976940
55961 27976940 31083490 34792541 39263336 44684669 51273718 59273953 68954841 80615907
55953 80615907 94585418 111207170 130832053 153825440 180554825 211302391 246079159
55946 246079159 284325200 324471256 363482867 396819491 419305542 426844077 418068040
55939 418068040 394834985 361282531 322202611 281750151 242910580 207507411 176405875
55932 176405875 149768240 127326087 108607802 93074917 80194360 69488467 60560801
55925 60560801 53088278 46802739 41485131 36963020 33098138 29774463 26897879 24396866
55917 24396866 22214130 20298967 18609374 17114546 15789154 14607864 13548330 12594934
55909 12594934 11735354 10956498 10246819 9599160 9007909 8465893 7966563 7506313 7081988
55900 7081988 6688723 6322599 5982829 5668898 5377780 5106094 4852708 4617195 4397855
55891 4397855 4193178 4003118 3827086 3662775 3508640 3365386 3233218 3109825 2992958
55882 2992958 2882976 2780902 2685850 2596402 2512741 2435373 2363106 2294279 2228763 2167022 2108386
55871 2108386 2051916 1997825 1946470 1897043 1848686 1801887 1757421 1715042 1674471 1636468 1601509
55860 1601509 1568617 1537031 1507994 1483348 1463234 1446584 1432916 1421894 1411627 1398919 1381077
55849 1381077 1356684 1325420 1288544 1249154 1210673 1175051 1142914 1114789 1091223 1072123 1056917
55838 1056917 1045141 1036278 1029430 1023663 1018277 1012370 1004801 995088 983655 970711 955630 937977 918392
55825 918392 897868 876777 855074 832780 809804 785987 761755 737996 715057 692750 671569
55814 671569 652744 636672 622505 609786 599189 591003 584353 578826 575464 574949 576035 577155 578642
55801 578642 581975 587519 594288 601337 608090 613726 617362 618542 616780 611223 601727 589679 576791 563602
55787 563602 550062 536835 524839 514039 503840 494242 485538 477416 469622 463122 459268 457851 457076
55774 457076 455336 451980 446542 438480 427887 415557 402187 388222 374450 361970 351420 342772
55762 342772 335810 330228 325491 321251 317701 314885 311973 308100 303700 300129 297974 296551 295051 293336
55748 293336 291466 289214 286268 282456 277666 271917 265525 258818 251848 244749 238099 232415 227585 223371
55734 223371 220173 218578 218405 218921 219796 221047 222169 222253 221069 219256 217204 214385 210024 203978 196898
55719 196898 189970 184490 181112 179273 177741 175835 173832 172280 171427 171382 172382 174646 178159 182605 187417
55704 187417 192076 196547 201163 205854 209872 212652 214534 216141 217469 218211 218653 219574 221418 224182 227909
55689 227909 232604 237856 243214 248746 254518 259741 263343 265321 266617 267596 267586 266230 264369 263067 262312
55674 262312 261187 258950 255588 251670 248042 245444 244090 243615 243504 243490 243599 244008 244719 245203 244598 242711
55658 242711 240633 239891 241074 243662 246953 250530 253917 256506 257992 258433 257809 255995 253195 249861 246099
55643 246099 241579 236105 229824 222868 215266 207271 199266 191349 183486 176011 169322 163047 156303 149037
55629 149037 142332 137043 132704 128277 123440 118589 114009 109630 105483 101831 98856 96510 94663 93191
55615 93191 91887 90445 88617 86456 84435 83131 82557 81987 80731 79004 77626 76947 76563 76118 75858 76135
55599 76135 76765 77141 76791 75668 74101 72614 71592 71037 70681 70252 69484 68154 66451 65095 64583 64439 63794
55582 63794 62637 61852 61995 62617 62947 62548 61204 58898 56277 54494 54029 54064 53440 51888 49993 48403 47522
55565 47522 47577 48446 49665 50998 52673 54604 55758 55003 52580 50049 48659 48256 47975 47523 47342 47745 48396
55548 48396 48846 49271 50286 52053 53966 55456 56780 58570 60820 62842 64209 65197 66189 67229 68428
55533 68428 70272 73059 76337 79331 81784 84069 86646 89692 93091 96395 98950 100462 101479 102928
55519 102928 105007 106741 106859 105059 102286 99761 97902 96301 94570 92801 91107 89167 86580 83442
55505 83442 80099 76506 72310 67531 62707 58335 54584 51531 49162 47053 44590 41721 39083 37206
55491 37206 35966 35000 34135 33162 31655 29473 27144 25429 24663 24696 25125 25349 24765 23362 21932 21349 21654
55474 21654 22076 21859 20968 20143 20285 21497 22758 22889 21874 20736 20122 19658 18932 18320 18360 18908 19490 19998
55456 19998 20453 20588 20346 20393 21370 22845 23680 23227 21637 19351 17045 15755 16051 17152 17720 17505 17337
55439 17337 17532 17396 16554 15668 15322 15110 14533 14051 14421 15485 16417 16878 17165 17413 17440 17353 17621 18447 19518
55420 19518 20519 21433 22209 22542 22207 21416 20629 20178 20079 20082 19821 19100 18114 17241 16649 16304 16322 16960 18163 19427
55400 19427 20389 21326 22751 24649 26445 27699 28448 28789 28491 27356 25740 24330 23420 22720 21980 21429 21317
55383 21317 21277 20560 18960 17140 15880 15224 14665 13931 13238 12769 12384 12030 12065 12761 13711 14114 13664 12728 11630
55364 11630 10213 8344 6482 5362 5285 5937 6803 7532 8110 8976 10714 13244 15476 16259 15720 15197 15742
55347 15742 17097 18230 18477 17896 16894 15887 15142 14588 13863 12786 11695 11112 11131 11340 11253 10642 9526
55330 9526 8088 6663 5669 5443 6072 7320 8720 9907 10895 11913 12910 13487 13453 13223 13370 13856 13996 13239
55312 13239 11762 10264 9277 8805 8532 8260 8058 8028 8072 8000 7903 8202 9246 10880 12485 13463 13719 13691 13904
55293 13904 14472 15125 15712 16447 17475 18437 18787 18450 17860 17391 17050 16626 15839 14434 12539 10861 10044 9834
55275 9834 9454 8765 8439 8805 9287 9346 9296 9675 10454 11448 12909 14923 16660 17179 16761 16591 17156 17808 17950
55256 17950 17799 17797 17993 18381 19158 20214 20814 20272 18691 16764 15084 13908 13300 13240 13721 14860 16657 18596
55238 18596 19897 20407 20853 21945 23487 24653 24838 23945 22161 19927 17957 16810 16411 16290 16237 16513 17456
55221 17456 19108 21151 23034 24263 24791 24975 25005 24619 23714 22900 22894 23530 23967 23948 24120 24905 25735 25900 25596
55202 25596 25496 25618 25415 24889 24782 25466 26290 26501 26275 26353 26934 27507 27653 27482 27243 27005 26882 27179 28015
55183 28015 29029 29726 29968 29954 29811 29449 28766 27877 27115 26815 26984 27161 26761 25709 24582 23928 23655 23319
55165 23319 22881 22804 23352 24085 24252 23533 22295 21215 20762 20943 21426 21912 22425 23216 24344 25424 25891 25508
55147 25508 24626 23905 23779 24106 24272 23666 22163 20323 19148 19463 21276 23654 25402 26044 26055 26058 26004 25436
55129 25436 24498 24198 25387 27697 29888 31175 31824 32415 33001 33385 33785 34623 35710 36289 36062 35630 35573 35595
55111 35595 35051 33961 32926 32298 32079 32517 33927 35803 36864 36473 35505 35379 36530 38241 39681 40633
55095 40633 41374 42280 43536 44973 46233 47233 48265 49437 50281 50293 49693 49317 49799 51077 52569 53585
55079 53585 53796 53624 54016 55415 57120 58070 58117 58053 58432 58977 59232 59205 59146 59094 58997 58925 58893 58724 58388 58243 58603
55058 58603 59229 59509 59077 57997 56497 54838 53453 52819 52976 53327 53081 51904 50141 48472 47360 46711
55042 46711 45947 44547 42650 41067 40528 40941 41659 42457 43819 45988 48075 48645 47198 44692 42613 41887
55026 41887 42651 44442 46322 47318 47230 46840 47000 47744 48557 49234 50005 50935 51689 51921 51607 51004 50509 50522 51120
55007 51120 51890 52297 52187 51805 51441 51279 51409 51640 51470 50626 49577 49056 49116 49057 48408 47568 47234 47515 47896
54988 47896 47932 47709 47603 47741 47833 47595 47194 47094 47494 48238 49339 51132 53600 55888 57023 56974 56643 56859
54970 56859 57682 58623 59181 59258 59289 59887 61118 62389 63342 64514 66626 69516 72437 75225 78492 82661 87466
54953 87466 92491 97626 102885 108319 114217 120938 128518 136947 146705 158273 170990 183218 193881
54940 193881 203141 211201 217218 219943 218898 214371 206692 196129 183253 168984 154396 140642 128617
54927 128617 118343 109145 100813 94139 89828 87304 85164 82550 79535 76448 73540 71316 70523 71550
54913 71550 74043 77237 80507 83700 87164 91437 96806 103205 110513 118716 127739 137434 147887 159347
54899 159347 171605 183751 194749 203904 210599 214062 213812 210041 203281 194036 183031 171329 159678
54886 159678 148083 136478 125463 115854 107812 101029 95485 91339 88191 85149 81701 78095 74881
54873 74881 72458 70955 70119 69381 68430 67576 67106 66525 65064 62851 60986 60357 60870 61797 62357 61977 60545
54856 60545 58593 56823 55483 54554 54353 55179 56376 56617 55429 53790 52845 52618 52398 51815 50938 49749 48198
54839 48198 46671 45802 45735 45921 45727 45099 44588 44837 46019 47659 49108 50170 51116 52043 52562 52319 51598 51096
54821 51096 51207 51779 52505 53256 54013 54745 55524 56536 57755 58737 59080 59134 59874 61806 64313 66449 68174
54804 68174 70232 72935 75819 78589 81674 85450 89683 94332 100237 108178 117675 127671 138164 150146
54790 150146 163923 178460 192649 206309 219530 231676 241522 247944 250225 248249 242860 235616 227649
54777 227649 219006 209373 199106 189132 180125 172211 165324 159451 154601 150814 148110 146276 144908 143929
54763 143929 143900 145502 148843 153475 158996 165359 172730 181282 191159 202410 214985 228817 243865 259996
54749 259996 276977 294575 312443 329772 345331 358095 367704 374088 376805 375046 368271 356706
54737 356706 341276 323189 303542 283166 262797 243330 225649 210117 196362 183782 172181
54726 172181 161838 153061 145784 139608 134113 129175 124947 121518 118649 116009 113549 111439 109692 108163
54712 108163 106881 106037 105591 105198 104672 104169 103817 103477 103106 103014 103474 104292 104988 105207 104755 103526 101756 100157
54694 100157 99436 99711 100641 101978 103640 105316 106406 106512 105839 104998 104561 104796 105644 106832 107997 108840 109283
54677 109283 109547 110019 110935 112229 113829 116032 119316 123751 128803 133782 138303 142351 146225 150451 155374
54662 155374 160638 165410 169370 173129 177383 181948 186074 189429 192339 195210 198371 202507 208640 217272
54648 217272 227847 239400 251605 264964 280074 297028 315475 334887 354617 373909 392087
54637 392087 408534 422299 431909 436060 434475 427750 416399 400610 381064 359302 336797 314185
54625 314185 291914 271028 252457 235882 220363 205942 193642 183816 175695 168870 164055 161687
54613 161687 160703 159589 158017 156547 155261 153778 152383 152097 153379 155461 157169 157891 157576 156284 154037
54598 154037 150926 147149 142931 138427 133703 128933 124580 121031 118003 114733 110958 107283 104313 101935
54584 101935 99802 97954 96478 95036 93375 91848 90715 89357 87051 84263 82192 81097 80038 78370
54570 78370 76606 75528 75198 75220 75349 75436 75216 74532 73492 72302 71250 70909 71813 73780 76003 77928 79593
54553 79593 81075 82199 83001 83852 84869 85745 86461 87612 89672 92488 95847 99933 104709 109425 113457
54538 113457 117330 122213 128578 135978 144005 152837 162748 173650 185173 196837 207947 217586 224873
54525 224873 229159 230104 227813 222825 215757 206971 196695 185363 173595 161995 151072 141264 132713
54512 132713 125158 118243 111873 106144 101132 96997 93991 92038 90509 88854 87302 86485 86471 86687 86788
54497 86788 86986 87393 87649 87532 87449 87879 88686 89408 90013 90799 91738 92447 92862 93405 94354 95483 96577 97895
54479 97895 99737 101828 103560 104734 105643 106431 106837 106706 106422 106539 107182 107965 108364 108019 106838 105066 103215
54462 103215 101760 100861 100401 100141 99866 99559 99506 99939 100491 100386 99394 98229 97613 97304 96533 95120 93504 91824
54444 91824 89767 87455 85723 85138 85209 85006 84208 83156 82184 81361 80824 80888 81725 83056 84225 84590 84011 82997
54426 82997 82269 82143 82502 83219 84266 85383 86148 86565 87146 88185 89323 90191 91080 92488 94236 95518 95805
54409 95805 95374 95014 95468 97035 99397 101904 104298 107006 110458 114383 118193 121870 125896 130337 134623
54394 134623 138339 141693 144901 147585 149192 149734 149724 149446 148622 146805 143894 140239 136386 132672 128993
54379 128993 125046 120858 116994 114023 111853 109774 107231 104380 101778 99674 97799 95818 93752 91853
54365 91853 90287 89141 88618 88874 89598 90028 89629 88669 87979 88210 89405 91176 93136 95164 97343 99677
54349 99677 101939 103924 105769 107785 109961 111972 113779 115876 118624 121687 124527 127237 130324 133709
54335 133709 136528 138097 138697 139084 139546 139748 139278 138008 135997 133387 130417 127320 124148 120849 117534
54320 117534 114458 111690 108999 106198 103492 101219 99316 97267 94625 91417 87988 84655 81622 79045
54306 79045 76878 74767 72348 69690 67229 65308 63928 62945 62260 61791 61479 61403 61686 62269 62944 63635 64366
54289 64366 64948 65063 64684 64092 63366 62314 61076 60340 60594 61499 62349 62827 62924 62553 61804 61271 61475 62055 62217
54270 62217 61908 61835 62263 62592 62377 62124 62527 63435 64133 64346 64451 64796 65309 65761 66101 66495 67241 68552 70214
54251 70214 71556 72034 71823 71576 71686 72073 72632 73492 74664 75783 76470 76760 76926 76991 76703 75952 74923 73811
54233 73811 72661 71611 71060 71339 72269 73260 73826 73906 73742 73616 73664 73768 73660 73287 72999 73142 73512 73596 73339
54214 73339 73324 74008 75125 76077 76626 76940 77213 77576 78145 78820 79204 79035 78581 78300 78176 77772 76908 75945 75393
54195 75393 75472 76026 76665 77045 77160 77190 76871 75406 72503 69229 67167 66714 66862 66662 66159 65683 65003 63759
54177 63759 62257 61215 60906 60999 61054 60814 60181 59290 58555 58330 58593 59188 60220 61809 63580 64742 64822 64094
54159 64094 63281 62982 63438 64625 66348 68194 69503 69649 68615 67184 66269 66025 65913 65632 65483 65682 65840
54142 65840 65586 65253 65388 65797 65762 65190 64863 65307 65927 65698 64424 62911 61907 61309 60555 59486 58501 57870
54124 57870 57271 56259 54957 53963 53608 53675 53888 54242 54684 54878 54620 54258 54325 54888 55537 55884 55832 55463 54994
54105 54994 54724 54708 54584 54018 53281 52965 53191 53501 53596 53792 54509 55600 56422 56472 55802 54899 54284 54204 54608 55310
54085 55310 56069 56528 56401 55873 55591 55982 56735 57242 57348 57259 56927 56099 55043 54586 55179 56333 57264 57763 58126
54066 58126 58549 59015 59580 60410 61519 62708 63748 64480 64848 65019 65374 66174 67305 68510 69782 71339 73262
54049 73262 75427 77771 80381 83202 85790 87576 88461 89136 90630 93388 96816 99880 102169 104165 106548
54034 106548 109558 113137 117315 122078 127113 132083 137113 142624 148648 154648 160114 165064 169762 174127
54020 174127 177653 179928 181071 181653 182187 182739 183091 183267 183708 184774 186225 187482 188301 188817 188856 187683 184803
54003 184803 180754 176725 173394 170518 167625 164719 162099 159796 157496 154931 152106 149215 146503 144230
53989 144230 142563 141381 140276 138857 137090 135357 134099 133370 132731 131687 130220 128775 127695 126909 126277
53974 126277 125959 126137 126607 126998 127285 127701 128178 128366 128263 128370 129038 130018 130811 131091 130634 129324 127568 126205
53956 126205 125563 124991 123828 122439 121669 121577 121495 121234 121395 122395 123967 125840 128205 131193 134488 137914
53940 137914 141904 146884 152540 158113 163171 167645 171449 174521 177051 179187 180628 180969 180393 179553 178802
53925 178802 177952 176902 176082 176050 176840 177962 179037 180250 182144 185037 188792 193164 198069 203313 208348
53910 208348 212849 217396 222969 229602 236283 242421 248647 255555 262333 267483 270541 272209 273022 272891 271958
53895 271958 270916 270089 268922 266796 263851 260666 257598 254757 252170 249520 246065 241282 235444 229302
53881 229302 223341 217531 211544 205070 198218 191797 186769 183045 179239 174063 167761 161720 156920 153240
53867 153240 150121 147265 144635 142250 140171 138408 136730 134835 132717 130585 128457 126124 123582 121119
53853 121119 118861 116625 114365 112392 110847 109326 107398 105312 103744 102939 102505 102062 101705 101643 101753 101744 101551
53836 101551 101269 100844 100112 99053 97771 96327 94916 94111 94403 95397 95966 95505 94672 94545 95446 96992 98836
53819 98836 100645 101642 101201 99989 99678 101091 103324 105075 106145 107027 107721 107860 107726 108162 109491 111260
53803 111260 113181 115574 118702 122297 126040 129967 134088 138177 142316 147154 153017 159101 164176 168000
53789 168000 171430 175140 178816 181842 184356 187206 191000 195471 199731 202976 204920 205712 205646 205057 204387
53774 204387 203997 203706 202724 200370 196811 192798 188719 184383 179860 176003 173705 172862 172515 171861 170672 168853
53758 168853 166235 163045 160036 157826 156383 155437 155057 155358 155895 155880 154977 153475 151721 149765 147587 145238
53742 145238 142647 139708 136675 134144 132413 131178 130046 129021 128243 127567 126730 125768 124910 124209 123542 122915
53726 122915 122493 122371 122563 123173 124354 126093 128185 130388 132509 134422 136124 137698 139151 140433 141689
53711 141689 143276 145407 147990 150979 154539 158619 162661 166186 169436 172985 176864 180554 183810 186998
53697 186998 190538 194407 198324 202084 205636 209071 212552 216029 219078 221390 223362 225799 228935 232149
53683 232149 234722 236498 237772 238928 240345 242245 244400 246305 247757 248998 250229 251398 252538 253779
53669 253779 254881 255286 254957 254603 254683 254639 253641 251697 249554 247827 246801 246734 247604 248656 248914 248228 247255 246385
53651 246385 245349 244020 242946 242667 242943 243135 243066 243043 243143 243017 242492 241959 241826 241793 241064 239361 237425 236249
53633 236249 236034 236230 236473 236968 237846 238642 238860 238755 239100 240271 241965 243856 246122 249137 252813 256502
53617 256502 259581 262064 264564 267599 271040 274380 277491 280815 284753 289211 293974 299202 305227 311962
53603 311962 318857 325409 331560 337601 343792 350086 356192 362061 368161 374929 381887 387891 392569 397006
53589 397006 402522 409122 415701 421516 426777 431955 437219 442609 448110 453392 457953 461704 465034 468207
53575 468207 471122 473788 476469 479097 480980 481539 481148 480823 481132 481669 481625 480727 479517 478681 478211 477453 476027
53558 476027 474364 473074 472143 471196 470241 469552 468964 467956 466448 464893 463431 461678 459572 457752 456628
53543 456628 455682 454252 452622 451738 452008 452936 453928 454989 456534 458721 461109 462991 464168 465383 467736
53528 467736 471647 476648 482235 488435 495333 502545 509675 517007 525269 534797 545373 556838 569440
53515 569440 583454 598634 614263 629834 645769 663327 683445 705598 728156 750081 772004
53504 772004 795416 821120 848671 877040 905472 933963 963234 994077 1026509 1059814 1093619
53493 1093619 1128503 1165047 1202668 1240034 1276486 1312424 1348294 1383859 1418697 1452980 1487445
53482 1487445 1522781 1559173 1596272 1633566 1670902 1708580 1746662 1784268 1819916 1852687 1882881
53471 1882881 1911527 1939490 1966990 1993618 2018596 2041232 2061362 2079410 2096076 2111978 2127422
53460 2127422 2142264 2156005 2168182 2178624 2187205 2193455 2196636 2196181 2191945 2184139 2173186 2159503 2143254
53447 2143254 2124443 2103369 2080657 2056498 2030138 2000633 1968023 1933398 1897919 1862227 1826584
53436 1826584 1790915 1754592 1716869 1677883 1638894 1601251 1565388 1530961 1497660 1465558 1434877
53425 1434877 1405733 1378122 1352105 1327935 1305904 1285961 1267751 1251312 1237538 1227439 1221071
53414 1221071 1217665 1216742 1218432 1222707 1229047 1237216 1247699 1260944 1276674 1294482 1314640 1337700 1363600
53401 1363600 1391762 1421896 1454064 1488002 1523048 1558964 1596402 1636325 1679190 1724813 1772821
53390 1772821 1823085 1875877 1931731 1991072 2053886 2119791 2188449 2259846 2334183 2411548 2491658
53379 2491658 2573870 2657482 2742130 2827829 2914558 3001829 3088728 3174389 3258412 3340828 3421626
53368 3421626 3500221 3575403 3645980 3711490 3772104 3827857 3878314 3923208 3963187 3999539 4033059
53357 4033059 4063194 4088263 4106509 4117154 4120582 4117484 4107810 4090626 4064979 4030633 3987838 3936658
53345 3936658 3876838 3808398 3732201 3649932 3563575 3474884 3385309 3296235 3208873 3123577 3039536
53334 3039536 2955711 2872205 2790181 2710371 2632256 2555090 2479110 2405144 2333367 2263248 2194684
53323 2194684 2128501 2065664 2006484 1950827 1898734 1850518 1806397 1766227 1729527 1695675 1664157
53312 1664157 1634681 1607055 1581101 1556823 1534525 1514537 1496934 1481736 1469275 1459955 1453638 1449555
53300 1449555 1446909 1445310 1444622 1444718 1445562 1447307 1450137 1454167 1459568 1466611 1475470 1486101 1498380 1512297
53286 1512297 1528061 1546294 1568070 1594288 1624761 1658238 1693600 1730748 1769947 1810571 1851092
53275 1851092 1890430 1928876 1967408 2006362 2045037 2082478 2118331 2152807 2186006 2217501 2246664
53264 2246664 2273307 2297839 2320763 2342186 2361890 2379582 2394791 2406627 2414111 2416916 2415471 2410115
53252 2410115 2400486 2386087 2367256 2344923 2319435 2290167 2256566 2219088 2178692 2135803 2090404
53241 2090404 2042995 1994810 1946965 1899833 1853399 1807734 1762864 1718595 1674885 1632175 1591015
53230 1591015 1551459 1513097 1475545 1438613 1402114 1365777 1329352 1292675 1255816 1219365 1184317
53219 1184317 1151324 1120193 1090485 1062444 1036835 1013884 992978 973525 955532 938939 922888
53208 922888 906223 888575 870502 852597 834856 816956 798829 780803 763327 746608 730391
53197 730391 714180 697923 682442 668761 656818 645115 631955 616901 600820 584742 569070
53186 569070 553852 539254 525440 512221 499134 485815 472157 458266 444506 431406 419261
53175 419261 407875 396996 386952 378457 371699 365918 360090 353834 347504 341583 336145 330769 324823
53162 324823 317985 310661 303777 298012 293256 288846 284169 278967 273343 267755 262882 259185 256585 254646
53148 254646 252982 251353 249568 247580 245621 243987 242646 241230 239385 237027 234363 231765 229523 227555
53134 227555 225508 223331 221511 220481 220009 219625 219442 219989 221185 222106 222022 221243 220610 220538 220902 221593 222664
53117 222664 223986 225169 225943 226414 226897 227685 228982 230874 233242 235776 238160 240303 242367 244537 246702
53102 246702 248343 248884 248189 246689 244973 243276 241349 238708 235002 230263 224974 219865 215512 212031 209085
53087 209085 206182 203022 199662 196374 193396 190839 188794 187266 185935 184178 181664 178796 176303 174411
53073 174411 172691 170724 168534 166347 164310 162695 162001 162465 163558 164324 164206 163352 162157 160794 159233
53058 159233 157514 155815 154319 153117 152253 151768 151627 151612 151380 150738 149788 148716 147511 146096 144634 143463
53042 143463 142708 142246 142093 142446 143101 143200 141994 139762 137545 136029 134999 133978 132932 132119 131505 130720 129593
53025 129593 128463 127865 127971 128379 128440 127786 126638 125593 125064 124936 124798 124465 124129 123968 123742 123014 121711 120329
53007 120329 119459 119268 119530 120021 120711 121552 122337 122852 123081 123153 123091 122743 122038 121225 120751 120813 121154 121411 121589 121895
52987 121895 122191 121967 121074 120140 119927 120462 121191 121876 122861 124411 126228 127863 129288 130829 132719 134918
52971 134918 137211 139271 140763 141654 142408 143739 146156 149737 154179 158932 163453 167550 171453 175386 179120
52956 179120 182127 184188 185702 187314 189267 191203 192554 193087 193037 192784 192489 192033 191132 189457 186855 183682
52940 183682 180792 178883 177829 176835 175254 173088 170803 168951 167940 167806 168057 168010 167341 166179 164723 163196
52924 163196 162126 162117 163077 164146 164726 165219 166365 168223 170222 171858 172849 172898 171955 170615 169655 169149 168573
52907 168573 167756 167163 167159 167538 168004 168581 169251 169670 169598 169309 169209 169309 169426 169643 170195 171062 172006 172933 173865 174680
52887 174680 175270 175852 176714 177653 178093 177904 177716 178151 179044 179672 179625 179186 178929 179210 180014 181092 182150 183016
52869 183016 183687 184251 184813 185477 186228 186810 186921 186647 186498 186833 187458 188033 188626 189489 190525 191499 192686 194633
52851 194633 197137 199199 200363 201519 203861 207440 211379 215148 218927 222870 226790 230594 234407 238086
52837 238086 241163 243450 245211 246604 247424 247580 247339 246777 245446 242969 239697 236397 233450 230578 227216
52822 227216 223042 218324 213874 210396 207787 205346 202660 199851 196929 193573 189877 186641 184426 182766
52808 182766 180878 178727 176773 175008 172971 170566 168202 166093 164030 161875 159807 158039 156673 155809
52794 155809 155409 155103 154515 153680 152740 151425 149413 147101 145360 144466 143859 143017 141924 140601 138898 137061
52778 137061 135854 135614 135631 134967 133619 132417 131927 131830 131326 129938 127931 126072 124866 124059 123015 121534
52762 121534 119982 118689 117643 116818 116298 115966 115492 114842 114268 113629 112281 109977 107345 105066 103136 101399
52746 101399 100272 100138 100359 99722 97851 95505 93493 91935 90656 89607 88672 87606 86526 86055 86585 87621
52730 87621 88186 87756 86625 85473 84776 84556 84519 84502 84744 85619 87084 88641 89863 90666 90946 90327 88656 86562
52712 86562 85061 84605 84838 85283 85853 86538 87058 87239 87455 88203 89293 90012 90191 90615 92050 94267 96452
52695 96452 98300 100183 102350 104559 106636 108855 111529 114521 117452 120108 122354 123878 124366 123917 123009
52680 123009 122069 121213 120385 119537 118636 117589 116238 114389 111892 108746 105204 101723 98734 96392 94515
52665 94515 92850 91385 90241 89232 87834 85833 83762 82348 81674 81257 80840 80648 80861 81324 81842 82334
52649 82334 82601 82437 82129 82330 83178 83970 84008 83333 82405 81544 81103 81604 83046 84506 85164 85491 86709 89156
52631 89156 91850 93729 94639 94978 94984 94684 94102 93265 92244 91340 90865 90637 90018 88713 87232 86310 86134 86337
52613 86337 86535 86575 86432 86185 86101 86470 87287 88210 88903 89380 89984 91027 92466 93955 95155 95923 96248 96246 96265
52594 96265 96765 97902 99385 100877 102329 103732 104845 105553 106287 107655 109717 111994 114065 115697 116521
52579 116521 116244 115331 114897 115636 117286 119322 121630 124103 126069 126835 126633 126522 127265 128715 130259 131532
52563 131532 132583 133700 135220 137299 139703 141896 143411 144109 144102 143663 143263 143495 144678 146487 148124 148963
52547 148963 149073 149036 149278 149642 149591 148777 147334 145703 144310 143425 143209 143727 144827 146078 146978 147392 147724 148459
52529 148459 149495 150141 149843 148742 147374 146083 145000 144465 144968 146512 148259 149068 148492 147195 146374 146668
52513 146668 147687 148673 149468 150474 151680 152308 151779 150580 149651 149253 149034 149026 149761 151311 152939 153963 154464
52496 154464 154858 155296 155859 156858 158460 160214 161426 161864 161850 161819 162100 162933 164296 165750 166767 167224 167436
52479 167436 167766 168340 169042 169601 169815 169851 170183 171048 172113 172901 173366 173837 174553 175588 177093 179184 181536
52462 181536 183402 184234 184181 183879 183823 184013 184169 184254 184655 185724 187212 188446 189142 189696 190437 190935 190440 188871
52444 188871 186962 185452 184443 183606 182700 181798 181126 180772 180460 179676 178169 176259 174492 173058 171753 170392
52428 170392 169005 167725 166779 166543 167220 168398 169261 169382 169097 168952 169031 168951 168392 167526 166993 167426 168808 170348
52410 170348 171256 171585 171981 172692 173352 173852 174752 176397 178208 179500 180632 182529 185154 187283 188001 187775
52394 187775 187729 188368 189406 190394 191063 191396 191841 193147 195446 197680 198630 198498 198833 200776 203938 207203 209955
52377 209955 212105 213512 214122 214530 215715 218099 221221 224326 226931 228813 229918 230477 231017 232058 233828
52362 233828 236185 238663 240736 242243 243525 244969 246600 248370 250554 253337 256186 258279 259594 260959
52348 260959 262884 264945 266543 267708 268802 269928 271048 272321 273907 275712 277661 279929 282624 285546
52334 285546 288481 291318 293651 294887 295173 295602 296866 298313 299110 299762 301462 304307 307342 310242 313709
52319 313709 317979 322170 325607 328809 332629 337240 342668 349471 357942 367199 376011 384365 393375 403775
52305 403775 415172 426806 438396 450160 462493 475786 490184 505423 521127 537211 553770
52294 553770 570692 587806 605279 623416 642052 660615 678892 697313 716300 735641 754658
52283 754658 772729 789553 805218 820140 834622 848305 860348 870401 879119 887428 895491 902700
52271 902700 908470 912695 915574 917485 919020 920634 921995 922029 919930 915970 911123 906147 901351 897013 893382
52256 893382 890125 886291 881278 875699 870954 867964 866569 866097 866187 866928 868478 870864 874240 879161 886377
52241 886377 896161 907804 920014 932011 944166 957381 971925 987079 1001849 1015764 1028979 1041933
52229 1041933 1054995 1068167 1080911 1092427 1102260 1110506 1117380 1122818 1126653 1128900 1129589 1128564 1125843
52216 1125843 1122100 1118297 1114671 1110350 1104124 1095513 1084970 1073220 1060619 1047096 1032541 1017199
52204 1017199 1001717 986884 973289 961154 950388 940774 932112 924219 916835 909697 902858 896839 892166
52191 892166 888705 885769 882965 880664 879371 879008 879231 880220 882407 885306 887281 886989 884775 882200 880375
52176 880375 879189 878059 876813 875587 874320 872822 871188 869720 868352 866505 863710 860169 856427 852592
52162 852592 848214 843041 837591 832682 828498 824457 820081 815594 811462 807599 803460 798846 794186 789899
52148 789899 785881 781896 778121 774864 771940 768818 765414 762248 759585 756859 753256 748616 743411 738032
52134 738032 732582 727324 722895 719762 717669 715880 713982 712250 711126 710411 709197 706701 703071 699136
52120 699136 695485 692126 689022 686499 684923 684371 684924 686899 690315 694462 698562 702746 707836 714179 721323
52105 721323 728929 737400 747337 758875 771856 786265 802162 819460 838164 858562 880847 904617
52093 904617 929041 953445 977595 1001543 1025372 1049040 1072350 1095160 1117555 1139560 1160707
52082 1160707 1180258 1197963 1214159 1228976 1241879 1252238 1259877 1264828 1267182 1267658 1267685 1268087 1267944 1265573
52068 1265573 1260475 1253629 1245977 1237494 1227869 1217274 1206136 1194749 1183422 1172512 1162013 1151584
52056 1151584 1141324 1132024 1124343 1118125 1112996 1109189 1107198 1106848 1107347 1108271 1110042 1113294 1118134 1124162
52042 1124162 1130955 1138331 1146210 1154416 1162719 1171111 1179906 1189368 1199233 1208807 1217616 1225790 1233702 1241339
52028 1241339 1248136 1253288 1256272 1257245 1257041 1256484 1255614 1253777 1250512 1245993 1240517 1233997 1226267 1217483 1207693
52013 1207693 1196319 1182610 1166575 1148980 1130497 1111315 1091575 1071597 1051483 1030933 1009747
52002 1009747 988143 966354 944236 921586 898535 875264 851599 827358 803026 779510 757112
51991 757112 735096 712544 689386 666437 644556 623983 604327 584979 565604 546378 527723
51980 527723 509732 492048 474518 457747 442582 429064 416338 403731 391523 380370 370366
51969 370366 361109 352408 344349 336718 328971 321016 313575 307419 302534 298340 294495 291079 288134 285442
51955 285442 282827 280327 277885 275164 271879 268201 264690 261865 259952 258845 258047 256786 254557 251695
51941 251695 249122 247310 245709 243401 240144 236434 232700 228899 224917 220940 217246 213959 211201 209197
51927 209197 207980 207276 206875 206809 206957 206834 206167 205356 204914 204734 204396 203948 203682 203308 202082 199830 197136 194465
51909 194465 191796 189292 187566 186897 186756 186562 186347 186271 186047 185397 184542 183634 182140 179524 176314 173732 172356
51892 172356 171754 171317 170790 169998 168685 166853 164861 163060 161642 160792 160529 160349 159568 158161 156922 156658
51876 156658 157512 159094 160827 162109 162619 162656 162827 163248 163411 163004 162505 162715 163977 166000 168185 169915 170877
51859 170877 171402 172321 174274 177212 180594 183797 186270 187709 188398 189137 190504 192207 193367 193343 192245 190775
51843 190775 189701 189329 189398 189508 189594 189789 189965 189887 189780 190243 191378 192500 193022 193210 193712 194732 196041 197496
51825 197496 199022 200309 201017 201202 201180 201030 200635 200119 199857 200019 200388 200619 200446 199710 198490 197180 196211 195669
51807 195669 195344 195039 194683 194277 194000 194147 194664 194909 194303 193168 192540 193138 194820 196959 198978 200542 201678
51790 201678 202829 204504 206709 208865 210325 210795 210419 209783 209794 211150 213765 216873 219667 221661 222744
51775 222744 223328 224372 226633 229782 232693 234707 236240 238131 240908 244794 249810 255633 261817 268442
51761 268442 276099 284992 294556 304147 313512 322151 328874 332690 333752 332833 330248 325986 320658 315428
51747 315428 311013 307375 304385 302106 300310 298432 296272 294256 292751 291594 290563 289866 289772 290078 290328
51732 290328 290375 290373 290422 290606 291293 292958 295530 298171 299946 300685 301005 301445 301760 301312 300127 299133 299168 300042 301002
51713 301002 301819 302800 303764 303738 302047 299237 296429 294007 291435 288290 284992 282342 280637 279408 277990
51698 277990 276179 274304 272747 271496 270260 268943 267785 267045 266755 266918 267796 269803 273166 277747 283161
51683 283161 289022 295168 301694 308598 315348 320968 324732 326617 326952 325798 323005 318840 314234 310159
51669 310159 306777 303295 298826 293412 288090 283785 280296 276696 272712 269196 267049 266089 265366 264279 262930
51654 262930 261554 260119 258462 256370 253494 249586 244905 240037 235257 230433 225588 221107 217273 214051
51640 214051 211562 210230 210060 210225 209869 209051 208397 207996 207312 206094 204703 203357 201670 199337 196906 195365
51624 195365 195033 195232 195112 194580 194287 194758 195634 195918 195022 193461 192305 192058 192385 192913 193793 195209 196734
51607 196734 197671 197903 198033 198661 199906 201656 203988 207065 210790 214680 218130 220818 223002 225433 228840
51592 228840 233446 238928 244674 249932 254016 256799 258984 261457 264291 266745 268272 269079 269485 269274 268146
51577 268146 266380 264534 262724 260794 259018 258014 257934 258370 259199 260867 263597 266806 269729 272275 274869
51562 274869 277729 280740 283832 287042 290239 293175 295855 298594 301666 305045 308454 311466 313626 314725
51548 314725 314983 314843 314627 314510 314670 315145 315603 315585 314982 314117 313328 312724 312239 311568 310066 307159 303122 299128
51530 299128 296216 294349 292681 290589 288209 286039 284268 282608 280673 278483 276488 275060 274060 273063
51516 273063 271916 270783 269682 268380 266814 265273 263972 262790 261612 260609 259858 259038 257921 256914 256595
51501 256595 256854 256992 256713 256500 256881 257778 258822 259910 261156 262514 263790 264987 266442 268555 271378 274348
51485 274348 276521 277369 277489 278300 280837 284943 289704 294432 299052 303755 308669 313853 319344 325124 331146
51470 331146 337383 343746 349969 355740 361004 365993 370869 375398 379075 381616 383289 384660 386017 387208
51456 387208 388088 388880 389766 390274 389586 387571 385031 382650 380129 376769 372567 368148 363788 359167 354103
51441 354103 348842 343455 337594 331259 325271 320361 316163 311787 307230 303440 300869 298757 296252 293684
51427 293684 292107 291869 292277 292606 292850 293323 294036 294807 295679 296879 298462 300284 302264 304458 306836 309121
51411 309121 310810 311300 310162 307534 304206 301032 298165 294973 290703 285114 278572 271786 265504 260193
51397 260193 255801 251852 247834 243509 238922 234287 229842 225646 221521 217328 213238 209522 206125 202755
51383 202755 199374 196235 193377 190543 187652 184950 182465 179826 176978 174579 173156 172206 170811 169001
51369 169001 167834 168090 169379 170583 170679 169090 165867 161836 158222 155770 154342 153399 152595 151885 151432 151551
51353 151551 152458 153946 155613 157443 159757 162479 164941 166658 167903 169179 170550 171827 173056 174372
51339 174372 175664 176861 178393 180810 184080 187655 191212 194885 198809 202795 206521 209686 211958 213091
51325 213091 213180 212562 211404 209564 206853 203246 198911 194220 189715 185729 182054 178237 174161 170113 166268
51310 166268 162459 158560 154841 151755 149438 147527 145452 143005 140613 138899 137850 136740 135126 133611
51296 133611 133178 133953 135102 135836 135991 135703 135177 134857 135270 136414 137717 138769 139600 140126 139953 139106 138420
51279 138420 138668 139641 140554 141027 141190 141113 140736 140273 140089 140181 140133 139627 138637 137187 135349 133550 132430 132205
51261 132205 132365 132182 131370 130251 129383 129026 128864 128269 127024 125665 124885 124712 124596 124239 123880 123665 123190 122025
51243 122025 120477 119412 119315 119775 120034 119854 119666 119891 120375 120603 120346 119878 119616 119763 120318 121164 122099 123026
51225 123026 124231 126159 128720 131109 132588 133151 133240 133125 133023 133457 134857 136806 138269 138719 138642 138796 139444
51208 139444 140446 141717 143273 145042 146862 148517 149666 150027 149808 149709 150194 150916 151163 150799 150495 150968 152165
51191 152165 153324 153788 153704 153860 154840 156401 157762 158420 158497 158357 158112 157615 156796 155817 154880 153928 152616 150691
51173 150691 148319 145924 143714 141658 139984 139226 139453 139774 139169 137667 136248 135649 135736 135946 135767 134837 133196
51156 133196 131641 131217 132089 133380 134329 135072 136028 137085 137856 138300 138568 138614 138447 138412 138668 138679 137847 136471
51138 136471 135462 135157 135010 134514 133816 133266 132794 131958 130417 128206 125799 123898 123000 123111 123964 125286 126578
51121 126578 126983 125994 124233 122907 122424 122102 121427 120949 121495 122961 124468 125502 126368 127477 128580 128982
51105 128982 128352 127196 126454 126675 127639 128841 130152 131808 133922 136328 138826 141178 142835 143204 142462 141714
51089 141714 141946 143103 144548 146104 148124 150609 152853 154146 154510 154544 154796 155431 156342 157336 158308 159348
51073 159348 160623 162117 163651 165240 167199 169638 172005 173465 173758 173444 173273 173594 174418 175686 177173
51058 177173 178431 179191 179729 180532 181642 182662 183325 183616 183387 182317 180473 178511 177059 176161 175476 174683
51042 174683 173533 171974 170544 170215 171304 172827 173505 173249 173088 173702 174669 175245 175290 175125 174961 174856 174986
51025 174986 175574 176596 177722 178539 178826 178642 178180 177480 176437 175215 174397 174395 174874 175204 175444 176366 178383 180919
51007 180919 183089 184714 186366 188601 191360 194089 196335 198287 200662 203921 207767 211662 215636 220106
50993 220106 225056 230011 234919 240488 247378 255503 264344 273537 282908 292334 301892 311850 322303 333120
50979 333120 344438 356792 370597 385959 403240 423279 446665 473215 502495 534448 569219
50968 569219 606935 648121 693729 744167 798726 856581 917827 982819 1050967 1121128 1192848
50957 1192848 1266138 1339992 1412116 1480339 1543537 1601091 1652231 1696184 1732341 1760044 1778863
50946 1778863 1789339 1792857 1790537 1782837 1770368 1754422 1736290 1716784 1696816 1677750 1660453 1644467
50934 1644467 1628759 1613012 1597523 1582121 1565872 1547778 1527099 1502957 1474290 1440521 1402016
50923 1402016 1359665 1314171 1265814 1214683 1161042 1105635 1049713 994641 941360 890293 841809
50912 841809 796597 755378 718236 684428 653044 623853 597369 574097 553948 536431 521161
50901 521161 507925 496499 486674 478384 471576 466082 461843 459070 457906 458029 458871 460020 461139 461797
50887 461797 461892 462025 462942 464752 467259 470727 475518 481079 486291 490939 495903 501713 507930 514322 521610
50872 521610 530362 540048 549993 560541 572427 585624 599772 615292 633073 653344 675787 700590
50860 700590 728496 759872 794585 832841 875430 923179 976830 1037397 1105861 1182483 1267161
50849 1267161 1360515 1463860 1577929 1702246 1835867 1978030 2127850 2284072 2445397 2610392
50839 2610392 2776708 2940778 3098549 3246120 3379737 3495989 3592523 3668067 3721616 3752344
50829 3752344 3760846 3749843 3723007 3683417 3633640 3576859 3517122 3458448 3404039 3356149 3316170
50818 3316170 3284601 3260989 3243698 3229659 3214745 3194898 3167030 3129038 3079501 3017710 2943660
50807 2943660 2857715 2760514 2653403 2538545 2418260 2294556 2169628 2046383 1927978 1816928
50797 1816928 1714892 1622878 1541193 1469562 1407879 1356722 1316627 1287175 1267400 1256994 1256457
50786 1256457 1265978 1284599 1310469 1341509 1375960 1412747 1451326 1490768 1529085 1563921 1593799
50775 1593799 1618212 1636718 1648743 1654354 1654454 1649906 1641062 1628415 1612984 1595482 1575545 1552306
50763 1552306 1525529 1495706 1463250 1428083 1390024 1349333 1306912 1264165 1222542 1183027 1146060
50752 1146060 1111928 1081056 1053868 1030718 1012086 998521 990169 986655 987687 993448 1004137 1019468
50740 1019468 1039086 1063236 1092546 1127309 1167521 1213578 1266361 1326479 1393905 1468596 1550986
50729 1550986 1641376 1738892 1841436 1946786 2053554 2160957 2267683 2371201 2468342 2556518
50719 2556518 2634234 2700373 2753306 2790950 2811625 2814678 2800499 2770434 2726829 2672867 2612019
50708 2612019 2547537 2482390 2419402 2361232 2310094 2267337 2233172 2206817 2187004 2172245 2160499
50697 2160499 2148961 2134840 2116475 2093230 2064191 2027603 1982096 1928058 1867263 1801480 1732219
50686 1732219 1661640 1592720 1528099 1469223 1416824 1371598 1334004 1304029 1281885 1268589 1265257
50675 1265257 1272053 1288533 1314899 1352104 1400679 1460162 1529994 1610264 1701143 1801890 1910664
50664 1910664 2024903 2141606 2257706 2370512 2477534 2575744 2661739 2733247 2790117 2833370
50654 2833370 2863767 2881907 2889084 2886880 2875964 2856229 2828213 2793470 2753272 2707763 2656884 2601612
50642 2601612 2543948 2486113 2430097 2377493 2329389 2286685 2250631 2222502 2202515 2189684 2183031
50631 2183031 2182253 2186691 2194536 2203939 2214398 2225999 2237498 2246344 2250824 2251439 2249935 2247681 2245310 2243302
50617 2243302 2242345 2243339 2247377 2255550 2268552 2286515 2309209 2336088 2366064 2397454 2428329 2456808
50605 2456808 2481211 2500292 2513393 2520045 2519408 2510436 2492626 2466157 2431160 2387270 2334119 2271973
50593 2271973 2201705 2124536 2042087 1956405 1869595 1783490 1699689 1619496 1543530 1471689 1403871
50582 1403871 1340593 1282636 1230221 1182813 1139622 1100133 1064340 1032767 1006104 984519 967358
50571 967358 953700 943105 935708 931760 931380 934616 941468 951899 965985 983876 1005465 1030314 1058255
50558 1058255 1089880 1126169 1167772 1214944 1267849 1326482 1390456 1459530 1534285 1615597 1703224
50547 1703224 1795396 1889962 1985381 2080234 2172342 2258927 2337500 2406271 2464090 2510738 2547364
50536 2547364 2576209 2599686 2619852 2638517 2657192 2676601 2696500 2716325 2735946 2755751 2776285
50525 2776285 2798245 2822809 2851589 2885899 2926049 2971375 3020866 3073702 3129285 3186947 3245598
50514 3245598 3303509 3358379 3407726 3449374 3481550 3502613 3510941 3505285 3485133 3450658 3402498 3341838
50502 3341838 3270604 3191227 3106186 3018068 2930086 2846023 2769256 2701980 2645678 2602008 2572609
50491 2572609 2557859 2556345 2565893 2584822 2611739 2644325 2679007 2712032 2740421 2761530 2772055 2768188
50479 2768188 2746934 2707140 2649288 2574769 2485626 2384726 2275677 2162254 2047717 1934468
50469 1934468 1824246 1718594 1618996 1526407 1440844 1361871 1289543 1224473 1166894 1116182 1071670
50458 1071670 1033421 1001663 975682 953986 935524 920241 908433 900143 895264 893681 894980 898485
50446 898485 903881 911558 922070 935514 951595 969996 990398 1012398 1035731 1060386 1086360 1113590
50434 1113590 1142348 1173322 1206850 1242276 1278486 1314973 1351940 1389547 1427548 1465681 1503900
50423 1503900 1542075 1579837 1616883 1653124 1688345 1722000 1753570 1782977 1810609 1837204 1863819
50412 1863819 1891574 1921048 1952000 1983866 2016467 2050103 2085067 2121206 2157790 2193545 2226966
50401 2226966 2256973 2283436 2306742 2326675 2341882 2350694 2352335 2347095 2335292 2316395 2289310 2253300
50389 2253300 2208390 2155031 2093795 2025505 1951434 1873291 1793119 1713241 1635994 1563333 1496713
50378 1496713 1437297 1386028 1343410 1309546 1284557 1268633 1261444 1261836 1268465 1280442 1296885 1316007
50366 1316007 1335183 1351921 1364384 1371076 1370718 1362678 1347114 1324449 1295091 1259880 1220348 1178172
50354 1178172 1134630 1090775 1047765 1006540 967364 930108 894913 862269 832507 805565 781179
50343 781179 759074 739067 721277 706102 693624 683172 673896 665818 659822 656493 655439 656024 658384
50330 658384 663274 671034 681100 692497 704521 716944 729917 743795 758892 775206 792517 810820
50318 810820 830480 851792 874503 897983 921793 945826 969993 994185 1018710 1044256 1071006
50307 1071006 1098013 1123948 1148403 1171976 1195011 1216789 1236164 1252641 1266515 1278240 1287924
50296 1287924 1295216 1299366 1299590 1295762 1288666 1279413 1268696 1256725 1243476 1228658 1211714 1192405 1171295
50283 1171295 1149144 1125847 1100505 1072691 1043206 1013413 984231 956009 928954 903308 879265
50272 879265 856917 836155 816518 797398 778588 760499 743728 728712 715871 705621 697817 691488
50260 691488 685657 680373 676548 674827 674988 676360 678372 680588 682717 684865 687495 690824 694378 697377
50246 697377 699505 701119 702724 704361 705443 705074 702642 698321 693024 687703 682668 677710 672793 668300
50232 668300 664443 660759 656559 651805 647140 643001 639143 635207 631370 628023 625119 622408 620242 619552
50218 619552 620848 623672 627211 631069 635211 639577 644143 649036 654166 658919 662706 665683 668490 671330
50204 671330 673743 675301 676019 675980 674962 672746 669492 665584 661317 656930 652677 648634 644565 640224 635676
50189 635676 631104 626452 621527 616352 611160 606007 600690 595132 589645 584610 580000 575375 570365 565049
50175 565049 559774 554684 549569 544257 539075 534775 531996 530840 530886 531422 531699 531311 530597 530494 531566 533103
50159 533103 533424 531253 526726 520992 515079 509341 503759 498322 492964 487468 481781 476323 471732 468317
50145 468317 465996 464616 464065 464046 464207 464645 465873 468009 470284 471758 472368 472904 474153 476435 479771 483874
50129 483874 488008 491528 494786 498948 504608 511088 517448 523666 530213 536863 542687 547178 550718 553872
50115 553872 556796 559552 562448 565637 568670 570849 572002 572616 573315 574390 575823 577534 579541 581988 585073
50100 585073 588887 593225 597639 601780 605790 610275 615795 622364 629544 637042 645112 654334 665072 677200
50086 677200 690194 703440 716634 729964 743757 757896 771906 785825 800629 817408 836268
50075 836268 856538 877948 901109 926764 955137 986223 1020252 1057549 1098192 1142188 1189884
50064 1189884 1242045 1299680 1363914 1435723 1515461 1602675 1696507 1796036 1899932 2005995 2111351
50053 2111351 2213008 2307996 2393230 2465945 2524650 2569683 2602891 2626969 2644942 2659675 2673256
50042 2673256 2686545 2699019 2708787 2712710 2706917 2687695 2652255 2599023 2527735 2439657 2337703 2226043
50030 2226043 2109216 1991294 1875471 1764109 1659051 1561905 1474100 1396506 1328916 1269973
50020 1269973 1217922 1171639 1130912 1095719 1065521 1039538 1017453 999282 984529 972039 961016
50009 961016 951697 944564 939112 934030 928464 922520 916437 909823 902091 893312 884269 875706 867726 859813
49995 859813 851331 842074 832416 822891 813532 803903 793894 784259 776010 769352 763524 757765 752109 747004
49981 747004 742456 737985 733500 729827 728099 728814 731738 736514 742931 750592 758874 767423 776387 785906
49967 785906 795801 806110 817528 830770 845670 861481 877921 895321 913831 933192 953479 975411
49955 975411 999593 1026104 1055269 1088336 1126796 1171329 1222005 1279387 1344889 1420088 1506125
49944 1506125 1603773 1713516 1835242 1967974 2110000 2259051 2412189 2565594 2714692 2854920
49934 2854920 2982926 3097455 3199141 3289527 3370484 3444373 3513906 3581163 3646703 3709689 3768281
49923 3768281 3819229 3857498 3877238 3873618 3843857 3787175 3704764 3599886 3477044 3340483 3193642
49912 3193642 3039954 2883312 2727181 2573610 2423581 2278019 2138102 2004859 1878996
49903 1878996 1761158 1652007 1551964 1460902 1378126 1302726 1234179 1172528 1117696 1068708 1024070
49892 1024070 983033 945967 913297 884575 858839 835330 813447 792558 772446 753500 735824
49881 735824 718512 700540 682169 664634 648516 633260 618419 604547 592419 581990 572567 563642
49869 563642 555145 547163 539850 533498 528378 524537 521845 520117 519022 518069 516898 515571 514514 514211 514922
49854 514922 516542 518689 521092 523839 527118 530790 534548 538339 542209 545782 548486 550539 553185 557600
49840 557600 563847 571203 579131 587599 596805 607154 619370 634132 651574 671472 693955 719778
49828 719778 749973 785455 826908 874759 929303 991051 1060915 1139791 1227872 1324453 1428175
49817 1428175 1537149 1648877 1760285 1867842 1967713 2056231 2130875 2190981 2237491 2272306
49807 2272306 2298161 2318684 2337574 2357209 2378029 2398973 2417821 2430986 2433668 2421020 2389423
49796 2389423 2336954 2263364 2170204 2060876 1940112 1813133 1684963 1559905 1441114 1330537
49786 1330537 1229232 1137617 1055443 982033 916906 859975 810870 768373 730960 697801 668798
49775 668798 643698 621691 602057 584792 570172 557881 546914 536391 526184 516665 508077 500492
49763 500492 494234 489818 487120 484909 481729 477260 472481 468450 465359 462855 460781 459152 457736 456219
49749 456219 454714 453699 453374 453368 453163 452565 451738 450984 450532 450352 450125 449587 448927 448692 449277 450664 452599 454782
49731 454782 456883 458610 459929 461040 462042 462777 463128 463287 463570 464060 464628 465231 466008 467003 467859 467896 466633
49714 466633 464356 462079 460735 460293 459838 458624 456902 455663 455728 457248 459829 462751 465156 466445 466826
49699 466826 467231 468376 469940 470985 471204 471482 472986 475871 479152 481791 483634 485269 487260 489664 492076
49684 492076 493857 494475 493889 492777 492201 492863 494547 496231 496858 496177 494862 493761 493084 492514 492018 492052 492832
49667 492832 493825 494371 494605 495280 496803 498854 500883 502562 503705 504225 504338 504545 505235 506435 507972 509578
49651 509578 510831 511382 511360 511217 511086 510641 509721 508636 507604 506348 504672 503083 502317 502466 503040 503757 504730
49634 504730 505961 507179 508273 509441 510731 511841 512557 513066 513596 513984 513909 513455 513190 513668 514997 516888
49618 516888 519018 521307 523851 526695 529808 533309 537535 542694 548538 554547 560398 566050 571416 576292
49604 576292 580744 585396 591161 598673 607934 618366 629227 640137 651256 662880 674930 687009
49592 687009 698973 711157 723979 737505 751568 766141 781423 797584 814576 832222 850490
49581 850490 869656 890112 911901 934592 957800 981795 1007305 1034754 1063903 1094303 1125738
49570 1125738 1158168 1191627 1226382 1262936 1301482 1341468 1381954 1422340 1462600 1502965 1543657
49559 1543657 1584799 1626350 1668065 1709692 1751068 1791918 1831658 1869634 1905419 1938649 1968775
49548 1968775 1995379 2018660 2039156 2056895 2071253 2081813 2088911 2093029 2093954 2091092 2084572 2075640 2065734
49535 2065734 2055358 2044039 2031269 2017305 2003055 1989454 1977147 1966645 1958394 1952487 1948523 1946076
49523 1946076 1945261 1946628 1950538 1956936 1965728 1977054 1991074 2007714 2026726 2047685 2069834 2092241
49511 2092241 2114398 2136495 2158866 2181371 2203523 2224909 2245040 2263034 2277965 2289494 2297651
49500 2297651 2302009 2301689 2296360 2286668 2273347 2256385 2235491 2210906 2183104 2151951 2116895 2078030
49488 2078030 2036369 1992894 1947890 1901411 1853911 1806007 1757957 1709877 1662282 1615966 1571356
49477 1571356 1528313 1486652 1446579 1408492 1372562 1338631 1306407 1275622 1246072 1217635 1190335
49466 1190335 1164394 1140154 1117813 1097241 1078151 1060507 1044571 1030463 1017843 1006215 995419
49455 995419 985556 976567 968141 960073 952443 945436 939218 933993 929957 927062 925004 923412 921910 920081
49441 920081 917758 915369 913598 912568 911791 911141 911359 913159 916231 919749 923655 928702 935236 942648 950311
49426 950311 958442 967616 977865 988903 1001084 1015551 1033211 1053801 1075998 1098070 1118291 1135085
49414 1135085 1147390 1155152 1159466 1162087 1164722 1168572 1174246 1181807 1190943 1201296 1212776 1225495 1239376
49401 1239376 1254064 1269335 1285387 1302433 1320153 1337863 1355187 1372177 1388742 1404374 1418760
49390 1418760 1432349 1445952 1459834 1473417 1485802 1496464 1505618 1514175 1523153 1532848 1542663 1552082
49378 1552082 1561649 1572468 1584738 1597307 1608894 1619329 1629301 1639360 1649629 1660248 1671487 1683399
49366 1683399 1695774 1708553 1721988 1736331 1751657 1768036 1785569 1804101 1823131 1842236 1861496
49355 1861496 1881463 1902877 1926425 1952387 1980310 2009313 2038993 2069816 2102393 2136658 2172226
49344 2172226 2209312 2248678 2290543 2334121 2378553 2423922 2471057 2520553 2572359 2626144 2681674
49333 2681674 2738825 2797540 2857826 2919610 2982555 3046150 3110001 3173881 3237522 3300580 3362833
49322 3362833 3424211 3484466 3542995 3599154 3652684 3703570 3751459 3795421 3834447 3868085 3896416
49311 3896416 3919431 3936734 3948009 3953564 3954114 3950118 3941661 3929069 3913201 3894893 3874424 3851933
49299 3851933 3828191 3804432 3781362 3758777 3736415 3714765 3694738 3676797 3660889 3647180 3636382
49288 3636382 3629167 3625573 3625156 3627491 3632315 3639440 3648887 3661026 3676169 3693979 3713646 3734753 3757563
49275 3757563 3782107 3807362 3831812 3854665 3875968 3895530 3912343 3925274 3933801 3937669 3936232 3928695
49263 3928695 3914902 3895440 3871004 3841952 3808378 3770240 3727485 3680534 3630639 3579367 3527530
49252 3527530 3474933 3421230 3366701 3312080 3258052 3205132 3153645 3103451 3053934 3004627 2955794
49241 2955794 2908172 2862293 2818279 2776126 2735831 2697240 2660022 2623839 2588436 2553769 2520168
49230 2520168 2488215 2458171 2429648 2402146 2375799 2351282 2329084 2309232 2291672 2276451 2263404
49219 2263404 2252070 2242131 2233707 2227066 2222257 2219146 2217533 2217057 2217181 2217511 2218084 2219278 2221529 2225069 2229728
49204 2229728 2234979 2240504 2246716 2254325 2263302 2272759 2282164 2292170 2303766 2317023 2331282 2346305 2362539
49191 2362539 2380256 2399135 2418851 2439416 2460647 2481843 2502386 2522380 2542317 2562385 2582459
49180 2582459 2602528 2622709 2642936 2662976 2682734 2702239 2721345 2739698 2757091 2773655 2789693
49169 2789693 2805443 2820917 2835811 2849639 2862187 2873826 2885167 2896505 2907851 2919408 2931640
49158 2931640 2944775 2958649 2973319 2989514 3008162 3029503 3052951 3077755 3103568 3130412 3158372
49147 3158372 3187492 3217808 3249329 3281913 3315173 3348434 3380811 3411421 3439655 3465311 3488561
49136 3488561 3509844 3529735 3548758 3567244 3585339 3603178 3620952 3638673 3655915 3672036 3686829
49125 3686829 3700739 3714108 3726301 3736079 3743078 3748486 3753838 3759395 3764144 3767172 3768434 3768268 3766975
49112 3766975 3765106 3763405 3761981 3760135 3757610 3755451 3754853 3755540 3756290 3757000 3759094 3763570 3769599 3775669 3781379
49097 3781379 3787360 3793962 3800955 3808306 3816341 3825027 3833800 3842343 3850913 3859611 3867822 3874844 3880785 3886440
49083 3886440 3892392 3898558 3904543 3910155 3915531 3920912 3926304 3931307 3935379 3938343 3940508 3942174 3943185 3943177 3942114
49068 3942114 3940354 3938205 3935578 3932048 3927069 3920235 3911527 3901283 3889728 3876647 3861744 3845234 3827679
49055 3827679 3809177 3789125 3766954 3742847 3717528 3691706 3665888 3640405 3615173 3589590 3563055
49044 3563055 3535596 3507767 3480163 3453382 3428194 3405088 3383605 3362701 3342047 3322502 3304944
49033 3304944 3289053 3273786 3258905 3245495 3234814 3226913 3220617 3214813 3209682 3206512 3206225 3208246 3211128
49020 3211128 3214253 3218395 3224430 3231998 3239991 3248054 3256928 3267323 3278984 3291047 3302822 3314005 3324490
49007 3324490 3334301 3343634 3352653 3361248 3369050 3375726 3381295 3386218 3391031 3395754 3399746 3402424 3404044 3405450
48993 3405450 3407131 3408907 3410568 3412320 3414361 3416417 3418049 3419133 3419668 3419342 3417739 3414853 3411018 3406278
48979 3406278 3400145 3392047 3381865 3370014 3357190 3344106 3331200 3318456 3305537 3292126 3278147 3263649
48967 3263649 3248598 3232818 3216142 3198619 3180521 3162195 3143980 3126327 3109776 3094599 3080626
48956 3080626 3067711 3056271 3046939 3039718 3033983 3029462 3026664 3026054 3027322 3029918 3033854 3039480 3046808 3055685
48942 3055685 3066304 3078864 3092888 3107651 3123354 3141147 3161753 3184689 3209055 3234589 3261654
48931 3261654 3290639 3321767 3355121 3390502 3427464 3465684 3505051 3545324 3586110 3627453 3670010
48920 3670010 3714328 3760305 3807718 3856849 3908070 3961054 4015001 4069577 4125212 4182517 4241868
48909 4241868 4303552 4367882 4435022 4504926 4577502 4652645 4730142 4809756 4891390 4974972 5060261
48898 5060261 5146977 5234969 5324022 5413667 5503505 5593547 5683766 5773477 5861698 5948108 6033056
48887 6033056 6116433 6197107 6273746 6345712 6412875 6474987 6531719 6583058 6629241 6670428 6706680
48876 6706680 6737925 6763536 6782208 6792849 6795589 6791482 6781258 6764802 6741848 6712624 6677561 6636844
48864 6636844 6590570 6539123 6483122 6423174 6359828 6293526 6224390 6152276 6077324 6000190 5921427
48853 5921427 5840922 5758432 5674588 5590762 5507873 5425830 5344378 5263961 5185378 5108956 5034556
48842 5034556 4962188 4892191 4824900 4760587 4699635 4642294 4588228 4536834 4488145 4443053 4402436
48831 4402436 4366400 4334570 4306692 4282637 4262154 4245081 4231622 4222012 4216051 4213381 4214155 4218986
48819 4218986 4228165 4241291 4257718 4277053 4299161 4324053 4351878 4382708 4416154 4451457 4488128
48808 4488128 4526188 4565638 4606079 4647268 4689674 4733926 4779797 4826328 4873067 4920606 4969548
48797 4969548 5019398 5069077 5118400 5168418 5220171 5273560 5327733 5382171 5436983 5492414 5548634
48786 5548634 5605990 5664852 5725007 5785595 5845938 5906055 5966101 6025642 6083906 6140507 6195483
48775 6195483 6248726 6299769 6347955 6392407 6432031 6466090 6494702 6518229 6536239 6547855 6553197
48764 6553197 6553564 6549754 6540935 6525861 6504633 6478496 6448235 6413606 6374247 6330356 6282305 6230180
48752 6230180 6173925 6113548 6049038 5980335 5907486 5830664 5750207 5667018 5582820 5499358 5417218
48741 5417218 5335890 5255187 5176169 5100428 5028860 4961447 4897857 4837842 4781235 4727985 4678304
48730 4678304 4632584 4591105 4553747 4519922 4488884 4460357 4434844 4412972 4394580 4378872 4365522
48719 4365522 4355042 4347803 4343234 4340474 4339496 4341113 4346077 4354555 4366235 4380447 4396326 4413349 4431697
48706 4431697 4451819 4473748 4497182 4521995 4548187 4575556 4604047 4634360 4667524 4703808 4742727
48695 4742727 4784241 4829276 4878637 4931987 4988387 5047412 5109189 5173604 5240090 5308141 5377511
48684 5377511 5447788 5518179 5587888 5656587 5724344 5791135 5856465 5919424 5979115 6034968 6086605
48673 6086605 6133535 6175227 6211452 6242290 6267752 6287640 6301751 6309871 6311580 6306556 6295276 6278945
48661 6278945 6258399 6233433 6203476 6168446 6128491 6083320 6032489 5976176 5915130 5850004 5781329
48650 5781329 5709945 5636776 5562119 5485732 5407613 5328000 5246600 5162744 5076694 4990097 4904596
48639 4904596 4820518 4737420 4655360 4574892 4496217 4419177 4344052 4271572 4201983 4134669 4068939
$$ [...]
##END NTUPLES=NMR SPECTRUM
##END=
