
##TITLE=AC1172_Tolima-ibage-TFiAH12005_7180122_D8ISGGaKJD
##JCAMPDX= 6.0         $$ Bruker NMR JCAMP-DX V2.0
##DATA TYPE= NMR SPECTRUM
##DATA CLASS= NTUPLES
##ORIGIN= BRUKER
##OWNER= Administrator
$$ 1.72 TOPSPIN		Version 2.1
$$ 2012-12-04 21:50:35.422 -0500  Administrator@X
$$ Compression mode = diff/dup
##.OBSERVE FREQUENCY= 400.02188249412
##.OBSERVE NUCLEUS= ^1H
##.ACQUISITION MODE= SIMULTANEOUS (DQD)
##.ACQUISITION SCHEME= undefined
##.AVERAGES= 64
##.DIGITISER RES= 22
##SPECTROMETER/DATA SYSTEM= spect
##.PULSE SEQUENCE= noesygpps1d.comp
##.SOLVENT NAME= COFFEE_meoh
##.SHIFT REFERENCE= INTERNAL, COFFEE_meoh, 1, 14.9609
##AUDIT TRAIL= $$ (NUMBER, WHEN, WHO, WHERE, PROCESS, VERSION, WHAT)
$$ ##TITLE= Audit trail, TOPSPIN		Version 2.1
$$ ##JCAMPDX= 5.01
$$ ##ORIGIN= Bruker BioSpin GmbH
$$ ##OWNER= Administrator
$$ $$ E:\/data/COFFEE/nmr/AC1172_Tolima-ibage-TFiAH12005_7180122_D8ISGGaKJD/12/pdata/1/auditp.txt
$$ ##AUDIT TRAIL=  $$ (NUMBER, WHEN, WHO, WHERE, PROCESS, VERSION, WHAT)
(   1,<2012-12-04 21:50:29.359 -0500>,<Administrator>,<X>,<go>,<TOPSPIN 2.1>,
      <created by zg
	started at 2012-12-04 21:38:59.156 -0500,
	POWCHK enabled, PULCHK disabled,
       configuration hash MD5:
       86 BA 57 50 F2 9D 5C 9B 26 00 A9 28 5F 66 2E 89
       data hash MD5: 64K
       E4 D6 7C 3E 57 14 16 0A 3F B2 51 0D D1 D2 EB 2E>)
(   2,<2012-12-04 21:50:32.578 -0500>,<Administrator>,<X>,<proc1d>,<TOPSPIN 2.1>,
      <Start of raw data processing
       efp LB = 0.3 FT_mod = 6 PKNL = 1 PHC0 = 0 PHC1 = 0 SI = 128K 
       data hash MD5: 128K
       79 74 DA 2E 25 B0 C7 14 E7 58 13 28 39 D7 E1 35>)
(   3,<2012-12-04 21:50:33.656 -0500>,<Administrator>,<X>,<proc1d>,<TOPSPIN 2.1>,
      <pk PHC0 = -75.18494 PHC1 = 0 
       data hash MD5: 128K
       92 2F CA 69 FB 29 F3 A2 BB FE 8F 54 81 62 CB CC>)
(   4,<2012-12-04 21:50:34.359 -0500>,<Administrator>,<X>,<proc1d>,<TOPSPIN 2.1>,
      <abs ABSG = 1 
       data hash MD5: 128K
       A8 77 CD 77 C0 C7 8A 45 F5 96 04 F9 E4 4C 5B DD>)
(   5,<2012-12-04 21:50:34.547 -0500>,<Administrator>,<X>,<proc1d>,<TOPSPIN 2.1>,
      <abs ABSG = 2 
       data hash MD5: 128K
       4A 8E EB 94 EF BD 80 3D BD FE 97 1B 7E CA 51 6F>)
(   6,<2012-12-04 21:50:34.734 -0500>,<Administrator>,<X>,<proc1d>,<TOPSPIN 2.1>,
      <abs ABSG = 3 
       data hash MD5: 128K
       5A 0B FA 94 7E 59 D9 1D D2 34 CF DF 39 4A 2A 7F>)
(   7,<2012-12-04 21:50:34.906 -0500>,<Administrator>,<X>,<proc1d>,<TOPSPIN 2.1>,
      <abs ABSG = 4 
       data hash MD5: 128K
       ED 04 D0 FF 71 F5 54 B2 EC 59 36 77 9A 17 4A E8>)
(   8,<2012-12-04 21:50:35.062 -0500>,<Administrator>,<X>,<proc1d>,<TOPSPIN 2.1>,
      <abs ABSG = 5 
       data hash MD5: 128K
       AB F8 82 79 C2 E1 AB 92 C3 0D 37 DF 09 08 EC D4>)
$$ ##END=
$$ 
$$ $$ hash MD5
$$ $$ 2D 1C 34 4D 65 A3 E6 A2 63 55 D6 EF 73 69 78 98
##$RELAX= 
##$RELAX= 
##$RELAX= 
##$RELAX= 
##$RELAX= 
##$RELAX= 
##$RELAX= 
##$RELAX= 
$$ Bruker specific parameters
$$ --------------------------
##$DU= <E:\>
$$ [...]
150 150 150 150 150 150 150 150
##$TP07= 0
##$TPNAME0= <>
##$TPNAME1= <>
##$TPNAME2= <>
##$TPNAME3= <>
##$TPNAME4= <>
##$TPNAME5= <>
##$TPNAME6= <>
##$TPNAME7= <>
##$TPOAL= (0..7)
0.5 0.5 0.5 0.5 0.5 0.5 0.5 0.5
##$TPOFFS= (0..7)
0 0 0 0 0 0 0 0
##$TUNHIN= 0
##$TUNHOUT= 0
##$TUNXOUT= 0
##$USERA1= <user>
##$USERA2= <user>
##$USERA3= <user>
##$USERA4= <user>
##$USERA5= <user>
##$V9= 5
##$VALIST= <valist>
##$VCLIST= <CCCCCCCCCCCCCCC>
##$VD= 0
##$VDLIST= <DDDDDDDDDDDDDDD>
##$VPLIST= <PPPPPPPPPPPPPPP>
##$VTLIST= <TTTTTTTTTTTTTTT>
##$WBST= 2048
##$WBSW= 25
##$XGAIN= (0..3)
0 0 0 0
##$XL= 0
##$YL= 0
##$YMAX_a= 6134669
##$YMIN_a= -12230324
##$ZGOPTNS= <>
##$ZL1= 120
##$ZL2= 120
##$ZL3= 120
##$ZL4= 120
##$ABSF1= 14.9609
##$ABSF2= -5.597281
##$ABSG= 5
##$ABSL= 3
##$ALPHA= 0
##$AQORDER= 0
##$ASSFAC= 0
##$ASSFACI= 0
##$ASSFACX= 0
##$ASSWID= 0
##$AUNMP= <proc_prof1d_extract.lims>
##$AXLEFT= 0
##$AXNAME= <>
##$AXNUC= <1H>
##$AXRIGHT= 0
##$AXTYPE= 0
##$AXUNIT= <>
##$AZFE= 0.1
##$AZFW= 0.1
##$BCFW= 0
##$BC_mod= 0
##$BYTORDP= 0
##$COROFFS= 0
##$CY= 15
##$DATMOD= 1
##$DC= 0
##$DFILT= <>
##$DTYPP= 0
##$F1P= 0
##$F2P= 0
##$FCOR= 0.5
##$FTSIZE= 131072
##$FT_mod= 6
##$GAMMA= 0
##$GB= 0
##$INTBC= 1
##$INTSCL= 1
##$ISEN= 128
##$LB= 0.3
##$LEV0= 0
##$LPBIN= 0
##$MAXI= 10000
##$MC2= 0
##$MEAN= 0
##$ME_mod= 0
##$MI= 0
##$NCOEF= 0
##$NC_proc= -2
##$NLEV= 6
##$NOISF1= 0
##$NOISF2= 0
##$NSP= 0
##$NTH_PI= 0
##$NZP= 0
##$OFFSET= 14.9609
##$PC= 1
##$PHC0= -75.18494
##$PHC1= 0
##$PH_mod= 1
##$PKNL= yes
##$PPARMOD= 0
##$PPDIAG= 0
##$PPIPTYP= 0
##$PPMPNUM= 2147483647
##$PPRESOL= 1
##$PSCAL= 4
##$PSIGN= 0
##$PYNMP= <proc.py>
##$REVERSE= no
##$SF= 400.020009678398
##$SI= 131072
##$SIGF1= 0
##$SIGF2= 0
##$SINO= 400
##$SIOLD= 131072
##$SPECTYP= <>
##$SREGLST= <1H.CDCl3>
##$SSB= 0
##$STSI= 131072
##$STSR= 0
##$SW_p= 8223.68421052631
##$SYMM= 0
##$S_DEV= 0
##$TDeff= 65536
##$TDoff= 0
##$TI= <>
##$TILT= no
##$TM1= 0
##$TM2= 0
##$TOPLEV= 0
##$USERP1= <user>
##$USERP2= <user>
##$USERP3= <user>
##$USERP4= <user>
##$USERP5= <user>
##$WDW= 1
##$XDIM= 131072
##$YMAX_p= 432907337
##$YMIN_p= -11206
##$CURPLOT= <Network HP LaserJet P1505>
##$CURPRIN= <$Network HP LaserJet P1505>
##$DFORMAT= <normdp>
##$LAYOUT= <+/1D_H.xwp>
##$LFORMAT= <normlp>
##$PFORMAT= <normpl>
##$SURQMSG= 1
$$ End of Bruker specific parameters
$$ ---------------------------------
##NTUPLES= NMR SPECTRUM
##VAR_NAME=  FREQUENCY,     SPECTRUM/REAL,   SPECTRUM/IMAG
##SYMBOL=    X,             R,               I
##VAR_TYPE=  INDEPENDENT,   DEPENDENT,       DEPENDENT
##VAR_FORM=  AFFN,          ASDF,            ASDF
##VAR_DIM=   131072,        131072,          131072
##UNITS=     HZ,            ARBITRARY UNITS, ARBITRARY UNITS
##FACTOR=    0.0627417313425164, 1,          1
##FIRST=     8223.62146879497, -584,         -58070
##LAST=      0,             761,             -58682
##MIN=       0,             -11206,          0
##MAX=       8223.62146879497, 432907337,    0
$$ Real data points
##PAGE= N=1
##DATA TABLE= (X++(R..R)), XYDATA
$$ [...]
63944A434013J38212J51503J63540J73476J81305J87390J91658J93536J92388
63935C007021J87550J78259J64155J45704J23705R8589P0759M1359J1880j6939
63925D012042m5121p2408r7952j21143j41795j59245j72203j80073j83841j84950
63915B653311j83781j79827j72957j63784j53002j41049j28415j15690j03281
63906A311525r1443q0640p1377o3525n6242m8830m1580l5522l1266k8243k5205
63895G37652k1560j7971j5482j4287j3700j3174j2693j2174j1145r375p263n270
63883E83558l343j291P89K839N127P685R928J1471J2974J5379J8530K1261K2876
63870G07783K3809K4822K6137K7511K8637K9259K9278K8797K7863K6271K3991
$$ y = [1434013, 1572225, 1723728, 1887268, 2060744, 2242049, 2429439, 2621097, 2814633, 3007021, 3194571, 3372830, 3536985, 3682689, 3806394, 3904983, 3975742, 4017101, 4028981, 4012042, 3966921, 3894513, 3796561, 3675418, 3533623, 3374378, 3202175, 3022102, 2838261, 2653311, 2469530, 2289703, 2116746, 1952962, 1799960, 1658911, 1530496, 1414806, 1311525, 1220082, 1139442, 1068065, 1004540, 948298, 899468, 857888, 822366, 791100, 762857, 737652, 716092, 698121, 682639, 668352, 654652, 641478, 628785, 616611, 605466, 596091, 588828, 583558, 580215, 578924, 579713, 582552, 587679, 595364, 605292, 616763, 629737, 645116, 663646, 684907, 707783, 731592, 756414, 782551, 810062, 838699, 867958, 897236, 926033, 953896, 980167, 1004158]
63859A004158K1514J9221J6640J3087Q925N291K402r41n714j1271j6132j9627
63847A037553k2192k4507k6876k9229l1199l2367l2759l2928l3304l3690l3687
63836G04815l3251l2496l1260k9352k7051k4958k3389k2265k1435k0723j9777
63825D18858j8239j6186j4086j2326j0980r964r142q321p354o348n622n439n765
63812B89086o218o303n789m936m194l781l662l799l999l707k574j297j102k110
63798B35615k968k625j707j427j805j977j834k093k766k815j724m33j48q40j586
63783B08867j848j754j475j005n02l04m72o65n92l98m58q79j261j118n06o3j86
63766A95381m12LR74J555J164K54m44q16j114j241q72j32M46O31O96Q33Q11M39
$$ y = [1004158, 1025672, 1044893, 1061533, 1074620, 1083545, 1088836, 1091238, 1090297, 1084583, 1073312, 1057180, 1037553, 1015361, 990854, 963978, 934749, 903550, 871183, 838424, 805496, 772192, 738502, 704815, 671564, 639068, 607808, 578456, 551405, 526447, 503058, 480793, 459358, 438635, 418858, 400619, 384433, 370347, 358021, 347041, 337077, 327935, 319614, 312260, 305912, 300290, 294851, 289086, 282868, 276565, 270776, 265840, 261646, 257865, 254203, 250404, 246405, 242698, 240124, 238827, 237725, 235615, 232647, 230022, 228315, 226888, 225083, 223106, 221272, 219179, 216413, 213598, 211874, 211441, 211293, 210453, 208867, 207019, 205265, 203790, 202785, 202283, 201979, 201507, 200842, 200250, 199852, 199394, 198515, 197254, 196136, 195630, 195567, 195381, 194969, 194972, 195946, 197501, 198665, 198919, 198475, 197659, 196545, 195304, 194432, 194300, 194746, 195377, 196073, 196906, 197717, 198156]
63748A98156ML1P03J662K323K339J861J394J315J526J642J504J246R86P40O65
63732B18097J050J857K604K952L150L553L987M027L784L829M267M525M247L812
63718B65741L606L290K441J460J069J034L35j292k795l215k946l046l739m253
63704B57690l895k718j235jN87N04K42L84J010J713K111K159K041K067K485L140
63688B68284L465L155K610K352K249J854J308J117J093M17j068k292k190r41L68
63673B81781R67R32Q49J243K037K473J898P92M09J150J951J683M80q72k178l609
63657B91986m783n018m416l784l505l291l001k901k969k721j993j237q09m88l1
63642B51039L50M45M67P04J079J364J522J583J601J927L065M863O350O789O563
$$ y = [198156, 198160, 198191, 198894, 200556, 202879, 205218, 207079, 208473, 209788, 211314, 212956, 214460, 215706, 216692, 217432, 218097, 219147, 221004, 223608, 226560, 229710, 233263, 237250, 241277, 245061, 248890, 253157, 257682, 261929, 265741, 269347, 272637, 275078, 276538, 277607, 278641, 278976, 277684, 274889, 271674, 268728, 265682, 261943, 257690, 253795, 251077, 249842, 249841, 250428, 250932, 251174, 251558, 252568, 254281, 256392, 258551, 260592, 262659, 265144, 268284, 271749, 274904, 277514, 279866, 282115, 283969, 285277, 286394, 287487, 287904, 286836, 284544, 282354, 281413, 281781, 282748, 283680, 284529, 285772, 287809, 290282, 292180, 292972, 293381, 294531, 296482, 298165, 298645, 297773, 295595, 291986, 287203, 282185, 277769, 273985, 270480, 267189, 264188, 261287, 258318, 255597, 253604, 252367, 251558, 251070, 251039, 251389, 251834, 252301, 253005, 254084, 255448, 256970, 258553, 260154, 262081, 265146, 270009, 276359, 283148, 289711]
63627B89711O541O945P368P607P850Q190Q594R384J1095J3635J6128J7810J8843
63614D29701J9893K1266K2688K3922K5168K6751K8468K9462K8927K6893K4097
63603G07236K1011J7332J2601P119J825k512n689p678q399q001p102o530o866
63590G14347q281j0559j3270j6075j8909k1674k3830k4636k3904k2222k0322j8520
63578D92145j6855j5416j4162j2677j0578q046n625l475j236J270L500M705M826
63565D18376M628M984O144P717R148J0172J0901J1681J2728J3912J4929J5864
63553E41184J7376K0088K3778K7522L0712L3604L6660L9527M0953L9540L4400
63542H85344K5526J4107K487o821j2526j4947j5185j4238j2797j1259r645p890
$$ y = [289711, 296252, 303197, 310565, 318172, 326022, 334212, 342806, 352190, 363285, 376920, 393048, 410858, 429701, 449594, 470860, 493548, 517470, 542638, 569389, 597857, 627319, 656246, 683139, 707236, 728247, 745579, 758180, 765299, 767124, 764612, 758923, 751245, 742846, 734845, 727743, 721213, 714347, 706066, 695507, 682237, 666162, 647253, 625579, 601749, 577113, 553209, 530987, 510665, 492145, 475290, 459874, 445712, 433035, 422457, 414411, 408786, 405311, 404075, 405345, 408845, 413550, 418376, 423004, 427988, 434132, 441849, 450997, 461169, 472070, 483751, 496479, 510391, 525320, 541184, 558560, 578648, 602426, 629948, 660660, 694264, 730924, 770451, 811404, 850944, 885344, 910870, 924977, 927464, 920643, 908117, 893170, 877985, 863747, 850950, 839691, 830046, 822156]
63530H22156o460o348q155j1494j5573j9921k4150k7465k9139k9424k9280k9196
63518E85551k8812k7748k6133k4223k2041j9783j7969j6744j5425j3325j0810
63507C62538q959q263q157p830p013n879m663l637l087k949k670j843q44m47p70
63492B95527j014n20K99M68k29q83n41P16K054K901L315L548L687L794M005M374
63476C21501M800N156N189M415K533J53j508j967k148l157m746n638n292m579
63462C14712m545n083n235m401k881j420n62l13j42N92J971L345M020M015L908
63447C07981M173M962O424Q649J1274J3598J5356J7049J9236K1831K4440K7074
63435D82047K9944L2496L3260L0974K5683J8630J1343N072P50j103o82J238L920
$$ y = [822156, 815696, 809348, 801193, 789699, 774126, 754205, 730055, 702590, 673451, 644027, 614747, 585551, 556739, 528991, 502858, 478635, 456594, 436811, 418842, 402098, 386673, 373348, 362538, 353579, 345316, 337159, 329329, 322316, 316437, 311774, 308137, 305050, 302101, 299431, 297588, 296744, 296297, 295527, 294513, 293993, 294292, 294760, 294531, 293648, 293107, 293823, 295877, 298778, 302093, 305641, 309328, 313122, 317127, 321501, 326301, 331457, 336646, 341061, 343594, 343747, 342239, 340272, 338124, 334967, 330221, 324583, 319291, 314712, 310167, 305084, 299849, 295448, 292567, 291147, 290585, 290272, 290130, 290722, 292693, 296038, 300058, 304073, 307981, 312154, 317116, 323540, 332189, 343463, 357061, 372417, 389466, 408702, 430533, 454973, 482047, 511991, 544487, 577747, 608721, 634404, 653034, 664377, 669449, 670199, 669096, 668414, 669652, 673572]
63422F73572P139J0961J5232J9516K3508K7283L0894L3803L4906L3351K9194K3186
63410I62545J6038Q263O75n542r556j1492j1948j1319j0001q940r250j1171j4092
63397H84210j7620k1936k6773l0857l2972l3201l2511l1484l0076k8324k6501
63386E71955k4570k2198j9381j6524j3872j1359r106p403o086m524k480m54J099
63373D35097K393L847N478P122Q841J0721J2613J4418J6317J8392K0392K2196
63361E77827K4102K6349K8725L1002L3279L5408L6585L6136L4276L1407K7154
63350I22250K0986J3549O397M99m216p916j0456j1923j2654j2577j1498j0294
63338H82147j0692j3382j7222k0836k4100k7371l0165l1542l1287k9776k7154
$$ y = [673572, 680711, 691672, 706904, 726420, 749928, 777211, 808105, 841908, 876814, 910165, 939359, 962545, 978583, 986846, 987521, 981979, 972423, 960931, 948983, 937664, 927663, 918723, 909473, 898302, 884210, 866590, 844654, 817881, 787024, 754052, 720851, 688340, 656856, 626780, 598456, 571955, 547385, 525187, 505806, 489282, 475410, 464051, 454945, 447542, 441456, 436932, 434452, 433998, 435097, 437490, 441337, 446815, 453937, 462778, 473499, 486112, 500530, 516847, 535239, 555631, 577827, 601929, 628278, 657003, 688005, 721284, 756692, 793277, 829413, 863689, 895096, 922250, 943236, 956785, 963182, 963681, 959465, 951549, 941093, 929170, 916516, 903939, 892441, 882147, 871455, 858073, 840851, 820015, 795915, 768544, 738379, 706837, 675550, 645774, 618620]
63327F18620k3531j9688j6496j3718j0240n649r62K223K718P3n207j1496j6764
63314D99883j9870k1014k0876j9799j7880j5392j2810j0568q893p688o625n563
63302C32905m782m524m510m253l732l292l040k794k529k406k346k145j905j843
63288B88804j747j215m04M7p5m31q47j427j887j647q18k31j81m7M94P94L66j95
63270B79353j87Q8M2m8M12J136J403J302J491J966K146K025K171K552K451J735
63254C00038J232J581K517L571M617N445N640N324N329O142P359Q547R923J1646
63240C78911J3110J3712J3837J4400J5710J7415J9190K0877K2208K3034K3678
63229E76082K4398K4772K4223K3038K2082K1539K0797J9720J9202K0040K1834
$$ y = [618620, 595089, 575401, 558905, 545187, 534947, 529298, 528336, 530559, 533277, 533350, 528143, 516647, 499883, 480013, 458999, 438123, 418324, 400444, 385052, 372242, 361674, 352781, 345093, 338468, 332905, 328123, 323599, 319089, 314836, 311104, 307812, 304772, 301978, 299449, 297043, 294697, 292552, 290647, 288804, 287057, 285842, 285438, 285485, 285410, 284979, 284132, 282705, 280818, 279171, 278353, 278122, 277941, 277894, 278388, 279182, 279548, 279353, 279166, 279254, 279296, 279248, 279660, 280796, 282199, 283501, 284992, 286958, 289104, 291129, 293300, 295852, 298303, 300038, 301270, 302851, 305368, 308939, 313556, 319001, 324641, 329965, 335294, 341436, 348795, 357342, 367265, 378911, 392021, 405733, 419570, 433970, 449680, 467095, 486285, 507162, 529370, 552404, 576082, 600480, 625252, 649475, 672513, 694595, 716134, 736931, 756651, 775853, 795893, 817727]
63218H17727K3527K4581K5045K4755K3183K0173J6381J2679R275N653J245l993
63206A000231r695j5558k1447k7002l1420l3877l4191l2954l0988k8751k6262
63195G08086k3359j9980j6321j2792r744p114m426j292K066N049P469R892J2870
63182F50404J6028J8292J9163J9318J9677K0312K0656K0508K0141J9622J8744
63171H62865J7696J7104J7026J6598J5053J2593R712O201J545l992r436j4249
63159I48716j8725k3219k7513l1039l3326l4173l3824l2953l2053l0837k8764
63148F22290k6076k3641k1661j9367j6383j3601j2054j1487j0788r512q168p165
63136D42387o350n610n160m943m366l068j505l77K57Q49J518J914J860J689J751
$$ y = [817727, 841254, 865835, 890880, 915635, 938818, 958991, 975372, 988051, 997326, 1002979, 1004224, 1000231, 990536, 974978, 953531, 926529, 895109, 861232, 827041, 794087, 763099, 734348, 708086, 684727, 664747, 648426, 635634, 625890, 618776, 614350, 613058, 615124, 620173, 627642, 637534, 650404, 666432, 684724, 703887, 723205, 742882, 763194, 783850, 804358, 824499, 844121, 862865, 880561, 897665, 914691, 931289, 946342, 958935, 968647, 974848, 976393, 972401, 962965, 948716, 929991, 906772, 879259, 848220, 814894, 780721, 746897, 713944, 681891, 651054, 622290, 596214, 572573, 550912, 531545, 515162, 501561, 489507, 478020, 467232, 457720, 449552, 442387, 436037, 430427, 425267, 420324, 415958, 412890, 411385, 411008, 411265, 412114, 413632, 415546, 417406, 419095, 420846]
63121D20846J896J737J296J029J285J910K500K821K894K819K723K793L120L508
63107D53177L656L494L194K838K303J532P24J28j59j18K01M94K50o80j708k000
63091D67326j323k17N55N95N5m59l09N40J382J566J393J756K956M277M942M957
63075D89992M851M977N378O025O832P659Q573R876J1521J2870J3421J3561J4106
63062F09642J5308J6916J8971K1805K5179K8194L0423L2497L5181L8422M1717
63051I14255M4929M8088N0779N2473N3294N3867N4407N4599N4403N4284N4456
63040A489834N4493N4085N3668N3832N4421N4711N4331N3448N2011M9344M4724
63029B068902L8174L0302K1479J1436j59j2894k5651l7477m8151n7683o5521p0696
$$ y = [420846, 422742, 424479, 425775, 426804, 428089, 429999, 432499, 435320, 438214, 441033, 443756, 446549, 449669, 453177, 456833, 460327, 463521, 466359, 468662, 470194, 470918, 471046, 470887, 470769, 470970, 471464, 471714, 471034, 469326, 467326, 466003, 465786, 466341, 466936, 466991, 466532, 466223, 466763, 468145, 469711, 471104, 472860, 475816, 480093, 485035, 489992, 494843, 499820, 505198, 511223, 518055, 525714, 534287, 544163, 555684, 568554, 581975, 595536, 609642, 624950, 641866, 660837, 682642, 707821, 736015, 766438, 798935, 834116, 872538, 914255, 959184, 1007272, 1058051, 1110524, 1163818, 1217685, 1272092, 1326691, 1381094, 1435378, 1489834, 1544327, 1598412, 1652080, 1705912, 1760333, 1815044, 1869375, 1922823, 1974834, 2024178, 2068902, 2107076, 2137378, 2158857, 2170293, 2170134, 2157240, 2131589, 2094112, 2045961, 1988278, 1922757, 1852061]
63017A852061p2835p2631p1133o8744o5143n9988n3442m6045l8326l0617k3108
63006A250049j5994r453l459K341Q304J4311J9747K4054K7180K9497L1479L3501
62994A411557L5616L7362L8030L7387L6008L4624L3382L1976L0248K8173K5348
62983A779711K1069J5070P879J94p835j6494k5876l5497m4465n1888n7374o1196
62971A523298o3948o5852o6458o5188o2097n8003n3810m9899m6102m2231l8379
62960I11331l4781l1502k8481k5797k3668k2111k0830j9557j8321j7256j6339
62949F52688j5524j4896j4430j3835j2995j2379j2500j2981j2745j1324r508q342
62937E01229p904p438o500n447m837m711m666m407l987l514k877j900p77q4j32
$$ y = [1852061, 1779226, 1706595, 1635462, 1566718, 1501575, 1441587, 1388145, 1342100, 1303774, 1273157, 1250049, 1234055, 1224602, 1221143, 1223484, 1231788, 1246099, 1265846, 1289900, 1317080, 1346577, 1378056, 1411557, 1447173, 1484535, 1522565, 1559952, 1595960, 1630584, 1663966, 1695942, 1726190, 1754363, 1779711, 1800780, 1815850, 1823729, 1823923, 1816088, 1799594, 1773718, 1738221, 1693756, 1641868, 1584494, 1523298, 1459350, 1393498, 1327040, 1261852, 1199755, 1141752, 1087942, 1038043, 991941, 949710, 911331, 876550, 845048, 816567, 790770, 767102, 744991, 724161, 704604, 686283, 669027, 652688, 637164, 622268, 607838, 594003, 581008, 568629, 556129, 543148, 530403, 519079, 509571, 501229, 493325, 485887, 479387, 473940, 469103, 464392, 459726, 455319, 451332, 447818, 444941, 443041, 442264, 442180, 442048]
62922D42048n06n99n25j070k548m091m429l226j374m5K25l22j099j609j747j812
62906D17271k195k870l307k963j889p66l27o82j246j248l46J113K303K443J433
62891D06724M7p25o70m72o85r27n27L39P56L40k09m3P87J549J682J201M33k26
62873D09374m95m04k89m28p43r50q74n17j8L56L77J17j19j80j39M9N33J155J442
62854D08247J282J135J316J522J418J256J361J443J028L53P6K25J31n22j216j387
62838D17668j162j060j277j490j221l02Q79J601J537J126R93J176J305J324J502
62823D22599J824J989K062K482L255L761L647L369L487L799L637K801J851J566
62809D62129K239L422M339M801N506P035Q688R085Q085P269Q056J0009J1642J2337
$$ y = [442048, 441542, 440943, 440418, 439348, 436800, 432709, 428280, 425054, 423680, 423635, 423860, 423538, 422439, 420830, 419083, 417271, 415076, 412206, 408899, 405936, 404047, 403281, 402954, 402272, 401026, 399778, 399432, 400545, 402848, 405291, 406724, 406771, 406046, 405376, 404904, 404219, 403292, 402765, 403104, 403860, 404200, 403991, 403948, 404735, 406284, 407966, 409167, 409600, 409374, 408879, 408475, 408186, 407758, 407015, 406065, 405191, 404674, 404656, 405012, 405389, 405506, 405387, 405207, 405068, 405117, 405650, 406805, 408247, 409529, 410664, 411980, 413502, 414920, 416176, 417537, 418980, 420008, 420361, 420437, 420662, 420793, 420271, 419055, 417668, 416506, 415446, 414169, 412679, 411458, 411156, 412035, 413636, 415173, 416299, 417292, 418468, 419773, 421097, 422599, 424423, 426412, 428474, 430956, 434211, 437972, 441619, 444988, 448475, 452274, 455911, 458712, 460563, 462129, 464368, 467790, 472129, 476930, 482436, 489471, 498159, 507244, 515329, 522598, 530654, 540663, 552305, 564642]
62795E64642J2690J3318J4251J5471J7264J9797K2809K6001K9393L3230L7723
62784H06589M2905M8550N4234N9710O5138P0765P6446Q1730Q6239Q9658R1587
62773A573551R1798R0486Q7770Q2883P4578O2552M8064L2822J7587K230j3175
62762B151146k7902m1267n3233o4065p3583q1033q5754q7732q7501q5704q2920
62751A380452p9632p6064p2032o7317o2142n7061n2311m7646m2896l8383l4539
62740G50429l1383k8568k5748k2791j9838j7300j5468j3956j2033r631p589o437
62728E39687n550m101k438j614j773j827r20N87J833K535L017L649M639O108Q060
62713E51892J0361J2869J5402J7600J9178K0437K2191K4970K8602L2646L6901
$$ y = [564642, 577332, 590650, 604901, 620372, 637636, 657433, 680242, 706243, 735636, 768866, 806589, 849494, 898044, 952278, 1011988, 1077126, 1147891, 1224337, 1306067, 1392306, 1481964, 1573551, 1665349, 1755835, 1843605, 1926488, 2001066, 2063618, 2111682, 2144504, 2162091, 2164321, 2151146, 2123244, 2081977, 2028744, 1964679, 1891096, 1810063, 1724309, 1636577, 1549076, 1463372, 1380452, 1300820, 1224756, 1152724, 1085407, 1023265, 966204, 913893, 866247, 823351, 784968, 750429, 719046, 690478, 664730, 641939, 622101, 604801, 589333, 575377, 563344, 553713, 546124, 539687, 534137, 530036, 527598, 525984, 524211, 522384, 521464, 522051, 523884, 526419, 529436, 533085, 537724, 543832, 551892, 562253, 575122, 590524, 608124, 627302, 647739, 669930, 694900, 723502, 756148, 793049]
62702G93049M1322M5759N0074N4378N8876O3549O8000P1594P3831P4789P4985
62691A470206P4445P2200O7175N9473N0036L9164K6329J1685l202j6836k9227
62680A821448m1136n2413o2005o9291p4467p7681p8663p7372p4401p0522o6227
62669A077270o1835n7533n3251m8838m4435m0366l6602l2843k9160k6047k3660
62658F22700k1516j9191j6895j5009j3461j1997j0798j0259j0299j0342j0004
62647D72929r340q430p140n543m164l496l443l507l372k951k135r32J12K52m58
62632D18382j002o63o1l57j647k763k678j521r6R99J550J557J341J405J855K235
62616D18536K235K232K710L516M220M850N693O538O900P023P892R859J1915J2917
$$ y = [793049, 834371, 880130, 930204, 984582, 1043458, 1107007, 1175007, 1246601, 1320432, 1395221, 1470206, 1544651, 1616851, 1684026, 1743499, 1793535, 1832699, 1859028, 1870713, 1867511, 1850675, 1821448, 1780312, 1727899, 1665894, 1596603, 1522136, 1444455, 1365792, 1288420, 1214019, 1143497, 1077270, 1015435, 957902, 904651, 855813, 811378, 771012, 734410, 701567, 672407, 646360, 622700, 601184, 581993, 565098, 550089, 536628, 524631, 513833, 503574, 493275, 482933, 472929, 463589, 455159, 448019, 442476, 438312, 434816, 431373, 427866, 424494, 421543, 419408, 418476, 418588, 418840, 418382, 417380, 416717, 416656, 416299, 414652, 411889, 409211, 407690, 407594, 408593, 410143, 411700, 413041, 414446, 416301, 418536, 420771, 423003, 425713, 429229, 433449, 438299, 443992, 450530, 457430, 464453, 472345, 482204, 494119, 507036]
62602E07036J3251J4574J7787K1847K5008K6938K8981L2216L5958L8749M0318
62591H02663M1684M3373M4536M4161M2224L9066L4445K8087K0631J3001N158l525
62579A155504j2704k0961k7395l2390l6556l9785m1793m2807m3148m2642m1000
62568G74323l8379l5187l1734k8432k5912k4388k3242k1721j9745j7628j5346
62557D92609j2721j0148q436p843p719p230o154m900m026l772l872l762l105k095
62543D06826j189o21k94J0M34Q88J008M74l90p10k9J079J680J649J742K639M285
62526D19481O182P955R546J1068J2643J4288J6033J8104K0799K4025K7274L0248
62514F17646L3190L6238L8885M0528M1374M2091M2717M2486M0857L7971L3935
$$ y = [507036, 520287, 534861, 552648, 574495, 599503, 626441, 655422, 687638, 723596, 762345, 802663, 844347, 887720, 932256, 976417, 1018641, 1057707, 1092152, 1120239, 1140870, 1153871, 1159029, 1155504, 1142800, 1121839, 1094444, 1062054, 1025498, 985713, 943920, 901113, 857965, 815323, 774323, 735944, 700757, 669023, 640591, 614679, 590291, 567049, 545328, 525583, 507955, 492609, 479888, 469740, 461304, 453461, 445742, 438512, 432358, 427458, 423432, 419660, 415788, 412026, 408921, 406826, 405637, 405016, 404722, 404732, 405166, 406054, 407062, 407536, 407146, 406436, 406407, 407486, 409166, 410815, 412557, 415196, 419481, 425663, 433618, 443164, 454232, 466875, 481163, 497196, 515300, 536099, 560124, 587398, 617646, 650836, 687074, 725959, 766487, 807861, 849952, 892669, 935155, 976012, 1013983, 1047918]
62503A047918K8301K0819J2285M023l327j0064j6448k1944k5663k7339k7609k7335
62491I53617k6737k5333k2634j8726j4163r478m959p17L256P011J0484J3454J5797
62478H80872J7575J8707J8671J6883J3342Q723L865o54m670q533j2925j8170k3701
62465I09985k8506l2044l4376l5540l5446l4430l3263l2273l0951k8746k5910
62454E58500k3123k0628j8133j5408j2567r890p640n992m824l724k375r05L93
62441D33684J448K299K813K923K955L297L751L675K832J681O82k47j355k579l751
62426D54108m962o274p235p270o546n926n893o017n751n319n239n329m958m200
62412C73189l933m454m730l699j846p55j174k208k513j750o14R7J71j9N6O09J316
$$ y = [1047918, 1076219, 1097038, 1109323, 1113346, 1110019, 1099955, 1083507, 1061563, 1035900, 1008561, 980952, 953617, 926880, 901547, 878913, 860187, 846024, 836546, 831587, 830870, 834126, 841137, 851621, 865075, 880872, 898447, 917154, 935825, 952708, 966050, 974773, 978638, 977984, 973314, 964781, 951856, 933686, 909985, 881479, 849435, 815059, 779519, 744073, 709643, 676380, 644107, 613156, 584410, 558500, 535377, 514749, 496616, 481208, 468641, 458751, 451111, 445119, 440295, 436571, 434196, 433291, 433684, 435132, 437431, 440244, 443167, 446122, 449419, 453170, 456845, 459677, 461358, 462040, 461793, 460438, 457859, 454108, 449146, 442872, 435637, 428367, 421821, 415895, 410002, 403985, 398234, 392915, 387676, 382347, 377389, 373189, 369256, 364802, 360072, 356373, 354527, 353772, 352598, 350390, 347877, 346127, 345513, 345610, 345781, 345762, 345818, 346427, 347743]
62395C47743J718J739J661J617J510J425J695K316K753K653K427K775L744M697
62381C80473N114N109N112N388N940O648P294P643P710P909Q660R811J0731J1210
62367D84752J2009J4020J6980J9652K1441K3173K5801K9068L2175L5313L9431
62356G53815M4510M9171N2143N3289N2914N1020M7705M3370L7935L0637K1415
62345A237924J1882L939k193p758j3605j9470k4886k9792l4071l7323l9376m0423
62333A004848m0538l9507l7306l4304l0898k7345k3997k1189j8875j6871j5462
62322F98556j5147j5682j6081j5870j5654j6068j6804j7184j7180j7155j6895
62311E18836j5730j3607j1377r796q751p656o329n147m507m417m548m494l902
$$ y = [347743, 349461, 351200, 352861, 354478, 355988, 357413, 359108, 361424, 364177, 366830, 369257, 372032, 375776, 380473, 385587, 390696, 395808, 401196, 407136, 413784, 421078, 428721, 436431, 444340, 453000, 462811, 473542, 484752, 496761, 510781, 527761, 547413, 568854, 592027, 617828, 646896, 679071, 714384, 753815, 798325, 847496, 899639, 952928, 1005842, 1056862, 1104567, 1147937, 1185872, 1216509, 1237924, 1249806, 1253745, 1251552, 1243794, 1230189, 1210719, 1185833, 1156041, 1121970, 1084647, 1045271, 1004848, 964310, 924803, 887497, 853193, 822295, 794950, 770953, 749764, 730889, 714018, 698556, 683409, 667727, 651646, 635776, 620122, 604054, 587250, 570066, 552886, 535731, 518836, 503106, 489499, 478122, 468326, 459575, 451919, 445590, 440443, 435936, 431519, 426971, 422477, 418575]
62298D18575k648j042K07N49J12m16n10j62M41J256K173K795K825K497K295K365
62282D31312K511K685L070L615L903L640L083K881L453M536N348N434N381O343
62268D87195Q637J1274J3229J4641J6261J8300K0621K3614K7782L2591L6882M0480
62256G51507M4338M8838N3050N6037N7855N8630N7652N4181M8461M1224L2910
62245A304683K4064J5760Q606J927n159j2279j8502k3978k9732l5893m1337m5092
62233A143068m7158m7726m6697m4272m1304l8577l6276l4298l2524l0641k8276
62222G15319k5571k3155k1375k0069j9007j8023j6685j4655j2514j1364j1319
62211E21582j1249j0377r326q904q732p860o200m513l262k258j236j31J020J947
$$ y = [418575, 415927, 414885, 415092, 415641, 415753, 415337, 414827, 414665, 415106, 416362, 418535, 421330, 424155, 426652, 428947, 431312, 433823, 436508, 439578, 443193, 447096, 450736, 453819, 456700, 460153, 464689, 470037, 475471, 480852, 487195, 495832, 507106, 520335, 534976, 551237, 569537, 590158, 613772, 641554, 674145, 711027, 751507, 795845, 844683, 897733, 953770, 1011625, 1070255, 1127907, 1182088, 1230549, 1271773, 1304683, 1328747, 1344507, 1353113, 1355040, 1349881, 1337602, 1319100, 1295122, 1265390, 1229497, 1188160, 1143068, 1095910, 1048184, 1001487, 957215, 915911, 877334, 841058, 806760, 774236, 743595, 715319, 689748, 666593, 645218, 625149, 606142, 588119, 571434, 556779, 544265, 532901, 521582, 510333, 499956, 490630, 481726, 472994, 465134, 458934, 454421, 451159, 448901, 447665, 447534, 448554, 450501]
62197D50501K185J814J817K992M823O175O845P568Q564R216R280R449J0224J1122
62183E42575J1488J1400J1166J0595R487Q321P621O983N673M108L708N116P431
62170F45672R666J2162J5922K0956K6098L0340L3669L6526L9002M0752M1256L9979
62158I92000L6554L1178K4591J7531J0401L567k397p205j1340j5572k0026k4151
62146A035131k7586l0563l3301l5358l5922l4528l1475k7651k4088k1314j9000
62135G14345j6407j3329j0351q063o355m672k739o70J370L273M889O149P248Q470
62121F83158R837J1112J1984J2082J1053Q985O570M565L137K064J324J013P87
62108G67671m6j791m138o689r195j1225j2173j1813j0472q476n932l224j066L40
$$ y = [450501, 452686, 454500, 456317, 459309, 464132, 470307, 477152, 484720, 493284, 502500, 511780, 521229, 531453, 542575, 554063, 565463, 576629, 587224, 596711, 605032, 612653, 619636, 625309, 629417, 633125, 638241, 645672, 655338, 667500, 683422, 704378, 730476, 760816, 794485, 831011, 870013, 910765, 952021, 992000, 1028554, 1059732, 1084323, 1101854, 1112255, 1115822, 1113425, 1106220, 1094880, 1079308, 1059282, 1035131, 1007545, 976982, 943681, 908323, 872401, 837873, 806398, 778747, 754659, 733345, 714345, 697938, 684609, 674258, 666195, 659840, 655168, 652429, 651759, 653129, 656402, 661291, 667440, 674688, 683158, 692995, 704107, 716091, 728173, 739226, 748211, 754781, 759346, 762483, 764547, 765871, 766884, 767671, 767625, 765834, 761696, 755007, 745812, 734587, 722414, 710601, 700129, 691653, 685721, 682497, 681431, 681771]
62094F81771J662L424N067N707N507N499O157O930P268P433P929Q676R186R311
62080G71527R436J0026J1149J2501J3768J4958J6329J7954J9541K0821K1854K2707
62068I62571K3032K2508K1556K1078K1385K1949K2319K2619K2827K2148J9731
62057A203723J5799J1402P156K809j935o617j0329j2707j4409j6614k0008k4193
62045A134077k8209l1480l4004l5685l6167l5620l5099l5430l6028l5592l3771
62034G56992l1401k9067k6404k3112j9776j7074j4809j2459j0321r146q847q368
62022E46208p062n489m553m407m609m935n471o126o536o498o101n461m638l813
62008D70509l184k627j823q70l43m55n27K71J821L256M044M338M247L476J987
$$ y = [681771, 683433, 686857, 691924, 697631, 703138, 708637, 714794, 721724, 728992, 736425, 744354, 753030, 762216, 771527, 780963, 790989, 802138, 814639, 828407, 843365, 859694, 877648, 897189, 918010, 939864, 962571, 985603, 1008111, 1029667, 1050745, 1072130, 1094079, 1116398, 1139017, 1161844, 1183992, 1203723, 1219522, 1230924, 1238080, 1240889, 1238954, 1232337, 1222008, 1209301, 1194892, 1178278, 1158270, 1134077, 1105868, 1074388, 1040384, 1004699, 968532, 932912, 897813, 862383, 826355, 790763, 756992, 725591, 696524, 670120, 647008, 627232, 610158, 595349, 582890, 572569, 563423, 554576, 546208, 539146, 533657, 529104, 524697, 520088, 515153, 509682, 503556, 497020, 490522, 484421, 478960, 474322, 470509, 467325, 464698, 462875, 462005, 461662, 461207, 460680, 460951, 462772, 466028, 470072, 474410, 478657, 482133, 484120]
61993D84120M12o60j374k172l001l626m337n639p241q157q021p589p602p738p189
61978D10186n928m729m127l849l366k554j669r62m96k57k33l85n72n74l12J7J89
61961C80379L19P16J267J343N92l74n41L14J461K226K751L494M454N232N705O246
61945D15584P257Q756J0446J2043J3457J4886J6637J8685K0439K1243K1172K0950
61933F01555K0914K0525J9224J7424J6002J5013J3641J1470R032O834M514J536
61921G57684j793m665o762q242r024q780p693o377m962k892J47L645O940R918
61907G17144J2713J5135J6819J7646J7553J6233J3413R428N123J152k417n867
61895H34075r376j2752j5557j7497j8659j9194j8916j7590j5656j4107j3426j3090
$$ y = [484120, 484532, 483872, 482498, 480326, 477325, 473699, 469362, 463723, 456482, 448325, 440304, 432715, 425113, 417375, 410186, 404258, 399529, 395402, 391553, 388187, 385633, 383964, 383002, 382506, 382249, 382016, 381631, 381059, 380485, 380173, 380190, 380379, 380698, 381414, 382681, 384024, 384616, 384242, 383701, 384015, 385476, 387702, 390453, 393947, 398401, 403633, 409338, 415584, 422841, 431597, 442043, 454086, 467543, 482429, 499066, 517751, 538190, 559433, 580605, 601555, 622469, 642994, 662218, 679642, 695644, 710657, 724298, 735768, 744800, 751634, 756148, 757684, 755891, 751226, 744464, 736222, 727198, 718418, 710725, 704348, 699386, 696494, 696641, 700286, 707226, 717144, 729857, 744992, 761811, 779457, 797010, 813243, 826656, 836084, 841207, 842359, 839942, 834075, 824699, 811947, 796390, 778893, 760234, 741040, 722124, 704534, 688878, 674771, 661345, 648255]
61883F48255j2461j1735j1492j1647j1498j0726r778r168q834q402p699o818n861
61870E22136m854l893l139k602j955p87Q72K472L603M564N953P781R569J1264
61856E50984J3485J6542J9868K2728K4999K6918K8546K9972L1532L3188L4103
61845H32865L3540L1875L0007K8015K5118K0907J5771J0141M059k203p793j1904
61833A010398j4384j5456j5182j3462j0358o290j952K052N636R071J2200J4196
61821I76469J4476J3402J1442Q122K725m159j0855j6483k1598k6704l1151l4011
61809H81675l5253l5396l4629l2950l0720k8475k6373k4253k2027j9654j7058
61798E74887j4347j1915j0034q676p836p616p740p519o651n653n083m741m086
$$ y = [648255, 635794, 624059, 612567, 600920, 589422, 578696, 568918, 559750, 550916, 542514, 534815, 527997, 522136, 517282, 513389, 510250, 507648, 505693, 504906, 505778, 508250, 511853, 516417, 522370, 530151, 539720, 550984, 564469, 581011, 600879, 623607, 648606, 675524, 704070, 734042, 765574, 798762, 832865, 866405, 898280, 928287, 956302, 981420, 1002327, 1018098, 1028239, 1032298, 1030095, 1022302, 1010398, 996014, 980558, 965376, 951914, 941556, 935266, 933314, 935366, 941002, 950073, 962273, 976469, 990945, 1004347, 1015789, 1023911, 1026636, 1022477, 1011622, 995139, 973541, 946837, 915686, 881675, 846422, 811026, 776397, 743447, 712727, 684252, 657879, 633626, 611599, 591945, 574887, 560540, 548625, 538591, 529915, 522079, 514463, 506723, 499204, 492553, 486900, 481817, 477076, 472990]
61785D72990l047k069j602j835k603l228k975k005j429j927k808k935k196j386
61771D40945j062j171j594k286k955l197k897k201j231k43K92K59K29O77J266
61756D24831J502J605J923J913Q46o80j163l82J17q41k419k969k133r49l42l30
61740D20529n06o17o60p52r45r85m55N94J429J373P03L86R68J978K536K328J864
61723D29768J807K215K572K478K106J896K068K577L255L769L654K751J443J63
61709D62522j033k094k604k388k138k613l341l129j897j112j884l530m591m646
61695D25522m379m296m203l827l267k762k431k306k421k733l096l359l406l300
61681C79736l283l415l268k397j206p50j419k373k676k465k446k655k510j809
$$ y = [472990, 469943, 467874, 466272, 464437, 461834, 458606, 455631, 453626, 452197, 450270, 447462, 444527, 442331, 440945, 439883, 438712, 437118, 434832, 431877, 428680, 425783, 423582, 422351, 422108, 422400, 422659, 422888, 423565, 424831, 426333, 427938, 429861, 431774, 432620, 431940, 430777, 430395, 430512, 429671, 427252, 424283, 422150, 421201, 420859, 420529, 420023, 419406, 418746, 417994, 417049, 416064, 415609, 416203, 417632, 419005, 419708, 420094, 421062, 423040, 425576, 427904, 429768, 431575, 433790, 436362, 438840, 440946, 442842, 444910, 447487, 450742, 454511, 458165, 460916, 462359, 462522, 461489, 459395, 456791, 454403, 452265, 449652, 446311, 443182, 441285, 440173, 438289, 434759, 430168, 425522, 421143, 416847, 412644, 408817, 405550, 402788, 400357, 398051, 395630, 392897, 389801, 386442, 383036, 379736, 376453, 373038, 369770, 367373, 366167, 365417, 363998, 361625, 358949, 356484, 354038, 351383, 348873, 347064]
61667C47064j026n60l60k95l20k61R6N13M30k06p44o39l8O80J513K546L386L436
61649C55215K673J721J171J092J298J720K391L205L960M477M587M095K973J514
61635C92092J25j097k334l569m427m600m281l860l473l081k908l261l907m074
61621C47345l309k032r96m64j63J79N72R59J328J570J412N46j119l199m855n359
61605C32415m800m046l867m242m677m858m734m306l715l306l239l191k824k384
61591B78226k334k550k478k026j686j679j649j397j244j339j241o66j70m39j283
61576B56045j972k268k355j990p10J011J752Q23p39j452j121o41n10l96m6K74
61560B45705M44Q34J575K068J751R70N78Q56J331J528J341P86o9q49j044o75k62
$$ y = [347064, 346038, 345478, 345118, 344823, 344503, 344242, 344338, 344851, 345281, 345075, 344331, 343692, 343654, 344334, 345847, 348393, 351779, 355215, 357888, 359609, 360780, 361872, 363170, 364890, 367281, 370486, 374446, 378923, 383510, 387605, 390578, 392092, 392217, 391120, 388786, 385217, 380790, 376190, 371909, 368049, 364576, 361495, 358587, 355326, 351419, 347345, 344036, 342004, 341008, 340544, 340381, 340560, 341132, 342091, 343419, 344989, 346401, 346947, 345828, 342629, 337774, 332415, 327615, 323569, 319702, 315460, 310783, 305925, 301191, 296885, 293170, 289864, 286625, 283434, 280610, 278226, 275892, 273342, 270864, 268838, 267152, 265473, 263824, 262427, 261183, 259844, 258603, 257937, 257767, 257328, 256045, 254073, 251805, 249450, 247460, 246750, 247761, 249513, 250336, 249597, 248145, 247024, 246383, 245873, 245477, 245431, 245705, 246149, 246983, 248558, 250626, 252377, 253347, 253925, 254781, 256112, 257640, 258981, 259767, 259698, 258849, 257805, 257130, 256868]
61543B56868Q8R49K497L717L434J960Q49R63J587J751J623J980K788L135K499
61528B86688J341M09q7m12q53j472j977j870j054l09n44j471j737p20N14O01l25
61511B76722j057j032o80l25J90O69M75l94j031q91o29j025j762j964j479r32
61495B64855p67q33q09n07L6M31K14l76l55P08J870K025J495J399J825J797J073
61478B74081O01R22J274R52M75N62Q13M09l52l59O56J735K008J572Q70qj006j610
61460B83595j287k33P01R02N60L15N30R87J226J040N99K40J49K70L76M04O40J390
61442B92404K374K777K240J473J456K211K916L080K994K978K920K694K473K261
61428C27251J751J006P62J525K754L446L277K742K431K595L134L572L245K012
$$ y = [256868, 256956, 257905, 260402, 264119, 267553, 269513, 270362, 271325, 272912, 274663, 276286, 278266, 281054, 284189, 286688, 288029, 288438, 288351, 287939, 287086, 285614, 283637, 281767, 280713, 280404, 279860, 278389, 276652, 275932, 276446, 277047, 276722, 275665, 274633, 273953, 273628, 273818, 274487, 274962, 274568, 273537, 272646, 272017, 270992, 269230, 267266, 265787, 264855, 264088, 263255, 262446, 261939, 261975, 262406, 262620, 262244, 261889, 262597, 264467, 266492, 267987, 269386, 271211, 273008, 274081, 274682, 275604, 276878, 277830, 278305, 278867, 279680, 280089, 279737, 279378, 280034, 281769, 283777, 285349, 286219, 286211, 285205, 283595, 282308, 282075, 282776, 283678, 284238, 284553, 285083, 286070, 287296, 288336, 288935, 289175, 289324, 289594, 289970, 290374, 291014, 292404, 294778, 297555, 299795, 301268, 302724, 304935, 307851, 310931, 313925, 316903, 319823, 322517, 324990, 327251, 329002, 330008, 330770, 332295, 335049, 338495, 341772, 344514, 346945, 349540, 352674, 356246, 359491, 361503]
61414C61503O05k04n39j069j954k723l074l160l071k651k023j742k173k971l448
61399C31306l216k413j525j051j116j320j194q12o78j003j400j395r72m60j42
61384C12609n8l0J73N95R45R21O76P01J165J622J538R38L30J64M93J097J726K189
61366C27794K354K176J771J408J391J780K305K586K535K573L301M845O443O968
61352C70230O129M972M848N996P565Q830R692R934Q990O937M985M189M217M119
61338D61633L899M269N073N101L696J632P0o79r39r79j016j437k424l581m343
61323D69975m525m232l528k576j813j573j628j467q87o5P69J478J992K436L210
61308D57566M586O257P608Q385Q908R484R960R905R139P832O176M216K036j4j554
$$ y = [361503, 362108, 361904, 361365, 360296, 358342, 355619, 352545, 349385, 346314, 343663, 341640, 339898, 337725, 334754, 331306, 328090, 325677, 324152, 323101, 321985, 320665, 319471, 318659, 317981, 316978, 315578, 314183, 313211, 312751, 312609, 312551, 312521, 312694, 313289, 314234, 315155, 315831, 316532, 317697, 319319, 320857, 321795, 322125, 322289, 322782, 323879, 325605, 327794, 330148, 332324, 334095, 335503, 336894, 338674, 340979, 343565, 346100, 348673, 351974, 356819, 363262, 370230, 376359, 381331, 386179, 392175, 399740, 408570, 418262, 428196, 437186, 444123, 449108, 453297, 457514, 461633, 465532, 469801, 474874, 479975, 483671, 485303, 485373, 484694, 483755, 482776, 481760, 480323, 477899, 474318, 469975, 465450, 461218, 457690, 455114, 453301, 451728, 450100, 448633, 447746, 447681, 448450, 449928, 451920, 454356, 457566, 462152, 468409, 476017, 484402, 493310, 502794, 512754, 522659, 531798, 539630, 545806, 550022, 552058, 552044, 550490]
61293E50490k601l518m503n323n746n906o059o162n995n561n077m656m309m111
61279D80963m033l767l144k493k111j507M2K222L765M123M222N053O124O111M722
61264E00292L121K595L367M842O484Q191R943J1306J1518J0264Q279O799O242
61251E93243N883M997L802K855K021P24j008k513l486m388n673p101q029q077
61237E73250p317o112m946m178l771l409k946k532k257j889j062K68J629K282
61223E37010J870R76Q15K039L933N142N126M550M342M783N535O047N839M821L544
61208E96372K751K517K264J733J430J791K515L172M003N448P284Q893J0230J1748
61194F62151J3445J4751J5406J5719J5759J5025J3313J1211R327P544N571L738
$$ y = [550490, 547889, 544371, 539868, 534545, 528799, 522893, 516834, 510672, 504677, 499116, 494039, 489383, 485074, 480963, 476930, 473163, 470019, 467526, 465415, 463908, 463950, 466172, 469937, 474060, 478282, 483335, 489459, 495570, 500292, 503413, 506008, 509375, 514217, 520701, 528892, 538835, 550141, 561659, 571923, 580202, 587001, 593243, 599126, 604123, 607925, 610780, 612801, 613525, 612517, 610004, 606518, 602130, 596457, 589356, 581327, 573250, 565933, 559821, 554875, 550697, 546926, 543517, 540571, 538039, 535782, 533893, 532831, 533099, 534728, 537010, 538880, 539856, 540671, 542710, 546643, 551785, 556911, 561461, 565803, 570586, 576121, 582168, 588007, 592828, 596372, 599123, 601640, 603904, 605637, 607067, 608858, 611373, 614545, 618548, 623996, 631280, 640173, 650403, 662151, 675596, 690347, 705753, 721472, 737231, 752256, 765569, 776780, 786107, 793651, 799222, 802960]
61182H02960K573J972J441R64Q62R12L05j323l429n269o581p426p878q168q649
61167G63266r398j0144j0814j1715j2859j3587j3306j2403j1853j2011j2211j1665
61155F21300j0386r042q073p207n895m091k325j014l4O99O10r94l822o638q489
61140E54599r361r524q971p792o390m897k937n16J451K101J759J518K082L521
61126E16643N698Q180J0094J0957J1436J2584J4485J6377J7895J9303K0681K1786
61114F86119K2765K4003K5217K5548K4842K3939K3452K3012K2047K0496J8421
61103I39861J5688J2497R528P042M441J162k521o054r343j2423j4975j6769j8157
61090I09977j9566k0807k1498k1770k2037k2279k2097k1260j9863j8165j6622
$$ y = [802960, 805533, 807505, 808946, 809910, 810772, 811684, 811989, 810666, 807237, 801968, 795387, 787961, 780083, 771915, 763266, 753868, 743724, 732910, 721195, 708336, 694749, 681443, 669040, 657187, 645176, 632965, 621300, 610914, 601872, 593799, 586592, 580697, 576606, 574281, 573267, 573233, 573932, 574542, 573548, 569726, 563088, 554599, 545238, 535714, 526743, 518951, 512561, 507664, 504727, 504211, 505662, 507763, 509522, 511040, 513122, 516643, 522341, 530521, 540615, 551572, 563008, 575592, 590077, 606454, 624349, 643652, 664333, 686119, 708884, 732887, 758104, 783652, 808494, 832433, 855885, 878897, 900944, 921440, 939861, 955549, 968046, 977574, 984616, 989057, 990219, 987698, 981644, 972301, 959878, 944903, 928134, 909977, 890411, 869604, 848106, 826336, 804299, 782020, 759923, 738663, 718800, 700635, 684013]
61079F84013j5686j5272j4697j3525j2035j0556q916p071n649n132m882l846j992
61066E64754k75O93J206J697K176K580L085L854M797N785O836P990R180J0224
61052F24582J0946J1377J1963J3205J5019J6770J8180J9693K1649K3685K5390
61041H12459K7005K8843L0594L1934L3360L5515L7978L9701M0506M1233M2370
61030A201498M3486M4126M4450M4787M5331M6486M8842N2502N7013O2225O8647
61019A759393P6605Q5706R5495J06383J19715J37303J61116J93126K35234K89433
61009C259509L57517M39941N35289O42165P62092Q99598J058675J238755J431255
61000A0624796J613109J738222J740074J559795J191370P08426K40902q8971k23620
$$ y = [684013, 668327, 653055, 638358, 624833, 612798, 602242, 593326, 586255, 580606, 575474, 570592, 566746, 564754, 564479, 565172, 566378, 568075, 570251, 572831, 575916, 579770, 584567, 590352, 597188, 605178, 614358, 624582, 635528, 646905, 658868, 672073, 687092, 703862, 722042, 741735, 763384, 787069, 812459, 839464, 868307, 898901, 930835, 964195, 999710, 1037688, 1077389, 1117895, 1159128, 1201498, 1244984, 1289110, 1333560, 1378347, 1423678, 1470164, 1519006, 1571508, 1628521, 1690746, 1759393, 1835998, 1921704, 2017199, 2123582, 2243297, 2380600, 2541716, 2734842, 2970076, 3259509, 3617026, 4056967, 4592256, 5234421, 5996513, 6896111, 7954786, 9193541, 10624796, 12237905, 13976127, 15716201, 17275996, 18467366, 19175792, 19416694, 19327723, 19104103]
60991A9104103j81291k9466J42727K37616J67323j07649n44086j026297j424384
60982A6338596j657092j714663j638076j483697j298939j113939r43135p91039
60974E698016o58140n44006m47673l67581l01993k49064k06711j73139j47317
60965B602392j28191j13773j01854r1481q2856p5839o9542o3446n7906n3275m9311
60954A714918m5834m3291m2182m2277m2797m3068m2738m1683l9979l7871l5705
60943A257493l3875l2744l2324l2131l1689l1107l0789l0703l0430k9916k9564
60932I12221k9421k8859k7416k5568k4157k3339k2465k0978j9031j7164j5649
60921F58174j4344j3071j1892j0915j0003q925p742o703n707m323k653j635j979
$$ y = [19104103, 18922812, 18893346, 19036073, 19273689, 19441012, 19333363, 18789277, 17762980, 16338596, 14681504, 12966841, 11328765, 9845068, 8546129, 7432190, 6489055, 5698016, 5039876, 4495870, 4048197, 3680616, 3378623, 3129559, 2922848, 2749709, 2602392, 2474201, 2360428, 2258574, 2167093, 2084237, 2008398, 1938856, 1875410, 1817504, 1764229, 1714918, 1669084, 1625793, 1583611, 1541334, 1498537, 1455469, 1412731, 1371048, 1331069, 1293198, 1257493, 1223618, 1190874, 1158550, 1126419, 1094730, 1063623, 1032834, 1002131, 971701, 941785, 912221, 882800, 853941, 826525, 800957, 776800, 753461, 730996, 710018, 690987, 673823, 658174, 643830, 630759, 618867, 607952, 597949, 589024, 581282, 574579, 568872, 564549, 561896, 560261, 558282]
60908E58282k980l116j859k57M75L60L53J016J962K402J962R73J90Q4L08N2r03
60891E59304j848k141k202k877m027m525l833k917l089m384n735o416o580o501
60877E02229o163n767n836o273o099m816l522l689n042n763m917l595l228l609
60863D33910l407k133p13j93o52j387j749j548j068p85q64r04m50K52M01l31j242
60846D17137j382p15j06k04o91q37n30l61p53j469k108k649l195l490l177k398
60830C93072j559o64N43J718J984J165L33N72J606K197J731P80J87J19J98J44
60814D04126K7k7j49o22j463k222k431k159j871j757j593j285j158j448j944k355
60798C81669k678k916k836k430k241k743l598m112m171m213m275l795k523j191
$$ y = [558282, 555302, 552186, 550327, 550070, 550545, 550905, 551258, 552274, 554236, 556638, 558600, 559573, 559763, 559847, 560155, 560207, 559304, 557456, 555315, 553113, 550236, 546209, 541684, 537851, 534934, 531845, 527461, 521726, 515310, 508730, 502229, 496066, 490299, 484463, 478190, 472091, 467275, 463753, 460064, 455022, 449259, 444342, 440747, 437519, 433910, 430503, 428370, 427657, 427464, 426812, 425425, 423676, 422128, 421060, 420275, 419411, 418507, 418057, 418309, 418710, 418379, 417137, 415755, 415040, 414934, 414730, 414039, 413202, 412672, 412311, 411558, 410089, 407981, 405332, 402137, 398647, 395470, 393072, 391513, 390849, 391392, 393110, 395094, 396259, 396592, 397164, 398770, 400967, 402698, 403478, 403665, 403784, 403982, 404126, 404153, 404126, 403977, 403355, 401892, 399670, 397239, 395080, 393209, 391452, 389859, 388574, 387416, 385968, 384024, 381669, 378991, 376075, 373239, 370809, 368568, 365825, 362227, 358115, 353944, 349731, 345456, 341661, 339138, 337947]
60784C37947q38j685k893l376k777j628o95k36j8J43J82J65M20J025J515J463
60768C28714J149J264K078L186M031M354M233L909L589L269K834K418K323K501
60754C69852K428J780R05L51K34L74O66R42Q66M56K82O27Q16qj750l660n367o867
60736C62927p753p494o438n617n406n192m544l820l393l031k455j887j604j548
60722C02745j613j803j879j454p66o43j286j785j290j59P03J020J084R56O14M98
60706B94942J050J779J603K95j077j420p94k6M18P68J339K033K547K778K826K716
60690C11777K418K180K420L110L570L276K650K610L408M396M892M779M255L524
60676C59265K885K645K765K900K784K226R15j111k893l349k783k683l710m814
$$ y = [337947, 337109, 335424, 332531, 329155, 326378, 324750, 324055, 323819, 323801, 323944, 324126, 324291, 324711, 325736, 327251, 328714, 329863, 331127, 333205, 336391, 340422, 344776, 349009, 352918, 356507, 359776, 362610, 365028, 367351, 369852, 372280, 374060, 374965, 375316, 375550, 375924, 376590, 377532, 378398, 378854, 379136, 379763, 380579, 380571, 378821, 375161, 369794, 362927, 355174, 347680, 341242, 335625, 330219, 325027, 320483, 316663, 313270, 310239, 307784, 305897, 304293, 302745, 301132, 299329, 297450, 295996, 295230, 294587, 293301, 291516, 290226, 290067, 290770, 291790, 292874, 293830, 294444, 294942, 295992, 297771, 299374, 299669, 298592, 297172, 296378, 296352, 296770, 297538, 298877, 300910, 303457, 306235, 309061, 311777, 314195, 316375, 318795, 321905, 325475, 328751, 331401, 334011, 337419, 341815, 346707, 351486, 355741, 359265, 362150, 364795, 367560, 370460, 373244, 375470, 376385, 375274, 372381, 369032, 366249, 363566, 359856, 355042]
60662C55042m842m060l367k901k362k021k281k675k324j161J29J191K095K595
60648C33058K306J545J083J079J028P67N54J95q89k545l759l944l543l086k571
60633C21278k070j995k306k278j641j084j049q78L9J051J154N93M60J024J500
60618C13798J359Q61L66p2k80nM69N21J43L0M86R48R20O39M33Q0n84r86n08N00
60598C19118J153J285J490J909J851R13j17j15R09J760J500M67l15m30l75o56
60582C30347j046r56l31L01N96Q28J396K232L045L799M676N663O559P356Q268
60567C72733R352J0363J0999J1067J0469R302P944O701N311L192L00k620m820
60554D50293o256p228p716p382o047l842j114J512L307M128M752O046P879R333
$$ y = [355042, 350200, 346140, 342773, 339872, 337510, 335489, 333208, 330533, 328209, 327048, 327177, 328368, 330463, 333058, 335364, 336909, 337992, 339071, 340099, 340866, 341420, 341615, 340726, 338181, 334422, 330478, 326935, 323849, 321278, 319208, 317213, 314907, 312629, 310988, 309904, 308855, 307977, 308016, 309067, 310221, 310814, 311274, 312298, 313798, 315157, 316018, 316384, 316312, 316032, 316027, 316496, 317017, 317160, 317190, 317676, 318624, 319544, 320183, 320616, 320696, 320112, 319126, 318618, 319118, 320271, 321556, 323046, 324955, 326806, 327719, 327602, 327487, 328396, 330156, 331656, 332123, 331808, 331378, 331003, 330347, 329301, 328345, 328014, 328315, 328911, 329739, 331135, 333367, 336412, 340211, 344887, 350550, 357109, 364465, 372733, 382085, 392448, 403447, 414514, 424983, 434285, 442229, 448930, 454241, 457433, 457733, 455113, 450293, 444037, 436809, 429093, 421711, 415664, 411822, 410708, 412220, 415527, 419655, 424407, 430453, 438332, 447665]
60540D47665R958J0208J0630J1254J1993J2901J3612J3061J0559O896L686J570
60528E63993k74k673n150o516o438n770n417n315m840l786k657k040k027k239
60514E08851k187j509j52J528K987L940M493M892N315O038P449R730J2674J6068
60500E80117J9976K4391K8880L2922L6458L9671M2303M3651M3238M1075L7304
60489I69986L1842K4542J5379M571p189j8696k8797l6962m3007m6515m7257m6030
60477G71867m4229m2301l9448l5182l0430k6542k3776k1479j9232j7141j5230
60466D56877j3332j1495r989q882p988p159o291n298m394m049m203l980k772j341
60452C65704j006j933l051l510l384k878j932q89n44r91j216m91M95O34qm76m32
$$ y = [447665, 457623, 467831, 478461, 489715, 501708, 514609, 528221, 541282, 551841, 558737, 562423, 563993, 563719, 561046, 555896, 549380, 542942, 537172, 531755, 526440, 521600, 517814, 515157, 513117, 511090, 508851, 506664, 505155, 505003, 506531, 509518, 513458, 517951, 522843, 528158, 534196, 541645, 551375, 564049, 580117, 600093, 624484, 653364, 686286, 722744, 762415, 804718, 848369, 891607, 932682, 969986, 1001828, 1026370, 1041749, 1046320, 1039131, 1020435, 991638, 954676, 911669, 865154, 817897, 771867, 727638, 685337, 645889, 610707, 580277, 553735, 529959, 508480, 489248, 472107, 456877, 443545, 432050, 422061, 413179, 405191, 398032, 391741, 386443, 382049, 378000, 373797, 369817, 367045, 365704, 364698, 362765, 359714, 356204, 352820, 349942, 348010, 347121, 346577, 345586, 344370, 343879, 344374, 345008, 345000, 344524, 344092]
60435C44092m59r19j391j443j267j184j114q60n21l07j50N9J31j85p16r71p25
60418C32070j33O44J558K339K541K164J822J866J768R13k08m41L53R37M22m47
60402C48168l94N31J169J050J031J879L157L886L741L085K245J337N61K23M06
60387C72075R49J661K364K817K849K535K086J587J003L62k09n80o01j68O27J453
60371C90810K034K295K172J547O24J21N81J653K413K468K294K461K948L443L882
60356D21746M413N028N615O201O837P329P367O967O487O149N734M837L209Q90
60342D98809j787m231n850o534o745o899o836o130m886l852l583l801l792l350
60328D30533k962l052l377l388l016k716k713k606j943r16j00M35J209K465L669
$$ y = [344092, 343633, 342714, 341323, 339880, 338613, 337429, 336315, 335455, 334934, 334627, 334477, 334536, 334667, 334482, 333766, 332795, 332070, 331937, 332581, 334139, 336478, 339019, 341183, 343005, 344871, 346639, 347552, 347344, 346903, 347256, 348193, 348615, 348168, 347774, 348305, 349474, 350524, 351555, 353434, 356591, 360477, 364218, 367303, 369548, 370885, 371446, 371669, 372075, 373024, 374685, 377049, 379866, 382715, 385250, 387336, 388923, 389926, 390288, 390079, 389499, 388898, 388730, 389357, 390810, 392844, 395139, 397311, 398858, 399482, 399603, 400184, 401837, 404250, 406718, 409012, 411473, 414421, 417864, 421746, 426159, 431187, 436802, 443003, 449840, 457169, 464536, 471503, 477990, 484139, 489873, 494710, 497919, 498809, 497022, 492791, 486941, 480407, 473662, 466763, 459927, 453797, 448911, 445059, 441476, 437675, 433883, 430533, 427571, 424519, 421142, 417754, 414738, 412022, 409309, 406703, 404760, 403844, 403744, 404179, 405388, 407853, 411522]
60313D11522M266M559N419P183R343J1271J2834J4151J5156J5699J5811J5572
60301E42786J4779J2992R903N728J232k727n918q948j2451j6058j8493j8877j7514
60288D86434j5259j2610r747p083n128l907l045k421k282k628k958k847k443k144
60274D11932k010j755j248p86q61j623k566k801j920n84L7m71j312j503j027o19
60258C90883o11n85k45l0m00r14o64L95J220R80R1m28k41J81M70P71J232J635
60240C93740J723J541J278J000P17M72L10L22O61J310J882J988J792J724J726
60225D12186J341O33L43Q62J574J656J077M73M48J263K769M259M880M618M379
60210D42761M744N214N158M828M765M844M722M673N037N336M941M235M025M112
$$ y = [411522, 415788, 420347, 425766, 432949, 442292, 453563, 466397, 480548, 495704, 511403, 527214, 542786, 557565, 570557, 580460, 586188, 587420, 584693, 578775, 569827, 557376, 541318, 522825, 503948, 486434, 471175, 458565, 448818, 441735, 436607, 432700, 429655, 427234, 424952, 422324, 419366, 416519, 414076, 411932, 409922, 408167, 406919, 406133, 405272, 403649, 401083, 398282, 396362, 395778, 395815, 395344, 394032, 392529, 391502, 390883, 390272, 389687, 389442, 389412, 389012, 388098, 387434, 387829, 389049, 390029, 390120, 389692, 389451, 389632, 390102, 390873, 392105, 393740, 395463, 397004, 398282, 399282, 399999, 400471, 400781, 401103, 401764, 403074, 404956, 406944, 408736, 410460, 412186, 413527, 414160, 414503, 415365, 416939, 418595, 419672, 420145, 420593, 421856, 424625, 428884, 433764, 438382, 442761, 447505, 452719, 457877, 462705, 467470, 472314, 477036, 481709, 486746, 492082, 497023, 501258, 505283, 509395]
60196E09395L636K651K059J985J597O94J26K07J13o72j533k003k603l513l716
60181E08423k604j508k097l901m856m118l003k983l844m219l263j382K78Q84N67
60166D72374N0k97o77j102j100n77k18m06m10M20J296R72l13j023m65M89R34J048
60148D70995J335J747K043K239K254J784J039R50K065L715M845N268N547N982
60134E11808O345O437O305N919N114L926K683J684R83N43L42K59J0n87j226j238
60118E49307k95R89J520R06n2l86j22p8o67j459j878j812j461j110j123j733k627
60101E37919l146l107k995l194l426l259k709k018j173m5J173K103K593K742K699
60086E24157K656K863L339L710L616L098K388J555O76Q7j2r9r26k529m062m791
$$ y = [509395, 513031, 515682, 517741, 519726, 521323, 522017, 522143, 522350, 522463, 521791, 520258, 518255, 515652, 512139, 508423, 505819, 504311, 502214, 498313, 493457, 489339, 486336, 483353, 479509, 475290, 472027, 470645, 470923, 471807, 472374, 472424, 472127, 471450, 470348, 469248, 468671, 468453, 468047, 467637, 468057, 469353, 470325, 470012, 468989, 468524, 469013, 469947, 470995, 472330, 474077, 476120, 478359, 480613, 482397, 483436, 484386, 486451, 490166, 495011, 500279, 505826, 511808, 518153, 524590, 530895, 536814, 541928, 545854, 548537, 550221, 551204, 551747, 552089, 552348, 552358, 551771, 550545, 549307, 549012, 550001, 551521, 552427, 552375, 551989, 551867, 551789, 551122, 549663, 547785, 545973, 544512, 543402, 542279, 540546, 537919, 534773, 531666, 528671, 525477, 522051, 518792, 516083, 514065, 512892, 512847, 514020, 516123, 518716, 521458, 524157, 526813, 529676, 533015, 536725, 540341, 543439, 545827, 547382, 548058, 548145, 548133, 548034, 547108, 544579, 540517, 535726]
60070E35726m897n120n855o790p309p117o546o286o676p181o895n608m143l421
60056D51882l450l543l310k953k652k182j322k33Q64J995L106L741L631L324L602
60041D52500M343M657M199L580L235K744J737P23K99J19m95j351j758j855k463
60026D70214l651m514m585m476m726m938m633m187m258m809n355n704n886n747
60012D02745n223m719m564m398l683k567j671j222j041j126j540j843j441n17
59998C67190J08J22J05N36J121J334J097O52K34J66Q08K043L172L632L519L110
59982C88949K375J277K49k43l46n91j112j570j740j728j644j490j328j155o61
59967C79242L75J393J427M60k12M56J857K593K459K583L493M065L068R97n34q72
$$ y = [535726, 530829, 525709, 519854, 513064, 505755, 498638, 492092, 485806, 479130, 471949, 465054, 459446, 455303, 451882, 448432, 444889, 441579, 438626, 435974, 433792, 432470, 432237, 433101, 435096, 438202, 441943, 445574, 448898, 452500, 456843, 461500, 465699, 469279, 472514, 475258, 476995, 477718, 478017, 478136, 477641, 476290, 474532, 472677, 470214, 466563, 462049, 457464, 452988, 448262, 443324, 438691, 434504, 430246, 425437, 420082, 414378, 408492, 402745, 397522, 392803, 388239, 383841, 380158, 377591, 375920, 374698, 373657, 372531, 370991, 369148, 367707, 367190, 367298, 367420, 367525, 368061, 369182, 370516, 371613, 372265, 372499, 372665, 373473, 375516, 378688, 382320, 385839, 388949, 391324, 392601, 392850, 392607, 392261, 391670, 390558, 388988, 387248, 385520, 383876, 382386, 381058, 379903, 379242, 379617, 381010, 382437, 382897, 382685, 383141, 384998, 387591, 390050, 392633, 396126, 400191, 403259, 404256, 403722, 402850]
59951D02850q33j154j546j553j461j671j799j229k11L19r1j068k120k964l251
59936C82218k741j892j548j791j728p52N84J371J439J184Q42N43P50J827L325
59921C83631M408M918N459O298O894O666N749M689L804L108K575K203J947J839
59907D44188J950K199K411K647L137L722L725K765J373M45K15J85n2l49m29k96
59891D67836o8K75P77J345J852K243K411K188J682J428J878K828L635L954L994
59876D98258M029L975L611K960K229J543Q91K25n88j721l089m171m431l867k876
59861D96978j678k40J205K089K205K196K873M231N441N841N649N579N946O259
59847E44574N672L883J483o23k128l321m243m351l366k049j598k381l720m870
$$ y = [402850, 402017, 400863, 399317, 397764, 396303, 394632, 392833, 391604, 391393, 391712, 391621, 390553, 388433, 385469, 382218, 379477, 377585, 376037, 374246, 372518, 371766, 372350, 373721, 375160, 376344, 377186, 377729, 378479, 380306, 383631, 388039, 392957, 398416, 404714, 411608, 418274, 424023, 428712, 432516, 435624, 438199, 440402, 442349, 444188, 446138, 448337, 450748, 453395, 456532, 460254, 463979, 466744, 468117, 468562, 468777, 468962, 468910, 468561, 468132, 467836, 467768, 468043, 468820, 470165, 472017, 474260, 476671, 478859, 480541, 481969, 483847, 486675, 490310, 494264, 498258, 502287, 506262, 509873, 512833, 515062, 516605, 517496, 517721, 517133, 515412, 512323, 508152, 503721, 499854, 496978, 495300, 495060, 496265, 498354, 500559, 502755, 505628, 509859, 515300, 521141, 526790, 532369, 538315, 544574, 550246, 554129, 555612, 554989, 552861, 549540, 545297, 540946, 537580, 535531, 533933, 531552, 527832, 522962]
59833E22962n672o231o458o171n317l970k438j426j584k664l577l528k822k223
59819D68881j986j863j718j616j516j355j307j543j745j407n48J81K64j88p13
59804D51821r80q82n16j93k12n16p75q59j009j428j948k265k328k253k054j597
59788D32006r06l13k71r29j894k524k570k419k559k894k846k104j023k68j80n29
59772D07777o91j23J151K483L218L351L368L552L716L628L291K816K312K046K292
59757D44187K899L349L499L900M982O234O655N972M987M608M878N112M831M264
59743E10357L972M138M417M437M238M012L649K856J727Q23N18N41K86n70j861
59728E43540l037l437k756j473n82o36j278j910k431k989l312k898j845r83r97
$$ y = [522962, 517290, 511059, 504601, 498430, 493113, 489143, 486705, 485279, 483695, 481031, 477454, 473926, 471104, 468881, 466895, 465032, 463314, 461698, 460182, 458827, 457520, 455977, 454232, 452825, 452277, 452458, 452722, 452534, 451821, 450841, 449959, 449443, 449250, 449038, 448522, 447747, 446888, 445879, 444451, 442503, 440238, 437910, 435657, 433603, 432006, 431100, 430787, 430516, 429587, 427693, 425169, 422599, 420180, 417621, 414727, 411881, 409777, 408754, 408486, 408306, 407777, 407086, 406963, 408114, 410597, 413815, 417166, 420534, 424086, 427802, 431430, 434721, 437537, 439849, 441895, 444187, 447086, 450435, 453934, 457834, 462816, 469050, 475705, 481677, 486664, 491272, 496150, 501262, 506093, 510357, 514329, 518467, 522884, 527321, 531559, 535571, 539220, 542076, 543803, 544626, 545144, 545685, 545971, 545401, 543540, 540503, 537066, 534310, 532837, 532255, 531619, 530341, 528431, 526000, 523011, 519699, 516801, 514956, 513973, 512976]
59713E12976j696k357k462k071j565j270j149q34o2R08J442J214N82J20o4l17
59697E03395p79j004n42L55Q91O24r3p07j064j206r42k54K40j14q79r05J6O25
59679D97657j28j610k436k392k533l553m953n919o215n974n253m215l306k787
59665D46383k388j789j217j135j508j790j674j416j343j264o64O09K074L011L044
59650D38933K354J501J093J409K169K677K422J494L28q35j978k860l004k315j402
59635D41986r65j027r84l97N09J059P64k23j248j791j958k188k585k795k583k116
59619D23458j639j243j059j301j883k424k797l180l361k611p59J189K086J918
59605D06394J533J511J886K597L366L538K790J874J752K209K164J328N68N59J001
$$ y = [512976, 511280, 508923, 506461, 504390, 502825, 501555, 500406, 499572, 499510, 500418, 501860, 503074, 503656, 503776, 503712, 503395, 502616, 501612, 501070, 501425, 502316, 502940, 502847, 502140, 501076, 499870, 498928, 498674, 498914, 498800, 497921, 497016, 497032, 497657, 497529, 495919, 493483, 491091, 488558, 485005, 480052, 474133, 467918, 461944, 456691, 452476, 449170, 446383, 443995, 442206, 440989, 439854, 438346, 436556, 434882, 433466, 432123, 430859, 430195, 430804, 432878, 435889, 438933, 441287, 442788, 443881, 445290, 447459, 450136, 452558, 454052, 454380, 453545, 451567, 448707, 445703, 443388, 441986, 441021, 439994, 439010, 438613, 439122, 440181, 440945, 440722, 439474, 437683, 435725, 433537, 430952, 428157, 425574, 423458, 421819, 420576, 419517, 418216, 416333, 413909, 411112, 407932, 404571, 401960, 401201, 402390, 404476, 406394, 407927, 409438, 411324, 413921, 417287, 420825, 423615, 425489, 427241, 429450, 431614, 432942, 433510, 434069, 435070]
59590D35070J378J557J422P10l44j007j075j181j677j981j572r41r09j495k075
59575D25880k251j953j136kP74O21k58j206j770j738r76J79Q19L90n05q68n55
59558D15445j49J48O44J317J658J467J180J215J514J896K332K798L254L888M957
59543D43564O279P355Q131R193J1059J3641J6522J9104K0223J8245J2423M095
59531E89834l993r631j2236j2234j0187o808l274p27N69J205J716K088K217K295
59517E40834K361J915N40j392l177m723o348p810q432q265q211q655q819p976
59503D71842o533n307m448l816l729m376m944m425l067k079j935j946j501q58
59489D22878m80l79l64k89J43J174K416L087L009K777K814K924K974L257L833
$$ y = [435070, 436448, 438005, 439427, 440137, 439793, 438786, 437711, 436530, 434853, 432872, 431300, 430359, 429450, 427955, 425880, 423629, 421676, 420540, 420538, 421312, 421933, 421675, 420469, 418699, 416961, 415985, 416164, 416983, 417373, 416868, 416000, 415445, 415296, 415444, 416088, 417405, 419063, 420530, 421710, 422925, 424439, 426335, 428667, 431465, 434719, 438607, 443564, 449843, 457198, 465329, 474522, 485581, 499222, 515744, 534848, 555071, 573316, 585739, 589834, 585841, 576210, 563974, 551740, 541553, 534745, 531471, 530744, 531313, 532518, 534234, 536322, 538539, 540834, 543195, 545110, 545650, 544258, 541081, 536358, 530010, 522200, 513768, 505503, 497292, 488637, 479818, 471842, 465309, 460002, 455554, 451738, 448009, 443633, 438689, 434264, 431197, 429118, 427183, 425237, 423736, 422878, 422398, 422019, 421655, 421366, 421509, 422683, 425099, 428186, 431195, 433972, 436786, 439710, 442684, 445941, 449774]
59474D49774M210M072L804L847M056M124M031L709K815J403K88J41O79J276J904
59459D90133K820L719M060M001M335N463O967Q103Q331P525O224N337N144M832
59445E66994L609J818K86j123l157n600p195p328o800o524o402n898m980l899
59431E13801k692j393k67O02J474K425L191L878N117P079R157J1083J3491J6580
59417E83526J9158K0153K0409K1702K4277K6661K7519K6221K1735J2868N60j1374
59405G93415j8943k1021j9182j5320j0250m153K464Q187J0770Q257P22r260j8253
59392G07433k3971k5908k4791k2027j9066j6520j4009j1192q529o609n238l846
59380E25727k354j025J17J053J363Q63L10O58J733K554K695K498K083J234L46
$$ y = [449774, 453984, 458056, 461860, 465707, 469763, 473887, 477918, 481627, 484442, 485845, 486133, 486274, 486953, 488229, 490133, 492953, 496672, 500732, 504733, 509068, 514531, 521498, 529601, 537932, 545457, 551681, 557018, 562162, 566994, 570603, 572421, 572707, 571584, 568427, 562827, 555632, 548304, 541504, 534980, 528578, 522680, 517700, 513801, 511109, 509716, 509449, 510051, 511525, 513950, 517141, 521019, 526136, 533215, 542372, 553455, 566946, 583526, 602684, 622837, 643246, 664948, 689225, 715886, 743405, 769626, 791361, 804229, 804789, 793415, 774472, 753451, 734269, 718949, 708699, 704546, 707010, 715197, 725967, 734224, 734946, 725686, 707433, 683462, 657554, 632763, 610736, 591670, 575150, 561141, 549949, 541420, 534811, 529573, 525727, 523373, 522348, 522465, 523518, 524881, 525744, 526054, 526712, 528445, 530999, 533694, 536192, 538275, 539509, 539855]
59365E39855L71J465K600K884K584K445K776L595M952O585P853Q524R081R838
59351F05408J0368J0415J0734J2179J4286J5652J5640J5015J4774J4956J4806
59340G54233J3728J1714R051N928K488q32l364m866n990p696j0208j2851j4898
59327G36437j6153j6686j6516j5757j4726j3661j2582j1503j0500r528q522p656
59315E82647p067o376n072l370k025j157o0J621L373M804O334Q298J0111J0878
59301F02939J0249Q031L792k287q625j3288j5563j5964j5128j3488j1648j0102
59289E18918q699p057n339l944k762j477m02k1M5P30K161L501M247M832N732O788
59273E17253P687Q506R392J0189J0733J1087J1300J1209J0687R790Q578P033N177
$$ y = [539855, 540226, 541691, 544291, 547175, 549759, 552204, 554980, 558575, 563527, 570112, 577965, 586489, 595570, 605408, 615776, 626191, 636925, 649104, 663390, 679042, 694682, 709697, 724471, 739427, 754233, 767961, 779675, 788726, 794654, 797142, 796310, 792946, 788080, 782090, 774394, 764186, 751335, 736437, 720284, 703598, 687082, 671325, 656599, 642938, 630356, 618853, 608353, 598825, 590303, 582647, 575580, 569204, 564132, 560762, 558737, 557580, 557520, 559141, 562514, 567318, 573652, 581950, 592061, 602939, 613188, 621219, 625011, 622724, 614099, 600811, 585248, 569284, 554156, 540668, 529020, 518918, 510219, 503162, 497823, 493879, 491117, 489640, 489238, 489217, 489262, 489992, 492153, 495654, 499901, 504733, 510465, 517253, 524940, 533446, 542838, 553027, 563760, 574847, 586147, 597356, 608043, 617833, 626411, 633444, 638621]
59260F38621L057P62j377k828l528m153n269o438o849o518o177o143o111n929
59246E81120n714n160l647j302Q64K120K741L340M125N004N792O088N567M650
59232F05588M214M385M167K711M29j520k454k497k175k060k568l722n124o303
59218E93071o953p035o917p238q136q821q451p320o450o106n572m468l362k853
59204E03389k854l067l389l532l021j986j267j276j519j520j409j182l06J285
59190D78346K588K749K226J958J989J831J713K367L747M863M985M364L751L682
59176E21159M195M864N173N133N341O075O731O594N840N246N236N683O380P060
59162F00710P124O043M050J932J60j384k848m091m965n639o471p668q952r623
$$ y = [638621, 641678, 642440, 641063, 638235, 634707, 630554, 625285, 618847, 611998, 605480, 599303, 593160, 587049, 581120, 575406, 570246, 566599, 565297, 566161, 568281, 571022, 574362, 578487, 583491, 589283, 595371, 600938, 605588, 609802, 614187, 618354, 621065, 621494, 619974, 617520, 615023, 612848, 610788, 608220, 604498, 599374, 593071, 586118, 579083, 572166, 564928, 556792, 547971, 539520, 532200, 525750, 519644, 514072, 509604, 506242, 503389, 500535, 497468, 494079, 490547, 487526, 485540, 484273, 482997, 481478, 479958, 478549, 477367, 477061, 478346, 480934, 483683, 485909, 487867, 489856, 491687, 493400, 495767, 499514, 504377, 509362, 513726, 517477, 521159, 525354, 530218, 535391, 540524, 545865, 551940, 558671, 565265, 571105, 576351, 581587, 587270, 593650, 600710, 607834, 613877, 617927, 619859, 620019, 618635, 615787, 611696, 606731, 601092, 594621, 586953, 578001, 568378]
59148E68378r226q234p641p691p589o774n848n704o255o682o605o270n793n002
59134D73064m014l321l147l174k951k332j486p15j36N57J723L045L661L357L106
59119D67237L929N621P215Q257Q988R550R826R893R952R925R708R631J0013J0416
59105E90161J0102R104Q085P195N972M408L225K776K439J519K19p43j076j116
59091F42270j327j910k718l361l505l143k483j707j073j084k096l782n343o319
59077F02419o804o923o562n759m966m676m973n516n854n795n506n263m970m266
59063E24586l266k771l324m374m871m474l626k721j843j211j168j598j973k005
59049D85361j814j490j009o19o70r31p15J54J027J284J007O13L00J50L16P78J225
$$ y = [568378, 559152, 550918, 543277, 535586, 527997, 521223, 515375, 509671, 503416, 496734, 490129, 483859, 478066, 473064, 469050, 465729, 462582, 459408, 456457, 454125, 452639, 451924, 451788, 452345, 454068, 457113, 460774, 464131, 467237, 471166, 476787, 484002, 492259, 501247, 510797, 520623, 530516, 540468, 550393, 560101, 569732, 579745, 590161, 600263, 609367, 617452, 624647, 630619, 635027, 638252, 641028, 643467, 644986, 645205, 644462, 643386, 642270, 640943, 639033, 636315, 632954, 629449, 626306, 623823, 622116, 621043, 619959, 617863, 614081, 608738, 602419, 595615, 588692, 582130, 576371, 571405, 566729, 561756, 556240, 550386, 544591, 539085, 533822, 528852, 524586, 521320, 518549, 515225, 510851, 505980, 501506, 497880, 495159, 493316, 492105, 490937, 489339, 487366, 485361, 483547, 482057, 481048, 480429, 479759, 478828, 478113, 478267, 479294, 480578, 481585, 482198, 482498, 482648, 482964, 483742, 484967]
59032D84967J476J770K428L400M312M831M876M759N079O270Q157J0131J1703J2695
59018E66854J3028J2747J2119J1326J0038P784M691J514j129l085m271m506l945
59005F23165l206k800k610k109q92R58K826L965M201M131M335M579M210L200K195
58990F46148J630J299Q44K10m36r12j231j852l385n486o577n466k967r29R4J124
58974F22108K776M372N345O227P570Q934R632R743R617R159Q365P894Q286R051
58960G29079R340R063Q582P678N762K955J69j957l659n493p700j0133j2428j4173
58946G17085j5106j5234j4742j3921j3133j2494j1568r827p577n824n062m777
58934E87820m411m102m041l779k915j909j444j366j028l80J7l4j41l6J37J70k9
$$ y = [484967, 486443, 488213, 490641, 494041, 498353, 503184, 508060, 512819, 517898, 524168, 532325, 542456, 554159, 566854, 579882, 592629, 604748, 616074, 626112, 633896, 638587, 640101, 638972, 635887, 631616, 627110, 623165, 619959, 617159, 614549, 612440, 611548, 612506, 615332, 619297, 623498, 627629, 631964, 636543, 640753, 643953, 646148, 647778, 649077, 649921, 650131, 649695, 648783, 647552, 645700, 642315, 636829, 630252, 624786, 621819, 620890, 620984, 622108, 624884, 629256, 634601, 640828, 648398, 657332, 666964, 676707, 686324, 695483, 703848, 711742, 720028, 729079, 738419, 747482, 756064, 763742, 769504, 772459, 772628, 770671, 767012, 761519, 753819, 743686, 731258, 717085, 701979, 686745, 672003, 658082, 644949, 632455, 620887, 611060, 603483, 597659, 592597, 587820, 583409, 579307, 575266, 571487, 568572, 566663, 565219, 563853, 562825, 562445, 562462, 562428, 562287, 562251, 562388, 562558, 562529]
58917E62529n79j407j960j684p56J04M45L48O0k8P14K571M795O265O876P632R135
58900E95060J0753J1596J1692J1664J1662J1294J0495R895J0213J1520J3228J4733
58888G33805J5974J7396J9255K1050K1716K0469J7475J3733J0326P691N422K800
58876I07112m13l755o648r046j1363j3827j6065j7324j7065j5422j3209j1330
58864G71645j0077r055p866o689o050o188o851p567p956p955p957q528r688j0572
58850F58646j0248q781p203o383o276o357o321o127n672m948m474m999o518p926
58836E66413q056p013n996n758n781n246m312l893m304m789m407k983j081N73
58822E03367J535J928K396L448M752N415N046M228L746L723L726L390K698J873
$$ y = [562529, 561950, 560543, 558583, 556899, 556143, 556247, 556692, 557040, 557100, 557072, 557786, 560357, 565152, 571417, 578293, 585925, 595060, 605813, 617409, 629101, 640765, 652427, 663721, 674216, 684111, 694324, 705844, 719072, 733805, 749779, 767175, 786430, 807480, 829196, 849665, 867140, 880873, 891199, 898890, 904312, 907112, 906699, 902944, 896296, 887250, 875887, 862060, 845995, 828671, 811606, 796184, 782975, 771645, 761568, 752513, 744647, 737958, 731908, 725720, 718869, 711302, 703346, 695391, 687434, 678906, 669218, 658646, 648398, 639617, 632414, 626031, 619755, 613398, 607077, 600950, 595278, 590330, 585856, 580857, 574339, 566413, 558357, 551344, 545348, 539590, 533809, 528563, 524251, 520358, 516054, 511265, 506858, 503875, 502794, 503367, 504902, 506830, 509226, 512674, 517426, 522841, 527887, 532115, 535861, 539584, 543310, 546700, 549398, 551271]
58808E51271J228R46Q51N99O9n78j267k000k510k441j985j888k522l402l883l921
58792E28567l869l907m006m107m010l420k433j594j123n08O89K080K935L171L254
58777E11719L395L346K953K419J997J706J263J72j803m068n481n599n166n054
58763E01799n149m867m248l726l205k290j258q33q54k70J343L055L843L834L706
58748D90880L498K704J311N8k86M92K041L679M682M803M491M395M650M958N222
58733E37578N685O424P152P679Q132Q452Q174P066N680M775M380M047L784M014
58719F23022M600M888M886N504P114Q708R261R104R113R135Q306O551M599K697
58705G17488M40k206m818p450j0491j3497j5399j6114j6806j8050j8969j8660
$$ y = [551271, 552499, 553445, 554296, 554895, 554964, 554386, 553119, 551119, 548609, 546168, 544183, 542295, 539773, 536371, 532488, 528567, 524698, 520791, 516785, 512678, 508668, 505248, 502815, 501221, 500098, 499590, 500279, 502359, 505294, 508465, 511719, 515114, 518460, 521413, 523832, 525829, 527535, 528798, 528970, 527167, 523099, 517618, 512019, 506853, 501799, 496650, 491783, 487535, 483809, 480604, 478314, 477056, 476223, 475369, 475099, 476442, 479497, 483340, 487174, 490880, 494378, 497082, 498393, 498451, 498165, 498657, 500698, 504377, 509059, 513862, 518353, 522748, 527398, 532356, 537578, 543263, 549687, 556839, 564518, 572650, 581102, 589276, 596342, 602022, 606797, 611177, 615224, 619008, 623022, 627622, 632510, 637396, 642900, 650014, 658722, 667983, 677087, 686200, 695335, 703641, 710192, 714791, 717488, 717928, 715722, 710904, 703454, 692963, 679466, 664067, 647953, 631147, 613097, 594128, 575468]
58693E75468j7443j6026j4459j2620j0836r291p717o271n759o191o232n106l988
58680D53529m248n180m950l245j450m87N6P39J538K375L323M154M681N465P229
58665D63529R549J1160J1646J1721J1822J1448J0153Q189N847L124L40j827l279
58652E53422m673o232p193o931n913n034m615m570m874n258m932l453j573n70
58638D87601p75j315j285o84p7K55N00Q05Q70K28j148k712l914m713n474o427
58622D61735p340p559o375l577K29M010P145R604J1380J2155J1744J0448Q751
58609E12350P013N586M681L933K692J016k24o22q14j357j803j654j476k175l543
58594E23603m489m319l122j309M77J531J915K662M346O028O604O522P018Q203
$$ y = [575468, 558025, 541999, 527540, 514920, 504084, 494793, 487076, 480805, 475046, 468855, 462623, 457517, 453529, 449281, 444101, 439151, 435906, 434456, 433969, 434025, 434764, 436302, 438677, 442000, 446154, 450835, 456300, 463529, 473078, 484238, 495884, 507605, 519427, 530875, 541028, 549217, 555064, 558188, 558528, 556701, 553422, 548749, 542517, 535324, 528393, 522480, 517446, 512831, 508261, 503387, 498129, 493197, 489744, 488171, 487601, 486826, 485511, 484226, 483542, 483465, 483720, 484220, 485025, 485895, 486123, 484975, 482263, 478349, 473636, 468162, 461735, 454395, 446836, 440461, 436884, 437113, 441123, 448268, 457872, 469252, 481407, 493151, 503599, 512350, 519363, 524949, 529630, 533563, 536255, 537271, 537047, 536425, 535611, 534254, 532451, 530797, 529321, 527146, 523603, 519114, 514795, 511673, 510364, 510841, 512372, 514287, 516949, 521295, 527323, 533927, 540449, 547467, 555670]
58580E55670R199R722J0092J0028Q906P258O453O774P146O908O581O672P104Q080
58566F66593J0159J3044J5581J7396J9286K1559K3319K3980K4203K4460K3884
58555H83464K1513J7737J3623R537N415J671j174l272n095o626p582q091q577
58542I12543r298j0388j1953j3710j5070j5930j6820j7869j8348j7708j6446j5250
58530G33753j3899j1711q726n822l828k996k978k959k188q19J27k6p94j267j177
58515F74690q83p21q56j362k057k534k690k885l305l557l302k832k687k982l441
58500F38596l776l768l296k561k019j897j998j999j618o04Q60J868J646P98Q02
58485F21034K160L923N275O544Q184R739J0659J1275J2082J2636J2156J0865R750
$$ y = [555670, 564869, 574591, 584683, 594711, 603617, 610875, 617328, 624102, 631248, 638156, 644737, 651409, 658513, 666593, 676752, 689796, 705377, 722773, 742059, 763618, 786937, 810917, 835120, 859580, 883464, 904977, 922714, 936337, 945874, 951289, 952960, 951786, 948514, 943419, 936793, 929211, 921120, 912543, 903245, 892857, 880904, 867194, 852124, 836194, 819374, 801505, 783157, 765449, 749003, 733753, 719854, 708143, 699417, 693595, 689767, 686771, 683793, 680834, 678646, 677827, 677954, 677928, 677134, 675867, 674690, 673807, 673086, 672230, 670868, 668811, 666277, 663587, 660702, 657397, 653840, 650538, 647706, 645019, 642037, 638596, 634820, 631052, 627756, 625195, 623176, 621279, 619281, 617282, 615664, 615060, 615920, 617788, 619434, 620232, 621034, 623194, 627117, 632392, 638936, 647120, 656859, 667518, 678793, 690875, 703511, 715667, 726532, 736282]
58472G36282R051P786N069J261k430n192p141q627r445r110p800o388n246l694
58458F94376j215J417L081L951N145O989Q657R495R555Q838P045M377J641o21
58444G62731k385l596m179m571n167n386m404k670j439q57M3J373K089J931K001
58429G35514K973M284N631P526R694J0661R886Q718Q205P523N743L562J871N8
58415H21849k605n097n929n509n536o567p719q373q735q861q408p282n697l791
58401G31740j827l76K76N52Q85J229J649K549L736M209L596K827K679K665K172
58386G58561J554J268R84N48O31J406J764J082N49J434L090M218M997O315P813
58371G96214Q418Q203Q130Q357Q340Q154Q288Q537Q472Q501R210J0069J0179R764
$$ y = [736282, 745333, 753119, 758188, 759449, 757019, 751827, 744686, 736059, 726614, 717504, 709704, 703316, 698070, 694376, 693161, 694578, 697659, 701610, 706755, 713744, 722401, 731896, 741451, 750289, 757334, 761711, 763352, 762731, 760346, 756750, 752571, 748000, 742833, 737447, 733043, 730373, 728934, 728077, 728120, 729493, 731582, 733513, 735514, 738487, 742771, 748402, 755928, 765622, 776283, 786169, 794887, 803092, 810615, 816358, 819920, 821791, 821849, 819244, 814147, 808218, 802709, 797173, 790606, 782887, 774514, 765779, 756918, 748510, 741228, 735531, 731740, 729913, 729537, 729813, 730365, 731250, 732479, 734128, 736677, 740413, 744622, 748218, 751045, 753724, 756389, 758561, 760115, 761383, 762367, 762915, 763546, 764952, 766716, 767798, 768347, 769781, 772871, 777089, 782086, 788401, 796214, 804632, 812835, 820965, 829322, 837662, 845816, 854104, 862641, 871113, 879614, 888824, 898893, 909072, 918836]
58357I18836R629R617R033Q064P426O937N928M700M145M191L944L251K855L163
58343A001719L896M828N921P001Q104R692J1755J3378J4029J4425J5229J5914
58331A125891J5997J6214J7064J7274J5444J2344R793Q040O074L905K609K439
58319A253088K620K828L360M041M441M867N839O986P701Q409R816J1496J2571
58306A338063J3245J4251J5406J6134J6717J7652J8420J8455J8494J9416K0483
58295A526736K0372J9304J8417J7828J7035J6553J7363J9180K0846K1965K2835
58284A738434K3475K4015K5027K6325K6647K5895K5957K7816K9661K9933L0144
58273B033329L2329L5578L7844L9439M1813M4430M5960M7212M9810N3136N5732
$$ y = [918836, 928465, 938082, 947115, 955179, 962605, 969542, 975470, 980170, 984315, 988506, 992450, 995701, 998556, 1001719, 1005615, 1010443, 1016364, 1023365, 1031469, 1041161, 1052916, 1066294, 1080323, 1094748, 1109977, 1125891, 1141888, 1158102, 1175166, 1192440, 1207884, 1220228, 1230021, 1238061, 1244135, 1248040, 1250649, 1253088, 1255708, 1258536, 1261896, 1265937, 1270378, 1275245, 1281084, 1288070, 1295771, 1304180, 1313996, 1325492, 1338063, 1351308, 1365559, 1380965, 1397099, 1413816, 1431468, 1449888, 1468343, 1486837, 1506253, 1526736, 1547108, 1566412, 1584829, 1602657, 1619692, 1636245, 1653608, 1672788, 1693634, 1715599, 1738434, 1761909, 1785924, 1810951, 1837276, 1863923, 1889818, 1915775, 1943591, 1973252, 2003185, 2033329, 2065658, 2101236, 2139080, 2178519, 2220332, 2264762, 2310722, 2357934, 2407744, 2460880, 2516612]
58262B516612N8321O2312O6580O9043P0134P1416P2122P0727O8617O8356O9530
58251C263770P0058P0404P2451P5502P7671Q0026Q4903R1267R6433J01310J08951
58240D192746J18706J27037J33608J41389J51049J60497J69677J80611J92875
58231E568195K04265K15704K30105K46805K62587K77902K96305L18162L40932
58222G960962L65296L94695M29142M66027N06608N54805O10103O69037P33252
58213A2689927Q08345Q95271R91262J098698J224084J368881J531390J717888
58205B2325746J942002K213962K542202K945533L451449M083162M863593N833994
58197E0201643P053080Q572738J0423431J2617888J5150929J8002197K1167235
$$ y = [2516612, 2574933, 2637245, 2703825, 2772868, 2843002, 2914418, 2986540, 3057267, 3125884, 3194240, 3263770, 3333828, 3404232, 3476683, 3552185, 3629856, 3709882, 3794785, 3886052, 3982485, 4083795, 4192746, 4311452, 4438489, 4572097, 4713486, 4864535, 5025032, 5194709, 5375320, 5568195, 5772460, 5988164, 6218269, 6465074, 6727661, 7005563, 7301868, 7620030, 7960962, 8326258, 8720953, 9150095, 9616122, 10122730, 10677535, 11287638, 11956675, 12689927, 13498272, 14393543, 15384805, 16483503, 17707587, 19076468, 20607858, 22325746, 24267748, 26481710, 29023912, 31969445, 35420894, 39504056, 44367649, 50201643, 57254723, 65827461, 76250892, 88868780, 104019709, 122021906, 143189141]
58190A43189141K4683219K8577921L2744044L6804504L9981872M0990930L8176056
58183C85147687L0184373J7005262N70015j5816223k8971224l7169347m0442132
58176C10508411l9948617l7135443l3211396k8980853k4880376k1105334j7742489
58169A07503903j4834565j2380264j0336951q650213p271958o152351n237909
58162D2639692m486762l872734l370586k950727k591811k285453k024147j795551
58154A9261921j591755j413030j258245j120753r96868q89280p98494p18987o47002
58145I827507n84647n33149m88934m49316m15723l88432l63853l39460l16224
58136E947769k94389k72109k49949k31267k16483k02138j87147j74652j65988
$$ y = [143189141, 167872360, 196450281, 229194325, 265998829, 305980701, 346971631, 385147687, 415332060, 432337322, 432907337, 417091114, 388119890, 350950543, 310508411, 270559794, 233424351, 200212955, 171232102, 146351726, 125246392, 107503903, 92669338, 80289074, 69952123, 61301910, 54029952, 47877601, 42639692, 38152930, 34280196, 30909610, 27958883, 25367072, 23081619, 21057472, 19261921, 17670166, 16257136, 14998891, 13878138, 12881270, 11991990, 11193496, 10474509, 9827507, 9242860, 8709711, 8220777, 7771461, 7355738, 6967306, 6603453, 6263993, 5947769, 5653380, 5381271, 5131322, 4900055, 4683572, 4481434, 4294287, 4119635, 3953647]
58127C953647j58073j48810j40100j33363j26780j19195j12445j07602j02772
58118B804507r6704r0967q6718q2676p7899p3319o9231o4501n9400n5824n3744
58107A993524n0890m6941m4331m3784m2938m0679l9072l9352l9720l8759l7607
58096A529451l6946l5282l2203l0108l0520l1490l0703k8593k6591k4709k2685
58085A199621k1230k0487j9422j8094j8191k0058k1599k1464k0866k0883k0569
58074I76758j9240j8114j8027j7877j6905j6186j6257j5673j3626j1701j1218
58063H01934j1060r966q835q770q906q162p360p630q347q560q816r670j0034q886
58049F76932p270o669o748o431n980o234o912p377p923q789r065q165p186p301
$$ y = [3953647, 3795574, 3646764, 3506664, 3373301, 3246521, 3127326, 3014881, 2907279, 2804507, 2707803, 2616836, 2530118, 2447442, 2369543, 2296224, 2226993, 2162492, 2103092, 2047268, 1993524, 1942634, 1895693, 1851362, 1807578, 1764640, 1723961, 1684889, 1645537, 1605817, 1567058, 1529451, 1492505, 1457223, 1425020, 1394912, 1364392, 1332902, 1302199, 1273606, 1247015, 1222306, 1199621, 1178391, 1157904, 1138482, 1120388, 1102197, 1082139, 1060540, 1039076, 1018210, 997327, 976758, 957518, 939404, 921377, 903500, 886595, 870409, 854152, 838479, 824853, 813152, 801934, 790874, 780908, 772073, 763303, 754397, 746235, 738875, 731245, 722898, 714338, 705522, 695852, 685818, 676932, 669662, 662993, 656245, 649814, 643834, 637600, 630688, 623311, 615388, 606599, 597534, 589369, 582183, 574882]
58035E74882p935q000p726p698p309o015m964n555p195q205q238q063p716o626
58021D73637n224m655n034n318m831l863k951k425k508l021l278k824j928j006
58007D24771j74L17Q2m89l36P21J546J361P93O49Q21J010J323J426M63j406k745
57990D30133l007l464m978o307o045m826m142m082l818l382l386l716l947m332
57976C70701n117n573n015m085l739l672l085k247j908j811j238n26n47j058r97
57961C30083j29Q31J527K192K758K810K320J561N06q09j761j894j805k356l324
57946C32510l725l156j969n04J056K378L303M153N070N633N765O276P681R149
57932C73620R627R271Q784P940O058L389R06j089k984m776n964o441o634o887
$$ y = [574882, 566947, 558947, 551221, 543523, 536214, 530199, 525235, 519680, 512485, 504280, 496042, 487979, 480263, 473637, 468413, 463758, 458724, 453406, 448575, 444712, 441761, 439336, 436828, 433807, 430529, 427705, 425777, 424771, 424597, 424914, 424996, 424507, 424171, 424892, 426438, 427799, 428592, 429241, 430062, 431072, 432395, 433821, 434284, 432878, 430133, 427126, 423662, 418684, 412377, 406332, 401506, 397364, 393282, 389464, 386082, 382696, 378980, 375033, 370701, 365584, 360011, 354996, 350911, 347172, 343500, 340415, 338168, 336260, 334449, 333211, 332685, 332138, 331080, 330083, 329954, 330785, 332312, 334504, 337262, 340072, 342392, 343953, 344459, 343650, 341889, 339995, 338190, 335834, 332510, 328785, 325629, 323660, 323156, 324212, 326590, 329893, 334046, 339116, 344749, 350514, 356790, 364471, 373620, 383247, 392518, 401302, 409242, 415300, 418689, 419595, 418506, 415522, 410746, 404782, 398341, 391707, 384820]
57918C84820p323p950q345p749o124m518l678k961j584j32K32m04p57P3J891L852
57902C39343M914M367K661J117K55p30k143k783j857o49p06j498j541j016j221
57887C38513k051k107j190o71j279k229k769l034l129k785k216k103k437k558
57873C07955k388k519k991l215l167l392l735l303j924m06P90K050L525M739N512
57858B97531O201O816O958O743O726O796O337N501N118N084M244K204qj509k509
57843C62233l293l535l312l549m706n978o505o461o282n803m892m116l958m032
57829B95811l795l396l129k705j741n32L86R77J458J706J494R90N77L70K17j65
57813B88523j174l029n272p026p856p928p355o159m973m732n285n238l736j682
$$ y = [384820, 377497, 369547, 361202, 353453, 347329, 342811, 339133, 336172, 334588, 334456, 334688, 334284, 333527, 333600, 335491, 339343, 344257, 348624, 351285, 352402, 352657, 351927, 349784, 347001, 345144, 344495, 343789, 342291, 340750, 339734, 338513, 336462, 334355, 333165, 332494, 331215, 328986, 326217, 323183, 320054, 317269, 315053, 312950, 310513, 307955, 305567, 303048, 300057, 296842, 293675, 290283, 286548, 283245, 281321, 280915, 281705, 283755, 287280, 292019, 297531, 303732, 310548, 317506, 324249, 330975, 337771, 344108, 349609, 354727, 359811, 364055, 366259, 366251, 364742, 362233, 358940, 355405, 352093, 348544, 343838, 337860, 331355, 324894, 318612, 312809, 307917, 303801, 299843, 295811, 292016, 288620, 285491, 282786, 281045, 280513, 280899, 281876, 283334, 285040, 286534, 287524, 288101, 288471, 288688, 288523, 287349, 284320, 279048, 272022, 264166, 256238, 248883, 242724, 237751, 233019, 227734, 222496, 218760, 217078]
57799B17078n49o26j091j216q22j8Q33J199J068J210K219L614M478M664M781N208
57783B42030N735O058O139O054N898N889O194O665O909O668N998N072L968K687
57769C21964J324J74n48j095k088l734n387o200o062n530n086m778m424l741k476
57754B72313q51M14J018J670L099M772N495N003L974K637N34k147m228m875m431
57739B84397l579k566j652j317j466j253k69P75J118R88J012J239J461J787K255
57724B82930K326J551L71m11p02r96j514k035k381k501k250j629j081j094j620
57709B68964k291l036m017n016n439n056m428m334m792m875l749j831m96m46q59
57694B18299p20l63q62k200l196l278l140l356l504l121k583k254j690m52R91
$$ y = [217078, 216529, 215903, 214812, 213596, 212774, 212756, 213589, 214788, 215856, 217066, 219285, 222899, 227377, 232041, 236822, 242030, 247765, 253823, 259962, 266016, 271914, 277803, 283997, 290662, 297571, 304239, 310237, 315309, 319277, 321964, 323288, 323462, 322914, 321819, 319731, 315997, 310610, 304410, 298348, 292818, 287732, 282954, 278530, 274789, 272313, 271462, 271876, 272894, 274564, 277663, 282435, 287930, 292933, 296907, 299544, 300078, 297931, 293703, 288828, 284397, 280818, 278252, 276600, 275283, 273817, 272564, 272295, 273070, 274188, 275176, 276188, 277427, 278888, 280675, 282930, 285256, 286807, 287178, 286767, 286065, 285069, 283555, 281520, 279139, 276638, 274388, 272759, 271678, 270584, 268964, 266673, 263637, 259620, 254604, 249165, 244109, 239681, 235347, 230555, 225680, 221931, 220100, 219604, 219158, 218299, 217579, 217216, 216354, 214154, 210958, 207680, 204540, 201184, 197680, 194559, 191976, 189722, 188032, 187580, 188571]
57679A88571J978K827M400O900R826J2825J5954J9309K3049K7573L3108L9275
57667C85595M5289N0157N2281M9375L9684K3392K813j8356l5907m6448m9255m6757
57655D51863m2402l7996l3406k8358k3433j9330j6059j3199j0544q271o690n916
57643B06259n657n357m701l795k788j682o38oK11M49P92P01k9o18l40L02K40o66
57625A82677j572j835j516r26m31o35j804l178l577k791j747j169q73n21l12n60
57609A59230j051j309j227j131j371j889k202j845r76l71n32j071j335j354j568
57594A39998j911j903j642j903k992m139m370l582k457j680j452j526j495j219
57580A07727j019j226j525j181p2R41R58M4r69j499j716k135k929l665l662k644
$$ y = [188571, 190549, 193376, 197776, 204676, 214502, 227327, 243281, 262590, 285639, 313212, 346320, 385595, 430884, 481041, 533322, 582697, 622381, 645773, 648586, 630230, 594323, 547875, 498620, 451863, 409461, 371465, 338059, 309701, 286268, 266938, 250879, 237680, 227136, 218865, 212175, 206259, 200602, 195245, 190544, 186749, 183961, 182279, 181641, 181635, 181846, 182295, 183087, 183788, 183759, 183141, 182801, 183103, 183343, 182677, 181105, 179270, 177754, 176828, 176397, 175762, 173958, 170780, 167203, 164412, 162665, 161496, 160623, 160102, 159790, 159230, 158179, 156870, 155643, 154512, 153141, 151252, 149050, 147205, 146229, 145858, 145326, 144255, 142920, 141566, 139998, 138087, 136184, 134542, 132639, 129647, 125508, 121138, 117556, 115099, 113419, 111967, 110441, 108946, 107727, 106708, 105482, 103957, 102776, 102704, 103645, 104603, 104647, 103678, 102179, 100463, 98328, 95399, 91734, 88072, 85428]
57564H5428j119oJ77l29r01j165j106q12l05L53Q64Q61L00m04q06q29o33k49K88
57545G9607O31M38MPN15Q81Q13Q00J136J189L69p75j217q58m66m98p74j145j609
57526G9048j729q88P42K204K883K989K753K056J117P84J465K430K747K469K298
57511A03368K405K337J916J476J256J085Q61P77Q67P62J61p31j480j913k095k071
57495A08981j995k272l082l879l859l019k187j833j510q24l25p03j544j741r77
57480G9231k1M33M03Q4m43p81m19L43N25p9m74L8P57P45K59J48M01L46j42n55
57460H0799p12q42q74m82K26P52R59J071J062P26K65R4J51L0k70m10m07n27o04
57441H1007k91J40Q0l68n36m26p13j428j692j136n51o01p51j62J061K078K281
$$ y = [85428, 84309, 84303, 84480, 84151, 83250, 82085, 80979, 80167, 79862, 80215, 81079, 81940, 82240, 81836, 81030, 80201, 79568, 79319, 79607, 80238, 80676, 80680, 80687, 81202, 82083, 82896, 83696, 84832, 86021, 86390, 85615, 84398, 83540, 83074, 82576, 81802, 80657, 79048, 77319, 76431, 77173, 79377, 82260, 85249, 88002, 90058, 91175, 91959, 93424, 95854, 98601, 101070, 103368, 105773, 108110, 110026, 111502, 112758, 113843, 114704, 115481, 116348, 117110, 117271, 116540, 115060, 113147, 111052, 108981, 106986, 104714, 101632, 97753, 93894, 90875, 88688, 86855, 85345, 84521, 84196, 83493, 81949, 80208, 79231, 79210, 79643, 80046, 80130, 79687, 78906, 78487, 78830, 79355, 79276, 78802, 78840, 79597, 80342, 80601, 80749, 81150, 81496, 81354, 80799, 80087, 79245, 78371, 77889, 78115, 78867, 79826, 80897, 81959, 82685, 82950, 83044, 83195, 83225, 82955, 82545, 82138, 81611, 81007, 80716, 80856, 80936, 80568, 80032, 79606, 78893, 77465, 75773, 74637, 74086, 73485, 72734, 72572, 73633, 75711, 77992]
57424G7992J540J11j213j476o81m5n25j632k180j756q03J89Q14N12q33k206k258
57407F5550q61P20J312Q85J19m99q40q49n12l8J90o3o33j060r70m01K96P96Q94
57388F4036M52m40j296j644j543j330q96J67J623K521K380J803J458J102K31q35
57372F7789j338j237j151j254j070m21J77L44M35R45J667J925J440O27L0k65n39
57355F8104q45p98j18P76J048L99n36r50p00j83K92O33O97L62j57m47m29m60q40
57336F5848j392j647j338o81j86j89n43r00j171j554k049k309k111j616j004k20
57320D6938N96Q51K00p42j012n21j20l26o42m13J59K97k41q74j005p37n51n70
57302D1287n25l75n40j226j912j914j297p45n52l28J37L82K0n54o82l86j88j98
$$ y = [77992, 79532, 79643, 78430, 76954, 76273, 76228, 75703, 74071, 71891, 70135, 69332, 69521, 70335, 70847, 70014, 67808, 65550, 64689, 65409, 66721, 67606, 67725, 67226, 66386, 65537, 65025, 64987, 65177, 65114, 64481, 63421, 62451, 62050, 62346, 63142, 64036, 64488, 64048, 62752, 61108, 59565, 58235, 57339, 57506, 59129, 61650, 64030, 65833, 67291, 68393, 68624, 67789, 66451, 65214, 64063, 62809, 61739, 61318, 61495, 61839, 62274, 63219, 64886, 66811, 68251, 68878, 68908, 68643, 68104, 67259, 66461, 66343, 67119, 68167, 68566, 68030, 67080, 66380, 66197, 66489, 67122, 67819, 68181, 68024, 67577, 67148, 66688, 65848, 64456, 62809, 61471, 60790, 60604, 60415, 59872, 58972, 57801, 56247, 54198, 51889, 49778, 48162, 47158, 46938, 47534, 48385, 48585, 47843, 46831, 46310, 46190, 45864, 45222, 44809, 44968, 45265, 45024, 44150, 43145, 42408, 41857, 41287, 40762, 40387, 39847, 38621, 36709, 34795, 33498, 32753, 32201, 31873, 32010, 32392, 32412, 31858, 31176, 30790, 30602, 30404]
57284C0404M7Q41J860K534K570K080J542J527K197L012L296L005K669K599K585
57269F2768K412K245K340K620K734K468J982J716J961K370K137R46m18r28n84
57254H6769l24o51j084j122j063j337j611j177l1J038J354Q45j83j260j709j112
57238G7342kM13l16j119o12J070K241J623j23j168n63R68K129K372J979J306N46
57221H8086m1j78qm8n68j248j562j271m29P60J821K119J474N09K1P0Q2k50o36
57202H8703p75p47o37j79Q11J951K574K447J902J357R81P61N90L84J84K02M88
57185A00997P33O57L86K04M0l32p07o35j74J10O0J84P90J417J562J456J571J865
57167A10184K113K607L730N054N687N525N363N707O197O424O519O603O310N423
$$ y = [30404, 30451, 31292, 33152, 35686, 38256, 40336, 41878, 43405, 45602, 48614, 51910, 54915, 57584, 60183, 62768, 65180, 67425, 69765, 72385, 75119, 77587, 79569, 81285, 83246, 85616, 87753, 88699, 88281, 87353, 86769, 86445, 85794, 84710, 83588, 82525, 81188, 79577, 78400, 78369, 79407, 80761, 81606, 81423, 80163, 78454, 77342, 77340, 77753, 77437, 76318, 75706, 76776, 79017, 80640, 80517, 79349, 78786, 79754, 81883, 84255, 86234, 87540, 88086, 88045, 87867, 87859, 87811, 87243, 85995, 84433, 83162, 82733, 83493, 85314, 87433, 88907, 89416, 89437, 89507, 89589, 89339, 88703, 87928, 87181, 86544, 86365, 87176, 89127, 91701, 94148, 96050, 97407, 98388, 99149, 99739, 100123, 100307, 100509, 100997, 101730, 102387, 102773, 102977, 103017, 102685, 101978, 101343, 101169, 101279, 101339, 101523, 102313, 103730, 105292, 106748, 108319, 110184, 112297, 114904, 118634, 123688, 129375, 134900, 140263, 145970, 152167, 158591, 165110, 171713, 178023, 183446]
57153A83446M474M126M231M082L427K707K398K512K748K836K741K742L218M112
57139B29800M790M761M449M785O066P596Q505Q534P982P294O913P201Q174R501
57125C26351J0981J2748J4850J6881J8468J9976K2262K5712K9877L4174L8529
57114E70809M3234M8429N4037N9845O5544P0882P6194Q2474R0594J00569J11980
57103A374591J25094J41309J62547J90448K26080K70187L23696L87886M63586
57094C665424N49871O43798P41398Q37989R27128J000319J048855J066388J052133
57085A1533303J017536R92647J017634J112059J243803J334638J309284J146390
57077B0707294Q83881N79044K67987m0519l45253o36553q97561j113552j277256
$$ y = [183446, 187920, 192046, 196277, 200359, 203786, 206493, 208891, 211403, 214151, 216987, 219728, 222470, 225688, 229800, 234590, 239351, 243800, 248585, 254651, 262247, 270752, 279286, 287268, 294562, 301475, 308676, 316850, 326351, 337332, 350080, 364930, 381811, 400279, 420255, 442517, 468229, 498106, 532280, 570809, 614043, 662472, 716509, 776354, 841898, 912780, 988974, 1071448, 1162042, 1262611, 1374591, 1499685, 1640994, 1803541, 1993989, 2220069, 2490256, 2813952, 3201838, 3665424, 4215295, 4859093, 5600491, 6438480, 7365608, 8365927, 9414782, 10481170, 11533303, 12550839, 13543486, 14561120, 15673179, 16916982, 18251620, 19560904, 20707294, 21591175, 22170219, 22438206, 22397687, 22052434, 21415881, 20518320, 19404768, 18127512]
57068A8127512j387639j445905j452899j410291j324252j207036j073838r38012
57060G887640q08810o91915n90399n05548m37793l86727l49698l21441k96537
57051C498772k72250k48532k25925k04492j84253j65308j47510j30695j15171
57042A804636j01284q8752p7133o6562n7333m9017m0837l2661k4926j7784j0879
57031A237468l669M323J2650J8382J6595M390j5375l5539n0026n7273n9031n7565
57019A015330n4365n0117m5057l9609l4729l1121k8324k5394k2287j9648j7521
57008F47158j5442j3654j2931j3147j3305j3144j3385j4035j3933j2550j0955
56997E00677j0263j0233j0098r728r145p904n920m079l075k314q62J252L477N776
$$ y = [18127512, 16739873, 15293968, 13841069, 12430778, 11106526, 9899490, 8825652, 7887640, 7078830, 6386915, 5796516, 5290968, 4853175, 4466448, 4116750, 3795309, 3498772, 3226522, 2977990, 2752065, 2547573, 2363320, 2198012, 2050502, 1919807, 1804636, 1703352, 1614600, 1537467, 1470905, 1413572, 1364555, 1323718, 1291057, 1266131, 1248347, 1237468, 1233799, 1238122, 1250772, 1269154, 1285749, 1290139, 1274764, 1239225, 1189199, 1131926, 1072895, 1015330, 960965, 910848, 865791, 826182, 791453, 760332, 732008, 706614, 684327, 664679, 647158, 631716, 618062, 605131, 591984, 578679, 565535, 552150, 538115, 524182, 511632, 500677, 490414, 480181, 470083, 460355, 451210, 443306, 437386, 433307, 430232, 427918, 427056, 428308, 431785, 437561]
56983D37561Q155R738R387O949L038j878p287j1949j4636j5441j5419j5037j3915
56970C79266j1982r857p954o090m161k497j267j33J370L577O713J0550J4061J6168
56956C87764J6950J7217J6756J3932P651q66q905j4458j7202j7807j7126j5933
56944C67973j4631j3046j0803q051n358k932l01K928O438R621J2421J5399J8963
56931C78621K2848K6205K7782K6099K0131J0290j355j2175k0320k5155k6970k6650
56919C99351k5267k3425k1034j7968j4739j2068j0072q381o942o101n901n844
56907B41609n421m496l197j874j054q76o75K99J695K458K345K271K935L982M875
56892B44876N762O975Q387R853J1627J3797J5846J7324J8256J8276J6095J0823
$$ y = [437561, 445716, 455454, 464841, 471790, 474828, 472950, 465663, 453714, 439078, 423637, 408218, 393181, 379266, 367284, 357427, 349473, 343383, 339222, 336725, 335458, 335325, 336695, 340272, 346985, 357535, 371596, 387764, 404714, 421931, 438687, 452619, 460270, 459404, 450499, 436041, 418839, 401032, 383906, 367973, 353342, 340296, 329493, 321442, 316084, 313152, 312851, 315779, 322217, 331838, 344259, 359658, 378621, 401469, 427674, 455456, 481555, 501686, 511976, 510621, 498446, 478126, 452971, 426001, 399351, 374084, 350659, 329625, 311657, 296918, 284850, 274778, 266397, 259455, 253354, 247453, 241609, 236188, 231692, 228495, 226621, 225567, 224691, 224016, 224315, 226010, 228468, 230813, 233084, 236019, 240001, 244876, 250638, 257613, 266000, 275853, 287480, 301277, 317123, 334447, 352703, 370979, 387074, 397897]
56880C97897L443l915r835j4043j6405j6606j4794j1665p817l592M38L711O415
56867C13232R382J3098J7424K2236K7692L3751M0006M6095N1522N4864N3774M6365
56855G29441L2541J4186n453k2617l4390l9954m0502l7780l2982k6911k0411j4009
56843E01159p526n33P055J5153K3923L3446M3210N2457O1114O9833P8706Q5914
56831I63911Q7696P9979O0659L1258l147l5749o0719p5316q0320p8597p2968o5028
56819G51659n5569m5466l5662k6458j7459q374N53R102J7597K6434L5354M3638
56807F95349N0868N6728N9847N7352M6455K6860J667k4044m5513n9834o6324o6276
56795G33135o2107n6034m9029m1150l2716k4767j8178j2748p584k180L184Q147
$$ y = [397897, 401340, 397425, 387590, 373547, 357142, 340536, 325742, 314077, 306260, 302668, 303106, 306817, 313232, 322614, 335712, 353136, 375372, 403064, 436815, 476821, 522916, 574438, 629302, 683076, 729441, 761982, 776168, 770715, 748098, 713708, 673754, 633252, 595472, 562490, 535579, 515168, 501159, 493633, 493100, 500155, 515308, 539231, 572677, 615887, 668344, 729458, 799291, 877997, 963911, 1051607, 1131586, 1192245, 1223503, 1220356, 1184607, 1123888, 1048572, 968252, 889655, 816687, 751659, 696090, 650624, 614962, 588504, 571045, 562671, 563224, 572326, 589923, 616357, 651711, 695349, 746217, 802945, 862792, 920144, 966599, 993459, 995126, 971082, 925569, 865735, 799411, 733135, 671028, 614994, 565965, 524815, 492099, 467332, 449154, 436406, 428822, 426642, 429826, 437973]
56783D37973J2921J8088K3760K9015L2097L1200K5323J4702R20j3429k5657l4222
56771E52691l9090m0795l9501l5607l0746k7034k4954k2978j9788j6050j3340
56760B42808j2037j1229j0184q888p391n717m424m257m972n303m450k958j836
56747A59162j449j571j993k537k812k478j624o35J69N98N72K86J67M22Q15J071
56731A48163J167J101O34k55r48p35K02Q14M31l97n97R5R25J213J134J180J261
56714A55388R25K48k03l05n41j034j089l12M97L51m25o03J56Q55O72L6j93N2K02
56695A54677%l03m56m55l12N5O46J297J820K089J985J424N10l70o92j75Q81J810
56677A64431K184K108J834J308M19n70j122j014m41K96R74J348J279R92Q35P67
$$ y = [437973, 450894, 468982, 492742, 521757, 553854, 585054, 610377, 625079, 625999, 612570, 586913, 552691, 513601, 472806, 433305, 397698, 366952, 339918, 314964, 291986, 272198, 256148, 242808, 230771, 219542, 209358, 200470, 193079, 187362, 182938, 178681, 173709, 168406, 163956, 160998, 159162, 157713, 156142, 154149, 151612, 148800, 146322, 144698, 144063, 144232, 144830, 145402, 145688, 145855, 146277, 147092, 148163, 149330, 150431, 151065, 150810, 149862, 149127, 149329, 150143, 150574, 150177, 149580, 149675, 150600, 151813, 152947, 154127, 155388, 156313, 156561, 156358, 156053, 155512, 154478, 153389, 153077, 153574, 153925, 153500, 152897, 153053, 153908, 154580, 154616, 154423, 154475, 154677, 154677, 154374, 153918, 153463, 153151, 153206, 153852, 155149, 156969, 159058, 161043, 162467, 162977, 162607, 161915, 161740, 162621, 164431, 166615, 168723, 170557, 171865, 172284, 171714, 170592, 169578, 169137, 169433, 170407, 171755, 173034, 174026, 174861, 175628]
56661A75628M37j64n39l43J45L99K83P9N6J87K27k1m56p04n20m1M52R10J392J729
56641A79136J688J414J310J417J406J176J058J225J358J170Q71P87Q21O65L30
56626A95832J01J7k04o76j080j050o69m14o32j158j550j563j279q85n28m08o47
56609A83207r73q51j77M46M10j94q60j325j557j402q17k80l34q16j036p85n12
56592A72144n33o01m36j12L10R24J554J614Q58j50n80k43M02Q39Q90P16O40Q61
56574A79097J198J241Q71M43L91Q06J440J943K109K113K455L373M398M859M792
56559B11529M907N555O231O268N639M810M134L670L379L228L122K887K338J410
56545B69107L76k51k91k43p36j727k595k909k718k253j778j616j852k098j995
$$ y = [175628, 176065, 175901, 175362, 175019, 175164, 175563, 175846, 175925, 175981, 176168, 176395, 176374, 175918, 175214, 174694, 174653, 175105, 176015, 177407, 179136, 180824, 182238, 183548, 184965, 186371, 187547, 188605, 189830, 191188, 192358, 193229, 194016, 194837, 195502, 195832, 195933, 195950, 195746, 195070, 193990, 192940, 192271, 191857, 191225, 190067, 188517, 186954, 185675, 184790, 184262, 183854, 183207, 182234, 181383, 181206, 181652, 182062, 181868, 181008, 179683, 178126, 176724, 175907, 175627, 175293, 174477, 173441, 172656, 172144, 171611, 171010, 170574, 170462, 170772, 171696, 173250, 174864, 175722, 175572, 174992, 174749, 175151, 175990, 176880, 177596, 178236, 179097, 180295, 181536, 182407, 182850, 183241, 184047, 185487, 187430, 189539, 191652, 194107, 197480, 201878, 206737, 211529, 216436, 221991, 228222, 234490, 240129, 244939, 249073, 252743, 256122, 259350, 262472, 265359, 267697, 269107, 269483, 269232, 268941, 268698, 267962, 266235, 263640, 260731, 258013, 255760, 253982, 252366, 250514, 248416, 246421]
56530B46421j818j989k300k287k181k550l119k966k031j360j575k141k510k948
56516B14646l598l768k923j718j136j222j386j444j540j472r36k17J16j1j69r8
56500A93124J28L56M55M11N98J443K513K604J269l77j042q11n85o06n07l20m06
56483A98247n86l69J24L84N11R89J590J488O59Q0K60N37K40j83Q2R60J590J444
56465B08047Q37L70K38J28l51j153j717j498m73Q74J963K385K062J366Q68P78
56449B14724Q16P63P35O34q9j553k767k625j351k12J12N1J28K70L63O83J356J873
56431B13911J637P54p8l16l8K49J03m62r61q59JJ238K156K178J390O64Q11J446
56413B23824J322N8j109q91L45J258J461J720K249K053M45j642k508j630j77L28
$$ y = [246421, 244603, 242614, 240314, 238027, 235846, 233296, 230177, 227211, 225180, 223820, 222245, 220104, 217594, 214646, 211048, 207280, 204357, 202639, 201503, 200281, 198895, 197451, 195911, 194439, 193503, 193286, 193402, 193391, 193222, 193124, 193252, 193608, 194063, 194474, 195072, 196515, 199028, 201632, 202901, 202524, 201482, 200671, 200086, 199480, 198973, 198653, 198247, 197661, 197292, 197416, 197800, 198311, 199300, 200890, 202378, 203037, 203117, 203377, 203914, 204154, 203971, 204053, 205013, 206603, 208047, 208884, 209254, 209492, 209620, 209269, 208116, 206399, 204901, 204428, 205302, 207265, 209650, 211712, 213078, 213946, 214724, 215540, 216303, 217038, 217672, 217583, 216030, 213263, 210638, 209287, 209075, 209187, 209238, 209366, 209636, 209999, 210682, 212038, 213911, 215548, 216302, 216224, 215908, 215870, 216119, 216222, 215760, 214799, 213940, 213941, 215179, 217335, 219513, 220903, 221567, 222378, 223824, 225146, 225204, 224095, 223204, 223549, 224807, 226268, 227988, 230237, 232290, 232735, 231093, 228585, 226955, 226778, 227106]
56397B27106m66j564j833j215o02o59j147j609k113k920l744l985l623l328l607
56382A94691m236m526l851j968P97L620N715O835P175O985O474N852N182M345
56368B33090L333K375J638J194J321K240L274L094J416k92n51K62P84P76J159
56353B55113K136K618J795L04o21m94K00O76M98rL8J071K392K895K400J719J558
56336B74289J918K450K733K323J203J55O0Q09J517J715J706J833K057K259K334
56321B99361K007J148K36k8M75J324K139K578K196J061J70L70J165J510J419J684
56305C18815K323K550K215J984K076K102K147K745L584L628K837K374K782L277
56291C55439L338L572M304M698M194L610L864M556M836M812N046N457N713O080
$$ y = [227106, 226640, 225076, 223243, 222028, 221426, 220767, 219620, 218011, 215898, 212978, 209234, 205249, 201626, 198298, 194691, 190455, 185929, 182078, 180110, 180907, 184527, 190242, 197077, 204252, 211237, 217711, 223563, 228745, 233090, 236423, 238798, 240436, 241630, 242951, 245191, 248465, 251559, 252975, 252683, 252132, 252394, 253178, 253954, 255113, 257249, 259867, 261662, 261966, 261345, 260851, 261051, 261727, 262225, 262216, 262254, 263325, 265717, 268612, 271012, 272731, 274289, 276207, 278657, 281390, 283713, 284916, 285071, 285131, 285940, 287457, 289172, 290878, 292711, 294768, 297027, 299361, 301368, 302516, 302752, 302724, 303199, 304523, 306662, 309240, 311436, 312497, 312667, 313037, 314202, 315712, 317131, 318815, 321138, 323688, 325903, 327887, 329963, 332065, 334212, 336957, 340541, 344169, 347006, 349380, 352162, 355439, 358777, 362349, 366653, 371351, 375545, 379155, 383019, 387575, 392411, 397223, 402269, 407726, 413439, 419519]
56277D19519O888P689P953Q124R019J0496J1655J2156J2488J3056J3666J3985
56265E46694J4064J4395J5622J7988K0942K3618K5819K8089L0847L4063L7868
56254H10009M2672M8392N4421O0687O7872P6103Q4353R1705R8356J04667J10080
56243A649317J13832J16045J17052J16198J12259J04810R4415Q1690O6877N0177
56233B622672L1852J2255p857k7272m5021o0760p4221q4824r2382r7581j01152
56222B075709j03049j02933j00952r7490r2734q7168q1919p7677p3687o8595o2219
56211A127286n5697n0133m5748m2207l9138l6243l3438l0807k8238k5363k2173
56200G18101j9341j7384j5907j4136j2027j0234r164q540p929p271o743o307n567
$$ y = [419519, 426407, 434096, 442049, 450173, 459192, 469688, 481343, 493499, 505987, 519043, 532709, 546694, 560758, 575153, 590775, 608763, 629705, 653323, 679142, 707231, 738078, 772141, 810009, 852681, 901073, 955494, 1016181, 1084053, 1160156, 1244509, 1336214, 1434570, 1539237, 1649317, 1763149, 1879194, 1996246, 2112444, 2224703, 2329513, 2423928, 2505618, 2572495, 2622672, 2654524, 2666779, 2658922, 2631650, 2586629, 2525869, 2451648, 2366824, 2274442, 2176861, 2075709, 1972660, 1869727, 1768775, 1671285, 1578551, 1491383, 1409464, 1331787, 1258100, 1189505, 1127286, 1071589, 1021456, 975708, 933501, 894363, 858120, 824682, 793875, 765637, 740274, 718101, 698760, 681376, 665469, 651333, 639306, 629072, 619908, 611368, 603439, 596168, 589425, 583118, 577551]
56187E77551m229k648j600j281r81j75N08K21o51r98o45l88l96O4J170K063K224
56170E69809K182K415K694K930L523M400M796M527M439N104O124P217Q696J0387
56156F39243J1332J1349J1660J3201J5340J7104J8499J9904K1354K3258K6606
56145H28850L1627L7292M2995M9515N7503O6245P4779Q2789Q9515R3197R2779
56134A547086Q8848Q2066P2338O0776N0612M4440M1735M0408L9164L6833L1371
56123B135677K1902J0519M1q984j7173k3898k8475l2724l9613m9834o1688p3546
56111A832204q4128r1166r2607q9021q2768p5103o6071n6659m8492m1556l4520
56100A070113k7294k1197j6670j2929r770p717o400m797k983j798r27P13K859
$$ y = [577551, 573322, 570674, 569074, 567793, 566812, 566637, 567145, 567366, 566715, 565717, 565072, 564684, 564288, 564352, 565522, 567585, 569809, 571991, 574406, 577100, 580030, 583553, 587953, 592749, 597276, 601715, 606819, 612943, 620160, 628856, 639243, 650575, 661924, 673584, 686785, 702125, 719229, 737728, 757632, 778986, 802244, 828850, 860477, 897769, 940764, 990279, 1047782, 1114027, 1188806, 1271595, 1361110, 1454307, 1547086, 1635934, 1718000, 1790338, 1851114, 1901726, 1946166, 1987901, 2028309, 2067473, 2104306, 2135677, 2157579, 2168098, 2168139, 2159155, 2141982, 2118084, 2089609, 2056885, 2017272, 1967438, 1905750, 1832204, 1748076, 1656910, 1564303, 1475282, 1392514, 1317411, 1251340, 1194681, 1146189, 1104633, 1070113, 1042819, 1021622, 1004952, 992023, 982253, 974536, 968136, 963339, 960356, 958558, 957631, 958344, 961203]
56087I61203M161M460M736N053M669M025M494O095P601Q769J0299J1689J1591
56074A048845J0412J0164J1399J2518J2542J2312J2573J2903J3121J3718J4453
56063A184960J4405J3811J4041J5414J6837J7803J8808J9715J9666J8836J8320
56052A372616J8132J7379J6337J6231J6855J6776J6030J6236J7791J9326K0214
56041A563923K1249K2542K3184K3343K4289K5916K6765K6828K7831L0267L2662
56030A848799L4291L6110L8385L9970M0590M1440M2981M4453M5958M8524N1837
56019B313338N4394N6205N8636O1493O3156O3758O5199O7744O9869P1603P4656
56008C020051P8805Q1849Q3675Q6683R1530R6188J00014J04934J11705J18755
$$ y = [961203, 965364, 969824, 974560, 979613, 984282, 988307, 992801, 998896, 1006497, 1015266, 1025565, 1037254, 1048845, 1059257, 1069421, 1080820, 1093338, 1105880, 1118192, 1130765, 1143668, 1156789, 1170507, 1184960, 1199365, 1213176, 1227217, 1242631, 1259468, 1277271, 1296079, 1315794, 1335460, 1354296, 1372616, 1390748, 1408127, 1424464, 1440695, 1457550, 1474326, 1490356, 1506592, 1524383, 1543709, 1563923, 1585172, 1607714, 1630898, 1654241, 1678530, 1704446, 1731211, 1758039, 1785870, 1816137, 1848799, 1883090, 1919200, 1957585, 1997555, 2038145, 2079585, 2122566, 2167019, 2212977, 2261501, 2313338, 2367732, 2423937, 2482573, 2544066, 2607222, 2670980, 2736179, 2803923, 2873792, 2945395, 3020051, 3098856, 3180705, 3264380, 3351063, 3442593, 3538781, 3638795, 3743729, 3855434, 3974189]
55998C974189J25516J33153J41319J48226J54622J63424J74705J85632J95901
55989E396687K08266K22887K36670K49423K64994K84626L05141L25629L49982
55980G844305L80418M14311M50022M90051N35957N86083O40795P03991P77076
55971A2823009Q57989R48479J055345J182222J328047J496462J698471J943317
55963B3333341K236432K589978L025717L564691M226708N045538O071995P354388
55955E7448788Q924383J0801475J2992449J5482328J8250003K1302292K4659349
55948A69861067K8262428L1855195L4871177L6325886L4846927K9113255J8711096
55941C83847031M836994r883549k2526058l1148170l5335105l5853302l3934888
$$ y = [3974189, 4099705, 4232858, 4374177, 4522403, 4677025, 4840449, 5015154, 5200786, 5396687, 5604953, 5827840, 6064510, 6313933, 6578927, 6863553, 7168694, 7494323, 7844305, 8224723, 8639034, 9089056, 9579107, 10115064, 10701147, 11341942, 12045933, 12823009, 13680998, 14629477, 15684822, 16867044, 18195091, 19691553, 21390024, 23333341, 25569773, 28159751, 31185468, 34750159, 38976867, 44022405, 50094400, 57448788, 66373171, 77174646, 90167095, 105649423, 123899426, 145201718, 169861067, 198123495, 229978690, 264849867, 301175753, 336022680, 365135935, 383847031, 388684025, 378800476, 356274418, 325126248, 289791143, 253937841, 220002953]
55934B20002953l0726924k7053068k3391406j9965969j6873013j4161995j1848092
55927G5982486r907980q298627o977614n901726n023234m300916l707480l219988
55919B8644921k812414k463855k164758j908539j684726j485622j311443j162681
55911A3650883j033789r19307q19686p35817o63766n99772n44897m99870m60358
55902G373621m22178l86739l56796l30747l05411k80905k58786k38461k18967
55893D574631k01588j87405j74789j62045j49994j39668j30162j21127j14551
55884C193302j11744j11001j10180j09103j07692j04527r9230r3588q8545q2748
55874B174944p5757o9808o6449o4110o0993n7738n5226n2365m8251m4222m1656
$$ y = [220002953, 189276029, 162222961, 138831555, 118865586, 101992573, 87830578, 75982486, 66074506, 57775879, 50798265, 44896539, 39873305, 35572389, 31864909, 28644921, 25832507, 23368652, 21203894, 19295355, 17610629, 16125007, 14813564, 13650883, 12617094, 11697787, 10878101, 10142284, 9478518, 8878746, 8333849, 7833979, 7373621, 6951443, 6564704, 6207908, 5877161, 5571750, 5290845, 5032059, 4793598, 4574631, 4373043, 4185638, 4010849, 3848804, 3698810, 3559142, 3428980, 3307853, 3193302, 3081558, 2970557, 2860377, 2751274, 2643582, 2539055, 2439825, 2346237, 2257692, 2174944, 2099187, 2029379, 1962930, 1898820, 1837827, 1780089, 1724863, 1672498, 1624247, 1580025, 1538369]
55863A538369l9784l7589l5789l5150l4751l3613l2258l1168k9674k7728k6642
55852A174223k6709k6248k4509k3273k4021k5631k6469k6594k6363k5103k2826
55841H96477k1169k0883k0371j8466j6502j5922j5881j5045j3868j3155j2293
55830G12922j0813r908j0349j0638r219o979n632n254n308o416q920j1151j1411
55817F00924j0528j0347j0846j0777j0113r696r286p992o071m583l724l050k574
55804E01337k278j347O91K838M017M696N797O911O990O017M586K773O81q34j366
55789E41509k004l733n758o724o717o733p133p976r789j2453j4366j4197j2665
55776D31261j1071r203o239k749L5K094M004N137M269J504k024n724r296j1630
$$ y = [1538369, 1498585, 1460996, 1425207, 1390057, 1355306, 1321693, 1289435, 1258267, 1228593, 1200865, 1174223, 1147514, 1121266, 1096757, 1073484, 1049463, 1023832, 997363, 970769, 944406, 919303, 896477, 875308, 854425, 834054, 815588, 799086, 783164, 767283, 752238, 738370, 725215, 712922, 702109, 692201, 681852, 671214, 661995, 655016, 649384, 644130, 638822, 632406, 623486, 612335, 600924, 590396, 580049, 569203, 558426, 548313, 538617, 529331, 521339, 515268, 510685, 506961, 503911, 501337, 499059, 497712, 498403, 501241, 505258, 509954, 515751, 522662, 529652, 535669, 540255, 543028, 543709, 542875, 541509, 539505, 535772, 530014, 523290, 516573, 509840, 502707, 494731, 484942, 472489, 458123, 443926, 431261, 420190, 410987, 404748, 401999, 402034, 404128, 408132, 413269, 417538, 419042, 417018, 411294, 401998, 390368]
55762C90368j1711j0253q814p738o446n122m434m015l003j824j739k829l968m629
55748C13843n275o024o423o410o267n749m536l301l049l536l677l251k983l129
55734B50233l235l170l162k955k189j342j180j514j640j726k454l613m368m625
55720B13060m797m550l228j337q6M59J305K600L309K974K371K153K064J766J338
55705B19401P51q2o44k97M43K64j209l014m351n295n948n997n406m615l790k788
55689A77423j907j676j788j291L3J372K138K526K745K741K829L547M564M782L821
55674B01859K506J533N67q81k456l358l251k420j469r76j104j396j342r53m51
55659A86408K33J062J541J497J704K749L793L646K658K153K267J864O40l94p49
$$ y = [390368, 378657, 368404, 359590, 351852, 345406, 340284, 335850, 331835, 328832, 327008, 325269, 322440, 318472, 313843, 308568, 302544, 296121, 289711, 283444, 277695, 273159, 269858, 266809, 263273, 259596, 256345, 253362, 250233, 246998, 243828, 240666, 237711, 235522, 234180, 233000, 231486, 229846, 228120, 225666, 222053, 217685, 213060, 208263, 203713, 200485, 199148, 199062, 199521, 200826, 203426, 206735, 209709, 212080, 214233, 216297, 218063, 219401, 220152, 220070, 219426, 219129, 219572, 219836, 218627, 215613, 211262, 205967, 200019, 194022, 188616, 184001, 180211, 177423, 175516, 173840, 172052, 170761, 170794, 172166, 174304, 176830, 179575, 182316, 185145, 188692, 193256, 198038, 201859, 204365, 205898, 206465, 205584, 203128, 199770, 196519, 194099, 192630, 191654, 190550, 189154, 187812, 186859, 186408, 186641, 187703, 189244, 190741, 192445, 195194, 198987, 202633, 205291, 207444, 209711, 211575, 212215, 211821, 211072]
55644B11072j207k241l112l297l484m361n382n649n311n180n519n834n566m533
55630A50396l044j802j356j481j510j225q68n07r5J4m47p69p7J075J138k19j626
55613A37597k129k343k956l410k988k133j657j461j052o60q79j525j766j167o6
55598A11405Q42R20k0j297j820j359p99q30j016p12j92j71n89p23j94O82J405
55581A05532J659J378R28J018K021L460M495M763M574M457M735N332N840N920
55567A56112N659N207M181J980j170m035n559n809n547n383n518n872o085n725
55553A22436m770l622k540j462m76J8j34n67r05j112j240j201r58n71L7Q53J391
55536A05177J126M24K94J016J736J715J224P87K74n74j379j573j319j256j486
$$ y = [211072, 209865, 207624, 204512, 201215, 197731, 193370, 187988, 182339, 177028, 171848, 166329, 160495, 154929, 150396, 147352, 145550, 144194, 142713, 141203, 139978, 139110, 138603, 138508, 138522, 138075, 137306, 137229, 138304, 139442, 139223, 137597, 135468, 133125, 130169, 126759, 123771, 121638, 119981, 118520, 117468, 116808, 115929, 114404, 112638, 111471, 111405, 112247, 113167, 113147, 111850, 110030, 108671, 107872, 107042, 106026, 105314, 105122, 104951, 104362, 103639, 103445, 104127, 105532, 107191, 108569, 109497, 110515, 112536, 115996, 120491, 125254, 129828, 134285, 139020, 144352, 150192, 156112, 161771, 166978, 171159, 173139, 171969, 167934, 162375, 156566, 151019, 145636, 140118, 134246, 128161, 122436, 117666, 114044, 111504, 110042, 109566, 109584, 109450, 108883, 107978, 106866, 105626, 104425, 103467, 102896, 102933, 103786, 105177, 106303, 106727, 107021, 108037, 109773, 111488, 112712, 113499, 113773, 113199, 111820, 110247, 108928, 107672, 106186]
55521A06186j404o03N42J318J465J381J568K074K604L106L732M246L998K909J769
55506A34891R50l97k941n580o573n919n221n256n163m271l204k656k359j925j638
55491H2738j647j430o94L9L41N37Q07O57o3n69l61l4m7K75J416K303J627o8r94
55472H4833m89M05O23J80m22q86j087r85p60o64p42r47j221j220m88P38J483J285
55454G9636Q16P22O12k0o50n41p5j76p77j015o66k73nM87J137J376J075O61K80
55435H2604k47p12o54k20l3j02K09R76J416J067M48K00K53K45J66J87K88L95O06
55416H7092J042J684K345K581J856L33q09n46N55R32K1j210j835k026k173j979
55400H7863j208n37p70j562j806j107j34M64P48R24Q04K01m95o31j06N40Q44Q61
$$ y = [106186, 104782, 104179, 104721, 106039, 107504, 108885, 110453, 112527, 115131, 118237, 121969, 126215, 130213, 133122, 134891, 135841, 135444, 132503, 126923, 120350, 114431, 109210, 103954, 98791, 94520, 91316, 88660, 86301, 84376, 82738, 81091, 79661, 78967, 79006, 79347, 79884, 80691, 81348, 81285, 80716, 80355, 80321, 80274, 80549, 81965, 84268, 85895, 85827, 84833, 84344, 84749, 85372, 85552, 85130, 84244, 83157, 82172, 81412, 80748, 80006, 79059, 77838, 76618, 76130, 76868, 78351, 79636, 80452, 81174, 81786, 81766, 81116, 80575, 80500, 80324, 79547, 78532, 77866, 77593, 77588, 78075, 79212, 80588, 81663, 82324, 82604, 82357, 81645, 80991, 80771, 80738, 80636, 80845, 81821, 83237, 84304, 84752, 84952, 85205, 85450, 85616, 85803, 86091, 86486, 87092, 88134, 89818, 92163, 94744, 96600, 96933, 96124, 95578, 96133, 97065, 97086, 95876, 94041, 92015, 89842, 87863, 86655, 86118, 85348, 83786, 81980, 80873, 80739, 81203, 81951, 82875, 83679, 83880, 83385, 82754, 82648, 83188, 84032, 84893]
55382H4893Q13O27J73k83l46j27j03l36l39P0L72Q5n05q03p11n64n05m82o00j040
55362H0289j628j933j759j326j006j042j300j249m89N27Q18K51n9P09J732J541
55346G4076N5j307j468p40M6O58J280J810J801J027j50r85r95l95J94N34Q19R58
55328G7218M50o68j433j190n74n04p26l25O47J185Q12R1l45l61J07J010J663J264
55310G8321J03p12q19q51r68m69O63J113J13j180j244l71J3l86m93K62J144J354
55292G5593J061P91N82K50k6J08O67J252J425R98J97m13l73J25M31K41J0L03J024
55273H4246J558J533J138O86K75l1j09m0k24q06j263j006l05J1k68l69L11J233
55255H6570J360M82n16o32K74J360J446Q9j782k613j871o39k47p40j160r75m85
$$ y = [84893, 85706, 86333, 86506, 86223, 85877, 85750, 85647, 85311, 84972, 85042, 85414, 85499, 84994, 84191, 83480, 82916, 82411, 81929, 81329, 80289, 78661, 76728, 74969, 73643, 72637, 71595, 70295, 69046, 68557, 69084, 69902, 70153, 70094, 70803, 72535, 74076, 74131, 72824, 71356, 70616, 70662, 71320, 72600, 74410, 76211, 77238, 77088, 76103, 75108, 74713, 74907, 75441, 76260, 77218, 77668, 77000, 75567, 74377, 73803, 73299, 72573, 72248, 72895, 74080, 74892, 74983, 74638, 74277, 74384, 75394, 77057, 78321, 78424, 77712, 76893, 76042, 75074, 74605, 75268, 76381, 76494, 75314, 74070, 73699, 73712, 73326, 72833, 73095, 74239, 75593, 76654, 77445, 78027, 78277, 78251, 78359, 79026, 80278, 81703, 82701, 82898, 82485, 82112, 82237, 82668, 82909, 82919, 83222, 84246, 85804, 87337, 88475, 89161, 89436, 89405, 89296, 89256, 89032, 88226, 86963, 85957, 85652, 85663, 85395, 85026, 85337, 86570, 87930, 88412, 87896, 87264, 87538, 88898, 90344, 90433, 88651, 86038, 84167, 83528, 83281, 82541, 81381, 80406, 79921]
55238G9921q9J44J86p8n13p78p50o19n01l94l57l87k13L51R52J135J067J253J568
55219H1898J368N57j39k28j04l15p42r24p33l87o2J98L92O30R81J254J158Q06
55201H5608O25O69M92j13o78o39n2N67P64L49n59j423j558q50KK17k29o80n43
55182H1969K00R67J065L42n08o49p8M23L67N7p5r9k48m20l38n0J89K51J64jj5
55161H3513L94J110J532J232N23N7J09M46P32P42L35m30j159j404j049m06O7R7
55143H6441k05m19k47J51M10N10P13R52P57J7o46o17j32P4k05m41j79L18M84K42
55123H7978R5L99P87O28m3m50o4O29P69K09l71l61J90Q33J190J109P40M20L17
55104I5004K16n7l05l46m81r45j201n02Q74J747J431L50p89j671k075j736r23
$$ y = [79921, 79832, 79976, 80162, 80084, 79571, 78793, 78043, 77424, 76923, 76529, 76172, 75785, 75572, 75923, 76875, 78010, 79077, 80330, 81898, 83266, 83823, 83684, 83456, 83352, 83037, 82295, 81371, 80638, 80251, 80189, 80387, 80779, 81409, 82390, 83644, 84802, 85608, 86233, 86902, 87394, 87281, 86603, 85964, 85912, 86479, 87243, 87592, 87033, 85610, 84052, 83202, 83204, 83421, 83192, 82512, 81969, 82169, 83136, 84201, 84543, 84035, 83386, 83308, 83731, 84098, 84155, 84080, 83981, 83733, 83313, 82975, 82925, 83114, 83365, 83529, 83528, 83513, 83907, 85017, 86549, 87781, 88304, 88361, 88470, 88916, 89648, 90390, 90725, 90295, 89136, 87732, 86683, 86277, 86344, 86441, 86236, 85817, 85570, 85721, 86131, 86641, 87354, 88306, 89063, 89080, 88434, 87817, 87685, 87759, 87554, 87113, 86934, 87252, 87736, 87978, 88073, 88472, 89259, 89887, 89844, 89394, 89330, 89959, 90728, 90937, 90566, 90205, 90395, 91228, 92418, 93527, 94267, 94687, 95004, 95220, 95163, 94858, 94512, 94031, 93086, 91885, 91383, 92257, 94004, 95435, 95785, 94996, 93325, 91250, 89514, 88591]
55087H8591m36n70o54j2J064J791J834J394P97L48K65L72K80M3J92Q06J201Q91
55069I8197K68j51m91r80j216p18J18M11m9o97r88q59m99k57n18j193j510q35
55051H8033M67J528K046K305K338J833Q66M0l18n09p85q16j67R13J548J124n4
55034A00392j118j592j749j916j719o14R95J869J399L06m63q10j031r34k05P63
55018I3573J205R77N85L29P5k45n24q38j302j583j150j32O29N80P7j87j8L31P55
54999I3137J440K349K862K298Q73k66k57M23O58K03j60J3K41R8p8M3J19j60l63
54980A03473m2L84K73k49o32p90q53m89N62J660J915J446J042Q49L96j82q9Q17
54962A09491J655J670J003J82l99l90K74Q72M64q36j891k031j712j430r27O2J066
$$ y = [88591, 88155, 87585, 86931, 86919, 87983, 89774, 91608, 93002, 93799, 94147, 94412, 94784, 95064, 95107, 95299, 96105, 97306, 98197, 98465, 98314, 97823, 96843, 95627, 94909, 95027, 95438, 95389, 94692, 93704, 92845, 92346, 92089, 91571, 90378, 88868, 88033, 88500, 90028, 92074, 94379, 96717, 98550, 99416, 99456, 99138, 98629, 97844, 97028, 96861, 97774, 99322, 100446, 100392, 99274, 97682, 95933, 94017, 92298, 91684, 92679, 94548, 95947, 96253, 95790, 94980, 93949, 93015, 92810, 93573, 94778, 95755, 96340, 96669, 96744, 96499, 95975, 95137, 93835, 92252, 91102, 90970, 91599, 92179, 92256, 92069, 92051, 92382, 93137, 94577, 96926, 99788, 102086, 102959, 102693, 102436, 102859, 103517, 103720, 103560, 103573, 103814, 103912, 103834, 103877, 103996, 103836, 103473, 103431, 103815, 104088, 103839, 103207, 102417, 101564, 101075, 101637, 103297, 105212, 106658, 107700, 108549, 108945, 108763, 108674, 109491, 111146, 112816, 113819, 114001, 113602, 113212, 113486, 114358, 114822, 113986, 112095, 110064, 108352, 106922, 105995, 106057, 107123]
54945A07123J381R11L6q83j539j705j581j614j727j273n1J197J688J530J311J244
54929A06048J175J073J097J375J944K702L284L397L359L827M822N632N735N310
54915A50780M572L397J923P21j62j490l497n035m971l845l151l321l537l289k974
54900A26121k814k318j229k39j64r26j761k059j705q72M7N62N00K46L37R04J666
54883A16296K310K689K737K500K249K337K794L251L368L291L470M013M423M074
54869A59802K845J208k40j142j544j867k670m043n315n589m635l072j701r51r20
54854A30166j519k426l135l322k990k291j423p54o46r60j119q69o59r72j583j911
54838A03587j820j645j499j136n34j36k11l38R7J011J684J672J273R61O81J43
$$ y = [107123, 108504, 109415, 109451, 108568, 107029, 105324, 103743, 102129, 100402, 99129, 99078, 100275, 101963, 103493, 104804, 106048, 107223, 108296, 109393, 110768, 112712, 115414, 118698, 122095, 125454, 129281, 134103, 139735, 145470, 150780, 155352, 158749, 160672, 161393, 161231, 159741, 156244, 151209, 146238, 142393, 139242, 135921, 132384, 129095, 126121, 123307, 120989, 119760, 119521, 119357, 118431, 116670, 114611, 112906, 112034, 112081, 112643, 113143, 113389, 113726, 114630, 116296, 118606, 121295, 124032, 126532, 128781, 131118, 133912, 137163, 140531, 143822, 147292, 151305, 155728, 159802, 162647, 163855, 163615, 162473, 160929, 159062, 156392, 152349, 147034, 141445, 136810, 133738, 132037, 131086, 130166, 128647, 126221, 123086, 119764, 116774, 114483, 113060, 112306, 111660, 110700, 109581, 108712, 108053, 107081, 105498, 103587, 101767, 100122, 98623, 97487, 96953, 96817, 96606, 96268, 96365, 97376, 99060, 100732, 102005, 102966, 103647, 103790]
54822A03790m91p21m60j09J42N14R27P97J5m48K75J597K078J280J28m61n59o19
54804A07675p00o17l25K06R37J465J213K45o59r40q28p23o05m09l75n40m54J20
54786A04686O69O93N07O36Q81P24M35P94J772K412K187J742J904K527K826K499
54770A27894K059K183L029M191N117N463N237M643L859L016K248J714J463J316
54756A73432R01j51j871l789n247n915n916n480m739l911l414l458l711l545k637
54741A20549j197K10R81Q14j6p76q56k72M88J001J196J224J196J145J178J586
54725A28451K498L431L563K786K163K721L991M460L570K384J986J957J078r54
54711A64085l205m617m929m647m476m690m776m003k548j555j683k133j782p70
$$ y = [103790, 103299, 102578, 102118, 102009, 102151, 102665, 103592, 104389, 104404, 103956, 104231, 105828, 107906, 109186, 109314, 108853, 108294, 107675, 106975, 106358, 106033, 106239, 107176, 108641, 109854, 110099, 109440, 108500, 107672, 106949, 106344, 105935, 105560, 105020, 104566, 104686, 105355, 106048, 106555, 107191, 108072, 108796, 109231, 110025, 111797, 114209, 116396, 118138, 120042, 122569, 125395, 127894, 129953, 132136, 135165, 139356, 144473, 149936, 155173, 159816, 163675, 166691, 168939, 170653, 172116, 173432, 174333, 174182, 172311, 168522, 163275, 157360, 151444, 145964, 141225, 137314, 133900, 130442, 126731, 123186, 120549, 119352, 119562, 120543, 121357, 121341, 120565, 119709, 119437, 119925, 120926, 122122, 123346, 124542, 125687, 126865, 128451, 130949, 134380, 137943, 140729, 142892, 145613, 149604, 154064, 157634, 160018, 162004, 163961, 165039, 164085, 160880, 156263, 151334, 146687, 142211, 137521, 132745, 128742, 126194, 124639, 122956, 120823, 119041, 118271]
54697A18271j31j82k96k49n81j434j978j612q93o32o49k22N92R56M90k12n00m13
54679A10325k76rO34J385J570Q96k42j289j955k106j637p86j79j07p3M89J265
54662A07905J454R29L71K06J42p3j49J72O48R83J150R93J50j154j879j402l74
54645A10072K46M47P43J033Q86N26N04O24K63l41k50N99J143P91K50K52M39J27
54627A18354n03p60n02j83j86n85j250j731j424l21O87P83K05k14j85q5j27m1
54609A11932L13N51K25n60j166j061m29n9m44j033p47N76J820J903J025J39l15
54592A12670m98l87K05Q73P66k23j120j068l42K23L46L19L47L83M36N31M61P5
54574A13997k65n2N38P11J26o11p96n70n12o56m64K98J205J766J897J667J018
$$ y = [118271, 118140, 117958, 117662, 117413, 116832, 115398, 113420, 111808, 110915, 110283, 109634, 109412, 110004, 110960, 111450, 111238, 110738, 110325, 110049, 110040, 110674, 112059, 113629, 114525, 114283, 112994, 111039, 108933, 107296, 106510, 106331, 106224, 106151, 106640, 107905, 109359, 110288, 110659, 110865, 111007, 110934, 110785, 110957, 111605, 112588, 113738, 114731, 114881, 113727, 111848, 110446, 110072, 110318, 110765, 111508, 112541, 113427, 113953, 114457, 115081, 115344, 115003, 114753, 115352, 116495, 117286, 117536, 117788, 118227, 118354, 117851, 117091, 116589, 116406, 116220, 115635, 114385, 112654, 111230, 110909, 111596, 112379, 112584, 112370, 112185, 112100, 111973, 111932, 112245, 112796, 113021, 112461, 111295, 110234, 109805, 109746, 109302, 108269, 107522, 108098, 109918, 111821, 112846, 112985, 112670, 112172, 111785, 111990, 112863, 113629, 113406, 112286, 111218, 110876, 111099, 111445, 111764, 112111, 112494, 112930, 113461, 113922, 113997, 113732, 113680, 114218, 114929, 115055, 114444, 113648, 113078, 112566, 111910, 111446, 111744, 112949, 114715, 116612, 118279, 119297]
54557A19297P5n68l59M60J027P80M1m68m64k23l8J87O43J151J237P24Jm18l96
54538A22689o2N26J271J790J672R86J11q34j866k513k007m16J062J397Q22J64
54522A24792l57r79j480j273m07L17L90J07o5r2j29j96k85m21m52j75K10K08k38
54503A19475o14o08m79l75P3J005J710J470O85M48J099J887K058J623R16J1j028
54486A29356j727j542n58M74Q41N34J52J99N24N58J32j80K33J125J592J180L74
54469A33267j22k13k40l07k74k08m30r31j192p71J36Q95J101Q84N96M16K53k5
54451A32835l24l62l1M07N84M65L09K02r0o56j157j242j033q89q66p45n07l91
54433A26509m29l22R5N80Q33R00R98J136J109Q37N24M32N98P89P76N97M82M50
$$ y = [119297, 119372, 118804, 118445, 118905, 119932, 120712, 120753, 120285, 119821, 119598, 119560, 119747, 120390, 121541, 122778, 123502, 123503, 123085, 122689, 122627, 123153, 124424, 126214, 127886, 128872, 128983, 128149, 126283, 123770, 121763, 121347, 122409, 123806, 124628, 124792, 124435, 123456, 121976, 120703, 120296, 120613, 121003, 121110, 121045, 120953, 120824, 120628, 120343, 119922, 119470, 119295, 119505, 119713, 119475, 118861, 118253, 117774, 117399, 117472, 118477, 120187, 121657, 122342, 122790, 123889, 125776, 127834, 129457, 130373, 130384, 129356, 127629, 126087, 125529, 126003, 126844, 127378, 127530, 127729, 128253, 128811, 128943, 128763, 128996, 130121, 131713, 132893, 133267, 133145, 132932, 132692, 132385, 132111, 131903, 131473, 130542, 129350, 128579, 128715, 129610, 130711, 131595, 132191, 132607, 132860, 132835, 132511, 132149, 132118, 132525, 133109, 133574, 133883, 134085, 133995, 133339, 132182, 130940, 129907, 129018, 128152, 127407, 126900, 126509, 126080, 125758, 125853, 126433, 127266, 128166, 129164, 130300, 131409, 132246, 132770, 133202, 133800, 134589, 135365, 135962, 136444, 136894]
54415A36894K19l57r51j169j118j148j187p85R6Q17P98K05l66n61m53k30K4L53
54397A31081Q19J356J752J973K295K819L045K423J203K07k63n82q91q21l47o6
54381A46003k30k64K37P71P58M51L73M12K09j37m07p39j055o68O51J810J744J039
54363A50958J036J727J947J444J209J701K207K290K437K814K674J658N44n4o32
54348A73960j663k521k538k280k672l481l719l157k413j823j239p69p18q76o05
54333A43486J82Q57R27N62K01J24L61N82K15q84j963k109j367n57j05K76P12P78
54315A42278K74k65k87PP3j35k17n9k5l92r80j377j361r78l96J83N52N84L13q1
54295A37711l44k78J14N07M28k91j186j491q78K47J130J278O72k45p19k02R66
$$ y = [136894, 137113, 136756, 135805, 134636, 133518, 132370, 131183, 130398, 130494, 131311, 132109, 132314, 131948, 131387, 130934, 130704, 130728, 131081, 131900, 133256, 135008, 136981, 139276, 142095, 145140, 147563, 148766, 148973, 148710, 148128, 147237, 146416, 146069, 146003, 145773, 145509, 145746, 146517, 147275, 147726, 148099, 148511, 148720, 148583, 148176, 147437, 146382, 145714, 146365, 148175, 149919, 150958, 151994, 153721, 155668, 157112, 158321, 160022, 162229, 164519, 166956, 169770, 172444, 174102, 174646, 174592, 173960, 172297, 169776, 167238, 164958, 162286, 158805, 155086, 151929, 149516, 147693, 146454, 145685, 144967, 144091, 143486, 143668, 144525, 145452, 146014, 146215, 146339, 146700, 147282, 147497, 146613, 144650, 142541, 141174, 140617, 140512, 140788, 141500, 142278, 142552, 142287, 142000, 142007, 142080, 141945, 141728, 141669, 141644, 141252, 140272, 138895, 137534, 136556, 136160, 136343, 136895, 137479, 137792, 137711, 137367, 137089, 137203, 137710, 138138, 137847, 136661, 135170, 134292, 134539, 135669, 136947, 137619, 137374, 136655, 136453, 137419]
54278A37419J631J051j62o84QJ164J710J247J69p62r15k92M47P13O48O84O89K33
54260A44998l92k49Q87K017K076J104o7p96r06n02J08N13O37P23Q04N33k15j031
54242A50242j485j510j139l99K87L39r2j25M69P29q4j258j645j226p75m31K84
54225A42181J278J812J573R53K18p01j478j398m00N56O11Ml62l9N72P14L0j014
54207A45110j538j206o55o63j107j224p38j49J04J95M53Q22R81P22J32m08m26
54190A40405K01J035J517J504J153N65j09n03m19k10k84n03n18m05l66j61M08
54173A43310P65K93m12q2J309K314J937P89q9n47r16j161j172j268j651j834j294
54156A40291l39L14M73M17K84P6M3L61O67M59j08l99j73J86K67M7l37p29q98o62
$$ y = [137419, 139050, 140101, 139939, 139255, 139263, 140427, 142137, 143384, 143553, 142791, 141876, 141584, 142031, 142744, 143392, 144076, 144765, 144998, 144606, 144357, 145244, 147261, 149337, 150441, 150374, 149578, 148672, 148170, 148278, 148791, 149428, 150151, 150955, 151488, 151273, 150242, 148757, 147247, 146108, 145709, 145996, 146335, 146243, 146118, 146587, 147316, 147232, 145974, 144329, 143103, 142328, 141897, 142181, 143459, 145271, 146844, 147797, 148015, 147314, 145836, 144438, 144038, 144594, 145205, 145209, 144847, 144808, 145380, 146094, 146124, 145110, 143572, 142366, 141711, 141048, 139941, 138717, 137979, 137830, 137934, 138129, 138582, 139404, 140385, 141107, 141239, 140831, 140405, 140606, 141641, 143158, 144662, 145815, 146380, 146271, 145768, 145349, 145139, 144855, 144352, 143834, 143429, 143063, 142902, 143310, 144075, 144368, 143956, 143874, 145183, 147497, 149434, 150223, 150134, 149587, 148671, 147510, 146338, 145070, 143419, 141585, 140291, 139952, 140266, 140739, 141156, 141440, 141516, 141559, 141920, 142587, 143046, 142938, 142539, 142366, 142552, 142819, 142866, 142529, 141800, 140902, 140240]
54136A40240j53L10N90Q15J058J260J363J329J084O61L24K73K96L9l88m03L65
54119A49063J541K300K140J324N54K41J42k17q31j192r44k79L62P61R09Q37O15
54102A57326L75J01l89j101j648j585q43K90J452K333K728K669K355J909J395
54087A67367J107J479K457L396L906M430N549O969P777P508O497N137L462J446
54073B28487o72k687m614o306p262p078o030m878m125l619k929j925r34l27j10
54058A74991PJ73K91L29N37J098J761K075J977J852J981K161K050J768J905K898
54042A97854M425N631N957N692N545N853O403O962P546Q069Q130P501O560N902
54028B88030N682N628N520N300M792L785K449J190J16r99k112k769k916l367m899
$$ y = [140240, 140087, 140397, 140987, 141802, 142860, 144120, 145483, 146812, 147896, 148557, 148881, 149154, 149450, 149489, 149101, 148698, 149063, 150604, 152904, 155044, 156368, 156922, 157163, 157305, 157088, 156257, 155065, 154121, 153842, 154204, 154965, 155874, 156711, 157326, 157701, 157802, 157413, 156312, 154664, 153079, 152236, 152526, 153978, 156311, 159039, 161708, 164063, 165972, 167367, 168474, 169953, 172410, 175806, 179712, 184142, 189691, 196660, 204437, 211945, 218442, 223579, 227041, 228487, 227815, 225128, 220514, 214208, 206946, 199868, 193838, 188960, 184835, 181216, 178287, 176362, 175428, 175101, 174991, 174998, 175171, 175462, 175791, 176328, 177426, 179187, 181262, 183239, 185091, 187072, 189233, 191283, 193051, 194956, 197854, 202279, 207910, 213867, 219559, 225104, 230957, 237360, 244322, 251868, 259937, 268067, 275568, 282128, 288030, 293712, 299340, 304860, 310160, 314952, 318737, 321186, 322376, 322492, 321493, 319381, 316612, 313696, 310329, 305430]
54013C05430p027q291p925o764o228o664p163o841n879n064m735m515m005l353
53999B20976k962k965l117l133k916k494j923j312q20n71o08r21j405j791j766
53984A92272j291p65p04j218j857k058j668r44j66N64J165J413J163N86O3j89
53968A86366k28j60Q6O61J454J955J702R06M66J001K005K339J607O32M19J076
53952B02287K025K788L177L164L079L586M873O173O764P140Q293J0036J1140J1291
53938B85816J1689J3218J5032J5638J4552J2038Q073K815k351n609o597o503o242
53925C51569n586m333l177k679k246r55J094K999M316N300O068O380O281O220
53911C71251O275N899M757L324K161J098l43j920k870l074l283l986m626m459
$$ y = [305430, 298403, 290112, 282187, 275423, 269195, 262531, 255368, 248527, 242648, 237584, 232849, 228334, 224329, 220976, 218014, 215049, 211932, 208799, 205883, 203389, 201466, 200154, 199334, 198763, 198155, 197234, 195829, 194038, 192272, 190981, 190216, 189512, 188294, 186437, 184379, 182711, 181767, 181601, 182165, 183330, 184743, 185906, 186492, 186555, 186366, 186138, 185978, 186064, 186725, 188179, 190134, 191836, 192742, 193208, 194209, 196214, 198553, 200160, 200792, 201211, 202287, 204312, 207100, 210277, 213441, 216520, 220106, 224979, 231152, 237916, 245056, 253349, 263385, 274525, 285816, 297505, 310723, 325755, 341393, 355945, 367983, 376056, 378871, 376520, 370911, 364314, 357811, 351569, 345983, 341650, 338473, 335794, 333548, 332593, 333687, 336686, 341002, 346302, 352370, 358750, 365031, 371251, 377526, 383425, 388182, 391506, 393667, 394765, 394422, 392502, 389632, 386558, 383275, 379289, 374663, 370204]
53897C70204l725l417m049n175o073o454o478o473o725p257p659p420o507n457
53883B87335m836m780n033n201m960m347l836l853m165m129l563k950k663k500
53869B30519k216k022k181k435k345j929j557j375j250j150j209j443j718j934
53855B05755j960j522n99J66n3j238k329k336j364l85j35m39n91k19K84K46m26
53838A92855j054r47k02N04P35O31M28J09l26n79l56J53M16K07r1j2L99O59N44
53819A94073M31Q25J677K397K495K070J650J719K355L174L630L559L424L746M382
53804B31607M681M405M059M114M325M178L657L201L045L061L166L383L510L119
53790B83511K091R36L96P45J532J937J422J44j233k181k712l104l455l695l904
$$ y = [370204, 366479, 363062, 359013, 353838, 347765, 341311, 334833, 328360, 321635, 314378, 306719, 299299, 292792, 287335, 282499, 277719, 272686, 267485, 262525, 258178, 254342, 250489, 246324, 242195, 238632, 235682, 233019, 230519, 228303, 226281, 224100, 221665, 219320, 217391, 215834, 214459, 213209, 212059, 210850, 209407, 207689, 205755, 203795, 202273, 201674, 201840, 201787, 200549, 198220, 195884, 194520, 194135, 194000, 193561, 192970, 192751, 193035, 193281, 192855, 191801, 190854, 190652, 191156, 191891, 192522, 192950, 193059, 192733, 192154, 191798, 191951, 192367, 192574, 192483, 192471, 192870, 193529, 194073, 194504, 195329, 197006, 199403, 201898, 203968, 205618, 207337, 209692, 212866, 216496, 220055, 223479, 227225, 231607, 236288, 240693, 244752, 248866, 253191, 257369, 261026, 264227, 267272, 270333, 273499, 276882, 280392, 283511, 285602, 286538, 286934, 287679, 289211, 291148, 292570, 292714, 291481, 289300, 286588, 283484, 280029, 276334, 272430]
53775B72430m315m966n543n666n183m200l048k230k205k948l808m001l402k673
53761B18242k435k487k093j072j89k11r36j533j604j401j152p92m18l03l50r4
53745B01172M51N59k08j221j507r11m6N45O85L05n06j233j254m96N75J526K196
53728B00632K475K273J791J460J488J664J607J108L38j88nP57J415J512J277J162
53712B20766J235J395J731K225K432J983J257R44J163J518J902K516L176L289
53698B47532K782K406K841L834M505M262L274K248J839K030K142J607O79J09J87
53683B82277N08N57J55o48j640k388k519k128j679j440j368j394j416j157m82
53668B65238J89K83j10l42r9L13N68O18L81k10p85p03Q1Q55R97N70L1k03J58R71
$$ y = [272430, 268115, 263149, 257606, 251940, 246757, 242557, 239509, 237279, 235074, 232126, 228318, 224317, 220915, 218242, 215807, 213320, 211227, 210155, 209966, 209755, 208819, 207286, 205682, 204281, 203129, 202337, 201919, 201616, 201266, 201172, 201623, 202182, 201974, 200753, 199246, 198335, 198289, 198834, 199519, 199824, 199318, 198085, 196831, 196335, 196910, 198436, 200632, 203107, 205380, 207171, 208631, 210119, 211783, 213390, 214498, 214836, 214648, 214643, 215400, 216815, 218327, 219604, 220766, 222001, 223396, 225127, 227352, 229784, 231767, 233024, 233968, 235131, 236649, 238551, 241067, 244243, 247532, 250314, 252720, 255561, 259395, 263900, 268162, 271436, 273684, 275523, 277553, 279695, 281302, 281981, 282090, 282277, 282785, 283342, 283497, 282849, 281209, 278821, 276302, 274174, 272495, 271055, 269687, 268293, 266877, 265720, 265238, 265427, 265710, 265600, 265258, 265159, 265472, 266040, 266658, 267039, 266829, 266044, 265341, 265422, 266277, 267274, 267844, 267875, 267672, 267830, 268801]
53648B68801J368N24j059j818j032K51O52J82q0M43J280J663J358P67N25R22J617
53631B76364K117K399K688K724K062J063P70J493K382K793L103L705M112L953
53617C11728M000N151O923P957P738O895O083N517N335N480N376M580L625L254
53603C89642L049J877k08j692j567n46J61L83O11P84L66o26j432j492j119j045
53587C87146j479j849j518o70k18p30j763k489k648k559k422k137j735j404j173
53572C62352r15o66n43m43k57k19n79j035j096p98n44k69L82J149J216M21m17
53555C57739o36m22j35L72J221J960K159K082K210K498K577K461K447K584K691
53540C81808K743K854K998L079L134L263L516M017M883N900O689P361Q438R848
$$ y = [268801, 270169, 270693, 269634, 267816, 266784, 267035, 267687, 267869, 267789, 268232, 269512, 271175, 272533, 273300, 273825, 274747, 276364, 278481, 280880, 283568, 286292, 288354, 289417, 290187, 291680, 294062, 296855, 299958, 303663, 307775, 311728, 315728, 320879, 327802, 335759, 343497, 350392, 356475, 361992, 367327, 372807, 378183, 382763, 386388, 389642, 392691, 394568, 394360, 392668, 391101, 390555, 390716, 391099, 391710, 392494, 392860, 392234, 390802, 389310, 388191, 387146, 385667, 383818, 382300, 381630, 381412, 380682, 378919, 376430, 373782, 371223, 368801, 366664, 364929, 363525, 362352, 361437, 360771, 360228, 359785, 359528, 359309, 358730, 357695, 356599, 355801, 355257, 354988, 355370, 356519, 357735, 358156, 357739, 357103, 356681, 356546, 356918, 358139, 360099, 362258, 364340, 366550, 369048, 371625, 374086, 376533, 379117, 381808, 384551, 387405, 390403, 393482, 396616, 399879, 403395, 407412, 412295, 418195, 424884, 432245, 440683, 450531]
53526D50531J0618J0186R416R592J0702J1621J1756J1663J2049J2981J4196J5516
53514E90827J6714J7592J8366J9467K0776K1613K1748K1835K2477K3319K3587
53503H18321K3171K2614K2277K1990K1527K0927K0273J9527J8792J8408J8540
53492A046367J8794J8527J7595J6578J6137J6284J6491J6383J6096J5966J6146
53481A231364J6554J6957J7014J6592J6039J5719J5159J3287R915O359L925K348
53469A381232M71j910m031n792q068j1051j3443j4043j3366j2894j3278j4052
53457A269775j4732j5376j6167j7034j7701j7861j7459j7066j7554j8949k0106
53446A079770k0009j8958j7865j6867j5516j3946j2817j2073j0810q583o069m123
$$ y = [450531, 461149, 471335, 480751, 490343, 501045, 512666, 524422, 536085, 548134, 561115, 575311, 590827, 607541, 625133, 643499, 662966, 683742, 705355, 727103, 748938, 771415, 794734, 818321, 841492, 864106, 886383, 908373, 929900, 950827, 971100, 990627, 1009419, 1027827, 1046367, 1065161, 1083688, 1101283, 1117861, 1133998, 1150282, 1166773, 1183156, 1199252, 1215218, 1231364, 1247918, 1264875, 1281889, 1298481, 1314520, 1330239, 1345398, 1358685, 1368600, 1374959, 1378884, 1381232, 1381703, 1379793, 1375762, 1369970, 1361902, 1350851, 1337408, 1323365, 1309999, 1297105, 1283827, 1269775, 1255043, 1239667, 1223500, 1206466, 1188765, 1170904, 1153445, 1136379, 1118825, 1099876, 1079770, 1059761, 1040803, 1022938, 1006071, 990555, 976609, 963792, 951719, 940909, 932326, 926257, 922134]
53434I22134k922k205j722j184l71N01J087J701L019M956O606P663Q853J0563
53420I58679J2032J2614J2956J4039J5799J7612J9457K1501K3127K3632K3692
53409A155140K4721K6868K8819K9728L0245L1301L2968L4981L7422M0246M2856
53398A515295M4780M6323M7988M9682N0954N1707N2179N2522N2786N3048N3253
53387B070517N3108N2383N1099M9308M6991M4378M1920L9737L7457L4873L2215
53376B553986K9450K5885K1024J5492J0524O616L139q74n970j2122j8898k5728
53364B602524l2292l8563m4284m8673n1015n1466n0960n0407n0174n0103m9760
53353B084827m8759m7180m5506m3993m2389m0581l9155l8789l9317l9867l9864
$$ y = [922134, 919212, 917007, 915285, 914101, 913730, 914231, 915318, 917019, 920038, 924994, 931600, 939263, 948116, 958679, 970711, 983325, 996281, 1010320, 1026119, 1043731, 1063188, 1084689, 1107816, 1131448, 1155140, 1179861, 1206729, 1235548, 1265276, 1295521, 1326822, 1359790, 1394771, 1432193, 1472439, 1515295, 1560075, 1606398, 1654386, 1704068, 1755022, 1806729, 1858908, 1911430, 1964216, 2017264, 2070517, 2123625, 2176008, 2227107, 2276415, 2323406, 2367784, 2409704, 2449441, 2486898, 2521771, 2553986, 2583436, 2609321, 2630345, 2645837, 2656361, 2662977, 2666116, 2665242, 2659272, 2647150, 2628252, 2602524, 2570232, 2531669, 2487385, 2438712, 2387697, 2336231, 2285271, 2234864, 2184690, 2134587, 2084827, 2036068, 1988888, 1943382, 1899389, 1857000, 1816419, 1777264, 1738475, 1699158, 1659291, 1619427]
53342A619427l9331l8330l6701l4525l2289l0353k8568k6558k4191k1642j9171
53331A287768j6977j5127j3610j2510j2009j2037j2131j1970j1836j2160j2739
53320A144662j2902j2412j1635j0795r667q246p068o457n828m350k115r9R67J357
53306A055412J883L025M599O109P284Q343R784J1829J4098J5963J7269J8491K0112
53293A194201K2016K3705K4962K5961K6719K6841K6054K4729K3415K2127K0499
53282A461229J8583J6914J5680J4316J2216R427O348L120k95l713o800r427j1642
53269A525956j3424j4810j6144j7900k0205k2711k4821k6022k6294k6284k6785
53258A290556k7780k8428k8221k7666k7441k7372k6867k5890k4841k3834k2887
$$ y = [1619427, 1580096, 1541766, 1505065, 1470540, 1438251, 1407898, 1379330, 1352772, 1328581, 1306939, 1287768, 1270791, 1255664, 1242054, 1229544, 1217535, 1205498, 1193367, 1181397, 1169561, 1157401, 1144662, 1131760, 1119348, 1107713, 1096918, 1087251, 1079005, 1071937, 1065480, 1059652, 1055302, 1053187, 1053088, 1054055, 1055412, 1057295, 1060320, 1064919, 1071028, 1078312, 1086655, 1096439, 1108268, 1122366, 1138329, 1155598, 1174089, 1194201, 1216217, 1239922, 1264884, 1290845, 1317564, 1344405, 1370459, 1395188, 1418603, 1440730, 1461229, 1479812, 1496726, 1512406, 1526722, 1538938, 1548365, 1554713, 1557833, 1557538, 1553825, 1547025, 1537598, 1525956, 1512532, 1497722, 1481578, 1463678, 1443473, 1420762, 1395941, 1369919, 1343625, 1317341, 1290556, 1262776, 1234348, 1206127, 1178461, 1151020, 1123648, 1096781, 1070891, 1046050, 1022216, 999329]
53247I99329k2563k3381k4721k5253k4622k3764k3333k2769k1404j9653j8452
53236G49414j7969j7556j6662j5307j3844j2612j1689j0765r522q178p325p148
53224F00837p290p628q458r683j0499j0437j0185j0733j2128j3585j4405j4274
53212D71532j3135j1448j0179r788r502q391o796n869n864n946n676n611o128
53199C67199o674o683o472o624p029p172o925o497n920n157m434l971l558k963
53185B87120k493k610l091l186k659k092k040k354k589k554k250j666j041r29
53171B55566j590k450k631j988j212r31j068j167j047q46o70m49r1K85L48j28
53155B39931r16j369j104n51n02j040j395j023l86k33m71l35M16J088J017M00
$$ y = [999329, 976766, 953385, 928664, 903411, 878789, 855025, 831692, 808923, 787519, 767866, 749414, 731445, 713889, 697227, 681920, 668076, 655464, 643775, 633010, 623488, 615310, 607985, 600837, 593547, 585919, 577461, 567778, 557279, 546842, 536657, 525924, 513796, 500211, 485806, 471532, 458397, 446949, 436770, 426982, 417480, 409089, 402293, 396424, 390560, 384614, 378938, 373327, 367199, 360525, 353842, 347370, 340746, 333717, 326545, 319620, 313123, 307203, 302046, 297612, 293641, 290083, 287120, 284627, 282017, 278926, 275740, 273081, 270989, 268949, 266595, 264006, 261452, 259202, 257536, 256495, 255566, 253976, 251526, 248895, 246907, 245695, 244764, 243696, 242529, 241482, 240636, 239966, 239517, 239426, 239711, 240059, 239931, 239015, 237646, 236542, 235991, 235489, 234449, 233054, 232031, 231645, 231412, 230941, 230606, 231022, 232110, 233127, 233527]
53139B33527p0j18%O6J81M28N98M74J59m8o0j5J35O67J533K078J752R71O59R39
53119B43856R34P8j002j354r27l70n2L2k11q01j196q14l7J63l89q72q22p49j085
53100B34382j412j293j121j385j614j002K46J049Q39J59j21L12J127J625J204
53085B32995J4r22q12j24L8m85p85l98k3l11p78o54j89k56r07j260q60l09l09
53066B23665o89q65p29o21o55o27n02m82o11o34l59J26O44J023J033N37j24k93
53048B19837K69J052J375J078M30k67p42p25k86M1j68n99o04r3L62L31Kj75o4
53029B21054M4k64j014j591j211R5J335J686J379J044O81L3m33JR60J220M50l31
53011B25138l32k3n4j63J36N16L65j67m35l06j45j07m0J26L60O02N58j13r64q18
$$ y = [233527, 233457, 233339, 233339, 233405, 233586, 234014, 234612, 235086, 235245, 235197, 235137, 235122, 235257, 235924, 237457, 239535, 241287, 242258, 242917, 243856, 244790, 244868, 243866, 242512, 241585, 241215, 241163, 241195, 240984, 240183, 238987, 238173, 238136, 238299, 237910, 237038, 236216, 235467, 234382, 232970, 231677, 230556, 229171, 227557, 226555, 226801, 227850, 228689, 228848, 228727, 229039, 230166, 231791, 232995, 233009, 232087, 231275, 231151, 231189, 230704, 229919, 229521, 229498, 229187, 228409, 227755, 227566, 227310, 226403, 225143, 224283, 223974, 223665, 222976, 222111, 221382, 220761, 220106, 219479, 218977, 218495, 217884, 217250, 216891, 217017, 217661, 218684, 219717, 220254, 220130, 219837, 220106, 221158, 222533, 223611, 224041, 223774, 223032, 222307, 222021, 222062, 221894, 221295, 220691, 220598, 220960, 221291, 221293, 221118, 221054, 221098, 220834, 219820, 218229, 217018, 217113, 218448, 220134, 221513, 222557, 223238, 223271, 222838, 222839, 223799, 225019, 225469, 225138, 224806, 224783, 224729, 224566, 224702, 225218, 225583, 225416, 224981, 224675, 224530, 224423, 224383, 224509, 224869, 225471, 226029, 225916, 224952, 224134]
52991B24134O58K108K122J185Q58J445J743J056J05k77k29j97j75j52m35j009
52975B32940j185n61K27L41o2q6O70J688K273K296K186K378K821K981K376J103
52959B52386l49j620k533k814k334j621j458j822j842j041n1K74r6o25j027j272
52943B32155j174o13J00N09M88J06o33j475j701r07K22O11J97q5K80P49P22M25
52925B29976L37K45m10j473k008j426k47N03M38O0j04j80o01j258j465q27K03
52908B21763Q66Q82M54j84p85q36pJ153J523P36k76m34J92O59M22j60n11l85K18
52889B25290J111J737J433K62q01q57r2N73N92J84k53o34r28q94l21N94J369J689
52871B30054J633J468J336J206J112J294J836K303K006Q98k20o19n65q28j561
$$ y = [224134, 224792, 226900, 229022, 230207, 231065, 232510, 234253, 235309, 235414, 235137, 234908, 234711, 234536, 234384, 233949, 232940, 231755, 231194, 231421, 231762, 231700, 231614, 232284, 233972, 236245, 238541, 240727, 243105, 245926, 248907, 251283, 252386, 252037, 250417, 247884, 245070, 242736, 241115, 239657, 237835, 235993, 234952, 234901, 235175, 235079, 234454, 233427, 232155, 230981, 230368, 230468, 230977, 231465, 231571, 230938, 229463, 227762, 226855, 227077, 227688, 227885, 227800, 228080, 228829, 229551, 229976, 230313, 230558, 230148, 228675, 226667, 225241, 224994, 225497, 225935, 225995, 225891, 225711, 225110, 223852, 222387, 221560, 221763, 222629, 223511, 223965, 223781, 222996, 222160, 222153, 223306, 224829, 225565, 225289, 224855, 225047, 225706, 226128, 225968, 225457, 225072, 225290, 226401, 228138, 229571, 229833, 229032, 228175, 228083, 228656, 229248, 229432, 229179, 228545, 227617, 226723, 226402, 226996, 228365, 230054, 231687, 233155, 234491, 235697, 236809, 238103, 239939, 242242, 244248, 245146, 244926, 244307, 243742, 242914, 241353]
52856B41353k176k266k073j966k017k222k561k722k266j295m74j97k25l57p99
52841B17737j466j650r62p6J45j61k67l1J12J11L31P45Q56M99K7l31o65q74o61
52822B13419j44J60P9l5N1K55O61J473K284K186J024j30j74P63J676J804J048
52805B26400k30j382j840j724j683j913j783r22j9P1m27o15k99j25m56q82r45
52788B11226p21n23m41m16l43m4N57J195J478J405J247R65K01r48j651j198P2
52771B12061J071J131N45l0l30n54q90j232j433j539j662j707j427p23J88R73
52755B04442J375J342J055Q39Q44Q91Q07P95J146J664J824J549J324J378J284
52740B22559P56L27P32J822K646K514J586N01j75j94K81P38P50L19l00r52j469
$$ y = [241353, 239177, 236911, 234838, 232872, 230855, 228633, 226072, 223350, 221084, 219789, 219315, 219118, 218893, 218536, 217737, 216271, 214621, 213659, 213583, 213728, 213567, 213300, 213269, 213381, 213492, 213823, 214568, 215424, 215923, 215950, 215619, 214954, 214080, 213419, 213275, 213435, 213514, 213479, 213530, 213785, 214446, 215919, 218203, 220389, 221413, 221283, 221109, 221872, 223548, 225352, 226400, 226170, 224788, 222948, 221224, 219541, 217628, 215845, 214923, 214904, 214975, 214548, 213933, 213634, 213509, 213053, 212171, 211226, 210505, 209982, 209541, 209125, 208782, 208738, 209295, 210490, 211968, 213373, 214620, 215585, 215786, 214838, 213187, 211989, 212061, 213132, 214263, 214808, 214778, 214448, 213894, 213004, 211772, 210339, 208800, 207138, 205431, 204004, 203281, 203469, 204442, 205817, 207159, 208214, 209053, 209897, 210788, 211595, 212390, 213536, 215200, 217024, 218573, 219897, 221275, 222559, 223315, 223642, 224374, 226196, 228842, 231356, 232942, 233443, 233268, 233074, 233355, 234093, 234843, 235162, 234862, 233910, 232441]
52723B32441j461p08L16P94M90p4m30o54r23j048p82l24j52m48r05j051o56O7
52705B24492O00N52K9n37r30j266j513j221l7J635K866L089K583J973J514J049
52689B34878M88N8j40m27j103j822j878j213o38p34j034p93k19j48o37p83j67
52672B23688M17K29j65K40J180J362L23q74j150o99k99rO65J663K282K196J906
52655B32955J973K346K617K572K181J444M73m69j216j780k028j685q98m01o30
52640B37454j074r75l82R7L61P85J230J038L06J44J153K304K265J290Q49J538
52624B48383K312J980O61o82j454j755j779j514j023n99n06p44j091j356j461
52609B39372j364r58j39Q87J513J164k6j168j391o18M86J264J536J531J507J560
$$ y = [232441, 230980, 230272, 230588, 231382, 231872, 231798, 231368, 230714, 229791, 228743, 227961, 227637, 227485, 227037, 226132, 225081, 224425, 224492, 225092, 225644, 225673, 225136, 224206, 222940, 221427, 220206, 220169, 221804, 224670, 227759, 230342, 232315, 233829, 234878, 235366, 235424, 235284, 234857, 233754, 231932, 230054, 228841, 228203, 227469, 226435, 225642, 225423, 225275, 224638, 223855, 223688, 224105, 224334, 224169, 224409, 225589, 226951, 227274, 226400, 225250, 224551, 224252, 224243, 224908, 226571, 228853, 231049, 232955, 234928, 237274, 239891, 242463, 244644, 246088, 246561, 246092, 244876, 243096, 241068, 239383, 238485, 238084, 237454, 236380, 235405, 235023, 235120, 235481, 236266, 237496, 238534, 238840, 238984, 240137, 242441, 244706, 245996, 246845, 248383, 250695, 252675, 253336, 252654, 251200, 249445, 247666, 246152, 245129, 244530, 244024, 243280, 242189, 240833, 239372, 238008, 237050, 236911, 237798, 239311, 240475, 240449, 239281, 237890, 237272, 237758, 239022, 240558, 242089, 243596, 245156]
52593B45156J564J268N96j07l15M3M41M07K06M43J124J515J110L00j88j80p1j52
52575B53160l60n61p29q22p87o57m35O0Q55J456J244K80p31j383j907k467k596
52558B43620j866o61J80L98M19M97K73n59j533j814j220n15m47p92o67K27J175
52541B36715J387R23L46j60o99r97n38N31J383J556J414J326J054L56l73o08m23
52524B43193j85R5N57R01O57l5n09m16qM72J116J899K350K035J234Q17J362K472
52506B58007L140K794J790P42k81j439k302k188j384j145k003k890k589j447p73
52491B48032r92j284r25j32M61M81m6o94q05j29P60J184J213J271J175M88m02
52474B49656n45J60Q20R63J055J318J155K77m72j92Q63J888K613L118L159K558
$$ y = [245156, 246720, 247988, 248584, 248477, 248162, 248205, 248646, 249053, 249259, 249702, 250826, 252341, 253451, 253751, 253563, 253383, 253312, 253160, 252800, 252239, 251510, 250688, 249901, 249244, 248809, 248869, 249724, 251180, 252424, 252704, 251973, 250590, 248683, 246216, 243620, 241754, 241093, 241273, 241671, 242090, 242587, 242860, 242301, 240768, 238954, 237734, 237219, 236772, 235980, 235313, 235540, 236715, 238102, 239025, 239371, 239211, 238512, 237515, 236977, 237508, 238891, 240447, 241861, 243187, 244241, 244597, 244224, 243616, 243193, 243008, 243103, 243660, 244561, 245218, 245183, 244674, 244258, 244250, 244722, 245838, 247737, 250087, 252122, 253356, 254173, 255535, 258007, 261147, 263941, 265731, 266473, 266192, 264753, 262451, 260263, 258879, 257734, 255731, 252841, 250252, 248805, 248032, 247040, 245756, 244831, 244699, 245160, 245641, 245595, 244901, 244096, 243967, 244727, 245911, 247124, 248395, 249570, 250058, 249656, 249111, 249271, 250091, 251054, 252109, 253427, 254582, 254859, 254387, 254195, 255058, 256946, 259559, 262677, 265836, 268394]
52458B68394J823J481J145J28j277k098k132k165k645l032k733j899j040m22j69
52443B53359l99r16j177r55o66o95q50p58m52j81O7L86N65L57l3j32J27L67L67
52424B48381L33M85P11P39M60Q4M7P47K074L289L709L474L330L670M283N067O371
52407B87254Q291J0158J1184J1221J0362Q243M456m33m985q087r609r872r137
52394C09046p772o290m947l617k353j560j340j128m16M91Q43L51n86j318j352
52379B78052n44P32J807K367K721L132L328L034K623K657L030L196L146L418M039
52364C16738M157L105J354pn34p21j103j413r16N30K047K611K161J545J381J503
52348C32438J589J785K353L112L760M359N075N666N786N605N548N596N419N114
$$ y = [268394, 270217, 271698, 272843, 272971, 271694, 269596, 267464, 265299, 262654, 259622, 256889, 254990, 253950, 253528, 253359, 252960, 252044, 250867, 249912, 249246, 248551, 247701, 246943, 246491, 246310, 246377, 246763, 247328, 247685, 247652, 247520, 247647, 248014, 248381, 248714, 249199, 249910, 250649, 251109, 251193, 251240, 251987, 254061, 257350, 261059, 264533, 267863, 271533, 275816, 280883, 287254, 295545, 305703, 316887, 328108, 338470, 346713, 351169, 350736, 345751, 337664, 328055, 318183, 309046, 301274, 294984, 290037, 286420, 284067, 282507, 281167, 280039, 279623, 280114, 280957, 281308, 280722, 279404, 278052, 277508, 278240, 280047, 282414, 285135, 288267, 291595, 294629, 297252, 299909, 302939, 306135, 309281, 312699, 316738, 320895, 324000, 325354, 325347, 324813, 324092, 322989, 321576, 320660, 321190, 323237, 325848, 328009, 329554, 330935, 332438, 334027, 335812, 338165, 341277, 345037, 349396, 354471, 360137, 365923, 371528, 377076, 382672, 388091, 393205]
52334C93205N235O032P268Q802J0692J2648J3939J4241J4203J4796J6348J8328
52322E35737J9907K0528K0226J9534J9037J8921J8987J8975J8711J8124J7376
52311G46063J6798J6456J6038J5454J5195J5585J5985J5420J3887J2287J1141
52300I10309J0071Q614O862N104L481K051P46q60l081n412o975p696q274q880
52286I06060q927q267p663p485o953n382l407k048j172J86K334M624O518Q116
52272H76534R634J1002J2083J2859J3337J3537J3557J3419J2980J2257J1637J1505
52260A024341J1806J2175J2317J2107J1540J0837J0290R831Q976P422N373L180
52248A140195R90j045k707m078n561p277q910j0285j1589j2757j3310j3109j2672
$$ y = [393205, 398440, 404472, 411740, 420542, 431234, 443882, 457821, 472062, 486265, 501061, 517409, 535737, 555644, 576172, 596398, 615932, 634969, 653890, 672877, 691852, 710563, 728687, 746063, 762861, 779317, 795355, 810809, 826004, 841589, 857574, 872994, 886881, 899168, 910309, 920380, 928994, 935856, 940960, 944441, 946492, 947238, 946378, 943297, 937885, 930910, 923214, 914940, 906060, 897133, 888866, 881203, 873718, 866765, 861383, 857976, 855928, 854756, 854942, 857276, 861900, 868418, 876534, 886168, 897170, 909253, 922112, 935449, 948986, 962543, 975962, 988942, 1001199, 1012836, 1024341, 1036147, 1048322, 1060639, 1072746, 1084286, 1095123, 1105413, 1115244, 1124220, 1131642, 1137015, 1140195, 1141185, 1140140, 1137433, 1133355, 1127794, 1120517, 1111607, 1101322, 1089733, 1076976, 1063666, 1050557, 1037885]
52235A037885j2325j1779j0958j0431j0352r880q455o942o383o295n452l887k752
52222I31994k410j972q87L34J245K156L290M191M531M704N106N509N638N753O095
52207I75277O213N523M244L216K843K659K076J285J224K489M411N537N207M303
52193A026507M088M709N334N390M885L749J777o37k502l282l450l790m644n947
52179A032187p400q390q324p431o695o684o864o388n177l798k624j589o26O4K27
52164I60488j42o95r21n41L12J336K351L119L204K377J111K27M5K36M38O23R00
52147I74468J409K282L309L797L294K294J642J355Q47J26j45K20P37J384K792
52132I99811M975O967Q307R911J2589J5617J7798J9289K1188K3654K5628K6435
$$ y = [1037885, 1025560, 1013781, 1002823, 992392, 982040, 972160, 963705, 956763, 950380, 944085, 938633, 934746, 931994, 929584, 927612, 926725, 927059, 928304, 930460, 933750, 937941, 942472, 947176, 952282, 957791, 963429, 969182, 975277, 981490, 987013, 991257, 994473, 997316, 999975, 1002051, 1003336, 1004560, 1007049, 1011460, 1016997, 1022204, 1026507, 1030595, 1035304, 1040638, 1046028, 1050913, 1054662, 1056439, 1055802, 1053300, 1050018, 1046568, 1042778, 1038134, 1032187, 1024787, 1016397, 1008073, 1000642, 993947, 987263, 980399, 974011, 968834, 965036, 962412, 960823, 960197, 960261, 960488, 960346, 959651, 958730, 958189, 958501, 959837, 962188, 965307, 968511, 970888, 971999, 972226, 972271, 972507, 972945, 973568, 974468, 975877, 978159, 981468, 985265, 988559, 990853, 992495, 993850, 994697, 994823, 994678, 994898, 995635, 997019, 999811, 1004786, 1011753, 1020060, 1029971, 1042560, 1058177, 1075975, 1095264, 1116452, 1140106, 1165734, 1192169]
52120A192169K6632K7027K7640K7897K7383K6168K4694K3545K2964K2444K0996
52109A469559J8061J4106J0325P700O256N175L760K186J062L69o00k213l996n450
52095A526300o782q478j0558j2742j4864j6775j8141j8791j8861j8269j6645j4159
52083A351235j1790j0091q295n527k301J82J860L717O037Q020R286J0550J2337
52070A365220J4064J5025J5438J5860J6203J6032J5431J4814J4178J3228J2109
52059A527602J1390J1206J0890R594P118M057J259q50k497m180o156q404j0902
52046A550127j3657j6412j8703k0288k1326k2019k2349k2245k1732k0837j9626
52035A330933j8372j7336j6354j5060j3690j3055j3372j3751j3312j2429j2120
$$ y = [1192169, 1218801, 1245828, 1273468, 1301365, 1328748, 1354916, 1379610, 1403155, 1426119, 1448563, 1469559, 1487620, 1501726, 1512051, 1519751, 1526007, 1531182, 1534942, 1537128, 1538190, 1538559, 1537959, 1535746, 1531750, 1526300, 1519518, 1511040, 1500482, 1487740, 1472876, 1456101, 1437960, 1419169, 1400308, 1382039, 1365394, 1351235, 1339445, 1329354, 1321059, 1315532, 1313231, 1313413, 1315273, 1318990, 1325027, 1333047, 1342333, 1352883, 1365220, 1379284, 1394309, 1409747, 1425607, 1441810, 1457842, 1473273, 1488087, 1502265, 1515493, 1527602, 1538992, 1550198, 1561088, 1570682, 1577800, 1581857, 1583116, 1582266, 1579769, 1575589, 1569433, 1561029, 1550127, 1536470, 1520058, 1501355, 1481067, 1459741, 1437722, 1415373, 1393128, 1371396, 1350559, 1330933, 1312561, 1295225, 1278871, 1263811, 1250121, 1237066, 1223694, 1209943, 1196631, 1184202, 1172082]
52024A172082j2555j2915j2696j2331j2280j2208j1461r988q365p215o888p509
52012A045671q909j0537j1745j2273j2333j2320j2538j3174j4205j5367j6316
52001I05954j6954j7440j7801j7648j6510j4509j2487j1273j0860j0486r614q600
51989G41772q250q863r963j0872j1300j1373j1374j1605j2203j3007j3628j3810
$$ y = [1172082, 1159527, 1146612, 1133916, 1121585, 1109305, 1097097, 1085636, 1075648, 1067283, 1060068, 1053180, 1045671, 1036762, 1026225, 1014480, 1002207, 989874, 977554, 965016, 951842, 937637, 922270, 905954, 889000, 871560, 853759, 836111, 819601, 805092, 792605, 781332, 770472, 759986, 750372, 741772, 733522, 724659, 714696, 703824, 692524, 681151, 669777, 658172, 645969, 632962, 619334, 605524]
$$ [...]
##END NTUPLES=NMR SPECTRUM
##END=
