
##TITLE=AC1172_Tolima-ibage-TFiAH12005_5858481_cE55nQ55Vn
##JCAMPDX= 6.0         $$ Bruker NMR JCAMP-DX V2.0
##DATA TYPE= NMR SPECTRUM
##DATA CLASS= NTUPLES
##ORIGIN= BRUKER
##OWNER= Administrator
$$ 1.72 TOPSPIN		Version 2.1
$$ 2012-03-29 18:35:32.546 -0500  Administrator@TOPSPIN
$$ Compression mode = diff/dup
##.OBSERVE FREQUENCY= 400.13188235
##.OBSERVE NUCLEUS= ^1H
##.ACQUISITION MODE= SIMULTANEOUS (DQD)
##.ACQUISITION SCHEME= undefined
##.AVERAGES= 64
##.DIGITISER RES= 22
##SPECTROMETER/DATA SYSTEM= spect
##.PULSE SEQUENCE= noesygpps1d.comp
##.SOLVENT NAME= COFFEE_meoh
##.SHIFT REFERENCE= INTERNAL, COFFEE_meoh, 1, 14.96658
##AUDIT TRAIL= $$ (NUMBER, WHEN, WHO, WHERE, PROCESS, VERSION, WHAT)
$$ ##TITLE= Audit trail, TOPSPIN		Version 2.1
$$ ##JCAMPDX= 5.01
$$ ##ORIGIN= Bruker BioSpin GmbH
$$ ##OWNER= Administrator
$$ $$ C:\Bruker\TOPSPIN/data/COFFEE/nmr/AC1172_Tolima-ibage-TFiAH12005_5858481_cE55nQ55Vn/12/pdata/1/auditp.txt
$$ ##AUDIT TRAIL=  $$ (NUMBER, WHEN, WHO, WHERE, PROCESS, VERSION, WHAT)
(   1,<2012-03-29 18:35:20.000 -0500>,<Administrator>,<TOPSPIN>,<go>,<TOPSPIN 2.1>,
      <created by zg
	started at 2012-03-29 18:23:48.218 -0500,
	POWCHK enabled, PULCHK disabled,
       configuration hash MD5:
       1A 1E CE 29 27 FD 77 03 67 4E F0 E3 C4 B2 CB 90
       data hash MD5: 64K
       FE 8B 7D A6 68 69 08 A5 49 53 76 E8 FD 9A A4 D8>)
(   2,<2012-03-29 18:35:28.734 -0500>,<Administrator>,<TOPSPIN>,<proc1d>,<TOPSPIN 2.1>,
      <Start of raw data processing
       efp LB = 0.3 FT_mod = 6 PKNL = 1 PHC0 = 0 PHC1 = 0 SI = 128K 
       data hash MD5: 128K
       9B 95 15 7A D7 B8 78 E4 12 31 68 7C D1 C4 DC 7A>)
(   3,<2012-03-29 18:35:30.109 -0500>,<Administrator>,<TOPSPIN>,<proc1d>,<TOPSPIN 2.1>,
      <pk PHC0 = 31.68457 PHC1 = 0 
       data hash MD5: 128K
       68 26 F1 1E 9D 65 33 D3 F6 9C 67 0C FC 1D 58 48>)
(   4,<2012-03-29 18:35:31.968 -0500>,<Administrator>,<TOPSPIN>,<proc1d>,<TOPSPIN 2.1>,
      <abs ABSG = 1 
       data hash MD5: 128K
       8F 91 66 91 91 3D AB 27 8F E4 83 5C F5 42 C5 0A>)
(   5,<2012-03-29 18:35:32.093 -0500>,<Administrator>,<TOPSPIN>,<proc1d>,<TOPSPIN 2.1>,
      <abs ABSG = 2 
       data hash MD5: 128K
       D5 DB 83 A7 EF 21 12 67 4E 24 94 CB 71 19 CE B8>)
(   6,<2012-03-29 18:35:32.187 -0500>,<Administrator>,<TOPSPIN>,<proc1d>,<TOPSPIN 2.1>,
      <abs ABSG = 3 
       data hash MD5: 128K
       60 00 D0 7F B6 00 49 3B 9F DB 45 CD 7C 50 8A A9>)
(   7,<2012-03-29 18:35:32.250 -0500>,<Administrator>,<TOPSPIN>,<proc1d>,<TOPSPIN 2.1>,
      <abs ABSG = 4 
       data hash MD5: 128K
       B0 65 1A E4 F1 52 92 90 BE 60 F7 6F F1 69 A3 8A>)
(   8,<2012-03-29 18:35:32.312 -0500>,<Administrator>,<TOPSPIN>,<proc1d>,<TOPSPIN 2.1>,
      <abs ABSG = 5 
       data hash MD5: 128K
       43 09 13 4E DA 61 3B A2 FA FE BB BA E5 CD B2 AF>)
$$ ##END=
$$ 
$$ $$ hash MD5
$$ $$ 1A 0C 06 B0 6F FE 2F 84 E1 81 B0 1F 51 99 11 5B
##$RELAX= 
##$RELAX= 
##$RELAX= 
##$RELAX= 
##$RELAX= 
##$RELAX= 
##$RELAX= 
##$RELAX= 
$$ [...]
##$TP07= 0
##$TPNAME0= <>
##$TPNAME1= <>
##$TPNAME2= <>
##$TPNAME3= <>
##$TPNAME4= <>
##$TPNAME5= <>
##$TPNAME6= <>
##$TPNAME7= <>
##$TPOAL= (0..7)
0.5 0.5 0.5 0.5 0.5 0.5 0.5 0.5
##$TPOFFS= (0..7)
0 0 0 0 0 0 0 0
##$TUNHIN= 0
##$TUNHOUT= 0
##$TUNXOUT= 0
##$USERA1= <user>
##$USERA2= <user>
##$USERA3= <user>
##$USERA4= <user>
##$USERA5= <user>
##$V9= 5
##$VALIST= <valist>
##$VCLIST= <CCCCCCCCCCCCCCC>
##$VD= 0
##$VDLIST= <DDDDDDDDDDDDDDD>
##$VPLIST= <PPPPPPPPPPPPPPP>
##$VTLIST= <TTTTTTTTTTTTTTT>
##$WBST= 1024
##$WBSW= 4
##$XGAIN= (0..3)
0 0 0 0
##$XL= 0
##$YL= 0
##$YMAX_a= 10177848
##$YMIN_a= -5954448
##$ZGOPTNS= <>
##$ZL1= 120
##$ZL2= 120
##$ZL3= 120
##$ZL4= 120
##$ABSF1= 14.96658
##$ABSF2= -5.58595
##$ABSG= 5
##$ABSL= 3
##$ALPHA= 0
##$AQORDER= 0
##$ASSFAC= 0
##$ASSFACI= 0
##$ASSFACX= 0
##$ASSWID= 0
##$AUNMP= <proc_prof1d_extract.lims>
##$AXLEFT= 0
##$AXNAME= <>
##$AXNUC= <1H>
##$AXRIGHT= 0
##$AXTYPE= 0
##$AXUNIT= <>
##$AZFE= 0.1
##$AZFW= 0.1
##$BCFW= 0
##$BC_mod= 0
##$BYTORDP= 0
##$COROFFS= 0
##$CY= 15
##$DATMOD= 1
##$DC= 0
##$DFILT= <>
##$DTYPP= 0
##$F1P= 0
##$F2P= 0
##$FCOR= 0.5
##$FTSIZE= 131072
##$FT_mod= 6
##$GAMMA= 0
##$GB= 0
##$INTBC= 1
##$INTSCL= 1
##$ISEN= 128
##$LB= 0.3
##$LEV0= 0
##$LPBIN= 0
##$MAXI= 10000
##$MC2= 0
##$MEAN= 0
##$ME_mod= 0
##$MI= 0
##$NCOEF= 0
##$NC_proc= -3
##$NLEV= 6
##$NOISF1= 0
##$NOISF2= 0
##$NSP= 0
##$NTH_PI= 0
##$NZP= 0
##$OFFSET= 14.96658
##$PC= 1
##$PHC0= 31.68457
##$PHC1= 0
##$PH_mod= 1
##$PKNL= yes
##$PPARMOD= 0
##$PPDIAG= 0
##$PPIPTYP= 0
##$PPMPNUM= 2147483647
##$PPRESOL= 1
##$PSCAL= 4
##$PSIGN= 0
##$PYNMP= <proc.py>
##$REVERSE= no
##$SF= 400.130005615015
##$SI= 131072
##$SIGF1= 0
##$SIGF2= 0
##$SINO= 400
##$SIOLD= 131072
##$SPECTYP= <>
##$SREGLST= <1H.CDCl3>
##$SSB= 0
##$STSI= 131072
##$STSR= 0
##$SW_p= 8223.68421052632
##$SYMM= 0
##$S_DEV= 0
##$TDeff= 65536
##$TDoff= 0
##$TI= <>
##$TILT= no
##$TM1= 0
##$TM2= 0
##$TOPLEV= 0
##$USERP1= <user>
##$USERP2= <user>
##$USERP3= <user>
##$USERP4= <user>
##$USERP5= <user>
##$WDW= 1
##$XDIM= 131072
##$YMAX_p= 364718186
##$YMIN_p= -93291199
##$CURPLOT= <Network HP LaserJet P1505>
##$CURPRIN= <$Network HP LaserJet P1505>
##$DFORMAT= <normdp>
##$LAYOUT= <+/1D_H.xwp>
##$LFORMAT= <normlp>
##$PFORMAT= <normpl>
##$SURQMSG= 1
$$ End of Bruker specific parameters
$$ ---------------------------------
##NTUPLES= NMR SPECTRUM
##VAR_NAME=  FREQUENCY,     SPECTRUM/REAL,   SPECTRUM/IMAG
##SYMBOL=    X,             R,               I
##VAR_TYPE=  INDEPENDENT,   DEPENDENT,       DEPENDENT
##VAR_FORM=  AFFN,          ASDF,            ASDF
##VAR_DIM=   131072,        131072,          131072
##UNITS=     HZ,            ARBITRARY UNITS, ARBITRARY UNITS
##FACTOR=    0.0627417313425165, 1,          1
##FIRST=     8223.62146879498, 1192,         -99768
##LAST=      0,             4615,            -100503
##MIN=       0,             -93291199,       0
##MAX=       8223.62146879498, 364718186,    0
$$ Real data points
##PAGE= N=1
##DATA TABLE= (X++(R..R)), XYDATA
$$ [...]
$$ plain form
63774 701112 672302 644346 618185 595086 575368 558193 542400 527125 511842 496407 481177
63763 481177 466738 453439 441338 430528 421142 412893 404849 396021 386263 376441 367530 359585 351881
63750 351881 344126 337094 331549 326907 321809 316121 311487 309420 309479 309983 310041 309981 309980 309276 307101 303789 300484
63733 300484 297940 295914 293671 290933 288381 287158 287673 288951 289413 288315 286191 283891 281539 278596 274782
63718 274782 270804 268146 267948 269795 271797 272317 271572 270957 270856 270031 267658 265089 264611 266739 269720 271677
63702 271677 272297 272185 271574 270457 269394 269249 270089 270957 270831 269489 267484 265734 265216 266509 269304 272528
63686 272528 275235 277336 279416 281941 284669 286788 287819 288557 290790 295487 301405 306239 309209 311672
63672 311672 314981 318861 322575 326586 331762 337513 342184 345262 347942 351434 355848 360876 366306 371460
$$ packed form
63774G01112k8810k7956k6161k3099j9718j7175j5793j5275j5283j5435j5230
63763D81177j4439j3299j2101j0810r386q249q044q828r758r822q911p945p704
63750C51881p755p032n545m642n098n688m634k067N9N04N8o0jp04k175l312l305
63733C00484k544k026k243k738k552j223N15J278M62j098k124k300k352k943l814
63718B74782l978k658j98J847K002N20p45o15j01q25k373k569m78K128K981J957
63702B71677O20j12o11j117j063j45Q40Q68j26j342k005j750n18J293K795L224
63686B72528K707K101K080K525K728K119J031P38K233M697N918M834K970K463
63672C11672L309L880L714M011N176N751M671L078K680L492M414N028N430N154
$$ plain form
63658 371460 375349 377999 380558 383382 385067 384344 381968 379584 377400 374242 369544 364090 358936 354725
63644 354725 352067 351515 352852 355032 356996 358201 358609 358813 359987 362870 366890 370912 374608 378246 381463
63629 381463 383521 384880 387258 391580 396754 401039 403996 406574 409857 414165 419030 423652 427617 431281
63615 431281 435246 439619 444261 449393 455039 460052 462824 463142 462243 460838 458321 454428 450388 447548 445790
63600 445790 444207 442494 440743 438585 435665 432547 430155 428457 426420 423179 418821 414321 411054 409896
63586 409896 410390 411396 412863 416026 421266 426933 431364 435188 440320 447301 454957 462290 469350 476568
63572 476568 484562 494478 507124 521734 536785 552006 568329 585864 603467 620732 638988 659572
63560 659572 682143 705485 729265 754295 781630 812005 845684 882337 921268 961942 1004017
$$ packed form
63658C71460L889K650K559K824J685p23k376k384k184l158m698n454n154m211
63644C54725k658n52J337K180J964J205M08K04J174K883M020M022L696L638L217
63629C81463K058J359K378M322N174M285K957K578L283M308M865M622L965L664
63615D31281L965M373M642N132N646N013K772L18q99j405k517l893m040k840j758
63600D45790j583j713j751k158k920l118k392j698k037l241m358m500l267j158
63586D09896M94J006J467L163N240N667M431L824N132O981P656P333P060P218
63572D76568P994R916J2646J4610J5051J5221J6323J7535J7603J7265J8256K0584
63560F59572K2571K3342K3780K5030K7335L0375L3679L6653L8931M0674M2075
$$ plain form
63549 1004017 1047061 1090862 1135818 1181857 1226782 1266794 1299404 1325117 1345726 1361661 1371711
63538 1371711 1374937 1372219 1366007 1358707 1350952 1341324 1328136 1311419 1292436 1271404 1246856 1217683
63526 1217683 1184720 1149714 1113703 1077184 1041055 1006328 973301 941925 912657 886223 862811
63515 862811 842194 824415 809688 797830 788398 781229 776399 773884 773789 776609 782738 791949 803898
63502 803898 818852 837322 859171 883774 911013 941427 975252 1011650 1049100 1086485 1124028
63491 1124028 1163352 1206313 1253412 1303516 1355213 1407788 1460231 1509818 1552642 1585775 1608535
63480 1608535 1621798 1626779 1624696 1617109 1606005 1593170 1579208 1563241 1544078 1521867 1498077 1473493
63468 1473493 1446755 1415469 1378465 1336438 1290859 1243083 1194442 1146231 1099119 1052881 1006962
$$ packed form
63549A004017M3044M3801M4956M6039M4925M0012L2610K5713K0609J5935J0050
63538A371711L226k718o212p300p755r628j3188j6717j8983k1032k4548k9173
63526A217683l2963l5006l6011l6519l6129l4727l3027l1376k9268k6434k3412
63515H62811k0617j7779j4727j1858r432p169m830k515r5K820O129R211J1949
63502H03898J4954J8470K1849K4603K7239L0414L3825L6398L7450L7385L7543
63491A124028L9324M2961M7099N0104N1697N2575N2443M9587M2824L3133K2760
63480A608535J3263M981k083p587j1104j2835j3962j5967j9163k2211k3790k4584
63468A473493k6738l1286l7004m2027m5579m7776m8641m8211m7112m6238m5919
$$ plain form
63457 1006962 961270 916439 873553 833611 797130 764143 734381 707250 681863 657748 635547
63446 635547 616360 600178 585647 571649 558323 546184 535093 524809 515707 508070 501315 494893
63434 494893 489430 485893 484026 482705 481548 481088 481475 482126 482660 483210 483881 484882 487149 491598 497545 502918
63418 502918 506379 508348 509760 510865 511698 512658 513914 514928 515190 514902 514521 514259 514427 515545 517446 518849
63402 518849 518568 516818 514802 513389 512798 513188 514760 517321 520419 524148 529391 536976 546754 557839 569782
63387 569782 583127 598393 614743 630627 646180 664137 687393 716154 748551 783654 822246
63376 822246 864459 908292 951347 992898 1033073 1070845 1104202 1132260 1156232 1178200 1199625
63365 1199625 1221162 1243360 1267175 1293883 1324600 1359850 1399629 1443679 1491442 1541768 1592968
$$ packed form
63457A006962m5692m4831m2886l9942l6481l2987k9762k7131k5387k4115k2201
63446F35547j9187j6182j4531j3998j3326j2139j1091j0284r102p637o755o422
63434D94893n463l537j867j321j157m60L87O51N34N50O71J001K267M449N947N373
63418E02918L461J969J412J105Q33R60J256J014K62k88l81k62J68J118J901J403
63402E18849k81j750k016j413n91L90J572K561L098L729N243P585R778J1085J1943
63387E69782J3345J5266J6350J5884J5553J7957K3256K8761L2397L5103L8592
63376H22246M2213M3833M3055M1551M0175L7772L3357K8058K3972K1968K1425
63365A199625K1537K2198K3815K6708L0717L5250L9779M4050M7763N0326N1200
$$ plain form
63354 1592968 1643055 1689714 1730424 1763510 1789086 1808116 1820427 1824656 1820489 1809958 1795767 1779062
63342 1779062 1759520 1736815 1710993 1681860 1649002 1612265 1571511 1526226 1476301 1423093 1368890
63331 1368890 1315349 1263112 1212686 1164732 1119468 1076855 1037691 1003512 974835 950331 928514
63320 928514 909678 895195 885262 878479 873742 871463 872404 876311 882724 892585 907678 928395 953193
63307 953193 980585 1010490 1043047 1077401 1113030 1151422 1194684 1242519 1292181 1341787 1392266
63296 1392266 1445260 1500150 1554014 1603884 1648201 1686501 1718514 1743565 1760566 1768864 1769283 1763918
63284 1763918 1754618 1742040 1726313 1707809 1686658 1662080 1632987 1599198 1561596 1521185 1478263
63273 1478263 1432544 1384031 1333838 1283898 1235507 1188556 1142841 1099724 1061367 1028440 999803
$$ packed form
63354A592968N0087M6659M0710L3086K5576J9030J2311M229m167j0531j4191j6705
63342A779062j9542k2705k5822k9133l2858l6737m0754m5285m9925n3208n4203
63331A368890n3541n2237n0426m7954m5264m2613l9164l4179k8677k4504k1817
63320I28514j8836j4483r933o783m737k279R41L907O413R861J5093K0717K4798
63307I53193K7392K9905L2557L4354L5629L8392M3262M7835M9662M9606N0479
63296A392266N2994N4890N3864M9870M4317L8300L2013K5051J7001Q298M19n365
63284A763918r300j2578j5727j8504k1151k4578k9093l3789l7602m0411m2922
63273A478263m5719m8513n0193m9940m8391m6951m5715m3117l8357l2927k8637
$$ plain form
63262 999803 974346 951613 930412 908626 885191 860680 835071 806822 775595 744284 716309
63251 716309 691905 668978 646651 625759 606431 587662 569469 553287 539692 527441 515367
63240 515367 503743 493153 483355 473987 465381 458024 451990 447303 443978 441350 438282 434424 430468 426883
63226 426883 423306 419464 415777 412689 410312 409043 409507 411390 413280 414193 414479 414813 415214 415623 416567 418594
63210 418594 421693 425660 430269 434756 438242 441298 445957 453239 461519 468393 473474 478379 484613 492607
63196 492607 502260 513125 524195 534596 544677 555630 568038 581545 595946 611791 629715 649706
63184 649706 671311 694242 718602 744685 772616 802210 833315 866204 901147 937510 973899
63173 973899 1009520 1044838 1080568 1116637 1152647 1188628 1224592 1259848 1293661 1326287 1358616
$$ packed form
63262I99803k5457k2733k1201k1786k3435k4511k5609k8249l1227l1311k7975
63251G16309k4404k2927k2327k0892j9328j8769j8193j6182j3595j2251j2074
63240E15367j1624j0590r798r368q606p357o034m687l325k628l068l858l956l585
63226D26883l577l842l687l088k377j269M64J883J890R13K86L34M01M09R44K027
63210D18594L099L967M609M487L486L056M659P282Q280O874N081M905O234P994
63196D92607R653J0865J1070J0401J0081J0953J2408J3507J4401J5845J7924J9991
63184F49706K1605K2931K4360K6083K7931K9594L1105L2889L4943L6363L6389
63173I73899L5621L5318L5730L6069L6010L5981L5964L5256L3813L2626L2329
$$ plain form
63162 1358616 1391092 1423728 1456701 1489767 1521129 1547992 1568655 1583334 1592805 1597111 1595892 1589044
63150 1589044 1576288 1556664 1529443 1495680 1458263 1420139 1382627 1345540 1308709 1272991 1239743
63139 1239743 1209685 1182731 1158763 1137990 1120468 1106049 1095374 1090277 1092274 1100620 1112631 1126176
63127 1126176 1141432 1159978 1182607 1208343 1235327 1262251 1288878 1315437 1341779 1367317 1391648
63116 1391648 1414923 1437307 1458286 1476758 1491843 1503345 1511386 1515755 1515714 1510332 1498925 1481203
63104 1481203 1457286 1427798 1393892 1356775 1317082 1274982 1230955 1185949 1140500 1094475 1048384
63093 1048384 1004238 963852 926583 890199 854238 821082 793094 769885 749277 729872 711491
63082 711491 693904 676642 660045 645414 633914 625780 620311 615957 610762 603721 595846 589244 585069
$$ packed form
63162A358616L2476L2636L2973L3066L1362K6863K0663J4679R471M306j219o848
63150A589044j2756j9624k7221l3763l7417l8124l7512l7087l6831l5718l3248
63139A239743l0058k6954k3968k0773j7522j4419j0675n097J997Q346J2011J3545
63127A126176J5256J8546K2629K5736K6984K6924K6627K6559K6342K5538K4331
63116A391648K3275K2384K0979J8472J5085J1502Q041M369m1n382j1407j7722
63104A481203k3917k9488l3906l7117l9693m2100m4027m5006m5449m6025m6091
63093A048384m4146m0386l7269l6384l5961l3156k7988k3209k0608j9405j8381
63082G11491j7587j7262j6597j4631j1500q134n469m354n195p041p875o602m175
$$ plain form
63069 585069 582724 580881 578699 576349 575062 576443 580852 586448 590683 592838 594439 597125 600961 605089
63055 605089 609168 613562 618604 624268 630461 637191 644367 651517 657814 662681 666620 671148 677534 685691
63041 685691 694568 703259 711192 717706 722468 726437 731514 738690 746932 754217 759431 763077 766484 770596
63027 770596 775415 780367 785022 789309 793255 797170 802296 810503 822580 837293 852831 868624 884915
63014 884915 901258 917071 933627 953791 978972 1007479 1036805 1066776 1099531 1136881 1178618
63003 1178618 1223349 1270264 1319777 1372571 1428300 1485718 1544428 1605980 1672418 1743923 1818844
62992 1818844 1895993 1975670 2058122 2142279 2226745 2311066 2395144 2478368 2560433 2642369 2725450
62981 2725450 2809248 2891788 2971576 3048509 3122754 3193708 3260349 3321720 3376387 3421776 3454721
$$ packed form
63069E85069k345j843k182k350j287J381M409N596M235K155J601K686L836M128
63055F05089M079M394N042N664O193O730P176P150O297M867L939M528O386Q157
63041F85691Q877Q691P933O514M762L969N077P176Q242P285N214L646L407M112
63027G70596M819M952M655M287L946L915N126Q207J2077J4713J5538J5793J6291
63014H84915J6343J5813J6556K0164K5181K8507K9326K9971L2755L7350M1737
63003A178618M4731M6915M9513N2794N5729N7418N8710O1552O6438P1505P4921
62992A818844P7149P9677Q2452Q4157Q4466Q4321Q4078Q3224Q2065Q1936Q3081
62981B725450Q3798Q2540P9788P6933P4245P0954O6641O1371N4667M5389L2945
$$ plain form
62970 3454721 3472869 3475657 3464038 3439396 3402642 3354173 3294466 3224518 3145967 3061220 2973407
62959 2973407 2885620 2799868 2717054 2638070 2564477 2498051 2440188 2391900 2353653 2324894 2304543
62948 2304543 2292468 2289706 2296547 2311204 2331436 2356922 2388748 2426694 2468333 2511060 2554004 2597605
62936 2597605 2642178 2687369 2732256 2775328 2814717 2849005 2877782 2901332 2919977 2933623 2941330
62925 2941330 2941126 2930717 2908729 2875016 2829859 2773534 2706923 2631757 2549665 2461463 2368066 2271703
62913 2271703 2175406 2081364 1990377 1902817 1819339 1740497 1666424 1597269 1533434 1474912 1420844
62902 1420844 1370342 1323498 1280985 1242757 1207856 1175578 1146148 1119801 1095702 1072394 1049079
62891 1049079 1025965 1003414 981326 959499 938169 917903 899019 881282 864160 847473 831776
$$ packed form
62970C454721J8148K788j1619k4642l6754m8469n9707o9948p8551q4747q7813
62959B973407q7787q5752q2814p8984p3593o6426n7863m8288l8247k8759k0351
62948B304543j2075k762O841J4657K0232K5486L1826L7946M1639M2727M2944M3601
62936B597605M4573M5191M4887M3072L9389L4288K8777K3550J8645J3646P707
62925B941330k04j0409k1988l3713m5157n6325o6611p5166q2092q8202r3397r6363
62913B271703r6297r4042r0987q7560q3478p8842p4073o9155o3835n8522n4068
62902A420844n0502m6844m2513l8228l4901l2278k9430k6347k4099k3308k3315
62891A049079k3114k2551k2088k1827k1330k0266j8884j7737j7122j6687j5697
$$ plain form
62880 831776 817801 805266 792610 778515 763590 749979 739189 730815 723469 716335 709505 703357
62868 703357 698089 693588 689380 684935 680301 676249 673564 672424 672526 673343 674033 673737 672531 671676 672185 673306
62852 673306 673050 670267 665788 661538 658718 656760 653808 648490 641517 635181 630891 627634 623457 618063
62838 618063 613128 610205 609189 608905 608385 607314 605942 604908 604685 604974 605070 604936 605350 606677 608114 608567
62822 608567 607924 607048 606811 607447 608622 609806 610741 611652 612841 614053 614746 615114 616213 618579 621169 622229
62806 622229 621068 618548 616104 614763 614872 616050 617270 617406 616029 613662 611419 610458 611355 613580 615820
62791 615820 617343 618838 621296 624239 625907 625306 623324 621518 620589 620506 621272 622656 623643 623317 622263 622165
62775 622165 623833 626430 628957 631642 635233 639646 644153 648574 653400 658819 664445 670188 676656 684288
$$ packed form
62880H31776j3975j2535j2656j4095j4925j3611j0790q374p346p134o830o148
62868G03357n268m501m208m445m634m052k685j140J02Q17O90k96j206q55N09J121
62852F73306k56k783m479m250k820j958k952n318o973o336m290l257m177n394
62838F18063m935k923j016k84n20j071j372j034k23K89R6j34M14J327J437M53
62822F08567o43q76k37O36J175J184R35R11J189J212O93L68J099K366K590J060
62806F22229j161k520k444j341J09J178J220J36j377k367k243r61Q97K225K240
62791F15820J523J495K458K943J668o01j982j806r29q3P66J384R87l26j054r8
62775F22165J668K597K527K685L591M413M507M421M826N419N626N743O468P632
$$ plain form
62761 684288 692532 700299 707011 712975 718957 725677 733515 742461 752376 763365 775644 788937 802406
62748 802406 815597 829320 845212 864297 886080 909062 932103 955426 980384 1008163 1038737
62737 1038737 1071194 1105057 1140944 1179991 1223126 1271130 1324850 1384783 1450640 1521769 1597997
62726 1597997 1679766 1767572 1861606 1961915 2068585 2181576 2300265 2422937 2546805 2668972
62716 2668972 2787587 2901716 3009924 3109530 3197495 3271464 3329520 3369733 3390779 3392500 3374973
62705 3374973 3337525 3279970 3204705 3116288 3018594 2913395 2801956 2686781 2570825 2455627
62695 2455627 2341117 2227107 2114603 2005943 1903887 1810005 1723424 1641578 1562710 1487494
62685 1487494 1417893 1354926 1298117 1246659 1200253 1158738 1121586 1088116 1057919 1030776 1006272
$$ packed form
62761F84288Q244P767O712N964N982O720P838Q946R915J0989J2279J3293J3469
62748H02406J3191J3723J5892J9085K1783K2982K3041K3323K4958K7779L0574
62737A038737L2457L3863L5887L9047M3135M8004N3720N9933O5857P1129P6228
62726A597997Q1769Q7806R4034J00309J06670J12991J18689J22672J23868J22167
62716B668972J18615J14129J08208R9606Q7965P3969N8056M0213K1046J721j7527
62705C374973l7448n7555p5265q8417r7694j05199j11439j15175j15956j15198
62695B455627j14510j14010j12504j08660j02056r3882q6581q1846p8868p5216
62685A487494o9601o2967n6809n1458m6406m1515l7152l3470l0197k7143k4504
$$ plain form
62674 1006272 983746 962907 944549 930219 920619 914411 909163 903665 898873 896504 897390 901440 908377
62661 908377 917785 928913 941243 955083 971098 989530 1010601 1035506 1066043 1102856 1144487 1188606
62649 1188606 1234166 1282337 1335536 1395616 1462829 1536315 1615199 1698928 1786782 1877837 1971655
62638 1971655 2068320 2167262 2266549 2363833 2457372 2545356 2624858 2692793 2747878 2790352 2819449
62627 2819449 2832479 2827307 2804837 2767858 2717931 2654784 2578897 2493224 2401490 2305575 2205762
62616 2205762 2103265 2001167 1902366 1807569 1716061 1627803 1543772 1464616 1390101 1320002 1254621
62605 1254621 1194191 1138547 1087620 1041461 999489 960556 924156 890792 860783 833668 809200
62594 809200 787806 769207 751747 734343 718246 705423 695712 686988 677783 668284 659070 650454 643062
$$ packed form
62674A006272k2526k0839j8358j4330r600o208n248n498m792k369Q86M050O937
62661I08377R408J1128J2330J3840J6015J8432K1071K4905L0537L6813M1631M4119
62649A188606M5560M8171N3199O0080O7213P3486P8884Q3729Q7854R1055R3818
62638A971655R6665R8942R9287R7284R3539Q7984P9502O7935N5085M2474K9097
62627B819449J3030n172k2470l6979m9927o3147p5887q5673r1734r5915r9813
62616B205762j02497j02098r8801r4797r1508q8258q4031p9156p4515p0099o5381
62605A254621o0430n5644n0927m6159m1972l8933l6400l3364l0009k7115k4468
62594H09200k1394j8599j7460j7404j6097j2823r711q724r205r499r214q616p392
$$ plain form
62581 643062 637457 632878 627765 621817 616179 611370 606612 601720 598077 596889 597747 599726 602567 605874
62567 605874 608466 609839 611164 613630 616804 619960 623900 629772 636826 643278 649101 656124 665394 676214
62553 676214 688030 701591 717649 735850 755649 777269 801039 826708 854179 884278 918014
62542 918014 955444 995782 1038364 1083148 1130558 1181133 1235056 1291749 1350030 1408526 1465669
62531 1465669 1519535 1568410 1611474 1648364 1678119 1699298 1711091 1713576 1706912 1691286 1667668 1637506
62519 1637506 1601216 1558143 1508703 1455614 1402104 1349461 1297043 1244046 1190566 1137555 1086646
62508 1086646 1039588 996979 957788 920870 886558 856048 829549 805932 783973 763042 742725
62497 742725 722845 704098 687947 675472 666586 660330 655474 650957 646418 642436 639811 638549 637862
$$ packed form
62581F43062n605m579n113n948n638m809m758m892l643j188Q58J979K841L307
62567F05874K592J373J325K466L174L156L940N872P054O452N823P023R270J0820
62553F76214J1816J3561J6058J8201J9799K1620K3770K5669K7471L0099L3736
62542I18014L7430M0338M2582M4784M7410N0575N3923N6693N8281N8496N7143
62531A465669N3866M8875M3064L6890K9755K1179J1793K485o664j5626k3618l0162
62519A637506l6290m3073m9440n3089n3510n2643n2418n2997n3480n3011n0909
62508A086646m7058m2609l9191l6918l4312l0510k6499k3617k1959k0931k0317
62497G42725j9880j8747j6151j2475q886o256m856m517m539l982k625j262o87
$$ plain form
62484 637862 637059 636123 635705 637009 641235 648292 656286 663274 669429 676505 685147 693990 701802 709291 718069
62469 718069 728848 741699 757430 777469 802397 831393 863160 896850 932208 969517 1009564
62458 1009564 1053212 1100716 1151584 1204989 1260024 1315589 1370484 1423824 1475251 1524508 1570713
62447 1570713 1612071 1646440 1672376 1689573 1698240 1698354 1689965 1674024 1652295 1626379 1597357 1566317
62435 1566317 1534342 1501736 1468113 1433775 1400378 1369779 1342997 1320835 1304453 1294176 1288507
62424 1288507 1285735 1286201 1291608 1302247 1316404 1332524 1350398 1369809 1389698 1409540 1430064 1451307
62412 1451307 1471017 1486485 1497267 1504635 1508795 1508312 1502338 1491786 1477857 1460617 1439628 1414893
62400 1414893 1386429 1353803 1317118 1277980 1238496 1199403 1159932 1119497 1078947 1040099 1004477
$$ packed form
62484F37862q03r36m18J304M226P057P994O988O155P076Q642Q843P812P489Q778
62469G18069J0779J2851J5731K0039K4928K8996L1767L3690L5358L7309M0047
62458A009564M3648M7504N0868N3405N5035N5565N4895N3340N1427M9257M6205
62447A570713M1358L4369K5936J7197Q667J14q389j5941k1729k5916k9022l1040
62435A566317l1975l2606l3623l4338l3397l0599k6782k2162j6382j0277n669
62424A288507k772M66N407J0639J4157J6120J7874J9411J9889J9842K0524K1243
62412A451307J9710J5468J0782P368M160m83n974j0552j3929j7240k0989k4735
62400A414893k8464l2626l6685l9138l9484l9093l9471m0435m0550l8848l5622
$$ plain form
62389 1004477 972577 943922 917591 892872 869603 848134 829191 813635 801716 792252 783203 773671
62377 773671 764927 758842 755632 753913 752503 751039 748978 745381 740122 734089 727534 719266 708329 695635
62363 695635 682968 671181 660417 651287 644192 637753 629654 619330 608552 598979 590441 582143 574274
62350 574274 567490 561790 556906 553146 550842 549450 548067 546393 544304 541120 536641 532729 532293 536103
62336 536103 541501 544948 545368 544553 544866 547156 550719 554613 558738 563747 570089 577337 584553 591213 597639
62321 597639 604639 612920 622647 633420 644866 657423 672131 689279 707746 726367 745670 767444
62309 767444 792681 820788 850950 883433 919220 958997 1002751 1049833 1099262 1150817 1206129
62298 1206129 1267768 1336527 1410268 1486148 1563228 1641896 1721250 1798434 1870526 1935842 1993047
$$ packed form
62389A004477l1900k8655k6331k4719k3269k1469j8943j5556j1919r464r049r532
62377G73671q744o085l210j719j410j464k061l597n259o033o555q268j0937j2694
62363F95635j2667j1787j0764r130p095o439q099j0324j0778r573q538q298p869
62350E74274o784n700m884l760k304j392j383j674k089l184m479l912m36L810
62336E36103N398L447M20q15L13K290L563L894M125N009O342P248P216O660O426
62321E97639P000Q281R727J0773J1446J2557J4708J7148J8467J8621J9303K1774
62309G67444K5237K8107L0162L2483L5787L9777M3754M7082M9429N1555N5312
62298A206129O1639O8759P3741P5880P7080P8668P9354P7184P2092O5316N7205
$$ plain form
62287 1993047 2040225 2075738 2099471 2112439 2115362 2108173 2090701 2063246 2026436 1981017 1927973 1868568
62275 1868568 1804108 1735849 1665333 1594717 1526576 1463135 1405397 1352794 1303775 1257199 1213408
62264 1213408 1173812 1139184 1108508 1079849 1052158 1025739 1000863 976603 951619 925764 900203
62253 900203 875957 852909 830477 808678 788071 768933 750933 733584 716757 700832 686624
62242 686624 675104 666788 661159 656813 652346 647109 641214 635129 629590 625693 624478 625999 628990 631848
62228 631848 633934 635634 637381 639274 641775 645944 652359 660245 668402 676754 686333 697870 711107 725428
62214 725428 740422 755705 771052 787090 805244 826534 850848 877724 907337 940244 976567
62203 976567 1016014 1058574 1104791 1155439 1211168 1272234 1338251 1408427 1482259 1559725 1640446
$$ packed form
62287A993047M7178L5513K3733J2968K923p189j7472k7455l6810m5419n3044n9405
62275A868568o4460o8259p0516p0616o8141o3441n7738n2603m9019m6576m3791
62264A213408l9596l4628l0676k8659k7691k6419k4876k4260k4984k5855k5561
62253I00203k4246k3048k2432k1799k0607j9138j8000j7349j6827j5925j4208
62242F86624j1520q316n629m346m467n237n895o085n539l897j215J521K991K858
62228F31848K086J700J747J893K501M169O415P886Q157Q352R579J1537J3237J4321
62214G25428J4994J5283J5347J6038J8154K1290K4314K6876K9613L2907L6323
62203I76567L9447M2560M6217N0648N5729O1066O6017P0176P3832P7466Q0721
$$ plain form
62192 1640446 1722890 1804725 1883607 1957250 2023096 2078661 2122405 2154012 2173889 2182618 2180675 2168212
62180 2168212 2145083 2111320 2067491 2014348 1952411 1882405 1806110 1726303 1645731 1566288 1489157
62169 1489157 1415375 1346046 1281915 1222689 1167028 1113785 1063471 1017919 978052 942467 908859
62158 908859 876478 846477 820055 797084 776672 758336 742316 729063 718588 710113 702489 695311
62146 695311 689368 685466 682984 680301 676718 673252 671408 671771 674001 677520 681789 686420 691566 698018
62132 698018 706581 717344 729578 742281 754979 768248 783182 799936 817158 833568 849798 867641
62120 867641 887529 908032 928195 949030 971884 996374 1021092 1045765 1071616 1099954 1131408
62109 1131408 1166412 1205425 1248628 1296067 1348102 1405077 1466475 1530866 1596479 1661293 1722967
$$ packed form
62192A640446Q2444Q1835P8882P3643O5846N5565M3744L1607J9877Q729j943j2463
62180B168212k3129l3763m3829n3143o1937p0006p6295p9807q0572p9443p7131
62169A489157p3782o9329o4131n9226n5661n3243n0314m5552l9867l5585l3608
62158I08859l2381l0001k6422k2971k0412j8336j6020j3253j0475q475p624p178
62146F95311n943l902k482k683l583l466j844L63K230L519M269M631N146O452
62132F98018Q563J0763J2234J2703J2698J3269J4934J6754J7222J6410J6230J7843
62120H67641J9888K0503K0163K0835K2854K4490K4718K4673K5851K8338L1454
62109A131408L5004L9013M3203M7439N2035N6975O1398O4391O5613O4814O1674
$$ plain form
62098 1722967 1779667 1830892 1876546 1915133 1943987 1961637 1969048 1968068 1959588 1943882 1921765 1894205
62086 1894205 1861199 1822228 1777968 1730666 1682570 1634682 1587296 1541160 1497642 1458025 1422996
62075 1422996 1392608 1366466 1344134 1325551 1310908 1299974 1291799 1285327 1280085 1275962 1272532 1269026
62063 1269026 1264958 1260386 1255518 1250365 1244832 1238844 1232326 1225358 1218351 1211694 1205175 1198156 1190416 1182314
62049 1182314 1173904 1164504 1153639 1142024 1131093 1121818 1114495 1109288 1106228 1104807 1104324 1104783 1106920 1111308
62035 1111308 1117878 1126255 1135927 1146006 1155580 1164584 1173864 1184139 1195457 1207856 1221902 1238124
62023 1238124 1256353 1276005 1296587 1317708 1339188 1361689 1386634 1414779 1445181 1476219 1507404
62012 1507404 1539504 1573143 1608054 1643757 1680202 1717518 1755775 1795309 1836842 1880747 1926252
$$ packed form
62098A722967N6700N1225M5654L8587K8854J7650P411r80q480j5706k2117k7560
62086A894205l3006l8971m4260m7302m8096m7888m7386m6136m3518l9617l5029
62075A422996l0388k6142k2332j8583j4643j0934q175o472n242m123l430l506
62063A269026m068m572m868n153n533n988o518o968p007o657o519p019p740q102
62049A182314q410r400j0865j1615j0931r275p323n207l060j421m83M59K137M388
62035A111308O570Q377R672J0079R574R004R280J0275J1318J2399J4046J6222
62023A238124J8229J9652K0582K1121K1480K2501K4945K8145L0402L1038L1185
62012A507404L2100L3639L4911L5703L6445L7316L8257L9534M1533M3905M5505
$$ plain form
62001 1926252 1971651 2015315 2056422 2094789 2130089 2161214 2186241 2202992 2209814 2206338 2193784 2174233
61989 2174233 2148924 2117160 2077384 2029546 1975939 1919354 1860841 1799710 1735399 1668812 1601945
61978 1601945 1536752 1474450 1415557 1360300 1308792 1260703 1215095 1171220 1129549 1091309 1056799
61967 1056799 1024913 994780 967041 942750 921700 902813 885668 870463 856735 843460 830536
61956 830536 818931 808891 799084 788176 776538 765759 756990 750338 745337 741325 737650 734205 731764
61943 731764 731386 733538 737913 743709 749668 754183 756115 755596 753668 751101 747986 744527 741515 739417 737256
61928 737256 733153 726305 717942 709916 702712 695519 687947 680698 674285 668100 661405 654473 647836 640983
61914 640983 632897 623734 614899 607358 600790 594566 588757 583900 580489 578868 578823 578999 577622 574433 571264
$$ packed form
62001A926252M5399M3664M1107L8367L5300L1125K5027J6751O822l476j2554j9551
61989B174233k5309l1764l9776m7838n3607n6585n8513o1131o4311o6587o6867
61978A601945o5193o2302n8893n5257n1508m8089m5608m3875m1671l8240l4510
61967A056799l1886l0133k7739k4291k1050j8887j7145j5205j3728j3275j2924
61956H30536j1605j0040r807j0908j1638j0779q769o652n001m012l675l445k441
61943G31764l78K152M375N796N959M515J932n19j928k567l115l459l012k098k161
61928G37256m103o848q363q026p204p193p572p249o413o185o695o932o637o853
61914F40983q086r163q835p541o568o224n809m857l411j621m5J76j377l189l169
$$ plain form
61899 571264 570083 570928 572271 572937 573066 573591 575482 579277 584748 591030 597486 604267 611786 620017 628848
61884 628848 638818 650826 665097 680998 697881 715559 733823 752030 769608 786784 804505 823546
61872 823546 843779 864296 884091 902496 919075 933497 945723 956069 964755 971592 976494 980051
61860 980051 983050 985480 986489 985273 981544 975343 967293 959159 953267 950947 951997 955790 962138 970803
61846 970803 981013 991948 1003085 1013673 1022642 1029562 1034840 1038418 1039214 1036677 1032023 1026798 1020838
61833 1020838 1012820 1002293 989863 975714 959447 941544 923770 907731 893785 881504 870353
61822 870353 859739 849185 838750 828734 818960 809004 799095 789961 781779 774154 767248 761944 758513
61809 758513 755968 753191 750058 747115 744847 743686 744050 745898 748746 752609 758442 767262 779218 793838
$$ packed form
61899E71264j181Q45J343O66J29N25J891L795N471O282O456O781P519Q231Q831
61884F28848R970J2008J4271J5901J6883J7678J8264J8207J7578J7176J7721J9041
61872H23546K0233K0517J9795J8405J6579J4422J2226J0346Q686O837M902L557
61860I80051K999K430J009j216l729o201q050q134n892k320J050L793O348Q665
61846I70803J0210J0935J1137J0588Q969O920N278L578P96k537m654n225n960
61833A020838q018j0527j2430j4149j6267j7903j7774j6039j3946j2281j1151
61822H70353j0614j0554j0435j0016r774r956r909r134q182p625o906n304l431
61809G58513k545k777l133k943k268j161L64J848K848L863N833Q820J1956J4620
$$ plain form
61795 793838 810710 829516 849920 871896 895822 921754 948813 975731 1001956 1028011 1054783
61784 1054783 1082458 1110008 1135756 1158557 1178082 1193750 1204085 1208077 1206860 1203009 1198232 1192660
61772 1192660 1186052 1178355 1169131 1158205 1147470 1140477 1139197 1142252 1147062 1152458 1158278 1163808 1168236
61759 1168236 1171692 1174346 1175056 1172298 1165832 1156089 1142531 1124287 1102042 1077579 1051476 1022946 992145
61746 992145 961027 931393 903385 876354 850070 824541 799762 776361 755653 738379 723917
61735 723917 711042 698939 687379 676705 667805 661118 655494 649088 641708 635018 629940 625232 619635
61722 619635 614241 611335 611508 613118 614200 613779 611605 607790 602884 597614 592502 588097 585044 583232 581396
61707 581396 578552 575495 573750 573226 572227 570029 568219 568799 571858 575871 579616 582879 585563 587146 587317
$$ packed form
61795G93838J6872J8806K0404K1976K3926K5932K7059K6918K6225K6055K6772
61784A054783K7675K7550K5748K2801J9525J5668J0335L992j217l851m777n572
61772A192660o608p697r224j0926j0735o993j280L055M810N396N820N530M428
61759A168236L456K654P10k758o466r743j3558j8244k2245k4463k6103k8530l0801
61746I92145l1118k9634k8008k7031k6284k5529k4779k3401k0708j7274j4462
61735G23917j2875j2103j1560j0674q900o687n624o406p380o690n078m708n597
61722F19635n394k906J73J610J082m21k174l815m906n270n112m405l053j812j836
61707E81396k844l057j745n24r99k198j810N80L059M013L745L263K684J583J71
$$ plain form
61692 587317 586595 585741 584631 582128 577419 571386 566206 563413 562636 562464 562060 561348 560053 557614 554355 551870
61676 551870 551564 553118 554995 556342 557807 560403 564039 567447 569303 569131 567355 564917 562888 561957 561970
61661 561970 562296 562947 565009 569344 575003 579748 582332 583649 585340 587987 591066 593879 595690 595577 593326
61646 593326 590309 588343 587489 585961 582543 578128 574311 571233 567674 562829 557102 551208 545302 539244
61632 539244 533249 527937 523795 520777 518431 516499 515279 515149 515707 515794 514686 512937 511615 510921 510038 508302
61616 508302 505920 503469 501249 499464 498508 498453 498384 496963 493976 490988 490017 491540 494031 495444 494950 493261
61600 493261 491679 491104 491695 493049 494674 496600 499460 503450 507220 508567 506907 504574 504699 507855 511640
61585 511640 513767 514569 515861 518267 520803 522695 524196 525458 525831 524909 523331 521753 519737 516652 513215
$$ packed form
61692E87317p22q54j110k503m709o033n180k793p77j72m04p12j295k439l259k485
61676E51870l06J554J877J347J465K596L636L408J856j72j776k438k029r31J3
61661E61970L26O51K062M335N659M745K584J317J691K647L079K813J811j13k251
61646E93326l017j966q54j528l418m415l817l078l559m845n727n894n906o058
61632E39244n995n312m142l018k346j932j220j30N58Q7j108j749j322o94q83j736
61616E08302k382k451k220j785r56n5o9j421k987k988r71J523K491J413m94j689
61600D93261j582n75N91J354J625J926K860L990L770J347j660k333J25L156L785
61585E11640K127Q02J292K406K536J892J501J262L73r22j578j578k016l085l437
$$ plain form
61570 513215 511015 510602 510977 511037 510534 509545 508081 506595 505818 505420 503746 499763 494543 489861 485954 481967
61554 481967 478187 476267 476890 478578 479458 479199 478385 476907 474185 470634 467598 465574 463401 459709 454590
61539 454590 449253 444363 439399 433701 427531 421718 416573 411643 406538 401503 396989 393027 389318 385727
61525 385727 382342 379157 376062 373026 369983 366565 362322 357303 352203 347980 345465 345129 346603 348392
61511 348392 348686 346954 344583 343623 344883 347340 349223 349553 348739 347818 347171 346168 344164 341587 339610 338902
61495 338902 339208 340045 341151 342201 342873 343537 345114 347665 349728 349824 348241 346557 345660 345049 344019 342632
61479 342632 341330 340347 339865 340176 341259 342563 343630 344669 346133 347941 349497 350390 350691 350605 350194 349496
61463 349496 348573 347217 344963 341779 338613 336702 336171 335826 334760 333745 334346 336830 339747 341711 342759
$$ packed form
61570E13215k200m13L75O0n03r89j464j486p77l98j674l983n220m682l907l987
61554D81967l780j920O23J688Q80k59q14j478k722l551l036k024k173l692n119
61539D54590n337m890m964n698o170n813n145m930n105n035m514l962l709l591
61525C85727l385l185l095l036l043l418m243n019n100m223k515l36J474J789
61511C48392K94j732k371r60J260K457J883L30q14r21o47j003k004k577j977p08
61495C38902L06Q37J106J050O72O64J577K551K063R6j583j684q97o11j030j387
61479C42632j302r83m82L11J083J304J067J039J464J808J556Q93L01q6m11o98
61463C49496r23j356k254l184l166j911n31l45j066j015O01K484K917J964J048
$$ plain form
61448 342759 343468 343465 341745 338260 334421 331863 331130 331554 332012 331786 331053 330675 331299 332742 334388 335936 337404
61431 337404 338712 339755 340708 341685 342290 342106 341509 341231 341181 340578 339348 338465 338610 339439 340596 342459 345134
61414 345134 347603 348915 349639 351049 353257 355358 357155 359371 361907 363230 362224 359839 358075 357804 358260
61399 358260 358333 357733 357035 357135 358547 360828 362763 363514 363530 363972 365301 366732 367079 365851 363613 361557 360721
61382 360721 361222 362187 362749 363191 364807 368416 373195 377232 379179 379314 379140 380073 382401 385311 387812 389629
61366 389629 391227 393165 395619 398402 401155 403497 405314 406967 408908 410988 412558 413470 414539 416505
61352 416505 418772 419789 418757 416560 414900 414792 415892 416972 416885 415353 412987 410560 408356 406325 404619
61337 404619 403582 403358 403916 405300 407195 408419 407730 405453 403383 402558 401905 399879 396757 394232 393082
$$ packed form
61448C42759P09lj720l485l839k558p33M24M58k26p33l78O24J443J646J548J468
61431C37404J308J043R53R77O05j84n97k78n0o03j230q83J45Q29J157J863K675
61414C45134K469J312P24J410K208K101J797K216K536J323j006k385j764k71M56
61399C58260P3o00o98J00J412K281J935P51J6M42J329J431L47j228k238k056q36
61382C60721N01R65N62M42J616L609M779M037J947J35j74R33K328K910K501J817
61366C89629J598J938K454K783K753K342J817J653J941K080J570R12J069J966
61352D16505K267J017j032k197j660j08J100J080q7j532k366k427k204k031j706
61337D04619j037k24N58J384J895J224o89k277k070q25o53k026l122k525j150
$$ plain form
61322 393082 392449 391595 391252 392672 396004 400145 403787 406158 407181 407537 408416 410631 413838 416877 418917
61307 418917 420098 421105 422458 424354 426857 429832 432709 434853 436438 438581 442052 446098 449288 451525
61293 451525 454270 458470 463290 467673 472215 478270 485677 492796 498714 504056 509465 514710 519838 525785
61279 525785 532854 539601 544484 548022 552141 557700 563772 569243 573978 578175 581466 583177 583064 581541
61265 581541 579450 577734 577023 577355 578413 579986 582135 585077 589017 593792 598606 602704 606645 612131 619811
61250 619811 627955 634420 639545 645819 654761 665475 676407 687049 697413 707289 716997 727653 739389
61237 739389 750209 758012 763161 767456 770934 771610 768763 764633 761707 759552 755749 749299 741547 733806
61223 733806 725673 716346 706552 697970 691153 685157 679404 674871 672771 672670 672901 672637 672527 673029 673226 672188
$$ packed form
61322C93082o33q54l43J420L332M141L642K371J023L56Q79K215L207L039K040
61307D18917J181J007J353J896K503K975K877K144J585K143L471M046L190K237
61293D51525K745M200M820M383M542O055P407P119N918N342N409N245N128N947
61279E25785P069O747M883L538M119N559O072N471M735M197L291J711j13j523
61265E81541k091j716p11L32J058J573K149K942L940M775M814M098L941N486P680
61250F19811Q144O465N125O274Q942J0714J0932J0642J0364R876R708J0656J1736
61237G39389J0820P803N149M295L478O76k847m130k926k155l803o450p752p741
61223G33806q133r327r794q582o817n996n753m533k100j01K31k64j10N02J97j038
$$ plain form
61207 672188 670821 671111 673577 676626 678791 680585 683394 687327 691287 694956 699502 705884 713159 719076
61193 719076 722096 722518 721990 722385 724926 729629 735203 739741 741965 741962 740724 739096 737331 735645 734803 735663
61177 735663 738124 740890 742654 743260 743383 743253 742327 740315 737979 736636 737191 739882 744400 749823 754860
61162 754860 758906 762773 767792 774260 781337 788435 795950 804440 813718 823157 832438 841618 850795 860044
61148 860044 869376 878476 886836 894494 902311 911097 920689 930253 939255 947784 956261 965301 975572 987237
61134 987237 999641 1012025 1024298 1036518 1047895 1057238 1064450 1070698 1076814 1082351 1086707 1090280 1093568
61121 1093568 1095599 1094426 1089474 1082661 1076817 1073369 1071792 1070786 1069382 1067093 1063678 1059088 1053352 1046290
61107 1046290 1037608 1027555 1017212 1007699 999245 991379 983706 975766 966340 954172 939960 926614 916488
$$ packed form
61207F72188j367K90K466L049K165J794K809L933L960L669M546O382P275N917
61193G19076L020M22n28L95K541M703N574M538K224lj238j628j765j686q42Q60
61177G35663K461K766J764O06J23j30r26k012k336j343N55K691M518N423N037
61162G54860M046L867N019O468P077P098P515Q490R278R439R281R180R177R249
61148H60044R332R100Q360P658P817Q786R592R564R002Q529Q477R040J0271J1665
61134I87237J2404J2384J2273J2220J1377R343P212O248O116N537M356L573L288
61121A093568K031j173m952o813n844l448j577j006j404k289l415m590n736p062
61107A046290q682j0053j0343r513q454p866p673p940r426j2168j4212j3346j0126
$$ plain form
61094 916488 908821 900890 891271 880918 871298 862846 855489 849357 844228 839076 832908 825546 817168 807755
61080 807755 797578 787621 778707 770633 762851 755655 749925 746020 743665 742746 743396 745353 748124 751950
61066 751950 757852 766391 776843 787906 798899 810078 822155 835737 851044 868049 886993 908610
61054 908610 933410 960685 988601 1015452 1040763 1065382 1090810 1118129 1146880 1175026 1200604
61043 1200604 1223478 1244882 1265360 1284139 1300605 1315160 1327902 1337574 1342991 1344893 1345083 1343951
61031 1343951 1340129 1332700 1322554 1311134 1298813 1285218 1270419 1254977 1239043 1222144 1203901 1184570
61019 1184570 1164940 1146009 1128617 1113053 1098952 1085857 1073873 1063638 1055687 1050047 1046421 1044568
61007 1044568 1044477 1046273 1049900 1054865 1060507 1066729 1074337 1084341 1097002 1111863 1128734 1148180 1170930
$$ packed form
61094I16488p667p931r619j0353r620q452p357o132n129n152o168p362q378r413
61080H07755j0177r957q914q074p782p196n730l905k355r19O50J957K771L826
61066G51950N902Q539J0452J1063J0993J1179J2077J3582J5307J7005J8944K1617
61054I08610K4800K7275K7916K6851K5311K4619K5428K7319K8751K8146K5578
61043A200604K2874K1404K0478J8779J6466J4555J2742R672N417J902J90j132
61031A343951l822p429j0146j1420j2321j3595j4799j5442j5934j6899j8243j9331
61019A184570j9630j8931j7392j5564j4101j3095j1984j0235p951n640l626j853
61007A044568r1J796L627M965N642O222P608J0004J2661J4861J6871J9446K2750
$$ plain form
60994 1170930 1197090 1226212 1257862 1291835 1327994 1366360 1407487 1452438 1502156 1556868 1616245
60983 1616245 1680168 1749221 1824196 1905035 1990466 2079138 2171231 2268618 2373139 2485019 2603510
60972 2603510 2728981 2863750 3010595 3171077 3346054 3537932 3751806 3993991 4269377
60963 4269377 4580446 4928983 5318535 5754775 6243569 6790035 7401214 8089863 8874114
60954 8874114 9772692 10801536 11973998 13297159 14757996 16309425 17874880 19372564
60946 19372564 20735817 21911142 22848514 23513084 23916495 24128843 24244290 24325208 24374899
60937 24374899 24354713 24213994 23900575 23358096 22536861 21422443 20056661 18528679 16942470
60928 16942470 15384880 13911079 12546999 11299640 10167213 9145323 8228875 7411780
$$ packed form
60994A170930K6160K9122L1650L3973L6159L8366M1127M4951M9718N4712N9377
60983A616245O3923O9053P4975Q0839Q5431Q8672R2093R7387J04521J11880J18491
60972B603510J25471J34769J46845J60482J74977J91878K13874K42185K75386
60963D269377L11069L48537L89552M36240M88794N46466O11179O88649P84251
60954H874114Q98578J028844J172462J323161J460837J551429J565455J497684
60946A9372564J363253J175325R37372O64570M03411K12348J15447Q0918M9691
60937B4374899k0186j40719l13419n42479q21235j114418j365782j527982j586209
60928A6942470j557590j473801j364080j247359j132427j021890r16448q17095
$$ plain form
60920 7411780 6686899 6046821 5484507 4992992 4564659 4191050 3863676 3575249 3320261
60911 3320261 3094412 2893567 2713451 2550482 2402779 2270026 2151906 2046494 1950387 1860701
60901 1860701 1776793 1699579 1629221 1563983 1501544 1441001 1383385 1330600 1284085 1243882 1208413
60890 1208413 1175357 1143254 1112254 1083270 1056886 1033332 1012733 994625 977724 961106 945380
60879 945380 931713 919810 907856 894592 880570 867161 855026 843824 832619 820295 806335
60868 806335 791595 777688 765246 753442 741596 730463 721282 714139 707972 701810 695399 688914 682669
60855 682669 676898 671379 665541 659349 653741 649668 647009 644983 643287 642056 640908 638916 635833 632796
60841 632796 631273 631438 631836 630865 628572 626737 626907 628583 629876 629806 629133 628853 628937 629016 629327 630174 631196 632083
$$ packed form
60920G411780p24881o40078n62314m91515m28333l73609l27374k88427k54988
60911C320261k25849k00845j80116j62969j47703j32753j18120j05412r6107q9686
60901A860701q3908p7214p0358o5238o2439o0543n7616n2785m6515m0203l5469
60890A208413l3056l2103l1000k8984k6384k3554k0599j8108j6901j6618j5726
60879I45380j3667j1903j1954j3264j4022j3409j2135j1202j1205j2324j3960
60868H06335j4740j3907j2442j1804j1846j1133r181p143o167o162o411o485o245
60855F82669n771n519n838o192n608m073k659k026j696j231j148j992l083l037
60841F32796j523J65L98r71k293j835J70J676J293p0o73k80Q4P9L11Q47J022Q87
$$ plain form
60823 632083 633334 635292 636917 636770 635041 633507 633439 634442 635388 635743 636057 637790 642389 649626 657214 663204
60807 663204 668481 675517 684790 694121 701764 708346 715076 721823 728191 735053 743494 753166 763113 773443
60793 773443 784659 795896 805574 813668 821792 830932 840514 849973 859849 870695 882048 893256 904517
60780 904517 916258 928161 939617 950750 962045 973113 982668 990057 996298 1003228 1011728 1021064 1029917
60767 1029917 1037864 1045598 1053771 1061889 1068512 1072364 1073092 1071173 1067423 1062559 1056899 1050435 1043294 1035904
60753 1035904 1028402 1020029 1009711 997299 983791 970227 956784 943175 929438 915903 902651 889462
60741 889462 876224 863028 849877 836553 822866 808885 794958 781642 769547 759021 749818 741135
60729 741135 732153 722721 713610 705909 699987 695072 690033 684463 678793 673457 668510 664058 660442 657661
$$ packed form
60823F32083J251J958J625j47j729j534o8J003R46L55L14J733M599P237P588N990
60807F63204N277P036R273R331P643O582O730O747O368O862Q441R672R947J0330
60793G73443J1216J1237R678Q094Q124R140R582R459R876J0846J1353J1208J1261
60780I04517J1741J1903J1456J1133J1295J1068R555P389O241O930Q500R336Q853
60767A029917P947P734Q173Q118O623L852P28j919l750m864n660o464p141p390
60753A035904p502q373j0318j2412j3508j3564j3443j3609j3737j3535j3252j3189
60741H89462j3238j3196j3151j3324j3687j3981j3927j3316j2095j0526r203q683
60729G41135q982r432r111p701n922m915n039n570n670n336m947m452l616k781
$$ plain form
60715 657661 655165 652684 650807 650036 649567 647875 644498 640517 637032 633900 630234 625524 619762 612995 605402
60700 605402 597620 590461 584320 579107 574515 570032 564957 558924 552374 546139 540647 535796 531521 528172
60686 528172 526369 526563 528417 530435 530739 528685 525249 521393 516796 511027 505174 500870 497998 494919 490986
60671 490986 487260 484405 481538 477907 474228 471412 469192 467124 465698 465262 464933 463968 463173 463389 463600 462414
60655 462414 460712 460528 461542 461025 457610 453075 449729 447813 446209 444020 440553 435322 429182 424189 421221
60640 421221 418933 416107 413808 413771 415634 417321 417506 416268 413830 410346 406836 404839 404811 405757 406609 407078
60624 407078 407134 406578 405527 404731 404979 406327 408004 409063 409348 409847 411637 414354 416423 417064 417233 418190 420132
60607 420132 422871 426681 431436 435992 439737 443765 448981 453927 456370 456586 457037 459048 461898 465236 469990
$$ packed form
60715F57661k496k481j877p71m69j692l377l981l485l132l666m710n762o767p593
60700F05402p782p159o141n213m592m483n075o033o550o235n492m851m275l349
60686E28172j803J94J854K018L04k054l436l856m597n769n853m304k872l079l933
60671D90986l726k855k867l631l679k816k220k068j426m36l29r65p95K16K11j186
60655D62414j702j84J014n17l415m535l346j916j604k189l467n231o140m993k968
60640D21221k288k826k299l7J863J687J85j238k438l484l510j997k8R46Q52M69
60624D07078N6n56j051p96K48J348J677J059K85M99J790K717K069O41J69R57J942
60607D20132K739L810M755M556L745M028N216M946K443K16M51K011K850L338M754
$$ plain form
60592 469990 476166 481837 485491 487867 490418 493369 496398 499866 503956 507549 509385 509673 509433 508935 507943
60577 507943 506802 505910 504451 501041 495646 489819 484968 481150 477560 473475 468707 463752 459587 456872
60563 456872 455438 454813 454877 455456 455684 454503 451717 448121 444744 442322 441137 440915 441147 441760 442841 443446
60547 443446 441794 437662 433717 433059 435862 439695 442781 445400 448154 450644 452447 454083 456138 458281
60533 458281 459833 460634 460812 460336 459334 458233 457052 455153 452344 449740 448860 450130 452839 456307 460524
60518 460524 465792 472221 479586 487363 494998 502458 510463 519870 530776 542258 552965 562001 569384
60505 569384 575651 580846 584041 584234 581762 578432 576047 574971 574102 572110 568809 565580 564295 565561 568379
60490 568379 571867 576652 583677 592190 600359 607709 615328 623521 631106 637788 645327 654875 664605 671853
$$ packed form
60592D69990O176N671L654K376K551K951L029L468M090L593J836K88k40m98r92
60577E07943j141q92j459l410n395n827m851l818l590m085m768m955m165k715
60563D56872j434o25O4N79K28j181k786l596l377k422j185k22K32O13J081O05
60547D43446j652m132l945o58K803L833L086K619K754K490J803J636K055K143
60533D58281J552Q01J78m76j002j101j181j899k809k604q80J270K709L468M217
60518D60524N268O429P365P777P635P460Q005R407J0906J1482J0707R036P383
60505E69384O267N195L195J93k472l330k385j076q69j992l301l229j285J266K818
60490E68379L488M785P025Q513Q169P350P619Q193P585O682P539R548R730P248
$$ plain form
60476 671853 676553 680517 683918 684963 683135 680475 678812 677642 675862 674066 673620 674395 674917 674319 672925
60461 672925 671233 669543 668508 668856 670355 671987 673478 675962 680740 687909 696590 706096 716505 728417
60447 728417 742618 759791 780105 803016 827814 854453 883608 915648 949650 983765 1016660
60436 1016660 1048305 1078899 1107128 1130067 1145131 1151726 1150653 1142367 1126574 1103381 1073921 1039541
60424 1039541 1001123 959772 917574 876850 838791 803404 770615 740656 713393 688136 664497
60413 664497 642841 623544 606434 591375 578743 568629 560011 551595 543225 535708 529402 523793 518366
60400 518366 512994 507373 501161 494963 490234 487624 486132 484329 481636 477900 472745 466308 459902 454856
60386 454856 451145 448164 446178 445646 445465 443570 439596 435586 433608 433766 435000 436632 438382 439803 440668
$$ packed form
60476F71853M700L964L401J045j828k660j663j170j780j796m46P75N22n98j394
60461F72925j692j690j035L48J499J632J491K484M778P169Q681R506J0409J1912
60447G28417J4201J7173K0314K2911K4798K6639K9155L2040L4002L4115L2895
60436A016660L1645L0594K8229K2939J5064O595j073q286j5793k3193k9460l4380
60424A039541l8418m1351m2198m0724l8059l5387l2789k9959k7263k5257k3639
60413F64497k1656j9297j7110j5059j2632j0114q618q416q370p517o306n609n427
60400E18366n372n621o212o198m729k610j492j803k693l736n155o437o406n046
60386D54856l711k981j986n32j81j895l974m010j978J58J234J632J750J421Q65
$$ plain form
60371 440668 441337 442069 442445 442093 441403 440945 440700 440439 440311 440508 441005 442223 445144 449873 454816 458379 460863
60354 460863 463457 465854 466439 464824 462742 462012 462649 463343 462904 461049 458660 457531 458953 462258 465536
60339 465536 467859 469809 471809 473422 474802 477300 481611 486486 490416 493599 497009 500402 502745 504054
60325 504054 505245 506433 506904 506762 507205 508871 511199 513698 516684 520243 523603 526217 528667 531712 535141
60310 535141 538256 541048 544118 547686 551245 554097 555872 556824 557959 560541 564935 570098 574561 577848
60296 577848 580726 584355 589588 596743 605412 614418 622387 628664 633642 638199 642883 647528 651446 653908
60282 653908 654403 652484 647827 640958 633779 628527 625771 623949 621287 617700 614233 611162 607641 603204
60268 603204 598725 595416 593367 591582 589285 586841 585333 585413 586704 588417 590578 594415 601291 611297
$$ packed form
60371D40668O69P32L76l52o90m58k45k61j28J97M97J218K921M729M943L563K484
60354D60863K594K397N85j615k082p30O37O94m39j855k389j129J422L305L278
60339D65536K323J950K000J613J380K498M311M875L930L183L410L393K343J309
60325E04054J191J188M71j42M43J666K328K499K986L559L360K614K450L045L429
60310E35141L115K792L070L568L559K852J775R52J135K582M394N163M463L287
60296E77848K878L629N233P155Q669R006P969O277M978M557M684M645L918K462
60282F53908M95j919m657o869p179n252k756j822k662l587l467l071l521m437
60268F03204m479l309k049j785k297k444j508Q0J291J713K161L837O876J0006
$$ plain form
60254 611297 623029 634741 645681 656480 668459 682474 698266 714986 732462 751523 772640
60243 772640 794373 813667 827859 836166 839295 838109 832921 823716 810728 794835 777505 760241
60231 760241 743901 728576 714120 700585 688082 676364 664801 652862 640785 629758 621195 615539
60219 615539 611850 608868 606374 605158 605745 607590 609506 610354 609329 606419 603020 601307 602134 603889 604207
60204 604207 602553 600217 597956 595041 591123 587793 587000 588411 589643 589249 588341 588776 590611 592179 592256 591223
60188 591223 590079 589119 587986 586609 585542 585431 586499 588645 591839 596131 601224 606239 610227 612911 614722
60173 614722 616074 616924 617202 617218 617294 617434 617872 619501 622860 626851 629511 630335 630816 632343 634622 636896 639625
60156 639625 643706 648627 652834 655833 658601 661819 665032 668048 671975 677976 685624 693307 699892 705347
$$ packed form
60254F11297J1732J1712J0940J0799J1979J4015J5792J6720J7476J9061K1117
60243G72640K1733J9294J4192Q307L129j186n188r205j2988j5893j7330j7264
60231G60241j6340j5325j4456j3535j2503j1718j1563j1939j2077j1027q563n656
60219F15539l689k982k494j216N87J845J916Q48j025k910l399j713Q27J755L18
60204F04207j654k336k261k915l918l330p93J411J232l94r08M35J835J568P7j033
60188E91223j144r60j133j377j067j11J068K146L194M292N093N015L988K684J811
60173F14722J352Q50K78J6P6J40M38J629L359L991K660Q24M81J527K279K274K729
60156F39625M081M921M207K999K768L218L213L016L927O001P648P683O585N455
$$ plain form
60142 705347 710040 714170 717887 721476 725278 729563 734426 739741 745254 750696 755578 759120 760951 761850
60128 761850 763085 764924 766499 767325 768026 769115 770005 769918 768950 767360 764594 760213 755207 751048 747587 743257
60112 743257 737446 731524 727184 724789 723669 723096 722530 721619 720423 719094 717156 713797 709019 703741 698615
60097 698615 693715 689584 687414 687570 689053 691088 694145 698424 702495 704759 705553 706416 707899 709578 711716
60082 711716 715154 719551 723491 726646 730298 735148 740000 743454 745752 748099 751114 754837 759341 764197
60068 764197 767953 769301 768508 766854 764992 762706 760007 757491 755786 755405 756883 759996 762956 763531 761312
60053 761312 758050 755479 753675 751858 749901 748316 747334 746614 745601 743804 741224 738912 738493 740509 743710
60038 743710 746625 749273 752401 755447 756593 755011 751957 749200 747282 745857 744823 744187 743358 741658 739443
$$ packed form
60142G05347M693M130L717L589L802M285M863N315N513N442M882L542J831Q99
60128G61850J235J839J575Q26P01J089Q90q7r68j590k766m381n006m159l461m330
60112G43257n811n922m340k395j120n73n66r11j196j329j938l359m778n278n126
60097F98615m900m131k170J56J483K035L057M279M071K264P94Q63J483J679K138
60082G11716L438M397L940L155L652M850M852L454K298K347L015L723M504M856
60068G64197L756J348p93j654j862k286k699k516j705l81J478L113K960N75k219
60053G61312l262k571j804j817j957j585r82p20j013j797k580k312m19K016L201
60038G43710K915K648L128L046J146j582l054k757j918j425j034o36q29j700k215
$$ plain form
60023 739443 737833 737216 736705 735274 732909 730440 728745 728241 728620 728742 727326 724145 720253 716688 713327
60008 713327 709375 704559 699181 693276 686452 678591 670130 661534 653029 645002 638088 632548 627941 623721
59994 623721 619874 616683 614103 611707 609102 606121 602760 599228 596010 593642 592404 592273 593102 594712 596967
59979 596967 599825 603178 606617 609576 611826 613592 615066 616170 617000 618160 620241 623090 625834 627447
59965 627447 627108 624459 620006 615028 610563 606502 602043 596808 591046 585000 578847 573290 569380 567299
59951 567299 565815 563377 559567 555263 551599 548938 546659 543803 540096 536258 532984 529837 525827 521193
59937 521193 517706 516715 517476 518126 517877 517564 518208 519816 521677 523341 525107 527726 531572 535948 539464 541359
59921 541359 542205 542938 543596 543613 543032 542582 542534 542336 541719 541498 542793 545737 549259 551909 552815 552169 551010 550246
$$ packed form
60023G39443j610o17n11j431k365k469j695n04L79J22j416l181l892l565l361
60008G13327l952m816n378n905o824p861q461q596q505q027o914n540m607m220
59994F23721l847l191k580k396k605k981l361l532l218k368j238j31Q29J610K255
59979E96967K858L353L439K959K250J766J474J104Q30J160K081K849K744J613
59965F27447l39k649m453m978m465m061m459n235n762o046o153n557l910k081
59951E67299j484k438l810m304l664k661k279k856l707l838l274l147m010m634
59937E21193l487r91P61O50k49l13O44J608J861J664J766K619L846M376L516J895
59921E41359Q46P33O58J7n81m50m8j98o17k21J295K944L522K650R06o46j159p64
$$ plain form
59903 550246 549852 549405 549310 550687 553687 556675 557846 557287 556803 557935 560751 564217 566941 567679 566126 563517
59887 563517 561764 561521 561526 560153 557210 553922 551508 550214 549472 548597 547372 546121 545125 543979 541960 539133
59871 539133 536536 534962 534163 533743 534144 535792 537720 538290 537268 536098 535870 536140 536215 536462 537570 539422
59855 539422 541752 545167 550289 556278 561515 565747 570325 576131 582454 588286 593659 599072 604484 609620
59841 609620 614653 619769 624474 628074 630529 632225 633250 633536 633393 633207 632831 631990 631076 630771 631097 631683
59825 631683 632892 635554 639377 642713 644512 645670 647742 651070 654975 659232 664074 668955 672615 674844
59811 674844 677109 680523 683816 684581 682556 680431 680741 682905 684562 685408 688003 694195 702160 708269 711088
59796 711088 712082 712767 713014 712535 712264 713054 713999 713386 710884 707677 704656 701497 697463 692173 685466 677390
$$ packed form
59903E50246l94m47r5J377L000K988J171n59m84J132K816L466K724P38j553k609
59887E63517j753k43Nj373k943l288k414j294p42q75j225j251r96j146k019k827
59871E39133k597j574p99m20M01J648J928N70j022j170k28K70P5K47J108J852
59855E39422K330L415N122N989N237M232M578N806O323N832N373N413N412N136
59841F09620N033N116M705L600K455J696J025K86j43j86l76q41r14l05L26N86
59825F31683J209K662L823L336J799J158K072L328L905M257M842M881L660K229
59811F74844K265L414L293P65k025k125L10K164J657Q46K595O192P965O109K819
59796G11088R94O85K47m79k71P90R45o13k502l207l021l159m034n290o707q076
$$ plain form
59780 677390 668573 659927 651747 643662 635584 628005 621117 614412 607598 601336 596571 593594 592218 592212 592890
59765 592890 592811 590889 587691 584842 583202 582378 581914 581958 582433 582443 581137 578673 575924 573727 572834 573879 576649
59748 576649 579714 581499 581611 580669 579306 578061 577720 578510 579022 577224 572916 568118 564572 561964 559317
59733 559317 556892 555475 554520 552554 549234 545683 542743 540182 537852 536332 535792 535239 533785 531999 531120
59718 531120 531316 531571 531128 530295 529674 529149 527970 525840 523821 523893 527113 532227 536713 539381 541306 543964
59702 543964 547394 550879 554468 558607 562720 565599 567217 568956 571760 575175 578583 582302 586797 591775
59688 591775 596877 602552 609160 615714 620653 623825 626670 630347 634535 638392 641850 645357 648891 651987
59674 651987 654607 657315 660468 663614 665914 666963 667046 666757 666594 666762 667079 667002 666096 664621 663436 663053 662999
$$ packed form
59780F77390q817q646q180q085q078p579o888o705o814o262m765k977j376oO78
59765E92890p9j922l198k849j640q24m64M4M75J0j306k464k749k197q93J045K770
59748E76649L065J785J12r42j363j245l41P90N12j798m308m798l546k608k647
59733E59317k425j417r55j966l320l551k940k561k330j520n40n53j454j786q79
59718E31120J96K55m43q33o21n25j179k130k019P2L220N114M486K668J925K658
59702E43964L430L485L589M139M113K879J618J739K804L415L408L719M495M978
59688E91775N102N675O608O554M939L172K845L677M188L857L458L507L534L096
59674F51987K620K708L153L146K300J049Q3k89j63J68L17p7r06j475j185l83n4
$$ plain form
59657 662999 662434 661189 659719 658161 656123 653563 651174 649495 648218 646983 646307 646862 648024 648172 646705
59642 646705 644972 644664 645763 646618 645877 643892 642230 642063 643083 643911 643583 642552 642048 642551 643311 643375 642509
59625 642509 640922 638664 635909 633387 631871 631251 630681 629570 627967 626039 623800 621489 619644 618384 617001
59610 617001 614720 611710 608980 607201 605905 604039 601336 598916 598223 599275 600344 599638 597047 593902 591454
59595 591454 590199 590340 591913 594344 596756 599014 601742 605021 607927 609789 610974 611758 611422 609551 607444
59580 607444 606845 607600 608014 607446 607048 607621 608214 607591 605963 604414 603455 603119 603770 605655 607905 609009 608436
59563 608436 607099 606179 605951 605749 604674 602298 599050 595918 593507 591578 589730 588163 587240 586606 585526
59548 585526 584058 583179 583605 585100 587176 589884 593467 597607 601476 604480 606724 608755 610796 612074 611094
$$ packed form
59657F62999n65j245j470j558k038k560k389j679j277j235o76N55J162J48j467
59642F46705j733l08J099Q55p41j985j662j67J020Q28l28j031n04N03P60O4q66
59625F42509j587k258k755k522j516o20n70j111j603j928k239k311j845j260j383
59610F17001k281l010k730j779j296j866k703k420o93J052J069p06k591l145k448
59595E91454j255J41J573K431K412K258K728L279K906J862J185P84l36j871k107
59580F07444n99P55M14n68l98N73N93o23j628j549r59l36O51J885K250J104n73
59563F08436j337r20k28k02j075k376l248l132k411j929j848j567r23o34j080
59548E85526j468q79M26J495K076K708L583M140L869L004K244K031K041J278r80
$$ plain form
59533 611094 607125 601610 597564 597062 599421 602099 603239 603092 603164 604381 606184 607102 606090 603406 600369
59518 600369 598266 597426 597181 596579 595111 592954 590755 589260 589013 590181 592484 595291 597952 600115 601730
59503 601730 602797 603192 602688 601043 598279 595245 593750 595418 600108 605976 611399 616364 621600 627125 632464
59488 632464 637842 644087 651413 659151 666728 674237 682234 691929 705291 723437 744444 764077 779449
59475 779449 790914 799683 805042 805421 801219 794707 787390 779227 770503 762700 756844 752281 747917 743733
59461 743733 740305 737667 735540 734102 733657 733945 734441 734883 734684 732423 727123 719991 713760 709994 707909
59446 707909 706007 703810 701377 698135 693388 687677 682549 678860 676017 673055 669674 665922 661600 656654
59432 656654 651831 648303 646665 646654 647699 649289 650949 652364 653631 655023 656519 657997 659848 662739 666553
$$ packed form
59533F11094l969n515m046n02K359K678J140j47P2J217J803R18j012k684l037
59518F00369k103q40k45o02j468k157k199j495k47J168K303K807K661K163J615
59503F01730J067L95n04j645k764l034j495J668M690N868N423M965N236N525N339
59488F32464N378O245P326P738P577P509P997R695J3362J8146K1007J9633J5372
59475G79449J1465Q769N359L79m202o512p317q163q724p803n856m563m364m184
59461G43733l428k638k127j438m45K88M96M42j99k261n300p132o231l766k085
59446G07909j902k197k433l242m747n711n128l689k843k962l381l752m322m946
59432F56654m823l528j638j1J045J590J660J415J267J392J496J478J851K891L814
$$ plain form
59417 666553 670202 672920 675235 678163 681890 685931 690259 695416 701459 707504 712544 716216 718584 719764
59403 719764 720154 720684 722249 724895 727803 730126 731747 733266 735414 738549 742722 748035 754564 761853 768960
59388 768960 775451 781996 789367 797014 803412 807894 811339 814752 817827 819423 818913 816584 813120 809162
59374 809162 805053 800518 795049 789076 784294 782113 782116 782840 783731 785391 788087 791310 795157 801048 810336
59359 810336 822779 836981 851922 867734 885522 906909 933054 963216 994459 1023420 1048226
59348 1048226 1068267 1082629 1089907 1089695 1083499 1073904 1063404 1054133 1047827 1045147 1045106 1045619 1044666 1040727
59334 1040727 1032294 1017581 995397 966619 934662 903832 876675 852877 830878 810210 791855
59323 791855 776734 764668 754901 746900 740251 734416 729093 724521 721011 718420 716388 714827 713863 713533
$$ packed form
59417F66553L649K718K315K928L727M041M328N157O043O045N040L672K368J180
59403G19764L90N30J565K646K908K323J621J519K148L135M173N313O529P289P107
59388G68960O491O545P371P647O398M482L445L413L075J596n10k329l464l958
59374H09162m109m535n469n973m782k181LP24Q91J660K696L223L847N891R288
59359H10336J2443J4202J4941J5812J7788K1387K6145L0162L1243K8961K4806
59348A048226K0041J4362P278k12o196r595j0500r271o306k680m1N13r53l939
59334A040727q433j4713k2184k8778l1957l0830k7157k3798k1999k0668j8355
59323G91855j5121j2066r767q001o649n835n323m572l510k591k032j561r64l30
$$ plain form
59309 713533 713781 714428 714939 714704 713956 713937 715581 718391 721274 724141 727815 732502 737273 741344 745153 749840
59293 749840 756089 763717 772036 780418 788849 797959 808097 818457 827722 835710 843719 853034 863707
59280 863707 875022 886386 897296 907102 915569 923204 930454 936913 941906 945360 947443 947771 945825 941979
59266 941979 937284 932284 926794 920794 914826 909418 904751 900982 898299 896627 895902 896633 899551 904588 910768
59251 910768 917034 922405 925439 924785 920689 914883 908343 900154 889400 877194 865689 855669 846324
59238 846324 837058 828177 819932 812177 805212 799773 795832 792518 789734 788677 789879 791709 792146 791515 791957
59223 791957 794177 796221 796132 794630 794036 795188 796789 797878 799657 804101 811364 819390 826030 831000 835761
59208 835761 841889 849685 858065 865644 872036 878115 884916 892395 899340 904263 906239 905362 902970 901150
$$ packed form
59309G13533K48O47N11k35p48j9J644K810K883K867L674M687M771M071L809M687
59293G49840O249P628Q319Q382Q431R110J0138J0360R265P988Q009R315J0673
59280H63707J1315J1364J0910R806Q467P635P250O459M993L454K083L28j946l846
59266I41979m695n000n490o000n968n408m667l769k683j672p25P31K918N037O180
59251I10768O266N371L034o54m096n806o540q189j0754j2206j1505j0020r345
59238H46324r266q881q245p755o965n439l941l314k784j057J202J830M37o31M42
59223G91957K220K044q9j502n94J152J601J089J779M444P263Q026O640M970M761
59208H35761O128P796Q380P579O392O079O801P479O945M923J976q77k392j820
$$ plain form
59194 901150 901194 902411 902988 901989 899837 896977 893218 888757 884703 881818 879614 877579 876437 876986 878286
59179 878286 878434 876954 875060 873629 872388 871430 871903 874309 877261 879083 879873 880873 882269 882856 881831
59164 881831 879796 877722 875771 873584 871180 868872 866433 862941 857836 851937 846932 843707 841574 839439
59150 839439 837227 835536 834336 833078 832011 832132 833427 834360 833852 832732 832236 832058 831235 830350 831191 834289
59134 834289 838281 841893 845174 848320 850669 851726 852285 853590 855938 858809 861878 865202 868842 872860
59120 872860 877262 881390 884084 885267 886799 890655 896509 902206 906489 910061 913958 918231 922726 927888
59106 927888 933896 939920 945196 950157 955463 960562 964547 968048 972711 978622 983861 987196 989730 992674
59092 992674 994762 993660 989429 984687 981105 977480 972086 965443 959417 954411 949020 942393 935488 929609
$$ packed form
59194I01150M4J217N77r99k152k860l759m461m054k885k204k035j142N49J300
59179H78286J48j480j894j431j241r58M73K406K952J822P90J000J396N87j025
59164H81831k035k074j951k187k404k308k439l492n105n899n005l225k133k135
59150H39439k212j691j200j258j067J21J295R33n08j120m96j78q23q85Q41L098
59134H34289L992L612L281L146K349J057N59J305K348K871L069L324L640M018
59120H72860M402M128K694J183J532L856N854N697M283L572L897M273M495N162
59106I27888O008O024N276M961N306N099L985L501M663N911N239L335K534K944
59092I92674K088j102m231m742l582l625n394o643o026n006n391o627o905n879
$$ plain form
59078 929609 924707 919815 914638 909980 906678 904614 902928 901013 899092 897727 896904 895947 894524 893375 893637
59063 893637 895592 898586 902060 906211 911584 918457 926624 935333 943387 949989 955691 962015 969850 978677
59049 978677 987598 996405 1005135 1013209 1019858 1025219 1030325 1036027 1042410 1049081 1055434 1060700 1064385 1066717
59035 1066717 1068223 1068963 1068809 1068410 1069015 1070958 1073022 1073811 1073269 1072325 1071446 1070241 1068314 1065770 1062804 1059282
59019 1059282 1054965 1049766 1043535 1035879 1026548 1015977 1005182 995064 985885 977367 969132 960955 952770
59006 952770 944726 937234 930677 924965 919576 914177 908906 903824 898436 892309 885983 880613 876607 873276
58992 873276 870153 868046 868180 870606 873971 876740 878140 878057 876701 874689 873119 873158 875349 879164 883259
58977 883259 886566 889489 893727 900420 908580 915865 920854 924114 927217 931521 938041 947445 959295 971732
$$ packed form
59078I29609m902m892n177m658l302k064j686j915j921j365q23r57j423j149K62
59063H93637J955K994L474M151N373O873Q167Q709Q054O602N702O324P835Q827
59049I78677Q921Q807Q730Q074O649N361N106N702O383O671O353N266L685K332
59035A066717J506P40j54l99O05J943K064P89n42r44q79j205j927k544k966l522
59019A059282m317n199o231p656r331j0571j0795j0118r179q518q235q177q185
59006I52770q044p492o557n712n389n399n271n082n388o127o326n370m006l331
58992H73276l123k107J34K426L365K769J400q3j356k012j570L9K191L815M095
58977H83259L307K923M238O693Q160P285M989L260L103M304O520R404J1850J2437
$$ plain form
58963 971732 982834 992465 1002397 1014513 1029056 1044536 1059110 1072205 1084971 1098927 1113949 1127986
58951 1127986 1139123 1147561 1154977 1162216 1168537 1173189 1176822 1180811 1185644 1190597 1194791 1198164 1201425 1205432
58937 1205432 1210711 1217371 1225172 1233507 1241480 1248572 1255504 1263944 1274582 1285664 1294282 1299438 1303293
58924 1303293 1309039 1317987 1329067 1340746 1352772 1366039 1381096 1397136 1412738 1427703 1443644 1462215
58912 1462215 1483179 1505139 1527959 1553051 1580912 1609740 1637417 1663801 1689951 1715930 1740892
58901 1740892 1764956 1789446 1815017 1840675 1864982 1887396 1908155 1927522 1945490 1961742 1975701
58890 1975701 1987014 1996046 2003576 2010071 2015581 2019989 2022896 2023761 2022918 2021891 2021682 2021071 2017839 2011422 2003001
58875 2003001 1993113 1980856 1965758 1948776 1930818 1911730 1891484 1871012 1850995 1831103 1811429
$$ packed form
58963I71732J1102R631R932J2116J4543J5480J4574J3095J2766J3956J5022J4037
58951A127986J1137Q438P416P239O321M652L633L989M833M953M194L373L261M007
58937A205432N279O660P801Q335P973P092O932Q440J0638J1082Q618N156L855
58924A303293N746Q948J1080J1679J2026J3267J5057J6040J5602J4965J5941J8571
58912A462215K0964K1960K2820K5092K7861K8828K7677K6384K6150K5979K4962
58901A740892K4064K4490K5571K5658K4307K2414K0759J9367J7968J6252J3959
58890A975701J1313R032P530O495N510M408K907Q65q43j027k09o11l232o417q421
58875B003001r888j2257j5098j6982j7958j9088k0246k0472k0017j9892j9674
$$ plain form
58864 1811429 1793407 1778124 1764766 1752011 1739985 1729518 1720383 1711826 1704186 1698536 1695144 1693643
58852 1693643 1694188 1696949 1700940 1705128 1710482 1719144 1731444 1745442 1759682 1774823 1792005 1811066 1830904
58839 1830904 1850303 1867816 1882268 1894307 1906308 1919563 1932307 1941527 1946253 1948167 1949387 1950504
58827 1950504 1950722 1949271 1946532 1943895 1942343 1941219 1938784 1933934 1926791 1917688 1906532 1893365 1878680
58814 1878680 1862641 1844675 1824327 1802033 1778756 1755344 1732316 1709454 1685470 1659187 1631512
58803 1631512 1605205 1582058 1561278 1541335 1522136 1504258 1487055 1469126 1450314 1431861 1414740
58792 1414740 1398874 1383810 1369002 1353567 1336983 1320284 1305560 1293916 1284478 1275509 1265848 1255408
58780 1255408 1245168 1236807 1231398 1228077 1224727 1220241 1215338 1210849 1206123 1199953 1192516 1185483 1180217 1176468
$$ packed form
58864A811429j8022j5283j3358j2755j2026j0467r135q557p640n650l392j501
58852A693643N45K761L991M188N354Q662J2300J3998J4240J5141J7182J9061J9838
58839A830904J9399J7513J4452J2039J2001J3255J2744R220M726J914J220J117
58827A950504K18j451k739k637j552j124k435m850p143r103j1156j3167j4685
58814A878680j6039j7966k0348k2294k3277k3412k3028k2862k3984k6283k7675
58803A631512k6307k3147k0780j9943j9199j7878j7203j7929j8812j8453j7121
58792A414740j5866j5064j4808j5435j6584j6699j4724j1644r438q969r661j0440
58780A255408j0240q361n409l321l350m486m903m489m726o170p437p033n266l749
$$ plain form
58766 1176468 1172968 1168909 1164763 1161880 1161419 1163478 1167145 1171366 1175779 1180633 1185868 1190389 1192510 1191355
58752 1191355 1187746 1183486 1179798 1176712 1173838 1171077 1168301 1164868 1160068 1153953 1147272 1140633 1133958 1126678
58738 1126678 1118227 1108506 1098125 1088065 1078859 1070250 1061827 1053738 1046464 1040081 1034097 1027927 1021295
58725 1021295 1014324 1007456 1001110 995209 989356 983739 979456 977439 977239 977404 976924 975915 974976 974345 973638
58710 973638 972054 968850 963949 958113 952335 947110 942392 938084 934298 931240 928920 926844 924140 920511
58696 920511 917044 915340 915596 916291 916030 914836 913212 911176 909150 908677 910860 914689 918298 921306 924517
58681 924517 927855 930461 932692 936147 941336 947017 952298 957763 963900 970034 975743 981838 988733 995112
58667 995112 999648 1003080 1007089 1011819 1016123 1019893 1024389 1030165 1036085 1040929 1044921 1049128 1054084 1059590
$$ packed form
58766A176468l500m059m146k883m61K059L667M221M413M854N235M521K121j155
58752A191355l609m260l688l086k874k761k776l433m800o115o681o639o675p280
58738A126678q451r721j0381j0060r206q609q423q089p274o383n984o170o632
58725A021295o971o868o346n901n853n617m283k017k00J65m80j009r39o31p07
58710I73638j584l204m901n836n778n225m718m308l786l058k320k076k704l629
58696I20511l467j704K56O95k61j194j624k036k026m73K183L829L609L008L211
58681I24517L338K606K231L455N189N681N281N465O137O134N709O095O895O379
58667I95112M536L432M009M730M304L770M496N776N920M844L992M207M956N506
$$ plain form
58653 1059590 1065312 1070904 1075782 1079382 1081784 1083809 1086252 1088976 1090935 1091125 1089405 1086217 1081907 1076831
58639 1076831 1071862 1067883 1064413 1059500 1051533 1040758 1028587 1015945 1002894 989477 976095 963109
58627 963109 950716 939250 929121 920296 912209 904333 896653 889584 883552 878699 874907 872084 870328
58614 870328 869531 868892 867274 864338 861014 858698 858201 859497 862001 864791 866965 868124 868373 867867 866873 866226
58598 866226 866799 868149 868509 866804 863843 860730 856873 850810 842549 833819 826091 819611 814427 810920 808722
58583 808722 806183 801920 796531 792117 790261 790796 792337 793667 794705 796270 798784 801402 802900 803362 804340
58568 804340 807189 811798 817156 822440 827083 830495 832465 833554 834496 835444 836332 837668 840258 844268 849291
58553 849291 855296 862699 871277 879741 886878 892662 897868 903064 908447 914134 919729 923793 924698 922413
$$ packed form
58653A059590N722N592M878L600K402K025K443K724J959J90j720l188m310n076
58639A076831m969l979l470m913p967j0775j2171j2642j3051j3417j3382j2986
58627I63109j2393j1466j0129q825q087p876p680p069o032m853l792k823j756
58614H70328p97o39j618k936l324k316m97J296K504K790K174J159K49n06r94o47
58598H66226N73J350L60j705k961l113l857o063q261q730p728o480n184l507k198
58583H08722k539m263n389m414j856N35J541J330J038J565K514K618J498M62R78
58568H04340K849M609N358N284M643L412J970J089R42R48Q88J336K590M010N023
58553H49291O005P403Q578Q464P137N784N206N196N383N687N595M064R05k285
$$ plain form
58539 922413 918927 916501 915800 915967 916062 915920 915837 916004 916351 916651 916653 916290 915705 915008 914112 913101 912650 913799 917213
58520 917213 922683 929220 935592 941147 946394 952478 959759 967328 974360 981405 989482 998297 1006658 1014706
58506 1014706 1024405 1037152 1051924 1066720 1081031 1095918 1112132 1129290 1146717 1164071 1181082
58495 1181082 1197509 1213459 1228974 1243189 1254805 1263752 1271425 1278529 1283388 1283570 1279078 1272831 1267566
58482 1267566 1263112 1257371 1249328 1240011 1230706 1221577 1212580 1204499 1197937 1191827 1184296 1174969 1165255 1156189
58468 1156189 1147097 1136859 1125505 1113934 1102931 1093199 1085517 1079849 1074807 1069133 1063544 1060127 1059865
58455 1059865 1061533 1062953 1062565 1059826 1055185 1050104 1046350 1044696 1044574 1045103 1045845 1046397 1046098 1044830 1043523
58440 1043523 1042995 1042464 1040103 1035357 1030125 1027186 1027605 1029942 1031894 1032428 1032301 1032908 1034947 1038174 1042033
$$ packed form
58539I22413l486k426p01J67R5j42q3J67L47L00Kl63n85o97q96j011m51J149L414
58520I17213N470O537O372N555N247O084P281P569P032P045Q077Q815Q361Q048
58506A014706R699J2747J4772J4796J4311J4887J6214J7158J7427J7354J7011
58495A181082J6427J5950J5515J4215J1616Q947P673P104M859J82m492o247n265
58482A267566m454n741q043r317r305r129q997q081o562o110p531r327r714r066
58468A156189r092j0238j1354j1571j1003r732p682n668n042n674n589l417k62
58455A059865J668J420l88k739m641n081l754j654j22N29P42N52k99j268j307
58440A043523n28n31k361m746n232k939M19K337J952N34j27O07K039L227L859
$$ plain form
58425 1042033 1046215 1050646 1055183 1059512 1063401 1067125 1071548 1077535 1085088 1093195 1100759 1107710 1115033 1123625
58411 1123625 1133299 1143140 1152737 1162692 1173550 1184462 1193389 1198834 1201124 1201934 1202905 1204760 1207098 1208664
58397 1208664 1208513 1207573 1208473 1212859 1219236 1224550 1227734 1230456 1234329 1238822 1242435 1244631 1245696 1245675 1244542
58382 1244542 1242880 1241367 1239863 1237759 1234918 1231634 1228022 1224150 1220422 1217168 1214168 1211266 1209100 1208465
58368 1208465 1209244 1210755 1212891 1216099 1220402 1225367 1231023 1237994 1246601 1256400 1266571 1276157 1284135 1290153
58354 1290153 1295231 1300790 1306719 1311276 1313303 1313799 1314696 1316608 1318517 1319441 1319707 1320336 1321698 1323187 1324145
58339 1324145 1324606 1324897 1325024 1325109 1326184 1329544 1335049 1340964 1345968 1350610 1356185 1362996 1370613 1379183 1389269
58324 1389269 1400554 1411715 1421689 1430447 1438591 1446797 1455514 1464530 1472983 1480379 1487318 1494555 1501667
$$ packed form
58425A042033M182M431M537M329L889L724M423N987P553Q107P564O951P323Q592
58411A123625R674R841R597R955J0858J0912Q927N445K290Q10R71J855K338J566
58397A208664j51r40R00M386O377N314L184K722L873M493L613K196J065k1j133
58382A244542j662j513j504k104k841l284l612l872l728l254l000k902k166o35
58368A208465P79J511K136L208M303M965N656O971Q607R799J0171R586P978O018
58354A290153N078N559N929M557K027M96Q97J912J909R24K66O29J362J489R58
58339A324145M61K91J27Q5J075L360N505N915N004M642N575O811P617Q570J0086
58324A389269J1285J1161R974Q758Q144Q206Q717R016Q453P396O939P237P112
$$ plain form
58311 1501667 1507586 1512351 1517384 1524006 1532430 1542289 1553297 1565127 1577170 1588735 1599357 1609112 1618861
58298 1618861 1629722 1641829 1654128 1665908 1677809 1690536 1703467 1715717 1727815 1740750 1753856
58287 1753856 1765473 1775596 1786039 1797758 1809820 1821527 1833813 1847678 1862672 1878014 1894041
58276 1894041 1911498 1930255 1949790 1970237 1991999 2014758 2037788 2061012 2085107 2110619 2137285
58265 2137285 2164081 2189930 2214752 2239726 2265914 2292731 2318581 2342945 2366897 2391590 2417362
58254 2417362 2444441 2473117 2502757 2531912 2560224 2589239 2620606 2654314 2689294 2724836 2760748
58243 2760748 2797000 2834047 2872712 2912965 2953571 2993772 3034665 3078089 3124522 3172769 3221317
58232 3221317 3269551 3318165 3368883 3423208 3480977 3540649 3601368 3664061 3730115 3799779 3872344
$$ packed form
58311A501667N919M765N033O622Q424R859J1008J1830J2043J1565J0622R755R749
58298A618861J0861J2107J2299J1780J1901J2727J2931J2250J2098J2935J3106
58287A753856J1617J0123J0443J1719J2062J1707J2286J3865J4994J5342J6027
58276A894041J7457J8757J9535K0447K1762K2759K3030K3224K4095K5512K6666
58265B137285K6796K5849K4822K4974K6188K6817K5850K4364K3952K4693K5772
58254B417362K7079K8676K9640K9155K8312K9015L1367L3708L4980L5542L5912
58243B760748L6252L7047L8665M0253M0606M0201M0893M3424M6433M8247M8548
58232C221317M8234M8614N0718N4325N7769N9672O0719O2693O6054O9664P2565
$$ plain form
58221 3872344 3947075 4023363 4100680 4179117 4259555 4342962 4430101 4522030 4619855 4723428 4831194
58210 4831194 4941998 5056339 5175495 5300389 5431787 5570538 5716833 5870125 6030558
58201 6030558 6199702 6379180 6569229 6769182 6978599 7197518 7426504 7666959 7920490
58192 7920490 8187516 8467439 8760381 9067489 9389228 9724927 10074593 10439633 10821216
58183 10821216 11219737 11636695 12075204 12537559 13024288 13536902 14079443 14655492 15265578
58174 15265578 15909744 16591206 17315114 18084801 18901561 19767340 20685482 21659221 22691286
58165 22691286 23784607 24942158 26166847 27462995 28837025 30295438 31843472 33487529
58157 33487529 35237988 37108332 39113106 41268853 43596306 46120641 48871605 51885550
$$ packed form
58221C872344P4731P6288P7317P8437Q0438Q3407Q7139R1929R7825J03573J07766
58210D831194J10804J14341J19156J24894J31398J38751J46295J53292J60433
58201F030558J69144J79478J90049J99953K09417K18919K28986K40455K53531
58192G920490K67026K79923K92942L07108L21739L35699L49666L65040L81583
58183A0821216L98521M16958M38509M62355M86729N12614N42541N76049O10086
58174A5265578O44166O81462P23908P69687Q16760Q65779R18142R73739J032065
58165B2691286J093321J157551J224689J296148J374030J458413J548034J644057
58157C3487529J750459J870344K004774K155747K327453K524335K750964L013945
$$ plain form
58149 51885550 55205931 58879822 62954945 67480817 72510476 78100935 84317911 91245362
58141 91245362 98988371 107662492 117378467 128229216 140271799 153505897 167874779
58134 167874779 183301855 199726269 217090268 235288020 254128238 273324140 292469818
58127 292469818 310988560 328108576 342919860 354489102 361972980 364718186 362374918
58120 362374918 355007067 343125273 327594716 309454744 289734394 269323782 248916077
58113 248916077 229008597 209939178 191928797 175111716 159554320 145271576 132242626
58106 132242626 120421859 109746002 100140324 91523667 83810964 76915037 70749801 65233520
58098 65233520 60290333 55851091 51854509 48247335 44983115 42021328 39327472 36872064
$$ packed form
58149E1885550L320381L673891M075123M525872N029659N590459O216976O927451
58141I1245362P743009Q674121R715975J0850749J2042583J3234098J4368882
58134A67874779J5427076J6424414J7363999J8197752J8840218J9195902J9145678
58127B92469818J8518742J7120016J4811284J1569242P483878K745206k343268
58120C62374918p367851j1881794j5530557j8139972j9720350k0410612k0407705
58113B48916077j9907480j9069419j8010381j6817081j5557396j4282744j3028950
58106A32242626j1820767j0675857r605678q616657p712703o895927o165236n516281
58098F5233520m943187m439242l996582l607174l264220k961787k693856k455408
$$ plain form
58090 36872064 34628264 32570791 30677249 28929347 27312225 25813426 24422748 23131908
58082 23131908 21933419 20820032 19785093 18822243 17924417 17084274 16296146 15556639 14862798
58073 14862798 14210558 13595493 13014204 12464269 11943450 11449586 10980686 10534588 10108905
58064 10108905 9701754 9312162 8939473 8582879 8241920 7916902 7608159 7314948 7035490
58055 7035490 6768134 6512280 6268030 6035105 5812538 5599763 5397541 5206841 5026706
58046 5026706 4854294 4687537 4526890 4373885 4228948 4091517 3961293 3838125 3721259
58037 3721259 3609907 3504038 3403556 3307398 3214763 3126596 3044167 2966611 2891654 2818634 2748933
58026 2748933 2683286 2620603 2559980 2501963 2446824 2393129 2339338 2285928 2234766 2186984 2142387
$$ packed form
58090C6872064k243800k057473j893542j747902j617122j498799j390678j290840
58082B3131908j198489j113387j034939r62850q97826q40143p88128p39507o93841
58073A4862798o52240o15065n81289n49935n20819m93864m68900m46098m25683
58064A0108905m07151l89592l72689l56594l40959l25018l08743k93211k79458
58055G035490k67356k55854k44250k32925k22567k12775k02222j90700j80135
58046E026706j72412j66757j60647j53005j44937j37431j30224j23168j16866
58037C721259j11352j05869j00482r6158r2635q8167q2429p7556p4957p3020o9701
58026B748933o5647o2683o0623n8017n5139n3695n3791n3410n1162m7782m4597
$$ plain form
58015 2142387 2100374 2060390 2021611 1983057 1944327 1905993 1869143 1834336 1800842 1767157 1732650
58004 1732650 1698528 1666748 1638247 1612584 1588701 1565197 1540492 1514047 1487357 1462602 1440324
57993 1440324 1419405 1399053 1379394 1360062 1339867 1318445 1297019 1276875 1258084 1240279 1223638
57982 1223638 1208349 1193873 1179433 1164668 1149456 1133785 1118164 1103399 1089622 1076262 1063277
57971 1063277 1051425 1040902 1030611 1019365 1006975 993704 979637 965204 951425 938760 926369
57960 926369 913215 899302 885265 871487 858302 846331 835721 825593 815086 804535 794855 786132
57948 786132 777523 768306 758463 748486 739165 731247 724893 719702 715535 712807 711567 710879 709613 707510
57934 707510 705097 703022 701856 701922 702909 704123 705470 707571 710570 713590 715861 717580 719020 719580 718526
$$ packed form
58015B142387m2013l9984l8779l8554l8730l8334l6850l4807l3494l3685l4507
58004A732650l4122l1780k8501k5663k3883k3504k4705k6445k6690k4755k2278
57993A440324k0919k0352j9659j9332k0195k1422k1426k0144j8791j7805j6641
57982A223638j5289j4476j4440j4765j5212j5671j5621j4765j3777j3360j2985
57971A063277j1852j0523j0291j1246j2390j3271j4067j4433j3779j2665j2391
57960I26369j3154j3913j4037j3778j3185j1971j0610j0128j0507j0551r680q723
57948G86132q609r217r843r977r321p918o354n191m167k728j240o88j266k103
57934G07510k413k075j166O6R87J214J347K101K999L020K271J719J440N60j054
$$ plain form
57919 718526 716022 712678 708626 703772 698311 692204 684865 676324 668154 662112 658155 654710 650643 646102
57905 646102 641746 638040 635110 632505 629408 625744 622702 621275 620812 619951 618438 616833 614944 612078 608724
57890 608724 606293 604883 602769 598813 594171 590826 589219 588135 586442 584313 583100 584366 588576 594291
57876 594291 598961 600845 600051 597823 595401 593669 593159 593896 595404 596984 597709 596388 592297 586058 578963
57861 578963 571215 561692 549949 537595 526914 518579 511443 504273 497016 490513 485571 482236 479548
57848 479548 476139 471530 466711 462996 460479 458165 455506 453077 451576 450825 450206 449646 449633 450309 451028 450854
57832 450854 449319 446732 443979 442044 441414 441729 442129 441946 440983 439218 436713 433964 431816 430459 428822
57817 428822 425672 421336 417615 415689 414677 412663 408747 403584 398192 392896 387498 382061 377159 373388
$$ packed form
57919G18526k504l344m052m854n461o107p339q541q170o042l957l445m067m541
57905F46102m356l706k930k605l097l664l042j427m63q61j513j605j889k866l354
57890F08724k431j410k114l956m642l345j607j084j693k129j213J266M210N715
57876E94291M670J884p94k228k422j732n10P37J508J580P25j321m091o239p095
57861E78963p748r523j1743j2354j0681q335p136p170p257o503m942l335k688
57848D79548l409m609m819l715k517k314k659k429j501p51o19n60j3O76P19j74
57832D50854j535k587k753j935o30L15M00j83r63j765k505k749k148j357j637
57817D28822l150m336l721j926j012k014l916n163n392n296n398n437m902l771
$$ plain form
57803 373388 370642 368045 364855 361504 359428 359682 361946 365016 367963 370523 372687 374457 376000 377675
57789 377675 379756 382137 384314 385624 385716 384852 383623 382382 381223 380419 380307 380573 380209 378523 375762 372484
57773 372484 368931 365442 362894 361968 362347 363249 364387 365784 367075 367955 368983 370979 373646 375794 376910
57758 376910 377485 377654 376696 374390 371844 370185 369139 367684 365569 363323 361029 358049 353993 349337 344925
57743 344925 341264 338357 335836 333158 329995 326617 323744 321905 321017 320566 320026 319109 317767 316064 314000
57728 314000 311495 308650 306044 304591 304839 306311 307722 308119 307872 308301 310162 312731 314598 315150 314951 314816
57712 314816 314994 315265 315319 314887 313824 312373 311089 310336 310114 310589 312363 315712 319637 322292 322618 321370
57696 321370 320326 320622 321954 323178 323416 322654 321637 321334 322236 323866 325029 324792 323317 321643 320694 320616
$$ packed form
57803C73388k746k597l190l351k076K54K264L070K947K560K164J770J543J675
57789C77675K081K381K177J310R2q64j229j241j159q04j12K66l64j686k761l278
57773C72484l553l489k548r26L79R02J138J397J291Q80J028J996K667K148J116
57758C76910N75J69r58k306k546j659j046j455k115k246k294k980m056m656m412
57743C44925l661k907k521k678l163l378k873j839q88m51n40r17j342j703k064
57728C14000k505k845k606j453K48J472J411L97k47M29J861K569J867N52j99j35
57712C14816J78K71N4m32j063j451j284p53k22M75J774L349L925K655L26j248
57696C21370j044K96J332J224K38p62j017l03R02J630J163k37j475j674r49p8
$$ plain form
57680 320616 320932 321048 320576 319480 318043 316566 315144 313971 313704 314976 317553 320530 323555 327132 331346
57665 331346 335036 336962 337315 337223 337045 335993 333300 328974 323468 317477 312088 308234 305751 303797 302329
57650 302329 302081 302561 301306 296290 288549 281306 276622 273841 271154 267637 263614 259956 257538 256744 256976
57635 256976 256980 256066 254744 253942 253880 254004 253653 252551 251015 250023 250574 252399 253752 253365 252415 253649 258484
57618 258484 265878 274126 282580 291030 298754 305598 313469 325309 342437 363720 387185 411310 434680
57605 434680 455634 472872 485582 492740 493265 487471 477352 464639 449319 430873 410179 389107
57593 389107 368799 349513 331781 316384 303183 291175 279975 270256 262515 256411 251721 249009
57581 249009 248612 249583 250377 250271 249589 248795 247984 247144 246433 246065 246137 246619 247397 248344 249344 250194 250604 250432 249866
$$ packed form
57680C20616L16J16m72j096j437j477j422j173k67J272K577K977L025L577M214
57665C31346L690J926L53r2j78j052k693m326n506n991n389l854k483j954j468
57650C02329k48M80j255n016p741p243m684k781k687l517m023l658k418p94K32
57635B56976Mr14j322q02o2J24l51j102j536r92N51J825J353l87r50J234M835
57618B58484P394Q248Q454Q450P724O844P871J1840J7128K1283K3465K4125K3370
57605D34680K0954J7238J2710P158N25n794j0119j2713j5320j8446k0694k1072
57593C89107k0308j9286j7732j5397j3201j2008j1200r719p741o104m690k712
57581B49009l97R71P94j06o82p94q11q40p11l68P2M82P78R47J000Q50M10j72n66
$$ plain form
57562 249866 249146 248240 247073 245858 244750 243334 241103 238484 236622 235815 234778 232070 227956 224354 223036
57547 223036 224181 226508 228415 229022 228432 227136 225182 222150 218041 213865 210928 209546 208780 207456 205183
57532 205183 202251 198912 195148 191119 187315 183977 180659 176936 173405 171305 170868 170692 169282 166718 164203
57517 164203 162374 160919 159651 158933 158722 158104 156364 154044 152401 151979 152096 151610 150004 147802 146050 145237
57501 145237 144851 144272 143925 144908 147355 149932 151414 152266 154006 157234 160838 163057 162940 160797 157668 154563
57485 154563 151999 150081 148838 148261 148044 147708 147246 147307 148310 149515 149541 147999 146221 146087 148241 151812
57469 151812 155716 159714 163895 167632 169752 169768 168415 166829 165753 165704 167186 170143 173655 176754 179326
57454 179326 181815 184455 187256 190212 192744 193444 191365 187452 183835 181819 181229 181372 181592 181158 179810
$$ packed form
57562B49866p20r06j167j215j108j416k231k619j862q07j037k708m114l602j318
57547B23036J145K327J907O07n90j296j954l032m109m176k937j382p66j324k273
57532B05183k932l339l764m029l804l338l318l723l531k100m37j76j410k564k515
57517A64203j829j455j268p18k11o18j740k320j643m22J17m86j606k202j752q13
57501A45237l86n79l47R83K447K577J482Q52J740L228L604K219j17k143l129l105
57485A54563k564j918j243n77k17l36m62O1J003J205K6j542j778j34K154L571
57469A51812L904L998M181L737K120J6j353j586j076m9J482K957L512L099K572
57454A79326K489K640K801K956K532P00k079l913l617k016n90J43K20m34j348
$$ plain form
57439 179810 178361 177532 176317 173094 168548 165730 166459 169172 171219 171840 171759 171221 170067 168865 168361 168202
57423 168202 167500 166298 165273 164444 163440 162699 163003 164010 164568 164436 164423 164748 164566 163368 161647 159820 157547
57406 157547 154640 151803 149919 149183 149238 149586 149592 148812 147670 147236 148003 149344 150385 150867 150998 151099 151676 153180
57388 153180 155290 156932 157406 157188 157296 158124 159040 158914 157047 154004 151418 150470 150598 150249 148755 146665
57372 146665 144340 141321 137382 133282 130005 127977 127304 127850 128655 128329 126785 125732 126662 129085 131601
57357 131601 133868 136383 138914 140502 140822 140418 139647 138476 137285 136701 136487 135766 134728 134982 137446 140649
57341 140649 142039 140534 137127 133424 130497 129009 129383 131279 133369 134170 133183 131174 129551 129523 131428
57326 131428 134345 136517 136822 136053 136258 138364 140791 141025 138444 134998 133056 133217 134411 135520 136341 137248
$$ packed form
57439A79810j449q29j215l223m546k818P29K713K047O21q1n38j154j202n04j59
57423A68202p02j202j025q29j004p41L04J007N58j32j3L25j82j198j721j827k273
57406A57547k907k837j884p36N5L48Op80j142m34P67J341J041M82J31J01N77J504
57388A53180K110J642M74k18J08Q28R16j26j867l043k586r48J28l49j494k090
57372A46665k325l019l939m100l277k028o73N46Q05l26j544j053R30K423K516
57357A31601K267K515K531J588L20m04p71j171j191n84k14p21j038K54K464L203
57341A40649J390j505l407l703k927j488L74J896K090Q01r87k009j623k8J905
57326A31428K917K172L05p69K05K106K427K34k581l446j942J61J194J109Q21R07
$$ plain form
57310 137248 138476 139824 140892 141523 141888 141933 140984 138545 135441 133369 132979 133172 132865 132628 133727 136154
57294 136154 138713 140789 142804 144847 146026 145706 144735 144877 147313 151768 156744 160665 163410 166626 171772
57279 171772 177896 182503 184814 186829 190487 195115 198944 201980 205620 209960 213522 215950 219132 224774
57265 224774 232129 239208 245374 251511 258207 265091 272004 279685 288775 298682 307912 315293 320674 324643
57251 324643 327929 331069 334416 338196 342438 347020 352073 358272 366211 375345 384039 391157 397269 403777
57237 403777 411126 418635 425989 433981 443305 453242 462199 469343 475210 480809 486655 492760 499150 506088
57223 506088 513833 522324 531118 539580 547227 553972 560285 567191 575882 586744 598568 609190 617455
57210 617455 624450 632297 641702 651207 659010 664926 670046 674944 679142 682430 685856 690827 697690 705741
$$ packed form
57310A37248J228J348J068O31L65M5r49k439l104k072l90J93l07k37J099K427
57294A36154K559K076K015K043J179l20r71J42K436M455M976L921K745L216N146
57279A71772O124M607K311K015L658M628L829L036L640M340L562K428L182N642
57265B24774P355P079O166O137O696O884O913P681R090R907R230P381N381L969
57251C24643L286L140L347L780M242M582N053O199P939R134Q694P118O112O508
57237D03777P349P509P354P992R324R937Q957P144N867N599N846O105O390O938
57223E06088P745Q491Q794Q462P647O745O313O906Q691J0862J1824J0622Q265
57210F17455O995P847R405R505P803N916N120M898M198L288L426M971O863Q051
$$ plain form
57196 705741 714325 723211 732047 740285 747925 755735 764392 773889 784107 795424 808226 822174 836538
57183 836538 851002 865645 880400 895209 910529 926942 944252 961665 979035 997284 1017258
57172 1017258 1038615 1060154 1081013 1101438 1122548 1145202 1168683 1190795 1210017 1227539 1246316
57161 1246316 1267995 1291813 1316766 1343573 1373429 1405661 1437998 1469037 1499520 1531203 1565287
57150 1565287 1602017 1641015 1681557 1722799 1764051 1804931 1845543 1886588 1928940 1972858 2017949
57139 2017949 2064069 2111497 2159760 2207103 2252125 2295427 2338618 2381986 2424285 2464694 2503671
57128 2503671 2541746 2578696 2614386 2649327 2683675 2716470 2746647 2774356 2800686 2826523 2852230
57117 2852230 2878059 2904223 2930745 2957721 2985578 3014683 3044820 3075487 3106662 3138974 3173061
$$ packed form
57196G05741Q584Q886Q836Q238P640P810Q657R497J0218J1317J2802J3948J4364
57183H36538J4464J4643J4755J4809J5320J6413J7310J7413J7370J8249J9974
57172A017258K1357K1539K0859K0425K1110K2654K3481K2112J9222J7522J8777
57161A246316K1679K3818K4953K6807K9856L2232L2337L1039L0483L1683L4084
57150A565287L6730L8998M0542M1242M1252M0880M0612M1045M2352M3918M5091
57139B017949M6120M7428M8263M7343M5022M3302M3191M3368M2299M0409L8977
57128B503671L8075L6950L5690L4941L4348L2795L0177K7709K6330K5837K5707
57117B852230K5829K6164K6522K6976K7857K9105L0137L0667L1175L2312L4087
$$ plain form
57106 3173061 3208805 3245104 3280447 3314090 3346810 3380227 3415220 3451316 3487646 3524003 3560680
57095 3560680 3597788 3635148 3672503 3709370 3744983 3779004 3812170 3845687 3879823 3913453 3945101
57084 3945101 3974201 4001113 4025911 4047293 4062738 4069784 4067171 4054980 4034150 4006056 3971958 3931954
57072 3931954 3884402 3826983 3758556 3679530 3590434 3490758 3379335 3254991 3116215 2960622
57062 2960622 2785253 2587103 2362925 2108892 1821050 1495997 1130790 722541 268558
57052 -233345 -785325 -1390274 -2051942 -2774471 -3562347 -4420862 -5356442 -6376818 -7491504
57043 -7491504 -8712518 -10054750 -11535987 -13176948 -15001472 -17036689 -19312910 -21862363
57035 -21862363 -24715942 -27898793 -31427014 -35306451 -39531701 -44082901 -48919976 -53976562
$$ packed form
57106C173061L5744L6299L5343L3643L2720L3417L4993L6096L6330L6357L6677
57095C560680L7108L7360L7355L6867L5613L4021L3166L3517L4136L3630L1648
57084C945101K9100K6912K4798K1382J5445P046k613j2191k0830k8094l4098m0004
57072C931954m7552n7419o8427p9026q9096r9676j11423j24344j38776j55593
57062B960622j75369j98150k24178k54033k87842l25053l65207m08249B68558
57052b33345n51980o04949o61668p22529p87876q58515r35580j020376j114686
57043g491504j221014j342232j481237j640961j824524k035217k276221k549453
57035b1862363k853579l182851l528221l879437m225250m551200m837075n056586
$$ plain form
57027 -53976562 -59157529 -64344505 -69410321 -74235473 -78715746 -82757340 -86268051 -89155378
57019 -89155378 -91332972 -92728834 -93291199 -92993245 -91836595 -89850793 -87088748 -83622692
57011 -83622692 -79543076 -74957072 -69983540 -64746569 -59370845 -53977804 -48679810 -43573432
57003 -43573432 -38735322 -34221358 -30066736 -26286406 -22877590 -19824846 -17105421 -14692926
56995 -14692926 -12559573 -10677778 -9021046 -7564085 -6282829 -5154911 -4160315 -3281804
56987 -3281804 -2504940 -1817587 -1208940 -668814 -187698 242982 631235 984694 1309482
56978 1309482 1608313 1880371 2123777 2338367 2526079 2689301 2829710 2948850 3049188
56969 3049188 3134099 3206864 3269823 3324273 3370704 3409039 3438920 3460119 3472800 3477298 3473678 3461496
$$ packed form
57027e3976562n180967n186976n065816m825152m480273m041594l510711k887327
57019h9155378k177594j395862n62365K97954J156650J985802K762045L466056
57011h3622692M079616M586004M973532N236971N375724N393041N297994N106378
57003d3573432M838110M513964M154622L780330L408816L052744K719425K412495
56995a4692926K133353J881795J656732J456961J281256J127918R94596Q78511
56987c281804P76864O87353O08647N40126a87698B42982L88253L53459L24788
56978A309482K98831K72058K43406K14590J87712J63222J40409J19140J00338
56969C049188Q4911P2765O2959N4450M6431L8335K9881K1199J2681M498l620j2182
$$ plain form
56957 3461496 3439995 3408542 3367011 3315879 3255945 3187790 3111435 3026664 2933761 2833939 2728972
56946 2728972 2620424 2509238 2395891 2280747 2164284 2047193 1930532 1815838 1704968
56937 1704968 1599648 1501029 1409484 1324769 1246381 1173923 1107208 1046103 990398 939935 894685
56926 894685 854418 818301 785153 754262 725691 699618 675692 653329 632198 611964 591912
56915 591912 571559 551534 533014 516205 500132 484316 469839 458160 449391 442411 436346 431290
56903 431290 427677 425573 424655 424578 425342 427397 431150 436156 441152 445083 447642 448522 446894 442291 435479
56888 435479 427622 419022 409556 399896 391172 383634 376881 371377 368399 368168 369314 370798 373287 377916
56874 377916 384587 392314 400520 409133 417837 425981 432808 437295 438325 435729 430728 424688 417853 409910
$$ packed form
56957C461496k1501l1453m1531n1132n9934o8155p6355q4771r2903r9822j04967
56946B728972j08548j11186j13347j15144j16463j17091j16661j14694j10870
56937A704968j05320r8619r1545q4715p8388p2458o6715o1105n5705n0463m5250
56926H94685m0267l6117l3148l0891k8571k6073k3926k2363k1131k0234k0052
56915E91912k0353k0025j8520j6809j6073j5816j4477j1679q769o980o065n056
56903D31290l613k104r18p7P64K055L753N006M996L931K559Q80j628m603o812
56888D35479p857q600r466r660q724p538o753n504k978k31J146J484K489M629
56874C77916O671P727Q206Q613Q704Q144O827M487J030k596n001o040o835p943
$$ plain form
56860 409910 401142 392138 382807 372724 362284 352623 344464 337778 332384 328041 324111 320072 316362 313786
56846 313786 312031 309713 306209 302656 300787 301417 304298 308775 314204 320189 326791 334244 342520 351625
56832 351625 362124 374528 388119 401314 413445 425195 436993 448033 457565 466174 474892 483743
56820 483743 491976 499087 504625 507653 507688 505965 504701 505061 506779 509629 514196 520968 529695 540001 551812
56805 551812 564793 578141 591566 605879 622031 639869 658272 676093 692439 706401 717301
56794 717301 725275 731115 735320 737589 737442 735159 731994 729533 728901 730512 734406 740574 748954 759420
56780 759420 772195 788232 808798 834426 864350 896980 930629 963611 993968 1019660 1039311
56769 1039311 1052665 1060116 1061735 1056877 1044983 1026736 1004213 979867 955594 932782 912617 895779
$$ packed form
56860D09910q768r004r331j0083j0440r661q159o686n394m343l930m039l710k576
56846C13786j755k318l504l553j869O30K881M477N429N985O602P453Q276R105
56832C51625J0499J2404J3591J3195J2131J1750J1798J1040R532Q609Q718Q851
56820D83743Q233P111N538L028L5j723j264L60J718K850M567O772Q727J0306J1811
56805E51812J2981J3348J3425J4313J6152J7838J8403J7821J6346J3962J0900
56794G17301P974N840M205K269j47k283l165k461o32J611L894O168Q380J0466
56780G59420J2775J6037K0566K5628K9924L2630L3649L2982L0357K5692J9651
56769A039311J3354P451J619m858j1894j8247k2523k4346k4273k2812k0165j6838
$$ plain form
56757 895779 882105 871114 862787 857367 854637 854258 856841 863724 875083 888915 902573 914992 926696
56744 926696 937726 946243 949525 946030 936290 921926 904184 883594 860849 837314 814268 792042
56732 792042 770552 750341 732200 715866 700379 686264 676163 672219 673411 676530 679323 681578
56720 681578 683404 683941 682222 678356 673209 667376 660796 652864 642617 629379 613713 597306 581471
56707 581471 565986 549847 532931 516397 501457 488154 475464 462442 449116 436318 424775
56696 424775 414540 405319 397001 389534 382508 375400 368222 361462 355285 349273 343204 337613 333193 329838
56682 329838 326680 322985 318699 314178 309680 305369 301720 299627 299732 301492 303173 303146 301183 298362 295948
56667 295948 294628 294403 294582 293975 291884 289058 287094 286670 286856 286344 284791 282781 281036 279982 279555 279054
$$ packed form
56757H95779j3674j0991q327n420k730l79K583O883J1359J3832J3658J2419J1704
56744I26696J1030Q517L282l495r740j4364j7742k0590k2745k3535k3046k2226
56732G92042k1490k0211j8141j6334j5487j4115j0101l944J192L119K793K255
56720F81578J826N37j719l866n147n833o580p932j0247j3238j5666j6407j5835
56707E81471j5485j6139j6916j6534j4940j3303j2690j3022j3326j2798j1543
56696D24775j0235r221q318p467p026p108p178o760o177o012o069n591m420l355
56682C29838l158l695m286m521m498m311l649k093J05J760J681k7j963k821k414
56667B95948j320k25J79o07k091k826j964m24J86n12j553k010j745j054m27n01
$$ plain form
56651 279054 277663 275430 273281 271865 271000 270592 271220 273180 275644 277556 278765 279480 279258 277730 275963
56636 275963 275769 277601 280172 282273 283933 285546 286930 287804 288515 289747 291890 294871 298035 300156 300482
56621 300482 300091 301285 305034 309825 313665 316459 319547 323502 327459 330309 331591 331392 330383 329958 331408
56606 331408 334683 338539 341869 344251 345382 345140 344494 345094 347166 348716 347907 345636 344619 346180 349104
56591 349104 351696 353699 355679 357622 359079 360135 361185 361960 361721 360620 360009 360907 362590 363281 362154
56576 362154 360218 359170 359682 361045 362361 363677 365677 368380 370771 372091 373167 375691 380049 384527
56562 384527 387159 388025 389075 391833 395883 399770 402683 404691 405727 405198 402952 400106 398282 398042 398373
56547 398373 397713 395220 391119 386303 381797 378234 375424 372557 369110 365478 362527 360715 359833 359285 358297
$$ packed form
56651B79054j391k233k149j416q65m08O28J960K464J912J209P15k22j528j767
56636B75963j94J832K571K101J660J613J384Q74P11J232K143K981L164K121L26
56621C00482l91J194L749M791L840K794L088L955L957K850J282j99j009m25J450
56606C31408L275L856L330K382J131k42o46O00K072J550q09k271j017J561K924
56591C49104K592K003J980J943J457J056J050P75k39j101o11Q98J683O91j127
56576C62154j936j048N12J363J316J316K000K703K391J320J076K524M358M478
56562C84527K632Q66J050K758M050L887K913K008J036n29k246k846j824k40L31
56547C98373o60k493m101m816m506l563k810k867l447l632k951j812q82n48r88
$$ plain form
56532 358297 356166 352871 349322 346532 344655 343354 342818 343527 344949 345350 343456 339880 336585 335300 336499
56517 336499 339254 341748 342532 341702 340601 340300 341028 343058 346911 352112 356929 360407 363756 368474 373825
56502 373825 377747 380017 382800 387813 394371 400803 406577 412218 417901 422935 426270 427111 425533 422814
56488 422814 420576 419183 417598 415167 412662 410884 409059 405854 401682 398641 397862 397954 396635 393270 389079
56473 389079 385260 381821 378332 375068 372882 372264 373009 374650 376706 378472 379151 378450 376703 374184 370789
56458 370789 366654 362580 359317 356830 354921 354173 355433 358355 361358 363214 364041 364467 364502 363718 362130 360337
56442 360337 358842 357578 356207 354839 354298 355363 357631 359509 359812 359120 359041 360382 362602 364827 366541
56427 366541 367345 367019 366126 365795 366518 367689 368505 368592 367565 364976 361383 358704 358600 360805 363709 366191
$$ packed form
56532C58297k131l295l549k790j877j301n36P09J422M01j894l576l295j285J199
56517C36499K755K494P84q30j101l01P28K030L853N201M817L478L349M718N351
56502C73825L922K270K783N013O558O432N774N641N683N034L335Q41j578k719
56488D22814k238j393j585k431k505j778j825l205m172l041p79R2j319l365m191
56473C89079l819l439l489l264k186o18P45J641K056J766O79p01j747k519l395
56458C70789m135m074l263k487j909p48J260K922L003J856Q27M26L5p84j588j793
56442C60337j495j264j371j368n41J065K268J878L03o92p9J341K220K225J714
56427C66541Q04l26q93l31P23J171Q16Q7j027k589l593k679j04K205K904K482
$$ plain form
56411 366191 368176 369780 370942 372017 373868 376853 380067 382066 382318 381648 381094 380497 378670 375155 371330
56396 371330 369163 369049 369612 369605 369176 369053 369333 369706 370243 371229 372492 373536 374260 375136 376663 378842 381092
56379 381092 382636 383239 383559 384362 385451 385954 385818 386166 387733 389620 390241 389081 386987 385060 383762 382794
56363 382794 381449 379376 377241 376153 376235 376437 376082 375660 375528 374825 372777 370313 369077 369228 369380 368524 366813
56346 366813 364602 362022 359672 358608 359276 361238 364140 368001 372318 375935 378389 380601 383563 386974
56332 386974 389857 392120 394711 398292 402385 406000 408720 410807 412332 412631 411124 408563 406806 406967 408336
56317 408336 409659 411009 413583 417827 422594 426282 428212 428978 430019 432816 437743 443434 447886 450459
56303 450459 452368 455090 458725 462150 464336 465221 465500 465803 466066 465843 465296 465484 467241 470148 473114 475564
$$ packed form
56411C66191J985J604J162J075J851K985L214J999K52o70n54n97j827l515l825
56396C71330k167j14N63pm29j23K80L73N37R86J263J044P24Q76J527K179K250
56379C81092J544O03L20Q03J089N03j36L48J567J887O21j160k094j927j298r68
56363C82794j345k073k135j088Q2K02l55m22j32p03k048k464j236J51J52q56j711
56346C66813k211k580k350j064O68J962K902L861M317L617K454K212K962L411
56332C86974K883K263K591L581M093L615K720K087J525K99j507k561j757J61J369
56317D08336J323J350K574M244M767L688J930P66J041K797M927N691M452K573
56303D50459J909K722L635L425K186Q85K79L03K63k23n47J88J757K907K966K450
$$ plain form
56287 475564 477352 477928 476777 474717 473688 474815 477399 480103 482398 484469 486506 488703 491548 495527
56273 495527 500522 505663 509773 512257 513937 516644 521300 526676 530932 534076 537646 541994 545493 546971
56259 546971 547401 548181 549011 548863 548211 548727 551005 553948 556494 558789 561394 564221 566777 569026 571620 575336
56243 575336 580275 585536 589975 593587 597785 603758 610882 617401 622650 627896 634912 644266 655186 666535
56229 666535 677545 687952 697861 707554 717301 727334 737939 749390 761792 775151 789572 805134
56217 805134 821545 838197 854886 872319 891529 912676 934805 957086 980035 1005018 1032641
56206 1032641 1062272 1093271 1125992 1161187 1199128 1240039 1284833 1334510 1389030 1447651 1510424
56195 1510424 1578589 1653538 1736014 1826221 1923813 2027838 2137710 2254442 2379949 2514818
$$ packed form
56287D75564J788N76j151k060j029J127K584K704K295K071K037K197K845L979
56273D95527M995N141M110K484J680K707M656N376M256L144L570M348L499J478
56259E46971M30P80Q30j48o52N16K278K943K546K295K605K827K556K249K594L716
56243E75336M939N261M439L612M198N973P124O519N249N246P016R354J0920J1349
56229F66535J1010J0407R909R693R747J0033J0605J1451J2402J3359J4421J5562
56217H05134J6411J6652J6689J7433J9210K1147K2129K2281K2949K4983K7623
56206A032641K9631L0999L2721L5195L7941M0911M4794M9677N4520N8621O2773
56195A510424O8165P4949Q2476R0207R7592J04025J09872J16732J25507J34869
$$ plain form
56185 2514818 2657598 2806448 2960258 3117569 3275617 3431475 3583356 3729641 3867183
56176 3867183 3991732 4099831 4189314 4258139 4303949 4325290 4322600 4297470 4251081 4183719 4095942
56165 4095942 3990165 3870773 3742220 3607070 3466201 3320782 3173304 3026670 2883080
56156 2883080 2744012 2610466 2482795 2361095 2246178 2139373 2040934 1949550 1864053 1784659
56146 1784659 1711800 1644819 1582943 1526565 1476040 1429869 1385832 1343816 1305886 1273235 1244480
56135 1244480 1217527 1191916 1168564 1147994 1129728 1113107 1098058 1085019 1074334 1065690 1058179 1051076
56123 1051076 1044523 1039230 1035681 1033846 1033376 1033733 1034414 1035440 1037273 1039809 1041988 1043132 1044357 1047656 1053570
56108 1053570 1060599 1067039 1072731 1078825 1086381 1095482 1105339 1115024 1124217 1133325 1143007 1154006 1167460
$$ packed form
56185B514818J42780J48850J53810J57311J58048J55858J51881J46285J37542
56176C867183J24549J08099Q9483O8825M5810K1341k690k5130m6389o7362q7777
56165D095942j05777j19392j28553j35150j40869j45419j47478j46634j43590
56156B883080j39068j33546j27671j21700j14917j06805r8439r1384q5497p9394
56146A784659p2859o6981o1876n6378n0525m6171m4037m2016l7930l2651k8755
56135A244480k6953k5611k3352k0570j8266j6621j5049j3039j0685q644p511p103
56123A051076o553n293l549j835m70L57O81J026J833K536K179J144J225L299N914
56108A053570P029O440N692O094P556R101R857R685R193R108R682J0999J3454
$$ plain form
56095 1167460 1184481 1204797 1226383 1247162 1266717 1286025 1306509 1330214 1359803 1396707 1439560
56084 1439560 1485889 1535123 1588567 1646655 1707842 1770288 1832946 1894519 1952821 2005976 2053417
56073 2053417 2095405 2132702 2166962 2200093 2232468 2262640 2289275 2312376 2332282 2348710 2361431
56062 2361431 2370624 2375676 2374647 2365969 2349990 2328110 2301169 2269444 2233516 2194311 2152853 2110597
56050 2110597 2069359 2030375 1994127 1961409 1933454 1910393 1890836 1873933 1860689 1852107 1847219 1844406
56038 1844406 1843725 1846303 1852019 1859387 1867365 1875905 1885073 1895155 1907315 1922431 1939237 1955232 1969771
56025 1969771 1984822 2002220 2021441 2040766 2059648 2079178 2100683 2124366 2149077 2173378 2197151
56014 2197151 2221911 2248972 2277703 2306416 2334606 2363278 2393347 2424940 2458211 2493494 2530444
$$ packed form
56095A167460J7021K0316K1586K0779J9555J9308K0484K3705K9589L6904M2853
56084A439560M6329M9234N3444N8088O1187O2446O2658O1573N8302N3155M7441
56073B053417M1988L7297L4260L3131L2375L0172K6635K3101J9906J6428J2721
56062B361431R193N052j029q678j5979k1880k6941l1725l5928l9205m1458m2256
56050B110597m1238l8984l6248l2718k7955k3061j9557j6903j3244q582m888k813
56038A844406o81K578N716P368P978Q540R168J0082J2160J5116J6806J5995J4539
56025A969771J5051J7398J9221J9325J8882J9530K1505K3683K4711K4301K3773
56014B197151K4760K7061K8731K8713K8190K8672L0069L1593L3271L5283L6950
$$ plain form
56003 2530444 2568148 2606311 2645269 2684803 2724378 2764857 2808466 2856286 2906917 2958312 3009809
55992 3009809 3061834 3114975 3170303 3229223 3291684 3355505 3418872 3482711 3549197 3618662 3689588
55981 3689588 3761206 3834316 3909648 3987224 4067714 4152755 4243013 4336979 4432632 4529644 4629280
55970 4629280 4732767 4840614 4953177 5071061 5194943 5325391 5462791 5607062 5757662
55961 5757662 5914382 6078270 6251361 6435239 6629961 6834466 7047965 7270778 7504055
55952 7504055 7749185 8007748 8281562 8571899 8878379 9199168 9532856 9879982 10242404
55943 10242404 10621480 11017450 11430607 11862558 12316195 12794724 13300789 13836234 14402454
55934 14402454 15001131 15634754 16306459 17019440 17776589 18580423 19433043 20336402 21293075
$$ packed form
56003B530444L7704L8163L8958L9534L9575M0479M3609M7820N0631N1395N1497
55992C009809N2025N3141N5328N8920O2461O3821O3367O3839O6486O9465P0926
55981C689588P1618P3110P5332P7576Q0490Q5041R0258R3966R5653R7012R9636
55970D629280J03487J07847J12563J17884J23882J30448J37400J44271J50600
55961E757662J56720J63888J73091J83878J94722K04505K13499K22813K33277
55952G504055K45130K58563K73814K90337L06480L20789L33688L47126L62422
55943A0242404L79076L95970M13157M31951M53637M78529N06065N35445N66220
55934A4402454N98677O33623O71705P12981P57149Q03834Q52620R03359R56673
$$ plain form
55925 21293075 22306717 23381232 24519317 25722325 26992022 28332585 29751043 31256453
55917 31256453 32859244 34571346 36406571 38380714 40511583 42819334 45327171 48061814
55909 48061814 51053609 54337075 57952855 61950280 66388260 71333514 76857814 83035924
55901 83035924 89943696 97655442 106242570 115776125 126331922 137993156 150846802 164973815
55893 164973815 180433995 197244397 215348480 234572838 254573008 274784982 294416425
55886 294416425 312506188 328042400 340091090 347893267 350932646 349000649 342255963
55879 342255963 331233000 316760034 299804833 281312558 262094150 242782024 223836784
55872 223836784 205579713 188229753 171931572 156771949 142790240 129988436 118340702
$$ packed form
55925B1293075J013642J074515J138085J203008J269697J340563J418458J505410
55917C1256453J602791J712102J835225J974143K130869K307751K507837K734643
55909D8061814K991795L283466L615780L997425M437980M945254N524300O178110
55901H3035924O907772P711746Q587128R533555J0555797J1661234J2853646J4127013
55893A64973815J5460180J6810402J8104083J9224358K0000170K0211974J9631443
55886B94416425J8089763J5536212J2048690P802177L039379j931997o744686
55879C42255963j1022963j4472966j6955201j8492275j9218408j9312126j8945240
55872B23836784j8257071j7349960j6298181j5159623j3981709j2801804j1647734
$$ plain form
55865 118340702 107800425 98305322 89782167 82150856 75327377 69227001 63768407 58876907
55857 58876907 54485166 50532652 46965919 43739226 40813703 38155281 35733277 33520327
55849 33520327 31492684 29630153 27915696 26334844 24874963 23524836 22274673 21115883
55841 21115883 20040453 19040840 18110637 17244693 16437856 15683948 14976657 14311124 13683761
55832 13683761 13090622 12527115 11989741 11477220 10989182 10524330 10080642 9656966 9253184
55823 9253184 8868526 8500534 8146452 7805355 7478349 7166731 6870483 6588603 6320202
55814 6320202 6064766 5821676 5590100 5369331 5158783 4957637 4764937 4580244 4403865
55805 4403865 4236284 4077601 3927633 3786273 3653472 3529027 3412451 3302837 3198824
$$ packed form
55865A18340702j0540277r495103q523155p631311o823479o100376n458594m891500
55857E8876907m391741l952514l566733l226693k925523k658422k422004k212950
55849C3520327k027643j862531j714457j580852j459881j350127j250163j158790
55841B1115883j075430r99613r30203q65944q06837p53908p07291o65533o27363
55832A3683761n93139n63507n37374n12521m88038m64852m43688m23676m03782
55823I253184l84658l67992l54082l41097l27006l11618k96248k81880k68401
55814F320202k55436k43090k31576k20769k10548k01146j92700j84693j76379
55805D403865j67581j58683j49968j41360j32801j24445j16576j09614j04013
$$ plain form
55796 3198824 3099030 3002781 2910371 2822644 2740454 2664175 2593068 2525095 2458194 2392084 2328185
55785 2328185 2267330 2208296 2149367 2090840 2034985 1983662 1936759 1892915 1850830 1809591 1768513
55774 1768513 1727446 1686995 1647991 1610669 1574512 1538901 1503760 1469664 1437412 1407508 1379922
55763 1379922 1354094 1329090 1304024 1278762 1254163 1231143 1209451 1187840 1165594 1143328 1122038
55752 1122038 1102009 1083099 1065452 1049198 1033779 1018287 1002334 986136 970079 954856 941635
55741 941635 931246 923212 916250 909601 903225 896931 890246 883243 876694 871244 867003 863950 861965 860430
55727 860430 858555 856296 854215 852381 850195 847399 844189 840000 833216 822744 809121 793517 776518
55714 776518 758657 741361 726209 713422 701823 690136 677816 665027 652474 640983 630499
$$ packed form
55796C198824r9794r6249r2410q7727q2190p6279p1107o7973o6901o6110o3899
55785B328185o0855n9034n8929n8527n5855n1323m6903m3844m2085m1239m1078
55774A768513m1067m0451l9004l7322l6157l5611l5141l4096l2252k9904k7586
55763A379922k5828k5004k5066k5262k4599k3020k1692k1611k2246k2266k1290
55752A122038k0029j8910j7647j6254j5419j5492j5953j6198j6057j5223j3221
55741I41635j0389q034o962o649o376o294o685p003o549n450m241l053j985j535
55727H60430j875k259k081j834k186k796l210m189o784j0472j3623j5604j6999
55714G76518j7861j7296j5152j2787j1599j1687j2320j2789j2553j1491j0484
$$ plain form
55703 630499 619705 607381 594074 581792 572058 564794 559037 554028 549475 545302 541439 537660 533559
55690 533559 528916 524069 519579 515530 511439 506897 502035 497343 493242 489883 487100 484410 481125 476744
55676 476744 471460 466271 462077 458343 453144 445257 435919 427500 420573 413637 406021 399414 395492 393310
55662 393310 390542 386435 381927 377456 372606 367803 364310 362113 359661 356455 354179 354058 354570 353478 351118
55647 351118 349777 350202 350688 349843 348384 347373 346090 343012 338185 333272 329357 325797 321439 316121 310611
55632 310611 305659 301556 298167 294968 291337 287287 283685 281315 279948 278737 277285 275656 273583 270565
55618 270565 266925 263947 262623 262774 263618 264357 263902 261076 256009 250709 247219 245568 244426 243349 243121
55603 243121 244000 244958 245068 244614 244275 244065 243812 244033 245484 247996 250427 251773 251897 251228 250189 249071 248158
$$ packed form
55703F30499j0794j2324j3307j2282r734p264n757n009m553m173l863l779m101
55690E33559m643m847m490m049m091m542m862m692m101l359k783k690l285m381
55676D76744n284n189m194l734n199p887r338q419o927o936p616o607l922k182
55662C93310k768m107m508m471m850m803l493k197k452l206k276j21N12j092k360
55647C51118j341M25M86q45j459j011j283l078m827m913l915l560m358n318n510
55632C10611m952m103l389l199l631m050l602k370j367j211j452j629k073l018
55618B70565l640k978j324J51Q44P39m55k826n067n300l490j651j142j077k28
55603B43121Q79R58J10m54l39k10k53K21J451K512K431J346J24o69j039j118r13
$$ plain form
55586 248158 247567 246893 245258 242095 237996 234420 232342 231463 230996 230797 231189 231992 232440 232051 230976 229446
55570 229446 227321 224271 219981 214326 207789 201545 196494 192359 188471 185246 183901 184631 186094 186982 187037
55555 187037 186142 183625 179323 174459 170476 167521 164917 162527 160663 159048 156924 154057 150769 147160
55541 147160 143227 139675 137651 137434 138194 139231 140664 142581 144254 144881 144669 144520 144686 144263 142245 138905
55525 138905 135846 134534 134850 135279 134607 133174 132408 133337 135791 138766 141296 143153 144921 147280 150078
55510 150078 152389 153702 154678 156351 158865 161396 163118 163789 163603 162994 162489 162309 162056 161123 159316 156808
55494 156808 153745 150322 146973 143820 140146 135138 129278 124219 120984 118765 115872 111521 106457 102149
55480 102149 99663 99014 99205 98872 97115 93878 89809 85983 83534 82974 83535 83474 81493 78054 75183 74735
$$ packed form
55586B48158n91o74j635l163m099l576k078q79m67j99L92Q03M48l89j075j530
55570B29446k125l050m290n655o537o244n051m135l888l225j345P30J463Q88N5
55555A87037q95k517m302m864l983k955k604k390j864j615k124k867l288l609
55541A47160l933l552k024k17P60J037J433J917J673O27k12j49J66m23k018l340
55525A38905l059j312L16M29o72j433p66R29K454K975K530J857J768K359K798
55510A50078K311J313R76J673K514K531J722O71j86o09n05j80k53r33j807k508
55494A56808l063l423l349l153l674n008n860n059l235k219k893m351n064m308
55480A02149k486o49J91l33j757l237m069l826k449n60N61o1j981l439k871m48
$$ plain form
55464 74735 76682 79174 80450 80611 81248 83538 87164 91055 94328 96236 96112 94163 91847 90625 90591 90903
55448 90903 91186 91682 92314 92585 92436 92407 92840 93532 94119 94160 93004 90479 87751 86594 87512 89330 90883 92372
55430 92372 94660 97865 101131 103604 105386 107545 110889 114437 115717 113323 108689 104370 101053 97570
55416 97570 93440 89600 86455 83139 79316 76089 74181 72673 70544 68235 66700 66125 66572 68533 71565
55401 71565 73659 73553 72614 72820 73782 73540 71541 68896 66243 63371 60706 59196 58719 58408 58495 59853 61640
55384 61640 61607 59291 56882 56187 56688 57557 59541 63260 67163 68979 68337 66551 64695 63241 62762 63373
55368 63373 63990 63560 62744 63014 64482 65989 67095 68440 70036 70748 69919 68328 67058 66395 66334 67222 69148
55351 69148 71403 73230 74624 75850 76686 76850 76714 76810 76757 75497 72793 69946 68667 69413 70982 71651 70688
$$ packed form
55464G4735J947K492J276J61O37K290L626L891L273J908j24j949k316j222l4L12
55448I0903K83M96O32K71j49k9M33O92N87M1j156k525k728j157R18J818J553J489
55430I2372K288L205L266K473J782K159L344L548J280k394m634m319l317l483
55416I7570m130l840l145l316l823l227j908j508k129k309j535n75M47J961L032
55401G1565K094j06r39K06R62k42j999k645k653k872k665j510m77l11Q7J358J787
55384F1640l3k316k409o95N01Q69J984L719L903J816o42j786j856j454m79O11
55368F3373O17m30q16K70J468J507J106J345J596P12q29j591j270o63o1Q88J926
55351F9148K255J827J394J226Q36J64j36R6n3j260k704k847j279P46J569O69r63
$$ plain form
55334 70688 68985 68238 69342 71459 72872 72844 72403 73035 74867 76538 76819 75882 74872 74757 75888 78102
55318 78102 80675 82495 82979 82728 82648 82472 80978 77860 74576 72802 72587 72581 71679 69846 67676 65853 64977
55301 64977 65191 65787 65638 64277 62363 60968 60655 61261 62296 63415 64707 66689 69830 73839 77455 79176
55285 79176 78399 75919 73310 71725 71166 70739 69578 67643 65846 65375 66615 68565 69634 69282 68623 69100
55269 69100 70784 72486 73383 73868 74665 75769 76595 76723 76151 75115 73982 73141 72847 73348 75084 78186 81634
55252 81634 83563 82851 80021 76344 72752 70007 69129 70622 73606 76564 78815 80517 81539 81390 80312
55237 80312 79403 79292 79356 78651 77085 75399 74443 74702 75931 77062 77066 76253 76084 77227 78464 78198 76480 74740
55219 74740 73899 73710 73852 74523 75687 76656 76963 77042 77440 77928 78057 78186 79062 80607 82046 83278 85068 87451
$$ packed form
55334G0688j703p47J104K117J413k8m41O32J832J671K81r37j010j15J131K214
55318G8102K573J820M84k51q0j76j494l118l284j774k15or02j833k170j823q76
55301F4977K14N96j49j361j914j395l13O06J035J119J292J982L141M009L616J721
55285G9176p77k480k609j585n59m27j161j935j797m71J240J950J069l52o59M77
55269F9100J684J702Q97M85P97J104Q26J28n72j036j133q41k94N01J736L102L448
55252H1634J929p12k830l677l592k745q78J493K984K958K251J702J022j49j078
55237H0312r09j11O4p05j566j686r56K59J229J131Mq13j69J143J237k66j718j740
55219G4740q41j89J42O71J164R69L07P9L98M88J29J29Q76J545J439J232J790K383
$$ plain form
55201 87451 89003 88548 86942 86048 86275 86291 85184 83716 82937 82638 81939 80797 80085 80497 81959 83820 85054
55184 85054 84708 82919 81208 80918 81531 81388 79972 78401 77595 77127 76445 76162 77144 78982 80349 80559 79826
55167 79826 78223 75518 72287 70162 70328 72230 74331 75847 77235 79195 81838 84855 87982 90959 93319
55152 93319 94530 94307 92677 89960 86890 84586 83904 84638 85595 85703 84984 84347 84559 85600 86899 87886 88238
55135 88238 87828 86735 85281 83901 82801 81773 80483 79016 77996 77916 78361 78202 76792 74842 73810 74431
55119 74431 76079 77608 78541 79249 80229 81580 83115 84529 85274 84674 82671 80380 79411 80448 82738 84983
55103 84983 86441 87055 87011 86555 85975 85346 84489 83474 82924 83313 84199 84629 84267 83575 82999 82611 82562 83124 83997
55084 83997 84156 82871 80634 78882 79004 81607 86133 90965 94331 95501 94967 93521 91663 89907 88792
$$ packed form
55201H7451J552m55j606q94K27J6j107j468p79k99o99j142p12M12J462J861J234
55184H5054l46j789j711k90O13j43j416j571q06m68o82k83R82J838J367K10p33
55167G9826j603k705l231k125J66J902K101J516J388J960K643L017L127K977K360
55152I3319J211k23j630k717l070k304o82P34R57J08p19o37K12J041J299R87L52
55135H8238m10j093j454j380j100j028j290j467j020q0M45j59j410j950j032O21
55119G4431J648J529R33P08R80J351J535J414P45o00k003k291r69J037K290K245
55103H4983J458O14m4m56n80o29q57j015n50L89Q86M30l62o92n76l88m9N62Q73
55084H3997J59j285k237j752J22K603M526M832L366J170n34j446j858j756j115
$$ plain form
55069 88792 88247 87640 86949 87238 89252 91986 93361 92172 88971 85374 82961 82531 83808 85916 88324 90990
55053 90990 93517 94986 95115 94792 94703 94154 92224 89548 87815 87742 88553 89302 89753 90053 90528 91769 94041
55036 94041 96629 98572 99946 101553 103560 105563 107765 110663 113373 113824 111337 107831 105656 105158 105190
55021 105190 105172 105520 106455 107460 108064 108568 109775 112055 114663 116168 115851 114484 113271 112334 110948 108946
55005 108946 106878 104857 102445 99855 98072 97441 97279 97283 98044 99618 100882 101145 101173 101666 101902 101077 99877
54988 99877 99301 98806 97261 95232 94607 96060 98325 99995 100754 100837 100525 100350 100651 100735 99559 97460 96131
54971 96131 96540 97875 98887 99299 99441 99515 99905 101367 104011 106623 107822 107617 107113 106915 106596 105785 105025
54954 105025 105163 106247 107514 108385 108961 109371 109119 107710 105727 104507 104566 105082 105281 105555 106570 107871 108297
$$ packed form
55069H8792n45o07o91K89K014K734J375j189l201l597k413m30J277K108K408K666
55053I0990K527J469J29l23q9n49j930k676j733p3Q11P49M51L00M75J241K272
55036I4041K588J943J374J607K007K003K202K898K710M51k487l506k175m98L2
55021A05190j8L48R35J005O04N04J207K280K608J505l17j367j213r37j386k002
55005A08946k068k021k412k590j783o31j62MP61J574J264K63K8M93K36q25j200
54988I9877n76m95j545k029o25J453K265J670P59Q3l12j75L01Q4j176k099j329
54971I6131M09J335J012M12J42P4L90J462K644K612J199k05n04j98l19q11p60
54954A05025J38J084J267Q71N76M10k52j409j983j220N9N16J99K74J015J301M26
$$ plain form
54937 108297 107531 106491 106289 107431 109734 112323 113927 113984 113433 113682 114905 116134 116815 117284 117674 117480 116627
54920 116627 116002 116350 117219 117552 116905 115672 114517 113869 113672 113357 112459 111332 110745 110661 110103 108601 107136
54903 107136 107078 108562 110406 111436 111518 111461 112182 113854 115770 117154 117974 118550 118525 117025 114039 110914 109088
54886 109088 108909 110027 112206 115086 117650 118758 118082 116136 113682 111598 110877 111967 114101 115757 115860
54871 115860 114397 112229 110769 111446 114689 119351 123572 126280 127561 127899 127768 127919 129206 131708 134541
54856 134541 137015 139645 143450 148445 153398 157245 160183 162942 165357 166464 166176 166106 168002 171627 174853
54841 174853 175742 173955 170241 165525 160832 157129 154417 151462 147244 142465 138877 137202 136446 135343 133784
54826 133784 132488 131720 130837 129043 126386 123894 122712 123130 124527 126264 128274 130660 133167 135543 138066
$$ packed form
54937A08297p66j040k02J142K303K589J604N7n51K49J223J229O81M69L90j94q53
54920A16627o25L48Q69L33o47j233j155o48j97l15q98j127n87q4n58j502j465
54903A07136n8J484J844J030Q2n7P21J672J916J384Q20N76k5j500k986l125j826
54886A09088j79J118K179K880K564J108o76j946k454k084p21J090K134J656J03
54871A15860j463k168j460O77L243M662M221K708J281L38j31J51J287K502K833
54856A34541K474K630L805M995M953L847K938K759K415J107k88p0J896L625L226
54841A74853Q89j787l714m716m693l703k712k955m218m779l588j675p56j103j559
54826A33784j296p68q83j794k657k492j182M18J397J737K010K386K507K376K523
$$ plain form
54811 138066 141051 144002 146073 147551 149971 154260 159354 163456 166259 168997 172251 174745 174952 173256
54797 173256 171636 171251 171110 169433 165726 161030 156543 152642 149149 145866 142602 139215 135998 133627 132269
54782 132269 130983 128604 125235 122346 121204 121634 122549 123260 123749 123924 123355 121954 120405 119507 119391 119696
54766 119696 120181 120691 120832 120362 119842 120056 120694 120462 119008 117927 119016 121899 124302 124471 122570 119776
54750 119776 117028 114951 114144 114775 116252 117801 119290 121126 123418 125562 126722 126638 125907 125444 125615 125972
54734 125972 125919 125386 124609 123512 121800 119681 117975 117337 117672 118467 119423 120667 122558 125300 128519 131273
54718 131273 132800 133234 133228 133041 132542 132115 132791 135190 138822 142699 146179 148976 150892 152044 152962 154019
54702 154019 155016 155712 156585 158693 162822 168842 175626 181512 185259 186889 187338 187088 185582 182208 177460
$$ packed form
54811A38066K985K951K071J478K420M289N094M102K803K738L254K494K07j696
54797A73256j620l85j41j677l707m696m487l901l493l283l264l387l217k371j358
54782A32269j286k379l369k889j142M30R15P11M89J75n69j401j549q98j16L05
54766A19696M85N10J41m70n20K14O38k32j454j081J089K883K403J69j901k794
54750A19776k748k077q07O31J477J549J489J836K292K144J160q4p31m63J71L57
54734A25972n3n33p77j097j712k119j706o38L35P95R56J244J891K742L219K754
54718A31273J527M34oj87m99m27O76K399L632L877L480K797J916J152R18J057
54702A54019R97O96Q73K108M129O020O784N886L747J630M49k50j506l374m748
$$ plain form
54687 177460 172765 169483 168245 168628 169021 167465 163443 158512 154442 151051 146791 141368 136583 134237 134023
54672 134023 134241 134120 134607 136891 140731 144533 146833 147441 147242 147176 147591 148382 149462 150942 152995 155608
54656 155608 158501 161382 164328 167699 171478 174889 176997 177616 177383 177127 177473 178747 180577 181699 180878
54641 180878 178171 174777 171633 168792 166161 163956 162112 160030 157320 154241 151116 147994 145139 143029
54627 143029 141454 139516 137068 135244 134822 134976 134535 133621 132885 131890 129761 127159 126125 127668 130509 132443
54611 132443 132232 130086 127140 124673 123275 122566 121982 121516 121310 121113 120905 121578 123928 127296 130252 132330
54595 132330 133905 134633 133609 131157 128959 128033 128001 128745 131035 134539 136756 135596 132231 129778 129469 129613
54579 129613 128474 126813 126787 129012 131628 132358 130957 129179 128487 128523 128149 127335 127075 127765 128638 128951 128845
$$ packed form
54687A77460m695l282j238L83L93j556m022m931m070l391m260n423m785k346k14
54672A34023K18j21M87K284L840L802K300O08j99o6M15P91J080J480K053K613
54656A55608K893K881K946L371L779L411K108O19k33k56L46J274J830J122q21
54641A80878k707l394l144k841k631k205j844k082k710l079l125l122k855k110
54627A43029j575j938k448j824m22J54m41r14p36r95k129k602j034J543K841J934
54611A32443k11k146k946k467j398p09n84m66k06j97k08O73K350L368K956K078
54595A32330J575P28j024k452k198r26l2P44K290L504K217j160l365k453l09J44
54579A29613j139j661k6K225K616P30j401j778o92L6l74q14k60O90Q73L13j06
$$ plain form
54562 128845 128869 129482 131095 133639 135801 135830 133675 131414 130968 132269 134284 136635 139120 140637 140182 138551
54546 138551 137598 137813 137862 136621 134443 132160 130002 128171 127545 128870 131533 133843 134459 133252 131012 128805
54530 128805 127619 128093 130145 132802 134601 134472 132482 129815 127940 127608 128402 129204 129269 128987 129425 130914
54514 130914 132396 132640 131921 131847 133471 136204 138849 141030 143006 144513 144575 142632 139515 136995 136295 136997
54498 136997 137616 137392 137194 138238 140264 141773 142031 141898 142483 143863 145565 147445 149416 150920 151437 151153
54482 151153 150600 150040 149749 150347 152055 153918 154473 153077 150227 147093 145299 146436 150642 155798 159133
54467 159133 159707 158740 157720 157030 156356 155441 154205 152774 151522 150529 149035 146246 142785 140512 140494 141740
54451 141740 142293 141192 139151 137685 137780 139106 140423 140973 141301 142301 143788 144805 145117 145350 145616 145194
$$ packed form
54562A28845K4O13J613K544K162K9k155k261m46J301K015K351K485J517m55j631
54546A38551r53K15M9j241k178k283k158j831o26J325K663K310O16j207k240k207
54530A28805j186M74K052K657J799j29j990k667j875l32P94Q02O5k82M38J489
54514A30914J482K44p19p4J624K733K645K181J976J507O2j943l117k520p00P02
54498A36997O19k24j98J044K026J509K58j33N85J380J702J880J971J504N17k84
54482A51153n53n60k91N98J708J863N55j396k850l134j794J137M206N156L335
54467A59133N74r67j020o90o74r15j236j431j252r93j494k789l461k273j8J246
54451A41740N53j101k041j466R5J326J317N50L28J000J487J017L12K33K66m22
$$ plain form
54435 145194 144074 143687 145225 147883 149676 149651 148559 147621 147406 147916 149114 151075 153725 156455 158101 157761
54419 157761 155817 153777 152762 152505 152053 151065 150124 150156 151830 154946 157953 158732 156659 153549 151857 152242
54403 152242 153689 155562 158170 161238 163294 163434 162727 162834 163726 163884 162579 160849 159967 159971 160292 161032 162537
54386 162537 163969 163601 161055 158440 158349 160902 163568 163965 162124 159758 158008 156656 155221 153916 153199
54371 153199 152879 152330 151590 151722 153637 156675 158874 158944 157711 157190 158353 160237 161225 160681 159181 157716
54355 157716 157111 157871 159903 162273 163671 163445 162210 161389 162176 164721 168036 170634 171476 170567 168776 167127
54339 167127 166203 166091 166709 168108 170377 173348 176509 179267 181236 182182 181882 180267 177662 174751 172339
54324 172339 171194 171742 173614 175736 177344 178710 180318 181659 181724 180662 179849 179910 179688 177852 174754 171831
$$ packed form
54435A45194j120l87J538K658J793k5j092r38k15N10J198J961K650K730J646l40
54419A57761j944k040j015k57m52r88r41L2J674L116L007P79k073l110j692L85
54403A52242J447J873K608L068K056J40p07J07Q92J58j305j730q82ML21P40J505
54386A62537J432l68k546k615r1K553K666L97j841k366j750j352j435j305p17
54371A53199l20n49p40J32J915L038K199P0j233n21J163J884R88n44j500j465
54355A57716o05P60K032K370J398k26j235q21P87K545L315K598Q42r09j791j649
54339A67127r24j12O18J399K269K971L161K758J969R46l00j615k605k911k412
54324A72339j145N48J872K122J608J366J608J341O5j062q13O1k22j836l098k923
$$ plain form
54308 171831 169912 169070 169489 171130 172815 173127 172372 172349 173788 175345 175786 175879 176974 178606 179028 177890 176964
54291 176964 177921 180413 182848 184285 184886 184935 184277 182958 181920 182533 185300 189258 192933 195850 198797 202622
54275 202622 207192 211680 215428 218226 220115 221371 222379 223036 222603 220699 218189 216348 215262 213861 211541
54260 211541 208851 206376 203885 201084 198387 196218 194261 192212 190705 190519 191224 191703 191801 192276 192981 192361
54244 192361 189400 185183 181786 180117 179454 178585 176718 173755 170539 168627 168936 170568 171705 171736 171792 172966
54228 172966 174739 175686 175279 174416 174370 175698 177993 180177 180947 179492 176205 172643 170450 170117 170786 171302
54212 171302 171457 172026 173565 175469 176599 176757 177002 178222 179863 180649 180443 180748 183069 187093 190872 192668
54196 192668 192330 190931 189410 187831 185881 183853 182915 184200 187576 191379 193581 193301 191129 188108 184742
$$ packed form
54308A71831j919q42M19J641J685L12p55k3J439J557M41R3J095J632M22j138r26
54291A76964R57K492K435J437O01M9o58j319j038O13K767L958L675K917K947L825
54275B02622M570M488L748K798J889J256J008O57m33j904k510j841j086j401k320
54260B11541k690k475k491k801k697k169j957k049j507j86P05M79R8M75P05o20
54244A92361k961m217l397j669o63q69j867k963l216j912L09J632J137L1N6J174
54228A72966J773R47m07q63m6J328K295K184P70j455l287l562k193l33O69N16
54212A71302J55N69J539J904J130J58K45J220J641P86k06L05K321M024L779J796
54196A92668l38j399j521j579j950k028r38J285L376L803K202k80k172l021l366
$$ plain form
54181 184742 181148 177810 175548 174662 174542 174531 174925 176626 179738 182924 184446 183719 181685 179875 179292 179970
54165 179970 181062 181337 180075 177819 176002 175541 176060 176851 178206 181057 185263 189137 191221 192007 193207
54150 193207 195561 198071 199307 198777 196978 194877 193690 194310 196203 197310 195945 192693 189692 188138 187418
54135 187418 186830 186997 188717 191231 192833 193007 192825 193060 192972 191455 188581 185382 182756 181251 181248 182297 182736
54118 182736 181214 178627 177360 178358 180106 180938 181145 181912 183206 184012 184169 184608 185874 187493 188832 189553
54102 189553 189117 186996 183785 181140 180023 179658 178716 176924 174936 173202 171682 170340 169309 168730 168838
54087 168838 169951 171940 174037 175587 176687 177611 178046 177599 176799 176731 177664 178835 179769 181036 183190 185477
54071 185477 186295 184964 182558 180807 180501 181296 182867 185492 189140 192540 194093 193613 192377 191342 190191
$$ packed form
54181A84742l594l338k262q86j20j1L94J701L112L186J522p27k034j810n83O78
54165A79970J092K75j262k256j817m61N19P91J355K851M206L874K084P86J200
54150A93207K354K510J236n30j799k101j187O20J893J107j365l252l001j554p20
54135A87418n88J67J720K514J602J74j82K35q8j517k874l199k626j505lJ049M39
54118A82736j522k587j267R98J748Q32K07P67J294Q06J57M39J266J619J339P21
54102A89553m36k121l211k645j117l65r42j792j988j734j520j342j031n79J08
54087A68838J113J989K097J550J100R24M35m47q00o8R33J171R34J267K154K287
54071A85477Q18j331k406j751l06P95J571K625L648L400J553m80j236j035j151
$$ plain form
54056 190191 188482 186689 185443 184556 183766 183776 185473 188447 191417 193887 196294 198580 199873 199728 198607
54041 198607 196885 194477 191818 190066 189719 189935 189882 189863 190325 190707 190365 190047 191157 193702 196026 196688 195769
54024 195769 194289 193118 192680 193059 194041 195363 196995 198895 200551 201285 201113 200908 201620 203636 206753 210209
54008 210209 212762 213464 212686 211959 212548 214527 217347 220654 224163 227300 229690 231754 234218 236997 239139
53993 239139 240000 240168 241065 243755 248121 252955 256865 259320 261008 263248 267163 273342 281676 291043 299493
53978 299493 305689 310341 315568 322566 330536 338246 345672 353204 359877 363915 365288 366491 369968 375450
53964 375450 380602 383887 385974 388462 392059 396118 399309 400466 399314 396807 394650 394125 395229 396849
53950 396849 397680 397096 395365 393017 389880 384937 377474 368195 358691 349835 341342 332962 325299 318889 313148
$$ packed form
54056A90191j709j793j246q87p90J0J697K974K970K470K407K286J293j45j121
54041A98607j722k408k659j752l47K16n3j9M62L82l42l18J110K545K324O62r19
54024A95769j480j171m38L79R82J322J632J900J656P34j72k05P12K016L117L456
54008B10209K553P02p78p27N89J979K820L307L509L137K390K064K464K779K142
53993B39139Q61J68Q97K690M366M834L910K455J688K240L915O179Q334R367Q450
53978B99493O196M652N227O998P970P710P426P532O673M038J373J203L477N482
53964C75450N152L285K087K488L597M059L191J157j152k507k157n25J104J620
53950C96849Q31n84j731k348l137m943p463r279r504q856q493q380p663o410n741
$$ plain form
53935 313148 307098 300824 295309 290847 286649 282291 278630 276528 275261 273255 270198 267385 265667 264010
53921 264010 260844 256386 252767 251852 253472 255906 257601 258333 259098 261050 264244 267255 268371 267361 265779
53906 265779 265307 266110 267076 267315 267011 266906 267291 267609 267026 265448 263797 262872 262125 260384 257991 257210 259785
53889 259785 264765 269693 273412 276601 279889 282856 285171 287560 291092 296218 302893 310895 319515 327612
53875 327612 334582 340893 347240 353669 360008 366609 374026 382215 390664 399097 407573 416007 424023 431279
53861 431279 437696 443525 449353 455785 462881 470155 477309 484595 492156 499397 505435 509969 513442 516527
53847 516527 519521 521810 521929 518914 513951 509771 507712 506111 502409 496134 488791 481535 474419 467595
53833 467595 461631 456296 450448 443600 436557 430006 423516 416548 409500 403014 396987 391041 385302 379941
$$ packed form
53935C13148o050o274n515m462m198m358l661k102j267k006l057k813j718j657
53921B64010l166m458l619r15J620K434J695P32P65J952L194L011J116j010j582
53906B65779m72Q03R66K39l04j05L85L18n83j578j651r25p47j741k393p81K575
53889B59785M980M928L719L189L288K967K315K389L532N126O675Q002Q620Q097
53875C27612O970O311O347O429O339O601P417Q189Q449Q433Q476Q434Q016P256
53861D31279O417N829N828O432P096P274P154P286P561P241O038M534L473L085
53847E16527K994K289J19l015m963m180k059j601l702o275p343p256p116o824
53833D67595n964n335n848o848p043o551o490o968p048o486o027n946n739n361
$$ plain form
53819 379941 374545 368859 363774 360687 360033 361074 362899 364970 367039 369333 372685 377670 383732 389850
53805 389850 395966 402873 410745 418608 425253 429736 430918 427719 420350 410392 399150 386883 374256
53792 374256 363347 355870 351026 346460 341137 336020 332064 328988 326339 324447 323621 323332 322955 322666 322859
53777 322859 323267 323375 323314 323588 324193 324693 324861 324629 323619 321426 318195 314354 310013 305344 301224 298566
53761 298566 297032 295404 293398 292156 292695 294722 297421 300466 303742 306919 310121 314282 319826 325495
53747 325495 329586 332184 335076 339357 344174 348242 351720 355848 361156 366845 371874 376103 380093 384106
53733 384106 387652 390064 391277 391878 392434 392954 392993 392105 390272 387998 385961 384287 382299 379416 376206 373829
53717 373829 372205 369539 364305 357216 350387 344880 340020 335074 330419 326501 322511 317077 310075 302942
$$ packed form
53819C79941n396n686n085l087o54J041J825K071K069K294L352M985O062O118
53805C89850O116O907P872P863O645M483J182l199p369r958j1242j2267j2627
53792C74256j0909p477m844m566n323n117l956l076k649j892q26k89l77k89J93
53777C22859M08J08o1K74O05N00J68k32j010k193l231l841m341m669m120k658
53761B98566j534j628k006j242N39K027K699L045L276L177L202M161N544N669
53747C25495M091K598K892M281M817M068L478M128N308N689N029M229L990M013
53733C84106L546K412J213O01N56N20L9q88j833k274k037j674j988k883l210k377
53717C73829j624k666n234p089o829n507m860m946m655l918l990n434p002p133
$$ plain form
53703 302942 297054 292368 288037 283888 280681 278965 278308 277931 277625 277596 277763 277841 278006 278727 279889 280753 281020
53686 281020 281228 281753 282103 281745 280974 280240 279213 277442 275659 275376 277105 279836 282465 284957 287779 290911
53670 290911 293965 296932 300267 304211 308307 311679 313868 315432 317394 319960 322172 323233 323777 325143
53656 325143 327697 330752 333939 337579 341486 344570 346353 348086 351481 356730 362477 367437 371389 374793
53642 374793 378140 381670 385187 388116 390151 391853 394267 397953 402682 408012 413695 419346 424024 426471
53628 426471 425970 423115 419627 417059 415493 413832 411481 409207 407880 406979 405266 402777 401075 401209 402305
53613 402305 402745 402065 400873 399315 396773 393307 390509 390199 392502 395722 398009 398782 398589 398133 397757 397502
53597 397502 397182 396380 394777 392808 391818 393057 396192 399082 399608 397949 396633 397945 401572 405267 407515
$$ packed form
53703C02942n888m686m331m149l207j716o57l77l06k9J67P8J65P21J162Q64K67
53686B81020K08N25L50l58p71p34j027j771j783k83J729K731K629K492K822L132
53670B90911L054K967L335L944M096L372K189J564J962K566K212J061N44J366
53656C25143K554L055L187L640L907L084J783J733L395N249N747M960L952L404
53642C74793L347L530L517K929K035J702K414L686M729N330N683N651M678K447
53628D26471n01k855l488k568j566j661k351k274j327r01j713k489j702J34J096
53613D02305M40o80j192j558k542l466k798l10K303L220K287P73j93m56l76k55
53597C97502l20q02j603j969r90J239L135K890N26j659j316J312L627L695K248
$$ plain form
53582 407515 408733 409901 411143 412291 413937 416849 420690 424324 427409 430704 434622 438440 441409 443911
53568 443911 446920 450794 455164 459583 463696 467182 470316 474429 480957 489792 499133 507239 513950 520402
53554 520402 527721 536159 545022 552982 558767 562028 563577 564690 566331 569087 573210 578140 582358 584536
53540 584536 584992 585410 586987 589366 591538 593166 594609 596127 597562 598509 598421 596942 594604 592794 592353 592487
53524 592487 591779 590089 588738 588852 590222 591740 592148 590400 586223 580610 575048 570072 565375 561349 559246
53509 559246 559228 559444 558037 555278 552757 551169 549963 548631 547207 545844 545020 545955 549684 555672 562235
53494 562235 568214 573390 577478 580055 581670 583904 587826 593183 599457 606895 615999 626609 638000 649563
53480 649563 661164 673159 686073 699745 712924 724483 735211 747605 763607 783108 804761
$$ packed form
53582D07515J218J168J242J148J646K912L841L634L085L295L918L818K969K502
53568D43911L009L874M370M419M113L486L134M113O528Q835R341Q106O711O452
53554E20402P319Q438Q863P960N785L261J549J113J641K756M123M930M218K178
53540E84536M56M18J577K379K172J628J443J518J435R47q8j479k338j810m41J34
53524E92487p08j690j351J14J370J518M08j748m177n613n562m976m697m026k103
53509E59246j8K16j407k759k521j588j206j332j424j363q24R35L729N988O563
53494E62235N979N176M088K577J615K234L922N357O274P438R104J0610J1391J1563
53480F49563J1601J1995J2914J3672J3179J1559J0728J2394J6002J9501K1653
$$ plain form
53469 804761 827308 849798 871483 892328 913219 935103 958285 982794 1008845 1036416 1064875
53458 1064875 1093644 1123024 1153966 1187242 1223054 1261097 1300705 1341176 1382074 1422946 1462806
53447 1462806 1500561 1536136 1570674 1605399 1640756 1676615 1712560 1747757 1781449 1814023 1846874
53436 1846874 1880790 1915020 1948294 1980051 2010404 2039693 2068571 2097651 2126542 2154006 2179665
53425 2179665 2204725 2230295 2255774 2279644 2301147 2320356 2337297 2351886 2364135 2373520 2378734 2378994
53413 2378994 2375130 2368560 2359674 2347951 2332994 2314632 2292820 2268543 2244143 2221456 2200064 2178352
53401 2178352 2155586 2131716 2105967 2077313 2046020 2013218 1979418 1945117 1912337 1883332 1857658
53390 1857658 1832624 1807049 1782640 1761087 1741853 1723859 1707578 1694045 1683029 1673541 1665374 1659067
$$ packed form
53469H04761K2547K2490K1685K0845K0891K1884K3182K4509K6051K7571K8459
53458A064875K8769K9380L0942L3276L5812L8043L9608M0471M0898M0872L9860
53447A462806L7755L5575L4538L4725L5357L5859L5945L5197L3692L2574L2851
53436A846874L3916L4230L3274L1757L0353K9289K8878K9080K8891K7464K5659
53425B179665K5060K5570K5479K3870K1503J9209J6941J4589J2249R385N214K60
53413B378994l864o570q886j1723j4957j8362k1812k4277k4400k2687k1392k1712
53401B178352k2766k3870k5749k8654l1293l2802l3800l4301l2780k9005k5674
53390A857658k5034k5575k4409k1553j9234j7994j6281j3533j1016r488q167o307
$$ plain form
53378 1659067 1655033 1653495 1654569 1657728 1661992 1667234 1674393 1683882 1695047 1707963 1724217 1744556 1767044
53365 1767044 1789304 1811748 1836739 1865071 1895319 1926667 1960389 1997837 2038391 2080436 2123562
53354 2123562 2168902 2217519 2269133 2322591 2377421 2434618 2495557 2560222 2627216 2695730 2766642
53343 2766642 2841041 2918460 2997487 3077519 3158866 3241583 3325334 3410111 3495926 3581936 3667016
53332 3667016 3751043 3834322 3915780 3993211 4065668 4134208 4199720 4261264 4317345 4367639 4412411
53321 4412411 4451166 4483078 4508201 4527065 4539369 4544141 4541117 4530985 4514146 4490041 4457919 4417693
53309 4417693 4369818 4314726 4252600 4183631 4108621 4029525 3948939 3868520 3788128 3707124 3626152
53298 3626152 3546764 3469438 3393252 3317843 3244425 3173924 3105080 3035881 2966638 2900241 2838956
$$ packed form
53378A659067m034j538J074L159M264N242P159R489J1165J2916J6254K0339K2488
53365A767044K2260K2444K4991K8332L0248L1348L3722L7448M0554M2045M3126
53354B123562M5340M8617N1614N3458N4830N7197O0939O4665O6994O8514P0912
53343B766642P4399P7419P9027Q0032Q1347Q2717Q3751Q4777Q5815Q6010Q5080
53332C667016Q4027Q3279Q1458P7431P2457O8540O5512O1544N6081N0294M4772
53321D412411L8755L1912K5123J8864J2304M772l024j0132j6839k4105l2122m0226
53309D417693m7875n5092o2126o8969p5010p9096q0586q0419q0392q1004q0972
53298C626152p9388p7326p6186p5409p3418p0501o8844o9199o9243o6397o1285
$$ plain form
53287 2838956 2782009 2726905 2672268 2618508 2566358 2515964 2467474 2421502 2378460 2337985 2299545
53276 2299545 2263300 2229839 2199197 2170482 2142537 2114742 2087345 2061395 2038249 2018613 2001759
53265 2001759 1985915 1969668 1952950 1936617 1921323 1907079 1893748 1881632 1871422 1863720 1858724 1856333
53253 1856333 1856472 1859223 1864540 1871938 1880659 1890293 1901166 1913981 1929262 1947305 1968416 1992721 2019658
53240 2019658 2048178 2077764 2108967 2142529 2178140 2214468 2250404 2285895 2321463 2357259 2392724
53229 2392724 2426851 2458594 2487233 2512606 2534818 2553577 2568037 2577568 2582501 2583802 2582100 2577343
53217 2577343 2569271 2557665 2541985 2521279 2495040 2464162 2430640 2396079 2360571 2323175 2283444
53206 2283444 2242184 2200591 2158917 2116444 2072759 2028519 1984649 1941209 1897593 1853661 1810024
$$ packed form
53287B838956n6947n5104n4637n3760n2150n0394m8490m5972m3042m0475l8440
53276B299545l6245l3461l0642k8715k7945k7795k7397k5950k3146j9636j6854
53265B001759j5844j6247j6718j6333j5294j4244j3331j2116j0210p702m996k391
53253A856333J39K751N317P398Q721R634J0873J2815J5281J8043K1111K4305K6937
53240B019658K8520K9586L1203L3562L5611L6328L5936L5491L5568L5796L5465
53229B392724L4127L1743K8639K5373K2212J8759J4460R531M933J301j702m757
53217B577343q072j1606j5680k0706k6239l0878l3522l4561l5508l7396l9731
53206B283444m1260m1593m1674m2473m3685m4240m3870m3440m3616m3932m3637
$$ plain form
53195 1810024 1767143 1724743 1682424 1640464 1599589 1560138 1521745 1483811 1446055 1408605 1371760
53184 1371760 1335742 1300715 1267105 1235695 1207082 1180988 1156558 1133463 1112208 1093049 1075141
53173 1075141 1057524 1040579 1025452 1011965 998089 982058 964219 946070 928146 909869 891205
53162 891205 873219 856612 840555 823452 804369 783425 761541 740375 721858 706819 694131
53151 694131 681779 668638 654693 639943 624144 607744 592106 578301 566170 554922 544129
53140 544129 533797 523876 514153 504325 493973 482937 472063 463000 456615 451896 446971 440989 434538
53127 434538 428452 422944 417816 412854 407845 402733 397944 394212 391853 390462 389389 388298 387174 386050
53113 386050 384854 383393 381442 379035 376660 375016 374465 374737 375151 375115 374619 374267 374601 375291 375367 374433 373133
$$ packed form
53195A810024m2881m2400m2319m1960m0875l9451l8393l7934l7756l7450l6845
53184A371760l6018l5027l3610l1410k8613k6094k4430k3095k1255j9159j7908
53173A075141j7617j6945j5127j3487j3876j6031j7839j8149j7924j8277j8664
53162H91205j7986j6607j6057j7103j9083k0944k1884k1166j8517j5039j2688
53151F94131j2352j3141j3945j4750j5799j6400j5638j3805j2131j1248j0793
53140E44129j0332r921r723r828j0352j1036j0874r063o385m719m925n982o451
53127D34538o086n508n128m962n009n112m789l732k359j391j073j091j124j124
53113C86050j196j461j951k407k375j644n51K72M14l6m96l52L34O90P6r34j300
$$ plain form
53096 373133 372025 370473 367420 363088 359155 357109 356902 357351 357394 356823 356194 356173 356743 357056 356384 355249 355148
53079 355148 356969 359898 362084 362303 360936 359398 358559 357739 355580 351945 348432 346642 346511 346954 347544 348587
53063 348587 349847 350398 349893 349057 348691 349025 350198 352404 355142 357174 357746 357275 356414 355200 353512 351619
53047 351619 349663 347428 345277 344518 345796 347637 347664 345100 341190 337433 334380 332065 330444 329031 326978
53032 326978 324030 320930 318647 317704 318421 321021 324909 328433 330137 330127 329667 329573 329601 329372 329139 329260 329375
53015 329375 328689 327002 325093 324047 324316 325356 325926 324997 322707 320368 319170 318953 318689 318066 317904 318956
52999 318956 321079 323862 327152 330407 332388 332454 331678 331701 332820 334111 335029 335705 335841 334586 331864 328853
52983 328853 326860 326263 326509 326296 323924 318796 312796 308994 308494 309575 310271 310355 310178 309123 306635 303844
$$ packed form
53096C73133j108j552l053m332l933k046k07M49M3n71o29k1N70L13o72j135j01
53079C55148J821K929K186K19j367j538q39q20k159l635l513j790j31M43N90J043
53063C48587J260N51n05q36l66L34J173K206K738K032N72m71q61j214j688j893
53047C51619j956k235k151p59J278J841K7k564l910l757l053k315j621j413k053
53032C26978k948l100k283r43P17K600L888L524J704j0m60r4K8k29k33J21J15
53015C29375o86j687j909j046K69J040N70r29k290k339j198k17k64o23j62J052
52999C18956K123K783L290L255J981O6p76K3J119J291R18O76J36j255k722l011
52983C28853j993n97K46k13k372n128o000l802n00J081O96Q4j77j055k488k791
$$ plain form
52967 303844 302641 303532 305474 307402 308839 309377 308819 307820 307414 307836 308518 309121 309788 310421 310497 309699 308263
52950 308263 306735 305811 306108 307579 309423 311096 312946 315213 316969 317026 315554 313778 312316 310953 309841
52935 309841 309568 309993 310354 310893 312918 316538 319599 319995 318278 316862 317064 318057 318479 317877 316324 313682
52919 313682 310024 306406 304362 304459 305724 306859 307793 309586 312780 316428 319217 321251 324040 328632 334202
52904 334202 338720 340759 340466 339057 337787 337397 338128 339731 341399 342226 342151 342204 343239 344523 344316 341976
52888 341976 338786 336364 334935 333652 331932 329801 327368 324712 322132 319909 317970 316183 314660 313343
52874 313343 311774 309873 308470 308305 308856 308923 308128 306981 305842 304833 304575 305808 308059 309712 309714 308440
52858 308440 306615 304268 301242 298068 295741 294911 295509 296821 297843 298025 297804 297952 298443 298566 298123 297656
$$ packed form
52967C03844j203Q91J942J928J437N38n58r99m06M22O82O03O67O33P6p98j436
52950C08263j528r24K97J471J844J673J850K267J756N7j472j776j462j363j112
52935C09841k73M25L61N39K025L620L061L96j717j416K02R93M22o02j553k642
52919C13682l658l618k044R7J265J135R34J793L194L648K789K034K789M592N570
52904C34202M518K039k93j409j270l90P31J603J668Q27p5N3J035J284k07k340
52888C41976l190k422j429j283j720k131k433k656k580k223j939j787j523j317
52874C13343j569j901j403j65N51O7p95j147j139j009k58J233K251J653Kj274
52858C08440j825k347l026l174k327q30N98J312J022J82k21J48M91J23m43m67
$$ plain form
52842 297656 297359 296738 295778 295489 296550 298107 298801 298502 298146 298102 297805 297104 296979 298289 300396 301858 302406
52825 302406 303408 305971 309161 310818 309968 307685 305531 303987 302788 302001 302084 303334 305793 309227 312630
52810 312630 314387 313810 312135 311140 311215 311633 312127 312837 312955 311067 307219 303420 301587 301898 303410 305135
52794 305135 305993 304971 302283 299741 299084 300240 301766 302476 302217 301615 301655 303033 305293 306935 306834 305230
52778 305230 303009 300614 298223 296371 295482 294997 293860 291947 290341 289963 290381 290365 289350 287905 286778 285958
52762 285958 285112 284523 284809 285688 286050 285649 285656 286756 287740 287254 286076 286025 287042 287240 285902 284520 284407 285040
52744 285040 285549 286241 287614 289132 290185 291253 292932 294523 294713 293211 290840 288508 286775 285856 285235
52729 285235 283835 281325 278804 277592 277844 278863 280039 280840 280682 279650 278765 278813 279493 280272 281236 282385
$$ packed form
52842B97656k97o21r60k89J061J557O94k99l56m4k97p01j25J310K107J462N48
52825C02406J002K563L190J657q50k283k154j544j199p87Q3J250K459L434L403
52810C12630J757n77j675r95P5M18M94P10J18j888l848l799j833L11J512J725
52794C05135Q58j022k688k542o57J156J526P10k59o02M0J378K260J642j01j604
52778C05230k221k395k391j852q89m85j137j913j606l78M18j6j015j445j127q20
52762B85958q46n89K86Q79L62m01PJ100R84m86j178n1J017J98j338j382j13O33
52744B85040N09O92J373J518J053J068J679J591J90j502k371k332j733r19o21
52729B85235j400k510k521j212K52J019J176Q01j58j032q85M8O80P79R64J149
$$ plain form
52713 282385 283014 282697 281968 281099 279238 276075 273389 273348 275814 278725 280658 281563 281524 280527 279357 279114 279752
52696 279752 280329 280596 280968 281146 280468 279739 280980 284776 289281 292420 293882 294393 294335 293937 293833 294544 295992
52679 295992 298045 300838 303995 306298 306878 306317 306092 307248 309834 313094 315967 317901 319375 321060 322506
52664 322506 322571 321315 320324 320597 321168 320573 318834 316978 315285 313197 310779 309149 309158 310325 311402 311735 311785
52647 311785 312371 313428 313674 311777 307898 303771 301136 300351 300532 300592 299957 298690 297281 296162 295264 294247
52631 294247 293239 293007 294252 296952 300477 304082 307281 309988 312319 313984 314125 312324 309687 308195 308724
52616 308724 310265 311231 310953 309640 307634 305322 303325 302123 301630 301498 301601 301856 301905 301490 301071 301583 303583
52599 303583 306917 311140 315860 320592 324639 327520 329484 331282 333164 334326 333821 332048 330806 331447 333405
$$ packed form
52713B82385O29l17p29q69j861l163k686m1K466K911J933R05l9r97j170k43O38
52696B79752N77K67L72J78o78p29J241L796M505L139J462N11n8l98j04P11J448
52679B95992K053K793L157K303N80n61k25J156K586L260K873J934J474J685J446
52664C22506O5j256r91K73N71n95j739j856j693k088k418j630RJ167J077L33N0
52647C11785N86J057K46j897l879m127k635p85J81O0o35j267j409j119q98j017
52631B94247j008k32J245K700L525L605L199K707K331J665J41j801k637j492N29
52616C08724J541R66k78j313k006k312j997j202m93j32J03K55M9m15m19N12K000
52599C03583L334M223M720M732M047K881J964J798J882J162n05j773j242O41J958
$$ plain form
52584 333405 335009 335389 334859 333716 331713 329038 326959 326796 328482 330624 331809 331545 330158 328286 326743
52569 326743 326580 328742 333261 338917 344082 348011 351004 353392 355007 355857 356481 357084 356941 355392 352892
52554 352892 350249 347383 343916 340674 339241 339878 340960 340901 339793 338802 338714 339457 340465 341073 340935 340335 339805
52537 339805 339425 338867 337984 336836 335355 333755 333072 334295 336878 339024 339656 339262 338726 338336 338160 338321 338484
52520 338484 338054 337341 337527 338925 340272 340455 340056 340376 341733 343517 345252 346681 347318 346853 345783 344947
52504 344947 344617 344386 343610 341718 338790 336145 335482 336791 337956 337223 335284 334086 334295 335013 335411 335469 335440
52487 335440 335638 336501 337916 338763 338137 336734 336018 336212 336264 335676 335143 335280 335822 336372 336893 337116 336437 334867
52469 334867 333330 332536 332230 331993 332085 332962 334573 336765 339720 343138 345416 344871 342038 339794 340443 343061
$$ packed form
52584C33405J604L80n30j143k003k675k079j63J686K142J185k64j387j872j543
52569C26743j63K162M519N656N165L929K993K388J615Q50O24O03j43j549k500
52554C52892k643k866l467l242j433O37J082n9j108r91q8P43J008O08j38o00n30
52537C39805l80n58q83j148j481j600o83J223K583K146O32l94n36l90j76J61J63
52520C38484m30p13J86J398J347J83l99L20J357J784J735J429O37m65j070q36
52504C44947l30k31p76j892k928k645o63J309J165p33j939j198K09P18L98N8k9
52487C35440J98Q63J415Q47o26j403p16J94N2n88n33J37N42N50N21K23o79j570
52469C34867j537p94l06k37R2Q77J611K192K955L418K278n45k833k244O49K618
$$ plain form
52453 343061 344491 342903 339641 337430 337547 339359 341971 345178 348828 352313 355197 357681 359930 361477
52439 361477 361824 361344 361072 361641 362653 363023 362016 360251 359493 360805 362988 363716 362288 360230 358909 357902
52423 357902 356433 355145 355126 356011 356444 356037 355581 355579 355739 355812 355876 355821 355586 355850 357426 359893 361818 362571 363115
52404 363115 364756 367705 371000 373285 373769 373141 373426 376120 380441 384170 386117 386817 386979 386490 385238 383740
52388 383740 382358 380735 378635 376609 375271 374436 373513 372283 370828 369132 367215 365395 364071 363429 363458
52373 363458 363894 364130 363690 362896 362548 362836 363188 363341 363886 365456 368026 371341 375415 380139 384877 388985
52357 388985 392503 396100 400537 406255 412929 419404 424732 429545 435718 444248 454067 463367 471478 478882
52343 478882 485845 491721 495377 495833 492798 487041 480036 472918 465955 459094 452540 446484 440805 435546
$$ packed form
52453C43061J430j588l262k211J17J812K612L207L650L485K884K484K249J547
52439C61477L47m80k72N69J012L70j007j765p58J312K183P28j428k058j321j007
52423C57902j469j288j9Q85M33m07m56kJ60P3O4n5k35K64J576K467J925P53N44
52404C63115J641K949L295K285M84o28K85K694M321L729J947P00J62m89j252j498
52388C83740j382j623k100k026j338q35r23j230j455j696j917j820j324o42K9
52373C63458M36K36m40p94l48K88L52J53N45J570K570L315M074M724M738M108
52357C88985L518L597M437N718O674O475N328M813O173Q530R819R300Q111P404
52343D78882O963N876L656M56l035n757p005p118o963o861o554o056n679n259
$$ plain form
52329 435546 431299 428618 427375 427111 427712 429205 431163 432821 433743 434097 434544 436113 439753 445426 451802
52314 451802 457295 461363 464602 467886 471828 476816 483149 491038 500480 510850 520745 528911 535572 542135
52300 542135 549171 555528 560092 563616 567754 572840 577953 582976 589221 597645 607488 617209 626078 634481
52286 634481 643344 653818 666923 682753 700240 718202 736574 756187 777414 799529 821618 843844
52274 843844 867503 893833 922998 954334 987226 1021285 1055785 1089680 1122605 1155391 1189046
52263 1189046 1223532 1258094 1292529 1327262 1362005 1395045 1424347 1449189 1470560 1490190 1509196
52252 1509196 1527286 1543006 1555028 1563414 1569464 1574289 1577823 1579388 1578757 1576191 1571670 1564840 1556072
52239 1556072 1547069 1539773 1534606 1530324 1525812 1521439 1518087 1515412 1512237 1508766 1507202 1509425 1514855 1521494
$$ packed form
52329D35546m247k681j243k64O01J493J958J658R22L54M47J569L640N673O376
52314D51802N493M068L239L284L942M988O333P889R442J0370R895Q166O661O563
52300E42135P036O357M564L524M138N086N113N023O245Q424R843R721Q869Q403
52286F34481Q863J0474J3105J5830J7487J7962J8372J9613K1227K2115K2089K2226
52274H43844K3659K6330K9165L1336L2892L4059L4500L3895L2925L2786L3655
52263A189046L4486L4562L4435L4733L4743L3040K9302K4842K1371J9630J9006
52252A509196J8090J5720J2022Q386O050M825L534J565o31k566m521o830q768
52239A556072r003p296n167m282m512m373l352k675l175l471j564K223N430O639
$$ plain form
52225 1521494 1528420 1536234 1545526 1556364 1569233 1585000 1603340 1622374 1640682 1658839 1678175 1698723
52213 1698723 1719386 1739616 1759751 1779814 1798945 1816249 1831513 1845011 1857105 1867996 1877160
$$ packed form
52225A521494O926P814R292J0838J2869J5767J8340J9034J8308J8157J9336K0548
52213A698723K0663K0230K0135K0063J9131J7304J5264J3498J2094J0891R164
$$ [...]
##END NTUPLES=NMR SPECTRUM
##END=
