
##TITLE=AC1173_Tolima-ibage-TDOAH12007_5898460_lYcPF7r5ge
##JCAMPDX= 6.0         $$ Bruker NMR JCAMP-DX V2.0
##DATA TYPE= NMR SPECTRUM
##DATA CLASS= NTUPLES
##ORIGIN= BRUKER
##OWNER= Administrator
$$ 1.72 TOPSPIN		Version 2.1
$$ 2012-04-03 21:16:02.109 -0500  Administrator@TOPSPIN
$$ Compression mode = diff/dup
##.OBSERVE FREQUENCY= 400.13188235
##.OBSERVE NUCLEUS= ^1H
##.ACQUISITION MODE= SIMULTANEOUS (DQD)
##.ACQUISITION SCHEME= undefined
##.AVERAGES= 8
##.DIGITISER RES= 22
##SPECTROMETER/DATA SYSTEM= spect
##.PULSE SEQUENCE= zg30
##.SOLVENT NAME= COFFEE_meoh
##.SHIFT REFERENCE= INTERNAL, COFFEE_meoh, 1, 14.98061
##AUDIT TRAIL= $$ (NUMBER, WHEN, WHO, WHERE, PROCESS, VERSION, WHAT)
$$ ##TITLE= Audit trail, TOPSPIN		Version 2.1
$$ ##JCAMPDX= 5.01
$$ ##ORIGIN= Bruker BioSpin GmbH
$$ ##OWNER= Administrator
$$ $$ C:\Bruker\TOPSPIN/data/COFFEE/nmr/AC1173_Tolima-ibage-TDOAH12007_5898460_lYcPF7r5ge/10/pdata/1/auditp.txt
$$ ##AUDIT TRAIL=  $$ (NUMBER, WHEN, WHO, WHERE, PROCESS, VERSION, WHAT)
(   1,<2012-04-03 21:15:55.015 -0500>,<Administrator>,<TOPSPIN>,<go>,<TOPSPIN 2.1>,
      <created by zg
	started at 2012-04-03 21:14:47.671 -0500,
	POWCHK enabled, PULCHK disabled,
       configuration hash MD5:
       1A 1E CE 29 27 FD 77 03 67 4E F0 E3 C4 B2 CB 90
       data hash MD5: 64K
       0B 3C 89 11 95 BA 4C 11 91 84 30 5D 49 B8 43 9D>)
(   2,<2012-04-03 21:15:57.781 -0500>,<Administrator>,<TOPSPIN>,<proc1d>,<TOPSPIN 2.1>,
      <Start of raw data processing
       efp LB = 0 FT_mod = 6 PKNL = 1 PHC0 = 0 PHC1 = 0 SI = 32K 
       data hash MD5: 32K
       7B 52 24 E2 1A F5 A3 2A 12 2F CC 81 45 83 CC 1C>)
(   3,<2012-04-03 21:15:58.140 -0500>,<Administrator>,<TOPSPIN>,<proc1d>,<TOPSPIN 2.1>,
      <pk PHC0 = 214.7223 PHC1 = 0 
       data hash MD5: 32K
       26 78 65 24 89 0D 60 8D F8 58 D5 A3 B1 F4 9D 8C>)
(   4,<2012-04-03 21:15:58.234 -0500>,<Administrator>,<TOPSPIN>,<proc1d>,<TOPSPIN 2.1>,
      <abs ABSG = 1 
       data hash MD5: 32K
       75 28 79 3C 4A 6C 96 7E 29 C1 D6 D8 D8 E5 37 52>)
(   5,<2012-04-03 21:15:58.265 -0500>,<Administrator>,<TOPSPIN>,<proc1d>,<TOPSPIN 2.1>,
      <abs ABSG = 2 
       data hash MD5: 32K
       AE 31 F7 0B 3E 1C 83 DD 51 48 15 1F 4F 55 1E C3>)
(   6,<2012-04-03 21:15:58.296 -0500>,<Administrator>,<TOPSPIN>,<proc1d>,<TOPSPIN 2.1>,
      <abs ABSG = 3 
       data hash MD5: 32K
       9D 87 BF 41 D0 F7 07 65 C2 6E 80 07 86 AC 68 4A>)
(   7,<2012-04-03 21:15:58.328 -0500>,<Administrator>,<TOPSPIN>,<proc1d>,<TOPSPIN 2.1>,
      <abs ABSG = 4 
       data hash MD5: 32K
       A8 BE 97 9A 8C 8C B7 03 A0 9A 16 B2 25 5E 1B 38>)
(   8,<2012-04-03 21:15:58.359 -0500>,<Administrator>,<TOPSPIN>,<proc1d>,<TOPSPIN 2.1>,
      <abs ABSG = 5 
       data hash MD5: 32K
       B5 91 79 66 79 52 A3 9B 9C 4F 2C 24 1E AD D9 8C>)
$$ ##END=
$$ 
$$ $$ hash MD5
$$ $$ 9D 60 15 8E 05 5D C1 3B C9 E3 9C 71 BB 59 A7 5B
##$RELAX= 
##$RELAX= 
##$RELAX= 
##$RELAX= 
##$RELAX= 
##$RELAX= 
##$RELAX= 
$$ Bruker specific parameters
$$ [...]
150 150 150 150 150 150 150 150
##$TP07= 0
##$TPNAME0= <>
##$TPNAME1= <>
##$TPNAME2= <>
##$TPNAME3= <>
##$TPNAME4= <>
##$TPNAME5= <>
##$TPNAME6= <>
##$TPNAME7= <>
##$TPOAL= (0..7)
0.5 0.5 0.5 0.5 0.5 0.5 0.5 0.5
##$TPOFFS= (0..7)
0 0 0 0 0 0 0 0
##$TUNHIN= 0
##$TUNHOUT= 0
##$TUNXOUT= 0
##$USERA1= <user>
##$USERA2= <user>
##$USERA3= <user>
##$USERA4= <user>
##$USERA5= <user>
##$V9= 5
##$VALIST= <valist>
##$VCLIST= <CCCCCCCCCCCCCCC>
##$VD= 0
##$VDLIST= <DDDDDDDDDDDDDDD>
##$VPLIST= <PPPPPPPPPPPPPPP>
##$VTLIST= <TTTTTTTTTTTTTTT>
##$WBST= 2048
##$WBSW= 25
##$XGAIN= (0..3)
0 0 0 0
##$XL= 0
##$YL= 0
##$YMAX_a= 533603
##$YMIN_a= -645978
##$ZGOPTNS= <>
##$ZL1= 120
##$ZL2= 120
##$ZL3= 120
##$ZL4= 120
##$ABSF1= 14.98061
##$ABSF2= -5.57192
##$ABSG= 5
##$ABSL= 3
##$ALPHA= 0
##$AQORDER= 0
##$ASSFAC= 0
##$ASSFACI= 0
##$ASSFACX= 0
##$ASSWID= 0
##$AUNMP= <proc_prof1d_extract_pilot.lims>
##$AXLEFT= 0
##$AXNAME= <>
##$AXNUC= <1H>
##$AXRIGHT= 0
##$AXTYPE= 0
##$AXUNIT= <>
##$AZFE= 0.1
##$AZFW= 0.1
##$BCFW= 0
##$BC_mod= 0
##$BYTORDP= 0
##$COROFFS= 0
##$CY= 15
##$DATMOD= 1
##$DC= 0
##$DFILT= <>
##$DTYPP= 0
##$F1P= 0
##$F2P= 0
##$FCOR= 0.5
##$FTSIZE= 32768
##$FT_mod= 6
##$GAMMA= 0
##$GB= 0
##$INTBC= 1
##$INTSCL= 1
##$ISEN= 128
##$LB= 0
##$LEV0= 0
##$LPBIN= 0
##$MAXI= 10000
##$MC2= 0
##$MEAN= 0
##$ME_mod= 0
##$MI= 0
##$NCOEF= 0
##$NC_proc= -8
##$NLEV= 6
##$NOISF1= 0
##$NOISF2= 0
##$NSP= 0
##$NTH_PI= 0
##$NZP= 0
##$OFFSET= 14.98061
##$PC= 1
##$PHC0= 214.7223
##$PHC1= 0
##$PH_mod= 1
##$PKNL= yes
##$PPARMOD= 0
##$PPDIAG= 0
##$PPIPTYP= 0
##$PPMPNUM= 2147483647
##$PPRESOL= 1
##$PSCAL= 4
##$PSIGN= 0
##$PYNMP= <proc.py>
##$REVERSE= no
##$SF= 400.13
##$SI= 32768
##$SIGF1= 0
##$SIGF2= 0
##$SINO= 400
##$SIOLD= 32768
##$SPECTYP= <>
##$SREGLST= <1H.CDCl3>
##$SSB= 0
##$STSI= 32768
##$STSR= 0
##$SW_p= 8223.68421052632
##$SYMM= 0
##$S_DEV= 0
##$TDeff= 65536
##$TDoff= 0
##$TI= <>
##$TILT= no
##$TM1= 0
##$TM2= 0
##$TOPLEV= 0
##$USERP1= <user>
##$USERP2= <user>
##$USERP3= <user>
##$USERP4= <user>
##$USERP5= <user>
##$WDW= 1
##$XDIM= 32768
##$YMAX_p= 468280928
##$YMIN_p= -708903
##$CURPLOT= <Network HP LaserJet P1505>
##$CURPRIN= <$Network HP LaserJet P1505>
##$DFORMAT= <normdp>
##$LAYOUT= <+/1D_H.xwp>
##$LFORMAT= <normlp>
##$PFORMAT= <normpl>
##$SURQMSG= 1
$$ End of Bruker specific parameters
$$ ---------------------------------
##NTUPLES= NMR SPECTRUM
##VAR_NAME=  FREQUENCY,     SPECTRUM/REAL,   SPECTRUM/IMAG
##SYMBOL=    X,             R,               I
##VAR_TYPE=  INDEPENDENT,   DEPENDENT,       DEPENDENT
##VAR_FORM=  AFFN,          ASDF,            ASDF
##VAR_DIM=   32768,         32768,           32768
##UNITS=     HZ,            ARBITRARY UNITS, ARBITRARY UNITS
##FACTOR=    0.250966925370066, 1,           1
##FIRST=     8223.43324360095, -28012,       -110775
##LAST=      0,             -373,            -100414
##MIN=       0,             -708903,         0
##MAX=       8223.43324360095, 468280928,    0
$$ Real data points
##PAGE= N=1
##DATA TABLE= (X++(R..R)), XYDATA
$$ [...]
19469d67525A50934c21894K1766h6372k84063C8574M658a38178H9421J64261b12391
19457g8017B9790c1688j96311M6006h3246F4954J04792B0966J19720b6515C0836
19445A24524d35527D20427a06410o0197A36600m2926J30430f6843j19998R1277
19435i5564j43452J11627c139I7963J663e8949C2443K83713b66349d6639a4871
19423f4065B86096e11674H3378b47625m1468D4236b04888j21919J54112A01966
19412B6809e1265j04341I3045G726J00826R3412a55466j43217A80370b56199A4776
19400a3827B0904a52961J2220c846o7929E5802e3645k04923j0082B46595e2900
19388b83188h1715k28241b1411n6887I3639a19251m42509A46467E3294b09190
$$ y = [-467525, 150934, -321894, -300128, -86372, -370435, 38574, 43232, -138178, 89421, 253682, -212391, -78017, 29790, -31688, -227999, -181993, -83246, 64954, 169746, 20966, 140686, -26515, 30836, 124524, -435527, 420427, -106410, -166607, 136600, 93674, 224104, -66843, -186841, -95564, -239016, -127389, -3139, 97963, 99626, -58949, 32443, 316156, -266349, -46639, -14871, -64065, 286096, -511674, 83378, -247625, -289093, 44236, -204888, -326807, -172695, 101966, 26809, -51265, -155606, 93045, 7726, 108552, 201964, -155466, -298683, 180370, -256199, 14776, -13827, 20904, -152961, -140741, -3846, -71775, 55802, -53645, -258568, -268650, 246595, -52900, -283188, -81715, -309956, -21411, -78298, 93639, -119251, -561760, 146467, 53294, -209190]
19377d6503m7424M4659B72771b93378Q7028O3886E7722q014b41051J9322H8451
19365f9084A30789j0678a35182H9943a90884j44918B80485a58782P0559j60067
19355b48290a17677B39774c86743b8992k0539n8662m25534b6277G6423J07603
19345A84026d32432J77533B9177a12903d987r6689d1437o372K1939r5314M9106
19334g2078m0650l00350a28641A9840a79720c3r2370j21391B2626b6244m3302
19323f9546F9322a46404H8401a78071j24451B506f9659B5629f9260j19360j85327
19312c73947C73684A31202K40613b37062C19101E4651a04727n4298H0121a2956
19301b78011e1658B00601n7287F5857a33966j06047J03947l3373B08513A02774
$$ y = [-46503, -93927, -49268, 272771, -293378, -206350, -142464, 57722, 49708, -241051, -221729, 88451, -69084, 130789, 120111, -135182, 89943, -190884, -335802, 280485, -158782, -88223, -248290, -117677, 239774, -386743, -28992, -49531, -108193, -533727, -26277, 76423, 184026, -432432, -254899, 29177, -112903, -4987, -101676, -41437, -47809, -25870, -121184, -72078, -112728, -413078, -128641, 19840, -179720, -33, -92403, -213794, 22626, -26244, -69546, 69322, -146404, 88401, -178071, -302522, 2506, -69659, 25629, -69260, -188620, -373947, 373684, 131202, 371815, -237062, 319101, 54651, -104727, -159025, 80121, -12956, -278011, -51658, 200601, 143314, 65857, -133966, -240013, -136066, -169439, 208513, 102774]
19290c51314a15506A35723a47743B83408A821a03690J5460k44202C04026c26853
19279b4965b925D8547a9822B03531f6304m33445J73454a52088A85247o2054f0287
19267A60189b64970a11688c7987I8907b11112E4039A818a93343o3472A59726f9958
19255A31872b21457j55192C26360a19486A17049n6542i3478A73482b75714A34279
19244A61327f2087l6572A08235B8289a9096A07588J03414d43648a76106A78536
19233A07622a06172j3187r9507N4225a4458C5438b09389h337H0114a39732B22664
19221c49739b51A21526P1811b66562a07304C20396i8769n3441k51283a83942A07323
19209b18278C61878E4528h0984j60889L3820J1521f8109G3607c13158J31512f3817
$$ y = [-351314, -115506, 135723, -147743, 283408, 1821, -103690, -88230, -332432, 304026, -326853, -24965, -2925, 48547, -19822, 203531, -66304, -499749, -326295, -152088, 185247, 123193, -60287, 160189, -264970, -111688, -37987, 98907, -211112, 54039, 1818, -193343, -256815, 159726, -69958, 131872, -221457, -376649, 326360, -119486, 117049, 60507, -93478, 173482, -275714, 134279, 161327, -62087, -98659, 108235, 28289, -19096, 107588, 211002, -443648, -176106, 178536, 107622, -106172, -119359, -218866, -164641, -14458, 35438, -209389, -8337, 80114, -139732, 222664, -349739, -251, 121526, 193337, -266562, -107304, 320396, -98769, -152210, -403493, -183942, 107323, -218278, 361878, 54528, -80984, -241873, -208053, -196532, -68109, 73607, -313158, -181646, -63817]
19197c2500m1254j9536B662O97b10602P5600e598l07695A40195d0086j16042P2776
19185h3352D4060a81553f5627H454c56675E7876A3591b67412A6177J30659a0954
19173d06732J973D8601J20273k2855b07205l2734P7101g7253b8536n4806A01057
19161B25625a02054A49537J01363b95701a8461P117k05469F146Q9127d8229n787
19150e4016I1922k2523b14703g3242q936p8217L9113A43802d97865a71820p9196
19139b51016c9053k44813b5352A36886c49233D30245a30666d7427o8215L0006
19129h5636I3824a65779F2643e8315a8723k9804C395b27717L4054A15357B2736
19117B0056b96506Q1902N1514P7986A10514b56225a0721n6447q1792p9475H0558
$$ y = [-32500, -73754, -93290, 2662, 3359, -210602, -135002, -5598, -313293, 140195, -40086, -156128, -83352, 44060, -181553, -65627, 8454, -356675, 57876, 13591, -267412, 16177, 146836, -10954, -406732, -404759, 48601, 168874, 146019, -207205, -239939, -162838, -77253, -28536, -83342, 101057, 225625, -102054, 149537, 250900, -295701, -18461, -11344, -216813, 6146, 95273, -48229, -54016, 91922, 69399, -214703, -73242, -82178, -160395, -121282, 143802, -497865, -171820, -251016, -39053, -283866, -25352, 136886, -349233, 430245, -130666, -47427, -115642, -85636, 93824, -165779, 62643, -58315, -18723, -48527, 3395, -227717, -193663, 115357, 22736, 20056, -296506, -214604, -163090, -85104, 110514, -256225, -10721, -67168, -148960, -228435, 80558]
19105H8175a37076B85812E6994K9538M3913F1711J01203n1016P919K6717J6968
19094A63502a32925E2118f1416B06226b7983F375R7509b22251d1857k53862B30976
19082c83644h1550E3030J24602o4182D9657J66522a07638r8504B68962c34161
19071A82340a71279K1940B777L06794h5998A8281J59769d8733E2964i7490L7795
19060e9695l44684i6464H7916J1180J04460h5363E9841j0129d78030a89860L5861
19049a53999A12134a10693d9r5371A36970m5708a38554M4918n29922B67847a72880
19037F8785h3218a9306j6810j82620l1241d5478A00530C0841a47508f4645l01173
19026c65818B54495a95403P1473d3531l67862K04342k9551j40731F8400b20739
$$ y = [88175, -137076, 285812, 56994, 86532, 130445, 61711, 162914, 111898, 119817, 146534, 163502, -132925, 52118, -61416, 206226, -27983, 6375, 103884, -222251, -41857, -295719, 230976, -383644, -81550, 53030, 177632, 113450, 49657, 216179, -107638, -206142, 268962, -334161, 182340, -171279, -149339, 2777, 309571, -85998, 18281, 178050, -48733, 52964, -97490, -59695, -404379, -96464, 87916, 99096, 203556, -85363, 59841, 49712, -478030, -189860, -153999, 112134, -110693, -49, -95420, 136970, 91262, -138554, -93636, -623558, 267847, -172880, 68785, -83218, -19306, -36116, -218736, -249977, -45478, 100530, 30841, -147508, -64645, -365818, 254495, -195403, -123930, -43531, -411393, -207051, -236602, -377333, 68400, -220739]
19015b2362C06127a7789k17945B18550A08404k2586h9179A4334a45030h07B79738
19003a03715a6896C2992a28836A28293a81708j3504B22819D6615J25064c52656
18992a4332A93736c21482h0789A88161i2589o265C7234A2172h8968c4237r487
18981d3724j16572A234a48982M5016C6169P846d3962j94547B08488a62145L1428
18970a30717h626o9291A92110f5502J3227a1096m622p1312A9447M7512M2886a21597
18957C10734J26759M1341J03903B18180J1509A6864b96728H7634a59990B11809
18946I5027K24711b42952k09734A2400a63277j184A35384J28241f2781k63556
18936c26337J58927M0982j13295R4690A13662I377A495J45362o8473b8674B27444
$$ y = [-22362, 306127, -17789, -235734, 218550, 108404, 85818, -89179, 14334, -145030, -807, 279738, -103715, -16896, 32992, -128836, 128293, -181708, -195212, 222819, 46615, 171679, -352656, -14332, 193736, -321482, -80789, 188161, -92589, -98854, 37234, 12172, -88968, -34237, -43724, -160296, 1234, -148982, -103966, 36169, 44015, -43962, -238509, 208488, -162145, -130717, -8626, -77917, 192110, -65502, -52275, -11096, -15718, -87030, 19447, 66959, 109845, -121597, 310734, 437493, 478834, 582737, 218180, 229689, 16864, -296728, 87634, -159990, 211809, 95027, 319738, -242952, -452686, 12400, -163277, -164461, 135384, 263625, -62781, -326337, -167410, -126428, -239723, -145033, 113662, 9377, 1495, 146857, 78384, -28674, 227444]
18924a11442M0003j80217A96329b64358A48436h8247p0674m7294G8963M1933a99945
18912a22287k23291m9661a83682i1448I4222a64903b9666k04657q7683O019F7761
18900g5790L7199j86844A89890C0664J71222J97293A02281O21268B72541K4198
18890B96739a25552F2534h2324p0063M5100C62032h3057j75118B2169J16135J30670
18879B68974d6250A29904j3087g175j95242g7712D6479K6449a53891f082C4357
18867c85368J31252g876j98628A18006a28888k786k62403a07846D7341L7422j0193
18856G4570N625a44454A86252g7100d249k3858A54685A8691J04565E7579a8906
18844c23716J790J21897g4250J2253A64063a19059k3983k13852A75885a17126
$$ y = [-111442, -71439, -251656, 196329, -264358, 148436, -88247, -158921, -206215, 78963, 120896, -199945, -122287, -345578, -395239, -183682, -91448, 94222, -164903, -29666, -234323, -322006, -315987, 67761, -75790, -38591, -225435, 189890, 30664, 201886, 399179, 102281, 723549, 272541, 296739, -125552, 62534, -82324, -152387, -107287, 362032, -83057, -258175, 22169, 138304, 268974, -46250, 129904, 116817, -7175, -202417, -77712, 46479, 72928, -153891, -6082, 34357, -385368, -254116, -7876, -206504, 118006, -128888, -131674, -394077, -107846, 47341, 84763, 74570, 80195, -144454, 186252, -77100, -4249, -28107, 154685, 18691, 123256, 57579, -18906, -323716, -321926, -200029, -74250, -61997, 164063, -119059, -143042, -356894, 175885, -117126]
18833B26418r3965a37904D1501M9139J0133b569A17384c68008C2230M6531G661
18821C9150a28554H8191O5003a65212j38611d0154r0864F0475O4673d6510C9761
18809B4555a70698j43645b0164A27387k0910a54620C6119J61148c9594e04B76508
18797g5566G0512a30577M4531A07486J281b95146A63998F8825a62735j10805A16597
18785A26987e4962A06035H94b76012k9362g6874c696r9594A18507b00913G3121
18773a72896B03029f3072k11023j75104c7574A73665p0141J9177f5124j3618D3330
18761b69090a27548k85157J29368l1350I6963L3130i8845K3271o4870j32922p2633
18750c45999a1378r7049n0590b675A26400b48285j27136A43126a15957B60198
$$ y = [226418, 132453, -137904, 41501, 90640, 100773, -2569, 117384, -368008, 32230, 78761, 7661, 39150, -128554, 88191, 153194, -165212, -303823, -40154, -131018, 60475, 125148, -46510, 39761, 24555, -170698, -314343, -20164, 127387, 106477, -154620, 36119, 197267, -39594, -504, 276508, -75566, 70512, -130577, -86046, 107486, 108767, -295146, 163998, 68825, -162735, -273540, 116597, 126987, -54962, 106035, 894, -276012, -305374, -76874, -3696, -103290, 118507, -200913, 73121, -172896, 203029, -63072, -274095, -449199, -37574, 173665, 103524, 122701, -65124, -78742, 43330, -269090, -127548, -412705, -283337, -314687, 96963, 130093, -98845, -75574, -140444, -273366, -345999, -11378, -108427, -159017, -2675, 126400, -248285, -375421, 143126, -115957, 260198]
18739a33011k5542l32223K40531m3874R4309A45319a27046J3081J7011k87889
18729c84843H9298A1875e5497A30479J9653a19410N4042m7831C2126P734a95849
18717I1228a27848N5589A9201K55492b84504B65248b90613R6288A34178b27573
18706A56324j6448L4281B0341a18966A84004o4066A6412b59111J00745r1929G768
18694a82205L0072B29716c40350a22256N2745j28296R5846m4983E3349h6218N526
18683h0692A30542J31117A05310M003a88981L4788O6636L9157j80186n8937A68522
18671b53846H629b47686m7135H3609j1759a81586A37126E6991a9086m5062q3650
18660a47798I7824A2447g2675A36804o1993a10922E4110a32365j24881d9479F495
$$ y = [-133011, -158553, -490776, -250245, -294119, -199810, 145319, -127046, -113965, -96954, -384843, 89298, 11875, -55497, 130479, 150132, -119410, -65368, -113199, 32126, 39860, -195849, 91228, -127848, -72259, 19201, 274693, -284504, 265248, -290613, -194325, 134178, -227573, 156324, 139876, 174157, 20341, -118966, 184004, 119938, 16412, -259111, -158366, -250295, 7768, -182205, -152133, 229716, -340350, -122256, -69511, -197807, -101961, -146944, 53349, -86218, -80692, 130542, 261659, 105310, 109313, -188981, -154193, -87557, -48400, -228586, -287523, 168522, -253846, 8629, -247686, -294821, 83609, 71850, -181586, 137126, 56991, -19086, -64148, -147798, 97824, 12447, -72675, 136804, 74811, -110922, 54110, -132365, -257246, -49479, 6495]
18648b05526O8103j13647A4018d0229j65799B37200k1000m543b12072B88047A33778
18636b76252J07836M7955H7406k0909J38974c32132I5656K4926n8491b40684A65414
18624b11469o0161R6362l07734b38608B62123e5490F605P2106q702f8638a2327
18612A00146D82e4902B5686b63115h1182A74714a3147q6677d0234j47365Q3949
18601a03650Q164j02229a8622A29878B3198b56715B93911j33215a94288B34520
18590b08324I851c5581B67197j19452r306a42651A01146a59193A45404b04064
18579c10995L2652e238B41296a81350L4006g2961l2456A00488D4367d04532a17243
18567h7917j95943N0608A71218a98490k06337a6222A36100a55613A0950b37690
$$ y = [-205526, -137423, -251070, 14018, -40229, -206028, 237200, 216200, 211657, -212072, 288047, 133778, -276252, -168416, -120461, 87406, 66497, 205471, -332132, 95656, 120582, 62091, -240684, 165414, -211469, -271630, -175268, -483002, -238608, 262123, -55490, 6605, 78711, 70009, -68638, -12327, 100146, 482, -54902, 25686, -263115, -81182, 174714, -13147, -99824, -40234, -187599, -103650, -95486, -197715, -18622, 129878, 23198, -256715, 293911, 160696, -194288, 234520, -208324, 9851, -35581, 267197, 147745, 138439, -142651, 101146, -159193, 145404, -204064, -310995, -278343, -5238, 241296, -181350, -147344, -72961, -105417, 100488, 44367, -404532, -117243, -87917, -283860, -233252, 171218, -198490, -404827, -16222, 136100, -155613, 10950, -237690]
18556a37650o4182b2404k70351j15942a47717A12283d55519a00763b0363L021
18546a7342A24557a09029K2999l8087C7850d70777a94584b0383k00886B03105
18535d1049j97078p4980I153b54028A44823b6147q5575l02625A76625b01988c4212
18523I1927a10725L9061j54778B95986i8714j5190M624A81485B2801d48580f2370
18511D206K5947a80274L1002H4800c36729a01369D1529L1391N4345b4087F6460
18499I9535a65434A8775c0652A77854q8424f286A33336D7053J87023a0266A89754
18487B35224a37742j41567a00781A75095b23349a03999j13200B50065c04273a4722
18476a42734A68149f3611B83603A03605N7885L8228a53939A60872g6360n227n5180
$$ y = [-137650, -201832, -22404, -292755, -408697, -147717, 112283, -455519, -100763, -20363, -17342, 124557, -109029, -86030, -124117, 37850, -470777, -194584, -20383, -221269, 203105, -41049, -238127, -313107, 9153, -254028, 144823, -26147, -111722, -414347, 176625, -201988, -34212, 91927, -110725, -71664, -226442, 295986, -98714, -113904, -109280, 181485, 22801, -448580, -62370, 4206, 30153, -180274, -149272, 84800, -336729, -101369, 41529, 72920, 127265, -24087, 66460, 99535, -165434, 18775, -30652, 177854, 89430, -6286, 133336, 47053, 234076, -10266, 189754, 235224, -137742, -279309, -100781, 175095, -223349, -103999, -217199, 250065, -304273, -14722, -142734, 168149, -63611, 283603, 103605, 161490, 199718, -153939, 160872, -76360, -81587, -136767]
18465a36767B48799a41887K9638C1376L2594c0899F6868p556a02071q1621l5364
18454b19056A09080O7710E2343n908a10731G7291a92302H5136M8013d13466G3709
18442g5300j55998j1558C18670D6660j6489b65265J11595C4716a88530b0982C0009
18430b8331A05248m3473b73226A45468h3641b0137k7393a8084l78682B23335b19493
18418b89483J18791F7498b58682J16857A4712a37177d4438B46832a56808j16057
18408b72865g9940B40966b27662P1868B1811Q9148b83874a3160m8287G6721C1875
18396a85624D9844b99041i6381D5037j3417b04480F4731J49406c7017j9420G9651
18384g4353G7359g8238A4103a06034A86694A3520M0243g6323B48067b23198A45305
$$ y = [-136767, 248799, -141887, -112249, 31376, 63970, -30899, 66868, 59312, -102071, -183692, -219056, 109080, 176790, 52343, 46435, -110731, 77291, -192302, 85136, 133149, -413466, 73709, -75300, -231298, -242856, 318670, 46660, 30171, -265265, -153670, 34716, -188530, -20982, 30009, -28331, 105248, 61775, -273226, 145468, -83641, -20137, -47530, -18084, -396766, 223335, -219493, -289483, -170692, 67498, -258682, -141825, 14712, -137177, -44438, 246832, -156808, -272865, -79940, 240966, -227662, -155794, 21811, 110959, -283874, -13160, -61447, 76721, 31875, -185624, 49844, -299041, -96381, 45037, 31620, -204480, 64731, 214137, -37017, -56437, 79651, -74353, 77359, -78238, 14103, -106034, 186694, 13520, 53763, -76323, 248067, -223198, 145305]
18372a58690B12870a98000J6149Q4412k58571J19079H4515J21125I3753a84289
18361D1389b16664E1557b49814g9390H4811b82688c0392j50634b4222k93421O5015
18350b52628D3071d44l41017C73401j04894e206B89445a56339g2558l735G3224
18338a37567g257B70942n3999E0018j5986M482a36361j20901L9589P3528N7804
18327h6341k10218J42608b6191o2976A60027l4487R777J04506d7041G6737C5210
18315a68359B00032C6032Q3359e92428B26468a35979K7379F9992J67179B6935
18304f2458j17989P1876A5517a59574A5726g587A65647J6782i0416A63319G6633
18292A37239J16321q7649f4852A11537b3686F6373a62167j37115j7174D52653
$$ y = [-158690, 212870, -198000, -181851, -97439, -356010, -236931, 84515, 205640, 93753, -184289, 41389, -216664, 51557, -249814, -79390, 84811, -282688, -30392, -181026, -24222, -317643, -252628, 43071, -444, -341461, 373401, 268507, -5206, 289445, -156339, -72558, -76293, 73224, -137567, -7257, 270942, 216943, 50018, 34032, 38514, -136361, -257262, -217673, -144145, -86341, -296559, -153951, -26191, -89167, 160027, 125540, 135317, 239823, -47041, 76737, 35210, -168359, 200032, 36032, 119391, -592428, 226468, -135979, -108600, 69992, 237171, 26935, -62458, -180447, -108571, 15517, -159574, 15726, -7587, 165647, 182429, -90416, 163319, 76633, 137239, 253560, 165911, -64852, 111537, -23686, 66373, -162167, -299282, -316456, 452653]
18281C5636b75357B98202g2805l55403A67744A0904K61027A31968A7874Q3404
18271A01278l5011O610a22738B7786d4111n601A7975K8198c4336n078q306A25525
18258E1469M2479K11558a78730A05911a18768K3171J8718A03286i0188C17900
18247g4629B46442q5561p4870N567i9371m4049M8644B676g3843j37479J6027g2152
18234f3290j85597G6707O4147J5439J35701b57019F5363a9910m1666M545j7322
18223g4353m1256N0963l7590B75451F3067a57783B18207I4157D0864J02821b49442
18211e4604j43480A16384k0157D1248b93985A68142a43900I8627b31500n4592
18201b86092E4996a25107A25660l1347B5820N6616L9620c9986I4467b59803L0363
$$ y = [35636, -275357, 298202, -72805, -428208, 167744, 10904, 271931, 131968, 17874, 101278, 66267, 72877, -122738, 27786, -44111, -49712, 17975, 46173, -34336, -39414, -47720, 125525, 51469, 93948, 305506, -178730, 105911, -118768, -95597, -76879, 103286, -90188, 317900, -74629, 246442, 160881, 86011, 91578, -99371, -143420, -94776, 2676, -73843, -211322, -195295, -72152, -63290, -248887, 76707, 140854, 156293, 291994, -257019, 65363, -19910, -61576, -57031, -74353, -115609, -64646, -102236, 275451, 63067, -157783, 218207, 94157, 40864, 143685, -249442, -54604, -198084, 116384, 96227, 41248, -293985, 168142, -143900, 98627, -231500, -286092, 54996, -125107, 125660, 94313, 25820, 82436, 122056, -39986, 94467, -259803, -229440]
18190b29440A50252f2726B33392C6094J41740k0651I133L4939R5410o8003J89959
18179B61438e028G0676P983c2215l7678k56876B85987D9930b74755a10832C01650
18167B96172K70132I0940b72144b1748A00164l0029Q6671c43710B21188a9717
18156F5827b49220P9875B33481m8495a50180J7164e6488f922C09886j04901a70270
18144F0866N3196C4448f7845o1263p0491h0042j33429J4398J3421M1621C1247
18132A82195H1318A0982k380J55210b03016C50068a85677M0431E542L7204d7945
18120a74714e1401l7024B12060m0631m9721g5351q5805A95590D4295K47780K175
18109B94250a13110c4063j43862f2360k0660a0551B78546B6280b40131M1654P5494
$$ y = [-229440, 150252, -62726, 233392, 36094, 177834, 157183, 9133, 44072, 139482, 71479, 261438, -5028, 70676, 78659, -32215, -69893, -326769, 285987, 49930, -274755, -110832, 301650, 296172, 566304, 90940, -272144, -21748, 100164, 70135, 156806, -343710, 221188, -19717, 65827, -249220, -169345, 233481, 184986, -150180, -133016, -56488, -6922, 309886, 204985, -170270, 60866, 114062, 34448, -67845, -129108, -199599, -80042, -213471, -199073, -185652, -144031, 31247, 182195, 81318, 10982, 8602, 163812, -203016, 350068, -185677, -145246, 5542, 42746, -47945, -174714, -51401, -88425, 212060, 171429, 121708, -75351, -161156, 195590, 44295, 292075, 294250, -113110, -34063, -177925, -62360, -83020, -10551, 278546, 26280, -240131, -198477, -122983]
18098a22983e9198j26625c9100A79240i4607q3842d138H3010R4179A4027M88715
18087E02742i4285C1382b38204C05994e7080m57631K33067a39808B86539b8638
18076g2238m4399K7012C364K51836a41747a1106k15003P11K3224A19725m0430
18065G9295a48300D4262a95175A0538J18805J56728a98719B4600a76621k9535
18055b06156A18714a03124G5648a5867j88157Q1683C3439P1262f3212q886A72555
18043B28483g173m40560f7189D49469a23915L9214b7544j38139B59874F7673J31583
18032A99256G5633J4283l4905k3123J72661b20629F320a64794G2215n100k3798
18021D3317K5228A8915b66307m9003A12046b4246A39977J88634B9908L3150J07151
$$ y = [-122983, -59198, -185823, -39100, 179240, -94607, -178449, -4138, 83010, 177189, 14027, 502742, -94285, 31382, -238204, 305994, -57080, -514711, -281644, -139808, 286539, -28638, -72238, -116637, -89625, 3364, 255200, -141747, -11106, -226109, -225398, -202174, 119725, 79295, -148300, 44262, -195175, 10538, 129343, 286071, -198719, 24600, -176621, -206156, 118714, -103124, 75648, -15867, -204024, -122341, 33439, 104701, -63212, -72098, 172555, 228483, -7173, -447733, -67189, 449469, -123915, -84701, -27544, -165683, 259874, 67673, 199256, 75633, 89916, 55011, 31888, 204549, -220629, 6320, -164794, 72215, 67115, 43317, 68545, 18915, -266307, -315310, 112046, -24246, 139977, 328611, 29908, 63058, 170209]
18010A70209d7453C84728a16710j23676H1805L4426D5023i7565A74013I012O3856
17999G2868N556k0169a17780j41618C9445g5298r5174A22257J46227a26727A62610
17987G6209J78804i2943j9372C17817b5477k00789I4135R2424j9505m2881b30494
17975A72051l7816g5483B7313J14408C0607R0709K39293G8339G487N2025a2957
17963A42758i5149G0616J4603J29453c4481D2771K15518q1977f3883B27023a68465
17951A13166a26177k7349A66257a92643j254c4222j22685o0420j7588A49342K26884
17940C76226g2201G1478a76870B6237K8140a96756i6843B35109b9043H2612a53664
17928F9206J40372J98557o6121A36529a94513R1511j22597g2613j36531H2270
$$ y = [170209, -47453, 384728, -116710, -240386, 81805, 116231, 45023, -97565, 174013, 9012, 72868, 78424, 58255, -117780, -259398, 39445, -75298, -170472, 122257, 268484, -126727, 162610, 76209, 255013, -92943, -112315, 317817, -25477, -226266, 94135, 186559, 167054, 124173, -230494, 172051, 134235, -75483, 27313, 141721, 30607, 121316, 360609, 78339, 7487, 59512, -12957, 142758, -95149, 70616, 85219, 214672, -34481, 42771, 258289, 176312, -63883, 227023, -168465, 113166, -126177, -153526, 166257, -192643, -193897, -34222, -156907, -217327, -234915, 149342, 376226, -72201, 71478, -176870, 26237, 54377, -196756, -96843, 235109, -29043, 82612, -153664, 69206, 209578, 408135, 342014, 136529, -194513, -103002, -225599, -72613, -209144, 82270]
17917a01468A77256c1779C20145A54799F5835L809d3122I4546d5726A96125D3583
17905A32610d951m12726A37688J86399j42601C0829J58955b3629A8090c0628F7882
17893i1868A38711f010B43845f0002b1497D0202J88588C8252J08792L4718a19671
17881E5031f5635k25792J19662A6978F118d24A80429a19824B50429A20435b74366
17869A06301b19001K9557e4876n9979D8767K71889a81927B40086G1701d5483C62899
17857A63192e0354A27769a6109k86148A35713J44959a18245A52395b18290B33932
17846b7023A19581B5640a04239j29477A40962A2030i597H7057c44699R4937C9734
17834A58060N056J374h8002L7277A89384C9712h4670k20561A81969h2359A3159
$$ y = [-101468, 177256, -31779, 320145, 154799, 65835, 69644, -43122, 94546, -45726, 196125, 43583, 132610, -4951, -417677, 137688, 324087, 181486, 30829, 189784, -23629, 18090, -30628, 67882, -91868, 138711, -6010, 243845, -60002, -21497, 40202, 228790, 38252, 147044, 181762, -119671, 55031, -65635, -291427, -171765, 16978, 6118, -424, 180429, -119824, 250429, 120435, -274366, 106301, -219001, -189444, -54876, -114855, 48767, 320656, -181927, 240086, 71701, -45483, 362899, 163192, -50354, 127769, -16109, -302257, 135713, 280672, -118245, 152395, -218290, 233932, -27023, 119581, 25640, -104239, -233716, 140962, 12030, -9597, 87057, -344699, -249762, 39734, 158060, 163116, 164490, -88002, -50725, 189384, 39712, -84670, -305231, 181969, -82359, 13159]
17822c8593j63682g3703P366c2738H5383O5325a74501c6538C04699j51934B7207
17810a16279D97283a7387j68749B99730a99346D4502c0316k4185A92534D2350
17799i0605C23506j02340q3805a15522I3629D3265M08376A32986C0123K95586
17789C25709a29614k70079a88203G9519a61861H8456a0079B96199I6566J1017
17779A07583k3203J45477m7820m6608L9090H4703O083b4215A07657e2339C42696
17767B359K51704J24802h4496A44606J46431l4893E735b49835C76975G6398d9785
17755G7457C6153N8400a44759A60741l3265E6117K33799A02819e0430I106a2190
17743a24683G3380b24329i4423E57129a37698m04B24813G4573a57144P2836A11388
$$ y = [-38593, -202275, -73703, -66337, -32738, 85383, 150708, -174501, -36538, 304699, 152765, 27207, -116279, 497283, -17387, -186136, 299730, -199346, 44502, -30316, -54501, 192534, 42350, -90605, 323506, 221166, 137361, -115522, 93629, 43265, 451641, 132986, 30123, 325709, -129614, -399693, -188203, 79519, -161861, 88456, -10079, 296199, 96566, 107583, 84380, 229857, 182037, 135429, 174519, 84703, 90786, -24215, 107657, -52339, 342696, 2359, 254063, 378865, -84496, 144606, 291037, 256144, 5735, -249835, 376975, 76398, -49785, 77457, 36153, 94553, -144759, 160741, 127476, 56117, 289916, 102819, -50430, 9106, -12190, -124683, 73380, -224329, -94423, 557129, -137698, -138102, 224813, 74573, -157144, -84308, 111388]
17731b4547B26684C1214b00500A11054a35097F9849L98131j13808j42624G7865
17720A67013a24773A30K73570E3336o553a02117A83604c0906A40091L6949a04202
17708a99402F5198d8088J131C77480A26270b11851A78211E8836J01380J8999M2869
17697B22084H9284i1923d5545r6192O0498B6268L43371c17284A53258O3243K18082
17686D34583a02701A41361h7282j61587g4664B08185D4329J6784L99013c21642
17675b7073j36092C48980A66102m2815K05478A20425j8467K77053A20249j1300
17665A08949a3324H5737N5101m0618K5866K78100A91478F3397g2827d873B24199
17653b6897B6194I093J98767P2907j529j03517J54715a38238k6559A09925j2551
$$ y = [-24547, 226684, 31214, -200500, 111054, -135097, 69849, 467980, 354172, 211548, 77865, 167013, -124773, 130, 273700, 53336, 46783, -102117, 183604, -30906, 140091, 177040, -104202, -199402, 65198, -48088, -46957, 377480, 126270, -211851, 178211, 58836, 160216, 179215, 222084, 89284, -91923, -45545, -141737, -81239, 26268, 369639, -317284, 153258, 216501, 434583, -102701, 141361, -87282, -248869, -74664, 208185, 44329, 61113, 460126, -321642, -27073, -163165, 348980, 166102, 123287, 328765, 120425, 101958, 379011, 120249, 108949, -13324, 85737, 140838, 100220, 126086, 404186, 191478, 63397, -72827, -4873, 224199, -26897, 26194, 9093, 207860, 280767, 279238, 175721, 330436, -138238, -164797, 109925, 97374]
17642I7374A0511Q90h9079F7070b58759B69941j0347I9199O9196q0020m1259L864
17630E0980P3085k9443J9038J49332F270R1231i0204D3871e9579C63234a63363
17618E5757H460N6423J18971K08670A70989b80908A72263L4398o2741l374n2078
17607H8468d6415j31387A0288K12265N0901j00920a4792n3030A54097J53546a66401
17595C22612a87116n0270E5700J59967J28917a35133B17492J22263F0185J62329
17585B22514b0784B82519G7553L3405d7099F0551N3508g7997B61246B0454R7041
17574A17495K04804q469a35184q6590A83125O3401K02953d7082A51186Q286r57
17563A58515d8610o8851a4277j08343A63793J05716b0158A70139H4384K52215
$$ y = [97374, 10511, 11401, -89079, 67070, -258759, 269941, 259594, 99199, 168395, 88375, 47116, 50980, 124065, 94622, 113660, 262992, 6270, 97501, -90204, 43871, -59579, 363234, -163363, 55757, 8460, 64883, 183854, 392524, 170989, -280908, 172263, 206661, 143920, 140546, 88468, -46415, -177802, 10288, 222553, 273454, 172534, -14792, -67822, 154097, 307643, -166401, 322612, -187116, -237386, 55700, 215667, 344584, -135133, 217492, 339755, 60185, 222514, -20784, 282519, 77553, 110958, -47099, 60551, 114059, -77997, 261246, 20454, 117495, 322299, 313830, -135184, -221774, 183125, 246526, 449479, -47082, 151186, 159472, 158515, -48610, -117461, -14277, -122620, 163793, 269509, -20158, 170139, 84384, 336599]
17553C36599b0249C10194E0080J68206A6945G501J438L07804n2592A09169K28735
17542C37904p6141C4254J34950K3357Q5731d0634C29941j34091O2650E7550J79013
17531B36563j12989i3220A8322K00165a49657G7493K2643L27882o3071m7329a97286
17519C35267k4251J26742j09594F5948N3678M21959q4981K54118N0224L30782
17509A091728J76707k68184k55254o1816j78016p4130j35862L48576j78559m3415
17499D21775j8353A41119O99486k91715K63472J27205r0953K4864k19958l09099
17489C44421J57614J1531L358o3821A30971K44420j22380J63010E1552M1945J98472
17478B91969J73064A88800K54051J18652j56234j07608K21378B35259L96803k60937
$$ y = [336599, -20249, 310194, 50080, 218286, 16945, 7501, 8939, 316743, 264151, 109169, 337904, 261763, 34254, 169204, 192561, 278292, -40634, 329941, 195850, 258500, 57550, 236563, 123574, -93220, 18322, 218487, -149657, 77493, 100136, 428018, 364947, 317618, -197286, 335267, 311016, 437758, 328164, 65948, 119626, 541585, 456604, 710722, 760946, 1091728, 1268435, 1000251, 744997, 683181, 505165, 431035, 295173, 643749, 465190, 421775, 403422, 141119, 840605, 548890, 812362, 939567, 848614, 873478, 653520, 344421, 502035, 513566, 516924, 453103, 130971, 375391, 253011, 416021, 51552, 93497, 291969, 465033, 188800, 442851, 561503, 405269, 297661, 519039, 235259, 632062, 371125]
17468C71125j64539J90834A61683K65669J50736j55711d4168A61886m3941a07567
17457E31952j01979k05918K5278i367A75482K5603J3701K06466g7888B41493A5311
17445B01754M39351k15446q9583j28313J18457P3121q7172J03272l1855R2932
17435D76518J59452B75702P7160J32655A36903M50204P4804B41948J54175J76639
17425E72762B71934K87646B15043K39121j37226P9220O7037j91931l3044J84316
17415D22536J51094A4726K71308k1340J90541H8962M25542I1803M38820J3932
17405E44555k40263K05294k36522J10779j78379m3457e6700B70356J52179j235
17395D21300J08896A94475J8317J33167I1233K19232Q5143A26649c3973B36396
$$ y = [371125, 206586, 397420, 161683, 427352, 578088, 422377, -44168, 161886, 117945, -107567, 531952, 429973, 224055, 249333, -9367, 175482, 201085, 214786, 421252, -77888, 241493, 15311, 201754, 641105, 425659, 336076, 207763, 326220, 399341, 312169, 415441, 383586, 476518, 635970, 275702, 352862, 485517, 136903, 587107, 661911, 241948, 396123, 572762, 271934, 559580, 215043, 454164, 316938, 396158, 463195, 271264, 238220, 422536, 573630, 14726, 286034, 264694, 455235, 88962, 514504, 91803, 530623, 544555, 304292, 509586, 273064, 383843, 205464, 162007, -56700, 270356, 422535, 421300, 530196, 194475, 212792, 345959, 91233, 310465, 395608, 126649, -33973, 236396]
17384C76063r7831L37084j06285B41795m0167P4958m2527R4421D064L78382M5395
17373D27841P8130A83239J83p7639K24332j17587Q9077p4179K62490J22724G6671
17361A30033b2032D18704N5461B21919N8115J12280A33998L15886k00323G9916
17350A36769J45588J76536B13370K56448A99573o3724L04672C7256Q7823b5035
17339A73552J46474J5062R6626j25301M6518R4770j24840A38363K48826A55071
17328B88447j08019J09634B1395L79033j63558j05619J82275I9849M12738F3370
17317D40022j79021K61282A65868R5835M9606J87122k00452A26314J78311L8366
17307C42991K8726J05117J14621j43059A46616J14796L67223k38786q6452o9291
$$ y = [376063, 278232, 615316, 509031, 241795, 201628, 276586, 234059, 328480, 4064, 382446, 427841, 505971, 183239, 183422, 105783, 330115, 212528, 301605, 227426, 489916, 612640, 76671, 130033, -22032, 418704, 474165, 221919, 280034, 392314, 133998, 449884, 249561, 79916, 136769, 282357, 458893, 213370, 469818, 199573, 135849, 440521, 37256, 125079, -25035, 173552, 320026, 335088, 431714, 306413, 352931, 447701, 322861, 138363, 387189, 155071, 288447, 180428, 290062, 21395, 400428, 236870, 131251, 313526, 99849, 512587, 63370, 440022, 261001, 522283, 165868, 261703, 311309, 498431, 297979, 126314, 304625, 342991, 371717, 476834, 591455, 448396, 146616, 261412, 628635, 389849, 303397, 234106]
17297B34106E1044K17832m9179r123J8048J75115G2947K94409n0108Q5918H3569
17285E13890N5202j78057j45694K06586j93856K3262O5464p3219J0740R3769J26289
17274E04376q3360j95613r2436L36256j98189K38018L1668j87486q1145L76957
17264F49046B85359L46770B6111K63055q089J4165j34506J26670J23003A85168
17253E98944j38568E7J65498J19904M31896j69189F2567K82348n9791q3230P8258
17242B80152j20052N3200J92194K6784l7888L14905j64474n3301j72911j45622
17232A72987c5110C66193j23438J32228L1844p8974L59324k97019j74862J56024
17222C71320M7030p8283L47500j18488K3090k23813K72711A37089K54104J54537
$$ y = [234106, 51044, 268876, 219697, 210574, 228622, 403737, 72947, 367356, 317248, 403166, 83569, 513890, 569092, 391035, 245341, 451927, 258071, 281333, 346797, 273578, 284318, 378087, 504376, 421016, 225403, 132967, 469223, 271034, 509052, 540720, 353234, 272089, 649046, 285359, 632129, 26111, 289166, 281077, 295242, 160736, 287406, 410409, 185168, 598944, 460376, 57, 165555, 285459, 717355, 548166, 62567, 344915, 285124, 201894, 280152, 160100, 213300, 405494, 432278, 394390, 709295, 544821, 491520, 318609, 172987, -35110, 366193, 242755, 374983, 406827, 327853, 687177, 390158, 215296, 371320, 418350, 340067, 687567, 569079, 592169, 368356, 641067, 137089, 391193, 545730]
17212E45730B18536L77037j52909A53324J00691J78686A02749O21624l40570K06793
17202E90596k78046P0482o3924L06608C07027J14430A36321L54458O0879B27709
17191F60315j84484M6296J83318k64520N7769J9576k30143J42451k3418K55647
17181F62807j97504e4985E22791K83215A74738E5498K12582K87621J84488C40476
17170F48427j46309k45942J69715p862L43233B72026J11928J97105K4928k84149
17160C21838N4658M76140l22955L2652j00063J07462J35378C47522J48273A78171
17149F29910p9436J2334K9404L02595l79338J35606K6580Q4014J29781D33373
17138F72336k7892p8126n3889j40828J01330o5527K96849j74991k7227p2678L51360
$$ y = [545730, 218536, 595573, 442664, 153324, 254015, 432701, 102749, 724373, 383803, 590596, 312550, 383032, 319108, 625716, 307027, 421457, 136321, 490779, 551658, 227709, 660315, 475831, 522127, 705445, 440925, 498694, 518270, 288127, 430578, 407160, 662807, 465303, -54985, 522791, 806006, 174738, 55498, 268080, 555701, 740189, 340476, 648427, 502118, 256176, 425891, 418029, 761262, 272026, 383954, 581059, 605987, 321838, 376496, 852636, 529681, 562333, 462270, 569732, 705110, 347522, 495795, 178171, 629910, 550474, 562808, 592212, 894807, 515469, 651075, 677655, 761669, 891450, 433373, 672336, 644444, 566318, 512429, 371601, 472931, 407404, 704253, 529262, 502035, 429357, 780717]
17127G80717p4721p2446l06251M96982j10754k46909J28062R6447j51851K07477
17117G46753k20437K31306l36382L33030K2910k58589M96524l81504j78358R8520
17107E53773j56430L63997O8024q1576C49709L42315j46165j71850L57245j83461
17097E47793Q7884K02718j27245J69466N7804D12771K07714J47795k14204J34870
17087F88946k09781K95211J19335C66423M45579K1207k45074j39165M60517l19724
17077E89763M71816E06561M8855J0680J03661J01223K11762p5442k43984K87810
17067I51126M8302D09653L17321r9303L26932D76816N6067L28993k69302M9629
17057F42203J3718J67311j41178j5427m1332B67650O65075k36674K3865J32133
$$ y = [780717, 705996, 633550, 327299, 824281, 713527, 466618, 594680, 691127, 539276, 746753, 526316, 757622, 421240, 754270, 777180, 518591, 1015115, 633611, 455253, 553773, 397343, 761340, 829364, 747788, 349709, 692024, 545859, 374009, 731254, 547793, 635677, 838395, 711150, 880616, 938420, 412771, 620485, 768280, 554076, 688946, 479165, 774376, 893711, 366423, 812002, 833209, 588135, 448970, 909487, 589763, 1061579, 506561, 555416, 566096, 669757, 770980, 982742, 907300, 663316, 951126, 999428, 409653, 726974, 627671, 954603, 476816, 532883, 861876, 592574, 642203, 655921, 823232, 682054, 666627, 625295, 267650, 932725, 696051, 719916, 852049]
17047H52049J91013m8330l46801P0038C43178P31079l41233J46940q1573q670
17037G89721j719O1037m3915J27318l68210N30479m19888J47006N28462o25879
17027G24412J83758N5500K39950k22381n0490P2030k39095K88167k94415K21562
17017I78998J28337k02300M62222n80747K7820K23569R5653M7625J18567l7970
17007A261774l49814L00319l84762L47888J89801k26152k28219L89389j64654
16998A135570p1817K38032l56657K03550k28945N37366P2129J4897n17623L83382
16988A409884j40066k05369j38430O24311m77286Q4416L21264O903k07217K59446
16978A537856Q0702k62491j09578j09124J37930N7257J81743j54526j2983L16695
$$ y = [852049, 1043062, 994732, 647931, 717969, 343178, 1074257, 733024, 879964, 798391, 789721, 788002, 849039, 805124, 932442, 564232, 1094711, 674823, 821829, 1350291, 724412, 908170, 963670, 1203620, 981239, 930749, 1002779, 763684, 1051851, 757436, 978998, 1107335, 905035, 1367257, 786510, 814330, 1037899, 1133552, 1181177, 1299744, 1261774, 911960, 1212279, 827517, 1175405, 1365206, 1139054, 910835, 1300224, 1135570, 1063753, 1301785, 945128, 1148678, 919733, 1457099, 1529228, 1544125, 1026502, 1409884, 1269818, 1064449, 926019, 1550330, 1073044, 1157460, 1478724, 1485627, 1278410, 1537856, 1618558, 1356067, 1246489, 1137365, 1275295, 1332552, 1514295, 1359769, 1346786, 1663481]
16968A663481j67073J69530m65469J89967J07552Q7259k09638K49616r3046K4514
16958A556693L07645k53037n9654K35918k65733N97915o56676l552K8302L88355
16948A876176m40431K39366j69836J71357P4013K59632n33175K16427j13772L00988
16938A880745J04754r6952l57135K64664K0882L58956j21632l41345K95211l9293
16928A968855K00208l12101L50294k82629L45132n91523M55337l25448M91675
16919B299800k16800Q2402J52607k00305Q0718M8893J57742k99715m8490K13910
16909B270762Q1472J97114q8715o6837K33447j93949j96810M68090j87951n2501
16899B464122j56278L23812j82750K18000j24115K26559J11924j10067L9352l0753
$$ y = [1663481, 1496408, 1665938, 1200469, 1390436, 1497988, 1585247, 1375609, 1625225, 1532179, 1556693, 1864338, 1611301, 1551647, 1787565, 1521832, 2119747, 1463071, 1459519, 1487821, 1876176, 1435745, 1675111, 1505275, 1676632, 1750645, 2010277, 1477102, 1693529, 1579757, 1880745, 1985499, 1888547, 1531412, 1796076, 1816958, 2175914, 2054282, 1712937, 2008148, 1968855, 2169063, 1856962, 2207256, 1924627, 2269759, 1678236, 2133573, 1808125, 2299800, 2083000, 2165402, 2318009, 2117704, 2198422, 2247315, 2405057, 2105342, 2056852, 2270762, 2352234, 2549348, 2460633, 2393796, 2627243, 2433294, 2236484, 2704574, 2516623, 2464122, 2307844, 2631656, 2448906, 2666906, 2542791, 2769350, 2881274, 2771207, 2810559, 2779806]
16889B779806K71742m46374J47683L70767l37864J70936J11834L8541j76952J44768
16879C074887O7923J20071J42721k05580R0592K8157J39296N3951k26539J20499
16869C405978j25856M93941k10080L04720k9327k23170K16537K12249k33559L81604
16859D193037r9560j63869P9600K80166J17452o815l34433L61721J74058P6315
16849D677672M343O3049K29076J5947r2631R884J09970l78295L20454n5493O10646
16838E514622r1985L50341m34799L52123r0806J68199j93606L61297L13878j98373
16828F050891j3963K17330J3635L27003J87778j89919M52850k89740K19544L33411
16818G308820J45736l3082k8723L99077K5375J47708Q9074K70467j01846K36902
$$ y = [2779806, 3051548, 2605174, 2752857, 3123624, 2785760, 2956696, 3068530, 3107071, 2930119, 3074887, 3142810, 3262881, 3405602, 3200022, 3290614, 3318771, 3458067, 3512018, 3285479, 3405978, 3280122, 3774063, 3563983, 3868703, 3839376, 3616206, 3832743, 4044992, 3811433, 4193037, 4093477, 3929608, 4009208, 4289374, 4406826, 4400011, 4065578, 4427299, 4601357, 4677672, 4682015, 4745064, 4974140, 4990087, 4897456, 4907340, 5017310, 4639015, 4959469, 4903976, 5514622, 5422637, 5772978, 5338179, 5690302, 5599496, 5767695, 5574089, 5935386, 6249264, 6050891, 6036928, 6254258, 6267893, 6594896, 6782674, 6592755, 7045605, 6755865, 6975409, 7308820, 7454556, 7421474, 7392751, 7791828, 7817203, 7964911, 8053985, 8324452, 8222606, 8459508]
16808H459508J46336M54435j78645J97206J90160K40368N3166L51997J91253O4341
16798A0170125L47792K54035J73238K99891K5341N37259j9745J93352P09647K14716
16788A2905651j31684N36542L23035M12432J87247M57213Q6598N63586J3642P48673
16778A6102935Q8759Q55634M62619J7764P81492M92632K59084M66079N80884Q48641
16768B0956523N37665L50614P12743N52427J061025M18588O13110Q43724R50418
16759B6996837N34608J057245P47591J071551P15349J442941P01501J259374J128723
16750C5655720J173931J212708J475985J369505J398980J434552J703500J547590
16742D6972471J727025J657967J913131J958456K325176K007181K331652K267881
$$ y = [8459508, 8605844, 9060279, 8881634, 9078840, 9269000, 9509368, 9562534, 9914531, 10105784, 10170125, 10517917, 10771952, 10945190, 11245081, 11270422, 11807681, 11787936, 11981288, 12690935, 12905651, 12773967, 13310509, 13633544, 14045976, 14233223, 14690436, 14777034, 15340620, 15354262, 16102935, 16191694, 17047328, 17509947, 17527711, 18309203, 18801835, 19060919, 19526998, 20107882, 20956523, 21494188, 21844802, 22557545, 23109972, 24170997, 24589585, 25202695, 26046419, 26996837, 27531445, 28588690, 29336281, 30407832, 31123181, 32566122, 33267623, 34526997, 35655720, 36829651, 38042359, 39518344, 40887849, 42286829, 43721381, 45424881, 46972471, 48699496, 50357463, 52270594, 54229050, 56554226, 58561407, 60893059, 63160940]
16734F3160940J922827K965356K363046K532082K732023K849622K585646L014094
16726H4125636K959208K740658L111404L005838L053940L329493K620617L066395
16718A08013189K982918K211773K732624K154603K318496K103750J718988J420447
16710A25656788R69514N85561P94268J22322k4543o13388q54434r85506j705036
16701A23945546k039243j852274k285611k667622k306672k900528k826588k867577
16693A04199431k954905l536051k558093l556832l020574l073170k594299l261717
16685G9643790k755746k648408l035070k448921k623274k186253k314234k795804
16677E8836080j840647k116329j972657j805489k154231j885851j604922j670283
$$ y = [63160940, 65083767, 68049123, 70412169, 72944251, 75676274, 78525896, 81111542, 84125636, 87084844, 89825502, 92936906, 95942744, 98996684, 102326177, 104946794, 108013189, 110996107, 113207880, 115940504, 118095107, 120413603, 122517353, 124236341, 125656788, 126626302, 127211863, 128006131, 128128453, 128103910, 127490522, 126636088, 125650582, 123945546, 121906303, 120054029, 117768418, 115100796, 112794124, 109893596, 107067008, 104199431, 101244526, 97708475, 95150382, 91593550, 88572976, 85499806, 82905507, 79643790, 76888044, 74239636, 71204566, 68755645, 66132371, 63946118, 61631884, 58836080, 56995433, 54879104, 52906447, 51100958, 48946727, 47060876, 45455954, 43785671]
16669D3785671j431851j242976j600678j576821j132416j463529j139484j136479
16661C3061437j244750j104134n66002j164453j076137m98436j042715q89499
16653B5475311o09295p43837p43624p34195r29955l23961n17229q12851l00343
16644A9760021m39705o62433p17735l22736l93041k89720n48543n67235j29735
16635A5689138r30391J57340n41865m50895o42922K30189n35927j91809k32127
16626A2550731l02887j52739m93523l06108p9126j37346l13947l66221l03526
16617A0095308m54146k42352J81802p3657p0380m30128j10143l42405m71368K98226
16607H380757m35066m6716j9662J553l3558l52261l40463L71649q24817K79499
$$ y = [43785671, 42353820, 41110844, 39510166, 37933345, 36800929, 35337400, 34197916, 33061437, 31816687, 30712553, 30146551, 28982098, 27905961, 27407525, 26364810, 25475311, 24866016, 24122179, 23378555, 22644360, 21714405, 21390444, 20873215, 20060364, 19760021, 19320316, 18657883, 17940148, 17617412, 17224371, 16934651, 16386108, 15818873, 15689138, 14758747, 14916087, 14374222, 13923327, 13280405, 13510594, 12974667, 12782858, 12550731, 12247844, 12095105, 11601582, 11295474, 11216348, 11079002, 10765055, 10398834, 10095308, 9641162, 9398810, 9580612, 9506955, 9436575, 9006447, 8896304, 8553899, 8082531, 8380757, 7945691, 7898975, 7879313, 7880866, 7847308, 7495047, 7154584, 7526233, 6701416, 6980915]
16597F980915k38813r7690k16912j22264L78508l76462j44591j08420n8609m52778
16587E542884K33798j95815K33494N2618m06152j21491j29898j45654K88119n41216
16577D810687J10174J93336m75825K45159j96662k91904J09946P4584m7150j55657
16567D376688l59640n2875K36416n74466J25547L07530j36983J63781j68633l05858
16557C611507L33660m19328j3552J54932l71763K08645p4256R1765r9297r5776
16547C326537k2081k68257j01325L71299k58320j31057K34906m27354J2156K00240
16537B936744o2635K98751o48787J08039J49175J9510j7753r0230j38465K89890
16527B844239k64864J68957l40838L34282k23683Q3130k92380L02281l16894J97608
$$ y = [6980915, 6742102, 6644412, 6427500, 6305236, 6683744, 6307282, 6162691, 6054271, 5995662, 5542884, 5776682, 5580867, 5814361, 5866979, 5460827, 5339336, 5209438, 5063784, 5351903, 4810687, 4920861, 5114197, 4638372, 4883531, 4686869, 4394965, 4504911, 4579495, 4532345, 4376688, 4017048, 3964173, 4200589, 3626123, 3751670, 4059200, 3922217, 4085998, 3917365, 3611507, 3945167, 3525839, 3512287, 3667219, 3295456, 3504101, 3429845, 3521610, 3422313, 3326537, 3304456, 3036199, 2934874, 3306173, 3047853, 2916796, 3151702, 2724348, 2736504, 2936744, 2874109, 3172860, 2524073, 2632112, 2781287, 2800797, 2783044, 2692814, 2554349, 2844239, 2579375, 2748332, 2407494, 2741776, 2518093, 2601223, 2308843, 2611124, 2294230, 2491838]
16517B491838j06087R647r6452k90164N35638l35501n5535J12912m16098N5861
16507A906059J42101N2312o3755r5622L06165j03133j03166j36251j51817R8173
16497A851066q4720r2479K46936K15651n13830N0072Q8149P0683o3005R112k19713
16486A557922K99245o43597M24365J02058k8300j46122K71510j72270j09083k80337
16476A275391r9884M00783J14180l3923j58520j79278J96011k39036j40340J68274
16466A303658L05223j97875N9742j96891K93599m80460L65438j80940J40452l04573
16456A107373J28949p0174K00909K18502n81419J30737K37195l8874l36085J12196
16446A109309r506q418r2683Q1420l2798l6354k3960K84724m2291J26986k54203
$$ y = [2491838, 2385751, 2395398, 2298946, 2008782, 2544420, 2208919, 2153384, 2266296, 1850198, 1906059, 2048160, 2100472, 2036717, 1941095, 2247260, 2144127, 2040961, 1904710, 1752893, 1851066, 1766346, 1673867, 1920803, 2136454, 1622624, 1672696, 1760845, 1831528, 1768523, 1777635, 1557922, 1857167, 1213570, 1637935, 1739993, 1711693, 1565571, 1837081, 1664811, 1555728, 1275391, 1175507, 1576290, 1690470, 1656547, 1498027, 1318749, 1514760, 1275724, 1135384, 1303658, 1608881, 1411006, 1470748, 1273857, 1567456, 1086996, 1452434, 1271494, 1411946, 1107373, 1236322, 1166148, 1367057, 1585559, 1004140, 1134877, 1372072, 1333198, 997113, 1109309, 1099803, 1091385, 998702, 1080122, 1047324, 1010970, 987010, 1271734, 1229443, 1356429, 1102226]
16435A102226N3443j55071j36053M3730M85694j94539J39740n19052r667L71125
16425A181576j54878Q7278M57156n61814j41188J2615K72452l13365K42701n9523
16415A023010p1852L32062p456l06438l66912K45006k80026L74923j10836J34874
16405I66355J52150k22415l03173M45465j21636o2543j7710l52488K24103n1027
16395F57081M72152l02803J17083K849k44425C49502J68492K15974J08907r0938
16385G51937r2816M57376k86714R8351Q0371j53454j93187B33115N37275Q4866
16375H55256l38643K74139k30183K63139j08393K76195m7225J22272C06374k0682
16365B85692R4008L28911k72231l1911l9352L13291L13299k38716l35377J15716
$$ y = [1102226, 1155669, 1000598, 864545, 908275, 1393969, 1199430, 1339170, 820118, 810451, 1181576, 1026698, 1113976, 1571132, 1009318, 868130, 880745, 1153197, 839832, 1082533, 1023010, 951158, 1283220, 1275764, 969326, 602414, 847420, 567394, 942317, 831481, 966355, 1118505, 896090, 592917, 1038382, 916746, 854203, 836493, 484005, 708108, 657081, 1129233, 826430, 943513, 946362, 701937, 349502, 517994, 733968, 842875, 751937, 659121, 1116497, 829783, 928134, 1008505, 855051, 661864, 233115, 770390, 855256, 516613, 790752, 560569, 823708, 715315, 991510, 944285, 1066557, 306374, 285692, 379700, 708611, 436380, 404469, 365117, 678408, 991707, 752991, 417614, 533330]
16355E33330J72566K76456D03736Q4019L85865k59584L9721J46676j33881j01428
16345E65124j0099m5480j66171K79095O7529j83201M6918n2597M1550k5050K93483
16334H11101k25454A55372N34238J30542p1887o9886j87019A88217L21600J91180
16324G00997m0478C01546N4243P2568L44437C11009k7727K16935j59726M74466
16314H14957j23980k79021J75617J30117J43148m17891J53955o5946n9811K83024
16304G54169C51858J67559N0880A43770M35786k13914l0955O8215P8724L5663
16294E17289j99414J89707j458A72862J90057M14576B25823J68547J47988H1531
16283D85140B23772M43599k90913A37193N51888C27367L14937k38739K32112k34568
$$ y = [533330, 705896, 982352, 403736, 487755, 873620, 614036, 653757, 800433, 666552, 565124, 555025, 509545, 343374, 622469, 689998, 506797, 553715, 501118, 542668, 517618, 811101, 585647, 155372, 689610, 820152, 748265, 678379, 491360, 188217, 509817, 700997, 660519, 301546, 355789, 428357, 772794, 311009, 283282, 500217, 340491, 814957, 690977, 411956, 587573, 717690, 860838, 442947, 596902, 530956, 471145, 754169, 351858, 519417, 570297, 143770, 579556, 365642, 334687, 402902, 481626, 517289, 317875, 507582, 506124, 172862, 362919, 777495, 225823, 394370, 542358, 81531, 485140, 223772, 667371, 376458, 137193, 689081, 327367, 642304, 403565, 635677, 401109]
16273D01109j38581n6790N0953k6398L85992l06108L30056k28529K38275B79012
16262H35269B55183L49952j17743j47205j38931K51503j56517j08723J8972M8600
16252B55091J83165B13584R9945L1661J07976p6667A87280l6596J64994q3061
16242B32617K14108B12700K58171K04975q7774B30275J39907m0361E5023J22624
16232A77647J86712A48980K23282d8086C54976O3665k528k2673J2006I8621J99356
16221B97977L3610P939J15796p489A79654C3564K24093r884O0744k1032g6183
16209H4609f1378A50164Q8750P018R7644A40715o1030M03520k38572a45258D15879
16197A64261L288J75991J24634k02572E2037O50092d1485C77852l9A84551Q5495
$$ y = [401109, 262528, 205738, 256691, 230293, 616285, 310177, 640233, 411704, 649979, 279012, 835269, 255183, 605135, 487392, 340187, 201256, 452759, 296242, 187519, 206491, 255091, 438256, 213584, 313529, 345190, 453166, 376499, 187280, 150684, 315678, 232617, 446725, 212700, 470871, 675846, 588072, 230275, 370182, 329821, 55023, 177647, 364359, 148980, 372262, -48086, 354976, 418641, 416113, 393440, 405446, 98621, 297977, 331587, 339526, 455322, 447833, 179654, 33564, 257657, 247773, 308517, 287485, -76183, 84609, -61378, 150164, 238914, 245932, 343576, 140715, 79685, 483205, 244633, -145258, 415879, 164261, 167549, 343540, 468174, 265602, 52037, 702129, -41485, 377852, 377813, 184551, 270046]
16186B70046r4930B4830J86456H1237K80674G5191K3240j7958J71829i7749A39377
16174C13514M8835I7525K9807E5442J52611R5454J36659j51943K58162H6213C5252
16162D04492A47228L92905E4136K87584d1011B64501Q8622g6187A0467O0016J64398
16151B34881A13206f9454A81052c567B80274o3620J9459a3416C23800h7946r2465
16140a80411A47000R623J334G2505J01599J94361i920n2277a8764q45B35825H3183
16127a26903N5703K2338B38455A16559d5396r629A56645p726g1005H9570o803
16116H2767J67513A2147J20495B9461K12798d9653B41017R4698a21448G8729J05264
16105A83993j7153J26084j27529A3325b6852r8461C8297L4842J03264h0903a68
$$ y = [270046, 175116, 24830, 211286, 81237, 361911, 75191, 98431, 80473, 252302, -97749, 139377, 313514, 362349, 97525, 127332, 55442, 208053, 303507, 440166, 288223, 546385, 86213, 35252, 404492, 147228, 540133, 54136, 341720, -41011, 264501, 353123, -76187, 10467, 70483, 234881, 113206, -69454, 181052, -3567, 280274, 216654, 236113, -13416, 323800, -87946, -180411, 147000, 156623, 157957, 72505, 174104, 368465, -9920, -62197, -18764, -19609, 235825, 83183, -126903, -71200, -48862, 238455, 116559, -45396, -55025, 156645, 148919, -71005, 89570, 82767, 250280, 12147, 132642, 29461, 242259, -49653, 241017, 335715, -121448, 78729, 183993, 166840, 292924, 165395, 13325, -26852, -125313, 38297, 73139, 176403, -80903, -168]
16093C6733a17785B9239a8797A23710N2602k5226c5925E4661L0596J89527a02522
16081D0428K05259b7440a1569k39424e6975B57907D5231M0623i3078E13772A58459
16069D15868H0609J33635J5578q7504b22494a02128A56299b07217g0555j61216
16059b31771f6951c1070A53499a213k26177D4252K35655J83622H038K93661p5745
16048B25954n0385l5810C3420d9109j49059D3388b6498H4251A6335P8049M5888
16037A40272K7228B7049h1539A66740c6713A80523J00967o1155a77019D13737
16026I2195P9044J8578a36061F6128a06575d8126D1870J15069B9863a87411L4115
16015a53296B28583a4838j5784n6177A22535A8253b82072a08368A42643Q1352
$$ y = [36733, -117785, 29239, -18797, 123710, 176312, 151086, -35925, 54661, 85257, 274784, -102522, 40428, 245687, -27440, -11569, -250993, -56975, 257907, 45231, 85854, -93078, 513772, 158459, 415868, 80609, 214244, 229822, 142318, -222494, -102128, 156299, -207217, -70555, -231771, -66951, -31070, 153499, -1213, -227390, 44252, 279907, 463529, 8038, 301699, 225954, 175569, 139759, 33420, -49109, -198168, 43388, -26498, 84251, 16335, 94384, 140272, 167500, 27049, -81539, 166740, -36713, 180523, 281490, 220335, -177019, 413737, 92195, 171239, 189817, -136061, 66128, -106575, -48126, 41870, 156939, 29863, -187411, -153296, 228583, -14838, -30622, -86799, 122535, 18253, -282072, -108368, 142643, 223995]
16005B23995I1106J12136H4133a11881F9779M1277m983g3654k2301O044L4260
15994e5651B12720n9290D0728K37530a29251A41248n5400J61630A13153m2166
15984G0987a18503A94446K99666j65151A55429Q1782c3010A07880K91424j14833
15974B84471R6714Q9707j3188m0927M04756K15679j20187l9299k12502R2954B79079
15962D3187j8901J87192j5481J42688E3036K07702b166D827J26444a76892j02097
15951b78989B38452a43522l9546I9467k8186a41246n3916j7376A32426b05907
15940A67643C1181a60197b0828n0324E2689a28604k5228f7557D262R4169L52524
15929D50955a34622d8694p0691l8921A24529i0623B28022f263m822k34817F6238
$$ y = [223995, 91106, 203242, 84133, -111881, 69779, 111056, 106073, -73654, -95955, -89911, -55651, 212720, 153430, 40728, 278258, -129251, 141248, 85848, 247478, 113153, 70987, -118503, 194446, 494112, 328961, 155429, 237211, -33010, 107880, 399304, 284471, 381185, 470892, 457704, 416777, 821533, 1037212, 917025, 877726, 665224, 758178, 279079, 43187, 24286, 211478, 195997, 338685, 53036, 260738, -2166, 4827, 131271, -176892, -278989, 238452, -143522, -183068, 99467, 71281, -141246, -195162, -212538, 132426, -205907, 167643, 31181, -160197, -20828, -71152, 52689, -128604, -153832, -67557, 4262, 98431, 450955, -134622, -48694, -119385, -158306, 124529, -90623, 228022, -6263, -11085, -245902, 66238]
15917A62507J51958b59601A23600E1452J95469c700F908N860K99761j23549l2466
15906A56514a0340m2262m9405A09297e5520B87922d57551B26991q920G841M44191
15895D52032H5741i2406l41986J19019B03036a53993C5548K31651a39648A42017
15884H1240c2988C24727i7928A0523n193c28312G2119K1715k9736b71374M2010
15873b29364a12462e6115l55424B16574H6002d2293A56380b07275h823o1454G4100
15861c55042Q2537d4946j12333D40898c84405f072l3417D8970j6197J6295b35827
15849a20039A09510D8186g708B63072A14861e14170A89307R7188b58592B40863
15838b645A97655a25787l7709L7505B53775P1559a90898L2048O1682M2181n2603
$$ y = [162507, 314465, -259601, 123600, 51452, 246921, -3700, 6908, 12768, 312529, 188980, 156514, -10340, -52602, -102007, 109297, -55520, 287922, -457551, 226991, 218071, 7841, 452032, 85741, -92406, -434392, -315373, 203036, -153993, 35548, 267199, -139648, 142017, 81240, -32988, 324727, -97928, 10523, 5330, -328312, 72119, 93834, 64098, -271374, -229364, -112462, -56115, -411539, 216574, 86002, -42293, 156380, -207275, -8823, -70277, 74100, -355042, -272505, -44946, -157279, 440898, -384405, -6072, -39489, 48970, 32773, 49068, -235827, -120039, 109510, 48186, -7708, 263072, 114861, -514170, 189307, 286495, -258592, 240863, -2645, 197655, -125787, -163496, -125991, 253775, 325334, -190898, -158850, -97168, -54987, -107590]
15827a07590B86950j07083q1836b13411j05431P1629A75452E3966g5760I63P527
15816H490d21778J27084i6689D43808c44823O7592G6619J2980i2268l53746I4303
15804i4924a7323A07819c07137P0476B42097b787j31546A36956k2319E2819a23926
15792b55562q1988B06971C9936J80437a9715I024N6880J6659d6296l3356D8262
15780a24345d4224E3929g1049o2471r8802A64834a9839l1501B0649b14636J06401
15769a08235J0116C2188c5967D647b82350A40649d1111A88757C7398A7626K8633
15758D6259a60558o168H1793J2484a62872A06164a02824j15055R2833B54670H0164
15746D4854M9984Q7754O8726j6190b51979A73953L31866A97403c4668k10772P8468
$$ y = [-107590, 286950, 179867, 98031, -213411, -318842, -247213, 175452, 53966, -75760, 963, 8490, -421778, -294694, -96689, 443808, -344823, -277231, 76619, 89599, -92268, -446014, 94303, -94924, -17323, 107819, -307137, -236661, 242097, -2787, -134333, 136956, 114637, 52819, -123926, -255562, -337550, 206971, 39936, 220373, -19715, 9024, 65904, 82563, -46296, -79652, 48262, -124345, -44224, 53929, -71049, -133520, -232322, 164834, -19839, -51340, 20649, -214636, -108235, -98119, 32188, -35967, 4647, -282350, 140649, -41111, 188757, 37398, 17626, 46259, -160558, -166726, 81793, 94277, -162872, 106164, -102824, -217879, -125046, 254670, 80164, 44854, 94838, 182592, 251318, 235128, -251979, 173953, 505819, 197403, -34668, -245440, -166972]
15735a66972A55822k2084a63138C63494A1358b48336R5935p6016i6689M5828l6527
15724h7388K500D1124a13535A70980b3835A37885b49028c2093k72808F980p68
15713F212d7902B84272e116E9070J59682f5781a5503j26664n5348F0425e10873
15701c00A16539A1971a84192k5675O4362n2007I2449J87739A21510D9005J8064
15690F7069R9381E168O03608A10592e7656B59107k1034c05989a40310A06977A359
15678i767C3161d61082C04778A10888a15395D27087a15829k4234A52759j9142
15668A33617m2329b30386A6032f9076H0620a9900D14761a00865l2928b2558A22144
15656A65629b1137A89770h5735I1877D1709a253j84446j2279D2487a5954o9889
$$ y = [-166972, 155822, 133738, -163138, 363494, 11358, -248336, -152401, -228417, -96689, -50861, -87388, -84888, 41124, -113535, 170980, -23835, 137885, -249028, -32093, -304901, 6980, 6212, -47902, 284272, -5116, 59070, 218752, -65781, -15503, -142167, -197515, 60425, -510873, -300, 116539, 11971, -184192, -209867, -145505, -197512, 92449, 280188, 121510, 49005, 67069, 166450, 5168, 608776, 110592, -57656, 259107, 238073, -305989, -140310, 106977, 1359, -9767, 33161, -461082, 304778, 110888, -115395, 427087, -115829, -140063, 152759, 133617, 91288, -230386, 16032, -69076, 80620, -19900, 414761, -100865, -133793, -22558, 122144, 165629, -21137, 189770, -85735, 91877, 41709, -1253, -185699, -197978, 42487, -15954, -85843]
15645h5843A86563c74834a3929l9635r4876d3586A54108b76357i6465A48643g4175
15633C7967a9130B3614h1034r0295H0113c1948n1163A10670a87558M226P8570
15622a04762j57807J16441G6736b45544B14824i3558K1232L2956l0334A51154
15611f022B20470e9912D8686a55726C3909G094N0983g1056A35015a22364k17013
15600c39377R1954B69174b2973A58862h9027H2120L3434a31244B5964b05786A36307
15588A77503a9946o0332k8752p1342O4679H7689h8335B87018a21144A40070a25665
15576c29059R8448h3019c7058p8967A29565Q03a30065C5632M5369L279A5887f9257
15563a16740a0254j75302d8939A98942Q926f0105H1962a02199A30562i4138A82074
$$ y = [-85843, 186563, -374834, -13929, -53564, -148440, -43586, 154108, -276357, -96465, 148643, -74175, 37967, -19130, 23614, -81034, -171329, 80113, -31948, -83111, 110670, -187558, -183332, -104762, -262569, -146128, 76736, -245544, 214824, -93558, -72326, -39370, -69704, 151154, -6022, 220470, -59912, 48686, -155726, 33909, 7094, 58077, -71056, 135015, -122364, -339377, -247423, 269174, -22973, 158862, -89027, 82120, 115554, -131244, 25964, -205786, 136307, 177503, -19946, -80278, -109030, -180372, -115693, 87689, -88335, 287018, -121144, 140070, -125665, -329059, -230611, -83019, -37058, -116025, 129565, 130368, -130065, 35632, 81001, 84280, 15887, -69257, -116740, -10254, -185556, -48939, 198942, 207868, -60105, 81962, -102199, 130562, -94138, 182074]
15551c56151J55215G5018L6122b4859E3431i8309C5975H670a42387D5291J82191
15540B27482c00991A03260J5173a15399c0772D1874Q4883C7286e6877K282n6249
15529a10844M8435b4582A50998l3304J9386F7715a3320j71089f3788I5217J61831
15518B57048a07509d4426B57631a3929n952I3239B7030k764h1311B4452h7266
15506i0200H8513d204m9922E0413J99819j24745k0373K87442A55094J37823j26884
15495A66033R2598j11379J04447L678o5910J17927j08257a8462E8449L114d4677
15483a63416B92704G4949K48370D6211e4799B14676K1708a06382J2875A87638
15472H5276A7225J73424h9235B41087b2149C95512j24893m7198j10900P5213c0308
$$ y = [-356151, -200936, 75018, 111140, -24859, 53431, -98309, 35975, 8670, -142387, 45291, 227482, -300991, 103260, 118433, -115399, -30772, 41874, 126757, 37286, -56877, -54595, -110844, -62409, -24582, 150998, 117694, 137080, 67715, -13320, -184409, -63788, 95217, 257048, -107509, -44426, 257631, -13929, -19881, 93239, 27030, 24266, -81311, 24452, -87266, -90200, 88513, -4204, -54126, 50413, 250232, 125487, 105114, 392556, 155094, 292917, 166033, 258631, 147252, 251699, 255377, 189467, 307394, 199137, -18462, 58449, 61563, -44677, -163416, 292704, 74949, 323319, 46211, -54799, 214676, 236384, -106382, -93507, 187638, 85276, 17225, 190649, -89235, 241087, -22149, 395512, 270619, 223421, 112521, 187734, -30308]
15460A87250O9906J96970J03763Q642k54808m0378n2084r4277e0373E3702a48459
15448b56937D72525k09564o2566K2083a51686d0832F6220B4977J9082K16772D4072
15436B05392F9808K8942L88164E1009M08674H3258M27569K08274B70927A32900
15425F37052N82117n32563J66874D22972A36252J69934j21734l7424n9672K19123
15415C06479J4696A49439G3367M31936A01235e8823j15401G5534J42136e5908
15404B9724b76540R2870A19105b7220j01092a947G4578b6001c749n82897B39130
15392A24870c04887h1526A73480b57105R3059q9817g5299K2995m348j27150A73523
15380a90798A69808G8089J3420i9506L7685K8563A61621N6602a70562g6460A45335
$$ y = [187250, 257156, 454126, 557889, 566531, 311723, 271345, 219261, 124984, -50373, 53702, -148459, -256937, 472525, 262961, 200395, 222478, -151686, -40832, 66220, 24977, 44059, 260831, 44072, 205392, 69808, 98750, 486914, 51009, 459683, 83258, 510827, 719101, 270927, 132900, 637052, 1219169, 686606, 853480, 422972, 136252, 306186, 184452, 147028, 87356, 306479, 321175, 149439, 73367, 505303, 101235, -58823, -174224, 75534, 217670, -55908, 29724, -276540, -183670, 119105, -27220, -128312, -1947, 74578, -26001, -3749, -586646, 239130, 124870, -304887, -81526, 173480, -257105, -164046, -253863, -75299, -52304, -56652, -183802, 173523, -190798, 169808, 78089, 91509, -99506, -61821, -33258, 161621, 218223, -170562, -76460, 145335]
15368I3214K31041a27631M0076A6879J46629o5552K12176b4807H0964g5045A66855
15356A86307g0830B22289Q2310j32416G8339M4888l6288K23607C0120f3005B80072
15344G45017j81179A05722l0376K14796o543a3836A27581e0029B20150n3328J81470
15333C48292F1942b41533E7614a13362D91964B9021N10471k37687N5326A00937
15322B04173M33740a49181B99593m3902j09929L6933E9549J44071p4502E7927
15311A31175n4879J5056b3292A36741N6604h1280B47478F1273K34631E8812J35874
15300A94686P5679r2146M5526P3127j05892d0851C21347J41307a46304B38375
15289A26945Q0244h2454A7456b43721A5623h5869E7888O5973n9061a33682A84010
$$ y = [93214, 324255, -127631, -87555, 16879, 163508, 97956, 310132, -24807, 80964, -75045, 166855, 186307, -70830, 222289, 304599, 172183, 78339, 123227, 86939, 310546, 30120, -63005, 280072, 745017, 563838, 105722, 75346, 290142, 283599, -13836, 127581, -50029, 220150, 166822, 348292, 61942, -241533, 57614, -113362, 491964, 29021, 539492, 301805, 357131, 100937, 204173, 637913, -149181, 299593, 255691, 145762, 182695, 59549, 203620, 129118, 57927, 131175, 76296, 91352, -23292, 136741, 193345, -81280, 247478, 61273, 295904, 58812, 194686, 270365, 178219, 223745, 296872, 190980, -40851, 321347, 462654, -146304, 238375, 126945, 207189, -82454, 17456, -243721, 15623, -85869, 57888, 123861, 64800, -133682, 184010]
15277b67086H4286B6912b22072D58888A21503i1237D16778A24221a0705r2450
15267a03155N26b8025k80481A44925c7162p7153A15404a36235E3R7456a14706
15255g1151A95427f240j9946A52268F584K35306c11957C3104J18018D9691K4681
15244G4372J50463A10068b69937A55676M25830G5538K15837C5586a42368A6724
15233A42817B4660R7275N8148L14797L9667j8110R94525q4821l48461N90905n05878
15222A162707m26569l34521m8927j48927m5730E2468N3310J05068f1231C25022
15211B46733D8383J03433c36790A20390l9768L477c1995p5964C45545A35564E2892
15199a25247A49215C1895n015M8461k454B675J89880C9788a81723A46038k5465
$$ y = [-267086, 84286, 26912, -222072, 458888, 121503, -91237, 416778, 124221, -10705, -103155, -102629, -28025, -308506, 144925, -37162, -114315, 115404, -136235, 53, 97509, -114706, -71151, 195427, -6240, -26186, 152268, 6584, 241890, -311957, 33104, 151122, 49691, 74372, 224835, 110068, -269937, 155676, 581506, 75538, 291375, 35586, -142368, 16724, 142817, 24660, 121935, 180083, 494880, 534547, 516437, 1510962, 1426141, 1077680, 1668585, 1162707, 736138, 401617, 352690, 203763, 158033, 52468, 105778, 210846, -61231, 325022, 246733, 48383, 151816, -336790, 120390, 80622, 84099, -31995, -107959, 345545, 135564, 52892, -125247, 149215, 31895, 26880, 75341, 72887, 2675, 192555, 39788, -181723, 146038, 120573]
15188A20573Q6153l7609p5646m3462R6577L18489a0344k44376b4291B3883R0468
15177A14351F014K27841g0247I0571L01347j29852J95671b45507n0356F0410J46196
15166B06606p199b63483a29304F0299N8491n922a58659C8719N003J23072J14190
15155B80984A24904Q4112n082h3927A94490B3668L46379A75409p6274K9075K27351
15144C55561A32902R0140K12297m6132r6946H8094M0636c8094A54985R4091F7715
15132i1455B163J55331K12815p5557G0240C1592m163J16293Q075a5594C46428
15120d9950C2663i0794C873K35930L55195k33292A54205N2905e5097B73177I2910
15108C90268i0653C39936r0576j10701M15156l366B67376m4694K81066A05525
$$ y = [120573, 206726, 169117, 93471, 50009, 146586, 465075, -10344, -254720, -24291, 23883, 114351, 6014, 233855, -70247, 90571, 391918, 262066, 457737, -245507, -295863, 60410, 206606, 199407, -263483, -129304, 60299, 118790, 112868, -158659, 38719, 43722, 166794, 280984, 124904, 209016, 203934, -83927, 194490, 23668, 370047, 175409, 99135, 128210, 355561, 132902, 223042, 435339, 389207, 292261, 88094, 128730, -38094, 154985, 249076, 67715, -91455, 2163, 157494, 370309, 294752, 70240, 31592, 27429, 143722, 151797, -15594, 346428, -49950, 32663, -90794, 3873, 239803, 594998, 361706, 154205, 207110, -55097, 273177, 92910, 390268, -90653, 339936, 249360, 138659, 553815, 550449, 267376, 222682, 503748, 105525]
15097D29653A13892Q7513k3116J8705j518P4714a316p4721A95827J0758J67413
15086C73998j74859A4332K34453J0933a35024C17811j26176J26952j33805o6399
15076A18383m3246J98981q5899Q1567r9345L71064b9285C1892L17657j58341d207
15064B25531C5615L03647a1642A73770L0621A7706J96004f9643a5085A33159m7035
15053H6124M43314k27696K48956G6093A2394L79868J9948l4871r4044J21355A80756
15041A53817N17648B51250K03841A78036L62613b31554B46063j07047K07703j42542
15031B04177M3036J13839h2481B41417j08525J77080A17359L33494k04823L11837
15021E57867k01055N378N19948D38140k01000O9761L82156J40544j02460r3777
$$ y = [429653, 113892, 201405, 178289, 196994, 195476, 270190, -1316, -76037, 195827, 206585, 373998, 199139, 14332, 248785, 259718, -135024, 317811, 191635, 318587, 184782, 118383, 75137, 274118, 188219, 269786, 170441, 541505, -29285, 31892, 349549, 191208, -4207, 225531, 35615, 339262, -11642, 173770, 204391, 17706, 213710, -69643, -15085, 133159, 86124, 529438, 301742, 550698, 76093, 12394, 392262, 412210, 377339, 283295, 404650, 180756, 153817, 671465, 251250, 455091, 178036, 540649, -231554, 246063, 139016, 346719, 204177, 247213, 361052, -82481, 241417, 132892, 309972, 117359, 450853, 246030, 557867, 356812, 362190, 882138, 438140, 237140, 306901, 689057, 829601, 727141, 633364]
15011F33364j13368k28653J54892j09438K18044n0965J4860k23303L88142A99551
15000F55885C00683K13150j48799r7019J56108o6759o1072P4016j08799J78620
14990D40129N1159j76260J13271j80837K0323M05470j59265J3441P0440A10906
14979E16212B50147O81228C43866L39986J55844C82017L28860l29531J22783K50328
14969G54457C75996J40443M40517p9166l04653M05305D22865K26135q6288j0480
14959E52232L9304o8917L65335j05720p2170p3507j44335J43022F9743M15983
14949D85726J02358r2738n2352j56724D7318L89889N5838r7049P8705k11791R5234
14938C58144Q885R3906M5624J04583o71j72684J1393L29338j07287O9320l0113
$$ y = [633364, 519996, 291343, 446235, 336797, 554841, 503876, 518736, 295433, 683575, 199551, 655885, 300683, 513833, 365034, 268015, 424123, 357364, 296292, 370308, 261509, 440129, 491288, 315028, 428299, 247462, 267785, 673255, 513990, 527431, 597871, 110906, 516212, 250147, 931375, 343866, 683852, 839696, 382017, 710877, 381346, 504129, 754457, 375996, 516439, 956956, 877790, 573137, 978442, 422865, 649000, 562712, 552232, 591536, 522619, 887954, 782234, 710064, 636557, 492222, 635244, 69743, 485726, 588084, 495346, 442994, 286270, 47318, 437207, 493045, 395996, 474701, 262910, 358144, 367029, 460935, 506559, 611142, 610471, 437787, 449180, 778518, 671231, 740551, 710438]
14927G10438J09776M4836j60500l6666l20157N1678j96675L53136j9155r3482
14917D43229J51548L24668J06046J56179o4766K82426J07142j26143J7861L71605
14907A769795k03555j65266j92518L72922N6379K09044J50861J70347q7824n93146
14897A487039k63459l71557P1361p7371D12150N9121J67510j35140J86521j57853
14887E32309n6216n2799P5424o486p4607j23094J68956j44622Q8791K37799C14442
14875E42035J69990J17534k03012j75872K9210K63843K2079K843J37062l2175
14865H73537l12339L66258j64106j82227J98068l42717N15744m48718J95515j16214
14855E82801k14460M16752k37976K15732m524K7440p5055j24991Q7289R8040D8840
$$ y = [710438, 820214, 865050, 704550, 667884, 347727, 399405, 202730, 555866, 536711, 443229, 594777, 919445, 1025491, 1181670, 1116904, 1399330, 1506472, 1380329, 1398190, 1769795, 1566240, 1400974, 1208456, 1581378, 1637757, 1846801, 1997662, 2168009, 2080185, 1487039, 1223580, 852023, 923384, 846013, 412150, 471271, 638781, 503641, 690162, 532309, 476093, 423294, 498718, 492232, 417625, 294531, 463487, 318865, 407656, 645455, 314442, 542035, 712025, 829559, 626547, 450675, 479885, 743728, 765807, 768650, 905712, 873537, 561198, 927456, 763350, 581123, 779191, 436474, 952218, 503500, 699015, 582801, 368341, 785093, 547117, 762849, 758325, 785765, 710710, 585719, 673008, 771048, 48840]
14843C82129N3565L8868K12906l4718j96658A54760M15202j42854K26062n3900
14833E99270N377j0841J7736J58240j95067L67688J77278m2256m20070O61012
14823A318367k6997m71624J42746J54700j32181k19445L4777k53974J42149l12453
14813C76065K81831j4324R4510j78029L045j41763K63024L73514l48487L01915
14803A011301l55731M13807k42343K08172k53326j01839J39459j24657J25258
14794H20101k08606j09956K57114O0753L6926J11942k08666K31789j64185R724
14784H36936j89807K21582D17650K67491j82554M6339l2507L5832n1786P112J37751
14773F45328p241K1972l01138K83371L28404j45585k68664L76633j55576J46911
$$ y = [382129, 435694, 474562, 687468, 652750, 456092, 154760, 569962, 427108, 653170, 599270, 604647, 593806, 611542, 769782, 574715, 942403, 1119681, 1077425, 657355, 1318367, 1291370, 819746, 962492, 1117192, 985011, 765566, 800343, 546369, 688518, 376065, 657896, 643572, 738082, 560053, 563098, 421335, 684359, 1057873, 709386, 1011301, 655570, 1069377, 827034, 1035206, 781880, 680041, 819500, 694843, 820101, 611495, 501539, 758653, 819406, 856332, 968274, 759608, 991397, 827212, 836936, 647129, 868711, 417650, 685141, 502587, 548926, 516419, 552251, 500465, 507577, 645328, 638087, 660059, 358921, 642292, 970696, 825111, 556447, 933080, 777504, 924415]
14763I24415k95818L71785k06824K08236j05504j99715M44726j30670j54065l28272
14753E28294K83872J39497m37947M30830l52125R6603K9479j1359N2359q4482
14743F75021L05346l84866j31217L07351C57392L13887r2652J86961n4976J23605
14733H34217Q6824k28159J01222k36940L59913k5323k26752p7786L17433j9992
14723H84657m1937J20328j70664L4978k12922K65391J19867Q7907K13547N4113
14713A355265j4437l5336L28033l63549K41448N3352l01709j11702k57717J85215
14703A078863o4205K5403Q7996j02399K1610j30169K45235j68293R8523j75643
14693I16921K20392q9498j22515L64352r7618J56778M84991j59994Q5972K04084
$$ y = [924415, 628597, 1000382, 793558, 1001794, 896290, 696575, 1141301, 1010631, 856566, 528294, 812166, 951663, 513716, 944546, 592421, 689024, 718503, 707144, 759503, 675021, 980367, 595501, 464284, 771635, 357392, 671279, 578627, 765588, 710612, 834217, 921041, 692882, 794104, 557164, 917077, 891754, 665002, 587216, 904649, 884657, 842720, 963048, 792384, 827362, 614440, 879831, 999698, 1087605, 1301152, 1355265, 1340828, 1305492, 1633525, 1269976, 1511424, 1564776, 1263067, 1151365, 893648, 1078863, 1014658, 1040061, 1128057, 1025658, 1047268, 917099, 1162334, 994041, 1092564, 916921, 1137313, 1047815, 925300, 1289652, 1192034, 1348812, 1833803, 1673809, 1759781, 1963865]
14683A963865l85364k31780j3164m07223L53193j63422k54410L09382l6241p8063
14673A056773Q1929j37357N8072O1355p2075j5068j05745l05339L15264L5396
14663I73205J93640k43419O2368p2706j07180N39054l06991J03050j1867M8851
14653A178005l17021K71613K023J10528j10396K80819m23765m46804O58126M6586
14643A249714j10450J10621J81162l48228N07864o6896l96704M21085k68227L44214
14633A624155r293k02051k18718M7086j37368L21087q6751q8362J54490k9841
14623A374434l00191L32989p8602k93845M08282J00538q8187J27651l68053l49563
14613H65453L92477k21908M80285K39873m04093L9572p6371k23799J11718K44507
$$ y = [1963865, 1578501, 1346721, 1333557, 926334, 1279527, 1116105, 861695, 1171077, 1134836, 1056773, 1138702, 1001345, 1059417, 1120772, 1048697, 1033629, 927884, 622545, 937809, 973205, 1166845, 923426, 985794, 913088, 805908, 1344962, 1037971, 1141021, 1129154, 1178005, 860984, 1132597, 1134620, 1245148, 1134752, 1415571, 991806, 545002, 1203128, 1249714, 1139264, 1249885, 1431047, 1082819, 1590683, 1523787, 1127083, 1548168, 1279941, 1624155, 1614862, 1412811, 1194093, 1241179, 1103811, 1424898, 1338147, 1249785, 1404275, 1374434, 1074243, 1407232, 1328630, 1034785, 1443067, 1543605, 1455418, 1583069, 1215016, 865453, 1257930, 1036022, 1516307, 1756180, 1352087, 1391659, 1315288, 1091489, 1203207, 1447714]
14603A447714Q7698q8339j97974N94759l14590J22700J38885l40094O26571n45235
14593A532095J5689q6077j20163J07181N1125L49988l05639K22247j48067J36409
14583A754788L0441J92504k273l14131J01391K1307L76374k95578M2227k56227
14573A650823J70817J34058J53155k60373Q9568K3393j00099J58310r9999J87078
14563B106731m8283k76104P2894L19749P3102J88021Q345j93336J56492n7311
14553B350300K12543p2336l21371K80876K10533l3864J15681M50171l48434J44625
14543B988724M87173k53970L52036P09966K98916K59621Q46900L36911J514635
14534G540912J949042L629894N796349J1228673N102140j4526457r131680m227802
$$ y = [1447714, 1535412, 1447073, 1249099, 1843858, 1529268, 1651968, 1790853, 1450759, 2077330, 1532095, 1547784, 1461707, 1341544, 1448725, 1499850, 1849838, 1544199, 1766446, 1618379, 1754788, 1785229, 1977733, 1975460, 1661329, 1762720, 1784027, 2160401, 1864823, 1907050, 1650823, 1821640, 1955698, 2108853, 1848480, 1938048, 1961441, 1861342, 2019652, 1919653, 2106731, 2058448, 1782344, 1855238, 2174987, 2248089, 2436110, 2444455, 2251119, 2407611, 2350300, 2562843, 2490507, 2169136, 2450012, 2660545, 2626681, 2742362, 3192533, 2844099, 2988724, 3475897, 3221927, 3573963, 4283929, 4582845, 4842466, 5689366, 6026277, 7540912, 9489954, 13119848, 18916197, 30144870, 35247010, 20720553, 11588873, 7361071]
14526G361071k832217m19472j77473P5545L94433K1459j442339J92724j31967
14517C041764n17352k39773K95518k30098L50023j87025m22039K33251L05418
14508B629687j63492k92638J16359K54940O978M0339K44949n27770P58881l5677
14498C032556P627l62684j9718L07765j93961K41363k19777K79134j55k6058J24024
14487C170116J64941k74855M47111j60062j99451P5006l6576L89191j90114K33770
14477C619077j4449K40366j31644J43716k31796J40329j07606p4156L15423Q7752
14467C987012k77339J04331K09289l73160P91362k42267o2213Q4612K21261k81464
14457D161424O50268n9173J0132N2794n76056K01358J39398M47446n8404r6592
$$ y = [7361071, 4528854, 4109382, 3931909, 4007454, 4401887, 4423346, 2981007, 3173731, 3041764, 2524412, 2284639, 2580157, 2350059, 2700082, 2513057, 2091018, 2324269, 2629687, 2466195, 2173557, 2289916, 2544856, 2551834, 2592173, 2837122, 2309352, 3068233, 3032556, 3040183, 2677499, 2657781, 2965546, 2771585, 3012948, 2793171, 3072305, 3072150, 3046092, 3170116, 3335057, 3060202, 3507313, 3347251, 3147800, 3222806, 3186230, 3575421, 3385307, 3619077, 3604628, 3844994, 3713350, 3857066, 3625270, 3765599, 3657993, 3583837, 3899260, 3987012, 3709673, 3814004, 4023293, 3650133, 4441495, 4199228, 4137015, 4221627, 4442888, 4161424, 4811692, 4752519, 4762651, 4815445, 4239389, 4440747, 4580145, 5027591, 4969187, 4872595]
14447D872595l57763L55279K03934R7573l3023L1665J32105K29585J21039q8587
14437E564402r860n5182K39802m0877J82277j47123K79971k47412N70622J51119
14427F487739m41282K35535J25196L6779J79894J45914k34691P71L97519j5066
14417F918308l2170L77148R7139m1444J37412J27538K15778L28247k61193M49001
14407H315764J4684j19362J17391L40135N17094o03650M24284J96718l32159P33267
14397I604166n49789K18760K69273J97595L47664N2644j93949O50242L17359k0938
14387A0893027l5516o192M78179l24766L70316L13282J8070J54570L67814J07327
14377A2336111N86800K23385l00392K77034L66096J34317K92747L69336J05378
$$ y = [4872595, 4514832, 4870111, 5074045, 5171618, 5138595, 5170260, 5302365, 5531950, 5652989, 5564402, 5554542, 5499360, 5739162, 5698285, 5880562, 5733439, 6013410, 5765998, 6336620, 6487739, 6046457, 6281992, 6407188, 6443967, 6623861, 6769775, 6535084, 6535855, 6933374, 6918308, 6886138, 7263286, 7360425, 7318981, 7456393, 7583931, 7799709, 8127956, 7866763, 8315764, 8330448, 8211086, 8328477, 8668612, 9185706, 8582056, 9006340, 9203058, 8870899, 9604166, 9054377, 9273137, 9542410, 9740005, 10087669, 10140313, 9946364, 10596606, 10913965, 10893027, 10857511, 10851319, 11329498, 11004732, 11375048, 11688330, 11706400, 11860970, 12228784, 12336111, 12922911, 13146296, 12845904, 13122938, 13489034, 13623351, 13916098, 14285434, 14390812]
14368A4390812M26104J97046L72001K56482N83476P8048K94899J02119P0553L73083
14358A7144623N52146R9675N37677M19793O90604M5289K03635P44855M82425J96848
14348B1117570N60858P75796k91141P12361N96052J41775O43644N87042Q46305
14339B5690262N38900P43175M24167L91530J026097P49497N54550R55457R48170
14330C2021805P97455Q97304L35917J399543J053184O09758J481058J051849J171662
14321D0819535R47670J097359J580387P69141J598214J543081J675521J300738
14313E1331646J927413J421555K106424J959273J866959K286046K090484K308760
14305F7298560K508216K463621K886843K753695K848305L187455L057165L444256
$$ y = [14390812, 14816916, 15013962, 15385963, 15642445, 16225921, 16303969, 16598868, 16700987, 16771540, 17144623, 17696769, 17796444, 18334121, 18753914, 19444518, 19489807, 19693442, 20438297, 20920722, 21117570, 21678428, 22454224, 22163083, 22875444, 23471496, 23613271, 24256915, 24843957, 25690262, 26229162, 26972337, 27396504, 27788034, 28814131, 29563628, 30118178, 31073635, 32021805, 32819260, 33716564, 34052481, 35452024, 36505208, 37114966, 38596024, 39647873, 40819535, 41767205, 42864564, 44444951, 45214092, 46812306, 48355387, 50030908, 51331646, 53259059, 54680614, 56787038, 58746311, 60613270, 62899316, 64989800, 67298560, 69806776, 72270397, 75157240, 77910935, 80759240, 83946695, 87003860, 90448116]
14297I0448116L998034M007441L512840M795596M490103M575695N395626N330640
14289A26554091O363336O216975O508843O958850P921543P479823Q379477Q840607
14281A85223545R418220R453384J0423208J0724117J1499170J2290338J2251378
14274B61283360J3163065J3588440J3984184J4404492J4641390J4578931J4091531
14267C59735393J3028507J2480859J1879190J1045703J0621559R968324R119043
14260D37878578Q139524P223249N270234M196926L076086K413969Q2362p027655
14252D61253273l722913o138802q585997j2072587j3076961j4908753j3810158
14245C88937102j3007073j4418965j4473755j4201383j4205214j2925954j3894626
$$ y = [90448116, 94446150, 98453591, 101966431, 106762027, 111252130, 115827825, 121223451, 126554091, 132917427, 139134402, 145643245, 152602095, 160523638, 168003461, 176382938, 185223545, 194641765, 204095149, 214518357, 225242474, 236741644, 249031982, 261283360, 274446425, 288034865, 302019049, 316423541, 331064931, 345643862, 359735393, 372763900, 385244759, 397123949, 408169652, 418791211, 428759535, 437878578, 446018102, 453241351, 458511585, 462708511, 465784597, 468198566, 468280928, 461253273, 457530360, 451391558, 442805561, 430732974, 417656013, 402747260, 388937102, 375930029, 361511064, 347037309, 332835926, 318630712, 305704758, 291810132]
14238B91810132j3630514j2040042j2058141j2306743j1874945j1554464j0120418
14231B08224865j0682443j0000285r199738q365834q665782p555950p270068o672532
14223A39812233o137656n764588n756907n183801n763246l874235m711591l714586
14215I8905623l964961m026442l328735l540434l308508l002529k921596k686905
14207G2125513k456064k522820k090592k298283j895370k431711j982526j432572
14199E5015575j883586j401754j674133j193802j749520j316904j634610m13465
14191D3747801j442834j318589j061021j552799p20708j246743l11223j433617
14183C4660267o68028r63232o94222j030955n83010p89556q92219o37560q76654
$$ y = [291810132, 278179618, 266139576, 254081435, 241774692, 229899747, 218345283, 208224865, 197542422, 187542137, 178342399, 169976565, 161310783, 153754833, 146484765, 139812233, 133674577, 127909989, 122153082, 116969281, 111206035, 107331800, 102620209, 98905623, 94940662, 90914220, 87585485, 84045051, 80736543, 77734014, 74812418, 72125513, 69669449, 67146629, 65056037, 62757754, 60862384, 58430673, 56448147, 55015575, 53131989, 51730235, 50056102, 48862300, 47112780, 45795876, 44161266, 43747801, 42304967, 40986378, 39925357, 38372558, 37651850, 36405107, 36093884, 34660267, 33992239, 33029007, 32334785, 31303830, 30720820, 29931264, 29039045, 28401485, 27524831]
14174B7524831n42521n77269n92633p51241l50884l80224p15585o78109j22554
14165B2813811p60503n69309J13571q71314m11543o76446m9859m19314k53172
14156A8915922m28369l2268j013259j94112k94610k72461k04408l15355n98415
14147A5562665r9566l69331l22094l39701k06634J94802j62410n62987k48095
14138A3446649k28305j63355k70776K64251n73377l53646l06276j75563j28350
14129A1511252P8182m99472K5905r7846o15132r2646j2831l11909L38537k09728
14119A0114312k83303n7695n45583K64571j27431k22649J7522j97119L1447p2258
14109H921814j36324j95068j87263K4273m62457P1121k56602J08729l61048j11713
$$ y = [27524831, 26982310, 26405041, 25812408, 25061167, 24710283, 24330059, 23614474, 22936365, 22813811, 22053308, 21483999, 21597570, 20726256, 20314713, 19638267, 19588408, 19169094, 18915922, 18487553, 18455285, 17442026, 17247914, 16953304, 16680843, 16476435, 16161080, 15562665, 15463099, 15093768, 14771674, 14431973, 14225339, 14420141, 14257731, 13694744, 13446649, 13218344, 13054989, 12784213, 13048464, 12475087, 12121441, 11815165, 11639602, 11511252, 11589434, 11089962, 11115867, 11018021, 10402889, 10310243, 10297412, 9985503, 10324040, 10114312, 9831009, 9773314, 9227731, 9492302, 9364871, 9142222, 9159744, 8962625, 8994072, 8921814, 8785490, 8590422, 8403159, 8427432, 7964975, 8036096, 7779494, 7888223, 7527175, 7415462]
14099G415462p9344M65377m95546o1357l2201k11818j05398k29988k52278J39126
14089F552035L9492j56574O8579J66582m77656k49648L27699m31248K63882L272
14079F106415k72853l53363L77592k63067k67312P8383L04232r2593n03022J83694
14069E298106j80033K7773l98326N24040o427l30363k4439r5039l11814K69543
14059D773021j75593Q9360K04578j60199j31957j11958j61462j53223J22764j36145
14049D159186M41367m82754J30791o0991L96993j73557l09357j10448l3412O973
14039C964791L71040m53283p0313P2901R1345k45249p3663j54899K33816Q4488
14029C820974K0897m57816J50239j1487k02797j03651J58604j13090j72939j19672
$$ y = [7415462, 7336118, 7801495, 7305949, 7244592, 7212391, 7000573, 6895175, 6665187, 6412909, 6552035, 6591527, 6434953, 6503532, 6670114, 6192458, 5942810, 6270509, 5839261, 6103143, 6106415, 5833562, 5480199, 5857791, 5594724, 5327412, 5405795, 5710027, 5617434, 5114412, 5298106, 5118073, 5145846, 4747520, 5271560, 5265133, 4934770, 4910331, 4815292, 4503478, 4773021, 4597428, 4686788, 4891366, 4731167, 4599210, 4487252, 4325790, 4172567, 4295331, 4159186, 4600553, 4117799, 4248590, 4187599, 4584592, 4411035, 4101678, 3991230, 3957818, 3964791, 4335831, 3882548, 3812235, 3885136, 3976481, 3731232, 3657569, 3502670, 3736486, 3820974, 3841871, 3384055, 3534294, 3522807, 3320010, 3216359, 3374963, 3261873, 3088934, 2969262]
14019B969262J38734K18615j79624K32431m64541R5610K0446j15235j60025p9413
14009B676260L04917q4568N224j57247j54357K11868l06813L64672k61575k78345
13999B320036K21650J40857O3705k46708N222L13078l42148n9147k2061J15372
13989B509856k88695K42739n00381L52191J65492q8223L82290o38634N24606L62255
13979C023496j31456J8712L72622O85654O60959J577976K421676N471562J0363789
13970B4464990J1902448j1575489q865554n357598l328260j325430r93693o48623
13962D272791l44120m46010K59449m32484k58396j27515j52821K38236l92061
13953B617069M4422j58996P429l07411J87853j23873J50763n8212J12822j83278
$$ y = [2969262, 3107996, 3326611, 3146987, 3379418, 2914877, 3010487, 3030933, 2915698, 2755673, 2676260, 2981177, 2896609, 2901833, 2744586, 2590229, 2802097, 2495284, 2859956, 2598381, 2320036, 2541686, 2682543, 2746248, 2499540, 2504762, 2817840, 2475692, 2416545, 2394484, 2509856, 2221161, 2463900, 1963519, 2315710, 2481202, 2392979, 2775269, 2136635, 2661241, 3023496, 2892040, 2910752, 3283374, 3969028, 4629987, 6207963, 8629639, 14101201, 24464990, 36367438, 24791949, 15926395, 10568797, 7240537, 5915107, 4921414, 4272791, 3928671, 3482661, 3742110, 3309626, 3051230, 2923715, 2770894, 3009130, 2617069, 2661491, 2502495, 2509924, 2202513, 2390366, 2266493, 2417256, 2359044, 2471866, 2288588]
13943B288588l85140K74473j11472J47826o7543r0431K37214k12627k32514J10356
13933A958730K61589n19802K20909k8776P2560J32172p5767l36528o9420J46338
13923A762005Q6893j48162m6738P8812j72115J31198o3396K39933p1141J88084
13913A985373l09253j29106R5957K5255m33878O25637j80645l66288L15570o1272
13903A567350k45798L39176j32331j77471L05483k43167m535J27644J146Q1302
13893A618799l7010k22237K35133j42043K1013J5296q3323k2005j6563Q1209k1502
13882A426767j8030M4726k02948q3494L40168R6727k63513j47368J07719j04010
13872A196744Q1869m38865K85825J77688q7275J51064j59693J19400M3696j16813
$$ y = [2288588, 1903448, 2177921, 2066449, 2214275, 2146732, 2056301, 2293515, 2080888, 1848374, 1958730, 2220319, 1700517, 1921426, 1892650, 1965210, 2097382, 2021615, 1685087, 1615667, 1762005, 1848898, 1700736, 1653998, 1732810, 1560695, 1691893, 1628497, 1868430, 1797289, 1985373, 1676120, 1547014, 1642971, 1668226, 1234348, 1859985, 1679340, 1313052, 1628622, 1567350, 1321552, 1660728, 1528397, 1350926, 1656409, 1413242, 1408707, 1536351, 1537497, 1618799, 1581789, 1359552, 1594685, 1452642, 1473655, 1488951, 1405628, 1383623, 1367060, 1448269, 1426767, 1408737, 1453463, 1250515, 1167021, 1507189, 1603916, 1340403, 1193035, 1300754, 1196744, 1278613, 839748, 1125573, 1303261, 1215986, 1367050, 1207357, 1326757, 1370453, 1253640]
13862A253640K41851j48971j87010M4544J86270j75742k98181K60106M8319q2253
13852A142573J45239k19634l05399M77340K95633k46848K10404j94742l58460
13843I46106K09931O9354p412k06576N6385K9728k6345K6005O573j1161p0613
13832A021975k59763L94356j58671J21521o440K15158k43815j85782J26145R8651
13822A123335l66055L98113l69874J88930q2366n9091K12792k65186Q7730J36986
13812A005314l14708K52785k52901J02738n6959N1843K27761o41n9841k99613
13802F55778K37573K56436n07273L48746l20851N09430k10965j94544M6559k7909
13792G92980K49364O8035k77099j6319K95109m04203K07735j89009j97699M01771
$$ y = [1253640, 1495491, 1346520, 1159510, 1204054, 1390324, 1214582, 916401, 1176507, 1224826, 1142573, 1287812, 1068178, 762779, 1240119, 1535752, 1288904, 1499308, 1304566, 946106, 1156037, 1225391, 1217979, 1011403, 1067788, 1097516, 1071171, 1097176, 1103749, 1092588, 1021975, 762212, 1156568, 997897, 1119418, 1112978, 1328136, 1084321, 898539, 1024684, 1123335, 757280, 1155393, 785519, 974449, 892083, 832992, 1045784, 780598, 868328, 1005314, 690606, 943391, 690490, 793228, 736269, 788112, 1015873, 1015232, 955391, 655778, 893351, 1149787, 642514, 991260, 670409, 1179839, 968874, 774330, 820889, 792980, 1042344, 1110379, 833280, 816961, 1112070, 707867, 915602, 726593, 528894, 930665]
13782I30665j1144N255k78214R7054j64454J93207J27133R00j33952j5173k95790
13771D55487L91581j76480J35163j36805M94865E66902K48321L3165l57999K53065
13761G43454J47218j18140M40468D62511P93839C67604N67465D14911N02911j1702
13751I06120C96535J88737K20235k18389n273J59360J2827m2946j91241K06527
13741G26372k98588J02059M6017K59335D05772K52158L67489l58776J83329j56342
13731F93630l06631L7378N46735m74241L26P939j19710R2823J78729B49296L63248
13720F12544P4754A44603M14043P2828M0288k34445N3910P0436K27168k66594
13710E22237N5122K50475k20112j32115J78661C16738K83101j30574k4614K77157
$$ y = [930665, 919521, 924776, 646562, 743616, 579162, 772369, 899502, 900402, 766450, 751277, 455487, 847068, 670588, 805751, 668946, 1163811, 566902, 815223, 848388, 490389, 743454, 890672, 772532, 1213000, 462511, 1256350, 367604, 935069, 414911, 917822, 906120, 396535, 585272, 805507, 587118, 581845, 741205, 754032, 711086, 519845, 726372, 427784, 529843, 575860, 835195, 405772, 657930, 1025419, 666643, 849972, 693630, 386999, 424377, 971112, 496871, 497197, 505136, 385426, 478249, 656978, 249296, 612544, 687298, 144603, 558646, 631474, 671762, 437317, 491227, 561663, 788831, 522237, 577359, 827834, 607722, 475607, 654268, 316738, 599839, 469265, 444651, 721808]
13700G21808k59553q6591k0680J28479J96251C07504N44838h8081E08654J17330
13690F25984B13056N62775C64650M3220M6944M96524k73473B46012L64940k83866
13680C27086J41832J10653O4750j52078j0278k3588K6381j47856K6690K24147
13670E87739K09147C06754L50542k37288M65537D12164A06936O91428C19305L60069
13660F79374C28736K05430L20113C51568M4807r2752M35833B45343J39013H5735
13649C21196M77542C96305J79186j71332K44786B72755J94352j18206J83237J20689
13639F52827F0666L89188j26621p5585j06385R3936J30772M80716k78234k79206
13629B89247A17241J63064M51056C60373J96872q8894J05129k30185L20301B69137
$$ y = [721808, 462255, 375664, 354984, 483463, 679714, 307504, 852342, -88081, 508654, 625984, 213056, 775831, 364650, 407870, 454814, 951338, 677865, 246012, 610952, 327086, 468918, 579571, 644321, 492243, 481965, 458377, 484758, 336902, 363592, 587739, 796886, 306754, 657296, 420008, 885545, 412164, 106936, 798364, 319305, 679374, 328736, 534166, 854279, 351568, 396375, 303623, 739456, 245343, 384356, 85735, 321196, 798738, 396305, 575491, 404159, 648945, 272755, 467107, 348901, 532138, 652827, 60666, 449854, 323233, 247648, 141263, 235199, 365971, 846687, 568453, 289247, 117241, 280305, 731361, 360373, 557245, 468351, 573480, 343295, 663596, 269137]
13618F26968A27294N8161M62346H6094L32921j145Q3092B22952K25611P1955j17807
13607D02711O0604K67686j16524B58440J43684p6246j22753J96633J54895A83501
13596F19165O1871k55126k4605j35847O9160q6286J57773n8162j68248M27085
13586F06780j85347K13820j58775j80221k8598r5341K09803A34944J21389N030
13576B61363I0422K09304J21269A71269J07430K10490E3278M8425L50129N0421
13566E02253B49607J51453J20182j4228B36406J78068o1378Q456n1745A50050
13555D87684N0737m2341k32792A17035J87791d5037C21369L18575B99896l2165
13545B67731p8060K16868J4176A69863A5232K30842I0376J26552n6742K15752
$$ y = [626968, 127294, 185455, 647801, 86094, 419015, 417870, 500962, 222952, 448563, 520518, 402711, 463315, 731001, 614477, 258440, 402124, 325878, 203125, 399758, 554653, 183501, 619165, 681036, 425910, 401305, 265458, 334618, 248332, 406105, 347943, 179695, 606780, 421433, 635253, 476478, 296257, 267659, 172318, 382121, 134944, 256333, 261363, 90422, 299726, 420995, 171269, 278699, 489189, 53278, 101703, 451832, 502253, 249607, 401060, 521242, 507014, 236406, 414474, 353096, 361552, 309807, 150050, 487684, 538421, 496080, 263288, 117035, 304826, -45037, 321369, 639944, 299896, 267731, 189671, 406539, 420715, 169863, 15232, 246074, 90376, 216928, 160186, 375938]
13535C75938j47268j03433r382J78567K48604N7161k93600J27552k5025n7274
13525C51840A40396J75970p7120M45432C02491J37597H1495J93790D6355J10463
13515A56818B3530b7692A10155J63970O0908j11385M97648g225F7827k9768K37304
13504B75363J49258j2020l4134a7046k2000B84615J63428A86263P000K71076k0179
13493D44160A12059J97398J10173e6559H9668J6080M77358B4913L85177j84960
13483B25130l3364K50973G1732J28835O0810l5875p9031L51109B02190F2269K61916
13472C24185M8395p7884P5190G5696J98113r3920q9126L05560A13520C5007J74972
13461B09979J74195J59709j07630A8544L83135M0482j68137A06600K8357J040
$$ y = [375938, 228670, 125237, 115855, 294422, 543026, 600187, 306587, 434139, 409114, 351840, 140396, 316366, 239246, 684678, 302491, 440088, 81495, 275285, 46355, 156818, 23530, -27692, 110155, 274125, 335033, 223648, 721296, -7225, 67827, 38059, 275363, 424621, 412601, 378467, -17046, -39046, 284615, 448043, 186263, 193263, 464339, 444160, 112059, 309457, 419630, -56559, 89668, 105748, 583106, 24913, 410090, 225130, 191766, 442739, 71732, 200567, 261377, 225502, 146471, 497580, 202190, 62269, 324185, 372580, 294696, 369886, 75696, 273809, 179889, 90763, 396323, 113520, 35007, 209979, 384174, 543883, 436253, 18544, 401679, 442161, 274024, 106600, 134957, 135997]
13451A35997K08501e9270a2883H9958K04409L7525R4401A69708C7742J44578j4437
13440A67883M01796F6708j8562a00949B14880f352C50282A72450d2722A16943
13429C75511I8527J89765d2831A70791c858r3334B43444I5495b0685A29595Q1856
13418B11451j8506N6529K94061A06447N9667K49902l6126j69476N1240J40933
13408D02587j51726h235H57968C6432O70607C37250j61272J18727J4424c4198
13397C6788N37244C5539j4068a2533C12951B8826L65014j79842D7151R3114h8534
13385f7024A44552E5727K8737J34589J79765A52588M24517A29516L93925b275
13374B3657R3477J15606O558l276J5861q7249o987c431E63302A33140J23696b173
$$ y = [135997, 344498, -59270, -12883, 89958, 294367, 331892, 426293, 169708, 37742, 182320, 167883, 569679, 66708, 48146, -100949, 214880, -6352, 350282, 172450, -42722, 116943, 375511, 98527, 288292, -42831, 170791, -3858, -97192, 243444, 95495, -20685, 129595, 211451, 192945, 249474, 543535, 106447, 166114, 416016, 379890, 210414, 261654, 402587, 250861, -8235, 857968, 36432, 707039, 337250, 175978, 294705, 309129, -34198, 36788, 574032, 35539, 21471, -12533, 312951, 28826, 393840, 213998, 47151, 140265, -88534, -67024, 144552, 55727, 84464, 219053, 398818, 152588, 577105, 129516, 523441, -2275, 23657, 117134, 232740, 239298, 236022, 251883, 164634, 157647, -3431, 563302, 133140, 256836, -2173]
13361I4330L6685O7041g4601B00912J19246b0983B74304J61849j6026j5616K5440
13350D29951j72439E9667J96466H0058J09679J1270A9096K12457p5017R3821K50733
13339E01090B16161J36976A17089i8740A15185M8890m7466j6989J2589a33979
13328A68966J32013r5453a00201F1641J21613R4645k8270L9241J39996G3124K43137
13317C16261j39619P799n1686J5141Q4333J34371I4942P6777b38958B40229B8692
13305D03538A64826C8467K16739L6459a2542B78919H0105c7528j12451b7611B94821
13293B52680r7194O0414A07430J72711b0722C68000M2476j92768O0248l034K08566
13282D83488e2552A58742N1989b56406C72388r3569N2496F7334J20918P8766P8918
$$ y = [94330, 131015, 198056, -74601, 200912, 320158, -20983, 274304, 436153, 420127, 404511, 429951, 257512, 59667, 256133, 80058, 189737, 201007, 19096, 231553, 156536, 250357, 501090, 216161, 353137, 117089, -98740, 115185, 164075, 116609, 99620, 112209, -133979, 168966, 300979, 205526, -100201, 61641, 183254, 277899, 249629, 288870, 428866, 73124, 316261, 176642, 184441, 132755, 147896, 232229, 366600, 94942, 171719, -238958, 240229, 28692, 403538, 164826, 38467, 255206, 291665, -12542, 278919, 80105, -37528, -149979, -27611, 294821, 252680, 155486, 215900, 107430, 280141, -20722, 368000, 410476, 217708, 277956, 274922, 483488, -52552, 158742, 210731, -256406, 372388, 278819, 331315, 67334, 188252, 267018, 345936]
13271C45936j05835o8101L8333r5571C3101O7119i6790A93728C7530J79008G1203
13259D41491j32274b2997C1179d3947E4178L86J66084G1789e2549B29363j9365
13248B09998o6821b24592H7403K03241r2944I7216b80629F7738c04268b0314j77810
13237a98124A51015K31364j7999f22H0484L9145i2712A55864C0643J95586D1755
13225A83272a61209C6419N18878a22067B40045m3728h9599A92625b13939B8506
13214b54480b793j5429A498R08J89305L22298G3057J61684E1788J4943K7407a75233
13201I4219K04653M8683A25477K98629A06906P7054b61179a6265G5501J77860
13191B53361O9126M3243A26586F0926d7150j70400A10593g8977B04806a22265
$$ y = [345936, 240101, 172000, 210333, 114762, 33101, 100220, -96790, 193728, 37530, 216538, 71203, 441491, 309217, -22997, 31179, -43947, 54178, 54564, 220648, 71789, -52549, 229363, 209998, 143177, -224592, 87403, 290644, 197700, 97216, -280629, 67738, -304268, -20314, -198124, 151015, 382379, 364380, -622, 80484, 119629, -92712, 155864, 30643, 226229, 41755, 183272, -161209, 36419, 555297, -122067, 240045, 196317, -89599, 192625, -213939, 28506, -254480, -2793, -18222, 1498, 2406, 191711, 514009, 73057, 234741, 51788, 66731, 94138, -175233, 94219, 298872, 347555, 125477, 424106, 106906, 183960, -261179, -16265, 75501, 253361, 322487, 365730, 126586, 60926, -47150, -217550, 110593, -78977, 204806, -122265]
13180A16095c9304j99034I0953a6952B96884d303B04861m319p6548Q6499m1318
13169A69175l5671j6519L5925C4022a22792B32474G9914a6562p5093B65566I6653
13157a12997I4574a22103j61075d6079F2968N399J06139a78178h963A42525B3893
13145c32774C78778a05085A01636d587k60599P5337a466l1210B8088P2881A8858
13133A77769a69483l5708A95471f9775j96021O2325h7356m3704C31432r6419C8564
13121A10252I067N7152b35732A48709E8668j7921O9119b09986E1697g351j0642
13110a7993H6454a1477B13834K3307R2831b4560M752G8970J13256b6813F3451
13098G6567i3897A97488J0141E641K9854J83057E0295a34847p4757D0778K56813
$$ y = [116095, -39304, -238338, 90953, -16952, 296884, -4303, 204861, 200542, 123994, 210493, 169175, 133504, 116985, 152910, 34022, -122792, 232474, 79914, -16562, -91655, 265566, 96653, -112997, 94574, -122103, -283178, -46079, 62968, 68367, 174506, -178178, -8963, 142525, 23893, -332774, 378778, -105085, 101636, -4587, -265186, -189849, -1466, -32676, 28088, 100969, 18858, 177769, -169483, -205191, 195471, -69775, -265796, -203471, -87356, -131060, 331432, 235013, 38564, 110252, 9067, 66219, -235732, 148709, 58668, 40747, 109866, -209986, 51697, -7351, -17993, 86454, -11477, 213834, 237141, 329972, -24560, -19808, 78970, 192226, -26813, 63451, 76567, -93897, 197488, 207629, 5641, 35495, 218552, 50295, -134847, -209604, 40778, 297591]
13087B97591A34567N4902F9956q157b3690p8527p5126I0680a00951B01862a45155
13075a18943C29023H8325M20517A6956J22357d56031B47853q698L4031A9210b68024
13063d98915b5705B81744j5067I4853l3659K29532r1763b17966A36910C863M9566
13052E3429K32786A13428j9918k5358K10698a5717m7193l4962B89288A41129Q9258
13041B30387A0434K3265C300i9283B6392K30077r2553n3108P9118O9114h1015
13029b68048A72273J42366H8491C9636K52949j16581O5049b09309A36488L0272
13019A66760B8485A2650P8015R7863a6174A22063b17962B91241A42458a81487
13008f2028l59133A82433H5780J21636a58362F6750K35329A20688J0429K34491
$$ y = [297591, 134567, 189469, 69956, 61799, -23690, -102217, -177343, 90680, -100951, 201862, -145155, -118943, 329023, 88325, 508842, 16956, 139313, -456031, 247853, 239155, 273186, 19210, -268024, -498915, -25705, 281744, 266677, 94853, 61194, 290726, 198963, -217966, 136910, 3863, 53429, 286215, 113428, 93510, 68152, 278850, -15717, -62910, -97872, 289288, 141129, 230387, 10434, 33699, 3300, -99283, 26392, 256469, 163916, 110808, 189926, 259040, -81015, -268048, 172273, 314639, 88491, 39636, 292585, 176004, 241053, -209309, 136488, 166760, 28485, 12650, 90665, 188528, -16174, 122063, -217962, 291241, 142458, -181487, -62028, -421161, 182433, 85780, 207416, -158362, 66750, 302079, 120688, 131117, 365608]
12998C65608j51510c9547p6473E4405a35621f4272B6195a4935G0814f0245F3489
12986A55118k2486J06432e245j7700A93518k2013M6302K00024E406a04435j27365
12975b31800A87483C0686K99180a99546B11299a13945M9681A06330k107K4152
12965A28375b84996a19355A92234a52354I3987E949b03536A93644b90586A32992
12954B42977c45150A085b15468h3849j53465A01919J05618l8090f4606D35218
12943d2440l3831a3111I3473i5888E2104j9632b26000Q5156G0198B6744b62029
12931a80598Q6833A51617F2464a75868F997Q9212C7314R5187B6716K06746h7934
12919b08463E9058O1581D9382N6505A6129P7992b81213k2895G950J44577a93333
$$ y = [365608, 214098, -39547, -116020, 54405, -135621, -64272, 26195, -14935, 70814, -60245, 63489, 155118, 132632, 239064, -5245, -22945, 193518, 171505, 217807, 417831, 5406, -104435, -231800, 187483, 30686, 329866, -199546, 211299, -113945, -64264, 106330, 104223, 128375, -284996, -119355, 192234, -152354, 93987, 5949, -203536, 193644, -290586, 132992, 242977, -345150, 1085, -215468, -83849, -237314, 101919, 207537, 169447, -64606, 435218, -42440, -76271, -13111, 93473, -95888, 52104, 32472, -226000, -140844, 70198, 26744, -262029, -180598, -93765, 151617, 62464, -175868, 6997, 96209, 37314, 132501, 26716, 233462, -87934, -208463, 59058, 120639, 49382, 105887, 16129, 94121, -281213, -304108, 7950, 152527, -193333]
12907A00481c7976E4656J01139J88785J09741A5257a27750A85111b23271e0217
12896A65347a47655D2222j5345O1559Q8908a38865k5549B1997d478j33875F3675
12884d1858E11367A53813J09905m7625a19617N2093F1296a69245I3263b32393
12873A45003K7429a68362J4301p2122E3287g033F7499d7653o5718j9882A28825
12861E8909f0649M986r1324l3398c4043B03537D9877K78005c05870P9944A08118
12849h5992j08437B02163C2493a55799n4276g3176j09126l3150L2260B24623p829
12838B16794C6748J45717b1734A4960J00549a89553j11472d3705B4569K10021
12828B34590m9713a18576A93205B2774a23945K6720j01835Q513l7138k802A88754
$$ y = [100481, -37976, 54656, 155795, 344580, 454321, 15257, -127750, 185111, -223271, -50217, 165347, -147655, 42222, 26877, 88436, 177344, -138865, -164414, 21997, -4478, -138353, 63675, -41858, 511367, 153813, 263718, 216093, -119617, -67524, 61296, -169245, 93263, -232393, 145003, 172432, -168362, -154061, -226183, 53287, -7033, 67499, -47653, -113371, -133253, 128825, 58909, -60649, -55663, -146987, -180385, -34043, 203537, 49877, 327882, -305870, -225926, 108118, -85992, -194429, 202163, 32493, -155799, -210075, -73176, -182302, -215452, -183192, 224623, 216794, 36748, 182465, -21734, 14960, 115509, -189553, -301025, -43705, 24569, 234590, 184877, -118576, 193205, 22774, -123945, -97225, -199060, -190547, -227685, -230487, 188754]
12816D21515E6746a41686B54715f9082A99040b41617O9690F151b10117A70841
12805a21313q5913K6874k77718g9057j10748e0710j6191A62063h3008B9106K4484
12794E3590b43232B94269g8735A34895A8771a82633j2291L8174j15842i2438A15469
12782a63943A63979J07788b19744M7762G6650J7500a06289A01514a94111j87545
12772c81656J34628a7756k06642A01723c4706r6289l0108e2589j08344B5779J01916
12761A27695K46723G9513J10534k0863F8827a14449k02243d820j7807r221C1673
12749a92958C1895A4661K74259c7876j4434k14421K3307J02645E9699J0424J45302
12738B15425a23254H2549b03915c0750a0976F8753J56873a68646A37765a78644
$$ y = [421515, 56746, -141686, 254715, -69082, 199040, -241617, -171927, 6151, -210117, 170841, -121313, -207226, -180352, -458070, -79057, -189805, -50710, -66901, 162063, -83008, 29106, 53590, -243232, 294269, -78735, 134895, 18771, -182633, -194924, -156750, -272592, -92438, 115469, -163943, 163979, 271767, -219744, -171982, 76650, 94150, -106289, 101514, -194111, -381656, -247028, -17756, -224398, 101723, -34706, -130995, -161103, -52589, -160933, 25779, 127695, 374418, 79513, 190047, 169184, 68827, -114449, -316692, -4820, -22627, -31848, 31673, -192958, 31895, 14661, 288920, -37876, -52310, -266731, -243424, -140779, 59699, 70123, 215425, -123254, 82549, -203915, -30750, -10976, 68753, 225626, -168646, 137765, -178644]
12727C1617a79204A42319J09372A00023c105E85169F6237Q5290J59218n2766a92717
12715A70720q0774c2983I3458L34607a15386B13278c6055A47911B4276J68c30853
12703B0872Q4477c8663A93294Q470h1660j67332C47135A10918L92379A8789g2736
12691B46875h3025A61004C4325J7180O867J12469K63948A38176N8638G9511A7492
12679d0888A08724a74172P1263A63993J74979b00047h3169I330Q2618a10403A49964
12667b37397E0785b16858D13735j78548B9490a998A71631a7061C62770r3459a67497
12655c1182j60297H0924J84012E1217b94678B49048a64554N9154j40229A41157
12644a39066A41551m5576J04432a67625K3661C14128p1841n3046N5072k8227j05578
$$ y = [31617, -179204, 142319, 251691, 100023, -3105, 585169, 66237, 151527, 310745, 257979, -192717, 170720, 89946, -32983, 93458, 428065, -115386, 213278, -36055, 147911, 24276, 24444, -330853, 20872, 105349, -38663, 193294, 201764, -81660, -248992, 347135, 110918, 503297, 18789, -72736, 246875, -83025, 161004, 34325, 51505, 58372, 170841, 434789, 138176, 196814, 79511, 17492, -40888, 108724, -174172, -102909, 163993, 338972, -200047, -83169, 9330, 91948, -110403, 149964, -237397, 50785, -216858, 413735, 235187, 29490, -1998, 171631, -17061, 362770, 269311, -167497, -31182, -191479, 80924, 264936, 51217, -294678, 249048, -164554, -105400, -245629, 141157, -139066, 141551, 95975, 200407, -167625, -143964, 314128, 242287, 189241, 244313, 216086, 110508]
12633A10508k9191O4550b64849J01346n9201a2108j05323B13615b37652F5982
12622b7127A46437o9535h3840M1083B71949A12983c57520A43345J75474j58372
12612A60447e9285F9135j9023P4613M5008c91637B59897f349j97639B14480i2669
12600A90425a10290l4439B63120g2182J7216B10457a4631j7271H8456C6492b1445
12588b12616a9109A68388a10925A27336f32C01817E297J35219D197K18229b93702
12576A03855J45472b02991A50347a54325a9729j96740b3771G3196A6703f3830
12565i5195I4443a29733B10709c5150j34831f0102G0905a27083k47927A02633
12554A01696j0143B2384J8355d30560a15944A88386C3970b68693F5b25348b1765
$$ y = [110508, 81317, 145867, -264849, -163503, -222704, -12108, -117431, 213615, -237652, 65982, -27127, 146437, 76902, -83840, -42757, 271949, 112983, -357520, 143345, 318819, 160447, -59285, 69135, 50112, 124725, 169733, -391637, 259897, -6349, -203988, 214480, -92669, 190425, -110290, -144729, 263120, -72182, -54966, 210457, -14631, -31902, 88456, 36492, -21445, -212616, -19109, 168388, -110925, 127336, -632, 301817, 5297, 140516, 4197, 222426, -293702, 103855, 249327, -202991, 150347, -154325, -19729, -216469, -23771, 73196, 16703, -63830, -95195, 94443, -129733, 210709, -35150, -169981, -60102, 70905, -127083, -375010, 102633, 101696, 91553, 22384, 40739, -430560, -115944, 188386, 33970, -268693, 65, -225348, -21765]
12542B15342a454n01979b10517l5120B59374a0259A88554K7937b28239N2454E63810
12530B43776A116a8349H1446a8990C30031K9355I6329J06687D5148b5151q2589
12519a07740j65458o7553a10525C81156b96356I6184i104j80300G11J13336C0771
12507B89548E1538j0444l662a04796j23257B95239B3554P6745k8436O9464a07637
12495E9792Q7191h0778K4755J1909j88816E3664i7211K9395I0999A7685e4782
12483B32601F6129J11409q2426c11702I0945J17591H6716b12499f0573j36347
12473a96920j10046g1171A8281b21032Q2336j69735a32887d4864j60939A1815
12462G4430a99025B72248a8491B97319b60355A0073b53190a14720K25F3667a42192
$$ y = [215342, -1454, -503433, -210517, -245637, 259374, -10259, 188554, 216491, -228239, -175785, 563810, 243776, 1116, -18349, 81446, -18990, 330031, 359386, 96329, 203016, 45148, -25151, -107740, -273198, -340751, -110525, 381156, -296356, 96184, -9104, -189404, 711, 114047, 30771, 289548, 51538, 41094, 37432, -104796, -228053, 295239, 23554, 100299, 71863, 141327, -107637, 59792, 146983, -80778, -56023, -44114, -232930, 53664, -97211, -67816, 90999, 17685, -54782, 232601, 66129, 177538, 95112, -311702, 90945, 208536, 86716, -212499, -60573, -196920, -306966, -71171, 18281, -221032, -138696, -308431, -132887, -44864, -205803, 11815, 74430, -199025, 272248, -18491, 297319, -260355, 10073, -253190, -114720, -114495, 63667, -142192]
12450A17661d38343a8802A18168e744D60666a64400A20334Q2745B2899K42851
12440B65750a25037B13088D4518j3084Q6546D0580a30417k59231g3513j58154
12430b31667C44862m2923f2402A30899K8527b31008B7792c51828C3015b5154j4338
12419c9492j44934a4770F3671N6538i255B26900a26533k56831a03171b4705B08906
12407a8065c420q275A0409a56200P2650E8403f4726l85666J64587E2800k3314
12396B9486g2884C6534J13176M231c70929B5272c45501A08238a69990A24224h494
12384a75773j39827h1331j33492b8434H2174JA1292O000a7034A11142c79098A28344
12371D6262e7033n4629C2047P8639a3796q2811j0607D73849A43940P0710q1082
$$ y = [117661, -438343, -18802, 118168, -5744, 460666, -164400, 120334, 203079, 22899, 265750, -125037, 213088, 44518, 31434, 117980, 40580, -130417, -389648, -73513, -231667, 344862, 301939, -62402, 130899, 159426, -231008, 27792, -351828, 33015, -25154, -39492, -184426, -14770, 63671, 120209, -9255, 226900, -126533, -383364, -103171, -24705, 208906, -18065, -3420, -11695, 10409, -156200, -83550, 58403, -64726, -450392, -285805, 52800, 29486, -72884, 36534, 149710, 153941, -370929, 25272, -345501, 108238, -169990, 124224, -8494, -175773, -315600, -81331, -214823, -28434, 82174, 82175, 11292, 17292, -17034, 111142, -379098, 128344, 46262, -57033, -111662, 32047, 110686, -13796, -96607, -107214, 473849, 143940, 214650, 133568]
12360A33568j3144h7065c0316C43171i4227A37183d87535B61066a61917j13857
12350b75774A76668E8600b94888B9046d4303h024k1202A86h4487M1292A79565
12338A41029o3407a96242B20777E1791a56988F6051a05406F3750J86645j7025
12328B33370a42131M6414k84804E2181L8627h1253A30780a6725B32714p2129o5924
12317I4661B6383J95251d2615B32534c3660B78363L23874B48852O9780k4332r2440
12306B01860a13883F1372N9202a19921A99609M3090c9276A47054a29936G0579
12295E50902B5892i1139l42993b01578G5823O4238m3725M1523l7924b54125B13994
12283D23797j98748e4756E0555R0248L5342m1793e1462C59235H388L96956E5967
$$ y = [133568, 120424, -87065, -30316, 343171, -94227, 137183, -487535, 261066, -161917, -275774, 176668, 58600, -294888, 29046, -44303, -8024, -29226, 186, -84487, -43195, 179565, 141029, 77622, -196242, 220777, 51791, -156988, 66051, -105406, 63750, 250395, 233370, -142131, -95717, -380521, 52181, 90808, -81253, 130780, -16725, 232714, 160585, 94661, 26383, 221634, -42615, 232534, -33660, 278363, 602237, 248852, 318632, 294300, 201860, -113883, 61372, 120574, -119921, 199609, 242699, -39276, 147054, -129936, 70579, 550902, 25892, -91139, -434132, -201578, 75823, 140061, 96336, 137859, 99935, -254125, 213994, 423797, 225049, -54756, 50555, 140803, 176145, 134352, -51462, 359235, 8388, 405344, 55967]
12271C06736f940A76243K86409d5336G8172P4037L0297O4783a11687A62152m3826
12260A18326K64262F3913j2536K21895B8655n448g6178p425B21670P7576G6681
12248D51950D8680K12383d6079j20824B70380A33661R6477K7162J3598n7607p1540
12237A41751N400N0374A9399J8786O05820C10316p1962A6806g1338B073J94092
12226A96165a32419E0291K3857a56234A27068f4925A11345a4158D93698a722D95635
12214A63213O647b08592A49403K01944A44485C62c3940L211A51198L4208a24496
12202E5921j245L41596i6284A58084k4458l4228K99625a1805B71151C3473H650
12190a32253B72240o8686K11182k02051h1901B74016j30531K44963k04A44955
$$ y = [306736, -6940, 176243, 462652, -45336, 78172, 152209, 182506, 247289, -111687, 162152, 118326, 382588, 63913, 51377, 273272, 28655, 23207, -76178, -83603, 221670, 299246, 76681, 451950, 48680, 261063, -46079, -166903, 270380, 133661, 230138, 257300, 270898, 213291, 141751, 147151, 197525, 19399, 38185, 644005, 310316, 238354, 16806, -71338, 2073, 196165, -132419, 50291, 74148, -156234, 127068, -64925, 111345, -14158, 493698, -1722, 495635, 163213, 169860, -208592, 149403, 351347, 144485, 362, -33940, -30729, 151198, 185406, -124496, 55921, 54676, 396272, -96284, 158084, 133626, 99398, 399023, -11805, 271151, 33473, 8650, -132253, 272240, 203554, 414736, 212685, -81901, 274016, 143485, 388448, 388244, 144955]
12179B65562G1701a7653D58916a06074A70455j8418J76267C2442K48621H7437
12168B99410j7075a0233C99897a77213A3456d8667C68316A11714K31495a64055
12157D19834A91284D3660L15747L9625A82013a7440E6264g3632B81476i4492C71579
12145A83778J29367g5584B56408F9689k7390J36039D102c29601C15019A13205
12134B87545j6721A31817F3531L2447b37055E6586K3674C5910a75574H0790f9661
12122b3082A05143J65050i9385B22444b606j67612B50401j21718j0182g7985A58759
12110A44211g9322B56090Q459J35880a59115F17974B80867k8689q5237m8281r7
12099A18563c1594B16022R4583A30059J57153j08719f2939j16895A97158C9302
$$ y = [265562, 71701, -17653, 458916, -106074, 170455, 152037, 328304, 32442, 281063, 87437, 299410, 282335, -10233, 399897, -177213, 13456, -48667, 368316, 111714, 343209, -164055, 419834, 191284, 43660, 359407, 399032, 182013, -17440, 56264, -73632, 281476, -94492, 371579, 183778, 313145, -75584, 256408, 69689, 42299, 178338, 4102, -329601, 315019, 113205, 287545, 270824, 131817, 63531, 95978, -237055, 56586, 80260, 35910, -175574, 80790, -69661, -23082, 105143, 270193, -99385, 222444, -2606, -170218, 250401, 128683, 118501, -77985, 158759, 144211, -79322, 256090, 264549, 400429, -159115, 617974, 280867, 252178, 166941, 118660, 118563, -31594, 216022, 310605, 130059, 287212, 178493, -62939, -179834, 197158, 39302]
12088i6751A36561r2b6980a1516A81838e186l774j18099A03146k1586b5531a1582
12075A22016J08145i9544C09142c2161f355E8841R899J51918M0351b14393f4024
12063h8759A72789J84790a40166C04161l1061J134a50105b553A96848J45350P9237
12052D21435b3416A52637b04711C72178j25664b1182j44524B39995a69149M0780
12042a28369a0837D8630J67323c6395I1371A5985e7953A90891b282l28065D11303
12030a01674J62p6712C70379K7618a11920j07331Q8441C2298g6943E5021g4912
12018C60259d0536C75358E9630a7794C6766K10727p4455a81967o524A07407c25001
12006D47278f9924o1777I1143R3089j9369O151R1004q2094e5523c604B93124l6887
$$ y = [-96751, 136561, 136469, -26980, -11516, 181838, -5186, -8960, -127059, 103146, 81560, -25531, -11582, 122016, 230161, -99544, 309142, -32161, -6355, 58841, 68740, 220658, 261009, -214393, -64024, -88759, 172789, 357579, -140166, 304161, 273100, 274234, -150105, -2553, 196848, 342198, 421435, -23416, 152637, -204711, 372178, 246514, -21182, -165706, 239995, -169149, -128369, -10837, 48630, 215953, -36395, 91371, 15985, -57953, 190891, -2282, -330347, 411303, -101674, -101512, -178224, 370379, 397997, -111920, -219251, -130810, 32298, -76943, 55021, -74912, 360259, -40536, 375358, 59630, -17794, 36766, 247493, 173038, -181967, -188491, 107407, -325001, 447278, -69924, -131701, 91143, 184232, 164863, 171014, 262018, 179924, -55523, -3604, 293124, 256237]
11994B56237K2304M4432a59588G7547L8719a47075B18308D11K03626b24708A6922
11982A34107c496m36243a24589j28915c703A4388c5794J7107l6471B84369i2324
11970A629b0775j09657C69404e4474B72696A02883c50385f1294J4006a5894C1074
11958a52713A35423k7112J891a43860j0210M2056q320e6437eH4767k0556b66073
11945H6692K3023a76461k3115L2713A3684K512M7822R3884C2470h1310c2824C24848
11932e9194G2730g6798l8029M0446C7167O6107f2586B87476G0628i5623k60618
11921c56241A49577b12797A11466r938B2355N4993a10335A0154a85678F5543H496
11909d14521B0593J60908H2000a11871A06746m2228h2167P411A83435f4261G0237
$$ y = [256237, 278541, 322973, -159588, 77547, 116266, -147075, 218308, 411, 204037, -224708, 16922, 134107, -3496, -439739, -124589, -253504, -3703, 14388, -35794, -18687, -55158, 284369, -92324, 1629, -20775, -130432, 369404, -54474, 272696, 102883, -350385, -61294, -47288, -15894, 31074, -152713, 135423, 108311, 110202, -143860, -154070, -112014, -120334, -56437, -5, 84767, 64211, -266073, 86692, 109715, -176461, -199576, -166863, 13684, 16196, 64018, 157902, 32470, -81310, -32824, 324848, -59194, 72730, -76798, -114827, -74381, 37167, 103274, -62586, 287476, 70628, -95623, -356241, 149577, -212797, 111466, 101528, 22355, 77348, -110335, 10154, -185678, 65543, 8496, -414521, 20593, 181501, 82000, -111871, 106746, 64518, -82167, -74756, 183435, -64261, 70237]
11897b368q5059a6772A87061K1072d1019J0929A26969K98076d1213j9110N591
11886e4732F1027B8032h9033l2370L1160A64217a96674M1286g5942C7674a99851
11874B35242F3543L22348A45973b46178A50223a71180D6126b56238R8519j38373
11864b96092c1966F3989i5608B7090K985b79685H2398J84295b01140M3442q8060
11853b45758A06355P9548b0606j18140b6540E75551a88618P0043A08714A0294
11842a84261o6094J2095o2695N7981h4934A14900b56035A6260J24987b6300o4776
11831i1076A57444h525j54927J1865F4790K42111b97390c2449p977j58719A48786
11819b36980H1539K6739b18572a06510B42313b89938a38278e9209l2705B61212
$$ y = [-2368, -87427, -16772, 187061, 208133, -41019, -30090, 126969, 425045, -41213, -60323, -54732, 61027, 28032, -89033, -121403, -90243, 164217, -196674, -155388, -75942, 37674, -199851, 235242, 63543, 385891, 145973, -246178, 150223, -171180, 46126, -256238, -157719, -296092, -31966, 63989, -95608, 27090, 30075, -279685, 82398, 266693, -201140, -157698, -245758, 106355, 185903, -20606, -138746, -26540, 575551, -188618, -118575, 108714, 10294, -184261, -250355, -238260, -300955, -242974, -84934, 114900, -256035, 16260, 141247, -26300, -91076, 157444, -8525, -163452, -151587, 64790, 306901, -297390, -32449, -40426, -199145, 148786, -236980, 81539, 108278, -218572, -106510, 242313, -289938, -138278, -59209, -91914, 261212]
11808a87445C9133b13677P4055C47079e1275K0963F5806J37785i7626B63712d7031
11796B14045c1033k8431j19040f7583A04516J95834c07341A01766J3464c7132
11785a86043D70016e3858B52843a22676H0485g6118D9763j8822Q6477j6920a06372
11773f3640j61217C6263N966N6185c03591B2818O7486b7040j68766B03052q7811
11762A15241j0071b75386Q8000D855i8159A00147d29997K08285b1686A54029b357
11750B68780M1221c33758d4266j48723M0666G6672i1906j40445K0104A022L18186
11739C19208b49060r9840B50691F7358b73770J31784B3048J96615e6321A81427
11728a4178A02932K6893l1207g6222K6023k64592B2556a17090B6837o607c4212
$$ y = [-187445, 39133, -213677, -139622, 347079, -51275, -30312, 65806, 203591, -97626, 263712, -47031, 214045, -31033, -59464, -178504, -67583, 104516, 300350, -307341, 101766, 115230, -37132, -186043, 470016, -53858, 252843, -122676, 80485, -76118, 49763, 30941, 117418, 100498, -106372, -63640, -224857, 36263, 42229, 98414, -303591, 22818, 90304, -27040, -195806, 203052, 115241, 105170, -275386, -187386, 4855, -98159, 100147, -429997, -221712, -21686, 154029, -2357, 268780, 310001, -333758, -44266, -192989, -152323, 76672, -91906, -232351, -212247, 1022, 319208, -249060, -348900, 250691, 67358, -273770, -141986, 23048, 219663, -56321, 181427, -14178, 102932, 129825, 98618, -76222, -50199, -314791, 22556, -117090, 26837, 20230, -34212]
11716a70875K5215O1425j22436h2586A139J28151b09349f7320A18192O0489a47541
11704H5301b616k35039I0734L5939J8588a171B2100J19627a02772A37730d871
11692a61541j42861G7401K01238b53833A06101P1958k7539J6864C4077A0787b68660
11680a05451B3650J84080e6115B10702b26613N4239D464D01P9470b1268C06945
11668C01293A29438F1068K8084K27043b47305D1215J17613C8030N5189D5592L0726
11657G6318J5711f0440C3540h1070A03721a6049A39854m2006e8970A00591c42928
11645a81201f6214H9541N4665h5495H6628h1303F4975N8431E1982j1161h7585
11633a68491A81226E002b8249A67756B0817e9777B96163A2148K83537I0097J10509
$$ y = [-170875, -145660, -84235, -206671, -82586, 1139, 129290, -209349, -67320, 118192, 178681, -147541, 85301, -2616, -237655, 90734, 126673, 145261, -1171, 22100, 141727, -102772, 137730, -4871, -161541, -304402, 77401, 278639, -253833, 106101, 178059, 150520, 167384, 34077, 10787, -268660, -105451, 23650, 207730, -56115, 210702, -226613, -172374, 4464, 401, 79871, -21268, 306945, 301293, 129438, 61068, 89152, 316195, -247305, 41215, 158828, 38030, 93219, 45592, 76318, 92029, -60440, 33540, -81070, 103721, -16049, 139854, 97848, -58970, 100591, -342928, -181201, -66214, 89541, 144206, -85495, 86628, -81303, 64975, 123406, 51982, 40821, -87585, -168491, 181226, 5002, -28249, 167756, 20817, -59777, 296163, 12148, 295685, 90097, 200606]
11622B00606E2793J35150B2409i4207K8063l67326I20K05922a42723C4815d1007
11610B16779C7577a25421L1380c2012A56516b47564A78090J9776Q6739A7137b6649
11598a61421B77266n3601J54763b55949K5058B9588J96579p970H136b29097J13152
11587a15945p0946D4247J21052b22231c1828A03225d4344J6853k36132P7848h0711
11575a86510C10173A08152l1335J8899d2904A71291E2908f6693G3916K08679c9317
11563B95934j4787E5374Q1812m7267K07230F5512L15612A57588e6186i823D05023
11551B27498f0548G984j170J68962E1500K94128j6844a558H5514L1836l2708L05969
11539C90611A7211L3981K3650k539g0439k5464A81983q409L2677J50576e3153
$$ y = [200606, 52793, 187943, 22409, -94207, -66144, -433470, 920, 206842, -142723, 34815, -41007, 216779, 37577, -125421, -94041, -32012, 156516, -247564, 178090, 197866, 284605, 17137, -26649, -161421, 277266, 223665, 378428, -255949, -230891, 29588, 226167, 218197, 8136, -229097, -115945, -186891, 44247, 165299, -222231, -31828, 103225, -44344, -27491, -263623, -185775, -80711, -186510, 310173, 108152, 76817, 95716, -42904, 171291, 52908, -66693, 73916, 282595, -39317, 295934, 281147, 55374, 137186, 89919, 297149, 65512, 381124, 157588, -56186, -9823, 405023, 227498, -60548, 7984, 6814, 175776, 51500, 345628, 328784, -1558, 85514, 117350, 84642, 390611, 17211, 51192, 74842, 72303, -70439, -95903, 181983, 173574, 206251, 356827, -53153]
11527A03370E747P9497J06118C9009J28816E0727K68705A1809O7759N5022M8326
11516A82916F1448b32063A02366a94808C3828L7784A7511J08133a04056A4428
11505f2663A11061O9194i0941I2378d4252A05781J08686r3093Q7642r3868h5100
11493a27748j7770C80254A18236J2195F2391L183L4716K16292D083c5260C50243
11481A41558g4249I6074K42540j01812O2018A057J78850K44949B06155F0811h5879
11469B02099c5576A7507e8623A30153c1330C88529A1154J02933R4998b39221D28631
11457B73883A07515a5683B12122r9860h3800A84400k1799G7781R9466q0144J09280
11446B06383L8002D3953O24849B66409c0249j01667G388a87354A07863D2529M7991
$$ y = [103370, 5747, 85244, 191362, 39009, 167825, 50727, 319432, 11809, 79568, 134590, 182916, 61448, -232063, 102366, -194808, 33828, 71612, 17511, 125644, -104056, 14428, -62663, 111061, 180255, -90941, 92378, -44252, 105781, 214467, 121374, 209016, 115148, -85100, -127748, -145518, 380254, 118236, 130431, 62391, 65574, 100290, 316582, 4083, -35260, 350243, 141558, -74249, 96074, 338614, 236802, 298820, 1057, 179907, 424856, 206155, 60811, -85879, 202099, -35576, 17507, -58623, 130153, -31330, 388529, 11154, 114087, 209085, -239221, 428631, 273883, 107515, -15683, 212122, 112262, -83800, 184400, 162601, 77781, 177247, 97103, 206383, 244385, 43953, 668802, 266409, -30249, -131916, 7388, -187354, 107863, 42529, 90520]
11435I0520C174N7676J36033f2505b0510C1040J48121C1031O7534J00960J1024
11424B10549a83057E3277N2011b79529d3547j20361c9868B56070J0050b85285
11413B08648A2977L19172j24040a162A92911b01851I5328J18396a24156B45959
11402B89795J03374a77102j52624e3489o7419B71151d2493C29978a63704D7642
11391A20452J61256q6304a73764k01096A05568c12073b755B96368D8477b16650
11380A93765m3551K3611c1135j49306D8952a98462B58283d9264F9733j5670L69104
11369D23167A89509b80887d6671l75459B08218a16437e0029j37984E7285a81832
11358A93897a41134p3993D8434h0716k18679a37105C63215G6237k6277f1057J2004
$$ y = [90520, 3174, 60850, 196883, -62505, -20510, 31040, 179161, 31031, 98565, 199525, 210549, -183057, 53277, 105288, -279529, -43547, -163908, -39868, 256070, 266120, -285285, 208648, 12977, 332149, 208109, -1162, 192911, -201851, 95328, 213724, -124156, 245959, 289795, 393169, -177102, -329726, -53489, -120908, 271151, -42493, 329978, -163704, 47642, 120452, 281708, 195404, -173764, -374860, 105568, -312073, -2755, 296368, 48477, -216650, 193765, 150214, 173825, -31135, -180441, 48952, -198462, 258283, -49264, 69733, 54063, 423167, 189509, -280887, -46671, -422130, 208218, -116437, -50029, -188013, 57285, -181832, 193897, -141134, -215127, 48434, -80716, -299395, -137105, 363215, 76237, 49960, -61057, -49053]
11347d9053A43913A6760J95239o819B8202a0971A09430b10074C3313j5642h6858
11335E9202b22538A25293d8978j3211j83098d2981j493B05447a40663M1233A15128
11323g2380A15606a02874R966I9036c4196o3096A4968c32676M6766A6896a78274
11311A14492b91273b3548G7392h4455B91936D8871c04432a33300A0707f0668B2814
11299i422D8033K79918a23037j14111b4708o1738j42686P5294J8637N7078A54423
11287a27994A31036a01213k34129B38478i0505F9511a33564j03192A40200b96750
11276a64246g3729j65056B64781B3671b49400F4590c44126A69972a99441B47498
11265b5871C02470d23m07424R2596m9982A49413b22127h2281o5307o9671m913
$$ y = [-49053, 143913, 16760, 211999, 205180, 28202, -10971, 109430, -210074, 33313, 17671, -86858, 59202, -222538, 125293, -48978, -62189, -245287, -42981, -44474, 205447, -140663, -99430, 115128, -72380, 115606, -102874, -92908, 99036, -34196, -97292, 14968, -332676, -285910, 16896, -178274, 114492, -291273, -23548, 77392, -84455, 291936, 48871, -304432, -133300, 10707, -60668, 22814, -9422, 48033, 327951, -123037, -237148, -24708, -86446, -229132, -153838, -135201, -78123, 154423, -127994, 131036, -101213, -335342, 238478, -90505, 69511, -133564, -236756, 140200, -296750, -164246, -73729, -238785, 264781, 23671, -249400, 64590, -344126, 169972, -199441, 247498, -25871, 302470, -423, -407847, -315251, -365233, 149413, -222127, -82281, -147588, -217259, -222172]
11254b22172A16060L1567F6898b75141B5235L77335A17149a08488b5467B49219
11243a91015H7287d03026J72807E2460g2602j30990m8813E495i2228k61623D4801
11231A31136d27491A07301J11966g6239A62623b90130J19878I336h5324J7559
11221f7765q3950B00546G5774O2281b02115B5483b71857c0179A65825a39529j24944
11210b64473i0106J8775A36867K0761a58611f4994F67b02053p8141h0713k6546
11199a07259B60259c18278J20115k32816b4673C00233A14560m2749a83308O652
11189a76656p5A01198R1514D5694J31552H3903i705F4144E173Q430g5894J6315
11177e9579k93133j6847A40526e10369B8568J16948a30257M4927q3685A15595
$$ y = [-222172, 116060, 147627, 66898, -275141, 25235, 402570, 117149, -108488, -25467, 249219, -191015, 87287, -403026, -230219, 52460, -72602, -203592, -252405, 5495, -92228, -353851, 44801, 131136, -427491, 107301, 219267, -76239, 162623, -290130, -170252, 9336, -85324, -67765, -151715, 200546, 75774, 138055, -202115, 25483, -271857, -30179, 165825, -139529, -264473, -90106, -71331, 136867, 157628, -158611, -64994, 667, -202053, -280194, -80713, -107259, 260259, -318278, -198163, -430979, -24673, 300233, 114560, 71811, -183308, -176656, -176731, 101198, 192712, 45694, 177246, 83903, -9705, 64144, 5173, 13603, -75894, -59579, -352712, -369559, 140526, -510369, 28568, 145516, -130257, -85330, -169015, 115595]
11166B25411b26824L3317j74935a56975c7304j79798G8003b47424h0111j5220
11156i5331D0519b35114A74112L2317d6655j24973Q3694k59666J19452b1399F875
11144c4500j42833a7602n04374a19007M6771a3743B72004b2647B3540q151L04806
11133C20195b18361k3659D8389b13626Q2617K3197G5856a47050d4033l31829b0306
11121c65481a00161d9592Q443J8139G1429a45499C19861A09082r24h1755C33442
11109B29149a8705k18881A26955K08388a82783j42019A14201J35383b23259A2462
11098b4165B0403a03571q749C92780A49779R2638a74006G4549R2080o4883L5411
11087A37157K35376A66391J34076a7504E0988J10993h5435m2994B36886N1521
$$ y = [225411, -226824, -193507, -368442, -156975, -37304, -217102, 78003, -247424, -80111, -95331, 40519, -235114, 174112, 206429, -46655, -171628, -87934, -347600, -228148, -21399, 6875, -34500, -177333, -17602, -521976, -119007, -72236, -13743, 272004, -22647, 23540, 15389, 320195, -218361, -242020, 48389, -213626, -131009, -107812, 75856, -147050, -44033, -375862, -20306, -365481, -100161, -49592, -41149, -23010, 71429, -145499, 319861, 109082, 108158, -81755, 333442, 229149, -18705, -237586, 126955, 335343, -182783, -324802, 114201, 249584, -223259, 12462, -24165, 20403, -103571, -112320, 392780, 149779, 242417, -174006, 74549, 166629, 101746, 137157, 372533, 166391, 300467, -17504, 50988, 161981, -85435, -128429, 236886, 288407]
11077B88407C3606a22513A2980J47246R7431A15420K2891N6654j0801k0223J74699
11066C38640j56973O5546A13804h0765B13936L26296g7599L1568k01887B59743
11055D49877G2529J99719D6376L11411A26308a16027B10577J48095l5919j28602
11045A94151M54222r4285k26657O4797r0682L13916K17752k34933J59280j4621
11035G42940l33765R1140j98957J98514J10791J22439j99294j91815K62476M1376
11025F45845J29145J2421j00819N3950k7514k5954o9256L7997R2676J53064l39302
11014E62253K04473m4274r593B96495K71673J55508J12104j39496j28507K81830
11004H49607C40621O774K41737j10918K24172K2947O433k21542L97194k25204
$$ y = [288407, 33606, -122513, 12980, 160226, 257657, 115420, 138311, 194965, 184164, 163941, 338640, 181667, 247213, 113804, -80765, 213936, 540232, -77599, -46031, -247918, 259743, 449877, 72529, 272248, 46376, 357787, 126308, -116027, 210577, 358672, 322753, 194151, 648373, 554088, 327431, 392228, 301546, 615462, 833214, 598281, 757561, 742940, 409175, 500315, 301358, 499872, 610663, 733102, 533808, 341993, 604469, 645845, 774990, 787411, 686592, 740542, 713028, 687074, 617818, 655815, 748491, 901555, 562253, 766726, 722452, 712859, 296495, 568168, 723676, 835780, 696284, 567777, 849607, 340621, 347395, 589132, 478214, 702386, 725333, 731766, 510224, 907418, 682214]
10994F82214q5632J50792l65099O7512j61833K35142j21837J61925k7280k12571
10984C23333k4540J98876Q3651K1983M9057j65914J87656j18395J58415k80077
10974D34045K13960n734L8269l47j99729K41845K76829k89073J83045M81168n56883
10963H17395J69246K07563L9189j01875O6915J72048N8048N84487p0743K76721
10953B218994K11162J559p7233j01083J50586j22840j81183q8125l81644L25634
10943A955827n36721L66910l49993k9693K30584j57655N68775n96763K08746l56188
10933A303829M0916n0989J68466F75659L25948C76751J94872j75611K93731B77320
10922D61345f5619A41153K32393a37801A75502C367Q5912b64507e896A02453a76408
$$ y = [682214, 596582, 747374, 382275, 449787, 287954, 523096, 401259, 563184, 535904, 323333, 298793, 497669, 581320, 603303, 652360, 486446, 674102, 555707, 714122, 434045, 648005, 642271, 680540, 680193, 480464, 722309, 999138, 710065, 893110, 1374278, 817395, 986641, 1194204, 1233393, 1131518, 1198433, 1370481, 1428529, 2013016, 1942273, 2218994, 2430156, 2431715, 2354482, 2253399, 2403985, 2281145, 2099962, 2011837, 1630193, 1955827, 1419106, 1786016, 1436023, 1406330, 1636914, 1479259, 2048034, 1451271, 1660017, 1303829, 1344745, 1293756, 1462222, 675659, 1001607, 376751, 571623, 396012, 689743, 277320, 461345, -65619, 141153, 373546, -137801, 175502, 3367, 89279, -264507, -5896, 102453, -176408]
10910A12983a89807D98959J0067g143F6022P2175N3759C702J42507f9667A51990
10898A00394b6801k41915A53314Q8685m2138J39397a69646P0958B55358n3331
10888B02027n9290b43577h5223H1523a49617O6370C4284b28350e9101n0609D4253
10876A36927q676c25592B5428c6533o4784A08733a10620A8786f1973H2764a37232
10864c0319G356e4170A12203J4555M1663j4917J38476H519a07423j68218O5761
10853b09880E3787G367f5924k06095e6747h49A8559K83276h8085B14879B4162
10841i5891d3129p9347M9801a0031j18637D84157A65066b19873A49227c92115
10830A54259a07986M5566j52755H272b94715f2415I116J53893E5475N4120j3098
$$ y = [112983, -189807, 498959, 509026, -7143, 66022, 138197, 191956, 3702, 146209, -69667, 151990, 100394, -26801, -268716, 153314, 241999, 199861, 339258, -169646, -98688, 255358, 202027, 142737, -243577, -85223, 81523, -149617, -83247, 34284, -228350, -59101, -109710, 44253, 136927, 128251, -325592, 25428, -36533, -101317, 108733, -110620, 18786, -61973, 82764, -137232, -30319, 7356, -54170, 112203, 126758, 168421, 153504, 291980, 8519, -107423, -275641, -209880, 53787, 7367, -65924, -272019, -56747, -849, 18559, 301835, -88085, 214879, 24162, -95891, -43129, -122476, -72675, -10031, -128668, 484157, 165066, -219873, 149227, -392115, 154259, -107986, -62420, -215175, 8272, -294715, -62415, 9116, 163009, 55475, 109595, 96497]
10819I6497f7323j83320O0609B69062g1237H1680b40058B07772b50661J17109
10809a33552N4728B42716c69366a51336B7063h9007q7565c9205F511a24696M4307
10798h0389O946F076b18527d545l7735k39661J12793n1340q5465H06a88404B77619
10785H514J10856K64540a54154D493b62978R8598n4707C71171b60203a05767j08094
10774b13861a04676I2173O722F843e30075A22037B7956i5450k23543R3206M6879
10763a78908j947A6197h5419A99047G1750A1315L6939d6703O089C0118J55658
10752A85776n3348b60144a14437k36270G3492c73650f679G7214K6274b58773M2912
10741b15861L5136H2456b72252P5136o7797O3572A72063a96616A03566a92141
$$ y = [96497, -67323, -250643, -190034, 269062, -71237, 81680, -240058, 207772, -250661, -133552, -78824, 242716, -369366, -151336, 27063, -89007, -176572, -39205, 6511, -124696, -80389, -73443, 6076, -218527, -4545, -42280, -281941, -169148, -220488, -305953, 806, -188404, 277619, 8514, 119370, 383910, -154154, 4493, -262978, -164380, -219087, 371171, -260203, -105767, -213861, -104676, 92173, 98895, 6843, -530075, 122037, 27956, -95450, -318993, -225787, -178908, -180855, 16197, -85419, 199047, 71750, 11315, 48254, -46703, -40614, 30118, 185776, 132428, -260144, -114437, -350707, 73492, -373650, -6679, 77214, 103488, -258773, -215861, -180725, 82456, -272252, -197116, -264913, -201341, 172063, -196616, 103566, -192141]
10730C3786a63724A01353D4740a01853o0382f3347j16361A45993o789d5893i947
10718d7503j14809c2312C49262A14464P2217H9487G749b01010e4131E1709g6531
10706f0974j64869k7809m0796g8544k14942K1175E351L6101J64724a15013b4128
10694a18107e0828k53997f4670K2515j05774j86026F6701A0674K6576d6878P820
10683c9058D7990e8386O318k68391J17575i4114C9464a43378j35357C1600c4833
10671f3419j54350p1684J7713a01768B4959c07061g4789C62366A1174J22900J85194
10660C19268A09069d301j67829A88065J2166k9631a52133b1361Q275A38636F0673
10648c75723G6471c33431a8678C3215a09078k37273b7511k35766j04729c3544
$$ y = [33786, -163724, 101353, 44740, -101853, -162235, -63347, -179708, 145993, 139204, -45893, -9947, -47503, -162312, -32312, 349262, 114464, 186681, 89487, 7749, -201010, -54131, 51709, -76531, -60974, -225843, -253652, -294448, -78544, -293486, -272311, 5351, 41452, 206176, -115013, -24128, -118107, -50828, -304825, -64670, -42155, -147929, -333955, 66701, 10674, 37250, -46878, -39058, 47990, -58386, -52068, -320459, -202884, -94114, 39464, -143378, -278735, 31600, -34833, -63419, -217769, -289453, -271740, -101768, 24959, -307061, -74789, 362366, 11174, 134074, 319268, 109069, -4301, -172130, 188065, 200231, 170600, -152133, -21361, -13086, 138636, 60673, -375723, 76471, -333431, -18678, 33215, -109078, -346351, -27511, -263277, -368006, -33544]
10637E7482i5935j22389E7357c3876j18332L8682o566d7495b0013k04990l2204
10626b57207a14392K3C03656J48150j76225F5149b44276F6744b934l7286l60164
10615d00384J62592O039o1265J02891F8322P9422a37257j77267i7163k992r3885
10604a94040M4649a1572k71505J08896g0457q1721D7772i9717p894m8722r3810
10593b50143A24252h1076j69976h455A40525a64594H850a77695o0095h1561G3878
10581a39792N8176J2469b2719j1628j22466C1576J73221a54998B55949H0734C609
10569b54528Q4452A52756B8264a47816f9453E6576L91810c15613A10732a96412
10558a98997B59433a77116J2112j27050D5125P9948b99943B19417k767g5802A83314
$$ y = [57482, -95935, -218324, 57357, -33876, -152208, -113526, -120092, -47495, -20013, -225003, -257207, -114392, -114369, 303656, 451806, 275581, 65149, -244276, 66744, -2934, -40220, -400384, -237792, -231753, -293018, -190127, 68322, 147744, -137257, -314524, -97163, -100155, -194040, -149391, -11572, -283077, -174181, -70457, -152178, 47772, -99717, -107611, -156333, -250143, 124252, -81076, -251052, -8455, 140525, -164594, 8850, -177695, -237790, -81561, 73878, -139792, -81616, -69147, -22719, -34347, -156813, 31576, 204797, -154998, 255949, 80734, 3609, -254528, -170076, 152756, 28264, -147816, -69453, 56576, 448386, -315613, 110732, -196412, -198997, 259433, -177116, -165004, -292054, 45125, 125073, -299943, 219417, 216650, -75802, 183314]
10546g5305k58603F373a08437A1149j161J87324j4533a56908B3302a49037j0893
10535a59930j90216D15026a10970c2951C8369c60559a14720C1463a32933H0744
10524a96156B92294d9686a1906A96882g3473G6598d00850A447b13154e1073A53836
10512A63290n7183f7657C24567E7962b16478N4455E1808d55308a80676A81788
10501a58949D1723A6133a14688I346h1833o9123l2826N3521j26385l0189B91771
10489g8502n2120A08236b2593C8247P697B451d3323E4903d5090A65120b66071
10477a30586E2153p337Q9479B4498J45850E2619J31392E5247b67290E9730k3156
10466C6574j5930d4087B72747h0875K6764B30539n1706A3573O30918k30701A80724
$$ y = [-75305, -333908, 6373, -108437, 11149, 9988, 197312, 182779, -156908, 23302, -149037, -159930, -350146, 415026, -110970, -32951, 38369, -360559, -114720, 31463, -132933, 80744, -196156, 292294, -49686, -11906, 196882, -73473, 76598, -400850, 1447, -213154, -51073, 153836, 163290, 106107, -67657, 324567, 57962, -216478, -162023, 51808, -455308, -180676, 181788, -158949, 41723, 16133, -114688, 9346, -81833, -150956, -183782, -130261, -256646, -286835, 291771, -78502, -130622, 108236, -22593, 38247, 45944, 2451, -43323, 54903, -45090, 165120, -266071, -130586, 52153, 44816, 134295, 24498, 170348, 52619, 184011, 55247, -267290, 59730, 36574, 20644, -44087, 272747, -80875, -54111, 230539, 178833, 13573, 644491, 413790, 180724]
10454C50628A02297L06556H7466e3656j31430n917G8939c1552k30775f9821A31019
10442D1455e7657j29351P7079l6838b645p3092A17427d8124a9571A37805B2429
10430B3411r724b94627B2265R7108P7284a27316p7497e042C0140J23114d20790
10418H9640a19000j96649E9725K6481a99586A14478c8539F7802Q51J47821N6343
10407B72817h9218B07804h5288B23011b06498N2155e8615n2176M8019J2176B5140
10395b05545k14102a23485j66738c8909B71092A32583i9066A86746n3671a64259
10384a29064A77351c30673a1490l66650a76552j0009B5115J64187j7041a573A4097
10372F5022b2730b826o3118F4518j6958L81843g905E88310B19441A04681c2123
$$ y = [350628, 102297, 408853, 87466, -53656, -185086, -191003, 78939, -31552, -262327, -69821, 131019, 41455, -57657, -187008, -109929, -146767, -2645, -75737, 117427, -48124, -19571, 137805, 22429, 23411, 13687, -294627, 22265, 119373, 196657, -127316, -204813, -5042, 30140, 153254, -420790, 89640, -119000, -315649, 59725, 86206, -199586, 114478, -38539, 67802, 68653, 216474, 272817, -89218, 207804, -85288, 223011, -206498, -154343, -58615, -110791, -62772, -50596, 25140, -205545, -419647, -123485, -290223, -38909, 271092, 132583, -99066, 186746, 133075, -164259, -129064, 177351, -330673, -11490, -378140, -176552, -186561, 25115, 189302, 172261, -1573, 14097, 65022, -22730, -2826, -65944, 64518, 47560, 429403, -7905, 588310, 219441, 104681, -32123]
10360A90219P2146K43524j65498a1932G4538A0414J12948B2810K13657K44692
10350D81159j31594L1106C2499R8332K35175j62279i9284B81002i2037I17P7736
10339G8653K05026I3992J64816G8687K43420o2998N7269K32761n3739j28612K52143
10328F18931C1103J80390l0623k4965J37715j21824K669Q116B3024J29214D2181
10316B85773E5301M1998c8998c777C27210j37883K9132C906J49626l7803Q6451
10305B02180K56138F7158O1280m7761P820K9847L381a70893H5266J11201r7361
10294I9106b85020B10364a07284q8577A61771c659G6906J03322F6908e1204l61825
10283d13029g0263B1690c16657J30117G3281O3064b72249j87389I520b49807B09451
$$ y = [190219, 262365, 505889, 340391, -11932, 74538, 10414, 123362, 22810, 236467, 481159, 349565, 380671, 32499, 130831, 366006, 203727, -99284, 281002, -92037, 917, 78653, 283679, 93992, 258808, 78687, 322107, 259109, 316378, 549139, 495400, 366788, 618931, 31103, 211493, 180870, 155905, 293620, 171796, 174465, 182581, 23024, 152238, 42181, 285773, 55301, 97299, -38998, -3777, 327210, 189327, 218459, 3906, 153532, 115729, 202180, 458318, 67158, 128438, 80677, 88497, 118344, 121725, -170893, 85266, 196467, 99106, -285020, 210364, -107284, -195861, 161771, -3659, 76906, 180228, 66908, -51204, -413029, -70263, 21690, -316657, -186540, 73281, 136345, -272249, -459638, 9520, -249807, 209451]
10271A14550n5463c56512J53471R9574E607b26541D9287g3397B56479R3495r5852
10260B54122a22925J5171O926B66998c14939a3827k0337k89843h7348D31855A11464
10248c57001J57105F3009b05811M7001A69938d320p4570k00105B51419a44947
10237G5654L11436j83410E429J14379J79670a8135C4923b93716A00351a58174
10226B709f1742n2667b019j44654l7437D5813b03503c7051l69693J53559H0166
10214A5438L0334f8857K7486A04386a63826I306d52643A93868a07497k00386A9912
10202G7304P2676b7352l09328A34659a5867n8092j75522Q3534H6584c51226d6227
10190a84754c1565a4757k52386r596a8469B34981d1169r3250c2010b050B14104
$$ y = [114550, 59087, -356512, -203041, -103467, 5607, -226541, 49287, -73397, 256479, 349974, 254122, -122925, -107754, -100828, 266998, -314939, -13827, -34164, -324007, -87348, 431855, 111464, -357001, -199896, 63009, -205811, -158810, 169938, -4320, -78890, -278995, 251419, -144947, 75654, 387090, 203680, 5429, 119808, 299478, -18135, 34923, -293716, 100351, -158174, 2709, -61742, -114409, -2019, -146673, -184110, 45813, -203503, -37051, -406744, -253185, 80166, 15438, 45772, -68857, -41371, 104386, -163826, 9306, -452643, 193868, -107497, -307883, 19912, 77304, 149980, -27352, -336680, 134659, -15867, -73959, -249481, -165947, 86584, -351226, -46227, -184754, -31565, -14757, -267143, -276739, -18469, 234981, -41169, -134419, -32010, -2050, 214104]
10178b20200g2248K4515j12580o6577o198i0474a9637k51070R8406K2335P1751
10167g8215K9179F4034a11547B1306b5239A18363c33570a53097f4450H8558J35407
10156B23965d6967B45c05946J39795j5271a6943d473p1898k9670c5929m25422
10145d61351Q0696p7514a88277D24605c82472e1346p1178k33317a12372N5034
10135e7338p7216l1607D372g6788l38971c1016C0329c18135P5810b7136r9068
10124a26204G170d15126J99691c776E453J4231c62502e9604k987p4083k7720J534
10112a62860I0797b96428j27006A17467m5159N7442c04518a35985O4487j9174
10102i0672j04351k39707e8778r6939j0239E60996F6147f6545r8241P1630A32964
$$ y = [-220200, -72248, -47733, -160313, -226890, -233088, -90474, -19637, -270707, -172301, -149966, -78215, -49036, 64034, -111547, 21306, -25239, 118363, -333570, -153097, -64450, 88558, 223965, -46967, 245, -305946, -166151, -181422, -16943, -4473, -76371, -106041, -35929, -461351, -380655, -458169, -188277, 424605, -382472, -51346, -122524, -355841, -112372, -57338, -134554, -166161, 4372, -76788, -415759, -31016, 30329, -318135, -242325, -27136, -126204, 7170, -415126, -215435, -3776, 5453, 19684, -362502, -59604, -62591, -136674, -164394, -162860, 90797, -296428, -423434, 117467, 72308, 129750, -304518, -135985, -71498, -90672, -195023, -434730, -58778, -155717, -165956, 560996, 66147, -66545, -164786, -93156, 132964]
10090a26922A74288J43771a46244j69779j1200J09220P4588E5109f6505p0926
10080a37431d2326r2222O1304k09147g6318k46533B04360f6661p6054d4554k01415
10069b45969j25859a02735j73323h14G1743b91977d5183E1081k0696b35884C1380
10057C56504H653P3899b42725q331K7455n3975A41606K28187g9788j72587F1268
10045f9395I344a52382L766m8260l8013G5746a95290A15461E1721a61833B35065
10033c9851o5979K9417m5664o3242D6208d22359J42262g1488A28591h7k46102
10022b46189j3928R4716M9829m8756j76357c267j4005m2987A42174c78346f5181
10010b31208q0025a20871D193g9274I1047g3141K5117j86229A06243b01971B84387
$$ y = [-126922, 174288, 318059, -146244, -316023, -327223, -218003, -143415, 55109, -66505, -137431, -42326, -134548, -73244, -282391, -76318, -322851, 204360, -66661, -142715, -44554, -245969, -371828, -102735, -276058, -814, 71743, -291977, -45183, 51081, 30385, -235884, 31380, 356504, 8653, 82552, -242725, -251056, -223601, -277576, 141606, 369793, -79788, -252375, 61268, -69395, 9344, -152382, -148616, -196876, -234889, 75746, -195290, 115461, 51721, -161833, 235065, -39851, -105830, -76413, -122077, -185319, 46208, -422359, -280097, -71488, 128591, -87, -246189, -260117, -165401, -115572, -164328, -340685, -3267, -17272, -60259, 142174, -378346, -65181, -231208, -311233, -120871, 4193, -79274, 91047, -73141, -48024, -234253, 106243, -201971, 284387]
9998h0568j12366A54007C6690a89749N8304a4135B32348b17978C699a20407A63127
9986h5368k50458E373L2752c83622J74712C61849c1816G6933b78864n3815B51757
9974B09116c25337E3811a84812A27339b4425A8862A079J00231b85566a16258o9256
9963a85514o450g6796A11159D5474A347b60796A13356L5968b27252c9286j89626
9952b28912B75658a05979b1189l14133k00509b17954O0973A91506D614h6419I1414
9940b19439I1924a8886j15126f3346j41636g9878j15334M8113A37348D5685c91323
9928b10359A26451J04678A7327J48968a6632l2001E6115R5785K1737D4781c6013
9916A52358B2157J00784d80029a63024O4299j1575n63d941I3178a9308L643m2342
$$ y = [-80568, -192934, 154007, 36690, -189749, -131445, -14135, 232348, -217978, 3699, -120407, 163127, -85368, -335826, 5373, 38125, -383622, -208910, 361849, -31816, 76933, -278864, -332679, 251757, 209116, -325337, 53811, -184812, 127339, -24425, 18862, 1079, 101310, -285566, -116258, -185514, -191964, -76796, 111159, 45474, 1347, -260796, 113356, 149324, -227252, -39286, -228912, 275658, -105979, -21189, -335322, -535831, -217954, -156981, 191506, 4614, -86419, 91414, -219439, 91924, -18886, -134012, -63346, -204982, -79878, -195212, -147099, 137348, 45685, -391323, -210359, 126451, 231129, 17327, 166295, -16632, -48633, 56115, 151900, 173637, 44781, -36013, 152358, 22157, 122941, -480029, -163024, -98725, -110300, -110863, -4941, 93178, -19308, -15665, -58007]
9904e8007N616j98326Q4925l8244C7062i6223o5727g9842C77124a56946b3473
9892a19157j51264J06727A10289B5739h4448c157E8018p812a4697k26847G4748
9880b7194l00220g1781j97553l9250K4862Q0566I5557b61168F8599r125c60562
9868h7807l40385a46403q4271A60369a4753D51738b66136k9077J44319C9519a81682
9856a37559B99354e9664C3022a62266f9404p7761B27632b64829e9727B11951b71704
9844B47947b81693c8892l26677a47984j61270J50602m4570A87604B4548e82513
9833a45803f5823n5317k86035O0515k4673b6030j77542l036Q4927r750C5904a53011
9820b25709b6425A58266a14533l23712K01220i6065L0483l00106J64523A23204
$$ y = [-58007, -52391, -250717, -165792, -204036, 37062, -96223, -161950, -79842, 377124, -156946, -23473, -119157, -270421, -163694, 110289, 25739, -84448, -3157, 58018, 50206, -14697, -241544, 74748, -27194, -327414, -71781, -269334, -308584, -283722, -203156, 95557, -261168, 68599, 59474, -360562, -87807, -428192, -146403, -230674, 160369, -14753, 451738, -266136, -295213, -150894, 39519, -181682, -137559, 299354, -59664, 33022, -162266, -69404, -147165, 227632, -264829, -59727, 211951, -271704, 247947, -281693, -38892, -365569, -147984, -309254, -158652, -203222, 187604, 24548, -582513, -145803, -65823, -121140, -407175, -346660, -371333, -26030, -203572, -206608, -121681, -131431, 35904, -153011, -225709, -26425, 158266, -114533, -438245, -237025, -96065, -65582, -365688, -201165, 123204]
9809a9439I3962f1202J5367A32314e8329k21858A72095h7921j62236N0513R0698
9798a08946o0650D54454H5615a90585a4414F0328j7648a30405A4996L2475a29794
9786D9369j8081f2663n06316K38665a60852k20245A26533c27807I9979J63981
9776B63960a02091F6303i5784o6092E5911b84110H4570b8722j00837A15771k5189
9765I0582d84029j0693A42807b45671b5909j27675g4901B74970a53610A94807
9754b1173p6722A93544I6199d03012d6126D36a09452C54336a91927D3623b79856
9742a83102c6074j8546n3178B02686I1376a86294g824o6436F9700a32274A10051
9730B4699c19379p577J30467A17584a23295k29613f2155A25329n4092a63217j57885
$$ y = [-19439, 93962, -61202, -45835, 132314, -58329, -280187, 172095, -87921, -250157, -199644, -108946, -169596, 454454, 85615, -190585, -14414, 60328, 42680, -130405, 14996, 47471, -129794, 49369, 31288, -62663, -568979, -330314, -160852, -381097, 126533, -327807, 99979, 263960, -102091, 66303, -95784, -161876, 55911, -284110, 84570, -28722, -129559, 115771, 90582, -484029, -494722, 142807, -245671, -25909, -153584, -74901, 274970, -153610, 194807, -21173, -97895, 193544, 96199, -403012, -46126, 436, -109452, 354336, -191927, 43623, -279856, -183102, -36074, -54620, -107798, 202686, 91376, -186294, -7824, -74260, 69700, -132274, 110051, 24699, -319379, -326956, -196489, 117584, -123295, -352908, -62155, 125329, 71237, -163217, -321102]
9719c21102a40335Q830a827H8106l6655a21173p6967p7696Q1904i1291A00967
9707B948a40506r2885G3310b87373D9344K5808J39683b97785q5164J44277g9350
9695a82361j998D7056M6765b49466G1892N807a6606A27496J01883b33699A16803
9683a89403E148K97174b14223E7315k2997a14299A54794F5236h2606G1584j9691
9672E1893h9939A39858i4296A2268a96840A79655a22381p6819A56796b90884A9481
9660a53079G0562a2910A49329a13761q5257G9138b52296A4470a39118k08491p889
9649c55498A9836c19141R3546J05027c0990A72433D1676K14904f713j04524B58353
9637d0422A2754Q3157H336b31646N7851P9G4126a23341k33666h374C10493c6689
$$ y = [-321102, -140335, -131505, -1827, 88106, 51451, -121173, -198140, -275836, -193932, -91291, 100967, 2948, -140506, -233391, 73310, -287373, 49344, 75152, 214835, -297785, -382949, -238672, -79350, -182361, -184359, 47056, 93821, -249466, 71892, 77699, -16606, 127496, 229379, -233699, 116803, -189403, 5148, 302322, -214223, 57315, 34318, -114299, 154794, 65236, -82606, 71584, 51893, -89939, 139858, -94296, 12268, -196840, 179655, -122381, -199200, 156796, -290884, 19481, -153079, 70562, -12910, 149329, -113761, -199018, 79138, -252296, 14470, -139118, -347609, -355498, 19836, -319141, -225595, -120568, -30990, 172433, 41676, 256580, -6713, -111237, 258353, -40422, 12754, 95911, 8336, -231646, -173795, -173716, 74126, -123341, -357007, -8374, 310493, -36689]
9624a51947C1064J53508B2220b2022H5657k1576b62077i8949l9796N5912A36698
9612a76989G825c18529c8508A10362d15819J16572A12984n1249J75245c8754J2695
9601b6059q7150p6096n6884A30773J9644N2504a70172a6409A05285J85249d48038
9589a911G8304a14760e6312j89K0912k8815A89891c6082J1035m20217a56140N1083
9577a05057r6235D3381P5763f8273k39328D9859C690f4668k65826p9942B55334
9565A14864a49340O3761I2798B0775Q2884e0403j03382o0842E5492a66404f3236
9553a14624q5156d2082G062P4993a81501P5483d9423b0594j17590m7859L6121
9542a49922A03157B7194J40331G1189J42260b81875B30177e17327D5542d3004
$$ y = [-151947, 31064, 184572, 22220, -22022, 85657, 64081, -262077, -98949, -138745, -82833, 136698, -176989, 7825, -318529, -38508, 110362, -415819, -299247, 112984, 61735, 236980, -38754, -26059, -113209, -189305, -246189, 130773, 150417, 202921, -170172, -16409, 105285, 290534, -448038, -1911, 78304, -114760, -56312, -56501, -35589, -64404, 189891, -36082, -25047, -445264, -156140, -105057, -201292, 43381, 119144, -68273, -307601, 49859, 3690, -64668, -330494, -410436, 255334, 114864, -149340, -85579, 92798, 20775, 103659, -50403, -153785, -214627, 55492, -166404, -63236, -114624, -199780, -42082, 7062, 82055, -181501, -106018, -49423, -20594, -138184, -186043, -149922, 103157, 27194, 167525, 71189, 213449, -281875, 230177, -517327, 45542, -43004]
9531A14638i7826J3385k92089d0217A53740D4580a49116K3424c6353r5252p9263
9520b10868O8328b9595a402E3498K57955e9697p2921b1161j94186b4961e5j13961
9508a14016A43595a36273l4647A29281l4806K11030a06061M7040j9054j30102
9498b08177A801b18841r6860L1590n5193a41541p7446M2031i270k7532k09144
9487b45946M7956e0371J9288A3286d8200H4089a06544A63344a85115j86199G3090
9475e8959f55A95617b58359G9898c20831I385k123f0887j25956d7362A3484a51820
9462B37583b73575b7711C03180a17452j32610g8485j55561D88667a68593d4025
9451d899j37229H3078a01929A30823I415J60488d5899B9078i5786K3355j23988
$$ y = [114638, -97826, -84441, -376530, -40217, 153740, 44580, -149116, -125692, -36353, -131605, -210868, -142540, -29595, -1402, 53498, 311453, -59697, -132618, -21161, -215347, -24961, -55, -114016, 143595, -136273, -170920, 129281, 94475, 305505, -106061, -59021, -78075, -208177, 1801, -218841, -315701, -284111, -339304, -141541, -218987, -176956, -9270, -36802, -245946, -197990, -50371, -31083, 13286, -48200, 84089, -106544, 163344, -185115, -371314, 73090, -58959, -655, 195617, -258359, 79898, -320831, 9385, 7262, -60887, -186843, -47362, 13484, -151820, 237583, -273575, -27711, 303180, -117452, -250062, -78485, -234046, 488667, -168593, -44025, -4899, -142128, 83078, -101929, 130823, 9415, 169903, -45899, 29078, -95786, -72431, -196419]
9440a96419h7194j65182I6275d6953j80240j66669A0216a28449G9655K9574j2528
9429I6701a98175O4816B79464c7577m31559b01078E5569d975k90324A50175g7671
9417a31270e6956A43746h447p4013B20455A6272d1090A67917B0827c7976j78337
9406b16313m4395A58335b46549B90323a35056b321k4406A74154e9051C74001b4293
9394g243F6275C1259a42742j08520A62773a60936C2703a87973C62649a75885H1644
9382A55552a13192m7716A16631C9079Q029A0305b00788j68765e954F5033Q0582
9371A45615a29601M0695c6514p2772D4184L7429i844l13827P5521M1440I2718
9359D9333J41578Q4426a49356A41891b30497O7022O1422A64848b12529R842c0732
$$ y = [-196419, -87194, -252376, 96275, -46953, -227193, -393862, 10216, -128449, 79655, 109229, 96701, -198175, -133359, 279464, -37577, -469136, -201078, 55569, -4975, -295299, 150175, -77671, -131270, -56956, 143746, -8447, -82460, 220455, 16272, -41090, 167917, 20827, -37976, -216313, -260708, 158335, -246549, 290323, -135056, -2321, -26727, 174154, -59051, 374001, -24293, -7243, 66275, 31259, -142742, -251262, 162773, -160936, 32703, -187973, 362649, -175885, 81644, 155552, -113192, -160908, 116631, 39079, 47108, 10305, -200788, -369553, -5954, 65033, 145615, -129601, -88906, -36514, -109286, 44184, 81613, -9844, -323671, -248150, -206710, 92718, 49333, 190911, 275337, -149356, 141891, -230497, -163475, -102053, 164848, -212529, -202687, -30732]
9347c94536J75231k75729A13049d08862D0543d5001j01955B4083a89948L0954
9337a58994B25340a227B920J34687i9924q8741A15001m6276M2650h1118J0676
9326g0442j21967k52867C4387a88264h9564A0812R1930b74452j57137I8816h3931
9314a47606m6567J3148D4937h417j78302j51212a57210c804k46311R6716b7739
9302C04345b87611g3658E7340a79673B00061i9721C8418b95960f7284G8985c9444
9290a64698j60355j3972A6390L57474b10418a8398A84135a36293j16653J11100
9280a41846M6853p5362d1888j51017A01439J49283c33943a34893D6866K0442b0566
9268A30651c11871Q2902k50782C4953M0448O2366b16544c8259J0061j96410O9328
$$ y = [-394536, -219305, -495034, 113049, -408862, 40543, -45001, -146956, 24083, -189948, -158994, 225340, -1227, 2920, 137607, -99924, -188665, 115001, 68725, 111375, -81118, -70442, -192409, -445276, 34387, -188264, -89564, 10812, 102742, -274452, -431589, 98816, -83931, -147606, -194173, -181025, 44937, -8417, -186719, -337931, -157210, -3804, -250115, -153399, -27739, 304345, -287611, -73658, 57340, -179673, 200061, -99721, 38418, -295960, -67284, 78985, -39444, -164698, -325053, -339025, 16390, 373864, -210418, -18398, 184135, -136293, -252946, -141846, -94993, -170355, -41888, -192905, 101439, 250722, -333943, -134893, 46866, 67308, -20566, 130651, -311871, -228969, -479751, 34953, 75401, 137767, -216544, -38259, -28198, -224608, -155280]
9257a55280L7964k19717c547n8078A46696a11189m42761a09920B32818I99a91361
9245e4003b5811j2740E9327a06590A32874a51406l43395K42435c1764C71657b11589
9233d938H7815J12642b07127H8839a74908d7957G802c10866I7991a7893A1595
9221b50946R5467c1024j5122l3848E9761J32694K8040d77898A74990c1586g368
9209e9599A44936n1421a58923F30J733K79266C9737b9246r6934A79424a61133
9197A76343a83000B24777a57424A4609a67985j29509a01060H7621a89012j32170
9187c21182A79352C0498Q604j0600J22161g7671K5108F3516b08121N5778g1884
9175B5320b79089J10378j37365B993Q8732a33076r5961b0821j92019E8598j0162
$$ y = [-155280, -117316, -337033, -3547, -61625, 146696, -111189, -553950, -109920, 232818, 999, -191361, -54003, -25811, -38551, 59327, -106590, 132874, -151406, -494801, -252366, -31764, 371657, -211589, -4938, 87815, 200457, -207127, 88839, -174908, -47957, 7802, -310866, 97991, -17893, 11595, -250946, -155479, -31024, -46146, -79994, 59761, 192455, 220495, -477898, 174990, -31586, -7368, -59599, 144936, 93515, -158923, 630, 2363, 281629, 39737, -29246, -126180, 179424, -161133, 176343, -183000, 224777, -157424, 14609, -167985, -297494, -101060, 87621, -189012, -321182, 179352, 30498, 39102, 28502, 150663, -77671, -52563, 63516, -208121, -152343, -71884, 25320, -279089, -168711, -306076, 2993, 91725, -133076, -229037, -20821, -212840, 58598, 48436]
9164D8436A3649O6182l3009a78012B2737L58916a47285b1978j29383l5967K5369
9153a61959E7213a71457n8598M108o5790c7717l12663b6354k37971j16469c6574
9141A02591l1135a15772m91050C41189c34296A68515g4070E0597b56017A593b21374
9129C53273H8524f4358C5150c8679j9823H9120a46016f3558K8568j71531F2920
9117a45357b7808B86560h0949A6902b92776h2800k15698c6273p8848l5944N868
9106a45197l5168k7039e5582A2429d8153b1970A8026h5385k2742b0845j36362
9095a57207J8511D1100K25235r8804a55325l9303Q6245c5195A75112a37528A39375
9083f1720I9337G729J00262N4367b37488J02420B44305F8774O7271a21995B83775
$$ y = [48436, 13649, 79831, 46822, -178012, 22737, 381653, -147285, -21978, -151361, -187328, -161959, 57213, -171457, -230055, -225947, -291737, -37717, -350380, -26354, -264325, -380794, -36574, 102591, 71456, -115772, -606822, 341189, -334296, 168515, -74070, 50597, -256017, 1593, -221374, 353273, 88524, -64358, 35150, -38679, -58502, 89120, -146016, -63558, -34990, -206521, 62920, -145357, -27808, 286560, -80949, 16902, -292776, -82800, -298498, -36273, -115121, -151065, -145197, -180365, -207404, -55582, 12429, -48153, -21970, 18026, -85385, -108127, -20845, -157207, -138696, 41100, 266335, 167531, -155325, -194628, -108383, -35195, 175112, -137528, 139375, -61720, 99337, 7729, 107991, 162358, -237488, -135068, 244305, 68774, 136045, -121995, 283775]
9071b1930j38778A88126a09894l0683O453N752k3913B3062c62212A91756i5699
9059c19249a19807a0779A06950d7547A57952b80394l5803b1686l5021j16180F1831
9047c90761A50655b26739C3932a00526b6891j1597A4330N1068a8924j50990O3399
9036a06515g775A60379a63989I8747f0722A11071k3881a57309a547l99757a43449
9024A62513P9597m8001F5501e3471F0543a65261A31075B3708L5371b28850B85630
9012c9906A49093n625K9936b16186k9234K2068A9068K3289d1145k06216g5588
9000e3596A30657g2040J4592n2081A7375L3796j7033b11831f926D5469K8693c85461
8987d9229k19719f3386a1666A31161l9602J03045b97472g083k12534K9519h6682
$$ y = [-21930, -160708, 188126, -109894, -140577, -134124, -128372, -152285, 23062, -362212, 191756, -95699, -319249, -119807, -10779, 106950, -47547, 157952, -280394, -316197, -21686, -56707, -172887, 61831, -390761, 150655, -226739, 33932, -100526, -26891, -38488, 14330, 65398, -18924, -169914, -106515, -7775, 160379, -163989, 98747, -60722, 111071, 87190, -157309, -1547, -401304, -143449, 162513, 242110, 194109, 65501, -53471, 60543, -165261, 131075, 23708, 59079, -228850, 285630, -39906, 149093, 143468, 173404, -216186, -245420, -223352, 19068, 42357, -41145, -247361, -75588, -53596, 130657, -72040, -57448, -109529, 17375, 51171, 34138, -211831, -6926, 45469, 74162, -385461, -49229, -268948, -63386, -11666, 131161, 91559, 194604, -297472, -7083, -219617, -190098, -86682]
8975B96461E7402c399k28750r6918N2236e7398l4049r0337B0835h9456p3705d7619
8962a55872B60497a18475j49908a01252H4314b21230e7996A82002g3224a1549
8951a0864C3370a35071B13627f441j45079A18249L1732k6577f3082I6786J32787
8940B29573b54585b3984j02743k51735G9057J76984a66347F695a49013A01706
8929G3362b7998j20978G18b15581O9022C5921a19663F8603c77302A2769b81855
8917A54348a8744A28302P0697c7797a182B18657J0858m8447J51278J14633L03465
8906G50444k05927P21315J928702K927007N1400B935963j384321G40163k28843
8897E11320k51914p7358a19549H0776J73172A016f8218A33107J06740b81052A12558
$$ y = [296461, 57402, -3399, -232149, -329067, -276831, -57398, -91447, -181784, 20835, -89456, -163161, -47619, -155872, 260497, -118475, -268383, -101252, 84314, -221230, -57996, 182002, -73224, -11549, -10864, 33370, -135071, 213627, -6441, -151520, 118249, 149981, 123404, -63082, 96786, 229573, -254585, -23984, -126727, -378462, 79057, 256041, -166347, 6695, -149013, 101706, 73362, -27998, -148976, 718, -215581, -146559, 35921, -119663, 68603, -377302, 12769, -281855, 154348, -18744, 128302, 198999, -37797, -1182, 218657, 229515, 181068, 332346, 446979, 750444, 544517, 1265832, 3194534, 6121541, 6172941, 2935963, 1551642, 740163, 511320, 259406, 182048, -119549, 80776, 253948, 1016, -68218, 133107, 239847, -281052, 112558]
8885A11036B3419h6549C15937f9494C18935a75169L4060J145M3169A25669b79595
8873a77371Q0781C4629J09935a0901A60072B1645B222f7211Q441m2957l0156e2787
8860c70430e9101o4046p435b6408l2884l8258L5590j08057D4381e58437a53581
8848d6280k36316A52429j6821d44121E0302J80102a96752A10298a87424O8204
8838a19220a9637l0040o4254p5728A1952d10992J35579J16098a4514A07933c1228
8826g4542q3219q4273m4966a11209I0663K63994I4133a68593A22394b8241m21628
$$ y = [111036, 23419, -86549, 315937, -69494, 318935, -175169, -141109, -139964, -96795, 125669, -279595, -177371, -96590, 34629, 144564, -10901, 160072, 21645, 2222, -67211, -58770, -101727, -131883, -52787, -370430, -59101, -123147, -130582, -26408, -59292, -97550, -61960, -170017, 44381, -558437, -153581, -46280, -282596, 152429, 135608, -444121, 50302, 230404, -196752, 110298, -187424, -119220, -19637, -49677, -113931, -189659, 11952, -410992, -275413, -159315, -14514, 107933, -31228, -74542, -157761, -242034, -287000, -111209, 90663, 354657, 94133, -168593, 122394, -28241, -449869]
$$ [...]
##END NTUPLES=NMR SPECTRUM
##END=
