
##TITLE=AC1173_Tolima-ibage-TDOAH12007_7165163_eVbsZZeuvh
##JCAMPDX= 6.0         $$ Bruker NMR JCAMP-DX V2.0
##DATA TYPE= NMR SPECTRUM
##DATA CLASS= NTUPLES
##ORIGIN= BRUKER
##OWNER= Administrator
$$ 1.72 TOPSPIN		Version 2.1
$$ 2012-12-02 03:18:46.678 -0500  Administrator@X
$$ Compression mode = diff/dup
##.OBSERVE FREQUENCY= 400.02188249412
##.OBSERVE NUCLEUS= ^1H
##.ACQUISITION MODE= SIMULTANEOUS (DQD)
##.ACQUISITION SCHEME= undefined
##.AVERAGES= 8
##.DIGITISER RES= 22
##SPECTROMETER/DATA SYSTEM= spect
##.PULSE SEQUENCE= zg30
##.SOLVENT NAME= COFFEE_meoh
##.SHIFT REFERENCE= INTERNAL, COFFEE_meoh, 1, 14.98509
##AUDIT TRAIL= $$ (NUMBER, WHEN, WHO, WHERE, PROCESS, VERSION, WHAT)
$$ ##TITLE= Audit trail, TOPSPIN		Version 2.1
$$ ##JCAMPDX= 5.01
$$ ##ORIGIN= Bruker BioSpin GmbH
$$ ##OWNER= Administrator
$$ $$ E:\/data/COFFEE/nmr/AC1173_Tolima-ibage-TDOAH12007_7165163_eVbsZZeuvh/10/pdata/1/auditp.txt
$$ ##AUDIT TRAIL=  $$ (NUMBER, WHEN, WHO, WHERE, PROCESS, VERSION, WHAT)
(   1,<2012-12-02 03:18:38.413 -0500>,<Administrator>,<X>,<go>,<TOPSPIN 2.1>,
      <created by zg
	started at 2012-12-02 03:17:31.850 -0500,
	POWCHK enabled, PULCHK disabled,
       configuration hash MD5:
       86 BA 57 50 F2 9D 5C 9B 26 00 A9 28 5F 66 2E 89
       data hash MD5: 64K
       76 79 8A 8C 6E 43 A2 B9 9E 1E 7F B5 FE C7 EB B8>)
(   2,<2012-12-02 03:18:41.491 -0500>,<Administrator>,<X>,<proc1d>,<TOPSPIN 2.1>,
      <Start of raw data processing
       efp LB = 0 FT_mod = 6 PKNL = 1 PHC0 = 0 PHC1 = 0 SI = 32K 
       data hash MD5: 32K
       63 69 30 4B 28 3C 87 1D 8B A7 38 B8 F9 A8 B7 13>)
(   3,<2012-12-02 03:18:41.960 -0500>,<Administrator>,<X>,<proc1d>,<TOPSPIN 2.1>,
      <pk PHC0 = 98.68469 PHC1 = 0 
       data hash MD5: 32K
       68 5D FF 4C 1A 9B 0B 61 EC 9F 3E 67 D0 DC 14 67>)
(   4,<2012-12-02 03:18:42.194 -0500>,<Administrator>,<X>,<proc1d>,<TOPSPIN 2.1>,
      <abs ABSG = 1 
       data hash MD5: 32K
       D4 6A 3A 5A 4F 4B 42 12 05 A2 EF 78 B9 79 6F B4>)
(   5,<2012-12-02 03:18:42.350 -0500>,<Administrator>,<X>,<proc1d>,<TOPSPIN 2.1>,
      <abs ABSG = 2 
       data hash MD5: 32K
       48 49 40 89 96 4A D5 DF 19 74 E6 32 50 B8 D1 32>)
(   6,<2012-12-02 03:18:42.491 -0500>,<Administrator>,<X>,<proc1d>,<TOPSPIN 2.1>,
      <abs ABSG = 3 
       data hash MD5: 32K
       ED FB 8E DB 55 D9 59 34 DA B8 D2 C0 5A 93 D0 8C>)
(   7,<2012-12-02 03:18:42.647 -0500>,<Administrator>,<X>,<proc1d>,<TOPSPIN 2.1>,
      <abs ABSG = 4 
       data hash MD5: 32K
       63 13 64 9B 9B 99 6F A6 22 EF F6 CD C2 02 52 FD>)
(   8,<2012-12-02 03:18:42.788 -0500>,<Administrator>,<X>,<proc1d>,<TOPSPIN 2.1>,
      <abs ABSG = 5 
       data hash MD5: 32K
       D8 15 CB 7B 90 8F 2A B8 82 80 5C 3C 47 C4 16 9E>)
$$ ##END=
$$ 
$$ $$ hash MD5
$$ $$ 41 05 F8 4E 32 30 3C 9A 62 0B 9E 7D DB 23 B7 2A
##$RELAX= 
##$RELAX= 
##$RELAX= 
##$RELAX= 
##$RELAX= 
##$RELAX= 
##$RELAX= 
$$ Bruker specific parameters
$$ --------------------------
##$DU= <E:\>
##$EXPNO= 10
$$ [...]
##$TP= (0..7)
150 150 150 150 150 150 150 150
##$TP07= 0
##$TPNAME0= <>
##$TPNAME1= <>
##$TPNAME2= <>
##$TPNAME3= <>
##$TPNAME4= <>
##$TPNAME5= <>
##$TPNAME6= <>
##$TPNAME7= <>
##$TPOAL= (0..7)
0.5 0.5 0.5 0.5 0.5 0.5 0.5 0.5
##$TPOFFS= (0..7)
0 0 0 0 0 0 0 0
##$TUNHIN= 0
##$TUNHOUT= 0
##$TUNXOUT= 0
##$USERA1= <user>
##$USERA2= <user>
##$USERA3= <user>
##$USERA4= <user>
##$USERA5= <user>
##$V9= 5
##$VALIST= <valist>
##$VCLIST= <CCCCCCCCCCCCCCC>
##$VD= 0
##$VDLIST= <DDDDDDDDDDDDDDD>
##$VPLIST= <PPPPPPPPPPPPPPP>
##$VTLIST= <TTTTTTTTTTTTTTT>
##$WBST= 1024
##$WBSW= 4
##$XGAIN= (0..3)
0 0 0 0
##$XL= 0
##$YL= 0
##$YMAX_a= 624795
##$YMIN_a= -528569
##$ZGOPTNS= <>
##$ZL1= 120
##$ZL2= 120
##$ZL3= 120
##$ZL4= 120
##$ABSF1= 14.98509
##$ABSF2= -5.573092
##$ABSG= 5
##$ABSL= 3
##$ALPHA= 0
##$AQORDER= 0
##$ASSFAC= 0
##$ASSFACI= 0
##$ASSFACX= 0
##$ASSWID= 0
##$AUNMP= <proc_prof1d_extract_pilot.lims>
##$AXLEFT= 0
##$AXNAME= <>
##$AXNUC= <1H>
##$AXRIGHT= 0
##$AXTYPE= 0
##$AXUNIT= <>
##$AZFE= 0.1
##$AZFW= 0.1
##$BCFW= 0
##$BC_mod= 0
##$BYTORDP= 0
##$COROFFS= 0
##$CY= 15
##$DATMOD= 1
##$DC= 0
##$DFILT= <>
##$DTYPP= 0
##$F1P= 0
##$F2P= 0
##$FCOR= 0.5
##$FTSIZE= 32768
##$FT_mod= 6
##$GAMMA= 0
##$GB= 0
##$INTBC= 1
##$INTSCL= 1
##$ISEN= 128
##$LB= 0
##$LEV0= 0
##$LPBIN= 0
##$MAXI= 10000
##$MC2= 0
##$MEAN= 0
##$ME_mod= 0
##$MI= 0
##$NCOEF= 0
##$NC_proc= -8
##$NLEV= 6
##$NOISF1= 0
##$NOISF2= 0
##$NSP= 0
##$NTH_PI= 0
##$NZP= 0
##$OFFSET= 14.98509
##$PC= 1
##$PHC0= 98.68469
##$PHC1= 0
##$PH_mod= 1
##$PKNL= yes
##$PPARMOD= 0
##$PPDIAG= 0
##$PPIPTYP= 0
##$PPMPNUM= 2147483647
##$PPRESOL= 1
##$PSCAL= 4
##$PSIGN= 0
##$PYNMP= <proc.py>
##$REVERSE= no
##$SF= 400.02
##$SI= 32768
##$SIGF1= 0
##$SIGF2= 0
##$SINO= 400
##$SIOLD= 32768
##$SPECTYP= <>
##$SREGLST= <1H.CDCl3>
##$SSB= 0
##$STSI= 32768
##$STSR= 0
##$SW_p= 8223.68421052631
##$SYMM= 0
##$S_DEV= 0
##$TDeff= 65536
##$TDoff= 0
##$TI= <>
##$TILT= no
##$TM1= 0
##$TM2= 0
##$TOPLEV= 0
##$USERP1= <user>
##$USERP2= <user>
##$USERP3= <user>
##$USERP4= <user>
##$USERP5= <user>
##$WDW= 1
##$XDIM= 32768
##$YMAX_p= 470450882
##$YMIN_p= -719246
##$CURPLOT= <Network HP LaserJet P1505>
##$CURPRIN= <$Network HP LaserJet P1505>
##$DFORMAT= <normdp>
##$LAYOUT= <+/1D_H.xwp>
##$LFORMAT= <normlp>
##$PFORMAT= <normpl>
##$SURQMSG= 1
$$ End of Bruker specific parameters
$$ ---------------------------------
##NTUPLES= NMR SPECTRUM
##VAR_NAME=  FREQUENCY,     SPECTRUM/REAL,   SPECTRUM/IMAG
##SYMBOL=    X,             R,               I
##VAR_TYPE=  INDEPENDENT,   DEPENDENT,       DEPENDENT
##VAR_FORM=  AFFN,          ASDF,            ASDF
##VAR_DIM=   32768,         32768,           32768
##UNITS=     HZ,            ARBITRARY UNITS, ARBITRARY UNITS
##FACTOR=    0.250966925370066, 1,           1
##FIRST=     8223.43324360094, -66930,       177706
##LAST=      0,             -101292,         113247
##MIN=       0,             -719246,         0
##MAX=       8223.43324360094, 470450882,    0
$$ Real data points
##PAGE= N=1
##DATA TABLE= (X++(R..R)), XYDATA
$$ [...]
23815 -334441 -42883 245612 -244993 -67841 174829 104031 39136 8947 -301254 24363 -106784
23803 276285 -41747 25176 -385450 226068 -191989 -66 65361 -104626 67475 11616 -100017
23791 109985 106576 -94956 207943 190903 -231324 223935 169418 -423234 -110411 -76780 6800
23779 307050 -269203 -259113 -13994 4662 331784 128088 141143 -4465 -96935 72752 30748
23767 -191525 86536 38036 -145222 -301502 -100604 -283397 314691 35246 46944 -54735
23756 -182699 -210572 123714 -365599 -293949 -12634 228501 -119770 -119857 28077 276770 49439
23744 47948 245779 252659 70937 52040 95105 -168761 -330236 170582 -61349 -206311 22875
23732 113428 78841 -31378 68870 -154867 -91254 280923 172689 117740 -12906 -215055 -258873
23721 -258873 -214799 -174854 -222608 -114929 182662 -194804 180900 -251786 210164 -16797
23710 -142829 115148 -7264 151560 133720 -40626 -11025 -276273 243437 -31518 31679 -302012
23698 -125482 -14075 15611 362839 -244660 70686 178374 -15007 -97256 -280687 -266119 -274274
23687 -274274 48204 -178064 132789 190026 246442 23499 31809 -91465 108371 12607 -13109
23675 -88970 75105 304214 -42076 57295 -294319 -237292 -63582 81324 -104138 -99529 -62298
23664 -62298 -34347 -181308 59496 -352695 -117056 -14003 71302 64681 37402 50709 -2092
23652 -5122 -104740 311031 17084 -108773 -104952 316405 -196001 -252479 -152209 72144 -31340
23640 -18790 -291263 -379053 -13806 -192734 -215362 164375 116837 198357 -368224 -130371 -212817
23629 -212817 -110364 -128061 -281021 -28677 -99148 -83431 -112105 -19969 -565877 76578 -165851
23617 -33323 -205185 264244 -77810 -154478 181021 286173 -123865 28733 -161015 -61377
23606 -436925 -34797 -94509 125519 -152754 -112408 133782 -76481 148188 330900 200194
23596 200194 97647 157300 308700 -191224 211646 252473 314482 68985 129192 120724 136314
23585 136314 21074 98320 -392365 157922 19620 405254 42395 -132864 63096 -408119
23574 170626 80170 174344 -133023 -244981 -52215 -241520 -247425 -18023 215075 -27351 -59312
23563 -59312 218085 -380434 11147 -50639 149095 -127962 -320817 210862 -3362 -319245
23553 -319245 -115025 -288569 51311 55930 -200235 -127167 106325 199094 118574 -310493 99041
23541 90212 38336 176193 14711 64058 171847 -134811 -112214 -152849 232170 -31911 -137531
23530 -137531 -210516 17775 -212958 -23734 136732 -144535 215489 -4865 -50766 -275452 -366554
23519 -366554 -35061 94773 -81943 -137229 410279 -193411 14244 81094 -374 -223613 50415
23507 -106422 33278 42798 -147906 -200861 -243534 -112165 -107325 -49897 16867 284987 -325535
23495 -67043 -113055 204055 -119580 237605 292117 443303 -35864 -133844 -89332 -47509 -46606
23484 -46606 -91712 147672 -187757 -5638 259579 -27774 34281 55539 -190081 -150503 -12204
23472 -11946 414985 211401 147301 191252 44658 328805 131428 -49843 -34166 70879 144707
23461 144707 -58967 -249506 199231 100878 34131 -118335 347518 25878 -79408 252186
23450 10797 -82120 -13781 109861 223599 97442 25832 -216409 -392482 -215710 142945
23439 -89680 -97345 -79250 52027 99008 -32494 -320869 144632 -68587 -143390 -277250 -215332
23428 -215332 -200431 -305582 78412 -9593 164204 -131427 -222413 176669 -139202 128155
23417 -282110 156593 -359067 -61880 -171787 197676 73926 -150232 208231 -81705 -124957
23407 -124957 -242498 199899 74526 57104 -170455 43707 258067 -221289 361598 258604
23397 258604 -7492 -158819 156414 106547 -1935 327280 161668 -3867 -92380 80158 -77906
23385 -88316 -167071 -456033 99287 115511 -30078 41827 -193652 -215447 112617 -319471 -378074
23374 -378074 -37371 -9955 17327 -91292 -119997 25343 54125 -127499 325 -68870 -32924 158859
23361 -341036 19634 -7387 314871 -15987 -82571 49185 194760 -130597 260031 -276314 28093
23349 212783 296649 75353 -76903 -109126 -191324 6190 -38811 -141216 62595 -115493 102724
23337 -286457 105149 -411633 136994 -29462 53011 10641 -227307 71669 -122953 -65421
23327 -65421 12185 19005 -370807 158833 -446432 -128604 -65322 -40284 -203344 -146648 -188216
23316 -188216 -226576 28116 292924 -222049 -232236 -261624 47557 -161826 -166591 3514 247703
23305 247703 -163091 -246427 -142035 173147 -66659 173913 11892 81303 -144837 74859
23294 -32439 -41107 170990 -178255 144163 76046 -407497 -109421 -60248 -8354 75669 -14137
23282 -33742 -160413 194579 -203123 -47099 -299418 63224 45562 -269213 137424 20841
23271 -200462 -142830 -70329 -284413 318623 193499 -60944 287360 -243955 -197652 -84027
23260 -229646 -145324 -291449 418386 37816 -148329 -122655 226452 -228403 -180034 -26261
23249 58691 44775 -326444 91454 -102268 -252671 -281156 -338474 155912 179308 -72886 186841
23237 -276943 398122 -151372 246 -162240 180669 -70766 7998 -197173 31891 99980 306171
23226 306171 112407 378843 -408 29935 101042 -8638 58642 195846 -87881 -187701 -77249
23214 -73510 -133689 -270955 169024 54805 -234133 -41235 -249168 -207258 -32826 -76016 -167552
23203 -167552 -185987 89662 -116081 -231610 -72484 133666 87163 175861 170425 -216943 -194342
23192 -194342 -99772 58124 -186575 -13834 -97786 -73303 185275 2730 -37662 227866 209820
23181 209820 290251 -223539 259680 310519 -74728 -337771 -97561 -87167 30186 -76962 -105116
23170 -105116 -241237 183869 -190952 65028 114906 66844 -70529 114203 -131424 -308308
23160 -308308 -126224 -43200 103163 40579 -45093 -215494 51329 108143 -236451 64077 -142355
23148 113903 24992 -105842 174071 63298 -198871 -166601 -48555 -153542 -33294 -6893 229039
23136 184382 -86210 283554 180768 -167186 100928 348720 220379 2746 167180 -216009
23125 294001 238468 -24482 108037 155060 162412 -68346 -25613 166638 -31480 13362 -96523
23113 -138507 157756 23095 -330082 18610 -22093 -218997 -27944 215380 678 169812 -244282
23101 -119486 -162147 -166659 -165951 292279 -297580 127889 46336 95322 106870 36000 -15658
23089 427909 89889 -462639 194687 29348 106751 -57567 482825 34853 -246523 -8639 -172236
23078 -172236 70785 -25801 -22940 -106383 -81038 -2573 51200 -26093 -23012 -22366 258095 -304634
23065 -74838 121623 137390 57046 49048 -165023 -183407 -14937 170186 53826 32120 97959
23054 97959 -313023 94275 -1070 258610 65236 -587 33735 -381 -207941 192137 178766 -4300
23041 51580 -238362 167226 -98700 123991 20342 -132822 239691 53176 -48384 -168596
23031 -168596 115026 202918 -196267 397247 -91508 -83771 72429 -117962 -140223 222259 29011
23019 142487 -182972 64106 -64292 -11667 417589 42294 290560 -32837 -142824 -118420 88868
23007 238365 -10721 74598 26920 -3856 -118918 5009 202773 51990 328602 -172150 360322
22995 56612 -31619 -14873 72652 103112 28973 -55632 12464 -87493 29871 74827 -25091 -47002
22983 -47002 -54825 31266 -244036 195497 38022 -64703 -173699 154730 -77794 -13889 -182591
22972 -182591 -235266 35080 -160284 -355541 -225633 5854 70975 17231 -292415 -362454 205014
22960 -140632 24313 -268113 -346825 14621 -59201 218308 -213852 -301773 106467 101304 -385993
22948 129967 -81292 -129529 39445 -208811 16394 -131568 65408 62326 103614 -99847 33334
22936 -80741 178058 -150069 11870 11593 272093 283060 -136512 -71036 -7458 10833 -309978
22924 -137899 -245513 178168 -180098 58561 174050 -253835 219679 -20315 53390 123044
22914 123044 3466 -8090 -325878 -78698 310587 -343175 -118376 105821 -256599 24670 -29217
22902 -163547 102035 204044 -131662 207787 82473 -137276 -44447 -330040 -207631 -334539
22892 -334539 -53210 82465 124725 -117039 -95919 144406 -144882 -28090 -153531 -100299 13940
22880 106620 263063 -46128 -76080 -167770 -222352 68759 140285 -337492 26395 -235056 -498922
22869 -498922 -81986 -79493 59551 107905 -9960 364116 -359501 150221 -262337 -128393 23203
22857 279428 -250754 -273150 111091 246230 61374 -90216 230166 63121 -27655 443835
22846 359977 -68105 7577 -201283 -113960 44322 -3062 51396 -2354 66358 -96175 7411 -132173
22833 44845 -357768 -217183 -226921 -335674 -15612 53126 56699 86628 130986 6369 250229
22822 250229 -13822 16076 298958 40537 39033 -124601 341081 -16803 -95533 -66575 -7675
22810 133398 -69703 36128 227844 -110951 -135996 74638 179554 -35400 103056 19116 -45840
22798 -76648 40195 -126083 255259 -50193 -103726 -79346 -227760 -86294 -338176 -129883 290599
22786 -419765 -190876 40801 -209684 -24048 -231500 -178059 253723 101811 199596 208765 -110174
22774 276992 -80397 61853 77253 -118734 -174092 -106539 93932 64720 -32313 -105179 -72685
22763 -72685 -318592 -339192 372276 326588 -114808 -161939 10576 -150373 -169182 -13265 152252
22751 -111513 -13129 77747 -282312 -170820 339376 -264086 -195918 -153317 20843 221070
22741 221070 -302120 -38886 157282 -209857 69275 78259 123657 -39416 -58264 60219 70022
22730 70022 -53808 -204437 -346024 -476074 -67047 -94689 54988 -189155 143704 -106013
22719 144786 -221704 -143221 48024 -305768 -151171 -163601 -162043 -330638 -99941 -159669 -62313
22707 21134 46234 -28906 80597 135472 -106071 90167 106108 101982 95056 167519 -24103 -226063
22695 -226063 53518 -112543 151750 -26302 -340670 81595 -298544 -105500 265698 105389
22684 -8713 -125706 -8681 143717 219813 -393776 -9841 61991 -249813 169933 294287 -219930
22672 -119316 1701 -281682 -224959 27569 36246 -86047 159634 -254097 182497 -81090 -91853
22661 -91853 -113455 -72784 -64691 -63483 -324919 -150813 -146629 119417 -135769 -276830 110926
22649 74628 273770 -188388 17827 -74458 -101668 -91044 204863 243185 -158116 -151185 -13686
22637 -303916 -49175 -74086 -4186 -96952 216362 155071 305948 -57698 42560 11695 -67843
22625 9373 -145002 -124102 -376590 -92417 125067 -242811 9264 -207776 125374 -181873 30840
22613 -171860 31617 77522 -584102 186591 13489 89046 159904 56241 -197955 -143840 -130301
22602 -130301 -160285 90987 -176863 -156924 -23887 -23174 -97591 122760 -160711 150094 -180597
22590 11068 -489220 -116371 -131109 53503 -289110 275611 71015 220342 -370687 359986
22579 -181788 163985 79753 9616 76638 33514 -71286 -42869 254883 -116292 -309050 45124
22567 -74886 -193766 -132618 4975 25854 383314 -355308 -86455 -252664 317173 -310417 120351
22555 206137 -147118 -70443 62118 397998 29245 -53609 -47344 -3231 90645 34930 -102847
22543 -165599 -28260 62897 -86899 253367 45742 -183242 -47877 -68163 -16567 -270803 155415
22531 99213 -38527 -146673 -411252 -301686 284053 -28223 -110331 -169023 135466 199553 122857
22520 122857 -103323 216999 -90829 55055 65974 188345 -93365 -156097 91450 -173291 -203355
22509 -203355 -130507 86284 -84746 -171747 -32811 167850 -180138 31857 -186944 15033 230488
22498 230488 -70012 62622 7946 -138714 170138 95777 11284 224791 85876 -222185 126351
22486 -38198 -58778 -22948 23846 -23316 -109974 -172374 220566 -21938 -284539 -201040 331800
22474 -329869 -505984 79398 -48139 -252305 -39202 295681 32009 -9745 41403 -292586 199686
22462 169138 90354 108068 101781 -67164 -67052 -1329 -435161 -56098 -17892 18250 156875 23992
22449 -52803 -347439 -382752 -136296 89077 -316685 77651 261547 139197 -16046 -176969
22439 -176969 263156 -165561 -174975 -51200 -38181 105973 86862 125414 76896 -224054 -122854
22428 -122854 -29800 93124 123586 -178043 -46764 -73567 -265714 45505 -51805 259291 243193
22417 243193 -13169 67918 -51497 -174318 -97844 -24349 -48309 205237 101478 277175 -155901
22405 88841 -64956 -181594 -82474 -161816 -175017 -73722 -89288 -60121 177414 -44465 -48297
22394 -48297 9990 20655 78665 239958 -460489 -49458 -171665 -21872 -257983 -16965 -147104
22383 -147104 -97128 -367499 219034 -224768 62830 -332837 -199429 -87618 51054 143140
22373 143140 -254274 -89318 -322571 -137118 162778 46084 470 15779 62955 62245 -468446
22361 -40372 87155 -196483 -193349 -491072 -187177 -97320 30455 154387 -396406 -126483 -105163
22350 -105163 -455398 178184 -116295 -303995 252702 126774 13129 -108215 -243426 -5290
22339 34420 -10577 -90116 -187117 33843 -50795 67275 -165404 302033 -79300 -251122 147418
22327 -236739 26145 -24171 -236922 -73686 -70146 146261 -343777 992 -200027 -498250 -333195
22316 -333195 -279256 102234 -43065 -223062 297189 167887 -2099 164363 99694 20063 -173557
22304 392 49314 -225254 -22904 5058 -119728 151450 -179837 -67010 -65399 -104119 -24321 120407
22291 -207682 35011 82939 -32001 108081 -303798 32104 169356 196734 36178 12044 61665
22280 61665 65531 8278 170603 -214501 60772 -176196 207485 98140 111829 -24123 6873
22268 49712 26462 34640 -374284 253653 -85516 311468 110404 -143744 155024 -249405
22257 -297366 -166643 97312 121017 -102398 -17470 224806 -19898 -275318 -49608 -151594
22247 -151594 156218 -110887 -423535 -116177 -332580 70223 18083 -321597 -60286 -194274
22237 -194274 -168559 54737 -63907 48308 68305 105989 99198 -337219 84189 -402891 -10093
22225 -222825 -108736 -57336 186467 -9083 6974 222899 237394 -165241 -13775 74459 -256344
22213 -219515 -349670 -57277 -380268 -297560 -152841 -115525 94553 42333 -119948 -33144 -61714
22202 -61714 -112073 -298327 -20525 -412248 -99646 -464733 14620 99083 232349 276092 -65774
22190 208155 -66690 206557 208601 -262920 315300 -37549 -184304 -133844 1808 372689 -183373
22178 147719 -245174 -364281 17237 -114310 -306412 -114817 -99403 168525 185760 96613
22168 96613 152823 -13025 -141378 -98296 -116207 92239 67076 -294259 -138956 25820 -31348
22156 1995 506471 98650 -19371 46658 289380 -94006 80224 -120500 129914 273952 -142317
22144 -120022 -449727 -60456 -8758 157179 -198408 -92337 121835 -123432 -118655 61403 282658
22133 282658 -148068 -76956 60879 -238233 -204504 -47620 50888 59119 367152 -67397 -187139
22122 -187139 135622 89779 160589 -141558 -175182 24777 -249948 -101366 -404433 -243841
22112 -243841 75957 -292 203073 9520 -50488 39566 -90957 -131722 -317915 -26913 25965 -240338
22099 -54571 -211262 -156055 65348 -29837 -324442 -234769 237752 -8657 -35876 -168413 173342
22087 167259 202114 -46014 125345 -135403 23666 -3753 -188593 84627 -297736 -293247 27819
22075 9321 -65683 153819 -135999 12000 46307 -121955 -115112 22314 -124815 -90450 119039
22063 90890 -317441 28509 35952 -94187 -110022 284469 -264637 108456 -68161 8832 -228367
22051 -197006 73310 432459 377882 -198074 -17517 -157308 -448076 -364102 10105 -25417 -112747
22040 -112747 -309281 -226314 -223822 85220 196819 25548 -310182 42596 -13307 -156677 43539
22028 -42268 -178181 -14316 253263 4322 167948 -163895 -6067 273781 91592 -77865 86511
22016 -304505 -50228 -84275 -224299 131571 25499 111534 -388926 -149296 -107250 -305263
22006 -305263 251602 -221692 130952 50123 95301 -12347 -295044 -166050 48006 182626
21996 182626 -152856 274161 -316144 80270 -207252 -22558 78196 100959 -276366 137551
21985 -504838 -273404 -16979 252739 170331 98203 -153909 -94313 249776 -451864 29187
21974 -95418 -69208 139773 -3992 -2257 -150835 -355394 -334568 -136989 -44684 -148336 120456
21962 -164183 -195359 -277716 -298781 -144277 -176945 -124069 -84265 21432 -141268 76744 -134569
21950 76428 -176336 373606 149699 73800 166612 7969 90948 -266346 60608 -224165 3215
21938 -58506 -11070 -135993 -265953 34046 -43222 -113456 -246185 -288426 -124530 -189031 -276880
21927 -276880 260169 -294722 90257 -237636 156541 -46063 39174 304050 -241706 66301
21916 -281684 -57527 182188 147944 69865 -160683 61631 227636 163879 -34606 62901 68134
21905 68134 152626 29757 -261018 -52301 400832 -207312 101611 60085 201728 -239084
21894 -269472 18185 -75518 160178 -210716 -13871 -276417 136960 96954 88105 -21301 7973
21882 92435 -121522 -208284 22981 -240721 -13309 105176 -5545 265336 29597 270375 -41816
21870 212814 -65792 -106812 169946 -348607 -421811 -218581 -149778 59604 -397793 82004 -44911
21858 120872 161629 -21651 -80652 -287843 104035 217582 89100 124672 -93229 -26999 1612
21846 -165075 -66698 -204432 -301949 166317 -18366 83321 -101379 99822 -37365 120740 -195284
21834 342753 -85103 -531 272519 -132242 -272931 58022 295574 -166359 58567 -292212 -11043
21822 -175359 124159 167847 51600 -156697 44746 -175798 -51655 76395 17114 -167381 59384
21810 -31105 150975 -52180 -250478 -273704 -181053 -21765 77638 189602 -335284 297099 90304
21798 59042 -107309 -101183 -129005 -180910 -155180 106472 253329 -285182 -161671 117669 200729
21787 200729 -127442 -30650 -59365 208561 92558 -132350 -5710 168517 64541 380314 94092
21775 -219763 143651 199499 -71821 64374 176772 30312 -297949 145626 67374 136339 151941
21764 151941 -235035 -33129 -190043 163584 38885 -49417 286203 58144 50866 289516 354328
21753 354328 109046 28195 -391748 -30878 39875 42221 119914 237613 210412 71380 50971
21742 50971 69936 20216 -67413 -146994 -202599 -54558 -221254 -151408 -230744 -129845 -175325
21731 -175325 -6626 396824 193734 4484 -196546 8660 -146203 174444 -231995 -23812 -234815
21720 -234815 -104468 -31682 -105197 -72964 -303310 -220716 -91439 -13530 -244466 177393 11053
21708 178874 -401828 -3734 302768 -129285 -91040 -39011 -70800 -193254 -372600 -224203
21698 -224203 12242 -109230 -337719 421464 -335507 -289195 -313362 -182878 -65024 182220
21687 35015 87957 362064 -186368 114608 61117 201203 -76612 62859 -364 -398469 -221062
21676 -221062 -196092 -217725 65869 56806 -167090 -203600 -49964 -116755 -228249 -94248 -269775
21665 -269775 -218148 13412 -316226 -30310 -107648 110263 13109 -321609 146305 -21172 -187998
21654 -187998 -78111 -16298 142417 29044 81718 103568 -430208 107268 -63251 -119871 -31390
21642 -117012 -150291 -76748 114962 -221879 -156746 93277 -151910 -198329 -197231 -451426 -132427
21630 37178 -25743 -360657 -31401 -69081 -9487 -127501 -128596 -221460 -24994 88071 -139206
21618 15821 -154004 3103 72800 359876 -143012 -29228 -202093 -144119 -121364 75022 115829
21607 115829 3089 135 124879 172221 65774 14498 -317323 -373025 -215862 107921 -56412
21595 69805 186175 -232581 26398 30667 71431 154118 -243591 -151207 23476 -63548 -295280
21584 -295280 -29940 -281304 30908 36858 -6776 51361 -88694 -43718 -279902 107235 218342
21573 218342 -237931 -164618 67005 33407 -91521 -74351 25205 -222245 -7846 205667 116949
21562 116949 -294960 148049 253161 -68445 -253386 70679 -236268 -340334 122940 34505
21551 24706 106759 -221110 308016 -149594 180686 -40057 -89337 -112437 -64924 -59211 83951
21539 -64166 95670 -23755 -264596 -231585 -113867 -16309 96370 216847 312973 26102 80804
21528 80804 257292 103972 -236684 -55675 -120032 345406 95883 -37908 -282622 148657
21517 -23538 110542 71966 -66728 -55597 52707 -288147 -183340 -22938 -91446 -114327 49191
21505 -157950 400551 -423567 142283 -170706 -1311 -136735 -31354 -109172 283493 177789
21495 177789 -112183 35245 -56747 -144513 -120120 -286499 -51150 35178 -393940 16468 -131057
21483 24785 -39597 884 80120 -166489 -50324 245083 -387439 -80796 45485 375641 -185035
21471 26278 -4612 135209 -453149 -10785 -101568 -178540 -73557 -262835 -282785 149966 -109127
21459 146361 -243307 -238083 -313714 141213 -18869 -93106 -8296 -169636 169576 269802 98941
21447 -20231 -262317 96086 432570 148881 -5189 -107840 78350 137614 -57770 -127314 299458
21435 137771 168058 125617 381802 312502 246452 326747 8980 51398 135730 52860 -88237
21423 -376546 -139018 -116988 -187438 -75437 103679 -350841 -217922 -33764 106142 -271465
21412 -146166 34152 -13636 -118527 -180309 -173940 -261484 -200988 -231392 -174487 -262697 -6348 111534
21399 146745 -108054 -29929 114973 -270844 -141774 -96840 -63226 -75982 96653 -319592
21388 -161591 86872 113096 -47426 -324 -262546 117244 -25434 -159404 -128450 -140564 -36613
21376 -449282 277606 1791 -324979 -39820 34574 -70979 -19923 -117305 312128 32792 80321
21365 80321 -138579 -51664 326263 305625 -28858 -434212 -33621 57981 22229 105255 207199
21354 207199 -147745 -146185 -240638 -144494 -128976 -185343 170880 41531 -101566 -103342 7859
21342 -124524 214017 253599 205912 -142984 119108 -392533 -485460 -212298 -210333 -273569 -409900
21331 -409900 1430 -295860 34426 241783 -140978 17078 -163973 56050 -86840 -109515 121673
21319 243674 257515 75521 -50576 -207875 -263529 -460387 -168751 116992 -256338 -50780
21308 -211011 -70088 -16329 -115129 -154858 -345339 -37176 6405 119054 223404 163766 107422
21297 107422 -222426 -133969 -276559 -228266 -30690 15245 -159613 -104606 -217294 57826 35202
21286 35202 113274 175388 -181478 -283928 -134430 -111906 -230042 223309 -200078 14910
21275 -22836 -100663 80517 -206062 -36765 -63538 -168530 1797 -45354 -24125 13496 282852
21264 282852 75919 72503 -278191 -53220 69502 -82390 -186811 234707 246383 -256751 -155659
21253 -155659 -451457 14380 -102288 89359 -279395 -28336 -252494 -30642 -134993 -140342 -106163
21242 -106163 56440 241015 305339 49357 248710 70964 366372 -171754 -102570 277831
21231 225264 -38621 -366265 -30195 320993 64819 -176727 -16680 -326675 -143174 49267
21220 -174418 157455 -148852 -59550 -133449 -24334 -101537 -103173 148456 -208756 46626 -149111
21208 158246 -333870 192143 21602 16916 -309786 44368 -63171 21968 166357 -147031 186719
21196 40537 -208409 -110119 399019 122399 55831 114399 -261221 -86785 -55326 220640 -166597
21184 62865 6065 63911 -48541 21213 107525 -8856 -565244 -272163 -23494 -20767 -36444 11088
21171 -293235 -349797 106137 -388760 -19752 -83318 34154 144101 -256586 -167564 -96207 -468251
21160 -468251 107982 -184885 -339996 -536135 -13260 -90055 -17806 151354 120765 34604
21149 -25789 112845 145681 107925 -106036 -174202 -135734 -14911 -21229 -337364 -125836 -56294
21137 123029 206032 28332 -54641 6706 -159136 -120928 -189192 29672 -310435 -56144 -77819
21126 -77819 -24784 66273 -34905 21705 -19294 -271781 39822 10977 -297733 -175889 60520
21114 -83979 -60960 -91530 31635 -291706 8447 -42524 -96342 -26297 255497 84847 -215822
21102 -163988 -290048 130653 -87471 -9156 85978 -60194 262070 189854 -113969 -182947 59574
21090 183536 78603 -95843 589405 230083 -54317 -62544 -332537 -207616 -431884 30878 -379301
21078 -103422 -236033 -57287 -53953 243562 94342 235591 -333014 144505 245272 292271
21068 292271 -140540 16946 2139 13480 -151436 -117365 106756 -30239 35979 32477 -114197
21056 -274747 -51790 -119274 -75884 89317 -238076 53690 -173657 -447962 45188 -234620 -113058
21044 -194762 251717 37165 43173 -105397 215162 -3001 5950 -14794 -223859 -55878 53106
21032 64625 -215465 234968 269584 200228 39407 -157834 -126092 -109186 -47065 -74805 -11453
21020 119269 -41853 -477 -465255 227786 -272382 -13418 -63633 288500 -43089 87961 103235
21009 103235 -98852 39134 59393 361018 294752 313865 522246 326510 22656 -399773 -390576
20998 -390576 -113634 -248813 -343803 66 112106 -417084 275148 -20914 -43681 -92942 79764
20986 -317884 -274529 -10500 85415 -123846 -256062 18585 -193219 -153186 237715 52459 51251
20975 51251 237774 148097 -42844 84258 24141 -153512 -109973 -179557 173229 -184103 -306056
20964 -306056 -44350 80444 162864 -273492 145177 99279 78154 35620 -125092 -274403 -31227
20952 142896 -78517 -165759 74889 -62176 154563 -211048 -180396 -41154 216939 440236 446035
20941 446035 599255 165276 614556 257692 152841 170304 3700 -185377 135338 -171029
20930 93165 -78491 -123691 -284689 -75373 -345890 -60823 89319 -512023 -400678 -130952 -8876
20918 -30199 -109469 529561 -335961 -151457 124312 -10932 -292361 -293261 -107087 -63213 -57651
20907 -57651 101274 -359014 -100889 49507 186969 -61227 -42053 182659 34763 84438 143198
20896 143198 8583 -64452 -359313 -111060 111702 -58395 -20184 62535 -49164 -290552 -560609
20885 -560609 -13654 -215497 214289 -282704 -197258 -200908 -1220 -90582 234142 -233700 363896
20873 -309006 -134210 -86865 -335597 68104 -114778 58691 86021 -329023 -108697 -226811
20863 -226811 23749 -244424 -144161 -62865 7938 -53966 -60051 -157357 70597 -99416 -28361
20851 1582 169323 -226309 -419154 185256 10057 60430 -52736 -154983 -185000 103774 61981
20840 61981 39263 -79426 -284559 50023 305251 28092 124760 -60466 19984 -223431 153783
20828 -218183 -28874 25416 -54933 98969 -351629 -285385 366414 -49643 -80958 -11716 -53461
20817 -53461 74234 -96857 32188 -91959 15828 -114820 -102907 140508 141359 -341508 -345763 -164109
20804 -250362 -297181 -308015 132026 -69012 144162 169008 -30719 -99198 38424 132752 74545
20793 74545 -254 -60001 -161474 -152999 -314443 -121113 36863 -68133 -331749 426816 178494
20781 477430 -87990 29390 -226134 -256195 -94120 117671 -225027 -88123 -202546 8659 -160718
20769 -111583 -290433 160812 20640 6460 -27825 42033 225612 17358 -226521 -155594 43282
20757 -66101 -93717 26005 -239831 -21701 25625 -62241 -291768 -200808 -185370 -180835 -175769 -62318
20744 64215 -129680 -43094 -165805 -55165 150188 -98861 -371163 -273041 -114388 142746
20733 -39752 -328322 -110073 183187 -193033 -462726 -77906 167969 -416544 72420 -82864
20722 -102954 -140790 -213184 -58517 -91645 119152 -33178 -39040 -49743 -109509 -89064 -92621 -88600
20710 -88600 -142993 -88079 -20586 -372656 -29118 -63659 213757 68814 -189519 17070 -239338
20698 -135683 -350785 -193142 49865 -197222 96780 186211 -29713 -82607 -18900 116969 -92294
20686 230310 -72275 238655 -230571 -201883 -27282 -289416 -121868 -93208 -23167 -225154
20676 -225154 250327 -194831 3857 -148434 -184466 -224731 -62116 -33916 290993 -168678 -49949
20664 -311396 -246866 18192 267960 48144 -125765 765 -149450 -192186 18486 -194045 97230
20652 13826 30283 172800 -51281 -85207 -205407 -195940 218336 -14295 -61520 -72674 -70272
20641 -70272 -217115 -101586 99892 -113966 247457 -43381 -112141 -6946 22033 56217 223173
20630 223173 181038 -96460 -115587 128854 -173199 -128877 -324176 84233 -183527 369977
20619 -536773 48324 -211155 -40943 -134446 -102528 109883 268427 -131551 -48827 -84391 90649
20607 -116919 -183529 -124114 4998 -266880 -160008 -147384 121387 -22220 -234435 175636 -21815
20595 -304160 -157819 20617 -202755 -87275 130492 -70252 -57214 -97745 -289676 -115002
20584 -39084 109807 389580 77891 -50917 67608 123241 27246 -189665 -118629 -256183 -181050
20573 -181050 -19780 -65562 -249412 -29126 -197823 30740 -268522 28335 -117025 -183127 -120376
20562 -120376 -126177 -440127 -16645 143809 49455 -355119 -399254 277137 -120342 131667
20551 -154561 -81313 224567 65284 -182197 -157315 66387 -77242 -122603 -153229 -198221 -101230
20540 -101230 -137436 -245403 40575 -138755 -41741 -396502 340547 -8240 -416270 140222
20529 -15498 111331 -496494 -200915 868 -253598 16113 127968 99473 -46891 -239546 -85527
20517 -101625 169271 -53691 -49223 -169206 195221 60154 88875 -149686 -292959 -27775 -12580
20505 -262741 153471 130633 -289926 -476983 4468 67098 -224695 -248637 -160102 -196815 -164398
20494 -164398 101248 61200 -241192 143 -333 -169558 184494 -169540 -391499 -347508 -123322
20482 -179796 -322942 117157 -38018 173716 -347438 -158109 -130711 -80651 192620 -128073
20471 236583 143356 -112712 -238065 110719 -239346 25700 27426 90093 -484601 95280 133935
20460 133935 -69592 54719 -135587 280177 -44983 250305 -212391 -247494 -313944 88397 388978
20449 388978 -32451 -111077 -54401 206143 -62650 -287008 -65826 -34801 -154714 -160622 -71044
20437 25587 82159 -110222 -266657 -205211 -145696 -182524 -75324 -165348 -83406 161183 338179
20426 338179 -575653 -2165 -48588 117616 271120 -201183 -1406 57527 -54271 -7728 -321308
20415 -321308 -260292 54446 -220123 -37201 -269241 -44577 255395 163771 346493 284223 -7697
20403 -168258 138225 -192564 29210 49650 -190884 -40077 -53674 -340131 98063 49141 -113764
20391 107135 -69575 -47002 21169 -412908 -327537 -233282 -112353 468318 19823 -251707 86038
20379 406997 60757 -130380 277616 45566 -294133 25497 239738 -142944 16580 -209877
20368 -198539 186689 259991 -81378 -217634 288791 -143510 -571736 -90894 1204 -31282 -28725
20357 -28725 -97784 19477 -235086 174198 170720 159616 111372 117832 175337 -132865 -13843
20345 -219784 -76656 90350 -253583 -74179 15253 -237762 -79155 -153720 -192295 -252355 -67637
20333 -522238 -43895 349880 96526 -62121 -23942 -352635 -174498 55748 68624 -180210 19621
20321 -84664 -68533 154417 -212883 -113960 -413437 -168748 -263035 70417 -216183 -290132 5718
20309 -227741 -194586 481790 -140681 -55409 185581 25066 -291068 -167846 386 142657 -359835
20297 113293 329109 144319 -266467 -116445 -96444 34517 9727 225573 121797 142443
20287 142443 -291124 -174699 -93363 85844 -338472 4547 175160 -247802 285539 -44727
20276 55301 22947 94583 -9196 -27870 -250466 -522447 -14834 -430587 -114457 -253824 -496394
20265 -496394 -313413 129209 -15878 -74382 -39890 -288291 80887 -384432 -231154 197485
20254 -202581 -54600 -149109 -438866 -223999 111636 -120609 209201 -297503 -150753 -157660
20244 -157660 -208431 41021 -20250 336328 110199 178999 253279 -183710 109669 114254 -291910
20232 -230893 -256944 34612 161422 -18651 -49787 158448 -101907 -105002 44695 7059 -9171
20220 -129799 -54735 -206721 205755 122557 -193857 128777 -386726 111780 -17501 168488
20209 -47160 123689 -210332 -185201 76135 -169009 -40218 -178831 145460 -397799 -217072
20199 -217072 -128448 16666 59705 40227 30557 -146505 55136 208779 -114707 -355219 6947
20187 -89114 -95520 248991 406611 -65737 -72325 193282 133543 -132312 -98241 199881 -76009
20175 15607 -55838 109119 -130874 -15806 135194 197507 -82047 -65174 135908 286261 -64101
20163 242906 103682 -124853 185935 -85260 130340 201510 326849 66825 178291 -84313
20152 -161763 -25874 -38599 -109940 802 190700 -38160 218276 671498 361686 248948 1911
20140 596931 326094 448663 347092 347128 346853 122803 72748 -8263 -171845 -189995 -58300 221253
20127 187391 -38714 -148287 -221666 -375008 -327201 -153231 27037 -60154 -181610 -320 180806
20115 92647 -203020 -308656 -340840 11957 -71918 -125344 57449 67086 -168140 48426 -322807
20103 -24213 -136364 -138418 -98363 -58228 -263672 347006 39582 106416 187451 -234853 -236298
20092 -236298 -49811 -257747 25725 -108085 -265504 -11631 76232 -427005 210637 74038
20081 -94518 14907 -139467 169707 38193 159895 349828 49229 -97808 -47098 -45525 231209
20069 -68113 187568 -336146 -133764 7202 -50444 -105828 -64997 -45671 174289 -93553 -80951
20058 -80951 92955 105089 -358013 81654 -40098 -23882 101679 -48892 3404 -86150 -238181
20047 -238181 159924 16995 -33656 -232991 10534 -61799 90042 -34254 -284448 20721 -93573
20035 126188 -68700 -454288 -7136 -258861 -5477 -4740 -8154 8796 -201035 -76515 -4837 -351631
20023 -351631 -203433 -364921 -13368 -45144 117477 -416930 -56930 243881 -148861 -148088 121449
20011 -14500 -66977 73436 -385938 -81489 128947 -231545 125132 -86781 -167001 -298569 -291632
20000 -291632 119225 -192052 -230670 180232 -91456 293421 -68540 116886 -27 257639 89489
19988 537535 519896 286802 388741 71379 199168 179857 234219 -99716 -18881 136117 186900
19977 186900 86221 -76180 86754 -5503 -118267 -32143 306786 -62156 -22730 -5863 118740
19965 23048 260077 111601 88405 342297 54222 337316 392600 -71885 390706 240512
19955 240512 169184 123221 -25972 137955 306246 19184 -82964 275396 101910 -356973
19944 -78207 -333111 -395883 7985 -9656 318082 -262661 239683 -4603 -249541 56495 -107521
19932 11374 -180231 -26675 -200479 -349341 -221960 -57856 27311 -50163 230265 -254407
19921 -97553 243825 -138522 -187684 -37791 230906 157686 231389 -111289 362714 206963
19911 206963 35870 -105580 -143285 -361128 52824 -189524 -61331 249548 -247254 -260836
19901 -260836 9771 -93048 -344470 -104263 -84093 -65023 50021 25504 -87321 325934 -40374
19889 17012 -255184 17122 478462 51279 -341011 -146200 -431464 -289377 -387910 -80354
19878 244421 -271689 334361 -289713 -190781 -273422 153728 277305 -318689 -205865 53962
19867 92991 -197392 20009 -413242 -366790 -14278 44328 -163535 -50733 -114111 260632 119579
19855 -48295 -72756 -383127 -104861 47008 -148560 -240879 -243187 -250875 -62646 -32708 -219639
19844 -219639 -230479 -90366 -78516 -218430 -426601 -395412 30325 -294630 -134250 -28380 74852
19832 -189267 -126714 143365 45125 217598 -297548 -119886 -391477 -65105 -169096 -108585
19822 -108585 -105153 -24566 243753 69498 -180306 -64249 -261749 116498 34486 -276531 -130541
19810 -14149 20141 -292705 164721 -205327 278215 120004 -105566 46185 -80573 -271870
19800 -271870 8470 -302083 286949 133892 227384 -102929 -66183 424854 -167468 240705
19789 42524 -60470 -88886 71453 -123149 -65949 259319 -203337 -187931 314242 -159138 88891
19777 -95832 -286504 -167458 -163094 231184 -105174 -203453 -252614 -178372 -229333 42085 -333701
19765 108817 -57675 162852 348186 91759 78156 10375 76057 19143 -318335 -602 200997
19753 133543 143512 -101956 59535 -169637 95916 153333 136418 23909 -252404 -165968 -196252
19742 -196252 -3164 -305398 -46312 53328 361757 -102869 69976 120033 187563 327787 -96001
19730 289975 210834 303369 435552 342891 214195 -68585 -62947 264316 173300 -39594 -163371
19719 -163371 -286717 -247091 -284708 -214070 -261107 -72266 10292 429381 107477 -156559 -414272
19708 -414272 -130891 -87212 100222 88063 344204 165631 4812 161219 -74312 76065 13907
19696 -80307 518434 607382 508613 -22418 -34619 -193019 -110189 275344 -113212 89700 -148136
19684 -146970 157801 -275799 -440432 19330 -13705 81639 -75009 -109210 -137816 16080 317360
19673 317360 88736 -220463 -551915 -42262 -72284 -317887 -174776 -76048 -163629 24794 140325
19662 140325 -439168 61202 -39869 -133840 -154072 -95024 -245514 4492 -224371 -149147 -150716
19651 -150716 -217444 -220233 -101508 220722 18524 98475 296721 -283948 -282194 190082 -352322
19639 -141999 -372326 -175048 -72452 -200336 -158649 -28774 -562394 -20380 84897 158052 73649
19627 -251552 45239 -167581 -134147 97789 -179749 -299589 181995 85568 -33536 -247041
19617 -247041 29987 -159077 -88821 -73584 -34418 -40623 70250 -116362 -138958 -208156 -115820
19606 -115820 63111 -109824 -95554 6767 -253203 -338155 -499655 -171122 -131066 -75641 46252
19594 65471 126001 89900 101762 -117804 -157344 -16254 86004 -209882 74481 -694116 -74419
19582 140927 206 152365 -244810 -23934 -72552 76153 -32983 -164468 -138832 -181754 277265
19570 -148750 16002 -55236 -84882 107005 -1418 -220685 -286911 -379401 69221 75643 -30686
19558 -21046 84247 -51164 112573 -329573 -158489 -377981 35492 -271301 157243 -351090
19547 -235121 44125 -254639 -209856 -210402 -53592 -77392 -135289 -401099 15805 76433 -108156
19535 -85474 177355 -62242 -212132 -240028 98176 9129 -144186 -225657 -160490 -227844 -90437
19523 -110553 -196827 70836 -370962 31265 66793 190490 -121511 36521 181501 154778 45001
19511 38146 92342 -269855 6914 -159452 -14716 -224640 -94874 -80080 288232 -138240 -44015
19499 22453 -175796 58524 -94155 740 -67341 56756 275691 -264746 -183650 -213303 14138
19487 -49247 114679 17816 -273012 -27655 -21827 -18185 -864 -162969 -35437 -150175 -63269 144708
19474 -9829 65178 170325 57096 134424 278050 -98190 20692 -156845 -78466 -147277 -169014
19463 -169014 124186 -141498 -71482 -243985 -285756 361760 -204532 -108422 -121297 -234246
19453 -234246 69471 14604 -65455 -8113 26691 -273897 1216 -257642 -68126 145039 -299261
19441 -368835 -454757 -57067 -153707 -232911 15296 -184996 -333678 136671 61678 -223320 -199332
19430 -199332 282796 -61937 -161685 -69969 -207648 190504 -62325 -113195 -238611 30189 259737
19419 259737 -41014 10040 -133753 -295302 287985 -341051 127940 -197719 -162453 116361
19408 -738 32208 -191314 -232115 -158073 70230 -243063 34729 -133328 58471 46069 -103831
19396 97533 40127 52319 68442 -63180 -108840 -196845 -238882 85804 -6002 -139587 247443
19384 -3861 142 -138375 110476 23486 -264205 -68997 16592 -284873 -31432 -95537 124804
19372 35268 108442 -216896 -28605 140763 -146217 142151 -97721 -281547 -257192 -78815 -75753
19361 -75753 -33806 83881 -396175 -85565 -138961 144167 -87872 -98956 -174279 83971 -175336
19349 348258 -329020 80232 -105891 -277665 -152772 -184335 -40611 58968 -61413 -108029 -102482
19338 -102482 -210230 -99898 313930 -85524 -236719 -118607 -325685 225434 -8306 2112 -92391
19326 -66060 -127570 17001 275181 102942 117985 -164654 -348174 -110826 47106 138482 -8819
19314 -160361 -148824 -299526 4433 14859 -44123 18788 -131791 129021 -94361 -53605 -145442
19303 -145442 -171901 123523 -215393 193659 -223678 -330911 -220661 86915 -36797 -127015
19293 -127015 -51623 -288339 -3378 -36583 95469 -93543 -77673 55514 -156732 -171957 176066
19281 -152110 -274102 -107262 -243359 -249014 -177619 -205338 -195524 168059 -91852 -157349 142420
19269 -198862 -43593 -444178 63972 -86404 110168 -2502 361062 26127 -290519 -257634 55660
19257 149408 -73429 203336 61172 -156243 30747 -182970 99675 -234856 251838 -289788
19246 -69665 -303437 -36892 125237 -71473 -93741 152655 -270349 -224665 -79316 62577 -64143
19234 -211480 -107197 -264902 -309642 -68680 -99963 251259 -120881 85691 -203148 -55882
19223 -81271 -159595 103822 137886 -153734 -127033 165712 9088 -106023 68155 -407276 23488
19211 -57170 -294893 164350 -72262 -43256 -187496 -52184 -313802 46293 -37788 -65418 110827
19199 7108 117285 -393388 -78890 -23735 173842 101910 59936 -422413 -176661 -148800 -154964
19188 -154964 -503145 -46776 73250 33680 125101 102902 -244253 71766 87175 -97355 -182908
19177 -182908 -218158 -110970 243818 -37084 175088 -11864 -216069 60018 -13932 -158634
19167 -158634 72946 -166691 -287198 -223762 -85153 -67624 2925 -119857 281091 -78350 -122306
19156 -122306 153320 246077 -38427 466359 -109558 -104759 -86148 -19030 142246 429694 42122
19144 -57062 155097 -104944 -93694 -251562 6136 -228858 -243354 -67027 -6355 -23453 154796
19132 249857 -115488 -100608 -134313 109274 25798 -97920 -62453 37195 -491586 211915 355933
19121 355933 75809 -201345 -198303 -21483 -168119 321660 82586 -53363 -202465 449035 -273248
19109 119684 -439069 -277302 182322 -189739 -181140 265095 -38235 89912 -206313 92448
19098 -224901 -19319 -64900 146642 96946 -258044 -85574 60710 57405 29961 -137221 -126403
19087 -126403 92869 -282467 -137874 86625 73225 10784 -46944 -29251 -20039 -93883 -281676
19076 -281676 -205423 -196000 203362 160791 -115164 -86248 10091 1892 -32269 -31611 -90404 -36679
19063 89422 12364 -38632 94445 18273 102763 -40821 -54387 -113637 -76084 -96646 -112351 -34338
19050 -107863 -97394 -46752 165329 -258582 -182069 11003 -172684 5964 -349508 -21542 -113790
19039 -113790 657 -37943 29877 -415072 9883 -335398 102661 -38767 130376 -243015 4785
19027 -90627 -366734 -124168 -115241 330506 263251 13507 -41483 -6517 141593 415758 -119355
19015 -75702 95249 -148028 -114464 -20628 156877 -147420 84230 -102532 -472077 38803 -55938
19003 36978 -95245 93583 19547 56128 -226244 90225 -400684 -286838 81362 52889 -363871
18991 -40523 21028 -342944 -243170 -288286 -162935 -296551 -166459 61742 70617 89787 -506755
18979 134947 -39842 -248549 -121907 -24223 31294 128628 -140769 258274 -118995 358751
18968 1019268 218552 176205 -119255 -297958 214966 301506 -80063 -63856 -45280 173098
18957 -115435 -195166 -239277 -12732 119222 -253225 -113401 -12546 27289 -25756 109585 -316707
18945 63994 -227746 51337 50185 -20400 -54406 -230912 -411838 25684 71833 71957 163205 -21279
18932 -172852 -361823 61424 141043 -220113 -127230 70535 -50916 -88860 -30064 -146375 -26803
18920 65479 -11470 31859 -12026 -390273 47981 386074 -282081 134827 -92230 -162838 206246
18908 -191254 306239 -68018 720072 464495 130044 156181 -39420 20631 360094 -238916
18897 207883 -181114 -43110 65331 -450109 -266 -96827 86746 33291 63758 252797 -219531
18885 -51912 -122058 -325515 -82535 334023 54947 -307833 140401 34965 242255 -49260 5737
18873 -100927 -63346 60678 -32915 -208027 -30569 -78859 -218770 -223594 26215 12239 -5557
18861 118510 -14045 -100613 -237584 -133757 -132530 23041 159565 -73095 -115288 -388650 303635
18849 153382 -401791 153287 -304846 17985 -149691 109282 -201949 -235736 -124635 -221490
18839 -221490 9690 125368 -54233 123971 43381 -47057 162342 -309634 -117247 -47013 118141
18827 -306403 21677 172275 192060 100877 101701 -166343 424395 18212 -88582 -114679 42908
18815 -2789 -81160 350703 188925 117596 210630 -98659 -49513 24196 -85039 73613 -39092
18803 -36665 193953 -257621 -280159 -58420 -271094 -40042 327487 -85292 -167112 -417800 103585
18791 39606 -38727 -14136 124883 -118868 -125985 -37654 251039 61440 233880 -84140 148857
18779 -113015 -139573 -308132 66325 -74386 79967 -138189 -32055 -124586 -180566 251849 -320986
18767 266857 -207006 -164663 31106 439212 -339416 6384 -176022 -174755 143226 -117996 -128645
18756 -128645 -77504 -143611 -161700 -16272 89452 -193688 172533 72887 -257424 9089 320085
18745 320085 261716 186318 -303597 -142696 -178486 -56058 -296899 72513 291538 -74196 318190
18733 276983 -248804 33546 -347637 -47782 -41012 -180847 -107206 -303453 -120540 185917
18722 162213 137866 71910 -77089 19744 -197881 86740 122452 166941 -232550 15324 -25619
18710 -327 -302077 -206436 -70897 61909 -57258 -152512 -210560 108564 -82038 88981 160490 -403144
18697 -279969 35103 -180154 -112047 40822 -270787 -215906 75015 -93225 14822 -127418 -28950
18685 -131274 207158 103200 3629 98323 -325813 -20501 35351 -268898 -96391 -177394 -23026
18673 -79314 -401930 -286465 60919 163508 -58239 49736 -338352 -104000 -123813 -277150
18663 -277150 -197200 28471 -28932 -162223 195834 -300580 27406 12528 -11695 -70828 -238033
18652 -238033 166259 -18602 143782 -214556 -215889 -11491 -320272 183414 76665 -130443
18641 21273 -87783 18742 -137805 -98711 -4303 -62726 -20412 -346746 -17154 -142392 74010
18629 93744 73623 61656 -385983 -56933 74223 171495 -190102 -137513 -140000 -5681 19773 -251364
18616 -153040 -61465 -171834 128412 -29800 174759 77864 238525 -234840 -141466 -16139
18605 57707 -235845 48472 45556 -178163 58988 144717 128271 -179888 152412 -244379 -53428
18593 107085 -184235 80687 -84706 -78949 59863 -352962 -334098 -368322 325791 -163232 -51165
18581 1383 80669 -233507 113659 -198039 -12550 -389638 -425291 72383 -10273 -140725 13413
18569 8448 -53542 153709 -230608 -50090 -334021 -26938 -100329 -90195 -282522 -204111 131365
18557 26037 137431 -283070 -88762 -49898 -184095 198061 -292260 -151406 -252454 21403
18546 -27713 -196440 -155916 48760 -85825 -64007 -134100 1759 -298944 191576 -212303 -263880
18535 -263880 -19311 -109625 -54039 -170988 -8495 -46646 -391709 -11618 109025 99889 92461
18524 92461 300001 98883 -171988 52377 -3656 205576 182879 -387251 -303201 -147425 -381232
18513 -381232 170718 -106566 -209062 -155027 -113522 -137491 -114245 -397235 82826 -132579
18502 14685 20530 -193359 217341 -253443 222515 66761 -295591 -106581 -107275 -277011 120757
18490 -42494 34374 -120414 -25901 -78461 -206171 147394 68557 -139532 -269669 -31839 -93610
18479 -93610 -221866 -212250 -55471 38629 -207691 -102331 56378 23503 -21153 -107824 213576
18467 -366919 -201959 221145 -80124 -11163 213737 26611 -123151 -208965 194651 111988
18457 111988 -224871 43403 -27836 -244183 -494816 -139423 -235062 -33426 -119056 223741
18446 -21234 124921 -108271 -286215 -200872 6050 -116271 232421 -86344 -159376 -114474 28112
18434 230859 -176401 -88298 59629 10703 212281 -33777 122569 -49813 18935 189394 -150484
18422 -6186 -17836 -170003 -252158 173043 -195213 -514775 124079 278106 -166826 91579
18411 196984 -193457 -33137 133838 -205378 20086 68691 -143654 180435 6450 394621
18401 394621 251372 -196320 -6018 44456 44196 256317 -134860 34599 -275675 161999 67345
18389 154503 -12591 -60856 -64620 93514 117635 -131074 -221349 51144 182384 16012 -403442
18377 -145985 360141 50106 47703 -172647 -9298 173064 -160995 -14105 -263151 62783 101471
18366 101471 -316340 133751 330835 18112 71199 -195537 -54053 101102 -13753 -56030
18356 -56030 104507 -82646 -216067 -124977 -75626 -105703 -90156 106180 -191082 -55271 -51435
18345 -51435 -8778 188993 -16093 71659 -337434 59907 -157488 -40481 -223622 113374 -280920
18333 -138521 187437 -178855 93687 219097 96169 -107849 -93735 35957 53624 77767 -154787
18321 -77627 -101826 282364 -256851 16064 51327 25517 54794 -185283 -205490 -211022 -208173
18310 -208173 -351840 -272490 -75207 -264688 95409 114125 -44035 -48336 266081 -98571 -103494
18299 -103494 -150823 91618 -212023 156120 93571 91894 -531185 5550 14283 -121677 -85030
18288 -85030 -52901 -227147 40032 79425 -45430 -68021 -43864 -25304 -398627 18131 126156
18277 126156 133367 -48192 -37437 -136040 -294255 80530 -168478 -129642 5509 174064 45185
18265 6019 -110158 -68364 -300427 6627 32238 -130547 213761 -273619 -182062 31267 -177402
18253 59666 -17814 -119907 -132931 -52918 -91205 -178991 -26570 -60926 -96915 -222082 64667
18241 -181152 64013 207277 -117047 -76976 -179211 122089 -26031 -10398 158504 177276
18231 177276 96472 288940 147891 -214998 58088 -48405 -300864 181515 -205374 -36405
18220 -11593 56153 456946 68793 -5725 -8514 217172 72486 -63630 22096 -182905 233052
18208 191723 -147930 -178010 -442809 58831 207136 89412 73175 -253641 175893 -133785
18197 -56805 -247394 150753 -207085 -216741 210919 -126575 218440 21208 -105847 -150398
18187 -150398 -40196 259428 320161 -46636 -128069 -182176 77900 -296353 112537 -215568 -60292
18175 -18328 15808 -115297 -21827 -282448 -199844 -187591 -67557 -229650 12192 -90771 39731
18163 245768 3958 77197 445152 199262 -209894 122061 78038 94046 -40356 -228853 -145906
18152 -145906 -185741 -233302 -23398 -22018 414718 23033 -77347 117823 -164112 15581 -36346
18140 -280142 71595 90803 -16202 242354 216221 -11209 -59043 -27088 -155821 57465 -98542
18128 218347 -66675 -290489 -109641 -221341 -108318 -170469 97605 -7823 135635 20264 -46445
18116 -189716 1847 20388 -7242 -306153 81284 -162253 -68878 225487 -73728 -187482 66352
18104 -201541 64547 -125121 -14600 -19514 81231 163775 -10718 -135566 -131800 -99334 -174192
18093 -174192 -11935 188110 -42401 -67211 177685 28391 -232913 -93483 349358 -304588
18082 302870 -126997 62987 43869 -165390 -345058 58557 -65137 -219059 194482 -148772
18071 -509923 -267346 -374102 -162878 205801 289236 94645 15418 72542 129352 -143719
18060 -227638 148945 -135345 359207 -118360 197336 -235984 250014 31409 -156566 -16413
18049 26007 -113125 -123940 -33102 -121087 -49328 87718 -231783 137301 93822 -115333 -100814
18038 -100814 -55648 -209102 40116 217362 -297169 -237992 -157249 -129334 52505 -202271 -91126
18026 48211 480406 -126017 65653 -105837 -27316 -41887 275276 -107511 134129 -53869
18015 61896 -323460 -56238 -59035 325396 200105 -69378 183711 17351 -108785 182431 -149467
18003 194923 104416 131391 -53667 181150 76532 -140822 145733 -250668 31250 94837 -92491
17991 126506 -50635 -16525 16073 -290448 -137052 -111633 -3461 237286 -79903 -80719 -173748
17980 -173748 142396 -133200 -52405 154140 -335323 -483994 -155126 -37376 114026 237959
17970 237959 -171188 -1913 -138273 11929 10343 -238466 125270 254418 -57100 21893 -162838
17958 421351 -295525 5735 -15946 79282 65178 -102409 287789 252250 212222 -337594 -46226
17946 -89018 116277 -296371 126058 -50592 149225 195876 12815 248992 -261047 11779
17935 -3634 254919 -310285 375980 -9243 142771 -26865 -160965 72714 -6858 178371 273495
17924 273495 -44401 -185626 -13336 475538 260640 -112931 68576 -155919 -198094 -8859 -290156
17913 -290156 20340 -76881 48906 -83365 -269615 -214359 29201 71708 -297918 -164162 1621
17901 -74790 -56148 -183256 4269 -22142 369162 -44805 -46160 -260067 25097 61192 300036
17890 300036 -159190 97614 35156 201718 188166 111649 91302 178240 -337335 -17746 -217164
17879 -217164 -415278 -148454 45765 54409 -43106 -191723 -32166 -200483 -11967 -67051 80897
17867 5673 293706 -137925 -148771 156237 -41239 36878 -98873 -334590 28067 292934 35377
17855 90357 -15775 22452 136157 55544 -198437 91870 -61953 287651 105817 310675 11089
17843 -158033 201279 63303 319192 52035 238289 128126 61357 -11774 103391 -75491
17832 -122271 215506 93706 -162864 71332 144011 -29984 -48301 368539 -368033 38026 -26898
17820 80211 -21950 -73197 -151094 91550 124696 37267 -243381 243089 51543 79379 247131
17809 247131 6609 -109199 140341 133142 295118 -164497 106841 50663 -14593 -128468 -189810
17798 -189810 -97645 6348 -131790 496660 459042 -122434 231732 9676 -35551 164534 158128
17787 158128 -15396 -52880 84295 -75314 252693 9876 -204780 323843 9868 -34629 289882
17775 18093 -373087 87824 64079 185128 -249366 -16819 76231 153831 -44964 119564 52570
17763 -138973 268518 282331 374601 96731 -137364 204275 -288658 -375249 72433 -11557 132096
17751 29496 104517 45815 116584 211104 -178532 -141934 -418538 -16418 41704 6920 136010
17740 136010 212025 -281971 284633 126516 -68160 -201900 15960 -67338 63483 400782
17730 400782 -167758 98513 287063 -248262 -58423 126905 -139802 41443 77377 67000
17720 67000 -345000 -61971 174790 276913 -29245 84217 -10683 191116 198338 -51271 -64522
17709 -64522 209153 165948 179604 92529 96685 137907 39187 57727 5489 135431 -28935 260699
17696 167185 -164885 70680 179085 166106 -41298 62371 134184 -116087 -92961 28580 15488
17685 15488 83975 -92821 165662 349661 -22779 114069 75325 174734 182603 554329 254420
17673 346493 -146905 -45518 223517 157629 178173 -4845 71893 -88892 100907 264045 50680
17661 -49002 43674 -151400 416653 -119123 -19568 -169474 127897 236706 -149557 353808
17650 -55038 -13629 222567 185145 47697 91333 -259413 -36773 227205 -64510 -232229 462610
17638 -144597 -88386 212465 -31497 -115054 153452 30647 -57291 251703 -22795 -69536 6413
17626 115229 228304 230447 -26701 240588 -283728 74057 119811 275253 -40254 211878 -14777
17614 25614 -150410 279605 -6065 -134774 48091 135831 76867 115421 219001 -155940 146296
17602 82260 -185648 5107 -291949 -59024 50367 368147 32386 -160579 93258 -39774 177157
17590 25226 21687 -132118 129198 -157736 350948 140150 75931 483602 206466 -65228
17579 189331 226157 -127613 -176033 107884 241917 96461 253836 167763 242401 157847 52524
17567 107562 -59304 67886 114438 51876 -2603 -148887 -13812 -127957 369106 -6421 115555
17555 -25311 363365 -75190 113946 426653 -62269 147848 139338 266380 -48389 130980 175837
17544 175837 -29396 156339 84300 283218 -1461 294863 529998 218976 542381 291761
17534 291761 785498 34271 92775 126572 -219832 285213 247406 -67890 556880 955386
17524 955386 796819 1129189 1134636 494022 689530 376002 588925 119061 275335 262609
17514 262609 229913 -32070 387877 412112 560403 764238 880258 1241158 993158 397649
17503 790596 464734 265050 217076 -32329 371954 -147779 209215 487486 570017 186395
17492 308355 317530 319826 168103 498401 442561 308425 334652 418188 116194 203107 547535
17481 547535 453405 -110872 320997 609686 98447 114610 144475 253239 337204 338119 428459
17470 428459 411717 770423 187559 374083 353071 432931 248308 330248 254250 283154 366913
17459 366913 544173 2629 382356 228989 547190 236964 322855 -14862 389890 283286
17449 283286 385060 242197 554237 464669 418077 427545 305617 152735 547118 383433
17439 383433 380476 364284 543923 251813 191406 297321 275726 413405 213166 597675
17429 597675 578301 315431 220242 303044 88704 454181 413771 416869 444842 307675 225210
17418 225210 437411 453290 485393 566742 404735 204320 393704 433655 345806 293777 -73038
17406 152043 316391 194559 255536 437200 326570 -39467 178673 305340 -35275 169779
17395 190697 -6833 297351 338124 424540 86000 66061 210914 334998 92030 371831 346027
17384 346027 525664 229111 89158 181428 307660 323739 209541 342684 237570 38477
17373 409759 492584 38256 290405 305573 225425 207184 433490 152817 436925 308738
17363 308738 209975 382151 123415 314611 281513 222984 -7969 133005 270253 189694 -33466
17351 489634 286740 145665 264386 158191 246936 -77851 266549 96727 63253 509364
17341 509364 -83088 263232 450370 -327257 640971 467722 184896 455189 25514 182028
17331 182028 408711 240538 352592 343252 430112 236067 109806 -147718 281686 304875
17321 304875 163182 137487 124253 -31913 9426 -61218 162318 175122 -219822 125128 382553
17310 382553 244589 140014 175479 176831 196536 329980 183340 455448 219495 316554
17300 316554 308608 372515 311120 276709 339661 436896 -121449 227114 143878 237885 181425
17289 181425 459654 480317 250148 409976 137452 142085 459167 210518 225712 78313
17278 183579 146005 199730 184585 128097 530372 179658 11567 -34980 224146 598520 189693
17266 414584 281186 -63564 -74655 329227 278894 132491 355499 392550 209666 321763
17256 321763 266683 402544 516021 132069 510640 485089 707297 280762 -13667 518627
17245 315739 379771 361832 185643 402697 183648 172543 339666 285003 424204 376825
17235 376825 369297 295752 724845 3644 272715 439498 475474 39714 177692 97268 412643
17224 412643 581765 190785 173097 38090 145219 101995 153722 387833 459996 331964
17214 331964 258029 456753 117423 512491 399459 256045 510138 441285 193093 248013
17204 248013 448503 534909 144616 477161 278803 226339 468933 651049 386168 431601
17194 431601 312578 322391 563055 192933 549890 470404 444177 583253 380296 369524
17184 369524 527631 639667 711140 538902 -71368 479115 325119 454914 195689 715206
17174 715206 189442 482012 185504 396748 616508 582266 568205 349939 273598 109314
17163 168476 117079 237038 582261 525114 382898 553636 620725 443123 499179 569173
17153 569173 495286 400194 230547 324670 215079 296312 396324 526720 532118 721065 364864
17142 364864 630575 668381 436545 569166 328052 229979 477135 382482 557352 581810
17132 581810 482332 392430 480406 626576 417713 847260 539923 573404 47242 960143
17122 960143 626085 733885 589648 500474 716905 414987 623045 250704 371342 602954
17112 602954 514183 393834 363385 540870 552945 778175 792936 859745 742318 540651
17102 540651 612379 199261 300771 531134 195439 765513 669033 803832 719120 870936
17092 870936 284009 811603 501352 892260 808972 567466 564118 562301 678247 714928 484104
17081 484104 619275 684987 633374 626431 430227 884549 695806 476048 694500 924893
17071 924893 413772 1032606 520752 672352 616852 772014 719247 686204 487673 846786
17061 846786 642845 694231 888194 713732 671750 707730 642168 1010447 633823 676099
17051 676099 1070452 724170 836342 574690 746534 828119 799764 676106 1074403 860497
17041 860497 650687 901315 933220 646047 714809 631681 1061480 823245 753260 807451
17031 807451 906554 871876 1085065 996702 810959 740403 818825 1072900 1077851 938106 832569
17020 832569 720690 1032445 977021 962785 1020981 760884 935501 835022 905110 692354
17010 692354 996824 997232 733913 899523 1249084 1042653 1085499 1212038 1216615 1131840 1153842
16999 1153842 907315 948403 1163336 1191333 914997 978014 1074292 1455013 1018429 1009746
16989 1009746 1282103 1012170 1287237 1070524 1104775 1190701 1059205 1092509 1288716 1208331
16979 1208331 1287880 1261771 1581043 1146810 1378712 638600 1321313 1032079 1234522 1311926
16969 1311926 1409790 1032640 1213926 1277493 1432110 1562100 1522521 1486296 1495811 1230386
16959 1230386 1569321 1116790 1574828 1476924 1498351 1673966 1464945 1510524 1630997 1380837
16949 1380837 1926148 1768851 1659801 1886526 1586972 1543257 1653727 1637898 1614562 1883318
16939 1883318 2250256 1589122 1891811 1470136 1863737 1530805 1717897 1410106 2061833
16930 2061833 1648000 1814234 1795011 1983464 1885915 1794047 2068716 2076453 1870461 2239468
16920 2239468 2018530 2131051 2289367 2067483 2112131 2109671 2072728 1971820 2387632 2438905
16910 2438905 2128355 2261351 2156307 2182090 2580975 2422970 2535871 2299551 2390413 2471533
16900 2471533 2628235 1977330 2520833 2487517 2551975 2901441 2671566 2908924 2925181 2972342
16890 2972342 3121276 2782652 2931558 2711730 2655274 2882436 2734969 3066056 3304922 3139832
16880 3139832 3031360 3124981 3152345 3282460 3408523 3431112 3741620 3356806 3399545 3598130
16870 3598130 3241606 3598091 3524035 4053197 3943936 3534398 3685042 3911799 3855802 3781392
16860 3781392 4005449 4011179 4126450 4403987 4279603 4037418 4546820 4384238 4592761 4441916
16850 4441916 4442375 4778293 5017327 4672998 4925780 4924991 5044207 5337853 5414542 5479705 5650002
16839 5650002 5502653 5649720 5691587 5443241 5635016 6147579 5887213 6248136 5961758 6193403
16829 6193403 6277598 6730505 6538476 6641606 7148816 6854679 7052802 6841409 7072390 7333929
16819 7333929 7886787 7658453 7899068 8177765 8492522 8511347 8637946 8830757 9198681 9141602
16809 9141602 9360364 9864119 10062541 9978094 10205940 10329944 10699321 10979438 11027372 11485634
16799 11485634 11534335 11957282 12482807 12240774 12729405 12952864 13272358 13565883 13679153
16790 13679153 14329579 14657991 15107334 15452373 15455744 16584929 16679630 16903915 17716790 17848071
16780 17848071 18238604 19024737 19634477 20378779 20879905 21569544 22269990 22973576 22912514
16771 22912514 24471259 25131824 25694727 26321579 27390718 27955975 29279567 29873825 31385510
16762 31385510 32083714 33468566 34297333 35400618 37221450 38036808 39881084 41276140
16754 41276140 43183099 44234160 46366871 48045567 49689245 51634458 53661435 55809716
16746 55809716 58321553 60772606 63295116 65774876 68076102 70816516 73442408 76792085
16738 76792085 79491008 82373088 85722224 88569999 91724335 95375240 98296146 101391548
16730 101391548 104661973 107863589 110648622 113288863 115820928 118169615 120110007 121726192
16722 121726192 123540029 124332447 124868770 125187025 125017485 124778978 123834494 122454954 120972647
16713 120972647 119197891 117021772 114533964 112006330 108816880 106173643 103060329 99987425
16705 99987425 96845954 93322313 90076887 87139923 83957253 80537901 77381855 74935903
16697 74935903 71759443 69063124 66330746 63661340 61139670 59000022 56627063 54305804
16689 54305804 52353308 49967794 47921250 46239988 44857176 42791325 41279935 39853272
16681 39853272 38345754 36676305 35911638 34193302 33246639 31961050 30664865 29470856
16673 29470856 28614152 27589863 27113774 26223213 25131154 24121687 23525136 22884722 21882357
16664 21882357 21338820 20583157 20124131 19827030 19108931 18173672 17847328 17410975 16896793
16655 16896793 16316300 15816301 15445630 15122511 14841270 14328545 13866414 13473370 13322676
16646 13322676 12599029 12783216 12285024 12200507 11771864 11542149 11034455 10918141 10586658
16637 10586658 10218942 10154735 9946787 9599365 9519078 9269342 9170605 8993661 8489163 8348343
16627 8348343 8477635 8368276 8067084 7970377 7626984 7539882 7168706 7364348 6981866 6771229
16617 6771229 6883592 6725037 6671627 6299741 6047323 6185902 5948163 5940603 5956810 5899638
16607 5899638 5547956 5678267 5440856 5468173 5392137 5232143 5129433 5190349 5074857 4789265
16597 4789265 4715154 4558684 4596737 4163623 4541248 4281045 4384198 4531808 4434025 4380239
16587 4380239 4277665 4106283 4244783 3622463 3675222 3540244 3875630 3462365 3338521 3190900
16577 3190900 3547750 3654928 3460271 3236147 3119618 3189392 3201344 2949897 3189834 3127990
16567 3127990 3048704 3239184 2971632 2807340 2648219 2893878 2823698 2552795 2637640 2821300
16557 2821300 2943935 2926491 2466832 2923694 2453164 2268576 2721095 2566992 2510513 2185247
16547 2185247 2588410 2368356 2406038 2191584 2098095 2547565 2444191 2239915 2212215 2000304
16537 2000304 2045969 2085459 2281051 2075897 2126725 2109146 1758159 2182334 1965645 1771258
16527 1771258 1993677 1772210 1861305 1663776 1687589 1734071 1650873 1858543 1780514 1506510
16517 1506510 1822207 1668961 1704678 1491751 1460167 1656507 1696121 1277743 1779637 1590036
16507 1590036 1481107 1539075 1372347 1351753 1433608 1550227 1103585 1413435 909976 1558145
16497 1558145 1439087 1375896 1380988 1344098 1307103 1256911 1552184 1121376 1432630 1265457
16487 1265457 1371673 1016357 907301 1026314 1298168 1012507 1187133 1196597 1038161 1091941
16477 1091941 1012259 1009763 1410216 1257297 1242501 1486959 1136831 1101207 839855 1027923
16467 1027923 798464 1219125 1074437 961243 890750 1111927 989023 929969 967077 926195
16457 926195 1150135 924799 709502 881679 1031843 1315889 883990 833897 643823 790500
16447 790500 805720 983277 811139 1090425 1333981 714710 914716 814778 602676 502799
16437 502799 775838 811794 479111 907781 831643 656374 740072 740707 504165 953576 369022
16425 759335 827986 474242 557608 824583 698682 647488 488187 836410 571716 552595
16415 552595 583992 766880 755089 349273 723524 695680 662062 470502 312039 473285
16405 473285 791926 715987 545208 526900 700172 787232 888894 458512 640985 518533
16395 518533 923102 680819 616758 213750 404396 1008850 822375 670734 610803 539277
16385 539277 540795 302992 930019 732372 393144 378700 799399 282633 380843 292826
16375 292826 418649 527940 598949 487666 362518 446273 563081 479975 802543 703792
16365 703792 424796 577785 564003 296316 615035 462054 331550 363410 683929 547639
16355 547639 225770 405848 423269 481308 605971 468414 571142 211522 441571 614868
16345 614868 322396 342834 477826 526776 625256 179184 696860 418419 363448 228332
16335 228332 426788 200249 546558 451632 130519 496747 476395 138645 157830 286548
16325 286548 389359 345605 253336 209409 631770 356570 -184754 723131 688046 290839
16314 299000 329417 153093 316772 553004 169611 256858 171128 579866 504948 120935
16303 470708 265145 352199 466176 434915 468210 177654 400763 249822 325813 255711
16293 255711 67970 133769 546025 354741 479803 98452 291875 107231 308856 335290
16283 335290 198727 386235 530565 296064 141374 -185313 441785 206314 316087 353207
16273 353207 35575 257094 198444 534173 119966 177689 14977 220364 328219 334251 323010
16262 323010 163801 -162383 237420 126713 357925 322290 19890 -164310 162152 15783
16251 -218897 390584 228120 329483 178081 117465 178303 281016 71488 359208 94955
16240 174010 502246 151409 346758 319739 232436 -24332 260181 133558 260130 448906
16230 448906 425178 -20472 134592 114878 226396 -81868 65502 -42417 -106100 127268 35746
16218 30165 115856 554783 298063 304204 280128 47280 -115593 -89604 -64441 298772 183665
16207 183665 262131 201768 152126 -15477 92220 263449 232079 458461 -133891 36927 522320
16196 522320 -293904 205117 242688 -350486 152087 62813 465942 151609 -9522 183553
16185 12686 -2693 -296133 425963 -186613 38135 299113 -7865 338254 59830 368972 -72454
16173 128404 92170 141514 281515 -41723 385620 -29815 -252779 120934 -379128 103441
16162 91543 -22815 -50748 -104710 309995 219312 73523 75534 4927 82407 -715 129567 -63317
16149 371690 -15705 -293197 13759 -21565 100901 83708 191309 73993 -228305 469594
16138 305262 321866 405010 -9566 -51429 -80435 42070 52590 -4610 387384 -4279 -147947 102177
16125 174647 368961 128726 -22510 284464 366928 -1283 174346 -242315 77938 -180689
16114 249516 -260440 288423 157657 349378 -228938 -1387 -142936 352494 53488 271551
16104 271551 -201504 -16817 -144174 -39412 7337 52820 -124711 36813 -102984 154240 182659
16093 182659 58767 350794 153816 433472 37706 128773 45959 -166435 82598 -386291
16082 -100176 -205232 26226 -154162 -194015 214543 146732 123902 -136535 18794 53832 -114481
16070 109504 130520 106134 -142849 178751 304590 87813 -23295 127579 -57266 -115240 76428
16058 -47951 116801 4063 148263 381064 200520 -95291 -28768 -65708 -47749 43767 -367528
16046 167978 -52436 -46722 36991 58043 -320539 -203640 -291961 20533 -133447 201828 41420
16034 -91961 -31573 55111 -196787 183506 22401 8461 -15949 169806 80576 -52088 -88587
16023 -88587 -346494 44133 76071 108896 92854 396254 -68077 -44421 -1699 -167979 46450
16011 246097 205102 -159029 2809 -85749 -149211 113879 51929 311830 -128963 42240 92452
16000 92452 488322 -187398 241916 -64108 -261 323985 -4680 203479 40238 186186 -132407
15988 301298 479984 468117 641559 942372 910058 986782 996586 785920 698049 347808 139698
15976 -16532 243942 480088 -191729 54212 411434 -126536 -137818 -232058 216670 31153
15965 202177 -124501 -84763 -137041 -246908 186501 203659 -97115 302262 179208 -42523
15954 -203963 -303439 -144761 32354 254929 22043 -61610 -124333 62642 -180997 -113548 191160
15942 160769 -304705 -483489 172281 361163 147772 -311163 246846 138450 98053 -114078
15931 -24831 -4248 -282975 -38390 -186858 -55828 18357 127880 86993 43277 11175 28134
15920 28134 -59398 275260 188507 -80580 166559 176314 995 202990 -23860 -160215 -110946
15909 -110946 117854 -197088 88353 -192264 -106499 -362286 -70848 -196242 420952 -90257
15898 23731 263495 28333 -91588 -333227 -191995 -25264 -167935 85564 114918 133405 229962
15887 229962 23273 -146580 113169 -22836 140753 549023 310066 195505 18051 -73603
15876 -270936 150652 -188249 -167576 193618 -268362 73533 -94700 -60381 -301827 79889
15865 -110523 -192065 -123301 99237 290698 -201504 -10987 104419 -22986 -102761 -253954 -201156
15854 -201156 -176084 -98394 -124365 101107 269693 439440 -391361 113029 -96288 157230
15843 -94495 -11612 -54210 -183444 23801 47559 6383 -106991 -72686 12377 -186028 29371
15831 128389 -153575 291962 -229691 -73870 215636 -348405 67575 88657 -325277 -387559
15821 -387559 -222183 -65211 -91245 -149947 405423 82172 -256576 -234226 -242589 139928 -77097
15809 10691 235413 -157527 -55077 66231 208556 76682 -50305 60723 281079 57692 14560
15797 -86015 -92855 -126382 -223082 45583 -20185 71188 40081 -222768 211758 31904 -5798 -312739
15785 -312739 -144014 -33124 -401014 -12495 -80166 -29072 193792 70558 -314967 97221 -40223
15773 -169665 -130133 -186628 114121 -45134 142766 317404 144380 -150386 111956 -15108
15762 76794 73389 149533 281753 146695 106394 257852 328129 246313 167734 -99432 209540
15750 95766 33928 91288 -47666 450 -201261 -89701 197188 -131354 223225 274267 203851
15739 203851 324049 -353593 234653 -65153 -196553 -222515 -18462 16382 -87711 276221
15728 -386604 50719 46441 -40992 46243 120113 -172285 -37396 -150892 177138 299189 -373823
15716 -38135 -87924 -186181 163338 304638 71742 -275825 -127187 91189 -538422 -127096
15705 85012 -198820 -32624 -246572 -241365 179308 -214735 242592 183312 29381 -93937 166701
15693 -86984 95494 58538 253266 219991 203476 -109687 -70813 219821 -46235 -147227 128525
15681 -142102 -49423 -394617 -75407 154422 -25766 -58644 263771 -86687 -222178 -91184 -47152
15670 -47152 -157261 273611 129334 226193 -58854 -204992 -47059 -245501 -29898 -11389 -131727
15659 -131727 -257549 126971 -421607 -352062 -144076 172506 -233392 -94236 26608 80137
15649 80137 -309528 -233820 -51667 36451 165426 -34545 -62236 50963 158788 -19408 73438
15637 -77249 5398 108968 -121318 124532 -14228 29033 -165427 -157028 -395870 -257255 -2892
15625 -33729 -256204 45655 100245 -482681 251824 -77071 -256911 -164943 -115465 -103797 -274605
15614 -274605 346895 258842 -147761 137833 71036 65704 199440 426464 185044 13023
15603 -41944 -174621 -33874 465054 268008 193952 101638 -172465 -167480 -37273 -78356 241775
15591 -109298 -161333 -116455 -61210 -47942 -232779 -24688 225393 -357060 151529 102097 74509
15580 74509 -142553 -212983 29458 64165 -211778 -200678 188414 -385211 271901 -111349
15569 186402 -351058 -227321 -220168 -105186 -146339 89829 -120549 189732 -73606 -134392 -61068
15557 -25855 -200594 -23811 -233264 -85758 -35094 100487 -156791 46771 -142380 -5018 119184
15545 189572 214790 8494 125042 -15338 43230 -69846 -30205 309543 176218 98451 -48441
15533 -6401 267630 154487 -111879 195687 -85019 -20944 397723 -89177 -238245 103883
15522 144714 -288326 212623 36301 -199454 -121618 -75298 525090 377169 9264 488168
15512 488168 22206 211758 -51924 79533 100002 180238 -154781 169935 30935 344552 52713
15500 70148 138397 -175890 415380 -80502 105060 99356 108307 49881 389907 -144539 123581
15488 105051 31285 -143419 -65480 370176 124076 73455 501117 -110123 224351 137570
15478 137570 -233299 47211 288823 524627 470568 353778 580925 455115 370740 270166
15468 270166 82779 241998 -54672 154022 -68607 120549 -152385 22338 211509 439434
15458 439434 -181088 25850 47096 293475 144293 -12957 -29750 89909 11559 221241 93821
15446 -163936 181578 169235 71917 329862 82131 489372 840337 1157268 1287011 744488
15436 744488 432043 261070 333038 292274 395814 -20162 -18350 36551 -220426 90838 -398725
15424 -41090 -47390 -8716 -68509 -67271 20748 -197519 -113788 -102500 10775 -68797 -446812 -92975
15411 -109625 382694 199478 35116 73518 -153271 -61472 -109106 170346 -48273 167005
15400 99870 -174225 -6915 -196920 -300744 -213248 211883 -48530 -192752 45265 123690 -239968
15388 -283109 134241 142175 84998 -312037 -177762 -192834 -249078 -256005 -226852 192009 33655
15376 51562 -112295 184782 40128 61445 224078 199509 -69671 -268694 67939 225373 242005
15365 242005 49109 105121 153545 195639 277186 -136737 190248 292543 86709 336900 180292
15354 180292 291771 -144953 96543 215298 181300 76546 -192212 16334 184972 213399
15344 213399 245789 95019 506695 203238 120283 -64542 -76336 -192600 73323 245965 70968
15332 42403 90844 221134 181270 -13236 112189 248636 88189 -58699 5059 94829 275839
15321 275839 202240 -161939 -71326 218569 84725 280052 180602 296592 35246 207991
15311 207991 58600 279587 254116 187555 277506 -41752 -184502 -193501 296937 75680 74091
15300 74091 -70438 182554 245028 26046 4653 -360316 101847 110574 85407 242360 76668
15288 -43667 -155937 69661 -144193 -59381 49019 -23542 130688 150725 268361 52451 35098
15277 35098 129448 -86455 136231 158132 -88744 -56932 -103110 134081 153401 111145 104277
15266 104277 116288 60844 127402 -23283 112996 12496 23597 -13045 295845 101448 552922
15255 552922 -182381 96239 -148619 238907 -66509 70914 26621 102692 315213 -291157
15244 107498 433342 283729 800988 1645967 1051388 1299240 1619208 715014 9182 320316
15234 320316 -82686 -79953 181941 2667 -278805 65668 86619 278955 -38547 -20143 74834
15222 -116773 130298 136325 465 33584 259256 -93674 189903 387357 -86840 -276912 -209667
15211 -209667 403768 230314 -123399 58890 -65493 15364 245651 57387 387673 61564
15200 40907 -7617 -66560 6680 393768 152423 203210 -57413 -133297 -51985 247050 -133608
15188 -118453 -531 170403 289992 609899 -66856 41230 -128162 278136 -4434 -86915 10152
15176 42783 -108210 176311 -79600 325757 112611 -131292 235347 39568 67509 325924
15166 325924 393487 99005 211789 -160480 -69949 1236 316426 -236972 122264 14931 95609
15155 95609 390421 -46120 48597 86581 85462 9488 297398 168410 1351 82859 -91151 -26153
15142 501457 166172 -77537 102486 -221153 -38705 166595 325055 -74794 230345 -93264
15131 233489 74150 -74665 148696 -128483 538122 -133388 -76256 155210 48876 43707 131397
15120 131397 -163800 311752 473677 521627 140233 -83538 91736 -31089 372471 -124765
15109 -132936 234917 -82194 -14446 344762 -165944 -141347 249752 64166 -25436 -363297
15099 -363297 -71584 72949 77905 113572 -21754 83644 139812 173106 -64797 27462 -200057
15087 -201540 330235 -226142 -24365 98156 -131012 64582 292814 321699 -75932 -118468 35688
15075 136399 -80652 51865 73189 195439 72366 140279 39097 98266 -13153 187191 149548
15064 149548 64958 83761 401066 166765 315921 -10544 306736 392882 252426 320376
15054 320376 384257 163141 579835 40706 253971 227568 404557 650275 647711 639 511315
15043 511315 60392 136031 444729 178934 369889 68057 452882 463191 219744 199188
15033 199188 3376 445483 433312 292918 540935 383416 729911 693197 318966 503155
15023 503155 264990 797571 492015 603903 421313 478421 373229 533125 451598 177189
15012 185466 -79027 332963 302580 242599 569398 521385 306750 308221 385536 335477 410157
15001 410157 54669 176955 440100 207985 352287 682104 189834 295143 297987 362877
14991 362877 564290 418847 563416 456584 472542 148458 738677 275043 527067 240705
14980 572979 658279 448544 622358 341683 338413 426199 306548 682837 491028 648173
14970 648173 669198 460833 174739 218558 298460 147142 145260 334931 49318 258362 305258
14959 305258 -89334 280113 371151 239179 269853 453152 349453 200132 207275 420714
14949 420714 421736 560795 272781 486933 107244 366155 530157 565416 499019 677266
14939 677266 524015 631119 576851 188941 295824 619207 458699 523055 431652 444226
14929 444226 900198 860723 1277608 923593 1173878 1772828 1492490 1599674 1300964 970292
14919 970292 1380279 1249632 1563432 1907683 2123366 1939881 1543675 1715544 1208187 1257070
14909 1257070 497817 740130 927321 423026 309499 394632 232272 600098 452153 577879
14899 577879 179095 308810 299087 503895 191415 228839 426507 314673 486904 509936
14889 509936 358636 356640 361821 809009 231146 383710 757796 937711 649258 579970
14879 579970 529776 982405 738763 729160 558299 561116 391763 488895 453703 212010 303143
14868 303143 265170 764133 565333 396284 534646 873963 415180 756274 412569 476567
14858 476567 568235 295202 487733 23454 489088 17019 293538 321925 193325 288216
14848 288216 606951 482384 611452 658944 678120 710713 740146 993721 1091623 1037136 1229508
14837 1229508 833050 957396 1095845 842464 587378 285390 441214 416893 548866 504268
14827 504268 653035 501677 503426 548217 401660 526421 497091 434648 473970 806330 390450
14815 565502 889756 888737 856767 676353 625491 640562 623333 638583 645844 491747 485530
14804 485530 923327 802160 762989 813548 417376 609063 850859 354211 354189 594321 638734
14793 638734 439874 705370 493777 695172 602141 985610 389562 276531 595686 514399
14783 514399 707512 151906 509698 557179 897726 496967 681796 1009006 678883 917041
14773 917041 997425 914165 639893 647436 579268 575021 722645 499277 414347 521492 710834
14762 710834 529664 336854 564343 892663 709316 355318 728859 543306 611590 638797
14752 638797 610067 455764 470797 383537 510134 342517 449998 680767 728574 784926
14742 784926 522651 677796 560794 908188 670505 777121 740727 488034 526916 643230
14732 643230 854479 541756 1061270 899332 1008814 1199131 1502665 1904059 1486590 1536903
14722 1536903 1103389 1238154 503837 875025 686311 758203 723524 662670 581206 769064
14712 769064 919476 744605 907698 759603 604883 932348 748581 1095240 596696 999822
14702 999822 1311142 1219209 1794094 1694091 1604751 1619931 1514888 823277 1204125 951924
14692 951924 829228 657208 1129891 757721 1003306 1041513 660109 1260645 973409 755729
14682 755729 756092 686278 1146803 795548 626293 861514 978987 740781 865044 675764
14672 675764 1216270 707536 682506 884217 1104632 1034152 446141 587323 945315 1159450
14662 1159450 841019 989845 560356 825526 915981 742532 898228 899920 821199 1058695
14652 1058695 699314 1420928 1398863 1204504 1117665 1406934 922143 1023612 996760 1009124
14642 1009124 962517 991293 1097481 1234153 1075327 1098944 913309 762507 807255 1239437
14632 1239437 884383 1023131 707860 1014794 1082736 1128726 850101 1232193 1247477 976900
14622 976900 1421099 1248557 1062657 1152338 903784 1297664 1135718 1160873 1225212 1401562
14612 1401562 1125437 1215229 1192713 1122601 1198843 1292512 1336423 1104554 1150572 1529514 1458738
14601 1458738 1406960 1281930 1711870 1252188 1551377 1416992 1478767 1598461 1571436 1517510
14591 1517510 1763978 1746128 1608124 1227469 1713129 1741643 1483383 1181960 1630184 1460997
14581 1460997 1670597 1646746 1835638 1465243 1567858 2001064 1854886 1726639 1508472 1885513
14571 1885513 1733083 1942016 1960887 2080627 2053549 2059773 2090408 1964370 2051557 2050461 2206802
14560 2206802 2244853 2273240 2186537 2627375 2591105 2678666 2814727 3339529 3324340 3760998
14550 3760998 4303610 5782402 8355916 15512407 34507504 52505671 21578551 8647501
14541 4484901 2904858 2325424 2320935 2672275 4769721 4458883 2504191 1757826 1691818
14532 1691818 1853684 1980025 1776449 1798069 1889820 1954793 1873651 2012418 1943458 2200252
14522 2200252 2282051 2014948 2237947 2225845 2273983 1914007 2270119 2211236 2403977 2564899
14512 2564899 2496224 2630999 2271111 2448491 2222599 2499076 2642395 2464237 2663880 2493423
14502 2493423 2587035 2704371 2550517 2611243 2738848 2601198 2738326 2798201 2909915 2915433
14492 2915433 2508565 2951360 2920389 3012010 2673870 3074425 3058501 3252653 3279736 3307250
14482 3307250 3261010 3177154 3031988 3215190 3198728 3427834 3461801 3408983 3412478 3514761 3899043
14471 3899043 3679654 3592929 3942548 3495529 3544218 3816474 4013285 3774023 4082109 3845331
14461 3845331 4109235 4321114 4397611 4305486 4298147 4553286 4271302 4462789 4316067 4487005
14451 4487005 4620808 4620876 4746922 4550502 4474033 5058124 5069184 4635775 4996592 5251190
14441 5251190 5400976 5230650 5223388 5454931 5497452 5464636 5493309 5556703 5951582 6013019 5803799
14430 5803799 5962369 6132066 6120421 6339166 6556104 6495354 6462279 6611890 6765080 6577108
14420 6577108 7381248 6905856 7638605 7574170 7591085 7518305 7601426 7392006 7728713 7514021
14410 7514021 8043732 8098152 8280397 8553701 8424669 8898651 8715515 9304511 9287517 9322964
14400 9322964 9051117 9429487 9638261 9486917 9819483 9952803 9934936 9754527 10421016 10471597
14390 10471597 10398747 10966895 11043031 11267804 11319929 11805865 12108988 12504094 12471768 13054644
14380 13054644 12882640 13703264 13694268 13872629 13973716 14111178 14551977 14554008 14853932 15418094
14370 15418094 15574855 15703714 16234371 16499256 16988747 17440406 17739002 18380710 18229590
14361 18229590 18703696 18929371 19280342 19830322 20254586 20734602 21538404 22152368 22637569
14352 22637569 23151002 23676123 24088392 24616998 24963762 25877626 26751074 27300694 27691226
14343 27691226 28707674 29663399 30042054 30953730 32253693 32405310 33745143 34769398 35658416
14334 35658416 36929832 38242092 38807737 40111063 41340886 43262816 44174813 45907761
14326 45907761 47081680 48790365 50433247 52047798 53899389 56065126 58300905 60164466
14318 60164466 62011542 64758021 66894555 69252620 72134231 74753839 77887226 81210008
14310 81210008 84767318 88270825 91832158 95910365 100534707 105223869 109891717 115319299
14302 115319299 120760016 126700642 133017457 139656574 146945192 154129752 162512091 171298610
14294 171298610 180410112 190095135 200480253 211566823 223608819 235932311 248901818
14287 248901818 262732060 277428647 292411719 308359484 324506960 340870065 357852608
14280 357852608 374401996 391250223 407568733 422933794 437331918 449757563 460112850
14273 460112850 466910821 469961165 470450882 469724684 468139494 463227909 458734863 452361319
14265 452361319 442272452 431715992 419447528 405186428 389486233 372717627 355492454
14258 355492454 338342620 321957388 305521365 290081597 275182219 260637561 246749893
14251 246749893 233608193 221029408 209364901 199071455 189879943 179640490 170654800
14244 170654800 162535029 154293905 146780606 139636919 132952066 126351076 121127215 115769156
14236 115769156 110548337 105365916 100800421 96188954 92692107 89201760 85358137 81836754
14228 81836754 78621837 75488385 72407629 69564374 67300746 64311641 62067649 60041089
14220 60041089 58376447 56011146 54180753 52566399 50583154 49033717 47862911 46329506
14212 46329506 44616171 43037435 42086013 40704653 39389228 39060576 37873339 36256215
14204 36256215 35241334 34508826 33368787 32700462 32350913 31007265 30362117 29061703 28377902
14195 28377902 27533075 27345015 26850994 25994915 25445705 24735152 23737065 23411239 23009974
14186 23009974 22597673 22338392 21495490 20966854 20608647 19920923 19393743 19419683 18808848
14177 18808848 18279262 18180515 17654329 17363425 16816179 16541267 16423344 15874389 15784471 15452933
14167 15452933 15185849 15201564 14359603 14191667 14066157 13772394 13401729 13241692 12925972
14158 12925972 12729098 12810954 12211615 12077664 12038932 11752691 11606478 11127732 11302016 11206049
14148 11206049 10940437 10613052 10553223 10423664 10308835 9997699 9989652 9723182 9432972 9354967
14138 9354967 9271888 9284397 8928514 8828774 8859599 8861392 8614748 8248509 8179495 7744884 8095885
14127 8095885 7771550 7831627 7459164 7740392 7179296 7367301 7107866 7174238 7245381 7112148
14117 7112148 6771322 6451761 6880111 6498566 6611375 6667231 6216829 6636896 6400682 5937452
14107 5937452 6168094 6077052 6059498 5998504 5757586 5821186 5569678 5085683 5570318 5601804
14097 5601804 5671186 5152351 5257970 5296328 4889932 5195250 5106449 5010506 4915417 4821188
14087 4821188 4879842 4742039 4256277 4849018 4597368 4683821 4569917 4758494 4345669 4665598
14077 4665598 4050557 4336017 4374033 4154276 4400904 4061667 4299815 3899002 4218408 3964467
14067 3964467 3992647 3594835 3962721 3781542 4078287 4028799 4378448 4266128 3673768 3681375
14057 3681375 3750573 3622190 3271398 3592789 3604695 3469945 3486986 3324872 3483819 3264478
14047 3264478 3071400 3252303 3457553 3123077 3018801 2970455 2930610 2675601 3088120 2960796
14037 2960796 2980367 3046514 2910290 2707405 2617184 2815346 2832127 2884748 2937061 2585630
14027 2585630 2456466 2772835 2691019 2612568 2405915 2600639 2679007 2360194 2260199 2701653
14017 2701653 2275343 2226136 2593628 2426400 2352299 2299751 2081239 2052971 2194550 2292531
14007 2292531 2185809 2270428 2097330 2189763 1904965 2057796 1724808 1836410 2052792 1921686
13997 1921686 2079604 2051660 1855084 1464205 1833194 1886643 1763373 2001103 2118138 4329368
13987 4329368 9204422 25096458 53560141 28844215 14257431 8327007 6056042 4719781
13979 4719781 3758545 3295005 2962484 2645136 3009020 2583969 2707019 2439156 2545171
13970 2545171 2324530 2000132 2261673 2149142 2117176 2260893 1893737 2142841 2081356 2034927
13960 2034927 1834408 1786731 2094725 2113985 1982094 1782490 1955880 1911610 1544857 1830357
13950 1830357 1704348 1726991 1848569 2161575 1646188 1733284 1388394 1537709 1602428 1349499
13940 1349499 1725148 1736634 1521241 1653326 1442620 1929978 1473029 1485082 1699587 1541536
13930 1541536 1404081 1607275 1337019 1445257 1324555 1345035 1673393 1443377 1584313 1658594
13920 1658594 1546661 1224242 1250535 1543621 1212548 1202476 1377224 1428286 1241961 1221162
13910 1221162 1189474 1295884 1132842 1512374 970964 1172872 1489488 1287634 1579931 903789
13900 903789 1347580 1419140 1099700 1504755 1081317 1396013 1154799 1096305 1107614 1080444
13890 1080444 599387 998676 1297751 1105158 1067060 831104 1479462 1108993 1085020 1128069
13880 1128069 1129750 1186509 1005844 826735 1192292 1276547 958350 1042840 834993 889775
13870 889775 1195067 1118811 783207 886139 1134908 1011342 1012879 894713 1176927 1106114
13860 1106114 1051935 906972 1012845 1200601 1051286 1245739 903364 956483 1357770 927387
13850 927387 1194848 783913 1003248 950272 743944 994044 1020509 1119666 792611 1346805
13840 1346805 765270 705610 1034045 1068640 1001346 681884 826477 1012669 536323 909158
13830 909158 819439 938827 706719 756021 731304 761504 713395 832111 942747 973106 698389
13819 698389 623216 669068 655616 878690 588452 705637 1039567 678189 672055 765268 571252
13808 571252 869900 897836 806152 977615 697737 797918 944262 507214 946603 657358
13798 657358 790906 896221 517885 750689 1170568 324408 877919 1109980 623932 1032039
13788 1032039 622182 897860 772036 827434 680821 706091 549864 580489 932713 459996
13777 744395 882150 832755 611980 459451 636564 705903 416794 748663 631474 639752
13767 639752 459256 651699 594879 120632 550867 395118 547577 767130 627557 557327
13757 557327 566516 514036 530424 616213 626358 716517 506207 291069 595236 625511 567337
13746 567337 435491 632781 623537 556793 698788 878127 681337 814857 547155 575467
13736 575467 558556 524840 617838 497176 608237 630162 607823 309213 579538 543290 405190
13725 405190 308467 552831 510837 430794 816256 643370 789584 514309 539245 832017
13715 832017 643953 725474 342706 470649 381437 463123 672374 574469 305607 488680
13705 488680 593123 602332 284917 429876 476630 218638 575897 456511 480347 553100
13695 553100 497484 468165 511515 408530 497875 223656 480822 357957 757822 607293
13685 607293 624476 548024 449164 389363 699699 613172 366835 480470 433163 353371 445977
13674 445977 389416 632830 164087 455615 581297 213699 405387 376158 395900 427880
13664 427880 419477 352635 715241 712325 467500 608693 200567 477055 387130 219418 265516
13653 265516 491572 455163 288333 491486 316802 410153 189230 388308 565480 663194
13643 663194 239846 539519 690327 358713 346949 606935 259106 -3635 229894 591622
13633 591622 256773 550724 702761 616074 586727 425127 257744 66593 342365 313820
13623 313820 486809 225483 395234 488760 174020 721626 322706 540786 393077 302939
13613 302939 9580 423613 444685 396644 409379 278333 484877 102720 -60543 279745 284763
13602 284763 739578 458232 302050 224052 353427 201829 453111 394392 479796 486117
13592 486117 388321 511281 276279 495871 162527 351652 426225 334354 163496 417238
13582 417238 461974 371272 388974 394472 405646 219936 413579 148191 346118 158545 391467
13571 391467 398540 694803 100023 261511 353487 608348 166288 516010 167094 340676
13561 340676 19989 478876 212060 534227 -127370 334497 625039 469914 169088 145460
13551 145460 238855 542851 365895 -6097 4033 327724 265553 364714 51663 343579 254603
13540 254603 316882 188223 94180 173807 -115784 381451 323317 316975 279910 205946 212054
13529 212054 95638 124160 198322 270546 183568 -7994 -6565 19879 8962 231531 412112 144188
13516 36319 135637 179113 107674 272615 447881 111380 357890 28317 -88750 -44889 378241
13504 156125 85324 236672 248195 -51614 123426 250710 512695 330557 225974 218401
13494 218401 89171 88820 256981 208836 230918 79879 268944 69484 -29557 384988 641172
13483 641172 -92927 217629 384693 85855 25383 217892 -159485 116096 267664 71807
13472 390097 52237 -243816 372397 250191 1708 398217 -292009 128245 86503 278017
13462 278017 441040 130199 269786 301953 228663 156537 190342 316154 524411 92377
13451 63705 154347 90844 -2058 238938 361695 41174 185765 262487 185250 60288 -22879
13439 166795 289785 -150517 -32435 338431 563219 185646 18334 248772 213218 162929
13429 162929 241680 -145914 453663 474776 381472 56339 -75175 65601 162419 118478 77346
13418 77346 153428 172206 648496 425186 -1252 663709 128775 192508 38797 210592 62829
13406 384424 100805 -259916 -46622 231410 -34765 11878 90677 528371 -28155 303682
13395 173572 43832 519226 -79599 154211 -4588 314398 -12207 1833 252476 72006 338601
13384 338601 264758 -142340 230228 337340 -95717 216371 168192 152813 211693 208024 -127884
13372 324618 54289 -13937 -119233 342767 19329 5762 69828 224650 314199 277072 256123
13361 256123 147412 130622 356267 159024 78934 180271 13456 70369 190601 202537
13351 202537 91566 176416 265465 591273 206183 465613 464684 577720 382779 345088 -732
13339 195316 364417 567036 362396 561049 224902 398715 276415 591342 38975 303789
13329 303789 326856 130521 390211 682163 558087 41714 342483 41357 6072 85785 227850
13318 227850 39904 2584 9696 448256 202807 2770 -4718 31670 225511 359276 201832
13307 201832 123170 99482 -7247 112554 205958 20486 348799 143152 -61542 285781 343750
13296 343750 173038 256751 49020 -13740 88234 176178 2867 85773 39801 198322 44579
13284 13292 139065 -60989 435617 -211872 27915 151121 61830 -93625 116674 73914 -160190
13272 306770 128360 222150 160355 -97281 87661 -220256 -137076 145341 27818 -25481 -32950
13261 -32950 80699 21515 -13053 61506 64991 -91869 457750 4155 556964 297068 274153
13250 274153 343840 71687 182328 216611 -142272 220811 -97016 13827 493600 -135782
13239 35921 28905 128475 176526 80094 -4144 153567 -20719 -10957 303011 280747 -141425 62160
13226 -170444 30295 -108678 261269 208530 86445 107937 172915 -109621 24221 266238 172470
13215 172470 221470 318147 266765 -269952 182897 202868 235265 424335 -345533 98456 93598
13204 93598 30696 -267887 -15320 -119511 -30499 -16587 390154 106483 125838 120077 266910
13193 266910 -92369 -341305 90145 382298 83266 136512 90756 -122665 47073 -333089 299707
13181 224360 105333 335727 159595 256069 80201 31371 -85791 -51878 -131839 -132122 -88250
13170 -88250 38966 -148342 91765 219668 -258974 10515 -34663 121558 358348 36019 12915
13158 226583 -117001 267951 271235 129835 184686 165117 177122 216358 215616 115421 190475
13147 190475 227976 91878 -105285 427900 -163699 122765 83681 -136590 70420 168912
13137 168912 105608 -245532 -283372 582615 116116 282474 117800 185943 266506 6266 215344
13126 215344 35069 148650 -91331 -172843 204740 -35388 -183622 223117 54194 283413
13116 283413 64872 127563 89195 42391 83648 207136 257075 88243 -13173 -68668 -44137
13105 -44137 -70203 30634 86849 239128 -355470 16386 50968 18507 77453 -186101 -158334
13094 -158334 279814 322374 -109944 27187 113949 282873 -261359 174402 439022 -7520
13083 22754 252558 -135007 345125 -69878 -6268 -121130 275919 363430 -56282 117270 243828
13072 243828 105440 1802 -37288 -5524 -183858 113447 1169 267409 188391 -85161 276023
13060 127589 -141177 115246 178927 254843 -129066 217890 -79672 292712 -77131 -16292
13049 -269475 -134969 303787 234551 94560 444113 -31592 139744 416846 123466 185216
13039 185216 307400 -70907 -202283 162623 196435 152895 6201 71539 -49899 -324721 1598
13027 -132090 -39212 -255273 103001 21749 -71124 146054 -222384 169046 68153 -79784
13016 -137552 98629 552295 -28358 -251465 45773 -208203 353223 -44756 118491 409642
13006 409642 -210468 361524 3176 -19775 199723 -292696 324518 227135 240919 -527258
12995 -94711 393562 -16894 -48298 -131411 -127398 -91865 59535 228542 279140 146318 104893
12984 104893 -141666 -102472 -278218 239664 103512 -395769 -156287 -19563 57248 418318
12974 418318 219507 121237 -245841 -68014 -161488 -195000 101538 -196281 10432 -246439
12963 297707 101190 228035 112982 230503 103672 111001 -163191 309424 70871 94510
12953 94510 245034 -181472 -213853 195297 -61092 -138205 201000 -92520 38902 -321154 123425
12941 224534 123943 -29856 -119339 51183 -31884 64070 -105615 58486 106398 -13339 69465
12929 -389005 41884 -7871 -127315 -34502 177129 297297 405468 61340 -71900 -241418 -31034
12917 36354 250673 36502 83294 -161578 -9819 -74572 162792 -6386 -48074 172017 -11343
12905 -43628 105810 -17335 -16918 115402 -105677 37159 382059 -260110 -9599 -115924 41649
12893 159153 -12902 13706 217890 -161745 -8367 -24367 -245420 -94328 -95878 -231323 -43417
12881 246232 20720 -168106 -6734 5305 -26509 -50325 138041 -59633 -190367 -166333 151114
12869 -38105 -148259 -35848 -194326 321344 -20774 12085 -221218 -49878 -226550 8195 -291806
12857 37284 210783 -284427 -72929 -164560 40553 299210 -149065 234561 47969 -88109 -243785
12846 -243785 56600 -150224 -117197 97524 73038 16396 130578 16307 104257 -68477 -35398
12835 -35398 304601 -213128 224755 15276 108269 17847 -110847 -216043 84129 -225394
12824 -36341 211356 -228243 -18968 305295 14257 37950 277482 292814 -151471 -316857
12814 -316857 24863 -13873 183350 17506 -28487 -269536 108847 28761 184307 132859 109535
12803 109535 -34740 -25099 -226929 151747 -222020 50929 108700 208856 -142668 229071
12792 437781 109093 -208766 -187390 -306885 359476 81787 23724 183335 -302752 18748
12781 -137011 -53059 -292937 131596 17691 -19715 115701 -126944 -293710 -186809 96207
12770 -309 -131355 51478 162115 131320 -62285 -198397 -69185 260348 -131461 -228250 -101709
12758 -107935 208275 -307665 -283496 29019 21022 95810 -220389 -24385 -77960 -166339 147962
12746 490475 230944 -92100 46545 261503 19618 -152446 -197434 184502 333850 -16511
12735 24881 225038 -5226 -213261 322396 -189434 -229956 -259325 171013 -58948 182629 33681
12723 -94019 -60402 75663 -169636 188712 -163243 -90951 77521 -52530 -349138 174500 68813
12711 106790 -43329 -77963 95783 244471 433871 355100 261279 36471 326477 149949 199691
12700 199691 281616 -322926 56583 -21838 -173280 167293 -58093 -31019 430118 -152819
12689 -149223 -29688 141534 21797 -35617 -203516 314586 -185764 -326100 162657 24138
12678 120995 547840 34484 86109 -131794 188665 198626 157262 265201 -61613 4475 216464
12667 216464 59220 -115269 20787 315163 227849 199481 180424 -152048 -49206 -110298 130826
12655 -4158 19044 307780 106293 -146688 137952 16570 -47233 93119 98102 142077 -58801
12643 138488 -23223 123932 -47598 -433093 86549 66260 38024 319357 194064 53483 501565
12632 501565 57386 158438 -5573 52656 7916 268703 463155 325942 -8103 127174 -21138
12620 4119 36763 -156878 228334 122475 9454 257795 38893 62019 -238511 62229 44076
12609 44076 142869 -201008 124165 40843 -36903 50095 4585 302556 -193122 -278123 60027
12597 -84020 101263 -448818 -207677 -38332 -207401 329711 -118826 129785 286178 -115874
12586 49489 -78229 -314123 -326460 -72945 2185 113984 -171567 175093 -68990 -246847 194630
12574 -26771 421304 23025 -82841 121588 -34162 -118383 -75648 -53183 68518 -99297 -101577
12563 -101577 168223 -36459 129758 126901 -47408 -159647 36520 -259578 153071 -29300 -33253
12552 -33253 -54720 83001 -162727 -425141 153127 -155635 -73663 11428 6198 162406 -43358
12540 148912 -11517 12111 -61641 241323 -184976 -136895 15118 180730 83814 -87462 -173036
12529 -173036 -136438 -351893 -347732 -146268 -65863 -163881 370428 -14380 -108842 203072 108154
12518 108154 -26272 -203979 227146 -210514 -146037 115971 88084 280750 116568 79203
12508 79203 363286 -14832 62442 18784 127912 71256 18585 -100387 -159786 33646 -78160
12496 -209942 90975 -301631 -28147 32816 -39212 12675 -292675 65969 -73028 202999 190844
12485 190844 213453 234965 156519 -674 299207 149845 286041 181905 -86631 174869 100651
12474 100651 -22174 87450 150525 -222052 -229550 -155049 -64683 145263 -178793 -34242 -126447
12463 -126447 -277227 -149394 145798 242225 -276072 223989 88395 119744 38899 240722
12453 240722 286954 289604 45233 -75191 234759 12573 -77312 19752 -111945 274881 -108563
12441 -96452 172606 -41204 163311 -72491 -213952 -92099 20337 114251 -35871 67547 273703
12430 273703 -267196 -410642 24777 -35179 81797 -95311 102897 -114325 93002 192824 -122401
12418 -58850 -43156 206972 -327050 -177508 -56785 -185664 -60395 206052 73571 -85780 346086
12406 66038 205996 258108 -66294 109574 -5531 -283953 -149771 -301879 -229964 -309614 -69239
12394 13300 -17274 484491 -34208 30135 119608 -138692 174151 -34707 70170 194788 83218
12382 -43846 124213 50398 -96917 205665 50666 -78871 -71168 90127 55254 87663 211003
12371 211003 480955 -320014 36375 -273953 141406 71024 -84801 6874 121351 -202266
12360 -122844 103769 -99685 18 -46725 78872 268006 -9461 -10851 -315276 -38224 60809 63199
12348 63199 -25296 228420 -164996 112244 -75624 -40224 17068 221765 -38482 32944 70581
12337 70581 187158 269138 7796 260198 133107 -292596 -268811 276526 99789 90540 67372
12326 67372 33470 -65516 106837 67520 562525 -91405 252506 317532 -11415 149368 282302
12315 282302 370122 72087 339397 -235413 32036 134226 122707 341609 -62397 21921 -245602
12303 177644 111893 158535 313868 -128494 17869 -221051 -292293 375313 -61196 307646
12292 158984 69994 -209115 69460 19742 -25811 165389 105061 -338682 149098 -206024
12281 315268 106999 382425 95730 -214560 -168554 161825 306898 140367 30966 -61264
12270 28020 131366 -42790 315174 294087 446665 58474 449659 259783 -87541 244757
12259 228760 261814 213941 158270 141966 270556 126779 178088 -113748 198136 126783 262421
12248 262421 276350 321965 237033 241637 -182943 309746 39409 375261 159148 27578 -108245
12236 199416 36919 388030 362867 -206429 -72199 156606 65734 -33351 251613 103081
12225 195508 322659 451144 446413 446333 304919 113499 210979 490327 256917 299980 522153
12214 522153 312581 401466 144835 592496 103324 287388 387606 37160 233033 49836
12203 243872 219843 173120 49074 444386 -9964 338415 35255 332400 411423 386889 332969
12192 332969 450187 196594 181003 189838 229337 485207 194868 357607 431378 54384 24277
12180 483662 122487 58668 112393 294635 133067 291573 27641 70072 347196 309699
12170 309699 425541 18013 294462 489044 321955 476583 310392 214830 172327 651613
12160 651613 -105845 70463 -31241 80952 47942 -86362 116237 198525 -164424 -239148 -35651
12148 10197 323401 296131 307704 129605 126554 80368 -80046 134687 144078 172064 107376
12137 107376 161937 94500 -23154 47184 233528 -148895 29432 -32083 169863 230262 -36514
12125 357584 -4466 294545 5818 215021 279330 98403 91714 337635 -97505 280195 -165441
12113 13462 186579 142504 22146 60477 124877 407219 340396 25993 111579 -74396 -78723
12102 -78723 62121 -3048 -148166 114470 281943 277870 89954 37882 408467 236445 -156909
12090 -29688 -54505 -131934 443337 142521 -256625 1851 256677 226430 342475 158177 -30427
12078 27685 185604 147035 33854 199055 -52429 113925 167319 285817 442737 197149
12067 210140 -102908 356697 219861 128607 -106438 140238 -202555 -6870 399399 -59300
12056 79743 93090 82157 -82647 117320 21312 -101728 59728 37885 91851 82281 37694
12044 14322 -73691 -55853 175699 -138616 -85529 336756 6299 -117211 169528 27083 -273855
12032 35938 81130 -22050 -602 304481 84158 -189187 36775 126475 99 -7985 83405 78643 127177
12019 127177 36893 -35747 91128 -85306 184904 54921 143470 350099 349502 -127073 -182676
12008 -182676 159613 -22473 243321 24388 -47237 131882 165857 61596 -91972 -43759 185740
11996 -142220 -224334 -338831 -69709 193274 -141334 -147174 -45191 191695 -194520 295950
11985 150532 42536 -172711 -314939 -103381 114451 -8573 -195704 -116693 -32964 -236170
11975 -236170 263333 124444 428776 6079 -274360 -58769 -54144 -359801 -223653 -186054 7874
11963 51834 218020 133575 -216821 -230340 -126584 212864 12224 -30985 -65429 102142 338010
11952 338010 35291 -66587 -86352 -53350 262678 -250682 -518796 -145711 96620 -199542
11941 30389 162989 -119483 113923 358518 -57550 -164846 206601 -103532 16001 -239758
11930 -162233 -338668 53439 33808 185768 42833 -26966 -293644 110711 213550 -173325
11919 224522 69741 -168839 -25831 437864 194468 -52238 -43520 85981 70189 58204 243386
11908 243386 -44979 34901 136595 -104074 -231609 66172 132966 225336 140191 -252012 139155
11896 135484 -143658 -51895 30516 87099 154921 -237962 -389741 363624 63466 2259 -14559
11884 -166467 -16411 93431 -269800 -193261 -181319 -62136 30385 -417460 270303 -119623 -105572
11873 -105572 -228135 -38824 -187746 533836 326999 25271 -89831 -248939 148356 157324
11863 157324 71200 -273246 -333159 -141075 -96972 -182866 361155 -137338 189045 -249629
11852 -17835 -144506 73956 189524 21562 -27313 -107684 -244975 115011 136732 -155370 210204
11840 97297 -253789 126939 56804 144067 119629 141323 -144738 -183385 154880 337547 -273982
11828 -12494 -90314 -39155 -208930 -153080 -43389 37390 -476801 -47084 -149839 73073 -317453
11816 -316292 136753 -61397 253796 31558 46700 -43551 -719246 -613850 -69856 -104529 -14450
11804 -57215 26035 102175 -8365 196647 33557 190653 802 -46541 39235 228428 -140990
11792 84476 151667 -86477 -437621 204318 182118 -69210 19866 -164321 354740 -275067 -253358
11781 -253358 -107489 -34471 -78673 -82988 165170 -42362 197181 13641 144400 -633122 -35572
11769 -147682 -114232 -166394 228440 76914 -202870 -107988 -51966 -27348 -351927 98401 -269207
11757 -55104 -205417 80061 -217875 314586 -90190 104601 -25767 -33200 198675 -110335 148115
11745 -90616 -74229 -163029 -56506 -268447 680511 21431 47214 402466 538723 -97507 -41311
11733 131395 38244 -170568 -12508 -5301 -86500 87405 108423 -182175 37854 63260 -235723
11721 127835 138600 -159397 160543 35705 45225 215727 302009 -5912 421763 -177780 203103
11709 -50738 -153324 81935 145082 770 54648 238373 -86991 47414 -108689 211776 -167877
11697 13634 124297 -21322 -40582 -5038 -200504 6657 -200855 34399 -32914 3034 143467
11686 143467 -110454 -23900 309554 -50486 -117160 -67197 155156 -344809 -212620 -93164
11675 30560 77723 -174681 90005 23686 -51096 62907 -18771 114133 -109756 2285 328065
11664 328065 55636 181264 -35571 233517 -143709 126422 -54371 -130808 -514382 344999
11653 -23426 -52399 -1059 176771 229590 338176 147423 58816 381141 254562 -116719 -8308
11641 -82169 123146 137025 27294 74544 -88642 -34061 270264 -3733 -87647 -39804 110119
11629 -184026 188206 181944 25829 -75193 303561 132253 -119545 249584 -66469 428020
11618 108346 -53127 25224 -86743 244086 38023 -239322 -30091 -68860 122881 257023 108402
11606 475306 -95832 297878 -4054 -13784 -155097 88066 164501 -137511 -94591 143460 -1947
11594 57097 123292 -94177 265678 258054 62769 -2286 68045 -227913 93779 -26433 -10849 327218
11581 51680 84240 -19499 196219 -170920 138036 -49679 -84185 107745 223826 -204596
11570 20282 376512 -51730 181574 198628 290024 28218 311365 -150523 252009 76237 -181029
11558 17212 80871 114959 -332660 149773 61689 154761 336027 -15246 -12215 58231 63163
11547 63163 187568 69 266319 -156785 -294962 442183 43380 -186417 152912 -120418 170903
11535 30172 218791 388357 -161238 44396 201950 234486 47990 -79339 88525 79736 -42280
11523 172456 240037 232774 156512 21574 230942 142314 9684 284714 406079 223729 -10399
11511 383044 24883 50653 91555 -89623 270074 135298 7448 156606 207773 -58976 164569
11499 217477 115775 64621 302594 474050 -202954 262665 172035 521582 267004 22900
11488 221560 74790 282239 258305 72461 126987 -5175 -150107 53016 368438 -59754 32563
11476 76106 135927 329737 15226 145163 461480 -19218 418880 40281 331981 371366 250954
11465 250954 131568 421036 223497 231043 64865 246419 56274 254466 155108 129680 54923
11453 189621 -82486 250388 -317988 254080 229428 371777 168574 21335 415597 169712
11442 167660 -59685 157142 19947 194598 -163971 -122352 -30565 12880 41681 89303 205168
11431 205168 14092 215813 55902 -1612 61194 -64223 84187 -138745 41416 103322 5488
11419 21763 141255 -170704 -135638 -135974 406808 -74291 -111284 100487 21287 128840 -4694
11407 -4372 90278 49073 51084 85250 121444 -29235 190307 -74571 343814 10727 28075 -29105
11394 -16808 -216634 114071 -164794 -59173 -111807 25769 99720 104478 -195398 156447 -261681
11382 135008 -526815 129462 57821 162294 111182 266633 -61645 200501 -190557 513356
11371 -11913 10146 -118764 -241111 -124657 8663 118210 -257258 33635 200745 234716 -254703
11359 92670 439328 417076 -262562 -44824 59848 151974 183447 -201556 -185914 29763 214925
11348 214925 166982 144446 142096 37626 91398 183575 242127 -212295 4581 -217218 156796
11336 -282491 -2311 -95850 248060 -271835 -118127 -151031 67918 -270474 100999 25198 -217138
11324 -164067 -179405 6271 9663 -279662 -57292 -134136 175722 -106339 -147617 -44547 163925
11312 28601 137699 300241 230649 -48564 -107666 -151586 132854 -287330 131805 69341 -216372
11300 -63107 192880 -299650 -231680 -181732 227390 -163803 -377707 -42918 126246 209554
11290 209554 -39339 84237 196833 8830 -111893 131503 241226 -38928 2044 73379 -262160
11278 54332 -103958 21608 -31368 -169570 -88998 -111015 -144476 -497067 149343 39441 288092
11267 288092 56494 71599 -34716 -412405 35194 -137037 -256959 10248 -223066 -256332 86730
11255 -198979 -220553 -199954 -91076 179647 248796 207358 -75253 -59532 -138694 -81659 -48643
11244 -48643 -90940 -68275 56050 -103590 -66240 -87796 43732 -73028 124681 112940 8583
11232 -79305 -44137 -39884 -102458 -318370 -206356 51706 207145 218431 -147661 198986 -157811
11220 -276031 178 44733 31810 -6716 -37147 164025 -207003 160971 -24138 -188903 -163993
11209 -163993 63044 -224139 -189427 -116304 -38035 -82309 -138401 -264115 118491 -154935 -405046
11198 -405046 151603 29713 -561721 -373379 -300763 58760 94405 46838 -331193 73181 141044
11187 141044 -8644 -184837 55617 -192917 -65180 168499 -100403 -162993 -27726 -152099 237558
11175 -80620 206001 241996 -210814 101538 -581317 -123463 -18723 316658 26835 234371
11165 234371 -237598 -87440 -93525 4753 -88737 -45 -96565 -70202 -145010 64339 247096 20517
11152 -6245 -142707 43904 -304736 -36824 28676 -73992 -251341 -151344 448509 107699 -53020
11140 137981 -54160 -313679 -260606 86308 -242487 -109957 -174497 -192704 -14549 49717 308251
11129 308251 99199 101678 541347 -26030 -17374 145455 309741 133686 206927 269678 -29272
11117 -167492 197985 142800 454445 32240 126763 38065 342787 -54098 117026 -68315 144589
11105 311862 89065 -45091 410127 210271 -143946 33665 75491 79942 59990 411140 154596
11093 349481 100246 257691 82227 360350 336905 381010 205146 276505 332391 367746 295716
11082 295716 290793 368750 101489 195784 303934 322516 121425 120210 555620 315369 407419
11071 407419 -97853 241767 426195 -26926 167696 616638 494661 397415 651696 391067
11061 391067 573102 -24224 459213 495809 795294 793956 851035 853463 729310 615755 806977
11050 806977 917234 681481 862473 793277 709509 1274156 1286779 1048607 972579 831321
11040 831321 1089200 907707 1063186 1080520 1205400 836787 1088029 1292106 1161153 1133799
11030 1133799 837261 659537 852468 1105318 1141541 832456 1165820 983115 1032281 1145353
11020 1145353 967806 895921 1093068 969906 536636 742943 958545 668536 819286 799965
11010 799965 946199 491030 728570 915271 795166 405901 910094 987758 855214 639744
11000 639744 833928 1052747 581035 473158 801707 827483 826196 799912 690037 722956
10990 722956 1019357 936436 1086283 1029802 844677 847323 974627 1157353 1190856 1310904
10980 1310904 1123770 1223830 1169599 1332701 1384635 1597695 1793687 2054359 2269738 2886864
10970 2886864 2718677 3275575 3150760 4064206 4079388 3883649 4190560 3899616 3409008 2900401
10960 2900401 2430443 2221486 1769161 1811713 1826100 1965651 1580295 2025473 1559392 1633293
10950 1633293 1731362 1760676 1477803 1014092 1319638 764439 690670 756893 171582 359040
10940 359040 92840 -177399 310293 408225 244794 434759 147134 403377 9198 457636
10930 457636 57012 -13387 335435 -122102 103840 135433 -129709 166389 154545 98720
10920 98720 -266669 16488 357388 -172167 -16116 38027 327371 301200 294617 187311 -121124
10908 -118474 202606 -118174 -419792 -16241 129412 278741 -86832 29673 205903 7114
10897 517488 360085 29106 333293 -226720 -128795 -40658 16833 318957 75370 226043
10887 226043 -86164 -101242 152948 72408 -116920 -145527 231699 15085 130688 -158313
10876 -126629 -366011 44642 145274 138124 -134419 -38895 15442 -221486 223850 -103012
10865 84919 -30984 -186900 -17721 -139796 1238 158516 107672 -15040 -75680 -117740 92912
10853 -210182 382856 -17560 -111212 284795 135768 -162606 -136445 -15975 -231153 112822
10842 -18870 183094 118057 -54691 -214758 11397 -109229 18839 -250229 -186995 258529 277921
10831 277921 154948 -35723 -120624 11663 -309125 -38082 -313314 241814 -69693 -217414
10821 -217414 114453 20882 -22084 160518 -441898 -96175 -227734 -273510 27370 141965
10811 141965 71779 93759 -96166 137951 -290745 -65523 -154821 54104 204017 -173556 164416
10799 -170242 -313873 -351111 -439811 -380009 -200367 111694 12359 69105 -118662 -137960 -109185
10788 -109185 261730 -42112 -201156 84268 -34680 -170973 38704 -164470 25153 -124961
10777 -131844 -219061 69429 -88777 -55139 248224 -161536 -155843 14673 -123027 -105687 -88062
10766 -88062 84962 114149 59281 -115300 105971 48181 -17669 -198555 -2270 188345 -414890
10754 209707 -158688 -2580 -471644 -118584 222752 60521 -211332 96748 -176102 220710
10743 132148 106303 -20708 -462240 -294490 -36248 -219853 -155790 68550 -195188 -169937 -371294
10732 -371294 -88067 -80625 -40219 -152789 -49333 -58457 282460 -95376 -147332 -119425 38375
10720 10232 -35612 215323 -60790 -101524 -18319 105041 235871 -250598 103660 -190099
10709 177604 144222 -21064 -214682 -177397 -263928 -61366 -147155 119301 134257 188087 -1240
10697 201505 -123589 291752 2717 150615 -42915 -120662 -162887 -196237 140770 -229038 121408
10685 -195853 -240037 41982 -238401 -324224 -39518 20542 -24091 -111375 326653 28215 148791
10674 148791 133178 -63593 -186855 70020 110335 -16875 93429 -30440 -193703 -188441 -99315
10663 -99315 -305083 159971 -56085 -120357 -83627 146453 -129528 6830 146315 -195954 -7798
10651 74239 -129775 261678 -177910 209660 -70743 -113895 -238193 118421 -148062 -136580
10641 -136580 -110976 177954 -19852 -228933 -14776 171766 -221820 49508 -181095 -159251
10631 -159251 -81758 -184338 108190 -146140 -313814 -66176 -386690 -29028 51499 -282761
10620 -101028 -8509 26208 120112 -367063 -104638 -165051 -174669 -317088 49325 205685 -445928
10608 5795 100080 -24440 -131716 348278 -74134 -244487 -4657 -152490 147314 -177719 39797
10596 470380 -7017 119772 -243141 -118960 -207737 -247262 -124433 96038 -139742 -139511 -204416
10585 -204416 46192 -390594 91256 -69058 -190942 -135461 -304104 -290978 102496 -133079
10574 -188326 -193099 -106525 -70714 66369 76949 5027 108036 231991 -126061 -13336 -38466
10563 -38466 -150687 57408 114740 -57712 -224807 471461 55260 208280 -320146 169319
10552 112863 109878 24378 -66821 63619 -171565 -113418 7029 -51617 -43860 -324874 147283
10540 -100873 155951 -153959 -238322 -209138 213603 -162049 -264263 -142387 124304 -282166
10529 -204891 173557 75107 47388 -126480 68249 -203520 93661 -44854 75635 -26178 -117156
10518 -117156 -69071 -266738 -179218 -12855 -56007 103056 187197 -296979 -369954 -3734 -438746
10507 -438746 150378 -409925 52223 -96482 -6864 -238293 45783 -47720 -430904 -164784 -338328
10496 -338328 40648 -131387 -72563 159774 -128777 -110943 -46310 -78328 -256693 85849 35774
10484 162034 60440 -69110 -107496 -94043 -83664 279658 156613 258583 519022 471703 617069
10473 617069 427538 409120 473113 197965 -3634 244093 -64069 257700 155877 184510 198723
10462 198723 -449142 286618 -155058 -148782 -122777 -143757 33349 75504 210265 -229024 -189033
10451 -189033 -60558 -139900 -63830 91799 -404716 -100163 -137180 -159490 114620 28285 -226003
10439 22877 -64974 9700 27266 103191 16551 -55597 97300 -195696 -359151 91445 -135483
10427 -49336 -76440 -74454 -18233 -54883 -169658 -130737 213710 129687 135871 -33966 141826
10415 144007 -336394 -110285 -16213 -65710 112425 155200 -102457 -198754 -322160 22744
10404 -105927 193439 140057 186282 176484 -98160 311055 27713 222349 171254 -304228 202032
10392 171585 246460 315337 38766 -108435 183015 61734 155392 -105236 181442 -255555
10381 189287 238815 -96045 174590 58634 253865 141052 289584 316750 388598 98553 518570
10370 518570 189007 288585 275224 274488 400854 242396 519652 481944 341205 420953 614951
10359 614951 596553 305362 308755 -55791 181300 417142 -74041 379524 461778 15923 468623
10348 468623 592920 763577 405964 -105882 459428 388186 399719 666353 324102 90313
10337 145211 420094 144221 221547 46980 491555 185477 47051 125065 333389 130704
10326 274207 -34919 83849 268993 202918 208416 485112 214037 483726 393988 426992 463139
10315 463139 545726 -121332 320675 318418 169078 -202478 204254 -57981 -132756 103764
10304 72048 197289 317169 -109977 -152741 -34381 196863 347649 175455 -161563 -13002
10293 31049 68030 -152337 47804 -179601 258979 184293 -149976 -254436 -17471 -208125
10283 -208125 -5644 -295562 -277390 -263192 -200187 77852 -12570 90613 146241 -28682 28206
10271 201842 -4988 267098 -225743 -31848 -143624 39777 -143158 -158699 -38605 -187430 -68928
10259 -246303 58135 -212768 511276 35532 -155524 167766 180359 98051 463095 461506 240759
10248 240759 -66038 34562 31622 98106 195281 -243602 -360559 180572 -25251 411460 116126
10236 -84117 20450 126324 -35319 60596 -16808 -58762 -186283 -94559 45379 -54901 -105782
10225 -105782 -115742 -258653 91648 -219231 -222459 -14519 125482 260570 63577 44350 -230788
10213 81531 -131731 -147740 -75788 49651 -120051 -4539 43276 -116486 -89274 -94270 -467142
10202 -467142 -84629 -171823 -123360 -284987 47512 -48459 -80782 -142548 -113250 -287606 -143734
10190 -149204 -259431 -130230 -39126 -54915 -168026 70831 430250 -154480 -332261 24655
10179 -24871 -204648 83231 -81572 -127874 170926 62559 -95544 86083 -85550 -45464 377917
10167 -21111 -367285 90579 -15017 -135840 -202482 -191168 -178408 -136430 -321390 -3486 179289
10155 18826 -256099 91721 -1899 -160508 91957 98350 -107843 16903 14773 -236810 123339
10143 -65532 995 -57153 -468769 22475 -76616 -334463 -135839 109421 -137329 86260 -123579
10131 -233857 -58215 -504714 3835 133910 115322 -210951 -149584 101888 -227408 -260214 -211063
10120 -211063 -406846 -261182 23914 267088 67725 74454 167688 137856 -210622 -138187 -182351
10109 -182351 -326004 -61928 -153287 256889 -19775 -205253 -179331 -82580 -77349 -356659 7960
10097 -72759 97951 165817 -128542 -125593 148866 -87162 79004 42991 -27173 262129 177523
10086 177523 -103999 -177972 59896 -20130 -139251 147739 -65268 313827 70342 -44926 -283077
10075 -283077 694 -307178 -241121 -269647 225769 -252659 -235162 -305677 60945 40573 189782
10064 189782 353753 13833 -19650 -178518 -20762 2024 -170730 -58752 -119993 -78264 293620
10052 -170965 -176874 -78338 -78923 43654 213429 -76541 71741 -179478 -122615 151773 -228095
10040 334153 -216981 63849 -38070 97290 -238277 96655 -390352 10413 -302154 -175492
10030 -175492 -68958 619 -19622 -437488 160654 -186891 -42459 -144738 -142644 -186872 -22253
10018 -418667 35000 50942 -401116 -102859 86038 3728 35470 -502656 276973 64387 -106004
10006 -21308 -59275 43987 13784 -3025 -108919 -320932 -281285 -110495 -260245 79255 111428
9995 111428 -78350 149115 496065 7261 177272 -165780 -328026 -39185 -53522 109814 -151591
9983 -314036 83472 88988 26359 -269563 -126987 68640 143153 -253813 -86634 -179036 -427561
9972 -427561 -143864 -147071 192161 170138 -230335 38977 64299 -249453 -249058 -353196 -506440
9961 -506440 76436 172108 127911 -241164 -218139 -329513 -91807 107474 -142075 39371 -4646
9949 76529 -373656 224590 -169266 62331 132708 -38949 60082 8316 -41172 -13748 -70450
9938 -70450 -96182 -72555 94208 -103685 -36540 148836 -18701 -229391 21773 67499 -366333
9926 214792 -91472 -157548 -75165 -6794 -97615 -119490 -95253 -77863 170511 -405731 -33796
9914 -38636 80268 210012 74865 -263733 -95027 94012 -334407 -238036 -3764 -226711 -245746
9903 -245746 -159002 -153625 8408 -180062 -295033 -111582 44325 363161 -76507 -221417 123544
9891 85423 -138449 -89215 -48119 -223363 -47683 -60285 138541 -211795 269627 -128658 -115792
9880 -115792 -136310 -160532 -325523 144845 -38877 -316585 -188778 197669 71286 31139 -189559
9868 31817 -34335 -158607 10622 -22196 -123004 -150255 -70731 -132103 114524 -216306 -5311
9856 209730 -305677 -341466 -41713 430533 -277556 50885 -29151 319502 -169237 131443
9845 -49784 -163817 128687 5161 -21087 53690 -238216 -133187 -270030 -634640 -140213 -1868
9833 -154715 1853 -73539 -195016 -183454 -108041 -45832 17394 81505 -399482 -115305 -139861
9822 -139861 -259433 -42939 -326423 -244228 -277109 -145347 -16125 20385 -8724 -185938 -12762
9810 38850 -84391 -84408 -31200 -92283 206568 -215879 -14336 -43550 103305 -284627 -134515
9798 -114088 -108036 -136471 116171 -316115 8621 -202292 -253222 -211389 50412 -192714 -99593
9787 -99593 -233824 78057 -103923 377950 195590 -237345 -160208 -227431 115981 154872 -197528
9775 -36299 -160827 -118291 23379 -144234 -267177 25456 -103259 -273850 -499499 -20504 -291996
9764 -291996 -213534 -177860 -325537 -77190 -1110 127953 -142496 -86716 -76186 77241 54764
9753 54764 -206709 392094 5058 57559 85407 -71774 2960 40949 75889 77756 -185780 -175950
9741 -175950 -94187 71522 149791 14453 187533 20307 -215926 2162 28733 -203235 -107673
9730 -107673 85154 -11630 -211609 -44998 30152 -103910 110235 -145571 -54128 131778 57340
9718 -231440 -44030 -188935 -161879 97421 -55055 -133945 110907 -259114 -78867 -171290 -25303
9706 -177046 -91159 -10823 -231398 -44791 -49224 106244 -33029 230372 94969 -198311 -55977
9694 -277994 -193054 -23887 -138328 130966 -49368 21875 -204037 -225380 -215838 61891 115181
9683 115181 -541220 -118872 98399 25698 86143 -133806 -194684 74025 46564 -110689 127115
9671 -259064 201671 225990 287512 -69584 -260691 -109046 -167118 -16763 352056 -339447 54968
9659 -107723 96933 -76580 -344257 118699 -171758 90174 310375 169624 -271766 53270
9648 117047 -35342 22591 -165030 -51963 -447084 -138357 -231842 -41932 -31715 80248 -146837
9636 -301120 -115397 -118608 -187049 -40749 -18276 -162394 108402 -467580 -144186 -41457 -164098
9625 -164098 -90304 -13326 -57430 84274 -227242 36868 141569 -6341 -94709 151982 -19149
9613 49579 -184186 -119699 173554 89881 -23123 31088 -233057 108597 -85581 -129191 -460860
9602 -460860 -29155 -72939 72138 98938 -173752 100566 -17070 -18653 -256015 -404392 -191134
9590 -75358 12023 -178553 -10397 274885 204478 -93008 86897 64910 -256302 -83486 37254
9578 -69699 -91036 172621 -444694 -212992 -40068 -138145 26989 -77954 -362935 -157821 84074
9566 -56086 -311036 44218 -43606 -4070 -219972 -111265 -101274 -343349 186971 393606 -271163
9554 2984 7409 -81150 143257 -140866 -284482 -218186 502104 132970 -193164 65428 -214102
9542 95383 -25902 -291337 -16488 -156953 39577 -21863 -138843 141741 93089 28769 63101
9531 63101 -73327 -176348 -83451 -105511 144488 -193443 -251872 100561 4669 -154836 -107294
9520 -107294 -198960 88269 62230 49326 98481 -29256 -139130 -250607 346663 -23140 4377
9508 3956 -80566 -178069 -40611 -414889 -286798 68062 127290 -88365 -215489 47846 -42932
9496 -319298 -59559 26566 -57752 29572 -235511 -145695 109023 17962 -168284 123616 -316847
9484 103798 190975 -407651 -408084 149942 -252681 -113753 47416 -35493 188755 -52221 38769
9472 -39126 -2605 34613 2316 -222606 -248633 118366 23465 288337 -193207 -195932 -179152 -506688
9460 -506688 -196971 58390 -132447 -334424 32373 33986 -231455 -122685 15203 -250281 158185
9448 -312766 -121384 24021 -109093 -13224 -197263 1985 -351443 -52161 -493925 -264477 -67171
9436 -305147 -216592 22445 -117348 52081 -96013 271475 -99309 168067 159923 -260171 58230
9424 -6430 -229190 -210438 -73440 -326737 190061 47637 -6143 -316223 -64173 -150405 -176069
9413 -176069 2305 232228 102289 -49371 61597 198154 -164327 5668 -121191 -97112 374625
9401 -62584 -24408 -414416 46078 -110532 -168490 -217518 -149944 -384010 64904 -82533 160906
9389 -23667 73389 105412 236894 -27290 18665 396826 61522 72603 201230 -379613 176132
9377 -294451 288560 -113558 -133119 16486 24089 56362 -118257 -213899 -126524 -214310 39466
9365 -279803 114661 -23180 -171166 -123394 56766 90944 -337376 -139722 -34149 -342501 -109106
9353 6550 252103 -353315 -61080 -422270 79467 -138279 -74945 -70239 -233303 -87696 15562
9341 -29332 -470283 -151028 -384497 56757 77629 252195 83150 -38028 -279561 -76879 106157
9329 -102277 -64529 -18970 -303432 -76520 -131849 -8397 26776 -40162 59466 -43695 -219890
9318 -219890 33943 157250 -203325 81525 -198909 66199 -225438 -18137 -128734 -96810 -307842
9307 -307842 56210 235434 122731 -236839 -78711 -196866 -72054 -111755 -93368 -95889 -120258
9296 -120258 -59718 -70140 215787 157958 -217846 168918 -147736 -48259 158667 -91790 -12012
9284 -128307 -123114 -44646 -91519 -57051 -38498 -344087 -26154 -104220 -301064 -420370 20710
9272 -339736 -172526 -63801 -106360 -5406 266858 -81991 -335064 120741 -136665 161855 50962
9260 410627 -353204 -298290 -133277 13658 -2807 -324766 42156 -303837 185279 -123045 263811
9248 82354 -103209 -296886 109542 89232 -338703 55044 7034 -242023 183222 87141 -103024
9236 -197795 120868 -94659 52022 100434 150367 -172266 -484190 -435829 -383002 -308623 -156159
9225 -156159 -193834 -182705 145687 36861 86705 -348555 -126349 -135147 171653 41322 345157
9214 345157 -276503 101571 21486 -511778 -13771 -131892 -69970 87025 39607 -143676 66803
9202 173630 263863 96795 -15265 -185193 69698 -102 -24375 -107611 177827 151501 -222481
9190 -153786 22196 -134387 45186 -207732 83171 -214984 133540 -84347 -26767 -115730 304427
9178 -184759 -130641 114278 -107683 -211761 90968 -115380 -181591 -318148 -232424 -259354 293404
9166 118601 -400749 145405 -34646 -203206 -149484 138843 -67232 83303 61152 39968 31881
9155 31881 -4403 285769 151787 94297 -302551 -18919 -126364 10118 -238956 -356881 -208131
9144 -208131 156282 -16462 73300 -178790 25237 167438 -338175 -279167 -394126 45926 12453
9132 -401259 10791 309193 238408 -24824 -171294 227733 -124496 -136219 -173148 -415572 -135211
9120 140085 252842 -100382 -346874 12201 -114800 -86879 -2453 70508 -174544 -161578 -193755
9109 -193755 -269452 -82330 -99460 -474100 282172 63791 -230758 33830 -147103 195173 118307
9098 118307 -23195 -75549 -31975 201507 -135995 296492 102294 -148661 110182 -473979
9087 -334524 -110535 -198629 33434 -262802 53334 -165135 -81442 -224511 114554 -41927 -193812
9076 -193812 60935 -617134 -15335 -293916 -45612 67314 74292 -76525 32418 -60486 52776
9064 -35715 -74640 -151901 -26558 -396576 -222096 24895 -40297 139889 90137 89933 -52140 217841
9051 -154655 217799 -221943 -172243 -89233 47619 -395583 -92558 -292677 119031 138287 -188715
9039 -107949 147462 135738 -111821 -99047 32377 -45394 -132676 -257783 -227635 -155036 -46092
9027 166415 -219677 204455 -326719 -362909 -156979 163387 -79378 -120550 -243014 12232
9016 -220016 101020 147819 -255599 11037 -342867 62718 -92132 235411 -182877 193491
9005 42156 -13077 -287489 -74274 -224050 157915 -204300 -109890 -214864 -225124 29122 -196762
8993 -168040 -367943 -349739 51751 -65076 -115424 68212 137184 347259 103205 31556 145588
8982 145588 274223 -372630 40315 -431495 114843 -139908 -48544 -94422 -107341 -109336 8423
8970 -334824 -97138 -13138 -140071 -14579 -174912 -48032 -129382 20329 68475 -73882 -278857
8959 -278857 -45432 46296 -161352 -48575 -288456 -172075 38283 -138836 103006 -349933
8948 74530 -2927 -157478 1025 -222865 -66830 81135 217369 64949 62101 23348 72576 10564
8935 -239671 -155335 74235 213820 340804 -68784 -99622 207395 212828 124094 -83481 97 -106631
8922 118635 426856 1077333 4388039 14126380 3617992 1436288 227174 207001 344940
8913 344940 105205 270652 339341 61051 -125089 57467 -123253 208160 31655 -27081 -391616
8902 -391616 -267867 -230311 231941 153101 -337950 135561 34005 -94527 -289198 78107 -20690
8890 -261886 174406 -90469 -87800 -35206 -133384 253166 -434041 125593 23361 58211 58281 12837
8877 176532 -554636 -412315 63693 -23494 120347 -65854 267870 -63275 91353 -20734 47908
8865 -93156 35193 -38237 -70832 62397 5453 -79046 -255665 3790 35142 -14467 -334423 -217929
8853 -217929 -76434 -1388 -229687 91076 -179193 49699 -98455 -93358 284050 -403684 118133
8841 -8336 -252793 -14038 -8080 -378599 -55652 -176070 -108709 -95277 -40233 58717 -103629
8829 -46169 -115818 -188766 -73213 139035 53640 -159982 73894 -209432 -28768 36440 150416
8818 150416 -128609 33610 -197314 6692 102163 -197806 -213611 -12653 -112396 36527 42121
8807 42121 -295316 137434 -200922 -54662 -183939 264251 58542 -222511 205591 -12105
8796 24208 -135955 251658 223260 -279446 -165454 -63829 -144789 -126946 201248 -108875 -64799
8785 -64799 -121395 -75544 181021 70009 61253 45707 -214367 -7519 -184058 -205803 -175925 -82847
8772 -50563 -47093 -299654 -92202 -143619 82776 -160015 15825 -19949 129202 90945 -172058
8760 -149086 -12425 -70302 8086 12247 121387 5005 191456 -144036 -117085 -378664 189512
8748 -23018 97855 -40994 -379278 -420653 -130358 289275 294797 101120 -300015 -184684 -115461
8737 -115461 -418131 -105259 -276720 78341 2741 -238584 -36144 -119228 28966 -203141 -233515
8726 -233515 217060 -279677 -152142 -171698 9265 -194021 65348 -71869 250343 -443851 73415
8714 71189 161876 -113857 53792 287682 -436158 124280 -128820 -201010 -80820 42083 169762
8703 169762 -32191 20487 -57097 -49963 -47912 -609509 211709 -184006 -107052 384149 -152228
8691 -507349 93466 -233529 34499 -204497 1048 153926 -424571 35497 140185 -122516 175657
8679 347897 233966 -140621 104928 -278279 -5172 136873 -196520 86977 -70051 -149862 267522
8667 98784 -29416 -15138 29427 -26834 -17276 75103 -153097 -1514 126932 -195286 7361 159750
8655 159750 46006 -126223 1255 69976 -101198 -169808 -60011 -64084 -120302 -157896 -105606 15057
8642 31586 -199172 -139307 -31447 -100560 50321 149028 -116138 -22961 181196 -451932 -1666
8630 61395 177673 221567 193854 22001 -89863 -26235 137598 183103 161939 178588 133940
8619 133940 -281228 77192 112131 -159420 -124298 43904 335117 -271677 -76365 -1963 -56580
8608 -56580 132134 -128989 41320 -267946 -107593 -89478 44066 -166425 -76604 141129 70448
8596 -292581 -1014 20316 -383715 -143572 -150747 -59837 -266474 116182 -194348 234721 -101508
8584 106276 20727 -150838 217638 176814 -29741 -174273 -224893 -18354 -123453 -157505 120392
8572 -197996 48386 -320181 1923 49157 243041 -110208 -155239 -11102 -176730 -335605 -68091
8560 -182664 5908 -261607 -190583 64892 82317 255416 145058 -74171 -79160 -98835 -231674
8549 -231674 8703 -219841 -28146 -203030 -222453 40164 -33959 -118812 32907 362198 110121
8537 313787 -337576 45386 442322 203740 -55512 -196533 113336 -273629 16557 -70709
8526 -149885 95878 -19066 -321949 26719 -159541 115004 -175718 -24707 -60076 8877 -324000
8514 210376 -111921 -399703 -210153 -29591 32894 -32636 96974 -358753 -238605 -38651 -215580
8503 -215580 -38378 -95425 194481 -309849 -119033 21785 30347 -23299 -103136 279618 160583
8492 160583 -8979 -154096 -236922 215571 -273484 -286061 10537 -533491 -113957 -262452 -106987
8480 122340 -51961 -63788 63096 -100156 -151029 261713 -33373 7979 96226 193974 15271
8468 -139550 -328068 69512 -133823 248542 -286493 -296134 16771 -355938 134904 401399
8458 401399 111176 66540 -105269 160617 -226569 186867 -77413 -7056 -159120 -153735 -26227
8446 -113346 -29847 -32645 -165069 -93810 -146559 310427 -199462 -208226 -280406 -232301 81207
8434 150438 383577 -128229 1096 21118 167806 -186765 85250 -98315 -387238 230459 164958
8423 164958 64835 145101 72 31834 -106064 154890 317801 -396877 -160943 -100399 89751
8411 -113334 -235589 75257 -209048 108527 -472178 15463 286107 -104685 368464 145947
8400 -50382 177494 -11872 -284600 296739 -175240 22239 -228318 -129054 -48599 -27343 -275103
8389 -275103 -363275 191798 138923 -141590 -125507 -207 -179386 -134927 -77805 -74732 -8549 -216433
8377 -216433 27921 285167 -280869 -35270 -113266 51955 -51715 217072 -319794 -18317 -22088
8366 -22088 -73149 -11246 -142812 -128289 -43375 -102217 15577 161141 140325 -406313 -207072
8355 -207072 29602 187123 9423 -268233 -174772 -153827 15169 212235 -55171 59175 -295914
8343 71164 -140083 -46907 -57583 -304933 -251719 -178511 -241253 -88247 90661 25290 -100886
8331 -357419 96353 -81510 191748 -180260 -121510 -98951 268674 31817 -6501 -98830 -91925
8320 -91925 21823 -184950 141018 -244567 -60743 254861 93249 -236581 -203489 -275028 74463
8308 102498 68881 261730 -109030 60129 -354559 -31156 -270248 -84167 -179366 97537 -67583
8296 87872 39307 228827 -177878 19111 -112442 128341 -63586 -54898 455785 -63997 -115969
8285 -115969 -225988 -150768 -272547 45001 169507 -14318 -395681 53902 -337925 86456 -101768
8273 -24644 35551 134343 -265443 -106951 -180166 -71294 -287383 -285495 -102186 -98102 136160
8261 32008 -125581 234438 -223395 -329508 225654 -22715 -157507 81441 -256902 143891
8250 -52896 -111993 -303383 -100922 36064 227831 -224839 20081 -160349 -115834 -516133 -101405
8238 145849 45195 7444 -5112 68475 -26281 120385 -98202 -46153 31587 -105158 262544
8226 33723 127344 -78232 34895 -118377 61580 -221779 -380919 -71102 -115590 -199678 -91210
8214 136615 10339 -417776 334924 67993 -346080 -134495 -261342 -176331 -186339 -30935 33218
8202 -10755 183699 131090 -154044 -198903 -205039 -287688 -541819 26416 16429 88109 -109308
8190 160942 -170867 101938 -347676 19019 -184457 250708 -137342 -15087 20333 240348
8180 240348 -376930 -312096 -41840 108346 68049 -159487 -438157 107174 -238038 122357
8169 -371401 33642 58337 -16551 -155026 63163 37468 -78969 -185666 -122645 17745 98335
8158 98335 -259100 56532 -146436 176890 145686 1611 -127287 -212021 -249026 -185561 199626
8146 -116063 -52620 35261 354519 -249522 -167228 -5428 204050 119215 -64104 133171 222919
8135 222919 98516 -34450 90818 139060 -292365 -124687 43653 -28528 -130963 -4034 -283048
8124 -283048 -6916 -115760 25317 -24396 55759 -119849 -482488 -141966 219904 86784 969
8112 -246277 -384754 224419 9199 -237985 246157 -323214 102344 18153 -394365 -62488
8101 -114683 -135045 -197038 15604 -39540 -110744 166530 -124533 7993 13979 -173887 226278
8089 93683 34905 27169 -64022 56828 191161 -242139 158775 -118608 -145056 74442 102466
8078 102466 -147476 -11703 -241093 89605 -28286 136730 -203189 -244663 -118688 -5421 149933
8066 -15430 -100428 226329 -114320 82396 -562126 146640 -71316 -333876 -214656 -117520 -35862
8054 113512 228630 -153906 -181254 319365 -136910 238456 -18262 -188618 39016 46080 -140420
8042 -65103 -23470 -371907 47328 56741 283427 -66558 -207181 103560 212909 -166017 -155145
8031 -155145 -50212 -43821 274374 -238489 -255275 -38465 -404274 -81564 349524 -121762 141369
8019 4531 111526 85136 76356 -20555 142689 -29279 203984 81430 -88434 -318359 257403
8007 101732 329316 -129113 -162727 -62541 59560 17700 149887 -249845 199687 148466 54166
7995 149377 -264354 -192252 1884 -289248 -142969 318173 -59469 125476 26409 -74069 -416812
7984 -416812 128167 7048 -123845 -61034 -423733 -205710 -200020 -316837 -38391 58350 91497
7973 91497 69558 -130360 54463 -204960 1235 150791 49015 128720 202905 -30690 -55392
7962 -55392 -155957 155480 44534 -141580 -269811 77583 148307 -128844 -92043 -144283 -319121
7951 -319121 -78736 -27115 -176923 -99408 78230 -130189 87288 130198 1267 162243 287201
7940 287201 164933 -328936 -11212 -82215 -326442 -43365 61571 -432156 -16313 -82058 226656
7928 271489 -246710 78151 409737 -52886 -216358 51350 -82637 -454253 -113169 -145216 89616
7916 240095 233788 -52925 369 198602 -250479 -338487 239167 -168297 -149323 -51726 267391
7904 -2605 -101937 -373378 -196111 -245647 161556 -134194 78708 -74027 122939 32177 -267589
7892 -336170 39626 162399 149637 -59977 355425 142687 47319 55091 -200514 -218191 -177246
7881 -177246 -166049 228239 -51152 168683 120554 -49919 -51187 36468 78668 449134 -203939
7869 -18200 358094 -121031 230022 -68110 -381892 247591 -67552 170237 -78193 -371731
7859 -371731 -342108 -72882 53313 169759 89396 -112093 48369 -113566 -50865 -274858 -48914
7847 -409040 -42492 -68053 -119509 -27337 -218998 -218604 -71708 -132225 61008 -70360 -217863 -475692
7835 -475692 241167 -82956 -109422 -196757 -66761 -165267 -246156 -236761 173256 -119173 -251410
7824 -251410 92671 18671 -54542 91594 124220 53653 -123979 -211300 -47273 -23308 74627
7812 -267145 -53170 322409 -195344 309604 -177889 19908 -333440 42304 -95718 -28297 -96156
7801 -96156 -101341 -119481 -225713 -48577 -271523 29308 -113433 56641 35455 184722 175858
7790 175858 -303915 -166418 303311 159732 94312 -42737 29089 -53148 13132 10691 -339624
7778 124696 -51640 116187 85773 173034 6575 -148235 151754 181841 374847 106277 119198
7767 119198 -133391 -381176 60789 -252213 -42918 3913 -53202 118907 35969 128609 222108
7756 222108 233838 37763 -256499 144381 1533 -156839 154483 138672 -273004 -116731 -128662
7745 -128662 -157572 87867 -102221 64523 50959 120849 149458 -91950 -56828 148342 288287
7734 288287 47793 -204215 63162 -41132 12888 -253599 -162883 -215092 190004 307473 304975
7723 304975 97204 -190797 163945 48241 -206560 -125906 -142106 -421780 -98869 -30079 92588
7711 224859 182347 213795 179475 -225638 -252210 135903 -94858 -297406 82012 -47375 -309
7699 119110 123956 104338 -185093 -303649 240122 -192330 -164322 127448 -182418 -173344 -55003
7687 -234519 -138532 -534 -2935 307955 142251 491052 -447919 -91665 48794 -140673 42735
7675 113372 183645 284954 56923 -67705 117776 81716 -134445 -55530 -263916 -186786 -331165
7664 -331165 98920 51271 8247 147652 130926 -122236 143040 -132156 24340 -74338 -190010
7653 -190010 136324 -33191 -270878 95867 115474 -116300 -174090 -126621 -120137 -2991 -71946
7642 -71946 91601 106028 -152562 -241518 -76621 -111428 -166389 -37611 61479 43703 85285 21676
7629 -79764 -182243 -331777 -276381 -330922 -351067 73998 3367 -233850 -6390 -163432 175621
7617 -86277 14183 -71896 20454 120700 36054 -175473 81861 104299 261989 3428 -225501
7605 -122700 134263 180830 -243212 -189377 284508 63000 19592 -143774 -168307 -241749 -129769
7594 -129769 -36490 199909 67577 30778 -165567 -340831 -284467 165086 -229587 -23424 26088
7582 -28581 131334 -33091 175525 -276529 -49688 -126411 -276911 -61076 -11176 -19371 -124863
7571 -124863 -15279 93994 -344911 139778 11747 -49265 -196250 -30867 -43899 197180 115442
7560 115442 210058 7462 98083 154010 115509 -216361 -33167 203376 27725 113028 105444 -87402
7547 -224027 20308 -208547 -346766 163034 -141298 -58966 -100367 119691 61266 -41172 122009
7535 187603 54302 77848 237229 -80601 -311318 -192591 109858 -134886 -36306 -181882
7525 -181882 -54544 44609 130498 324562 -67064 -189827 -78625 -288265 -82812 -196550 229843
7513 429 183725 3920 28189 -23619 145138 -99648 -219447 -202985 -547959 -12508 -147394
7502 -147394 -23320 123369 183833 -748 -98389 167350 -77423 120624 -34161 -241837 20418
7490 100408 63004 72803 -194776 -168853 253238 59630 -196746 -112521 -135528 -163356 -116035
7479 -116035 206370 117568 39604 5987 -275405 -17224 -194623 -144201 -160171 -185015 825 -146915
7466 -265608 165044 -17139 28746 127506 165104 -165991 -138319 56795 -173525 -203413 -383
7454 161041 -358688 -413370 25918 -249386 -71461 -54364 70829 61566 232156 43609 220012
7443 220012 15886 286219 145549 147927 -317068 -42144 61580 45008 40614 -246582 -83295
7431 41743 -121673 147907 -312160 -243686 -129002 -30684 -66105 18815 39775 98655 -277256
7419 478 179724 7609 -261362 -31542 29165 -75308 -28028 -288834 -169633 -26857 26027 -77434
7406 -35312 191 138633 239827 -381021 -25182 -77884 57372 141703 -121003 -231828 -284349
7395 -284349 17667 -138013 287787 286598 -13789 -32260 57340 -77862 37026 -30339 -19072
7384 -19072 135369 67156 -185402 -177971 -219453 92713 -297318 -38241 -213753 -13855 79363
7372 -31039 -37068 -79858 19672 64382 -46478 -200626 133765 38208 -155136 -234877 183696
7360 89478 -11297 279871 150917 105541 241684 -108484 -63122 -198122 -187671 -31451 -224893
7349 -224893 -208058 -324544 -199276 147711 129251 178428 -309807 -125357 -127034 67834 -389824
7337 281307 -259524 -7030 -68386 244464 25017 -146444 97320 -271109 -341175 81495 65607
7326 65607 -195163 193354 57764 -121889 -17520 242515 -266409 164402 311394 -38548
7315 -139205 -83247 -116013 -222376 357913 192412 243582 48502 -5195 -206791 -154883 21174
7303 181137 -21178 -191790 21823 -172312 -95759 -112163 -326208 -37328 -43274 91376 240991
7292 240991 94261 -147130 -122718 -167312 -32301 -249569 -79309 -255131 -435808 -141545 -170098
7281 -170098 -279357 107147 35386 -201863 -187515 118247 42476 220372 -140665 205479
7270 -186796 1865 240337 -68861 81966 -10169 -124779 4231 75879 -83522 -228253 2808 213233
7258 213233 141497 35116 -299926 251658 -170967 -183131 -75663 36252 -6679 -68989 -92362
7247 -92362 77494 -190933 -410297 -198649 -336695 3199 193184 -169372 -64758 179983 -362741
7235 -242529 31024 117856 -88503 45261 -144604 218285 113195 -25767 -308997 51959 70272
7224 70272 125684 -3397 -124638 -88825 -74060 -4836 92407 267441 -118293 135496 -115091
7212 305606 -248535 -228224 -35368 145250 -285562 42398 1 73544 71844 241932 -63917 -211350
7200 -211350 -4557 134063 -38343 -122638 -130651 24533 -219680 -351900 -115191 6788 -259089
7188 -167629 141927 103408 -57476 8099 43848 -188721 -329737 -165218 -107339 26624 7910
7176 -69180 141853 -225017 100459 -143461 270674 -323150 88220 -12641 -47232 -109768 -11895
7164 150887 405782 330296 87606 -285696 -49535 -122936 -69057 14768 -26230 2404 -62926
7152 83483 23766 34645 -107122 174342 -74713 -46148 214142 69293 -125719 482945 87034
7140 -180325 -164585 -146671 -36774 139785 44156 163290 -87822 -30997 8754 194838 -254536
7128 -130141 -41132 95615 42155 -151813 35811 52181 -248310 160739 -61533 -50521 115947
7116 -266914 -12824 -211557 -165167 -316620 97935 -244098 214772 -203432 34570 516295
7106 516295 49466 -120435 -335335 -66146 -24254 -71196 -268756 143764 -216389 241295
7095 -239860 -10790 -289153 -56292 -193527 35238 3141 -34182 -297215 18014 -9496 -161281
7084 -161281 -27513 -66343 -8247 188800 -84821 -408616 -29098 -59404 32941 115980 -342256
7072 -215700 196466 -26625 -65383 82290 198531 17017 -55161 46544 36096 -30367 36390
7060 -204058 -122936 -15009 -283344 -399893 264724 99977 -135777 -112273 149855 -26905 -176429
7049 -176429 713 76609 -188151 188125 198353 -8682 7557 -133838 2873 -65886 53060 75478
7037 75478 111677 -182599 15362 -177113 -97244 110170 70498 -354116 142500 -153776 33449
7025 25809 -216771 82604 -192920 -195613 180524 -347733 197795 -85989 10280 -25190 314087
7013 16714 348347 -171311 -173517 -181874 -135160 -149673 149108 -43533 44620 -344535 87513
7001 -59069 -14895 45032 65447 -134246 -5829 -2524 -250034 81383 -147994 -154493 -139753 -355585
6989 -355585 65412 -76021 91259 41802 -569251 39390 -122596 143312 -31533 -271231 -185839
6978 -185839 -61188 -267199 -181746 -202283 -308361 -109407 -204281 -67901 -115543 -215502 34220
6966 225462 42272 -133272 261084 429104 -34391 -24741 -126608 -207966 -8609 472094 63559
6954 5639 184548 174915 33928 -232893 105475 53843 -153424 26805 -69829 226202 -238115
6942 -215242 -190391 -1806 -61721 32604 -260328 -188970 191067 27142 -137570 230570 11777
6930 -298860 253257 -342910 278445 -139712 -103666 -187218 17726 6306 -57291 -84514 -181484
6919 -181484 17510 214623 -310513 28289 -147983 -13241 233278 142708 -138268 25702 -346897
6907 140928 -156784 -194207 -233643 -144410 -188737 11750 -123402 -280631 -145705 -36933 90744
6895 165755 146165 116724 40770 -131345 117478 -137299 -12563 -391 -163118 154458 179933
6884 179933 61483 -60547 -64357 145167 149919 55709 -26822 -15697 -4187 -243299 -64077 -166638
6872 -166638 283825 -152268 -184988 -77185 44489 69829 -46359 24941 -15916 194172 114494
6861 114494 -82549 -238817 -100242 150882 3816 892 -14479 -78946 37024 984 -62307 -73070
6849 -73070 404536 -126821 78921 5875 -78329 46813 -64022 -189756 14483 82679 214657
6838 214657 -305016 -66925 -68956 -112031 -305410 143842 10206 174557 22065 -64233 20794
6826 -120773 -67273 -123725 -227322 -110294 -106796 -318646 260366 242800 212798 388888 -359707
6814 -41547 303049 217640 350836 -197643 -263892 -436593 44899 215859 -321931 -51728 212716
6802 204958 41961 81059 4646 168292 -405599 -29900 -17938 -26581 -146045 -63172 -138682
6791 -138682 11380 196183 10308 100983 201647 -188668 -38307 327429 -330466 -83974 -244129
6780 -244129 14725 288509 -195882 -275256 75317 -23968 -180008 -79863 -147138 -92783 12584
6768 54224 100381 47204 25698 -146697 -432545 -257090 -75284 174332 -17537 41520 195820
6757 195820 -123473 173653 -158683 -162874 -99661 -138571 -337060 -54767 -257660 -58204 -107865
6746 -107865 -52352 -30123 151084 42008 -86460 30065 7691 110352 -319406 24269 130645
6735 130645 31826 -93033 113653 -342223 100396 28813 -187191 -296747 49346 172763
6725 172763 -31355 -207537 63226 216945 -114731 72630 -11391 -357481 54500 -30423 -98085
6714 -98085 -128409 -407157 309646 25719 -268412 -129091 83150 -193632 143409 272965
6704 272965 -654157 38130 278918 94833 -83583 62718 -60603 -29485 184114 -283187 159297
6692 -9002 -20173 -107855 129050 141634 -118778 -182889 -70261 -246502 -131424 -136880 -317418
6681 -317418 -154986 -213813 125593 73058 -450229 -178438 -275398 -224815 110492 -347891
6670 -89696 39582 107698 -93613 22311 83932 72495 7064 -64888 -78186 -74259 17958 63884
6658 63884 -256224 81056 -74509 -348806 90690 37331 281138 140671 -174146 93826 -179388
6646 -71185 -326119 214394 1734 119340 282332 -26316 -175089 -214674 -3598 -231695 33891
6634 -136355 -443166 82750 17829 86563 214861 -236223 -80969 -198714 -8291 -117630 115636
6622 349157 -323838 437296 -279573 321037 268892 43325 -238600 -47975 93077 18214 -70624
6610 10470 38047 -307204 -28302 278862 -38239 293120 -199958 14375 -340692 38617 87491
6599 87491 -188946 245983 -176166 71871 1849 85663 14954 168003 -30557 109977 -1314
6587 174948 -2397 -7482 122443 -196382 -182401 -143005 -102676 109138 116975 128676 66330 -137971
6574 -100573 -229212 -99701 63813 -77391 104675 -163997 -278572 -83776 -102255 145857 -223860
6562 53536 70557 -42174 -102196 89069 -33977 -11575 -482220 -230320 -377956 -230181 -74432
6550 54284 61161 122124 140093 39162 98847 -177930 26235 -147551 -107265 -67645 130173
6538 25846 40271 17471 -303756 -113553 89362 -99475 321045 -90250 -221147 50386 27972
6527 27972 100125 -367864 -36732 214194 -73529 -61008 -222707 153005 -200276 214640 52863
6515 217442 -185295 97341 -196698 149921 -193684 1338 21281 -142856 115576 -37601 -1049
6503 -360267 -212519 12366 75556 -81102 260174 122890 -202732 -113754 186232 125572 261603
6492 261603 -151363 -57622 -196525 271267 -387821 -170915 -39724 -23026 -283895 -138551
6481 105615 -424660 -82867 308437 -275190 -12110 126939 18641 -7941 -125928 19123 93737
6470 93737 245931 137779 -122270 55548 200543 -197113 -262795 -272811 -21515 116841 -68264
6458 -83745 146968 5244 -280682 -41372 -269943 -10584 415807 -109516 60227 -133598 -5625
6446 84064 68236 -128575 217155 -37404 -50626 -391543 -106628 151961 48029 -108369 8847
6434 59907 -92181 96207 -48143 101137 7417 252546 -517391 24592 135867 40825 113012
6423 113012 53583 -206228 399762 -300965 -394804 -518335 192144 -209830 188243 -27046
6412 102876 92763 -100500 -19657 -12020 -219388 -33986 -194771 305825 -28977 14332 -142645
6400 -90816 136512 37480 28686 -1740 173250 134611 31539 -193171 -160512 -73526 25896 167748
6388 167748 -299788 10083 152485 -191547 108646 35469 -127628 9229 274967 310476 275714
6377 275714 -7775 -97098 -40821 52023 17187 -309575 -48138 -38493 -146773 -201091 -110014 457181
6364 128072 -39429 48822 217879 167239 57121 -171517 366057 116207 -180609 10903 153498
6353 153498 20449 10594 316551 -190063 -248791 209449 -311568 -67956 27530 -135708 271
6341 -172192 366326 -156874 112595 31557 -111075 -8121 -118918 -173358 62836 51370 103078
6330 103078 -62855 -265859 -22739 267835 101246 144891 -46436 -5805 -86580 -174278 -73036
6318 -292835 -34782 -26007 68831 -156411 -160109 -25618 -119680 43948 -56778 -28790 55644 71467
6306 71467 -31710 -361388 43129 -321416 254569 83108 47809 -60439 -228496 156109 54160
6294 -136108 -95207 60487 43051 -329 147193 7052 -5184 -225687 -63304 49055 88662 155126
6282 155126 -76648 -80614 -125017 196374 -39642 -855 -209403 -56118 58863 182583 -132735
6270 -373995 -168588 75670 -102192 100801 49534 -149352 -33847 141244 -334972 24486
6259 -236644 -72094 -11336 74473 270710 59562 6745 204304 63119 151462 -217336 -205778
6248 -205778 9056 -121236 -34113 66292 257035 -331766 -415988 79927 338929 183249 -299825
6236 -457745 -168752 -34358 -303501 136630 115288 -23315 44022 -214622 -84387 92712 324500
6225 324500 53817 -265522 -139689 34447 -179737 84847 14362 173162 112067 75358 366773
6214 366773 -82579 178645 268619 68200 -71361 -106603 -124881 206401 287272 153559 180078
6203 180078 352229 2179 10551 270390 189615 -200287 211657 -19751 54737 -104352 26469
6191 -17551 28201 164523 50824 302452 195513 8794 44421 -186037 132690 -341485 312992
6179 -156449 -81503 -278783 -164673 27775 -497532 89548 135791 24259 28471 71888 29193
6167 -163211 103991 54360 116611 -8786 12229 21396 -285111 55643 -210917 -14784 -119024
6156 -119024 -261847 -14959 123052 234222 -26190 -171459 109826 -174735 239333 -212740
6145 -304576 9397 219402 -28180 197574 -169253 -206952 129582 -250177 211160 69701 -252687
6133 123392 314940 -253602 7715 300062 321911 22470 -178032 53442 -196882 318898 -249730
6121 121839 -138719 -390605 56467 -273187 104229 108410 247705 -4411 15533 -240286 279158
6109 49331 -124092 43558 86729 -156471 17196 -327642 -199964 317674 -145228 33256 415704
6098 415704 18829 -17564 -397375 -74741 14974 69566 159960 -79707 -5353 -219264 -94275
6086 171135 -197143 -96075 34488 56625 71870 50188 278239 -34613 332822 -376302 49444
6074 26734 381318 82931 -84727 -373227 -197353 -145338 -236954 3149 155292 221538 426981
6063 426981 142978 97247 262710 -97206 -94079 365659 -91441 -310047 115606 -148557 87322
6051 282579 -272608 51475 79273 -38159 -187669 216034 -46058 -138608 57749 -102641 19574
6039 -223390 176881 46625 -100108 -91905 150545 69459 77499 29815 60815 21443 -43964
6027 244925 111333 28377 292598 -35108 41825 -50537 131324 -383342 -341137 -33211 -167288
6016 -167288 -188584 -94682 -530526 226512 -33518 254278 -244263 316049 -287046 -38739
6005 -143070 477985 66966 183819 173203 -226087 -119327 224871 42907 374547 -181339
5994 173123 121432 203626 -115443 -225173 63762 -85867 -325133 155491 -90286 -64082 -207378
5983 -207378 118158 41196 61451 389185 128305 -313295 -364749 -67646 -132834 -57248 -54733
5972 -54733 89714 1602 -195273 48130 47738 482423 -275217 -147026 -90564 -119105 -119322 -511869
5960 -511869 277354 429219 -263531 -452941 201838 320159 -139545 -31531 86212 -136789
5949 -15831 -5373 102284 -68530 -336653 -66424 317762 44805 251416 239477 143672 -86876
5937 -165373 -196947 -23565 44461 -4773 -7767 -66485 -150895 -11605 148617 -29639 -6643 -148308
5925 -148308 143561 -154979 191329 81718 -291825 -372814 112575 37697 28870 -181995 -47046
5913 51654 5558 -109197 127828 14470 32307 -52699 -8379 -26516 -147081 -528164 -133247
5901 -50087 -158420 50038 -212510 49812 198494 137613 -270515 18747 4029 14593 77492
5890 77492 139435 -278594 22954 207265 -89652 -39848 -12322 -258665 -235503 113004 -368458
5878 25054 67484 173969 -73370 296747 -94690 -110836 -22442 -207931 -98201 -348284 70484
5866 114521 4180 308488 -1331 -14625 -298057 448123 -65753 10549 -61533 106387 -54364
5854 538114 332688 40995 -261646 -117584 202573 -65932 132390 288358 -155602 -174334
5844 -174334 -254392 18398 190639 -322418 -195359 42506 -32114 -201725 193198 -6716 70355
5832 -180551 -128195 46251 33145 114029 282867 59415 62640 32102 111938 -195128 -24010
5820 187049 92300 5088 -147666 -194062 55990 -156643 140673 -227671 195270 275421 55521
5808 141418 45580 143059 185701 149697 31184 10309 -114582 56640 112945 210943 -104988
5796 159559 -462528 -245652 310741 -11018 27579 152079 128555 104870 75484 -108295 -115837
5785 -115837 130739 97625 394793 -61086 348955 70405 -206736 74073 -242506 -140283
5775 -140283 408667 3302 -191604 133681 -335637 -147969 9340 -216662 -147636 -163354 41121
5763 -212625 24172 -9494 -453907 -61169 -565597 471287 50596 193508 -39460 -110263 48735
5751 -163438 -169478 277515 136250 -221363 -36270 280662 205563 -58138 30770 -55857 -13418
5739 -144667 42003 221073 -107536 -118905 220366 -142732 190129 153444 -51030 -29735 243670
5727 -9947 90155 291853 109087 -414364 342556 -12248 95093 29711 -13082 -22792 197900
5715 185795 -52024 103256 78888 200305 -41741 184439 -109674 10083 45444 77374 -21987
5703 -195503 -37949 352113 -54804 49589 -78166 -204153 90677 -139761 -126741 20364 125213
5692 125213 -98517 -23341 -110387 -260662 -35584 -13666 1743 -64178 -79350 -235369 141147
5680 -222138 -111323 29240 -119651 201938 -149927 -410215 355817 86698 -151059 108491
5669 -35981 154694 50635 227611 -140225 185206 140892 154418 -25087 -123303 -154488 28992
5657 -12524 -110449 -144189 444338 267819 33494 -98746 -218095 36704 252054 -216683 221991
5645 -180533 -35517 45985 -32952 56206 127866 -58229 -180639 221151 9749 -19181 11628
5633 -218870 219466 25551 96646 -135288 292394 21694 -226781 -115275 -86412 224243
5622 -305412 -79503 -45463 160372 287560 -216260 -364136 -17787 -189143 -152844 -32777 -18524
5611 -18524 41846 -51547 -157476 162874 -259168 -129402 106865 -349270 -318217 307496
5600 18475 -137773 -176516 -97997 -35829 -101480 77852 -108673 -273017 -112985 55447 -254022
5588 -1534 318026 -10499 -130510 -63208 311594 -55421 299218 -91329 126530 -42167 -9318
5576 -117047 -193977 171127 -186656 -301708 12626 -68120 80258 139063 234006 5860 224450
5565 224450 98457 245991 67084 215046 49453 233410 -46232 42658 31367 -198329 -6596
5553 -23297 203902 -130844 53628 -288232 -117668 122142 -101576 -330858 95496 -186468
5542 -167760 127637 -166229 -26987 90511 63892 -135050 165265 -155164 27933 207198
5532 207198 59665 18954 -269125 57655 163258 235549 -11290 -10071 -31246 55447 128301
5521 128301 -144561 129625 134978 260785 -152551 -71861 260279 -62055 323019 86376 -301245
5509 -48869 -226689 235936 23521 -34405 217988 234686 -195303 -139305 28014 343461 114432
5497 -27293 -403206 59200 -115151 -34654 145459 135804 102227 -534171 -67386 18870 114201
5486 114201 23458 13845 51248 -115295 -252033 -47700 38437 223182 -25840 -315205 -27885
5474 95635 -182890 195027 33968 131866 -388073 -83481 -71931 -29225 223717 -1692 134291
5462 -2513 117317 -40801 154481 96556 -118870 -45710 -120187 381877 215065 -221564 -76297
5450 138381 -98503 -104076 -56594 -182664 -90466 -130660 80353 20728 -22879 -111366 -55139 47256
5437 337603 -66456 200203 84799 41273 -234422 429316 70847 -90257 -53706 -261619 -139211
5426 -139211 -6473 122580 7740 -66568 37173 -59276 -163240 101688 -92298 -137079 106781
5414 -48623 183120 -162472 57576 -158255 197073 -246521 110463 -32067 80778 144074 -35637
5402 329775 -48831 41966 126865 -30273 285770 -194503 54282 -121764 -261089 102986 308577
5391 308577 51958 -136474 -238709 -115811 58806 -129218 -114629 -33077 287722 -140929
5380 -106511 -256387 313995 -289855 -136009 -136895 60493 247959 -181102 7065 79267 173312
5369 173312 -126497 24747 215606 -165544 -30522 95499 119028 146481 327543 -133687 -27553
5357 -1340 120603 110760 -45065 -46075 -82332 19809 -14227 -216194 -108592 -132235 82274 -4229
5344 354615 33911 365348 141669 4924 -235707 8355 47353 -51152 -34969 -87184 258324
5332 -49036 -215169 -11994 -132341 -291437 -147818 -224479 -544347 22938 -61656 144718 70274
5320 -109091 448648 121228 -40899 164446 -105626 41227 -80415 151948 49029 189168
5310 189168 -26679 51211 31682 -72104 181988 279503 258290 -141258 263183 76614 51263
5299 51263 6063 16250 -114092 -176342 -64778 142502 -147863 3762 69229 225118 84247
5287 -224501 -329592 63359 10244 -80741 123471 -11986 110542 -93674 216230 239467 109423
5275 -45995 -256143 62589 -7587 152760 -282176 252585 -154143 -180832 313693 -478384 -23412
5263 308349 15964 -10521 84067 85993 -177735 -315286 93179 305684 211485 175301 141343
5252 141343 239131 -196686 82392 -100816 -45032 -142713 174420 -192534 87861 -309155 -62818
5240 -248176 -291546 26668 202364 167622 -9180 -104430 9635 85988 128233 -168471 206091
5228 -97472 -4185 -11149 5463 59994 -90036 212855 -110064 -65056 30103 -21128 104867 13544
5215 -196859 -11177 52282 152883 -182020 -270632 -279685 3636 132071 17804 -46934 80316
5203 285704 152785 -147791 -118676 132001 1270 37778 -168482 -283433 -171367 126075
5192 -41185 -6568 396667 -59083 16570 51411 3274 42737 107329 -103462 -8105 71071 149481
5180 149481 178406 -49169 57450 -43622 -79965 -36894 -182133 137857 175029 -249316 87012
5168 155793 105916 441829 -191256 -162429 97352 11280 -319231 31665 332778 -326138 -39586
5156 20455 71632 73029 19311 216643 -277590 -224579 25086 -106142 -31170 85113 -226474
5144 -13006 -60884 -132968 79401 -300039 -95044 144314 299200 -16776 -127722 -51003 166256
5132 -89264 -45711 -153714 -244517 322913 13323 -6531 -85013 -180150 13241 -302906 -213462
5121 -213462 -51672 406824 49318 138288 -99989 250527 -107332 147739 102123 -222632 -238571
5110 -238571 -17423 114526 -97033 219523 11895 25553 98782 34476 -43531 -269465 -82938
5098 133884 98463 -214711 -320263 148673 95941 2990 71073 24476 -377091 203422 349224
5087 349224 -27582 97105 -27187 146557 -129919 134404 273484 30895 -156574 65597 -313046
5075 80359 -55986 -216273 -122916 117913 113020 49529 33585 87135 -9624 -98090 64971 4470
5062 142154 -166539 -467511 279278 -170268 -63896 -105057 15203 81657 -440284 108608
5051 22285 16184 -206886 346907 48216 447190 57391 316559 148802 86585 -46040 73160
5039 -78194 -93685 -125001 131593 -117771 193228 -247639 50964 356834 77611 -124324 -152404
5028 -152404 158957 -116815 -20834 -573628 -7651 -131917 96785 -247921 -456007 -114727
5017 -64251 284074 245243 34315 87685 -70491 175983 132818 359477 125397 45280 54343
5006 54343 -104134 -311983 58304 -104786 -179139 91570 -254882 -66703 -33834 223075 32780
4994 140558 -176483 300968 -252649 -107057 -37003 179722 -46351 28698 -424896 -44773
4983 -214593 -50728 -69011 46724 374956 77230 230976 -12960 104028 -158787 93026 -32999
4971 -35385 37032 414794 189608 -165973 -213045 -371957 -174960 -102624 -436 44785 -11657
4959 26009 -5631 138377 24205 -73188 35981 75236 -72710 106311 -207098 264466 -94422
4947 -291909 -101509 -279359 -84695 -202480 249345 -146056 71237 14411 -45383 62003 -185092
4935 228910 372485 37642 78912 -179418 -123008 246521 -141286 -130946 337636 -120513
4924 -52956 208671 -102933 58297 -401884 -102840 -71706 -69728 34428 -11214 -9207 -97211
4913 -97211 -64554 73078 -117814 -140934 76480 256040 36134 -52243 -129619 27289 188567
4902 188567 -161210 19252 -145738 32632 -163680 -122628 84064 -101411 -90387 43890 165488
4891 165488 -2378 220800 66837 -82379 51358 5619 -65747 82938 -15524 97910 326886 -128110
4878 92838 -101306 100308 -88628 -241926 44034 -273830 146426 -197005 85021 597927
4868 597927 59722 -119828 -117040 -35003 -63431 264274 -28828 143476 371331 149078 79854
4857 79854 84913 -176982 82499 134935 106262 -401643 19264 -18288 -117737 -94318 -219176
4846 -219176 -160998 230270 497645 61336 -84544 -39679 -165392 -138139 -227874 144805 194275
4835 194275 74928 191911 282563 -35627 -71643 -103681 -229563 -106009 -150557 99032 -259758
4823 -17017 35078 140391 -161941 -128240 -35348 -16118 128640 24365 -105158 213534 223189
4812 223189 -108519 -175576 108173 137831 187838 -54750 -118044 -23353 42799 127057 13861
4800 114388 389890 73994 -195546 -185462 -83860 552022 -90745 -29743 249835 -154969 -268774
4789 -268774 18777 41911 -213634 -186207 -173331 238329 -105481 166373 -250551 172661
4778 -16924 94969 103019 209512 100987 -86051 188090 -42162 74385 -193702 133197 118628
4767 118628 -114106 -209397 104535 56114 30328 -92568 -562690 125471 -139074 -151046 -405608
4756 -405608 -55588 -150289 -196799 -24835 194277 86077 3178 337268 96029 360634 -37430
4744 183880 -107481 328440 -312855 78375 -195802 25750 21718 902 37202 -163294 -247535
4733 -247535 -12684 274695 -324367 57158 -145236 10583 167992 -206616 67622 173914
4723 173914 176409 -67514 39255 -174676 52209 45259 151072 -129061 94918 -232110 -89634
4711 32703 -104093 -167190 210308 14883 -87591 23993 -53067 129009 200784 -66917 136283
4699 16891 69686 -123962 87928 19639 112866 6937 -207341 -5063 79126 -12754 63498 -54563
4686 37927 132843 -86763 100927 175812 -123878 -49578 44703 73445 232089 -26861 68933
4674 -157921 39618 -409471 -202794 -29795 26356 140585 -154671 210004 90968 -99566 -251176
4663 -251176 188190 -33347 27579 254135 124970 114902 26749 196396 18841 378631 -11949
4651 -172574 31470 261490 160084 435021 94726 70927 103538 -61362 13781 67448 19248
4639 104046 21341 309842 125694 446062 -193095 -140127 -151858 -474068 57901 4120 -28232
4627 289825 -156583 -291959 -122479 135973 -320840 110653 -142475 -45335 191948 -334980
4616 53841 1993 50496 64335 17567 -205350 181547 309730 -285842 -327193 -103729 -86126
4605 -86126 84184 -23754 106290 126189 250555 124313 158256 -88036 -159157 -91000 -91220 -196178
4593 -196178 1180 -90306 161802 -104851 68721 86299 -277442 74104 -124432 55330 -53844
4581 125265 -248156 -126521 68260 176333 -192387 137426 -62645 -114322 136536 407092
4571 407092 -32166 -21069 -196730 211596 -306431 44447 228711 314843 29693 -113817 119445
4559 -107603 -141114 105265 -173317 219435 -56889 -20633 -153097 131887 -97644 240144
4548 -171386 234631 -89919 -62487 -165585 -96332 149336 96961 15962 -73372 395690 -79570
4536 -307054 26026 97068 -199276 -90571 -189495 46866 -182592 -170682 94468 157115 -249175
4524 153124 232729 90808 170412 -158745 82482 -12273 186420 -126695 7124 13460 10614 152731
4512 152731 -223535 217241 11495 -134713 307896 137878 -172523 -91397 60495 -125955
$$ [...]
##END NTUPLES=NMR SPECTRUM
##END=
