
##TITLE=AC1173_Tolima-ibage-TDOAH12007_7165163_eVbsZZeuvh
##JCAMPDX= 6.0         $$ Bruker NMR JCAMP-DX V2.0
##DATA TYPE= NMR SPECTRUM
##DATA CLASS= NTUPLES
##ORIGIN= BRUKER
##OWNER= Administrator
$$ 1.72 TOPSPIN		Version 2.1
$$ 2012-12-02 03:31:49.788 -0500  Administrator@X
$$ Compression mode = diff/dup
##.OBSERVE FREQUENCY= 400.02188249412
##.OBSERVE NUCLEUS= ^1H
##.ACQUISITION MODE= SIMULTANEOUS (DQD)
##.ACQUISITION SCHEME= undefined
##.AVERAGES= 64
##.DIGITISER RES= 22
##SPECTROMETER/DATA SYSTEM= spect
##.PULSE SEQUENCE= noesygpps1d.comp
##.SOLVENT NAME= COFFEE_meoh
##.SHIFT REFERENCE= INTERNAL, COFFEE_meoh, 1, 14.96236
##AUDIT TRAIL= $$ (NUMBER, WHEN, WHO, WHERE, PROCESS, VERSION, WHAT)
$$ ##TITLE= Audit trail, TOPSPIN		Version 2.1
$$ ##JCAMPDX= 5.01
$$ ##ORIGIN= Bruker BioSpin GmbH
$$ ##OWNER= Administrator
$$ $$ E:\/data/COFFEE/nmr/AC1173_Tolima-ibage-TDOAH12007_7165163_eVbsZZeuvh/12/pdata/1/auditp.txt
$$ ##AUDIT TRAIL=  $$ (NUMBER, WHEN, WHO, WHERE, PROCESS, VERSION, WHAT)
(   1,<2012-12-02 03:31:43.803 -0500>,<Administrator>,<X>,<go>,<TOPSPIN 2.1>,
      <created by zg
	started at 2012-12-02 03:20:13.788 -0500,
	POWCHK enabled, PULCHK disabled,
       configuration hash MD5:
       86 BA 57 50 F2 9D 5C 9B 26 00 A9 28 5F 66 2E 89
       data hash MD5: 64K
       27 79 AA DB 6A FB 66 23 E6 9B 12 09 45 18 5E 09>)
(   2,<2012-12-02 03:31:46.975 -0500>,<Administrator>,<X>,<proc1d>,<TOPSPIN 2.1>,
      <Start of raw data processing
       efp LB = 0.3 FT_mod = 6 PKNL = 1 PHC0 = 0 PHC1 = 0 SI = 128K 
       data hash MD5: 128K
       78 EF FA D6 4A 06 06 66 FC 15 7E B5 65 35 61 DE>)
(   3,<2012-12-02 03:31:48.085 -0500>,<Administrator>,<X>,<proc1d>,<TOPSPIN 2.1>,
      <pk PHC0 = -79.08508 PHC1 = 0 
       data hash MD5: 128K
       C3 CA 85 D7 D3 74 03 F6 3F 8F EB 8E B2 D3 AB 2E>)
(   4,<2012-12-02 03:31:48.741 -0500>,<Administrator>,<X>,<proc1d>,<TOPSPIN 2.1>,
      <abs ABSG = 1 
       data hash MD5: 128K
       87 E3 07 24 A3 DC 8A 5D 17 5F 63 98 99 87 42 75>)
(   5,<2012-12-02 03:31:48.928 -0500>,<Administrator>,<X>,<proc1d>,<TOPSPIN 2.1>,
      <abs ABSG = 2 
       data hash MD5: 128K
       D3 77 7C CF E8 17 AD AB 08 D6 05 E1 69 93 E0 03>)
(   6,<2012-12-02 03:31:49.116 -0500>,<Administrator>,<X>,<proc1d>,<TOPSPIN 2.1>,
      <abs ABSG = 3 
       data hash MD5: 128K
       BB 5F 2E 02 28 52 D7 70 F3 9A E4 65 81 20 74 EB>)
(   7,<2012-12-02 03:31:49.335 -0500>,<Administrator>,<X>,<proc1d>,<TOPSPIN 2.1>,
      <abs ABSG = 4 
       data hash MD5: 128K
       07 86 31 37 CE 38 71 E7 6E 24 03 02 03 E9 0F 41>)
(   8,<2012-12-02 03:31:49.506 -0500>,<Administrator>,<X>,<proc1d>,<TOPSPIN 2.1>,
      <abs ABSG = 5 
       data hash MD5: 128K
       61 96 B3 F6 EF 86 5D B2 94 2A 23 99 11 96 15 B5>)
$$ ##END=
$$ 
$$ $$ hash MD5
$$ $$ D4 71 D1 EE 48 14 87 21 99 E7 67 F0 F4 D9 F2 2C
##$RELAX= 
##$RELAX= 
##$RELAX= 
##$RELAX= 
##$RELAX= 
##$RELAX= 
##$RELAX= 
##$RELAX= 
$$ Bruker specific parameters
$$ --------------------------
##$DU= <E:\>
$$ [...]
##$TP07= 0
##$TPNAME0= <>
##$TPNAME1= <>
##$TPNAME2= <>
##$TPNAME3= <>
##$TPNAME4= <>
##$TPNAME5= <>
##$TPNAME6= <>
##$TPNAME7= <>
##$TPOAL= (0..7)
0.5 0.5 0.5 0.5 0.5 0.5 0.5 0.5
##$TPOFFS= (0..7)
0 0 0 0 0 0 0 0
##$TUNHIN= 0
##$TUNHOUT= 0
##$TUNXOUT= 0
##$USERA1= <user>
##$USERA2= <user>
##$USERA3= <user>
##$USERA4= <user>
##$USERA5= <user>
##$V9= 5
##$VALIST= <valist>
##$VCLIST= <CCCCCCCCCCCCCCC>
##$VD= 0
##$VDLIST= <DDDDDDDDDDDDDDD>
##$VPLIST= <PPPPPPPPPPPPPPP>
##$VTLIST= <TTTTTTTTTTTTTTT>
##$WBST= 1024
##$WBSW= 4
##$XGAIN= (0..3)
0 0 0 0
##$XL= 0
##$YL= 0
##$YMAX_a= 8520290
##$YMIN_a= -18148995
##$ZGOPTNS= <>
##$ZL1= 120
##$ZL2= 120
##$ZL3= 120
##$ZL4= 120
##$ABSF1= 14.96236
##$ABSF2= -5.595821
##$ABSG= 5
##$ABSL= 3
##$ALPHA= 0
##$AQORDER= 0
##$ASSFAC= 0
##$ASSFACI= 0
##$ASSFACX= 0
##$ASSWID= 0
##$AUNMP= <proc_prof1d_extract.lims>
##$AXLEFT= 0
##$AXNAME= <>
##$AXNUC= <1H>
##$AXRIGHT= 0
##$AXTYPE= 0
##$AXUNIT= <>
##$AZFE= 0.1
##$AZFW= 0.1
##$BCFW= 0
##$BC_mod= 0
##$BYTORDP= 0
##$COROFFS= 0
##$CY= 15
##$DATMOD= 1
##$DC= 0
##$DFILT= <>
##$DTYPP= 0
##$F1P= 0
##$F2P= 0
##$FCOR= 0.5
##$FTSIZE= 131072
##$FT_mod= 6
##$GAMMA= 0
##$GB= 0
##$INTBC= 1
##$INTSCL= 1
##$ISEN= 128
##$LB= 0.3
##$LEV0= 0
##$LPBIN= 0
##$MAXI= 10000
##$MC2= 0
##$MEAN= 0
##$ME_mod= 0
##$MI= 0
##$NCOEF= 0
##$NC_proc= -2
##$NLEV= 6
##$NOISF1= 0
##$NOISF2= 0
##$NSP= 0
##$NTH_PI= 0
##$NZP= 0
##$OFFSET= 14.96236
##$PC= 1
##$PHC0= -79.08508
##$PHC1= 0
##$PH_mod= 1
##$PKNL= yes
##$PPARMOD= 0
##$PPDIAG= 0
##$PPIPTYP= 0
##$PPMPNUM= 2147483647
##$PPRESOL= 1
##$PSCAL= 4
##$PSIGN= 0
##$PYNMP= <proc.py>
##$REVERSE= no
##$SF= 400.020009093136
##$SI= 131072
##$SIGF1= 0
##$SIGF2= 0
##$SINO= 400
##$SIOLD= 131072
##$SPECTYP= <>
##$SREGLST= <1H.CDCl3>
##$SSB= 0
##$STSI= 131072
##$STSR= 0
##$SW_p= 8223.68421052631
##$SYMM= 0
##$S_DEV= 0
##$TDeff= 65536
##$TDoff= 0
##$TI= <>
##$TILT= no
##$TM1= 0
##$TM2= 0
##$TOPLEV= 0
##$USERP1= <user>
##$USERP2= <user>
##$USERP3= <user>
##$USERP4= <user>
##$USERP5= <user>
##$WDW= 1
##$XDIM= 131072
##$YMAX_p= 449874061
##$YMIN_p= -11491
##$CURPLOT= <Network HP LaserJet P1505>
##$CURPRIN= <$Network HP LaserJet P1505>
##$DFORMAT= <normdp>
##$LAYOUT= <+/1D_H.xwp>
##$LFORMAT= <normlp>
##$PFORMAT= <normpl>
##$SURQMSG= 1
$$ End of Bruker specific parameters
$$ ---------------------------------
##NTUPLES= NMR SPECTRUM
##VAR_NAME=  FREQUENCY,     SPECTRUM/REAL,   SPECTRUM/IMAG
##SYMBOL=    X,             R,               I
##VAR_TYPE=  INDEPENDENT,   DEPENDENT,       DEPENDENT
##VAR_FORM=  AFFN,          ASDF,            ASDF
##VAR_DIM=   131072,        131072,          131072
##UNITS=     HZ,            ARBITRARY UNITS, ARBITRARY UNITS
##FACTOR=    0.0627417313425164, 1,          1
##FIRST=     8223.62146879497, -651,         -71082
##LAST=      0,             1801,            -71782
##MIN=       0,             -11491,          0
##MAX=       8223.62146879497, 449874061,    0
$$ Real data points
##PAGE= N=1
##DATA TABLE= (X++(R..R)), XYDATA
$$ [...]
61013H43869Q061P865Q211Q609J0055J2960J5714J7174J8550K1099K4082K6822
61001A023071L0466L5593M0372M3264M5302M7660M9566N1004N4717O2619P2831
60990A556465Q3130R4608J08691J23384J36204J48461J63182J81455K04578K36581
60980C036739K80308L34005L96378M71434N63488O72665Q02901R69534J189761
60971H717213J470391J813823K218480K634495K909420K826423K262979J335763
60963B6188987L64783l32355o19789n42093k06207K76437P39466R37615O63840
60954B7470684p8120j039377j887281k410495k589678k520584k310765k038019
60946A2596365j754605j491756j259508j056086q80042p31328o06685n01524m14542
$$ plain form
61013 843869 851930 859795 868006 876615 886670 899630 915344 932518 951068 972167 996249 1023071
61001 1023071 1053537 1089130 1129502 1172766 1218068 1265728 1315294 1366298 1421015 1483634 1556465
60990 1556465 1639595 1734203 1842894 1966278 2102482 2250943 2414125 2595580 2800158 3036739
60980 3036739 3317047 3651052 4047430 4518864 5082352 5755017 6557918 7527452 8717213
60971 8717213 10187604 12001427 14219907 16854402 19763822 22590245 24853224 26188987
60963 26188987 26553770 26221415 25601626 25059533 24853326 25129763 25869229 26806844 27470684
60954 27470684 27392564 26353187 24465906 22055411 19465733 16945149 14634384 12596365
60946 12596365 10841760 9350004 8090496 7034410 6154368 5423040 4816355 4314831 3900289
60937C900289l45924k93114k52117k20872j97743j79004j61371j45263j32312
60928A972569j21435j10348r9172q9319q0319p0924o2262n6811n4817n4166n3282
60917A119714n1985n0080m7185m3568l9663l5319l0707k6980k4727k2870k0435
60906G26195j8159j6922j5894j3859j1276r348q097o853n720n034m320l154k196
60893F05363j982j694m14J351K649L579M520N016M697M308M444M282K912R50n44
60878F39437j729l311n095o528p664q437q088o650n833o876q532q794p673o649
60864E47578o208n646m733l879k968j521J95J437K126K708L275L798M680O150
60850E46992P557Q225Q559R440J1096J3228J5573J7618J8594J8554J8605J9224
$$ plain form
60937 3900289 3554365 3261251 3009134 2788262 2590519 2411515 2250144 2104881 1972569
60928 1972569 1851134 1740786 1641614 1552295 1471976 1401052 1338790 1281979 1227162 1172996 1119714
60917 1119714 1067729 1017649 970464 926896 887233 851914 821207 794227 769500 746630 726195
60906 726195 708036 691114 675220 661361 650085 640737 632640 625787 620067 615033 610713 607559 605363
60893 605363 603381 601687 601273 602624 605273 608852 613372 618388 623085 627393 631837 636119 639031 639981 639437
60878 639437 637708 634397 629302 622774 615110 606673 598585 591935 586102 579226 570694 561900 554227 547578
60864 547578 541370 535724 530991 527112 524144 522623 522818 524255 526381 529089 532364 536162 540842 546992
60850 546992 554549 562774 571333 580773 591869 605097 620670 638288 656882 675436 694041 713265
60838G13265J9372J8157J6295J4777J3225J0846Q106O025M534K963J544J003J080
60825H31192P51l39j742l066m130m612m554m721n618o602o888o800p132p877q504
60810G59358r070r984j1093j1763j1602j0552q791p072o399o722o729n567l892
60797F50122k615j658p73l97n87j63J729M100N431N772O275P284Q217Q930R801
60782G01468J0784J1465J1852J2192J2345J2079J1626J1169J0315Q837P387O643
60770H28162O326N899N573N742O063N998N729N618N316M347L062K158J673J276
60756H92942R19N29l04j533k212j710p29k77m15p35j327k265k881k642k133k275
60740H72952l131m298n698p088p620o935o047o035o510o366n441m341l300k287
$$ plain form
60838 713265 732637 750794 767089 781866 795091 805937 814043 820068 824602 827565 829109 830112 831192
60825 831192 831943 831604 829862 826796 822666 818054 813500 808779 803161 796559 789671 782871 775739 767862 759358
60810 759358 750288 740304 729211 717448 705846 695294 686503 679431 673032 666310 659581 654014 650122
60797 650122 647507 645849 645076 644679 644092 643929 645658 649758 655189 660961 667236 674520 682737 691667 701468
60782 701468 712252 723717 735569 747761 760106 772185 783811 794980 805295 814132 821519 828162
60770 828162 834488 840387 845960 851702 857765 863763 869492 875110 880426 884773 887835 889993 891666 892942
60756 892942 893861 894390 894086 892553 890341 888631 887902 887625 887210 886475 885148 882883 880002 877360 875227 872952
60740 872952 869821 865523 859825 852737 845117 838182 832135 826100 819590 813224 807783 803442 800142 797855
60726G97855j678j755j966j762j569k013k676k700k145j748j750j885k087k364
60712G69757k366j890j340j108r97q52r47j214j003l13j76j020j723j351o50p38
60696G52069j410j969k687m065n569o512p304q510r569r844r986j0746j1369j0875
60682F51654r995j0029j0464r778q120p170p499p929p583o788n899m699l247j973
60668E50481q00P63K544L834M497N034N624O055O387O744O758O108N321N075N212
60653F19637N244N310N584N552M977M825N869P180P393O812O658O909O608N813
60639G04371N450N578N579N773P005Q823R856R986J0333J1135J1483J1306J1709
60626H18387J2921J3596J2773J1104R581Q279O866N268L311O66k476n455p962
$$ plain form
60726 797855 796177 794422 792456 790694 789125 787112 784436 781736 779591 777843 776093 774208 772121 769757
60712 769757 767391 765501 764161 763053 762056 761204 760257 759043 758040 757727 757551 756531 754808 753457 752807 752069
60696 752069 750659 748690 746003 741938 736369 729857 722553 714043 704474 694630 684644 673898 662529 651654
60682 651654 641659 631630 621166 611388 603268 596098 588599 580670 573087 566299 560400 555701 552454 550481
60668 550481 549681 550444 552988 556822 561319 566353 571977 578032 584419 591163 597921 604029 609350 614425 619637
60653 619637 624881 630191 635775 641327 646304 651129 656998 664178 671571 678383 685041 691950 698558 704371
60639 704371 709821 715399 720978 726751 733756 742579 752435 762421 772754 783889 795372 806678 818387
60626 818387 831308 844904 857677 868781 878362 886641 893507 898775 902086 902752 900276 894821 886859
60613H86859j0057j1427j1658j1134j0652j0195r198p839o790n784l827r39J684
60600G89043L403M684N689N652M156J902l03k417m587o540p888q446q017o573
60586G69758m672l057j732j44J865L837N299N916N415M167L429L993M934M702
60572H03710L138J439M86L09P86J605J823P42r68k141k863m067n736o897p286
60557G84080p590q117q544q893r423r590q541o625n033l970k494k04K247M424
60543G11727O603Q840J0822J2702J4975J7544K0134K3394K8220L4143L9858M5171
60531I74133N0669N5478N7202N4470M7944L8442K5842J0502n703k0452l2103l9496
60519A216928m2065m0635l6956l1922k5362j7661j0228l985J227N349P657Q191
$$ plain form
60613 886859 876802 865375 853717 842583 831931 821736 812538 804699 797909 792125 788298 787359 789043
60600 789043 792446 797130 802819 808471 812627 814529 814226 811809 807222 800682 792794 784348 776331 769758
60586 769758 765086 762029 760297 760153 762018 765855 771154 777070 782485 786652 790081 794074 799008 803710
60572 803710 806848 808287 808773 809082 809868 811473 813296 814038 813070 810929 808066 803999 798263 791366 784080
60557 784080 776490 768373 759829 750936 741513 731923 723382 716757 711724 707754 705260 705056 707303 711727
60543 711727 718330 727170 737992 750694 765669 783213 803347 826741 854961 889104 928962 974133
60531 974133 1024802 1080280 1137482 1191952 1239896 1278338 1304180 1314682 1308979 1288527 1256424 1216928
60519 1216928 1174863 1134228 1097272 1065350 1039988 1022327 1012099 1008114 1009341 1014690 1022347 1030538
60507A030538Q299Q985R777R839R255Q716Q814J0072J2842J6748K1136K6146L2511
60494A213678M0288M8913N8419O9336Q1344R3489J05789J19121J33341J47195
60484B110913J60625J75640J94435K18137K47883K85342L30882L81721M31753
60475D537331M71739M89689M73945M18476L25341K02257N9518r0112k31181l48562
60465F308441m32016m78431m91081m77637m47452m08611l66502l24558k85170
60456B596983k49545k17775j89782j65608j44565j25353j07648r2615q1076p2009
60446A151007o3567n4954m6665l9468l3778k9484k6012k2888k0345j8837j7990
60435G77019j6920j5592j4859j5010j5265j4863j3743j2049j0004q337p774p978
$$ plain form
60507 1030538 1038837 1047822 1057599 1067438 1076693 1085409 1094223 1104295 1117137 1133885 1155021 1181167 1213678
60494 1213678 1253966 1302879 1361298 1430634 1511978 1605467 1711256 1830377 1963718 2110913
60484 2110913 2271538 2447178 2641613 2859750 3107633 3392975 3723857 4105578 4537331
60475 4537331 5009070 5498759 5972704 6391180 6716521 6918778 6978296 6888184 6657003 6308441
60465 6308441 5876425 5397994 4906913 4429276 3981824 3573213 3206711 2882153 2596983
60456 2596983 2347438 2129663 1939881 1774273 1629708 1504355 1396707 1304092 1223016 1151007
60446 1151007 1087440 1032486 985821 946353 912575 883091 857079 834191 813846 795009 777019
60435 777019 760099 744507 729648 714638 699373 684510 670767 658718 648714 640377 632603 624625
60423F24625p969p522p043o254m541k536j654j832j490j12Q88N27k87m03M5O06
60407E85048J460K524K978K616K423K896L167K647K178K476K757K162J432J915
60393F18679L662N645P122P869P746O972O209N686M878L588K479J989J528M47
60379F84499j049k436l559m321m586m735n283n718m872k858j231p74o24j19Q6
60364F42420l93o15P3Q32R14J088K187L489L866L569L524L744L726L648L943M388
60348F80403M649N085O018O952P422P842Q570Q938Q242O963O054N658N355M958
60334G73109M233K655L00j745k635k695k434j624j79J050J439J700K760M308N295
60319G85537N207L998J659j283l565m465m586m663m503l873l470l930m699m872
$$ plain form
60423 624625 616656 609134 602091 595837 591296 588760 587106 585274 583784 583672 584560 585087 584800 584397 584442 585048
60407 585048 586508 589032 592010 594626 597049 599945 603112 605759 607937 610413 613170 615332 616764 618679
60393 618679 622341 627986 635108 642977 650723 657695 663904 669590 674468 678056 680535 682524 684052 684499
60379 684499 683450 681014 677455 673134 668548 663813 658530 652812 647940 645082 643851 643077 642453 642334 642420
60364 642420 642027 641412 641485 642317 643231 644319 646506 649995 653861 657430 660954 664698 668424 672072 676015 680403
60348 680403 685052 690137 696155 703107 710529 718371 726941 735879 744121 751084 757138 762796 768151 773109
60334 773109 777342 779997 780297 778552 775917 773222 770788 769164 768985 770035 771474 773174 775934 780242 785537
60319 785537 790744 794742 796401 795118 791553 787088 782502 777839 773336 769463 765993 762063 757364 752492
60305G52492m479m036l536k796k110j810j701j557j433j147l27O13P45K71N63
60290G29752J947L005K906K734L434M061L462K304J949K401K902L408M114M471
60276G72850M106L817M334M969M765M026L454K879K147K199L749N889P403Q512
60262H35099R879J1033J1387J1846J3657J6421J8910K1023K3402K5907K8223L1146
60250A057933L5499M0426M4501M7944N2024N6929O2001O7506P4252Q1845Q9101
60239A709961R5859J02590J08634J12635J14495J15119J14385J11156J05190R7365
60229B787389Q7976P6502O3161M9144L5060K0596N902p984k0305l1005l9954m6725
60217B979757n1215n3497n3235n0247m5354l9550l2582k3508j2495q60J0546K1970
$$ plain form
60305 752492 748013 743977 740441 737645 735535 733725 732024 730467 729034 727887 727560 728173 728918 729189 729752
60290 729752 731699 734704 737610 740344 743778 747839 751301 753605 755554 757955 760857 764265 768379 772850
60276 772850 776956 780773 785107 790076 794841 798867 802321 805200 807347 809546 813295 819184 826587 835099
60262 835099 844978 856011 867398 879244 892901 909322 928232 949255 972657 998564 1026787 1057933
60250 1057933 1093432 1133858 1178359 1226303 1278327 1335256 1397257 1464763 1539015 1620860 1709961
60239 1709961 1805820 1908410 2017044 2129679 2244174 2359293 2473678 2584834 2690024 2787389
60229 2787389 2875365 2951867 3015028 3064172 3099232 3119828 3125730 3117746 3097441 3066436 3026482 2979757
60217 2979757 2928542 2875045 2821810 2771563 2726209 2686659 2654077 2630569 2618074 2617214 2627760 2649730
60205B649730L3863M6343N9399P2692Q5365R6799J07066J15858J21716J23370
60195C512201J21199J16215J08341R6974Q2515O5958M7623K7739P662j1121k8752
60184D146554m6176o2955p7440q8754r6994j01815j02482r9225r3037q4184p2327
60173C221165n7979m2532k6901j1314L916J8624L3339M8212O1942P3037Q1557
60162C403066Q8084R1702R0922Q6022P8609O9186N7183M3081K8436J3869q29j4651
60150D034680k5565l2910l7600l9646l7598l0985k1322r980L186J8384L4659N0875
60138C906178O6703Q2001R6541J10849J26146J43012J61246J81327K04545K31143
60128E309691K59441K87300L13412L36826L56358L70902L79502L80877L73846
$$ plain form
60205 2649730 2683593 2729936 2789335 2862027 2947392 3044191 3151257 3267115 3388831 3512201
60195 3512201 3633400 3749615 3857956 3954930 4037445 4103403 4151026 4178765 4186427 4175306 4146554
60184 4146554 4100378 4037423 3959983 3871229 3774235 3672420 3569938 3470713 3377676 3293492 3221165
60173 3221165 3163186 3120654 3093753 3082439 3086355 3104979 3138318 3186530 3248472 3321509 3403066
60162 3403066 3491150 3582852 3673774 3759796 3838405 3907591 3964774 4007855 4036291 4050160 4049331 4034680
60150 4034680 4009115 3976205 3938605 3898959 3861361 3830376 3809054 3799074 3802260 3820644 3855303 3906178
60138 3906178 3972881 4054882 4151423 4262272 4388418 4531430 4692676 4874003 5078548 5309691
60128 5309691 5569132 5856432 6169844 6506670 6863028 7233930 7613432 7994309 8368155
60119H368155L58356L35225L05014K68166K25934J79741J29754P5587J8286l9842
60109A0224376r7293j53540k07069k55106k95551l27497l49459l59228l56440
60100G823193l43767l24464k99914k70303k36481k00015j62145j23559q4697m5876
60090E731972p617K8974O2645R2599J17937J36849J47516J49579J43614J29741
60080F733809J08342Q1720N3159K4253m962l3274n8061p8330r5868j12414j27533
60069F490841j40234j50845j59994j67228j71996j74822j76125j74921j70071
60060E004605j62120j52607j42047j29751j15392r9737q3808o7903n1566l4276
60050C965398j6173J994J9735L7270N4762P1639Q7313J01833J14849J24610J29322
$$ plain form
60119 8368155 8726511 9061736 9366750 9634916 9860850 10040591 10170345 10245932 10264218 10224376
60109 10224376 10127083 9973543 9766474 9511368 9215817 8888320 8538861 8179633 7823193
60100 7823193 7479426 7154962 6855048 6584745 6348264 6148249 5986104 5862545 5777848 5731972
60090 5731972 5724355 5753329 5815974 5908573 6026510 6163359 6310875 6460454 6604068 6733809
60080 6733809 6842151 6923871 6977030 7001283 6996321 6963047 6904986 6826656 6730788 6618374 6490841
60069 6490841 6350607 6199762 6039768 5872540 5700544 5525722 5349597 5174676 5004605
60060 5004605 4842485 4689878 4547831 4418080 4302688 4202951 4119143 4051240 3999674 3965398
60050 3965398 3949225 3951219 3970954 4008224 4062986 4134625 4221938 4323771 4438620 4563230 4692552
60039D692552J29062J24920J16705J03270Q4927O3670M0811J6210r837l5740o0229
60028E266321q3238j04518j22774j36820j46444j51545j51732j47366j39772j29819
60018C952293j17346j02516q6586p0799n5471m0548k5979j1204M586K1326L8226
60007C505982N5281P3307R2296J11111J29210J47093J64480J79323J89370J93666
59997D841119J92023J84258J70604J51860J28666J01672P2611M3825J6134j1522
59987E891250l9888o7953r4034j16927j35473j48482j55758j58047j55499j47446
59977D671743j34208j17682r9440p9523n7788l5116j2511R811L1703N2442P1379
59966D300810Q8127J01618J10276J13741J13386J10590J05682R8875R0798Q1526
$$ plain form
60039 4692552 4821614 4946534 5063239 5166509 5251436 5315106 5355917 5372127 5362290 5326550 5266321
60028 5266321 5183083 5078565 4955791 4818971 4672527 4520982 4369250 4221884 4082112 3952293
60018 3952293 3834947 3732431 3645845 3575046 3519575 3479027 3453048 3441844 3446430 3467756 3505982
60007 3505982 3561263 3634570 3726866 3837977 3967187 4114280 4278760 4458083 4647453 4841119
59997 4841119 5033142 5217400 5388004 5539864 5668530 5770202 5842813 5886638 5902772 5891250
59987 5891250 5851362 5783409 5689375 5572448 5436975 5288493 5132735 4974688 4819189 4671743
59977 4671743 4537535 4419853 4320413 4240890 4183102 4147986 4135475 4145286 4176989 4229431 4300810
59966 4300810 4388937 4490555 4600831 4714572 4827958 4938548 5044230 5143105 5233903 5315429
59956E315429P0478N7941M5288L3214K1212R397q45q780j5197k0295k2325j9586
59944E465931j2391j792J2429L1124N4171Q0766J10502J43109J77938K14588K53381
59933F529756K94184L35485L75142M11199M41261M62087M70546M64134M40213
59924A0224007L96182L31574K49242J54009N1271n2637j50488k36195l06436l59818
59914A0300711l95695m14757m19571m13367l98678l77530l51814l22681k90506
59905F916112k56123k21066j86046j50353j13520p6345l9674l383L2514O7050
59895E969166R9453J29923J58348J83303K03251K17481K24922K23138K09712J83945
59885G802642J46507R8502M1882k0076q3628j45355k01795k49524k86474l12475
$$ plain form
59956 5315429 5385907 5443848 5489136 5522350 5543562 5552959 5552114 5543334 5528137 5507842 5485517 5465931
59944 5465931 5453540 5451748 5464177 5495301 5549472 5630238 5740740 5883849 6061787 6276375 6529756
59933 6529756 6823940 7159425 7534567 7945766 8387027 8849114 9319660 9783794 10224007
59924 10224007 10620189 10951763 11201005 11355014 11406285 11353648 11203160 10966965 10660529 10300711
59914 10300711 9905016 9490259 9070688 8657321 8258643 7881113 7529299 7206618 6916112
59905 6916112 6659989 6438923 6252877 6102524 5989004 5912659 5872985 5869602 5902116 5969166
59895 5969166 6068619 6198542 6356890 6540193 6743444 6960925 7185847 7408985 7618697 7802642
59885 7802642 7949149 8047651 8089533 8069457 7985829 7840474 7638679 7389155 7102681 6790206
59875F790206l28121l34053l31568l22560l08392k89999k69188k48139k27244
59866D130942k05270j82231j60143j40280j21651j03265q5868p0344n6347m3825
59856B961718l4065k7857k4292k2675k3714k7354l1327l3547l4212l3958l1765
59845B636952k6760k0414j4682r346l377K186M974M085K08o134j4571k3762l2186
59832B497173l9498m5670m9622n0305m8333m4947m0238l3894k6792k0141j3821
59821B083912p085j37O482J3033J9546K4650K7293K8725L1079L4844L9413M5112
59809B346867N2535O0528O6766P0019P0154O6665N9208M9211L9023K9571K0327
59798B930874J1257L176l510q877j2498j3708j2566r474m315K920J1379K0446
$$ plain form
59875 6790206 6462085 6128032 5796464 5473904 5165512 4875513 4606325 4358186 4130942
59866 4130942 3925672 3743441 3583298 3443018 3321367 3218102 3132234 3061890 3005543 2961718
59856 2961718 2927653 2899796 2875504 2852829 2829115 2801761 2770434 2736887 2702675 2668717 2636952
59845 2636952 2610192 2589778 2575096 2565750 2562373 2564559 2569533 2573618 2573826 2567692 2553121 2529359 2497173
59832 2497173 2457675 2412005 2362383 2312078 2263745 2218798 2178560 2144666 2117874 2097733 2083912
59821 2083912 2076827 2076690 2083172 2096205 2115751 2140401 2167694 2196419 2227498 2262342 2301755 2346867
59809 2346867 2399402 2459930 2526696 2596715 2666869 2733534 2792742 2841953 2880976 2910547 2930874
59798 2930874 2942131 2945307 2941797 2932920 2920422 2906714 2894148 2884674 2880359 2883279 2894658 2915104
59786B915104L0757M2938N6223O9828Q4734J02470J23015J45615J70846K00009
59776C941539K33103K69218L08299L50485L93640M32670M60453M68087M45711
59767G303205L86622K92101J72028M1411q3348j87639k62639l07806l28437l30715
59757F694783l19557k99542k74935k48243k20358j92223j65095j39372j14741
59748D720717r1542p0650n2070l4862j8363k504J2840K7837M2405N6851P2208
59737D662867Q9028J06610J24421J43316J64208J86607K09849K34695K62221K92088
59727F475910L23512L56987L93398M32315M72606N13648N54194N91136O21097
59718A0734803O42129O52288O48291O28214N94541N52419N06127M59687M19351
$$ plain form
59786 2915104 2945861 2988799 3045022 3114850 3199584 3302054 3425069 3570684 3741530 3941539
59776 3941539 4174642 4443860 4752159 5102644 5496284 5928954 6389407 6857494 7303205
59767 7303205 7689827 7981928 8153956 8195367 8112019 7924380 7661741 7353935 7025498 6694783
59757 6694783 6375226 6075684 5800749 5552506 5332148 5139925 4974830 4835458 4720717
59748 4720717 4629175 4558525 4506455 4471593 4453230 4450726 4463566 4491403 4533808 4590659 4662867
59737 4662867 4751895 4858505 4982926 5126242 5290450 5477057 5686906 5921601 6183822 6475910
59727 6475910 6799422 7156409 7549807 7982122 8454728 8968376 9522570 10113706 10734803
59718 10734803 11376932 12029220 12677511 13305725 13900266 14452685 14958812 15418499 15837850
59709A5837850L91789L79932L83087M00487M31624M73233N19112N63401O01658
59700A9982173O28709O38325O25790N88963N26885M39965L32211K11270Q5680
59691B4059971l6601j47561k39990l09764l55868l78173l77107l55243l16709
59682B1542955k64493j99986j25092m2537M6131J40851K41088L45619M54254N67553
59672B2706343O84112P99658R08694J005002J080340J124626J127793J080377
59664C0516945R73624Q02739N71655K93580j2695l25421o20631q75644j075033
59655C0249119j212952j290122j310954j283465j218478j126804j018048r02229
59647B0886067p90322o92656o18567n77283n75462o11663o74354p46380q10929
$$ plain form
59709 15837850 16229639 16609571 16992658 17393145 17824769 18298002 18817114 19380515 19982173
59700 19982173 20610882 21249207 21874997 22463960 22990845 23430810 23763021 23974291 24059971
59691 24059971 24023370 23875809 23635819 23326055 22970187 22592014 22214907 21859664 21542955
59682 21542955 21278462 21078476 20953384 20910847 20956978 21097829 21338917 21684536 22138790 22706343
59672 22706343 23390455 24190113 25098807 26103809 27184149 28308775 29436568 30516945
59664 30516945 31490569 32293308 32864963 33158543 33145848 32820427 32199796 31324152 30249119
59655 30249119 29036167 27746045 26435091 25151626 23933148 22806344 21788296 20886067
59647 20886067 20095745 19403089 18784522 18207239 17631777 17020114 16345760 15599380 14788451
59638A4788451q54836q70809q59169q26187p79171p23520o63629o03639n45991
59629H061500m91156m39729l93103l51500l13514k78470k47327k20378j96044
59620E130279j73075j52020j33427j16384j00063q5106p2250o0980n0754m2268
59610D143952l6481l3421l2764l4571l8754m4823n2493o1413p0237p7353q2737
59599C578905q7440r1189r2290r0180q6205q1453p5693o8892o1856n4807m7117
59588B741783l8897l1067k3516j5185o387J083O571J1219J5553J8719K0738K3004
59576B723618K5707K7080K6213K4384K2625K0259J6991J4237J3118J3232J4535
59565B941999J8209K4324L0823L6334M2106M9675N8618O7985P8050Q9144J00574
$$ plain form
59638 14788451 13933615 13062806 12203637 11377450 10598279 9874759 9211130 8607491 8061500
59629 8061500 7570344 7130615 6737512 6386012 6072498 5794028 5546701 5326323 5130279
59620 5130279 4957204 4805184 4671757 4555373 4455310 4370204 4297954 4236974 4186220 4143952
59610 4143952 4107471 4074050 4041286 4006715 3967961 3923138 3870645 3809232 3738995 3661642 3578905
59599 3578905 3491465 3400276 3307986 3217806 3131601 3050148 2974455 2905563 2843707 2788900 2741783
59588 2741783 2702886 2671819 2648303 2633118 2626731 2627814 2634385 2645604 2661157 2679876 2700614 2723618
59576 2723618 2749325 2776405 2802618 2827002 2849627 2869886 2886877 2901114 2914232 2927464 2941999
59565 2941999 2960208 2984532 3015355 3051689 3093795 3143470 3202088 3270073 3348123 3437267 3537841
59554C537841J12212J25414J40852J57256J73630J90918K09827K28841K46077
59545E122868K61510K75653K87535K95612K99350K98483K92266K80891K66184
59536G680352K49518K30741K10436J90891J72761J52748J27381R8151P0650M9449
59526I233078L5692K8768K8016L2971M3643O0444Q2697J07582J31352J50715J62391
59515A0097349J62683J49043J21382Q1023K9468l0851r6093j62604k28062k89967
59505I833371l44446l88030m19631m39610m48031m45207m32828m13229l88164
59496F114195l59278l28568k97326k65765k34638k05913j80700j57891j36101
59487C948015j15677r7497q1104o5440n0332l5911k1637p160O933K0375L4092
$$ plain form
59554 3537841 3650053 3775467 3916319 4073575 4247205 4438123 4647950 4876791 5122868
59545 5122868 5384378 5660031 5947566 6243178 6542528 6841011 7133277 7414168 7680352
59536 7680352 7929870 8160611 8371047 8561938 8734699 8887447 9014828 9112979 9183629 9233078
59526 9233078 9268770 9297538 9325554 9358525 9402168 9462612 9545309 9652891 9784243 9934958 10097349
59515 10097349 10260032 10409075 10530457 10611480 10640948 10610097 10514004 10351400 10123338 9833371
59505 9833371 9488925 9100895 8681264 8241654 7793623 7348416 6915588 6502359 6114195
59496 6114195 5754917 5426349 5129023 4863258 4628620 4422707 4242007 4084116 3948015
59487 3948015 3832338 3734841 3653737 3588297 3537965 3502054 3480417 3473257 3480190 3500565 3534657
59476C534657M8742O3699P8593R4491J12244J30965J49525J68262J87843K07700
59466D776721K26820K44844K60928K72707K77741K74927K63519K42149K10153
59457G050509J68618J19047O2589J728n9098j16139j68028k13575k49892k74832
59447F320927k89659k97171k98413k93201k82559k68490k52227k34559k16833
59438C887815j99907j83108j65895j49398j34688j20899j06965r3855q2997p3675
59428B576428o4239n4821m6630l9408l1930k4328j7724j2063o326n04M501Q573
59416B291529J2240J5397J7745K0006K3028K6395K9552L3386L8670M3371M3688
59405B595007L7844K7643J6700Q533N678Q698J5821K4777L4985M7145O1143P5217
$$ plain form
59476 3534657 3583399 3647098 3725691 3820182 3932426 4063391 4212916 4381178 4569021 4776721
59466 4776721 5003541 5248385 5509313 5782020 6059761 6334688 6598207 6840356 7050509
59457 7050509 7219127 7338174 7400763 7402491 7343393 7227254 7059226 6845651 6595759 6320927
59447 6320927 6031268 5734097 5435684 5142483 4859924 4591434 4339207 4104648 3887815
59438 3887815 3687908 3504800 3338905 3189507 3054819 2933920 2826955 2733100 2650103 2576428
59428 2576428 2512189 2457368 2410738 2371330 2339400 2315072 2297348 2285285 2278959 2278455 2282956 2291529
59416 2291529 2303769 2319166 2336911 2356917 2379945 2406340 2435892 2469278 2507948 2551319 2595007
59405 2595007 2632851 2660494 2677194 2685727 2691405 2700103 2715924 2740701 2775686 2822831 2883974 2959191
59393B959191Q6746R3475R5317R5809J00433J12192J29714J50499J74233K01682
59383D199291K32327K65224L00845L39988L81776M24567M67666N10158N48871
59374G670713N79354N98213O03244N92732N66763N28433M82038M30747L77242
59365A2429479L25063K77246K34580J96809J64224J36211J09701Q1150M9145J3247
59355A4016855k8113p6124j29067j83320k35705k82840l19935l43324l53594l54094
59345A1710739l47564l36535l25433l18860l18138l21973l29613l40601l52380
59336H719642l61294l65801l66139l61459l50306l33519l13761k92189k68313
59327E706861k42902k18132j94700j71558j48672j27557j08757r1254p4673n9771
$$ plain form
59393 2959191 3045937 3139412 3234729 3330538 3430971 3543163 3672877 3823376 3997609 4199291
59383 4199291 4431618 4696842 4997687 5337675 5719451 6144018 6611684 7121842 7670713
59374 7670713 8250067 8848280 9451524 10044256 10611019 11139452 11621490 12052237 12429479
59365 12429479 12754542 13031788 13266368 13463177 13627401 13763612 13873313 13954463 14003608 14016855
59355 14016855 13988742 13912618 13783551 13600231 13364526 13081686 12761751 12418427 12064833 11710739
59345 11710739 11363175 11026640 10701207 10382347 10064209 9742236 9412623 9072022 8719642
59336 8719642 8358348 7992547 7626408 7264949 6914643 6581124 6267363 5975174 5706861
59327 5706861 5463959 5245827 5051127 4879569 4730897 4603340 4494583 4403329 4328656 4268885
59317D268885m6549l4052k2299j2186l371N633J5046K3617L0970L8066M5055N0629
59305D359444N3824N4759N3455M9648M3755L6380K7103J5460K822q622j8379k7278
59293D642371l5010m0202m2647m3353m2501l9392l4136k7385j8750p581N131J7830
59281D334375L0970M6094O2750P8918R4259J10248J27043J42842J56495J68253
59271E352247J77629J83049J84016J81304J74419J60864J38496J07209O8718K6715
59261F754666j3149m6040p1077r0037j03529j10805j12698j11758j09345j05361
59251E880867j00797r7608r5803r3666r1262r0731r2404r3685r2794r0824q8884
59240D852409q5788q0071p2140o2951n2262l9379k4214o719J3346L5538N9042
$$ plain form
59317 4268885 4222336 4188284 4165985 4153799 4150428 4156061 4171107 4194724 4225694 4263760 4308815 4359444
59305 4359444 4413268 4468027 4521482 4571130 4614885 4651265 4678368 4693828 4696650 4688028 4669649 4642371
59293 4642371 4607361 4567159 4524512 4481159 4438658 4399266 4365130 4337745 4318995 4311414 4316545 4334375
59281 4334375 4365345 4411439 4474189 4553107 4647366 4757614 4884657 5027499 5183994 5352247
59271 5352247 5529876 5712925 5896941 6078245 6252664 6413528 6552024 6659233 6727951 6754666
59261 6754666 6741517 6695477 6624400 6534363 6430834 6320029 6207331 6095573 5986228 5880867
59251 5880867 5780070 5682462 5586659 5492993 5401731 5311000 5218596 5124911 5032117 4941293 4852409
59240 4852409 4766621 4686550 4614410 4551459 4499197 4459818 4435604 4428885 4442231 4477769 4536811
59229D536811Q4226J12313J43346J76208K10712K47642K86384L24472L59639L90267
59219F872020M13536M25295M22415M03554L67667L14068K44412J62533P1964k4434
59209I673030j22258k15351k98374l67879m20939m55408m71930m73502m62556
59200F384833m40566m10518l76976l42931l08815k75092k43407k14635j88245
59191C583648j64314j43976j27275j12857j00287r0374q2727p5499o8103o1714
59181B556522n6484n0832m4275l8303l3580k8780k3184j7962j3799r603m618L57
59169B235459M875R678J4798J8965K1961K5293K9689L4120L8146M2867M8545N3664
59157B578060N7477O1333O6373P1915P7097Q2041Q6477Q9320R0425R0745R0095
$$ plain form
59229 4536811 4621037 4733350 4876696 5052904 5263616 5511258 5797642 6122114 6481753 6872020
59219 6872020 7285556 7710851 8133266 8536820 8904487 9218555 9462967 9625500 9697464 9673030
59209 9673030 9550772 9335421 9037047 8669168 8248229 7792821 7320891 6847389 6384833
59200 6384833 5944267 5533749 5156773 4813842 4505027 4229935 3986528 3771893 3583648
59191 3583648 3419334 3275358 3148083 3035226 2934939 2844565 2761838 2686339 2618236 2556522
59181 2556522 2500038 2449206 2404931 2366628 2333048 2304268 2281084 2263122 2249323 2239720 2235102 2235459
59169 2235459 2240334 2250012 2264810 2283775 2305736 2331029 2360718 2394838 2432984 2475851 2524396 2578060
59157 2578060 2635537 2696870 2763243 2835158 2912255 2994296 3080773 3170093 3260518 3351263 3441358
59146C441358Q6956Q1052P3709O5103N3857M0082K6017J2695j124j5575k8241
59135C835889l7451m4261m9692n2704n2570n0609m7786m2947l5157k5583j5444
59124C381685m283Q195K0787L2837M5442N9164P2768Q5701R9426J14722J30001
59113D046445J44012J57916J72997J88536K03692K19275K35716K51357K64419
59104E884365K74673K81329K81364K71839K52141K22574J82827J33709P8461K0728
59094G884010l7077r2265j41175j81755k14829k41371k60814k73491k81995k87988
59084E871250k90025k86591k79095k69670k58293k44382k29211k14361j99545
59075C600077j84205j69544j56787j45045j33036j21389j11253j02236r3530q5530
$$ plain form
59146 3441358 3528314 3609366 3683075 3748178 3802035 3842117 3868134 3880829 3879705 3864130 3835889
59135 3835889 3798438 3754177 3704485 3651781 3599211 3548602 3500816 3457869 3422712 3397129 3381685
59124 3381685 3377402 3385597 3406384 3439221 3484663 3543827 3616595 3702296 3801722 3916444 4046445
59113 4046445 4190457 4348373 4521370 4709906 4913598 5132873 5368589 5619946 5884365
59104 5884365 6159038 6440367 6721731 6993570 7245711 7468285 7651112 7784821 7863282 7884010
59094 7884010 7846933 7754668 7613493 7431738 7216909 6975538 6714724 6441233 6159238 5871250
59084 5871250 5581225 5294634 5015539 4745869 4487576 4243194 4013983 3799622 3600077
59075 3600077 3415872 3246328 3089541 2944496 2811460 2690071 2578818 2476582 2383052 2297522
59065B297522p8545p1550o3889n6522m9940m2847l4535k6534k0015j3730o504
59054A832911M06N516R557J3495J6053J5571J2501P843R62q686j9348k8741l6410
59041A821630m2348m5188m4025m0337l5895l0498k3869j7803j4018j1701r488
59030A506460p955p682o819l349J814O475J0362J4111J6772J7108J5898J4443
59018A577638J2066P695K558j239l584n440o442n800m276k824o42L106P100R766
59004A589682J1906J4880J7600J7972J6017J3052R099L683k086o845j1135j5817
58992A658008j9639k0937k0471j9920j8900j6194j2704j0284q596n924k330N93
58980A502702K375L746M856N633P022R668J2364J3860J5048J7356K0330K2915
$$ plain form
59065 2297522 2218977 2147427 2083538 2027016 1977076 1934229 1899694 1873160 1853145 1839415 1832911
59054 1832911 1833317 1838833 1848390 1861885 1877938 1893509 1906010 1913853 1914815 1906129 1886781 1858040 1821630
59041 1821630 1779282 1734094 1690069 1649732 1613837 1583339 1559470 1541667 1527649 1515948 1506460
59030 1506460 1498505 1490823 1484004 1480655 1482469 1488944 1499306 1513417 1530189 1547297 1563195 1577638
59018 1577638 1589704 1597399 1599957 1598718 1595134 1589694 1583252 1577452 1573176 1570352 1569710 1572816 1579916 1589682
59004 1589682 1601588 1616468 1634068 1652040 1668057 1681109 1690208 1693891 1691805 1684960 1673825 1658008
58992 1658008 1638369 1617432 1596961 1577041 1558141 1541947 1529243 1518959 1510363 1504439 1502109 1502702
58980 1502702 1505077 1508823 1513679 1519312 1526334 1536002 1548366 1562226 1577274 1594630 1614960 1637875
58968A637875K5657K9322L2856L5120L7072L9808M2066M2301M1656M2100M3108
58957B048941M2906M1584M0155L8027L4351L0471K8175K6831K5128K4147K5637
58946B406353K8785L1837L5509M1443M8619N4796O0422O7627P6382Q5050R3780
58935C030603J03816J14204J22767J29706J37052J45239J53614J63575J77599
58926D278175J95489K14977K35683K59315K86293L15453L46895L81921M20302
58917F934503M60418N01946N45606N90632O35173O78570P20318P57194P84097
58908A2608457P97163P93388P68192P16769O37640N32474M03631K55021R4508
58899A7607243o8015k24586l68854m93622n92809o65480p14591p42366p50111
$$ plain form
58968 1637875 1663532 1692854 1725710 1760830 1797902 1837710 1879776 1922077 1963733 2005833 2048941
58957 2048941 2091847 2133431 2173586 2211613 2245964 2276435 2304610 2331441 2356569 2380716 2406353
58946 2406353 2435138 2466975 2502484 2543927 2592546 2647342 2707764 2775391 2851773 2936823 3030603
58935 3030603 3134419 3248623 3371390 3501096 3638148 3783387 3937001 4100576 4278175
58926 4278175 4473664 4688641 4924324 5183639 5469932 5785385 6132280 6514201 6934503
58917 6934503 7394921 7896867 8442473 9033105 9668278 10346848 11067166 11824360 12608457
58908 12608457 13405620 14199008 14967200 15683969 16321609 16854083 17257714 17512735 17607243
58899 17607243 17539228 17314642 16945788 16452166 15859357 15193877 14479286 13736920 12986809
58890A2986809p41376p21062o91655o53913o10644n65898n20809m74269m27565
58881G579618l84396l46196l11393k79497k52252k30428k13079k00256j92833
58872E169288j89201j85552j79983j73246j65471j55510j43846j32692j22798
58863C720989j13092j03621r5604q8600q0942p3083o7121o2913n8041n1786m5723
58852B880463m0276l4199k7680k2374j8100j2883o579r78L848R709J6562K2357
58840B769870K7019L2828M0260M7139N2688N8817O6510P4338Q1486Q9089R7706
58829C437750J06516J15644J26285J38096J49559J61200J75207J91702K08850
58820D810809K26885K48316K73697L01099L30332L63741M01930M42470M84037
$$ plain form
58890 12986809 12245433 11524371 10832716 10178803 9568159 9002261 8481452 8007183 7579618
58881 7579618 7195222 6849026 6537633 6258136 6005884 5775456 5562377 5362121 5169288
58872 5169288 4980087 4794535 4614552 4441306 4275835 4120325 3976479 3843787 3720989
58863 3720989 3607897 3504276 3408672 3320072 3239130 3166047 3098926 3036013 2977972 2926186 2880463
58852 2880463 2840187 2805988 2778308 2755934 2737834 2724951 2718372 2717394 2721242 2730951 2747513 2769870
58840 2769870 2796889 2829717 2869977 2917116 2969804 3028621 3095131 3169469 3250955 3340044 3437750
58829 3437750 3544266 3659910 3786195 3924291 4073850 4235050 4410257 4601959 4810809
58820 4810809 5037694 5286010 5559707 5860806 6191138 6554879 6956809 7399279 7883316
58811G883316N28043N74855O21737O65761P05577P38936P61448P68869P58026
58802A4006568P24931O65273N77887M65348L31179J79641J8481j41864k92699
58793A6534745m28155n42505o30630o91855p29518p46267p43387p24848o97313
58784A0600267o65009o28414n88813n49900n13742m79256m45858m14692l85266
58775E929317l55154l24424k96404k72753k51655k32124k15743k02613j89888
58766C588559j76101j63131j52120j41366j29969j19635j11065j02400r2965q4775
58756B315032p8504p1817o3578n5874n0049m4480l8124l2490k8209k3480j7794
58745A810633j3319j0672p291k064K445M506N929P889Q047M483j139o772j2843
$$ plain form
58811 7883316 8411359 8986214 9607951 10273712 10979289 11718225 12479673 13248542 14006568
58802 14006568 14731499 15396772 15974659 16440007 16771186 16950827 16969308 16827444 16534745
58793 16534745 16106590 15564085 14933455 14241600 13512082 12765815 12022428 11297580 10600267
58784 10600267 9935258 9306844 8718031 8168131 7654389 7175133 6729275 6314583 5929317
58775 5929317 5574163 5249739 4953335 4680582 4428927 4196803 3981060 3778447 3588559
58766 3588559 3412458 3249327 3097207 2955841 2825872 2706237 2595172 2492772 2399807 2315032
58756 2315032 2236528 2164711 2101133 2045259 1995210 1950730 1912606 1880116 1851907 1828427 1810633
58745 1810633 1797314 1786642 1779351 1777287 1779732 1784238 1790167 1798056 1806103 1810586 1809447 1802675 1789832
58732A789832j9534k4786k7472k9194l0745l0379k7799k5957k6535k7384k6922
58721A493125k7085k9188l0874l0273k9498l0758l2503l2639l2221l2676l2577
58710A152833l0480k8053k7085k6166k3437k0055j7903j6421j4599j3434j3688
58699I21512j3694j2084j0255r691r427q472p972q623q784p541o653p122o941
58686H04253m732k445j955k002j166o75j643k609k453k673m166m921l526j776
58672G67511j162k7K963N883O905P347Q514Q874P203N432N337N598M813M130M128
58657H43449K655j304n126o798q034j0167j0925q675n938n090m284j420J615K589
58643G82547L191N650Q429R414J0081J2400J4832J5510J6228J9094K2340K3632
$$ plain form
58732 1789832 1770298 1745512 1718040 1688846 1658101 1627722 1599923 1573966 1547431 1520047 1493125
58721 1493125 1466040 1436852 1405978 1375705 1346207 1315449 1282946 1250307 1218086 1185410 1152833
58710 1152833 1122353 1094300 1067215 1041049 1017612 997557 979654 963233 948634 935200 921512
58699 921512 907818 895734 885479 875788 866361 857889 849917 841294 832510 824969 818316 811194 804253
58686 804253 799521 797076 795121 793119 791953 791278 789635 787026 784573 781900 777734 772813 769287 767511
58672 767511 766349 766322 769285 775168 782073 789420 797934 806808 814011 819443 824780 830378 835191 839321 843449
58657 843449 846104 844800 839674 832876 824842 814675 803750 795075 789137 784047 779763 778343 779958 782547
58643 782547 785738 791388 799817 809231 819312 831712 846544 862054 878282 897376 919716 943348
58631I43348K4560K7641L1840L5170L8761M4211M9832N3865N8413O6021P5249
58620A448911Q3865R3425J06183J20540J34082J48301J65541J84052K00735K16118
58610B901753K31778K45242K52168K51284K42603K23335J90452J45484R2594L4348
58600D811041k6412q3484j31090j68669j97724k16738k23977k22471k16976k08244
58590C115256j95125j79774j65531j51881j36746j21627j09321r8595q6406p3506
58580A796744o2747n3686m4056l4749k8177k3384j7846j2428r547q070n082j175
58568A495797R78J732L356N514O582P643J0356J2641J1272O889J711n360j6168
58555A542943k8078l6729m2081m6514m9107m7473m3328m0362l8215l4232k9566
$$ plain form
58631 943348 967908 995549 1027389 1062559 1101320 1145531 1195363 1249228 1307641 1373662 1448911
58620 1448911 1532776 1626201 1732384 1852924 1987006 2135307 2300848 2484900 2685635 2901753
58610 2901753 3133531 3378773 3630941 3882225 4124828 4348163 4538615 4684099 4776693 4811041
58600 4811041 4784629 4701145 4570055 4401386 4203662 3986924 3762947 3540476 3323500 3115256
58590 3115256 2920131 2740357 2574826 2422945 2286199 2164572 2055251 1956656 1870250 1796744
58580 1796744 1733997 1680311 1636255 1601506 1573329 1549945 1532099 1519671 1510124 1502054 1496972 1495797
58568 1495797 1496775 1498507 1501863 1507377 1513959 1521602 1531958 1544599 1555871 1562760 1564471 1559111 1542943
58555 1542943 1514865 1478136 1436055 1389541 1340434 1292961 1249633 1209271 1171056 1136824 1107258
58544A107258k7612k7803k6715k4212k2856k2456k0731j8269j7400j7360j5810
58533H66034j3759j3655j4179j2358r294q221q580p674o381p331r139q606p037
58520G39820q037j0630j0972r520r800j1304j0378p323n836n996m520j488k57
58507F43759r50m17J608K540K741M978Q436R563Q621R237J1716J2956J2816J4328
58493G41932J7667J9956K0934K2982K5742K6477K5397K4830K3797J9400J2855
58482I81969Q096N102P72m693q649j2132j8177k4874k7225k5372k4051k4337k3111
58469H03318k0235j8958j9227j7759j4767j3611j3931j2187q844p758q666p604
58457F39771m590l443l994k330J231K210L43L3K059K647J367K035M961O154N162
$$ plain form
58544 1107258 1079646 1051843 1025128 1000916 978060 955604 934873 916604 899204 881844 866034
58533 866034 852275 838620 824441 812083 802789 794568 785988 778314 771933 764602 755463 746857 739820
58520 739820 731783 721153 710181 700661 690861 679557 669179 661856 656020 650024 645504 644016 643759
58507 643759 642809 642392 644000 646540 649281 654259 662695 672258 680879 690116 701832 714788 727604 741932
58493 741932 759599 779555 800489 823471 849213 875690 901087 925917 949714 969114 981969
58482 981969 990065 995167 995939 991246 982597 970465 952288 927414 900189 874817 850766 826429 803318
58469 803318 783083 764125 744898 727139 712372 698761 684830 672643 663799 656041 647375 639771
58457 639771 635181 631738 627744 625414 626645 628855 629198 629231 631290 633937 635304 637339 642300 648454 653616
58442F53616O006R351J1402J1499J3252J7214J9921K1097K4067K8263K8954K5336
58430H69978K1267J7379J0448J219n378q705j2896j8152j9957j7944j6897j7841
58418H02521j6641j2689j0233r828p282k423l3n90Q80N263P875Q062J0737J6421
58404G92040J9354J7928J7368J9513J9303J4271Q347L498l205j1450j5860j5276
58392H65831j4906j6622j6225j2852j1434j3113j2798r190p384q613p455k480
58380G32759M77q54j162J958L741K153J927M772N763L451L307P006Q714O296N621
58365G85929R262J1578R804R278J2606J4308J1609R982J2470J3974J1678J0736
58353I23214J3956J6258J4979J5238J9329K1320J7962J4460J3644J0263J972m874
$$ plain form
58442 653616 659622 668973 680375 691874 705126 722340 742261 763358 787425 815688 844642 869978
58430 869978 891245 908624 919072 920291 914913 906208 893312 875160 855203 837259 820362 802521
58418 802521 785880 773191 762958 753130 745848 743425 743392 742802 743682 748945 756820 764882 775619 792040
58404 792040 811394 829322 846690 866203 885506 899777 908124 911622 908417 896967 881107 865831
58392 865831 850925 834303 818078 805226 793792 780679 767881 758691 751307 742694 735239 732759
58380 732759 733236 732382 731220 733178 736919 739072 740999 745771 751534 754985 758292 765298 774012 780308 785929
58365 785929 795191 806769 816573 825851 838457 852765 864374 874356 886826 900800 912478 923214
58353 923214 937170 953428 968407 983645 1002974 1024294 1042256 1056716 1070360 1080623 1082595 1077721
58341A077721o513q014j2324j4260j1506j0143j2794j2912p407l146m008l590
58329I71104K028O381N200M611Q949J2398J1026J0863J5681J8886J6238J4400
58317A097765J8065K0973J8724J7907K3062K7179K4901K2581K5222K6178K0083
58306A342640J3352J1284P660j957r475q158m638n744o263j215K830P13j44O245
58292A347130J2249J0915R148J3878J8470J6168J3697J7935K2370K0600J9789
58281A522349K6657L3646L3390L3173M0364M7594M7406M7412N5203O2567O0719
58270B010480N6754N8705N8948M9317L7823L3265K8441J6197O375Q465J3223J0420
58258B388413Q549J7300K7219K7371K6510L5412M5069M4482M2957N1960O2167
$$ plain form
58341 1077721 1071208 1063194 1050870 1036610 1025104 1014961 1002167 989255 981848 978702 974694 971104
58329 971104 973132 979513 984713 989324 998273 1010671 1021697 1032560 1048241 1067127 1083365 1097765
58317 1097765 1115830 1136803 1155527 1173434 1196496 1223675 1248576 1271157 1296379 1322557 1342640
58306 1342640 1355992 1367276 1374936 1372979 1363504 1355346 1350708 1344964 1338701 1337486 1340316 1341029 1340885 1347130
58292 1347130 1359379 1370294 1379442 1393320 1411790 1427958 1441655 1459590 1481960 1502560 1522349
58281 1522349 1549006 1582652 1616042 1649215 1689579 1737173 1784579 1831991 1887194 1949761 2010480
58270 2010480 2067234 2125939 2184887 2234204 2272027 2305292 2333733 2349930 2356305 2364770 2377993 2388413
58258 2388413 2396962 2414262 2441481 2468852 2495362 2530774 2575843 2620325 2663282 2715242 2777409
58247B777409O1921O0819P0612Q0896P9085P6086Q5733R7533R7241R5231J05925
58236C688491J18666J18790J17685J30901J46851J49501J50990J67998J87584
58227D977457J91971J94813K15501K40668K50587K59805K89744L25631L44751
58218G290928L62098M01288M46567M73617N00639N55928O23327O76441P36800
58209A2067633Q36956R57649J067970J194667J379985J606317J841651K122144
58201B3074972K502834K967276L483020M103591M907473N884406P005590Q354474
58193F2283636J0051731J2124201J4626078J7811496K1966629K7151550L3318817
58186A99334138M0333028M7055722N0286057M5730338L1326596R853095j2307787
$$ plain form
58247 2777409 2839330 2900149 2970761 3051657 3130742 3206828 3292561 3390094 3487335 3582566 3688491
58236 3688491 3807157 3925947 4043632 4174533 4321384 4470885 4621875 4789873 4977457
58227 4977457 5169428 5364241 5579742 5820410 6070997 6330802 6620546 6946177 7290928
58218 7290928 7653026 8054314 8500881 8974498 9475137 10031065 10654392 11330833 12067633
58209 12067633 12904589 13862238 14930208 16124875 17504860 19111177 20952828 23074972
58201 23074972 25577806 28545082 32028102 36131693 41039166 46923572 53929162 62283636
58193 62283636 72335367 84459568 99085646 116897142 138863771 166015321 199334138
58186 199334138 239667166 286722888 337008945 382739283 414065879 423918974 411611187
58179D11611187k9314819l8911957m2107540m1037299l7545644l2991802k8319419
58172A61382707k3988862k0102276j6703817j3859995j1529369r575410p928207
58165E7694771o595892n529216m615945l809454l137213k578873k053016j531271
58157B7843891j051521o01951r9702M94014J147238J873475K732427L601915M032500
58148C9972286L501928J890266l26675k384486l734332m289117m280318l973279
58140B6376273l527651l033714k564945k161883j816445j511424j255010j056839
58132I448362q99064p59033o39255n48984m76336m05917l46076l10745k89525
58123D773427k63215k35410k21219k16597k05895j89710j78945j70119j52153
$$ plain form
58179 411611187 382296368 343384411 301276871 260239572 222693928 189702126 161382707
58172 161382707 137393845 117291569 100587752 86727757 75198388 65622978 57694771
58165 57694771 51098879 45569663 40953718 37144264 34007051 31428178 29375162 27843891
58157 27843891 26792370 26190419 26090717 26584731 27731969 29605444 32337871 35939786 39972286
58148 39972286 43474214 45364480 45037805 42653319 38918987 34629870 30349552 26376273
58140 26376273 22848622 19814908 17249963 15088080 13271635 11760211 10505201 9448362
58132 9448362 8549298 7790265 7151010 6602026 6125690 5719773 5373697 5062952 4773427
58123 4773427 4510212 4274802 4053583 3836986 3631091 3441381 3262436 3092317 2940164
58114B940164j29989j16841j09739r6105p8278o8737o7040o3518n9927o4669p2910
58103B012411p2787o6455o4539o4915n7553m5521m0378m0714l5559k5572k1071
58092A477347k2094j9942j5775j8602k6855l0413k9067l1285l6608l6789l2751
58081A177166l3111l7244l6588l1415k9909l1831k9368k3167k1431k3893k2421
58070H56788j6852j4812j6444j4555r545q972j2541j2329p950o879r581q856m352
58057G13120l456p047q245o109o947j1122j1930q744q203j1129j1102p282o055
58044F05749q462q290m271k253l690l579j267j725m721m216J8J520q14j039J936
58029E64896K193j605l595j800j073k877k635N58J829K80P76M007M761K119J420
$$ plain form
58114 2940164 2810175 2693334 2583595 2487490 2409212 2340475 2273435 2209917 2149990 2085321 2012411
58103 2012411 1939624 1873169 1808630 1743715 1686162 1640641 1600263 1559549 1523990 1498418 1477347
58092 1477347 1455253 1435311 1419536 1400934 1374079 1343666 1314599 1283314 1246706 1209917 1177166
58081 1177166 1144055 1106811 1070223 1038808 1008899 977068 947700 924533 903102 879209 856788
58070 856788 839936 825124 808680 794125 784580 775608 763067 750738 742788 735909 726328 717472 713120
58057 713120 709664 702617 694372 688263 681316 670194 658264 649520 641317 630188 619086 611804 605749
58044 605749 597287 588997 584726 582473 578783 575204 573937 572212 567491 563275 563293 564813 563999 562960 564896
58029 564896 567089 565484 561889 560089 559016 556139 553504 554062 555891 556171 556947 560954 565715 567834 569254
58014E69254L947M671K393K176N175N996K945J266L243M405K658K079M467N820
58000F20495M443M172O417P132M635K564K223j03n474r684j0988j2824j6316j7764
57986E78928j6105j5274j6463j5677j1614q509q403p928n443m015m663l827l41
57973D60666K143K168K882N073N064K185J013L247M561K492N63J377K423J883
57959D97740J999L558L383M28j797j696k325m991o472n326m711o147o601m594
57945D62448l034l350k892p65mj394j497N80J027j376k457k66J280m08k307k152
57929D43433k673n757q534r096j0089j2858j3907j1184q160p730p502n078k599
57916C38266k100j615K31R53o22j166J318L563K933K170M192O991P832P926Q844
$$ plain form
58014 569254 573201 577872 580265 582441 587616 593612 596557 597823 601066 605471 608129 610208 614675 620495
58000 620495 624938 629110 635527 642659 647294 649858 652081 651978 646504 636820 625832 613008 596692 578928
57986 578928 562823 547549 531086 515409 503795 495286 486883 478955 473512 469497 464834 461007 460666
57973 460666 462809 464977 467859 472932 477996 480181 481194 484441 489002 491494 492057 493434 495857 497740
57959 497740 499739 503297 506680 507108 505311 503615 501290 496299 489827 484501 479790 473643 467042 462448
57945 462448 459414 456064 453172 452407 452403 451009 449512 450092 451119 449743 447286 447020 448300 447892 445585 443433
57929 443433 440760 435003 426469 417373 407284 394426 380519 369335 361175 353445 345943 340865 338266
57916 338266 336166 334551 334782 335735 335113 333947 335265 338828 341761 343931 348123 355114 362946 370872 379716
57901C79716Q835O708N083N855O589N135L538L807M119K869K116L344M041K223
57887D43978R6k69o81k711m235l682l340m801n539l742k162l290n006m908m534
57872C95174n416n341k719l47n62r02J175L451L287K601L879N107L593J183R42
57857D05105J876J569Q25J252J409k22j602p74J10j290k934k221r23j673k748
57842C97759j387Q23Q39k73L25J865J848R73J361K021Q59r31j047o55k193m630
57826C97557n422n293o577q527q797p913q044q819q561p920q345q657p218n592
57812B91872n906o597n045k603k375l739l687k266j948k715k351q32j16k53L50
57797B51789J529J961K349M307O972Q266Q517R332R977Q597N924M117L019J229
$$ plain form
57901 379716 388551 395259 400342 406197 412786 417921 421459 425266 429385 432254 434370 437714 441755 443978
57887 443978 444074 443805 443124 440413 436178 432496 429156 424355 418816 415074 412912 409622 404616 399708 395174
57872 395174 389758 384417 381698 381351 380789 379887 381062 384513 387800 390401 394280 399387 402980 404163 405105
57857 405105 406981 408550 409375 410627 412036 411814 410212 409438 409548 408258 405324 403103 402180 400507 397759
57842 397759 396372 397195 398034 397761 398086 399951 401799 402772 404133 406154 407013 406082 405035 404380 402187 397557
57826 397557 392135 386842 380265 371738 362941 355028 346984 338165 329604 321684 313339 304682 297464 291872
57812 291872 285966 279369 274324 271721 269346 265607 261920 259654 257706 254991 252640 251808 251692 251439 251789
57797 251789 253318 255279 257628 261935 268907 277173 285690 295022 304999 313596 319520 323637 326656 327885
57783C27885l77j7J201P39j008j670j272j791l172l664l474m344n938o321n526
57768B91251n200n224m169k526k046k331j501J93Q04K71L82J509K450L000L739
57753B80602L927K607J039J076J943J701Q56J298K689L264L286M168N084M123
57739C17663K092J475K200K098J004P09J243R50N1M86K247L338L332L649M419
57724C46956M369L778M204N413N778N519O297P811Q166P538Q067J0018J1392J1463
57710D46769J1573J2209J2468J2551J3784J5927J7323J7841J8908K0736K2342
57699F22431K4003K6844L0278L2933L5688M0540M6871N2289N6871O3040P1390
57688A103178Q0333Q9917J02149J17073J32294J46969J62888J80869J99358K17045
$$ plain form
57783 327885 327508 327491 328692 329431 328423 326753 325481 323690 320518 316854 313380 309036 303098 296777 291251
57768 291251 286051 280827 276658 274132 272086 269755 268254 268447 269251 269522 269904 271413 273863 276863 280602
57753 280602 284529 287136 288175 289251 291194 292895 293751 295049 297738 301002 304288 308456 313540 317663
57739 317663 319755 321230 323430 325528 326532 327241 328484 329434 329485 329971 332218 335556 338888 342537 346956
57724 346956 351325 355103 359307 364720 370498 376017 382314 390125 398291 405829 413896 423914 435306 446769
57710 446769 458342 470551 483019 495570 509354 525281 542604 560445 579353 600089 622431
57699 622431 646434 673278 703556 736489 772177 812717 859588 911877 968748 1031788 1103178
57688 1103178 1183511 1273428 1375577 1492650 1624944 1771913 1934801 2115670 2315028 2532073
57678B532073K33478K46507K52330K48894K36314K13859J80305J38063R3612N2704
57668D428139J8189p426k1956k8544l7558o0357j01255j54985k09407k50863k70923
57657C303054k70525k56733k35660k10299j83715j59741j39561j21188j03537
57648A622095q8025p5324o3911n2983m3795l6770l0275k3466j7509j2646p033
57637A170358P8O760J1579J5857K1302K7771L4761M2765N1768O0551O8782P7788
57625A590120Q8346R9855J12425J27187J43647J59226J72555J84516J94917K00753
57615C073547J99094J89057J69822J39630R8655N0610m6n0351r7220j36491j65659
57604C470648j85478j97328k01162j97606j89577j79769j68381j55093j41342
$$ plain form
57678 2532073 2765551 3012058 3264388 3513282 3749596 3963455 4143760 4281823 4375435 4428139
57668 4428139 4446328 4438902 4416946 4388402 4350844 4290487 4189232 4034247 3824840 3573977 3303054
57657 3303054 3032529 2775796 2540136 2329837 2146122 1986381 1846820 1725632 1622095
57648 1622095 1534070 1458746 1394835 1341852 1298057 1261287 1231012 1207546 1190037 1177391 1170358
57637 1170358 1170436 1177196 1188775 1204632 1225934 1253705 1288466 1331231 1382999 1443550 1512332 1590120
57625 1590120 1678466 1778321 1890746 2017933 2161580 2320806 2493361 2677877 2872794 3073547
57615 3073547 3272641 3461698 3631520 3771150 3869805 3920415 3920369 3870018 3772798 3636307 3470648
57604 3470648 3285170 3087842 2886680 2689074 2499497 2319728 2151347 1996254 1854912
57595A854912j28831j17464j06513r6371q7577p9626p2082o5406n9598n3671m7587
57584I40186m2768l9599l6404l2151k8148k5666k3857k1533j9168j7571j6281
57573F37040j4749j3500j2807j1755r888q136p040n860m436l976m725m923l363
57560E31882j111O52K385M382N433M951M475N332O639P263P903R457J1129J1925
57546F12697J2526J3894J5639J7278J9589K3077K6646K9372L2087L5816M0238
57535H78859M5093N1241N8868O6457P3231Q0755R0405J01097J11337J21653J32921
57524A811917J43937J52757J58847J61815J59384J48851J29545J02237O7613K7315
57514C064218j4700n3934q7778j15040j34649j46510j52256j53422j50056j42458
$$ plain form
57595 1854912 1726081 1608617 1502104 1405733 1318156 1238530 1166448 1101042 1041444 987773 940186
57584 940186 897418 857819 821415 789264 761116 735450 711593 690060 670892 653321 637040
57573 637040 622291 608791 595984 584229 574341 566205 559165 553305 548869 544893 540168 535245 531882
57560 531882 530771 531423 533808 538190 543623 548574 553049 558381 565020 572283 580186 589643 600772 612697
57546 612697 625223 639117 654756 672034 691623 714700 741346 770718 802805 838621 878859
57535 878859 923952 975193 1034061 1100518 1173749 1254504 1344909 1446006 1557343 1678996 1811917
57524 1811917 1955854 2108611 2267458 2429273 2588657 2737508 2867053 2969290 3036903 3064218
57514 3064218 3049518 2995584 2907806 2792766 2658117 2511607 2359351 2205929 2055873 1913415
57504A913415j32628j22342j11504j00064q9657q1323p3502o4587n5783m9053
57494A032972m3778l8057l1990k6999k2912j8403j3579r725p006m461j718J151
57482H15495M648Q890J2617J5083J7843K2686K8859L4461L9519M5400N2102N8570
57470A156173O5028P2748Q1991R2151J03293J15490J27404J37455J45634J52091
57460B249458J54749J50480J37956J17398Q8591N1842J0283l1252o9523j03150
57450B756832j30338j49022j59194j62902j61834j56653j48407j38532j27572
57441A422378j15607j03663r3080q3875p5365o7827o1859n6793n1564m6476m2199
57430F24070l8020l3115k8681k6356k5200k2899j9403j6790j5753j4883j3435
$$ plain form
57504 1913415 1780787 1658445 1546941 1446877 1357220 1275897 1202395 1137808 1082025 1032972
57494 1032972 989194 951137 919147 892148 869236 850833 837254 827529 820523 816062 814344 815495
57482 815495 820143 829033 841650 856733 874576 897262 926121 960582 1000101 1045501 1097603 1156173
57470 1156173 1221201 1293949 1375940 1468091 1571384 1686874 1814278 1951733 2097367 2249458
57460 2249458 2404207 2554687 2692643 2810041 2898632 2950474 2960757 2929505 2859982 2756832
57450 2756832 2626494 2477472 2318278 2155376 1993542 1836889 1688482 1549950 1422378
57441 1422378 1306771 1203108 1110028 1026153 950788 882961 821102 764309 712745 666269 624070
57430 624070 586050 552935 524254 497898 472698 449799 430396 413606 397853 382970 369535
57419C69535j2287j1881j1509j0969j0832j0874j0119q588p282o469n739n477
57407B57509o325p425p262o014n105m681l715k331j711j796j438p69j017j910
57393B06010j761l58O16M12J13L19K53l16m25J29K79l10o26k08J94K96O37R45
57375B06199J73j413k206j820j626k214k420j589p77q52j258j401j626k026j930
57360A83214j227p09n85k10L71L78qK79J050Q76l41r83m41l3m75o13K87J119Q98
57341A82847K71j0l26q18n25Q98K240K597K622K927K906K154J501J464J223K33
57325B02204o29n88k04PO78K153L390L454K823K193J333K06k23N47J560J984K389
57308B23277L309L921L424K566K512L248M203N353O558O913N968M739M466N194
$$ plain form
57419 369535 357248 345367 333858 322889 312057 301183 291064 282476 275194 268725 262986 257509
57407 257509 251184 243759 236497 230483 225378 220697 216982 214651 212940 211144 209706 208937 207920 206010
57393 206010 204249 203891 204507 204919 205032 205351 205604 205288 204863 204992 205271 204961 204335 204127 204321 204617 205254 206199
57375 206199 206372 204959 202753 200933 199307 197093 194673 193084 192307 191455 190197 188796 187170 185144 183214
57360 183214 181987 181278 180693 180483 180854 181232 181224 181503 182553 183429 183088 182105 181664 181631 181156 180543 180830 181949 182847
57341 182847 183118 183108 182782 181964 181439 182337 184577 187174 189796 192723 195629 197783 199284 200748 201971 202204
57325 202204 201575 200987 200783 200790 201468 203621 207011 210465 213288 215481 216814 217020 216797 217344 218904 220888 223277
57308 223277 226586 230507 233931 236497 239009 242257 246460 251813 258371 265284 271252 275991 280457 285651
57294B85651O306P493Q453Q751Q738R435J0905J2092J2925J4807J8093K0937K2002
57281D46588K2617K4602K7444K9410L0245L0839L1181L0504K8888K6962K4392
57270G53672K0163J4139P229K24o543j2737j8046k2381k5555k7344k8193k9006
57258F25622k9701k9088k6710k3685k1087j8763j6491j4863j4059j3131j1547
57247D06497j0204r810r572q638p463o609n567m087l311l986m826m287k854j901
57233C23382j396m74N88P79J58l20l21j49J38M56L18j84L6J268K047J317L23O42
57215C28608J576J436L62j74Q0K59L87J177K264K604K404K762L682M252M437M956
57199C61072N589N490M912M861N219N078M659N054O122O598O258O132O459O324
$$ plain form
57294 285651 291957 299450 307903 316654 325392 334827 345732 357824 370749 385556 403649 424586 446588
57281 446588 469205 493807 521251 550661 580906 611745 642926 673430 702318 729280 753672
57270 753672 773835 787974 795203 795427 788884 776147 758101 735720 710165 682821 654628 625622
57258 625622 595921 566833 540123 516438 495351 476588 460097 445234 431175 418044 406497
57247 406497 396293 386483 376911 368273 360810 354201 348634 344547 341236 337250 332424 328137 325283 323382
57233 323382 321986 321512 322100 322879 323037 322717 322396 322247 322385 322841 323159 322975 323011 324279 326326 327643 327966 328608
57215 328608 330184 331620 331982 331808 331888 332147 332534 333711 335975 338579 340983 343745 347427 351679 356116 361072
57199 361072 366661 372151 377063 381924 387143 392221 396880 401934 408056 414654 420912 427044 433503 439827
57185D39827N546N063N214N294N142N463O224O411N833N648O549P856Q804R489
57171E28363J0073J0412J0732J1549J2656J3403J4034J5328J6891J7376J6611
57160F77428J5826J5508J4833J3654J3252J4282J5716J6656J7684J9420K1194
57149H55453K2248K3025K4209K5520K6475K7312K8344K9333L0318L1937L4191
57138A158365L6032L7082L8447M0827M3114M4137M4646M6102M8539N1075N3693
57127A642059N6926O0467O3656O6846P0811P5321P9723Q4437R0313R6961J03303
57116B490823J09456J16419J24233J32261J41098J52345J66509J82994K02251
57107C818389K25881K54470K87360L25075L70032M24549M90358N70492O69460
$$ plain form
57185 439827 445373 450436 455650 460944 466086 471549 477773 484184 490017 495665 502214 510070 518874 528363
57171 528363 538436 548848 559580 571129 583785 597188 611222 626550 643441 660817 677428
57160 677428 693254 708762 723595 737249 750501 764783 780499 797155 814839 834259 855453
57149 855453 877701 900726 924935 950455 976930 1004242 1032586 1061919 1092237 1124174 1158365
57138 1158365 1194397 1231479 1269926 1310753 1353867 1398004 1442650 1488752 1537291 1588366 1642059
57127 1642059 1698985 1759452 1823108 1889954 1960765 2036086 2115809 2200246 2290559 2387520 2490823
57116 2490823 2600279 2716698 2840931 2973192 3114290 3266635 3433144 3616138 3818389
57107 3818389 4044270 4298740 4586100 4911175 5281207 5705756 6196114 6766606 7436066
57098G436066P91271R40120J123495J351266J630507J964207K354954K804192
57090B0396078L305399L843014M400419M962131N504062N989778O382884O654574
57082F1438339O772470O700454O434065O025416N531227M917868M048723K803864
57074A04672426J214964n31126k212262l677854m860533n738621o317961o630905
57066G5918128o721713o626921o376179o004827n553071n054630m535263m020067
57058C1025457l533023l089371k694909k351938k060013j812232j597951j410352
57050A2475668j247503j107098r85019q78504p85898p03463o26811n55325m91164
57041E094883m34413l83050l37033k97916k64675k34201k05920j81945j62499
$$ plain form
57098 7436066 8227337 9167457 10290952 11642218 13272725 15236932 17591886 20396078
57090 20396078 23701477 27544491 31944910 36907041 42411103 48400881 54783765 61438339
57082 61438339 68210809 74911263 81345328 87370744 92901971 97819839 101868562 104672426
57074 104672426 105887390 105356264 103144002 99466148 94605615 88866994 82549033 75918128
57066 75918128 69196415 62569494 56193315 50188488 44635417 39580787 35045524 31025457
57058 31025457 27492434 24403063 21708154 19356216 17296203 15483971 13886020 12475668
57050 12475668 11228165 10121067 9136048 8257544 7471646 6768183 6141372 5586047 5094883
57041 5094883 4660470 4277420 3940387 3642471 3377796 3143595 2937675 2755730 2593231
57032B593231j45332j29829j17692j09002j01432r4029q8085q3721p9104p3817
57022A571188o9477o6285o2341n7188n2633m9177m4967l9433l4631l1695k9100
57011A034261k5656k2216j9118j4976r317l503K310J0045K0202L0928M2337N8169
56999A103466Q0827J08704J41482J82991K31274K66672K58322J88849P2812n1160
56989B584239j46613j99038k14866k07569j87380j60776j33110j08175q7071p0305
56979A069336o0075n8130o2154o6865o8635o7093o2819n6198m8589m1851l6076
56968D40851k9866k3134j7425j3105q664l297K111P108J2537J8659K4679L0783
56956D41237L7998M4899M6866M0308K6158Q342r334k3844l2834l5865l4811l1882
$$ plain form
57032 2593231 2447899 2318070 2200378 2091376 1989944 1895915 1807830 1724109 1645005 1571188
57022 1571188 1501711 1435426 1373085 1315897 1263264 1214087 1169120 1129687 1095056 1063361 1034261
57011 1034261 1008605 986389 967271 952295 942978 939475 941785 951830 972032 1002960 1045297 1103466
56999 1103466 1184293 1292997 1434479 1617470 1848744 2115416 2373738 2562587 2635399 2584239
56989 2584239 2437626 2238588 2023722 1816153 1628773 1467997 1334887 1226712 1139641 1069336
56979 1069336 1009261 951131 888977 822112 753477 686384 623565 567367 518778 476927 440851
56968 440851 410985 387851 370426 357321 348657 345360 347471 354579 367116 385775 410454 441237
56956 441237 479235 524134 571000 611308 637466 645808 636474 612630 579796 543931 509120 477238
56944D77238k8020k3682j9589j5943j2131p898l700M16M953R854J4708K0063K6903
56931D43172L4913M2856M9930N4347N1417L6798J2492j3354l3482m5814n0924
56920E82351m9381m3283l6760l2355k9003k5133k1348j8453j5575j2237r858r234
56908B79731q732o976n082m283l575j876l13j42l29N06J587J719J846L500O163
56893B63744Q343J0004J1959J4213J6763K0617K6102L1635L5847L9178M1353L9279
56881E59037L0044J4975j391j5194k4483k8453k7969k5675k3356k0159j5115r677
56869D12584n585j913L184R163J4330J9294K6309L5800M6383N7990P2008Q7440
56857G76987R8514R7110P7831M2306j56l7333o1432p2159p3167o7762n8632m8568
$$ plain form
56944 477238 449218 425536 405947 390004 377873 369975 366275 366691 371644 381498 396206 416269 443172
56931 443172 478085 520941 570871 625218 676635 713433 725925 712571 679089 633275 582351
56920 582351 532970 489687 452927 420572 391569 366436 345088 326635 311060 298823 288965 279731
56908 279731 270999 264023 258941 254658 251083 249207 248894 248752 248423 248929 250516 252235 254081 257581 263744
56893 263744 272087 282091 294050 308263 325026 345643 371745 403380 439227 478405 519758 559037
56881 559037 589081 604056 602665 587471 562988 534535 506566 480891 457535 437376 422261 412584
56869 412584 406999 405086 408270 417433 431763 451057 477366 513166 559549 617539 689547 776987
56857 776987 875501 972611 1050442 1092748 1092592 1055259 993827 921668 848501 780739 722107 673539
56845F73539l8867k8592j7296o709J979J0415K0473L1585M3003N6499P4076R5047
56833I15152J17860J41583J61183J63855J36707P9859Q919n6150j02622j27480
56823A438866j34020j28302j16177j01178q5056o9582n6084m3985l1908j9946
56813F52628q931J942J4427K8508M2784N7479P4586R4122J11243J17195J03291
56802A289274O6585J4336l8223p7488r9310j07147j05204r6259q3849p1781o1064
56791F29870n0333l9357k9581k1323j3327n141K558J0010J8319K7466L6674M6222
56779F12057N5889O1686N7337M0157J3868j4471l8414n3799n9741n8998n5493
56768E60078n1069m5651l9722l4349k9389k4132j9397j6557j4928j2643r766p985
$$ plain form
56845 673539 634672 606080 588784 582075 584054 594469 614942 646527 689530 746029 820105 915152
56833 915152 1033012 1174595 1335778 1499633 1636340 1716199 1725118 1668968 1566346 1438866
56823 1438866 1304846 1176544 1060367 959189 874133 804551 748467 704482 672574 652628
56813 652628 643697 645639 660066 688574 731358 788837 863423 957545 1068788 1185983 1289274
56802 1289274 1355859 1370195 1331972 1254484 1155174 1048027 942823 846564 762715 690934 629870
56791 629870 579537 540180 510599 489276 475949 470808 473366 483376 501695 529161 565835 612057
56779 612057 667946 729632 786969 827126 840994 826523 788109 734310 674569 615571 560078
56768 560078 509009 463358 423636 389287 359898 335766 316369 299812 284884 272241 262475 254490
56756B54490p460o708n355m316l453j865l21n36k072k746k126j753j917j313n
56741B12544L13n16p77j03j03j181j702j047p07j505k396k730l199l832l622k722
56725A86715k509k937k464j114p67j736j947m71R04O90k69q66j408k060j993j111
56709A66657o23q94q56k08r4q83j489j504j791k357k067r87o30j206j162l7P36
56692A50605M93K77M63J47m69Q9J633K083J005M71J425K252K051K198L259L473
56676A71455J959O20J016J911J752J156J097R55K15NJ071K090J648K75q33j346
56660A85046j126J22J472J198n37j550j030o38j307j700j013o12j369j972j430
56645A73554q01r76j110p36r57k027k322j203m10r92j453o22K19j28n97j80J15
$$ plain form
56756 254490 247030 240322 234967 230651 227198 225333 225012 224476 222404 219658 217532 215779 213862 212549 212544
56741 212544 212857 212341 211564 211461 211358 210177 208475 207428 206721 205216 202820 200090 196891 193059 189437 186715
56725 186715 184206 181269 178805 177691 176924 175188 173241 172770 173674 174364 174095 173229 171821 169761 167768 166657
56709 166657 166034 165140 164284 164076 163982 163099 161610 160106 158315 155958 153891 152904 152274 151068 149906 149869 150605
56692 150605 151098 151375 151838 151985 151516 151605 153238 155321 156326 156797 158222 160474 162525 164723 167982 171455
56676 171455 173414 174034 175050 176961 178713 179869 180966 181921 182136 182141 183212 185302 186950 187225 186392 185046
56660 185046 183920 184042 185514 186712 186175 184625 183595 182957 181650 179950 178937 178325 176956 174984 173554
56645 173554 172753 171777 170667 169931 168974 166947 164625 163422 163012 162020 160567 159945 160164 160036 159439 159259 159374
56628A59374n01p78J35Q17J20o26p4O82J67r38j333j271j331r97j54J1p48p62
56610A51793O49J614P76m36m33J8j47j65N79Q74K3m26N81J555J229R27J904K746
56592A63661J924O10M06N02l29j026k38R12P16k33m07J3K08O40J696K223J547
56575A72825J085J870K564J988J388J960K487J891J660L122M682M572M065N025
56561B11184O505O813O857Q235R855R660Q126P053O481N632N248O036O516N274
56547C09475L668L400L282J451r49j624j067j396k703l651m354n577o446n899
56533B87610n143n772o817o514n499n318n354m245k791k405k269j073p5j115l148
56518B30072l969l843m237m440k966r16m90j379j842j984k725l019j615j21o94
$$ plain form
56628 159374 158873 158095 158230 159047 159167 158541 158467 159149 159316 158378 157045 155774 154443 153446 153292 153303 152555 151793
56610 151793 152442 154056 154832 154396 153963 153981 153834 153669 154248 155122 155145 154719 155300 156855 158084 159011 160915 163661
56592 163661 165585 166195 166601 167103 166774 165748 165510 166422 167138 166905 166498 166511 166719 167359 169055 171278 172825
56575 172825 173910 175780 178344 180332 181720 183680 186167 188058 189718 192840 197522 202094 206159 211184
56561 211184 217689 224502 231359 239594 249449 259109 267235 274288 280769 286401 291649 297685 304201 309475
56547 309475 313143 316543 319825 321276 320327 318703 317636 316240 313537 309886 305532 299955 293509 287610
56533 287610 282467 276695 269878 263364 257865 252547 247193 242948 240157 237752 235483 234410 234335 233220 230072
56518 230072 226103 222260 218023 213583 210617 209701 209211 207832 205990 204006 201281 198262 196647 196526 195832
56503A95832k126j851m60l76j292r97K94M80l45k60N98M10n82m13Q88J402P88
56486A91990L78K48n37j368r46oj11n92J77J510J716J528K688M269M086K800K777
56469B10607L761L598K498K536L531L376K100J744K530K808K477K844L509K919
56455B50838J575J207J374M67p75m88M61k26j834j635K47J106L61j07J14k11o14
56438B51860M32J896J350n25p61Q24J546O42j08k82j170k284j811m66p47k480
56422B47916l197k698k928l680k849q72l26j208j152j72m67j598r42J005R49j195
56406B26586j852k0J204L00n05R0L79m45p99l22o62j683j214N53Q59o21j097P8
56388B20829L38r16r04J310K896K230J361J954K826L094L660M313L321J171N53
$$ plain form
56503 195832 193706 191855 191395 191019 189727 188730 189024 189504 189159 188899 189497 189907 189325 188912 189800 191202 191990
56486 191990 192368 192616 192079 190711 189765 189759 189648 189056 189233 190743 192459 193987 196675 200944 205030 207830 210607
56469 210607 214368 217966 220464 223000 226531 229907 232007 233751 236281 239089 241566 244410 247919 250838
56455 250838 252413 253620 254994 255461 254686 254198 254659 254433 252599 250964 251211 252317 252678 252571 252685 252474 251860
56438 251860 252292 254188 255538 255013 254252 255076 256622 257264 257156 256874 255704 253420 251609 251143 250396 247916
56422 247916 244719 242021 239093 235413 232564 231692 231366 230158 229006 228834 228367 226769 225827 226832 227781 226586
56406 226586 224734 224714 225918 226218 225713 225803 226182 225737 224938 224616 223954 222271 221057 221610 222469 221848 220751 220829
56388 220829 221167 220251 219347 220657 223553 225783 227144 229098 231924 235018 238678 242991 246312 247483 248036
56373B48036J642J646N1k64J698L237K879K449K854K338O31K64K021L326K861
56358B75669K522L212L050J456O77J511J759N43n3P88J064J76L18J978K524J003
56342B98197p5O47J283R16J358K986L422K114J783L500M859M660M860O122O304
56327C42936N113N323P439Q180O339N093O263P330O586O269P895R372R235R174
56313D42547R872R203O876N924P178P357N128L662M484M345J307j467j448j010
56299E03958k375l406k241j190k159k798j018R94J056R40K467L918L901M437O802
56284E13286Q597Q388Q786J1534J3991J4103J4287J6720J9309K0081K1089K4214
56272F94385K7467K9190L1545L6128M0622M3507M7525N4577O1916O7311P3430
$$ plain form
56373 248036 249678 251324 251375 251111 252809 256046 258925 261374 264228 266566 267197 267461 269482 272808 275669
56358 275669 278191 281403 284453 285909 286586 288097 289856 290399 290346 291134 292198 292374 292692 294670 297194 298197
56342 298197 298122 298769 300052 300968 302326 305312 308734 310848 312631 316131 320990 325650 330510 336632 342936
56327 342936 348049 353372 360811 368991 375330 380423 386686 394016 400602 406871 414766 424138 433373 442547
56313 442547 452419 461622 468498 474422 481600 488957 494085 497747 502231 506576 507883 506416 504968 503958
56299 503958 501583 498177 495936 494746 492587 489789 488771 489765 490821 491761 494228 498146 502047 506484 513286
56284 513286 521883 530271 539057 550591 564582 578685 592972 609692 629001 649082 670171 694385
56272 694385 721852 751042 782587 818715 859337 902844 950369 1004946 1066862 1134173 1207603
56261A207603Q2927R3790J03680J14323J27357J40371J51366J62641J75897J87916
56251B547871J95438J99931K03169K02574J95452J83445J68408J48286J21661
56242D166235R1982O2793L3170K278k6228m9051o7921q4837r7331j03325j05971
56231C821794j08612j09528j06742j03297j02484j02360j00492r9538j02549j06948
56221B779244j08859j09361j11060j12507j11495j09907j09866j09066j05070
56212A792053j00182r6892r2822q5503p7686p2533o7923o1048n4110m9849m5987
56201I87518l9918l4297l2078l0554k6346k1770k0178j9544j6836j4193j4444
56190G17360j5031j2719r912r841j0122p564m710m917n584l120k1p1j039Q43L603
$$ plain form
56261 1207603 1290530 1384320 1488000 1602323 1729680 1870051 2021417 2184058 2359955 2547871
56251 2547871 2743309 2943240 3146409 3348983 3544435 3727880 3896288 4044574 4166235
56242 4166235 4258217 4321010 4354180 4356458 4330230 4281179 4213258 4128421 4031090 3927765 3821794
56231 3821794 3713182 3603654 3496912 3393615 3291131 3188771 3088279 2988741 2886192 2779244
56221 2779244 2670385 2561024 2449964 2337457 2225962 2116055 2006189 1897123 1792053
56212 1792053 1691871 1594979 1502157 1416654 1338968 1266435 1198512 1137464 1083354 1033505 987518
56201 987518 947600 913303 881225 850671 824325 802555 782377 762833 745997 731804 717360
56190 717360 702329 689610 679698 669857 659735 652171 647461 642544 636960 633840 633819 633748 632709 633552 637155
56175F37155L797L480N817Q367P899P269J0139J3550J3284J1890J3631J6173J5176
56162G67627J2552J2089J1609P664L372L168M278J929j541j398L42n79j714J342
56148H20740N740O379N860R714J5804J8363J8822K2782K9647L5126M0690N0790
56136A080457O3879P5669Q7879J04015J19925J28305J29233J26742J19078J02812
56126B137994Q3124O9226O2239N7370N4297N4805N3790M3906K6891J0306l890
56115B650058j7617k7768l0332l0164l5707m7017n9145p3041r1667j09506j18014
56104B010080j18192j16253j11016r7874q1049o8782n9853m7830l4996k8614k6782
56093A218839k1976j5529j4543j7300j6070j1877j2041j5361j4233r438q321j0272
$$ plain form
56175 637155 640952 644432 650249 658616 666515 673784 683923 697473 710757 722647 736278 752451 767627
56162 767627 780179 792268 803877 811541 814913 818081 822359 824288 822747 821349 821691 821112 819398 820740
56148 820740 826480 832859 838719 848433 864237 882600 901422 924204 953851 988977 1029667 1080457
56136 1080457 1144336 1220005 1307884 1411899 1531824 1660129 1789362 1916104 2035182 2137994
56126 2137994 2221118 2290344 2352583 2409953 2464250 2519055 2572845 2616751 2643642 2653948 2650058
56115 2650058 2632441 2604673 2574341 2544177 2508470 2461453 2402308 2329267 2237600 2128094 2010080
56104 2010080 1891888 1775635 1664619 1566745 1485696 1416914 1357061 1309231 1274235 1245621 1218839
56093 1218839 1196863 1181334 1166791 1149491 1133421 1121544 1109503 1094142 1079909 1070471 1062150 1051878
56081A051878q576m586n257q608o586n26J290m80J826P138P599M404N711J0451
56067A055678J0404O841Q444J4053J4377R740R132J2622J1946P785Q851J4450
56055A184323J5487J2166J3115J7647J7020J2455J3437J8912J8981J4508J5633
56044A353684K1562K1803J6993J7953K4441K5685K1904K3882L1104L2210K7490
56033A618711K8596L5480L6392L1423L2512L9396L9639L3620L4653M2873M4550
56022B017845L9145M0804N0675N4360M9756N0358N7870N9115N3437N4941O4003
56011B592309O5420N8551N9613P0224P4236O9909P3526Q6398R1099Q5664Q7909
56000C414858J00310J05284J01162J06722J23548J31231J27147J32433J50802
$$ plain form
56081 1051878 1043302 1038716 1033459 1024851 1018265 1017739 1019029 1018549 1020375 1027513 1035112 1039516 1045227 1055678
56067 1055678 1066082 1072923 1081367 1095420 1109797 1119537 1128669 1141291 1153237 1161022 1169873 1184323
56055 1184323 1199810 1211976 1225091 1242738 1259758 1272213 1285650 1304562 1323543 1338051 1353684
56044 1353684 1375246 1397049 1414042 1431995 1456436 1482121 1504025 1527907 1559011 1591221 1618711
56033 1618711 1647307 1682787 1719179 1750602 1783114 1822510 1862149 1895769 1930422 1973295 2017845
56022 2017845 2056990 2097794 2148469 2202829 2252585 2302943 2360813 2419928 2473365 2528306 2592309
56011 2592309 2657729 2716280 2775893 2846117 2920353 2990262 3063788 3150186 3241285 3326949 3414858
56000 3414858 3515168 3620452 3721614 3828336 3951884 4083115 4210262 4342695 4493497
55991D493497J61429J60941J70708J93511K06268K05731K16504K43170K61326
55982F313085K67222K87109L25102L53368L67273L96090M44889M83160N06666
55973I743964N49949O20565O85349P40224Q24776R47409J070053J189802J356332
55964A7728423J583660J831055K099488K453013K913404L437751M036616M799808
55956D0883218N764805O889497Q202653R837039J1870207J4320510J7367178K1348065
55948A36483172K6445179L2614730L9783431M7356960N2925616N2117634M1242651
55941D28969373K0904688l350522k4499873l8281347m4443913m4994960m2149522
55934B52153924l7602098l2560110k7727305k3341623j9456925j6144680j3416965
$$ plain form
55991 4493497 4654926 4815867 4986575 5180086 5386354 5592085 5808589 6051759 6313085
55982 6313085 6580307 6867416 7192518 7545886 7913159 8309249 8754138 9237298 9743964
55973 9743964 10293913 10914478 11599827 12340051 13164827 14112236 15182289 16372091 17728423
55964 17728423 19312083 21143138 23242626 25695639 28609043 32046794 36083410 40883218
55956 40883218 46648023 53537520 61740173 71577212 83447419 97767929 115135107 136483172
55948 136483172 162928351 195543081 235326512 282683472 335609088 387726722 428969373
55941 428969373 449874061 446523539 422023666 383742319 339298406 294303446 252153924
55934 252153924 214551826 181991716 154264411 130922788 111465863 95321183 81904218
55927H1904218j1161701r272782p735937o527077n545022m709074m022825l486627
55919B9443173l038392k631237k285733k017411j787081j565357j376062j234737
55911A3507163j108305r73459q55166p71547o96668o11625n39446m96591m59404
55902F994952m09851l67877l48445l30665k98347k69561k58327k46599k20784
55893D244496j98349j92482j86248j66488j48992j46143j42651j26583j12771
55884B823789j12670j11599r7972q5847q6786q7544p6794o6847o8303o9308o0008
55873A900111n2282n5596n7946m9754m2775m6401m8726l9894l1473l4074l7648
55862A403542l2395k7786l2518l6214k9329k1534k2393k2853j3496k849m02N52
$$ plain form
55927 81904218 70742517 61469735 53733798 47206721 41661699 36952625 32929800 29443173
55919 29443173 26404781 23773544 21487811 19470400 17683319 16117962 14741900 13507163
55911 13507163 12398858 11425399 10570233 9798686 9102018 8490393 7950947 7454356 6994952
55902 6994952 6585101 6217224 5868779 5538114 5239767 4970206 4711879 4465280 4244496
55893 4244496 4046147 3853665 3667417 3500929 3351937 3205794 3063143 2936560 2823789
55884 2823789 2711119 2599520 2501548 2415701 2328915 2241371 2164577 2097730 2029427 1960119 1900111
55873 1900111 1847829 1792233 1734287 1684533 1641758 1595357 1546631 1506737 1475264 1441190 1403542
55862 1403542 1371147 1343361 1310843 1274629 1245300 1223766 1201373 1178520 1165024 1162175 1161773 1162325
55850A162325O319O958n691k0861k6456k7726l2621l4921k8293k1362k2302k3201
55838I32168j5630p243p185r256n306j569n929j2060j1715j0301j5148k0577j9332
55825G90917j6919k0128k3123j9274j5164j8473k3204k1200j7292j8851k1055
55814E76234j6868j1364j1896j3826r979m810n440p665m503J62k35j667K460Q163
55800D98766Q637P145R647J2401R348M231L141K510l417j0450j1837j0622j2956
55787E06544j6017j4254j0889j1709j3889j2097r252j0278j1659q096l085k208
55775C83111k419J244M778J904m498q086r991j3803j6117j2726q018p737q379
55762B99263m191J640L230K982N441O585O97p809j0847r817j1137j3733j2326
$$ plain form
55850 1162325 1168644 1175602 1169911 1149050 1122594 1094868 1062247 1027326 999033 977671 955369 932168
55838 932168 916538 909295 902110 892854 887548 885979 880050 867990 856275 845974 830826 810249 790917
55825 790917 773998 753870 730747 711473 696309 677836 654632 633432 616140 597289 576234
55814 576234 559366 548002 536106 522280 512301 507491 502051 494386 489883 490045 489810 488143 490603 498766
55800 498766 507403 514548 524195 536596 545944 550175 553316 555826 552409 541959 530122 519500 506544
55787 506544 490527 476273 465384 453675 439786 427689 418437 408159 396500 388404 385319 383111
55775 383111 380692 381936 386714 388618 384120 376034 366043 352240 336123 323397 315379 307642 299263
55762 299263 295072 296712 299942 302924 308365 314950 315647 307838 296991 287174 276037 262304 249978
55749B49978q623p990r018p067m112m700o318m140j114k870o700o203k973k939
55735A75211m856l160R24J843M65J903N257N522L284K741K625j185o360p080m261
55720A72873l521n114m931l377m188o314n709l342l030l517j040K615L017J666
55706A36088L184O402O793N354O356Q621P728M738M013M405J544l066m098j958
55692A86104j474k526p70L502N760N539O217P445N925K715J906K909J706j338
55678B23620k340j380j594k267m68J911N08l312m389k576j964k618j137J680J797
55663B05471k04o8K075K270N93P53K521K258M12Q98L418L972K484K457L516J890
55647B34716j992l922l619m632o924p060n508o178q747q974o760o326q155q263
$$ plain form
55749 249978 241355 233365 224347 217280 213168 208468 202150 198010 196896 194026 187326 181123 178150 175211
55735 175211 170355 167195 168119 169962 170427 172330 177587 183109 186393 189134 191759 190574 184214 177134 172873
55720 172873 169352 164238 159307 155930 151742 145428 139719 136377 133347 129830 128790 131405 134422 136088
55706 136088 139272 145674 152467 157821 164177 172798 180526 185264 189277 193682 195226 192160 188062 186104
55692 186104 184630 182104 181334 184836 190596 196135 202352 209797 215722 218437 220343 223252 224958 223620
55678 223620 221280 219900 218306 216039 215571 217482 217990 214678 210289 207713 205749 203131 201994 203674 205471
55663 205471 205267 205199 207274 209544 210137 210890 213411 215669 216081 216979 220397 224369 226853 229310 232826 234716
55647 234716 232724 228802 225183 220551 213627 206567 201059 194881 186134 177160 170400 164074 155919 147656
55633A47656n968m955o053o067m517m472n968n534l002k117l577m096k957k912
55619H5461l967k990l17L5k420l605k040p49j116j069k83r99k765k368J03J022
55603F1933l12q59Ml53j953j763J54K80j706k133j52Q77j54l72J067J277o06j697
55585E3532p47om50l58L89j94j691j455J73J98j234r71R75J315j61k09J407J397
55567E1910m12m08J952L060K045K223M358M907K700J054J469J272n85j428m69
55552G3648o24k738l723k393j546k289j954L03J414P0r92l52k02j333j217Q16
55536E6888J878J029J145L241M334L101K308L410M027L020K791M166M303K068
55522I7709M30R99J310j12j041l33l62k202l312k538k448m267n327m144l095l660
$$ plain form
55633 147656 141688 136733 130680 124613 120096 115624 109656 104122 101120 99003 95426 91330 88373 85461
55619 85461 81494 78504 78187 78222 75802 72197 70157 69408 68292 67223 66940 65941 63176 60808 60911 61933
55603 61933 61621 60762 60766 60413 58460 56697 56851 57131 55425 53292 53140 54017 53863 53491 54558 55835 55229 53532
55585 53532 52785 52779 52329 51971 52360 52166 50475 49020 49193 49391 48157 47186 48161 49476 49315 49106 50513 51910
55567 51910 51498 51090 53042 56102 58147 60370 64728 69635 72335 73389 74858 76130 75545 74117 73648
55552 73648 73024 70286 66563 64170 62624 60335 58381 58684 60098 60168 59176 58824 58622 57289 56072 56888
55536 56888 58766 59795 60940 64181 68515 71616 73924 77334 81361 84381 87172 91338 95641 97709
55522 97709 98139 99138 100448 100336 99295 98962 98600 96398 93086 90548 88100 83833 78506 74362 71267 67607
55506F7607l842k779k807m438m499j909k31j467k604j313p7j145k384j624o76
55491C5812j430k233j574j141k048k128k43R43l24j615r48l96j725k709j350K67
55475A7158o5p60j2N09p99j949r80L39m5p84k32J76r02j582k63J018J57j318j355
55456H311j010j640j785j97J210Q07M68J918L114J812k26l00P57P05q2q9K01j08
55438A3866OJ277J994Q98l48j23L88m5j53R25J272l71j863j220R8L30O22K038
55420A9591K654R74q51o60o5j127k310j426J51N1q09k72J007J184Q51J539K528
55403B3010K378J733J670J330k1q55o9O22k89j281p84j91r21j429k70P36j96j232
55385B3941k66R88M9j751j713m76l49j025q12k84q84j705j165j57k15l95O24J397
$$ plain form
55506 67607 63765 60986 58179 53741 49242 47333 47102 45635 43031 41718 41641 40496 38112 36488 35812
55491 35812 34382 32149 30575 29434 27386 25258 25015 25958 25634 24019 23071 22675 20950 18241 16891 17158
55475 17158 17093 16333 16321 16830 16031 14082 13102 13441 13396 12612 12380 12556 11654 10072 9809 10827 10984 9666 8311
55456 8311 7301 5661 3876 3679 4889 5696 6164 8082 11196 13008 12782 12482 13239 13944 13862 13773 13974 13866
55438 13866 13872 15149 17143 18041 17693 17570 17958 17913 17760 18685 19957 19586 17723 16503 16601 16931 17553 19591
55420 19591 22245 23219 22368 21708 21643 20516 18206 16780 16931 16982 16173 15901 16908 18092 18943 20482 23010
55403 23010 25388 27121 28791 30121 30100 29245 29176 29798 29509 28228 27444 27253 26332 24903 24633 25369 25173 23941
55385 23941 23675 24663 24712 22961 21248 20772 20423 19398 18586 18302 17418 15713 14548 14391 14176 13781 14405 15802
55367A5802J80j555j547q12j563k968k695j052M8O71J884K779J977O12N20R24
55351A3205J60r68q18j17l58p77j71K17r34j844m11J737J764L47j6M08k62j367
55333I795q71N57O75k50l39J34l07p96M69K318K118L45l23K84k2j465k078j459
55315H785j096j204o08M72P22M41Q86J469P71l51J28J750K252J312M93L5j044
55298A5213k164j773l75N5o28q18j38M72R74J845K174R06p21p46L49Q39R36J810
55280A8210K527J308r75j886j311j034j169l57J030J228K60k61j42m29q23k33
55264A5943O75M23m32k56N97O83M11J036J609M09j445j398K89J115O30N17R02
55247B1708L31q89r25P9K19n72n50L98O46J13K52Q81L90r26j101JO12M46P72J248
$$ plain form
55367 15802 15982 14427 12880 12068 10505 7537 4842 3790 3838 4509 6393 9172 11149 11761 12281 13205
55351 13205 13365 12397 11579 11462 11104 10327 10156 10373 9439 7595 7184 8921 10685 11032 11016 11424 11162 9795
55333 9795 8924 9481 10156 9906 9567 9701 9394 8598 9067 11385 13503 13848 13525 13809 13787 12322 10244 8785
55315 8785 7689 6485 5877 6349 7071 7512 8398 9867 10638 10287 10415 12165 14417 15729 16222 16257 15213
55298 15213 13049 11276 10901 10956 10328 9510 9372 9844 10818 12663 14837 15743 15022 14276 14625 15464 16400 18210
55280 18210 20737 22045 21070 19184 17873 16839 15670 15313 16343 17571 17831 17570 17428 16999 16176 15943
55264 15943 16618 17041 16609 16353 16950 17633 18044 19080 20689 21098 19653 18255 18544 19659 20289 20806 21708
55247 21708 22039 21150 20225 20304 20523 19951 19401 19799 20445 20558 20810 21691 22081 21155 20054 20055 20667 21113 21885 23133
55227B3133K00j845k365r44K66L31N46J273J200K37j4P27R18J88o2N17O00j46
55209B4760n46l13l65n91j9P86K93j047j239j56M41K01M66J251J050j97r47r47
55191B2881j257j548n01J158J345L26L12J322J160l60r20O3N67l0J34J527J962
55174B8141M61j052j202j150j834k237j656r96o36K48J384J200k20q02K5M41l11
55157A9804o26K86R39M76J44O47P87j4n13j57j46q90r77J69J150J131R94J083
55139B4287L88j021j482o31q6l86j12R47R53m59r02Q35K547K104N81n6N3r2k61
55120B7207K7K05p0n2M60M61k47l62N51J064L67l37JP01R66J085J140N33l42j67
55100C3191Q46Q73l93j036j18R42J134J309J817J443j4p44Q9R15O41M60J328K105
$$ plain form
55227 23133 23333 21488 19123 18179 18445 18776 19322 20595 21795 22032 22018 22745 23663 23851 23789 24306 24906 24760
55209 24760 24214 23901 23536 22945 22926 23712 24005 22958 21719 21563 22004 22205 22671 23922 24972 24775 23828 22881
55191 22881 21624 20076 19575 20733 22078 22404 22716 24038 25198 24838 23918 23981 24548 24518 24652 26179 28141
55174 28141 28602 27550 26348 25198 23364 21127 19471 18475 17839 18087 19471 20671 20451 19649 19674 20115 19804
55157 19804 19178 19464 20403 20879 21023 21670 22457 22443 21930 21773 21627 20737 19760 19929 21079 22210 23204 24287
55139 24287 24675 23654 22172 21541 21455 21069 20957 21904 22857 22398 21496 22331 24878 26982 27563 27507 27560 27468 27207
55120 27207 27234 27439 27369 27317 27777 28238 27991 27629 28180 29244 29611 29274 29275 29976 30942 32027 33167 33700 33358 33191
55100 33191 34037 34910 34517 33481 33363 34305 35439 36748 38565 40008 39994 39250 39339 40254 40895 41355 42683 44788
55082D4788J763J040N57l71j652j606J99J811J955J851K453K518J200n1lK16n21
55065E6147j139m98L75K34k06O0L27k99j121j334j530k145k221j318o80j003j003
55048D2646J30R49K09q86p62L0K57J16K06M7o22q51l30l83j536k086q35P10P53
55029C7762j3k5N93R21J100J420J166J47l29M05R55L24j78P24J856J588N07N1
55011D8974P2k24l94K29R75J051R78J217R40k28r68l95K82m1l68L23R48K74p61
54992E2884q07m53p42j063n97k05o59p98L33J240L70r21m34J212J782J100Q54
54975E3096J486J918J728J428J064M44J02L42K79n49q37M50K018K160J430J337
54959F7896J708J541J214J598K093J838J736K996M663N008M477M851O287P583
$$ plain form
55082 44788 46551 47591 48148 47777 46125 44519 44718 46529 48484 50335 52788 55306 56506 56455 56452 56668 56147
55065 56147 55008 54510 54885 55119 54913 54973 55300 55001 53880 52546 51016 48871 46650 45332 44652 43649 42646
55048 42646 42776 43725 43934 43048 42286 42316 42573 42689 42895 42942 42320 41469 41139 40756 39220 37134 36299 37009 37762
55029 37762 37749 37724 38317 39238 40338 41758 42924 43071 42742 43147 44102 44426 44248 44972 46828 48416 48923 48974
55011 48974 49046 48822 48428 48657 49632 50683 51661 52878 53818 53590 52622 52227 52509 52468 52100 52423 53371 53645 52884
54992 52884 52077 51624 50882 49819 49222 49017 48358 47560 47893 49133 49503 48582 48148 49360 51142 52242 53096
54975 53096 54582 56500 58228 59656 60720 61164 61266 61608 61887 61338 60501 60951 62969 65129 66559 67896
54959 67896 69604 71145 72359 73957 76050 77888 79624 82620 87283 92291 96768 101619 107906 115489
54945A15489Q619J0221J2112J3256J3716J4083J3606J0945O376J400l305p720
54933B08798j1086j2648j3137j3662j3761j2397j0113q322p163n955m968m805
54921I0781m722l691k348j983k250j935j239j168j347o43O12J191J342K354M084
54906G9038N133N316N957P666R675J1356J2778J3793J3970J3381J2253J0214O987
54893B07517L218n16m584q985j2273j3326j3100j2951j2444j0640q403p285p042
54880I9186o403n444n039m763l631k253j942k227j564j39L63m14j101j021r05
54865F2703j187j326r67l66K43N70L4j203j759r16O8p9n76k29K64k27q36j76P91
54846E4826R5j799k616j827r76q12o02j49n3r2L86P20j48j359j084M09J108N07
$$ plain form
54945 115489 124108 134329 146441 159697 173413 187496 201102 212047 218423 219823 216518 208798
54933 208798 197712 185064 171927 158265 144504 132107 121994 113672 106509 100554 95586 90781
54921 90781 86059 82368 80020 78037 75787 73852 72613 71445 70098 69455 70067 71258 72600 74954 79038
54906 79038 84171 89487 95444 103110 112785 124141 136919 150712 164682 178063 190316 200530 207517
54893 207517 210735 210219 205635 196650 184377 171051 157951 145000 132556 121916 113513 106228 99186
54880 99186 92783 87339 82300 77537 73906 71653 69711 67484 65920 65781 66144 65730 64629 63608 62703
54865 62703 61516 60190 59223 58857 59100 59670 59704 58501 56742 55826 55894 55815 55239 55010 55274 55047 54211 54035 54826
54846 54826 54921 53122 50506 48679 47703 46891 46289 46140 46087 45995 46381 47101 46953 45594 44510 44919 46027 46534
54828D6534J27P14J346J439J445J351N71n14q47n40n64p50j79P16N92l60o65r8
54810E0318K57L78J337K886L488K906K533K895L113L026L525M493M733M321M727
54795I4936O180P178P127P259Q359R723J0981J2743J4764J5447J4073J1696R187
54782B29653O149K329j590n187q572j1071j1521j0337r434r482r200p872o589
54769A47276o091n378l527j353l6N90J363K483L589M381M692M799N722Q123J0971
54754A77604J2640J3169J3927J5153J5713J5368J5344J6203J6930J6614J5335
54743C44000J2989Q964L596j645o098j0489j5054j8608k0200k0369k0078j9547
54731B37461j8671j7500j5903j3686j1313r531q322p217o363o015n390l572j338
$$ plain form
54828 46534 46661 47375 48721 50160 51605 52956 53527 53013 52166 51626 51062 50312 50133 50849 51441 51081 50416 50318
54810 50318 50575 50953 52290 55176 58664 61570 64103 66998 70111 73137 76662 81155 85888 90209 94936
54795 94936 101116 108294 115421 122680 131039 140762 151743 164486 179250 194697 208770 220466 229653
54782 229653 235802 238131 236541 231354 222782 211711 200190 189853 180419 170937 161737 153865 147276
54769 147276 141185 135807 132280 130927 130891 131481 132844 135327 138916 143297 147989 152788 158510 166633 177604
54754 177604 190244 203413 217340 232493 248206 263574 278918 295121 312051 328665 344000
54743 344000 356989 365953 369549 367904 361806 351317 336263 317655 297455 277086 257008 237461
54731 237461 218790 201290 185387 171701 160388 150857 142535 135318 128955 122940 117550 113978 112640
54718A12640m03r91j826k278k715k877k025p04m03j205j663j215p45o53k95L76
54702I3018N77L86P21J394J148mn38J00P08M90O9j06m85j042j002l81j00j70L33
54683I5116J259J324L92j36M14J241J831K449K685J731L68L73J640K247J724J681
54667A16339K683L268K883L011M319N355N242N222O061O395N145L483K865L063
54653A75334L425M143N033N078M431M879P018R168J0270J1673J4479J7418J9082
54640B91431K0138K1481K2066K0493J7122J2819P299M48o382j2073j7189k1988
54628C55665k4810k4399k2263k0640j9459j7351j4456j2128j0724r603q540p561
54616A63731o182m318l019l004l359k986k227j808j364m62J99J9k23J75M52j42
$$ plain form
54718 112640 112237 111246 109420 107142 104427 101550 99525 98821 98418 97213 95550 94335 93590 92937 92642 93018
54702 93018 93595 93981 94702 96096 97244 97240 96702 96802 97510 98000 98069 97963 97478 96436 95434 95053 94953 94783 95116
54683 95116 96375 97699 98091 97955 98369 99610 101441 103890 106575 108306 108674 109047 110687 112934 114658 116339
54667 116339 119022 122290 125173 128184 132503 137858 143100 148322 154383 160778 165923 169406 172271 175334
54653 175334 178759 182902 187935 193013 197444 202323 209341 218509 228779 240452 254931 272349 291431
54640 291431 311569 333050 355116 375609 392731 405550 412849 413297 406915 394842 377653 355665
54628 355665 330855 306456 284193 263553 244094 226743 212287 200159 189435 179832 171292 163731
54616 163731 157549 153231 150212 147208 143849 140863 138636 136828 135464 135002 135201 135220 134997 135172 135624 135482
54600A35482p61m82j44q71j962k149j871k319l110k963k178k270l427m110l327
54585A03538j794p45o38j128j553j480j190j249j486j199n46n51j409k133k330
54570H4107k697l208k623p49O91N57j11k48n38j529j909n85J134J499J009J173
54554G5973J836J927J709K076K475J724L21j73M23R53J049J442K333L120L550
54539A00738L836L932L783L980M963O254P352Q727J0705J2250J2168J0805R270
54526A98763P711N547K764k53l449o564q721r557r922j0386j0231r029p938q001
54512A30734q379p747o355n139m026k725k023k515l114k602j658j459j404l01
54498H1287J119J145o5p60k79N34J187J870K235J718R04Q50J332J247M49l35q95
$$ plain form
54600 135482 134721 134239 134095 133224 131262 129113 127242 124923 121813 118850 116672 114402 110975 106865 103538
54585 103538 101744 100999 100361 99233 97680 96200 95010 93761 92275 91076 90530 89979 88570 86437 84107
54570 84107 81410 78202 75579 74830 75521 76078 75967 75719 75181 73652 71743 71158 72292 73791 74800 75973
54554 75973 77809 79736 81445 83521 85996 87720 88041 87868 88291 89244 90293 91735 94068 97188 100738
54539 100738 104574 108506 112289 116269 121232 127486 134838 143565 154270 166520 178688 189493 198763
54526 198763 206474 212021 214785 214532 211083 204519 195798 186241 176319 165933 155702 146673 138735 130734
54512 130734 122355 114608 108253 103114 99088 96363 94340 91825 88711 86109 84451 82992 81588 81287
54498 81287 82406 83551 83486 82726 82447 82981 84168 86038 88273 89991 90895 91745 93077 94324 94773 94438 93543
54481I3543j296q86P68K420K440J158K67L52O65Q25R94P83k16j154r82l07m51
54464I8923j102q64J86N88k0n12m08m15o91m11N48J172Q72K00k91n90o03j51L41
54445I6772K80j13l10o22j546k441k237j187m96n27p64j087j641j840j118k64
54429H0859m19j101r58m6M26K89M21P80M13n54q37q8O91R69J259J709J747J349
54411H6909J165J239J079R32J494K318K240J379J089J755K365K434K630L218L501
54396A15747L253L213L718M185M240M167L970L271K191J218K30j124k232k190
54382A43857j485j409j966k100j857k456m045n269n365m928m310l089j499o25
54368A03454o82p24m77p59j639j939j205m77m36m22K7K76O6K89J365K191J785
$$ plain form
54481 93543 92247 91361 92129 94549 96989 98147 98414 98766 99431 100256 101250 102033 101817 100663 99681 99374 98923
54464 98923 97821 96957 97143 97731 97711 97199 96791 96376 95685 95274 95822 96994 97866 98066 97775 97185 96582 96431 96772
54445 96772 97052 96939 96629 96007 94461 92020 89783 88596 88100 87573 86809 85722 84081 82241 81123 80859
54429 80859 80440 79339 78381 78335 78761 79050 79471 80251 80664 80110 79273 79185 79876 80845 82104 83813 85560 86909
54411 86909 88074 89313 90392 91324 92818 95136 97376 98755 99844 101599 103964 106398 109028 112246 115747
54396 115747 119000 122213 125931 130116 134356 138523 142493 145764 147955 149173 149403 148279 146047 143857
54382 143857 142372 140963 138997 136897 135040 132584 128539 123270 117905 112977 108667 105578 104079 103454
54368 103454 102772 102048 101571 100812 99173 97234 96029 95552 95116 94694 94721 94997 95063 95352 96717 98908 100693
54351A00693P31J29R1K14N18J082J585J885K309K887L138L012L144L675L882L427
54335A32402K967K965K867K026O78n44j352j694j598j495j964k964l945m687n260
54320A18402n327m479l273k713k773k536j872j675k256k827k858k722k669k353
54306G8069j726j352j460j626j585j511j340q49m00n91j194j440j267j142r16
54291E9670j51O01M53j53j6O88O29k72o37m3L23j48n35k64l0j38K57J406K071
54272F3711J433M12J19L15L42L17N26O86O80Q68J107N97n87j106k88Q16J077P72
54254G1797O46O31M50L90O60Q22O48O20R54J070O27J26p3l08o58n77J1K97k3j41
54234G7969N27J340J520J116M07o69j845k299j691o37K57Q40Q32n4j089j084j52
$$ plain form
54351 100693 101424 101553 101644 101858 102376 103458 105043 106928 109237 112124 115262 118274 121418 125093 128975 132402
54335 132402 135369 138334 141201 143227 143905 143361 142009 140315 138717 137222 135258 132294 128349 123662 118402
54320 118402 113075 108596 105323 102610 99837 97301 95429 93754 91498 88671 85813 83091 80422 78069
54306 78069 76343 74991 73531 71905 70320 68809 67469 66620 66220 65629 64435 62995 61728 60586 59670
54291 59670 59519 60120 60573 60420 60404 61092 61721 61449 60812 60769 61092 60944 60409 60145 60115 59977 60234 61640 63711
54272 63711 65144 65556 65675 65990 66332 66649 67175 67861 68541 69409 70516 71113 70526 69420 69132 69948 71025 71797
54254 71797 72443 73074 73524 73914 74574 75396 76044 76664 77618 78688 79315 79441 79368 79060 78402 77825 77836 78133 78110 77969
54234 77969 78496 79836 81356 82472 82879 82210 80365 78066 76375 75738 75995 76835 77667 77613 76524 75440 75288
54217G5288L71J24J17O24N43n03j256r13l76m14l11M93J021L99n64p31l38r6J90
54198G3668P99J117P53M95Q91J037J49q40p31j42m89j685k343j839q18M3N10M48
54180G1023q2o04q18r90j207j008l15P8k59n77j48N94R06Q52P79M77k39r05j120
54161F6437j151j196r31l39L8K24R92K292K809J964Q99O19M99j45n44J28J068
54144G3663J070L98Pj62o20r97p33l54o11j080r86o40p54r82n88O9J49k20l84
54125F6245m75r27j280q84k65m03j041j118n25j15j84k07O5L69N75P07N57P3k09
54106F0958M9K93r5p62r99p86l58M10J410J769J000j3k19J33K00l6j54k96o90
54087F1814q53m54j52m47n36L79J497J551Q48N81P41L39o77j356j349j148q76
$$ plain form
54217 75288 75659 75783 75900 76524 77067 76564 75308 74395 74019 73605 73294 73787 74808 75207 74643 73912 73574 73478 73668
54198 73668 74467 75584 76337 76832 77723 78760 78909 78069 77338 77196 76707 75022 72679 70840 70022 70065 70575 71023
54180 71023 70941 70337 69519 68529 67322 66314 65999 66077 65818 65241 65093 65687 66593 67445 68224 68701 68462 67557 66437
54161 66437 65286 64090 63159 62820 62858 63082 64074 66366 69175 71139 72038 72657 73156 73011 72467 72595 73663
54144 73663 74733 75131 75138 74976 74356 73359 72626 72272 71661 70581 69595 68955 68201 67219 66631 66700 66849 66629 66245
54125 66245 65770 64843 63563 62679 62414 62011 60970 59852 59327 59212 59028 58821 58886 59255 59830 60537 61094 61167 60958
54106 60958 61007 61300 61205 60443 59444 58658 58300 58710 60120 61889 62889 62876 62657 62790 62990 62954 62800 62504 61814
54087 61814 60961 60507 60355 59908 59372 59751 61248 62799 63647 64228 64969 65308 64631 63275 61926 60778 59902
54070E9902k17O05R56Q55P78O56J07n38n83q2L87P58J222J436J046O57J068J942
54052G0955K338K215K195K250J876J292J143J263R63M15N10J379K163K288J995
54037I5240J713J666K014K617K948K882L066L869M592M599M403M709N131N000
54023A44449M608M454M060K933J970K236L063K972J954J238J103P22k5l36ML51
54007A75756M33M71J94q50k129k609k371k364k766k895k612k394k208j672j156
53992A50828j308j746j643j341j699k188j462K13J088O09Nn5m17j476k169j758
53976A35481j023q33q53o24n72j052j446j138n09j40J30N99Q42K88p73j419j105
53959A25853k22K57l08j376j593m48Q73J069N58O23J253J262M09j14N25J825L026
$$ plain form
54070 59902 59685 60290 61246 62101 62879 63535 63642 63104 62521 62439 62826 63584 64806 66242 67288 67945 69013 70955
54052 70955 73293 75508 77703 79953 81829 83121 84264 85527 86490 86905 87415 88794 90957 93245 95240
54037 95240 96953 98619 100633 103250 106198 109080 112146 116015 120607 125206 129609 134318 139449 144449
54023 144449 149057 153511 157571 160504 162474 164710 167773 170745 172699 173937 175040 175762 175737 175401 175405 175756
54007 175756 176189 176660 176854 176004 173875 171266 168895 166531 163765 160870 158258 155864 153656 151984 150828
53992 150828 149520 147774 146131 144790 143091 140903 139441 139654 140742 141351 141356 141301 140884 139408 137239 135481
53976 135481 134458 133625 132772 132148 131576 130524 129078 127940 127431 127291 127421 128020 128862 129150 128377 126958 125853
53959 125853 125631 125888 125580 124204 122611 122163 123036 124105 124663 125286 126539 127801 128210 128096 128621 130446 133472
53942A33472L995M657M742M439M382M651M608M024L420L139K820K020O52j131
53928A79890k821l529k992k273k368k551j370R20K526K699K604L267M252M839
53914A83093N163N535N753N656N407M899L828K681K607L851N310O026O153O043
53900B52005N483M264K616O94j499l368l925l140k199j975k105k018j924k267
53886B40642k887l366l681m073m643n336o017o512o839p152p188o297m625l526
53872A68500l865m602m263l169k727k994k809j999j673k143k430k057j710j743
53858A30316j628j304j541k414k875k402j658j127m91J31r9j142j723j284q85
53843A09874j325j807j418o95o13j034j227j070q74o25k63rQ5K09J16o92j741
$$ plain form
53942 133472 137467 142124 146866 151305 155687 160338 164946 168970 172390 175529 178349 180369 181021 179890
53928 179890 177069 173540 170548 168275 165907 163356 161986 162906 165432 168131 170735 174002 178254 183093
53914 183093 188256 193791 199544 205200 210607 215506 219334 222015 224622 228473 233783 239809 245962 252005
53900 252005 257488 261752 264368 265062 263563 260195 256270 253130 250931 248956 246851 244833 242909 240642
53886 240642 237755 234389 230708 226635 221992 216656 210639 204127 197288 190136 182948 176651 172026 168500
53872 168500 164635 160033 155770 152601 149874 146880 144071 142072 140399 138256 135826 133769 132059 130316
53858 130316 128688 127384 125843 123429 120554 118152 116494 115367 114876 115007 114908 113766 112043 110759 109874
53843 109874 108549 106742 105324 104629 104016 102982 101755 100685 99811 99186 98923 98914 98999 99208 99324 98632 96891
53826I6891j671j51J396J641R05K90J46K45N05Q20Q54O06N38P74R07Q45R98J366
53808A07905J396J058R16R68O13L2K19J228J918J928K347L639M574M248L655M020
53792A40664M857N008M547M318M421M427M373M417M123L138J990J396J332J528
53778A90539K095K821K748J406k38r74r12j027j760k826l781m048l146j601q60
53763A78436j550k601k753k113j438q75l50k91r51j641j644j260j098j026p29
53748A58116n32p96j088r14p09j165k094k767k873k497j755j050j033j635j937
53733A35271j605j478k005k207j192K58P72K53l87o93p15l00N89J383J733K141
53717A31818K920L327K816K242K591L244K980K083J842K431K739K278J803J934
$$ plain form
53826 96891 95220 95069 96465 98106 99011 99301 99447 99692 100197 101017 101871 102477 103015 103789 104696 105541 106539 107905
53808 107905 109301 110359 111275 112243 112856 112888 113107 114335 116253 118181 120528 124167 128741 132989 136644 140664
53792 140664 145521 150529 155076 159394 163815 168242 172615 177032 181155 184293 186283 187679 189011 190539
53778 190539 192634 195455 198203 199609 199371 198397 197485 196458 194698 191872 188091 184043 180897 179296 178436
53763 178436 176886 174285 171532 169419 167981 167106 166756 166465 165514 163873 162229 160969 159871 158845 158116
53748 158116 157584 156788 155700 154786 154077 152912 150818 148051 145178 142681 140926 139876 138843 137208 135271
53733 135271 133666 132188 130183 127976 126784 127042 127814 128067 127680 126987 126272 125972 126561 127944 129677 131818
53717 131818 134738 138065 140881 143123 145714 148958 151938 154021 155863 158294 161033 163311 165114 167048
53703A67048K364K598K600K482K291K194K363K723L177L761M251M147L489L065
53689B08553L234L267K551J698J635K296L054L726M205L978L021K481L202M281
53675B51182M281L308K529K207J700J090J185J905K072J137p1n67l28R0K29r9
53659B71850p89j379j480j187p55k38J63p7j029j839j754j110o21l25k4n6o55
53642B58695j108p20j07l25j147j386p53j01L1q1j95l47k21N85J549J582O08j95
53624B56364M2Q63J374J420J499J960K597K831K333J559J457K362L588M372M726
53609B89347M929M877M569M577N219N860N901N889O639P736P979P156O214N764
53595C72656N458M940M529M723N570O706P602P834P445O857O253N478M722M599
$$ plain form
53703 167048 169412 172010 174610 177092 179383 181577 183940 186663 189840 193601 197852 201999 205488 208553
53689 208553 211787 215054 217605 219303 220938 223234 226288 230014 234219 238197 241218 243699 246901 251182
53675 251182 255463 258771 261300 263507 265207 266297 267482 269387 271459 272596 272525 271958 271630 271720 271949 271850
53659 271850 271061 269682 268202 267015 266260 266022 266185 266108 265079 263240 261486 260376 259755 259430 259406 259350 258695
53642 258695 257587 256867 256760 256435 255288 253902 253149 253048 253079 252998 252803 252456 252235 252820 254369 255951 256559 256364
53624 256364 256406 257269 258643 260063 261562 263522 266119 268950 271283 272842 274299 276661 280249 284621 289347
53609 289347 294276 299153 303722 308299 313518 319378 325279 331168 337807 345543 353522 360678 366892 372656
53595 372656 378114 383054 387583 392306 397876 404582 412184 420018 427463 434320 440573 446051 450773 455372
53581D55372N194N705N571N164M807M074K830J986K181K602K207J282O73K13o64
53566D99197j454j217k80J56j63m96o59j231k271l094l372l461l565l520l309
53551D71261l033k481j577q94r11j164j033p97j005j322j174q37p95n73M16J469
53535D55550J464P04L39M75L94K63R36K252L281M001N090O209O350N866O264P785
53519E07223R049R400R780J0831J1951J2742J3678J4754J5127J4811J5174J6874
53507F61394J8821J9994K0870K2153K3422K4140K4814K6040K7316K7934K8308
53496I25206K9371L1231L3168L4565L5162L5002L4644L4881L5721L6207L5729
53485A300887L4893L4670L5300L6361L7342L7787L7600L7478L8299L9780M0477
$$ plain form
53581 455372 460566 466271 471842 477006 481813 485887 488717 490703 492884 495486 497693 498975 499648 499861 499197
53566 499197 497743 496526 496246 496402 496239 495743 495084 493853 491582 488488 485116 481655 478090 474570 471261
53551 471261 468228 465747 464170 463276 462365 461201 460168 459371 458366 457044 455870 455033 454238 453665 454081 455550
53535 455550 457014 457718 458057 458532 458926 459189 460125 462377 465658 469659 474749 480958 487308 493174 499438 507223
53519 507223 516272 525672 535452 546283 558234 570976 584654 599408 614535 629346 644520 661394
53507 661394 680215 700209 721079 743232 766654 790794 815608 841648 868964 896898 925206
53496 925206 954577 985808 1018976 1053541 1088703 1123705 1158349 1193230 1228951 1265158 1300887
53485 1300887 1335780 1370450 1405750 1442111 1479453 1517240 1554840 1592318 1630617 1670397 1710874
53474A710874L9488L7416L5287L3346L1337K9248K7276K5518K4098K3071K2076
53463B039035K0733J9429J8883J8903J8521J7571J6913J6716J5694J2750Q430
53452B223578M008o5l989p642j0594j2795j4591j6400j8625k1512k4661k7224
53440B069488k8893l0213l1668l3101l4336l5699l7430l9136m0255m0648m0358
53429A677751l9305l7597l5723l4061l2492l0775k8948k7153k5435k3828k2352
53418A340082k0757j8633j5787j2332q631n352l146j699L71L905P918J0931J3043
53405A289913J5543J8760K1654K3524K4791K6012K7289K8855L0988L3164L4534
53394A575027L5432L7169M0082M3070M5396M7622N0278N3065N5888N9443O3913
$$ plain form
53474 1710874 1750362 1787778 1823065 1856411 1887748 1916996 1944272 1969790 1993888 2016959 2039035
53463 2039035 2059768 2079197 2098080 2116983 2135504 2153075 2169988 2186704 2202398 2215148 2223578
53452 2223578 2227586 2227521 2223532 2215890 2205296 2192501 2177910 2161510 2142885 2121373 2096712 2069488
53440 2069488 2040595 2010382 1978714 1945613 1911277 1875578 1838148 1799012 1758757 1718109 1677751
53429 1677751 1638446 1600849 1565126 1531065 1498573 1467798 1438850 1411697 1386262 1362434 1340082
53418 1340082 1319325 1300692 1284905 1272573 1263942 1258590 1255444 1253745 1254116 1258021 1265939 1276870 1289913
53405 1289913 1305456 1324216 1345870 1369394 1394185 1420197 1447486 1476341 1507329 1540493 1575027
53394 1575027 1610459 1647628 1687710 1730780 1776176 1823798 1874076 1927141 1983029 2042472 2106385
53383B106385O8311P1880P5129P8673Q2021Q4404Q5971Q7315Q8468Q9138Q9377
53372C007072Q9389Q9178Q8759Q8146Q6823Q3971P9509P4178O8463O2457N6959
53361C874904N3311N1537M9913M6988M3009L8646L3672K7827K1859J6449J1008
53350D269123M610k665j0415j9267l0328m3545n7451p0218q0311q6762q9811r0914
53338C692046r1426r1515r0860q9765q8754q7662q5985q3878q2033q0796q0028
53327B739344p9547p9156p8475p7189p5235p2482o8680o4123n9675n5712n1554
53316A977516m6534m1182l6763l3949l2445l1536l0618k9438k8058k6405k3933
53305A616655k0305j6294j3243j1497j0271r092q347q084p479n992m187k796j823
$$ plain form
53383 2106385 2174696 2246576 2321705 2400378 2482399 2566803 2652774 2740089 2828557 2917695 3007072
53372 3007072 3096461 3185639 3274398 3362544 3449367 3533338 3612847 3687025 3755488 3817945 3874904
53361 3874904 3928215 3979752 4029665 4076653 4119662 4158308 4191980 4219807 4241666 4258115 4269123
53350 4269123 4273733 4271068 4260653 4241386 4211058 4167513 4110062 4039844 3959533 3872771 3782960 3692046
53338 3692046 3600620 3509105 3418245 3328480 3239726 3152064 3066079 2982201 2900168 2819372 2739344
53327 2739344 2659797 2580641 2502166 2424977 2349742 2277260 2208580 2144457 2084782 2029070 1977516
53316 1977516 1930982 1889800 1853037 1819088 1786643 1755107 1724489 1695051 1666993 1640588 1616655
53305 1616655 1596350 1580056 1566813 1555316 1545045 1535953 1527606 1519522 1512043 1506051 1501864 1499068 1497245
53292A497245j024l80M22K045M518P030R199J1626J4710J8021K1356K5287K9866
53279A639921L3879L6215L7211L7805L8314L8789L9559M0484M0671L9807L8906
53268B061561L8731L8461L7009L4771L2832L1226K9264K7019K5219K3929K2413
53257B402435K0111J6919J2924Q564M631J325k260o965j2380j7611k2587k7828
53245B377278l3307l8375m2450m5217m6699m7616m9052n1117n2637n2725n1814
53234A866269n0594m8869m6412m3880m1944m0342l8783l7897l8210l9011l9363
53223A400964l9418l9674l9740l9081l8161l7554l6585l4256l0990k8063k5812
53212A011630k3692k1688k0354j9777j9628j9917k0589k0835k0012j8824j8405
$$ plain form
53292 1497245 1496221 1495841 1496263 1498308 1502826 1509856 1519055 1530681 1545391 1563412 1584768 1610055 1639921
53279 1639921 1673800 1710015 1747226 1785031 1823345 1862134 1901693 1942177 1982848 2022655 2061561
53268 2061561 2100292 2138753 2175762 2210533 2243365 2274591 2303855 2330874 2356093 2380022 2402435
53257 2402435 2422546 2439465 2452389 2460953 2465584 2466909 2464649 2457684 2445304 2427693 2405106 2377278
53245 2377278 2343971 2305596 2263146 2217929 2171230 2123614 2074562 2023445 1970808 1918083 1866269
53234 1866269 1815675 1766806 1720394 1676514 1634570 1594228 1555445 1517548 1479338 1440327 1400964
53223 1400964 1361546 1321872 1282132 1243051 1204890 1167336 1130751 1096495 1065505 1037442 1011630
53212 1011630 987938 966250 945896 926119 906491 886574 865985 845150 825138 806314 787909
53201G87909j8628j8538j7989j7664j7720j7638j7126j6221j4854j3301j2515
53190F05715j2970j3691j3604j3230j3688j4792j5478j5610j5813j5973j5492
53179D45374j4618j3964j3131j1451r733r397j0149j0278r252q195p739p269o532
53166C13666o145o131n615m503l856m120m449m273m079m062l529k334j542j816
53152B57212k365k315k041k299k969l445l562l365k672j546o09l57o66j300k217
53137B25484l102l232k313r07K64Q94Q50J49o65p96k49J10k23p04o12N1P89J215
53119B17003J236J019R35J108J172Q86P99J523K619L083K862K841L373L763L439
53104B47661K667J862J023R6q02j673k611l466m067m598n145n218m590m130m677
$$ plain form
53201 787909 769281 750743 732754 715090 697370 679732 662606 646385 631531 618230 605715
53190 605715 592745 579054 565450 552220 538532 523740 508262 492652 476839 460866 445374
53179 445374 430756 416792 403661 392210 382477 373080 362931 352653 343401 335206 327467 320198 313666
53166 313666 307521 301390 295775 291272 287416 283296 278847 274574 270495 266433 262904 260570 259028 257212
53152 257212 254847 252532 250491 248192 245223 241778 238216 234851 232179 230633 230024 229667 229001 227701 225484
53137 225484 222382 219150 216837 215930 216194 217088 217938 218087 217422 216626 216377 216487 216264 215560 214948 214999 215788 217003
53119 217003 218239 219258 220193 221301 222473 223359 224158 225681 228300 231383 234245 237086 240459 244222 247661
53104 247661 250328 252190 253213 253309 252507 250834 248223 244757 240690 236092 230947 225729 221139 217009 212332
53089B12332n539n357m259l600l714l582k884k581l044l210k356j291r70j146
53075A68799j235j400j833j966j285k26N48J016J244P54o86k227k726k044j035
53060A55698m56l86m15r2N39Q66N14K5O6K44k44j073j127m24j70o85q03QN18l15
53040A52288j594j883j279q53q63q29q05j265j949k030j354o60n97j110j786k189
53024A31242j960j058O8Q63J061O68j71j027j381j206j027j183j396j262p68j42
53008A21321L75M82Q5l70k99J49K60j10k83J33O48P00M30L07N40J044J489J290
52990A28191K48q19q82j90M0m42m73O23J928K308J926J591J560J702K137K727
52974A42175K646J383k78j014m38P99J969K751L125L307L629M124M487M618M737
$$ plain form
53089 212332 206793 201436 197177 193577 189863 186281 183397 180816 177772 174562 172206 170915 169945 168799
53075 168799 167564 166164 164331 162365 161080 160854 161402 162418 163662 164416 163730 161503 158777 156733 155698
53060 155698 155242 154856 154441 154349 154888 155754 156268 156293 156359 156603 156359 155286 154159 153735 153565 152880 152077 152085 152603 152288
53040 152288 150694 148811 147532 146679 145816 144987 144182 142917 140968 138938 137584 136924 136327 135217 133431 131242
53024 131242 129282 128224 128292 129155 130216 130884 130713 129686 128305 127099 126072 124889 123493 122231 121463 121321
53008 121321 121696 122178 122263 121893 121594 121743 122003 121893 121610 121743 122391 123091 123521 123828 124368 125412 126901 128191
52990 128191 128439 127620 126738 126548 126588 126146 125673 126296 128224 130532 132458 134049 135609 137311 139448 142175
52974 142175 144821 146204 145926 144912 144474 145273 147242 149993 153118 156425 160054 164178 168665 173283 178020
52959A78020M793M345L278K100J239O57L31L74M46j10j214j863j532r54j030j617
52943A87263j963j809j523j542k046k708k712j630k67J37m15q45p50p92j137j020
52927A66241l27n0m54l45Q94J958J572M80J41N39P41O92R03J062N50j76k28R7
52909A74290k08j038j261n60J83L82M55Q49J302J377R86K96l53m78L0O57R34J033
52891A78876J121P49l58j338j074K27J321J585J473J457J421J190Q23L64p6n0
52875A87711P45J771K017J141k08j109j065j76Q85J339J084P93R47J200J086P39
52859A98900M65J96l7J95R46J473J308J049J303J601J324R96J516K623L330L440
52843B20628L464L498L349L436M199M883M282K615J340J065R39K26p99j767k798
$$ plain form
52959 178020 182813 187158 190436 192536 193775 194432 194763 195137 195583 195473 194259 192396 190864 189910 188880 187263
52943 187263 185300 183491 181968 180426 178380 175672 172960 171330 171063 171200 170785 169940 169190 168398 167261 166241
52927 166241 165914 165864 165410 165065 165959 167917 169489 169969 170110 170649 171390 172082 172985 174047 174597 174421 174193 174290
52909 174290 174082 173044 171783 171223 171406 171788 172243 173092 174394 175771 176757 177053 176700 176222 176252 176909 177843 178876
52891 178876 179997 180746 180388 179050 177976 178203 179524 181109 182582 184039 185460 186650 187473 187837 187761 187711
52875 187711 188456 190227 192244 193385 193177 192068 191003 190827 191712 193051 194135 194928 195875 197075 198161 198900
52859 198900 199365 199561 199524 199719 200665 202138 203446 204495 205798 207399 208723 209719 211235 213858 217188 220628
52843 220628 224092 227590 230939 234375 238574 243457 247739 250354 251694 252759 253698 253924 253125 251358 248560
52828B48560l738l939l258k481k251k395k544k746l087l365l451l434l259k790
52814B05822k295k258k583k619k063j303q05p49j240k175k893k708j822j075q42
52799A78392q54r74j356j783j786j479j391j467j137n33n93j606k647k806k204
52784A55776j409p06k94l96p78q51n99o53j133j355j095j129j830k268j649p84
52768A38847r94k071k564j848p59k06j85m04q77j539j949j811j372r82o20k73
52752A20393k88r20j747k092j922j805k007k143j929j703j793j873j459q44p49
52737I7119j202j489j299j112j225j218p58k45m4K14Q77J334P96l40q38k97M10
52720I0683M77J58J14M05N22J01o87j372j554j161m71J21L50J64k33m23q2N95
$$ plain form
52828 248560 244822 240883 237625 235144 232893 230498 227954 225208 222121 218756 215305 211871 208612 205822
52814 205822 203527 201269 198686 196067 194004 192701 191896 191147 189907 187732 184839 182131 180309 179234 178392
52799 178392 177538 176564 175208 173425 171639 170160 168769 167302 166165 165632 165039 163433 160786 157980 155776
52784 155776 154367 153661 153367 152971 152193 151342 150743 150090 148957 147602 146507 145378 143548 141280 139631 138847
52768 138847 137853 135782 133218 131370 130611 130405 130220 129816 128939 127400 125451 123640 122268 121286 120666 120393
52752 120393 120105 119185 117438 115346 113424 111619 109612 107469 105540 103837 102044 100171 98712 97868 97119
52737 97119 95917 94428 93129 92017 90792 89574 88816 88571 88527 88741 89618 90952 91748 91408 90570 90273 90683
52720 90683 91160 91318 91432 91837 92359 92460 91773 90401 88847 87686 87215 87336 87686 87850 87617 87194 87112 87707
52702H7707J076J135R97Q04N26M34J073K333L286L347K993K797K542J936J513
52687A14499J847K371K065R94J14k98q75j809k299j751p01j89o61j736k624k645
52671A06302j742o69l35r57j979k713k767k128j219o76o62p18n24m12o56q72p13
52654H6560o03r33j121m73N00P37L63N20J543K466K420J545L14r91j953k080j501
52637H7313q72m08K82J257J983K145K048K039K204K627L215L293K261N53q89j967
52621A07084l182m183l990k776j950k039j924q66J74J54l81l89n5j62n32l86K30
52604H4827O06O71R50J386J283N49K0L73J304J988J911J119P9o10o03pQ66J743
52586I8455K310K247J705J349J511J631J056Q7l28J85J077J736K053K119J877
$$ plain form
52702 87707 88783 89918 90915 91719 92245 92679 93752 96085 99371 102718 105711 108508 111050 112986 114499
52687 114499 116346 118717 120782 121776 121890 121592 120717 118908 116609 114858 114157 113968 113307 111571 108947 106302
52671 106302 104560 103891 103556 102599 100620 97907 95140 93012 91793 91117 90455 89737 89213 88801 88145 87273 86560
52654 86560 85957 85024 83903 83430 83930 84667 85030 85550 87093 89559 91979 93524 93838 92847 90894 88814 87313
52637 87313 86441 86033 86315 87572 89555 91700 93748 95787 97991 100618 103833 107126 109387 109940 109051 107084
52621 107084 103902 99719 95729 92953 91003 88964 87040 86174 86348 86502 86121 85732 85677 85515 84983 84597 84827
52604 84827 85433 86104 87054 88440 89723 90272 90292 90665 91969 93957 95868 96987 97066 96456 95853 95846 96712 98455
52586 98455 100765 103012 104717 106066 107577 109208 110264 110351 110023 110208 111285 113021 115074 117193 119070
52571A19070J417J155J342J641J540J099Q94J241J786K049K013J899J645J026
52557A39817J98l79n47n70n44k48L14P59R29J105J327J156N21N3J40K82M3j16
52539A44240K90P02L63l70o00l62l58n61l33K83O09N93Q08J152R37L04K13P20
52521A48630P26j16o70j88L70j01j080j278n23K49M46K74O5m8J2J85K26O3mK04
52501A47442M38M60L94L63K66J78L79P62P30J03m51k75M35J024J122O87q3o56
52483A53318n19M7J61l64o81k09M62O06M61O51J071J181R73R06J104J289J285
52466A61742J098P18K72J60O51J464K057K092J505M86m65r36j133j419j412l46
52450A66534J414K333J666M07l35q81j959l051l077k117j272j019q56m67k14l73
$$ plain form
52571 119070 120487 121642 122984 124625 126165 127264 128158 129399 131185 133234 135247 137146 138791 139817
52557 139817 140015 139636 139089 138519 137975 137727 138041 138800 139729 140834 142161 143317 143838 143891 144031 144313 144356 144240
52539 144240 144530 145232 145595 145225 144625 144263 143905 143344 143011 143294 143903 144496 145304 146456 147393 147697 147910 148630
52521 148630 149356 149240 148570 148382 148752 148651 147571 146293 145770 146019 146465 146739 146804 146756 146768 146953 147179 147242 147238 147442
52501 147442 147880 148340 148734 149097 149363 149541 149920 150682 151412 151515 151064 150789 151224 152248 153370 154057 153974 153318
52483 153318 152799 152846 153007 152643 151962 151753 152215 152821 153282 153933 155004 156185 157158 158064 159168 160457 161742
52466 161742 162840 163558 163830 163990 164641 166105 168162 170254 171759 172245 171780 170844 169711 168292 166880 166534
52450 166534 167948 170281 171947 172354 172019 171138 169179 166128 163051 160934 159662 158643 157787 157320 157106 156733
52434A56733p14r64j062r01l93J87M10L07K73M01L09k82j090j489j124l71j26
52417A50104p84j534j260j38M74K2m43N4R40J249J256J805K573K435J352N26O35
52400A59266J084J244J370J782K068J693Q89M02O59J459K288K621K188J152J5
52385A80180p20p12J42J518K608K716J950J144J044J728K689L280L109K372J732
52370B04780J696K083K238J790R96L87K23L40N17Q29J448K097K130J514J203J909
52354B26180K857K687J440N93R51J722K079K435L382M360M399L602K827K375J961
52339B63850J651J836K385K646K373J928J645J539J627J908K079J845J494J662
52325B90468K444L237L517L390L332L626M101M291L924L351L233L775M585N380
$$ plain form
52434 156733 156019 155055 153993 153092 152699 152886 153296 153603 153876 154277 154586 154304 153214 151725 150601 150230 150104
52417 150104 149320 147786 146526 146388 146862 146884 146441 146495 147435 148684 149940 151745 154318 156753 158105 158631 159266
52400 159266 160350 161594 162964 164746 166814 168507 169396 169798 170457 171916 174204 176825 179013 180165 180180
52385 180180 179460 178748 178890 180408 183016 185732 187682 188826 189870 191598 194287 197567 200676 203048 204780
52370 204780 206476 208559 210797 212587 213583 213970 214193 214533 215050 215879 217327 219424 221554 223068 224271 226180
52354 226180 229037 231724 233164 233757 234708 236430 238509 240944 244326 248686 253085 256687 259514 261889 263850
52339 263850 265501 267337 269722 272368 274741 276669 278314 279853 281480 283388 285467 287312 288806 290468
52325 290468 292912 296149 299666 303056 306388 310014 314115 318406 322330 325681 328914 332689 337274 342654
52311C42654O230O955P004O445O392P735R932J1697J2461J2557J2385J2253J2732
52298D67432J4233J6268J7793J8377J8447J8524J8772J9213J9880K0655K1353
52287F70947K1896K2156K1872K1094K0402K0243K0336K0176J9811J9529J9102
52276H97564J7987J6143J4121J2405J1102J0102R082P534N313L009J354M63o2
52263A006117o48j703l505n661p105p316p089p471q331q707q228p331o393n428
52249I21201m435l327j671P20L126M593N170N784P044Q811J0744J2504J3592J3790
52235I97646J3724J4350J5834J7466J8518J8622J7660J5963J4395J3490J2775
52224A170443J1582J0092Q779P301N032K387L81r98k684m878o757q026r436j1370
$$ plain form
52311 342654 348884 355839 362843 369288 375680 383415 393347 405044 417505 430062 442447 454700 467432
52298 467432 481665 497933 515726 534103 552550 571074 589846 609059 628939 649594 670947
52287 670947 692843 714999 736871 757965 778367 798610 818946 839122 858933 878462 897564
52276 897564 915551 931694 945815 958220 969322 979424 988506 996040 1001353 1004362 1005716 1006179 1006117
52263 1006117 1005469 1003766 1000261 994600 987495 980179 973090 965619 957288 948581 940353 933022 926629 921201
52249 921201 916766 913439 911768 912488 915614 920207 925377 931161 938205 947016 957760 970264 983856 997646
52235 997646 1011370 1025720 1041554 1059020 1077538 1096160 1113820 1129783 1144178 1157668 1170443
52224 1170443 1182025 1192117 1200896 1208197 1213229 1215616 1215997 1214999 1212315 1207437 1200680 1192654 1183218 1171848
52210A171848j3166j4388j5645j7431j9013j9365j8619j7861j7762j8002j7840
52199I82756j6861j5293j3867j3182j3111j2948j2116j0550q536o571n215m636
52187H49870m389m045l741l692l573l018k419k259k082j127K06P00J59l46k29
52172H20015k26j020k114k695k780k823k881k749k508k358k301k323k619l278
52158G87340m057m607m699m279l673l561m167m610l937k627k172l000l922l911
52144G34118l444l421l737l669l201l083l739m677n030m433l429k917l118l291
52130F82929k821k217k344k996l147k544k033k224k736k982k852k442j865j498
52116F48228j510j184L38K475L569L154K615L157M351N333O200P368Q609R725
$$ plain form
52210 1171848 1158682 1144294 1128649 1111218 1092205 1072840 1054221 1036360 1018598 1000596 982756
52199 982756 965895 950602 936735 923553 910442 897494 885378 874828 866292 859721 854506 849870
52187 849870 845481 841436 837695 834003 830430 827412 824993 822734 820652 819525 819731 820431 820590 820244 820015
52172 820015 819789 818769 816655 813960 811180 808357 805476 802727 800219 797861 795560 793237 790618 787340
52158 787340 783283 778676 773977 769698 766025 762464 758297 753687 749750 747123 744951 741951 738029 734118
52144 734118 730674 727253 723516 719847 716646 713563 709824 705147 700117 695684 692255 689338 686220 682929
52130 682929 680108 677891 675547 672551 669404 666860 664827 662603 659867 656885 654033 651591 649726 648228
52116 648228 646718 645534 645872 648347 651916 655070 657685 660842 665193 670526 676726 684094 692703 702428
52102G02428J1258J3493J5585J6776J7740J9566K1976K3758K4608K5293K6230
52091I18711K7036K7504K8002K8720K9309K9417K8949K7778K5804K3392K1216
52080A215838J9586J8255J6858J5231J3373J1374R296O893L841N11k012l235m092
52067A321717n791q177j0086j1105j2029j3460j4916j5704j5967j6312j6712j6438
52055A165020j4986j2703j0367q413o797n427m350l354j833M75K810M105M398
52042A108578M926O546Q731J0419J1352J2019J2718J3282J3593J3786J3940J3938
52030A243828J3696J3261J2679J1888J0753R109O979M757K933J493q0k063m003
52017A325230n346o282p653r934j2611j4675j5701j6353j7653j9752k1695k2590
$$ plain form
52102 702428 713686 727179 742764 759540 777280 796846 818822 842580 867188 892481 918711
52091 918711 945747 973251 1001253 1029973 1059282 1088699 1117648 1145426 1171230 1194622 1215838
52080 1215838 1235424 1253679 1270537 1285768 1299141 1310515 1319811 1326704 1330545 1331056 1329044 1325809 1321717
52067 1321717 1315926 1307749 1297663 1286558 1274529 1261069 1246153 1230449 1214482 1198170 1181458 1165020
52055 1165020 1150034 1137331 1126964 1118551 1111754 1106327 1101977 1098623 1096790 1097265 1100075 1104180 1108578
52042 1108578 1113504 1120050 1128781 1139200 1150552 1162571 1175289 1188571 1202164 1215950 1229890 1243828
52030 1243828 1257524 1270785 1283464 1295352 1306105 1315214 1322193 1326950 1329883 1331376 1331296 1329233 1325230
52017 1325230 1319884 1313602 1305949 1296015 1283404 1268729 1253028 1236675 1219022 1199270 1177575 1154985
52005A154985k2632k2612k2748k2709k2633k3279k4977k6987k8257k8358k7534
51994H82259k6309k5258k4765k4761k4833k4731k4447k3984k3378k2887k2613
51983F14293k2056k0660j8747j7243j6455j5866j5151j4535j3997j3012j1518
51972D35053j0269r814r776r536r022q358p427o252n319m961m943m874m624m089
51958C35789l277k780l313m411m632l604k801l478m778m999m092l512l962m564
51944B81586m325l405k591k284k360k585k851l120l307l280l126l249l856m344
51930B36903l836k482j556j883k799l124k549j626q07j23N34J225J788J704O13
51915B21982q31j373p43p5k69q19r16q26j236j849j814j173q50j278j939k216
$$ plain form
52005 1154985 1132353 1109741 1086993 1064284 1041651 1018372 993395 966408 938151 909793 882259
51994 882259 855950 830692 805927 781166 756333 731602 707155 683171 659793 636906 614293
51983 614293 592237 571577 552830 535587 519132 503266 488115 473580 459583 446571 435053
51972 435053 424784 414970 405194 395658 386636 378278 370851 364599 359280 354319 349376 344502 339878 335789
51958 335789 332512 329732 326419 322008 317376 313772 310971 307493 302715 297716 293624 290112 286150 281586
51944 281586 277261 273856 271265 268981 266621 264036 261185 258065 254758 251478 248352 245103 241247 236903
51930 236903 233067 230585 229029 227146 224347 221223 218674 217048 216241 216118 216652 217877 219665 221369 221982
51915 221982 221151 219778 219035 218960 218691 217872 216956 216130 214894 213045 211231 210058 209208 207930 205991 203775
51899B03775k008j535j125j146j643k127k167j965j946j992j674j002m33k32k80
51884A82500l85m07k12J64M89O43P20O59K48l41o33o31q75j450j672j166m69p8
51866A77104K84Q86J293J234J302K011K860L215L295L416K978J431l44q29J86
51851B00322J472J973J642R45L70K25L28J33k96j55O85J111M92o4N58J465J127
51834B12333jp2J266K422K265J335N02RN2Q32J716J606N02m58p11q16j156j334
51816B20292j166j055j120j102j241j973k556j615N22J682P73o11n62N17R35L04
51800B12024k74r9L91O53P41R56J374J819J999J808J547J580J754J574J039O79
51784B29565O52N31J24j26R5M91P16P63N89J4p05q67j95Q82J989L146M186M683
$$ plain form
51899 203775 201767 200232 199107 197961 196318 194191 192024 190059 188113 186121 184447 183445 183012 182780 182500
51884 182500 182115 181708 181496 181660 182149 182792 183512 184171 184419 184078 183445 182814 181939 180489 178817 177651 177182 177104
51866 177104 177388 178274 179567 180801 182103 184114 186974 190189 193484 196900 199878 201309 200965 200136 200322
51851 200322 201794 203767 205409 206354 206724 206949 207277 207410 207114 206959 207644 208755 209247 209183 209741 211206 212333
51834 212333 212332 212260 213526 215948 218213 219548 220050 220059 220111 220943 222659 224265 224767 224309 223598 222782 221626 220292
51816 220292 219126 218071 216951 215849 214608 212635 210079 208464 208986 210668 211441 210830 210268 210785 211720 212024
51800 212024 211750 211651 212042 212695 213436 214392 215766 217585 219584 221392 222939 224519 226273 227847 228886 229565
51784 229565 230217 230748 230872 230746 230841 231332 232048 232811 233400 233414 232709 231842 231647 232529 234518 237664 241850 246533
51766B46533M794N343O638Q048R062R925J0749J0895R828P877N458K434j143m350
51752C32091o347p367p959p941o939n510m686m628m585m049l183k283j461q41
51738B64312n52m44l18k47m16p02q25o97l72O4K93q8q81j161l57R14J664J723
51720B61910J514J094K28o81p38L07J684K592K903K699J740o5k068l325l603l467
51704B62724l279k654j217L72Q61j27j610k525k847l076l139k599j636r19n93
51689B37736j15P75J704K377K973L612M174M847O105P792Q793Q135N918K919j30
51674B97615k590l915m185m143m264m247l826l454l608l922l763l238k909k727
51660B46824k150j088l6Q81K187M100N833O179M645J729j635m600o559p176o591
$$ plain form
51766 246533 251327 256670 263308 271356 280418 290343 301092 311987 321815 329692 335150 337584 336441 332091
51752 332091 325744 318377 310418 302477 295538 290028 285342 280714 276129 272080 268897 266614 265153 264312
51738 264312 263760 263316 262998 262751 262335 261633 260808 260111 259739 259803 260096 260008 259127 257966 257609 258523 260187 261910
51720 261910 263424 264518 264746 264065 263327 263634 265318 267910 270813 273512 275252 275187 273119 269794 266191 262724
51704 262724 259445 256791 255574 255946 256807 256680 255070 252545 249698 246622 243483 240884 239248 238329 237736
51689 237736 237621 238396 240100 242477 245450 249062 253236 258083 264188 271980 280773 288908 294826 297745 297615
51674 297615 295025 291110 286925 282782 278518 274271 270445 266991 263383 259461 255698 252460 249551 246824
51660 246824 244674 243586 243550 244431 246618 250718 256551 262730 267375 269104 267469 262869 256310 249134 242543
51645B42543n457m556m197m112l950l614l093k377j800k000k999l712l031j266
51631A96379J77M50m2o03j013j193r31l13J11J7k91l71j37L00P93R77N15k53n24
51612A94048l0O33R11Q88P89O13N98J273K565L519L444K799K400K378K454K716
51596B21998L335L982M264M449N035N755N801M915L691K711K010J403R52Q77J148
51581B72326J274N58j154k932l411k258o58K0l33p51m69M67J629K707L528L942
51565B74485L887L498L209L568M664N767N921N010L778K801J910R50L45M86R13
51550C21192P25l15j483j874j244j07P87J114J077Q64K59q32j823k002j557j372
51534C13409j817k438k899l438m153m582m365l723l009k357j935j914j933j417
$$ plain form
51645 242543 237086 232530 228333 224221 220271 216657 213564 211187 209387 207387 204388 200676 197645 196379
51631 196379 196556 197006 196964 196361 195348 194155 193224 192911 193022 193039 192748 192377 192240 192540 193333 194310 194825 194572 194048
51612 194048 194018 194651 195562 196450 197239 197852 198450 199723 202288 205807 209251 212050 214450 216828 219282 221998
51596 221998 225333 229315 233579 238028 243063 248818 254619 259534 263225 265936 267946 269349 270301 271178 272326
51581 272326 273600 274158 273004 270072 266661 264403 263745 263765 263432 262681 262212 262679 264308 267015 270543 274485
51565 274485 278372 281870 285079 288647 293311 299078 304999 310009 313787 316588 318498 319448 319793 320279 321192
51550 321192 321917 321602 320119 318245 317001 316894 317681 318795 319872 320736 320995 320163 318340 316338 314781 313409
51534 313409 311592 309154 306255 302817 298664 294082 289717 285994 282985 280628 278693 276779 274846 273429
51520B73429o19n04j264j844j447n71j7J82J87l38j491k442k473k027j884j842
51504B55035j305n96o44j540k437k667k213j262r6P28Q73P84J089J651J880J758
51488B51038J776K010K087J959J976K170K176J973K046K668L426L714L437L141
51474B85597L469M463N406N625N337N209N189M600L548L095L569L777K798J549
51460C43231J470K367K822K236J299O67K82j08o69j634k876l591l269k683l058
51445C36486m454n893o775p187p027o078m818m062l771l269k624k647l330l521
51431B71030k520j030m7L12M10L14N3K7N70J447K156K485K570K588K564K256J327
51414B86512j20j376j902k022k380l073l814m620n508n900n237m002l195k980
$$ plain form
51520 273429 272810 272306 271042 269198 267751 267180 267163 267345 267532 267194 265703 263261 260788 258761 256877 255035
51504 255035 253730 253134 252490 250950 248513 245846 243633 242371 242275 243003 243876 244660 245749 247400 249280 251038
51488 251038 252814 254824 256911 258870 260846 263016 265192 267165 269211 271879 275305 279019 282456 285597
51474 285597 289066 293529 298935 304560 309897 315106 320295 324895 328443 331538 335107 338884 341682 343231
51460 343231 344701 347068 349890 352126 353425 354092 354374 354266 353597 351963 349087 345496 342227 339544 336486
51445 336486 332032 326139 319364 312177 305150 299072 294254 290192 286421 283152 280528 277881 274551 271030
51431 271030 268510 267480 267433 267745 268155 268469 268522 268549 269119 270566 272722 275207 277777 280365 282929 285185 286512
51414 286512 286392 285016 283114 281092 278712 275639 271825 267205 261697 255797 250560 246558 243363 240383
51400B40383k853k911l708m836n053m125l306l443l807l494k914k949l391l300
51386A90293k519j909k129k864l270k855j854r55n95o20p01r25j503k076j914
51371A63604q90L58J305J995K476K439J628J59j700l548m605m120k360o28L6j98
51355A55951m80k54M56J225J510J061L02l7K75Q96J528K071K261J878J318J250
51339A71211J629J782J594J752K603L580M128M425M763M906M581L937L111J803
51325B15805j19k053l209l447l254l182l527m207m754m730m320m087m166m233
51311A66517m150m007l571k562j566j589k470k862k206j578j903k486k248j412
51297A31907q69o64l12Lk26o37m24K87O46N58P30J240J253M78j89K8P73J350J715
$$ plain form
51400 240383 237530 234619 230911 226075 221022 216897 213591 210148 206341 202847 199933 196984 193593 190293
51386 190293 187774 185865 183736 180872 177602 174747 172893 171938 171343 170723 170022 169097 167594 165518 163604
51371 163604 162714 163072 164377 166372 168848 171287 172915 173074 171374 167826 163221 159101 156741 156113 156149 155951
51355 155951 155471 155217 155673 156898 158408 159469 159771 159734 160009 160905 162433 164504 166765 168643 169961 171211
51339 171211 172840 174622 176216 177968 180571 184151 188279 192704 197467 202373 206954 210891 214002 215805
51325 215805 215686 213633 210424 206977 203723 200541 197014 192807 188053 183323 179003 174916 170750 166517
51311 166517 162367 158360 154789 152227 150661 149072 146602 143740 141534 139956 138053 135567 133319 131907
51297 131907 131038 130374 130062 130065 129839 129202 128778 129065 129711 130269 130999 132239 133492 133970 133781 133809 134582 135932 137647
51278A37647K004J818Q12l42n19L64J158R45Q7m54l79j83l40p99j302j763k154
51261A36600k344k235j880j358p18j39J43J68K13L12K06o4k1M36O69K71k14j67
51243A29878j9n32j409j658j215r90j204q97M44J838K080J348P88R67J387J356
51227A32162P84J64lJ88P9o10j146n97Q01J829J831J344J086J165J507K132K656
51210A45372K375J383P85J238K004K072J571J306J481J706J819J961K008J650
51196A68731R66L75J30K17N42R09R99P49M40K14j58q10j449j779j841j639j016
51179A65580j99J05l77j042j312j450j859k200j902j201q49j047j272j129p60
51164A49086n35o58j011j162p47r1N6m65r01p20l03j28J19Q66J727K018J796J610
$$ plain form
51278 137647 139651 141469 142281 141939 141420 141784 142942 143887 143974 143520 143141 142958 142618 141819 140517 138754 136600
51261 136600 134256 132021 130141 128783 128065 127926 128069 128237 128450 128762 128968 128904 128883 129319 129988 130259 130045 129878
51243 129878 129859 129327 127918 126260 125045 124055 122851 121954 122398 124236 126316 127664 128452 129419 130806 132162
51227 132162 132946 133110 133107 133295 133374 132764 131618 131021 131822 133651 135482 136826 137912 139077 140584 142716 145372
51210 145372 147747 149130 149915 151153 153157 155229 156800 158106 159587 161293 163112 165073 167081 168731
51196 168731 169697 170072 170202 170419 170961 171870 172869 173618 174058 174272 174114 173304 171855 170076 168235 166596 165580
51179 165580 165381 165486 165109 164067 162755 161305 159446 157246 155344 154143 153294 152247 150975 149846 149086
51164 149086 148551 147893 146882 145720 144973 144882 144938 144473 143572 142852 142549 142421 142540 143406 145133 147151 148947 150557
51146A50557J494J068L34l63r87j692k240k215j769j458j445j467j435j469j428
51131A35485r95k73K78L79O9n62j300j679j412q62o02p15q66q22n09J44Q66J058
51113A27682N97K40N80J078Q96K33o2J82N07Q65J528K119J912J141Q65J329J564
51096A43256R51J36n6K95P33J263J999K581K614K328K216K318K334K122J739J129
51080A67958K69n70j042j163j238j351j138k09J187K111J794O63J33J077K806
51065A71287L887L736K913K154J727J664J946K291K230J543L92q61j734j726q92
51050A90557m0J76K20R85K253K726J766K61n56m68K1O51J466K235K456J952J120
51033B07781N42M47N44L72j27n14n10m05n53o66k21N36O59l06j720k569k410j453
$$ plain form
51146 150557 152051 153119 153453 153090 152103 150411 148171 145956 144187 142729 141284 139817 138382 136913 135485
51131 135485 134490 134217 134495 134874 134943 134381 133081 131402 129990 129128 128526 127811 126945 126123 125614 125758 126624 127682
51113 127682 128279 128519 129099 130177 131073 131306 131244 131426 131933 132798 134326 136445 138357 139498 140363 141692 143256
51096 143256 144207 144343 144287 144582 145315 146578 148577 151158 153772 156100 158316 160634 162968 165090 166829 167958
51080 167958 168227 167657 166615 165452 164214 162863 161725 161516 162703 164814 166608 167271 167404 168481 171287
51065 171287 175174 178910 181823 183977 185704 187368 189314 191605 193835 195378 195770 194909 193175 191449 190557
51050 190557 190517 190693 190913 191898 194151 196877 198643 198904 198348 197880 197901 198552 200018 202253 204709 206661 207781
51033 207781 208323 208770 209314 209686 209559 209045 208535 208130 207577 206911 206690 207226 207885 207579 205859 203290 200880 199427
51015A99427k33O68R54Q92R94J359J668J772J781J642J209P93J006J863K682L057
50999B21534L356L854M120L780L353L625M513N266N570N830O411P184P956Q782
50985B95134R634J0129R989R581R690J0728J2337J3871J5096J6295J7879K0072
50973D50435K2852K5902K8707L1091L3725L7594M2848M8555N3849N8719O3436
50962H97713O7860P1817P5627P9532Q3012Q5415Q6889Q7772Q7400Q4497P8724
50951A786258P0909O1725N1261L9968K8842J8249P579l396j3695k2335k9462l5562
50939A960341m0235m2680m2904m1581l9077l5511l1639k8683k7236k6889k7112
50928A576794k7846k9166l0913l2960l5429l8437m1812m5259m8469n0994n2352
$$ plain form
51015 199427 199194 199862 200816 201708 202702 204061 205729 207501 209282 210924 212133 212926 213932 215795 218477 221534
50999 221534 224890 228744 232864 236644 239997 243622 248135 253401 258971 264801 271212 278396 286352 295134
50985 295134 304768 314897 324886 334467 344157 354885 367222 381093 396189 412484 430363 450435
50973 450435 473287 499189 527896 558987 592712 630306 673154 721709 775558 834277 897713
50962 897713 965573 1037390 1113017 1192549 1275561 1360976 1447865 1535637 1623037 1707534 1786258
50951 1786258 1857167 1918892 1970153 2010121 2038963 2057212 2064791 2061395 2047700 2025365 1995903 1960341
50939 1960341 1920106 1877426 1834522 1792941 1753864 1718353 1686714 1658031 1630795 1603906 1576794
50928 1576794 1548948 1519782 1488869 1455909 1420480 1382043 1340231 1294972 1246503 1195509 1143157
50917A143157n2493n1961n1305n0359m8406m5100m1042l7269l4282l1715k8971
50906F70254k5979k3175k0850j8744j6376j3674j1215r649q816p692n518k862
50894E05704j031m35j60N99J427J548J166J155J714K267K533K899L638M491N119
50879E32634N422N309M854M683N515P124Q449Q996R421J0393J1647J2598J3339
50866F40384J4379J5805J7326J8896K0817K3294K6265K9544L2961L6512M0565
50855I16748M5654N1943N9146O7103P5975Q5774R6150J07004J18766J31557J44525
50844A900345J56530J67314J77396J86910J95046K00630K02839K01171J95052
50835C583233J83745J66835J44717J18487Q9241N7746K5115o567l4992n9174p9497
$$ plain form
50917 1143157 1090664 1038703 987398 937039 888633 843533 802491 765222 730940 699225 670254
50906 670254 644275 621100 600250 581506 565130 551456 540241 530592 521776 514084 508566 505704
50894 505704 504673 504238 504078 504677 506104 507652 508818 509973 511687 513954 516487 519386 523024 527515 532634
50879 532634 538056 543365 548219 552902 558417 565541 573990 582986 592407 602800 614447 627045 640384
50866 640384 654763 670568 687894 706790 727607 750901 777166 806710 839671 876183 916748
50855 916748 962402 1014345 1073491 1140594 1216569 1302343 1398493 1505497 1624263 1755820 1900345
50844 1900345 2056875 2224189 2401585 2588495 2783541 2984171 3187010 3388181 3583233
50835 3583233 3766978 3933813 4078530 4197017 4286258 4344004 4369119 4362552 4327560 4268386 4188889
50824D188889r6059j07685j13094j12494j07399r9195q8638p6533o4243n3443
50814C270106m5627m1827m2298m6405n2999o0994o9544p8006q6108r3974j01617
50803B550707j08447j13498j16124j16207j13806j08964j01939r3406q4271p5196
50793A518849o6185n6722m6495l5967k5916j6468o995K864J2548K1226K8686L5205
50781A364630M0896M5570M9002N0766N0099M6463M0297L2873K5349J8291J1906
50770A776142O296J348l230p666j2045j6514k1279k6393l1725l7107m2328m6928
50758A538571n0288n2064n2391n1576m9765m7025m3639m0009l6178l1699k6193
50747A057744j9941j3669p780k183L126P829J1922J6037K0702K5645L0546L5958
$$ plain form
50824 4188889 4092830 3985145 3872051 3759557 3652158 3552963 3464325 3387792 3323549 3270106
50814 3270106 3224479 3182652 3140354 3093949 3040950 2979956 2910412 2832406 2746298 2652324 2550707
50803 2550707 2442260 2328762 2212638 2096431 1982625 1873661 1771722 1678316 1594045 1518849
50793 1518849 1452664 1395942 1349447 1313480 1287564 1271096 1264101 1266965 1279513 1300739 1329425 1364630
50781 1364630 1405526 1451096 1500098 1550864 1600963 1647426 1687723 1720596 1745945 1764236 1776142
50770 1776142 1782438 1783786 1780556 1772890 1760845 1744331 1723052 1696659 1664934 1627827 1585499 1538571
50758 1538571 1488283 1436219 1383828 1332252 1282487 1235462 1191823 1151814 1115636 1083937 1057744
50747 1057744 1037803 1024134 1016354 1014171 1017297 1025126 1037048 1053085 1073787 1099432 1129978 1165936
50735A165936M2673N0333N7756O4720P2389Q1664R1984J02209J11775J20368J27254
50724B089061J31730J33738J33284J29766J22680J12609J00593Q6699P0026N0101
50714C160287K7607L751k0380m3615o4449q1284r2911r8920r9909r7034r1074
50703B502069q2228p1144n9587m9398m1036l3909k7888k3724k2102k3128k6718
50692B041207l2619l9880m7151n3748n9692o4565o7158o6803o4244o0616n6157
50681A428574n0449m3500l5770k7520j8790r860j099P577J6614K6203L6253M6904
50669A375137N8518P1065Q3896R6214J07453J17123J24656J29434J30714J27536
50659B421746J19230J06348R0713P4228N7843M1903K7106J4403L930n300j4348
$$ plain form
50735 1165936 1208609 1258942 1316698 1381418 1453807 1535471 1627455 1729664 1841439 1961807 2089061
50724 2089061 2220791 2354529 2487813 2617579 2740259 2852868 2953461 3040160 3110186 3160287
50714 3160287 3187894 3191645 3171265 3127650 3063201 2981917 2889006 2790086 2690177 2593143 2502069
50703 2502069 2419841 2348697 2289110 2239712 2198676 2164767 2136879 2113155 2091053 2067925 2041207
50692 2041207 2008588 1968708 1921557 1867809 1808117 1743552 1676394 1609591 1545347 1484731 1428574
50681 1428574 1378125 1334625 1298855 1271335 1252545 1242685 1241586 1249163 1265777 1291980 1328233 1375137
50669 1375137 1433655 1504720 1588616 1684830 1792283 1909406 2034062 2163496 2294210 2421746
50659 2421746 2540976 2647324 2738037 2812265 2870108 2912011 2939117 2953520 2957450 2952150 2937802
50648B937802k3339l1853l9896m7908n5739o2310o6626o8875o9978p0140o8328
50637B332810o3531n6129m7669l9300l0933k2051j2860m245L112R064J3484J6006
50625B097758J6451J5206J2934J0180P337M738K481N03r52j205K37L248P521J3030
50611B189467J9602K6264L1732L5444L7574L8031L6088L1227K3974J5668P630
50600B492701M51o224j3359k1739l1390m1900n2888o3793p3448q0677q5290q7874
50588A934570q8629q7221q3893p9795p5768p1582o6812o1842n7273n2920m8132
50577A160703m2886l7906l3773l0373k7225k3926k0306j6447j2492q403m075J96
50565I03087L758O374Q570J1081J4235J8076K2554K7313L1805L6007M0525M5632
$$ plain form
50648 2937802 2914463 2882610 2842714 2794806 2739067 2676757 2610131 2541256 2471278 2401138 2332810
50637 2332810 2269279 2213150 2165481 2126181 2095248 2073197 2060337 2056092 2059204 2068268 2081752 2097758
50625 2097758 2114209 2129415 2142349 2152529 2159866 2164604 2167085 2167588 2166636 2165431 2165668 2168916 2176437 2189467
50611 2189467 2209069 2235333 2267065 2302509 2340083 2378114 2414202 2445429 2469403 2485071 2492701
50600 2492701 2493152 2486928 2473569 2451830 2420440 2378540 2325652 2261859 2188411 2107734 2022444 1934570
50588 1934570 1845941 1758720 1674827 1595032 1519264 1447682 1380870 1319028 1261755 1208835 1160703
50577 1160703 1117817 1079911 1046138 1015765 988540 964614 944308 927861 915369 906966 902891 903087
50565 903087 906845 913219 921789 932870 947105 965181 987735 1015048 1046853 1082860 1123385 1169017
50553A169017N0705N5233N9725O4983P0873P6573Q1685Q6305R0165R2540R2898
50542A990702R0999Q6479P9129O9609N9231M8963L9218L0492K3508J8633J5771
50531B552734J4788J5339J6305J6279J4895J3129J2030J1898J2845J5274J9304
50520B714820K4314K9633L5229M1206M7073N2028N5642N7697N7657N4915M9456
50509C219670M1801L2329K1045Q038o166k0737l4827m7777n9308o9416p7833q3739
50497B923080q6174q4686p9380p0626n9044m5642l1516j7387l728Q766J9289K7499
50485B500451L3483L7025L7375L3973K6859J6101J453j6770l6752n5987p2942
50474B504269q7410r9267j07792j12443j13596j12007j08184j02678r6435r0077
$$ plain form
50553 1169017 1219722 1274955 1334680 1399663 1470536 1547109 1628794 1715099 1805264 1897804 1990702
50542 1990702 2081701 2168180 2247309 2316918 2376149 2425112 2464330 2494822 2518330 2536963 2552734
50531 2552734 2567522 2582861 2599166 2615445 2630340 2643469 2655499 2667397 2680242 2695516 2714820
50520 2714820 2739134 2768767 2803996 2845202 2892275 2944303 2999945 3057642 3115299 3170214 3219670
50509 3219670 3261471 3293800 3314845 3322883 3316717 3295980 3261153 3213376 3154068 3084652 3006819 2923080
50497 2923080 2836906 2752220 2672840 2602214 2543170 2497528 2466012 2448625 2444897 2453663 2472952 2500451
50485 2500451 2533934 2570959 2608334 2642307 2669166 2685267 2686720 2669950 2633198 2577211 2504269
50474 2504269 2416859 2317592 2209800 2097357 1983761 1871754 1763570 1660892 1564457 1474380
50464A474380q3359p6034o8832o2689n7218n1055m3855l6895l1401k7123k3075
50453I12844j8928j5025j1542q313n222k271O03L345N642P366Q915J0750J2868
50440I01032J5037J7338J9947K2524K4339K5047K5114K5453K6775K9166L2020
50429A163792L4415L5770L6189L6148L6076L6151L6303L6235L5735L5033L4554
50418A556401L4283L3738L2649L1301L0005K8834K7982K7909K8727L0001L1389
50407A893219L2950L4499L5286L4831L3528L1892K9795K7044K4100K1372J8308
50396B216824J4087Q955L927p49n894j2191j9482k7371l5773m4648n3715o2527
50384A981443p0349p6044p8695p8469p6334p2858o7790o0925n2777m4192l5716
$$ plain form
50464 1474380 1391021 1314987 1246155 1183466 1126248 1075193 1031338 994443 963042 935919 912844
50453 912844 893916 878891 867349 859036 853814 851543 852146 855491 861133 868499 877414 888164 901032
50440 901032 916069 933407 953354 975878 1000217 1025264 1050378 1075831 1102606 1131772 1163792
50429 1163792 1198207 1233977 1270166 1306314 1342390 1378541 1414844 1451079 1486814 1521847 1556401
50418 1556401 1590684 1624422 1657071 1688372 1718377 1747211 1775193 1803102 1831829 1861830 1893219
50407 1893219 1926169 1960668 1995954 2030785 2064313 2096205 2126000 2153044 2177144 2198516 2216824
50396 2216824 2230911 2239866 2243793 2243044 2237150 2224959 2205477 2178106 2142333 2097685 2043970 1981443
50384 1981443 1911094 1835050 1756355 1677886 1601552 1528694 1460904 1399979 1347202 1303010 1267294
50373A267294k7519j9580j1773m020L510J0473J6433K0679K2278K0811J6818J1079
50361A326483L749n149j4692k3354l0330l5733l9611m1605m1857m1217m0243l8642
50349I77799l6238l3730l1880l0409k8396k5621k2874k0923j9604j8064j5747
50338F94313j2993j0655r125p863o034l496r09J029K222L104M268O088Q422J0657
50324F79028J2225J3125J3812J4696J5888J7214J8218J8471J8108J7845J8185
50313H56815J8918J9735K0806K2324K3890K5038K5947K6934K7532K6919K5090
50302A119948K2796K0459J8005J5632J3818J2474J0921Q838O469L840O39k929
50290A250910n939p770q709r414j0421j2216j5014j8223k0910k3047k5505k8615
$$ plain form
50373 1267294 1239775 1220195 1208422 1204402 1207912 1218385 1234818 1255497 1277775 1298586 1315404 1326483
50361 1326483 1330232 1325083 1310391 1287037 1256707 1220974 1181363 1139758 1097901 1056684 1016441 977799
50349 977799 941561 907831 875951 845542 817146 791525 768651 747728 728124 710060 694313
50338 694313 681320 670665 661540 653677 647643 644147 643238 644267 646489 649593 653861 659949 668371 679028
50324 679028 691253 704378 718190 732886 748774 765988 784206 802677 820785 838630 856815
50313 856815 875733 895468 916274 938598 962488 987526 1013473 1040407 1067939 1094858 1119948
50302 1119948 1142744 1163203 1181208 1196840 1210658 1223132 1234053 1242891 1249360 1253200 1253839 1250910
50290 1250910 1244971 1237201 1228492 1219078 1208657 1196441 1181427 1163204 1142294 1119247 1093742 1065127
50278A065127l1477l2997l2982l1840l0029k8102k6561k5293k3708k1762k0134
50267G60242j9092j8025j6483j4837j3426j1899r999q189o828n440l601j858r40
50254F29625n27K36J396K232K375K124J812J571J595J915J989J233n2q74p42k19
50238F45689j66q55j897k808l449m030m708n319n638n748n804n532m572l313k656
50223E89194k787k887k430j900j757j459l21J274K451L117L767M300M203L749
50209E98514L958N048N899N463M158L221L132L217K648J324l03j756k712k903
50195F28908k286j403j137j906l246m379m892m687l764k555j992k568l550l932
50181E86611l872m271n145n598n473n710o629p130o323m878l900l420k809j987
$$ plain form
50278 1065127 1033650 1000653 967671 935831 905802 877700 851139 825846 802138 780376 760242
50267 760242 741150 723125 706642 691805 678379 666480 656481 648292 641464 636024 632423 630565 629625
50254 629625 629098 629334 630730 632962 635337 637461 639273 640844 642439 644354 646343 647576 647524 646650 645908 645689
50238 645689 645523 644668 642771 639963 636514 632484 627776 622457 616819 611071 605267 599735 595163 591850 589194
50223 589194 586407 583520 581090 579190 577433 575974 575653 576927 579378 582495 586262 590562 594765 598514
50209 598514 602472 607520 613419 618882 623040 626261 629393 632610 635258 636582 636279 634523 631811 628908
50195 628908 626622 625219 624082 622176 618930 614551 609659 604972 601208 598653 596661 594093 590543 586611
50181 586611 582739 578468 573323 567725 562252 556542 549913 542783 536460 531582 527682 524262 521453 519466
50167E19466j177j05J488L015L660L520L276L015K312J092l81k166m345o317p222
50152E19131p021o341n479m355l274k767k652k209j350p77p59o05K41J333J831
50137D84947J536R14M96N39J057J864K680L296L569L439L157L273M016M815M903
50122E24501M291L772L906M447M758M512L868L243K892K671K331K138K726M027
50108E74083M864M203K522J310J338K077K700K984L136L309L573M036M771N730
50094F20636O764P632Q147Q441Q876R573J0326J1137J2285J3653J4570J4875J5541
50081G62456J7464K0105K2158K3258K4179K5564K7450K9988L3653L8474M3756
50070A068505M8828N3645N8624O4414P1767Q1021R1618J02622J13565J24198J33508
$$ plain form
50167 519466 518289 518184 519672 522687 526347 529867 533143 536158 538470 539562 539181 537015 532670 526353 519131
50152 519131 512110 505769 500290 495935 492661 489894 487242 485033 483683 482906 482147 481542 481783 483116 484947
50137 484947 486483 487397 487893 488432 489489 491353 494033 497329 500898 504337 507494 510767 514783 519598 524501
50122 524501 528792 532564 536470 540917 545675 550187 554055 557298 560190 562861 565192 567330 570056 574083
50108 574083 578947 583150 585672 586982 588320 590397 593097 596081 599217 602526 606099 610135 614906 620636
50094 620636 627400 635032 643179 651620 660496 670069 680395 691532 703817 717470 732040 746915 762456
50081 762456 779920 800025 822183 845441 869620 895184 922634 952622 986275 1024749 1068505
50070 1068505 1117333 1170978 1229602 1294016 1365783 1446804 1538422 1641044 1754609 1878807 2012315
50059B012315J39735J41471J38028J28944J14139R4967P4330N5203L9490K8231
50049B966853K1994K0380K1776K4232K6201K6010K1255R819q452l1607n7071q2768
50037B958622j06756j26683j40498j47687j49280j46463j39748j29777j18277
50028A753453j07248r7270q7508p7485o7916n9523n1974m4747l8209l2966k8744
50017A059863k4837k1274j8582j6748j5183j3550j1786r703p385n704n421n991
50005I03699o192n772n398n243m806m197m258n125n899o020n927n986n850n374
49991H27652n072n107m827l992l467l858m290l521j696k9R12J624K612L740M689
49976H05370N420O125P024Q234R553J0582J1207J1880J3144J5142J7626K0213
$$ plain form
50059 2012315 2152050 2293521 2431549 2560493 2674632 2769599 2843929 2899132 2938622 2966853
50049 2966853 2988847 3009227 3031003 3055235 3081436 3107446 3128701 3138520 3130068 3098461 3041390 2958622
50037 2958622 2851866 2725183 2584685 2436998 2287718 2141255 2001507 1871730 1753453
50028 1753453 1646205 1548935 1461427 1383942 1316026 1256503 1204529 1159782 1121573 1088607 1059863
50017 1059863 1035026 1013752 995170 978422 963239 949689 937903 928200 920815 915111 909690 903699
50005 903699 897507 891735 886337 881094 876288 872091 867833 862708 856809 850789 844862 838876 833026 827652
49991 827652 822580 817473 812646 808654 805187 801329 797039 793518 791822 791793 792705 794329 796941 800681 805370
49976 805370 810790 816915 823939 832173 841726 852308 863515 875395 888539 903681 921307 941520
49964I41520K2446K4037K5197K6519K8335L0570L3253L6672M0843M5404N0347
49953A305143N6365O4177P3873Q5217R8169J12790J29033J46728J65243J82818
49943B419556J96804K04966K06296K00485J87546J68741J47247J26912J10264
49934C968817R8002R0002Q5955Q5076Q5760Q5771Q2630P3919N7723L3174R78l6185
49922D711622p3989j08097j36176j58249j75090j86820j93347j95458j94608j91804
49912C097984j87246j80937j73128j64231j54664j44806j34805j24519j13892
49903A719756j03215r2901q3157p4154o6227n9599n4036m9104m4545m0233l6029
49892A016556l2021k8590k6017k4093k2541k1472k1158k1451k1846k1911k1472
$$ plain form
49964 941520 963966 988003 1013200 1039719 1068054 1098624 1131877 1168549 1209392 1254796 1305143
49953 1305143 1361508 1425685 1499558 1584775 1682944 1795734 1924767 2071495 2236738 2419556
49943 2419556 2616360 2821326 3027622 3228107 3415653 3584394 3731641 3858553 3968817
49934 3968817 4066819 4156821 4242776 4327852 4413612 4499383 4582013 4655932 4713655 4746829 4747807 4711622
49922 4711622 4637633 4529536 4393360 4235111 4060021 3873201 3679854 3484396 3289788 3097984
49912 3097984 2910738 2729801 2556673 2392442 2237778 2092972 1958167 1833648 1719756
49903 1719756 1616541 1523640 1440483 1366329 1300102 1240503 1186467 1137363 1092818 1052585 1016556
49892 1016556 984535 955945 929928 905835 883294 861822 840664 819213 797367 775456 753984
49881G53984k0505j9219j8063j7287j6619j5623j4290j2951j1740j0505r145p746
49869E80291o361m954l577k422j665j355j406j546j404q51j72K60M58Q12J606
49854E57714K649L486L910M194M690N254N370M934M566M876N736O712P909R746
49840F31746J2058J4112J5587J6982J8916K1550K4823K8712L3061L7711M3032
49829H98290M9841N8536O8703P9792R1685J04409J17604J30438J41620J49332
49819A890250J51621J47207J35826J18175R6174P3090N2329L5861K4288J8306
49809B743127J8657K4247L1472L6276L6183K9917J6339m995l2712o3967r5555
49798B738989j24123j46319j60142j66027j65799j60776j51602j39351j25629
$$ plain form
49881 753984 733479 714260 696197 678910 662291 646668 632378 619427 607687 597182 588037 580291
49869 580291 573930 568976 565399 562977 561312 559957 558551 557005 555601 554750 554578 554838 555296 556108 557714
49854 557714 560363 563849 567759 571953 576643 581897 587267 592201 596767 601643 607379 614091 622000 631746
49840 631746 643804 657916 673503 690485 709401 730951 755774 784486 817547 855258 898290
49829 898290 948131 1006667 1075370 1155162 1246847 1351256 1468860 1599298 1740918 1890250
49819 1890250 2041871 2189078 2324904 2443079 2539253 2612343 2664672 2700533 2724821 2743127
49809 2743127 2761784 2786031 2817503 2853779 2889962 2919879 2936218 2931223 2898511 2834544 2738989
49798 2738989 2614866 2468547 2308405 2142378 1976579 1815803 1664201 1524850 1399221
49789A399221j11612r7976q5595p5320o7018n9677n2638m6106m0435l5593l1381
49778F95870k7638k4162k0988j8582j7254j6426j5140j3213j1264r722q456p364
49766E05661o529n761m717l618l141l483m062m342m365m281l987l514l185l123
49752D47553k932k267j388r35j235j968k364j822n77M04N22K98N09R30P11r6l86
49735D34957L10J021P28j42m17J84Q85J179J401J923K471K506J903R51n1q01q42
49718D48166J30J646K505J786j44j897k348j522l20L46J72m70q45m76L79J042
$$ plain form
49789 1399221 1287609 1189633 1104038 1028718 961700 902023 849385 803279 762844 727251 695870
49778 695870 668232 644070 623082 604500 587246 570820 555680 542467 531203 521481 513025 505661
49766 505661 499132 493371 488654 485036 481895 478412 474350 470008 465643 461362 457375 453861 450676 447553
49752 447553 444621 442354 440966 440031 438796 436828 434464 432642 432065 432469 432991 433289 433798 434728 435439 435343 434957
49735 434957 435267 436288 437016 436874 436457 436641 437526 438705 440106 442029 444500 447006 448909 449860 449809 449008 448166
49718 448166 448296 449942 452447 454233 454089 452192 449844 448322 448002 448348 448520 448050 447205 446729 447108 448150
$$ [...]
##END NTUPLES=NMR SPECTRUM
##END=
