
##TITLE=AC1173_Tolima-ibage-TDOAH12007_7165805_ORvyc2jwbm
##JCAMPDX= 6.0         $$ Bruker NMR JCAMP-DX V2.0
##DATA TYPE= NMR SPECTRUM
##DATA CLASS= NTUPLES
##ORIGIN= BRUKER
##OWNER= Administrator
$$ 1.72 TOPSPIN		Version 2.1
$$ 2012-12-01 23:53:07.734 -0500  Administrator@X
$$ Compression mode = diff/dup
##.OBSERVE FREQUENCY= 400.02188249412
##.OBSERVE NUCLEUS= ^1H
##.ACQUISITION MODE= SIMULTANEOUS (DQD)
##.ACQUISITION SCHEME= undefined
##.AVERAGES= 64
##.DIGITISER RES= 22
##SPECTROMETER/DATA SYSTEM= spect
##.PULSE SEQUENCE= noesygpps1d.comp
##.SOLVENT NAME= COFFEE_meoh
##.SHIFT REFERENCE= INTERNAL, COFFEE_meoh, 1, 14.9611
##AUDIT TRAIL= $$ (NUMBER, WHEN, WHO, WHERE, PROCESS, VERSION, WHAT)
$$ ##TITLE= Audit trail, TOPSPIN		Version 2.1
$$ ##JCAMPDX= 5.01
$$ ##ORIGIN= Bruker BioSpin GmbH
$$ ##OWNER= Administrator
$$ $$ E:\/data/COFFEE/nmr/AC1173_Tolima-ibage-TDOAH12007_7165805_ORvyc2jwbm/12/pdata/1/auditp.txt
$$ ##AUDIT TRAIL=  $$ (NUMBER, WHEN, WHO, WHERE, PROCESS, VERSION, WHAT)
(   1,<2012-12-01 23:53:01.812 -0500>,<Administrator>,<X>,<go>,<TOPSPIN 2.1>,
      <created by zg
	started at 2012-12-01 23:41:31.718 -0500,
	POWCHK enabled, PULCHK disabled,
       configuration hash MD5:
       86 BA 57 50 F2 9D 5C 9B 26 00 A9 28 5F 66 2E 89
       data hash MD5: 64K
       7B 63 5A A0 EC E1 E9 EC 67 51 31 C4 0B C9 A0 B2>)
(   2,<2012-12-01 23:53:04.906 -0500>,<Administrator>,<X>,<proc1d>,<TOPSPIN 2.1>,
      <Start of raw data processing
       efp LB = 0.3 FT_mod = 6 PKNL = 1 PHC0 = 0 PHC1 = 0 SI = 128K 
       data hash MD5: 128K
       6B 64 A0 6E CB 4C 66 7F 26 52 9E FA C6 CE 1B 65>)
(   3,<2012-12-01 23:53:05.984 -0500>,<Administrator>,<X>,<proc1d>,<TOPSPIN 2.1>,
      <pk PHC0 = -79.74426 PHC1 = 0 
       data hash MD5: 128K
       B5 8B ED 71 74 F8 CC F0 6B 74 78 17 A5 95 65 3C>)
(   4,<2012-12-01 23:53:06.687 -0500>,<Administrator>,<X>,<proc1d>,<TOPSPIN 2.1>,
      <abs ABSG = 1 
       data hash MD5: 128K
       EC A9 1E 26 49 8A 99 15 CC 59 50 06 FC 7C 95 73>)
(   5,<2012-12-01 23:53:06.890 -0500>,<Administrator>,<X>,<proc1d>,<TOPSPIN 2.1>,
      <abs ABSG = 2 
       data hash MD5: 128K
       A4 9C 00 BB 3D 77 FD 52 34 89 9B E5 24 D4 BD CF>)
(   6,<2012-12-01 23:53:07.046 -0500>,<Administrator>,<X>,<proc1d>,<TOPSPIN 2.1>,
      <abs ABSG = 3 
       data hash MD5: 128K
       08 9D 80 40 5E 05 B6 35 B5 4E C5 7E 93 3A E5 64>)
(   7,<2012-12-01 23:53:07.218 -0500>,<Administrator>,<X>,<proc1d>,<TOPSPIN 2.1>,
      <abs ABSG = 4 
       data hash MD5: 128K
       36 FB 1C 16 22 A7 17 6C 0D 83 29 6E A0 97 82 8E>)
(   8,<2012-12-01 23:53:07.406 -0500>,<Administrator>,<X>,<proc1d>,<TOPSPIN 2.1>,
      <abs ABSG = 5 
       data hash MD5: 128K
       13 FC 71 25 75 DA 39 6F F2 89 84 42 D1 E7 91 B3>)
$$ ##END=
$$ 
$$ $$ hash MD5
$$ $$ 24 28 3E CE AB 06 C4 24 4E BF 45 A7 48 EB A3 EB
##$RELAX= 
##$RELAX= 
##$RELAX= 
##$RELAX= 
##$RELAX= 
##$RELAX= 
##$RELAX= 
##$RELAX= 
$$ Bruker specific parameters
$$ --------------------------
##$DU= <E:\>
$$ [...]
150 150 150 150 150 150 150 150
##$TP07= 0
##$TPNAME0= <>
##$TPNAME1= <>
##$TPNAME2= <>
##$TPNAME3= <>
##$TPNAME4= <>
##$TPNAME5= <>
##$TPNAME6= <>
##$TPNAME7= <>
##$TPOAL= (0..7)
0.5 0.5 0.5 0.5 0.5 0.5 0.5 0.5
##$TPOFFS= (0..7)
0 0 0 0 0 0 0 0
##$TUNHIN= 0
##$TUNHOUT= 0
##$TUNXOUT= 0
##$USERA1= <user>
##$USERA2= <user>
##$USERA3= <user>
##$USERA4= <user>
##$USERA5= <user>
##$V9= 5
##$VALIST= <valist>
##$VCLIST= <CCCCCCCCCCCCCCC>
##$VD= 0
##$VDLIST= <DDDDDDDDDDDDDDD>
##$VPLIST= <PPPPPPPPPPPPPPP>
##$VTLIST= <TTTTTTTTTTTTTTT>
##$WBST= 1024
##$WBSW= 4
##$XGAIN= (0..3)
0 0 0 0
##$XL= 0
##$YL= 0
##$YMAX_a= 6034702
##$YMIN_a= -12859070
##$ZGOPTNS= <>
##$ZL1= 120
##$ZL2= 120
##$ZL3= 120
##$ZL4= 120
##$ABSF1= 14.9611
##$ABSF2= -5.597082
##$ABSG= 5
##$ABSL= 3
##$ALPHA= 0
##$AQORDER= 0
##$ASSFAC= 0
##$ASSFACI= 0
##$ASSFACX= 0
##$ASSWID= 0
##$AUNMP= <proc_prof1d_extract.lims>
##$AXLEFT= 0
##$AXNAME= <>
##$AXNUC= <1H>
##$AXRIGHT= 0
##$AXTYPE= 0
##$AXUNIT= <>
##$AZFE= 0.1
##$AZFW= 0.1
##$BCFW= 0
##$BC_mod= 0
##$BYTORDP= 0
##$COROFFS= 0
##$CY= 15
##$DATMOD= 1
##$DC= 0
##$DFILT= <>
##$DTYPP= 0
##$F1P= 0
##$F2P= 0
##$FCOR= 0.5
##$FTSIZE= 131072
##$FT_mod= 6
##$GAMMA= 0
##$GB= 0
##$INTBC= 1
##$INTSCL= 1
##$ISEN= 128
##$LB= 0.3
##$LEV0= 0
##$LPBIN= 0
##$MAXI= 10000
##$MC2= 0
##$MEAN= 0
##$ME_mod= 0
##$MI= 0
##$NCOEF= 0
##$NC_proc= -2
##$NLEV= 6
##$NOISF1= 0
##$NOISF2= 0
##$NSP= 0
##$NTH_PI= 0
##$NZP= 0
##$OFFSET= 14.9611
##$PC= 1
##$PHC0= -79.74426
##$PHC1= 0
##$PH_mod= 1
##$PKNL= yes
##$PPARMOD= 0
##$PPDIAG= 0
##$PPIPTYP= 0
##$PPMPNUM= 2147483647
##$PPRESOL= 1
##$PSCAL= 4
##$PSIGN= 0
##$PYNMP= <proc.py>
##$REVERSE= no
##$SF= 400.02000959507
##$SI= 131072
##$SIGF1= 0
##$SIGF2= 0
##$SINO= 400
##$SIOLD= 131072
##$SPECTYP= <>
##$SREGLST= <1H.CDCl3>
##$SSB= 0
##$STSI= 131072
##$STSR= 0
##$SW_p= 8223.68421052631
##$SYMM= 0
##$S_DEV= 0
##$TDeff= 65536
##$TDoff= 0
##$TI= <>
##$TILT= no
##$TM1= 0
##$TM2= 0
##$TOPLEV= 0
##$USERP1= <user>
##$USERP2= <user>
##$USERP3= <user>
##$USERP4= <user>
##$USERP5= <user>
##$WDW= 1
##$XDIM= 131072
##$YMAX_p= 404778087
##$YMIN_p= -11079
##$CURPLOT= <Network HP LaserJet P1505>
##$CURPRIN= <$Network HP LaserJet P1505>
##$DFORMAT= <normdp>
##$LAYOUT= <+/1D_H.xwp>
##$LFORMAT= <normlp>
##$PFORMAT= <normpl>
##$SURQMSG= 1
$$ End of Bruker specific parameters
$$ ---------------------------------
##NTUPLES= NMR SPECTRUM
##VAR_NAME=  FREQUENCY,     SPECTRUM/REAL,   SPECTRUM/IMAG
##SYMBOL=    X,             R,               I
##VAR_TYPE=  INDEPENDENT,   DEPENDENT,       DEPENDENT
##VAR_FORM=  AFFN,          ASDF,            ASDF
##VAR_DIM=   131072,        131072,          131072
##UNITS=     HZ,            ARBITRARY UNITS, ARBITRARY UNITS
##FACTOR=    0.0627417313425164, 1,          1
##FIRST=     8223.62146879497, 2957,         -62911
##LAST=      0,             5360,            -62829
##MIN=       0,             -11079,          0
##MAX=       8223.62146879497, 404778087,    0
$$ Real data points
##PAGE= N=1
##DATA TABLE= (X++(R..R)), XYDATA
$$ [...]
61732D07829N87L94K56L92L35J35N58J711K598K491J885J593J645J682J694J846
$$ 407829 408416 408810 409066 409458 409793 409928 410486 412197 414795 417286 419171 420764 422409 424091 425785 427631
61716D27631K062K275K560K754K499J975J834K079J813N58r20j726k007k353k706
$$ 427631 429693 431968 434528 437282 439781 441756 443590 445669 447482 448040 447120 445394 443387 441034 438328
61701D38328k713k697l342m592n590n720n178m552m209m051l695k975k302k263
$$ 438328 435615 432918 429576 424984 419394 413674 408496 403944 399735 395684 391989 389014 386712 384449
61687C84449k809l335l490l436l234k787k466k880l670l520k001m75l84j404k114
$$ 384449 381640 378305 374815 371379 368145 365358 362892 360012 356342 352822 350821 350346 349962 348558 346444
61672C46444j925j369r57p61q37j176j350r20j36L74M36K97R4o5J51Q07J249R12
$$ 346444 344519 343150 342193 341432 340595 339419 338069 337149 337013 337387 337823 338120 338214 338149 338300 339107 340356 341268
61654C41268K62J73O12Q28O99Q95J643K308K401K219K148K066J788J549J667K067
$$ 341268 341530 341703 342315 343143 343842 344737 346380 348688 351089 353308 355456 357522 359310 360859 362526 364593
61638C64593K543L025L373L214K332J046j39j057j900k786l578m037m083l808
$$ 364593 367136 370161 373534 376748 379080 380126 379987 378930 377030 374244 370666 366629 362546 358738
61624C58738l383k982k756k745k702k147r20L89R43O62K98L88O07L97k03q07j355
$$ 358738 355355 352373 349617 346872 344170 342023 341103 341492 342435 343097 343395 343783 344390 344787 344584 343777 342422
61607C42422k083l003l830m368m618m654m561m390m022l387k826k868l355l383
$$ 342422 340339 337336 333506 329138 324520 319866 315305 310915 306893 303506 300680 297812 294457 291074
61593B91074k451j168m24l28m86p82j192j276p12r0l20j322k077j980j410r15
$$ 291074 288623 287455 287031 286703 286217 285435 284243 282967 282255 282165 281845 280523 278446 276466 275056 274141
61577B74141n59l07m06r63j598j807j484r52o27p04r42q82l96P5J14n8N8M65P77
$$ 274141 273582 273275 272869 271906 270308 268501 267017 266065 265438 264734 263792 262910 262514 262589 262703 262645 262703 263168 263945
61558B63945Q93J071J293J184O30M9r2K77R50J593J816J463R22P63J044J294J235
$$ 263945 264838 265909 267202 268386 269016 269065 268973 269250 270200 271793 273609 275072 275994 276757 277801 279095 280330
61541B80330J081J013Q14K98k07r0Q12J882K179J348J55j73P52J990K296J377
$$ 280330 281411 282424 283238 283536 283329 283239 284051 285933 288112 289460 289615 289442 290194 292184 294480 295857
61525B95857j19j431k078j832r07o8M4l87p57r46j206j415j143n15j88l95o78
$$ 295857 295738 294307 292229 290397 289490 289422 289466 289079 288322 287376 286170 284755 283612 283097 282909 282514 281836
61508B81836p20p32p89n72p4J00l60q55p67l83m12r15j399j645j709j335j16J631
$$ 281836 281116 280384 279595 279023 278949 279049 278689 277834 277067 276684 276272 275357 273958 272313 270604 269269 269153 270784
61490B70784K817K706J688O80J36q5j48NL88P48Q20O23M51N55R00J214J268J142
$$ 270784 273601 276307 277995 278675 278811 278726 278578 278583 278971 279719 280539 281162 281613 282168 283068 284282 285550 286692
61472B86692J130J308J327Q08o2n86l50L44R12J132J043O17o1n23l64J10K60P7
$$ 286692 287822 289130 290457 291265 291203 290617 290267 290611 291523 292655 293698 294315 294254 293731 293367 293477 293737 293814
61454B93814J44N85P69K95l50n00j39L57P52R03O42J68K2K92M07J78M27J798L487
$$ 293814 293958 294543 295312 295607 295257 294757 294618 294975 295727 296630 297272 297440 297462 297754 298161 298339 298766 300564 304051
61435C04051M055L243K157J731J883K167K427K551K244J419M65p9L7O69J377J722
$$ 304051 308106 311349 313506 315237 317120 319287 321714 324265 326509 327928 328393 328314 328351 329020 330397 332119
61419C32119J657J523J440J042J66n80m10O20J678K075J690P69k37r05j289j845
$$ 332119 333776 335299 336739 337781 337947 337367 336957 337577 339255 341330 343020 343789 343552 342647 341358 339513
61403C39513k531k541j630r09j392k280k023p11P7k48n58r9K97j42o75l02N09
$$ 339513 336982 334441 332811 331902 330510 328230 326207 325496 325573 325325 324767 324668 324965 324823 324148 323846 324355
61386C24355N93k0k20M08J045Q82J34m68n22r6N95J318J787J790J415J105J351
$$ 324355 324948 324928 324708 325116 326161 327043 327177 326709 326187 326091 326686 328004 329791 331581 332996 334101 335452
61369C35452K175L063L523L538L318K853K105J417J225J459J719J931K349K932
$$ 335452 337627 340690 344213 347751 351069 353922 356027 357444 358669 360128 361847 363778 366127 369059
61355C69059L322L454L622L962M409N063N983O604O239N201M577M739M879M380
$$ 369059 372381 375835 379457 383419 387828 392891 398874 405478 411717 416918 421495 426234 431113 435493
61341D35493L668L305L087K642K213K152K201J998J701J484R03m48k030k908k986
$$ 435493 439161 442466 445553 448195 450408 452560 454761 456759 458460 459944 460847 460399 458369 455461 452475
61326D52475k890k871k561j843j211j149j575k095k344k051j164l7P66J063J276
$$ 452475 449585 446714 444153 442310 441099 439950 438375 436280 433936 431885 430721 430684 431450 432513 433789
61311D33789K031L549N427O925P600P725Q041R018J0484J1873J2629J2290J0652
$$ 433789 435820 439369 444796 451721 459321 467046 475087 484105 494589 506462 519091 531381 542033
61298E42033Q067N350L229J885J102N47n2p45j297j580j984l036m558n681n888
$$ 542033 550100 555450 558679 560564 561666 562213 562161 561416 560119 558539 556555 553519 548961 543280 537392
61283E37392n582n520o045o973p804p845o702m857l289k347j503l88O01J049J231
$$ 537392 531810 526290 520245 513272 505468 497623 490921 486064 482775 480428 478925 478537 479138 480187 481418
61268D81418J558J878J899J856K204K929L725M523N362O007O217O145O067N933
$$ 481418 482976 484854 486753 488609 490813 493742 497467 501990 507352 513359 519576 525721 531788 537721
61254E37721N549M937M182L231K254J773J958K182J739P53j98r65j779k610l161
$$ 537721 543270 548207 552389 555620 557874 559647 561605 563787 565526 566279 566081 565116 563337 560727 557566
61239E57566l439l666l855l857l776l782l756l585l615m170m775m441k803n08
$$ 557566 554127 550461 546606 542749 538973 535191 531435 527850 524235 520065 515290 510849 508046 507538
61225E07538J542K909L626L965M236M522M654M631M842N500O152O220N861N756
$$ 507538 509080 511989 515615 519580 523816 528338 532992 537623 542465 547965 554117 560337 566198 571954
61211E71954O188O790P163P181O757N804M544L484K987L077L584M240M818N448
$$ 571954 578142 584932 592095 599276 606033 611837 616381 619865 622852 625929 629513 633753 638571 644019
61197F44019O587Q367J0241J1639J2641J3428J3565J2480J0547Q849P895P225
$$ 644019 650606 658973 669214 680853 693494 706922 720487 732967 743514 752363 760258 767483
61185G67483O286N094L908K884K108J491N79j007k931m483n538o522p520q158
$$ 767483 773769 778863 782771 785655 787763 789254 789833 788826 785895 781412 775874 769352 761832 753674
61171G53674q469r019r842j0114r427q708r144j0583j1772j1962j1586j1294j1009
$$ 753674 745205 736186 726344 716230 706803 698095 688951 678368 666596 654634 643048 631754 620745
61158F20745j0287r240q585q686q906q230o530m755l756l245k338q59L45L71q56
$$ 620745 610458 601218 592633 583947 575041 566811 560281 555526 551770 548525 546187 545328 545673 546044 545188
61143E45188k677m377n659o635p408p639o831n168l654k965k528j305P32K607
$$ 545188 542511 538134 532475 525840 518432 510793 503962 498794 495140 492175 489647 488342 489074 491681
61129D91681L626L984M120M247M658N726P373R070J0603J2230J3885J4956J5317
$$ 491681 495307 499291 503411 507658 512316 518042 525415 534485 545088 557318 571203 586159 601476
61116F01476J5876J7458J9550K0893K1153K1272K2062K3078K3220K2135K0636
$$ 601476 617352 634810 654360 675253 696406 717678 739740 762818 786038 808173 828809
61105H28809J9625J8987J7781J5462J2465R514O752L987J308j057l302n805q371
$$ 828809 848434 867421 885202 900664 913129 922643 929395 933382 934690 933633 930331 924526 916155
61092I16155j0384j1728j2952j4433j5939j7184j8122j8539j8033j6774j5630
$$ 916155 905771 894043 881091 866658 850719 833535 815413 796874 778841 762067 746437
61081G46437j5074j4475j3021j0918r060p843o879n766m565l528k704j894p53
$$ 746437 731363 716888 703867 692949 683889 676046 669167 663401 658836 655308 652604 650710 649957
61068F49957R53K996M739N771O308O807P398Q012Q783R849J0933J1592J1878J2408
$$ 649957 650910 653906 658645 664416 670724 677531 684929 692941 701724 711573 722506 734098 745976 758384
61054G58384J3633J5346J7060J8588K0130K1882K3756K5542K7225K8982L0829
$$ 758384 772017 787363 804423 823011 843141 865023 888779 914321 941546 970528 1001357
61043A001357L2406L3392L4000L4777L5967L7349L8712M0095M1494M2762M3949
$$ 1001357 1033763 1067155 1101155 1135932 1171899 1209248 1247960 1288055 1329549 1372311 1416260
61032A416260M5351M7005M8458M9311M9616M9515M8877M7726M6686M6627M8071
$$ 1416260 1461611 1508616 1557074 1606385 1656001 1705516 1754393 1802119 1848805 1895432 1943503
61021A943503N1198N6089O2487O9705P7334Q5825R6021J08570J24451J45539J73596
$$ 1943503 1994701 2050790 2113277 2182982 2260316 2346141 2442162 2550732 2675183 2820722 2994318
61010B994318K08971K51450L02345L64598M40899N33297O44485P77070R30596
$$ 2994318 3203289 3454739 3757084 4121682 4562581 5095878 5740363 6517433 7448029
61001G448029J101421J285008J470224J623148J681218J581990J313936R39739
$$ 7448029 8549450 9834458 11304682 12927830 14609048 16191038 17504974 18444713
60993A8444713N61389K58838O2287k7906j9422N8594J33122J07665p5716l93475
$$ 18444713 19006102 19264940 19327227 19299321 19279899 19338493 19471615 19579280 19503564 19110089
60983A9110089p61806j096345j350639j511078j576495j552318j455899j314600
$$ 19110089 18348283 17251938 15901299 14390221 12813726 11261408 9805509 8490909
60975H490909j154434r92365q38276o99323n80045m80749l98736l31246k76518
$$ 8490909 7336475 6344110 5505834 4806511 4226466 3745717 3346981 3015735 2739217
60966B739217k32893j98325j70946j49270j31822j17158j04354r3068q3019p3845
$$ 2739217 2506324 2307999 2137053 1987783 1855961 1738803 1634449 1541381 1458362 1384517
60956A384517o5455n8098n1824m6300m1364l7385l4720l3019l1514k9833k8138
$$ 1384517 1319062 1260964 1209140 1162840 1121476 1084091 1049371 1016352 984838 955005 926867
60945I26867k6543k4889k3182k1748k0745j9811j8560j7128j5927j5059j4298
$$ 926867 900324 875435 852253 830505 809760 789949 771389 754261 738334 723275 708977
60934G08977j3671j3580j4238j5193j5631j5084j3746j2200j0889r868q885p728
$$ 708977 695306 681726 667488 652295 636664 621580 607834 595634 584745 574877 565992 558264
60922E58264o499n567n204n261n279m916m218l485k895k397j898j444j148r95
$$ 558264 551765 546198 540994 535733 530454 525538 521320 517835 514940 512543 510645 509201 508053 507058
60908E07058q46o20m28m31n72m59K86J509K448K383J356J06o61p97n06k8L47J64
$$ 507058 506212 505592 505164 504733 504161 503702 503988 505497 507945 510328 511684 511790 511129 510332 509826 509798 510145 510309
60890E10309r55k938n152o702o937n991m830m514n220o243p003p588q121q162
$$ 510309 509354 506416 501264 494562 487625 481634 476804 472290 467070 460827 453824 446236 438115 429953
60876D29953p299n990n102m796m455l731k986k602k452k306k216k159j709n51
$$ 429953 422654 416664 411562 406766 402311 398580 395594 392992 390540 388234 386018 383859 382150 381599
60862C81599J000K294K999L173K936K445K037J996K210K327K288K388K807L310
$$ 381599 382599 384893 387892 391065 394001 396446 398483 400479 402689 405016 407304 409692 412499 415809
60848D15809L494L163K413J545R79J056J662K183J984J030j24r84j598k252k906
$$ 415809 419303 422466 424879 426424 427403 428459 430121 432304 434288 435318 435194 434210 432612 430360 427454
60833D27454l236l193l173l473l869l941l607l105k605k184k053k407k994l191
$$ 427454 424218 421025 417852 414379 410510 406569 402962 399857 397252 395068 393015 390608 387614 384423
60819C84423k698j943j631j962k468k638k533k637l145l596l449k916k780l334
$$ 384423 381725 379782 378151 376189 373721 371083 368550 365913 362768 359172 355723 352807 350027 346693
60805C46693l917l801l172k788k941l231l281l091k727k130j418r53q29o76j61
$$ 346693 342776 338975 335803 333015 330074 326843 323562 320471 317744 315614 314196 313243 312414 311738 311577
60790C11577M99Q25P34O73J039J677J994J570O35j05j39M89J388K177K531K257
$$ 311577 312076 312901 313635 314308 315347 317024 319018 320588 321223 321118 320979 321468 322856 325033 327564 329821
60774C29821J628J389J981K862L078K485K008K524L796M688M313K856J333N38
$$ 329821 331449 332838 334819 337681 340759 343244 345252 347776 351572 356260 360573 363429 364762 365300
60760C65300K80j89j051j676j675j568j971k605k800k575k403k170j418n03m11
$$ 365300 365580 365391 364340 362664 360989 359421 357450 354845 352045 349470 347067 344897 343479 342976 342565
60745C42565j144j427m90P61J006J98p79j499k170k839l334l781m371m690m061
$$ 342565 341421 339994 339504 340265 341271 341469 340690 339191 337021 334182 330848 327067 322696 318006 313945
60730C13945k684j662j732k467k997k979k576j951j254p94p56q10m79J08L20m8
$$ 313945 311261 309599 307867 305400 302403 299424 296848 294897 293643 292849 292093 291283 290804 290912 291232 291184
60714B91184l35J04J023J690J874J895J812J419J039J455K608L202K344R39N88
$$ 291184 290849 290953 291976 293666 295540 297435 299247 300666 301705 303160 305768 308970 311314 312253 312841
60699C12841J531K602K918K614K006J188N42O45J303J557R81K42J8J37J72J13
$$ 312841 314372 316974 319892 322506 324512 325700 326242 326887 328190 329747 330728 330970 330988 331125 331297 331410
60683C31410K6k73o33m00O44J721K051J788J428R21J64k72K00J093J333O43l58
$$ 331410 331436 331163 330530 330130 330774 332495 334546 336334 337762 338683 338847 338575 338775 339868 341201 341844 341486
60666C41486j257k241l314l965l827l179k580k281k104j695r00l5L85L52M23Q99
$$ 341486 340229 337988 334674 330709 326882 323703 321123 318842 316738 315043 314143 314108 314493 314845 315268 316167
60650C16167J344J338J216J500K031K267K147J960J671J055L38k7j38n16j286
$$ 316167 317511 318849 320065 321565 323596 325863 328010 329970 331641 332696 333034 333007 332869 332353 331067
60635C31067k121k831l294l071j935o71l64q72j031m93j92o03p76J49J433J745
$$ 331067 328946 326115 322821 319750 317815 317144 316780 315908 314877 314384 314192 313589 312813 312962 314395 316140
60619C16140J028L42K65M54N53N62L02m84j348j252O5J486J778J027K76Q2J2l79
$$ 316140 317168 317510 317775 318229 318782 319344 319646 319162 317814 316562 316627 318113 319891 320918 321194 321276 321288 320909
60601C20909p52m67M46J244J350R41O50Q75J460J858J583O89p0J53J326K440K632
$$ 320909 320157 319690 320136 321380 322730 323671 324321 325196 326656 328514 330097 330786 330716 330869 332195 334635 337267
60584C37267K116J691J528J091J91m99k84O30J403J547J328J353K012L265M759
$$ 337267 339383 341074 342602 343693 343884 343385 343101 343731 345134 346681 348009 349362 351374 354639 359398
60569C59398O154P456Q880J0327J1249J1233J0588J0049R889R635Q673O831M373
$$ 359398 365552 373008 381888 392215 403464 414697 425285 435334 445223 454858 463531 470362 474735
60556D74735J671q95k938m237m873m987m564l645k623j944j472n84J003K793M198
$$ 474735 476406 475511 472573 468336 463463 458476 453912 450267 447644 445700 444228 443644 444647 447440 451638
60541D51638N316O713Q623J0759J2793J4549J5825J6481J6812J7307J7783J7137
$$ 451638 456954 463667 472290 483049 495842 510391 526216 542697 559509 576816 594599 611736
60529F11736J4317R537M266J6k796m894p107r346j0643j0305q812p317o402n707
$$ 611736 626053 635590 639856 639872 637076 632182 625075 615729 605086 594781 585969 578652 572250 566543
60515E66543m744l556k421j351k26Q25J505J748J922K619M288O863R736J2275
$$ 566543 561799 558243 555822 554471 554245 555070 556575 558323 560245 562864 567152 574015 583751 596026
60501E96026J4505J7053K0451K4691K9379L4056L8322M1986M5147M7763M9145
$$ 596026 610531 627584 648035 672726 702105 736161 774483 816469 861616 909379 958524
60490I58524M8309M4991L9930L3949K7067J8713Q609k719j4065k4184l2585l9645
$$ 958524 1006833 1051824 1091754 1125703 1152770 1171483 1180092 1177373 1163308 1139124 1106539 1066894
60478A066894m5688n0145n2170n1959n0603m8652m5707m1622l7185l3118k9238
$$ 1066894 1021206 971061 918891 866932 816329 767677 721970 680348 643163 610045 580807
60467E80807k5238k1583j8946j7262j5982j4791j3494j1746r636q028p510p388
$$ 580807 555569 533986 515040 497778 481796 467005 453511 441765 432129 424101 416591 409203
60455D09203o532m873l314k384j877j678k034k869l580l692l296k713k172j810
$$ 409203 402671 397798 394484 392100 390223 388545 386511 383642 380062 376370 373074 370361 368189 366379
60441C66379j649j581j544j583j491q84N4L82m67j775k466k514k607k786k385
$$ 366379 364730 363149 361605 360022 358531 357647 357701 358083 357616 355841 353375 350861 348254 345468 343083
60426C43083j282k03L03M50N94P38Q61J093J388J485J369J275J214R74O58O81
$$ 343083 341801 341598 341901 342351 342945 343683 344544 345637 347025 348510 349879 351154 352368 353342 354000 354681
60410C54681J109J469J411J082P50M28O1k16j45L94J181J650J420R20J057J949
$$ 354681 355790 357259 358670 359752 360502 360930 360991 360775 360630 361024 362205 363855 365275 366195 367252 369201
60394C69201K565K124J211Q26R26Q73Q10J408K496L110K953K681K692K672K487
$$ 369201 371766 373890 375101 375927 376853 377726 378536 379944 382440 385550 388503 391184 393876 396548 399035
60379C99035K494K649K339J421O10M72Q48J501K459L357L411K495J514J184J207
$$ 399035 401529 404178 406517 407938 408548 409020 409868 411369 413828 417185 420596 423091 424605 425789 426996
60364D26996J115J126J514J878J808J720K228L076L467L301L363M278N738O901
$$ 426996 428111 429237 430751 432629 434437 436157 438385 441461 444928 448229 451592 455870 461608 468509
60350D68509P291P163O993O740N881M292K670J601O56r59l113m952o131o955p327
$$ 468509 475800 482963 489956 496696 502577 506869 509539 511140 511796 510837 507724 502772 496641 489686 482359
60335D82359o722n326m173l744l417k644j815j495j615j920k443k993l047k554
$$ 482359 475637 470311 466138 462394 458977 456333 454518 453023 451408 449488 447045 444052 441005 438451
60321D38451k135j974j387o8J099J257Q86J130K368M210O252Q109R190R330R297
$$ 438451 436316 434342 432955 432887 433986 435243 436129 437259 439627 443837 450089 458198 467388 476718 486015
60306D86015R990J1436J3096J4655J5845J6063J4914J2896J0838Q914O700L753
$$ 486015 496005 507441 520537 535192 551037 567100 582014 594910 605748 614662 621362 625115
60294F25115l33n808j1943j6869j9121j9073j8118j6938j5290j3134j0943r093
$$ 625115 624782 618974 607031 590162 571041 551968 533850 516912 501622 488488 477545 468452
60282D68452p646o622n831m770l372k447k623l247l215k530k080k198k522l016
$$ 468452 460806 454184 448353 443583 440211 437764 435141 431894 428679 426149 424069 421871 419349 416333
60268D16333l907m644m192k556r69k72j30r8l61r51j185o29J26L37J21jk1j62
$$ 416333 412426 407782 403590 401034 400065 399793 399663 399565 399204 398253 397068 396439 396565 396902 397023 397022 397001 396839
60250C96839j23N50J500J790J180N59Q12J664K001J252M3n62k33M16P25O38M71
$$ 396839 396716 397266 398766 400556 401736 402295 403107 404771 406772 408024 408067 407505 407272 407688 408413 409051 409522
60233D09522M07M99Q83J562K175K362K226K109K056J885J637J503J362R12L26
$$ 409522 409929 410428 411311 412873 415048 417410 419636 421745 423801 425686 427323 428826 430188 431100 431426
60218D31426K60J019K094K743K761K475K271K382K932L871M839N357N277M961
$$ 431426 431686 432705 434799 437542 440303 442778 445049 447431 450363 454234 459073 464430 469707 474668
60204D74668M923N248N510N329M843M439M167L704K945K211J838J830K006K183
$$ 474668 479591 484839 490349 495678 500521 504960 509127 512831 515776 517987 519825 521655 523661 525844
60190E25844K081J432M19l80o60p32j029j600k292l040l709l963l628k927k157
$$ 525844 527925 529357 529776 529396 528736 528004 526975 525375 523083 520043 516334 512371 508743 505816 503659
60175E03659j467j103j391k172k629k175j178n03n23r44j245j072n56l69j033
$$ 503659 502192 501089 499698 497526 494897 492722 491544 491041 490518 489574 488329 487257 486701 486332 485299
60160D85299j927j753l01J006R56J47r3L27M58P3k6N91J325J488J085N41L14P95
$$ 485299 483372 481619 481318 482324 483280 483427 483334 483661 484119 484192 484166 484757 486082 487570 488655 489196 489510 490305
60142D90305J923K854K741J967J918L330N465P107P771P738P488P412P628P804
$$ 490305 492228 495082 497823 499790 501708 505038 510503 517610 525381 533119 540607 548019 555647 563451
60128E63451P411O338M974L650K379J151J17o49j236j663j880j998k209k455k490
$$ 563451 570862 577200 582174 585824 588203 589354 589471 588822 587586 585923 584043 582045 579836 577381 574891
60113E74891k291k110k144k325k466k324j750j116j229k376l662l958l381l057
$$ 574891 572600 570490 568346 566021 563555 561231 559481 558365 557136 554760 551098 547140 543759 540702
60099E40702l474l831l311k243j520j308r32Q2J313J875J416N58K82R22K005K976
$$ 540702 537228 533397 530086 527843 526323 525015 524083 524165 525478 527353 528769 529327 529609 530531 532536 535512
60083E35512L731M256M284L731L048K657K334J658P49l3p97j883l124m059m726
$$ 535512 539243 543499 547783 551514 554562 557219 559553 561211 561960 561927 561130 559247 556123 552064 547338
60068E47338n512o338o747o785p049p725q273q247p766p124o471n983n731n288
$$ 547338 541826 535488 528741 521956 514907 507182 498909 490662 482896 475772 469301 463318 457587 452299
60054D52299m115k508j518j689k405k768k537j924j007J97J474K517L184L433
$$ 452299 448184 445676 444158 442469 440064 437296 434759 432835 431828 432025 433499 436016 439200 442633
60040D42633L266K876K552K417K453K744L324L775L513K501J327M74o5n05j002
$$ 442633 445899 448775 451327 453744 456197 458941 462265 466040 469553 472054 473381 473855 473790 473285 472283
60025D72283j772k912m060m644m637m666n209o062o638o574n943n189m838n018
$$ 472283 470511 467599 463539 458895 454258 449592 444383 438321 431683 425109 419166 413977 409139 404121
60011D04121n309n279m944m357l206j435R1L70m15j127j172j016j120j269j077
$$ 404121 398812 393533 388589 384232 381026 379591 379682 380052 379637 378510 377338 376322 375202 373933 372856
59996C72856n03L55J328J938J745J079P76J133J709K200K734L234L329L054K835
$$ 372856 372353 372708 374036 375974 377719 378798 379574 380707 382416 384616 387350 390584 393913 396967 399802
59981C99802K583J720L29o51p56o22q17j000p76m85n01m87q0L66M95P84J780L004
$$ 399802 402385 404105 404434 403783 403027 402405 401588 400588 399812 399327 398826 398339 398259 398625 399120 399904 401684 404688
59963D04688L556L482L687M607N737O417O467N931M829L330J873R06N20L55j69
$$ 404688 408244 411726 415413 420020 425757 432174 438641 444572 449401 452731 454604 455510 456030 456385 456216
59948D56216j280k556l363l669l995m531m776m270l337k757k910l433l618l177
$$ 456216 454936 452380 449017 445348 441353 436822 432046 427776 424439 421682 418772 415339 411721 408544
59934D08544k631k743l366l316j899RJ175J794K890M282M694L960L517M192M960
$$ 408544 405913 403170 399804 396488 394589 394598 395773 397567 400457 404739 409433 413393 416910 421102 426062
59919D26062M705L866L361K989K125J152R14J332J675J834K290L064L709M127
$$ 426062 430767 434633 437994 440983 443108 444260 445174 446506 448181 450015 452305 455369 459078 463205
59905D63205M622N228N684N852N594M615L002J528P61L23l09r07j081j181j599
$$ 463205 467827 473055 478739 484591 490185 494800 497802 499330 500091 500414 500105 499198 498117 496936 495337
59890D95337j692o50R41J680J374J245J980K859L099L002L217L767M355N074O167
$$ 495337 493645 492995 493936 495616 496990 498235 500215 503074 506173 509175 512392 516159 520514 525588 531755
59875E31755P434Q304Q304P290N537L702K370J528Q37L49M98J219J731J407M92
$$ 531755 539189 547493 555797 563087 568624 572326 574696 576224 577061 577410 577908 579127 580858 582265 582757
59860E82757l71r50j339j400p65M76J492J384K42p41l89J225K863L373K554Q63
$$ 582757 582386 581436 580097 578697 577932 578408 579900 581284 581526 580785 580396 581621 584484 587857 590411 591274
59844E91274j213l173m437m748m469m069l498k516j483j337k592m605o058o118
$$ 591274 590061 586888 582451 577703 573234 569165 565667 563151 561668 560331 557739 553134 547076 540958
59830E40958n170m270l851l284k002o78n19j484k213j948j517j806k213j648m84
$$ 540958 535788 531518 527667 524383 522381 521703 521184 519700 517487 515539 514022 512216 510003 508355 507871
59815E07871k73j653l518m411m027l159k697k990l739m294m223l692l162k850
$$ 507871 507598 505945 502427 498016 493989 490830 488133 485143 481404 477110 472887 469195 466033 463183
59801D63183k640k423k232k167k321k653k882k738k379k211k198j835j040m39
$$ 463183 460543 458120 455888 453721 451400 448747 445865 443127 440748 438537 436339 434504 433464 433025
59787D33025m70p31o83m62m35m59k03J81L29L42N78R95J299J503J825K184K345
$$ 433025 432555 431824 431141 430679 430244 429785 429582 429763 430092 430434 431012 432007 433306 434809 436634 438818 441163
59770D41163K383K533K841L295M044N018N688N706N398N200N025M744M714N107
$$ 441163 443546 446079 448920 452215 456259 461277 466965 472671 478069 483269 488294 493038 497752 502859
59756E02859N249M486L406L257M341N861P147Q097Q573Q321P629P229P420P918
$$ 502859 508108 512594 516000 519257 523598 529459 536606 544703 553276 561597 569226 576455 583875 591793
59742E91793Q499R074R230Q512P233O138N282M043K391J166P99N72l47j781k893
$$ 591793 600292 609366 618596 627108 634341 640479 645761 649804 652195 653361 654160 654732 654385 652604 649711
59727F49711l212k932k468k099j877j683j519j606k041k526k764k918l248l568
$$ 649711 646499 643567 641099 639000 637123 635440 633921 632315 630274 627748 624984 622066 618818 615250
59713F15250l576l496l771m290m522m317l938l457k813k259k083j965j384n91
$$ 615250 611674 608178 604407 600117 595595 591278 587340 583883 581070 578811 576728 574763 573379 572788
59699E72788k78m61n91o90j300k186k257j179k1J67m38j104j647k184k515k371
$$ 572788 572510 572049 571458 570768 569468 567282 565025 563846 563825 563992 563554 562450 560803 558619 556104 553733
59683E53733j933j559j386j536k192l139l690l580l417l889m828n511n497m834
$$ 553733 551800 550241 548855 547319 545127 541988 538298 534718 531301 527412 522584 517073 511576 506742
59669E06742l781k737k172k269k779l411m006m280l882k940k151j987k163k039
$$ 506742 502961 500224 498052 495783 493004 489593 485587 481307 477425 474485 472334 470347 468184 466145
59655D66145j233K58K004L143L027K194J966K740L330K514O43r86j828k358k948
$$ 466145 464912 465170 467174 470317 473344 475538 477504 480244 483574 486088 486731 485745 483917 481559 478611
59640D78611l297l031k222j253n96o76j500k360k413j628q64q11j251j523j424
$$ 478611 475314 472283 470061 468808 468212 467536 466036 463676 461263 459635 458771 457960 456709 455186 453762
59625D53762j261j230j149q94p26r43j368j589j592j796k361k902l049k880k588
$$ 453762 452501 451271 450122 449228 448502 447559 446191 444602 443010 441214 438853 435951 432902 430022 427434
59610D27434k114j423q17o05o77p45o58k08Q64K198K739J996R46Q67J620K051
$$ 427434 425320 423897 423080 422475 421798 421053 420395 420187 421051 423249 425988 427984 428930 429797 431417 433468
59594D33468J812J640J884J965J631J583K289L020K804J732O28q7o27j159j497
$$ 433468 435280 436920 438804 440769 442400 443983 446272 449292 452096 453828 454456 454369 453742 452583 451086
59579D51086j470j187r35r66j287j680k019k457l020l213k517j219k22j7l25p29
$$ 451086 449616 448429 447494 446528 445241 443561 441542 439085 436065 432852 430335 429116 428894 428877 428552 427823
59563D27823j080j238j034o66n59p10p25o06q45j469j725j066N1Q17J025J084
$$ 427823 426743 425505 424471 423805 423246 422536 421811 421205 420360 418891 417166 416100 416151 416968 417993 419077
59547D19077J386K058K952L684M020M436N762Q001J0045J1103J1937J3962J7191
$$ 419077 420463 422521 425473 429157 433177 437613 443375 451376 461421 472524 484461 498423 515614
59534E15614J9610J8861J4363P767J460l197o246q139q908q402o809m582k224
$$ 515614 535224 554085 568448 576215 577675 574478 568232 560093 551185 542783 535974 531392 529168
59521E29168m33J39k24l01M98J110L03j408k523k818l371m478n144n013n123o142
$$ 529168 528735 528874 528650 528349 528847 529957 530260 528852 526329 523511 520140 515662 510518 505505 500382 494240
59505D94240p159p182o641o440o398n794m761m070l870l626l132k694k429k057
$$ 494240 487081 479899 473258 466818 460420 454626 449865 445795 441925 438299 435167 432473 430044 427987
59491D27987j374m45N69J393J595J017K05M5R42K430L510L449K520J908K520L909
$$ 427987 426613 426168 426737 428130 429725 430742 430947 430992 431934 434364 437874 441323 443843 445751 448271 452180
59475D52180M861M878M439L966L368K744K569K802K714J981J221R95J035R00O92
$$ 452180 457041 461919 466358 470324 473692 476436 479005 481807 484521 486502 487723 488718 489753 490653 491345
59460D91345O21N84P31J593L146M345M381L779L614M164N026N947O756O983O307
$$ 491345 491966 492550 493281 494874 498020 502365 506746 510525 514139 518303 523329 529276 536032 543015 549322
59445E49322N159M145L191J841J50j378k507l418m284n135n874o204n821m933
$$ 549322 554481 558626 561817 563658 563808 562430 559923 556505 552221 547086 541212 535008 529187 524254
59431E24254m163l675k984j953j188r63m70J176L717O221Q218R722J0658J1175
$$ 524254 520091 516416 513432 511479 510291 509328 508858 510034 513751 519972 528190 537912 548570 559745
59417E59745J2064J4022J6649J8906K0443K1945K4082K6467K7505K5276J9096
$$ 559745 571809 585831 602480 621386 641829 663774 687856 714323 741828 767104 786200
59406G86200J0489K099m503r380j2613j3365j1076o484p35N330J0111J0910O346
$$ 786200 796689 798788 794285 784905 772292 758927 747851 741367 740632 745962 756073 766983 773329
59393G73329j501q873j3940j7338j9776k0861k0307j8653j6416j3690j0875q698
$$ 773329 771828 762955 749015 731677 711901 691040 670733 652080 635664 621974 611099 602401
59381F02401p229n844m397l464l177k813j990j348j510k086k312k093j797j473
$$ 602401 595172 589328 584931 581467 578290 575477 573487 572139 570629 568543 566231 564138 562341 560868
59367E60868q48N6Q13J143J294J726K494L072K990K599K830M040N537O492O921
$$ 560868 560020 560076 560889 562032 563326 565052 567546 570618 573608 576207 579037 583077 588614 595106 602027
59352F02027P369Q097R114J0600J2566J4347J5124J4918J4497J4285J3950J3078
$$ 602027 609396 617493 626607 637207 649773 664120 679244 694162 708659 722944 736894 749972
59340G49972J1737J0330R205Q403P545O031L603N73k616n780q680j0799j1826
$$ 749972 761709 772039 781244 789647 797192 803223 806826 807399 804783 799003 790323 779524 767698
59327G67698j2148j2423j2938j3592j4131j4103j3146j1630j0543j0214r853q811
$$ 767698 755550 743127 730189 716597 702466 688363 675217 663587 653044 642830 632977 624166
59315F24166p651p199p182o711n599m271k773q90J001K241K992M126O005Q127
$$ 624166 616515 609316 602134 595423 589824 585553 582780 581890 582891 585132 588124 592250 598255 606382
59301F06382R897J0908J0465P825L161k269p146j0865j3323j4482j4394j3382
$$ 606382 616279 627187 637652 645477 648638 646369 639223 628358 615035 600553 586159 572777
59289E72777j2053j1065j0632j0121q666o340m147k592j055R23K659L415L668
$$ 572777 560724 549659 539027 528906 520240 513900 509753 507161 506106 507029 509688 513103 516771
59276E16771M291N151N620N954O961Q598J0078J1073J1878J2501J2637J2348J1849
$$ 516771 521062 526213 531833 537787 544748 553346 563424 574497 586375 598876 611513 623861 635710
59263F35710J0866R151P280N867M404K073n74k199k745l440m629n183m443l331
$$ 635710 646576 655727 663007 668874 673278 675351 674777 672578 669833 666393 661764 656581 652138 648807
59249F48807k924l081l078k688j995r89J11Q08J089J534K315K809K609K299K645
$$ 648807 645883 642802 639724 637036 635041 634052 634163 634971 636060 637594 639909 642718 645327 647626 650271
59234F50271L505M051L717K620J255k5j305k916m789o333p233p938q803r325r026
$$ 650271 653776 657827 661544 664164 665419 665394 664089 661173 656384 650051 642818 634880 626077 616752 607726
59219F07726q567q880r540r222p716o230n565n227m665m217m312m609m535m029
$$ 607726 599159 590279 580739 571517 563801 557571 552006 546779 542114 537897 533585 528976 524441 520412
59205E20412l377k814k526k521k400j752q20j48K72Q06J292J267J034J413K349
$$ 520412 517035 514221 511695 509174 506774 505022 504202 504054 504326 505132 506424 507691 508725 510138 512487
59190E12487K821K374J791J852K376K857L268L756M168M332M332M260M125M084
$$ 512487 515308 517682 519473 521325 523701 526558 529826 533582 537750 542082 546414 550674 554799 558883
59176E58883M274M495M521M588M941N127M548L437K489J764R47L77O01J140R35
$$ 558883 563157 567652 572173 576761 581702 586829 591377 594814 597303 599067 600014 600391 600992 602132 603067
59161F03067L5n39o18j169k569l998m862n496o084o224o000o222p036p547p281
$$ 603067 603102 602563 601945 600776 598207 594209 589347 583851 577767 571543 565543 559321 552285 544738 537457
59146E37457o857o686o207n120m148l879l886l672l467l484l334k876k605k629
$$ 537457 530600 523914 517707 512587 508439 504560 500674 497002 493535 490051 486717 483841 481236 478607
59132D78607k217j047J15N94O99Q51R32J055J863L294M198L992L606L961M711
$$ 478607 476390 475343 475458 476052 476751 477602 478534 479589 481452 484746 488944 492936 496542 500503 505214
59117E05214N341O260P643Q384P644O493O529P551Q023P415O621O298O164N867
$$ 505214 510555 516815 524458 532842 540486 546979 553508 561059 569082 576497 583118 589416 595580 601447
59103F01447N536N281M944M401L656K773K030J733J576Q14n43j486j532j614k614
$$ 601447 606983 612264 617208 621609 625265 628038 630068 631801 633377 634191 633648 632162 630630 629016 626402
59088F26402l844m021l124k167j628j236r61j155j756k274k550k896l506m328
$$ 626402 622558 618537 615413 613246 611618 610382 609421 608266 606510 604236 601686 598790 595284 590956
59074E90956n296o197o542o125n438m991m615l972l367l342l800m208m461m804
$$ 590956 585660 579463 572921 566796 561358 556367 551752 547780 544413 541071 537271 533063 528602 523798
59060E23798n072m728l694k623k161k238k219j645q79q23j789k866k922k032j229
$$ 523798 518726 513998 510304 507681 505520 503282 501063 499418 498539 497716 495927 493061 490139 488107 486878
59045D86878r70p56k76Q5J33K71O28P09L73K79Q63J697K247K524K639K581K795
$$ 486878 485908 485152 484876 484961 485094 485365 485993 486702 487075 487354 488217 489914 492161 494685 497324 499905 502700
59028E02700L958N747O912P087P454Q971J1102J2984J4662J6238J6982J6413J5325
$$ 502700 506658 512405 519317 526404 533858 542829 553931 566915 581577 597815 614797 631210 646535
59015F46535J4636J3920J2130R111N464J631j960m594o112p340q775r618r016
$$ 646535 661171 675091 687221 696332 701796 703427 701467 696873 690761 683421 674646 665028 656012
59002F56012p475n967m451k480n12O00R90J351J648J399Q77P91J029Q12k7r08
$$ 656012 648537 642570 638119 635639 635127 635727 636717 638068 639716 641115 641992 642783 643812 644624 644597 643689
58986F43689j537k213l109l949m321l944k849j593p78k14Q24K266L203L468M074
$$ 643689 642152 639939 636830 632881 628560 624616 621767 620174 619396 619182 620006 622272 625475 628943 633017
58971F33017N490O865P646Q573R981J0704R973R081R435J0191R645Q047P100P187
$$ 633017 638507 645372 653018 661591 671572 682276 692249 701330 710765 720956 730601 738648 745748 752935
58957G52935P104O163M732K874J61l000n392o560p241q181r542j1259j2989j3855
$$ 752935 760039 766202 770934 773808 773969 770969 765577 759017 751776 743595 734053 722794 709805 695950
58943F95950j3287j1903j0700r746q572p311o365n493m412l631l526l233j903
$$ 695950 682663 670760 660060 650314 641742 634431 628066 622573 618161 614530 611004 607771 605868
58930F05868l91j06o48l33J191K515K604J742M51j047k146k112j286q37j201j793
$$ 605868 605477 605371 604723 604390 605581 608096 610700 612442 612893 611846 609700 607588 606302 605465 604264 602471
58914F02471k226k641k853k399j499r35q97q38l57O11K196M205N794O539P307
$$ 602471 600245 597604 594751 592352 590853 589918 589021 588183 587826 588437 590633 594838 600632 607171 614478
58899F14478Q948J0750J1483J1394J1551J1790J1054R522Q654R148J0364J1698
$$ 614478 623426 634176 645659 657053 668604 680394 691448 700970 709624 718772 729136 740834
58887G40834J2986J3738J3568J3263J3839J4641J4071J2028R889Q106N766K623
$$ 740834 753820 767558 781126 794389 808228 822869 836940 848968 858857 866963 872729 875352
58875H75352l53k783n332p982r653j0038j0187j0625j0606r781r029q832q366
$$ 875352 874999 872216 866884 858902 849249 839211 829024 818399 807793 798012 788983 780151 771785
58862G71785o994n365m296l734l517l972n084o103o578o797o848o345n496n189
$$ 771785 764791 759426 755130 751396 747879 743907 738823 732720 726142 719345 712497 706152 700656 695467
58848F95467n538n500m503l318k777k742k850l261m105n137o393q222j0260j1425
$$ 695467 689929 684429 679926 676608 673831 671089 668239 664978 660873 655736 649343 641121 630861 619436
58834F19436j1315j0636r897q777p198n905n388n160m648l900l101k155j197n70
$$ 619436 608121 597485 587588 578811 571613 565708 560320 555160 550512 546612 543511 541356 540159 539589
58820E39589j12P11J783K415K566K944L721M231M159L947L809L416K789K393K173
$$ 539589 539477 540188 541971 544386 546952 549896 553617 557848 562007 565954 569763 573179 575968 578361 580534
58805E80534J535M91k86o90j330k344l162l606m048m427m240l693l594m072m528
$$ 580534 582069 582560 582274 581584 580254 577910 574748 571142 567094 562667 558427 554734 551140 547068 542540
58790E42540m828n242n381m673l719l543l617k474k86J144J200J155J708J943
$$ 542540 537712 532470 527089 522416 518697 515154 511537 509063 508777 509921 511121 512276 513984 515927
58776E15927J424J249K114L094L257K803J886O2k239l427l015k542l232m343m810
$$ 515927 517351 518600 520714 523808 527065 529868 531754 531816 529577 526150 523135 520593 517361 513018 508208
58761E08208m877m943m379k761r88N6Q09J900K933L411L677L900L412K100J256
$$ 508208 503331 498388 494009 491248 490260 490316 491125 493025 495958 499369 503046 506946 510358 512458 513714
58746E13714J768K633K402J213K41PK79Q48J483J829K008K602L533L945L598L268
$$ 513714 515482 518115 520517 521730 521971 521978 522257 523105 524588 526417 528425 531027 534560 538505 542103 545371
58730E45371L382L513L617M344N535N971N287M535M278L758K760K489L518M547
$$ 545371 548753 552266 555883 560227 565762 571733 577020 581555 585833 589591 592351 594840 598358 602905
58716F02905M441L946M230N121N974O863P675P431N724L684K327J149o05k639
$$ 602905 607346 611292 615522 620643 626617 633480 641155 648586 654310 657994 660321 661470 660865 658226
58702F58226m536o602q779j0185j0728j1641j3359j4592j4576j4491j5225j5571
$$ 658226 653690 647088 638309 628124 617396 605755 592396 577804 563228 548737 533512 517941
58690E17941j4261j2067j0217q389o074m303m039m269l633k728k806l389l159
$$ 517941 503680 491613 481396 473007 466933 462630 458591 454322 450689 447961 445155 441766 438607
58677D38607k205j502j082n60m54j077j148N02K777L819L817M304N465O294O840
$$ 438607 436402 434900 433818 433258 432804 431727 430579 431081 433858 437677 441494 445798 451263 457557 464397
58662D64397Q130J0074J1286J0946R334O874L988J539jj323l042m424m648m457
$$ 464397 472527 482601 493887 504833 514167 521041 525029 526568 526567 525244 522202 517778 513130 508673
58648E08673m977n705n359m146l423l544l703l535l335l018k248j353q41m02M97
$$ 508673 503696 497991 492632 488486 485063 481519 477816 474281 470946 467928 465680 464327 463486 463084 463581
58633D63581J545K156K468K693K262Q00q11j558j662j698j361l54N28N95M89Q77
$$ 463581 465126 467282 469750 472443 474705 475505 474694 473136 471474 469776 468415 468061 468589 469184 469673 470550
58617D70550J065M87K86J675L786M979N335N878O296N522L921K790K235J401L76
$$ 470550 471615 472102 472388 474063 477849 482828 488163 494041 500337 505859 509780 512570 514805 516206 516582
58602E16582kJ63O8k70l00l10q88j533j385p68n54n30O2R83J517J849K470K978
$$ 516582 516580 516743 516811 516541 516241 515931 515043 513510 512125 511357 510803 510273 510335 511318 512835 514684 517154 520132
58584E20132K976L286M624O042O362O165O550O957O240N014M766N381N649N604
$$ 520132 523108 526394 531018 537060 543422 549587 556137 563094 569334 574348 579114 584495 590144 595748
58570E95748O196P270P985Q682J0238J2103J3089J3618J5136J7588J9564K0541
$$ 595748 601944 609214 617199 625881 636119 648222 661311 674929 690065 707653 727217 747758
58558G47758K1021K0878J9611J7853J6603J5284J2520Q508M780J938n25k655m089
$$ 747758 768779 789657 809268 827121 843724 859008 871528 880036 884816 886754 886229 883574 879485
58545H79485n254o626p470p105o726p925j0145j1626j2254j3241j4626j5354j5360
$$ 879485 874231 867605 860135 853030 846304 838379 828234 816608 804354 791113 776487 761133 745773
58532G45773j5393j5223j4171j2876j2378j1989j0264p600n604m514l449k556
$$ 745773 730380 715157 700986 688110 675732 663743 653479 645879 640275 635761 632312 629756
58520F29756k522k655j814o90p03j296r44j37o20k148k869k555k631l231l086
$$ 629756 627234 624579 622765 622075 621372 620076 619132 618995 618375 616227 613358 610803 608172 604941 601855
58505F01855k174j741j779j154j31j40j084j506j255j436j880j387l26k39r98
$$ 601855 599681 597940 596161 595007 594876 594736 593652 592146 590891 589455 587575 586188 585862 585623 584625
58490E84625r88O4J019J819L252M596M429L523L944N510O306O391P685J0151J1568
$$ 584625 583637 583701 584720 586539 589791 594387 598816 602339 606283 611793 618099 624490 632175 642326 653894
58475F53894J1373J1333J2012J1804J0101Q244O635L929j43l818n858o663o648
$$ 653894 665267 676600 688612 700416 710517 718761 725396 729325 729182 725364 719506 712843 706195
58462G06195n886n292n598n381k946L08J584J300K367N223P381P957Q591R543
$$ 706195 700309 695017 689419 684038 681092 681400 682984 684284 686651 691874 699255 707212 715803 725346
58448G25346Q937O516M357L043R09k258m418m962n531o402n889m050l127l444
$$ 725346 734283 740799 745156 748199 749108 746850 742432 737470 731939 725537 719648 715598 712471 709027
58434G09027k727m85R40P33R20K205K568J492J462L612N655O001O159P266P791
$$ 709027 706300 705815 706755 707488 708408 710613 713181 714673 716135 719747 725402 731403 737562 744828 752619
58419G52619O575M869L659K168M20r9L65n58l218n088n221n697p212p381n214
$$ 752619 759194 764063 767722 769890 770310 770211 770576 770018 766800 761712 756491 750794 743582 736201 730987
58404G30987l208l100l325k627k231k591j894K16J332P13R84L352N287N144M872
$$ 730987 727779 724679 721354 718727 716496 713905 712011 712227 713559 714272 715256 718608 723895 729039 733911
58389G33911N802N951M206K960L754M309K911J756K871M419M268L698M360M959
$$ 733911 739713 745664 749870 752830 756584 760893 763804 765560 768431 772850 777118 780816 785176 790135
58375G90135M106L245L757M244L554L292M646N899N748N722O845P360O417O232
$$ 790135 794241 797486 801243 805487 809041 812333 816979 822878 828626 834348 841193 848553 854970 861202
58361H61202P968R254Q586Q200R617J0397Q625O665O969P906P222O034N916N612
$$ 861202 869170 878424 887010 895210 904827 915224 923849 930514 937483 945389 952611 958645 964561 970173
58347I70173M052L168M332N533N218N248O913Q001P148O930R118J1140J0992J1274
$$ 970173 974225 977393 981725 987258 992476 997724 1004637 1012638 1019786 1026716 1035834 1046974 1057966 1069240
58333A069240J4257J7172J6805J4802J4091J3829J2228J0685J0710J0372P968
$$ 1069240 1083497 1100669 1117474 1132276 1146367 1160196 1172424 1183109 1193819 1204191 1212159
58322A212159N653N487N639M431L981N845P316O348N633P469R220Q494Q054J0547
$$ 1212159 1217812 1223299 1228938 1233369 1237350 1243195 1250511 1256859 1262492 1269961 1279181 1287675 1295729 1306276
58308A306276J3134J2645J1461J2791J4693J4392J3950J5885J7651J6459J5139
$$ 1306276 1319410 1332055 1343516 1356307 1371000 1385392 1399342 1415227 1432878 1449337 1464476
58297A464476J7077J9691J9147J7338J7811J9008J8028J6938J8723K1019K0498
$$ 1464476 1481553 1501244 1520391 1537729 1555540 1574548 1592576 1609514 1628237 1649256 1669754
58286A669754J9449K1435K4383K4681K4088K5857K8152K8026K7746L0304L3026
$$ 1669754 1689203 1710638 1735021 1759702 1783790 1809647 1837799 1865825 1893571 1923875 1956901
58275A956901L2550L1649L4010L6967L6744L6051L8829M2349M2501M1923M4784
$$ 1956901 1989451 2021100 2055110 2092077 2128821 2164872 2203701 2246050 2288551 2330474 2375258
58264B375258M8586M9482N0433N5348O0528O1085O0422O3845O8250O8139O6461
$$ 2375258 2423844 2473326 2523759 2579107 2639635 2700720 2761142 2824987 2893237 2961376 3027837
58253C027837O8966P3103P3352P2420P6017Q1527Q3236Q3873Q9358R7008J00833
$$ 3027837 3096803 3169906 3243258 3315678 3391695 3473222 3556458 3640331 3729689 3826697 3927530
58242C927530J03575J11335J21298J27138J31499J40490J51170J57598J63560
$$ 3927530 4031105 4142440 4263738 4390876 4522375 4662865 4814035 4971633 5135193
58233E135193J75716J89983J99003K06947K22043K40756K55056K68852K90686
$$ 5135193 5310909 5500892 5699895 5906842 6128885 6369641 6624697 6893549 7184235
58224G184235L16792L38682L60735L92071M28066M59236M91236N35675N88579
$$ 7184235 7501027 7839709 8200444 8592515 9020581 9479817 9971053 10506728 11095307
58215A1095307O39550O94645P67231Q53991R44458J046162J174288J324961J486861
$$ 11095307 11734857 12429502 13196733 14050724 14995182 16041344 17215632 18540593 20027454
58206B0027454J670646J897176K166572K471890K833393L283855L831502M476700
$$ 20027454 21698100 23595276 25761848 28233738 31067131 34350986 38182488 42659188
58198D2659188N251704O198740P324480Q631910J0185738J2085507J4383535J7090401
$$ 42659188 47910892 54109632 61434112 70066022 80251760 92337267 106720802 123811203
58190A23811203K0233428K3810591K7682242L1569771L5058543L7363587L7108184
$$ 123811203 144044631 167855222 195537464 227107235 262165778 299529365 336637549
58183C36637549L2774415K3838540J1527583j737437j3722301k3236447k9939660
$$ 336637549 369411964 393250504 404778087 403040650 389318349 366081902 336142242
58176C36142242l3814437l5034888l4085677l1669774k8436216k4858207k1292918
$$ 336142242 302327805 267292917 233207240 201537466 173101250 148243043 126950125
58169A26950125j8005101j5119258j2641566j0551799q833434p436697o284899
$$ 126950125 108945024 93825766 81184200 70632401 61798967 54362270 48077371
58162D8077371n327687m546212l910208l374262k915580k535887k225480j959260
$$ 48077371 42749684 38203472 34293264 30919002 28003422 25467535 23242055 21282795
58154B1282795j726884j534344j375893j233488j103162r94636r05617q21879
$$ 21282795 19555911 18021567 16645674 15412186 14309024 13314388 12408771 11586892
58146A1586892p41569o74898o20731n67004n13533m71725m41778m11666l78883
$$ 11586892 10845323 10170425 9549694 8982690 8469157 7997432 7555654 7143988 6765105
58137F765105l52567l33548l12059k86359k65080k49735k32331k11678j95555
$$ 6765105 6412538 6078990 5766931 5480572 5215492 4965757 4733426 4521748 4326193
58128D326193j85225j73468j59221j49183j43716j35692j24437j16860j13703
$$ 4326193 4140968 3967500 3808279 3659096 3515380 3379688 3255251 3138391 3024688
58119C024688j08256r9733r4519r3090q8753q0681p5456p4271p0995o4458o0512
$$ 3024688 2916432 2816699 2722180 2629090 2540337 2459656 2384200 2309929 2238934 2174476 2113964
58108B113964o0208n7719n1972m8898m9985m9550m5666m3310m4305m4189m1391
$$ 2113964 2053756 1996037 1944065 1895167 1845182 1795632 1749966 1706656 1662351 1618162 1576771
58097A576771l9920m0651l9273l5108l2983l4133l3902l0545k7859k7110k4743
$$ 1576771 1536851 1496200 1456927 1421819 1388836 1354703 1320801 1290256 1262397 1235287 1210544
58086A210544k0150j7569j8236j8358j6718j6605j8544j8814j6915j6888j9461
$$ 1210544 1190394 1172825 1154589 1136231 1119513 1102908 1084364 1065550 1048635 1031747 1012286
58075A012286k0479j8833j8399k0271k0646j8346j7120j8257j8149j5465j3730
$$ 1012286 991807 972974 954575 934304 913658 895312 878192 859935 841786 826321 812591
58064H12591j4400j4134j1391r254r267q760o681n953p708q985q303p901q567
$$ 812591 798191 784057 772666 763412 754145 745385 738704 732751 725043 716058 707755 699854 691287
58051F91287p982o056n970q079q589o275m675n621o479n823o012p960r011q321
$$ 691287 683305 677249 671279 663200 654611 648336 643661 638040 631561 625738 619726 611766 602755 594434
58037E94434q667j0732j1167q735o790p228p447n877n053o435p458o570o171p679
$$ 594434 585767 575035 563868 555133 548343 541115 533668 527791 522738 516303 508845 502275 496104 488425
58023D88425q623p478o671p785q458o921n203m951m438k606j680k811l350j437
$$ 488425 479802 472324 465653 457868 449410 442489 437286 432335 427897 425291 423611 420800 417450 416013
58009D16013O30O34N0N90R33j48j024m77j88j209j460M79K479K479J738J828J729
$$ 416013 416643 417277 417327 417917 418850 418702 417678 417201 417013 415804 414344 414823 417302 419781 421519 423347 425076
57992D25076N05k88L74P15o55k275k852l568n137n842m944m683o375p797p088
$$ 425076 425581 425293 425667 426382 425727 423452 420600 417032 411895 406053 401109 396426 390051 382254 375166
57977C75166n912o085o260m930l576l846m436l761k948l333l558k165n74n78j145
$$ 375166 369254 363169 356909 351979 348403 344557 340121 336360 333412 330079 326521 324356 323782 323204 322059
57962C22059n42N68Q30Q35J513J945J302P96J355J506Lj686j909j693k558l588
$$ 322059 321517 322085 322915 323750 325263 327208 328510 329306 330661 332167 332170 330484 328575 326882 324324 320736
57946C20736l274k300k010j862q27M18R56J494K724L630L472L559N017O667P160
$$ 320736 317462 315162 313152 311290 310463 310881 311837 313331 316055 319685 323157 326716 331733 338400 345560
57931C45560P244P888Q129O842M743K720K43k708m386m126m092o001q268q823
$$ 345560 352804 360692 368821 375663 380406 383126 383369 380661 376275 372149 368057 362056 353788 344965
57917C44965q441q742r070q117o791o579o727n681l947k902k183p29Q44J344J234
$$ 344965 336524 327782 318712 310595 303804 297225 290498 284817 280870 277968 275785 275056 275900 277244 278478
57902B78478J575J975J679J314J617J723Q12m0L74J235J296J080J534K063J890
$$ 278478 280053 282028 283707 285021 286638 288361 289173 289133 289507 290742 292038 293118 294652 296715 298605
57887B98605J773K371K610J752J219K194L203K514J170J090J765J487L89l78j124
$$ 298605 300378 302749 305359 307111 308330 310524 313727 316241 317411 318501 320266 321753 322142 321764 320640
57872C20640k653m054m073l537l876m455l888k856k920l575l181k017j623j820
$$ 320640 317987 313933 309860 306323 302447 297992 294104 291248 288328 284753 281572 279555 277932 276112
57858B76112j005R69K629L290L506L501L119K858L234L605L232K705K783K861
$$ 276112 275107 276076 278705 281995 285501 289002 292121 294979 298213 301818 305050 307755 310538 313399
57844C13399K213J575J734J813Q17l86o04m75j033j587j192p64j369j884r69K00
$$ 313399 315612 317187 318921 320734 321551 321165 320561 320086 319053 317466 316274 315510 314141 312257 311288 311488
57828C11488j29r60l12R78N87j005j082P68K066J458K10n73j321k218k638k878
$$ 311488 311359 310399 310087 311065 311652 310647 309565 310333 312399 313857 314067 313494 312173 309955 307317 304439
57812C04439m082n994p052o993p248q294q826q069o949o315n728m698l651l110
$$ 304439 300357 294363 287311 280318 273070 264776 255950 247881 240932 234617 228889 224191 220540 217430
57798B17430k955k833k416j312L03J294Q30l63j033j068j034q63l04K01L71R31
$$ 217430 214475 211642 209226 207914 208217 209511 210341 209978 208945 207877 206843 205980 205676 205877 206248 207179
57782B07179K158K799K079J473K534M184M442L691L757M689N029M629M464M195
$$ 207179 209337 212136 214215 215688 218222 222406 226848 230539 234296 238985 244014 248643 253107 257302
57768B57302K628L60p33n05n39j254j584j481k101l253l228j631n3N03O97R99
$$ 257302 259930 260290 259557 259052 258513 257259 255675 254194 252093 248840 245612 243981 243928 244431 245128 246127
57752B46127Q70L19K72R31J496J771K300K733K003L35p56p47n65p11p14n68q04
$$ 246127 246997 247316 247588 248519 250015 251786 254086 256819 258822 259157 258401 257654 257089 256378 255664 255096 254292
57735B54292j060m90L84K67n34m54N64R45L50K18J004J287L85l96LQ59J245J334
$$ 254292 253232 252742 253126 253393 252859 252405 252969 253914 254264 254482 255486 256773 257158 256762 256765 257624 258869 260203
57717B60203J380J070O24Q90J764K053J418Q00N41p8j024j171l93o2p60j401j330
$$ 260203 261583 262653 263277 264167 265931 267984 269402 270202 270743 270665 269641 268470 268077 268015 267255 265854 264524
57700B64524j390k057k357j686r80j041j295j147j101j551j933k004k565l980
$$ 264524 263134 261077 258720 257034 256054 255013 253718 252571 251470 249919 247986 245982 243417 239437
57686B39437n284n611n242m572l402j948j067o66N15K767M610N164N758Q002J1564
$$ 239437 234153 228542 223300 218728 215326 213378 212311 211645 212160 214927 219537 224701 230459 238461 250025
57671B50025J5115J8390K2024K6291L1077L6365M1623M5229M5195M0168K9725
$$ 250025 265140 283530 305554 331845 362922 399287 440910 486139 531334 571502 601227
57660F01227J4765k004j7196k8925l7155m2007m3208m1420l8273l4444k9221k2787
$$ 601227 615992 613988 596792 567867 530712 488705 445497 404077 365804 331360 302139 279352
57648B79352j7182j3968j2300j0515q385o682n566m604l605k447q58R04J883J625
$$ 279352 262170 248202 235902 225387 217002 210320 204754 200150 196545 194098 193240 194144 196027 197652
57634A97652P95R3m56p53l08P06J283J027O68N52n4j369k198j616n16l24j136
$$ 197652 198447 198540 198084 197331 197023 197729 199012 200039 200707 201259 201205 199836 197638 196022 195506 195182 194046
57617A94046j990k293k066j518j048j059j329j294j175j757k838l194k493j834
$$ 194046 192056 189763 187697 186179 185131 184072 182743 181449 180274 178517 175679 172485 169992 168158
57603A68158j823j701j039p23j214j435n80L08l3j091j566j354j212j355j588
$$ 168158 166335 164634 163595 162872 161658 160223 159643 159951 159918 158827 157261 155907 154695 153340 151752
57588A51752k116k992l498l142k609k677k935k634k048j846j809j313n72k88n18
$$ 151752 149636 146644 143146 140004 137395 134718 131783 129149 127101 125255 123446 122133 121561 121273 120755
57573A20755q32j165j579j651j036k48l4l81q26j298j855k105j630p01J21P12
$$ 120755 119923 118758 117179 115528 114492 114244 114210 113829 113003 111705 109850 107745 106115 105414 105535 106247
57557A06247J187J389J175Q03N97N69O43Q06Q61O25N01J029J823J866J115O34
$$ 106247 107434 108823 109998 110801 111398 111967 112610 113416 114277 114902 115403 116432 118255 120121 121236 121870
57541A21870R39J333J332J383J721J764J394J451K143K309J222p4k89L20P38Q13
$$ 121870 122809 124142 125474 126857 128578 130342 131736 133187 135330 137639 138861 138787 138498 138818 139556 140369
57525A40369R37R96P36M87N36M20k15p70n85J1L05K23K1k51l58J90J180J564R70
$$ 140369 141306 142302 143038 143525 144061 144481 144266 143496 142911 142922 143227 143450 143471 143220 142862 143052 144232 145796 146766
57506A46766L32L12K72l72r47p48l71p61j785k775l503l787l130j795j084j557
$$ 146766 147098 147410 147682 147310 146363 145615 145244 144483 142698 139923 136420 132633 129503 127708 126624 125067
57490A25067k061j600r33j047j410j179r74j726k709k551j435o04k54L82J294
$$ 125067 123006 121406 120473 119426 118016 116837 115863 114137 111428 108877 107442 106838 106584 106966 108260
57475A08260J670J363R49O03J67k5L66Q00O43L48O24R72M66n53j000q50r46j287
$$ 108260 109930 111293 112242 112845 113012 112987 113353 114153 114796 115144 115768 116740 117206 116653 115653 114803 113857 112570
57457A12570j068k75J86qk59k16j82k78k63j76k84m59m15l54n79p58m26R7J94
$$ 112570 111502 111227 111413 111405 111146 110930 110748 110470 110207 110031 109747 109288 108873 108519 107940 107182 106756 106853 107047
57438A07047j2M0L10K63k32q89j443j604j060j65J81m8K97J612K474J661Q4o18
$$ 107047 107035 107075 107385 107648 107416 106527 105084 103480 102420 102255 102436 102388 102685 104297 106771 108432 108516 107898
57420A07898m14k74k32K10N24q5r18o44M40Q03J37l10J16O75O40J40n37j245j555
$$ 107898 107484 107210 106978 107188 107712 107627 106709 106065 106505 107308 107445 107135 107251 107926 108566 108706 108169 106924 105369
57401A05369j152n42m17o17o83q04j066n41J299L007K756J077Q7M22Q71Q77J190
$$ 105369 104217 103675 103258 102641 101958 101154 100088 99547 100846 103853 106609 107686 107773 108195 109066 109943 111133
57384A11133J958K172J532J024J202J420J251J137J185P36k93r27n58K59P70Q38
$$ 111133 113091 115263 116795 117819 119021 120441 121692 122829 124014 124750 124457 123530 122972 123231 124001 124839
57368A24839N20j16n56k66L57M45J7k29k76o96j247j050j39N23O51Q78J326J381
$$ 124839 125359 125243 124687 124421 124778 125223 125240 125011 124735 124039 122792 121742 121603 122126 122777 123655 124981 126362
57350A26362J062J097J514J545J215J456K372K837K245J279N54j36p95q45k14
$$ 126362 127424 128521 130035 131580 132795 134251 136623 139460 141705 142984 143538 143402 142607 141762 141548
57335A41548L34L84K93J58l75j053j029k30N22R36J473K006J738P58J34J29j29
$$ 141548 141882 142266 142559 142717 142342 141289 140260 140030 140552 141488 142961 144967 146705 147463 147597 147726 147597
57318A47597p94q34N5P11M10OL39R23J078J047J152J039N38K11L46N29P39J537
$$ 147597 146803 145969 146024 146735 147145 147151 147490 148413 149491 150538 151690 152729 153267 153478 153824 154353 155092 156629
57300A56629K600K559J183J91Q85K259K637J992J428J325J277J126R96Q14O42
$$ 156629 159229 161788 162971 163162 164047 166306 168943 170935 172363 173688 174965 176091 177087 177901 178543
57285A78543Q88J577K153K439K924L574L477K354J306J275J771J924J734J452
$$ 178543 179431 181008 183161 185600 188524 192098 195575 197929 199235 200510 202281 204205 205939 207391
57271B07391P84l42j129r93m39p0L30R23J133P01M15P70R92N12K67J262K674K910
$$ 207391 208175 207833 206704 205711 205272 205202 205532 206455 207588 208289 208704 209474 210466 210978 211245 212507 215181 218091
57253B18091J877Q28L97K51L14J016K266L327L785L914M081M401M793M956M513
$$ 218091 219968 220796 221193 221444 221758 222774 225040 228367 232152 236066 240147 244548 249341 254297 258810
57238B58810L657L145L217L134K385J657J890K904L779M104M151M244M596N351
$$ 258810 262467 265612 268829 271963 274348 276005 277895 280799 284578 288682 292833 297077 301673 307024
57224C07024O151O186N312M556M787N445N476M994N066O050P111P388O917O335
$$ 307024 313175 319361 324673 329229 334016 339461 344937 349931 354997 361047 368158 375546 382463 388798
57210C88798O101O165O204O106O161O550O924O952P064P841Q915R323R017Q826
$$ 388798 394899 401064 407268 413374 419535 426085 433009 439961 447025 454866 463781 473104 482121 490947
57196D90947Q965Q733Q015P730Q318R042R428J0089J1414J2629J3071J3301J3987
$$ 490947 499912 508645 516660 524390 532708 541750 551178 561267 572681 585310 598381 611682 625669
57183F25669J4673J4705J4416J4402J4405J3944J3364J3208J3266J3149J3223
$$ 625669 640342 655047 669463 683865 698270 712214 725578 738786 752052 765201 778424
57172G78424J3972J5032J5737J6131J6632J7239J7805J8563J9645K0692K1513
$$ 778424 792396 807428 823165 839296 855928 873167 890972 909535 929180 949872 971385
57161I71385K2479K3655K4461K4815K5622K7304K8890K9486K9664L0302L0979
$$ 971385 993864 1017519 1041980 1066795 1092417 1119721 1148611 1178097 1207761 1238063 1269042
57150A269042L0736K9602K8187K6505K4518K3090K3044K3802K4267K4598K5746
$$ 1269042 1299778 1329380 1357567 1384072 1408590 1431680 1454724 1478526 1502793 1527391 1553137
57139A553137K7670K9340L0350L1269L2477L3731L4878L6142L7705L9644M2012
$$ 1553137 1580807 1610147 1640497 1671766 1704243 1737974 1772852 1808994 1846699 1886343 1928355
57128A928355M4492M6433M7930N0232N4245N9329O4283O8918P3644P8321Q2711
$$ 1928355 1972847 2019280 2067210 2117442 2171687 2231016 2295299 2364217 2437861 2516182 2598893
57117B598893Q7448R3348J00117J06941J14038J22525J33046J45696J60966J79639
$$ 2598893 2686341 2779689 2879806 2986747 3100785 3223310 3356356 3502052 3663018 3842657
57107C842657K01891K27554K57207K92165L33572L82398M40400N10442N95937
$$ 3842657 4044548 4272102 4529309 4821474 5155046 5537444 5977844 6488286 7084223
57098G084223P00520Q27970R81787J164793J379090J625819J904535K213147K548147
$$ 7084223 7784743 8612713 9594500 10759293 12138383 13764202 15668737 17881884 20430031
57089B0430031K903321L267125L621461L943197M207519M392824M485627M478923
$$ 20430031 23333352 26600477 30221938 34165135 38372654 42765478 47251105 51730028
57081E1730028M360256M102072L674641L079134K367581J621906R07083K41125
$$ 51730028 56090284 60192356 63866997 66946131 69313712 70935618 71842701 72083826
57073G2083826l96252j033446j682994k333607k953319l499161l930516m220480
$$ 72083826 71687574 70654128 68971134 66637527 63684208 60185047 56254531 52034051
57065E2034051m360324m358126m234870m018924l739551l422378l088491k754999
$$ 52034051 47673727 43315601 39080731 35061807 31322256 27899878 24811387 22056388
57057B2056388k434776k136175j863882j620007j404556j216053j052568r12028
$$ 22056388 19621612 17485437 15621555 14001548 12596992 11380939 10328371 9416343
57049I416343p91928o89614o02965n30063m68396m15403l69782l31308k99426
$$ 9416343 8624415 7934801 7331836 6801773 6333377 5917974 5548192 5216884 4917458
57040D917458k73020k51354k33942k19426k05756j91586j76544j60246j42237
$$ 4917458 4644438 4393084 4159142 3939716 3733960 3542374 3365830 3205584 3063347
57031C063347j22837j02856q2878o4387n1367m8450n6551p1541q7818j01938j12603
$$ 3063347 2940510 2837654 2754776 2690389 2639022 2590572 2534021 2462480 2374662 2272724 2160121
57020B160121j19065j21005j18976j13868j06293r7062q7427p8329o9941o2266
$$ 2160121 2041056 1920051 1801075 1687207 1580914 1483852 1396425 1318096 1248155 1185889
57010A185889n5548m9793m4675m0238l6892l4456l2002k9045k6149k4043k2736
$$ 1185889 1130341 1080548 1035873 995635 958743 924287 892285 863240 837091 813048 790312
56999G90312k1788k0847j9778j8718j8017j7661j6970j5462j3612j2038j0386
$$ 790312 768524 747677 727899 709181 691164 673503 656533 641071 627459 615421 605035
56988F05035q111n743m081k611j74L034N631O974P276N995K111l756r329j3251
$$ 605035 596924 591181 587100 584489 584315 587349 592980 599954 607230 613225 615336 611580 602251 589000
56974E89000j6034j8133j8915j8127j6673j5109j2896r972p445n785l779l78L600
$$ 589000 572966 554833 535918 517791 501118 486009 473113 463141 455696 449911 446132 445754 449354
56961D49354O815R233J1677J4390J7075J9435K0751J9762J5945J0196L658l323
$$ 449354 456169 465402 477079 491469 508544 527979 548730 568492 584437 594633 598291 594968
56949E94968j0323j6016j9283k0485k0696k0247j8811j6371j3324j0012o748l861
$$ 594968 584645 568629 549346 528861 508165 487918 469107 452736 439412 429400 422652 418791
56937D18791j192J989O047J0442J4486J8205K2041K5984K9119K9662K5805J7376
$$ 418791 417599 419588 425635 436077 450563 468768 490809 516793 545912 575574 601379 618755
56925F18755O538l983j3157k1214k7510l0628l0620k9281k7762k5642k2792k0303
$$ 618755 625293 621310 608153 586939 559429 528801 498181 468900 441138 415496 392704 372401
56913C72401j8591j6368j2750q916o482n316m266k962j681l38J172K366K958L576
$$ 372401 353810 337442 324692 315776 309294 303978 299712 296750 295069 294731 295903 298269 301227 304803
56899C04803M824O350P710R259J1264J3011J3793J4052J4592J5417J6327J7755
$$ 304803 309627 315977 323687 332946 344210 357221 371014 385066 399658 415075 431402 449157
56887D49157J9913K1773K2057K0729J8494J5331J0611M281k924j0135j6461k0974
$$ 449157 469070 490843 512900 533629 552123 567454 578065 582346 579422 569287 552826 531852
56875E31852k3341k4112k3722k1812j8158j3617r228m962j40N344J1020J6729
$$ 531852 508511 484399 460677 438865 420707 407090 397862 392900 392760 398104 409124 425853
56863D25853K2700K8987L5404M1725M7455N1579N2782M9640M0921K6768R756o324
$$ 425853 448553 477540 512944 554669 602124 653703 706485 756125 797046 823814 833570 827246
56851H27246j9283k9221l6398l9898l9099l5054k9286k2302j4226n857K094R966
$$ 827246 807963 778742 742344 702446 663347 628293 599007 576705 562479 556622 558716 568682
56839E68682J8313K6896L5461M4657N5077O6008P6031Q3930Q7901Q4821P1973
$$ 568682 586995 613891 649352 694009 749086 815094 891125 975055 1062956 1147777 1219750
56828A219750M9606K1163q675l5666n6766p0735p7935p9105p4825o6508n6697
$$ 1219750 1269356 1290519 1281844 1246178 1189412 1118677 1040742 961637 886812 820304 763607
56817G63607m7235l7881k7750j7345p935M63R173J9063K9616L9722M8566N5658
$$ 763607 716372 678491 650741 633396 625461 625924 635097 654160 683776 723498 772064 827722
56805H27722O0188O0322N3420L8145J6600o521k7340m4401n7096o4369o5970o3356
$$ 827722 887910 948232 1001652 1039797 1056397 1049876 1022536 978135 921039 856670 790700 727344
56793G27344n8189n1082m2719l4742k8126k1947j5034p802j124N352J2213J8750
$$ 727344 669155 618073 575354 540612 512486 490539 475505 467703 466579 471931 484144 502894
56781E02894K3992K8233L1757L2872K9137K0222Q140m825j7087k7302l4588l9050
$$ 502894 526886 555119 586876 619748 648885 669107 677247 672422 655335 628033 593445 554395
56769E54395m1056m0475l7640l4041l0795k7317k2911j8685j6235j5197j3882
$$ 554395 513339 472864 435224 401183 370388 343071 320160 301475 285240 270043 256161
56758B56161j1694r346p331n787n256n835o182n135l663l398l922l598k543k443
$$ 256161 244467 235121 227790 222003 216747 210912 204730 199595 195932 192534 188612 185014 182471 180028
56744A80028l557m222l507k346j631j131p25r60j772k093j370l39J59J04j95n31
$$ 180028 176471 172249 168742 166396 164765 163634 162909 161949 160177 158084 156714 156375 156534 156638 156443 155912
56728A55912n75j70J45k37r44j160q59n77k82L26Q24O24J45K30P26R35R60J254
$$ 155912 155337 155167 155312 155075 154131 152971 152112 151535 151253 151579 152403 153027 153172 153402 154128 155063 156023 157277
56710A57277J330N29m25k59Q13J521J628J843J988J253J19l1P18P79l26j244j019
$$ 157277 158607 159136 158711 158452 159265 160786 162414 164257 166245 167498 167617 167586 168304 169083 168757 167513 166494
56693A66494l19M4K73P02J170J618K161K392J818J005R11J228Q26j54m11L33R17
$$ 166494 166175 166219 166492 167194 168364 169982 172143 174535 176353 177358 178269 179497 180323 180169 179758 180091 181008
56676A81008O88K28j38q46j796k090j445m90M33J385J814J075n8j58N21M26n89
$$ 181008 181696 181924 181786 180940 179144 177054 175609 175119 175552 176937 178751 179826 179768 179610 180131 180557 179968
56659A79968j016m10p3m71j73J570L274L419K561K093K199K196J794J103K39l97
$$ 179968 178952 178542 178469 177998 177825 179395 182669 186088 188649 190742 192941 195137 196931 198034 198273 197876
56643A97876l43J56M54O27J125J504J028L71Q66K037J946K71j095j008m75n13
$$ 197876 197533 197689 198143 198770 199895 201399 202427 202798 203664 205701 207647 207918 206823 205815 205340 204827
56627B04827o64n25o67j181j183o32p11j593j825r20l88j106j847j665j577k311
$$ 204827 204163 203638 202971 201790 200607 199975 199264 197671 195846 194926 194538 193432 191585 189920 188343 186032
56611A86032k549j261J48jr19q80q1J41k33k79j06m44r56o99K14R71J477K041
$$ 186032 183483 182222 182370 182369 181450 180570 180489 180630 180397 180118 180012 179568 178612 177913 178127 179098 180575 182616
56593A82616K253J656R31R77J359R89p7q17q14n03k09nj57p32j149r36m32p9L71
$$ 182616 184869 186525 187456 188433 189792 190781 190704 189887 189073 188570 188361 188356 188199 187467 186318 185382 184950 184871 185242
56574A85242J195J888J864J319P62L15J37O64J774K569K740L124M245N270N383
$$ 185242 186437 188325 190189 191508 192270 192585 192722 193386 195160 197729 200469 203593 207838 213108 218491
56559B18491N122N424O148O530O277N433M028K605K183K771K932J681j21j072
$$ 218491 223613 229037 235185 241715 247992 253425 257453 260058 262241 265012 267944 269625 269504 268432
56545B68432j022o64m41o52j594k728k770j546n15o69j159j066r89j607k076j454
$$ 268432 267410 266746 266305 265653 264059 261331 258561 257015 256500 255831 254672 253606 252617 251010 248934 247480
56529B47480n41o32j398j625j252j044j007o46l01p12j654k337k650k884k793
$$ 247480 246939 246307 244909 243284 242032 240988 239981 239335 239034 238322 236668 234331 231681 228797 226004
56514B26004k091j369j299j454j040k87k1l09n83o58p28q31j012j430j695r71
$$ 226004 223913 222544 221245 219791 218751 218464 218443 218134 217551 216893 216165 215334 214322 212892 211197 210226
56498B10226N74J433O71q17j740j907j524l61J233J845Q48m36o80l55l79l19M27
$$ 210226 210800 212233 212904 212087 210347 208440 206916 206555 207788 209633 210481 210045 209365 209010 208631 208312 208739
56481B08739J003M16n36m81K65L82k16n47k63L13J193K280K722K078J346J416
$$ 208739 209742 210158 209622 209141 209406 209788 209572 209025 208762 209075 210268 212548 215270 217348 218694 220110
56465B20110J539P85m0K64J116J188O69N65O23K0o76l33N10M29l73m59K98O34
$$ 220110 221649 222434 222394 222658 223774 224962 225631 226196 226819 226839 226163 225830 226340 226769 226396 225937 226235 226869
56447B26869J73j61Q3M73Q67J301J109j03j062l29J182J349J75l11N74J245O77
$$ 226869 227042 226881 226964 227437 228304 229605 230714 230611 229549 229220 230402 231751 231926 231615 232189 233434 234111
56430B34111j17r7J74j26o76p86m90j49J41K98R2m59j058j485j466o20Q20J751
$$ 234111 233994 233897 234071 233945 233269 232483 231993 231844 231985 232283 232375 231916 230858 229373 227907 227287 228107 229858
56412B29858J532R62R98J282J004M11J34j40r29j574j170k07K73M54J109J838
$$ 229858 231390 232352 233350 234632 235636 236047 236181 236041 235112 233538 232368 232161 232434 232888 233997 235835
56396B35835J666R40Q57J525K101K371K613K393J282K31M39J294J239K42l83j67
$$ 235835 237501 238441 239298 240823 242924 245295 247908 250301 251583 251814 252253 253547 254786 255028 254645 254478
56380B54478L32J051K223L132L015K798L841N408N531M139K989K729K289J258
$$ 254478 254810 255861 258084 261216 264231 267029 270870 276278 281809 285948 288937 291666 293955 295213
56366B95213N83O21N53M6l13m35q32j225q31j6R3m00l95J53L15J46N18J093O94
$$ 295213 295796 296417 296970 297016 296703 296268 295436 294211 293380 293364 293457 293057 292662 292815 293130 293276 293794 294887 295581
56347B95581l66n06M58R89M96Q9L80N88K35j70m43r65j312n66Q38J464J182J260
$$ 295581 295215 294709 295167 296156 296652 296741 297121 297709 297944 297774 297331 296366 295054 294488 295326 296790 297972 299232
56329B99232K047K615K764L262L942L732K787K451K844K719J948J878K755L133
$$ 299232 301279 303894 306658 309920 313862 317594 320381 322832 325676 328395 330343 332221 334976 338109
56315C38109K401J710J763J771J300J104J455J545J159J165J791K193K137K381
$$ 338109 340510 342220 343983 345754 347054 348158 349613 351158 352317 353482 355273 357466 359603 361984
56301C61984L105L706M271N322O193N760M726M792N655N380L869L082L565L709
$$ 361984 365089 368795 373066 378388 384581 390341 395067 399859 405514 410894 414763 417845 421410 425119
56287D25119K994K931L979M509L948M040N717P384P677P453P705P919P880Q735
$$ 425119 428113 431044 435023 439532 443480 447520 453237 460621 468298 475751 483456 491375 499255 507990
56273E07990J0788J2452J2743J2797J3621J4528J4965J5772J7301J8495J9041
$$ 507990 518778 531230 543973 556770 570391 584919 599884 615656 632957 651452 670493
56262F70493K0310K2895K5476K7386K9978L4053L8309M1966M6601N3511O1374
$$ 670493 690803 713698 739174 766560 796538 830591 868900 910866 957467 1010978 1072352
56251A072352O8440P5185Q2905R1350R9630J07992J16928J25676J33130J39016
$$ 1072352 1140792 1215977 1298882 1390232 1489862 1597854 1714782 1840458 1973588 2112604
56241B112604J43060J44322J42459J38209J31674J21702J07774R0876P1615M9493
$$ 2112604 2255664 2399986 2542445 2680654 2812328 2934030 3041804 3132680 3204295 3253788
56231C253788K4998M56k2361m3657o3683q1373r5949j07934j17475j23619j26254
$$ 3253788 3278786 3279242 3256881 3213224 3149541 3068168 2972219 2864285 2746810 2623191 2496937
56220B496937j26794j25963j23082j18338j13384j08619j02465r4566q7111q1489
$$ 2496937 2370143 2244180 2121098 2002760 1889376 1780757 1678292 1583726 1496615 1415126
56210A415126p6233o9907o3592n8683n4512n0006m5661m2059l8431l4243l0400
$$ 1415126 1338893 1268986 1205394 1146711 1092199 1042193 996532 954473 916042 881799 851399
56199H51399k7416k4419k1187j8979j8022j6555j3789j1394j0638j0458r749r065
$$ 851399 823983 799564 778377 759398 741376 724821 711032 699638 689000 678542 668793 659728
56187F59728q600p214m954l781m167l944k165r82j740k525j792j150j921k206
$$ 659728 651128 643914 638960 635179 631012 627068 624903 623921 622181 619656 617864 616714 614793 612587
56173F12587k67K055K433J875K373L224K921K445L418M906N159M731N015N474
$$ 612587 612320 614375 616808 618683 621056 624280 627201 629646 633064 637970 643129 647860 652875 658349
56159F58349N162N190O906R325J0899J2054J3596J4586J4295J4321J6163J8760
$$ 658349 663511 668701 675607 684932 695831 707885 721481 736067 750362 764683 780846 799606
56147G99606K0830K3456K7835L2768L7067M2124M9240N6815O3076O9194P6533
$$ 799606 820436 843892 871727 904495 941562 983686 1032926 1089741 1152817 1222011 1298544
56136A298544Q3048Q5643Q4178Q0152P3635O4700N5808M9408M4870M0528L6698
$$ 1298544 1381592 1467235 1551413 1631565 1705200 1769900 1825708 1875116 1919986 1960514 1997212
56125A997212L3734K9493K2075J3108N265j445p951j3296j6955k1613k9953m0602
$$ 1997212 2030946 2060439 2082514 2095622 2100887 2099442 2091491 2078195 2061240 2039627 2009674 1969072
56113A969072n0567n9576o8549p6045p9905q0507p9050p4700o6813n7828n0440
$$ 1969072 1918505 1858929 1790380 1714335 1634430 1553923 1474873 1400173 1333360 1275532 1225092
56102A225092m3983l6908l0341k5713k1488j5973j0851q191o541l868j593j586
$$ 1225092 1181109 1144201 1113860 1088147 1066659 1050686 1039835 1031644 1025103 1021235 1019642 1018056
56090A018056j924PK795L794L975N565P443P510O997P790Q230O405M844O725J0055
$$ 1018056 1016132 1016139 1018934 1022728 1026703 1032268 1039711 1047221 1054218 1062008 1070238 1076643 1081487 1088212 1098267
56075A098267J0910J0051J0819J2880J3673J3855J5599J7515J6944J5389J6111
$$ 1098267 1109177 1119228 1130047 1142927 1156600 1170455 1186054 1203569 1220513 1235902 1252013
56064A252013J8232J8708J8103J8827J9779J8507J6599J7141J8850J8576J7444
$$ 1252013 1270245 1288953 1307056 1325883 1345662 1364169 1380768 1397909 1416759 1435335 1452779
56053A452779J8475K0349J9762J7764J7624J8554J7920J7224J9348K2299K2465
$$ 1452779 1471254 1491603 1511365 1529129 1546753 1565307 1583227 1600451 1619799 1642098 1664563
56042A664563K1601K3593K6906K7514K6792K8769L2023L2262L0710L1724L4338
$$ 1664563 1686164 1709757 1736663 1764177 1790969 1819738 1851761 1884023 1914733 1946457 1980795
56031A980795L4536L3777L6505M1142M2528M1522M3162M6887M7909M6780M8187
$$ 1980795 2015331 2049108 2085613 2126755 2169283 2210805 2253967 2300854 2348763 2395543 2443730
56020B443730N1637N2837N2868N6321O1663O3506O3086O6236P2264P5425P6204
$$ 2443730 2495367 2548204 2601072 2657393 2719056 2782562 2845648 2911884 2984148 3059573 3135777
56009C135777Q0227Q6931R0583R1740R6242J03647J08217J10645J16898J26136
$$ 3135777 3216004 3302935 3393518 3485258 3581500 3685147 3793364 3904009 4020907 4147043
55999D147043J32143J35967J44346J56180J63907J67940J76024J88496J98333
$$ 4147043 4279186 4415153 4559499 4715679 4879586 5047526 5223550 5412046 5610379
55990E610379K05780K18328K36033K51653K65552K85143L09643L31285L51588
$$ 5610379 5816159 6034487 6270520 6522173 6787725 7072868 7382511 7713796 8065384
55981H065384L79677M14674M47314M78898N20001N70545O21014O73358P39709
$$ 8065384 8445061 8859735 9307049 9785947 10305948 10876493 11497507 12170865 12910574
55972A2910574Q20270R04976R97453J113336J254454J410438J586753J803586
$$ 12910574 13730844 14635820 15633273 16746609 18001063 19411501 20998254 22801840
55964B2801840K066304K367414K719075L151183L676402M293734N027590N921601
$$ 22801840 24868144 27235558 29954633 33105816 36782218 41075952 46103542 52025143
55956E2025143O992784Q242366R719172J1518299J3706285J6300969J9322122
$$ 52025143 59017927 67260293 76979465 88497764 102204049 118505018 137827140
55949A37827140K2775066K6556667L0435394L4067015L6804705L7422207L4363338
$$ 137827140 160602206 187158873 217594267 251661282 288465987 325888194 360251532
55942C60251532K6747827J5304601K175462j0302818k0636884k8246966l3001090
$$ 360251532 386999359 402303960 404479422 394176604 373539720 345292754 312291664
55935C12291664l4991077l4615527l2544646k9469879k5926882k2312134j8920277
$$ 312291664 277300587 242685060 210140414 180670535 154743653 132431519 113511242
55928A13511242j5911286j3315365j1115209r295013p814643o601408n595381
$$ 113511242 97599956 84284591 73169382 63874369 56059726 49458318 43862937
55921D3862937m769631m096620l532967l049767k644666k311835k028400j779652
$$ 43862937 39093306 34996686 31463719 28413952 25769286 23457451 21429051 19649399
55913A9649399j569928j398608j249749j114127r98708r05906q24316p47392o81574
$$ 19649399 18079471 16680863 15431114 14316987 13318279 12412373 11588057 10840665 10159091
55904A0159091o28876n79817n30160m87176m53251m20002l84229l53547l30646
$$ 10159091 9530215 8950398 8420238 7933062 7479811 7059809 6675580 6322033 5991387
55895E991387l07523k80808k57773k41594k25050k04508j86430j74356j62413
$$ 5991387 5683864 5403056 5145283 4903689 4678639 4474131 4287701 4113345 3950932
55886C950932j47369j34867j28308j23110j17039j14741j17018j16750j10629
$$ 3950932 3803563 3668696 3540388 3417278 3300239 3185498 3068480 2951730 2841101
55877B841101j04471j01973r8457r0765q3404p9740p6323p0938o7337o7182o5804
$$ 2841101 2736630 2634657 2536200 2445435 2362031 2282291 2205968 2135030 2067693 2000511 1934707
55866A934707o0648n5854n4078n1681m6392m1982m1101m0752l8844l8035l9337
$$ 1934707 1874059 1818205 1764127 1712446 1666054 1624072 1582971 1542219 1503375 1465340 1426003
55855A426003l9054l5816l3583l4118l3461k9513k6033k5577k5243k3196k2466
$$ 1426003 1386949 1351133 1317550 1283432 1249971 1220458 1194425 1168848 1143605 1120409 1097943
55844A097943k4529k5695k3856k2455k3875k5028k3372k1359k1126k0503j8030
$$ 1097943 1073414 1047719 1023863 1001408 977533 952505 929133 907774 886648 866145 848115
55833H48115j6244j6451j5811j3112j1733j3356j4385j2347j0202j0515j0861
$$ 848115 831871 815420 799609 786497 774764 761408 747023 734676 724474 713959 703098
55822G03098r055p659r033j0833j0590j0123j1331j2062j0301q220q133q457p397
$$ 703098 694043 686384 677351 666518 655928 645805 634474 622412 612111 603891 595758 587301 579904
55809E79904o611p433p502m945k156j632j723j53J822K406K875M645O000N276
$$ 579904 573293 565860 558358 553413 551257 549625 547902 547749 549571 551977 554852 559497 565497 570773
55795E70773M126M278M220K356L14j84o47k736m877n130m562m787n016m546n140
$$ 570773 574899 579177 583397 585753 586067 585883 585236 582500 577623 572493 567931 563144 558128 553582 548442
55780E48442p881j0557j1096j0762j1039j0364p121k844P15M822J0669J5698J6443
$$ 548442 540561 530004 518908 508146 497107 486743 479622 476778 477493 482315 492984 508682 525125
55767E25125J2914P141j89q558j5454j8691j9253j9190j8626j7166j5928j5535
$$ 525125 538039 545180 544991 536433 520979 502288 483035 463845 445219 428053 412125 396590
55755C96590j4342j1290q308p367p456p003o743p545p827o157m135l773m147l483
$$ 396590 382248 370958 362650 355283 347827 340824 334081 326536 318709 312552 308417 304644 300497 297014
55741B97014k481k555k767j530K61O83j85j154k273l873m923m689m307m632m493
$$ 297014 294533 291978 289211 287681 287942 288625 288440 287286 285013 281140 276217 271528 267221 262589 258096
55726B58096l227k685m226n956n617m142l544l371k171n78R1O08K201L804L882
$$ 258096 254869 252184 247958 242002 236385 232243 228699 225328 223157 222579 222670 223278 225479 229283 233165
55711B33165L598N081P673Q786P542N062K169p56k721l307l882n563p145p139
$$ 233165 236763 241844 249517 258303 265845 270907 273076 272320 269599 266292 262410 256847 249702 242563
55697B42563o391o467o961o654n930n678n233l716k131j747j830j189m99p53r78
$$ 242563 236172 229705 222744 216090 210160 204482 199249 195533 193402 191655 189825 188636 188137 187384 186406
55682A86406R9J596K159K545L952N277M805L283K543K328J243k93q95r75j814
$$ 186406 186505 188101 190260 192805 196757 202034 206839 210122 212665 214993 216236 215943 215048 214073 212259
55667B12259k785k314q35j00k65j78J47j47o80m91q2l74n11Q23K731L261K527
$$ 212259 209474 207160 206325 206225 205960 205782 205929 205782 205102 204611 204529 204155 203644 204467 207198 210459 212986
55650B12986K153K365K153J675J832K033R70q52j795j887k476l631m344m871o277
$$ 212986 215139 217504 219657 221332 223164 225197 226167 225315 223520 221633 219157 215526 211182 206311 200034
55635B00034p967q217p032o058n736m929l386k296k209k443k603k859k780j685
$$ 200034 192067 183850 176818 170760 165024 160095 156709 154413 152204 149761 147158 144299 141519 139834
55621A39834j18P06O82N01M4j163k384k469j780j546j768j569j089j172j655j799
$$ 139834 139716 140422 141104 141605 141649 140486 138102 135633 133853 132307 130539 128970 127881 126709 125054 123255
55605A23255j883k555l228k941k174j927j829j140o49j366k230j616k73j97j243
$$ 123255 121372 118817 115589 112648 110474 108547 106718 105578 104929 103563 101333 99717 99444 99247 98004
55590I8004j562r36p65j044k99J409K203J478P20Q48J131J112J378J899J758R60
$$ 98004 96442 95506 94741 93697 93398 94807 97010 98488 99208 100056 101187 102299 103677 105576 107334 108294
55574A08294O26J048J391J514K158L260L889M028M436M672L424R43q66j156j032
$$ 108294 108920 109968 111359 112873 115031 118291 122180 126208 130644 135316 138740 139683 138817 137661 136629
55559A36629j403j825j849j805j860j839k071k887l410k519r19l70r99j358j049
$$ 136629 135226 133401 131552 129747 127887 126048 123977 121090 117680 115161 114242 113872 112873 111515 110466
55544A10466j109j744j876j244q73j084r28o0O66P86P40O71L25J57P12J140K31
$$ 110466 109357 107613 105737 104493 103620 102536 101608 101548 102214 103000 103740 104411 104736 104893 105605 106745 106976
55527A06976j199j234o5J59j216k566k925l108l426k890j461p17j222j517o42
$$ 106976 105777 104543 104478 104637 103421 100855 97930 94822 91396 88506 87045 86328 85106 83589 82947
55512H2947L85O06N70P75N94j90n89k13r0p39j126n18K77M67M97Q08R11N99N41
$$ 82947 83332 83938 84508 85283 85877 85687 85098 84885 84795 84056 82930 82412 82689 83156 83653 84461 85372 85971 86512
55493H6512Q79Q12K62K94J134J503P92J35L73O65K30k17N1M22K41K1K14J47o65
$$ 86512 87391 88203 88465 88759 89893 91396 92188 92323 92696 93361 93591 93374 93425 93847 94088 94109 94323 94470 93805
55474I3805j412j312q33n80k26M43O69L2n92l81J32J24k65n58q37j130r43k01
$$ 93805 92393 91081 90248 89668 89442 89885 90554 90586 89994 89613 89745 89869 89604 89046 88209 87079 86136 85935
55456H5935L43K65M6l4l97j004j019k08N82Q67J097J293P03n44j102n06M1j97
$$ 85935 86278 86543 86589 86555 86158 85154 84135 83927 84509 85376 86473 87766 88469 87925 86823 86317 86358 86161
55438H6161l21L22Q40N02P6K37K54m03o94K21J259J032K3l34K36R98J493J511
$$ 86161 85840 86162 87002 87504 87580 87817 88071 87668 86974 87195 88454 89486 89509 89175 89411 90409 91902 93413
55420I3413P64k85l51Q88K036K043J675J814J813R09j26l78m98j346k116j690
$$ 93413 94177 93892 93541 94429 96465 98508 100183 101997 103810 104719 104593 104215 103717 102371 100255 98565
55404I8565p84q71j702j827j044n00o69q54n75p1M00O98M89j71m86PN19J87n84
$$ 98565 97781 96910 95208 93381 92337 91837 91168 90314 89739 89668 90068 90766 91255 91084 90598 90605 91124 91311 90727
55385I0727r34q99q72n58L37J100J018O17O65P04p7j211j667j560j691j907j386
$$ 90727 89793 88894 88022 87464 87801 88901 89919 90536 91201 91905 91828 90617 88950 87390 85699 83792 82406
55368H2406k58M37K66l12q48j059n35O01J298Q58Q1kJ98k52r55q09P6N97N01M04
$$ 82406 82148 82585 82851 82539 81691 80632 80097 80698 81996 82854 82935 82933 83131 82879 81924 81115 81191 81788 82289 82693
55348H2693L32k30r29q05M8N15K37L0M21R49J086P80N2r33j445r22n4o5q84j209
$$ 82693 83025 82795 81866 81061 81109 81624 81861 81891 82312 83261 84347 85127 85179 84246 82801 81879 81825 81760 80876 79667
55328G9667m32O10J007Q04M97L22L28M48L83Nk35N2L89O7o94j055q05l77J39R23
$$ 79667 79235 79845 80852 81656 82153 82475 82803 83251 83634 83639 83404 83456 83845 83912 83218 82163 81358 80981 81120 82043
55308H2043J538J234J59o86p58l49K69J070J589J104k35j268j141j64P78J099
$$ 82043 83581 84815 84974 84288 83530 83181 83450 84520 86109 87213 86978 85710 84569 84405 85183 86282
55292H6282P29M2l56k46r7l44o86o18l31l11m61l48o3L0R6N33J049R81L32l63
$$ 86282 87011 87053 86697 86451 86354 86010 85324 84706 84375 84064 83603 83255 83192 83222 83318 83851 84900 85881 86213 85850
55272H5850r62j570j751r65L33J073J058J021J190R47N6q19j114r70n98P4P77
$$ 85850 84888 83318 81567 80602 80935 82008 83066 84087 85277 86224 86280 85461 84347 83377 82779 82853 83630
55255H3630P84o6r18q81n0Q21J189J002M88l0l40m94o06o23m60k28n4R5J86J9
$$ 83630 84414 84348 83430 82549 82499 83320 84509 85511 85999 85969 85629 85135 84529 83906 83446 83218 83164 83259 83445 83464
55235H3464k95k61K31N50K40k57m25n40r96j299p77K26Q28R67J204J472J176L54
$$ 83464 83169 82908 83139 83689 83929 83672 83247 82707 81711 80412 79635 79861 80689 81656 82860 84332 85508 85862
55217H5862k98n53p73r78q31n28o34j021r80m70k03l32j64N70J207J261J112J156
$$ 85862 85564 85011 84238 83260 82429 81901 81267 80246 79266 78796 78593 78261 78097 78667 79874 81135 82247 83403
55199H3403J075N76M7k7J29qm52p25n27r2N7k91o91m78K97P10J73o35o52J70R79
$$ 83403 84478 85054 85101 85074 85203 85195 84743 84018 83491 83399 83456 83165 82474 81996 82293 83003 83176 82541 81889 82059 83038
55178H3038J264J182Q47K00m64n94j50L86P32R58J015P70M64M67O19M14k02p78
$$ 83038 84302 85484 86331 86531 86067 85473 85323 85709 86441 87399 88414 89184 89648 90115 90734 91148 90946 90168
55160I0168j028j045r23o61l12J54Q41J436J279M61R3O75J036j3j717k382j831
$$ 90168 89140 88095 87172 86511 86199 86353 87194 88630 89909 90370 90463 91138 92174 92161 90444 88062 86231
55143H6231j268j039k99J018J672R72k42r82j239j259q68j51K28N0j9M54R33Q61
$$ 86231 84963 83924 83625 84643 86315 87287 87045 86063 84824 83565 82697 82546 82774 82824 82805 83259 84192 85053
55125H5053N75O46Q87O75j05r13j106m97M12P66K49m86p20o13o83p35k46N36R18
$$ 85053 85628 86274 87161 87836 87731 86818 85712 85215 85627 86393 86642 86156 85436 84823 84140 83405 83159 83695 84613
55106H4613R39J119J270P97M2m6M19L95k01k86M61R84P18M42O60O17j39o59q3
$$ 84613 85552 86671 87941 88738 88780 88734 89153 89548 89347 89061 89522 90506 91224 91666 92326 92943 92804 92145 92062
55087I2062Q94J174R17R17J182J217J061J011Q30K58k88k97m3j0J8N02J200J502
$$ 92062 92956 94130 95047 95964 97146 98363 99424 100435 101265 101523 101235 100938 100895 100885 100903 101405 102605 104107
55069A04107J361J115P69J87l69n96p60j245j795j854j408q56l32J51K10n05j487
$$ 104107 105468 106583 107352 107539 107170 106574 105814 104569 102774 100920 99512 98656 98324 98475 98685 98180 96693
55052I6693j722r28P2L50j55p72r28o45l11j46n9mj25l81l24K69R24J111J067
$$ 96693 94971 94043 94115 94465 94310 93538 92610 91965 91654 91508 91449 91445 91320 90939 90615 90884 91808 92919 93986
55033I3986J271J469J126O09P79J384J099n08k167k532j672m33O68J372J377Q64
$$ 93986 95257 96726 97852 98461 99240 100624 101723 101215 99048 96516 94844 94411 95079 96451 97828 98692
55017I8692O16R92J345J003J96m83q93j096r27m37j32k91m95l58j30q7j2K47L28
$$ 98692 99308 100300 101645 102648 102844 102361 101468 100372 99445 99008 98876 98585 98090 97732 97602 97515 97503 97750 98078
54998I8078Pk60q2J93P0k87m30k26K90J079J676J376L21l44n5L01j89r11o55N70
$$ 98078 98085 97825 97743 97936 98006 97719 97289 97063 97353 98432 100108 101484 101805 101461 101406 101707 101518 100607 99952 100522
54978A00522J635J913J726J438R48J48p98j615j973j571n23N48J122J244J121
$$ 100522 102157 104070 105796 107234 108182 108330 107532 105917 103944 102373 101850 102398 103520 104764 105885
54963A05885P53K63N1J89K27MM6P11J462J531Q30j88j045j284o65K79N86J40j70
$$ 105885 106638 106901 106952 107141 107368 107372 107418 108129 109591 111122 111952 111764 110719 109435 108770 109049 109635 109775 109605
54944A09605L7m0r13j745j588q63n87q64j073r40m80M29J568K086J637J065J122
$$ 109605 109642 109602 108689 106944 105356 104493 103906 103042 101969 101029 100549 100978 102546 104632 106269 107334 108456
54927A08456J325J052R27J741K802K903K357K468L270L498K758K267L048M633
$$ 108456 109781 110833 111760 113501 116303 119206 121563 124031 127301 130799 133557 135824 138872 143505
54913A43505N820N781M316J905l49j636k316l168m104m466m357m528n033n083
$$ 143505 149325 155106 159422 161327 160978 159342 157026 153858 149754 145288 140931 136403 131370 126287
54899A26287m324l275k359j479o54j91qL77J065J547J400O45l81j030n47R27K025
$$ 126287 121963 118688 116329 114850 114196 114005 113997 114374 115439 116986 118386 119031 118650 117620 117073 118000 120025
54882A20025J707P62P00J554K078J855J835K645L730M408M703M859M933N011M952
$$ 120025 121732 122494 123194 124748 126826 128681 130516 133161 136891 141299 146002 150861 155794 160805 165757
54867A65757L992J652j111k833l471m181n203n539m901m346m476m511l750k672
$$ 165757 169749 171401 170290 167457 163986 159805 154602 149063 144162 139816 135340 130829 127079 124407
54853A24407j901j312q16q69j398j433n86J59j08r59j608k099k628k690j904q80
$$ 124407 122506 121194 120378 119509 118111 116678 116092 116251 116143 115184 113576 111477 108849 106159 104255 103375
54837A03375l60j41J84K93j70o48m47J54N16P00R75Q79j5r86r39l0O26N70K90
$$ 103375 103015 102874 103058 103351 103181 102533 102086 102240 102756 103456 104431 105310 105295 104309 103370 103340 103966 104536 104826
54818A04826R1k44p33j068j173j111n85N29J406J077j5l82M36J254J046L25J60
$$ 104826 104917 104673 103940 102872 101699 100588 100003 100532 101938 103015 103000 102618 103054 104308 105354 105679 105839
54801A05839O49J092J154J052Q67L78l77q83p53k62o1m13r46j197j153j002o62
$$ 105839 106488 107580 108734 109786 110653 111031 110654 109771 109018 108756 108695 108282 107336 106139 104986 103984 103322
54784A03322M5P84R15M54J86N58J060J114R77J177J599J838K050K611L227L260
$$ 103322 103367 104151 105066 105520 105706 106264 107324 108438 109415 110592 112191 114029 116079 118690 121917 125177
54768A25177K837K746L230L778M142M696N494N862N373M525L975L603K890J676
$$ 125177 128014 130760 133990 137768 141910 146606 152100 157962 163335 167860 171835 175438 178328 180004
54754A80004J12j736l639m994n441n383n364n240m641l917l773m000l561k154
$$ 180004 180116 178380 174741 169747 164306 158923 153559 148319 143678 139761 135988 131988 128427 126273
54740A26273q34o36j186j302n00O43J409J551J207O87L41K42N8l72n28K14J656
$$ 126273 125439 124803 123617 122315 121815 122458 123867 125418 126625 127312 127653 127895 127953 127581 127053 127267 128923
54723A28923K964L724M161M357M041L318K899L130L413L063K168J164L9j389k778
$$ 128923 131887 135611 139772 144129 148170 151488 154387 157517 160930 163993 166161 167325 167364 165975 163197
54708A63197l552l698l667l634l441l090k795k578k380k427k957l625l738l132
$$ 163197 159645 155947 152280 148646 145205 142115 139320 136742 134362 131935 128978 125353 121615 118483
54694A18483k271j539r27m74m07o68p28j40R62J921J965P65j008j941j244K06
$$ 118483 116212 114673 113746 113272 112865 112197 111469 111329 112291 114212 116177 116942 115934 113993 112749 112955
54678A12955Q53L56k46j95R0K9j58l1K84N03Q36J488J921J371r3j535k219k159
$$ 112955 113808 114164 113918 113723 113813 113842 113684 113653 113937 114440 115276 116764 118685 120056 119963 118428 116209 114050
54660A14050j725j126m05L92J119J521J338N40n63j459j654q81N61J681J502J44
$$ 114050 112325 111199 110794 111186 112305 113826 115164 115704 115141 113682 112028 111147 111708 113389 114891 115035
54644A15035j140j299o00n4j02l44l80k84j52K27Q94J257O75n49j294r51j77L7
$$ 115035 113895 112596 111996 111942 111840 111496 111116 110832 110680 110907 111801 113058 113733 113184 111890 110939 110762 110799
54626A10799k66k67K27M46l2n50m29l5q5m57n43l83m39n51j37O20Q76N38M61J005
$$ 110799 110533 110266 110493 110939 110907 110357 109928 109893 109808 109351 108808 108425 107986 107435 107298 107918 108794 109332 109793 110798
54606A10798J387R56K51J48O89J288J534J255L82p53j421j343j001p78l91K78
$$ 110798 112185 113141 113392 113540 114229 115517 117051 118306 118688 117935 116514 115171 114170 113392 113001 113279
54590A13279N57k6p64o63Q8M66J48k51l73n11q09q66m17K21O02N62J11n71r25
$$ 113279 113836 113810 113046 112383 112471 112937 113085 112834 112461 111950 111141 110275 109858 110079 110681 111243 111354 110783 109858
54571A09858l89P79J628J630J190Q76O77M18K96M99O48K47m41n81R4Q82J001N52
$$ 109858 109469 110248 111876 113506 114696 115572 116249 116667 116963 117462 118110 118357 117916 117335 117429 118311 119312 119864
54553A19864K20L74P75J046J042P96M42K55M17O81O19L07L15P56R32L60l35k35
$$ 119864 120084 120458 121233 122279 123321 124117 124559 124814 125231 125912 126531 126838 127153 127909 128841 129201 128866 128631
54535A28631M87Q42N02J32J40M4n79j305j530j305j020p39m00k79o27j141j242
$$ 128631 129118 129960 130462 130594 130734 130778 130199 128894 127364 126059 125039 124300 123900 123621 122994 121853 120611
54518A20611p72l3O09Q80O49J60l5K54N16K50l08n57l28R8M41N09J34m39m64L91
$$ 120611 119839 119806 120415 121295 121944 122104 122069 122323 122839 123089 122781 122224 121896 121994 122435 122944 123078 122639 122175 122566
54498A22566J298J194K37l75j46P9n83j711k043r08J128K786L077K004N20l66
$$ 122566 123864 125058 125295 124920 124774 124853 124270 122559 120516 119608 120736 123522 126599 128603 129123 128757
54482A28757n10n12p45r29p41l90j94MN95J517K244K412K070J274r0j796k953
$$ 128757 128247 127735 126990 126061 125320 124930 124736 124740 125335 126852 129096 131508 133578 134852 134762 132966 130013
54465A30013k719j343l9L53K75O62J605K211J827Q60K15K23L79N2p70j433j299
$$ 130013 127294 125951 125912 126265 126540 127202 128807 131018 132845 133705 133920 134143 134522 134574 133804 132371 131072
54448A31072m70K67L34N3J57P03R39L28p54j530j691j433r05o3R32J494J076j72
$$ 131072 130602 130869 131203 131256 131413 132116 133055 133383 132629 131099 129408 127975 127070 127007 127939 129433 130509 130337
54430A30337j306j372l40Q94J475J382J155J139J292J431J337Q17M2m01k21J33
$$ 130337 129031 127659 127319 128213 129688 131070 132225 133364 134656 136087 137424 138241 138283 137882 137661 137794
54414A37794J86K11O18R53M47o85j480j667j728j542l54J571K644K004P49L30
$$ 137794 137980 138191 138809 139762 140209 139524 138044 136377 134649 133107 132753 134324 136968 138972 139721 140051
54398A40051P34J150J417J734J706R23p1m21k04n3K5L53N70J1j022j545j333j101
$$ 140051 140785 141935 143352 145086 146792 147715 147644 147223 147019 146966 146991 147344 147914 147925 146903 145358 144025 142924
54380A42924j204j204p53o2O50J341J690J263L18k39J20J056K001K654K854K601
$$ 142924 141720 140516 139763 139701 140351 141692 143382 144645 144963 144724 144844 145900 147901 150555 153409 156010
54364A56010K282K298K530K606K571K659K686K397K129K171J782Q9k123k971k073
$$ 156010 158292 160590 163120 165726 168297 170956 173642 176039 178168 180339 182121 182210 180087 177116 175043
54349A75043j221j857l178l643l202k921l146l283l001k573k092j304l17K69R8
$$ 175043 173822 171965 168787 165144 161942 159021 155875 152592 149591 147018 144926 143622 143305 143574 143672
54334A43672m97r13q33l42K39N86O01M46L22L12M63P63R61O96k7p26r12n80j11
$$ 143672 143175 142262 141429 141087 141326 141912 142513 142959 143281 143593 144056 144819 145780 146476 146449 145723 144811 144231 144120
54315A44120N9k67q03q97k86M05L64k29m13J19N94M57K20M88Q75O06k08p38o41
$$ 144120 144179 143912 143109 142212 141926 142331 142695 142466 142053 142172 142766 143223 143443 143931 144806 145412 145204 144466 143825
54296A43825l97n12r07j181r96l28M16O36K24j87k4M35N12J49j09m1J5j40j96
$$ 143825 143428 142916 142009 140828 139832 139504 139920 140556 140780 140593 140569 141004 141516 141665 141556 141515 141530 141390 141194
54277A41194L1J85j31p33j085r37m47J57P74J358J824K095K129J983J846J862
$$ 141194 141225 141410 141279 140546 139461 138524 138077 138234 139008 140366 142190 144285 146414 148397 150243 152105
54261A52105J860J448N60k36k90L11P83N52j45p13r34r54q09l61K44N44K77k96
$$ 152105 153965 155413 155973 155737 155447 155758 156541 157093 156948 156235 155301 154347 153538 153177 153421 153965 154242 153946
54243A53946p21p34k70N74J372J510P89l36j258j741j749j267n91l64q31j357
$$ 153946 153225 152491 152221 152795 154167 155677 156466 156130 154872 153131 151382 150115 149524 149160 148329 146972
54227A46972j244p32n54p05m79L05R33Q64M70L38M68N14L86J92o8l70n28n29p29
$$ 146972 145728 144996 144442 143737 143258 143563 144496 145360 145830 146168 146636 147150 147536 147728 147660 147290 146762 146233 145504
54208A45504j304j734j298l3J201J571J037K24j65J19P19R96O99K79L84R95J328
$$ 145504 144200 142466 141168 141135 142336 143907 144944 145168 145003 145122 145841 146837 147536 147815 148199 149194 150522
54191A50522P64l41j003p94l09k98o57p02k10L37N54O66R04R45L60o80j556j861
$$ 150522 151286 150945 149942 149148 148839 148541 147884 147182 146972 147309 147863 148529 149433 150378 150738 150058 148502 146641
54173A46641j590r21j50M06P12J048J456J529J066N17L32K73j17p47j247j541
$$ 146641 145051 144130 143980 144386 145098 146146 147602 149131 150197 150714 151046 151319 151202 150455 149208 147667
54157A47667j510o92Q48J853J288L9o8J079J690P19p28j163o02O5N03Q03P65K76
$$ 147667 146157 145465 146313 148166 149454 149493 149425 150504 152194 152913 152185 151022 150420 150485 150988 151791 152556 152832
54139A52832j68j10J25J00J09O03J235J336R78P55P41M96j7l73m90p72j312j553
$$ 152832 152664 152554 152679 152779 152888 153491 154726 156062 157040 157795 158536 159032 159015 158642 158152 157380 156068 154515
54121A54515r85K08J354J877J640R91M92M30N84O06M30J75j14l49j70P13J982
$$ 154515 153530 153738 155092 156969 158609 159600 160092 160522 161106 161712 162142 162317 162203 161854 161684 162397 164379
54104A64379K773K448J207J5j87O90J846K512K852L604M939O205O720O309M908
$$ 164379 167152 169600 170807 170822 170635 171325 173171 175683 178535 182139 187078 193283 200003 206312 211220
54089B11220K463n38k994m243m693n025n168m578l216j718p82o50r95j093m37
$$ 211220 213683 213145 210151 205908 201215 196190 191022 186444 183228 181510 180728 180078 179083 177990 177553
54074A77553O58J389J535J623J919K065J960K127K609K483J325K59M30J060M14
$$ 177553 178211 179600 181135 182758 184677 186742 188702 190829 193438 195921 197246 197505 197935 198995 199409
54059A99409j623l316l424k490j596j051p70q76j267j300n78M21R67J076J340
$$ 199409 197786 194470 191046 188556 186960 185909 185139 184263 182996 181696 181118 181539 182506 183582 184922
54044A84922K041K800L083K796K446K664L544M474M869M894N188N941O634O687
$$ 184922 186963 189763 192846 195642 198088 200752 204296 208770 213639 218533 223721 229662 236296 242983
54030B42983O059N121M271L719L387L017K477J897J371P67J07j92R8M88L26l28
$$ 242983 249042 254163 258434 262153 265540 268557 271034 272931 274302 275069 275176 274984 275082 275570 275896 275568
54014B75568r45j460k289l416m247m476m485m713n088n375n497n355m684l462
$$ 275568 274623 273163 270874 267458 263211 258735 254250 249537 244449 239074 233577 228222 223538 220076
54000B20076k127j183q14r50j413j885k071j965j732j356q44o71j341k426k726
$$ 220076 217949 216766 215952 215002 213589 211704 209633 207668 205936 204580 203736 203065 201724 199298 196572
53985A96572j795o48m70j120j538j224n79PO09J132J020M1j037j147j54J065J774
$$ 196572 194777 194129 193659 192539 191001 189777 189198 189205 189814 190946 191966 192007 190970 189823 189669 190734 192508
53968A92508K115K487K785K696K474K763L720M967O367Q152R966J0636R423P039
$$ 192508 194623 197110 199895 202591 205065 207828 211548 216515 222882 231034 241000 251636 261059 268098
53954B68098M717K710L91k384m849o220o370n631m476l429k730k073j062M0O42
$$ 268098 272815 275525 275916 273532 268683 262463 256093 250462 245986 242557 239827 237754 236692 236732 237374
53939B37374P85J145J930K527K480K241K476L077L376L058K462K034J927K076
$$ 237374 238159 239304 241234 243761 246241 248482 250958 254035 257411 260469 262931 264965 266892 268968
53925B68968K444L039L785M505N058N492N902O171O112N972O346P356Q255Q285
$$ 268968 271412 274451 278236 282741 287799 293291 299193 305364 311476 317448 323794 331150 339405 347690
53911C47690P607O915O397N716M792L813K695J184l94j321j548j857k643l310
$$ 347690 355297 362212 368609 374325 379117 382930 385625 386809 386415 385094 383546 381689 379046 375736
53897C75736l235k750k654l149l859m547n346o345p320p896p808p148o450o340
$$ 375736 372501 369751 367097 363948 360089 355542 350196 343851 336531 328635 320827 313679 307229 300889
53883C00889o891p454p280o204m770l770l622l979m031l430k749k654k889k646
$$ 300889 293998 286544 279264 273060 268290 264520 260898 256919 252888 249458 246709 244055 241166 238520
53869B38520j830j265j486k015k161k010k161k851l680m063l691k735j704r78
$$ 238520 236690 235425 233939 231924 229763 227753 225592 222741 219061 214998 211307 208572 206868 205890
53855B05890n04j42j23p65j802k552k734k584k208j500p16l80m37j72O55J365
$$ 205890 205386 205244 205121 204356 202554 200002 197268 194684 192476 190976 190260 189880 189443 189271 189926 191291
53839A91291J352Q66M09j4n49r64j004p96m23L67J519K303K204J689J417J208
$$ 191291 192643 193509 193918 193904 193355 192391 191387 190591 190168 190535 192054 194357 196561 198250 199667 200875
53823B00875N16m48r54q55o03l12L01J129J633J735J976K574L031K956K720K857
$$ 200875 201391 200943 199989 199134 198531 198219 198520 199649 201282 203017 204993 207567 210598 213554 216274 219131
53807B19131L260L387L059K636K514K769L296M004M752N277N358N112M873M742
$$ 219131 222391 225778 228837 231473 233987 236756 240052 244056 248808 254085 259443 264555 269428 274170
53793B74170M378L474K302J467J248J428J747K059K061J478N46j52n30j136k237
$$ 274170 278548 282022 284324 285791 287039 288467 290214 292273 294334 295812 296358 296206 295676 294540 292303
53778B92303l335l927m185m391m318l751l180l289m004m656m899m879m670m178
$$ 292303 288968 285041 280856 276465 272147 268396 265216 261927 257923 253267 248368 243489 238819 234641
53764B34641l533l053k828k690k562k406k050j453r93j036j385j584j562j524
$$ 234641 231108 228055 225227 222537 219975 217569 215519 214066 213073 212037 210652 209068 207506 205982
53750B05982j425j151j028j425j942j761q49p3L1j07N8L27K32j45l17j7O18J339
$$ 205982 204557 203406 202378 200953 199011 197250 196401 196328 196359 196252 196310 196637 196869 196724 196407 196390 197008 198347
53732A98347J890K031J740J315J079J078J082Q52L61p4L7P59J442J304L72n23
$$ 198347 200237 202268 204008 205323 206402 207480 208562 209414 209775 209701 209738 210497 211939 213243 213615 213092
53716B13092p06j61R24K460M013M614L685K017J169J787K917L246K620K014K095
$$ 213092 212386 212225 213149 215609 219622 224236 227921 229938 231107 232894 235811 239057 241677 243691 245786
53701B45786K373J978R98N17J326K970M293M587L975K957K018J558J715K118K158
$$ 245786 248159 250137 251135 251652 252978 255948 260241 264828 268803 271760 273778 275336 277051 279169 281327
53686B81327J615R00N24M65K09o00j659k220j890j100o05n92n82k43J74L53M68
$$ 281327 282942 283842 284366 284831 285040 284440 282781 280561 278671 277571 276966 276374 275792 275549 275723 276076 276544
53669B76544P67J009P34ko40q19o63m23j66J42M71O85N42j34j027j422r41o1N21
$$ 276544 277311 278320 279054 279052 278412 277593 276930 276507 276341 276483 276954 277639 278181 278047 277020 275598 274657 274596 275117
53650B75117P18Q71R66O63M4k92J2O69J248J587J695J568J339J244J392J730K220
$$ 275117 275835 276706 277672 278335 278379 278087 278099 278768 280016 281603 283298 284866 286205 287449 288841 290571 292791
53633B92791K758L020K781K352K290K715L292L788M143M114L491K681K419K748
$$ 292791 295549 298569 301350 303702 305992 308707 311999 315787 319930 324044 327535 330216 332635 335383
53619C35383K907K379J520Q96O66P55J059J283J224J402K619M515N523M857L694
$$ 335383 338290 340669 342189 343085 343751 344506 345565 346848 348072 349474 352093 356608 362131 366988 370682
53604C70682L490L915L576K273J213J163J594J852J957J952J427K82q30j365j547
$$ 370682 374172 378087 381663 383936 385149 386312 387906 389758 391715 393667 395094 395376 394546 393181 391634
53589C91634j675j401m81L26M8j014j564j068l84l94q10q34m15j94m92r66j241
$$ 391634 389959 388558 388077 388403 388451 387437 385873 384805 384421 384027 383217 382383 381968 381774 381282 380316 379075
53572C79075j323j355j361j404j589j779j563p31L45J012R05J74o14q34k96N00
$$ 379075 377752 376397 375036 373632 372043 370264 368701 367970 368315 369327 370232 370406 369792 368958 368662 369162
53556C69162Q54O75M95N83N62J39k87k33J41M54R06J851K802K757J606M56L02
$$ 369162 370016 370691 371186 371769 372331 372470 372183 371950 372091 372545 373451 375302 378104 380861 382467 382923 383225
53539C83225J027J980K825L438L599L318L135L519M288M951N362N652N901O282
$$ 383225 384252 386232 389057 392495 396094 399412 402547 406066 410354 415305 420667 426319 432220 438502
53525D38502P161Q472R407R404R100R488J0392J0768J0528J0882J2468J4206J4878
$$ 438502 445663 454135 463542 472946 482046 491534 501926 512694 523222 534104 546572 560778 575656
53512E75656J4973J5914J7912J9713K0463K0657K1072K1644K1935K1928K1820
$$ 575656 590629 606543 624455 644168 664631 685288 706360 728004 749939 771867 793687
53501G93687K1518K0942K0445K0312K0239J9819J9340J9341J9662J9625J9122
$$ 793687 815205 836147 856592 876904 897143 916962 936302 955643 975305 994930 1014052
53490A014052J8672J8405J7850J6902J6231J6296J6669J6769J6673J6678J6675
$$ 1014052 1032724 1051129 1068979 1085881 1102112 1118408 1135077 1151846 1168519 1185197 1201872
53479A201872J6511J6445J6614J6495J5577J4197J2960J1720R922P714N836M465
$$ 1201872 1218383 1234828 1251442 1267937 1283514 1297711 1310671 1322391 1332313 1340027 1345863 1350328
53467A350328K994J030j110l034m716o229p562q872j0329j1645j2308j2364j2363
$$ 1350328 1353322 1354352 1353242 1350208 1345492 1339263 1331701 1322829 1312500 1300855 1288547 1276183 1263820
53454A263820j2529j2661j2878j3682j5049j6285j7019j7609j8182j8136j7130
$$ 1263820 1251291 1238630 1225752 1212070 1197021 1180736 1163717 1146108 1127926 1109790 1092660
53443A092660j5899j5401j5591j5594j4695j2726r979p221n332m363l424k031
$$ 1092660 1076761 1061360 1045769 1030175 1015480 1002754 992775 985554 980222 975859 972435 970404
53431I70404r66j101j883j865n72J153K469L406M296N193O081P093Q213R206R987
$$ 970404 969438 968337 966454 964589 964017 965170 967639 971045 975341 980534 986615 993708 1001921 1011127 1021114
53416A021114J0814J2032J3841J6168J8462J9863K0110K0075K0781K2050K2864
$$ 1021114 1031928 1043960 1057801 1073969 1092431 1112294 1132404 1152479 1173260 1195310 1218174
53405A218174K3078K3821K5874K8524L0549L1814L3146L5066L7364L9726M2133
$$ 1218174 1241252 1265073 1290947 1319471 1350020 1381834 1414980 1450046 1487410 1527136 1569269
53394A569269M4455M6235M7187M7626M8174M9059M9929N0331N0241M9946M9518
$$ 1569269 1613724 1659959 1707146 1754772 1802946 1852005 1901934 1952265 2002506 2052452 2101970
53383B101970M8619M6967M4795M2624M0708L8905L6981L4742L1949K8520K4864
$$ 2101970 2150589 2197556 2242351 2284975 2325683 2364588 2401569 2436311 2468260 2496780 2521644
53372B521644K1619J8826J5717J1578O562J359l736r008j4643k0322k5594l0312
$$ 2521644 2543263 2562089 2577806 2589384 2595946 2597305 2593569 2584561 2569918 2549596 2524002 2493690
53360B493690l4498l8013m0650m2406m3436m3803m3540m2958m2479m2041m0983
$$ 2493690 2459192 2421179 2380529 2338123 2294687 2250884 2207344 2164386 2121907 2079866 2038883
53349B038883l8850l6136l3895l2732l2465l2674l3124l3591l3764l3474l2838
$$ 2038883 2000033 1963897 1930002 1897270 1864805 1832131 1799007 1765416 1731652 1698178 1665340
53338A665340l1960l0749k9182k7403k5464k3198k0640j8255j6417j4902j3227
$$ 1665340 1633380 1602631 1573449 1546046 1520582 1497384 1476744 1458489 1442072 1427170 1413943
53327A413943j1395j0006r685j0617j2456j4428j5723j6115j6089j6185j6324
$$ 1413943 1402548 1392542 1382857 1372240 1359784 1345356 1329633 1313518 1297429 1281244 1264920
53316A264920j6087j5420j4664j3963j3092j1901j0484q891p068n233l963l619
$$ 1264920 1248833 1233413 1218749 1204786 1191694 1179793 1169309 1160418 1153350 1148117 1144154 1140535
53304A140535l854l896l179j609N57K931N072O671P776Q897J0665J3160J5586
$$ 1140535 1136681 1132785 1129606 1127997 1128554 1131485 1136557 1143228 1151004 1159901 1170566 1183726 1199312
53291A199312J6960J7256J7537J8738K0570K1925K2115K1325K0114J8965J8163
$$ 1199312 1216272 1233528 1251065 1269803 1290373 1312298 1334413 1355738 1375852 1394817 1412980
53280A412980J7587J6615J4744J2318J0165Q446O428L551K39k628m670o215p844
$$ 1412980 1430567 1447182 1461926 1474244 1484409 1492855 1499283 1502834 1503073 1500445 1495775 1489560 1481716
53267A481716j0004j2756j5639j8029j9710k0925k1798k2227k2454k3134k4385
$$ 1481716 1471712 1458956 1443317 1425288 1405578 1384653 1362855 1340628 1318174 1295040 1270655
53256A270655k5298k4981k3791k2930k2962k3369k3411k2846k1700k0066j8408
$$ 1270655 1245357 1220376 1196585 1173655 1150693 1127324 1103913 1081067 1059367 1039301 1020893
53245A020893j7564j8026j9358k0622k1175k0932k0098j8995j8044j7509j7227
$$ 1020893 1003329 985303 965945 945323 924148 903216 883118 864123 846079 828570 811343
53234H11343j6726j5756j4521j3338j2189j0777r060p509o703o721p088p380p646
$$ 811343 794617 778861 764340 751002 738813 728036 718976 711467 704764 698043 690955 683575 675929
53221F75929q171r072j0323j1936j3746j5137j5503j5023j4588j4713j4908j4458
$$ 675929 667758 658686 648363 636427 622681 607544 592041 577018 562430 547717 532809 518351
53209E18351j3418j2409j1643j0795r796r129r053r111q789q314q300q784r149
$$ 518351 504933 492524 480881 470086 460290 451161 442108 432997 424208 415894 407594 398810 389661
53196C89661r006q691q732r115r317q893p884o736n907n472n109m553l979l749
$$ 389661 380655 371964 363232 354117 344800 335907 328023 321287 315380 309908 304799 300246 296267 292518
53182B92518l788l565k825k062j926k357k616k253j679j598k057k413k215j783
$$ 292518 288730 285165 282340 280278 278352 275995 273379 271126 269447 267849 265792 263379 261164 259381
53168B59381j600j505j000l52n36j808k982k866j900j483j904k042j246l55l20
$$ 259381 257781 256276 255276 254924 254388 252580 249598 246732 244832 243349 241445 239403 238157 237802 237482
53153B37482p86q57n87o87j143j162m68K72M16P1l58o80p69m55R4L42N6l40l89
$$ 237482 236696 235839 235252 234565 233422 232260 231792 232064 232480 232551 232193 231513 230744 230289 230383 230725 230781 230441 230052
53134B30052k36k51l17OP14J220J119P43P10J086J348J187R52J031J095M81o32
$$ 230052 229816 229565 229248 229254 229968 231188 232307 233050 233760 234846 236194 237381 238333 239364 240459 240940 240308
53117B40308j097k04J293K031J691J154J109J213P86k07j205j763j863j671j274
$$ 240308 239211 239007 240300 242331 244022 245176 246285 247498 248284 248077 246872 245109 243246 241575 240301
53102B40301p56l72m93j191j887j758p34K49K83m41j061j181j041p57k31J98j19
$$ 240301 239545 239173 238680 237489 235602 233844 233110 233359 233642 233201 232140 230959 229918 229161 228930 229128 229009
53085B29009j029j343l11J228J781R86j37n57k84m8l22q68j081o93j08O9k66o98
$$ 229009 227980 226637 226326 227554 229335 230321 230184 229627 229343 229295 228973 228105 227024 226331 226223 226292 226026 225328
53067B25328r06r08o99j92L32K87l46p35l19L04K42l22m32J58O65M99M5n4K83
$$ 225328 224422 223514 222815 222623 222955 223242 222896 222161 221842 222146 222388 222066 221634 221792 222457 222956 223001 222947 223230
53048B23230P64J236J573J446P03k47p97p87n12k42OK95O34R70J121P66j95j280
$$ 223230 223994 225230 226803 228249 228952 228705 227908 227121 226609 226367 226373 226668 227302 228272 229393 230159 229964 228684
53030B28684j717j226l20K47K80J65K56M57M79K79Q8Q2K70O89J410K204K418J564
$$ 228684 226967 225741 225421 225668 225948 226113 226369 226826 227305 227584 227672 227754 228024 228713 230123 232327 234745 236309
53012B36309K5j087r79J7P75N38l56q90m58N20J097Q32J77j91j95l05p43j104
$$ 236309 236334 235247 234268 234285 235060 235598 235242 234352 233894 234414 235511 236343 236520 236329 236134 235829 235086 233982
52994B33982q54qQ73J295J221Q99N77L90L88M77M91M16M28N78N75K21j27J31R50
$$ 233982 233128 233120 233993 235288 236509 237408 237985 238375 238763 239240 239731 240147 240575 241153 241728 241949 241822 241953 242903
52975B42903J546J391R34R17J350J622J513J453J709J904J646J185J000J066R74
$$ 242903 244449 245840 246774 247691 249041 250663 252176 253629 255338 257242 258888 260073 261073 262139 263113
52960B63113O28L32J60k71j220k256k651k215j528j235j367j516j541j715k086
$$ 263113 263741 264073 264233 263962 262742 260486 257835 255620 254092 252857 251490 249974 248433 246718 244632
52945B44632k077j140K83R95M05p34j216o98J62O71O91L62k31q94j207q78j47
$$ 244632 242555 241415 241698 242693 243098 242364 241148 240450 240612 241283 241974 242336 242105 241211 240004 239126 238979
52928B38979M25M56J9m93n92K3J086J756J371K90l54P8R85J342R46M34K76K52
$$ 238979 239404 239860 239879 239386 238794 238817 239903 241659 243030 243320 242966 243044 244029 245371 246317 246751 247027 247279
52910B47279J6l82p39j021j190j111r03r61j290j186j87J046J428Q45J97O3R3
$$ 247279 247295 246913 246174 245153 243963 242852 241949 240988 239698 238512 238325 239371 240799 241644 241841 241904 241997
52893B41997j60m75l68K49J074J682J605O28o87j249o55L05O75M95M33O58P30
$$ 241997 241837 241362 240994 241243 242317 243999 245604 246232 245545 244296 243641 243946 244621 245116 245549 246207 246937
52876B46937L48l43j175k046k524j977k81J852L392L758L036J770O05j24n43r05
$$ 246937 247285 246942 245767 243721 241197 239220 238939 240791 244183 247941 250977 252747 253352 253228 252685 251780
52860B51780j189j168q16m22k98n69j107j537j458r58p50j396k456k901k339j400
$$ 251780 250591 249423 248607 248185 247887 247318 246211 244674 243216 242258 241508 240112 237656 234755 232416 231016
52844B31016q68q75j170j583j918j809j178n97p01j247j316m82N79Q99L53k39
$$ 231016 230148 229273 228103 226520 224602 222793 221615 221018 220317 219070 217754 217272 217851 218750 219103 218864
52828B18864r9O62J242J027K43l63l35L9J46k01o08p08o59q26j109r79k46N79
$$ 218864 218765 219427 220669 221696 221939 221576 221241 221280 221426 221225 220617 219909 219250 218424 217315 216336 216090 216669
52810B16669R82J198J761K455K345J068n36j451j663j770j809j314m25q7p15j406
$$ 216669 217651 218849 220610 223065 225410 226478 225942 224491 222828 221058 219249 217935 217510 217423 216708 215302
52794B15302j036J70Q84L65o78j069n99p6j94p04q07q8J037J828J922J542J102
$$ 215302 214266 214436 215320 215685 215007 213938 213339 213263 213069 212365 211558 211470 212507 214335 216257 217799 218901
52777B18901Q06N91K83k82j120j942k255j878j236r21r06n97K81J185J410R41
$$ 218901 219707 220298 220581 220299 219179 217237 214982 213104 211868 210947 210041 209444 209725 210910 212320 213261
52761B13261K98k62q09j142p91J74R19Q92O63J135K215K915K711K098J687J377
$$ 213261 213559 213297 212488 211346 210555 210729 211648 212540 213203 214338 216553 219468 222179 224277 225964 227341
52745B27341Q38L15M00J148J879J949J375P02M41P53J434K050K155J609P74K66
$$ 227341 228179 228494 228894 230042 231921 233870 235245 235947 236388 237141 238575 240625 242780 244389 245163 245429
52729B45429L65O97O68J57m19o87p33p94r29j143j549k067k255j791r95m62m18
$$ 245429 245794 246491 247159 247316 246897 246210 245477 244683 243754 242611 241062 238995 236740 234949 233954 233492 233074
52712B33074p19j224j669j505n14N31O34n2l59K57J030J126P12L91K68J35P8K65
$$ 233074 232355 231131 229462 227957 227443 227974 228608 228556 228197 228454 229484 230610 231322 231713 231981 232116 232194 232459
52694B32459M88M62L00K89M74P48R84Q38m4j238j648r22j17k17o87m21M28P19
$$ 232459 232947 233409 233709 233998 234472 235220 236204 237042 236998 235760 234112 233190 233073 232856 232169 231748 232176 232895
52676B32895K00j87O4K86j36p65q74m81j10j4o3o3J77P52J404J696J553J338J215
$$ 232895 233095 232908 232972 233258 233122 232357 231483 231002 230892 230878 230815 230752 230929 231681 233085 234781 236334 237672 238887
52657B38887R50M90K72O71J538K493L295L614K948J249o71j797j902j551j320
$$ 238887 239837 240327 240599 241270 242808 245301 248596 252210 255158 256407 255736 253939 252037 250486 249166
52642B49166j339j471j554j454j085n03J04N01N31L03K63Q41J875K631K522J756
$$ 249166 247827 246356 244802 243348 242263 241760 241864 242365 242896 243199 243462 244303 246178 248809 251331 253087
52626B53087J094J099J654K148J996J081k14j366k077k324k191j811j396j066
$$ 253087 254181 255280 256934 259082 261078 262159 261945 260579 258502 256178 253987 252176 250780 249714
52612B49714p49l62rK32M94Q50R74N10l13q11o50k01J4q2j76J5M50P23L81m93
$$ 249714 248965 248603 248594 248826 249320 250170 251144 251654 251341 250530 249880 249679 249693 249611 249435 249450 249900 250623 251004 250511
52592B50511j144q71Q9Q37Q46M07N8O3M57J043J334R35J78r7M02J050J228J045
$$ 250511 249367 248496 248585 249422 250268 250675 250733 250796 251253 252296 253630 254565 254743 254646 255048 256098 257326 258371
52574B58371Q67N78j14r22j172p03j87l28j047j643j564q66O5R06J326Q59o04
$$ 258371 259238 259816 259702 258780 257608 256905 256718 256390 255343 253700 252136 251270 251335 252241 253567 254426 253822
52557B53822k258k922k337j349n95K40J350J943J362M71O19J584J844Q43l47q16
$$ 253822 251564 248642 246305 244956 244361 244601 245951 247894 249256 249727 250346 251930 253774 254617 254270 253454
52541B53454r16j185j325r47l33K16R71K017K665K340J413N93M4k27J02R79J519
$$ 253454 252538 251353 250028 249081 248748 248964 249935 251952 254617 256957 258370 258963 259007 258780 258882 259861 261380
52524B61380J050J22l30l34n35r65j138j054j113j239r52k86K23L99N62Q02R06
$$ 261380 262430 262552 262222 261888 261353 260388 259250 258196 257083 255844 254892 254606 254829 255228 255790 256592 257498
52507B57498R81J509K528L342L217K069M73p71j257j393j920k707k651j271J83
$$ 257498 258479 259988 262516 265858 269075 271144 271617 270846 269589 268196 266276 263569 260918 259647 259830
52492B59830J28j264k382k315j588q94k68K72L40j06m82m41k84j82L06J402K413
$$ 259830 259958 258694 256312 253997 252409 251515 251247 251519 251859 251753 251271 250830 250546 250364 250670 252072 254485
52475B54485K432J459L77k3L08P79P10jo75n80J30O14N57N73J167J879J931J386
$$ 254485 256917 258376 258753 258730 259038 259817 260527 260526 259851 259271 259401 260015 260572 261145 262312 264191 266122 267508
52457B67508R89J051J031M13n10j023j009j118j790k496k393j555r61j157j597
$$ 267508 268497 269548 270579 270992 270482 269459 268450 267332 265542 263046 260653 259098 258137 256980 255383
52442B55383j598j315j203j086n03K95O05L46J67L78N36K12m13r05j106j073q87
$$ 255383 253785 252470 251267 250181 249678 249973 250578 250924 251091 251469 252005 252217 251804 250899 249793 248720 247833
52425B47833o61m46j26L74Q46J086J240J505J724J719J803K365L180L707L971
$$ 247833 247172 246726 246600 246974 247820 248906 250146 251651 253375 255094 256897 259262 262442 266149 270120
52410B70120M462N289O118O791P384P760P750P554P201N943L262K09j570k106
$$ 270120 274582 279871 285989 292780 300164 307924 315674 323228 330429 336372 339634 339843 338273 336167
52396C36167l021m943o524o599n869n562n560m935l493j761j74R02R83K10l29
$$ 336167 333146 328203 321679 315080 309211 303649 298089 293154 289661 287900 287726 288628 289611 289821 289492
52381B89492N8O44M80l3J09P88J059Q16R38J768K675L182L550L995M289M377M554
$$ 289492 289550 290194 290674 290641 290750 291538 292597 293413 294351 296119 298794 301976 305526 309521 313810 318187 322741
52364C22741M756M368L166J795J026R35J100J161Q91K07n73q06j79Q95J754K157
$$ 322741 327497 331865 335031 336826 337852 338787 339887 341048 341939 342146 341573 340767 340588 341483 343237 345394
52348C45394K315K422K467K379K229K264K741L680M770N647O284O962P808Q518
$$ 345394 347709 350131 352598 354977 357206 359470 362211 365891 370661 376308 382592 389554 397362 405880
52334D05880Q766Q788R393J1058J3125J4333J4332J4203J5091J6726J7992J8643
$$ 405880 414646 423434 432827 443885 457010 471343 485675 499878 514969 531695 549687 568330
52322E68330J9503K1005K2499K3304K3585K3751K3830K3879K4269K4878K4796
$$ 568330 587833 608838 631337 654641 678226 701977 725807 749686 773955 798833 823629
52311H23629K3602K2288K2056K2658K2795K1831K0198J8433J6750J5405J4591
$$ 823629 847231 869519 891575 914233 937028 958859 979057 997490 1014240 1029645 1044236
52300A044236J3907J2728J1053R375P753N778L438J230o22k345m034n514o890
$$ 1044236 1058143 1070871 1081924 1091299 1099052 1104830 1108268 1109498 1108876 1106531 1102497 1096983 1090093
52287A090093q474j0065j0957j0884j0317r671q798p468n767l800j557O88K351
$$ 1090093 1081619 1071554 1060597 1049713 1039396 1029725 1020927 1013459 1007692 1003892 1002335 1003023 1005374
52274A005374L297M186N766Q097J0688J3043J4826J5804J5941J5490J4850J4386
$$ 1005374 1008671 1012857 1018623 1026720 1037408 1050451 1065277 1081081 1097022 1112512 1127362 1141748
52262A141748J4318J4564J4789J4854J4974J5215J5068J4058J2502J1146J0142
$$ 1141748 1156066 1170630 1185419 1200273 1215247 1230462 1245530 1259588 1272090 1283236 1293378
52251A293378Q966P273N271L281J430k91k148m605p591j0129j1509j2482j4250
$$ 1293378 1302344 1309617 1314888 1318169 1319599 1319308 1317160 1312555 1304964 1294835 1283326 1270844 1256594
52238A256594j6507j7699j7347j6639j6466j6235j5349j4496j4440j4524j3603
$$ 1256594 1240087 1222388 1205041 1188402 1171936 1155701 1140352 1125856 1111416 1096892 1083289
52227A083289j1813j0301r615r315q874q074o759n098l844l519l539k825j211
$$ 1083289 1071476 1061175 1051560 1042245 1033371 1025297 1018538 1013440 1009596 1006077 1002538 999713 998502
52214I98502N15J772K631L205L425L527L986M803N378N313M838M353L993L766
$$ 998502 999017 1000789 1003420 1006625 1010050 1013577 1017563 1022366 1027744 1033057 1037895 1042248 1046241 1050007
52200A050007L690L645L433L094K928L114L571M151M631M620L823K458J139K92
$$ 1050007 1053697 1057342 1060775 1063869 1066797 1069911 1073482 1077633 1082264 1086884 1090707 1093165 1094304 1094596
52186A094596r8k37l41o75j415k504l818n347o931q028q248p934p703p450o532
$$ 1094596 1094498 1094261 1093920 1093245 1091830 1089326 1085508 1080161 1073230 1065202 1056954 1049020 1041317 1033867 1027335
52171A027335m962l738l561l868l590k522j342n18K33J279K365K869K573J960
$$ 1027335 1022373 1018635 1015074 1011206 1007616 1005094 1003752 1003234 1003467 1004746 1007111 1009980 1012553 1014513
52157A014513J673J883K240K400K385K381K364K097J543J086J192J891K645K868
$$ 1014513 1016186 1018069 1020309 1022709 1025094 1027475 1029839 1031936 1033479 1034565 1035757 1037648 1040293 1043161
52143A043161K572K340K573K952K908K438K097K225K692L458M773O589Q283R393
$$ 1043161 1045733 1048073 1050646 1053598 1056506 1058944 1061041 1063266 1065958 1069416 1074189 1080778 1089061 1098454
52129A098454J0315J1792J4029J6678J9410K2047K4417K6533K8709L0973L2708
$$ 1098454 1108769 1120561 1134590 1151268 1170678 1192725 1217142 1243675 1272384 1303357 1336065
52118A336065L3356L3279L3228L3179L2472L1004K9425K8023K6304K3983K1544
$$ 1336065 1369421 1402700 1435928 1469107 1501579 1532583 1562008 1590031 1616335 1640318 1661862
52107A661862J9392J7099J4118J0764P847N656L817J918j84k453m590o167p215
$$ 1661862 1681254 1698353 1712471 1723235 1731082 1736738 1740555 1742473 1742289 1739836 1735246 1729079 1721864
52094A721864q501j0669j3351j5653j7332j8835k0258k1098k1137k0807k0392
$$ 1721864 1713363 1702694 1689343 1673690 1656358 1637523 1617265 1596167 1575030 1554223 1533831
52083A533831j9486j7719j5417j3012j0295o947l477p55J280L579O527R336J1254
$$ 1533831 1514345 1496626 1481209 1468197 1457902 1450955 1447478 1446723 1448003 1451582 1458109 1467445 1478699
52070A478699J2611J4182J6024J7682J9097K0499K1657K1971K1363K0313J9023
$$ 1478699 1491310 1505492 1521516 1539198 1558295 1578794 1600451 1622422 1643785 1664098 1683121
52059A683121J7264J5176J3489J2535J1721J0378Q613O808M754J894j794n739
$$ 1683121 1700385 1715561 1729050 1741585 1753306 1763684 1772297 1779105 1783859 1785753 1783959 1778220
52047A778220r436j2772j5773j8469k0871k2860k4233k5098k5931k6917k7522
$$ 1778220 1768784 1756012 1740239 1721770 1700899 1678039 1653806 1628708 1602777 1575860 1548338
52036A548338k7159k5988k4669k3577k2689k1954k1255k0318j9160j8334j8088
$$ 1548338 1521179 1495191 1470522 1446945 1424256 1402302 1381047 1360729 1341569 1323235 1305147
52025A305147j7742j6687j5631j5732j6643j6700j5272j3675j3224j3477j3190
$$ 1305147 1287405 1270718 1255087 1239355 1222712 1206012 1190740 1177065 1163841 1150364 1137174
52014A137174j2136j1076j0513j0389j0639j1280j2114j3026j4298j6019j7454
$$ 1137174 1125038 1113962 1103449 1093060 1082421 1071141 1059027 1046001 1031703 1015684 998230
52003I98230j7753j7122j6649j6936j7553j7834j7628j7100j6342j5429j4549
$$ 998230 980477 963355 946706 929770 912217 894383 876755 859655 843313 827884 813335
51992H13335j3827j3209j2612j2041j1585j1385j1598j2151j2649j2706j2311
$$ 813335 799508 786299 773687 761646 750061 738676 727078 714927 702278 689572 677261
51981F77261j1760j1305j1105j1220j1477j1525j1328j1314j1661j1711j0616
$$ 677261 665501 654196 643091 631871 620394 608869 597541 586227 574566 562855 552239
51970E52239q474o276m756l714k500p67J290L094M060M172M103M381M644M216
$$ 552239 543765 537489 532733 529019 526519 525752 527042 530136 534196 538368 542471 546852 551496 555712
51956E55712L179K146J102n80k741m141m142l768m277n289n289l686j345Q11K738
$$ 555712 558891 561037 562139 561559 558818 554677 550535 546767 542490 537201 531912 528226 526881 527692 530430
51941E30430M668O474Q085R951J2523J5521J8118J9670K0136J9935J9681J9783
$$ 530430 535098 541572 549657 559608 572131 587652 605770 625440 645576 665511 685192 704975
51929G04975J9889J8851J5501R664K278n398j2522j8710k3617k6803k8013k7545
$$ 704975 724864 743715 759216 768880 771158 765760 753238 734528 710911 684108 656095 628550
51917F28550k6198k4773k3547k2229k0385j7920j5167j2579j0346q319o323m446
$$ 628550 602352 577579 554032 531803 511418 493498 478331 465752 455406 447087 440764 436318
51905D36318k919j726n81N83J388J520J311J382J726J651P07p61k190l512m891
$$ 436318 433399 431673 431092 431675 433063 434583 435894 437276 439002 440653 441360 440599 438409 434897 430006
51890D30006o133o793o753o225n395m403l574l013k162m21J767L136L229L078
$$ 430006 423873 417080 410327 404102 398707 394304 390730 387717 385555 385134 386901 390037 393266 396344
51876C96344L817N298O573P223P418P088N977M385L036K075R35o23k038k833l289
$$ 396344 400161 405459 412032 419255 426673 433761 439738 444123 447159 449234 450169 449546 447508 444675 441386
51861D41386l834m289m217l687l119k636j961q80N26J969K969K993J988O30k86
$$ 441386 437552 433263 429046 425359 422240 419604 417643 416763 417289 419258 422227 425220 427208 427838 427552
51846D27552o72j086j913k943l714l988l862l683l806m178m280l698k687j878
$$ 427552 426880 425794 423881 420938 417224 413236 409374 405691 401885 397707 393427 389729 387042 385164
51832C85164j459j028k75N50R60P72J98l66n48k49J47lr83k314l005k350o05J007
$$ 385164 383705 382677 382402 382952 383912 384684 384882 384516 383968 383719 383866 383863 382880 380566 377561 375211 374606 375613
51814C75613J233O2j117r31N03J924K544K692K738K276Q70q87j866j737j215r52
$$ 375613 376846 376908 375791 374860 375363 377287 379831 382523 385261 387537 388407 387520 385654 383917 382702 381750
51798C81750q37n81m55r31j894k628k648k199j818j654j476j167r33r08q91o01
$$ 381750 380913 380332 379877 378946 377052 374424 371776 369577 367759 366105 364629 363462 362529 361621 360730 360129
51782C60129n3N27J042J503J756J555R71M50L83Q13J561K432L154L509L627L956
$$ 360129 360076 360603 361645 363148 364904 366459 367430 367880 368263 369076 370637 373069 376223 379732 383359 387315
51766C87315M691N470N851N837N637N149M084K514Q63o61k187l711m927n673o178
$$ 387315 392006 397476 403327 409164 414801 419950 424034 426548 427411 426750 424563 420852 415925 410252 404074
51751D04074o632o769o281n346m497m024l826l689l367k483q20J229K848L668
$$ 404074 397442 390673 384392 379046 374549 370525 366699 363010 359643 357160 356340 357569 360417 364085
51737C64085M062M499N013N534O185O810O621N066K836J315R64J040R65J085J706
$$ 364085 368147 372646 377659 383193 389378 396188 402809 407875 410711 412026 412990 414030 414995 416080 417786
51722D17786K130J463j11j599k426k757k783k499k094j884j798j517j184j356
$$ 417786 419916 421379 421268 419669 417243 414486 411703 409204 407110 405226 403428 401911 400727 399371
51708C99371k073k605k281j141L95J949L119L482K986J951O13q81k059k336j893
$$ 399371 397298 394693 392412 391271 391666 393615 396734 400216 403202 405153 405766 404885 402826 400490 398597
51693C98597j489j274n84O73J432R52n4o72j260k514l773l786k824k439l010l131
$$ 398597 397108 395834 395250 395923 397355 398307 398253 397581 396321 393807 390034 386248 383424 380985 377975 374844
51677C74844j916m37n5l64R4J738L653M973N634N920O017O175O667P418P891P495
$$ 374844 372928 372491 372436 372072 372166 373904 377557 382530 388164 394084 400101 406276 412943 420361 428252 435747
51661D35747N967L530P70j739l798n471o524o435n047k923p19J379L338M760N097
$$ 435747 441714 445244 446014 444275 440477 435006 428482 422047 417000 414077 413358 414737 418075 422835 427932
51646D27932M164K145o48l656o035p234p465p253o697n659m467l818l912m089
$$ 427932 432096 434241 433593 429937 423902 416668 409203 401950 395253 389594 385127 381309 377397 373308
51632C73308l491j893J41J703K165J662R25M77J47m19j053j297j229j477k370
$$ 373308 369817 367924 368065 369768 371933 373595 374520 374997 375144 374725 373672 372375 371146 369669 367299
51617C67299l515m309m529m311l871l412l069k816k545k226j833j197k54O75J193
$$ 367299 363784 359475 354946 350635 346764 343352 340283 337467 334922 332696 330863 329666 329412 330087 331280
51602C31280J390J722K390L239M282N753P508Q860R334R112Q463P157M944K305
$$ 331280 332670 334392 336782 340021 344303 350056 357564 366424 375758 384870 393333 400490 405434 407739
51588D07739K08q84j381j942k776l571l893l446k175k00K195M643O869Q890J0832
$$ 407739 407947 407063 405682 403740 400964 397393 393500 390054 387879 387679 389874 394517 401386 410276 421108
51573D21108J2490J3337J3194J2687J2584J2840J2793J2146J1180J0028Q599P412
$$ 421108 433598 446935 460129 472816 485400 498240 511033 523179 534359 544387 552986 560398
51561E60398P699J0020J3429J6582J9310K2336K5736K8432K9207K7635K4065J9240
$$ 560398 568097 578117 591546 608128 627438 649774 675510 703942 733149 760784 784849 804089
51549H04089J3922Q462K611l826j0270j5699j9714k2743k5147k6733k7299k7100
$$ 804089 818011 826473 829084 825258 814988 799289 779575 756832 731685 704952 677653 650553
51537F50553k6399k4990k2579j9456j6380j3874j1899j0181q632p424o708o340
$$ 650553 624154 599164 576585 557129 540749 526875 514976 504795 496163 488739 482031 475691
51525D75691n974n519n311n624o162o363o162o067o352o631o457n954n536n241
$$ 475691 469717 464198 458887 453263 447101 440738 434576 428509 422157 415526 409069 403115 397579 392338
51511C92338m720l841k974k619k845l253l331k966k482k234k145j882j418j152
$$ 392338 387618 383777 380803 378184 375339 372086 368755 365789 363307 361073 358928 357046 355628 354476
51497C54476j336j615j402o54nq0p47j157n97P56K042K602K495K103J630J159
$$ 354476 353140 351525 350123 349469 349464 349384 348637 347480 346883 347639 349681 352283 354778 356881 358511 359670
51481C59670Q38O08j1j322k754l336k864k012j384j041j064j744k880l596l318
$$ 359670 360508 361116 361105 359783 357029 353693 350829 348817 347433 346392 345328 343584 340704 337108 333790
51466C33790k477j774j362j116j146j423j393p71j58k07m96k08M49N01r5j83R43
$$ 333790 331313 329539 328177 327061 325915 324492 323099 322328 322170 321963 321467 321259 321708 322209 322114 321931 322874
51449C22874K605L862M723N700O858P966R124J0608J2176J3072J2617J0661P685
$$ 322874 325479 329341 334064 339764 346622 354588 363712 374320 386496 399568 412185 422846 430531
51436D30531M685K589J537R15K84j82l77q24k063l881n639p051q076q445p981
$$ 430531 435216 437805 439342 440257 440541 440359 439982 439158 437095 433214 427575 420524 412448 404003 396022
51421C96022p260p093p367p038n537l520j981j169p39m96m73n30m18j20K23O48
$$ 396022 388762 381669 374302 367264 361727 358207 356226 355057 354318 353822 353349 352819 352401 352281 352504 353152
51405C53152J225J632J395O79M05J215K569L335L088K428J998J792J647J867K852
$$ 353152 354377 356009 357404 358083 358488 359703 362272 365607 368695 371123 373121 374913 376560 378427 381279
51390C81279M388N783O656P168P673Q586J0405J3245J6350J8809K0836K3593K7519
$$ 381279 385667 391450 398106 405274 412947 421533 431938 445183 461533 480342 501178 524771 552290
51377E52290L1651L5042L7924M0730M2714M2526L9891L5682L0549K4433J7410
$$ 552290 583941 618983 656907 697637 740351 782877 822768 858450 888999 913432 930842
51366I30842J0037K612n102j3123k0811k7465l2787l6584l8692l9495l9836m0009
$$ 930842 940879 943491 938389 925266 904455 876990 844203 807619 768927 729432 689596 649587
51354F49587l9285l6924l3225k9170k5438k2175j9348j6841j4414j2036j0077
$$ 649587 610302 573378 540153 510983 485545 463370 444022 427181 412767 400731 390654
51343C90654q897q323p783o705m814k410n13o4p21j103n61J01J28J17Q46J642
$$ 390654 381757 373434 365651 358946 354132 351722 351209 351145 350424 349321 348760 348861 348989 349106 349952 351594
51327C51594J223k45j354j504j421j536j354p73o47j331j901j623j144j275j505
$$ 351594 352817 352572 351218 349714 348293 346757 345403 344630 343983 342652 340751 339128 337984 336709 335204
51312C35204r06J78O19L10J50M00L27l85j017j024q88j234j803j920j505j047
$$ 335204 334298 334476 335095 335405 335555 335955 336282 335897 334880 333856 332968 331734 329931 328011 326506 325459
51296C25459q64q26o98m11p0J70K63L96P49J157J302J277J579K393L308L881M117
$$ 325459 324595 323769 323071 322660 322590 322760 323023 323419 324168 325325 326627 327904 329483 331876 335184 339065 343182
51279C43182M189M048L623L098K630K106J454R32P69Q45J027J451K036K171J576
$$ 343182 347371 351419 355042 358140 360770 362876 364330 365262 366031 366876 367903 369354 371390 373561 375137
51264C75137J061J552K534K483J006n33r82r88j797l299m284m309m133m342m532
$$ 375137 376198 377750 380284 382767 383773 383240 382258 381270 379473 376174 371890 367581 363448 359106 354574
51249C54574m213l642l247k818j895o55K04L51J36K2J12K64L80M21K81j04n69
$$ 354574 350361 346719 343472 340654 338759 338104 338308 338659 338795 338817 338929 339193 339573 339994 340275 340171 339602
51232C39602p04k15O73J315J342J134J334J924K179J674P92M5o62j522k089j717
$$ 339602 338898 338683 339356 340671 342013 343147 344481 346405 348584 350258 351050 351095 350433 348911 346822 345105
51216C45105o05K76M07J93J38J68Q7J09M96J054J411J517J530J540J717K361L336
$$ 345105 344500 344776 345183 345376 345514 345682 345769 345878 346374 347428 348839 350356 351886 353426 355143 357504 360840
51199C60840L848L307K202J481J262R12L05N2L59M79j92j176j637j532j333j005
$$ 360840 364688 367995 370197 371678 372940 373852 374157 374209 374568 375047 374855 373679 372042 370510 369177 368172
51183C68172j26J071J597R47j78p41n28p6K62O27J087J247P10k58q16l98O57J482
$$ 368172 368046 369117 370714 371661 371483 370742 370214 370138 370400 371027 372114 373361 374071 373813 372997 372599 373256 374738
51165C74738J573J183Q11O21M92L96L80K80j40p68j226j472j873k526k892k535
$$ 374738 376311 377494 378305 378926 379418 379814 380194 380474 380334 379566 378340 376868 374995 372469 369577 367042
51149C67042j851j553j657j547j043p02r16j301j319r99o49k64K62O82O75M15
$$ 367042 365191 363638 361981 360434 359391 358689 357773 356472 355153 354154 353505 353241 353503 354185 354860 355275
51133C55275K71K04N0J48R28J888J996J262R46J688K435J935N81k45j00L55P73
$$ 355275 355546 355750 355800 355948 356876 358764 360760 362022 362968 364656 367091 369026 369607 369362 369262 369617 370390
51116C70390J485K405K772K363J991K219K444J893R62O65J143J562J352R33R94
$$ 370390 371875 374280 377052 379415 381406 383625 386069 387962 388924 389589 390732 392294 393646 394579 395573
51101C95573J622K268K352J708O38l40q79q85l77N73J633K275K292K031J902J857
$$ 395573 397195 399463 401815 403523 404161 403821 402942 402057 401680 402253 403886 406161 408453 410484 412386 414243
51085D14243J630J230Q79N80K13r1k0M15Q28R59R19Q99R63J226J882K888L780
$$ 414243 415873 417103 417982 418562 418775 418684 418664 419079 419907 420866 421785 422684 423647 424873 426755 429643 433423
51068D33423M056L663L068K931L665N163O922Q549J0196J2312J4915J7271J8417
$$ 433423 437479 441142 444210 447141 450806 455969 462891 471440 481636 493948 508863 526134 544551
51055E44551J7917J6159J3995J2195J1100J0694J0875J1477J1983J1526R607O688
$$ 544551 562468 578627 592622 604817 615917 626611 637486 648963 660946 672472 682079 688767
51043F88767L749J196j454m699q173j0842j1867j1172r376p422o186o118p104
$$ 688767 692516 693712 692258 687559 679386 668544 656677 645505 636129 628707 622521 616403 609299
51030F09299q663j0298j1729j2863j3547j3390j2024r632p046n058l712k532j196
$$ 609299 600636 590338 578609 565746 552199 538809 526785 517153 510107 505049 501337 498805 497609
51017D97609K69J923L924O042P616Q287Q484Q908R840J1095J2345J3170J3075
$$ 497609 497878 499801 503725 509767 517383 525670 534154 543062 552902 563997 576342 589512 602587
51004F02587J1920J0313R194Q978R204R084Q275P132O282N844N199L749J897P72
$$ 602587 614507 624820 634014 642992 652196 661280 669555 676687 682969 688813 694012 697761 699658 700430
50990G00430Q28J239J095P77J443L385N722P677R464J1577J3837J5630J6742J7502
$$ 700430 701258 702497 703592 704369 705812 709197 714919 722596 732060 743637 757474 773104 789846 807348
50976H07348J8291J9357K0898K2988K5503K8437L2173L7029M2601M7999N2876
$$ 807348 825639 844996 865894 888882 914385 942822 974995 1012024 1054625 1102624 1155500
50965A155500N7774O3194O8738P3624P7762Q1597Q4930Q6656Q6101Q4117Q2029
$$ 1155500 1213274 1276468 1345206 1418830 1496592 1578189 1663119 1749775 1835876 1919993 2002022
50954B002022P9726P5641O8829O0296N1686M3283L4140K3968J3912N247j787p456
$$ 2002022 2081748 2157389 2226218 2286514 2338200 2381483 2415623 2439591 2453503 2458750 2456963 2449507
50942B449507j1598j4109j5882j8279k1537k4560k6461k7567k8517k9164k9152
$$ 2449507 2437909 2423800 2407918 2389639 2368102 2343542 2317081 2289514 2260997 2231833 2202681
50931B202681k9095l0202l2760l5771l8259m0270m2401m4989m8095n1708n5422
$$ 2202681 2173586 2143384 2110624 2074853 2036594 1996324 1953923 1908934 1860839 1809131 1753709
50920A753709n8358n9896o0254n9906n8755n6429n3128m9566m6150m2774l9404
$$ 1753709 1695351 1635455 1575201 1515295 1456540 1400111 1346983 1297417 1251267 1208493 1169089
50909A169089l6246l3270l0190k7026k4225k2046k0245j8557j7017j5621j4115
$$ 1169089 1132843 1099573 1069383 1042357 1018132 996086 975841 957284 940267 924646 910531
50898I10531j2354j0504q608o498m367k986k793l168l097k405j740j440j051o8
$$ 910531 898177 887673 879065 872567 868200 865214 862421 859253 856156 853751 852011 850571 849520 849452
50884H49452J270K261K661L016M008N592P041P890Q561R712J1206J2333J2933
$$ 849452 850722 852983 855644 858660 862668 868260 875301 883191 891752 901464 912670 925003 937936
50871I37936J3658J4932J6431J7894J9686K2044K4407K6274K8177L0978L4518
$$ 937936 951594 966526 982957 1000851 1020537 1042581 1066988 1093262 1121439 1152417 1186935
50860A186935L7932M1144M5059N0204N6105O2259O8969P6852Q6100R6579J08143
$$ 1186935 1224867 1266011 1311070 1361274 1417379 1479638 1548607 1625459 1711559 1808138 1916281
50849A916281J20343J32314J43329J53373J62849J71913J80290J87436J92684
$$ 1916281 2036624 2168938 2312267 2465640 2628489 2800402 2980692 3168128 3360812
50840C360812J95369J95031J91310J83602J71115J53532J31484J06233P9084N1181
$$ 3360812 3556181 3751212 3942522 4126124 4297239 4450771 4582255 4688488 4767572 4818753
50830D818753K3600k629k6539m7163o3630p5407q2368q4616q2479p6709o8514
$$ 4818753 4842353 4839724 4813185 4766022 4702392 4626985 4544617 4460001 4377522 4300813 4232299
50819D232299n9232n0035m1956l5893l2610l2731l6626m4092n4231o5987p8694
$$ 4232299 4173067 4123032 4081076 4045183 4012573 3979842 3943216 3899124 3844893 3778906 3700212
50808C700212r1869j04670j16124j25821j33828j39901j43317j43619j41009j35873
$$ 3700212 3608343 3503673 3387549 3261728 3127900 2987999 2844682 2701063 2560054 2424181
50798B424181j28505j19514j09844j00008q9743p8870o8061n8253m9618m1611
$$ 2424181 2295676 2176162 2066318 1966310 1876567 1797697 1729636 1671383 1621765 1580154
50788A580154l3847k6485j9922j4462j0259p251n192l944l590m080n012n896o557
$$ 1580154 1546307 1519822 1499900 1485438 1475179 1467928 1462736 1458792 1455202 1451122 1446110 1440214 1433657
50775A433657p085p650q434r568j0944j2304j3607j5033j6559j7911j8947j9695
$$ 1433657 1426572 1418922 1410488 1400920 1389976 1377672 1364065 1349032 1332473 1314562 1295615 1275920
50763A275920k0029j9852j9618j9963k0568k0223j8374j5876j3709j1731r406
$$ 1275920 1255891 1236039 1216421 1196458 1175890 1155667 1137293 1121417 1107708 1095977 1086571
50752A086571o961m944l073n32K887O685J0457J4053J7307K0384K4042K8748L3869
$$ 1086571 1079610 1074666 1071593 1071061 1073948 1080633 1091090 1105143 1122450 1142834 1166876 1195624 1229493
50739A229493L8560M3028M7942N3061N7742O2443O8234P4839Q0702Q5262Q9594
$$ 1229493 1268053 1311081 1359023 1412084 1469826 1532269 1600503 1675342 1756044 1841306 1930900
50728A930900R4313R8303J00323J00665J00270R9247R7211R4152Q9813Q2964P2481
$$ 1930900 2025213 2123516 2223839 2324504 2424774 2524021 2621232 2715384 2805197 2888161 2960642
50717B960642N8747M3014K5842P247j1962l0064m5579n7690o5695o9084o8190
$$ 2960642 3019389 3062403 3088245 3095492 3083530 3053466 3007887 2950197 2884502 2815418 2747228
50706B747228o4038n7535m9463m1035l3475k6951k0865j5389j1829j1158j3070
$$ 2747228 2683190 2625655 2576192 2535157 2501682 2474731 2453866 2438477 2426648 2415490 2402420
50695B402420j6963k3018l1554m1826n2253o1684o9738p6033p9714q0128p7629
$$ 2402420 2385457 2362439 2330885 2289059 2236806 2175122 2105384 2029351 1949637 1869509 1791880
50684A791880p3460o8750o3675n7586n0072m1775l3883k6842j9923j2343m422
$$ 1791880 1718420 1649670 1585995 1528409 1478337 1436562 1402679 1375837 1355914 1343571 1339149
50673A339149K794Q867J4340J9721K4640K8311L0426L1085L0242K7819K4455K1382
$$ 1339149 1341943 1350810 1365150 1384871 1409511 1437822 1468248 1499333 1529575 1557394 1581849 1603231
50661A603231J9322J7849J6204J4301J2530J1006R575Q375P712P424O948O075
$$ 1603231 1622553 1640402 1656606 1670907 1683437 1694443 1704018 1712393 1720105 1727529 1734477 1740552
50649A740552N165M554M326M683N930P934J0223J2789J6080J9990K3607K6447
$$ 1740552 1745717 1750271 1754597 1759280 1765210 1773144 1783367 1796156 1812236 1832226 1855833 1882280
50637A882280K9175L2452L5707L7845L8658L8693L8181L7106L6135L6350L7842
$$ 1882280 1911455 1943907 1979614 2017459 2056117 2094810 2132991 2170097 2206232 2242582 2280424
50626B280424L9305L9053L5695K8002J5347j030j7912l1933m1379m6255m7269
$$ 2280424 2319729 2358782 2394477 2422479 2437826 2436796 2418884 2386951 2345572 2299317 2252048
50615B252048m5272m1066l5253k8391k1424j5406j0496n828r28L206N090M349
$$ 2252048 2206776 2165710 2130457 2102066 2080642 2065236 2054740 2048912 2047984 2051190 2056280 2060629
50603B060629J642k682q884j6774k5185l2891l9589m5629n1121n5611n8522n9637
$$ 2060629 2062271 2059589 2050705 2033931 2008746 1975855 1936266 1890637 1839516 1783905 1725383 1665746
50591A665746n9280n8159n6905n5651n4066n1753m8592m4769m0690l6843l3469
$$ 1665746 1606466 1548307 1491402 1435751 1381685 1329932 1281340 1236571 1195881 1159038 1125569
50580A125569l0387k7268k4117k1199j8476j5462j1818p916m481j824L97K681
$$ 1125569 1095182 1067914 1043797 1022598 1004122 988660 976842 968926 964445 962621 963018 965699
50568I65699N120P386R118J0376J1646J3370J5434J7381J9136K1189K3811K6387
$$ 965699 970819 978205 987323 997699 1009345 1022715 1038149 1055530 1074666 1095855 1119666 1146053
50556A146053K8014K8649K9124L0025L1029L1576L1647L1499L1028K9900K8160
$$ 1146053 1174067 1202716 1231840 1261865 1292894 1324470 1356117 1387616 1418644 1448544 1476704
50545A476704K6293K4798K3970K3991K4804K6016K7359K9124L1730L4959L8218
$$ 1476704 1502997 1527795 1551765 1575756 1600560 1626576 1653935 1683059 1714789 1749748 1787966
50534A787966M1456M5188M9519N3819N7635O1251O5042O8960P3134P8251Q4575
$$ 1787966 1829422 1874610 1924129 1977948 2035583 2096834 2161876 2230836 2303970 2382221 2466796
50523B466796R1072R6267R9687J01635J01878R9495R4135Q6502P7390O6871N4659
$$ 2466796 2557868 2654135 2753822 2855457 2957335 3056830 3150965 3237467 3314857 3381728 3436387
50512C436387M0648K4834P369j0946k8703m4870n9352p2259q3083r0944r5282
$$ 3436387 3477035 3501869 3509238 3498292 3469589 3424719 3365367 3293108 3210025 3119081 3023799
50501C023799r5940r2903q6441p7286o6085n2966l8072k2389p461N751J7235K7130
$$ 3023799 2927859 2834956 2748515 2671229 2605144 2552178 2514106 2491717 2484256 2490007 2507242 2534372
50489B534372L5017M0052M1369L8243L0232J7557J199j7494l7110n6072p2709
$$ 2534372 2569389 2609441 2650810 2689053 2719285 2736842 2738041 2720547 2683437 2627365 2554656
50478B554656q5895r5482j01824j04955j04647j01232r5896q9873q3683p7358
$$ 2554656 2468761 2373279 2271455 2166500 2061853 1960621 1864725 1774852 1691169 1613811
50468A613811p1116o5310n9939n4744m9893m5961m3003m0118l6342l1674k6763
$$ 1613811 1542695 1477385 1417446 1362702 1312809 1266848 1223845 1183727 1147385 1115711 1088948
50457A088948k1938j7076j2331q273n160k617k08K134M368O569Q608J0100J1046
$$ 1088948 1067010 1049934 1037603 1029330 1024170 1021553 1021345 1023479 1027847 1034416 1043024 1053124 1064170
50444A064170J2084J3668J5331J6309J6666J7096J7638J7326J5374J2283R331
$$ 1064170 1076254 1089922 1105253 1121562 1138228 1155324 1172962 1190288 1205662 1217945 1227276
50433A227276P187N482L651J782M45r5j48l9M15J566L203M560N238N804P230R862
$$ 1227276 1234463 1239945 1243596 1245378 1245823 1245728 1245580 1245541 1245956 1247522 1250725 1255285 1260523 1266327 1273557 1283419
50417A283419J3219J6730K0358K4454K9166L4091L8512M1969M4735M7499N0544
$$ 1283419 1296638 1313368 1333726 1358180 1387346 1421437 1459949 1501918 1546653 1594152 1644696
50406A644696N3282N4868N5105N4481N3340N1381M8105M3446L7736L1212K3777
$$ 1644696 1697978 1752846 1807951 1862432 1915772 1967153 2015258 2058704 2096440 2127652 2151429
50395B151429J5179N295n685j7188k8456l8902m8213n6015o1679o4717o5297o4035
$$ 2151429 2166608 2171903 2166218 2149030 2120574 2081672 2033459 1977444 1915765 1851048 1785751 1721716
50383A721716o1193n6421m9532m1271l2942k5287j8011j0485k650M812J0984J5241
$$ 1721716 1660523 1604102 1554570 1513299 1480357 1455070 1437059 1426574 1423924 1428736 1439720 1454961
50371A454961J7430J7740J6366J3195P979Q49p431j5871k3789l0787l6417m0164
$$ 1454961 1472391 1490131 1506497 1519692 1527671 1528520 1521089 1505218 1481429 1450642 1414225 1374061
50359A374061m1852m1853m0788l9051l6677l3553k9769k5721k1861j8364j5241
$$ 1374061 1332209 1290356 1249568 1210517 1173840 1140287 1110518 1084797 1062936 1044572 1029331
50348A029331j2783j1590j2026j3797j6256j8869k1148k2488k2520k1488j9840
$$ 1029331 1016548 1004958 992932 979135 962879 944010 922862 900374 877854 856366 836526
50337H36526j7554j4342j0459o768l893j753j1J450K688L865M996N861O444P140
$$ 836526 818972 804630 794171 787403 783510 781757 781746 783196 785884 789749 794745 800606 807050 814190
50323H14190Q226R389J0015R797Q896P709O679O086N802N411M717L893L105K287
$$ 814190 822416 831805 841820 851617 860513 868222 874901 880987 886789 892200 896917 900810 903915 906202
50309I06202J370M95k19p56r58n75K91J097J509J764K211K864L588M304M812M950
$$ 906202 907572 908067 907848 907092 906134 905559 905850 906947 908456 910220 912431 915295 918883 923187 927999 932949
50293I32949N098N921P216P803P124O238O355P076P130O391N874N800N062K986
$$ 932949 938047 943968 951184 958987 966111 972349 978704 985780 992910 999301 1005175 1010975 1016037 1019023
50279A019023N23q96r71m42O9M76Q72J301J806K446L242M163N026N525N640N917
$$ 1019023 1019546 1018650 1017679 1017237 1017306 1017782 1018654 1019955 1021761 1024207 1027449 1031612 1036638 1042163 1047803 1053720
50263A053720O918Q472J0027J1590J3783J6788K0022K2926K5477K7622K8918K9168
$$ 1053720 1060638 1069110 1079137 1090727 1104510 1121298 1141320 1164246 1189723 1217345 1246263 1275431
50251A275431K8856K8541K8197K7588K6832K6165K5437K4295K2542J9909J5836
$$ 1275431 1304287 1332828 1361025 1388613 1415445 1441610 1467047 1491342 1513884 1533793 1549629
50240A549629R987K853m620j1810j8539k4576k9437l2581l3612l2487k9819k6780
$$ 1549629 1559616 1562469 1557849 1546039 1527500 1502924 1473487 1440906 1407294 1374807 1344988 1318208
50228A318208k4399k3120k3133k4649k7448l0620l3316l5500l7376l8410l7625
$$ 1318208 1293809 1270689 1247556 1222907 1195459 1164839 1131523 1096023 1058647 1020237 982612
50217I82612l4925l1371k7990k4916k1862j8921j6452j4482j2636j0684q820p395
$$ 982612 947687 916316 888326 863410 841548 822627 806175 791693 779057 768373 759553 752158
50205G52158o456n698m881m134l672l358k843k218k017k460l057l281l251l342
$$ 752158 745702 740004 735123 730989 727317 723959 721116 718898 716881 714421 711364 708083 704832 701490
50191G01490l490l392l180l286l726m068m046l797l490l185l071l275l487l217
$$ 701490 698000 694608 691428 688142 684416 680348 676302 672505 669015 665830 662759 659484 655997 652780
50177F52780k568k179k262k276j751r70m45j74K36R59J868K813L607L979L872
$$ 652780 650212 648033 645771 643495 641744 640774 640329 640155 640391 641350 643218 646031 649638 653617 657489
50162F57489L672L870M530N428O553Q075R897J1585J2885J4042J5453J7149J8817
$$ 657489 661161 665031 669561 674989 681542 689617 699514 711099 723984 738026 753479 770628 789445
50149G89445K0258K1671K3352K5272K7152K8997L1287L4439L8266M2308M6484
$$ 789445 809703 831374 854726 879998 907150 936147 967434 1001873 1040139 1082447 1128931
50138A128931N0872N4894N7385N7852N7216N6826N7036N7247N6980N6279N5045
$$ 1128931 1179803 1234697 1292082 1349934 1407150 1463976 1521012 1578259 1635239 1691518 1746563
50127A746563N2715M8698M2740L4579K3827J0526m373j9372l3164m4940n4379
$$ 1746563 1799278 1847976 1890716 1925295 1949122 1959648 1955275 1935903 1902739 1857799 1803420
50116A803420o1607o6868o9965p0299o7877o3850n9588n5379n0679m5475m0643
$$ 1803420 1741813 1674945 1604980 1534681 1466804 1402954 1343366 1287987 1237308 1191833 1151190
50105A151190l6881l4052l1820l0185k8996k7532k5256k2513j9930j7489j4855
$$ 1151190 1114309 1080257 1048437 1018252 989256 961724 936468 913955 894025 876536 861681
50094H61681j2188r896p794n392k909j138j39R42K584M151M927N150N507O160
$$ 861681 849493 839597 831803 826411 823502 822364 822225 823167 825751 829902 834829 839979 845486 851646
50080H51646O771P106P096O627N691M488L088J463M8m25p4j44j412k991l621l542
$$ 851646 858417 865523 872619 879246 884937 889425 892513 893976 894024 893599 893525 893381 891969 888978 885357 881815
50064H81815l929m890n344n015n024o111p310p238n914m484l700l391l128k641
$$ 881815 877886 872996 867652 862637 857613 851502 844192 836954 831040 826556 822856 819465 816337 813696
50050H13696j646M5K142L947N046N744O703Q186R775J0893J1526J2136J2872J3275
$$ 813696 812050 812095 814237 818184 823230 828974 835677 843863 853638 864531 876057 888193 901065 914340
50036I14340J3105J2971J3492J4219J4182J3432J3060J3584J4238J4271J4076
$$ 914340 927445 940416 953908 968127 982309 995741 1008801 1022385 1036623 1050894 1064970
50025A064970J4432J5327J6288J7393J9149K1570K3991K5713K6430K6205K5434
$$ 1064970 1079402 1094729 1111017 1128410 1147559 1169129 1193120 1218833 1245263 1271468 1296902
50014A296902K4585K3685K2319K0497J9001J8357J7902J6536J3981J0553O024
$$ 1296902 1321487 1345172 1367491 1387988 1406989 1425346 1443248 1459784 1473765 1484318 1490342
50003A490342k80q256j6860k5243l3151l9964m4398m5803m5159m3996m2740m0672
$$ 1490342 1490062 1481806 1464946 1439703 1406552 1366588 1322190 1276387 1231228 1187232 1144492 1103820
49991A103820l7337l3286k9482k6484k4312k2762k1656k0977k0815k1091k1388
$$ 1103820 1066483 1033197 1003715 977231 952919 930157 908501 887524 866709 845618 824230
49980H24230k1145k0123j8581j6985j5570j4191j2597j0791r132q000p418p044
$$ 824230 803085 782962 764381 747396 731826 717635 705038 694247 685115 677115 669697 662653
49968F62653o532n823n156m785m698m607m295l874l526l013j815R1J953L047L518
$$ 662653 656121 650298 645142 640357 635659 631052 626757 622883 619357 616344 614529 614620 616573 619620 623138
49953F23138M045M912N815O539P242Q018Q608Q731Q383P669O571N081L386J790
$$ 623138 627183 632095 637910 644449 651691 659709 668317 677048 685431 693100 699671 704752 708138 709928
49939G09928N34l10r49j885l602o119q937j1416j3053j3589j3171j2427j1951
$$ 709928 710462 710152 709203 707318 703716 697597 688660 677244 664191 650602 637431 625004 613053
49926F13053j1675j0972r488p586n895m739l987l220j982j98J527K400K328K001
$$ 613053 601378 590406 580918 573332 567437 562698 558711 555491 553509 553311 554838 557238 559566 561567
49912E61567J990K166K195K166K427L122M218N695P319Q526Q896Q731Q794R474
$$ 561567 563557 565723 567918 570084 572511 575633 579851 585546 592865 601391 610287 619018 627812 637286
49898F37286J0399J0783J0092Q449O518M830L273J416o78k417l522m429n631p027
$$ 637286 647685 658468 668560 677009 683527 688357 691630 693046 692368 689951 686429 682000 676369 669342
49884F69342q234r148r842j0340j0750j1305j1820j1646j0584r339q537p791o501
$$ 669342 661108 651960 642118 631778 621028 609723 597903 586257 575673 566334 557797 550006 543505
49871E43505n008m063l489k501j210o47j069j353m85J253L047M631O117P395Q378
$$ 543505 538497 534434 530945 528444 527234 526587 525518 524165 523680 524933 527980 532611 538728 546123 554501
$$ [...]
##END NTUPLES=NMR SPECTRUM
##END=
