
##TITLE=AC1177_popayan-inza-1-cauca-CINAH12012_5890806_j3gYLsKNoV
##JCAMPDX= 6.0         $$ Bruker NMR JCAMP-DX V2.0
##DATA TYPE= NMR SPECTRUM
##DATA CLASS= NTUPLES
##ORIGIN= BRUKER
##OWNER= Administrator
$$ 1.72 TOPSPIN		Version 2.1
$$ 2012-04-02 16:55:07.031 -0500  Administrator@TOPSPIN
$$ Compression mode = diff/dup
##.OBSERVE FREQUENCY= 400.13188235
##.OBSERVE NUCLEUS= ^1H
##.ACQUISITION MODE= SIMULTANEOUS (DQD)
##.ACQUISITION SCHEME= undefined
##.AVERAGES= 8
##.DIGITISER RES= 22
##SPECTROMETER/DATA SYSTEM= spect
##.PULSE SEQUENCE= zg30
##.SOLVENT NAME= COFFEE_meoh
##.SHIFT REFERENCE= INTERNAL, COFFEE_meoh, 1, 14.98061
##AUDIT TRAIL= $$ (NUMBER, WHEN, WHO, WHERE, PROCESS, VERSION, WHAT)
$$ ##TITLE= Audit trail, TOPSPIN		Version 2.1
$$ ##JCAMPDX= 5.01
$$ ##ORIGIN= Bruker BioSpin GmbH
$$ ##OWNER= Administrator
$$ $$ C:\Bruker\TOPSPIN/data/COFFEE/nmr/AC1177_popayan-inza-1-cauca-CINAH12012_5890806_j3gYLsKNoV/10/pdata/1/auditp.txt
$$ ##AUDIT TRAIL=  $$ (NUMBER, WHEN, WHO, WHERE, PROCESS, VERSION, WHAT)
(   1,<2012-04-02 16:54:57.859 -0500>,<Administrator>,<TOPSPIN>,<go>,<TOPSPIN 2.1>,
      <created by zg
	started at 2012-04-02 16:53:50.796 -0500,
	POWCHK enabled, PULCHK disabled,
       configuration hash MD5:
       1A 1E CE 29 27 FD 77 03 67 4E F0 E3 C4 B2 CB 90
       data hash MD5: 64K
       EC E1 E3 77 8D 64 EB 1D D0 29 8E 56 76 A0 46 E5>)
(   2,<2012-04-02 16:55:01.343 -0500>,<Administrator>,<TOPSPIN>,<proc1d>,<TOPSPIN 2.1>,
      <Start of raw data processing
       efp LB = 0 FT_mod = 6 PKNL = 1 PHC0 = 0 PHC1 = 0 SI = 32K 
       data hash MD5: 32K
       51 1E 36 BF FC 4A 46 DC 2C DE A3 35 9B 37 17 CA>)
(   3,<2012-04-02 16:55:01.734 -0500>,<Administrator>,<TOPSPIN>,<proc1d>,<TOPSPIN 2.1>,
      <pk PHC0 = 210.0146 PHC1 = 0 
       data hash MD5: 32K
       63 BE FA F8 9E D2 19 BC 75 F3 B2 57 54 DA 5F D8>)
(   4,<2012-04-02 16:55:01.968 -0500>,<Administrator>,<TOPSPIN>,<proc1d>,<TOPSPIN 2.1>,
      <abs ABSG = 1 
       data hash MD5: 32K
       1A 6A FB 8E 4C 23 1C 8C 17 2E FF 20 6B 6B F5 0F>)
(   5,<2012-04-02 16:55:02.078 -0500>,<Administrator>,<TOPSPIN>,<proc1d>,<TOPSPIN 2.1>,
      <abs ABSG = 2 
       data hash MD5: 32K
       76 B7 1B DE 2E B1 C6 F5 9E E2 3A FC 2E D9 B1 28>)
(   6,<2012-04-02 16:55:02.140 -0500>,<Administrator>,<TOPSPIN>,<proc1d>,<TOPSPIN 2.1>,
      <abs ABSG = 3 
       data hash MD5: 32K
       E9 D8 D5 3F 50 23 32 8E EE 45 73 73 65 D6 AF 93>)
(   7,<2012-04-02 16:55:02.171 -0500>,<Administrator>,<TOPSPIN>,<proc1d>,<TOPSPIN 2.1>,
      <abs ABSG = 4 
       data hash MD5: 32K
       05 84 9E 5C DD 2A 92 52 47 BD BC 16 36 77 D5 83>)
(   8,<2012-04-02 16:55:02.218 -0500>,<Administrator>,<TOPSPIN>,<proc1d>,<TOPSPIN 2.1>,
      <abs ABSG = 5 
       data hash MD5: 32K
       98 CC 7B 7C 6A 92 42 16 78 84 19 42 9F 6E 4B 0C>)
$$ ##END=
$$ 
$$ $$ hash MD5
$$ $$ 0C 89 FC 77 B9 D9 AD 6D 60 3D 6F 66 34 B2 D2 C0
##$RELAX= 
##$RELAX= 
##$RELAX= 
##$RELAX= 
##$RELAX= 
##$RELAX= 
##$RELAX= 
$$ Bruker specific parameters
$$ [...]
##$TP= (0..7)
150 150 150 150 150 150 150 150
##$TP07= 0
##$TPNAME0= <>
##$TPNAME1= <>
##$TPNAME2= <>
##$TPNAME3= <>
##$TPNAME4= <>
##$TPNAME5= <>
##$TPNAME6= <>
##$TPNAME7= <>
##$TPOAL= (0..7)
0.5 0.5 0.5 0.5 0.5 0.5 0.5 0.5
##$TPOFFS= (0..7)
0 0 0 0 0 0 0 0
##$TUNHIN= 0
##$TUNHOUT= 0
##$TUNXOUT= 0
##$USERA1= <user>
##$USERA2= <user>
##$USERA3= <user>
##$USERA4= <user>
##$USERA5= <user>
##$V9= 5
##$VALIST= <valist>
##$VCLIST= <CCCCCCCCCCCCCCC>
##$VD= 0
##$VDLIST= <DDDDDDDDDDDDDDD>
##$VPLIST= <PPPPPPPPPPPPPPP>
##$VTLIST= <TTTTTTTTTTTTTTT>
##$WBST= 2048
##$WBSW= 25
##$XGAIN= (0..3)
0 0 0 0
##$XL= 0
##$YL= 0
##$YMAX_a= 528504
##$YMIN_a= -656506
##$ZGOPTNS= <>
##$ZL1= 120
##$ZL2= 120
##$ZL3= 120
##$ZL4= 120
##$ABSF1= 14.98061
##$ABSF2= -5.57192
##$ABSG= 5
##$ABSL= 3
##$ALPHA= 0
##$AQORDER= 0
##$ASSFAC= 0
##$ASSFACI= 0
##$ASSFACX= 0
##$ASSWID= 0
##$AUNMP= <proc_prof1d_extract_pilot.lims>
##$AXLEFT= 0
##$AXNAME= <>
##$AXNUC= <1H>
##$AXRIGHT= 0
##$AXTYPE= 0
##$AXUNIT= <>
##$AZFE= 0.1
##$AZFW= 0.1
##$BCFW= 0
##$BC_mod= 0
##$BYTORDP= 0
##$COROFFS= 0
##$CY= 15
##$DATMOD= 1
##$DC= 0
##$DFILT= <>
##$DTYPP= 0
##$F1P= 0
##$F2P= 0
##$FCOR= 0.5
##$FTSIZE= 32768
##$FT_mod= 6
##$GAMMA= 0
##$GB= 0
##$INTBC= 1
##$INTSCL= 1
##$ISEN= 128
##$LB= 0
##$LEV0= 0
##$LPBIN= 0
##$MAXI= 10000
##$MC2= 0
##$MEAN= 0
##$ME_mod= 0
##$MI= 0
##$NCOEF= 0
##$NC_proc= -8
##$NLEV= 6
##$NOISF1= 0
##$NOISF2= 0
##$NSP= 0
##$NTH_PI= 0
##$NZP= 0
##$OFFSET= 14.98061
##$PC= 1
##$PHC0= 210.0146
##$PHC1= 0
##$PH_mod= 1
##$PKNL= yes
##$PPARMOD= 0
##$PPDIAG= 0
##$PPIPTYP= 0
##$PPMPNUM= 2147483647
##$PPRESOL= 1
##$PSCAL= 4
##$PSIGN= 0
##$PYNMP= <proc.py>
##$REVERSE= no
##$SF= 400.13
##$SI= 32768
##$SIGF1= 0
##$SIGF2= 0
##$SINO= 400
##$SIOLD= 32768
##$SPECTYP= <>
##$SREGLST= <1H.CDCl3>
##$SSB= 0
##$STSI= 32768
##$STSR= 0
##$SW_p= 8223.68421052632
##$SYMM= 0
##$S_DEV= 0
##$TDeff= 65536
##$TDoff= 0
##$TI= <>
##$TILT= no
##$TM1= 0
##$TM2= 0
##$TOPLEV= 0
##$USERP1= <user>
##$USERP2= <user>
##$USERP3= <user>
##$USERP4= <user>
##$USERP5= <user>
##$WDW= 1
##$XDIM= 32768
##$YMAX_p= 466967426
##$YMIN_p= -754643
##$CURPLOT= <Network HP LaserJet P1505>
##$CURPRIN= <$Network HP LaserJet P1505>
##$DFORMAT= <normdp>
##$LAYOUT= <+/1D_H.xwp>
##$LFORMAT= <normlp>
##$PFORMAT= <normpl>
##$SURQMSG= 1
$$ End of Bruker specific parameters
$$ ---------------------------------
##NTUPLES= NMR SPECTRUM
##VAR_NAME=  FREQUENCY,     SPECTRUM/REAL,   SPECTRUM/IMAG
##SYMBOL=    X,             R,               I
##VAR_TYPE=  INDEPENDENT,   DEPENDENT,       DEPENDENT
##VAR_FORM=  AFFN,          ASDF,            ASDF
##VAR_DIM=   32768,         32768,           32768
##UNITS=     HZ,            ARBITRARY UNITS, ARBITRARY UNITS
##FACTOR=    0.250966925370066, 1,           1
##FIRST=     8223.43324360095, -157082,      122580
##LAST=      0,             -148588,         -70763
##MIN=       0,             -754643,         0
##MAX=       8223.43324360095, 466967426,    0
$$ Real data points
##PAGE= N=1
##DATA TABLE= (X++(R..R)), XYDATA
$$ [...]
$$ plain form
19456 -106628 -180668 -170916 -73765 -81747 77499 -133918 196902 -262300 28677 -179750 138299
19444 -213243 305623 -260874 -76340 151084 -246640 -50360 148910 -155424 -16159 -67435
19434 -67435 -194197 -264366 49314 -129219 -236402 -32902 115652 111337 -323919 -157906 -471558
19423 -471558 -156192 -316339 -168439 102459 205146 -56172 -355792 -82973 299364 -23596
19412 -132748 168859 69529 -11193 -28677 16158 -84368 -231663 187841 -150445 151772
19401 -305184 119187 -130761 -72393 -34556 -53517 -293728 -214340 110146 -352170 -163756
19390 100907 -12329 92848 -258816 129745 -259339 -143628 -375750 -56901 -268201 -30050
19379 135118 177970 169639 -161006 -467186 -110889 -78359 -182739 51151 -255731 -118083
$$ packed form
19456a06628p4040R752g3765p982G7499a33918A96902b62300B8677a79750A38299
19444b13243C05623b60874g6340A51084b46640e0360A48910a55424a6159n1276
19434f7435j26762p0169D9314a29219j07183c2902A15652m315c23919a57906l13652
19423d71558a56192j60147J47900A02459J02687e6172k99620h2973B99364b3596
19412a32748A68859F9529a1193j7484A6158h4368j47295A87841a50445A51772
19401c05184A19187a30761N8368c4556j8961k40211P9388A10146c52170a63756
19390A00907a2329I2848b58816A29745b59339J15711k32122e6901k11300c0050
19379A35118M2852q331a61006l06180a10889L2530j04380E1151b55731a18083
$$ plain form
19368 -195805 -103597 -61929 216680 53690 9642 -8976 -297246 -50371 -318898 19173 93208
19357 93208 -12248 -307121 -58480 21856 -143060 -106087 17613 32513 -65983 140772 -144927
19345 -49406 209740 -183957 -152542 129553 -141907 222125 -26276 -255156 152130 209568
19335 209568 -182813 -149778 79919 -182843 -320715 -104478 130460 -18368 -322407 -61536
19324 -61519 52140 24389 -161495 22265 100617 223339 -192404 -127968 -189660 -145459 108023
19312 -46922 -145881 -255861 199352 185627 -128036 -208440 -161357 42617 -43448 52257 234970
19301 234970 -140291 -187334 -34827 -98061 -34172 82521 -72375 33642 -66257 -130600 -62629
19289 -241462 58196 -227501 -58026 96578 256679 -82321 -347814 -353480 149214 -128073 -108628
$$ packed form
19368a95805R2208M1668B16680E3690I642h976k88270e0371k68527A9173P4035
19357I3208a2248k94873e8480B1856a43060L6973A7613J4900f5983A40772a44927
19345d9406B09740a83957L1415A29553a41907B22125b6276k28880A52130N7438
19335B09568a82813L3035G9919a82843j37872a04478A30460a8368l04039f1536
19324f1519E2140B4389a61495B2265P8352J22722a92404O4436o1692M4201A08023
19312d6922r8959j09980A99352j3725a28036q0404M7083D2617d3448E2257J82713
19301B34970a40291m7043c4827o3234c4172H2521g2375C3642f6257o4343f2629
19289b41462E8196b27501e8026I6578J60101h2321k65493n666A49214a28073J9445
$$ plain form
19278 -108628 -227140 -134543 -269331 -189414 -167189 -3436 -64522 337902 -29916 -99733 -266961
19267 -266961 -68324 18540 241931 -291271 -191085 -263627 -173855 -103858 599535 -354457
19256 -181362 11388 -410506 -136643 -203088 119237 -170909 -91447 53499 210245 -120687
19245 -217756 37591 -178516 1709 -96905 -237285 244543 -104400 -213202 -211672 122335 -345855
19233 148377 -208185 -70772 143975 -228955 164417 11323 -300820 107737 73293 98328
19223 98328 86381 71045 -9248 -70852 -28986 56445 -77153 -98841 -162044 -104454 49192 -158870
19210 -20130 37797 72459 -378993 -11187 -115184 -186390 9656 69662 161033 -30504 -27811 18122
19197 -26722 -30529 -139829 135756 -64563 -14414 -402066 -151823 -120702 109272 337804 233214
$$ packed form
19278a08628j18512R2597j34788P9917K2225c436o1086C37902b9916o9817j67228
19267b66961f8324A8540K23391b91271J00186p2542Q9772O9997E99535c54457
19256a81362A1388d10506a36643o6445A19237a70909P9462E3499J56746a20687
19245b17756C7591a78516A709i6905j40380B44543a04400j08802J530A22335c45855
19233A48377b08185g0772A43975b28955A64417A1323c00820A07737l4444K5035
19223I8328j1947j5336i248o1604b8986E6445g7153k1688o3203N7590D9192a58870
19210b0130C7797L4662c78993a1187j03997p1206I656O0006R1371c0504K693A8122
19197b6722l807j09300A35756f4563a4414l87652a51823L1121A09272K28532j04590
$$ plain form
19186 233214 96493 -234450 -205688 148639 -239802 -199631 273818 -148676 92690 -324633
19175 91110 -91710 -106278 195681 80805 -32978 3419 -86393 -76028 -106595 53286 -81217 -179981
19163 -179981 219613 -141788 -323011 -79540 -65357 -159187 79518 -267385 -176427 -14639 -258403
19152 -258403 162512 40196 -188132 -109526 196767 169729 94229 -192823 218404 97521
19141 -94516 -253524 -66389 -51122 -111459 -114357 34350 -202489 -47924 -229263 234687 91853
19129 -264646 32638 -43777 -167325 -192217 -20755 -269872 -15644 -120761 -2902 92087 -2924
19117 -222262 125589 -176219 -211169 34433 270054 368767 -69601 7370 -59132 306912 -13126
19105 -71644 -5395 -389168 -24816 -55692 292839 172244 28844 -130992 -145965 36574 297234
$$ packed form
19186B33214I6493b34450K8762A48639b39802M0171B73818a48676I2690c24633
19175I1110i1710j4568A95681H0805c2978C419h6393J0365l0567E3286h1217r8764
19163a79981B19613a41788j81223g9540J4183r3830G9518b67385R0958a4639k43764
19152b58403A62512D0196a88132P8606A96767k7038p5500a92823B18404I7521
19141i4516j59008f6389J5267o0337k898C4350b02489d7924j81339B34687I1853
19129b64646C2638d3777j23548k4892b0755k49117a5644j05117b902I2087b924
19117b22262A25589a76219l4950C4433K35621R8713f9601G370e9132C06912a3126
19105g1644e395l83773b4816l0876B92839j20595B8844a30992j4973C6574K60660
$$ plain form
19094 297234 -17502 -110954 28567 -231609 186091 -304237 100710 -267720 -417831 170299
19083 29885 -32159 255230 188625 -83871 136208 -65711 28619 201143 -67062 9292 -119333
19071 199535 -203424 28824 149067 8466 -148391 224494 -149842 -4829 -294106 263485
19060 -152230 -249970 102411 225739 -11704 -171185 40584 -148828 -154327 -78335 101316 27490
19048 -103876 -39467 132672 -344409 -63329 104771 -141659 -196051 -289321 -139858 -100873
19038 -100873 -213970 151052 149375 -353670 161646 -219500 -76441 -100061 56049 -105280
19027 -128300 -38642 -75351 -437263 -112160 87939 -94498 -120761 206088 324599 -56817 34235
19015 -182825 89908 36687 70070 94792 58546 232473 43944 94170 138277 -18613 129589
$$ packed form
19094B97234a7502r3452B8567b31609A86091c04237A00710b67720j50111A70299
19083B9885c2159B55230o6605h3871A36208f5711B8619J72524f7062I292a19333
19071A99535b03424B8824J20243H466a48391B24494a49842d829k89277B63485
19060a52230r7740A02411J23328a1704j59481D0584a48828n499P5992A01316B7490
19048a03876c9467A32672c44409f3329A04771a41659n4392r3270a39858L8985
19038a00873j13097A51052j677c53670A61646b19500g6441k3620E6049a05280
19027a28300c8642l6709l61912a12160H7939i4498k6263B06088J18511e6817C4235
19015a82825H9908C6687L3383K4722l6246J73927D3944N0226M4107a8613A29589
$$ plain form
19003 143456 84443 109667 -33290 -56141 107095 -364056 -217849 57363 -116609 -164084 121051
18991 85108 -173276 -33686 395755 -210799 100446 113256 89683 100399 -63423 82398 -71815
18979 229144 -93908 4914 157741 -152254 291954 -30023 246159 -156228 -141704 407711
18968 -140941 52132 -149562 145954 -70692 -12258 -419004 -923 -267463 94882 192038 157115
18957 157115 330252 230787 -8349 220280 -22444 116195 191722 150150 -60601 -116160 -232552
18946 -232552 -230221 130615 15186 -110241 -137704 -38713 -30542 57492 307766 157369 57474
18934 -84780 91402 298327 -48674 -243673 128917 -110173 -126389 -191123 107569 21477 -91964
18922 -261717 -200364 -169480 -273960 20334 50450 78895 -195681 60141 222946 -497149 146694
$$ packed form
19003A43456n9013K5224c3290k2851A07095c64056J46207E7363a16609m7475A21051
18991H5108a73276c3686C95755b10799A00446J2810k3573J0716f3423H2398g1815
18979B29144i3908D914J52827a52254B91954c0023B46159a56228J4524D07711
18968a40941E2132a49562A45954g0692a2258m06746i23k66540I4882R7156l4923
18957A57115J73137r9465h349B20280b2444A16195P5527m1572f0601n5559j16392
18946b32552K331A30615A5186a10241k7463c8713Q171E7492K50274j50397E7474
18934h4780I1402K06925d8674j94999A28917a10173j6216o4734A07569B1477i1964
18922b61717O1353L0884j04480B0334L0116K8445a95681F0141J62805d97149A46694
$$ plain form
18910 182435 47578 -16942 36592 -15943 -20332 -47990 53520 -216279 -91900 -6122 203006
18898 24230 176338 53537 210862 259752 437030 360083 213837 12698 -171875 367146
18887 213516 -24715 -146549 -73336 -51237 -91696 41947 150373 81224 -304356 -13808 59151
18875 -277660 -101536 198300 -36499 17744 -41702 -208888 181024 77009 -26040 139751
18864 -175245 -248213 67174 260391 -321404 -194733 17775 -88655 119428 -262023 -209184
18854 -209184 47420 -279753 -111214 -100666 212196 256372 -119367 -64907 79589 154529 -326693
18842 -152277 -44018 -113137 12024 -111079 58948 -30103 -77683 18660 109292 -93305 -35961
18830 92513 47101 10884 81519 -113211 -72582 18598 -261728 -154887 39254 304412 29404
$$ packed form
18910A82435D7578a6942C6592a5943m389k7658E3520b16279i1900f122B03006
18898B4230J52108E3537J57325M8890J77278p6947j46246A2698a71875C67146
18887B13516b4715j21834P3213K2099m0459D1947J08426o9149c04356a3808E9151
18875b77660a01536A98300c6499A7744d1702j67186A81024G7009b6040A39751
18864a75245p2968F7174J93217c21404J26671A7775h8655A19428b62023N2839
18854b09184D7420b79753a11214J0548B12196M4176a19367N4460G9589P4940c26693
18842a52277d4018o9119A2024a11079E8948c0103m7580A8660R0632i3305c5961
18830I2513m5412A0884P0635a13211M0629A8598b61728J06841C9254K65158B9404
$$ plain form
18818 -78421 -325879 384 -207672 -374347 -75274 37627 219471 -7645 -109402 78490 66548
18807 66548 -42962 -26905 -343311 177114 140286 93433 153551 -262559 -74444 61972 -46594
18795 -126362 9283 237811 91146 147995 68192 118537 -227049 -146252 152135 228901 106502
18783 -73441 -12152 61871 -74209 -107797 -80773 -62216 -39601 -240687 -20933 110068 -109140
18771 -5223 19749 57835 200797 -208284 -69314 10707 -11557 -7053 49431 22513 -36301 -35440
18759 -35440 26942 290647 124796 -59666 30982 -269343 -72493 52662 129132 -83524 -327659
18748 -327659 -110061 -148149 9144 197168 -69570 -188569 -322909 -424308 -37309 260140
18737 2054 -34034 -149431 -230562 3372 57254 253099 -180303 176299 -252438 -380320 -4025
$$ packed form
18818g8421k47458C84b07672j66675g5274C7627J81844g645j01757G8490j1942
18807F6548d2962J6057l16406A77114l6828m6853O0118b62559g4444F1972d6594
18795a26362I283K28528I1146N6849F8192N0345b27049Q0797A52135P6766A06502
18783g3441a2152F1871g4209l3588K7024J8557K2615k01086b0933A10068a09140
18771e223A9749L8086J42962b08284f9314A0707a1557M504D9431B2513c6301Q61
18759c5440B6942K63705A24796e9666C0982b69343g2493E2662P6470h3524k44135
18748c27659a10061l8088I144J88024f9570j18999j34340j01399c7309B60140
18737B054c4034j15397q1131C372N3882J95845a80303A76299b52438j27882d025
$$ plain form
18725 -392150 63135 -70334 145672 -180119 47547 -503560 119770 -254935 278984 -33344
18714 158926 -312572 223328 180399 -246669 -57023 -106502 191303 -64641 -27400 -405022
18704 -405022 84107 189575 -67955 -296590 -204822 -211163 88588 -101095 -411649 -91003 -63272
18693 -63272 -42781 -429234 -392526 -55741 -323417 -503150 -332792 -131972 -231903 75937 -174128
18681 189292 -98745 -105435 -102696 -39011 -76409 49643 117003 -128921 -32787 34797 35980 284875
18669 284875 -112835 -288022 -230177 -168547 -32042 21074 -85533 -268538 88168 102627 -43793
18657 -27948 -45459 -57166 -200006 -4712 253174 -168668 167125 159279 -2552 117675 -166832
18645 -164543 -64544 -20035 -24427 -80275 156057 26742 -47510 193193 -46986 -184427 -156544
$$ packed form
18725c92150F3135g0334A45672a80119D7547e03560A19770b54935B78984c3344
18714A58926c12572B23328m2929b46669e7023m9479A91303f4641b7400l77622
18704d05022H4107J05468f7955k28635R1768o341H8588a01095l10554i1003K7731
18693f3272K0491l86453L6708e5741k67676j79733J70358a31972r9931G5937a74128
18681A89292i8745o690K739c9011l7398D9643O7360a28921c2787C4797J183K48895
18669B84875a12835j75187N7845O1630c2042B1074h5533j83005H8168J4459d3793
18657b7948j7511j1707j42840d712B53174a68668A67125p846b552A17675a66832
18645a64543f4544b0035m392n5848A56057B6742d7510A93193d6986j37441K7883
$$ plain form
18634 -156544 -281971 135875 -200117 102363 -144282 -286160 -220677 171645 -176877 -294475
18624 -294475 -220045 54944 -28602 22065 -137663 140342 164914 -123792 260549 -127327
18613 338575 -114553 142590 143068 -324016 -277088 143249 -219103 -26265 -194473 207134
18602 -295083 -140288 72812 149753 175413 78932 -114411 -165308 -77628 -180402 -33539 -252282
18591 -252282 -355482 -80789 153213 -116052 178785 -36639 -130297 -234487 -282397 -91700
18580 419667 -114691 -2132 -4441 4120 -144595 102331 17079 -21082 -66320 139293 -131959
18568 -147866 -10129 298163 229509 -3082 -138634 68649 -45769 183519 -362235 -219768 -240567
18557 -240567 -1609 -52194 -285208 -293091 24304 259922 112330 157209 -221825 -78160 51716
$$ packed form
18634a56544j25427A35875b00117A02363a44282j41878O5483A71645a76877j17598
18624b94475P4430E4944b8602B2065a37663A40342K4572a23792B60549a27327
18613C38575a14553A42590M78c24016M6928A43249b19103b6265j68208B07134
18602b95083a40288G2812P6941K5660G8932a14411n0897g7628j02774c3539k18743
18591b52282j03200h0789A53213a16052A78785c6639r3658j04190m7910i1700
18580D19667a14691b132k309D120a44595A02331A7079b1082m5238A39293a31959
18568a47866a0129B98163o8654c082j35552F8649d5769A83519c62235J42467k0799
18557b40567a609n0585k33014p883B4304K35618A12330M4879b21825g8160E1716
$$ plain form
18545 -160549 134899 -114810 -105534 -69205 -135678 175413 -91431 255878 37433 48820 -39609
18533 39384 -29917 233006 -43714 -278203 17047 -191972 56043 -185880 142574 -199783
18522 -81870 -181346 49052 1228 -94908 -238497 -82020 -156129 85591 -38165 -263160 -238618
18511 -238618 -288894 202900 275266 150146 395214 -152250 55264 4529 -150591 225370
18500 -60311 -237864 68092 -91595 200832 -134113 222078 -55887 -96883 -65935 195007 48940
18488 -5257 -368771 -24623 57848 -117878 -272097 44259 -7581 -125460 105353 -438993 -21162
18476 -105770 -74788 -61030 -43376 -279760 -145931 11311 53207 -320370 -119005 -36596 -307943
18465 -307943 -243263 670648 -22567 -140382 -23282 66540 -156776 84365 -211329 -3773 -368616
$$ packed form
18545a60549A34899a14810R276L6329o6473A75413i1431B55878C7433J1387c9609
18533C9384b9917B33006d3714k34489A7047a91972E6043a85880A42574a99783
18522h1870r9476D9052A228i4908j43589h2020p4109H5591c8165k24995K4542
18511b38618n0276B02900P2366j25120K45068a52250E5264D529a50591B25370
18500f0311j77553F8092i1595B00832a34113B22078e5887m0996L0948A95007D8940
18488e257l63514b4623E7848a17878j54219D4259g581j17879A05353d38993b1162
18476a05770L0982J3758J7654k36384J33829A1311M1896c20370a19005c6596k71347
18465c07943O4680F70648b2567j17815b3282F6540a56776H4365b11329c773l64843
$$ plain form
18454 -368616 -245286 94017 24994 80149 -101330 31516 -283157 269563 -215388 -24344
18443 -101500 7636 -141646 10760 -139795 45630 -167746 -73912 164463 -216709 35776 195826
18432 195826 128316 90458 -142165 112240 -113124 -191283 192150 -29361 -128055 161338
18421 16876 6686 -106593 31763 112925 -313076 16480 -144450 -55804 44119 -145100 -34351
18409 46972 -9337 -155692 38657 98079 -32976 82468 90132 21 -16679 -268444 -72208 213170
18396 -184863 62995 -2245 -129187 2753 -11878 -146046 31593 -206573 -152671 -7437 -59978
18385 -59978 -151065 -157763 140379 -383404 171305 -196683 109421 -112723 258187 78474
18374 -44447 -84902 -58791 62793 -354498 -252733 175873 -26384 748 -202730 -120029 46868
$$ packed form
18454c68616J23330I4017B4994N5155a01330C1516b83157B69563b15388b4344
18443a01500G636a41646A0760a39795D5630a67746g3912A64463b16709C5776J60050
18432A95826o7510l7858a42165A12240a13124p8159A92150b9361r8694A61338
18421A6876F686a06593C1763Q1162c13076A6480a44450e5804D4119a45100c4351
18409D6972i337j46355C8657N9422c2976H2468P664B1a6679k51765g2208B13170
18396a84863F2995b245j26942B753a1878j34168C1593b06573N3902g437n2541
18385e9978r1087o698A40379c83404A71305a96683A09421a12723B58187G8474
18374d4447m0455K6111F2793c54498J01765A75873b6384G48b02730Q2701D6868
$$ plain form
18362 -184917 37804 195187 37636 -27079 86823 -216600 -274102 3989 215888 35106 -54679
18350 96264 94760 23813 122355 27981 -203739 -161023 -183907 -196993 144351 -82300 127948
18338 -157195 -191576 -137436 28660 -4955 -111379 -118555 -87389 266004 106179 -50689 -195766
18327 -195766 112741 60216 150738 -84027 313895 240857 -44392 148919 -107718 -144883 231080
18315 -36453 85335 -99315 -139649 140668 -43687 -133915 -265773 9441 48260 1763 75608 2426
18302 -80464 -71053 286153 41103 -65380 -233480 -19192 -242103 -304913 26331 144129 204871
18291 204871 -49153 47012 -229151 117935 119543 -158257 92563 -206443 -86528 -114765 86303
18279 -104410 -171240 50000 -20752 182914 46842 219695 -194795 104963 140095 -127153
$$ packed form
18362a84917C7804J57383C7636b7079H6823b16600n7502C989K11899C5106e4679
18350I6264j504B3813R8542B7981b03739M2716k2884j3086A44351h2300A27948
18338a57195l4381N4140B8660d955j06424p176L1166B66004A06179e0689j45077
18327a95766A12741n2525R0522h4027C13895p3038d4392A48919a07718l7165B31080
18315c6453H5335i9315m0334A40668d3687r0228j31858I441L8819A763P3845B426
18302h0464R411B86153D1103f5380j68100a9192k22911o2810B6331J17798O0742
18291B04871d9153D7012b29151A17935J608a58257I2563b06443h6528k8237H6303
18279a04410o6830E0000b0752A82914D6842J72853a94795A04963L5132a27153
$$ plain form
18268 61118 -35218 -56128 -16540 201700 -97883 -219293 132900 -137175 56631 -103503 -333
18256 -244337 -183310 -62097 198866 -104852 -109009 108037 -437656 -62837 -180877 271667
18245 364721 51907 161471 44767 79597 -207540 -395764 97541 -156540 -13247 56918 198637
18234 198637 27444 106162 65269 9065 926 -69341 -50562 239292 32332 16706 120173 1285
18221 -20195 -18482 -232640 -282769 -219241 -111439 -265766 55465 -97200 -38549 -102138 265567
18209 -23262 91597 210734 -144556 -135234 19632 213985 -133739 335145 -98222 100999 372460
18198 372460 -3611 -38560 147920 79555 -20066 -339547 -170411 -272526 60451 128852 -93403
18186 -20626 -17830 -53399 -73761 -162392 -61009 169347 -221028 173153 24858 -108967 -179779
$$ packed form
18268F1118c5218k0910a6540B01700i7883j21410A32900a37175E6631a03503c33
18256b44337O1027f2097A98866a04852m157A08037d37656f2837j18040B71667
18245C64721E1907J09564D4767L4830b07540j88224I7541a56540a3247E6918J41719
18234A98637B7444P8718m0893I065I26f9341J8779B39292C2332j5626J03467A285
18221b0195J713k14158n0129O3528J07802j54327E5465i7200c8549o3589B65567
18209b3262I1597J19137a44556R322A9632J94353a33739C35145i8222A00999K71461
18198C72460c611l4949A47920o8365b0066l19481J69136j02115F0451O8401i3403
18186b0626K796l5569k0362q8631f1009A69347b21028A73153B4858a08967p0812
$$ plain form
18175 -179779 209955 -15166 -178709 12135 -82338 -362586 52821 7762 15770 -12298 -33805
18164 -33805 -299746 -167630 -250929 54246 148335 91975 36656 170692 -32602 292908 22027
18152 -102058 -207153 33057 -23085 -77411 38647 -109362 -10911 99777 447522 22504 -218275
18140 -175116 -83907 358983 -87685 14865 191900 265415 -71064 -24393 155641 -231408 -153933
18129 -153933 -18140 106086 4950 17361 72499 100419 -50189 150152 -272420 5594 -71993
18117 -56447 136511 -275205 9896 -56354 105770 -94233 192350 -102596 413139 -93810 -85132
18106 -85132 -20705 -114336 -43769 -192562 -124848 55345 -152666 -50483 -55750 313770 220085
18095 220085 217409 159178 132775 90122 -371994 -141000 -200512 70104 -96223 -298766 375960
$$ packed form
18175a79779B09955a5166j63543A2135h2338k80248E2821G762Q008a2298k1507
18164c3805k65941J32116q3299E4246R4089n6360C6656J34036c2602B92908B2027
18152a02058j05095C3057b3085n4326C8647a09362a0911I9777L47745B2504b18275
18140a75116h3907C58983h7685A4865J77035P3515g1064b4393A55641b31408P7475
18129a53933a8140A06086D950J2411N5138K7920e0189A50152b72420E594g1993
18117e6447A36511b75205I896e6354A05770i4233A92350a02596D13139i3810Q678
18106h5132b0705r3631d3769j48793O7714E5345a52666e0483n267C13770r3685
18095B20085k676n8231k6403m2653c71994a41000n9512G0104i6223k02543C75960
$$ plain form
18083 289773 258518 21211 353473 -235934 -90621 63960 -330863 -200227 140968 -241056
18072 184459 90950 102438 -134079 -191325 -196869 -58136 -96529 -281934 -109345 27789 -74761
18060 -74958 109204 170263 -71918 77299 119572 234903 -16683 -273696 116322 -187808 246065
18048 -51167 40656 -21437 10400 -37308 208891 208287 -52863 299839 -135383 -40155 -33849 -143298
18036 -143298 -192381 -36907 -195923 37330 316605 166783 219843 -192624 -90851 -43496 -72975
18025 -72975 -21342 -102110 -13560 243911 -14427 -61327 -339771 468725 -56224 4841 328514
18014 328514 -34816 -20818 -30190 -99449 -146476 232302 -40719 518043 -178722 -120673 83708
18002 -232295 -208440 -218343 86685 231029 -1800 -126223 347027 36895 146456 -85556 311186
$$ packed form
18083B89773l1255B1211L32262b35934i0621F3960c30863J30636A40968b41056
18072A84459I0950J1488a34079n7246n544e8136l8393j85405a09345B7789g4761
18060g4958A09204O1059g1918G7299M2273J15331a6683k57013A16322a87808B46065
18048e1167D0656b1437A0400c7308B08891o04e2863B99839a35383d0155O306j09449
18036a43298m9083c6907j59016C7330K79275j49822N3060a92624i0851d3496k9479
18025g2975b1342q0768a3560B43911a4427m6900k78444D68725e6224D841L23673
18014C28514c4816J3998r372o9259m7027B32302d0719E18043a78722N8049H3708
18002b32295K3855r903H6685J44344a800j24423C47027C6895J09561h5556C11186
$$ plain form
17990 -65452 399904 132367 15438 -39863 -25488 65819 -45768 318676 30910 -355689 65029
17978 72886 -220675 -232197 -201697 144018 -57099 -143160 -99610 -164026 224629 -126736 324483
17966 -82742 -250461 -203001 -311105 10447 299661 39575 -35498 -178565 -100490 57404 90729
17955 90729 221549 142733 44908 349449 204269 -106719 -23679 -72696 -15957 49697 89764
17944 89764 38607 214361 22405 94425 73914 -155921 -92207 205011 53679 -166125 201821
17932 410254 64497 37263 234636 60708 -115121 8111 -29707 59530 -73731 116967 3737
17920 -12902 -153334 39356 135221 86441 -85173 93584 -177382 -6749 86453 554 -27423 34858
17907 186738 214641 2892 256220 181316 -397402 -4330 -172173 323213 -315908 -162424 -307311
$$ packed form
17990f5452C99904A32367A5438c9863J4375F5819d5768C18676C0910c55689F5029
17978G2886b20675j1522L0500A44018e7099q6061M3550o4416B24629a26736C24483
17966h2742j67719M7460j08104A0447K89214C9575c5498j43067P8075E7404L3325
17955I0729J30820p8816D4908L04541j45180a06719b3679m9017a5957D9697M0067
17944H9764C8607J75754B2405P2020k0511a55921O3714B05011E3679a66125B01821
17932D10254F4497k7234J97373F0708a15121H111b9707E9530g3731A16967C737
17920a2902j40432C9356R5865m8780h5173I3584a77382f749H6453E54b7423C4858
17907A86738K7903B892K53328p4904c97402d330j67843C23213c15908J53484j44887
$$ plain form
17896 -307311 -241065 -148518 129352 -91300 56243 -18972 -8843 127216 413731 515229 -321495
17884 35247 -147874 50690 -136871 154840 -304950 -159479 -3396 138727 -180902 30929
17873 -113210 -31464 319749 -156758 -69098 -56911 9143 -61476 64394 161705 127828 -149505
17861 182948 16163 263607 -169761 -2098 137106 -277160 23667 78140 19409 421652 49474
17849 272621 1277 -49547 64631 3705 173096 294182 23471 -117138 231891 185138 -95899
17837 317484 -248814 -193942 -13600 239034 85740 -199365 -254194 126933 66861 -100656
17826 -8934 86495 -96994 172516 -37669 -91083 330294 37812 -21412 114529 -40411 -16338
17814 227470 -383866 103025 -52902 221142 258194 118485 170089 -48159 -23438 -6188 -68925
$$ packed form
17896c07311O6246R2547A29352i1300E6243a8972h843A27216K86515J01498c21495
17884C5247a47874E0690a36871A54840c04950J45471c396A38727a80902C0929
17873a13210c1464C19749a56758f9098J2187I143f1476F4394R7311l3877a49505
17861A82948A6163K47444a69761b098A37106b77160B3667N4473A9409M02243D9474
17849B72621A277d9547F4631C705J69391J21086B3471a17138B31891m6753i5899
17837C17484b48814N4872a3600B39034H5740a99365n4829A26933o0072a00656
17826h934H6495i6994A72516c7669n3414C30294C7812b1412A14529d0411a6338
17814B27470c83866A03025e2902B21142L7052A18485N1604d8159b3438f188o2737
$$ plain form
17803 -68925 -59255 -78659 -42945 -39286 -214686 7769 -91495 -67758 315929 -48693 -109577 132174
17790 70487 -205711 41231 -15603 101449 97844 192848 -70237 -148621 49364 36411 189979
17779 189979 -224152 160735 292490 -10794 164371 36972 67417 126544 383361 154418
17768 91078 -59282 -174820 198371 203750 107145 58463 119312 147735 105167 236425 78442
17756 -37836 21067 249852 -327647 14580 126792 -76514 182360 -112735 -27318 -61036 275678
17744 -85503 63462 188312 -93344 -170128 -30089 108381 -169344 6487 374175 36134 193358
17733 193358 -166544 133881 271254 -96955 175998 73213 -43124 166527 -83049 99466
17722 73898 373156 -17192 138443 -227325 -23122 188387 -48834 265556 230383 240041 100494
$$ packed form
17803f8925R670j9404L5714L659j75400G769i1495K3737C15929d8693o0884A32174
17790G0487b05711D1231a5603A01449l605R5004g0237p8384D9364j2953J53568
17779A89979b24152A60735J31755a0794A64371C6972L0445N9127K56817A54418
17768I1078e9282j15538A98371N379r6605m8682O0849K8423m2568J31258G8442
17756c7836B1067K28785c27647A4580J12212g6514A82360a12735b7318l3718B75678
17744h5503F3462J24850i3344p6784c0089A08381a69344F487L67688C6134J57224
17733A93358a66544A33881J37373i6955A75998G3213d3124A66527h3049I9466
17722G3898K99258a7192A38443b27325b3122A88387d8834B65556l5173R658A00494
$$ plain form
17710 242551 -164909 190954 114258 173514 296338 110823 -38996 81473 25442 123859 -59908
17698 23765 93837 137453 88603 100092 80095 98262 -3992 -134887 162528 1001 164725
17687 164725 217004 195222 70598 110759 -74325 -155433 390796 229287 159932 -100403 83338
17675 335245 -20581 4127 66703 316430 340243 -59601 136161 204746 162962 -20841 -103593
17664 -103593 -78397 98951 93044 213904 141493 100821 -5990 -76100 -115394 200200 -59429
17652 86162 341108 85601 168861 246529 -83619 -165977 251206 -124629 46251 -84545 -123964
17641 -123964 -192264 73726 149052 -264118 6909 38207 -22054 48947 398371 -64 286131 152222
17629 152222 -20916 208477 18179 7398 89756 -23066 290035 120434 389114 134597 299692
$$ packed form
17710B42551a64909A90954p6696N9256J22824A10823c8996H1473B5442R8417e9908
17698B3765P0072M3616m8850J1489j9997J8167c992j30895A62528A001J63724
17687A64725N2279k1782G0598M0161g4325q1108C90796j61509o9355a00403H3338
17675C35245b0581D127O2576K49727K3813e9601A36161O8585m1784b0841q2752
17664a03593K5196I8951n907J20860p2411m0672e990p0110l9294B00200e9429
17652H6162K54946H5601Q3260P7668h3619q2358B51206a24629D6251h4545l9419
17641a23964o8300G3726P5326b64118F909L1298b2054D8947L49424f4B86131j33909
17629A52222b0916B08477A8179G398Q2358b3066B90035A20434K68680A34597J65095
$$ plain form
17618 299692 153813 217211 222197 170491 48941 183832 71134 295945 81807 297295 11053
17606 190252 240781 55469 -64912 366003 15244 -15976 39683 118232 29949 112819 204770
17595 204770 277635 341705 136549 -268929 -114175 -106176 -303630 -108971 157990 106111
17585 106111 -97376 43919 335576 -264522 171214 309088 -137330 228739 -50553 182711
17574 -123969 251241 189316 328076 -80159 -87084 168513 232461 164710 170624 330264 391494
17563 391494 249979 158900 148218 -20648 41786 89498 302631 62182 180808 -65129 288074
17551 93916 71301 171659 675981 170019 272373 162786 198102 120656 53923 220551
17541 220551 227881 -28693 108420 432440 36259 255037 15022 127258 126639 37963 364301
$$ packed form
17618B99692j45879O3398M986n1706D8941J34891G1134K24811H1807K15488A1053
17606A90252N0529E5469f4912C66003A5244a5976C9683P8549B9949Q2870R1951
17595B04770P2865O4070A36549b68929a14175P999j97454a08971A57990n1879
17585A06111i7376D3919K91657b64522A71214J37874a37330B28739e0553A82711
17574a23969B51241o1925J38760h0159o925A68513O3948o7751N914J59640O1230
17563C91494j41515r1079j0682b0648D1786M7712K13133F2182J18626f5129B88074
17551I3916k2615J00358N04322A70019J02354j09587L5316p7446E3923J66628
17541B20551P330b8693A08420L24020C6259K18778A5022J12236o19C7963L26338
$$ plain form
17530 364301 249873 398986 238433 73043 200743 333309 193656 557626 -98508 249401
17519 -3000 353496 376503 154408 656062 369785 369878 278455 811164 431063 656329 791891
17508 791891 979666 937750 743791 668986 403113 428021 321720 704816 445271 410458
17498 410458 147812 419987 565168 792258 901289 949719 855651 763997 773286 647419
17488 647419 272397 393754 522431 362629 20441 88144 318401 399507 79679 431467
17478 431467 280830 462985 -11062 133468 584620 286851 519050 69292 219711 379413
17468 379413 270453 273666 247418 359120 426408 252319 353923 283041 183182 110636 206681
17457 206681 401181 330495 409618 246712 403291 409247 390313 112793 260805 209820 429049
$$ packed form
17530C64301j14428J49113j60553G3043J27700J32566j39653L63970i8508B49401
17519c000C53496K3007A54408N01654k86277R3r1423N32709l80101K25266J35562
17508G91891J87775m1916j93959p4805k65873K4908j06301L83096k59545l4813
17498D10458A47812K72175J45181K27090J09031M8430r4068r1654R289j25867
17488F47419B72397J21357J28677j59802B0441O7703K30257Q1106G9679L51788
17478D31467j50637J82155a1062A33468M51152B86851K32199F9292J50419J59702
17468C79413j08960L213k6248J11702O7288j74089J01604p0882r9859p2546R6045
17457B06681J94500p0686P9123j62906J56579N956j8934A12793J48012n0985K19229
$$ plain form
17446 429049 224268 456861 452514 425420 63896 197116 435183 194018 186204 408378 195095
17434 422137 117260 223313 341892 105904 691753 -39309 335996 670342 174131 317534
17424 317534 471003 118479 310802 346685 480633 94059 329811 98994 122570 148586
17414 148586 201526 529926 556861 579878 307343 236155 153341 453117 358633 218736 473681
17403 473681 541386 -17488 125064 474890 403601 170314 130963 224932 -46200 522103 204825
17391 299139 80737 383707 191754 37644 180364 593472 243270 71529 344803 172821
17381 172821 233386 -99762 62737 164205 358093 -134838 277865 449119 -89239 71318
17370 209523 130877 361641 444568 245930 124402 55339 186643 15922 104105 158695 200093
$$ packed form
17446D29049k04781K32593m347k7094F3896J33220K38067A94018p814K22174A95095
17434D22137A17260J06053J18579A05904N85849c9309C35996L34346A74131J43403
17424C17534J53469A18479J92323L5883J33948I4059K35752I8994K3576K6016
17414A48586N2940L28400K6935K3017k72535p1188q2814K99776r4484j39897K54945
17403D73681O7705a7488A25064L49826p1289A70314l9351R3969d6200E22103B04825
17391B99139H0737L02970A91754C7644J42720M13108B43270G1529K73274j71982
17381A72821O0565i9762F2737J01468J93888a34838B77865J71254h9239G1318
17370B09523p8646K30764Q2927j98638j21528E5339J31304A5922Q8183N4590M1398
$$ plain form
17359 200093 271697 257295 327692 381922 283638 226994 109127 139927 464583 138890 103581
17348 103581 70632 321137 118804 443630 93929 261163 276319 148510 236703 207268
17338 207268 170337 207176 -13910 398260 176438 399292 522624 342299 140322 318733
17328 318733 163596 304181 536796 358151 374566 325301 187013 162573 425499 118495
17317 285249 356746 276280 410405 61681 317939 391601 25844 180132 439992 139428
17306 214416 102978 203153 399876 245456 119685 260677 235963 241095 560613 405387
17296 405387 80741 -7588 367741 205433 320931 518353 259203 398942 324808 424635
17286 424635 212600 121931 633196 228053 456786 323087 9024 524568 543024 198399
$$ packed form
17359B00093P1604j4402P0397N4230r8284n6644A09127L0800L24656A38890l5309
17348A03581l2949K50505A18804L24826I3929J67234J5156j27809Q8193k9435
17338B07268l6931L6839a3910C98260A76438K22854J23332j80325A40322J78411
17328C18733j55137J40585K32615j78645J6415m9265j38288k4440K62926A18495
17317B85249P1497q0466J34125F1681K56258P3662B5844J54288K59860A39428
17306B14416A02978J00175J96723j54420A19685J40992k4714N132L19518j55226
17296D05387H0741g588C67741j62308J15498J97422k59150J39739p4134R9827
17286D24635k12035r0669N11265B28053K28733j33699I024N15544J8456A98399
$$ plain form
17275 632401 256490 160298 455738 77727 508626 658906 188684 503703 519838 252831
17264 277317 381723 478436 131498 -80594 423769 26491 482479 154975 547330 444530
17254 444530 625995 85683 125198 275848 192631 241903 147091 377868 606031 482390
17244 482390 539736 388145 226875 155621 305479 316177 -36073 433165 211159 69435
17233 -146325 450806 199113 174722 167210 547322 531722 747189 480097 555144 85911 263707
17222 263707 61123 243154 125796 666500 460539 215725 659151 483997 151503 155803
17212 155803 261990 396251 564678 338589 529621 380854 176098 314395 305950 279036
17202 279036 428639 593921 511575 915384 417369 490610 10456 698469 216996 591924
$$ packed form
17275F32401B56490r6192K95440G7727M30899J50280A88684L15019J6135B52831
17264B77317J04406R6713A31498h0594D23769B6491M55988A54975L92355j02800
17254D44530J81465H5683L9515J50650q3217M9272r4812K30777K28163j23641
17244D82390N7346j51591j61270p1254J49858J0698c6073D33165B11159F9435
17233a46325D50806A99113k4391p512L80112j5600K15467k67092P5047H5911J77796
17222B63707F1123J82031j17358N40704k05961B15725M43426j75154A51503M300
17212A55803J06187J34261J68427k26089J91032j48767A76098J38297q445k6914
17202B79036J49603J65282q2346M03809D17369P3241A0456O88013B16996L74928
$$ plain form
17192 591924 543052 395848 251107 288728 225175 841191 348570 66678 365094 781719
17182 781719 454835 274462 695508 167868 494844 530276 367373 455627 69018 489630
17172 489630 585584 486708 525033 476104 732418 327212 313135 200559 438219 447354 374368
17161 374368 344080 535920 540870 457093 708937 215741 769750 448451 673307 613693
17151 613693 620590 510663 422194 350879 703904 309916 449854 325307 740019 608078
17141 608078 535528 619050 414739 552543 634899 667408 798185 473482 647570 367357
17131 367357 291343 379205 330138 608110 460646 615314 317293 458780 200247 439681
17121 439681 356471 615345 387730 654461 726006 380218 537444 512320 634181 398170
$$ packed form
17192E91924m8872j47204j44741L7621o3553O16016C48570F6678K98416M16625
17182G81719l26884j80373M21046A67868L26976L5432j62903Q8254F9018M20612
17172D89630R5954r8876L8325m8929K56314C27212j4077j12576K37660R135p2986
17161C74368l0288J91840M950q3777K51844B15741N54009l21299K24856n9614
17151F13693O897j09927q8469p1315L53025C09916J39938j24547M14712j31941
17141F08078p2550Q3522k04311J37804Q2356L2509J30777l24703J74088k80213
17131C67357p6014Q7862m9067K77972j47464J54668k98021J41487B00247K39434
17121D39681q3210K58874k27615K66731P1545l45788J57226k5124J21861k36011
$$ plain form
17111 398170 578471 348443 673922 476987 243624 771446 643773 562118 529450 694979
17101 694979 596788 732221 522510 432069 427267 257993 661560 585410 555692 577543 688713
17090 688713 725527 753827 477048 795837 633152 270533 793988 461784 734395 637869
17080 637869 248471 753143 653153 579736 611587 587400 648181 355578 620854 638205 1163093
17069 1163093 751502 644992 979691 535387 1048520 919871 748924 824756 747795 525259
17059 525259 686962 730996 767313 508755 1024807 957513 832118 813622 735032 649423 695592
17048 695592 613860 954024 849968 605015 981101 568910 933236 833920 813151 768504
17038 768504 942056 795110 824769 899725 568914 1005544 785479 798779 1194173 968248
$$ packed form
17111C98170J80301k30028L25479j96935k33363N27822j27673q1655l2668J65529
17101F94979r8191J35433k09711r0441m802j69274M03567p6150k9718K1851J11170
17090F88713L6814K8300k76779L18789j62685B70533N23455l32204K72611r6526
17080F37869B48471N04672r9990p3417L1851k4187O0781k92603K65276J7351N24888
17069A163093m11591j06510L34699m44304N13133j28649j70947P5832p6961k22536
17059E25259J61703M4034L6317k58558N16052o7294j25395j8496p8590q5609M6169
17048F95592q1732L40164j04056k44953L76086m12191L64326r9316k0769m4647
17038G68504J73552j46946K9659P4956l30811M36630k20065J3300L95394k25925
$$ plain form
17028 968248 829732 840121 575657 1092085 879889 710573 709471 1105124 798801 1045426
17018 1045426 1162306 1011046 1257296 1108872 1101091 705845 1057722 994310 446510 1072889
17008 1072889 1121058 1364915 1174121 1006524 1127090 918526 1103320 1286728 1066075 989686
16998 989686 1124769 1004404 1420209 1183370 1047456 1689190 1225142 1412544 1118753 1142618
16988 1142618 1218276 1459890 1160271 1664649 999780 1115681 1329635 1002831 1356716 1396844
16978 1396844 1301202 1152243 1133573 1941396 1199514 1057378 1257659 1464262 1316451 1552267
16968 1552267 1473767 1238639 1568435 1489414 1270153 1448141 1367083 1204840 1711513 1523226
16958 1523226 1850402 1494121 1683338 1197405 1402944 1348703 1406610 1647480 1680461 1481808
$$ packed form
17028I68248j38516J0389k64464N16428k12196j69316j102L95653l06323K46625
17018A045426J16880j51260K46250j48424p781l95246L51877o3412D46510O26379
17008A072889M8169K43857j90794j67597J20566k08564J84794J83408k20653p6389
16998I89686J35083j20365M15805k36839j35914O41734m64048J87402k93791K3865
16988A142618P5658K41614k99619N04378o64869J15901K13954l26804L53885M0128
16978A396844r5642j48959j8670Q07823p41882j42136K00281K06603j47811K35816
16968A552267p8500k35128L29796p9021k19261J77988q1058j62243N06673j88287
16958A523226L27176l56281J89217m85933K05539n4241N7907K40870L2981j98653
$$ plain form
16948 1481808 1387960 1839653 1740008 1327066 1679722 1208676 1687842 1599558 1601314 2106164
16938 2106164 1783906 1895592 1798094 1784065 1449466 1928444 1816495 1836352 1697755 1283199
16928 1283199 1712324 1891059 1719468 1994501 1949561 1865757 1928221 2036584 1953303 1897539
16918 1897539 2258537 1879158 2091869 1953800 1727715 1930285 2242682 2089555 2018731 2028819
16908 2028819 2379622 2072621 2055932 2129438 2205387 2362130 2443592 2512771 2562295 2520826 2557140
16897 2557140 2263067 2365488 2801096 2536282 2697273 2454519 2227783 3061143 2614105
16888 2614105 2417813 2499625 2827180 2569125 2975358 2541805 2626770 2938841 2953975 2754704
16878 2754704 2891139 3275863 3079369 2902434 3527447 3394894 3275172 3549948 3186596
$$ packed form
16948A481808r3848M51693r9645m12942L52656m71046M79166q8284J756N04850
16938B106164l22258J11686r7498j4029l34599M78978j11949J9857j38597m14556
16928A283199M29125J78735j71591K75033m4940q3804O2464J08363q3281n5764
16918A897539L60998l79379K12711j38069k26085K02570L12397j53127p0824J0088
16908B028819L50803l07001j6689P3506P5949J56743Q1462O9179M9524m1469L6314
16897B557140k94073J02421M35608k64814J60991k42754k26736Q33360m47038
16888B614105j96292Q1812L27555k58055M06233m33553Q4965L12071J5134j99271
16878B754704J36435L84724j96494j76935O25013j32553j19722K74776l63352
$$ plain form
16869 3186596 3431195 3417951 3528318 3538259 3597785 3629954 3174483 3804767 4282302 3392164
16859 3392164 3697527 3553067 3839459 4238789 4108570 3942891 4187368 4221519 4375245 4437020
16849 4437020 4552661 4008170 4546249 4381024 4469121 4572348 4361526 4520833 4936807 4999304
16839 4999304 5125111 5119477 5251142 5029513 5458154 5907885 5562776 5938855 5545635 5623816
16829 5623816 6083712 6079794 6116374 6653216 6115446 6151748 6504061 6274993 6373233 6792820
16819 6792820 7146110 6969318 7211771 7474461 7687513 7183877 7739390 7968602 7798667
16810 7798667 8122644 8151349 8639065 8676234 8867869 8958240 8979116 9258249 9209231 9278181
16800 9278181 9910808 10084173 10401650 10179027 10381543 10919828 11185324 11363183 11656882
$$ packed form
16869C186596K44599j3244J10367R941N9526L2169m55471O30284M77535q90138
16859C392164L05363j44460K86392L99330j30219j65679K44477L4151J53726O1775
16849D437020J15641n44491N38079j65225Q8097J03227k10822J59307M15974O2497
16839D999304J25807n634J31665k21629M28641M49731l45109L76079l93220P8181
16829E623816M59896l918L6580N36842n37770L6302L52313k29068R8240M19587
16819F792820L53290j76792K42453K62690K13052n03636N55513K29212j69935
16810G798667L23977K8705M87716L7169J91635R0371K0876K79133m9018O8950
16800I278181O32627J73365L17477k22623K02516N38285K65496J77859K93699
$$ plain form
16791 11656882 11758729 12277855 12409658 12786939 12724433 13194379 13817827 13912260 14529866 14596215
16781 14596215 14988751 15291358 15843700 16295313 16525089 16853880 17185293 18129861 18542067
16772 18542067 19180090 19539002 20204490 20573683 21272767 21718869 22336939 23120500 23584065
16763 23584065 24510832 25165646 26013050 26906120 27445875 28814463 29843050 30299118 31184399
16754 31184399 32672779 33606638 34889968 36019688 37514427 38349792 39860021 41466143
16746 41466143 42704335 44578787 45842839 47970419 49664976 51434890 53643503 55861890
16738 55861890 57955090 60410180 62654060 64867797 67271494 70210558 72917553 75573345
16730 75573345 78721628 81341711 84719101 87893345 91281556 94270522 97623888 101047043
$$ packed form
16791A1656882J01847N19126J31803L77281o2506M69946O23448R4433O17606O6349
16781A4596215L92536L02607N52342M51613K29776L28791L31413R44568M12206
16772A8542067O38023L58912O65488L69193O99084M46102O18070P83561M63565
16763B3584065R26767O54814Q47404Q93070N39755J368588J028587M56068Q85281
16754C1184399J488380R33859J283330J129720J494739Q35365J510229J606122
16746D1466143J238192J874452J264052K127580J694557J769914K208613K218387
16738E5861890K093200K455090K243880K213737K403697K939064K706995K655792
16730G5573345L148283K620083L377390L174244L388211K988966L353366L423155
$$ plain form
16722 101047043 104331025 107404193 110752427 113706529 117136472 119649834 122333067 124882460
16714 124882460 127123746 128935643 130366427 131507901 132532160 133130666 132918300 133011260
16706 133011260 132082301 131388245 129817817 128068482 126301903 123611739 121489576 118277626
16698 118277626 115514463 112386453 109324350 105850288 102403318 99330822 95415549 92333499
16690 92333499 88904140 85733104 82304870 79245175 76150824 73205960 70417590 67866517
16682 67866517 64958101 62803371 60221607 57881976 55504761 53426490 51273810 49327708
16674 49327708 47640749 45519985 43825819 42604961 40773115 39260058 37918668 36460013
16666 36460013 35635927 33921732 32857090 32078469 30638554 29825971 28895821 27898334 27135960
$$ packed form
16722A01047043L283982L073168L348234K954102L429943K513362K683233K549393
16714A24882460K241286J811897J430784J141474J024259N98506k12366R2960
16706A33011260r28959o94056j570428j749335j766579k690164k122163l211950
16698A18277626k763163l128010l062103l474062l446970l072496l915273l082050
16690I2333499l429359l171036l428234l059695l094351k944864k788370k551073
16682F7866517k908416k154730k581764k339631k377215k078271k152680j946102
16674D9327708j686959k120764j694166j220858j831846j513057j341390j458655
16666C6460013q24086j714195j064642p78621j439915q12583r30150r97487p62374
$$ plain form
16657 27135960 26078082 25227209 24429044 23761012 23057656 22384322 21637442 21006041 20531794
16648 20531794 19975777 19066877 18551362 18138267 17708427 17145050 16839944 16128249 15836959
16639 15836959 15586928 15001246 14566161 14293256 13729326 13474717 13387275 13290543 12945837 12632233
16629 12632233 12137640 11581352 11428385 11051425 11197442 10552900 10716375 10473218 9966368
16620 9966368 9985847 9502072 9446535 9490702 9193558 9166525 8825525 8462855 8326124 8162221
16610 8162221 8042995 7813061 7981581 7531654 7754675 7313063 6994337 7333241 7140315
16601 7140315 6823511 6945679 6867772 6403906 6413862 6337219 6068376 5805141 6021007 5985301
16591 5985301 5633339 5769504 5633299 5445148 5437407 5346266 5581882 5055534 5288774 5292346
$$ packed form
16657B7135960j057878q50873p98165o68032p03356o73334p46880o31401m74247
16648B0531794n56017r08900n15515m13095m29840n63377l05106p11695k91290
16639A5836959k50031n85682m35085k72905n63930k54609q7442r6732l44706l13604
16629A2632233m94593n56288j52967l76960J46017o44542J63475k43157n06850
16620I966368J9479m83775n5537M4167k97144k7033l41000l62670j36731j63903
16610H162221j19226k29934J68520m49927K23021m41612l18726L38904j92926
16601G140315l16804J22168p7907m63866R956p6643k68843k63235K15866l5706
16591E985301l51962J36165j36205j88151p741r1141K35616n26348K33240L572
$$ plain form
16581 5292346 4848691 4855425 5204912 4950749 4614283 4337146 4355337 4537848 4216669 4422509
16571 4422509 4238958 4448567 4453992 4154531 4145453 3760871 3874125 3941532 4116404 3783669
16561 3783669 3682429 3490008 3827357 3824702 3554990 3377852 3676211 3475311 3847761 3396153
16551 3396153 3358744 3413351 3566046 3165161 2894545 3059597 3268898 2891404 3204459 3071256
16541 3071256 2918124 3305765 2990169 3117837 2919374 2776641 2761856 2530956 2473011 2398116
16531 2398116 2368585 2339548 2830165 2326226 2512541 2601188 2487575 2380404 2462940 2277735
16521 2277735 2359310 2130149 2223285 2035466 2277129 2052392 2234040 2315589 2133754 2071991
16511 2071991 2018387 2552091 2302196 2044102 2170716 1806988 1981087 2409097 2090194 2033603
$$ packed form
16581E292346m43655O734L49487k54163l36466k77137J8191J82511l21179K05840
16571D422509j83551K09609N425k99461r078l84582J13254O7407J74872l32735
16561C783669j01240j92421L37349k655k69712j77138K98359k00900L72450m51608
16551C396153l7409N4607J52695m00885k70616J65052K09301l77494L13055j33203
16541C071256j53132L87641l15596J27668j98463j42733j4785k30900n7945p4895
16531B398116k9531k9037M90617n03939J86315Q8647j13613j07171Q2536j85205
16521B277735Q1575k29161R3136j87819K41663k24737J81648Q1549j81835o1763
16511B071991n3604N33704k49895k58094J26614l63728J74099M28010l18903n6591
$$ plain form
16501 2033603 2144134 2198489 1903553 1628338 1917856 1667849 1885465 1796402 1562620 1749698
16491 1749698 1718824 1565728 1573795 1573222 1893121 1614211 1773623 1562197 1659369 1516956 1611966
16480 1611966 1802480 1957177 1563697 1276183 1766223 1399186 1602662 1502737 1415402 1716395
16470 1716395 1588389 1326980 1314442 1344674 1516948 1316957 1192947 1616646 991960 1172210
16460 1172210 1335927 1342308 1435112 1362002 1469149 1489698 1470607 995595 1343914 916156
16450 916156 915300 1179893 1225139 853640 1448583 1029549 1462479 1280188 1314281 1190843
16440 1190843 1153374 1092190 956913 1565290 1052565 1264004 1441143 1001329 1102969 1289668
16430 1289668 1219242 1451839 1276193 1047177 1032760 1282070 962140 1296663 1310022 950685
$$ packed form
16501B033603J10531N4355k94936k75215K89518k50007K17616q9063k33782J87078
16491A749698l0874j53096Q067n73L19899k78910J59412k11426R7172j42413R5010
16480A611966J90514J54697l93480k87514M90040l67037K03476r9925q7335L00993
16470A716395j28006k61409j2538L0232J72274j99991j24010M23699o24686J80250
16460A172210J63717O381R2804p3110J07147K0549j9091m75012L48319m27758
16450I16156q56K64593M5246l71499N94943m19034M32930j82291L4093j23438
16440A190843l7469o1184j35277O08377n12725K11439J77139m39814J01640J86699
16430A289668p0426K32597j75646k29016j4417K49310l19930L34523J3359l59337
$$ plain form
16420 950685 1061423 947964 1141781 877261 1218964 1080734 921150 920645 1036445 1125603
16410 1125603 1046862 1142453 948783 924729 927056 808138 900831 820932 1114651 895274 782383
16399 782383 1082461 767748 852623 823627 787877 788344 793367 898159 1083231 632504 788836
16388 788836 823899 918897 732417 813418 988775 677003 968049 745628 884395 581708
16378 581708 603318 677958 1075895 373265 1246583 721116 743678 731278 778460 1041057
16368 1041057 1397761 897001 817542 568628 1006402 580213 479743 838390 578783 845409
16358 845409 744190 874727 752954 699828 295661 938769 541684 575971 924997 594256
16348 594256 743403 502178 359705 673628 939709 627218 943710 753183 577741 718146
$$ packed form
16420I50685J10738j13459J93817k64520L41703j38230j59584n05J15800Q9158
16410A125603p8741R5591j93670k4054K327j18918R2693p9899K93719k19377j12891
16399G82383L00078l14713Q4875k8996l5750M67N023J04792J85072m50727J56332
16388G88836L5063R4998j86480Q1001J75357l11772K91046k22421J38767l02687
16378E81708K1610P4640L97937C73265Q73318n25467K2562j2400M7182K62597
16368A041057L56704n00760p9459k48914M37774m26189j00470L58647k59607K66626
16358H45409j01219J30537j21773n3126B95661O43108l97085L4287L49026l30741
16348E94256J49147k41225j42473L13923K66081l12491L16492j90527j75442J40405
$$ plain form
16338 718146 659840 510666 651545 398206 472392 474972 725452 710992 695783 577085 707818
16327 707818 821884 940341 561675 678422 525140 318035 919585 1050295 581383 813798
16317 813798 746721 730658 498894 666323 672257 608758 420292 448835 352746 264641 207548
16306 207548 473764 483702 574115 532807 503873 618293 715317 427952 581124 478781 503042
16295 503042 273382 366965 711389 445492 535244 225294 798032 514941 238149 560464
16285 560464 584268 731298 828918 703602 711572 314665 621579 546729 37769 244717 502971
16274 502971 242236 446569 596917 538958 427587 285713 363214 808522 157470 256529
16264 256529 341432 197157 668484 647728 132658 222489 408807 379639 227158 430394
$$ packed form
16338G18146n8306j49174J40879k53339P4186K580K50480j4460j5209j18698J30733
16327G07818J14066J18457l78666J16747j53282k07105O01550J30710m68912K32415
16317H13798o7077j6063k31764J67429N934o3499j88466K8543r6089q8105n7093
16306B07548K66216R938R0413m1308k8934J14420R7024k87365J53172j02343K4261
16295E03042k29660R3583L44424k65897Q9752B25294N72738k83091B38149L22315
16285E60464K3804J47030R7620j25316P970C14665L06914p4850C7769K06948K58254
16274E02971B42236K04333J50348n7959j11371j41874P7501M45308A57470R9059
16264B56529Q4903j44275M71327k0756A32658Q9831J86318k9168j52481K03236
$$ plain form
16254 430394 286699 364988 825100 700783 584926 289253 469702 488399 753170 395754
16244 395754 290676 540062 -33646 128133 678026 242833 558462 552104 165526 424044
16234 424044 455907 377727 269518 316081 517980 177828 141896 186530 214744 213403 513984
16223 513984 238079 427737 113874 550764 542606 346229 430573 174252 287112 -7505
16212 300942 246882 506032 78708 556731 356638 411180 319465 292360 366788 361553 167597
16200 25905 123171 130836 337411 255366 390774 159226 233268 596144 259130 342416 592522
16189 592522 457119 232885 338977 439660 196564 210213 401578 373889 198741 258676
16179 258676 102419 131635 283992 232305 162006 262286 -117253 182735 90810 263776
$$ packed form
16254D30394j43695P8289M60112j24317j15857B89253J80449J8697K64771l57416
16244C95754j05078K49386c3646A28133N49893B42833L15629o358A65526K58518
16234D24044L1863p8180j08209M6563K01899A77828l5932M4634K8214j341L00581
16223E13984B38079J89658A13874M36890q158j96377Q4344A74252J12860g505
16212C00942n4060K59150G8708M78023k00093N4542r1715k7105P4428n235A67597
16200B5905R7266P665K06575q2045J35408A59226P4042L62876B59130Q3286K50106
16189E92522j35403k24234J06092J00683A96564J3649J91365k7689j75148N9935
16179B58676A02419K9216J52357n1687p0299J00280a17253A82735I0810J72966
$$ plain form
16169 263776 32986 107189 458795 170068 67326 173965 235958 421434 242339 259502
16159 259502 255456 318172 196560 -155511 337469 484914 -95987 250315 456230 155574
16148 168951 13007 322739 504946 142050 -23915 108560 168943 239448 -48343 -24498 423714
16136 -85094 131759 384663 315381 -155860 377938 279316 18124 133928 495821 441252
16126 441252 301043 131134 440654 62623 232554 302659 150963 336510 270428 -78666
16115 406335 113515 43922 -3991 148465 -265961 363011 235235 266617 187277 112682 84667
16104 84667 253811 210464 77787 437854 -178714 354221 374159 78269 -19669 303988 -70610
16092 352821 279671 382283 98609 -55486 -74835 308162 147847 137201 122009 182362 140100
$$ packed form
16169B63776C2986P4203L51606A70068F7326J06639O1993J85476j79095J7163
16159B59502m046O2716j21612a55511C37469J47445i5987B50315K05915A55574
16148A68951A3007L09732J82207A42050b3915A08560O0383P0505d8343K3845D23714
16136h5094A31759K52904o9282a55860C77938r8622A8124J15804L61893n4569
16126D41252j40209A31134L09520F2623J69931P0105A50963J85547o6082g8666
16115D06335A13515D3922c991A48465b65961C63011j27776L1382p9340p4595k8015
16104H4667J69144m3347G7787L60067a78714C54221J9938G8269a9669C03988g0610
16092C52821p3150J02612I8609e5486j9349C08162A47847j0646j5192O0353m2262
$$ plain form
16081 140100 110548 87912 88195 260462 479654 290158 255657 355534 -64401 -126029 467865
16069 -47085 92373 -141534 -193440 130815 30171 240595 -363583 189027 291079 19612
16058 139790 102465 135998 270893 274479 13627 248683 -271504 175568 175093 235137 164594
16047 164594 73102 27611 63491 405675 -35312 -59765 405090 97174 29084 -85026 234230
16035 9618 86711 294957 45479 190877 89792 -198763 -56766 68807 -156627 13384 39056
16024 39056 -5575 16621 28184 29258 115870 123723 356628 -44996 -249596 -159611 -30057 -76921
16012 -76921 252903 123434 -106114 -113890 -228284 18602 224632 165414 185601 -328262 86019
16000 246453 141739 266436 -45372 -94336 -22467 309182 144400 -165364 -136723 -64192
$$ packed form
16081A40100k9552k2636K83J72267K19192j89496l4501R9877f4401o1628D67865
16069d7085I2373a41534n1906A30815C0171K10424c63583A89027J02052A9612
16058A39790l7325L3533J34895L586A3627K35056b71504A75568m75O0044p0543
16047A64594G3102B7611L5880L42184c5312k4453D05090I7174B9084h5026B34230
16035I618P7093K08246D5479J45398H9792a98763e6766F8807a56627A3384K5672
16024C9056e575A6621J1563J074Q6612P853K32905d4996k04600Q9985c0057m6864
16012g6921B52903A23434a06114p776j14394A8602K06030n9218K0187c28262H6019
16000B46453j04714J24697d5372m8964b2467C09182A44400a65364K8641f4192
$$ plain form
15989 86300 66061 -149202 323659 -6046 -112321 434721 -226527 131670 -23328 48132 -65213
15977 181402 323820 -75329 -60670 368634 363488 766513 1094199 1191781 1235588 935375 617121
15966 617121 808738 186161 177956 209997 78092 239978 -85836 141558 348763 128159
15955 395749 176550 142655 259482 194637 -135352 215173 7514 -39211 -42522 -339855 245249
15943 -172645 209983 202448 11371 -251232 7747 80199 -3455 51711 -25905 -118533 137129
15931 -170314 195254 -543451 -210749 -45795 35421 43735 -291447 -211739 279809 369277 -178057
15919 -56965 -272462 -117962 -11573 -193251 -52269 46094 50877 210693 175073 -73642 231678
15907 -45423 163866 -219821 126165 106653 -67363 -93347 10934 -22958 273315 18957 -145674
$$ packed form
15989H6300k0239a49202C23659f046j06275D34721b26527A31670b3328D8132f5213
15977A81402J42418g5329J4659C68634n146M03025L27686R7582M3807l00213l18254
15966F17121J91617A86161q205L2041G8092J61886h5836A41558K07205A28159
15955C95749A76550l3895J16827o4845a35352B15173G514c9211l311k97333B45249
15943a72645B09983p535A1371b51232G747P2452c455E1711b5905r2628A37129
15931a70314A95254e43451b10749d5795C5421Q314b91447P9708B79809Q9468a78057
15919e6965k15497a17962a1573j81678e2269D6094M783J59816l5620g3642B31678
15907d5423A63866b19821A26165j9512f7363k5984A0934b2958B73315A8957a45674
$$ plain form
15895 47494 -158858 -4772 51432 -274434 187418 -301247 93712 277163 117594 142920 189555
15884 189555 63304 126388 317283 191671 61857 -109307 216765 -1878 11373 -42779 141126
15872 156971 -161301 65462 165696 -3919 4617 -22396 -263949 -116813 -162497 -247351 -99552
15860 -34072 422304 -33582 -364424 120450 -18960 110604 141569 -35270 -60020 109023 243440
15849 243440 -308529 19559 107265 -189152 93992 102613 -332098 19969 -119388 -66491 -31819
15837 901 -6345 -76780 201026 -35111 -8005 -110405 -385524 -117393 -53973 148719 143595 93246
15825 93246 -27412 -55660 83126 217916 165651 71265 -185870 331451 -11995 14336 -456032
15813 -296188 -7680 -53230 -171028 -237065 66277 -44726 198100 -234019 33928 -69814 -281176
$$ packed form
15895D7494a58858d772E1432b74434A87418c01247I3712J83451A17594K5326M6635
15884A89555F3304O3084J90895j25612F1857a09307B16765a878A1373d2779A41126
15872A56971a61301F5462J00234c919D617b2396k41553a16813m5684q4854i9552
15860c4072D22304c3582l30842A20450a8960A10604L0965c5270k4750A09023J34417
15849B43440c08529A9559Q7706a89152I3992Q621c32098A9969a19388N2897c1819
15837I01f345p0435B01026c5111h005j02400k75119a17393e3973A48719n124n0349
15825I3246b7412k8248H3126J34790n2265G1265a85870C31451a1995A4336d56032
15813b96188g680m5550j17798o6037F6277d4726A98100b34019C3928f9814k11362
$$ plain form
15802 -281176 -275994 -8271 179144 121596 -409666 -76132 -305978 -68068 -209896 267376 -129250
15790 188070 -10150 143928 -227177 311116 108069 -94576 -342864 16934 -265587 267119
15779 115585 -155330 -130405 -43106 -131755 -91323 -67051 -262694 -137654 -233514 -101247 -298159
15768 -298159 -74750 -172800 272010 -161501 -380468 12934 57571 40811 47211 -161973 -88298
15757 -88298 5778 -238304 190803 -97785 190703 -83250 -30819 -198833 235965 151101 205047
15746 205047 183187 10309 78230 226067 134293 -146279 -39908 -154729 146073 224600 41724
15734 103657 103912 103622 37449 -67975 190470 -80596 289605 233750 46857 -123270 -30539 -98984
15722 -98984 52191 208366 -243494 276880 117289 -56558 384413 189696 734 -187014 -252073
$$ packed form
15802b81176N182h271A79144n7548d09666g6132k29846f8068j41828B67376a29250
15790A88070a0150A43928b27177C11116A08069i4576k48288A6934b65587B67119
15779A15585a55330K4925d3106q8649M0432K4272j95643J25040r5860a01247j96912
15768b98159g4750r8050B72010a61501k18967A2934M4637j6760O400a61973P3675
15757h8298E778b38304A90803i7785A90703h3250c0819j68014B35965q4864N3946
15746B05047k1860A0309O7921J47837r1774a46279c9908j14821A46073P8527D1724
15734A03657K55k90C7449f7975A90470h0596B89605n5855D6857a23270c0539o8445
15722i8984E2191J56175b43494B76880A17289e6558C84413A89696G34a87014o5059
$$ plain form
15711 -252073 -137446 -43483 8265 -165831 -196288 134426 -104585 -192159 -6073 -179181 -65993
15699 144207 -54017 221524 -80317 122210 162927 -178187 129199 -33021 137036 -144351
15688 -113459 125286 -10821 -79259 205880 177486 23902 -77639 339900 -149443 173378
15677 -67377 -94274 128818 64282 -72622 83381 -150115 -178817 -140551 -238774 -276003 64974
15665 -184363 159367 -60311 35354 -61199 -113118 -165078 -146614 -278062 -141511 -361969 480991
15653 -242505 -139436 -14167 -134319 -226725 -57239 252459 -48620 -117070 -264967 -187293 121299
15641 -117289 -203400 -206352 105586 11969 -298532 -198501 283457 -319784 -64929 32439 159180
15630 159180 242298 283363 -20510 -5653 -156928 5405 -38178 -260492 -148249 184233 -455074
$$ packed form
15711b52073J14627d3483H265a65831l0457A34426a04585q7574f073j73108f5993
15699A44207e4017B21524h0317A22210M0717a78187A29199c3021A37036a44351
15688a13459A25286a0821o8438B05880k8394B3902g7639C39900a49443A73378
15677f7377k6897A28818F4282g2622H3381a50115k8702L8266r8223l7229F4974
15665a84363A59367f0311C5354f1199n1919n1960J8464j31448J36551k20458D80991
15653b42505J03069a4167j20152r2406e7239B52459d8620o8450j47897P7674A21299
15641a17289q6111k952A05586A1969b98532J00031B83457c19784f4929C2439J26741
15630A59180Q3118M1065b0510e653j51275E405c8178k22314J12243A84233d55074
$$ plain form
15618 62180 -82330 214315 123985 -625706 255996 -119039 -38635 428906 -25934 -277765
15608 -277765 63513 -32661 50549 -331560 -150462 139786 79986 -147544 142649 -283337
15597 35527 -369431 -184217 70314 -146185 4652 -51239 -231975 -344307 -81194 131946 109648
15586 109648 212770 269539 -101000 -47435 41798 -270674 224448 146439 -146239 81257
15575 -15327 457 82408 -109835 -191934 3205 232003 -114233 -194563 44521 -366044 450168
15563 -43758 -266050 -304417 19477 -289460 -64371 97171 174803 243557 -34211 -377807 -200805
15552 -200805 71988 -220884 68724 260710 -37886 42390 -91595 187929 -120144 -154580 -408966
15541 -408966 6567 223566 -195945 -211242 7344 -291466 -80943 -87835 -187066 -62843 -86235
$$ packed form
15618F2180h2330B14315r0330f25706B55996a19039c8635D28906b5934k51831
15608b77765F3513c2661E0549c31560a50462A39786n9800a47544A42649b83337
15597C5527c69431a84217G0314a46185D652e1239j80736j12332h1194A31946k2298
15586A09648J03122N6769a01000d7435D1798b70674B24448p8009a46239H1257
15575a5327D57Q1951a09835q2099C205K28798a14233q0330D4521c66044D50168
15563d3758k22292l8367A9477b89460f4371I7171P7632O8754c4211l43596J77002
15552b00805G1988b20884F8724J91986c7886D2390i1595A87929a20144l4436k54386
15541d08966F567K16999a95945j5297G344b91466h0943o892r9231f2843k3392
$$ plain form
15530 -86235 87680 42896 -31171 66279 -53879 60824 -64775 172845 357226 179336 188434
15519 188434 -246271 -103444 33081 -127620 -120390 450548 -159907 -47974 8188 111127 145808
15508 145808 -81277 238375 107904 -232248 -31777 276977 78390 105172 -28688 198732
15497 -168549 333193 46269 82361 107739 119944 -119176 345971 158481 224671 -132460
15486 140166 -61371 89635 -19503 125223 232998 342988 232587 439561 258813 258288 58969
15474 134455 78066 -265403 -49663 157721 308132 -254622 -278227 165197 104863 36138
15463 232835 277324 -68480 512363 60857 501996 680681 653794 425320 430846 363274 11440
15451 171891 475813 246072 13575 -189548 212537 -194424 -78893 104685 359512 -101638
$$ packed form
15530h6235H7680D2896c1171F6279e3879F0824f4775A72845J84381j77890R098
15519A88434b46271a03444C3081a27620P230D50548a59907d7974H188J02939L4681
15508A45808h1277B38375A07904b32248c1777B76977G8390K6782b8688A98732
15497a68549C33193D6269L6092K5378J2205a19176C45971A58481O6190a32460
15486A40166f1371H9635a9503A25223J07775J09990j10401K06974j80748n25E8969
15474A34455n6389b65403d9663A57721J50411b54622k3605A65197o0334C6138
15463B32835M4489f8480E12363F0857M41139J78685k6887k28474N526o7572A1440
15451A71891L03922k29741A3575a89548B12537a94424g8893A04685K54827a01638
$$ plain form
15440 198973 -183750 99641 -65239 194102 -42867 318737 -42900 208570 90753 154241 300729
15429 300729 477790 231455 594604 860862 880718 864490 564528 517999 221181 98043
15418 -76740 -16461 -92431 -9350 225801 131900 63903 -87620 204444 -26660 -49779 -87741
15407 -87741 -72607 -1786 -32231 -13324 332400 77775 -35470 86215 -70862 134306 -118569
15395 149772 533146 -286327 -83886 -356316 -54448 231290 164227 11675 127556 209162
15385 209162 -305490 -87920 -37683 151835 -80684 -135780 -149235 -208220 -14279 183392 233900
15374 233900 -171234 -58560 -36067 135318 273560 -9583 147130 -114710 -75755 -53435 359594
15362 116130 140090 -132838 -31359 196503 418302 106148 501314 304729 183276 11822
$$ packed form
15440A98973a83750I9641f5239A94102d2867C18737d2900B08570I0753O3488J46488
15429C00729J77061B31455L63149K66258J9856j6228k99962m6529B21181I8043
15418g6740a6461p5970i350B25801r3901F3903h7620B04444b6660k3119l7962
15407h7741J5134a786l0445a3324C32400G7775c5470H6215g0862A34306a18569
15395A49772L83374b86327h3886k72430e4448B31290o7063A1675J15881Q1606
15385B09162c05490h7920c7683A51835h0684n5096j3455n8985a4279A83392N0508
15374B33900a71234e8560K2493A35318J38242i583A47130a14710L8955K2320C59594
15362A16130K3960a32838c1359A96503K21799A06148L95166j96585j21453A1822
$$ plain form
15351 280014 28084 177121 330612 183832 276712 145748 206200 71572 62880 149485 288720
15340 288720 314390 232197 195080 -111374 176412 18797 74486 456555 -169374 -25799 2349
15328 320690 152553 267847 191695 -24859 487841 223085 361310 116162 -21372 28917
15317 80064 -186484 -48212 211695 312573 207501 -90266 217469 161744 -184427 201607
15306 284025 219343 63778 317962 252839 610294 255047 330770 -120990 415093 304926
15296 304926 140099 195598 451951 14769 -107806 85655 234077 130283 200942 52940
15285 17648 63881 241309 73349 -139029 134044 -15112 -69965 105201 80342 -10471 82264
15273 138933 340370 -158483 41431 504103 160396 145474 642589 138500 254812 -238946
$$ packed form
15351B80014B8084J49037J53491j46780R2880j30964O0452G1572q692Q6605J39235
15340B88720K5670q2193l7117a11374A76412A8797N5689L82069a69374b5799B349
15328C20690A52553J15294p6152b4859D87841B23085J38225A16162b1372B8917
15317H0064a86484d8212B11695J00878j05072i0266B17469n5725a84427B01607
15306B84025o4682F3778K54184o5123L57455B55047P5723a20990D15093j10167
15296C04926A40099N5499K56353A4769a07806H5655J48422j03794P0659E2940
15285A7648M6233J77428G3349a39029A34044a5112n4853A05201k4859a0471H2264
15273A38933K01437a58483D1431M62672A60396j4922M97115A38500J16312b38946
$$ plain form
15262 152994 -182217 -56950 -67519 113303 -132738 130174 -116641 97820 169462 74699
15251 -124231 93422 677069 -22547 354251 120906 -77405 189547 63729 171543 8991 21697
15240 21697 215525 -251603 -17086 -33532 251099 73221 -70018 -44793 720846 353988 711516
15229 711516 758150 1554795 845553 1477132 1456031 933628 419322 448376 284652 -54599
15218 177959 175039 -157541 220594 -120045 105752 -331154 -77059 117796 95074 -42209
15207 109341 -30187 79656 56364 -110453 16109 104569 -349137 64209 62893 81839 298516
15196 298516 -6836 125821 194692 201846 244831 118846 443951 382810 63074 -21157 85089
15184 346783 121762 165166 142495 277923 125620 -38483 105876 411291 -26403 375289
$$ packed form
15262A52994a82217e6950j0569A13303a32738A30174a16641I7820P1642G4699
15251a24231I3422N83647b2547C54251A20906g7405A89547F3729J07814H991J2706
15240B1697J93828b51603a7086j6446B51099G3221g0018K5225G20846C53988L57528
15229G11516M6634P96645p09242O31579k1101n22403D19322K9054j63724e4599
15218A77959k920a57541B20594a20045A05752c31154g7059A17796k2722d2209
15207A09341c0187G9656k3292a10453A6109Q8460c49137F4209j316J8946K16677
15196B98516f836A25821O8871P154M2985A18846L25105o1141F3074b1157H5089
15184C46783A21762M3404k2671J35428A25620c8483A05876L05415b6403C75289
$$ plain form
15173 126085 323852 -106284 134690 -134161 286022 107144 11914 314634 -31347 30878
15162 386264 -81504 367000 -178983 297870 -30286 148347 216741 -121294 150519 43899
15151 74948 42275 531184 204333 217916 -131698 164525 207760 -16727 234698 -32799 249186
15139 -61725 409466 88174 34477 75492 95493 -22526 209424 294818 285205 96527 307054
15128 307054 31000 165138 -106003 -26302 -49225 199340 28770 170871 86149 -21739 -70468
15117 -70468 145194 -92002 319756 167427 5796 332527 261956 130543 205066 22786 177647
15106 177647 -49810 139137 506207 578825 417005 177547 115465 183729 224660 186011 245225
15095 245225 362609 143357 112439 106743 -133806 -155299 308450 252522 110605 15575 -187063
$$ packed form
15173A26085J97767a06284A34690a34161B86022A07144A1914L02720c1347C0878
15162C86264h1504C67000a78983B97870c0286A48347O8394a21294A50519D3899
15151G4948l2673M88909B04333J3583a31698A64525M3235a6727B34698c2799B49186
15139f1725D09466H8174C4477M1015K0001b2526B09424Q5394r613I6527K10527
15128C07054C1000J34138a06003b6302k2923A99340B8770J42101q4722b1739m8729
15117g0468A45194i2002C19756j52329E796L26731p0571A30543P4523B2786J54861
15106A77647d9810A39137L67070P2618j61820A77547o2082O8264M0931l8649N9214
15095B45225J17384A43357l0918n696a33806k1493C08450n5928A10605A5575a87063
$$ plain form
15083 200499 -38075 9266 134261 208309 211804 156525 -99528 341831 296119 207459 230456
15072 230456 281976 165024 328402 355037 448005 301110 17640 -220816 30202 424897
15062 424897 268670 258767 412706 30700 229682 243093 405649 277594 375891 279561 77592
15050 81433 48508 180515 351472 192740 189215 211056 402180 466896 253387 69793 49369
15039 49369 518230 441737 65636 194134 311366 390334 530202 205132 303481 62549 343468
15028 343468 640513 390648 236017 304570 219258 244960 4152 375427 241316 219974 446182
15017 446182 701433 399128 923876 842757 652516 588140 841257 618877 600980 448030
15007 448030 390531 341306 655820 559102 564735 173119 765874 495527 285841 474341
$$ packed form
15083B00499c8075I266J24995P4048L495n5279i9528C41831m5712q8660K2997
15072B30456N1520j16952J63378K6635R2968j46895A7640b20816C0202L94695
15062D24897j56227r903J53939C0700J98982J3411J62556j28055R8297r6330G7592
15050H1433l2925J32007J70957j58732l525K1841J91124O4716k13509F9793k0424
15039D9369M68861p6493F5636J28498J17232P8968J39868B05132R8349F2549K80919
15028C43468K97045k49865j54631O8553q5312K5702D152L71275j34111k1342K26208
15017D46182K55251l02305N24748q1119j90241o4376K53117k22380j7897j52950
15007D48030n7499m9225L14514r6718N633A73119N92755k70347k09686J88500
$$ plain form
14997 474341 215208 -29405 805224 306382 673777 429725 313149 461048 135800 537811
14987 537811 452649 36956 442391 515335 219153 369963 738206 873963 662557 107018
14976 103680 522505 614759 223927 612243 851761 437667 465635 476081 752948 697808
14966 697808 710836 794445 1178800 562822 756325 150162 418593 295947 464143 315874
14956 315874 499717 368422 720717 315199 488543 678614 394750 559062 212841 656198
14946 656198 690514 54261 493110 234307 529853 473642 292824 277536 466463 158822
14935 574526 498298 590296 623226 592755 274542 129444 412258 312841 651549 850557
14925 850557 814824 577075 425039 530337 509732 307869 382301 575699 481766 571596
$$ packed form
14997D74341B15208b9405H05224C06382L67395k44052j16576J47899A35800M02011
14987E37811q5162C6956M05435P2944B19153J50810L68243J35757k11406A07018
14976A03680M18825R2254B23927L88316K39518m14094K7968J0446K76867n5140
14966F97808J3028Q3609L84355E62822J93503A50162K68431j22646J68196j48269
14956C15874J83843j31295L52295C15199J73344J90071k83864J64312B12841M43357
14946F56198L4316E4261M38849B34307K95546n6211j80818j5288J88927A58822
14935E74526p6228R1998L2930l0471B74542A29444K82814r9417L38708J99008
14925H50557l5733k37749j52036J05298k0605k01863P4432J93398r3933Q9830
$$ plain form
14915 571596 1056424 1087091 1184371 1010780 1416880 1453227 1560501 1841652 1696550 1255637
14905 1255637 1418405 1486898 1324343 1756686 1914700 2269562 1968300 1897167 1630812 1149393
14895 1149393 1013523 936571 1019905 656401 622833 320960 478213 479016 661435 399695
14885 399695 608139 521644 598159 374133 712279 610174 510251 111243 450044 279923
14875 279923 322372 338718 636288 473007 656825 459667 711727 892553 790900 993018
14865 993018 570764 656026 899354 874241 764660 765895 676187 685582 318565 348464 700919
14854 700919 632776 581506 621964 786416 569486 714209 644837 703549 816468 474831
14844 474831 375404 440189 389822 771173 443305 529429 264933 301197 574417 653197 921529
$$ packed form
14915E71596M84828L0667R7280j73591M06100L6347J07274K81151j45102m40913
14905A255637J62768O8493j62555M32343J58014L54862l01262p1133k66355m81419
14895A149393j35870p6952Q3334l63504l3568l01873J57253Q03J82419k61740
14885C99695K08444q6495P6515k24026L38146j02105r9923A11243L38801j70121
14875B79923M2449J6346K97570j63281J83818j97158K52060J80826j01653K02118
14865I93018m22254Q5262K43328k5113j09581J235q9708R395C18565K9899L52455
14854G00919o8143n1270M0458J64452k16930J44723o9372N8712J12919l41637
14844D74831r9427O4785n0367L81351l27868Q6124k64496L6264K73220P8780K68332
$$ plain form
14833 921529 136271 569245 672451 516021 891459 669143 696619 1117935 1163363 1125171
14823 1125171 954839 1053495 1125608 1344437 718915 867410 708475 683444 641692 926077
14813 926077 424091 693397 458061 669803 600697 502551 364507 749060 496758 633878
14803 633878 707154 723822 470024 528598 520243 509004 679773 672969 775491 471640 630050
14792 630050 902330 642008 743526 1028579 631554 803902 867178 861409 746337 1022066
14782 1022066 665828 882058 368832 426367 1001027 1141065 591525 696232 418110 390486
14772 390486 607680 694840 675721 644363 464847 548218 874771 550256 892617 419188
14761 716678 976897 815121 1157243 715158 962936 828681 688520 910606 664134 674219
$$ packed form
14833I21529A36271M32974J03206j56430L75438k22316K7476M21316M5428l8192
14823A125171j70332R8656P2113K18829o25522J48495j58935k5031m1752K84385
14813I26077D24091K69306k35336K11742o9106r8146j38044L84553k52302J37120
14803F33878P3276J6668k53798N8574q355j1239J70769o804J02522l03851J58410
14792F30050K72280k60322J01518K85053l97025J72348O3276n769j15072K75729
14782A022066l56238K16230C68832N7535N74660J40038n49540J04707k78122k7624
14772C90486K17194Q7160j9119l1358j79516Q3371L26553l24515L42361D19188
14761G16678K60219j61776L42122m42085K47778j34255j40161K22086k46472J0085
$$ plain form
14751 674219 617505 526100 670528 842371 614695 653528 703889 587258 606239 756125
14741 756125 544921 739878 664017 878843 543941 838117 762942 526344 601539 815805
14731 815805 584557 809614 895023 593947 757375 770862 691555 987593 919554 907610
14721 907610 1086400 919214 707433 1045465 922654 925572 835264 1108742 1209990 1299460
14711 1299460 1552415 2007794 1471494 1510602 1570826 1288277 1322235 887848 1033374 1200347
14701 1200347 885959 830075 819624 1028299 1036352 758577 1160069 841100 870955 1366805
14691 1366805 912785 971276 1091731 1151934 1502921 1549888 1358213 1834330 1734089 1173606
14681 1173606 1636276 1318720 1044979 1169939 880002 1273426 733130 1072928 994834 633464
$$ packed form
14751F74219n6714r1405J44428J71843k27676L8833N0361j16631J8981J49886
14741G56125k11204J94957p5861K14826l34902K94176p5175k36598P5195K14266
14731H15805k31248K25057Q5409l01076J63428J3487p9307K96038o8039j1944
14721I07610J78790j67186k11781L38032j22811K918r0308K73478J01248Q9470
14711A299460K52955M55379n36300L9108O0224k82549L3958m34387J45526J66973
14701A200347l14388n5884j0451K08675Q053k77775M01492l18969K9855M95850
14691A366805m54020N8491J20455O0203L50987M6967j91675M76117j00241n60483
14681A173606M62670l17556k73741J24960k89937L93424n40296L39798p8094l61370
$$ plain form
14671 633464 994707 1192681 915934 771995 1149540 937281 929435 980664 786620 963302
14661 963302 1070374 1174017 1084607 779496 744766 1268709 1017141 874937 974988 840819
14651 840819 1144438 737353 1082313 1138438 1438860 1182837 1216649 1012537 1224886 1061679
14641 1061679 1081637 1281552 1309069 1292791 1369569 1396377 1582871 1429635 1379730 1234072
14631 1234072 1200555 1146698 1302715 1021508 1888554 1064117 1363066 1343021 1660848 1321318
14621 1321318 1464210 1583688 1331075 1228367 1237970 1566322 1570174 1606185 1155559 1216381
14611 1216381 1530818 1535199 1590517 1449090 1560706 1556427 1401803 1576543 1406504 1567463
14601 1567463 1740738 1344118 1665321 1605383 1466546 1596995 1294449 1551882 1415089 1630185
$$ packed form
14671F33464L61243J97974k76747j43939L77545k12259p846N1229j94044J76682
14661I63302J07072J03643q9410l05111l4730N23943k51568j42204J00051j34169
14651H40819L03619m07085L44960N6125L00422k56023L3812k04112K12349j63207
14641A061679J9958J99915K7517j6278P6778K6808J86494j53236m9905j45658
14631A234072l3517n3857J56017k81207Q67046q24437K98949k0045L17827l39530
14621A321318J42892J19478k52613j02708R603L28352L852L6011m50626O0822
14611A216381L14437M381N5318j41427J11616m279j54624J74740j70039J60959
14601A567463J73275l96620L21203n9938j38837J30449l02546K57433j36793K15096
$$ plain form
14591 1630185 1821437 1842799 1569989 1526537 1576948 1765872 2020725 1783318 2164999 1894622
14581 1894622 1979354 1975806 1635821 1994000 1820658 1850688 1635465 1943577 1888841 1770438
14571 1770438 1933232 1806710 1986363 2094394 1917283 1885810 1751767 2149041 2102070 2160402
14561 2160402 2133157 1933758 2075736 2126672 2459697 2328620 2348992 2415219 2393710 2310935
14551 2310935 2566043 2934997 2784545 2972877 2516229 3043044 2805622 3058922 3410185
14542 3410185 3538484 3638772 3674209 4263790 4791133 5471525 6239854 7603032 9801159
14533 9801159 13732074 20574053 30865859 32687188 19231344 11400020 7164368 5415944
14525 5415944 4896647 4982926 5684684 3756703 2970287 3031280 2580372 2776734 2412766 2333197
$$ packed form
14591A630185J91252K1362k72810m3452N0411J88924K54853k37407L81681k70377
14581A894622Q4732l548l39985L58179j73342L0030k15223L08112n4736j18403
14571A770438J62794j26522J79653J08031j77111l1473j34043L97274m6971N8332
14561B160402k7245j99399J41978N0936L33025j31077K0372O6227k1509q2775
14551B310935K55108L68954j50452J88332m56648N26815k37422K53300L51263
14542C410185J28299J00288L5437N89581N27343O80392P68329J363178K198127
14533I801159L930915O841979J0291806J821329j3455844p831324m235652j748424
14525E415944n19297Q6279P01758j927981p86416O0993m50908J96362l63968p9569
$$ plain form
14515 2333197 2431045 2619909 2466572 2497508 2572708 2297476 2517265 2586484 2408117 2821900
14505 2821900 2448548 2282937 2665894 2469992 2837139 3086893 2735846 3333029 2707519
14496 2707519 3123537 3128374 3109726 2760383 2704945 2986125 3123872 3261186 2841826 3133915
14486 3133915 2861073 3187197 3081201 3315547 3480743 3978741 3444062 3608863 3459833
14477 3459833 3759780 3506031 3565773 3535340 3675400 3344100 3645074 3760260 3993933 3774706
14467 3774706 4032319 3610580 3955872 3937068 3907436 4045698 3722558 4107213 4178837 4196371
14457 4196371 4441653 4600240 4634392 4163508 4426452 5051484 4763253 4316109 4566576 4786991
14447 4786991 5083417 5084408 4928328 4954895 5231379 5164052 5533680 5419399 5596264 5285287
$$ packed form
14515B333197R7848J88864j53337L0936P5200k75232K19789O9219j78367M13783
14505B821900l73352j65611L82957j95902L67147K49754l51047N97183o25510
14496B707519M16018M837j8648l49343n5438K81180J37747J37314m19360K92089
14486C133915k72842L26124j05996K34346J65196M97998n34679J64801j49030
14477C459833K99947k53749N9742l0433J40060l31300L00974J15186K33673k19227
14467C774706K57613m21739L45292j8804k9632J38262l23140L84655P1624J7534
14457D196371K45282J58587L4152m70884K62944O25032k88231m47144K50467K20415
14447D786991K96426R91j56080K6567K76484o7327L69628j14281J76865l10977
$$ plain form
14437 5285287 5420091 5688185 5678460 5765689 5756490 5583274 6142926 5809561 5996218 6098147
14427 6098147 6007866 6341829 6428822 6407286 6343836 6453995 6789015 6863817 7124348 6804954
14417 6804954 7340252 7294518 7251173 7214912 7559385 7444781 7311885 8130095 7733282 7966657
14407 7966657 7944437 8162577 8322290 8513658 8606491 9213757 9139075 9394494 9246382 9560220
14397 9560220 9107169 9354388 9597729 9839499 9872834 10194250 10493124 10743404 10593935 10840894
14387 10840894 11234972 10951306 10841372 11399097 11757121 11711808 11857697 12015281 12127504
14378 12127504 12550929 12270950 12757676 13312322 13187534 13413846 13943565 13836028 14360005
14369 14360005 14608507 14809373 14962323 15952406 15806620 16008358 16774489 16495336 17013126
$$ packed form
14437E285287J34804K68094r725Q7229r199j73216N59652l33365J86657J01929
14427F098147r0281L33963Q6993k1536o3450J10159L35020P4802K60531l19394
14417F804954N35298m5734m3345l6261L44473j14604j32896Q18210l96813K33375
14407G966657k2220K18140J59713J91368R2833O07266p4682K55419j48112L13838
14397I560220m53051K47219K43341K41770L3335L21416K98874K50280j49469K46959
14387A0840894L94078k83666j09934N57725L58024m5313J45889J57584J12223
14378A2127504M23425k79979M86726N54646j24788K26312N29719j07537N23977
14369A4360005K48502K00866J52950R90083j45786K01738P66131k79153N17790
$$ plain form
14360 17013126 17206267 17489223 17814030 18043434 18401065 19236952 19404156 19796076 20177614
14351 20177614 20686232 21126920 21468828 22004156 22340354 22920845 23227486 23839970 24413051
14342 24413051 24967756 25427350 26134709 26915866 27269981 28219957 28739981 29331029 30335496
14333 30335496 31238104 32281630 32856251 33843294 34657587 35415609 36596786 37404397 38317257
14324 38317257 39653994 40342804 41897467 43020116 44170166 45773390 46952856 48650747
14316 48650747 50346713 51816861 53382424 55155017 56949553 58823163 60769745 63111220
14308 63111220 65480685 67303240 69984849 72608617 75403883 78293596 81409153 84034516
14300 84034516 87467314 90889426 94399838 98324739 102503032 107218828 111565139 116433094
$$ packed form
14360A7013126J93141K82956L24807K29404L57631Q35887J67204L91920L81538
14351B0177614N08618M40688L41908N35328L36198N80491L06641O12484N73081
14342B4413051N54705M59594P07359P81157L54115R49976N20024N91048J004467
14333C0335496R02608J043526N74621R87043Q14293P58022J181177Q07611R12860
14324C8317257J336737O88810J554663J122649J150050J603224J179466J697891
14316D8650747J695966J470148J565563J772593J794536J873610J946582K341475
14308F3111220K369465J822555K681609K623768K795266K889713L115557K625363
14300H4034516L432798L422112L510412L924901M178293M715796M346311M867955
$$ plain form
14292 116433094 121520429 127363051 132881976 139119978 145589410 152180408 159816261 167459179
14284 167459179 175536179 184066880 193077810 202482701 212849116 223620896 234924049
14277 234924049 246845156 259179600 272179375 285774558 300186651 314486223 328865346
14270 328865346 343393752 357900923 371991081 385551559 398364023 410414292 421749114
14263 421749114 432525626 441975015 450379144 457311522 463270215 466896479 466967426 466086337
14255 466086337 466589557 462690845 454324365 448345837 440219861 428280980 415606043 402056334
14247 402056334 388093619 374699858 360640659 345936372 331622017 316949498 302579062
14240 302579062 288507322 275365701 262087031 249371791 237013224 225825736 215006126
$$ packed form
14292A16433094N087335N842622N518925O238002O469432O590998P635853P642918
14284A67459179Q077000Q530701R010930R404891J0366415J0771780J1303153
14277B34924049J1921107J2334444J2999775J3595183J4412093J4299572J4379123
14270C28865346J4528406J4507171J4090158J3560478J2812464J2050269J1334822
14263D21749114J0776512R449389Q404129O932378N958693L626264P0947q81089
14255D66086337N03220l898712q366480n978528q125976j1938881j2674937j3549709
14247D02056334j3962715j3393761j4059199j4704287j4314355j4672519j4370436
14240C02579062j4071740j3141621j3278670j2715240j2358567j1187488j0819610
$$ plain form
14233 215006126 204050234 193447746 183574923 174579420 165882815 157757514 150219817 143260233
14225 143260233 136338295 130201422 124689600 118867182 113822509 108811938 104329671 100038271
14217 100038271 95874625 92337520 88585966 84942564 81660525 78363647 75722325 72946387
14209 72946387 70453575 67766689 65564840 63331960 61331864 59072301 57198154 55377530
14201 55377530 53672251 51886898 50442915 49022788 47418322 45447529 44422265 43106070
14193 43106070 41911308 41123265 40301897 38842099 37491662 36830097 35623122 34795392 34197822
14184 34197822 33182354 31897440 31417775 30417711 29821640 29099328 28751189 27725438 27046139
14175 27046139 26359758 25578051 25097399 24388556 23816873 23663663 22809656 22531822 22131156
$$ packed form
14233B15006126j0955892j0602488r872823q995503q696605q125301p537697o959584
14225A43260233o921938o136873n511822n822418n044673n010571m482267m291400
14217A00038271m163646l537105l751554l643402l282039l296878k641322k775938
14209G2946387k492812k686886k201849k232880k000096k259563j874147j820624
14201E5377530j705279j785353j443983j420127j604466j970793j025264j316195
14193D3106070j194762p88043q21368j459798j350437o61565j206975q27730n97570
14184C4197822j015468j284914m79665j000064n96071p22312l48139j025751o79299
14175B7046139o86381p81707m80652p08843n71683j53210q54007k77834m00666
$$ plain form
14166 22131156 21611025 21039000 20703410 20274895 19895380 19615051 19247600 18410807 18330533
14157 18330533 17870208 17676985 17441824 16844606 16393460 16492759 15672730 15639867 15293945 15170223
14147 15170223 15126618 14753389 14551215 14233650 13850550 13570370 13356383 13270627 12906354 12678478
14137 12678478 12286058 12093785 12155062 11976410 11841212 11532967 11525981 11258350 11169506 10889756
14127 10889756 10733165 10630576 10411154 10332091 10063911 10153196 9715647 9710972 9240883 9570916
14117 9570916 9567173 9079862 9153035 8738039 8798558 8323260 8748434 8457606 8304445 8078744
14107 8078744 8321539 8192182 8264235 7838141 7457779 7565279 7750369 7268131 7193031 7458322
14097 7458322 6791084 7323014 6900597 6781273 6773846 6623902 6558810 6353830 6059341 6514258
$$ packed form
14166B2131156n20131n72025l35590m28515l79515k80329l67451q36793q0274
14157A8330533m60325j93223k35161n97218m51146R9299q20029l2863l45922j23722
14147A5170223m3605l73229k02174l17565l83100k80180k13987q5756l64273k27876
14137A2678478l92420j92273O1277j78652j35198l08245o986k67631q8844k79750
14127A0889756j56591j02589k19422p9063k68180Q9285m37549m675m70089L30033
14117I570916l743m87311P3173m14996O0519m75298M25174k90828j53161k25701
14107H078744K42795j29357P2053m26094l80362J07500J85090m82238p5100K65291
14097G458322o67238N31930m22417j19324p427j49944o5092k04980k94489M54917
$$ plain form
14087 6514258 6281861 6299449 6136004 6170708 6104837 6075860 5728831 5878872 5867495 5630935
14077 5630935 5608237 5421849 5368464 5640909 5213928 5311975 5064755 5125156 5070847 5276774
14067 5276774 4814715 4720854 4994537 4944314 4628715 4664202 4730982 4730642 4595471 4603682 4804616
14056 4804616 4384727 4363419 4458190 4440331 4347174 4231954 4552621 4063106 4310784 4127940
14046 4127940 4467333 4096235 4105285 4137975 3970537 4102331 3793266 3934360 4233090 3907475
14036 3907475 3781356 3815711 3546449 3488673 3187618 3544968 3265323 3277267 3389348 3258428
14026 3258428 3239823 3354150 3133499 3404708 2991549 3340932 2941759 3327469 3304900 3337711
14016 3337711 3208364 3153199 2801807 3110198 2872183 2735175 2867688 3115782 2714919 2985957
$$ packed form
14087F514258k32397J7588j63445L4704o5871k8977l47029J50041j1377k36560
14077E630935k2698j86388n3385K72445m26981R8047k47220O0401n4309K05927
14067E276774m62059r3861K73683n0223l15599L5487O6780l40j35171Q211K00934
14056D804616m19889k1308R4771j7859r3157j15220L20667m89515K47678j82844
14046D127940L39393l71098R050L2690j67438J31794l09065J41094K98730l25615
14036C907475j26119L4355k69262n7776l01055L57350k79645J1944J12081j30920
14026C258428j8605J14327k20651K71209m13159L49383l99173L85710k2569L2811
14016C337711j29347n5165l51392L08391k38015j37008J32513K48094m00863K71038
$$ plain form
14006 2985957 2578232 2747109 2796324 2589310 2757411 2636917 2683227 2456267 2505002 2405224
13996 2405224 2375491 2337197 2188162 2585738 2442964 2279929 2088552 2376846 2423143 2334387
13986 2334387 2164165 2119934 2184423 2400202 2422519 2538971 2412586 2982036 2646652 3412215
13976 3412215 4011698 4203581 5966751 9235689 15069457 25575883 34017186 23298899
13968 23298899 15056296 9949529 7412773 5761565 4719950 4357814 3867824 3674004
13960 3674004 3661494 3065008 2981974 2829251 2208240 2369271 2363595 2635377 2447186 2684857
13950 2684857 2252746 2299576 2488339 2335700 2064905 2047928 1668569 2291421 2117702 1871739
13940 1871739 2016777 1750567 1926332 2050534 1916793 2041761 1957708 2147211 1839249 1665797
$$ packed form
14006B985957m07725J68877M9215k07014J68101j20494M6310k26960M8735r9778
13996B405224k9733l8294j49035L97576j42774j63035j91377K88294M6297q8756
13986B334387j70222m4231O4489K15779K2317J16452j26385N69450l35384P65563
13976C412215N99483J91883J763170L268938N833768J0506426Q441303j0718287
13968B3298899q242603n106767k536756j651208j041615l62136m89990j93820
13960C674004j2510n96486q3034j52723o21011J61031n676K71782j88191K37671
13950B684857m32111M6830J88763j52639k70795j6977l79359O22852j73719k45963
13940A871739J45038k66210J75765J24202j33741J24968q4053J89503l07962j73452
$$ plain form
13930 1665797 1832836 1615161 1812252 1659447 1592459 2035672 1316155 1617438 1827173 1914251
13920 1914251 1854278 1704542 1708214 1606425 1799496 1497479 1304651 1434419 1468780 1783989
13910 1783989 1840899 1476228 1614383 1367981 1586629 1594320 1702143 1584231 1432575 1610452
13900 1610452 1785457 1397735 1515042 1257503 1529698 1219811 1349472 1240983 1356651
13891 1356651 1329219 1212987 1172348 1328144 1301204 1553091 1231665 1508218 1423637 1417885
13881 1417885 1331488 1355705 1476062 1210123 1344177 1229954 1098866 1466404 1291659 1055292
13871 1055292 1040481 1272266 1197374 725786 900702 1087480 1081483 1294605 984255 1118890
13861 1118890 1364961 937303 1401080 992288 1176251 1349373 1053124 1465960 1025098
$$ packed form
13930A665797J67039k17675J97091j52805o6988M43213p19517L01283K09735Q7078
13920A914251n9973j49736L672j01789J93071l02017j92828J29768L4361L15209
13910A783989N6910l64671J38155k46402K18648P691J07823j17912j51656J77877
13900A610452J75005l87722J17307k57539K72195l09887J29661j08489J15668
13891A356651k7432j16232m0639J55796k6940K51887l21426K76553q4581n752
13881A417885q6397K4217J20357k65939J34054j14223j31088L67538j74745k36367
13871A055292j4811K31785p4892m71588J74916J86778n997K13122l10350J34635
13861A118890K46071m27658M63777m08792J83963J73122k96249M12836m40862
$$ plain form
13852 1025098 1166242 1323297 1398676 1165802 951671 801387 881823 1014925 1203733 894896
13842 894896 1381679 787320 1003397 1147818 884977 968116 1121637 943465 907165 916786
13832 916786 943042 1044136 1056243 778025 1028538 1121197 1146665 938372 1348080 770917
13822 770917 831857 801336 1073831 1095586 1054035 757219 740188 701004 698312 961377 608456
13811 608456 969902 979240 689285 803278 860194 970034 936224 1011738 903927 789487
13801 789487 918690 858062 770806 706143 781840 861733 531791 796595 834937 808083 833658
13790 833658 1260449 965090 1019739 723544 1018979 764790 780532 1183702 851408 511650
13780 511650 848090 486969 616957 538788 827488 556827 678266 536689 629882 766784
$$ packed form
13852A025098J41144J57055P5379k32874k14131j50284Q0436J33102J88808l08837
13842H94896M86783n94359K16077J44421k62841Q3139J53521j78172l6300R621
13832I16786K6256J01094J2107k78218K50513R2659K5468k08293M09708n77163
13822G70917O0940l0521K72495K1755m1551k96816j7031l9184k692K63065l52921
13811F08456L61446R338k89955J13993N6916J09840l3810P5514j07811j14440
13801G89487J29203o0628q7256o4663P5697P9893l29942K64804L8342k6854K5575
13790H33658M26791k95359N4649k96195K95435k54189J5742M03170l32294l39758
13780E11650L36440l61121J29988p8169K88700k70661J21439j41577R3193J36902
$$ plain form
13770 766784 616132 928361 620061 735147 781295 702783 845297 819709 724748 797763
13760 797763 704819 461687 922744 704921 576873 572306 483197 437223 620263 467652
13750 467652 470013 929102 969433 741062 502157 516047 375914 689316 798235 419919
13740 419919 986392 714054 588517 683120 961731 435421 822468 304921 673761 179147
13729 592676 645608 423904 355491 498369 565309 297425 495358 629255 774921 452071
13719 452071 599815 310867 481108 465097 651228 515092 573179 391782 643262 615756
13709 615756 891127 555692 808216 361477 694876 928353 581492 647549 460651 568599
13699 568599 483253 440013 588781 411165 435708 691717 -130142 590476 420092 364684
$$ packed form
13770G66784j50652L12229l08300J15086M6148p8512J42514k5588r4961P3015
13760G97763r2944k43132M61057k17823j28048m567q9109m5974J83040j52611
13750D67652K361M59089M0331k28371k38905J3890j40133L13402J08919l78316
13740D19919N66473k72338j25537R4603K78611D35421L87047C04921L68840A79147
13729E92676N2932k21704o8413J42878O6940k67884J97933J33897J45666l22850
13719D52071J47744k88948J70241j6011J86131j36136N8087j81397K51480k7506
13709F15756K75371l35435K52524C61477L33399K33477l46861O6057j86898J07948
13699E68599q5346m3240J48768j77616K4543K56009a30142E90476j70384n5408
$$ plain form
13689 364684 503986 525928 712277 604120 779275 351244 524077 410136 706591 367209
13679 367209 708345 434205 445111 707644 566104 318987 405021 675251 580975 710173
13669 710173 71384 482998 533454 898529 459079 366845 522081 497264 417906 689300
13659 689300 640785 212853 540429 485526 524766 457459 637222 547116 216751 307496 505353
13648 505353 486815 520957 370713 444471 375965 364886 245846 485211 567812 310552 418133
13637 418133 170643 433963 292204 375204 366205 208970 614501 479851 420015 646955
13627 646955 590379 345068 402413 504333 263583 384057 602503 314469 298915 620376
13617 620376 349001 310636 514298 261339 435624 189336 562945 411329 390967 266509
$$ packed form
13689C64684J39302K1942J86349j08157J75155C51244J72833j13941K96455l39382
13679C67209L41136k74140J0906K62533j41540k47117Q6034K70230r4276J29198
13669G10173G1384M11614N0456L65075m39450r2234J55236k4817p9358K71394
13659F89300m8515B12853L27576n4903L9240o7307J79763r0106B16751R0745J97857
13648E05353j8538L4142j50244P3758o8506j1079j19040K39365Q2601k57260J07581
13637D18133A70643K63320j41759Q3000q999j57235M05531j34650n9836K26940
13627F46955n6576k45311N7345J01920k40750J20474K18446k88034j5554L21461
13617F20376k71375l8365K03662k52959J74285A89336L73609j51616k0362j24458
$$ plain form
13607 266509 276212 196706 599993 548524 174514 241496 678895 290630 395817 445980 412056
13596 412056 311403 358326 232235 658370 141102 267110 288914 382215 268871 488135
13586 488135 595784 -111336 289199 390686 322732 177643 752154 340233 -71776 659819
13575 198364 625357 578309 400302 -1779 89666 563045 242689 246320 96086 251092 409350
13564 409350 252755 324981 429223 525915 344234 278295 260682 216182 75386 40645 422656
13553 422656 509478 260513 275010 287530 612869 302808 -83609 455658 340729 200525
13543 200525 585457 218191 362408 421353 591922 346411 25425 189115 -98619 302583
13532 70068 269679 408520 -38710 206909 203726 208486 -37273 175834 303377 214826 287445
$$ packed form
13607B66509R703p9506M03287n1469A74514O6982M37399B90630J05187N0163l3924
13596D12056j00653M6923j26091M26135A41102J26008K1804R3301j13344K19264
13586D88135J07649a11336B89199J01487o7954j45089N74511C40233g1776F59819
13575A98364M26993m7048j78007a779H9666M73379B42689L631I6086J55006J58258
13564D09350j56595P2226J04242R6692j81681o5939j7613m4500G5386l4741L82011
13553D22656Q6822k48965J4497J2520L25339C02808h3609D55658j14929j40204
13543B00525L84932B18191J44217N8945J70569k45511B5425J63690i8619C02583
13532G0068J99611J38841c8710B06909l183M760c7273A75834J27543q8551P2619
$$ plain form
13521 287445 245367 -7033 328900 310348 97438 338719 596689 79663 351182 254580 234456
13510 234456 350976 -46393 159722 65477 234639 466379 210133 273661 371093 211595
13500 211595 270407 221172 156019 338672 160542 96808 340223 371961 235627 296881 584081
13489 584081 221774 481296 285037 97426 386766 172032 273902 -63860 239274 114478
13478 -3295 66256 135698 622383 84334 186920 544695 144819 383161 432330 112697 136193
13467 136193 21256 333284 328376 546259 94117 50625 19896 -23892 -113182 -100799 904 543706
13455 543706 75944 294801 -23330 184194 522485 44304 397770 459752 225083 385773
13445 385773 174600 330672 289999 139347 261892 321268 431311 267381 -95064 290229
$$ packed form
13521B87445m2078g033C28900j8552I7438K41281K57970G9663K71519r6602k0124
13510B34456J16520d6393A59722F5477J69162K31740B10133O3528R7432j59498
13500B11595N8812m9235o5153J82653A60542o3734K43415L1738j36334O1254K87200
13489E84081B21774K59522j96259I7426K89340A72032J01870f3860B39274A14478
13478c295F6256O9442M86685H4334J02586L57775A44819K38342M9169A12697K3496
13467A36193B1256L12028m908K17883I4117m3492A9896b3892q9290J2383I04N42802
13455E43706G5944K18857b3330A84194L38291D4304L53466O1982B25083J60690
13445C85773A74600J56072m0673A39347J22545N9376J10043j63930i5064B90229
$$ plain form
13434 371636 351938 293128 241217 -74474 265233 421704 -241383 263501 -122624 328761
13423 279726 377342 299092 237810 88739 407357 348657 -212038 101890 86187 60197 350103
13412 350103 419152 -50938 258687 -165692 219880 231179 376973 130734 363052 118321
13401 -111178 316407 382475 183866 485912 48758 -46921 183931 341204 335381 573508
13391 573508 12992 326313 201061 218849 355853 -85588 399057 337715 112409 -111710
13380 199129 -48537 173599 463746 501488 303511 -136352 530462 367591 381501 289609
13370 289609 236123 251512 362508 98064 155524 186257 373257 441278 119103 185683 394219
13359 394219 360615 450 5443 104320 79840 228932 109872 176446 -104987 101140 372112
$$ packed form
13434C71636j9698n8810n1911g4474B65233J56471b41383B63501a22624C28761
13423B79726R7616p8250o1282H8739L18618n8700b12038A01890j5703k5990K89906
13412C50103O9049e0938B58687a65692B19880J1299J45794A30734K32318A18321
13401a11178C16407O6068A83866L02046D8758d6921A83931J57273n823K38127
13391E73508A2992L13321j25252J7788J37004h5588C99057o1342A12409a11710
13380A99129d8537A73599K90147L7742j97977a36352E30462j62871J3910r1892
13370B89609n3486J5389J10996I8064N7460L0733J87000O8021A19103O6580K08536
13359C94219l3604D50M993R8877k4480J49092A09872O6574a04987A01140K70972
$$ plain form
13348 372112 515057 239035 153773 278181 -216982 186304 157893 205264 66881 28116
13337 63318 124305 208268 350251 152508 205720 166074 274274 165175 575059 506674 265229
13326 265229 331395 354956 210689 405129 288824 471590 387334 199992 335644 44457
13315 178907 363132 145788 -115273 203508 -6380 166333 121706 149339 243669 -127931
13304 507886 -70159 -2851 281678 342377 74130 -97126 223421 487398 24414 16878 484230
13293 484230 174774 -44600 -131178 202356 490800 115270 2779 239061 216248 17372 -21141
13281 181438 276615 261243 60194 74635 124097 186577 61813 218044 -108282 59762 19264
13269 295518 125517 127088 172791 -68615 -112829 -146295 -288585 205783 -34548 129494 145276
$$ packed form
13348C72112J42945B39035q5262J24408b16982A86304k8411M7371F6881B8116
13337F3318O0987Q3963J41983A52508N3212l9646J08200j09099M09884o8385k41445
13326B65229O6166K3561j44267J94440j16305J82766q4256j87342J35652D4457
13315A78907J84225A45788a15273B03508f380A66333m4627K7633R4330a27931
13304E07886g0159b851B81678O0699G4130i7126B23421K63977B4414p536M67352
13293D84230A74774d4600q6578B02356K88444A15270B779K36282k2813A7372b1141
13281A81438R5177j5372F0194J4441M9462O2480F1813J56231a08282E9762A9264
13269B95518A25517J571M5703f8615m4214l3466j42290B05783c4548A29494J5782
$$ plain form
13258 145276 331058 66052 86694 -46434 159395 249158 -281585 82615 322672 103760
13247 125268 103415 13013 85848 13289 225171 -91259 13137 116658 300176 298581 133135
13235 65480 39637 266288 73540 150023 59526 253055 138281 -65090 341047 61680 218195
13224 218195 -86604 -78016 63039 -150883 47715 -56051 120428 -142303 214851 -118098 110757
13212 -38901 110530 668626 145486 121124 -15921 106009 184549 72211 -9087 28062 -6473
13200 183914 -188569 164770 137754 -15027 -72683 171064 -145392 289965 220689 128072
13190 128072 354115 -102628 -72077 430158 22725 195376 -120701 -39653 -127487 250637
13179 329709 178657 113304 45058 46117 314868 -4890 207928 -166920 409813 150796 173049
$$ packed form
13258A45276J85782F6052K0642d6434A59395Q9763b81585H2615K40057A03760
13247A25268k1853A3013P2835A3289K11882i1259A3137J03521J83518j595A33135
13235F5480k5843K26651G3540P6483E9526J93529j14774f5090C41047F1680J56515
13224B18195h6604Q588F3039a50883D7715e6051A20428a42303B14851a18098A10757
13212c8901A10530N58096A45486k4362a5921A06009P8540G2211i087B8062f473
13200A83914a88569A64770k7016a5027n7656A71064a45392B89965o9276r2617
13190A28072K26043a02628L0551D30158B2725J72651a20701c9653q7834B50637
13179C29709j51052o5353D5058J059K68751d890B07928a66920D09813A50796K2253
$$ plain form
13168 173049 -186328 216090 -10878 -179285 89500 -162594 152104 -71482 255774 -35028
13157 -142372 235905 -113559 123373 -87333 225373 153719 189659 19010 71288 105818 139395
13146 139395 165439 252516 186236 295418 -152236 -65034 -144721 228791 174576 58270 -108021
13134 -91876 16895 -189265 4150 138576 -161874 116617 49929 -28000 -60205 -326169 108164
13122 160175 -47254 -200005 238015 259129 294438 184698 30889 117148 -13992 362990 -174273
13110 -65764 -252683 83611 5985 15252 174112 -25607 375917 10538 268385 -32866 76703
13098 -93367 259246 -149772 -24789 -64527 161045 28595 -296769 21817 17685 87985 108641
13087 108641 -131688 -186730 -161908 -300004 151737 186652 178978 52967 168934 -32590 -49069
$$ packed form
13168A73049a86328B16090a0878j68407H9500a62594A52104g1482B55774c5028
13157a42372B35905a13559A23373h7333B25373p1654L5940A9010N2278L4530L3577
13146A39395K6044Q7077o6280J09182a52236f5034p9687B28791n4215E8270a08021
13134i1876A6895a89265D150J34426a61874A16617D9929b8000l2205k65964A08164
13122A60175d7254j52751B38015K1114L5309j09740C0889Q6259a3992C62990a74273
13110f5764j86919H3611E985R267J58860b5607C75917A0538K57847c2866G6703
13098i3367B59246a49772b4789l9738A61045B8595b96769B1817m132P0300K0656
13087A08641a31688n5042K4822j38096A51737L4915p674E2967J15967c2590j6479
$$ plain form
13076 -49069 -108996 262211 -32971 154796 96249 -69382 33067 -50154 74259 162072 193141
13065 193141 42586 42599 -51922 -218199 59959 389375 26852 214386 -138308 317518 26869
13053 222825 37870 345280 -184890 -108204 92174 233173 166954 291698 -267819 -139937
13043 -139937 -60794 196307 -192635 116525 100804 -179506 233556 46785 -80539 58732
13032 286371 -98516 205347 267929 159577 -80021 53823 92216 -83380 34319 302665 72898
13020 378820 -16970 45397 -82506 268594 -208689 -14057 303200 194034 12913 147193
13010 147193 184583 61168 244603 299500 -55717 -109981 197309 259492 83073 98231 164475
12999 164475 298175 141735 -144248 105923 12444 69576 -49397 -126649 24191 77320 -74835
$$ packed form
13076d9069n9927B62211c2971A54796n8547f9382C3067e0154G4259Q7813L1069
13065A93141D2586J3e1922j66277E9959L29416B6852J87534a38308C17518B6869
13053B22825C7870L07410a84890P6686I2174J40999o6219J24744b67819J27882
13043a39937f0794A96307a92635A16525j5721a79506B33556D6785h0539E8732
13032B86371i8516B05347O2582j08352h0021E3823L8393h3380C4319K68346G2898
13020C78820a6970D5397h2506B68594b08689a4057C03200j09166A2913J34280
13010A47193L7390F1168J83435N4897e5717n4264A97309O2183H3073J5158O6244
12999A64475J33700A41735a44248A05923A2444N7132d9397p7252B4191N3129g4835
$$ plain form
12987 22792 181696 123125 214417 283299 -206558 230914 276685 85019 192235 93639 -86334
12975 -214489 106833 -68180 196053 -343473 64710 -101032 96063 -97517 -42647 74485 -318894
12963 353654 143098 58403 13232 -115064 71440 222753 261511 375754 -208807 109600
12952 39764 78629 309162 -67638 -95797 -7998 162276 -120979 73580 128660 88938 250736
12941 250736 -87105 151517 220457 -35436 48096 -3403 59871 87675 150925 73189 -328268
12929 11718 113565 -16489 -46057 117946 41938 134408 160616 342214 99913 172862 -182936
12917 -150757 147548 -230312 -119281 -6508 17309 -275726 243356 7496 151839 250208 163722
12906 163722 208640 25781 -73774 -10476 356266 291517 249706 188412 -116943 -54221 -148660
$$ packed form
12987B2792J58904n8571R1292O8882b06558B30914M5771H5019J07216I3639h6334
12975b14489A06833f8180A96053c43473F4710a01032I6063i7517d2647G4485c18894
12963C53654A43098E8403A3232a15064G1440J51313L8758J14243b08807A09600
12952C9764L8865K30533f7638k8159g998A62276a20979G3580N5080l9722J61798
12941B50736h7105A51517O8940c5436D8096c403E9871K7804O3250G3189c28268
12929A1718J01847a6489k9568A17946D1938R2470K6208J81598I9913P2949a82936
12917a50757A47548b30312J11031f508A7309b75726B43356G496J44343R8369q6486
12906A63722M4918B5781g3774a0476C56266o4749m1811o1294a16943e4221r4439
$$ plain form
12895 -148660 -249068 -236210 3802 -39186 -112299 14432 -70569 -160387 136613 -205349 31212
12883 275664 184011 151943 -144661 93228 -276018 44736 -159435 -227079 363870 -73526 -169192
12872 -169192 -109574 -88555 155915 -10809 216708 325775 -86312 -218998 272832 107862
12861 -213344 183984 -88627 134616 -65176 -13643 -266320 3469 18900 223562 -13531 -72779
12850 -72779 -29613 -20252 -245632 -30377 110850 178895 4415 463865 -19068 -43231 -92184
12839 -92184 -188748 75182 87448 70378 357550 76336 32601 -176896 69473 -52611 5474
12827 184309 -217675 -137592 -156679 -73328 -57801 296092 42805 41044 -132744 27458 -84212
12815 -9092 137908 196037 35451 -297482 -115537 298038 -138000 -317560 -237629 4178 -81938
$$ packed form
12895a48660j00408J2858C802c9186p3113A4432g0569q9818A36613b05349C1212
12883B75664r1653l2068a44661I3228b76018D4736a59435o7644C63870g3526r5666
12872a69192N9618K1019A55915a0809B16708J09067h6312j32686B72832A07862
12861b13344A83984h8627A34616f5176a3643k52677C469J5431K04662a3531n9248
12850g2779b9613R361k25380c0377A10850O8045D415M59450a9068k4163m8953
12839i2184r6564G5182J2266j7070K87172G6336C2601a76896F9473e2611E474
12827A84309b17675Q0083j9087g3328J5527B96092D2805j761a32744B7458h4212
12815i092A37908N8129C5451b97482a15537B98038a38000j79560P9931D178h1938
$$ plain form
12803 76728 -43683 83202 31225 6985 -44715 -301443 103530 -89692 -176217 -19580 -18738 -119443
12791 -119443 -493307 27791 -23972 -140388 146991 -302741 62596 -170666 -174100 -56520 -14392
12779 -80503 -161057 -102302 10692 -137098 5200 259908 -249889 130049 112177 -88247 -53670
12768 -53670 -329914 106044 23067 -11965 -82213 -113017 395807 -217130 394351 8851 -40918
12756 -95080 135934 204 14971 -156440 -28344 -220519 -151942 -27425 -138428 69313 -460716
12744 163656 275191 120638 -260408 27752 -301815 -149661 77859 -25951 70220 -111223
12733 19771 343922 154470 -34409 20553 382640 163040 25474 244836 -1386 485875 -156058
12721 -116100 81073 96693 68170 96739 129022 92348 -123681 5430 -238193 199986 26811
$$ packed form
12803G6728d3683H3202C1225F985d4715k56728A03530h9692q6525a9580Q42j00705
12791a19443l73864B7791b3972j16416A46991c02741F2596a70666l434e6520a4392
12779h0503q0554N8755A0692a37098E200K54708b49889A30049j7872h8247L4577
12768e3670k76244A06044B3067a1965p0248l0804C95807b17130C94351H851d0918
12756i5080A35934B04J4767a56440b8344j92175O8577b7425j11003F9313d60716
12744A63656J11535A20638b60408B7752c01815a49661G7859b5951G0220a11223
12733A9771L24151A54470c4409B0553L62087A63040B5474K19362a386D85875a56058
12721a16100H1073J5620k8523K8569L2283l6674a23681E430b38193A99986B6811
$$ plain form
12709 -169749 -254359 54308 79784 185477 57047 -49974 -100596 35906 -267170 -95588 -140288
12698 -140288 -3104 168391 51611 221117 -30330 313771 238383 232976 -92058 91774 -194898
12686 124283 240612 286552 -300942 79364 89293 247056 388697 -28709 -81216 283869 -134503
12674 61261 -303166 -202829 281716 222842 -11265 -31079 -217847 9935 12892 69622 -23378
12662 94680 169423 -229232 -19045 -47629 -221544 -185203 115746 -35582 227781 -323077 102341
12650 28651 339770 84671 26510 -208958 13528 -174549 -239903 -178864 -213533 -284879 135948
12638 6010 74915 55364 144628 680275 634037 -178375 90527 -183852 -93458 77633 -15150
12626 25417 147779 141831 -46622 -126279 -56475 -233685 158463 484840 -134716 52913 293936
$$ packed form
12709a69749q4610E4308K5476J05693E7047d9974n0622C5906b67170i5588m4700
12698a40288c104A68391E1611J69506c0330C13771p5388n407i2058I1774a94898
12686A24283J16329M5940c00942G9364R929J57763J41641b8709n2507B83869a34503
12674F1261c03166J00337B81716n8874a1265j9814j86768I935K957N6730b3378
12662I4680P4743b29232a9045k8584j73915L6341A15746c5582B27781c23077A02341
12650B8651L11119H4671B6510b08958A3528a74549o5354O1039l4669p1346A35948
12638F010O8905j9551Q9264N35647m6238a78375I0527a83852R0394G7633a5150
12626B5417J22362n948d6622p9657e6475j77210A58463L26377a34716E2913K41023
$$ plain form
12615 293936 196719 42491 108209 218369 -64443 79643 20189 -114134 76773 245846 291604
12604 291604 61312 105856 -195722 33187 94512 -148267 9304 174634 94627 -124325 -350292
12593 -350292 51739 12789 -17719 288048 -123644 -187563 -12712 194012 71662 59090 274185
12582 274185 -81194 19174 710265 244025 216724 -15706 24109 -460878 261826 -69242 81301
12570 -60917 123390 278979 103534 104367 159238 -117594 -45234 83411 30121 98471 202681
12559 202681 260341 -93313 127309 -115138 -53615 56465 -21789 -150763 385716 80069 195408
12548 195408 -68434 73342 216514 -50830 16312 212688 -10253 -214118 47263 62798 294727
12537 294727 -98145 140309 -123476 175274 -153010 152450 262595 -189244 226976 205999
$$ packed form
12615B93936r7217D2491O5718J10160f4443G9643B0189a14134G6773J69073M5758
12604B91604F1312M4544a95722C3187O1325a48267I304J65330q0007a24325k25967
12593c50292E1739A2789a7719B88048a23644o3919a2712A94012G1662j2572K15095
12582B74185h1194A9174O91091B44025k7301a5706B4109d60878B61826f9242H1301
12570f0917A23390J55589A03534Q33N4871a17594d5234H3411C0121O8350J04210
12559B02681N7660i3313A27309a15138e3615E6465b1789j28974C85716H0069J15339
12548A95408f8434G3342J43172e0830A6312J96376a0253k03865D7263J5535K31929
12537B94727i8145A40309a23476A75274a53010A52450J10145a89244B26976k0977
$$ plain form
12527 205999 31709 -458292 -172324 64415 -206375 -157080 -39472 115827 -87541 -73456 90986
12515 -125920 -28898 -33968 187872 74729 108776 -175121 87169 -216980 3410 -135338 -39993
12503 5986 -74729 -301040 35498 -58897 -66371 -150593 139445 111967 162560 -211687 -434000
12492 -434000 -71382 -211966 108276 206346 39742 56377 22367 20840 -161067 -121522 208288
12480 503 -92390 185418 -80801 88987 78375 -162345 260038 401970 69558 -102206 65085
12468 235919 -117587 78647 200977 56161 -70338 130347 53320 343350 -95311 132613
12457 176575 -37419 139721 53584 -43756 -61376 28146 -128058 127298 36462 48684 41051
12446 41051 134684 -322466 -141513 -78051 -158003 93666 382202 -190494 -252054 32358 -143491
$$ packed form
12527B05999C1709d58292a72324F4415b06375M9295c9472A15827h7541J4085I0986
12515a25920b8898n070A87872G4729L4047a75121H7169b16980C410a35338c9993
12503E986g4729k26311C5498e8897p474q4222A39445k7478N0593b11687k22313
12492d34000g1382j40584A08276R8070C9742J6635B2367j527a61067L9545B08288
12480E03i2390A85418h0801H8987j0612a62345B60038J41932F9558a02206F5085
12468B35919a17587G8647J22330E6161g0338A30347E3320K90030i5311A32613
12457A76575c7419A39721E3584d3756j7620B8146a28058A27298C6462J2222p633
12446D1051R3633c22466a41513O3462p9952I3666K88536a90494o1560C2358a43491
$$ plain form
12434 193435 -57714 52958 -37616 -156179 -53816 -127065 -139207 -157412 -132942 155873 161631
12423 161631 -28591 -16278 266601 57888 72115 142349 -100029 -26640 -280632 -169954 -192304
12412 -192304 196389 -61035 -131103 -66180 -13952 -64654 -139296 253920 -7380 74353 -155870
12400 61884 -145658 -29279 -26763 -24674 50430 -273604 -55138 136860 -379719 41639 -28157
12388 100839 74429 -110152 248018 -50503 100490 71317 -155475 -145900 105211 -183327
12377 211027 -204437 96925 118784 159494 144391 310957 188443 -83057 36114 -127628 34118
12365 211665 -81530 261082 -25496 153004 111160 -128835 -282564 270730 57513 -156992
12354 97629 -83229 9725 133133 23995 -52135 312045 55880 132129 -92524 -304748 -145184
$$ packed form
12434A93435e7714E2958c7616j18563e3816p3249j2142j8205K4470A55873N758
12423A61631b8591J2313B66601E7888J4227P0234a00029b6640k53992J10678k2350
12412a92304A96389f1035p0068O4923a3952n0702p4642B53920g380G4353a55870
12400F1884a45658b9279K516K089E0430b73604e5138A36860c79719D1639b8157
12388A00839k6410a10152B48018e0503A00490k9173a55475R575A05211a83327
12377B11027b04437I6925K1859M0710j5103J66566j22514h3057C6114a27628C4118
12365B11665h1530B61082b5496A53004m1844a28835j53729B70730E7513a56992
12354I7629h3229I725J23408B3995e2135C12045E5880P6249i2524k12224a45184
$$ plain form
12342 -219488 -118492 146767 33034 -536232 150354 -143570 69086 327139 16187 -14710
12331 27477 310074 45048 240849 81943 122572 -138975 -195547 -199226 79724 -202150 -88157
12319 142328 35069 75312 46726 103256 100882 184148 195307 -154231 77081 227241 -31833
12307 -1561 359041 137009 376001 333888 -37520 -170012 294745 -181464 122957 129808 9267
12295 73230 161467 317 -165027 200309 -112605 178217 502919 226663 268649 125946 -214812
12283 261785 -32562 162166 -21457 19191 -218059 271643 176898 246021 -201564 -17155 39154
12271 -54022 -338 98963 49877 137026 15958 187294 397338 53491 118525 71470 91698 252163
12259 252163 182147 50053 134790 82822 108860 -202018 382919 41925 397615 114547 327726
$$ packed form
12342b19488J00996A46767C3034e36232A50354a43570F9086K58053A6187a4710
12331B7477K82597D5048J95801H1943M0629a38975n6572l679G9724b02150h8157
12319A42328C5069M0243k8586N6530k374Q3266J1159a54231G7081J50160c1833
12307a561C59041A37009K38992m2113c7520j32492B94745a81464A22957O851I267
12295G3230Q8237C17a65027B00309a12605A78217L24702B26663M1986A25946b14812
12283B61785c2562A62166b1457A9191b18059B71643r4745O9123b01564a7155C9154
12271e4022c38I8963m9086Q7149A5958J71336K10044E3491O5034m7055K0228J60465
12259B52163p0016E0053Q4737n1968K6038b02018C82919D1925L55690A14547K13179
$$ plain form
12248 327726 7013 83342 140379 244198 40197 54064 132641 66347 214534 328715 -172242
12236 -74445 89218 1238 -25955 -6162 -42203 -18887 226792 236075 381553 -12499 -251801 182444
12223 -198042 194603 260759 91415 12727 -71734 106590 -38609 207842 398982 175018
12212 -101627 -187270 35419 -1288 -181005 350757 113186 386496 369260 500657 76742 185433
12201 185433 70299 430454 434508 -37885 62885 195734 14431 97053 46938 43542 101497
12190 101497 112542 -123119 -61560 277673 285337 453299 361464 2275 154613 55589 -110102
12178 -115665 -211626 156182 423312 329325 40971 149153 384761 387641 124792 125056 252252
12167 252252 283442 -72668 266539 -212873 174351 -29973 -8702 202674 115680 258475 186445
$$ packed form
12248C27726G013P6329N7037J03819D0197J3867P8577o6294J48187J14181a72242
12236g4445H9218A238b5955f162l6041a8887B26792R283J45478a2499k39302A82444
12223a98042A94603O6156I1415A2727g1734A06590c8609B07842J91140A75018
12212a01627q5643C5419a288j79717C50757A13186K73310j7236J31397G6742J08691
12201A85433G0299L60155M054c7885F2885J32849A4431Q2622D6938l396N7955
12190A01497J1045a23119O1559B77673P664J67962r1835B275J52338E5589a10102
12178a15665r5961A56182K67130r3987D0971J08182K35608K880A24792K64J27196
12167B52252L1190g2668B66539b12873A74351b9973h702B02674q6994J42795p2030
$$ plain form
12156 186445 145594 341576 194764 -165461 404466 8779 247914 3518 -89576 472727 281486
12145 281486 154264 -97835 162403 -26446 411120 7822 74660 -264619 -1293 248293 120740
12133 208911 305398 -17833 324541 60917 202440 39864 -549321 -55139 324382 -118569
12122 62965 -221877 150080 -9134 38050 11399 74455 263751 328509 187841 23105 -215106
12110 96989 -90151 177206 185858 1681 73675 -273047 149709 93567 -91973 257471 202930
12099 202930 3116 106232 192800 113320 361993 319545 103169 171767 111681 -190205 107973
12087 67133 29092 121247 137393 -12951 374390 379596 346358 55248 80916 164854 399082
12076 399082 -200044 76961 183242 165676 402311 396440 -24435 112181 -11846 36650 235645
$$ packed form
12156A86445m0851J95982j46812a65461D04466H779K39135C518h9576D72727j91241
12145B81486j27222i7835A62403b6446D11120G822O6838b64619a293B48293A20740
12133B08911R6487a7833C24541F0917J41523C9864e49321e5139C24382a18569
12122F2965b21877A50080i134C8050A1399O3056J89296O4758j40668B3105b15106
12110I6989i0151A77206Q652A681P1994b73047A49709n6142i1973B57471n4541
12099B02930C116J03116Q6568p9480K48673m2448A03169O8598o0086a90205A07973
12087F7133B9092R2155J6146a2951C74390N206l3238E5248K5668Q3938K34228
12076C99082b00044G6961J06281j7566K36635n871b4435A12181a1846C6650J98995
$$ plain form
12065 235645 124866 129960 147848 265525 -52736 51689 44832 334292 -346270 132542 67938
12054 67938 150830 -212921 112387 222382 -142674 104742 -29722 142023 172989 159792
12044 159792 -51348 -61791 304736 -296874 149899 -184346 -147507 220255 154980 166129
12034 166129 -139753 54251 -335468 247561 41635 15562 -126722 -76894 -225338 -20660
12023 96753 280282 159718 31663 46522 187692 -25103 120029 114932 122660 32624 -144953
12011 -282655 66398 -15921 -91682 155857 -242529 104532 -45163 50380 202547 79286 -56993
11999 -155140 -10867 222362 -226207 -93084 217303 101712 155210 -109856 185170 157901
11989 157901 210794 40475 -106907 239972 -78800 -469904 149787 -89282 -43491 -145252
$$ packed form
12065B35645j10779N094J7888J17677e2736E1689o857K89460c46270A32542o4604
12054F7938Q2892b12921A12387J09995a42674A04742b9722A42023L0966j3197
12044A59792e1348j0443C04736b96874A49899a84346L6839B20255o5275J1149
12034A66129a39753E4251c35468B47561D1635A5562a26722M9828j48444b0660
12023I6753J83529j20564C1663J4859J41170b5103A20029n097P728C2624a44953
12011b82655F6398a5921p5761A55857b42529A04532d5163E0380J52167G9286e6993
11999a55140a0867B22362b26207i3084B17303A01712N3498a09856A85170k7269
11989A57901N2893D0475a06907B39972g8800l91104A49787h9282d3491j01761
$$ plain form
11979 -145252 19601 -98818 -69134 237588 4268 82358 -194930 -103785 -203711 -40718 150699
11967 -166430 -229145 -68747 37368 -6276 86142 -262477 -104350 -141263 -160668 -11710 166672
11955 -209630 -110790 155142 -47262 -190577 878 93468 147817 157697 251654 45450 -61327 -83377
11943 -83377 59992 -137764 289467 15454 85085 229864 -156330 -203528 -142877 -1927 -1823
11932 -1823 -90397 96293 77519 76843 531841 -181070 -5034 -404349 -79317 -55777 -200439 -23561
11919 125521 -128141 97350 36686 27628 -5484 -102515 -41256 90721 -274651 -81265 -78266 102056
11906 -182863 -92319 -129104 -149552 -94839 -31255 160787 19699 -16921 -147637 -63075 85366
11894 -464 -179872 45671 18987 39036 -72152 40633 -293452 27001 213710 206990 -99881 -113982
$$ packed form
11979a45252A9601i8818K9684B37588D268P8090a94930R1145r9926d0718A50699
11967a66430o2715f8747C7368f276H6142b62477a04350l6913j9405a1710A66672
11955b09630R8840A55142d7262j43315H78R2590N4349R880R3957D5450f1327k2050
11943h3377E9992a37764B89467A5454O9631J44779a56330m7198O0651a927J04
11932a823q8574I6293j8774o76M54998a81070e034l99315g9317K3540j44662b3561
11919A25521a28141I7350C6686r058e484r7031d1256I0721b74651h1265K999A02056
11906a82863R0544l6785k0448N4713c1255A60787A9699a6921j30716f3075H5366
11894d64j79408D5671A8987K0049g2152D0633b93452B7001J86709o720i9881j4101
$$ plain form
11882 -113982 49978 26938 6387 -70872 42999 -24328 -209556 110607 170469 -127572 -44394
11870 -165508 18778 -35851 161021 -106033 -91109 -152204 -69962 -444590 -107587 -86211 137466
11858 -1403 -276725 -592417 -82820 122160 -383661 -67924 -10513 -68714 345053 -38685 -54078
11847 -54078 56240 -171574 -182701 -52932 95513 74730 121742 -15625 55682 -94773 32127
11835 -136524 66209 159828 14716 -206604 -34448 158567 50772 380414 18893 73417 217565
11824 217565 32854 -53057 -243034 3117 -159001 261750 -545077 -169567 -106969 -33059 -180161
11813 -180161 -128338 62749 197830 106978 122790 -211617 61882 -121012 -386678 -256348
11803 -256348 -136022 -91950 -115027 131403 -272889 -138573 87525 -115141 179060 -77912
$$ packed form
11882a13982D9978k3040F387g0872D2999b4328j85228A10607N9862a27572d4394
11870a65508A8778c5851A61021a06033J4924o1095f9962l74628a07587K1376A37466
11858a403k75322l15692h2820A22160c83661f7924a0513n8201C45053c8685j5393
11847e4078E6240a71574j1127e2932I5513k0783M7012a5625E5682i4773C2127
11835a36524F6209R3619A4716b06604c4448A58567E0772L29642A8893N4524J44148
11824B17565C2854e3057j89977C117a59001B61750e45077a69567O2598c3059j47102
11813a80161N1823F2749J35081r0852J5812b11617F1882a21012k65666J30330
11803b56348J20326M4072k3077A31403b72889J34316H7525a15141A79060g7912
$$ plain form
11792 -23769 213325 -163552 253459 -327738 -129044 -204463 15434 -197455 -45594 -132546
11782 -132546 -132589 118379 378400 -57800 -58573 -406001 -136422 43169 -157889 -64898 101526
11770 165503 50438 88722 12535 75116 -198639 379366 -314783 -234850 -416994 163120
11759 -102440 -39303 -160 186351 7266 36041 -320597 99830 -63857 218835 -100055 -43546
11747 -236533 296793 -481384 -4282 -66075 163988 26504 251051 11367 -168170 169834
11736 -41624 27960 131240 161294 107125 -73403 -30096 -47911 51615 -160724 102475 117890
11725 117890 -2523 -53736 554 -47446 -39993 274367 181553 -15501 -339888 54143 -275632 350797
11712 110210 -25696 -199582 32234 50670 32560 36194 219533 276841 -141840 203696 76068
$$ packed form
11792b3769B13325a63552B53459c27738a29044p5419A5434a97455d5594q6952
11782a32546m3A18379K60021e7800p73l47428a36422D3169a57889f4898A01526
11770A65503E0438L8284A2535O2581a98639C79366c14783P9933j82144A63120
11759a02440c9303a60A86351G266K8775c20597I9830f3857B18835a00055d3546
11747b36533B96793d81384d282o1793A63988B6504K24547A1367a68170A69834
11736d1624B7960J03280L0054n4169g3403c0096j7815E1615a60724A02475J5415
11725A17890b523n1213E54d7446P453B74367r2814a5501l24387E4143b75632C50797
11712A10210b5696j73886C2234J8436j8110L634J83339N7308a41840B03696G6068
$$ plain form
11700 -19248 -269096 -93744 -48054 -84925 -30791 20143 319809 116610 -433886 201964 -1392
11688 -78913 260248 -59303 147529 82350 8665 180456 252916 62980 11246 -80802 -384386
11677 -384386 92206 -72331 302532 -271273 -136417 -56820 -190242 -101476 -154010 14571 -145192
11665 58921 222404 97283 134982 -90089 356166 191637 28816 54518 -8504 -78387 -137573
11654 -137573 -149844 -78133 -403508 -103785 -21252 -20784 -327739 41352 20613 -14043 -29573
11643 -29573 168758 -91328 -61341 51127 289965 331391 -66244 -50834 -27029 234112 74708
11631 -39612 74246 143979 151431 -636 -214677 2509 80811 -50475 -50155 -169024 -105845 -294840
11619 -294840 193251 -17292 -145508 -15581 -237827 -198329 85319 -41533 -186281 20414 -69738
$$ packed form
11700a9248k49848i3744M5690l6871c0791B0143K99666A16610d33886B01964a392
11688g8913B60248e9303A47529o5179H665J71791P2460F2980A1246h0802l03584
11677c84386I2206g2331C02532b71273J34856e6820j33422Q8766n2534A4571a45192
11665E8921J63483I7283L7699i0089C56166j64529B8816K5702h504o9883n9186
11654a37573j2271P1711l25375a03785b1252M68l06955D1352B0613a4043j5530
11643b9573A68758i1328K9987E1127K38838M1426f6244J5410K3805B34112G4708
11631c9612G4246O9733P452f36k14041B509P8302e0475L20j18869O3179j88995
11619b94840A93251a7292j28216a5581k22246L9498H5319d1533j44748B0414f9738
$$ plain form
11607 -10643 -36683 -140531 53679 -101729 370616 53543 104710 252899 56550 5199 -194586
11595 30575 14910 -133035 1323 -91087 -194529 -22208 163616 -24824 97739 -135815 -151949
11584 -151949 -136227 59595 196239 226251 -78361 -128676 132161 -81632 253174 182727 3768
11572 8435 51367 74764 -2233 -147946 -134977 25113 55983 -107403 -196830 -223257 -140740 60339
11559 -171180 -52876 121730 28498 -8781 -36977 281325 -324473 -266235 31841 267159 -72072
11547 17738 18714 97751 -10840 -153456 -126236 86757 42048 -92329 168232 183464 -129025
11535 73023 97778 -42420 -9316 70868 -121922 86828 189440 -269048 -39317 -63466 90454
11523 218421 -42991 -210112 -91027 -71797 -287862 14817 122029 122562 -24593 149173 -247410
$$ packed form
11607a0643k6040j03848E3679a01729C70616E3543N1167J48189E6550E199a94586
11595C0575A4910a33035A323i1087j03442b2208A63616b4824I7739a35815j6134
11584a51949J5722E9595J36644L0012g8361n0315A32161h1632B53174p0447C768
11572H435M2932K3397b233j45713J2969B5113L0870a07403q9427k6427Q2517F0339
11559a71180e2876A21730B8498h781k8196B81325c24473N8238C1841K35318g2072
11547A7738R76P9037a0840j42616K7220H6757D2048i2329A68232J5232a29025
11535G3023K4755d2420i316G0868a21922H6828J02612b69048c9317k4149I0454
11523B18421d2991j67121i1027J9230k16065A4817J07212N33b4593A49173b47410
$$ plain form
11511 -54640 456024 77467 -118019 68959 -7086 277613 211335 56974 126081 -171027 -12061
11499 -3769 167615 -35224 44845 1012 -147263 255786 191739 115913 -72478 -211397 126312
11487 234296 294931 -35978 483613 -167587 -43478 87539 -137006 -320516 -18553 200151
11476 239337 3925 -80876 92597 36667 62134 240226 144154 247034 192807 133352 -25384
11464 336596 -32764 179205 252400 75425 301764 -44909 40183 43858 236147 -179138 -251390
11453 -251390 -38935 -36506 103298 397865 534580 312297 -12561 -119290 321335 185479
11443 185479 93107 -184915 -192827 319936 137396 233088 -27053 92310 -112633 205648 27422
11431 -8596 107444 -161681 -90930 110303 -105165 -28750 44941 44658 37418 -56682 39687 47993
$$ packed form
11511e4640D56024G7467a18019F8959g086B77613o6278E6974O9107a71027a2061
11499c769A67615c5224D4845A012a47263B55786o4047p5826g2478j38919A26312
11487B34296O0635c5978D83613a67587d3478H7539a37006j83510a8553B00151
11476B39337C925h0876I2597C6667K5467J78092r6072J02880n4227n9455b5384
11464C36596c2764A79205P3195G5425K26339d4909D0183L675J92289a79138p2252
11453b51390c8935K429A03298K94567J36715k22283a2561j06729C21335j35856
11443A85479r2372a84915p912C19936A37396R5692b7053I2310a12633B05648B7422
11431h596A07444a61681P0751A10303a05165b8750D4941k83p240e6682C9687Q306
$$ plain form
11419 47993 118094 -20877 -41660 -107407 141508 -246145 6214 23627 -74336 -57231 -144269
11408 -144269 143685 -22447 260009 -59177 21676 -13123 -217981 -228837 37470 52677 69881
11397 69881 -233029 168646 -287037 44142 15513 -205038 -3291 -256506 -19613 20316 14542
11386 14542 -185169 39727 137006 -225659 -321071 418186 -159909 29198 180885 -161378
11375 210265 238689 81466 -275539 19792 105745 50275 -216996 -91732 -288663 -153148 147062
11363 23646 15717 181717 -24502 210258 254185 -121290 -13220 -20562 -338596 26711 43902
11352 43902 196480 -134819 173680 -166834 -225168 34528 -80250 -188111 -18999 368239
11341 55396 -68622 177042 -94350 -203809 -40317 117979 -270984 81431 272716 131320
$$ packed form
11419D7993P0101b0877k0783o5747A41508b46145F214J7413g4336J7105q7038
11408a44269A43685b2447B60009e9177B1676a3123k04858j0856C7470J5207J7204
11397F9881b33029A68646b87037D4142A5513b05038c291k53215a9613B0316n774
11386A4542a85169C9727R7279b25659r5412D18186a59909B9198J51687a61378
11375B10265K8424H1466b75539A9792Q5953E0275b16996i1732j96931J35515A47062
11363B3646p929J66000b4502B10258M3927a21290a3220p342l18034B6711J7191
11352D3902J52578a34819A73680a66834n8334C4528h0250j07861a8999C68239
11341E5396f8622A77042i4350j09459d0317A17979b70984H1431J91285A31320
$$ plain form
11330 -75146 -32542 -36142 27901 -106595 -79659 -80324 -188464 234924 -55130 -126576 -24690 -56251
11318 -56251 102403 -137363 -282763 40535 482314 91056 -55604 -462869 -19676 -139631
11308 -139631 10684 -30635 109818 -94927 58504 100173 130966 -58073 -50097 161128 -141961
11296 7874 -20565 -39723 -273106 -146846 -151078 149195 -66218 -231151 154342 157964 25109
11284 -241074 209691 145857 145138 -373036 -99769 -23043 -17707 -198260 -366821 -135028 -16695
11272 -49844 13972 72506 139518 -228804 -147136 111948 -145389 -154496 77491 208960 -71326
11260 -201246 144036 61531 54721 17588 -264115 205432 -92408 -9386 35184 -139738 -191123
11249 -191123 -136906 -373537 208195 -160577 29099 142704 111051 9786 -46546 -70478 64150
$$ packed form
11330g5146c2542l600B7901a06595K6936o65j08140B34924e5130p1446b4690l1561
11318e6251A02403a37363j45400D0535M41779I1056e5604m07265a9676j19955
11308a39631A0684c0635A09818i4927E8504M1669L0793e8073P976A61128a41961
11296G874b0565j9158k33383J26260m232A49195f6218j64933A54342L622B5109
11284b41074B09691o3834p19c73036i9769b3043N336j80553j68561a35028a6695
11272d9844A3972N8534O7012b28804Q1668A11948a45389r107G7491J31469g1326
11260b01246A44036F1531o810A7588b64115B05432i2408i386C5184a39738n1385
11249a91123N4217k36631B08195a60577B9099J13605l1653I786d6546k3932F4150
$$ plain form
11237 -289461 4375 -165591 -88867 52963 -80654 -443622 263794 -93097 -100722 -131476 -7013
11225 -13072 150291 -304391 -274055 125885 -124462 -175798 57743 9480 365642 -63963 27378
11213 -58245 -228216 -185344 47895 9943 41828 108419 -82167 -50959 128454 -44554 -49517 -344320
11201 -344320 29742 -124416 -175142 -124826 276009 136191 -125622 -132067 -99960 -262613 159565
11189 -312681 -63047 -117867 -297016 146685 -50662 -21959 -93347 205902 -463350 -274491
11179 -274491 160431 -332 7876 64442 -221352 -427734 189398 43470 -40774 116541 123446
11168 123446 -206006 -154225 -131165 -73684 -124813 -136082 -17288 -7965 -188923 -232303 -272152
11157 -272152 -515511 -101865 -4048 -132400 -21377 -1132 269372 -295334 -191184 -226239 -241795
$$ packed form
11237b89461D375a65591P6724E2963h0654l62968B63794i3097p625l0754g013
11225a3072A50291c04391L0336A25885a24462n1336E7743I480L56162f3963B7378
11213e8245j69971M2872D7895I943L1885O6591h2167L1208A28454d4554m963k94803
11201c44320B9742a24416n0726N0316B76009A36191a25622o445L2107j62653A59565
11189c12681f3047n4820j79149A46685e0662b1959p1388B05902d63350J88859
11179b74491A60431c32G876N6566b21352k06382A89398D3470d0774A16541O905
11168A23446b06006N1781K3060N7481n1129j1269a7288g965j80958m3380l9849
11157b72152k43359a01865d048j28352b1377a132B69372b95334J04150l5055j5556
$$ plain form
11146 -241795 -44725 63861 -199534 -20719 -178300 89558 -132366 -145448 -184776 -252401 -41316
11134 97429 -39862 101703 -50121 -137899 -229423 20283 -25041 -110552 135618 -76013 -42204
11123 -42204 66348 -5084 -102009 145271 -111906 -257128 157943 -528 264075 191111 -194756
11111 90980 -92613 -157327 -168193 -73409 189141 -145334 -136771 82417 -132666 -41530 -1714
11099 -127039 196706 -97791 48328 48132 -105646 73055 78088 166822 20845 -3879 65870 140669
11087 140669 -52065 -104784 -86039 155710 89025 340712 52192 254816 -4889 -76278 -86440
11076 -86440 -189528 35683 -421 33450 299791 79792 368357 93361 449679 189449 -214502
11064 125122 81078 299919 190779 360433 265482 337805 -13002 -355263 6248 155790 312751
$$ packed form
11146b41795d4725F3861a99534b0719j57581H9558a32366j3082l9328o7625d1316
11134I7429c9862A01703e0121q7778r1524B0283b5041q5511A35618g6013L3809
11123d2204F6348e084r6925A45271a11906j45222A57943e28B64075p2964a94756
11111I0980i2613o4714j0866g3409A89141a45334Q563H2417a32666d1530a714
11099a27039A96706i7791D8328j96a05646G3055N033Q8734B0845c879F5870P4799
11087A40669e2065n2719J8745A55710o6685K51687E2192K02624d889p1389j0162
11076h6440j03088C5683d21C3450K66341G9792K88565I3361L56318A89449b14502
11064A25122m4044K18841j09140J69654r4951P2323a3002l42261F248J49542J56961
$$ plain form
11053 312751 441309 222023 112010 243930 66293 55726 524522 179708 712855 466369
11043 466369 107292 260100 549476 269503 442205 441777 111279 11364 409211 560037
11033 560037 549192 676437 442204 480171 453469 663966 520759 692178 603650 643301
11023 643301 407556 678608 711594 376079 312631 722033 625256 778115 458043 515169
11013 515169 275734 310000 367256 883262 737428 686610 494403 439501 725931 399498
11003 399498 356881 487178 472137 440627 564829 737543 526373 307380 559259 42768
10992 528523 331820 507824 491687 504628 232861 310370 455868 543609 457678 359629 255258
10981 255258 262037 389296 621509 493521 495607 685570 478343 623137 508084 359228
$$ packed form
11053C12751J28558k19286j10013J31920F6293j0567M68796A79708N33147k46486
11043D66369A07292J52808K89376B69503J72702m28A11279A1364L97847J50826
11033E60037j0845J27245k34233L7967k6702K10497j43207J71419q8528L9651
11023F43301k35745K71052L2986l35515o3448M09402r6777J52859l20072N7126
11013E15169k39435L4266N7256N16006j45834n0818j92207n4902K86430l26433
11003C99498m2617J30297j5041l1510J24202J72714k11170k18993K51879D2768
10992E28523j96703J76004j6137J2941B32861P7509J45498Q7741q5931r8049j04371
10981B55258O779J27259K32213j27988K086J89963k07227J44794j15053j48856
$$ plain form
10971 359228 519099 465801 774709 748009 746690 804531 1139074 1363066 612485 737911
10961 737911 632239 1046447 1376905 1253453 1371695 1585874 1859413 1760269 1401637 1957399
10951 1957399 1719691 2018591 1736970 1451816 1503319 1536972 1466391 1463469 1169339 1566704
10941 1566704 1744388 1339046 1399623 1080737 1334637 1217521 1364612 1182942 987597 1034376
10931 1034376 942680 739471 809022 802470 361319 487429 395008 58513 405593 -34805 59120
10919 487665 210646 199883 -183562 145451 76931 -330410 62477 81683 257679 186173
10909 186173 5780 317139 419657 -89077 -55889 41455 175635 260685 -20734 54800 -167921
10897 54857 -27060 -280652 -291423 -210045 -149023 -109965 -239409 -214123 -257755 -43723 202255
$$ packed form
10971C59228J59871n3298L08908k6700j319N7841L34543K23992F12485J25426
10961G37911j05672M14208L30458j23452J18242K14179K73539r9144l58632N55762
10951A957399k37708K98900k81621k85154N1503L3653p0581k922k94130L97365
10941A566704J77684m05342O0577l18886K53900j17116J47091j81670j95345M6779
10931A034376r1696k03209O9551o552C61319J26110r2421E8513L47080c4805E9120
10919D87665B10646j0763a83562A45451o8520c30410F2477J9206J75996p1506
10909A86173E780L11359J02518h9077L3188D1455J34180Q5050b0734E4800a67921
10897E4857b7060k53592j0771Q1378O1022L9058j29444K5286m3632d3723B02255
$$ plain form
10885 37967 22827 -163804 23763 -154336 238352 -56279 31375 -137978 -324621 -27077 -14341
10874 -14341 5571 -233460 -276481 84407 -86627 -83528 -168006 172877 86211 -382278 -142228
10862 88225 -141811 45026 -248741 -55016 94371 -15310 73012 -61216 50868 271417 58745
10850 -164221 56096 -254273 81589 123853 -67729 -233785 218976 -73071 -160407 -299563 305549
10838 19406 -103475 102093 119849 5345 -77416 397529 55361 2589 -160811 -59487 26895
10826 70703 -6369 -190509 -85305 73487 65304 221705 229213 1169 -107053 330630 -72016 -42293
10814 -42293 -29067 192962 11736 12000 194981 -56217 -202972 8385 243972 -47290 -185085
10803 -185085 1985 32622 -118211 -296696 247059 201865 -164309 205504 -79514 -72272 -309350
$$ packed form
10885C7967j5140a63804B3763a54336B38352e6279C1375a37978j86643b7077J2736
10874a4341E571b33460m3021H4407h6627L099q4478A72877H6211c82278a42228
10862H8225a41811D5026b48741e5016I4371a5310G3012f1216E0868K20549E8745
10850a64221E6096b54273H1589M2264f7729j66056B18976g3071q7336j39156C05549
10838A9406a03475A02093J7756E345g7416C97529E5361B589a60811e9487B6895
10826G0703f369j84140h5305G3487q183J56401P508A169a07053C30630g2016K9723
10814d2293J3226A92962A1736K64J82981e6217j46755H385K35587d7290j37795
10803a85085A985L0637a18211j78485B47059m5194a64309B05504g9514P242k37078
$$ plain form
10792 -309350 -126909 115509 -306829 -246943 58951 -213174 15877 -123101 -112153 -65686
10782 -65686 -180138 147733 -95755 -225609 -4712 51629 -54229 -150648 -88675 -116562 -80894
10771 -80894 45962 131804 -78619 -398084 -173953 -150902 -205957 -54974 -148217 -129463 -163430
10760 -163430 -2650 24167 120265 -221490 -40566 41680 -279032 146957 113590 -54865 -83973
10749 -83973 -155272 -234876 -50169 -9364 86315 -26032 219527 59379 -188006 -141356 203834
10737 234387 -124732 -126947 -35260 -150040 -162309 67220 118602 127791 -190277 97151 -271858
10725 78584 -174434 20753 30975 224635 -130054 133541 43780 -160070 -411515 207428
10714 -109241 179407 -120817 -123456 -34170 144815 21170 -102230 -150289 -142923 -34618 -27585
$$ packed form
10792c09350a26909A15509c06829N9886E8951b13174A5877a23101J0948M6467
10782f5686j14452A47733i5755j29854d712E1629e4229r6419O1973k7887L5668
10771h0894D5962Q5842g8619l19465a73953K3051n5055e4974r3243J8754l3967
10760a63430b650B4167R6098b21490d0566D1680b79032A46957l3367e4865k9108
10749h3973p1299p9604e0169i364H6315b6032B19527E9379a88006M6650B03834
10737B34387a24732k215c5260j14780j2269F7220N1382R189a90277I7151b71858
10725G8584a74434B0753J0222J93660a30054A33541D3780a60070k51445B07428
10714a09241A79407a20817k639c4170A44815B1170a02230m8059P366c4618P033
$$ plain form
10703 -27585 -67863 -478506 111408 32932 -26373 -302700 -106229 -138203 -772 -153042 202515
10691 259522 175056 -35588 -220586 161199 136235 35764 -81904 63715 -24396 -614 3405 -288853
10678 -70838 -281977 -186951 42128 33427 -185093 -123236 2924 -330977 40609 -227006 132334
10666 -85156 -235708 122532 -134754 25386 -188854 -304796 248571 -58589 -36603 -213485
10656 -213485 -128444 -236902 -9843 35907 8919 215864 -142641 -46555 298482 -35384 -12028
10644 -118003 16806 -155290 -91451 -307392 182636 -145042 13159 -162412 -245730 -135311
10634 -135311 -192269 141598 -170771 -111723 -4637 -82812 296333 155055 -40993 -72044 -434194
10623 -434194 11530 -84905 28879 -230314 -446965 -45745 -57071 -38731 -140354 -51793 -232486
$$ packed form
10703b7585m0278m10643A11408C2932b6373k76327a06229l1974g72j52270B02515
10691B59522q4466c5588j84998A61199k4964C5764h1904F3715b4396f14C405b88853
10678g0838k11139R5026D2128q701a85093O1857B924c30977D0609b27006A32334
10666h5156j50552A22532a34754B5386a88854j15942B48571e8589K1986j76882
10656b13485Q5041j08458i843C5907H919K06945a42641d6555B98482c5384a2028
10644a18003A6806a55290O3839k15941A82636a45042A3159a62412q3318J10419
10634a35311n6958A41598a70771N9048d637p8175B96333j41278d0993l1051l62150
10623d34194A1530h4905B8879b30314k16651d5745j1326J8340j01623e1793j80693
$$ plain form
10612 -232486 347659 -114773 -36229 353846 -427652 -125508 191624 11858 10948 64650 -56940
10600 -203857 -133028 -96123 -203775 97779 -158221 122430 108700 -78442 -73242 -109304 -56795
10589 -56795 113831 39517 268663 -294810 -13542 -92762 57813 168822 48256 -108738 33636
10577 235199 -21018 -333211 -159722 -360200 -22502 -14133 -312564 57821 -292042 -507741
10567 -507741 208691 -174160 -121213 45693 82727 -28641 36770 -196746 -317560 -317258 50092
10555 -97779 253023 141842 -82058 -304034 90525 286373 -150222 199085 -177378 -31091
10544 -20364 -115804 -115653 161205 -169092 -157504 106660 46201 -163761 120352 271017 50663
10532 -372761 10771 72421 288917 1016 64308 -38471 9689 92737 -118574 -316098 -118658
$$ packed form
10612b32486C47659a14773c6229C53846d27652a25508A91624A1858r10N3702e6940
10600b03857P0829L6905j07652I7779a58221A22430j3730g8442N200l6062N2509
10589e6795A13831C9517K29146b94810a3542p9220E7813J11009D8256a08738C3636
10577B35199b1018l12193a59722k00478b2502Q369k98431E7821b92042k15699
10567e07741B08691a74160N2947D5693L7034b8641C6770a96746j20814L02E0092
10555i7779B53023j11181h2058k21976I0525J95848a50222A99085a77378c1091
10544b0364r5440J51A61205a69092J1588A06660D6201a63761A20352J50665E0663
10532c72761A0771O1650K16496A016O3292c8471I689Q3048a18574j97524a18658
$$ plain form
10520 56511 -25684 -100318 76371 -204031 105212 220908 -106220 -94676 -246755 19858 61493
10509 61493 1210 -156238 -108003 -227033 -188324 63947 -64489 67352 -374886 114700 140883
10498 140883 -84389 -116458 19177 -281840 7762 -99052 -80189 -234376 -17837 -166492 9146
10486 -130828 -210678 -205527 27146 106668 -352638 -133476 -23277 -203991 -56720 -109987 125023
10474 40002 54839 61093 -67279 -57713 -177814 77055 56329 -158763 159981 -40426 -84756
10463 -84756 73106 174304 122046 457173 462932 335346 330690 309467 369249 227277 195342
10452 195342 -73143 185380 215423 60794 191348 -283381 -210718 -344324 -23746 -455410
10442 -455410 -67644 -214743 -116894 -46552 30450 43129 -144631 -57214 18691 28699 -1738
$$ packed form
10520E6511b5684p4634G6371b04031A05212J15696a06220J1544j52079A9858M1635
10509F1493A210a56238M8235j19030L8709F3947f4489F7352c74886A14700K6183
10498A40883h4389l2069A9177b81840G762i9052J8863j54187a7837j48655I146
10486a30828p9850N151B7146P9522c52638a33476b3277j80714e6720n3267A25023
10474D0002J4837O254f7279R566j20101G7055k0726a58763A59981d0426m4330
10463h4756G3106J01198n2258L35127N759j27586m656k1223N9782j41972l1935
10452A95342g3143A85380L0043F0794J30554b83381P2663j33606b3746m31664
10442d55410f7644j47099R7849d6552C0450J2679a44631e7214A8691J0008a738
$$ plain form
10430 -253498 76938 62614 -36634 452633 -317333 -190875 194758 544016 55935 9827 -160453
10418 -14327 310380 -111955 271134 -26200 145430 9479 -92401 -86302 102633 -190227 -81394
10406 -140338 612 170086 -30609 74895 123129 1701 -27494 -21398 -359413 28843 -72419 183112
10393 59994 64634 100099 23344 85927 -83159 -144941 -96451 -285500 -73069 -27703 -20587 90672
10380 240455 307074 -362340 248950 158575 -195056 322355 35991 66505 -378002 179892
10369 173439 170972 -207770 -197386 57566 298525 267572 -48469 135998 119351 324815 1183
10357 -86427 425232 -19640 10576 242840 190344 370248 460131 251798 278123 250585 606052
10346 606052 424684 114481 299388 258878 228255 267909 369223 247548 -220451 229637
$$ packed form
10430b53498G6938j4324c6634D52633c17333J26458A94758L49258E5935I827a60453
10418a4327C10380a11955B71134b6200A45430I479i2401O099A02633a90227h1394
10406a40338F12J69474c0609G4895M8234A701b7494O096l38015B8843g2419A83112
10393E9994M640L5465B3344O2583h3159o1782M8490j89049g3069b7703P116I0672
10380B40455O6619c62340B48950r0375a95056C22355C5991L0514c78002A79892
10369A73439k467b07770J0384E7566K40959l0953d8469A35998j6647K05464A183
10357h6427D25232a9640A0576K32264n2496J79904Q9883k08333K6325k7538L55467
10346F06052j81368A14481J84907m0510l0623L9654J01314j21675b20451B29637
$$ plain form
10335 185184 40219 265589 476894 163734 364383 332075 657709 258907 -46859 33849
10324 451845 -103869 77927 285703 73630 228223 213041 -85347 265746 148093 146331 -230970
10312 221480 106408 230293 -50485 627716 155133 -41644 -274443 278810 -23576 39582
10301 136068 -127529 -102069 -29184 91467 -166949 70235 -256035 211140 -340434 97539
10290 3989 52475 -55647 76551 -254313 -65913 23990 6745 183083 57692 260969 134258
10279 134258 -28217 -47418 -75356 -97590 265062 -60621 12345 187790 42063 -58627 164825
10267 -147063 -147444 -5053 -12976 -175161 -263410 -53816 2593 -172218 405219 -247858 -269313 -65111
10254 -350330 -112774 37933 213819 10297 177521 -49335 85379 -210338 -43562 39798 -224238
$$ packed form
10335A85184D0219K25370K11305A63734K00649l2308L25634B58907d6859C3849
10324D51845a03869G7927K07776G3630J54593j5182h5347B65746j17653j762b30970
10312B21480A06408J23885e0485F27716A55133d1644k32799B78810b3576C9582
10301A36068a27529K5460b9184I1467a66949G0235b56035B11140c40434I7539
10290C989M8486e5647G6551b54313f5913B3990F745J76338E7692K03277j26711
10279A34258b8217j9201k7938k2234B65062f0621A2345J75445D2063e8627A64825
10267a47063l81e053p923j62185q8249e3816B593a72218D05219b47858k1455f5111
10254c50330a12774C7933J75886A0297J67224d9335H5379b10338d3562C9798b24238
$$ plain form
10242 -209528 130912 56784 165710 -99581 159482 145897 -143574 246897 231330 -57030
10231 65177 57268 -122521 -191359 123580 111945 -151666 -137223 -356073 84367 -22664 -173921
10220 -173921 -486114 -260358 41860 -94162 361802 -335255 43045 -224651 -57147 -90045
10210 -90045 -214885 -106920 192868 193800 150020 78374 415990 -110226 -133544 -18252 -219865
10199 -219865 -139374 -114561 141636 528237 -195583 34320 50027 -429287 30520 -145820
10188 -543559 155643 -39136 62204 62149 319188 -311607 2202 385614 203270 421697 -18794
10176 55492 -130923 -166774 -83055 76625 -77543 -254811 -454920 28642 26142 -328405 -249275
10165 -249275 82464 -290230 -145605 162368 -105854 -139572 119566 -320793 160387 61791
$$ packed form
10242b09528A30912E6784J08926i9581A59482j3585a43574B46897j5567e7030
10231F5177p909a22521o8838A23580j1635a51666J4443k18850H4367b2664j51257
10220a73921l12193K25756D1860i4162C61802c35255D3045b24651e7147l2898
10210i0045j24840a06920A92868R32m3780p1646L37616a10226k3318a8252k01613
10199b19865Q0491K4813A41636L86601a95583C4320J5707d29287C0520a45820
10188e43559A55643c9136F2204n5K57039c11607B202L83412j82344K18427a8794
10176E5492a30923l5851h3055G6625g7543j77268k00109B8642k500c28405P9130
10165b49275H2464b90230J44625A62368a05854l3718A19566c20793A60387F1791
$$ plain form
10154 -40825 -208537 58715 -50646 163560 205670 -97904 -98848 -94969 24765 150069 384511
10143 384511 586273 -90743 36656 -386951 33760 -13559 14024 -134355 -184210 67426 -285147
10131 93917 22643 82852 -211601 -208072 -170911 -203575 52396 -43513 -143288 -77668 153221
10119 -39453 -544409 -64223 -19185 -84277 -10377 -322570 -142738 -112033 -250937 70518 -100403
10107 115870 7969 -43867 76341 69905 -146217 288798 39778 13181 59778 -42884 -233207
10096 -233207 202058 45971 -202663 -121716 -87837 183718 6308 147355 32598 184495 132433
10085 132433 -83227 -135144 -218690 -277000 122411 -241006 323594 76173 146687 -175724 -237355
10074 -237355 -472261 -1413 36810 82840 -172001 -190779 -94723 157556 188537 69019 -14161
$$ packed form
10154d0825j67712E8715e0646A63560M2110i7904r44L879B4765J25304K34442
10143C84511K01762i0743C6656c86951C3760a3559A4024a34355m9855F7426b85147
10131I3917B2643O0209b11601L529L7161l2664E2396d3513r9775O5620A53221
10119c9453n04956f4223a9185o5092a0377l12193a42738L0705j38904G0518a00403
10107A15870G969d3867G6341o436a46217B88798C9778A3181M6597d2884j90323
10096b33207B02058D5971b02663Q0947L3879A83718F308J41047C2598J51897n2062
10085A32433h3227n1917q3546n8310A22411b41006C23594G6173P0514a75724o1631
10074b37355k34906a413C6810M6030a72001j8778i4723A57556L0981F9019a4161
$$ plain form
10062 -263063 -150245 -8760 -111929 -222975 173263 -159833 -17212 -299822 -563005 -23399
10051 -146184 -75248 44061 -377900 97016 -166129 -148296 -378952 -558116 -92394 -12833 72747
10039 -43401 -28470 59913 70258 -301053 37668 -186086 -154184 96894 174955 73027 -255670
10027 7487 24323 205514 88149 43321 -470209 42551 -622291 -70886 8693 -188965 49364
10015 -291872 -156614 -71849 -105903 -103362 -131925 -307065 -322709 -250119 2946 -37760 -179400
10004 -179400 -6338 144621 -264979 -111590 -69597 -51373 17112 -436497 186324 -100621
9993 55666 -165223 192622 158952 -173463 56759 -188785 76599 -178827 270007 -225091
9982 96446 -162495 339750 -14732 101121 -50939 -417939 -16639 -180805 5057 -390020 -146603
$$ packed form
10062b63063J12818h760j03169j11046A73263a59833a7212k82610k63183b3399
10051a46184P0936D4061c77900I7016a66129J7833k30656j79164i2394a2833G2747
10039d3401J4931E9913J0345c01053C7668a86086L1902I6894P8061G3027b55670
10027G487J6836J81191H8149D3321d70209D2551f22291g0886H693a88965D9364
10015b91872J35258g1849l4054K541k8563j75140j5644P2590B946c7760j41640
10004a79400f338A44621b64979a11590M1993J8224A7112d36497A86324a00621
9993E5666a65223A92622l3670a73463E6759a88785G6599a78827B70007b25091
9982I6446a62495C39750a4732A01121e0939l67000a6639j64166E057c90020a46603
$$ plain form
9970 -161243 -247186 -125918 -120974 193001 169779 -14664 40064 -231827 -207036 -79179 40220
9958 -224296 -165488 5055 306750 162563 -207116 -226309 -196904 -410285 -67580 -228650 -417567
9947 -417567 -326495 -72944 -400699 -58460 89718 104898 75041 162493 100842 -72109 226802
9935 -192289 -82105 27192 -280351 -111450 194748 62179 -214983 -82365 -263952 222480
9924 -24820 205738 133401 6924 36340 -56327 70453 -136070 -131634 -146627 -200976 -389292 -290496
9912 -290496 -136124 244177 -113821 -270252 -174904 67233 -50774 74206 -218039 -156128 217720
9900 -103280 -205315 342914 -68332 141611 99625 212713 -18555 -313662 -143774 -73273
9890 -73273 13822 -165661 160389 -98209 -68723 139670 232444 -194013 -4674 -399991 86592
$$ packed form
9970a61243q5943J21268M944A93001k3222a4664D0064b31827K4791g9179D0220
9958b24296N8808E055L01695j44187b07116j9193K9405k13381f7580j61070j88917
9947d17567R1072g2944l27755e8460H9718J5180k9857Q7452o1651g2109B26802
9935a92289h2105B7192b80351a11450A94748F2179b14983h2365j81587B22480
9924b4820B05738p2337F924K9416e6327G0453a36070M436j4993n4349j88316R8796
9912b90496a36124B44177a13821j56431R5348F7233e0774G4206b18039O1911B17720
9900a03280j02035C42914f8332A41611m1986J13088a8555k95107a43774P0501
9890g3273A3822a65661A60389i8209K9486A39670R2774a94013d674l95317H6592
$$ plain form
9878 -159736 -68860 -28202 -9923 -30883 137588 94688 -88030 -26445 -130965 -369678 -36475
9866 105680 -111615 -208201 35722 -177130 3458 -97008 241339 117298 -77447 -89385 -291409
9855 -291409 37265 -161750 -281687 -55892 155963 -163981 -134530 -113031 37756 -230813 54499
9843 74407 -198202 103010 -69729 -8864 -104594 51427 8997 130633 -276089 -90192 106516
9831 227563 -196421 181840 -132694 140644 115904 -170227 23794 -47567 91920 -77922 -2887
9819 234962 -107257 188936 190147 51789 -267851 -88572 -72005 -105138 11404 -327982 -33841
9807 -4360 59255 -315895 -126319 -18400 272 109922 -86034 45 -75717 84635 -443294 106817
9794 212572 83266 -129068 162693 -283219 -33917 -28016 -197292 -196903 171687 -157016 -6707
$$ packed form
9878a59736f8860b8202i923k0960A37588m2900h8030b6445j04520k38713c6475
9866A05680a11615r6586C5722a77130C458i7008B41339A17298g7447j1938k02024
9855b91409C7265a61750j19937e5892A55963a63981K9451K1499C7756b30813E4499
9843G4407a98202A03010f9729h864r5730E1427H997J21636b76089i0192A06516
9831B27563a96421A81840a32694A40644k4740a70227B3794d7567I1920g7922b887
9819B34962a07257A88936J211E1789b67851h8572J6567l3133A1404c27982c3841
9807d360E9255c15895a26319a8400B72J09650h6034D5g5717H4635d43294A06817
9794B12572H3266a29068A62693b83219c3917N901j69276L89A71687a57016f707
$$ plain form
9782 -248947 -2046 86450 -261004 23799 158921 59894 -61777 -101244 -243155 156717 -178020
9770 -41212 -190281 -198250 -34469 -318171 -90488 -141003 92685 -182512 15087 -98722 164261
9758 -96714 -124371 -126925 4081 -315901 -43217 223876 -131678 -148450 132225 73525 -452903
9746 -67090 261507 -2660 -231417 76940 62487 -258467 300060 -137422 271837 -269782 -204955
9735 -204955 -190743 -244854 19741 -106893 168484 191686 205941 -12267 -75746 -380958 32296
9723 -144932 -36310 -73926 -19498 -52610 -129152 -47753 -90697 -122136 -185320 -150691 18176 56688
9711 56688 -161692 128303 -247311 103430 -39847 176431 -385422 120333 -370691 119735
9700 -242333 72426 -20390 -122057 -253876 -504544 -273449 -131619 186333 -157384 -375076
$$ packed form
9782b48947b046H6450b61004B3799J35122E9894f1777l9467j41911A56717a78020
9770d1212j49069p969c4469k83702i0488n0515I2685a82512A5087i8722A64261
9758i6714k7657k554D081c15901d3217B23876a31678j6772A32225n8700d52903
9746f7090B61507b660k28757G6940j4453b58467C00060a37422B71837b69782O4827
9735b04955J4212n4111A9741a06893A68484K3202J4255a2267o3479l05212C2296
9723a44932c6310l7616a9498l3112p6542d7753m2944l1439o3184L4629A8176L8512
9711E6688a61692A28303b47311A03430c9847A76431c85422A20333c70691A19735
9700b42333G2426b0390j01667j31819k50668K31095a31619A86333a57384k17692
$$ plain form
9690 -375076 -129395 -100685 -56834 -75941 -75065 -136462 -392326 -122047 -127849 9960 -399968 -83042
9677 127218 -190470 -62480 411953 43791 -108817 101795 -426797 -62557 -239101 -177428
9667 -177428 -128014 -126600 25384 1069 -271643 -42587 8937 192955 179803 -312268 -442354
9656 -442354 -579 -155515 -244238 -106780 -152188 3638 -82636 -60457 -151375 -108807 87391 17753
9643 48861 -206804 86440 -112598 67690 -162580 -282921 -242525 -73773 -313695 -33532 -187693
9632 -187693 -308931 41810 155946 -148367 -165134 97823 -128454 -261619 20827 378466
9622 378466 5581 189807 -171095 75783 -5805 32729 -24136 65386 -28517 19895 22551 -196950
9609 258314 199658 -58808 -90222 -296576 -152181 -72297 -248795 -270185 -63091 -45404 17861
$$ packed form
9690c75076a29395K8710M3851j9107Q76o1397k55864a22047n802I960c99968h3042
9677A27218a90470f2480D11953D3791a08817A01795d26797f2557j76544O1673
9667a77428M9414J414B5384A069b71643d2587H937J84018j3152c12268j30086
9656d42354e79j54936q8723a06780m5408C638h2636K2179r0918M2568H7391A7753
9643D8861b06804H6440a12598F7690a62580j20341M0396g3773k39922c3532j54161
9632a87693j21238D1810J14136a48367j6767I7823a28454j33165B0827L57639
9622C78466E581J84226a71095G5783e805C2729b4136F5386b8517A9895K656a96950
9609B58314n8656e8808l1414k06354J44395g2297j76498k1390f3091J7687A7861
$$ plain form
9597 -144223 -423838 -159224 -263192 47269 -13879 64283 -205761 -50327 8150 -1406 58077
9585 -71272 -84869 109111 -139499 -54764 168831 -297900 -175060 -166272 43858 -205961 313090
9573 -100449 -68125 -75998 -296128 -136101 -118164 -296258 224553 -297950 -269066 -166090 82611
9561 -114083 73564 68742 -48959 8456 -118523 11056 186992 65172 -319761 142171 -292716
9549 -242018 -280884 -177849 -11319 98095 945 130145 -116537 -156144 -7955 17172 313976
9538 313976 -23068 -36629 -11738 -76875 97768 -50810 97882 -265231 57379 -259445 -174906
9527 -174906 5656 -66213 -214284 46842 81832 118580 -187528 -47514 -111934 -168303 228041
9515 -161999 -123812 50622 38155 189238 118830 195748 181630 -65594 -34348 92302 -175254
$$ packed form
9597a44223k79615a59224j03968D7269a3879F4283b05761e0327H150a406E8077
9585g1272j3597A09111a39499e4764A68831b97900J22840Q788D3858b05961C13090
9573a00449L2324p873k20130a36101J7937j78094B24553b97950K8884J02976H2611
9561a14083G3564m822d8959H456a18523A1056J75936F5172c19761A42171b92716
9549b42018l8866J03035a1319I8095I45J29200a16537l9607g955A7172K96804
9538C13976b3068j3561a1738o5137I7768e0810I7882b65231E7379b59445Q4539
9527a74906E656f6213j48071D6842L4990L6748a87528d7514o4420n6369B28041
9515a61999L8187E0622j2467J51083p0408P6918j4118f5594L1246I2302a75254
$$ plain form
9503 -72831 -40380 -33215 -258772 66398 47143 -171043 -116950 -4422 -274502 -211130 -40972 -466927
9491 -466927 26045 42028 -218369 -241235 84658 -172627 -102483 339091 168553 91676 -95015
9479 59438 -81230 -9271 50756 21774 -27642 -20412 -178818 156725 41632 261773 248000 -141762
9466 -272027 -31587 -231702 -386613 -77782 -179986 12688 -3984 187370 182134 -6089 -76947
9455 -76947 12954 -357720 -53551 16307 -202880 -7285 9049 10050 -586603 -80126 99086 59233
9443 59233 153565 -27155 30049 31217 138649 -218998 -5789 -219860 6781 -9089 8151 184554
9431 184554 -77910 -10532 -34428 -205769 -18845 -401056 -39419 -38556 -21057 268645 282051
9420 282051 -116509 -82446 -126736 -153523 -163760 2169 310 -285387 -315116 -40003 -281505 74040
$$ packed form
9503g2831L2451P165k25557F6398j9255a71043N4093d422k70080O3372d0972m25955
9491d66927B6045J5983b18369k2866H4658a72627P0144C39091A68553p6877i5015
9479E9438h1230i271E0756B1774b7642P230j58406A56725D1632K20141j3773a41762
9466b72027c1587k00115j54911g7782j02204A2688c984A87370n236f089p0858
9455g6947A2954c57720e3551A6307b02880g285I049J001e86603h0126I9086l9853
9443E9233R4332b7155C0049J168J07432b18998e789k14071F781i089H151J76403
9431A84554g7910a0532k3896j71341a8845l82211c9419Q63J7499B68645J3406
9420B82051a16509L4063m4290k6787j0237B169C10b85387k9729d0003k41502G4040
$$ plain form
9407 -101995 -165511 -22442 -37758 -137735 -147089 -93165 -33767 32802 -147188 4326 -2851 18404
9394 285089 -78646 -238098 -336198 -265509 -32188 -29392 -62131 352592 -309529 -413980 -42196
9382 11142 -364160 -237674 -356616 -204163 72111 -95229 -12423 116304 -321156 -172781
9372 -172781 -297232 -57759 -169810 -43795 -114260 -198669 -24177 -167042 138541 -111512 32843
9360 218578 -121409 93374 -230263 -52107 -246381 -20407 -81821 -17964 13413 -78910 -201815
9349 -201815 -274967 -179381 -219088 146116 328990 -244757 -153513 170141 -190451 -175369 -151559
9338 -151559 -180947 212459 -159029 -232557 -5490 82047 47264 -17766 -12784 -294895 -193111
9327 -193111 -149572 121364 48755 103378 -307120 -186542 -69945 -197712 -186413 -178593 37082
$$ packed form
9407a01995o3516b2442j5316r9977r354N3924c3767C2802a47188D326b851A8404
9394B85089g8646j59452r8100P0689c2188K796l2739C52592c09529j04451d2196
9382A1142c64160J26486j18942J52453G2111i5229a2423A16304c21156J48375
9372a72781j24451e7759j12051d3795p0465q4409b4177j42865A38541a11512C2843
9360B18578a21409I3374b30263e2107j94274b0407o1414a7964A3413g8910j22905
9349b01815p3152R5586l9707A46116J82874b44757R1244A70141a90451J5082K3810
9338a51559k9388B12459a59029p3528e490H2047l4783a7766M982k82111J01784
9327a93111M3539A21364D8755N4623c07120J20578f9945j27767J1299P820C7082
$$ plain form
9315 -79718 -258256 -15621 -185098 -333972 -94510 -189746 2706 -74049 -12408 -34474 -158436
9304 -158436 88444 -181276 -398891 -144327 72198 130676 -141212 -23350 -127432 -155227 195574
9292 57382 12541 -334883 77387 2610 -344419 -25155 83517 -196508 -120378 -35585 -61444
9281 -61444 -118265 -207413 -133493 -285756 -50237 258423 -11030 -144453 30336 126294 338616
9270 338616 -340339 -207114 146803 376313 21360 -354089 131250 6292 103356 76532 7926
9258 -8495 -15832 -20016 11374 187529 16633 -28123 31694 -7229 159673 262855 75656 -64377
9245 -560303 14191 45205 215099 8312 -276154 20760 -298407 -162835 -26763 84589 -282010
9233 281633 -84807 -301875 71807 -277680 -202514 -56908 -262822 -50679 -154022 99251 -283052
$$ packed form
9315g9718j78538a5621j69477j48874i4510r5236B706g4049a2408k2066j23962
9304a58436H8444a81276k17615a44327G2198N8478a41212b3350j04082k7795A95574
9292E7382A2541c34883G7387B610c44419b5155H3517a96508P6130c5585k5859
9281f1444n6821q9148P3920j52263e0237B58423a1030j33423C0336R5958K12322
9270C38616c40339J33225A46803K29510B1360c54089A31250F292R7064k6824G926
9258h495p337m184A1374J76155A6633b8123C1694g229A59673J03182G5656f4377
9245e60303A4191L1014J69894H312b76154B0760b98407J35572b6763H4589b82010
9233B81633h4807k17068G1807b77680P5166e6908k05914e0679j03343I9251b83052
$$ plain form
9221 -145978 127136 -85064 -148286 -51947 -136299 53780 12391 50185 -38652 -199304 33884
9209 139230 -9945 230821 -378670 -129605 -136338 -15421 44806 75924 -304288 378436 -10092
9197 -22692 -229255 -35203 -291738 -27107 -189771 39906 42832 215069 -203585 95494 126612
9186 126612 -200908 -10409 -268530 79814 -237916 35989 12834 41891 229104 191948 88254
9174 -422010 144013 229403 344847 68238 -207102 -164660 -21282 -76094 -138719 60881 211445
9163 211445 158486 -168151 159267 115323 175835 196286 191234 -49556 -261278 -338270 248280
9151 -101404 96533 -196889 18049 -13719 -306800 -198474 9481 246626 70750 -325676 -409480
9140 -409480 -123750 122425 81935 -151037 -137168 -204061 140391 267480 138076 -47275
$$ packed form
9221a45978A27136h5064o3222e1947q4352E3780A2391L7794c8652j60652C3884
9209A39230i945B30821c78670a29605o733a5421D4806L1118c04288C78436a0092
9197b2692k06563c5203k56535b7107j62664C9906K926J72237b03585I5494L1118
9186A26612b00908a0409k58121G9814b37916C5989A2834K9057J87213l7156H8254
9174d22010A44013Q5390J15444F8238b07102M2442b1282n4812o2625F0881J50564
9163B11445n2959a68151A59267m3944O0512K0451n052d9556k11722p6992B48280
9151a01404I6533a96889A8049a3719k93081J08326I481K37145G0750c25676q3804
9140d09480a23750A22425m0490a51037J3869o6893A40391J27089j29404d7275
$$ plain form
9129 157217 -29374 -361561 -77621 -36301 -174492 149459 70240 -1603 136429 212958 -32012
9117 -3799 82403 -65994 231953 148386 -185955 119982 313698 -180952 100929 -296697 223036
9105 -165409 61290 70236 11287 -172957 95410 96912 -429357 -34280 -85932 -96919 -166196 -289293
9093 -289293 -321849 -53745 -167814 -31677 -145713 -188172 -179959 32620 -215974 140924 98145
9082 98145 70353 -204217 198459 110479 102227 224352 -107777 116140 -224430 -31002 -140101
9071 -140101 -58355 -88717 -170690 24984 173005 -372554 -31324 23047 35935 30624 12721
9059 13493 81427 -125698 -84144 -35994 -192308 -71757 258915 -169416 112519 -290106 2535
9047 -98544 117236 127492 -477501 -42246 37487 -109327 13297 -41260 -236886 75316 -120757
$$ packed form
9129A57217b9374l32187g7621c6301j38191A49459G0240a603A36429P6529c2012
9117c799H2403f5994B31953q3567a85955A19982J93716a80952A00929b96697B23036
9105a65409F1290Q946A1287a72957I5410J502d29357c4280n1652j0987o9277j23097
9093b89293l2556e3745j14069c1677j14036m2459Q213C2620b15974A40924m2779
9082I8145k7792b04217A98459q7980q252J22125a07777A16140b24430c1002j09099
9071a40101e8355l0362q1973B4984J48021c72554c1324B3047J2888n311A2721
9059A3493O7934a25698M1554c5994j56314g1757B58915a69416A12519b90106B535
9047i8544A17236J0256d77501d2246C7487a09327A3297d1260j95626G5316a20757
$$ plain form
9035 -55671 83341 111544 -251581 -456934 -145803 9963 -195694 -84712 -314100 148241 -14041
9023 48707 157376 -113769 -324844 -156127 -17373 -7301 56686 1402 -16957 -351020 -273436
9012 -273436 -17367 -193216 -29325 147537 -196926 113283 -476309 -15502 -310758 7246 -128683
9000 -128548 65232 -144586 299532 -127080 -83180 -337733 -235831 177182 -340739 -197212
8990 -197212 -328735 71069 -13244 -65192 47682 -153737 -102191 4388 -55046 -236649 -54230
8978 150384 -401181 165680 -87941 -52005 167294 -47491 40379 -262782 -460099 -71216 195216
8966 -190934 -49347 -175399 -76825 39614 37770 -191756 -191211 -205776 -142376 228836 62894 -285651
8953 -187295 -177580 -222063 249230 -234127 36624 -42415 44756 -172863 60213 -122459 -349134
$$ packed form
9035e5671H3341K8203b51581k05353a45803I963a95694h4712k29388A48241a4041
9023D8707J08669a13769k11075a56127a7373g301E6686A402a6957l34063P7584
9012b73436a7367j75849b9325A47537a96926A13283d76309a5502k95256G246a28683
9000a28548F5232a44586B99532a27080M3900k54553J01902A77182c40739J43527
8990a97212j31523G1069a3244n1948D7682a53737N1546D388e5046j81603e4230
8978A50384d01181A65680h7941L5936A67294d7491D0379b62782j97317g1216A95216
8966a90934d9347j26052g6825C9614j844a91756N45j4565O3400B28836F2894b85651
8953a87295R715m4483B49230b34127C6624d2415D4756a72863F0213a22459k26675
$$ plain form
8942 -349134 -263834 120775 132510 89464 -41670 -234456 -220294 208162 -245410 1161 60506
8931 60506 52943 266487 -198097 -82371 -65781 267468 200707 280548 -48079 184010 -113343
8919 -265735 -149293 154612 51964 -551 -198176 242910 71764 72160 140157 418279 666720
8908 666720 748310 816675 788744 2092071 3890325 8749306 4648388 2114407 1122415
8899 1122415 800105 693710 561778 411573 530830 100678 -75347 -263110 54364 38468
8889 38468 302002 251770 -463153 -285756 67091 44493 -168053 -151426 -10157 174329 -199795
8877 83862 15295 -7184 46297 -233755 91969 -190813 -233481 -116681 -64753 -439820 77363
8865 -197368 -364317 275284 27035 -59542 185241 -37823 -166024 -26992 -105202 41358 25615
$$ packed form
8942c49134Q5300A20775J1735m3046d1670j92786J4162B08162b45410A161N9345
8931F0506p563K13544a98097h2371J6590B67468o6761P9841d8079A84010a13343
8919b65735J16442A54612E1964e51j97625B42910G1764L96O7997K78122K48441
8908F66720Q1590O8365k7931J303327J798254M858981m100918B114407r91992
8899A122415l22310j06395j31932j50205J19257A00678g5347j87763E4364j5896
8889C8468K63534n0232d63153J77397F7091k2598a68053J6627a0157A74329a99795
8877H3862A5295g184D6297b33755I1969a90813m2668a16681N1928l75067G7363
8865a97368j66949B75284B7035e9542A85241c7823j28201b6992p8210D1358j5743
$$ plain form
8854 25615 74813 185544 -367947 67788 233870 -74100 9454 -193257 263049 -268237 -201050
8843 -201050 -104910 -376816 8017 184979 -349487 -210296 -295272 -2793 -49926 -132540 2610
8831 -83118 -127628 137767 254834 -73417 34228 -83331 93218 -169177 -245757 25871 31076
8820 31076 285537 112949 -297815 146169 -24159 -253224 -346897 -389672 -179981 -149743 -132610
$$ packed form
8854B5615M9198J10731c67947F7788J66082g4100I454a93257B63049b68237O7187
8843b01050R6140k71906H017J76962c49487J39191q4976b793m7133q2614B610
8831h3118m4510A37767J17067g3417C4228h3331I3218a69177p6580B5871N205
8820C1076K54461A12949b97815A46169b4159k29065r3673m2775a79981L0238J7133
$$ [...]
##END NTUPLES=NMR SPECTRUM
##END=
