
##TITLE=AC1178_popayan-inza-3-cauca-CINAH12013_5891437_CKZ91HNEDv
##JCAMPDX= 6.0         $$ Bruker NMR JCAMP-DX V2.0
##DATA TYPE= NMR SPECTRUM
##DATA CLASS= NTUPLES
##ORIGIN= BRUKER
##OWNER= Administrator
$$ 1.72 TOPSPIN		Version 2.1
$$ 2012-04-03 00:46:16.859 -0500  Administrator@TOPSPIN
$$ Compression mode = diff/dup
##.OBSERVE FREQUENCY= 400.13188235
##.OBSERVE NUCLEUS= ^1H
##.ACQUISITION MODE= SIMULTANEOUS (DQD)
##.ACQUISITION SCHEME= undefined
##.AVERAGES= 8
##.DIGITISER RES= 22
##SPECTROMETER/DATA SYSTEM= spect
##.PULSE SEQUENCE= zg30
##.SOLVENT NAME= COFFEE_meoh
##.SHIFT REFERENCE= INTERNAL, COFFEE_meoh, 1, 14.98061
##AUDIT TRAIL= $$ (NUMBER, WHEN, WHO, WHERE, PROCESS, VERSION, WHAT)
$$ ##TITLE= Audit trail, TOPSPIN		Version 2.1
$$ ##JCAMPDX= 5.01
$$ ##ORIGIN= Bruker BioSpin GmbH
$$ ##OWNER= Administrator
$$ $$ C:\Bruker\TOPSPIN/data/COFFEE/nmr/AC1178_popayan-inza-3-cauca-CINAH12013_5891437_CKZ91HNEDv/10/pdata/1/auditp.txt
$$ ##AUDIT TRAIL=  $$ (NUMBER, WHEN, WHO, WHERE, PROCESS, VERSION, WHAT)
(   1,<2012-04-03 00:46:08.218 -0500>,<Administrator>,<TOPSPIN>,<go>,<TOPSPIN 2.1>,
      <created by zg
	started at 2012-04-03 00:45:01.375 -0500,
	POWCHK enabled, PULCHK disabled,
       configuration hash MD5:
       1A 1E CE 29 27 FD 77 03 67 4E F0 E3 C4 B2 CB 90
       data hash MD5: 64K
       97 F9 41 F4 FA F4 67 23 7F 99 43 61 BE 93 59 BE>)
(   2,<2012-04-03 00:46:11.343 -0500>,<Administrator>,<TOPSPIN>,<proc1d>,<TOPSPIN 2.1>,
      <Start of raw data processing
       efp LB = 0 FT_mod = 6 PKNL = 1 PHC0 = 0 PHC1 = 0 SI = 32K 
       data hash MD5: 32K
       7B 01 CF 5A D3 0A 80 76 0A 88 C9 4C 2F 2C 85 3D>)
(   3,<2012-04-03 00:46:11.750 -0500>,<Administrator>,<TOPSPIN>,<proc1d>,<TOPSPIN 2.1>,
      <pk PHC0 = 213.0579 PHC1 = 0 
       data hash MD5: 32K
       98 4F AD 75 F4 D5 AE 18 5A 7D 7A 3F 00 53 61 FB>)
(   4,<2012-04-03 00:46:11.812 -0500>,<Administrator>,<TOPSPIN>,<proc1d>,<TOPSPIN 2.1>,
      <abs ABSG = 1 
       data hash MD5: 32K
       23 38 C3 D9 C8 78 DC D2 09 FC FF 57 48 67 4A 27>)
(   5,<2012-04-03 00:46:11.859 -0500>,<Administrator>,<TOPSPIN>,<proc1d>,<TOPSPIN 2.1>,
      <abs ABSG = 2 
       data hash MD5: 32K
       BF 00 09 16 B1 21 27 E0 7C 13 53 17 78 40 29 4A>)
(   6,<2012-04-03 00:46:11.890 -0500>,<Administrator>,<TOPSPIN>,<proc1d>,<TOPSPIN 2.1>,
      <abs ABSG = 3 
       data hash MD5: 32K
       7C 68 6C 0B B9 19 AB 24 DD C5 34 53 E5 EA 0F 2B>)
(   7,<2012-04-03 00:46:11.937 -0500>,<Administrator>,<TOPSPIN>,<proc1d>,<TOPSPIN 2.1>,
      <abs ABSG = 4 
       data hash MD5: 32K
       CF 2A 10 71 28 AD 6B 38 DE 7A 74 4A C7 EC D4 0C>)
(   8,<2012-04-03 00:46:11.984 -0500>,<Administrator>,<TOPSPIN>,<proc1d>,<TOPSPIN 2.1>,
      <abs ABSG = 5 
       data hash MD5: 32K
       F6 A2 F3 FD 6B 81 4D A7 F5 65 4A BB 2A 15 B0 43>)
$$ ##END=
$$ 
$$ $$ hash MD5
$$ $$ C9 AA 8F 8F 41 D3 49 CC 38 6B 82 A7 15 E3 23 2A
##$RELAX= 
##$RELAX= 
##$RELAX= 
##$RELAX= 
##$RELAX= 
##$RELAX= 
##$RELAX= 
$$ Bruker specific parameters
$$ [...]
150 150 150 150 150 150 150 150
##$TP07= 0
##$TPNAME0= <>
##$TPNAME1= <>
##$TPNAME2= <>
##$TPNAME3= <>
##$TPNAME4= <>
##$TPNAME5= <>
##$TPNAME6= <>
##$TPNAME7= <>
##$TPOAL= (0..7)
0.5 0.5 0.5 0.5 0.5 0.5 0.5 0.5
##$TPOFFS= (0..7)
0 0 0 0 0 0 0 0
##$TUNHIN= 0
##$TUNHOUT= 0
##$TUNXOUT= 0
##$USERA1= <user>
##$USERA2= <user>
##$USERA3= <user>
##$USERA4= <user>
##$USERA5= <user>
##$V9= 5
##$VALIST= <valist>
##$VCLIST= <CCCCCCCCCCCCCCC>
##$VD= 0
##$VDLIST= <DDDDDDDDDDDDDDD>
##$VPLIST= <PPPPPPPPPPPPPPP>
##$VTLIST= <TTTTTTTTTTTTTTT>
##$WBST= 2048
##$WBSW= 25
##$XGAIN= (0..3)
0 0 0 0
##$XL= 0
##$YL= 0
##$YMAX_a= 531219
##$YMIN_a= -646200
##$ZGOPTNS= <>
##$ZL1= 120
##$ZL2= 120
##$ZL3= 120
##$ZL4= 120
##$ABSF1= 14.98061
##$ABSF2= -5.57192
##$ABSG= 5
##$ABSL= 3
##$ALPHA= 0
##$AQORDER= 0
##$ASSFAC= 0
##$ASSFACI= 0
##$ASSFACX= 0
##$ASSWID= 0
##$AUNMP= <proc_prof1d_extract_pilot.lims>
##$AXLEFT= 0
##$AXNAME= <>
##$AXNUC= <1H>
##$AXRIGHT= 0
##$AXTYPE= 0
##$AXUNIT= <>
##$AZFE= 0.1
##$AZFW= 0.1
##$BCFW= 0
##$BC_mod= 0
##$BYTORDP= 0
##$COROFFS= 0
##$CY= 15
##$DATMOD= 1
##$DC= 0
##$DFILT= <>
##$DTYPP= 0
##$F1P= 0
##$F2P= 0
##$FCOR= 0.5
##$FTSIZE= 32768
##$FT_mod= 6
##$GAMMA= 0
##$GB= 0
##$INTBC= 1
##$INTSCL= 1
##$ISEN= 128
##$LB= 0
##$LEV0= 0
##$LPBIN= 0
##$MAXI= 10000
##$MC2= 0
##$MEAN= 0
##$ME_mod= 0
##$MI= 0
##$NCOEF= 0
##$NC_proc= -8
##$NLEV= 6
##$NOISF1= 0
##$NOISF2= 0
##$NSP= 0
##$NTH_PI= 0
##$NZP= 0
##$OFFSET= 14.98061
##$PC= 1
##$PHC0= 213.0579
##$PHC1= 0
##$PH_mod= 1
##$PKNL= yes
##$PPARMOD= 0
##$PPDIAG= 0
##$PPIPTYP= 0
##$PPMPNUM= 2147483647
##$PPRESOL= 1
##$PSCAL= 4
##$PSIGN= 0
##$PYNMP= <proc.py>
##$REVERSE= no
##$SF= 400.13
##$SI= 32768
##$SIGF1= 0
##$SIGF2= 0
##$SINO= 400
##$SIOLD= 32768
##$SPECTYP= <>
##$SREGLST= <1H.CDCl3>
##$SSB= 0
##$STSI= 32768
##$STSR= 0
##$SW_p= 8223.68421052632
##$SYMM= 0
##$S_DEV= 0
##$TDeff= 65536
##$TDoff= 0
##$TI= <>
##$TILT= no
##$TM1= 0
##$TM2= 0
##$TOPLEV= 0
##$USERP1= <user>
##$USERP2= <user>
##$USERP3= <user>
##$USERP4= <user>
##$USERP5= <user>
##$WDW= 1
##$XDIM= 32768
##$YMAX_p= 470047748
##$YMIN_p= -737603
##$CURPLOT= <Network HP LaserJet P1505>
##$CURPRIN= <$Network HP LaserJet P1505>
##$DFORMAT= <normdp>
##$LAYOUT= <+/1D_H.xwp>
##$LFORMAT= <normlp>
##$PFORMAT= <normpl>
##$SURQMSG= 1
$$ End of Bruker specific parameters
$$ ---------------------------------
##NTUPLES= NMR SPECTRUM
##VAR_NAME=  FREQUENCY,     SPECTRUM/REAL,   SPECTRUM/IMAG
##SYMBOL=    X,             R,               I
##VAR_TYPE=  INDEPENDENT,   DEPENDENT,       DEPENDENT
##VAR_FORM=  AFFN,          ASDF,            ASDF
##VAR_DIM=   32768,         32768,           32768
##UNITS=     HZ,            ARBITRARY UNITS, ARBITRARY UNITS
##FACTOR=    0.250966925370066, 1,           1
##FIRST=     8223.43324360095, -102149,      -69747
##LAST=      0,             -88741,          -314460
##MIN=       0,             -737603,         0
##MAX=       8223.43324360095, 470047748,    0
$$ Real data points
##PAGE= N=1
##DATA TABLE= (X++(R..R)), XYDATA
$$ [...]
19479a23990d7939j14861b8946j66173a9774B576a69196I1234a36873j10720Q1641
$$ -123990 -47939 -162800 -28946 -195119 -19774 2576 -169196 91234 -136873 -247593 -165952
19468a65952p1182e169A81659J4311D454a05620A31629J8179K4576c94033J73310
$$ -165952 -237134 -5169 181659 195970 4454 -105620 131629 149808 174384 -394033 -220723
19457b20723A83503b22231L0266N4705A13802a06979C6771a77023m8228i3776
$$ -220723 183503 -222231 -191965 -137260 113802 -106979 36771 -177023 -225251 -93776
19446b32631F7471j7445a08503H3461d1717F9326a7441j95178k34914e8057j6604
$$ -232631 67471 50026 -108503 83461 -41717 69326 -17441 -212619 -447533 -58057 -74661
19435g4661G7623b92925A02225a40877m23744a30449C3790a7119m2657k00779
$$ -74661 77623 -292925 102225 -140877 -564621 -130449 33790 -17119 -59776 -260555
19425b60555f77H0185a67587A39221K33652d7619l07634j1761J19112B503b9713
$$ -260555 -677 80185 -167587 139221 372873 -47619 -355253 -367014 -247902 2503 -29713
19413b65192C5649L25908c07405i4365q1820Q5626j68897A54882c34248h8073
$$ -265192 35649 361557 -307405 -94365 -176185 -90559 -259456 154882 -334248 -88073
19402B8952b52717j34110A07278f1551A27832a3598j85999A24916b833A05829
$$ 28952 -252717 -386827 107278 -61551 127832 -13598 -199597 124916 -2833 105829
19391B3789c73192A59329d2774j92422O4305M0831K3155A21552c19331B57288
$$ 23789 -373192 159329 -42774 -235196 -170891 -130060 -106905 121552 -319331 257288
19380c1955m2726j40665A91525f585j81579D82954a7604j28344k97157c3101m172
$$ -31955 -74681 -215346 191525 -6585 -188164 482954 -17604 -145948 -443105 -33101 -37273
19369c7273k17673B3667c06431H7200d4355j46377k5963B5704b31888O2314r7995
$$ -37273 -254946 23667 -306431 87200 -44355 -190732 -216695 25704 -231888 -169574 -267569
19358b67569J6843a361l10326J32279A43249c15438g5063j6027F091M1600a29689
$$ -267569 -250726 -1361 -311687 -179408 143249 -315438 -75063 -91090 6091 47691 -129689
19346a85890P1714L3315k01468C1903J93248a37166e4201a2203j94253A18243
$$ -185890 -114176 -80861 -282329 31903 225151 -137166 -54201 -12203 -206456 118243
19335c70638A11529N4513c90745a68084B45724h9710l9802j06776a10105A06351
$$ -370638 111529 166042 -390745 -168084 245724 -89710 -129512 -236288 -110105 106351
19324B20407b41665J10275l5037c9842j07895J8407C04420b78976A61979D8300
$$ 220407 -241665 -131390 -166427 -39842 -147737 -129330 304420 -278976 161979 48300
19313a29403I6267D5478e0867a3398k02449E145J13106l952a70597A68566d1940
$$ -129403 96267 45478 -50867 -13398 -215847 5145 118251 114299 -170597 168566 -41940
19301A2676a55580l336j14387Q1792r4278N0151a983H7787G309d5739F8376f8563
$$ 12676 -155580 -158916 -273303 -191511 -285789 -235638 -1983 87787 7309 -45739 68376 -68563
19288f5291k4285J4606B25306d9711j40397F8141b215A67696e619k88403n7821
$$ -65291 -89576 -74970 225306 -49711 -190108 68141 -2215 167696 -5619 -294022 -351843
19277c51843g3662l0392J7739K3418j62146j11303B62436I0658a62647R154F571
$$ -351843 -73662 -104054 -86315 -62897 -225043 -336346 262436 90658 -162647 -153493 6571
19265G3648k6524a17440B44586e1541k03114i0234j65874A58271g0383G5007b91189
$$ 73648 47124 -117440 244586 -51541 -254655 -90234 -256108 158271 -70383 75007 -291189
19253C7177c32577C372a48131A3405a90743F4102a98991G3697A4094b38338o882
$$ 37177 -332577 3372 -148131 13405 -190743 64102 -198991 73697 14094 -238338 -245220
19242b45220B27024b87041A0693c9595p0438j66587a15093n8661H2965j1696e2035
$$ -245220 227024 -287041 10693 -39595 -110033 -276620 -115093 -173754 82965 71269 -52035
19230c89075a34239j71633a3055j28580A07330i5710j70545j62341I0076h7313
$$ -389075 -134239 -305872 -13055 -141635 107330 -95710 -266255 -428596 90076 -87313
19219A93982a53998C8739a01912j87105D1039c56292G8539c99770a53264B9710
$$ 193982 -153998 38739 -101912 -289017 41039 -356292 78539 -399770 -153264 29710
19208D963J30085b93101R3981A64561a9679I4984M1039a78437h6326j55659I1621
$$ 4963 135048 -293101 -199120 164561 -19679 94984 136023 -178437 -86326 -241985 91621
19196c1958o5615j6737b7978C6480a44366D7375b13393F3762b94267E0358h3242
$$ -31958 -97573 -114310 -27978 36480 -144366 47375 -213393 63762 -294267 50358 -83242
19184A78718a08912A32614b0524j9536A80851b38162L5127a7481j00713B4160
$$ 178718 -108912 132614 -20524 -40060 180851 -238162 -203035 -17481 -118194 24160
19173a30564N9201F4329l794K1938h4335b5538p1139I8531c6205I0298b28046
$$ -130564 -71363 64329 60535 82473 -84335 -25538 -96677 98531 -36205 90298 -228046
19161I4045a29755A6243b76303a4021L524B18283a38787F38514e6238b4335m3252
$$ 94045 -129755 16243 -276303 -14021 -10497 218283 -138787 638514 -56238 -24335 -67587
19150f7587m45642K34148D9486N50079a30348f58F7217J9495b29739A6788J22407
$$ -67587 -513229 -279081 49486 599565 -130348 -658 67217 86712 -229739 16788 139195
19139A39195o5778a15407l4843B82801c60317f7264K7438b031n03156J98844J2950
$$ 139195 73417 -115407 -150250 282801 -360317 -67264 -39826 -2031 -505187 -306343 -293393
19128b93393J13253L0473B37421J16717H936e830I6693f2823F3991g4366L3596
$$ -293393 -180140 -149667 237421 354138 8936 -5830 96693 -62823 63991 -74366 -40770
19117d0770k78384A8472a86436g130A36685A1915b16852F6113J35839a5576j56793
$$ -40770 -319154 18472 -186436 -7130 136685 11915 -216852 66113 201952 -15576 -172369
19106a72369I7979C0282b81325D625a25724L7391p3821a5100r7008r3685F5888
$$ -172369 97979 30282 -281325 4625 -125724 -88333 -162154 -15100 -112108 -205793 65888
19094A77636n8663k007c5194j33343D18617a29339a8789j62759a9762A16049a92352
$$ 177636 118973 116966 -35194 -168537 418617 -129339 -18789 -181548 -19762 116049 -192352
19082B16375e2395n8691B75009a83564A06709j8118b62882O6649R7428q0945l1057
$$ 216375 -52395 -111086 275009 -183564 106709 88591 -262882 -196233 -98805 -179750 -210807
19071b10807N8258A01059D4639H05K1050a13431k1452A37420b80787k01779f8698
$$ -210807 -152549 101059 44639 805 21855 -113431 -134883 137420 -280787 -482566 -68698
19059A50323b01687I0772a38068d6452A28828E8884b01000k19880A38582b40078
$$ 150323 -201687 90772 -138068 -46452 128828 58884 -201000 -420880 138582 -240078
19048a23309A95074b25158i559C24551a5509A53652n3845b70990g3392c3638j21471
$$ -123309 195074 -225158 -9559 324551 -15509 153652 99807 -270990 -73392 -33638 -155109
19037a55109d0398l60612D0330d8674j77447A69601A3527e78432g1571G7315a35493
$$ -155109 -40398 -401010 40330 -48674 -226121 169601 13527 -578432 -71571 77315 -135493
19025A81522a18727C41056E7873g2333l6532p7563K055E0544b36100N4794J4498
$$ 181522 -118727 341056 57873 -72333 -108865 -186428 -184373 50544 -236100 -181306 -166808
19014a66808b8518B4544J93077e0927j44392g3222B61134i2226A61226b27899
$$ -166808 -28518 24544 217621 -50927 -195319 -73222 261134 -92226 161226 -227899
19003A13297f6086k28655J778h9477H7330d26947H076a92875J3563n5866D18880
$$ 113297 -66086 -294741 -292963 -89477 87330 -426947 8076 -192875 -179312 -235178 418880
18991C3482J24467b62150D1925A5488a48484o5732a5740j9593k9843k39262E8869
$$ 33482 157949 -262150 41925 15488 -148484 -214216 -15740 -35333 -65176 -304438 58869
18979c2463j92788C45845F9790J47343O5137M4566b9590o7060A68861a45438k34578
$$ -32463 -225251 345845 69790 217133 282270 326836 -29590 -96650 168861 -145438 -380016
18968c80016G1424a92551f350G4002J19140b8542A02694a44722N9857C81461A35124
$$ -380016 71424 -192551 -6350 74002 193142 -28542 102694 -144722 -84865 381461 135124
18956D70792A59608L61611c38158A28845h4487l1787f850k20277A4869b20022
$$ 470792 159608 521219 -338158 128845 -84487 -116274 -6850 -227127 14869 -220022
18945A28391l2749A9430Q3457D7072a33483A52702b5462C58630e7084B8678f5920
$$ 128391 95642 19430 102887 47072 -133483 152702 -25462 358630 -57084 28678 -65920
18933F3274a33777A6348a31987O1814F2205c30502i1981j78443A83687b41684
$$ 63274 -133777 16348 -131987 -70173 62205 -330502 -91981 -270424 183687 -241684
18922A55890a89237j58610B7370a97252B46794b6172p9212A29779b3810C5177
$$ 155890 -189237 -347847 27370 -197252 246794 -26172 -105384 129779 -23810 35177
18911c2312G7760J13858b10517g9214H2834a71745A9116K2101K69709c49790J44329
$$ -32312 77760 191618 -210517 -79214 82834 -171745 19116 41217 310926 -349790 -205461
18900b05461J01898A01948J93331C1698b13874C30755P4581j24959O1791j45757
$$ -205461 -103563 101948 295279 31698 -213874 330755 405336 280377 342168 196411
18890A96411p6866k4169J5855L3556r139C1848i9592o2342A33843e9885o7012
$$ 196411 119545 95376 111231 144787 135648 31848 -99592 -161934 133843 -59885 -126897
18879a26897l286c8624B2094i643k63492R6610j30996j03483A54102b2995j58185
$$ -126897 -130183 -38624 22094 -9643 -273135 -176525 -307521 -411004 154102 -22995 -181180
18868a81180f1153j61670F8292a72200A17161h7932m9453l3051J9616j08246A72973
$$ -181180 -61153 -222823 68292 -172200 117161 -87932 -137385 -170436 -150820 -259066 172973
18856g6407A07504f6810J6486A12244b57203h324B26626c44000a58159A7791c2284
$$ -76407 107504 -66810 -50324 112244 -257203 -8324 226626 -344000 -158159 17791 -32284
18844B72383A0355R3961a46504E1240b86429a14000m2735E7880d00086f1779p0616
$$ 272383 10355 104316 -146504 51240 -286429 -114000 -156735 57880 -400086 -61779 -132395
18833a32395A76016j0235c6616B04697n2557g4508B07377C1792K28904D5222c26807
$$ -132395 176016 165781 -36616 204697 152140 -74508 207377 31792 260696 45222 -326807
18821F3177N3410e5082B71503M7297f5414P202C12144a35893k26038Q7009h4083
$$ 63177 116587 -55082 271503 318800 -65414 -58212 312144 -135893 -361931 -274922 -84083
18809a29167K5828k18788F9266Q1006b12327I2194f8399F8265a01347c807A3576
$$ -129167 -103339 -322127 69266 150272 -212327 92194 -68399 68265 -101347 -3807 13576
18797a30387o6955B20528A05873h8636A83277c50971A24690b40065A14513d73109
$$ -130387 -197342 220528 105873 -88636 183277 -350971 124690 -240065 114513 -473109
18786A15583a04085j102A44821a59718l36881A71986a96985k5858d894j00290
$$ 115583 -104085 -105187 144821 -159718 -496599 171986 -196985 -222843 -4894 -105184
18776a05184d7191r4821j4894J0362A09713L0641a3027k9627D9074f3980A08946
$$ -105184 -47191 -142012 -156906 -146544 109713 140354 -13027 -42654 49074 -63980 108946
18764h7981j4819o583j14757c9719B21455d0575j21476H6682J12060b22828O3424
$$ -87981 -102800 -109383 -224140 -39719 221455 -40575 -162051 86682 198742 -222828 -159404
18753a59404A55245F7753c24834A77893a71561G0359a74848H0766J9913D507b17291
$$ -159404 155245 67753 -324834 177893 -171561 70359 -174848 80766 100679 4507 -217291
18741A01156e2080j99115Q0959m8342J00565E5552a53091A43566a88775i0381
$$ 101156 -52080 -251195 -170236 -218578 -118013 55552 -153091 143566 -188775 -90381
18730b04802a6969q3976A43365a51517N6476j60566A21131H461a52680l4487B7867
$$ -204802 -16969 -100945 143365 -151517 -95041 -255607 121131 8461 -152680 -187167 27867
18718b43511J09879M0285A5413a89747A86914i8892B46191n0288l0615N821K9482
$$ -243511 -133632 -93347 15413 -189747 186914 -98892 246191 195903 165288 171109 200591
18707B00591e528p9321m18216I7265k9389J85905A6084b68838d7375l7727o4760
$$ 200591 -5528 -84849 -503065 97265 67876 253781 16084 -268838 -47375 -85102 -149862
18696a49862N9201m2532j23754A21311b80799B5634b547B0923J09279C1637b40803
$$ -149862 -90661 -133193 -256947 121311 -280799 25634 -2547 20923 130202 31637 -240803
18684a57719B35436a23326C52807g8684p446A19114c19722G0493d0851l45129
$$ -157719 235436 -123326 352807 -78684 -86130 119114 -319722 70493 -40851 -385980
18674c85980A12266B0617a62719J4254j07060C22621n7569g5462k01643g7116
$$ -385980 112266 20617 -162719 -148465 -255525 322621 265052 -75462 -277105 -77116
18663b01584c9090B1050b86221M0150F1189d6071a5783k57551A4962a49269k32932
$$ -201584 -39090 21050 -286221 -246071 61189 -46071 -15783 -273334 14962 -149269 -382201
18652c82201G6480d81888B861a62595j4596C6977b011C52611b45839a14372c0770
$$ -382201 76480 -481888 2861 -162595 -177191 36977 -2011 352611 -245839 -114372 -30770
18640a05457A17215a87782L9421H5088g6467a9545A13719L0720i1857c202B22060
$$ -105457 117215 -187782 -148361 85088 -76467 -19545 113719 144439 -91857 -3202 222060
18628b06018G2934c14659B73158b93338J26901g5577L2244J7661k50152D8260
$$ -206018 72934 -314659 273158 -293338 -166437 -75577 -43333 -25672 -275824 48260
18617C25528d1070B7826a01596j56863a10312j74031g1429A04288b06836b0674
$$ 325528 -41070 27826 -101596 -258459 -110312 -284343 -71429 104288 -206836 -20674
18606F5562f2615k72749a4806j37960l2042D6884g0450A76095a90545B7707g6504
$$ 65562 -62615 -335364 -14806 -152766 -184808 46884 -70450 176095 -190545 27707 -76504
18594a47298o1331A71941a58568B22080B8631O9388a28597k4487l9613P5786k655
$$ -147298 -208629 171941 -158568 222080 28631 98019 -128597 -153084 -192697 -116911 -119566
18583a19566g732l29175R6089D695R8730k6174b46116j27381C39261A7338c25031
$$ -119566 -7732 -336907 -240818 4695 103425 77251 -246116 -373497 339261 17338 -325031
18571c8753k98004O1453R481o6291J09268F3686M4382e5968B24572b67082A87325
$$ -38753 -336757 -275304 -265823 -332114 -222846 63686 108068 -55968 224572 -267082 187325
18559C34720A55841c59844a7838j3145r6589h915A2147N6632j6089h2473L865
$$ 334720 155841 -359844 -17838 -30983 -127572 -8915 12147 68779 52690 -82473 -78608
18548g8608c615r7713a4017j72931m8129C65029B6813j0132J91170F782b6791
$$ -78608 -3615 -101328 -14017 -186948 -235077 365029 26813 16681 207851 6782 -26791
18536a31060F2803a57240F5048A7344L35858B2749a26741j30927C3551M6742b03032
$$ -131060 62803 -157240 65048 17344 353202 22749 -126741 -257668 33551 80293 -203032
18524c11656J22804B07565b27906J3084A50837P7774k3424H7737K13437b78948
$$ -311656 -188852 207565 -227906 -214822 150837 228611 205187 87737 301174 -278948
18513f8327C9715E063f6065C08523c73682R7804a29590B2208a30827j43419A74258
$$ -68327 39715 5063 -66065 308523 -373682 -275878 -129590 22208 -130827 -274246 174258
18501e9802B76055f73l06510B09679c62551a4710l45140P2619e7260j46304A34022
$$ -59802 276055 -673 -307183 209679 -362551 -14710 -359850 -287231 -57260 -203564 134022
18489a73334k80111b05224h4197a2646n7580A66570a25798j92977H3618k556e3469
$$ -173334 -453445 -205224 -84197 -12646 -70226 166570 -125798 -318775 83618 81062 -53469
18477b40549D6836a37472K516j26203d6936B21589o7701J7011a57815n2654J3188
$$ -240549 46836 -137472 -134956 -261159 -46936 221589 153888 170899 -157815 -210469 -197281
18466a97281B50233G1916M6322b14232E2503R1785m9450A0477N9133O870K1280
$$ -197281 250233 71916 118238 -214232 52503 144288 94838 10477 69610 76480 97760
18455I7760a60883j31323f6571B22019a0692D7364R5220b6017l0566J7335l8812
$$ 97760 -160883 -292206 -66571 222019 -10692 47364 142584 -26017 -56583 -39248 -78060
18444g8060r6773B28807f7838l9659o2347A3152G27d6224E9864b59639R0171A32871
$$ -78060 -174833 228807 -67838 -107497 -169844 13152 727 -46224 59864 -259639 -169468 132871
18431g7626b8251j23058N8009j01727G3223a56841f8882k08166E3717b26043A31658
$$ -77626 -28251 -151309 -93300 -195027 73223 -156841 -68882 -277048 53717 -226043 131658
18419c07967I772K37581j09117L6619a99664R4980A03657c95902a74427l1628
$$ -307967 9772 247353 138236 174855 -199664 -104684 103657 -395902 -174427 -206055
18409b06055J6458j8739A9754b8088B47081a2641q357G1419C4232c22250J32256
$$ -206055 -189597 -208336 19754 -28088 247081 -12641 -20998 71419 34232 -322250 -189994
18398a89994k9937E1340d88655K27151B3108R4444j9534R2087h9927B50906K14521
$$ -189994 -219931 51340 -488655 -261504 23108 117552 98018 190105 -89927 250906 465427
18387D65427h2689A21452L053J1651J617a58251B59518b49780l1191B84304b19118
$$ 465427 -82689 121452 124505 136156 137773 -158251 259518 -249780 -280971 284304 -219118
18375a66169B32667e2536B0130J26023a32009l8712A99431b58003j45108B44031
$$ -166169 232667 -52536 20130 146153 -132009 -170721 199431 -258003 -403111 244031
18364b77089c0293C8464a34085q1646e653A8589J88542A3941J3073J64534b06952
$$ -277089 -30293 38464 -134085 -215731 -5653 18589 207131 13941 27014 191548 -206952
18352f7726B36676A16220L51003G0534B4986J78477P2886a16253j8320A5671E250
$$ -67726 236676 116220 467223 70534 24986 203463 276349 -116253 -134573 15671 5250
18340B72114g8297l656A19742A6399c09507j75198c0657B03073b5497l5130b371
$$ 272114 -78297 -81953 119742 16399 -309507 -484705 -30657 203073 -25497 -60627 -2371
18328C60966A28853J88791f8561o899B39826j5677d05330a08004M7951j62579
$$ 360966 128853 317644 -68561 -75460 239826 224149 -405330 -108004 -60053 -222632
18318b22632H4687K04636G5347J36639n4549p0276b37723j1482G2262J60533C9281
$$ -222632 84687 289323 75347 211986 157437 87161 -237723 -249205 72262 232795 39281
18306h9437l32A2150J18756c5129j83704B08986n0467b26447f3723k4505K9946
$$ -89437 -89769 12150 130906 -35129 -218833 208986 158519 -226447 -63723 -88228 -58282
18295e8282C659J20056b29315A75524e7365k24535n4674d1203l5589D2171c0510
$$ -58282 3659 123715 -229315 175524 -57365 -281900 -336574 -41203 -76792 42171 -30510
18283b16558F9560b05122A29708c36639J17805d2904j65028B50840h8698j52862
$$ -216558 69560 -205122 129708 -336639 -218834 -42904 -207932 250840 -88698 -241560
18273b41560i9792B48313B4872g9197A80906a62476j56102O4345d678o5127j63789
$$ -241560 -99792 248313 24872 -79197 180906 -162476 -318578 -254233 -4678 -69805 -233594
18262b33594B21733b17189F6797L3079a5469j13038B9967a4129A38783H989f3368
$$ -233594 221733 -217189 66797 99876 -15469 -128507 29967 -14129 138783 8989 -63368
18250e9160A04957e6197l6863l17025i6367G534j947P1587c6219E6477J14166
$$ -59160 104957 -56197 -93060 -410085 -96367 7534 5587 77174 -36219 56477 170643
18239A70643k7866a09701p2697A09122O4550a17774H2688i5086j0982d2105m056
$$ 170643 142777 -109701 -182398 109122 173672 -117774 82688 -95086 -106068 -42105 -46161
18228d6161j85335d0946k7166A15773a58008O113M5659o6356A56274e807k62259
$$ -46161 -231496 -40946 -68112 115773 -158008 -151895 -106236 -172592 156274 -5807 -268066
18217b68066H668J21036J7318A6499d0401l5657l4241j42526Q9700A07050a22969
$$ -268066 8668 129704 147022 16499 -40401 -76058 -110299 -252825 -163125 107050 -122969
18205c09709a3352M033j41584c9543j36648B54089a06377I5562m0493a54123A72987
$$ -309709 -13352 -9319 -150903 -39543 -176191 254089 -106377 95562 55069 -154123 172987
18193a83087O3827A15484a09919A88280F8650L8703b95829C7181P5484a85624
$$ -183087 -119260 115484 -109919 188280 68650 107353 -295829 37181 112665 -185624
18182A15807a42869j09888f7866A00303C0426K2977h3257A50778E3161e0200k85376
$$ 115807 -142869 -252757 -67866 100303 30426 53403 -83257 150778 53161 -50200 -335576
18171c35576B02663d11621H6012b1965j18646F5990M0284a49429G046J3466R0328
$$ -335576 202663 -411621 86012 -21965 -140611 65990 106274 -149429 7046 20512 110840
18160A10840b16899i1462B83817a68442a8891m3502k10163N0583J02716j11383
$$ 110840 -216899 -91462 283817 -168442 -18891 -62393 -272556 -221973 -119257 -230640
18150b30640p7540A02794c24669a58803c9680C25354e7781J8214A56396A8338
$$ -230640 -308180 102794 -324669 -158803 -39680 325354 -57781 -39567 156396 18338
18139b29846H4142b05429B1041J44023i8729A9669R200d39332I8475b33890B49303
$$ -229846 84142 -205429 21041 165064 -98729 19669 28869 -439332 98475 -233890 249303
18127B3907K72761A21171d5821j24090D4883L800J47754c3367k6050H9397c3589
$$ 23907 296668 121171 -45821 -169911 44883 48683 196437 -33367 -59417 89397 -33589
18115a74921F8246a16433B06779b17314B10200b54749P6681O9413j88118C0269
$$ -174921 68246 -116433 206779 -217314 210200 -254749 -178068 -108655 -296773 30269
18104A93554b28039g364j19229K3906q8661e3783j88320m7893a29484n9608e5370
$$ 193554 -228039 -7364 -126593 -102687 -191348 -53783 -242103 -289996 -129484 -189092 -55370
18092B31173b3105A21283a2252o1870F64J98213a41138A46181d6798l5681F9928
$$ 231173 -23105 121283 -12252 -74122 664 198877 -141138 146181 -46798 -82479 69928
18080a54187e1876k77062a25156H1066K12334h6977A860J22351b19396d4471A4765
$$ -154187 -51876 -328938 -125156 81066 293400 -86977 1860 124211 -219396 -44471 14765
18068f3782k74177A75821K21724i4338A22931J62057j01842I146b27000a04662
$$ -63782 -337959 175821 397545 -94338 122931 284988 183146 9146 -227000 -104662
18057g8544F8474d9504m908G685P4080c4552B5540M9004a97430c184A16715a22700
$$ -78544 68474 -49504 -54412 7685 81765 -34552 25540 74544 -197430 -3184 116715 -122700
18044b07700B3209i1698C1405J52890c040G1594a10301A10103D1922J08122a87390
$$ -207700 23209 -91698 31405 184295 -3040 71594 -110301 110103 41922 150044 -187390
18032h5580A0538C728c14149A66593L8516I6909e120j21123B66898I1721b43025
$$ -85580 10538 3728 -314149 166593 205109 96909 -5120 -126243 266898 91721 -243025
18020B22944a51467N9640A69619h4474r7561A51396E6063b2942l347B71866r7240
$$ 222944 -151467 -91827 169619 -84474 -182035 151396 56063 -22942 -26289 271866 174626
18009A74626p8650d28295B8741R015N9606A0987P6750J16861O5221j04113n1321
$$ 174626 95976 -428295 28741 37756 97362 10987 87737 204598 269819 165706 114385
17998A14385a9189A00220C8164a59287f2376H5437r643l0142R8117K19075A5843
$$ 114385 -19189 100220 38164 -159287 -62376 85437 75794 45652 143769 362844 15843
17986A03765k0625P6845a30264j2621n7784b5780D1551h9650n0181B34499a37920
$$ 103765 83140 159985 -130264 -142885 -200669 -25780 41551 -89650 -139831 234499 -137920
17974b81819a00903j43919N2679E9635b94774F6098K9154C5140r856O4228d4078
$$ -281819 -100903 -244822 -192143 59635 -294774 66098 95252 35140 25284 89512 -44078
17962A22419g6429A53100b82493B36512C9879R5833P7921a65702C03440l0746
$$ 122419 -76429 153100 -282493 236512 39879 135712 213633 -165702 303440 272694
17952B72694a44605c8921B84970b3262k5702J168G2796b3696j76445j37605A23120
$$ 272694 -144605 -38921 284970 -23262 -48964 -47796 72796 -23696 -200141 -337746 123120
17940A39142A8003a41703C22945d7678k87655B13192F4808J7108d0986A52912
$$ 139142 18003 -141703 322945 -47678 -335333 213192 64808 81916 -40986 152912
17929B21261l3132a05465h02A43567a93256A85012M7748g5791e584C19271a97305
$$ 221261 188129 -105465 -802 143567 -193256 185012 232760 -75791 -5584 319271 -197305
17917f5790A0843L07192a38507G3821i8271C64768a27993L0505A61572k3022k0793
$$ -65790 10843 318035 -138507 73821 -98271 364768 -127993 -97488 161572 138550 117757
17906A17757P3676i2817H0416O0963J78907b39258A76518H8018J02602F5528a30262
$$ 117757 191433 -92817 80416 141379 320286 -239258 176518 88018 190620 65528 -130262
17894B41003C9298J48487k4619A1991P9475J3903C9382n290a45950f6793i931
$$ 241003 39298 187785 163166 11991 91466 105369 39382 34092 -145950 -66793 -9931
17882a14945H910a91942A85184h4537I40J31958J29623h602I6220H238K00947
$$ -114945 8910 -191942 185184 -84537 940 132898 262521 -8602 96220 8238 209185
17871B09185i5139C70738a03488j51201B06318h2533l4343e4009j72087A0879
$$ 209185 -95139 370738 -103488 -254689 206318 -82533 -116876 -54009 -226096 10879
17860G7652L4623c25209B64878p1997a67977H0770M668h9310j21100g0987h239
$$ 77652 112275 -325209 264878 192881 -167977 80770 85438 -89310 -210410 -70987 -8239
17848g776j01569D12218b0605B82680j21460g2261f847G8912E89K4221K92125
$$ -7776 -109345 412218 -20605 282680 161220 -72261 -6847 78912 589 24810 316935
17837C16935D1435a18148C87625d4130I7378m4702K75629A15044n6514J6821J44298
$$ 316935 41435 -118148 387625 -44130 97378 52676 328305 115044 58530 75351 219649
17826B19649j5618g7742J4829A12133c7558r0269B65136a5194k5191A33844p281
$$ 219649 204031 -77742 -62913 112133 -37558 -127827 265136 -15194 -40385 133844 126563
17815A26563b13235B05915a54494c955C6347J965d1900G5804J74660G799b1115
$$ 126563 -213235 205915 -154494 -3955 36347 38312 -41900 75804 250464 7799 -21115
17803d1432A8480M41077C4184M6634a24597e2080H7312h7494D6445a54928d1606
$$ -41432 18480 459557 34184 80818 -124597 -52080 87312 -87494 46445 -154928 -41606
17791a55408G9148J6582C1672K09637A02957P6844h9948B21956a25480b9976A71028
$$ -155408 79148 95730 31672 241309 102957 179801 -89948 221956 -125480 -29976 171028
17779B76021I5687f1902B58615r9012b9061F2212c2864E9211K35151b97614A10973
$$ 276021 95687 -61902 258615 159603 -29061 62212 -32864 59211 294362 -297614 110973
17767B45629i4813H7600c23181E7218c1414B6331a78050E9392K1612e233j13125
$$ 245629 -94813 87600 -323181 57218 -31414 26331 -178050 59392 81004 -5233 -118358
17756a18358B39597g5086l6164c237n3919k340j5147c1304H8608K79625B6236
$$ -118358 239597 -75086 -111250 -3237 -57156 -59496 -74643 -31304 88608 368233 26236
17744A31547M0783a59023A98775n3591b6879A40972A7329F59L87801A38242a94029
$$ 131547 172330 -159023 198775 145184 -26879 140972 17329 659 388460 138242 -194029
17732A4598J65960G9676M0619L1933k9028J59853C1607J44025J6691a28008K7061
$$ 14598 180558 79676 120295 152228 123200 283053 31607 175632 192323 -128008 -100947
17721a00947C02953o4302b4790A80940C1450M70488f7574k97n6557B46758C0652
$$ -100947 302953 238651 -24790 180940 31450 501938 -67574 -67871 -124428 246758 30652
17709i9188m8299d2116j02112E2406j4777M2003a86839j5555C37190E8733J64275
$$ -99188 -147487 -42116 -144228 52406 37629 79632 -186839 -202394 337190 58733 223008
17698B23008a13570A66052N4239I0673a70892B53452j14529B0393J46218i8917
$$ 223008 -113570 166052 220291 90673 -170892 253452 138923 20393 166611 -98917
17687B1510J88807i8356G2334n753M7927k867b89494B650f5980q5714A17088a9890
$$ 21510 210317 -98356 72334 66581 114508 111641 -289494 2650 -65980 -151694 117088 -19890
17674F7717J61139H8500A373K26481B5162K22041h6393c3995C86573b00550C84530
$$ 67717 228856 88500 1373 227854 25162 247203 -86393 -33995 386573 -200550 384530
17662A89589l5991Q6709I5694R1340a18117C2713g3426a932D2888b4112C46843
$$ 189589 153598 240307 95694 187034 -118117 32713 -73426 -1932 42888 -24112 346843
17650I404a77082j0772D9782K21237k4876b4259k00769B98644A8453d997A79151
$$ 9404 -177082 -187854 49782 271019 246143 -24259 -225028 298644 18453 -4997 179151
17638g4370E4839b86991B38384b1969C82943A37052K36494A27399b20009g4905
$$ -74370 54839 -286991 238384 -21969 382943 137052 373546 127399 -220009 -74905
17627c621E89142F126c2118p8833D0340b538C34161b2552D724a55518G3890O6083
$$ -3621 589142 6126 -32118 -110951 40340 -2538 334161 -22552 4724 -155518 73890 139973
17615A39973O8300a62906I4185f0489E6536K43613k2922i9999B91010a45335i467
$$ 139973 208273 -162906 94185 -60489 56536 300149 277227 -99999 291010 -145335 -9467
17603B6349K87638F849M44065b85354A17717A7385n143e824B27714l8149L9172
$$ 26349 313987 6849 450914 -285354 117717 17385 12242 -5824 227714 189565 228737
17592B28737b21643A85330b1914A26567K6360a66637H8817K09464A07082L80887
$$ 228737 -221643 185330 -21914 126567 152927 -166637 88817 298281 107082 487969
17582D87969b57523A15246J6039g5420B07098m3393a8352B37885a14540A22855
$$ 487969 -257523 115246 131285 -75420 207098 163705 -18352 237885 -114540 122855
17571D05976j93594j06166h6105D40441c4740A11147c22811B13819C6866a00878
$$ 405976 212382 106216 -86105 440441 -34740 111147 -322811 213819 36866 -100878
17560i4564B15937m4090o9446j7214J57442j04380L5723A7336e2574B72444J62962
$$ -94564 215937 171847 102401 85187 242629 138249 173972 17336 -52574 272444 435406
17549D35406a62139A84452J09262C9633M67560j91147j51902J70522J76356g9959
$$ 435406 -162139 184452 293714 39633 507193 316046 164144 334666 511022 -79959
17538A34290b8824B87136q7099J48285o8479m5409K88803D9169K84001l4298M0242
$$ 134290 -28824 287136 200037 348322 279843 234434 523237 49169 333170 298872 339114
17527C39114A02553L76828E3059f8110A06199n0736L90195j70624A03670j3084
$$ 339114 102553 479381 53059 -68110 106199 55463 445658 275034 103670 90586
17517I0586N6743a9338C48378R5600n6758M50844l65292K29755k8955K11634k94860
$$ 90586 147329 -19338 348378 443978 387220 838064 472772 702527 673572 885206 590346
17506E90346M3781j7984A42548L10794k12785J72475J81078j2280B60122J96738
$$ 590346 634127 616143 142548 453342 240557 413032 594110 581830 260122 456860
17496D56860K57610K21354m04489M27444j08242k09866j33167K76737A94065N84248
$$ 456860 714470 935824 531335 958779 850537 640671 507504 784241 194065 778313
17486G78313l16672j45651j29435J91056m3939p0484L9034o8697J75526e3945
$$ 778313 461641 315990 186555 377611 333672 263188 302222 233525 409051 -53945
17475D04978J6280G9514L62325q838J45415c3716E08408A66867Q923P0985o0535
$$ 404978 421258 79514 441839 433001 578416 -33716 508408 166867 175790 246775 186240
17464A86240N44710C29548q1496K4127p7915K80320O8077i6275E57949k35053
$$ 186240 730950 329548 248052 272179 194264 474584 542661 -96275 557949 322896
17454C22896r416R2890A83814J04844R7470j07927A38418J88769j44370J5961
$$ 322896 313480 406370 183814 288658 386128 278201 138418 327187 182817 198778
17444A98778b01362C06878J66708A92677o9724B7118K95501J24423k11118R406
$$ 198778 -201362 306878 473586 192677 122953 27118 322619 447042 235924 245330
17434B45330J23870j65102L7808O3344A06798L41916b9638C82106j81272Q1045
$$ 245330 369200 204098 241906 305250 106798 448714 -29638 382106 200834 281879
17424B81879A2838J10826Q5210L7240J13093N6445j1299j44119F4859L01604B0208
$$ 281879 12838 123664 208874 246114 359207 415652 404353 260234 64859 366463 20208
17412D30161j37910O7785m7809K90597k27859K52126A00885K47677J55726k04176
$$ 430161 292251 360036 312227 602824 374965 627091 100885 348562 504288 300112
17402C00112j5632K43649j82772j12502o2660J27044J78785o3114A34583R7118
$$ 300112 284480 528129 345357 232855 170195 297239 476024 412910 134583 231701
17392B31701M6579m9120N9017A26146m5772Q7885F7189K58835m9190f3051l3696
$$ 231701 278280 229160 288177 126146 80374 168259 67189 326024 276834 -63051 -96747
17381i6747A48300J75235J04421A82145P6985r821J29597K33326A83333p1266
$$ -96747 148300 323535 427956 182145 259130 249309 378906 612232 183333 112067
17371A12067c2267C55651F5718J70583L23026n4961a50392B2274L58916A76337
$$ 112067 -32267 355651 65718 236301 559327 504366 -150392 22274 381190 176337
17360D13534k04104J72677A36346o6960O2063c63872B07480r732K6286K10046
$$ 413534 209430 382107 136346 69386 131449 -363872 207480 197748 224034 434080
17350D34080j93084K30539j97252K2284l9528e0778B37921j0710J50685p5836
$$ 434080 240996 471535 274283 296567 257039 -50778 237921 227211 377896 302060
17340C02060N1720j05041j9313M5435j6913M15756A02955J57958p6585J27180
$$ 302060 353780 248739 229426 274861 257948 673704 102955 260913 184328 311508
17330C11508e5551E04663j26173p1279k1758r096J54356j48431J87771B19097
$$ 311508 -55551 504663 378490 307211 285453 276357 430713 282282 470053 219097
17319A03250L26689G6251L95057E0573E750K99042L89583A6639L2626Q5573K93437
$$ 103250 429939 76251 471308 50573 5750 304792 694375 16639 49265 134838 428275
17308D28275A59164J36517M1364A32545k6159P9334g8124D63198r7746J02868
$$ 428275 159164 295681 337045 132545 106386 185720 -78124 463198 365452 468320
17298D68320p4494O167A527J85117J84565n1889L65967k17305F4335K33750J7784
$$ 468320 393826 399993 1527 186644 371209 319320 685287 467982 64335 298085 315869
17287C15869L99575A96723K31831P3363A68489L49039H9740J04958J15370m8916
$$ 315869 715444 196723 428554 501917 168489 517528 89740 194698 310068 261152
17277B61152K3645P9066r7869J83206B0561a55824C72802A53266K57879p067M10879
$$ 261152 284797 363863 265994 449200 20561 -155824 372802 153266 411145 404078 814957
17266H14957A8125M09664m2774J55782B57426C4807L02492H8357L31517l2104
$$ 814957 18125 427789 385015 540797 257426 34807 337299 88357 419874 387770
17256C87770m2637A24075J03307K7075J49085j75030K53089B16150a5217A81704
$$ 387770 345133 124075 227382 254457 403542 228512 481601 216150 -15217 181704
17245b8727E60635A76618K17241r2762D7202K12240l0994n8856J3957K26547J54488
$$ -28727 560635 176618 393859 301097 47202 259442 228448 169592 183549 410096 564584
17234E64584A04939J32026O7365j2274K92702k35455r185J84334B61196L16757
$$ 564584 104939 236965 304330 292056 584758 349303 340118 524452 261196 577953
17224E77953j20352k25653J5140l6685q1353J91007q1850J44628K04366B31486
$$ 577953 457601 231948 247088 210403 129050 320057 238207 382835 587201 231486
17213I6507N4564K79805d0763E33941k03754K11958q2528j46104J01546P611j5791
$$ 96507 151071 430876 -40763 533941 330187 542145 459617 313513 415059 422670 406879
17202D06879K64935j00803k6703j74026A10841M36527R2253A66643K70860N0697
$$ 406879 671814 571011 544308 370282 110841 547368 639621 166643 437503 488200
17192D88200B3062M14451L8904j40578R539j8822j3517J5328K69375j90529J39802
$$ 488200 23062 437513 476417 335839 345378 326556 313039 328367 597742 407213 547015
17181E47015K2624J4736k56702J57034o4221j65416L21837j24195P5732k57920
$$ 547015 569639 584375 327673 484707 420486 255070 576907 452712 528444 270524
17171B70524P6535A50098K95457B3736N31724B76230L5498A55226M3795J98458
$$ 270524 347059 150098 445555 23736 555460 276230 311728 155226 199021 397479
17161C97479P2052j53822J05413j13409N8079L71829k79780J61186k81714J58680
$$ 397479 469531 315709 421122 307713 365792 737621 457841 619027 337313 495993
17151D95993L4490r9666Q545L8758P9887A59638P75011C52170M6552J60269j26016
$$ 495993 530483 430817 439362 478120 558007 159638 934649 352170 398722 558991 432975
17140D32975J28650l7288J31638A97025m9171M27875q8113n2472M99845I1347
$$ 432975 561625 524337 655975 197025 147854 575729 487616 435144 934989 91347
17129B81052L77875k03983k8911o378L17661C58907K56779B79416p9023M55388
$$ 281052 658927 454944 426033 419655 737316 358907 615686 279416 200393 655781
17119F55781k05590j99099M31095j31929P3211k87907L01759l15966L83558n0435
$$ 655781 450191 251092 682187 550258 623469 335562 637321 321355 704913 654478
17109F54478k2532j60216J6403k9382J09230l8295J80058l522l30692O6202J58246
$$ 654478 631946 471730 488133 458751 567981 529686 709744 706222 375530 441732 599978
17098E99978j66255q3664M02146j62350n8010L5800j33122K78111k31500K36939
$$ 599978 433723 350059 752205 589855 531845 567645 434523 712634 481134 718073
17088G18073K34956c0592F88506o0633N4409k91126J56327M73687D90150M58106
$$ 718073 953029 -30592 688506 627873 682282 391156 547483 1021170 490150 948256
17078I48256D36890m9202N83288j76734C04313O55779D45211L3385K71697K79764
$$ 948256 436890 387688 970976 794242 304313 960092 445211 478596 750293 1030057
17068A030057D20930L22137l1138k9261K80500n2077j37986J52987m55860L66620
$$ 1030057 420930 743067 711929 682668 963168 911091 773105 926092 470232 836852
17058H36852j03566P1986R5045q603C12249M03718O1390B64055L75824J09671
$$ 836852 733286 805272 900317 891714 312249 715967 777357 264055 639879 749550
17048G49550J66420P4253k71709k2222q6253L09216j81876j76339L33741r0881
$$ 749550 915970 990223 718514 696292 610039 919255 737379 561040 894781 803900
17038H03900k13485K19472j46381J50521n4178k0626k71244P206K26991J19124
$$ 803900 590415 809887 663506 814027 759849 739223 467979 475185 702176 821300
17028H21300J65460k33800K11898j5584K13715j78436j0106j4263k45924P5925
$$ 821300 986760 752960 964858 949274 1162989 984553 974447 960184 714260 790185
17018G90185n1885K02414k45053J31305J05986j33668j997K28702q3710k35080
$$ 790185 738300 940714 695661 826966 932952 799284 797287 1025989 942279 707199
17008G07199L61394j66983J97770Q349m92940M09404j58402J57861l26003M55753
$$ 707199 1068593 901610 1099380 1107729 614789 1024193 865791 1023652 697649 1153402
16998A153402k79204K52032j25859J32948j82602j03495M23878q7160r2093J37654
$$ 1153402 874198 1126230 1000371 1133319 950717 847222 1271100 1183940 1091847 1229501
16988A229501J10297j85088p9302Q2724J01068m4880r4939K0475K39619l24975
$$ 1229501 1339798 1154710 1075408 1158132 1259200 1214320 1119381 1139856 1379475 1054500
16978A054500J40937L9986k55325K1909K3413N59056l14916j1067k46978M37377
$$ 1054500 1195437 1235423 980098 1002007 1025420 1584476 1269560 1258493 1011515 1448892
16968A448892l60724j25713L79649L46385k04010k05941O2577J14045l81623L42071
$$ 1448892 1088168 962455 1342104 1688489 1484479 1278538 1341115 1455160 1073537 1415608
16958A415608k27747J08999J82528O8768j31591J66032k94975L40706n8959j52892
$$ 1415608 1187861 1296860 1479388 1548156 1416565 1582597 1287622 1628328 1569369 1416477
16948A416477J52843J99441N5331j69227j98181J86847j29844L88707j46946Q134
$$ 1416477 1569320 1768761 1824092 1654865 1456684 1643531 1513687 1902394 1755448 1763582
16938A763582j01121l18704L94505j16596J28311J01075K05963k90271J47136
$$ 1763582 1662461 1343757 1738262 1621666 1749977 1851052 2057015 1766744 1913880
16929A913880p3037J26397l30098O6431K57792j29462p3625n223J47454N9944
$$ 1913880 1840843 1967240 1637142 1703573 1961365 1831903 1758278 1753055 1900509 1960453
16919A960453L3289J21744j21299k81833L93909m6165k4932P9430o1254K39828
$$ 1960453 1993742 2115486 1994187 1712354 2106263 2060098 2035166 2114596 2053342 2293170
16909B293170n3830k10627J07273J0795K615K07500l83756L81668j46135J97738
$$ 2293170 2239340 2028713 2135986 2146781 2149396 2356896 1973140 2354808 2208673 2406411
16899B406411r0073k13741K85389K4143n6366K21184j65486J04819P0793l8223
$$ 2406411 2316338 2102597 2387986 2412129 2355763 2576947 2411461 2516280 2587073 2548850
16889B548850K19114k90613J71317J53549j45812J02397l22383J72571k49985
$$ 2548850 2767964 2477351 2648668 2802217 2656405 2758802 2436419 2608990 2359005
16880B359005K39553J89371k67156K94176j30518M21782m62698O17559j98359
$$ 2359005 2598558 2787929 2520773 2814949 2684431 3106213 2643515 3261074 3062715
16871C062715k4061K34408K1392L3077J88250j12432k9565L53805k53438M15062
$$ 3062715 3038654 3273062 3294454 3327531 3515781 3403349 3373784 3727589 3474151 3889213
16861C889213l124m25125O7369j02480L90314k05559J58101K94700k13151K38340
$$ 3889213 3886089 3460964 3528333 3425853 3816167 3610608 3768709 4063409 3850258 4088598
16851D088598q9124k6660N00095l08034n8803M32016j3079n5221K12887j54087
$$ 4088598 3999474 3972814 4472909 4164875 4106072 4538088 4525009 4469788 4682675 4528588
16841D528588R6296J38104k73770L97180L19001k54590J54140J25415R3506j72597
$$ 4528588 4624884 4762988 4489218 4886398 5205399 4950809 5104949 5230364 5323870 5151273
16831E151273J6721K59315K90649m929j60956J22194J78416J20271M8513J11634
$$ 5151273 5167994 5427309 5717958 5713029 5552073 5674267 5852683 5972954 6021467 6133101
16821F133101J61487J00318J32291L49954j1167j65239K35239J48627J16091M01974
$$ 6133101 6294588 6394906 6527197 6877151 6865984 6700745 6935984 7084611 7200702 7602676
16811G602676L567k1064K44443M45714l55572j380O21723j53462k1531L60509
$$ 7602676 7606243 7585179 7829622 8275336 7919764 7918384 8540107 8386645 8365114 8725623
16801H725623L08479J84232L94676j42479K67325L64725k4835N29141k02783O59735
$$ 8725623 9034102 9218334 9613010 9470531 9737856 10102581 10077746 10606887 10404104 11063839
16791A1063839k78311M06770M57830L70532o5816Q15419K83873K09094L6429M30059
$$ 11063839 10785528 11192298 11650128 12020660 11954844 12770263 13054136 13263230 13299659 13729718
16781A3729718N67596O50311j14466L05253J76911Q63113N36161K84986K34761
$$ 13729718 14297314 14947625 14833159 15138412 15315323 16178436 16714597 16999583 17234344
16772A7234344K16448N45525O05992P06054N80445K06715J026884N89729P20419
$$ 17234344 17450792 17996317 18602309 19308363 19888808 20095523 21122407 21712136 22432555
16763B2432555M78579P41374N29355Q39797J049740M34312J137161Q81104P61503
$$ 22432555 22911134 23652508 24181863 25021660 26071400 26505712 27642873 28523977 29285480
16754B9285480J191748Q88604J116617J208555J183156J355778J383447R91868
$$ 29285480 30477228 31365832 32482449 33691004 34874160 36229938 37613385 38605253
16746C8605253J390254J369046J961796J802376J746685J653414J609917K260709
$$ 38605253 39995507 41364553 43326349 45128725 46875410 48528824 50138741 52399450
16738E2399450J894927K856129J511549K563340K261648K691476K383833L219443
$$ 52399450 54294377 57150506 58662055 61225395 63487043 66178519 68562352 71781795
16730G1781795K943900K621366L105094K994498L274156L300250L447363L475311
$$ 71781795 74725695 77347061 80452155 83446653 86720809 90021059 93468422 96943733
16722I6943733L642673L322453L173154L562482L319340K871986L040972K859175
$$ 96943733 100586406 103908859 107082013 110644495 113963835 116835821 119876793 122735968
16714A22735968L160883J798768K221538J525539J614380J161385M52728N25989
$$ 122735968 125896851 127695619 129917157 131442696 133057076 134218461 134671189 135197178
16706A35197178J0752p46195r06159j218924j442006k356222k077348k575628
$$ 135197178 135207930 134461735 133555576 132336652 130894646 128538424 126461076 123885448
16698A23885448k691355k940448l300628l192279l838233l151395l395797l502412
$$ 123885448 121194093 118253645 114953017 111760738 107922505 104771110 101375313 97872901
16690I7872901l531461l384286l428921l049752l414962l008302l109650l026947
$$ 97872901 94341440 90957154 87528233 84478481 81063519 78055217 74945567 71918620
16682G1918620k631878k907300k577214k463983k581509k270740k427348j945513
$$ 71918620 69286742 66379442 63802228 61338245 58756736 56485996 54058648 52113135
16674E2113135j984551j911882k063541j785847j512643j203341k134354j005226
$$ 52113135 50128584 48216702 46153161 44367314 42854671 41651330 39516976 38511750
16666C8511750j399870j221720j403137j131506r37729j419462q64713j265068
$$ 38511750 37111880 35890160 34487023 33355517 32417788 30998326 30133613 28868545
16658B8868545r88635q57747r75410o50148q13423q13658p77710m63206p03335
$$ 28868545 27879910 27022163 26046753 25396605 24583182 23769524 22991814 22528608 21825273
16649B1825273p64501o33825q14692k50859r07993j76075l63603n03812m83181
$$ 21825273 21060772 20426947 19612255 19361396 18453403 18277328 17913725 17409913 16926732
16640A6926732q80212l56917k08545l30608q6333n73709m30731n05052j98600
$$ 16926732 16046520 15689603 15481058 15150450 15064117 14490408 14059677 13554625 13356025
16631A3356025m18235k12354j60760m0777n82873m08493n47405p1156p0619j80796
$$ 13356025 12937790 12725436 12564676 12523899 11941026 11532533 10985128 10913972 10843353 10662557
16621A0662557l78825j79338l7567p12880J2931o8121l25156j54911k49042n2117
$$ 10662557 10283732 10104394 10066827 9353947 9366878 9298757 8973601 8818690 8569648 8517531
16611H517531j19538k14183R9162m68489l9593j06524m47228J96492j57571l13990
$$ 8517531 8397993 8183810 8282972 7814483 7774890 7668366 7221138 7417630 7260059 6946069
16601F946069L1732k66550J52511l42470n6554j73626Q2401k97220L7296k81547
$$ 6946069 6977801 6711251 6863762 6521292 6464738 6291112 6373513 6076293 6113589 5832042
16591E832042J72864j23624m57380Q2920j9078j78798J74602j91227J20168j84370
$$ 5832042 6004906 5881282 5423902 5506822 5487744 5308946 5483548 5292321 5412489 5228119
16581E228119m43380K06730j06916j22643R6912l57571j59392L94707q2494j66997
$$ 5228119 4784739 4991469 4884553 4761910 4858822 4501251 4341859 4736566 4654072 4487075
16571D487075M072n06473O4502J67235j77382K48213m30517J310J23372j23314
$$ 4487075 4491147 3984674 4049176 4216411 4039029 4287242 3856725 3858035 3981407 3858093
16561C858093N8675O2964n52371L76743l89462N8817M4934k01293K04381m76342
$$ 3858093 3916768 3979732 3427361 3804104 3414642 3473459 3518393 3317100 3521481 3045139
16551C045139j3592J56329K4626k5620k10772j15648K47571m15617O25596p33388
$$ 3045139 3031547 3187876 3212502 3186882 2976110 2860462 3108033 2692416 3318012 2584624
16541B584624J96436M2707j25517N65531j90132l77258l284k42659L00999m74190
$$ 2584624 2781060 2823767 2698250 3263781 3073649 2696391 2693107 2450448 2751447 2277257
16531B277257L72910k43330M43486j92655l66227M26919n4342m41466j86009M50917
$$ 2277257 2650167 2406837 2850323 2657668 2291441 2718360 2664018 2222552 2036543 2487460
16521B487460j31069k27131l3835j71910J14959L34600j81043J40969q1931r9856
$$ 2487460 2356391 2129260 2095425 1923515 2038474 2373074 2192031 2333000 2251069 2151213
16511B151213p5061K83174p23959L16510J05904K53211k39323k3296k14346L3431
$$ 2151213 2076152 2359326 1635367 1951877 2057781 2310992 2071669 2048373 1834027 1867458
16501A867458K92208l61149J22231N5493j53746J88639j81326j8549j57761K56931
$$ 1867458 2159666 1798517 1920748 1976241 1822495 2011134 1829808 1811259 1653498 1910429
16491A910429n55321N28610j36385j7837m67428O73164q2511l21195L4772P503
$$ 1910429 1355108 1883718 1747333 1729496 1262068 1935232 1852721 1531526 1566298 1573801
16481A573801k94175P4787J75166K01534n31507J00126J72239K38232J0666k44640
$$ 1573801 1279626 1354413 1529579 1731113 1199606 1299732 1471971 1710203 1720869 1476229
16471A476229J21072l86290M92271n96922N73501m79727P9433K5552N70550o47341
$$ 1476229 1597301 1211011 1703282 1106360 1679861 1200134 1279567 1305119 1875669 1228328
16461A228328L63324m16283J73719k97604J96503p748O1566K16815n8929k02484
$$ 1228328 1591652 1175369 1349088 1051484 1247987 1240239 1301805 1518620 1459691 1257207
16451A257207p2433J46921j73321J23485J4997j52972L30399l95518J39270k8691
$$ 1257207 1184774 1331695 1158374 1281859 1296856 1143884 1474283 1078765 1218035 1189344
16441A189344J22450j94308O1363k35368L68314k83771J65099j91448K94818k33206
$$ 1189344 1311794 1117486 1178849 943481 1311795 1028024 1193123 1001675 1296493 1063287
16431A063287k78891R9705L5661L19128q7730J53179j44001m53733K58900K69795
$$ 1063287 784396 884101 919762 1238890 1151160 1304339 1160338 706605 965505 1235300
16421A235300k39212j54905K93083K6596l6017j50970k3728M03999l89277J21967
$$ 1235300 996088 841183 1134266 1160862 1124845 973875 950147 1354146 964869 1086836
16411A086836N3502k60696J42023K58752l45901k03487j35538N15201l86956K33982
$$ 1086836 1140338 879642 1021665 1280417 934516 731029 595491 1110692 723736 957718
16401I57718j2396j14594l5621J02519p9060j69642J08680L96133l76173r6088
$$ 957718 945322 830728 795107 897626 818566 648924 757604 1153737 777564 681476
16391F81476K09773j95599L73870R1191k48907O0686j65780J71100l23209j56487
$$ 681476 891249 695650 1069520 1160711 911804 972490 806710 977810 654601 498114
16381D98114L08886K9225k19942k1062R0012J00227n3155O0979m5382l17113L03839
$$ 498114 807000 836225 616283 595221 685233 785460 732305 793284 747902 430789 734628
16370G34628k06197r3414M10327j66054l4601m7857R773L09419l03936j07651
$$ 734628 528431 435017 845344 679290 644689 596832 606605 916024 612088 504437
16360E04437M79292l66815L12198j48747N8429j21661K44930j73125K55909k38042
$$ 504437 983729 616914 929112 780365 838794 717133 962063 788938 1044847 806805
16350H06805Q1233l66428M94516m75771r9955L1008L89972j70022R4162p002j80108
$$ 806805 888038 521610 1016126 540355 440400 471408 861380 691358 785520 778518 598410
16339E98410j52147K32145K52264k55768j6684Q5814n3921L96j99843K79182p8079
$$ 598410 446263 678408 930672 674904 658220 744034 690113 690509 490666 769848 691769
16328F91769k22305l3177M1395L00131B49198L78545J23552l19073J04662j4618
$$ 691769 469464 436287 477682 777813 249198 627743 751295 432222 536884 522266
16318E22266O3915j07769J68584j77887L85672C71187K22851j12543Q1942J34071
$$ 522266 586181 478412 646996 469109 854781 371187 594038 481495 563437 697508
16308F97508k7675K0502J8467q3589K05671C22673J8573J96381j13738J43371
$$ 697508 669833 690335 708802 625213 830884 322673 341246 537627 423889 567260
16298E67260J4565J67502C62129Q7726J87616j39487M2257B67775F3722N60962
$$ 567260 581825 749327 362129 449855 637471 497984 540241 267775 63722 624684
16288F24684B80877K04212k2147O5633B58348N12759j25252A94895J97405j89500
$$ 624684 280877 485089 462942 528575 258348 771107 645855 194895 392300 202800
16278B02800L67046j36280J8585J09680A84759L05126k7388N5937N6370l776j07502
$$ 202800 569846 433566 452151 561831 184759 489885 462497 518434 574804 571028 463526
16267D63526A69760K619K72541K0828j54809N3339j5215K52826j33441j44044
$$ 463526 169760 172379 444920 465748 310939 364278 349063 601889 468448 324404
16257C24404L95918B70065P6049N4294p2698K3299N9487L7127j69037j2872J55116
$$ 324404 720322 270065 346114 400408 327710 351009 410496 447623 278586 265714 420830
16246D20830J58448k29272R2112l8971J40640j2312j72982l0248I8614B2844L92062
$$ 420830 579278 350006 442118 403147 543787 531475 358493 328245 98614 22844 414906
16235D14906J53476j76746K74085B8957K62057K44657A50482O0754L45330j18380
$$ 414906 568382 391636 665721 28957 291014 535671 150482 211236 556566 438186
16225D38186C1494N1017K84021j72688L85487k70883K7070m7361o5358K84373
$$ 438186 31494 82511 366532 193844 579331 308448 335518 288157 222799 507172
16215E07172I9414K63756N0004B05197a30267D22331N9078j86849n6072A17724
$$ 507172 99414 363170 413174 205197 -130267 422331 481409 294560 238488 117724
16204G5163J70401B3005L78362j17617n1040J59615a55369H8105C2588J77903
$$ 75163 245564 23005 401367 283750 232710 392325 -155369 88105 32588 210491
16194B10491L7481H7893e1184D34264l6378m3605j77080C836J24606M14496j16569
$$ 210491 247972 87893 -51184 434264 397886 354281 177201 3836 128442 542938 426369
16183D26369P8603B31728K03329l7655n3013Q20k7178L6680J71346B58364A6456
$$ 426369 504972 231728 435057 397402 344389 345209 318031 354711 526057 258364 16456
16171B73554J74214A81019K08163o3717M3450h8501I4012K21872K43748q9094
$$ 273554 447768 181019 389182 325465 368915 -88501 94012 315884 559632 470538
16161D70538o3491j42243G6592J97916q8197K82101A77673h2245B74007a90200
$$ 470538 407047 264804 76592 274508 186311 468412 177673 -82245 274007 -190200
16150C65826A38106J45664j29231J03955J8998K624K083r7645g1451B4632A416
$$ 365826 138106 283770 154539 258494 277492 280116 282199 184554 -71451 24632 1416
16138A36135m5985N0134K84670j56528A6894h6822B87803b06386A92853r3161
$$ 136135 90150 140284 424954 268426 16894 -86822 287803 -206386 192853 99692
16128I9692M3470E9444K37265K88312A18264K28338A30308J17814R2628F8963
$$ 99692 143162 59444 296709 585021 118264 346602 130308 248122 340750 68963
16117D42845b5938C92149A65993J73211A8931f6805C21250q0311J56149F3939
$$ 442845 -25938 392149 165993 339204 18931 -66805 321250 240939 397088 63939
16106B2047G259a7886C4534K67916N0706K3734j18509N7259J04161k5380A19210
$$ 22047 7259 -17886 34534 302450 353156 376890 258381 315640 419801 394421 119210
16094C47671C5314K6677N752K77280A19735D6482Q7945a33505B01287i1856B51011
$$ 347671 35314 61991 67743 345023 119735 46482 134427 -133505 201287 -91856 251011
16082A21316J69216q9042L3020R34a19868A16249K25472j40892k0316h7629J6059
$$ 121316 290532 201490 234510 235444 -119868 116249 341721 200829 180513 -87629 -71570
16071g1570B4179L96408q8915Q32j41021a47528A54346b81293f9101b1043D2778
$$ -71570 24179 420587 331672 332504 191483 -147528 154346 -281293 -69101 -21043 42778
16059D71887I1371k6372a64223C72090D168b94577d8434A79347a0686N112j66470
$$ 471887 91371 64999 -164223 372090 4168 -294577 -48434 179347 -10686 -5574 -172044
16048a72044A88240b30854B7671J58518C1867J70413j1458a56136A06665J60516
$$ -172044 188240 -230854 27671 186189 31867 202280 190822 -156136 106665 267181
16038B67181J02443a39739m9740E9246O7207C712J25436B0013a02090a0511A11678
$$ 267181 369624 -139739 -189479 59246 126453 3712 129148 20013 -102090 -10511 111678
16026C04458b4241m6141B23387b92249A60966H90a31804a7286G4176b53772B86894
$$ 304458 -24241 -70382 223387 -292249 160966 890 -131804 -17286 74176 -253772 286894
16014a77956B15047K30462D6439d8281C00334b55149A93675d1235A76389Q5171
$$ -177956 215047 445509 46439 -48281 300334 -255149 193675 -41235 176389 261560
16004B61560a52892r7181A0045g7818b6075k0716j7098k4132A17136k7717i2508
$$ 261560 -152892 -250073 10045 -77818 -26075 -46791 -63889 -88021 117136 89419 -92508
15992A91023f425D7908J93419A4864N1063K39714c1867B04412b14444K7091E3284
$$ 191023 -6425 47908 241327 14864 65927 305641 -31867 204412 -214444 -187353 53284
15980D6276K35972H8126A1929a12668q9911B20654H5562L50391K17031J16932
$$ 46276 282248 88126 11929 -112668 -202579 220654 85562 435953 652984 769916
15970G69916O80198m59905j85392j08695k90885K05278k02443j46969E6483J11276
$$ 769916 1450114 990209 804817 696122 405237 610515 408072 261103 56483 167759
15960A67759c538k2202e329B03950a13126j56787J16369D6255b1258m95428d2152
$$ 167759 -3538 -25740 -5329 203950 -113126 -269913 -153544 46255 -21258 -516686 -42152
15948a31454A26472D3819J84302G038b5990q9596m5611K943L6799A60008D16b84632
$$ -131454 126472 43819 228121 7038 -25990 -115586 -161197 -158254 -121455 160008 416 -284632
15935A49734m7019O983a36552l3988k22188J40292d9682G8300l7855j9758a10110
$$ 149734 102715 109698 -136552 -170540 -392728 -252436 -49682 78300 40445 20687 -110110
15923A88675a16238a9028B64047a11216D3693f4077k20097A37220J84665B7846
$$ 188675 -116238 -19028 264047 -111216 43693 -64077 -284174 137220 321885 27846
15912h0944i401l30930R985A20851h6252b7600B05527d3445q4311A34734a20115
$$ -80944 -9401 -340331 -330346 120851 -86252 -27600 205527 -43445 -127756 134734 -120115
15900B46840A11397Q4129B2463a31996k18642e0130b2087k58095l4740a04867
$$ 246840 111397 195526 22463 -131996 -350638 -50130 -22087 -280182 -314922 -104867
15889a72185c5296p5468a2345A1269O6607J12347b9827j88693b8172A27975e4537
$$ -172185 -35296 -110764 -12345 11269 77876 190223 -29827 -218520 -28172 127975 -54537
15877d08064A88123O4318e1599p1707b5290A7505a0223A19014i8303M4295A99369
$$ -408064 188123 252441 -51599 -123306 -25290 17505 -10223 119014 -98303 -54008 199369
15865h3750M0734j13648A78438h029k2599j88605k568n7312E5901a09491d4921
$$ -83750 -43016 -156664 178438 -8029 -30628 -219233 -221801 -279113 55901 -109491 -44921
15853a19436l6275A20041o98c26413A74083j593E106b34860F6834P1103a38236
$$ -119436 -155711 120041 119343 -326413 174083 172490 5106 -234860 66834 137937 -138236
15841A10458c3022B01098a1329k79969A63246m6127a36170e0231A54804a97073
$$ 110458 -33022 201098 -11329 -291298 163246 117119 -136170 -50231 154804 -197073
15830C28376a57608A4144P7309a70763A13544k0073g9869C65754I3762l3299b5309
$$ 328376 -157608 14144 91453 -170763 113544 93471 -79869 365754 93762 60463 -25309
15818A50082J15089j26111P420o8440A6014K7427J86797b49274B29087n8153b65657
$$ 150082 265171 139060 146480 78040 16014 43441 230238 -249274 229087 170934 -265657
15806B35835A0008c44428a28630a2772q4323j20828l0269A6525c0306A69830a02373
$$ 235835 10008 -344428 -128630 -12772 -97095 -217923 -248192 16525 -30306 169830 -102373
15794G0995J63901h1076L4870C51235c610F5861J52505a43618B93045F2128J27977
$$ 70995 234896 -81076 -46206 351235 -3610 65861 218366 -143618 293045 62128 190105
15783A90105a37941C10542g265A80219a10572A85750F8995J09653P5112a99788
$$ 190105 -137941 310542 -7265 180219 -110572 185750 68995 178648 253760 -199788
15772b06502M4809j34758p7879J39928l33917b23049F9322g46k96905f9506j01434
$$ -206502 -161693 -296451 -374330 -234402 -568319 -223049 69322 -746 -297651 -69506 -170940
15761a70940j27586f6812a8849j52753I983b3641j96068m6522b1183j09738C08791
$$ -170940 -298526 -66812 -18849 -171602 9983 -23641 -219709 -266231 -21183 -130921 308791
15749A93709n3857J42417m1054J93204A36791M3690j9277l4020A9543q175b80431
$$ 193709 139852 282269 241215 434419 136791 180481 161204 127184 19543 11368 -280431
15737B13473A9809J12797K1510K437n8041C8547f5718B23074f7637M978C45758
$$ 213473 19809 132606 154116 156553 98512 38547 -65718 223074 -67637 -62659 345758
15725A15771k7131c02765A7984d33181A41205a09305j05362e306n1284K4191A09082
$$ 115771 88640 -302765 17984 -433181 141205 -109305 -214667 -5306 -56590 -32399 109082
15713e4835a2301n8011J0103j55686A79008c01004b7620j95001B11646n6436c5012
$$ -54835 -12301 -70312 -60209 -215895 179008 -301004 -27620 -222621 211646 155210 -35012
15701b8554o3910k90589a03997C1431c005q0041J072B96364G200c04681B3250
$$ -28554 -92464 -383053 -103997 31431 -3005 -83046 -81974 296364 7200 -304681 23250
15689b2707j05808B17623m6443d5544C35622a4057n1278a4517l1689m3016B81075
$$ -22707 -128515 217623 171180 -45544 335622 -14057 -65335 -14517 -46206 -89222 281075
15677B56142a0434C1785a11081H9461h942A10J1039c7778C78685A27395J76335
$$ 256142 -10434 31785 -111081 89461 -8942 110 11149 -37778 378685 127395 303730
15666C03730a11518j09455a7679n9050l30854A3980L386J9604a89885P7707e1056
$$ 303730 -111518 -220973 -17679 -76729 -407583 13980 17366 36970 -189885 -112178 -51056
15654B11452r0630a41414C7799A031a65528k62793A36983o4905l5162a09654B55847
$$ 211452 120822 -141414 37799 1031 -165528 -428321 136983 72078 36916 -109654 255847
15642A8640a27227f129C65305b08688i1677A42421f8090A10825a1505k96332j01700
$$ 18640 -127227 -6129 365305 -208688 -91677 142421 -68090 110825 -11505 -307837 -409537
15631d09537B35660M7929C7975b25304B03851e7848A12940d73933K22179e087
$$ -409537 235660 283589 37975 -225304 203851 -57848 112940 -473933 -251754 -5087
15620a05863A45163o1300i0534k0749k7469o6148C6245c984j29830B4974b5344
$$ -105863 145163 83863 -90534 -111283 -138752 -204900 36245 -3984 -133814 24974 -25344
15608a48306j75622A45280a86684P8298m4050A77176L8681C2829J41546b58048
$$ -148306 -323928 145280 -186684 -108386 -152436 177176 215857 32829 174375 -258048
15597b58581K8034Q3850G6680a14408b4325k2979k46780Q3519d4301n4430E350
$$ -258581 -230547 -146697 76680 -114408 -24325 -47304 -294084 -210565 -44301 -98731 5350
15585B3196B05b02846j20392A3555J4684a14900Q483A55994c37397a03573C5006
$$ 23196 205 -202846 -323238 13555 28239 -114900 -106417 155994 -337397 -103573 35006
15573C9071c2779j6344I9199a90777h3130D6512j6710A2649L1025L9342b28719
$$ 39071 -32779 -49123 99199 -190777 -83130 46512 29802 12649 43674 83016 -228719
15561a99265c8910C45082C9483a09412d6278o7260j74437a9429A26958i632A18916
$$ -199265 -38910 345082 39483 -109412 -46278 -113538 -287975 -19429 126958 -9632 118916
15549a03089A4787b65853A24863c21576I715O3689J5625b19662F8285C2886b2740
$$ -103089 14787 -265853 124863 -321576 9715 73404 89029 -219662 68285 32886 -22740
15537e9841B15869a95939M5825B04885D6068j6982K634J12285b18945C4891f5359
$$ -59841 215869 -195939 -150114 204885 46068 29086 31720 144005 -218945 34891 -65359
15525a30716D9466P3504L8312a43088F7498b5423C6633a95149B04668K01819b47006
$$ -130716 49466 122970 161282 -143088 67498 -25423 36633 -195149 204668 406487 -247006
15513b46423e772j26986A05215a29162A91283f7145l4561C32336A49212d8806
$$ -246423 -5772 -132758 105215 -129162 191283 -67145 -101706 332336 149212 -48806
15502A18661L43c4823C5900a24723L3265A21678J01012a26908A21251a24707A62840
$$ 118661 119004 -34823 35900 -124723 -91458 121678 222690 -126908 121251 -124707 162840
15490B69383E6440a10671A50808F1498b58438A5946J59991l5435c7288A73645
$$ 269383 56440 -110671 150808 61498 -258438 15946 175937 140502 -37288 173645
15479H5453K39785A5069a25092B20874F0798R895a95743d4446A55086g6995L8172
$$ 85453 325238 15069 -125092 220874 60798 70693 -195743 -44446 155086 -76995 -38823
15468c8823B07145l3829q5440a52050k5890c8279A70990c7799E00371B22917O02567
$$ -38823 207145 173316 87876 -152050 -177940 -38279 170990 -37799 500371 222917 825484
15457H25484l86620m5764k4320A73844O5344O1488B5536f6667A54188j2893Q1097
$$ 825484 438864 393100 368780 173844 239188 300676 25536 -66667 154188 141295 222392
15446B22392H1772M09853a11118C03019a52480a6695j24718B7729K16746o5681
$$ 222392 81772 491625 -111118 303019 -152480 -16695 -141413 27729 244475 178794
15436A78794C5820N6610d1191A2509K59121A15219a14540B04137K58743l3435
$$ 178794 35820 92430 -41191 12509 271630 115219 -114540 204137 462880 429445
15426D29445R7078J26162q1683J50454k25450j87507j53287h383D05028A46903
$$ 429445 526523 652685 571002 721456 496006 308499 155212 -8383 405028 146903
15415i3212j38120A00592J38349a27296H2137B9802R7702a07151B6660a10586
$$ -93212 -231332 100592 238941 -127296 82137 29802 127504 -107151 26660 -110586
15404i1057A04553m0420P1622h3791k65137f0892B713d7756J3517A96094Q6091
$$ -91057 104553 64133 135755 -83791 -348928 -60892 2713 -47756 -34239 196094 282185
15393B82185a53209j5531l5501a993C72164j47999a73712j08053P8385c3626a5239
$$ 282185 -153209 -168740 -204241 -1993 372164 224165 -173712 -281765 -203380 -33626 -15239
15381E6029K9856J7043a475C453i251E557L32878a13244J9620m637B33109m5191
$$ 56029 85885 102928 -1475 3453 -9251 5557 338435 -113244 -93624 -98261 233109 187918
15369A87918J48537G7136K53050p5935g6656B98123I1061K92548A05171b4845
$$ 187918 336455 77136 330186 254251 -76656 298123 91061 383609 105171 -24845
15358A11057J71874A0156M49650A64455M7831a79026e8792B28790j07730K53879
$$ 111057 282931 10156 459806 164455 212286 -179026 -58792 228790 121060 374939
15348C74939d5871f001B67587j1084n6690J80220A76970p5212L4011R0752n0142
$$ 374939 -45871 -6001 267587 256503 199813 380033 176970 101758 135769 226521 176379
15337A76379c4723A6814L40989o378A12508O2781j5176j7246J37182A35229L45790
$$ 176379 -34723 16814 357803 351425 112508 175289 160113 142867 280049 135229 481019
15326D81019B17748K57413A38261f5410B70378g0410B75541e26A39896c8199E2621
$$ 481019 217748 475161 138261 -65410 270378 -70410 275541 -526 139896 -38199 52621
15314d4263B94255j12339D1582a32985A65401g232k4536C0283b38175c1528B20586
$$ -44263 294255 181916 41582 -132985 165401 -7232 -31768 30283 -238175 -31528 220586
15302d7494B44504l0340p5236K03390j18052q6858h1814B17256b286J134A79562
$$ -47494 244504 214164 138928 342318 224266 137408 -81814 217256 -2286 -1152 179562
15290f023A02603J27539b03018b9726H4737a35461B2800e6116C17698p2897J24003
$$ -6023 102603 230142 -203018 -29726 84737 -135461 22800 -56116 317698 244801 368804
15279C68804g840F7367J83523a71357A30078b72072J16443N2425j94259H5371
$$ 368804 -7840 67367 250890 -171357 130078 -272072 -155629 -103204 -297463 85371
15268C50879a04312l8388A6975c2703H1366J04435A927b83838C02745F4197Q9129
$$ 350879 -104312 -142700 16975 -32703 81366 185801 1927 -283838 302745 64197 153326
15257A53326b3399c552l5479j12612I810J5282d7442B3848J87331J83067b2189
$$ 153326 -23399 -3552 -39031 -151643 9810 25092 -47442 23848 211179 394246 -22189
15245B28722I361J34880a30776j17714A43524J23525C8982O1247B2698Q111J99346
$$ 228722 9361 144241 -130776 -248490 143524 267049 38982 100229 22698 30809 230155
15234B30155a17691A98576L25564k7283j6899M85243M70169j74537Q8751j31837
$$ 230155 -117691 198576 524140 496857 479958 965201 1435370 1260833 1349584 1217747
15224A217747l73490D05154J04744H1387P5835g8775B69527E9453M4674K53335
$$ 1217747 844257 405154 509898 81387 157222 -78775 269527 59453 104127 357462
15214C57462B0586K64665q1798a69764G8295L1017e3362A11108O8806J8301J94094
$$ 357462 20586 285251 203453 -169764 78295 109312 -53362 111108 179914 198215 392309
15203C92309B7592g2167A31604i8585C46103j26177M9709C4842a22610k4631B0786
$$ 392309 27592 -72167 131604 -98585 346103 219926 269635 34842 -122610 -147241 20786
15191A30360o2739j3146N57005A05983a25877H707d3862A1433L37504j26306B3066
$$ 130360 67621 54475 611480 105983 -125877 8707 -43862 11433 348937 222631 23066
15179B25958a59187n3101B03294o7638N1836h6029A32741a71322B44466b44513
$$ 225958 -159187 -212288 203294 135656 187492 -86029 132741 -171322 244466 -244513
15168g977j30456C00422F9705J74436q1548K64196I4774N794m7809b02796b9440
$$ -7977 -138433 300422 69705 244141 162593 426789 94774 100568 52759 -202796 -29440
15156F4303A8774K22004k9975f166A02948d8506A55369R3870C0943d1149H4461
$$ 64303 18774 240778 210803 -6166 102948 -48506 155369 249239 30943 -41149 84461
15144B62667D836d8673l79247B29K70776A8150Q0818h493k7965E2284J34067m1742
$$ 262667 4836 -48673 -427920 229 271005 18150 98968 -8493 -36458 52284 186351 144609
15132A44609J26680A24332J07868J71567j82839o6113c42712D89047B11030E4304
$$ 144609 271289 124332 232200 403767 220928 154815 -342712 489047 211030 54304
15121b00635B48318j6178n1924r779K2158f862A56906g4206A14362N2728N549
$$ -200635 248318 232140 180216 170437 192595 -6862 156906 -74206 114362 167090 172639
15110A72639k260L05089F5336R1125P0356J4806r8839M40312f2172C3569g1449
$$ 172639 170379 475468 65336 156461 226817 241623 142784 583096 -62172 33569 -71449
15098C69379H5309J99886o9490k057A7385K01542L1674r5782B8264L29269b18916
$$ 369379 85309 285195 215705 213648 17385 218927 250601 154819 28264 357533 -218916
15086a7711A89278l9030F2868J78717J4034a92288e0217B47292r5707J01888h8297
$$ -17711 189278 150248 62868 241585 255619 -192288 -50217 247292 151585 253473 -88297
15074F489K03596l0205b15859A78225b4071G4679e756C10138a38191B80918d0149
$$ 6489 210085 179880 -215859 178225 -24071 74679 -5756 310138 -138191 280918 -40149
15062f5842E0411a39267A08421C5837J37681Q7673r9879L0806N0585O6420L1892
$$ -65842 50411 -139267 108421 35837 173518 261191 161312 192118 242703 309123 341015
15051C41015L7122A5379J0974b12219E63612B78489J04202A01976J27262M68007
$$ 341015 378137 15379 26353 -212219 563612 278489 382691 101976 229238 697245
15041F97245B53939j25338J88463A33316j1904K16839r4197e209C47412N333L59596
$$ 697245 253939 128601 317064 133316 121412 338251 244054 -5209 347412 352745 712341
15030G12341l13796J94482p7856J45804C16822K78J63131o9859j89408P6939D4897
$$ 712341 398545 593027 515171 660975 316822 317100 480231 410372 220964 297903 44897
15018E34105J21032p0835l6254J60601j50949L52653l65629n751J5323B73898
$$ 534105 655137 584302 548048 708649 557700 910353 544724 538973 554296 273898
15007D63913o3920L069N5172B10348o708J83132K98683k76938j32726K88439K27992
$$ 463913 399993 403062 458234 210348 203640 386772 685455 408517 275791 564230 792222
14996G92222G1259J74815L30852B08843I3149M22494J91432j76398m4128A86010
$$ 792222 71259 246074 576926 208843 93149 515643 707075 530677 486549 186010
14985D07164J33468p0776M6897M4812k48449J51339O9284m8402K6891B11222M33312
$$ 407164 540632 469856 516753 561565 313116 464455 533739 485337 512228 211222 644534
14974F44534K1764J3314k69621J27059q05k64217L82078M0249N7972L32647l77484
$$ 644534 666298 679612 409991 537050 536245 272028 654106 694355 752327 1084974 707490
14963G07490j19800L04402j67726C00285K25236j38337J3049K3168K25253k78815
$$ 707490 587690 892092 724366 300285 525521 387184 400233 423401 648654 369839
14953C69839K81455m3541k40386K5681K2593j77021L92372B20613J90278I9718
$$ 369839 651294 607753 367367 393048 415641 238620 630992 220613 410891 99718
14942B50175j03621J854J00900J78456k08942L0520J95602m0561J80936P337j89026
$$ 250175 146554 148408 249308 427764 218822 249342 444944 404383 585319 592656 403630
14931D03630j00367L61506B93532Q6682q842K74168l3423j77062R6398j15814
$$ 403630 303263 664769 293532 380214 371372 645540 612117 435055 531453 415639
14921D15639L0430j97291M83058p4417J62932N1725l3478o2253K76434L51586
$$ 415639 446069 248778 731836 657419 820351 872076 838598 776345 1052779 1404365
14911A404365k26948L14033J74934m61446J30070M6733J01487J10501L7745K35743
$$ 1404365 1177417 1491450 1666384 1204938 1335008 1381741 1483228 1593729 1631474 1867217
14901A867217Q701J39854j56315j68277n20671P3366j27346j20160j4532l15799
$$ 1867217 1875918 2015772 1859457 1691180 1170509 1243875 1116529 996369 981837 666038
14891F66038J35494l08853B33868M10407A13220N31834N2199j42375C1176J63899
$$ 666038 801532 492679 233868 644275 113220 645054 697253 554878 31176 195075
14881A95075L10825q406J73243j13370L563K13077A01130K68386K09863j23156
$$ 195075 505900 497494 670737 557367 560930 774007 101130 369516 579379 456223
14871D56223k17486K55687L29K99700K54072l70499j35019J35651n0918J70595
$$ 456223 238737 494424 494753 794453 1048525 678026 543007 678658 627740 798335
14861G98335j58764J95974C96545K97002B36609K88906j73661M6370Q6874K24124
$$ 798335 639571 835545 396545 693547 236609 525515 351854 398224 485098 709222
14851G09222j54848k59052L84750J04174j73942j58959K3115Q9181n1028L84234
$$ 709222 554374 295322 680072 784246 610304 451345 474460 563641 512613 896847
14841H96847k63050O9455L76587E15826k14024k6978L38982J79620k74213p423
$$ 896847 633797 703252 1079839 515826 301802 274824 613806 793426 519213 511790
14831E11790L17748j39622C44948L29811N5913M02779j63566j68512J61198K96464
$$ 511790 829538 689916 344948 674759 730672 1133451 969885 801373 962571 1259035
14821A259035k07275r3317j83758J5819j65884K45264l29711n8237J25088J47009
$$ 1259035 1051760 958443 774685 790504 624620 869884 540173 481936 607024 754033
14811G54033C23937J17235m0366M10263k54007K25558p8958n6708B52938M51894
$$ 754033 323937 441172 400806 811069 557062 782620 703662 646954 252938 704832
14801G04832J78890j63906j31359j75085N88591j03557l0712j75848K35630j73764
$$ 704832 883722 719816 588457 413372 1001963 898406 867694 691846 927476 753712
14791G53712K3751K7471l01288J17011K97693N7532O8569l38380K95888l91873
$$ 753712 777463 804934 503646 620657 918350 975882 1044451 706071 1001959 610086
14781F10086O7876r6872q1309J83210N4240k12416K51876L0889k73997J72115
$$ 610086 677962 581090 499781 682991 737231 524815 776691 807580 533583 705698
14771G05698j06898J23685j14006k2415J21447K4534M5834J59176l78587k3320
$$ 705698 598800 722485 608479 586064 707511 732045 777879 937055 558468 535148
14761E35148J87702j16181K46379J7860m8936k6562j09524m342q9644J3014P1677
$$ 535148 722850 606669 853048 870908 821972 795410 685886 681544 591900 604914 676591
14750F76591j36288K94370j62871K04986C79920M98173l8585o474j70522R3070
$$ 676591 540303 834673 671802 876788 379920 878093 839508 833034 662512 755582
14740G55582P8972l31829P3974K30568j50744j93467K25047J66806k10548k09460
$$ 755582 834554 502725 576699 807267 656523 463056 688103 854909 644361 434901
14730D34901L76674K39820k43717K30106m82666L72010n7016j08931o897j11528
$$ 434901 811575 1051395 807678 1037784 555118 927128 870112 761181 754284 642756
14720F42756K90077j26901r9837L6166M61249m31095K25434K15465M1411J23825
$$ 642756 932833 805932 706095 742261 1203510 772415 997849 1213314 1254725 1378550
14710A378550K61240q8412m46241K45563k68652J61120l02255J51219k75648q6179
$$ 1378550 1639790 1551378 1105137 1350700 1082048 1243168 940913 1092132 816484 730305
14700G30305M27355l73343Q2613P4546K71913l00473J67232K05753j29703K25839
$$ 730305 1157660 784317 866930 941476 1213389 912916 1080148 1285901 1156198 1382037
14690A382037m26294J83972J96946l1765O9623K09023k4708K62806q4741j18377
$$ 1382037 955743 1139715 1336661 1304896 1374519 1583542 1558834 1821640 1736899 1618522
14680A618522j57495n34131M81537m46826r824J94743N2585j54258Q9616k54546
$$ 1618522 1461027 926896 1408433 961607 951783 1146526 1199111 1044853 1134469 879923
14670H79923r2671K56413m1664l22883K02855K36933O2550j56255O6216l32837
$$ 879923 787252 1043665 1002001 679118 881973 1118906 1181456 1025201 1091417 758580
14660G58580K30516j36310J42571J18903M4777j50025J43409k00213n7167L33170
$$ 758580 989096 852786 995357 1114260 1159037 1009012 1152421 952208 895041 1228211
14650A228211K25600l42484k10231M27952k35025L30522j85095j46479l8249M9163
$$ 1228211 1453811 1111327 901096 1329048 1094023 1424545 1239450 1092971 1054722 1103885
14640A103885J87396k12799j02551M43099k5076r3984R3695J6979M6036k9130
$$ 1103885 1291281 1078482 975931 1419030 1393954 1299970 1393665 1410644 1456680 1427550
14630A427550k38974K06596J21896k19967k3190K92379k40309J54822k85677j32792
$$ 1427550 1188576 1395172 1517068 1297101 1273911 1566290 1325981 1480803 1195126 1062334
14620A062334K58783O7919k69650J98628q8229J05406j69727K2623o3155Q2887
$$ 1062334 1321117 1389036 1119386 1318014 1229785 1335191 1165464 1188087 1124932 1207819
14610A207819J52302J39624N5064k38621N23198m39824k20882K77541J2464k32969
$$ 1207819 1360121 1499745 1554809 1316188 1839386 1399562 1178680 1456221 1468685 1235716
14600A235716M26125k69717J63689l02785J81123k8198L02431l36674j87482K39362
$$ 1235716 1661841 1392124 1555813 1253028 1434151 1405953 1708384 1371710 1184228 1423590
14590A423590J18755M1163J84361n06330L14076J07700K44314l91692P497M47729
$$ 1423590 1542345 1583508 1767869 1261539 1575615 1683315 1927629 1535937 1543434 1991163
14580A991163l1294j8721l3435k40054K3928R5517j1775J59653K9975K87941m11930
$$ 1991163 1959869 1941148 1907713 1667659 1691587 1787104 1775329 1934982 1964957 2252898 1840968
14569A840968K303M19097p6809l40896k44904r6694M38162P9732Q331j3087M97190
$$ 1840968 1843271 2262368 2185559 1844663 1599759 1503065 1941227 2020959 2029290 2016203 2513393
14558B513393l37289k16133N6566j07551K47865J74547j2232j85607M40107L4047
$$ 2513393 2176104 1959971 2016537 1908986 2156851 2331398 2319166 2133559 2573666 2607713
14548B607713M3103p0234J84656M67725l82835J83439M83907K5010R12325l11627
$$ 2607713 2650816 2580582 2765238 3232963 2850128 3033567 3517474 3542484 4454809 4143182
14538D143182P86717K89738J516084J233732K146687L516967N678054R623889
$$ 4143182 4929899 5219637 6735721 7969453 10116140 13633107 19311161 28935050
14530B8935050L062503j3118059p152010l804450k160021r76948L26112N5139
$$ 28935050 31997553 18879494 11727484 7923034 5763013 4786065 5112177 5167316
14522E167316j416081q35718m1999m17714Q8186K65620n09619N09319p44474Q1887
$$ 5167316 3751235 2915517 2873518 2455804 2543990 2809610 2299991 2809310 2064836 2146723
14512B146723J39457M7337J80782j89802K6901K79663k51937j64560M62307K5317
$$ 2146723 2286180 2333517 2514299 2324497 2351398 2631061 2379124 2214564 2676871 2702188
14502B702188j10613J03342K36990l50881K56660l19691M32456j3689J6326k0912
$$ 2702188 2591575 2694917 2931907 2581026 2837686 2517995 2950451 2936762 2953088 2932176
14492B932176r5492N9976L63377l83085K58896k01005j2473K24500K5729n318
$$ 2932176 2836684 2896660 3260037 2876952 3135848 2934843 2922370 3146870 3172599 3167281
14482C167281M04359k76662m3430L38167j36949N8745j38500K0199L45316k85871
$$ 3167281 3571640 3294978 3251548 3589715 3452766 3511511 3373011 3393210 3738526 3452655
14472C452655K19528j382M9018k2349j06368J87053Q828O11088n79589K77932
$$ 3452655 3672183 3670801 3719819 3697470 3591102 3778155 3786983 4398071 3818482 4096414
14462D096414J8007l4630J80763j19565N7912J28295j49994o5515j00561P08479
$$ 4096414 4114421 4079791 4260554 4140989 4198901 4327196 4177202 4111687 4011126 4719605
14452D719605k19986L79227l32000K147K64920j98067p4344N07014k48085L04862
$$ 4719605 4499619 4878846 4546846 4548993 4813913 4615846 4541502 5048516 4800431 5105293
14442E105293J13726k6190J92676j87117M27446m63976J50284J68146j63377j0534
$$ 5105293 5219019 5192829 5385505 5198388 5625834 5161858 5312142 5480288 5316911 5306377
14432E306377K06146J50087K08021n7095q5453J23631K19819M89808l72675J46056
$$ 5306377 5512523 5662610 5870631 5813536 5728083 5851714 6071533 6561341 6188666 6334722
14422F334722L12292K49863L592j17421j55757K68671j15433K41251J08347L1031
$$ 6334722 6647014 6896877 6900469 6783048 6627291 6895962 6780529 7021780 7130127 7161158
14412G161158K96322q8480L3674M47096k52226L88771J40363K81889L1941L73008
$$ 7161158 7457480 7369000 7402674 7849770 7597544 7986315 8126678 8408567 8440508 8813516
14402H813516N4534J99574k74256r153K69672J41777N4447j64725N55199J36044
$$ 8813516 8868050 9067624 8793368 8784215 9053887 9195664 9250111 9085386 9640585 9776629
14392I776629j02294M57819r3444L05245O71545k64369K91680L4420J02603N4315
$$ 9776629 9674335 10132154 10038710 10343955 11015500 10751131 11042811 11077231 11179834 11234149
14382A1234149J65232L34819k86889M50088J71154J22486K48254N55826J76939
$$ 11234149 11399381 11734200 11447311 11897399 12068553 12191039 12439293 12995119 13172058
14373A3172058l41076L26286N57356K90033K25796q700N97543K67188L58312K38575
$$ 13172058 12830982 13157268 13714624 14004657 14230453 14221753 14819296 15086484 15444796 15683371
14363A5683371K37036K52303K57378Q0409L60917N21201L79687L66646K13637
$$ 15683371 15920407 16172710 16430088 16510497 16871414 17392615 17772302 18138948 18352585
14354A8352585L30190L54041M16408L24812P32487M11400L37621N76656J00471
$$ 18352585 18682775 19036816 19453224 19778036 20510523 20921923 21259544 21836200 21936671
14345B1936671P78023M94192K61400Q26259Q6156O68757O25919O18587O95504
$$ 21936671 22714694 23208886 23470286 24296545 24382701 25051458 25677377 26295964 26991468
14336B6991468O33035J093611M95823N91742N49152Q70338R58353J002639P39102
$$ 26991468 27624503 28718114 29213937 29805679 30354831 31225169 32183522 33186161 33925263
14327C3925263J063578Q78090Q04177J048484J394683Q11662J059439J400689
$$ 33925263 34988841 35866931 36671108 37719592 39114275 39925937 40985376 42386065
14319D2386065J549365J004378J296254J726810J532756J389853J716616J574487
$$ 42386065 43935430 44939808 46236062 47962872 49495628 50885481 52602097 54176584
14311E4176584J820883K366867J578889K313579K235946K473970K359640K555057
$$ 54176584 55997467 58364334 59943223 62256802 64492748 66966718 69326358 71881415
14303G1881415K762823K767284K693184L349847L374337L273729L860408L826785
$$ 71881415 74644238 77411522 80104706 83454553 86828890 90102619 93963027 97789812
14295I7789812M194776M560855M992205M778141N147363N683181N883958O330496
$$ 97789812 101984588 106545443 111537648 116315789 121463152 127146333 133030291 139360787
14287A39360787P237087O918737P483755P970128Q256253R221931R645225J0057281
$$ 139360787 146597874 153516611 161000366 168970494 177226747 186448678 196093903 206151184
14279B06151184J0816073J1179921J1380956J3002076J3251485J3979427J4279472
$$ 206151184 216967257 228147178 239528134 252530210 265781695 279761122 294040594
14272B94040594J4969948J4462768J4876891J5050155J4782506J3617359J2582740
$$ 294040594 309010542 323473310 338350201 353400356 368182862 381800221 394382961
14265C94382961J1860578J1090064J0552039R316908Q780966P889765N127430
$$ 394382961 406243539 417333603 427885642 437202550 445983516 453873281 459000711
14258D59000711L583199K402060K820386K241392k362376o848682o122256p129139
$$ 459000711 462583910 464985970 467806356 470047748 467685372 460836690 454714434 447585295
14250D47585295r027615r821294j4687706j4483255j3175472j4407193j5102469
$$ 447585295 438557680 428736386 414048680 399565425 386389953 371982760 356880291
14243C56880291j5458296j4972732j4605187j3591215j2511061j2808940j3134439
$$ 356880291 341421995 326449263 311844076 298252861 285741800 272932860 259798421
14236B59798421j2596167j2460479j1584402j1006205j0645051j0525224r440488
$$ 259798421 247202254 234741775 223157373 212151168 201506117 190980893 181540405
14229A81540405q851784q449725p979635p103518p306101o437804o385166n285859
$$ 181540405 172688621 164238896 156259261 149155743 141849642 135411838 129026672 123740813
14221A23740813n601375n306990m794032m675973m327535l738757l862542l684395
$$ 123740813 118139438 112832448 108038416 103362443 99034908 95296151 91433609 87749214
14213H7749214l579737l228591l121677k615447k985876k543831k674905k239578
$$ 87749214 84169477 80940886 77819209 75203762 72217886 69674055 66999150 64759572
14205F4759572k213605k069127j807970j820091k041210j773578j425456j592821
$$ 64759572 62545967 60476840 58668870 56848779 54807569 53033991 51608535 50015714
14197E0015714j556345j161454j811995j435580j018649p67324j332814j152400
$$ 50015714 48459369 47297915 45485920 44050340 43031691 42264367 40931553 39779153
14189C9779153j316664r73331r10418j251126m51913p45173j342173r69704l08599
$$ 39779153 38462489 37489158 36578740 35327614 34875701 34130528 32788355 31818651 31510052
14180C1510052j169048o65669m49379j123882l76385q37144p94157m78480m02827
$$ 31510052 30341004 29675335 29225956 28102074 27725689 26888545 26094388 25615908 25213081
14171B5213081p54698o32362k80081p05850l85084j8747j018759n09176k38384
$$ 25213081 24458383 23826021 23545940 22840090 22455006 22436259 21417500 20908324 20669940
14162B0669940n16349l96783l97968o07054l0109n52360k68726n75431j27980
$$ 20669940 20153591 19756808 19358840 18751786 18721677 18169317 17900591 17325160 17197180
14153A7197180m11029m17998j35051j23035l43957o13913j9946j15977m12911
$$ 17197180 16786151 16368153 16233102 16110067 15766110 15152197 15132251 15016274 14603363
14144A4603363k92047l08472k72562l88581l8303m12746n6682Q749k05740k1448
$$ 14603363 14311316 14002844 13730282 13341701 13303398 12890652 12833970 12842719 12636979 12615531
14134A2615531k27088p46685k0093l04792k70485M5779n34302M05753l88288k65642
$$ 12615531 12388443 11641758 11621665 11316873 11046388 11092167 10557865 10963618 10575330 10309688
14124A0309688L1074k32697Q1382m55979K23782k59156k50051J1371j13289k20855
$$ 10309688 10340762 10108065 10189447 9733468 9957250 9698094 9448043 9459414 9346125 9125270
14114I125270j69266p3034k27808n82401M78886R183k79310L1974m06998P45M5716
$$ 9125270 8956004 8882970 8655162 8072761 8551647 8560830 8281520 8313494 7906496 7907241 7952957
14103G952957k21322l00782j20133K26539n86180L12350M1342j58768m6210l51328
$$ 7952957 7731635 7430853 7310720 7537259 6951079 7263429 7304771 7146003 7099793 6748465
14093F748465J00666m2251l96126P35887n44730N7442j66290m74133J12981j84773
$$ 6748465 6849131 6806880 6410754 7146641 6601911 6659353 6493063 6018930 6131911 5947138
14083E947138M47861k77317l84442L43507l91151J78663m93540K71472j51965
$$ 5947138 6394999 6117682 5733240 6076747 5685596 5864259 5370719 5642191 5490226
14074E490226K66598j88454l08356k59868J95765R8014l11929l08237L74460l70616
$$ 5490226 5756824 5568370 5260014 5000146 5195911 5293925 4981996 4673759 5048219 4677603
14064D677603M78004m43421m9210k4557k22643K21309R894k11026K05939j1404
$$ 4677603 5155607 4712186 4662976 4638419 4415776 4637085 4646979 4435953 4641892 4630488
14054D630488m8202k08577k27411J96517j1932m533k85754N23010o8911j78579
$$ 4630488 4582286 4373709 4146298 4342815 4330883 4326350 4040596 4563606 4494695 4316116
14044D316116p9878M2393J5426L690l27770q2809j15714M91847p80834K08639
$$ 4316116 4236238 4278631 4294057 4297747 3969977 3887168 3771454 4263301 3482467 3691106
14034C691106J7332j69963k39656N31062k47420j37414J56340k69962K5727j74876
$$ 3691106 3708438 3538475 3298819 3829881 3582461 3445047 3601387 3331425 3357152 3182276
14024C182276L11551k64023j78362K9953L8961K66389l07064j43577J19294j00391
$$ 3182276 3493827 3229804 3051442 3081395 3120356 3386745 3079681 2936104 3055398 2955007
14014B955007j40180K69283j54451P5515k13723M9907Q9676k23359L50504l93262
$$ 2955007 2814827 3084110 2929659 3005174 2791451 2841358 2931034 2707675 3058179 2664917
14004B664917j163Q8238L9576J76182k34743l61651K88875l09746P7909K98047
$$ 2664917 2663754 2751992 2791568 2967750 2733007 2371356 2660231 2350485 2428394 2726441
13994B726441k70216k64854L64037l30757J7511k66417L39837J8968K75322n25684
$$ 2726441 2456225 2191371 2555408 2224651 2242162 1975745 2315582 2334550 2609872 2084188
13984B084188J66922O33228m80658M21734r1996K98451P0354K68571N72616J138607
$$ 2084188 2251110 2884338 2403680 2825414 2733418 3031869 3102223 3370794 3943410 5082017
13974E082017J714518L151330M805943R498910R030126j0679872p097650m820498
$$ 5082017 6796535 9947865 14753808 24252718 33282844 22602972 15505322 10684824
13966A0684824k823353j728404j106474p90811m0998m14767l91497l1049k94173
$$ 10684824 7861471 6133067 5026593 4235782 4194784 3780017 3388520 3357471 3063298
13957C063298k87395N5563n7480j42907K32389l05089r2772j30985o1195P2977
$$ 3063298 2775903 2831466 2773986 2631079 2863468 2558379 2465607 2334622 2273427 2346404
13947B346404l94241J39895K3481J8491J39301j15643j52469q5296j06242J73948
$$ 2346404 1952163 2092058 2115539 2134030 2273331 2157688 2005219 1919923 1813681 1987629
13937A987629J13125j6958j05735l02763K74172k48021J68084Q5640M3520j79937
$$ 1987629 2100754 2083796 1978061 1675298 1949470 1701449 1869533 1955173 1998693 1818756
13927A818756J55313n15417M79306O3333j18434J075l39131L53022k17465p0704
$$ 1818756 1974069 1458652 1937958 2001291 1882857 1883932 1544801 1897823 1680358 1609654
13917A609654R7821J48315l28724K34383k52823q1313J22538J76348K30135j41764
$$ 1609654 1707475 1855790 1527066 1761449 1508626 1427313 1549851 1726199 1956334 1814570
13907A814570l36118j38282J52338J29949k71655L90035k26776P1751j21540j36270
$$ 1814570 1478452 1340170 1492508 1622457 1350802 1740837 1514061 1585812 1464272 1328002
13897A328002K13575j55005K44283r1645K40760l38147M28890j27602l45212J64305
$$ 1328002 1541577 1386572 1630855 1539210 1779970 1441823 1870713 1743111 1397899 1562204
13887A562204m84470L49584P2479m59783K29729j15135J0298Q723L7969N2589
$$ 1562204 1077734 1427318 1499797 1040014 1269743 1154608 1164906 1173629 1211598 1264187
13877A264187K7923M8328j35658K64591N429l21546K82916j63213p476p6227L13574
$$ 1264187 1292110 1340438 1204780 1469371 1474800 1153254 1436170 1272957 1265481 1189254 1502828
13866A502828k87582j14715p9667L65067k36496J10934j16292L21198l23241J1126
$$ 1502828 1215246 1100531 1020864 1385931 1149435 1260369 1144077 1465275 1142034 1153160
13856A153160m4345j75601L80275m04989K67698J56818j21835k14916Q6599o3999
$$ 1153160 1108815 933214 1313489 908500 1176198 1333016 1211181 996265 1082864 1018865
13846A018865Q1676p8321J93329m25568L32114N3100J45502K0511m79367K76989
$$ 1018865 1100541 1022220 1215549 789981 1122095 1175195 1320697 1341208 861841 1138830
13836A138830l74903K58892J22563l17941L25002j9950k32715k32163R4257q2238
$$ 1138830 763927 1022819 1145382 827441 1152443 1132493 899778 667615 761872 679634
13826F79634K43403n479M18000l39147P2651l46789M5501K47697l9092m0433k11263
$$ 679634 923037 917558 1335558 996411 1069062 722273 767774 1015471 976379 935946 724683
13815G24683J69151K4675J99648l79586P3786N0368K94805j58855k9598k32782
$$ 724683 893834 918509 1118157 738571 812357 862725 1157530 998675 969077 736295
13805G36295L68130l13245l89121P01705j28206O2014R3774l54899l5273l7379
$$ 736295 1104425 791180 402059 1103764 975558 1037572 1131346 776447 741174 703795
13795G03795K42944J6372l8312j33475O8253N771p2420k0970K06759k52274M7157
$$ 703795 946739 963111 924799 791324 859577 865348 792928 771958 978717 726443 773600
13784G73600J12561n5344J23797l69214j71740M62359k56119L58677k48380m3960
$$ 773600 886161 830817 954614 585400 413660 876019 619900 978577 730197 686237
13774F86237M25822k39509j06423j0324j16878L89538D87522N10473l13994Q0104
$$ 686237 1112059 872550 766127 755803 638925 1028463 487522 997995 684001 764105
13764G64105j09906O6933J81977k30843J19595j98118j0597r6218K75144p7479
$$ 764105 654199 721132 903109 672266 791861 593743 583146 486928 762072 684593
13754F84593O5447J7386j29833M3137J83955j46730C57107L26640J35255L45607
$$ 684593 750040 767426 637593 680730 864685 717955 357107 683747 819002 1164609
13744A164609l51862C83488K1924L18355O3645j09183j85434K35664J05608l43643
$$ 1164609 812747 383488 405412 723767 787412 678229 492795 728459 834067 490424
13734D90424M31777j81543N3698k25975n427N939O9931L57441l47385B95826L62020
$$ 490424 922201 740658 794356 568381 562954 568893 638824 996265 648880 295826 657846
13723F57846M755J16012l1468B67312L53043L9602j98987Q9591M40452m55432
$$ 657846 662601 778613 747145 267312 620355 659957 460970 550561 991013 535581
13713E35581J20377l09323M00322q1927J17721P5219k2455k373k59046J72473
$$ 535581 655958 346635 746957 665030 782751 857970 835515 833142 574096 746569
13703G46569l0052l50454J08806L17334l67102K1542J73099K52700j20919k60765
$$ 746569 716517 366063 474869 792203 425101 446643 619742 872442 751523 490758
13693D90758N661K45198k16222J69937n5294k73512M62761l79004J9722k27196
$$ 490758 496419 741617 525395 695332 640038 366526 829287 450283 470005 242809
13683B42809M56946k92100o408n9171k4349N41505C47199J19591J78715k71223
$$ 242809 699755 407655 401247 342076 317727 859232 347199 466790 645505 374282
13673C74282K83587B88324m5258l1735O83368m0488C66117r4834J00165J89347
$$ 374282 657869 288324 243066 211331 894699 854211 366117 271283 371448 560795
13663E60795l1983k16085J84795j29317K7349K9773k5734o7455j9884Q3700K14888
$$ 560795 528812 312727 497522 368205 395554 425327 399593 332138 312254 395954 610842
13652F10842j97047J18334k42510K75025j28956C3821J84029J44787L91266r7621
$$ 610842 413795 532129 289619 564644 435688 33821 217850 362637 753903 656282
13642F56282k44508o024L1759j70363K22194j06092J54277K31338o1203B51681
$$ 656282 411774 405750 437509 267146 489340 383248 537525 768863 707660 251681
13631F00049r0384B36483J91143j13186L5493j8366L16373B66933J89318O9778
$$ 600049 509665 236483 427626 314440 349933 331567 647940 266933 456251 526029
13621E26029L9915k17959K0954j29623L55639o1969I9751M83099j77180R0480
$$ 526029 565944 347985 368939 239316 594955 532986 99751 582850 405670 496150
13611D96150K06963j60518k60504j7324I9436J59886J33557p2523r970g9186E84521
$$ 496150 703113 542595 282091 264767 99436 259322 392879 320356 310386 -79186 584521
13599D06767L2453j45017K11200A55791J03604G8028K71407K13041k8841B61926
$$ 406767 439220 294203 505403 155791 259395 78028 349435 562476 533635 261926
13588A61986J03863K49343k19750K74281B81510m6248j3244H6178K55758J04345
$$ 161986 265849 515192 295442 569723 281510 235262 222018 86178 341936 446281
13578D46281B04487L56024k54078K00086A51907K56038N5687k658k0631L87328
$$ 446281 204487 560511 306433 506519 151907 407945 463632 460974 440343 827671
13568H27671A03730K77251l0695L7540P4856j16919r784O314A50223J77430L3181
$$ 827671 103730 380981 350286 387826 462682 345763 335979 342293 150223 327653 360834
13557C60834J4018q8931j23069J59768n1624n3158n13J11355m2562L3264K0874
$$ 360834 374852 285921 162852 322620 270996 217838 217325 328680 286118 319382 340256
13546C40256A06288K27471L79130C44077m2947A37642F6143L27646b7321D05746
$$ 340256 106288 333759 712889 344077 301130 137642 66143 393789 -27321 405746
13535B77122A18929J36732A1069J90436J6333N667J32161k5247M9373A22004L76676
$$ 277122 118929 255661 11069 201505 217838 223505 355666 330419 379792 122004 498680
13524D98680j30924A09420B3513K81640Q1692A33070L55690A24255J9495J64800
$$ 498680 367756 109420 23513 305153 386845 133070 488760 124255 143750 308550
13514C08550j32628a1526E39723A82689R1264A28708R7596F5523L83901A25867
$$ 308550 175922 -11526 539723 182689 273953 128708 226304 65523 449424 125867
13503A17397K47805l1466j56196j7211A7649a12355B26420J38364j76518n2619
$$ 117397 365202 333736 177540 160329 17649 -112355 226420 364784 188266 135647
13493A35647J33439O5516k8522j1770I4928k9473M61405k36978J65669j23580
$$ 135647 269086 334602 306080 294310 94928 65455 526860 289882 455551 331971
13483C31971j55197b7641j5853E09484j20187o9768H8573J89271J49440A83086
$$ 331971 176774 -27641 -43494 509484 389297 319529 88573 277844 427284 183086
13472A48595J18494j4531K893G4028J56547o002L94870A24042N3355K50983R9613
$$ 148595 267089 252558 255451 74028 230575 224573 619443 124042 177397 428380 527993
13461E27993k30497A47024L09150C6513K49539m0552r323P3340D322K95620N6609
$$ 527993 297496 147024 456174 36513 286052 245500 236177 309517 4322 299942 356551
13450C56551A3458L74243A40727M06312A15680J6959K14752i8535B37808B8167
$$ 356551 13458 387701 140727 547039 115680 132639 347391 -98535 237808 28167
13439B75625j5753J26364o6015J26008a536j19547B64982F4907K52521J02911
$$ 275625 259872 386236 320221 446229 -1536 -121083 264982 64907 317428 420339
13429D20339q213A75718a14626B10448M0913G6983Q5798L5713E9997J9483O01666
$$ 420339 412126 175718 -114626 210448 251361 76983 162781 198494 59997 79480 681146
13418F81146A56670J67216c9190C13369p0902j08520d2614B71407j29182L9029
$$ 681146 156670 323886 -39190 313369 242467 133947 -42614 271407 142225 181254
13408A81254H6323K13921K39692j90539D2944M65003C9362J28949c0253D0248
$$ 181254 86323 300244 539936 349397 42944 507947 39362 168311 -30253 40248
13397F2291L9290K43941q2598c9630C82060O5449A804K09320L75293A52400J35104
$$ 62291 101581 345522 262924 -39630 382060 447509 1804 211124 586417 152400 287504
13386B87504m272J33165k05529F0720K30625K15771B09198a53689C16513j4016
$$ 287504 283232 416397 210868 60720 291345 507116 209198 -153689 316513 302497
13376C02497p5849l5360e7812B4810J52549q5731L3923J64735h8419H833L46992
$$ 302497 226648 191288 -57812 24810 177359 91628 125551 290286 -88419 8833 355825
13365C55825O9331k12468n9319a03976H9955L1211E9004J21379J35390J02206
$$ 355825 425156 212688 153369 -103976 89955 121166 59004 180383 315773 417979
13355D17979j81222q3307J5399R9420j08466L11511j82895l4243p8716J27174
$$ 417979 236757 153450 168849 268269 159803 471314 288419 254176 175460 302634
13345C02634A8162K74773q1739K5033G7651K42483q1057J0906G0854K35042N532
$$ 302634 18162 292935 211196 236229 77651 320134 239077 249983 70854 305896 311428
13334C11428A40782J91223m6105A16068J20587I848L03469P00j53537K24631A83012
$$ 311428 140782 332005 285900 116068 236655 9848 313317 314017 160480 385111 183012
13322B22064R433J23435F6734L96955B16092H2500K39697J63768A05266J80652
$$ 222064 231497 354932 66734 463689 216092 82500 322197 485965 105266 285918
13312B85918J8858q0204f1578B25795L48756C1045K70567J79488c7528D50947
$$ 285918 304776 224572 -61578 225795 574551 31045 301612 481100 -37528 450947
13301A74850a3371B90279C5348J21161J07224R9582E5297J16156J87608F7408
$$ 174850 -13371 290279 35348 156509 263733 363315 55297 171453 359061 67408
13290B39442k4282B4933a3618B52891P4403d9972A85656C5262K3455J89514N458
$$ 239442 215160 24933 -13618 252891 327294 -49972 185656 35262 58717 248231 253689
13279B53689L11415B05511k4643a32501A9332O0231L23432c6569j5311A78049
$$ 253689 565104 205511 180868 -132501 19332 79563 402995 -36569 -51880 178049
13268C7184a21205A74343b92I2021l8164K2423C2123R5734D9495L1823f9686A01367
$$ 37184 -121205 174343 -292 92021 53857 76280 32123 127857 49495 81318 -69686 101367
13255H3605N7555M09766A90115J68717m5966a9548B09967h9567A40986J702N8206
$$ 83605 141160 550926 190115 358832 312866 -19548 209967 -89567 140986 142688 200894
13244B00894q2336J75876P8534a3318G6885K35634j04416i373B55573a11010A10125
$$ 200894 118558 294434 372968 -13318 76885 312519 208103 -9373 255573 -111010 110125
13232D52515J76398A62407o8208j8788d3486C91602c9704o1418r9287H631R2294
$$ 452515 628913 162407 94199 75411 -43486 391602 -39704 -101122 -200409 8631 100925
13221A00925Q1918j365Q756N0302g2886C41337b46449b4960B44065b885k21560
$$ 100925 182843 181478 190234 240536 -72886 341337 -246449 -24960 244065 -2885 -224445
13210b24445A59810b58145J0530A6496K43270J878E6265L37850r3701h466A69504
$$ -224445 159810 -258145 -247615 16496 259766 261644 56265 394115 300414 -8466 169504
13198C6238O331b17628c0848A86256g1628C19095G9364O0590L28863A98678d8462
$$ 36238 42569 -217628 -30848 186256 -71628 319095 79364 139954 468817 198678 -48462
13186B4375O4344K33935d3p519B55079E0940A7334P4913M9929J8101J96802A78344
$$ 24375 88719 322654 -43 -7562 255079 50940 17334 92247 142176 160277 357079 178344
13173D6547K6192a58824A30185M4720o7049a52321G2746b4211C05420H8490J38332
$$ 46547 72739 -158824 130185 174905 107856 -152321 72746 -24211 305420 88490 226822
13162B26822J9744A4884M53738A13223A1407b98646B54843k5594q7121N4531a1907
$$ 226822 246566 14884 468622 113223 11407 -298646 254843 229249 142128 196659 -11907
13150C83872f2572A03715J78166Q6312b39100O6142A76475R6167b09195D1850
$$ 383872 -62572 103715 281881 368193 -239100 -172958 176475 272642 -209195 41850
13139a20524E6267K97952F7337d9577A90518r3487a9153n8472A77961D8297L86946
$$ -120524 56267 354219 67337 -49577 190518 97031 -19153 -77625 177961 48297 435243
13128D35243G6348h4626j83282C23334K762i3869k359B9616J47773B7956P8581
$$ 435243 76348 -84626 -267908 323334 326096 -93869 -96228 29616 177389 27956 106537
13117A06537b43712q1225H0787A5711L482K83257b402B54668h589F3704J84717
$$ 106537 -243712 -324937 80787 15711 19193 302450 -2402 254668 -8589 63704 248421
13106B48421a2666m4718j29634B46194P346P9019g7224B32866p3408b88918A74358
$$ 248421 -12666 -57384 -187018 246194 253540 332559 -77224 232866 159458 -288918 174358
13094a25338A06472a66378A6878K76848q8256a29671A40578J69794A25421Q9530
$$ -125338 106472 -166378 16878 293726 205470 -129671 140578 310372 125421 214951
13084B14951i3036r4699B05349p6323j4567g7665A61012p5389J49109E5101K33151
$$ 214951 -93036 -187735 205349 129026 114459 -77665 161012 85623 234732 55101 288252
13073B88252A16108b12961I4227J67797D4952j430J3603h4054B22381a46001G3189
$$ 288252 116108 -212961 94227 262024 44952 43522 57125 -84054 222381 -146001 73189
13061C77309c3873C02177a9033D54649a45745A81234E4401g2098D73537a9575
$$ 377309 -33873 302177 -19033 454649 -145745 181234 54401 -72098 473537 -19575
13050A48194a45627q2653B44663J27034h4298C7383a1895B18746N8918D6290L00951
$$ 148194 -145627 -228280 244663 371697 -84298 37383 -11895 218746 277664 46290 347241
13039C47241G9567I776J72392b30874e9258B05568J96604r2313B6398P0633J35808
$$ 347241 79567 9776 182168 -230874 -59258 205568 402172 309859 26398 97031 232839
13028B32839p0857i4224B18002f4220H7938A367K56632a04101D37858A91554a33424
$$ 232839 161982 -94224 218002 -64220 87938 1367 257999 -104101 437858 191554 -133424
13016c1409O747A54599O0273a12101p221r2793E2576f5795p8240f4949F1419M3059
$$ -31409 -24662 154599 214872 -112101 -119322 -212115 52576 -65795 -144035 -64949 61419 104478
13004A04478J49892n2528F3420A8486J29367M5331J54454b7169m1600A16078J68627
$$ 104478 254370 201842 63420 18486 147853 193184 347638 -27169 -68769 116078 284705
12993B84705A14491M8374e819o0472j25870d2456o4648G362O5167M8740K37715
$$ 284705 114491 162865 -5819 -66291 -192161 -42456 -107104 7362 72529 121269 358984
12982C58984a05799A94075a26927e3869j34912A6378b84089B13139A7592b68229
$$ 358984 -105799 194075 -126927 -53869 -188781 16378 -284089 213139 17592 -268229
12971A82926j5125q3040a36428F6499O7633a839p9121C57410A58152j0768d9489
$$ 182926 167801 84761 -136428 66499 134132 -1839 -80960 357410 158152 147384 -49489
12959E0454J28789J06559b83811A12115E0405b80650a6435B13085a24675H59K112
$$ 50454 179243 285802 -283811 112115 50405 -280650 -16435 213085 -124675 859 2971
12948B971J73622R4707b24714C44023D6778e2855A16268d33236a85614a8719k48303
$$ 2971 176593 271300 -224714 344023 46778 -52855 116268 -433236 -185614 -18719 -267022
12937b67022A06962a47671H5062a45077a8675A72942n8996f1228B10731f4251
$$ -267022 106962 -147671 85062 -145077 -18675 172942 113946 -61228 210731 -64251
12926F1424J0510g0317k10073J15944e8456B0694M7812K5658K92264a16617m427
$$ 61424 71934 -70317 -280390 -164446 -58456 20694 68506 94164 386428 -116617 -121044
12915a21044b6888B06300j5019j1359e6789A94302a995r0261H4733j6429j9229
$$ -121044 -26888 206300 191281 179922 -56789 194302 -1995 -92256 84733 68304 49075
12904D9075f0500D3075b09966A37327g0793I2265a71049E0252o599K86991C5176
$$ 49075 -60500 43075 -209966 137327 -70793 92265 -171049 50252 43653 330644 35176
12892A90625C1626a1572A093Q2181R422J18454f919D0809K6131i390A2066b63285
$$ 190625 31626 -11572 1093 83274 92696 211150 -6919 40809 66940 -9390 12066 -263285
12879f149p5163B9279a75601e9839F9812e709G578a77283C25985I7325b97128
$$ -6149 -81312 29279 -175601 -59839 69812 -5709 7578 -177283 325985 97325 -297128
12867b81A66936a35661A87551f1587j48827J7189A81137E9689J3385b77621E2414
$$ -281 166936 -135661 187551 -61587 -210414 -193225 181137 59689 73074 -277621 52414
12855B05648O1803A15300a2415l0243A40454a72917D40208a9993F4213a38557
$$ 205648 267451 115300 -12415 -42658 140454 -172917 440208 -19993 64213 -138557
12844a10870k19292B02460H3609K80071j52707F774J21682c45572I1351f2933
$$ -110870 -330162 202460 83609 363680 210973 6774 128456 -345572 91351 -62933
12833I9219M1725c55824B68185h859D593a75139A68458i9278k95324B13479F3069
$$ 99219 140944 -355824 268185 -8859 4593 -175139 168458 -99278 -394602 213479 63069
12821c3551B51179r3575L9380F608a56874e1148l318n9887A21637g119A1157a20473
$$ -33551 251179 157604 196984 6608 -156874 -51148 -54466 -114353 121637 -7119 11157 -120473
12808h7636E6360A9107a14158O730A3317J03201E114d8912j27356P6140b749C37531
$$ -87636 56360 19107 -114158 -107428 13317 116518 5114 -48912 -176268 -100128 -2749 337531
12795E1990J84414j14040a23981A9223b23218K2123n1096B17575i0666G1439L8784
$$ 51990 236404 122364 -123981 19223 -223218 -201095 -252191 217575 -90666 71439 110223
12784A10223N805a55813e3084B48488d4785j23302O4632A46128f2451I0935a99659
$$ 110223 116028 -155813 -53084 248488 -44785 -168087 -103455 146128 -62451 90935 -199659
12772b30005K8034G2320d8983k42285H202c12187H534b97029B97714I2340a88904
$$ -230005 -201971 72320 -48983 -291268 8202 -312187 8534 -297029 297714 92340 -188904
12760C26770c06345a15640H1332a21864e5406k1757q4307A18587c83111C49327
$$ 326770 -306345 -115640 81332 -121864 -55406 -77163 -161470 118587 -383111 349327
12749B4830K28671f8899A61607J06419L0209i6082I6585L73448b53784I7585b33936
$$ 24830 253501 -68899 161607 268026 298235 -96082 96585 470033 -253784 97585 -233936
12737d629B8253J96929G1377e77198c5748C65299A56059G6484a368o5452B4524
$$ -4629 28253 225182 71377 -577198 -35748 365299 156059 76484 -1368 -66820 24524
12725a29145H2584a15666D8075K48791a75008A26481L55742G7417B1651b53106
$$ -129145 82584 -115666 48075 296866 -175008 126481 482223 77417 21651 -253106
12714A45687b34686A39612E9187a75397A39230A3771L7652g0766B82317a46425
$$ 145687 -234686 139612 59187 -175397 139230 13771 51423 -70766 282317 -146425
12703a54200O1190A39881P6539A00532e0443j0775A55384m2949k8002e3810A45939
$$ -154200 -93010 139881 216420 100532 -50443 -61218 155384 112435 84433 -53810 145939
12691B18528J68630A52793L1960k4175q562C3724k649L70604n7551c43077B40202
$$ 218528 387158 152793 184753 160578 152016 33724 31075 401679 344128 -343077 240202
12679a46659o279r5000A13226p476J99116a13529A85963c78200a34602a5690B8108
$$ -146659 -152938 -247938 113226 105750 304866 -113529 185963 -378200 -134602 -15690 28108
12667B50784B2717J63068C7436Q9703J9771D5956L24694c5545o6206H5019c2081
$$ 250784 22717 185785 37436 127139 146910 45956 370650 -35545 -101751 85019 -32081
12655i6240C75509c60560a42692B8295a06012e143bA05355k4024e8188A21866
$$ -96240 375509 -360560 -142692 28295 -106012 -5143 -2 105355 81331 -58188 121866
12643C9857a65486c3936I0833D2906J23874n3456L65981g080E2258h8732C10431
$$ 39857 -165486 -33936 90833 42906 166780 113324 479305 -7080 52258 -88732 310431
12631F39727a21696G541K08693F612J03647O1816L4437f4271C23291j23047a11347
$$ 639727 -121696 7541 216234 6612 110259 172075 206512 -64271 323291 200244 -111347
12619a73394F3223g4269o8582c7888B24566j09363J64625A34126f9989A37401
$$ -173394 63223 -74269 -142851 -37888 224566 115203 279828 134126 -69989 137401
12608D98296E9621f0908A30955f650A54885f823n4286k00530G6803Q196b59831
$$ 498296 59621 -60908 130955 -6650 154885 -6823 -61109 -261639 76803 84999 -259831
12596F5234a85770p375C0528N2943J12590a45497f0139A16425B1813d6223C24529
$$ 65234 -185770 -193145 30528 83471 196061 -145497 -60139 116425 21813 -46223 324529
12584a36967e8385B7295J16150P4369H8129a11034A71835k55J49608b5636C217
$$ -136967 -58385 27295 143445 217814 88129 -111034 171835 171580 321188 -25636 3217
12572c2627A7405J19238M5247P263c06249B11284b07383G6977f3956j0040c5428
$$ -32627 17405 136643 181890 189153 -306249 211284 -207383 76977 -63956 -73996 -35428
12560h9943l2285l0705B44650c13510A15652j3211h5418B79957A07247A2929b39213
$$ -89943 -122228 -152933 244650 -313510 115652 102441 -85418 279957 107247 12929 -239213
12548b00919A57540h9574K7940A0955J71823b27511c4896I4352R4612M6975h5593
$$ -200919 157540 -89574 -61634 10955 182778 -227511 -34896 94352 188964 235939 -85593
12536f0539A3520e7676I0995D2958K8716i9986p7695l4303O9467M8088a4489k51485
$$ -60539 13520 -57676 90995 42958 71674 -99986 -177681 -211984 -142517 -94429 -14489 -265974
12524b65974D160a05742b837p0078A12720C4313P7471c44244H4005d8181E8599
$$ -265974 4160 -105742 -2837 -72915 112720 34313 111784 -344244 84005 -48181 58599
12512c72088a75723c0746N682B53949c64826b8798C6024a2799A12971b86482B26059
$$ -372088 -175723 -30746 -25064 253949 -364826 -28798 36024 -12799 112971 -286482 226059
12500G4126a1050o7890r4123G857b33697h4684D968M78370k36397j08891a29159
$$ 74126 -11050 -78940 -173063 7857 -233697 -84684 4968 483338 246941 138050 -129159
12488g0927k08336A83955g0482A07224g2471k09681J25814B25996B6588J36600
$$ -70927 -279263 183955 -70482 107224 -72471 -282152 -156338 225996 26588 163188
12478A63188a7486B06261a54788C34688a33541D2920J84228c2574A10677J2957
$$ 163188 -17486 206261 -154788 334688 -133541 42920 227148 -32574 110677 123634
12468A23634e679B6963a92981O6952m5084A30855h7356E5883a29038A57063C0858
$$ 123634 -5679 26963 -192981 -126029 -171113 130855 -87356 55883 -129038 157063 30858
12456a94220H4902J5415d6249B9752i1425o1995B26746f7663B4901g2876B55842
$$ -194220 84902 100317 -46249 29752 -91425 -153420 226746 -67663 24901 -72876 255842
12444F5371k8795N6075g3773m0260m2118a5785a16B2784O9491B525c50330E7198
$$ 65371 36576 92651 -73773 -114033 -156151 -15785 -116 22784 92275 2525 -350330 57198
12431a60102f0742I025b1033A40851J1753E1339b44523e2271H6695B7190J04018
$$ -160102 -60742 9025 -21033 140851 152604 51339 -244523 -52271 86695 27190 131208
12420A31208a44244B17318C1053A521a83626B07199a89624B4595e6437K1220l5638
$$ 131208 -144244 217318 31053 1521 -183626 207199 -189624 24595 -56437 -35217 -70855
12409g0855j18914f4569B939J35757f4360A15175b6778B89830d6699A57817b98393
$$ -70855 -189769 -64569 2939 138696 -64360 115175 -26778 289830 -46699 157817 -298393
12397b22671g7419A42862a61554g2127j18303e9537c545r4731b7316J1839H8509
$$ -222671 -77419 142862 -161554 -72127 -190430 -59537 -3545 -98276 -27316 -15477 88509
12385b05184E8506L2305h2281j7749q8505g6313B2560h2666B1920K58858I6334
$$ -205184 58506 90811 -82281 -100030 -188535 -76313 22560 -82666 21920 280778 96334
12373A14696J42898D6633J20484h6612D6850a33785B24171j8489i7555E639K02656
$$ 114696 257594 46633 167117 -86612 46850 -133785 224171 205682 -97555 5639 208295
12362B08295o3161O4645J34101E0579a11077L9559a440B16937b96425h1636A82359
$$ 208295 145134 209779 343880 50579 -111077 -71518 -1440 216937 -296425 -81636 182359
12350e4565j07902H1064N3809b03233B35470i5887A70969a03815I4899O2908a08195
$$ -54565 -162467 81064 134873 -203233 235470 -95887 170969 -103815 94899 157807 -108195
12338a47849B0790d4958J9041A27456A6418K6830K1800Q4347f8653B00967i8548
$$ -147849 20790 -44958 -25917 127456 16418 43248 65048 149395 -68653 200967 -98548
12326A73556a30347D9210b12466I9957M1070E2969f8110p1851A65116c5456A55396
$$ 173556 -130347 49210 -212466 99957 141027 52969 -68110 -139961 165116 -35456 155396
12314B24942q8872J5802J93898j55642K40665I0545J6109K29113E5271Q9263K25428
$$ 224942 136070 151872 345770 190128 430793 90545 106654 335767 55271 144534 369962
12303C69962c1900A3812b23841A29116Q0493j8878J02772C3901K11530q9018L4094
$$ 369962 -31900 13812 -223841 129116 209609 190731 293503 33901 245431 156413 190507
12292A90507b17663h563j11042B39237J48793J74800b50112B14733C3695a25442
$$ 190507 -217663 -8563 -119605 239237 388030 562830 -250112 214733 33695 -125442
12281b19968A5621a04683l28347A01318f7384M423B46659L9007I5622b76613g7925
$$ -219968 15621 -104683 -433030 101318 -67384 -62961 246659 285666 95622 -276613 -77925
12269E6371J15303p6138B4170K27647O261o2828F4164J4444d9583F5438h9755
$$ 56371 171674 95536 24170 251817 258078 195250 64164 78608 -49583 65438 -89755
12257B47972G0067M07631h9932i890r7674F7932L24697j43524H6786K03292c4802
$$ 247972 70067 477698 -89932 -9890 -107564 67932 392629 249105 86786 290078 -34802
12245B40286j11988b16651L2603a1131A56046o5795J41107J29628g9685A24084
$$ 240286 128298 -216651 -184048 -11131 156046 90251 231358 360986 -79685 124084
12234i9096d1206A41907M688i1421c2816k13208I2692J44601A17863L66193A16459
$$ -99096 -41206 141907 146595 -91421 -32816 -246024 92692 237293 117863 484056 116459
12222C5660b20713D29236B4216K13162F1995J04100p0763D5754a22670e6940I5899
$$ 35660 -220713 429236 24216 237378 61995 166095 95332 45754 -122670 -56940 95899
12210a1885k51496B24175j7745n1211L5457Q2674E2967L93354A18116J5224K19177
$$ -11885 -263381 224175 206430 155219 190676 273350 52967 446321 118116 133340 352517
12199C52517j46236M9058J6734F6558M9104n3653J5404e9896B40814A2782J85650
$$ 352517 206281 255339 272073 66558 115662 62009 77413 -59896 240814 12782 198432
12188A98432a47813C04876a54852a2260A46582B1911G547K98756Q9820j52893
$$ 198432 -147813 304876 -154852 -12260 146582 21911 7547 306303 396123 243230
12178B43230j5482a60524B52051r4201a46641F37251a90065A14285K5439j3052
$$ 243230 227748 -160524 252051 157850 -146641 637251 -190065 114285 139724 126672
12168A26672o2454L52375H8975b7280C91464e5768l9952C00797A07030L62070
$$ 126672 64218 416593 88975 -27280 391464 -55768 -95720 300797 107030 469100
12158D69100B08554M4912C324N4713r712h3188C00668C0017K34800l3299K85732
$$ 469100 208554 253466 3324 58037 48325 -83188 300668 30017 264817 231518 517250
12147E17250h5957B63833j24328J51020m5176r1548Q4854a2969A6118J99012A02530
$$ 517250 -85957 263833 139505 290525 245349 153801 238655 -12969 16118 215130 102530
12135H6841K8884k688a28041K108B20438a06353D09918C4838c2646B31396n6507
$$ 86841 115725 113037 -128041 -125933 220438 -106353 409918 34838 -32646 231396 174889
12124A74889o2219h7706K3233k052n7312A3761K25713a52567J553f6439A26872
$$ 174889 112670 -87706 -64473 -66525 -123837 13761 239474 -152567 -151014 -66439 126872
12112C68095B9923J37258p1213a1157C606J52450i0288c4251B88996H389R2070
$$ 368095 29923 167181 95968 -11157 3606 156056 -90288 -34251 288996 8389 100459
12101A00459J17338a58654P305D26461H0766a70527A5483J90832F5376g4469A80003
$$ 100459 217797 -158654 -151349 426461 80766 -170527 15483 206315 65376 -74469 180003
12089I1342K5023a61693C29449A01707J07346a13110A0697a66329p1458b1880
$$ 91342 116365 -161693 329449 101707 209053 -113110 10697 -166329 -237787 -21880
12078C99279j96802M3612L25607B44662B3687J15524a12189d8374B59192b42444
$$ 399279 202477 246089 571696 244662 23687 139211 -112189 -48374 259192 -242444
12067d7586B50754B0096e50j6803C60083B9000P1683P759C91J83822G1209R8458
$$ -47586 250754 20096 -550 -17353 360083 29000 100683 108442 391 184213 71209 169667
12055A69667J6453p1867J67887C1195L24169j14836J16907j48206F9952J78849
$$ 169667 186120 114253 282140 31195 355364 240528 357435 209229 69952 248801
12045B48801B941L55980g0154B75927d9261A00487O3329c71899a2006C812J0761
$$ 248801 2941 358921 -70154 275927 -49261 100487 163816 -371899 -12006 3812 14573
12034A4573J86881M8412F6626K01167a49674A19582B7928b69401a26701B06548
$$ 14573 201454 249866 66626 267793 -149674 119582 27928 -269401 -126701 206548
12023b07445A29040O2699H9757K09868b17497D995b3258A80384h3912A3561a09803
$$ -207445 129040 191739 89757 299625 -217497 4995 -23258 180384 -83912 13561 -109803
12011A82686P1008b61935A47715r046d7786j21582O2799m4687B23223H7940J24468
$$ 182686 253694 -261935 147715 138669 -47786 -169368 -106569 -151256 223223 87940 212408
12000B12408e0941H2496h1540F3460J24659M089L98394B77575o4778o1613l7065
$$ 212408 -50941 82496 -81540 63460 188119 192208 590602 277575 212797 151184 114119
11989A14119l7727b95981A96986a05609J5470D3108d4273j55483R5206A63684
$$ 114119 76392 -295981 196986 -105609 -90139 43108 -44273 -199756 -104550 163684
11978A70257E2567M68064F1134R34g6054I9193b4495F1061B5911J49793M8644
$$ 170257 52567 520631 61134 62068 -76054 99193 -24495 61061 25911 175704 224348
11967B24348A11127E0385h8454a8843j2343I6500d04481K9571H9353J52359a13719
$$ 224348 111127 50385 -88454 -18843 -31186 96500 -404481 -374910 89353 241712 -113719
11955c9277j09685E8122a5302l13369F94h9660B03195q6086c9202p2723a6085
$$ -39277 -148962 58122 -15302 -328671 694 -89660 203195 117109 -39202 -111925 -16085
11943A47196D261h9937G3800a56396B08001n4287N7497c7011k11333A59625a90290
$$ 147196 4261 -89937 73800 -156396 208001 153714 211211 -37011 -248344 159625 -190290
11931A02601B5260L70684g9632H0330b6506p9534k6117I8364a29007P712C2026
$$ 102601 25260 395944 -79632 80330 -26506 -106040 -132157 98364 -129007 -121295 32026
11919h6614m9544O1772L1802q2614K9404j07928B196c32025E7094J91980A5155
$$ -86614 -136158 -74386 -42584 -125198 -95794 -203722 2196 -332025 57094 249074 15155
11907F982e4778C34002a22386j15789N5698a9867j10520l3341B237J39895j7036
$$ 6982 -54778 334002 -122386 -238175 -182477 -19867 -130387 -163728 2237 142132 125096
11896A25096g9062j05147K5977A08640a31069B27830k7116b01176K0606j9853
$$ 125096 -79062 -184209 -158232 108640 -131069 227830 200714 -201176 -180570 -200423
11886b00423M1351I7510J1798N6742b78015B31275b30200f0110b0316B60172a30431
$$ -200423 -159072 97510 109308 166050 -278015 231275 -230200 -60110 -20316 260172 -130431
11874b94906B37743b62081A34760b5774j79151B7559a45059B4508J12172o3484
$$ -294906 237743 -262081 134760 -25774 -204925 27559 -145059 24508 136680 73196
11864G3196g9587a1651G8592a03960I1009k7134c2346j43650A6756a11237r9973
$$ 73196 -79587 -11651 78592 -103960 91009 63875 -32346 -175996 16756 -111237 -211210
11853b11210A67766J5711e0073j17410I1101b62466B57923d2697q9253A58897
$$ -211210 167766 183477 -50073 -167483 91101 -262466 257923 -42697 -131950 158897
11842B3171b38698f307j14228j45957B38261e871E40917D9251A5145K40790J13333
$$ 23171 -238698 -6307 -120535 -266492 238261 -5871 540917 49251 15145 255935 369268
11831C69268F2005h6617m5622e4892B7298g9274a4079F5910k0486J73351O114
$$ 369268 62005 -86617 -132239 -54892 27298 -79274 -14079 65910 45424 218775 224889
11820B24889a59419A1870e9708k20921f2419A31670a87352q897e0272k18192a5971
$$ 224889 -159419 11870 -59708 -280629 -62419 131670 -187352 -196249 -50272 -268464 -15971
11808b7990A51307a56276j19170a7355m7392C7301d4875j0281j36839P7838E0682
$$ -27990 151307 -156276 -275446 -17355 -64747 37301 -44875 -55156 -191995 -114157 50682
11796D8911j4547f2516j68632B9763N2378d94008c871k46663r3110r3654J93730
$$ 48911 34364 -62516 -231148 29763 82141 -494008 -3871 -250534 -343644 -437298 -243568
11785b43568D2037a61633B67149b94782B6755N0687b7321l13375a41139e7276
$$ -243568 42037 -161633 267149 -294782 26755 77442 -27321 -340696 -141139 -57276
11774h3046K573f027B52126a0610o180m91257b40166Q9483A53868a49605k17232
$$ -83046 -80473 -6027 252126 -10610 -16790 -508047 -240166 -150683 153868 -149605 -366837
11763c66837A31202a03956F1653k6855N0825l2399e3011A94831a50076B0202c8306
$$ -366837 131202 -103956 61653 34798 85623 53224 -53011 194831 -150076 20202 -38306
11751c58471a60938H9756R0654i4125A59154A1435a71074A22036A1347f0658k51667
$$ -358471 -160938 89756 180410 -94125 159154 11435 -171074 122036 11347 -60658 -312325
11740c12325A90592C1808c499F9228a03965Q309j12332d9419k44733i1515B86822
$$ -312325 190592 31808 -3499 69228 -103965 -95656 -207988 -49419 -294152 -91515 286822
11728i1323B01781B3850f8810J0275B67932a76228C2605b46107A26928K06234
$$ -91323 201781 23850 -68810 -58535 267932 -176228 32605 -246107 126928 333162
11718C33162e0861a456A80627G1563a25639A29731c05234J50148D00346f7298
$$ 333162 -50861 -1456 180627 71563 -125639 129731 -305234 -155086 400346 -67298
11707d0666H4590d1505q5500I596a45572j88978B35691G0559f7438I8518h0966
$$ -40666 84590 -41505 -127005 9596 -145572 -334550 235691 70559 -67438 98518 -80966
11695a64273A05015J76764g4779l6924G8302O1422a11690I9874J41747e9215A05599
$$ -164273 105015 281779 -74779 -111703 78302 139724 -111690 99874 241621 -59215 105599
11683b14199N8635C5637b41741e0046j89356E6293b31820C11242j35435b05347
$$ -214199 -155564 35637 -241741 -50046 -239402 56293 -231820 311242 175807 -205347
11672f2013D3346Q9471B16P9922c0107n5100B01677J55509A69482A6001J24263
$$ -62013 43346 132817 216 80138 -30107 -85207 201677 357186 169482 16001 140264
11661A40264h1456C29254n2042D0459g7954L8768C7225J37733p5383B4157b51635
$$ 140264 -81456 329254 277212 40459 -77954 -39186 37225 174958 99575 24157 -251635
11649H3748K83472F7170c68814a76127e3151C5997c393B28628a66503B01489a9642
$$ 83748 367220 67170 -368814 -176127 -53151 35997 -3393 228628 -166503 201489 -19642
11637E6419L6944h9992C04893h7542A67418J6422c1507k34358B85533A14807d0798
$$ 56419 93363 -89992 304893 -87542 167418 183840 -31507 -265865 285533 114807 -40798
11625A78905b9519k15471A31902b74675Q9316l37717K57989E482c39417C8441
$$ 178905 -29519 -244990 131902 -274675 -185359 -523076 -265087 5482 -339417 38441
11614H1034O9131a07565D1661P6723f9393B47749i0895n7712d1371K0406r241
$$ 81034 150165 -107565 41661 118384 -69393 247749 -90895 -148607 -41371 -20965 -30206
11603c0206A69911F6877M03855D8227J30529J72295k4478b67105g6927B14496
$$ -30206 169911 66877 470732 48227 178756 351051 326573 -267105 -76927 214496
11592A48011a24869A17168a60703O3287j2217D8219J41087a55007j17284a02135
$$ 148011 -124869 117168 -160703 -97416 -109633 48219 189306 -155007 -272291 -102135
11581a05046j17708R4534q8087H2234h8639F9667A387J24926K9594J40278b88266
$$ -105046 -222754 -128220 -216307 82234 -88639 69667 1387 126313 155907 296185 -288266
11569B18949n0710p475J99743p3251m5437O2253G4478J18198a66687A77043b36026
$$ 218949 168239 160764 360507 287256 241819 304072 74478 192676 -166687 177043 -236026
11557B54079A128b25008C00698H6124a13702A56295b43189J04630A33934O2117
$$ 254079 1128 -225008 300698 86124 -113702 156295 -243189 -138559 133934 196051
11547A96051b13522B96596g7321H0854c0382A40653j4928a37392I2969a32392
$$ 196051 -213522 296596 -77321 80854 -30382 140653 125725 -137392 92969 -132392
11536A89260c201A40072c56017A89081a97208O5718A02821e4155b4802D9020J98911
$$ 189260 -3201 140072 -356017 189081 -197208 -131490 102821 -54155 -24802 49020 247931
11525B47931a40324C44897E655e0970D9461N833A865J09048c22798B37199D2125
$$ 247931 -140324 344897 5655 -50970 49461 55294 1865 110913 -322798 237199 42125
11513B8375K29721p7906E0417K0245a8743C09398D9814d4425F9673g6023G1592
$$ 28375 258096 180190 50417 70662 -18743 309398 49814 -44425 69673 -76023 71592
11501E1415b2960C33573j20949h9398j37591Q2917k9228G9255a38498A12874d1396
$$ 51415 -22960 333573 212624 -89398 -226989 -144072 -173300 79255 -138498 112874 -41396
11489A37919J4743d04307C31521j38062H2330g6561A13078J91870a23873C96032
$$ 137919 152662 -404307 331521 193459 82330 -76561 113078 304948 -123873 396032
11478B88767m4206k2465A01957A0008N4482c73171A91134j8449C2638J75764Q611
$$ 288767 244561 222096 101957 10008 64490 -373171 191134 172685 32638 208402 217013
11467B17013a31737A32304K82914g6770c2441m9230q809B96753D4698k0530a00217
$$ 217013 -131737 132304 415218 -76770 -32441 -81671 -90480 296753 44698 24168 -100217
11455c19624A38127a79451A85052H3171k4687K14244a22359K5721d5194l16607
$$ -319624 138127 -179451 185052 83171 58484 272728 -122359 -96638 -45194 -361801
11445c61801f2814C32667O9122B9494a43518A05118K46246c8693D1593J90396
$$ -361801 -62814 332667 401789 29494 -143518 105118 351364 -38693 41593 231989
11435B31989d6478m9880k76372H1263l3395a43154A0906Q2019d79A05626L43641
$$ 231989 -46478 -96358 -372730 81263 47868 -143154 10906 92925 -479 105626 449267
11424D49267a27152B43429C5117d105k05720q0297A0612g6423q8759H8421a05452
$$ 449267 -127152 243429 35117 -4105 -209825 -290122 10612 -76423 -165182 88421 -105452
11412a71931D53767g719p2625i577j78061A12629E0871a60311M5770I6253r495
$$ -171931 453767 -7719 -80344 -9577 -187638 112629 50871 -160311 -114541 96253 86758
11401H6758c2913B0523Q9384h1289K1769A0596a90127c7142A32050C8083K1474
$$ 86758 -32913 20523 109907 -81289 -59520 10596 -190127 -37142 132050 38083 59557
11390E9557d5467A43916d1063D02521a267E8202N4352R5803a25745A36602d0512
$$ 59557 -45467 143916 -41063 402521 -1267 58202 112554 208357 -125745 136602 -40512
11378E8630N4790M023i8983A7374a70275A19004D0471P3842a76625c5666B54094
$$ 58630 113420 117443 -98983 17374 -170275 119004 40471 114313 -176625 -35666 254094
11366F8358l875a25359B26916I1359m5322a77432A24312J38500H9391b4422k10039
$$ 68358 64483 -125359 226916 91359 46037 -177432 124312 262812 89391 -24422 -234461
11355b34461G3093N2020b52900G1421K15702H4744b80435n3970J59517a2348A04399
$$ -234461 73093 125113 -252900 71421 287123 84744 -280435 -334405 -174888 -12348 104399
11343d69398d6346j70597A82089e0058k53977a0581A13225C1536L2968k062L6948
$$ -469398 -46346 -216943 182089 -50058 -304035 -10581 113225 31536 64504 62442 99390
11332I9390d77172f7151A73218b96588J16598N571D358a01289B03472F6081A0341
$$ 99390 -477172 -67151 173218 -296588 -179990 -174419 4358 -101289 203472 66081 10341
11320f678q5382C84105E1550g1115G816P5005J45433F3101J34487m5790d88519
$$ -6678 -92060 384105 51550 -71115 7816 82821 228254 63101 197588 151798 -488519
11308e3886A88216c9884l83442B16774a67557A98638e6732G3339a58550I300g4948
$$ -53886 188216 -39884 -423326 216774 -167557 198638 -56732 73339 -158550 9300 -74948
11296a74677o5808B03791i5579j37238D0631K7717d8320A21362a8389H9184K72836
$$ -174677 -240485 203791 -95579 -232817 40631 68348 -48320 121362 -18389 89184 362020
11285C62020j14687b92342J26522l6986l727e222j95376G1121a51951j1772P2632
$$ 362020 247333 -292342 -165820 -202806 -206533 -5222 -200598 71121 -151951 -163723 -91091
11274i1091B38601a5989m20922a17937k13305n6602C78014h3971k19964J39622
$$ -91091 238601 -15989 -436911 -117937 -331242 -387844 378014 -83971 -303935 -164313
11264a64313e8568b6688B37819G1985b18515J0550g8808G6145C5756a49149j60415
$$ -164313 -58568 -26688 237819 71985 -218515 -207965 -78808 76145 35756 -149149 -309564
11253c09564g3440A78655h8762b0876r0750A33534f0036k00097d9178B18923a18567
$$ -309564 -73440 178655 -88762 -20876 -111626 133534 -60036 -260133 -49178 218923 -118567
11241b17965B1580a3880j66816n9397j03779a7699j98982A42942E7480b11813
$$ -217965 21580 -13880 -180696 -240093 -343872 -17699 -216681 142942 57480 -211813
11230d8079o3795A71141i04A23425b60376e9834B9261a04115L2888B26771A0432
$$ -48079 -111874 171141 -904 123425 -260376 -59834 29261 -104115 -71227 226771 10432
11218g8297L1996r3159n4873D76996a17755k20283a61494F3504a38028B5580a25496
$$ -78297 -46301 -139460 -194333 476996 -117755 -338038 -161494 63504 -138028 25580 -125496
11206I4644a48825I3856m3626J93167I7327m7895b40754A06200a5760j49018C9252
$$ 94644 -148825 93856 50230 243397 97327 49432 -240754 106200 -15760 -164778 39252
11194A06122k466b34653b2617p7290k33292f8336k38664h2146K8794a394j81897
$$ 106122 103656 -234653 -22617 -99907 -333199 -68336 -307000 -82146 -53352 -1394 -183291
11183a83291j621A04061j6083a48352j85247A32957b92659g7973A9887a05360
$$ -183291 -184912 104061 87978 -148352 -333599 132957 -292659 -77973 19887 -105360
11172I4523c1948j72863d4126I7229a2124j65509A07229g2979B30568r9719B3766
$$ 94523 -31948 -204811 -44126 97229 -12124 -177633 107229 -72979 230568 130849 23766
11160f8804H4700b7885j73870B37559J0864A03862f3847G0670C1509a12239k7083
$$ -68804 84700 -27885 -201755 237559 248423 103862 -63847 70670 31509 -112239 -139322
11149a39322a470k49807K8557A62309A0822J06739c34140a44485a8845k95173
$$ -139322 -1470 -251277 -222720 162309 10822 117561 -334140 -144485 -18845 -314018
11139c14018J01623A60265a13680B2991J11419i8354M7185B49268L0269j10004
$$ -314018 -212395 160265 -113680 22991 134410 -98354 -51169 249268 279537 169533
11129A69533b64072C6483b5093l091A17589a55712A30361n3158b06622A02830
$$ 169533 -264072 36483 -25093 -28184 117589 -155712 130361 77203 -206622 102830
11118d1511l6442I51a3421A9012e9959F8217J22950a94142f3076G5919c27798
$$ -41511 -77953 951 -13421 19012 -59959 68217 191167 -194142 -63076 75919 -327798
11106e789A09070a81244A80888e8745B7964J78278e7844F6157d3889H585J99619
$$ -5789 109070 -181244 180888 -58745 27964 206242 -57844 66157 -43889 8585 208204
11095B08204g4441F3131b38603d7618B64114J3784a05425l5375B42615b9205A57013
$$ 208204 -74441 63131 -238603 -47618 264114 277898 -105425 -140800 242615 -29205 157013
11083a19911B79560j18968P7106A11469a75908B09164F5241J81813b39548A526
$$ -119911 279560 160592 237698 111469 -175908 209164 65241 247054 -239548 1526
11072A01011M3570B5045R2269m3759M4773c2921E875K73176B8869J17501j51K4582
$$ 101011 144581 25045 117314 73555 118328 -32921 5875 279051 28869 146370 146219 170801
11060A70801m6437m3932N49732l01164o4371k5967C3806J38138o3243K9881J46886
$$ 170801 124364 80432 630164 329000 264629 238662 33806 171944 108701 138582 285468
11049B85468o0266J686q3864J98204j26272O4236J79139J4129G3982N18505j45745
$$ 285468 225202 226888 143024 341228 214956 279192 458331 472460 73982 592487 446742
11038D46742J6559L82906B19154H0831K32845M9577L66654k53020K0406L78819
$$ 446742 463301 846207 219154 80831 313676 363253 729907 476887 497293 876112
11028H76112q7538m8163j86467k10867J03688M38994l88711j90875N12217C16135
$$ 876112 788574 740411 553944 343077 446765 885759 497048 306173 818390 316135
11017G18240k23677o785j31445K99587R9261C07000N19204m07961j01081L93144
$$ 718240 494563 487778 356333 655920 755181 307000 826204 418243 317162 710306
11007G10306l21133Q1251J91703l07926J40743J27485j12353j31214L63162B17240
$$ 710306 389173 470424 662127 354201 494944 622429 510076 378862 742024 217240
10996D07845j38048I5273J64002K15914J33046R7776k80309B03226J27060J31453
$$ 407845 269797 95273 259275 475189 608235 706011 425702 203226 330286 461739
10986D61739M0481j49564P8814N43416l88351j03936m5171K42954j46513k29726
$$ 461739 502220 352656 431470 974886 586535 482599 437428 680382 533869 304143
10976C04143L83256K67083m65783B41779J90487J16552K02855R0055N9205l07966
$$ 304143 687399 954482 488699 241779 432266 548818 751673 841728 900933 592967
10966E92967L71069k78008K63010j11677R7349q8706K8004K64220J01990J75961
$$ 592967 964036 686028 949038 837361 934710 846004 874008 1138228 1240218 1416179
10956A416179M2513L71118Q9899K3814p2173J95752j26927J58807m53863K6290
$$ 1416179 1458692 1829810 1919709 1943523 1871350 2067102 1940175 2098982 1645119 1671409
10946A671409L7509j62768m16222K21272J71171K9746j44751J07925m23295M39426
$$ 1671409 1708918 1546150 1129928 1351200 1522371 1552117 1407366 1515291 1091996 1531422
10936A531422k59451j68775n3380l50649L68784k37994j51859K50201D31600J86069
$$ 1531422 1271971 1103196 1049816 699167 1067951 829957 678098 928299 431600 617669
10926F17669k97569n4247n3349J25859a0479A75107e9513C58847A17475Q5930
$$ 617669 320100 265853 212504 338363 -10479 175107 -59513 358847 117475 203405
10916B03405a15701A20194a18382D25633A25854m1092K69512f0986q1145a5611
$$ 203405 -115701 120194 -118382 425633 125854 84762 354274 -60986 -142131 -15611
10905a48733b1600B38785n4369d7751C10257a11238I3846J51293D2442c46779
$$ -148733 -21600 238785 184416 -47751 310257 -111238 93846 245139 42442 -346779
10894E20212a0792j91851G0988b3706o6760C7110J06716l7758a74728e4134l1802
$$ 520212 -10792 -202643 70988 -23706 -90466 37110 143826 106068 -174728 -54134 -85936
10883h5936I5805a44756e8794C6500f4594A91682b19490d1756H1248a11730p7589
$$ -85936 95805 -144756 -58794 36500 -64594 191682 -219490 -41756 81248 -111730 -189319
10872a89319d1942G6476a04681N1952j71951A9280g0334J2047k66159B7784Q7663
$$ -189319 -41942 76476 -104681 -52729 -224680 19280 -70334 -58287 -324446 27784 115447
10861A15447a74367A33215c38563Q014A27445a06332e0847A73335a80476i0057
$$ 115447 -174367 133215 -338563 -330549 127445 -106332 -50847 173335 -180476 -90057
10850b99703a43708n8485a5744j14969J9383b364D7090N1279e498k79254R0396
$$ -299703 -143708 -202193 -15744 -130713 -111330 -2364 47090 98369 -5498 -284752 -194356
10839a94356l7633H3714K14228B3376d2134a8073B9001O1341K14120b18426G7654
$$ -194356 -231989 83714 297942 23376 -42134 -18073 29001 90342 304462 -218426 77654
10827a66231D8953b69337B00993d9175L84j28663d2705j39542B84383A03465K8334
$$ -166231 48953 -269337 200993 -49175 -48791 -177454 -42705 -182247 284383 103465 131799
10816A31799c4754j32044a1238n69568h05l85924E5725b31716A48636b75059d7099
$$ 131799 -34754 -166798 -11238 -580806 -805 -386729 55725 -231716 148636 -275059 -47099
10804A17470a1609B12221b4279B59020a31756M5975E9422c4078k7031A40634J00620
$$ 117470 -11609 212221 -24279 259020 -131756 -85781 59422 -34078 -61109 140634 241254
10793B41254j20004a8610o3876j93266b6535A28605d9396n2092I9437b29636e3488
$$ 241254 121250 -18610 -82486 -275752 -26535 128605 -49396 -101488 99437 -229636 -53488
10781A83685b7055O652C482J4057R7267B2858g6735I4823a72617j7331G6852J80372
$$ 183685 -27055 -20403 3482 17539 114806 22858 -76735 94823 -172617 -189948 76852 257224
10769B57224c58662C8626f421F2752L8541b28152N2795C2402Q2741a02694l0981
$$ 257224 -358662 38626 -6421 62752 101293 -228152 -175357 32402 115143 -102694 -133675
10758a33675A64412a69944A44207F6327b36944J15214B25143G0134a11896K3184
$$ -133675 164412 -169944 144207 66327 -236944 -121730 225143 70134 -111896 -88712
10748h8712a9136j92923Q7490L1329j48156e6001l63817b07474A61028b55396
$$ -88712 -19136 -212059 -124569 -93240 -241396 -56001 -419818 -207474 161028 -255396
10737A80754b44765J19504D22651i214q1820L4656b4512k4798B7157K6221b4181
$$ 180754 -244765 -125261 422651 -9214 -91034 -56378 -24512 -49310 27157 53378 -24181
10725B7496J71050e5333l72973H8153B6577a92360A63741c2512G0442c26452c717
$$ 27496 198546 -55333 -428306 88153 26577 -192360 163741 -32512 70442 -326452 -3717
10713A80757b7443k4280j68602A176b28785E2773a50319C2778b3823A36361J01778
$$ 180757 -27443 -51723 -220325 1176 -228785 52773 -150319 32778 -23823 136361 238139
10702B38139B8523c74721A42858a75528P3361k82233D12a63391j68769P2739k21223
$$ 238139 28523 -374721 142858 -175528 -102167 -384400 412 -163391 -332160 -259421 -480644
10691d80644b9540D8203b34279r2134B1914M34522a32286C96486c02582e9460
$$ -480644 -29540 48203 -234279 -326413 21914 456436 -132286 396486 -302582 -59460
10680b83119G7100a86885H5469a97568A20840a56467r6543d1066l01619J51658
$$ -283119 77100 -186885 85469 -197568 120840 -156467 -253010 -41066 -342685 -191027
10670a91027A10790a46554c6691i012A85505a11689c6865j95571E9177Q2250c26124
$$ -191027 110790 -146554 -36691 -9012 185505 -111689 -36865 -232436 59177 141427 -326124
10658a90956j52681B52437H1655f6166k22326e3204m8048j29410c8223j15642
$$ -190956 -343637 252437 81655 -66166 -288492 -53204 -101252 -230662 -38223 -153865
10648a53865A71547a58763o4551Q1638A37716c9927A64055A3547b99643A89859
$$ -153865 171547 -158763 -223314 -141676 137716 -39927 164055 13547 -299643 189859
10637a76484G7497K02878D5528a08446k65132J13765J20367I7851c56602J08883
$$ -176484 77497 280375 45528 -108446 -373578 -259813 -139446 97851 -356602 -247719
10627b47719L3127E5465a41231H7761b4363j06434a5709l41075a07485c045j57709
$$ -247719 -214592 55465 -141231 87761 -24363 -130797 -15709 -356784 -107485 -3045 -160754
10616a60754A43178B9867L5933J18081c8296B48959B3536a45848p1047o884b5759
$$ -160754 143178 29867 65800 183881 -38296 248959 23536 -145848 -216895 -223779 -25759
10604b73999a4074l56769G0851f5165b8765m5971c3442F7800a31816k10123i0910
$$ -273999 -14074 -370843 70851 -65165 -28765 -74736 -33442 67800 -131816 -341939 -90910
10592e1618j10342B1838N7890b877j91723E0780d40282a78313Q6297c4625L053
$$ -51618 -161960 21838 79728 -2877 -194600 50780 -440282 -178313 -92016 -34625 -31572
10581c1572d972E153g2742k54444a28273G710a43839C34633a36157a1770j89746
$$ -31572 -4972 5153 -72742 -327186 -128273 7710 -143839 334633 -136157 -11770 -201516
10570b01516E9766J8877d10872J94934P3584A63077B5376f3020m5536p6810C3624
$$ -201516 59766 78643 -410872 -215938 -142354 163077 25376 -63020 -108556 -185366 33624
10558b68749h8479j44075L6363F4027c1755A36756b21740b1500m9529r9881A00179
$$ -268749 -88479 -232554 -196191 64027 -31755 136756 -221740 -21500 -71029 -170910 100179
10546h1370k49230C62711e1104m9542A63293a8066o8899k31881A73296b49634
$$ -81370 -330600 362711 -51104 -100646 163293 -18066 -86965 -318846 173296 -249634
10535a63556L7733j35400A81435a9743q0411k48652a58912a6578l90599a41618
$$ -163556 -125823 -261223 181435 -19743 -100154 -348806 -158912 -16578 -407177 -141618
10524A97715f0623B99722c7804C6907a78065j2392j42092i5964n1070e9886E0790
$$ 197715 -60623 299722 -37804 36907 -178065 -190457 -332549 -95964 -147034 -59886 50790
10512A0771a50121n5360I789a28029A42945c12036a10195B15291E4012f6878m72773
$$ 10771 -150121 -205481 9789 -128029 142945 -312036 -110195 215291 54012 -66878 -539651
10501e39651b24063j3371a2367B19025J22825b04321E7519e7788k44687o3535
$$ -539651 -224063 -237434 -12367 219025 341850 -204321 57519 -57788 -302475 -366010
10491c66010J72488I766f1123J7073l88532a34324A85693b07795Q493p456g9060
$$ -366010 -193522 9766 -61123 -44050 -432582 -134324 185693 -207795 -199302 -206758 -79060
10479a07811k05460H9367O4752m4817J5313l7186P882c43956A11761a54693a9429
$$ -107811 -313271 89367 154119 109302 124615 87429 95311 -343956 111761 -154693 -19429
10467A32520J95186h6367e127q3251F896L59567K87841j65076N3797j48953b0780
$$ 132520 327706 -86367 -5127 -88378 6896 366463 654304 489228 543025 394072 -20780
10455D89506A07933J38146f1272A44230J77511A7614f786j064j35431A1635d91212
$$ 489506 107933 246079 -61272 144230 321741 17614 -6786 -7850 -143281 11635 -491212
10443a43375A29504c7388A93829B8776b11018j53927J15684f9556B80086b63274
$$ -143375 129504 -37388 193829 28776 -211018 -364945 -249261 -69556 280086 -263274
10432C0618M276J00593L9356H1481K4101c27420e8326A76978i4428a7012A47560
$$ 30618 34894 135487 174843 81481 105582 -327420 -58326 176978 -94428 -17012 147560
10420a77472C4018a63610A69528n0690i6971g191B83921c13564A9807a47473e9405
$$ -177472 34018 -163610 169528 118838 -96971 -7191 283921 -313564 19807 -147473 -59405
10408D29155A20739f0066G6264a21231c5652n7095J4251r5857b4679j65266D42492
$$ 429155 120739 -60066 76264 -121231 -35652 -92747 -78496 -174353 -24679 -189945 442492
10396a06302E08501i5538l9844I223f2289A42092i6544b2309j14591J0772B24500
$$ -106302 508501 -95538 -135382 9223 -62289 142092 -96544 -22309 -136900 -126128 224500
10384b3973q9777o6959B7416a88702A64965c43318A74542m5288K73049e4770I3361
$$ -23973 -113750 -180709 27416 -188702 164965 -343318 174542 129254 402303 -54770 93361
10372a64391A10079R5528H6039P9688a47564q4261E2872b18447a7738l7350A10658
$$ -164391 110079 205607 86039 165727 -147564 -231825 52872 -218447 -17738 -55088 110658
10360C93564O1815A24235E160J99922H6900P9670O473D8909J4752K72102j47234
$$ 393564 455379 124235 5160 205082 86900 166570 173043 48909 63661 335763 188529
10349A88529J51203l8406A05780I944M79504A17154a13353B27279N703A4991O8231
$$ 188529 339732 301326 105780 9944 489448 117154 -113353 227279 232982 14991 83222
10338H3222K62466A54210R2013o2009J06223J33725A27761d721B37756Q9551F8058
$$ 83222 345688 154210 246223 184214 290437 424162 127761 -4721 237756 327307 68058
10326F26346j61231q0949o4309m5788K65062C6253O9956a49697j58814B00943
$$ 626346 465115 384166 319857 274069 539131 36253 106209 -149697 -308511 200943
10315a54044L2494B68910E2276a22890E2396n331a27641C12420G3144m95j0964
$$ -154044 -121550 268910 52276 -122890 52396 47065 -127641 312420 73144 72649 61685
10304F1685C443K20326K1755H3943h060C26909H9586Q7890p3768J21821n1926
$$ 61685 3443 223769 245524 83943 -8060 326909 89586 177476 103708 225529 173603
10293A73603E3059O591b94331b8663n0305F4139b72185J09119E2342j2117a39841
$$ 173603 53059 59650 -294331 -28663 -78968 64139 -272185 -163066 52342 40225 -139841
10281c8024k25224B64920a07235A8448a05961l51978c2358l5406A32412g0579
$$ -38024 -263248 264920 -107235 18448 -105961 -457939 -32358 -67764 132412 -70579
10270a10152G6940J13079e8470A06084b60362J10391Q858a5241F2493b99768A05029
$$ -110152 76940 190019 -58470 106084 -260362 -149971 -141113 -15241 62493 -299768 105029
10258d65169G7367A3210m406J89582a49649B20902K45664A30230a08609r1305
$$ -465169 77367 13210 8804 198386 -149649 220902 466566 130230 -108609 -199914
10248a99914d2166k624A81464b0732k17228B36317d10581A9072L13965n3214I3205
$$ -199914 -42166 -44790 181464 -20732 -237960 236317 -410581 19072 333037 279823 93205
10236B44316L7276L0036m2460c708A28431R3152b26856R8403L7882n1847e8285
$$ 244316 281592 311628 269168 -3708 128431 221583 -226856 -128453 -90571 -142418 -58285
10224b5593j5897I6472a72424A39997o3715a20259l9822j8703n4696A4038C821
$$ -25593 -41490 96472 -172424 139997 76282 -120259 -160081 -178784 -233480 14038 3821
10212A88638K30981b5582k59129j143a22408b6200D1455I076J7789c18356j75876
$$ 188638 419619 -25582 -284711 -285854 -122408 -26200 41455 9076 26865 -318356 -494232
10201d94232b4670B02888b06994d4472p1277F8038b48594A53752F599J55110i036
$$ -494232 -24670 202888 -206994 -44472 -115749 68038 -248594 153752 6599 161709 -9036
10189b51551B19485e81607f5476j18420C8191a27145m981F5142a24063q5455e2610
$$ -251551 219485 -581607 -65476 -183896 38191 -127145 -132126 65142 -124063 -209518 -52610
10177f1166o15393b20145b3532l97500J35922e7998C6299a39652k22340d2138
$$ -61166 -676559 -220145 -23532 -421032 -285110 -57998 36299 -139652 -361992 -42138
10166g1153j6572C6614g8053j07117d0602m9691C3277e5770A88629b10521A12305
$$ -71153 -87725 36614 -78053 -185170 -40602 -90293 33277 -55770 188629 -210521 112305
10154d39771a57673j12547A90237a67412M9446j3782L1502k8946D2055g649J802
$$ -439771 -157673 -270220 190237 -167412 -117966 -131748 -100246 -129192 42055 -7649 -5847
10143e847k77481N4117J6707C1324L32181a86461j68790B8071c64614d5808a594
$$ -5847 -283328 -229211 -212504 31324 363505 -186461 -355251 28071 -364614 -45808 -1594
10131a97213i6450d6637F4400f7000H901K20209a26259k7681B1605J63541f0763
$$ -197213 -96450 -46637 64400 -67000 8901 229110 -126259 -153940 21605 185146 -60763
10119G6058B1499M20335g10A08546a50246E3424a1186l62661J3323E5545b99524
$$ 76058 21499 441834 -710 108546 -150246 53424 -11186 -373847 -360524 55545 -299524
10107f0073r1502d3723O852k68587O2637a13469e0261A09018d0288n6141A15162
$$ -60073 -151575 -43723 -36871 -305458 -242821 -113469 -50261 109018 -40288 -96429 115162
10095c30101m8701a45528F8424b43273C1968h9235E1327J02642c92926P9109B56750
$$ -330101 -378802 -145528 68424 -243273 31968 -89235 51327 153969 -392926 -313817 256750
10083e45453J99937J11769G4934J1948a16682k0488B2856J39548J12024b79713
$$ -545453 -345516 -233747 74934 86882 -116682 -137170 22856 162404 274428 -279713
10072a81039g6428j78225a15755B60404D5596J24783D3455j9444a3454n7610A47170
$$ -181039 -76428 -254653 -115755 260404 45596 170379 43455 24011 -13454 -71064 147170
10060g2813B05509b42708J01988H4274b59893a5323C47186c0214l6511m8829D4066
$$ -72813 205509 -242708 -140720 84274 -259893 -15323 347186 -30214 -66725 -115554 44066
10048H7631a01597H7580k881a44306f3075k2308m6323m8697r4076I4433c62433
$$ 87631 -101597 87580 84699 -144306 -63075 -85383 -131706 -180403 -274479 94433 -362433
10036a69568A939L995J67785b98165h0495j85760A08395m9292K62327a78863B768
$$ -169568 1939 5934 173719 -298165 -80495 -266255 108395 59103 321430 -178863 2768
10024a66703P7834j51905j10074R7119a1041j05073j9930A04841g8924l50035
$$ -166703 -88869 -240774 -350848 -253729 -11041 -116114 -136044 104841 -78924 -428959
10014d28959D13324b07940m6949A11096K09237h9867G5042a93655G1760i4542
$$ -428959 413324 -207940 -254889 111096 320333 -89867 75042 -193655 71760 -94542
10003a84909c4474k65935J47881j8573r6557k05507a13168b4451j32024d6953
$$ -184909 -34474 -300409 -152528 -171101 -267658 -473165 -113168 -24451 -156475 -46953
9992G6333r894h0375n7257j26336O0672f8846E7145b82042b5169B35546b76814
$$ 76333 66439 -80375 -137632 -263968 -203296 -68846 57145 -282042 -25169 235546 -276814
9980A45345o3873K64312j53887b87882A92098a51412P918A07871J18306i8334
$$ 145345 81472 345784 191897 -287882 192098 -151412 -143494 107871 226177 -98334
9969C06732r4901d9105k74227F1993i9487B80164b40820B071M5855a94338O2301
$$ 306732 211831 -49105 -323332 61993 -99487 280164 -240820 2071 47926 -194338 -132037
9958a32037B5130J45616a4235p8102M0255j10684B3619d28089B28884G6176d5865
$$ -132037 25130 170746 -14235 -92337 -52082 -162766 23619 -428089 228884 76176 -45865
9946d16818e3339j62845c0767k19193B75138a25574l2663c5587l31501J34165
$$ -416818 -53339 -216184 -30767 -249960 275138 -125574 -158237 -35587 -367088 -232923
9936b32923P7657q9577j3565c9195o3133c4541H3935J58861d2538j16080e5031
$$ -232923 -155266 -244843 -258408 -39195 -102328 -34541 83935 242796 -42538 -158618 -55031
9924b33647c4940j68787N1337L7865p9988E458f0210k49671J54857A22632l6324
$$ -233647 -34940 -203727 -152390 -114525 -194513 5458 -60210 -309881 -155024 122632 86308
9913H6308f2700j57004c8872G6396c10838i3949A47566b59668k32270e5808q9198
$$ 86308 -62700 -219704 -38872 76396 -310838 -93949 147566 -259668 -491938 -55808 -145006
9902a45006q3974J10132L3668j60815Q5980j2905F4674b95429a01513m1176K2496
$$ -145006 -228980 -118848 -85180 -245995 -160015 -172920 64674 -295429 -101513 -142689 -120193
9891a20193B57893f1768j29283B19780a82339K8222k02086E0733a89705A85519
$$ -120193 257893 -61768 -191051 219780 -182339 -154117 -356203 50733 -189705 185519
9880A87786O6569B7788c02688o6824A4037h4981k54199d7692n3916A84784a55817
$$ 187786 254355 27788 -302688 -369512 14037 -84981 -339180 -47692 -101608 184784 -155817
9868b3442B84377a14302E9273c01677A45315a7998A6489c3819D0840a6044A61801
$$ -23442 284377 -114302 59273 -301677 145315 -17998 16489 -33819 40840 -16044 161801
9856A51540b53311A97539P2186a01613C34061c43763a66225c7019q1996J3352
$$ 151540 -253311 197539 269725 -101613 334061 -343763 -166225 -37019 -119015 -105663
9846a05663I8555c57621a59231f6388I2093c6235k56264B26361o2302D863P2245
$$ -105663 98555 -357621 -159231 -66388 92093 -36235 -292499 226361 164059 4863 77108
9835G7108c0914k25789O6640j07976L2979k04000K09883R5781j10390c7622A1623
$$ 77108 -30914 -256703 -190063 -298039 -265060 -469060 -259177 -163396 -273786 -37622 11623
9823C5521g229j33028F3931b81688A21830J90806e2161M160o3571j80111P8932
$$ 35521 -7229 -140257 63931 -281688 121830 312636 -52161 -48001 -111572 -291683 -212751
9812b12751a8587l10004i5697f153q3419o1524A19821a05449j26063L4141l89522
$$ -212751 -18587 -328591 -95697 -6153 -89572 -151096 119821 -105449 -231512 -197371 -586893
9801e86893J74102a99877H4945e56826a42888j02344i3783a3207C59809b037A4435
$$ -586893 -412791 -199877 84945 -556826 -142888 -245232 -93783 -13207 359809 -2037 14435
9789I3612m3317b47053h5907c1557J3325B19158D1182a72166E946b51868b4991
$$ 93612 50295 -247053 -85907 -31557 -18232 219158 41182 -172166 5946 -251868 -24991
9777a37582b941B20695a42900j52833J39691K3134N7343n18495A06385p156b5351
$$ -137582 -2941 220695 -142900 -295733 -156042 -132908 -75565 -594060 106385 99229 -25351
9765A9420a19567b0121N60A57617c49126e7271l0777q994J5944k53338e7612m4852
$$ 19420 -119567 -20121 -19561 157617 -349126 -57271 -88048 -97042 -81098 -334436 -57612 -102464
9753a02464l55955N1497A32864b02904A14214a50532B38547D7161d5781l06715
$$ -102464 -458419 -406922 132864 -202904 114214 -150532 238547 47161 -45781 -352496
9743c52496d093B25775d23864A13229b5799l35190a27280e5009A33978a07938
$$ -352496 -4093 225775 -423864 113229 -25799 -360989 -127280 -55009 133978 -107938
9732E95839a75170n9771A39646a30522A06421c35525a60701a7949j42836A49820
$$ 595839 -175170 -234941 139646 -130522 106421 -335525 -160701 -17949 -160785 149820
9721a90797C347a23762D0441c5356j91598d2417p2029a9041j40664L9556n8470
$$ -190797 3347 -123762 40441 -35356 -226954 -42417 -114446 -19041 -159705 -120149 -178619
9710a78619N5716K8020m2138e6193k92823a25881F9274d84129G891a17234J6705
$$ -178619 -122903 -94883 -137021 -56193 -349016 -125881 69274 -484129 7891 -117234 -100529
9699a00529D1469J97000h9337A61910D548J19705k3428N1647g1050A51036b86128
$$ -100529 41469 238469 -89337 161910 4548 124253 100825 152472 -71050 151036 -286128
9687d36986G7953k0708K08755b16700p4740d832A84825b46875a06724l00150J03186
$$ -436986 77953 57245 266000 -216700 -291440 -4832 184825 -246875 -106724 -406874 -303688
9676c03688m4212Q651a28004k10501B6143J3516Q9869c27204B6896a39268K2586
$$ -303688 -347900 -339249 -128004 -338505 26143 39659 129528 -327204 26896 -139268 -116682
9665a16682A40124Q1532J55111c73977g0099J3527A94125G2197g2615G3068a36483
$$ -116682 140124 221656 376767 -373977 -70099 -56572 194125 72197 -72615 73068 -136483
9653f5728b0381A04454d34267h5996j53552C1908D244Q0304Q790J0227j3223b95052
$$ -65728 -20381 104454 -434267 -85996 -239548 31908 4244 84548 93338 103565 90342 -295052
9640H7217C3944f5038A63965a52957j16265E9394h4597q1714P2803l0850A8334
$$ 87217 33944 -65038 163965 -152957 -269222 59394 -84597 -166311 -93508 -124358 18334
9628B24798E3355h0955I2737b88640j31139D0234J30414m4735b9095q5877D8894
$$ 224798 53355 -80955 92737 -288640 -419779 40234 170648 125913 -29095 -114972 48894
9616g9346j8227a3783m07810H3193B6671I146a69025q1378A75592m3877a29474
$$ -79346 -97573 -13783 -421593 83193 26671 9146 -169025 -250403 175592 131715 -129474
9604a79196q2608J20913L0928n3922J037p4683q5204R1262h0681r3168j46470
$$ -179196 -261804 -140891 -109963 -163885 -162848 -237531 -322735 -231473 -80681 -173849 -320319
9593c20319J06271A76645q6572e4935C4968g5026k49159J33433M169j52430E3179
$$ -320319 -214048 176645 90073 -54935 34968 -75026 -324185 -190752 -186583 -339013 53179
9581A65349c50830a01715C1906c403C34630h4729B6964d37645K00689d3496g961
$$ 165349 -350830 -101715 31906 -3403 334630 -84729 26964 -437645 -236956 -43496 -7961
9569A68024c5715m6306D08615h641j7558G5178a93265f6963j78886a1145j21383
$$ 168024 -35715 -82021 408615 -8641 -26199 75178 -193265 -66963 -245849 -11145 -132528
9558a32528r2293G7821K7621Q5663p1277j8592b75849B7201i305l9712j74451
$$ -132528 -224821 77821 105442 191105 119828 101236 -275849 27201 -9305 -49017 -223468
9547b23468h391j13243M7806a8179B65601a60451f2656A72624f098k07576C7765
$$ -223468 -8391 -121634 -73828 -18179 265601 -160451 -62656 172624 -6098 -213674 37765
9535e9172E9614B866a90606b4865j89554q9265M6366m5743J33271O2622k94384
$$ -59172 59614 2866 -190606 -24865 -214419 -303684 -257318 -303061 -169790 -107168 -401552
9524d01552H6285c5045G7647a75746P8177n1013p9252a5167k49645C8460a97310
$$ -401552 86285 -35045 77647 -175746 -97569 -148582 -227834 -15167 -264812 38460 -197310
9512a41434A43378a3763j5055l38939e8352j71501o609l7734J21443A38831b63988
$$ -141434 143378 -13763 -28818 -367757 -58352 -229853 -236462 -274196 -152753 138831 -263988
9500a18947p90j04310g7281r2362H2511b3728j52746e0436k17200B9328a8798
$$ -118947 -119737 -224047 -77281 -169643 82511 -23728 -176474 -50436 -267636 29328 -18798
9488g1405B24366C1762a6164r1424A20707f38q7042H6697b7500A91322e0308B15316
$$ -71405 224366 31762 -16164 -107588 120707 -638 -87680 86697 -27500 191322 -50308 215316
9475b75077D7242a19234j82850q9329a29811G1168b05034A35979a0714B77694
$$ -275077 47242 -119234 -302084 -391413 -129811 71168 -205034 135979 -10714 277694
9464a5415C6704K8991e84A07176c5823k14311M0780i7593a0205E084g2956h217
$$ -15415 36704 65695 -584 107176 -35823 -250134 -209354 -97593 -10205 5084 -72956 -8217
9451D6047e9833n5564H2158b98684J38372A17044n7662a30011k53731D7941a87771
$$ 46047 -59833 -115397 82158 -298684 -160312 117044 59382 -130011 -383742 47941 -187771
9439d14086J66071F1739Q8382m6930l3495b81020J15325k58116L6551a00151M1051
$$ -414086 -248015 61739 150121 103191 69696 -281020 -165695 -423811 -387260 -100151 -59100
9428e9100H0450a46126k16494B20648h8913l52270K06785k58398a80041N4068
$$ -59100 80450 -146126 -362620 220648 -88913 -441183 -234398 -492796 -180041 -125973
9418a25973n5418B77302A4041b63380C58421a06712c4727j13314I4043f1709E4771
$$ -125973 -181391 277302 14041 -263380 358421 -106712 -34727 -148041 94043 -61709 54771
9406c22756A37836a55617E2394k5149J21948L7492b7230G6447l504b3746p4222
$$ -322756 137836 -155617 52394 27245 149193 186685 -27230 76447 72943 -23746 -97968
9395i7968B01660a38651K2353o8406E1763a453E2958h8761q8526H8049a84212
$$ -97968 201660 -138651 -116298 -184704 51763 -1453 52958 -88761 -177287 88049 -184212
9383H8166Q8346c3822j10329e2913F8597b93372A09688a40554j35735a12869A38857
$$ 88166 176512 -33822 -144151 -52913 68597 -293372 109688 -140554 -276289 -112869 138857
9371c43039Q8994g1004l2293j79578A59173a01200M6725j99090B0886J18897Q154
$$ -343039 -254045 -71004 -103297 -282875 159173 -101200 -54475 -253565 20886 139783 147937
9360A47937b19472i469n8169k13347g3605C6064c00055i1754C0666b43534J19145
$$ 147937 -219472 -9469 -67638 -280985 -73605 36064 -300055 -91754 30666 -243534 -124389
9349a24389A06374a07322e1996D1752j3720a36227b6707l81470F7404a03484k19552
$$ -124389 106374 -107322 -51996 41752 28032 -136227 -26707 -408177 67404 -103484 -323036
9338c23036D3946d74197b17385B3759f4841A46582b20215O8552J1452L2322j51054
$$ -323036 43946 -474197 -217385 23759 -64841 146582 -220215 -151663 -140211 -107889 -258943
9327b58943M8001j17561B29456d24655A90592a37429j71715J51173b828p3147
$$ -258943 -210942 -328503 229456 -424655 190592 -137429 -309144 -157971 -2828 -75975
9317g5975A345d1478A2466J74448n4255B796b99051I1807a80552d7018F4557a36373
$$ -75975 1345 -41478 12466 186914 132659 2796 -299051 91807 -180552 -47018 64557 -136373
9304a90434A61655b37792B39813b19300C28804e441B3854b07694j82129I811b6263
$$ -190434 161655 -237792 239813 -219300 328804 -5441 23854 -207694 -389823 9811 -26263
9292g1454A12356b65400k8670j05746a52921A20320b86036a24574j69968B43797
$$ -71454 112356 -265400 -294070 -399816 -152921 120320 -286036 -124574 -294542 243797
9281b7051H6436h6031k5491A73568p8993d53404J03624C25135A49670E0315b83685
$$ -27051 86436 -86031 -111522 173568 94575 -453404 -349780 325135 149670 50315 -283685
9269b43251A7028a7558j38796m9072a1041E6516e9343E312M4390g7253A12212
$$ -243251 17028 -17558 -156354 -205426 -11041 56516 -59343 5312 49702 -77253 112212
9257H677P8606k7699d25926a57226K4511d9666A62866b87596J07859e4521j11437
$$ 8677 87283 59584 -425926 -157226 -132715 -49666 162866 -287596 -179737 -54521 -165958
9246a65958A66816n748b25090E4898L7407e5932K933k01648l5444P6614B04138
$$ -165958 166816 161068 -225090 54898 92305 -55932 -52999 -254647 -290091 -213477 204138
9234d0033B61684a48331j0034p5407i2820J7008C77212d14017F1363C0558a68820
$$ -40033 261684 -148331 -158365 -233772 -92820 -75812 377212 -414017 61363 30558 -168820
9222E7158a50609C2123a80028P2059B30880f7407e782k93698C09358g0551K1432
$$ 57158 -150609 32123 -180028 -107969 230880 -67407 -5782 -299480 309358 -70551 -49119
9211d9119C97272h0715l40932A12779D0610c06944A3033a39412F2775j7217N2138
$$ -49119 397272 -80715 -421647 112779 40610 -306944 13033 -139412 62775 45558 97696
9200I7696a16630B3254a1147A31250J45052C6444N5385a04693a8183j90160m8334
$$ 97696 -116630 23254 -11147 131250 276302 36444 91829 -104693 -18183 -208343 -256677
9189b56677D730J25410c63679B22236E2776a6955A19270h8030n4692L1889b3800
$$ -256677 4730 130140 -363679 222236 52776 -16955 119270 -88030 -142722 -110833 -23800
9177a71477d2219m2655K6963j9825j21833J7672O3340N8159j53086F2242a06678
$$ -171477 -42219 -84874 -57911 -77736 -199569 -181897 -118557 -60398 -213484 62242 -106678
9165B15283a0375m53046J84177e1238C43187f3008B72442b39250l4537A07736
$$ 215283 -10375 -463421 -279244 -51238 343187 -63008 272442 -239250 -273787 107736
9154a04859k46659J41800A83661F3058b20087A16862c8751H4938k3148J36751
$$ -104859 -351518 -209718 183661 63058 -220087 116862 -38751 84938 61790 198541
9144A98541a61870r1221A75731o0954e4612l30059i450j1083I9641J39618a71621
$$ 198541 -161870 -253091 175731 114777 -54612 -384671 -9450 -20533 99641 239259 -171621
9132b21994j5810B2821a08460k41359a14416H1061P0119b12522b7467D8564L5364
$$ -221994 -237804 22821 -108460 -349819 -114416 81061 151180 -212522 -27467 48564 83928
9121H3928a40812A53028a20462j43168B05560c90796R8417b7496E6394F783a46234
$$ 83928 -140812 153028 -120462 -263630 205560 -390796 -292379 -27496 56394 6783 -146234
9109C11515p8051b8502j00967M5321j94169b954j82138c774I4303d90093K34314
$$ 311515 233464 -28502 -129469 -84148 -278317 -2954 -185092 -3774 94303 -490093 -255779
9098b55779A31222a26134B80387g0866A92050l6150E3062L05999f5343k11310
$$ -255779 131222 -126134 280387 -70866 192050 155900 53062 359061 -65343 -276653
9088b76653a05231A3103a01297G4227J37011d1121n4429I368c24770J33444D6651
$$ -276653 -105231 13103 -101297 74227 211238 -41121 -95550 9368 -324770 -191326 46651
9076i2918m3821B05256n8309c9319E5993a70017N8293I211e7986B18097H9904
$$ -92918 -136739 205256 146947 -39319 55993 -170017 -111724 9211 -57986 218097 89904
9064C0466d3428l33671I2032l2746N8603a43625O5823L8367G6363g032A52010
$$ 30466 -43428 -377099 92032 59286 117889 -143625 -77802 -39435 76363 -7032 152010
9052B8543b476l5259I4563K4525h760A16118b38347e8061o0816d0283H4014L32813
$$ 28543 -2476 -37735 94563 119088 -8760 116118 -238347 -58061 -118877 -40283 84014 416827
9040D16827g3142h802j36775C11014d10014D0649a87200N0724l0792l9585c6625
$$ 416827 -73142 -8802 -145577 311014 -410014 40649 -187200 -136476 -167268 -206853 -36625
9028A8309J73966B0132I09a77473A05a74112j0465q5214l2395B6978o935a35222
$$ 18309 192275 20132 909 -177473 105 -174112 -184577 -269791 -302186 26978 20043 -135222
9015a39030l8925A01071a31440J7088j4291j69811k28201J86095J15584g6007
$$ -139030 -177955 101071 -131440 -114352 -128643 -298454 -526655 -340560 -224976 -76007
9004h1085A17132b85770D252a06538J9976q8802A58947b27538j4386A6705b11255
$$ -81085 117132 -285770 4252 -106538 -86562 -175364 158947 -227538 -241924 16705 -211255
8992i9741K9454A8111b06981b4521E4847i4449A00118m7054A4005O6429f1937
$$ -99741 -70287 18111 -206981 -24521 54847 -94449 100118 53064 14005 80434 -61937
8980A54620a50574A72161q1487d6990B38143a14809K108e3654A34681a13679j20622
$$ 154620 -150574 172161 90674 -46990 238143 -114809 -112701 -53654 134681 -113679 -234301
8969b34301N9335j33245a46435j08988d2007G8827f8401k53548a31235k96465
$$ -234301 -174966 -308211 -146435 -255423 -42007 78827 -68401 -321949 -131235 -427700
8959d27700f7993j04955g4232B4703b62123M2475i7665B08893g3896j45669D5542
$$ -427700 -67993 -172948 -74232 24703 -262123 -219648 -97665 208893 -73896 -219565 45542
8947b81866A30741L9072a0919n2534C82365q3003F1787b01153A39855J5060F5171
$$ -281866 130741 169813 -10919 -63453 382365 299362 61787 -201153 139855 154915 65171
8935F4840b34134P8527B5116M1564K2811b89564e7439l99711E5039c57020a56687
$$ 64840 -234134 -155607 25116 66680 89491 -289564 -57439 -457150 55039 -357020 -156687
8923b31709H7817b35466f8709H2448J23677J0621j4795K1610m2880G0914K5111
$$ -231709 87817 -235466 -68709 82448 206125 216746 201951 223561 180681 70914 96025
8912I6025K57909j19666L38790B46406K96858J11400P45071P55103J872895M540379
$$ 96025 353934 234268 573058 246406 543264 654664 1399735 2154838 4027733 8568112
8902H568112l914861k143703j021405o22735C48827n2382J32254b18549I4773
$$ 8568112 4653251 2509548 1488143 865408 348827 296445 428699 -218549 94773
8892G4779i2020o5427A47874K26855j68194c6172H1867J28829a680I8182Q049
$$ 74779 -92020 -157447 147874 374729 206535 -36172 81867 210696 -1680 98182 106231
8881A06231c100q8046j36494A11014b3081A06259a32160N0037q0545d3969j43332
$$ 106231 -3100 -91146 -227640 111014 -23081 106259 -132160 -82123 -162668 -43969 -187301
8870a87301a9940F0941h3258j97326B55170c26249J41630A6130P9249D4630I616
$$ -187301 -19940 60941 -83258 -280584 255170 -326249 -184619 16130 95379 44630 9616
8858A28684j093a9100r8170j04683h4500A20060G982J22484B5064a15683j97907
$$ 128684 127591 -19100 -117270 -221953 -84500 120060 7982 130466 25064 -115683 -313590
$$ [...]
##END NTUPLES=NMR SPECTRUM
##END=
