
##TITLE=AC1178_popayan-inza-3-cauca-CINAH12013_5891437_CKZ91HNEDv
##JCAMPDX= 6.0         $$ Bruker NMR JCAMP-DX V2.0
##DATA TYPE= NMR SPECTRUM
##DATA CLASS= NTUPLES
##ORIGIN= BRUKER
##OWNER= Administrator
$$ 1.72 TOPSPIN		Version 2.1
$$ 2012-04-03 00:59:54.453 -0500  Administrator@TOPSPIN
$$ Compression mode = diff/dup
##.OBSERVE FREQUENCY= 400.13188235
##.OBSERVE NUCLEUS= ^1H
##.ACQUISITION MODE= SIMULTANEOUS (DQD)
##.ACQUISITION SCHEME= undefined
##.AVERAGES= 64
##.DIGITISER RES= 22
##SPECTROMETER/DATA SYSTEM= spect
##.PULSE SEQUENCE= noesygpps1d.comp
##.SOLVENT NAME= COFFEE_meoh
##.SHIFT REFERENCE= INTERNAL, COFFEE_meoh, 1, 14.96845
##AUDIT TRAIL= $$ (NUMBER, WHEN, WHO, WHERE, PROCESS, VERSION, WHAT)
$$ ##TITLE= Audit trail, TOPSPIN		Version 2.1
$$ ##JCAMPDX= 5.01
$$ ##ORIGIN= Bruker BioSpin GmbH
$$ ##OWNER= Administrator
$$ $$ C:\Bruker\TOPSPIN/data/COFFEE/nmr/AC1178_popayan-inza-3-cauca-CINAH12013_5891437_CKZ91HNEDv/12/pdata/1/auditp.txt
$$ ##AUDIT TRAIL=  $$ (NUMBER, WHEN, WHO, WHERE, PROCESS, VERSION, WHAT)
(   1,<2012-04-03 00:59:49.000 -0500>,<Administrator>,<TOPSPIN>,<go>,<TOPSPIN 2.1>,
      <created by zg
	started at 2012-04-03 00:48:16.968 -0500,
	POWCHK enabled, PULCHK disabled,
       configuration hash MD5:
       1A 1E CE 29 27 FD 77 03 67 4E F0 E3 C4 B2 CB 90
       data hash MD5: 64K
       CF E1 87 A5 FE FC 9D E3 32 65 96 52 D2 FD 4A 8A>)
(   2,<2012-04-03 00:59:51.984 -0500>,<Administrator>,<TOPSPIN>,<proc1d>,<TOPSPIN 2.1>,
      <Start of raw data processing
       efp LB = 0.3 FT_mod = 6 PKNL = 1 PHC0 = 0 PHC1 = 0 SI = 128K 
       data hash MD5: 128K
       EF 35 B1 1B 9E F0 08 DE 08 1C 1A 44 02 E6 EA 64>)
(   3,<2012-04-03 00:59:53.453 -0500>,<Administrator>,<TOPSPIN>,<proc1d>,<TOPSPIN 2.1>,
      <pk PHC0 = 35.10681 PHC1 = 0 
       data hash MD5: 128K
       CD 63 C1 82 EC 57 4F B4 0F AC 53 66 41 6E A9 3F>)
(   4,<2012-04-03 00:59:53.765 -0500>,<Administrator>,<TOPSPIN>,<proc1d>,<TOPSPIN 2.1>,
      <abs ABSG = 1 
       data hash MD5: 128K
       4F 26 0C 69 C4 EF ED 8F F7 65 0A 8E EF F4 D1 AD>)
(   5,<2012-04-03 00:59:53.875 -0500>,<Administrator>,<TOPSPIN>,<proc1d>,<TOPSPIN 2.1>,
      <abs ABSG = 2 
       data hash MD5: 128K
       9A DC 6E 4B A4 03 A6 68 82 FB EC 06 7B 94 19 B6>)
(   6,<2012-04-03 00:59:53.984 -0500>,<Administrator>,<TOPSPIN>,<proc1d>,<TOPSPIN 2.1>,
      <abs ABSG = 3 
       data hash MD5: 128K
       1F 2D 80 7F A0 17 37 85 85 96 8D 24 27 FA 2D ED>)
(   7,<2012-04-03 00:59:54.265 -0500>,<Administrator>,<TOPSPIN>,<proc1d>,<TOPSPIN 2.1>,
      <abs ABSG = 4 
       data hash MD5: 128K
       92 12 07 9A F4 02 0C FE 25 73 14 BD F8 E3 57 D3>)
(   8,<2012-04-03 00:59:54.343 -0500>,<Administrator>,<TOPSPIN>,<proc1d>,<TOPSPIN 2.1>,
      <abs ABSG = 5 
       data hash MD5: 128K
       9B AB D6 CF 13 F3 33 6B BA DB 9D F7 0A C2 9A 15>)
$$ ##END=
$$ 
$$ $$ hash MD5
$$ $$ 94 BF 20 E4 79 50 8C 9A FB 42 8E B2 97 AE B5 96
##$RELAX= 
##$RELAX= 
##$RELAX= 
##$RELAX= 
##$RELAX= 
##$RELAX= 
##$RELAX= 
$$ [...]
##$TP07= 0
##$TPNAME0= <>
##$TPNAME1= <>
##$TPNAME2= <>
##$TPNAME3= <>
##$TPNAME4= <>
##$TPNAME5= <>
##$TPNAME6= <>
##$TPNAME7= <>
##$TPOAL= (0..7)
0.5 0.5 0.5 0.5 0.5 0.5 0.5 0.5
##$TPOFFS= (0..7)
0 0 0 0 0 0 0 0
##$TUNHIN= 0
##$TUNHOUT= 0
##$TUNXOUT= 0
##$USERA1= <user>
##$USERA2= <user>
##$USERA3= <user>
##$USERA4= <user>
##$USERA5= <user>
##$V9= 5
##$VALIST= <valist>
##$VCLIST= <CCCCCCCCCCCCCCC>
##$VD= 0
##$VDLIST= <DDDDDDDDDDDDDDD>
##$VPLIST= <PPPPPPPPPPPPPPP>
##$VTLIST= <TTTTTTTTTTTTTTT>
##$WBST= 2048
##$WBSW= 25
##$XGAIN= (0..3)
0 0 0 0
##$XL= 0
##$YL= 0
##$YMAX_a= 13119749
##$YMIN_a= -6037771
##$ZGOPTNS= <>
##$ZL1= 120
##$ZL2= 120
##$ZL3= 120
##$ZL4= 120
##$ABSF1= 14.96845
##$ABSF2= -5.584081
##$ABSG= 5
##$ABSL= 3
##$ALPHA= 0
##$AQORDER= 0
##$ASSFAC= 0
##$ASSFACI= 0
##$ASSFACX= 0
##$ASSWID= 0
##$AUNMP= <proc_prof1d_extract.lims>
##$AXLEFT= 0
##$AXNAME= <>
##$AXNUC= <1H>
##$AXRIGHT= 0
##$AXTYPE= 0
##$AXUNIT= <>
##$AZFE= 0.1
##$AZFW= 0.1
##$BCFW= 0
##$BC_mod= 0
##$BYTORDP= 0
##$COROFFS= 0
##$CY= 15
##$DATMOD= 1
##$DC= 0
##$DFILT= <>
##$DTYPP= 0
##$F1P= 0
##$F2P= 0
##$FCOR= 0.5
##$FTSIZE= 131072
##$FT_mod= 6
##$GAMMA= 0
##$GB= 0
##$INTBC= 1
##$INTSCL= 1
##$ISEN= 128
##$LB= 0.3
##$LEV0= 0
##$LPBIN= 0
##$MAXI= 10000
##$MC2= 0
##$MEAN= 0
##$ME_mod= 0
##$MI= 0
##$NCOEF= 0
##$NC_proc= -3
##$NLEV= 6
##$NOISF1= 0
##$NOISF2= 0
##$NSP= 0
##$NTH_PI= 0
##$NZP= 0
##$OFFSET= 14.96845
##$PC= 1
##$PHC0= 35.10681
##$PHC1= 0
##$PH_mod= 1
##$PKNL= yes
##$PPARMOD= 0
##$PPDIAG= 0
##$PPIPTYP= 0
##$PPMPNUM= 2147483647
##$PPRESOL= 1
##$PSCAL= 4
##$PSIGN= 0
##$PYNMP= <proc.py>
##$REVERSE= no
##$SF= 400.130004866526
##$SI= 131072
##$SIGF1= 0
##$SIGF2= 0
##$SINO= 400
##$SIOLD= 131072
##$SPECTYP= <>
##$SREGLST= <1H.CDCl3>
##$SSB= 0
##$STSI= 131072
##$STSR= 0
##$SW_p= 8223.68421052632
##$SYMM= 0
##$S_DEV= 0
##$TDeff= 65536
##$TDoff= 0
##$TI= <>
##$TILT= no
##$TM1= 0
##$TM2= 0
##$TOPLEV= 0
##$USERP1= <user>
##$USERP2= <user>
##$USERP3= <user>
##$USERP4= <user>
##$USERP5= <user>
##$WDW= 1
##$XDIM= 131072
##$YMAX_p= 479690353
##$YMIN_p= -408495575
##$CURPLOT= <Network HP LaserJet P1505>
##$CURPRIN= <$Network HP LaserJet P1505>
##$DFORMAT= <normdp>
##$LAYOUT= <+/1D_H.xwp>
##$LFORMAT= <normlp>
##$PFORMAT= <normpl>
##$SURQMSG= 1
$$ End of Bruker specific parameters
$$ ---------------------------------
##NTUPLES= NMR SPECTRUM
##VAR_NAME=  FREQUENCY,     SPECTRUM/REAL,   SPECTRUM/IMAG
##SYMBOL=    X,             R,               I
##VAR_TYPE=  INDEPENDENT,   DEPENDENT,       DEPENDENT
##VAR_FORM=  AFFN,          ASDF,            ASDF
##VAR_DIM=   131072,        131072,          131072
##UNITS=     HZ,            ARBITRARY UNITS, ARBITRARY UNITS
##FACTOR=    0.0627417313425165, 1,          1
##FIRST=     8223.62146879498, 3360,         -96606
##LAST=      0,             6533,            -96809
##MIN=       0,             -408495575,      0
##MAX=       8223.62146879498, 479690353,    0
$$ Real data points
##PAGE= N=1
##DATA TABLE= (X++(R..R)), XYDATA
$$ [...]
$$ plain form
62948 3056570 2999061 2950282 2909808 2877108 2852409 2836511 2829716 2831078 2838768 2851230 2867999 2889433
62936 2889433 2915723 2946176 2979403 3014092 3049577 3085632 3121782 3157037 3190436 3221711 3251037
62925 3251037 3278133 3301855 3320686 3333241 3338265 3334640 3321751 3299545 3267893 3226132 3173573 3110330
62913 3110330 3037443 2956525 2869658 2779298 2687619 2595769 2504068 2412870 2322996 2235499 2151402
62902 2151402 2071573 1996437 1925807 1859415 1797648 1741388 1690948 1645430 1603275 1563395 1525815
62891 1525815 1491397 1460889 1434087 1409950 1387535 1366517 1346698 1327571 1308864 1291121 1275064
62880 1275064 1260564 1246879 1233686 1221085 1208660 1195485 1181334 1167027 1153098 1138843 1123429
62869 1123429 1107553 1093207 1081632 1071974 1062193 1051217 1040069 1030760 1024139 1019074 1013826 1007807 1001689
$$ packed form
62948C056570n7509m8779m0474l2700k4699j5898o795J362P690J2462J6769K1434
62936B889433K6290L0453L3227L4689L5485L6055L6150L5255L3399L1275K9326
62925C251037K7096K3722J8831J2555N024l625j2889k2206l1652m1761n2559o3243
62913C110330p2887q0918q6867r0360r1679r1850r1701r1198q9874q7497q4097
62902B151402p9829p5136p0630o6392o1767n6260n0440m5518m2155l9880l7580
62891A525815l4418l0508k6802k4137k2415k1018j9819j9127j8707j7743j6057
62880A275064j4500j3685j3193j2601j2425j3175j4151j4307j3929j4255j5414
62869A123429j5876j4346j1575r658r781j0976j1148r309o621n065n248o019o118
$$ plain form
62856 1001689 996250 991791 988440 986125 984221 982004 979613 977884 977014 976147 974573 972588 970699 968687
62842 968687 966086 963089 960324 958071 956324 955321 955391 956360 957595 958549 958902 958363 956885 955045 953730 953209
62826 953209 952674 950852 947147 942335 938061 935393 933862 932205 929956 927835 926593 926125 925888 925454 924338
62811 924338 922002 918496 914482 910194 905137 899404 894354 890912 887878 883297 877199 871564 867499 863781
62797 863781 858665 852036 845116 838847 833277 828104 823209 818864 815761 814525 814980 816200 817424 818417 818820
62782 818820 817936 815780 813730 813401 815117 818047 821407 824711 827195 828221 828514 829895 833131 836836 839359
62767 839359 841203 844466 849944 855975 860548 863598 866465 869840 873338 876865 881201 886882 893352 899776
62753 899776 906118 912894 920249 927915 935815 944174 953161 962950 974067 987110 1002004 1017989 1034514
$$ packed form
62856A001689n439m459l351k315j904k217k391j729q70q67j574j985j889k012
62842I68687k601k997k765k253j747j003P0R69J235R54L53n39j478j840j315n21
62826I53209n35j822l705m812m274k668j531j657k249k121j242m68k37m34j116
62811I24338k336l506m014m288n057n733n050l442l034m581o098n635m065l718
62797H63781n116o629o920o269n570n173m895m345l103j236M55J220J224R93M03
62782H18820q84k156k050l29J716K930L360L304K484J026K93J381L236L705K523
62767H39359J844L263N478O031M573L050K867L375L498L527M336N681O470O424
62753H99776O342O776P355P666P900Q359Q987R789J1117J3043J4894J5985J6525
$$ plain form
62740 1034514 1051863 1070705 1091299 1113412 1136963 1162524 1190992 1222664 1256760 1292165 1328805
62729 1328805 1367958 1410934 1457770 1507694 1560723 1618122 1681051 1749320 1821982 1898927 1981261
62718 1981261 2069970 2164622 2263847 2366971 2474694 2587881 2705953 2826734 2947599 3066350
62708 3066350 3181145 3290219 3391821 3483873 3563486 3627280 3672545 3697762 3702008 3684717 3646692
62697 3646692 3590642 3519712 3435579 3338727 3230459 3113767 2992125 2868159 2743553 2619428
62687 2619428 2496406 2375017 2256622 2143583 2038018 1940604 1850758 1767529 1689946 1617115
62677 1617115 1548854 1486103 1429965 1380135 1334821 1292440 1252971 1217354 1185969 1158146 1132991
62666 1132991 1110203 1090077 1073148 1059963 1050730 1044863 1041032 1038017 1035465 1033728 1033337 1035030 1039929
$$ packed form
62740A034514J7349J8842K0594K2113K3551K5561K8468L1672L4096L5405L6640
62729A328805L9153M2976M6836M9924N3029N7399O2929O8269P2662P6945Q2334
62718A981261Q8709R4652R9225J03124J07723J13187J18072J20781J20865J18751
62708C066350J14795J09074J01602R2052P9613O3794M5265K5217M246j7291l8025
62697C646692n6050p0930q4133r6852j08268j16692j21642j23966j24606j24125
62687B619428j23022j21389j18395j13039j05565r7414q9846q3229p7583p2831
62677A617115o8261o2751n6138m9830m5314m2381l9469l5617l1385k7823k5155
62666A132991k2788k0126j6929j3185r233n867l831l015k552j737l91J693M899
$$ plain form
62653 1039929 1048858 1061402 1076281 1092935 1112139 1134792 1160760 1189463 1221068 1256276 1295178
62642 1295178 1337157 1382042 1430644 1483855 1541673 1603481 1668952 1738258 1811417 1887901 1967224
62631 1967224 2049793 2136503 2226900 2317848 2404772 2484526 2556648 2621627 2678556 2724933 2758150
62620 2758150 2776438 2778838 2765247 2736595 2694303 2639517 2573416 2498155 2416639 2331032 2242062
62609 2242062 2150095 2056377 1962850 1871183 1782443 1697484 1617105 1541678 1470939 1404374 1341905
62598 1341905 1284030 1231154 1182841 1138035 1096017 1056774 1020343 986341 954349 924214 895655
62587 895655 868252 842413 819533 800231 783041 766016 749319 734799 723062 712465 701532
62576 701532 691067 682945 677548 673212 667863 660681 652555 645277 639966 636060 632259 628501 626270 626680
$$ packed form
62653A039929Q929J2544J4879J6654J9204K2653K5968K8703L1605L5208L8902
62642A295178M1979M4885M8602N3211N7818O1808O5471O9306P3159P6484P9323
62631A967224Q2569Q6710R0397R0948Q6924P9754P2122O4979N6929M6377L3217
62620B758150J8288K400j3591k8652m2292n4786o6101p5261q1516q5607q8970
62609B242062r1967r3718r3527r1667q8740q4959q0379p5427p0739o6565o2469
62598A341905n7875n2876m8313m4806m2018l9243l6431l4002l1992l0135k8559
62587H95655k7403k5839k2880j9302j7190j7025j6697j4520j1737j0597j0933
62576G01532j0465q122n397m336n349p182q126p278n311l906l801l758k231M10
$$ plain form
62562 626680 629032 631656 633479 634400 634971 636358 639849 645595 652253 658578 664922 672593 682300 693925
62548 693925 707291 722271 738415 755379 773655 794203 817380 842632 869098 896271 924549
62537 924549 955613 991571 1032931 1077816 1123913 1170802 1219642 1271318 1326099 1384567 1447203
62526 1447203 1512691 1577847 1639615 1696370 1747254 1791465 1828646 1858924 1881830 1895812 1899332
62515 1899332 1891929 1873981 1846233 1810006 1767200 1719496 1668006 1613976 1559048 1504323 1449867
62504 1449867 1395765 1342976 1292527 1244513 1198625 1155081 1114177 1075539 1038832 1004774 974300
62493 974300 946914 921003 895741 871671 849505 829521 812208 798022 785994 773884 760597
62482 760597 747468 736274 726914 718178 709966 703237 698115 693678 689814 687833 688629 691286 694259 697264
$$ packed form
62562F26680K352K624J823R21N71J387L491N746O658O325O344P671R707J1625
62548F93925J3366J4980J6144J6964J8276K0548K3177K5252K6466K7173K8278
62537I24549L1064L5958M1360M4885M6097M6889M8840N1676N4781N8468O2636
62526A447203O5488O5156O1768N6755N0884M4211L7181L0278K2906J3982L520
62515A899332p403j7948k7748l6227m2806m7704n1490n4030n4928n4725n4456
62504A449867n4102n2789n0449m8014m5888m3544m0904l8638l6707l4058l0474
62493I74300k7386k5911k5262k4070k2166j9984j7313j4186j2028j2110j3287
62482G60597j3129j1194r360q736q212o729n122m437l864j981P96K657K973L005
$$ plain form
62468 697264 701380 707730 716648 727735 740272 753849 768892 786145 805403 825411 845439 866271
62456 866271 889066 913988 940716 969579 1001110 1035029 1070966 1109859 1153152 1200426 1249169
62445 1249169 1297214 1344215 1390287 1434427 1475026 1510913 1541004 1563822 1578444 1585487 1586116 1580257
62433 1580257 1566483 1543599 1512038 1474108 1433256 1392365 1351953 1310430 1266854 1223032 1182130
62422 1182130 1145558 1112091 1079789 1047946 1017287 989159 964620 943725 925645 909760 896252
62411 896252 885148 875505 866493 858742 853316 849660 845997 841847 838674 837746 838746 841072 845064 850958
62397 850958 857740 864229 870646 877954 886118 894129 901627 909461 918545 928925 940114 951716 963432
62384 963432 974878 985640 995322 1003313 1008629 1010169 1007310 1000294 989921 976736 960776 942401 922977
$$ packed form
62468F97264M116O350Q918J1087J2537J3577J5043J7253J9258K0008K0028K0832
62456H66271K2795K4922K6728K8863L1531L3919L5937L8893M3293M7274M8743
62445A249169M8045M7001M6072M4140M0599L5887L0091K2818J4622P043O29n859
62433A580257j3774k2884l1561l7930m0852m0891m0412m1523m3576m3822m0902
62422A182130l6572l3467l2302l1843l0659k8128k4539k0895j8080j5885j3508
62411H96252j1104r643r012p751n426l656l663m150l173r28J000K326L992N894
62397H50958O782O489O417P308Q164Q011P498P834R084J0380J1189J1602J1716
62384I63432J1446J0762R682P991N316J540k859p016j0373j3185j5960j8375j9424
$$ plain form
62371 922977 904089 886136 868433 850641 833265 816556 799980 783408 768091 755637 746394 739444
62359 739444 733795 728992 724951 721876 720145 719690 719821 720240 721908 726112 732798 740503 747921 755025 762798
62344 762798 772498 784992 800031 816044 831317 845521 859528 873721 887220 899027 909194 918362
62332 918362 926598 933306 938078 941157 943037 943920 943708 942400 940361 938086 935811 933606 931967 931973 934603
62317 934603 940090 948231 959098 973066 990383 1011170 1035648 1063865 1095367 1129629 1166771 1207374
62305 1207374 1251795 1300259 1353376 1411673 1474674 1541391 1611846 1686926 1766131 1846424 1924021
62294 1924021 1996522 2062615 2120682 2169149 2207769 2237082 2256490 2264268 2260033 2246085 2225388 2198796
62282 2198796 2165114 2123490 2074767 2020413 1961179 1897610 1831580 1766396 1704859 1647482 1593002
$$ packed form
62371I22977j8888j7953j7703j7792j7376j6709j6576j6572j5317j2454r243o950
62359G39444n649m803m041l075j731m55J31M19J668M204O686P705P418P104P773
62344G62798R700J2494J5039J6013J5273J4204J4007J4193J3499J1807J0167R168
62332I18362Q236O708M772L079J880Q83k12j308k039k275k275k205j639OK630
62317I34603N487Q141J0867J3968J7317K0787K4478K8217L1502L4262L7142M0603
62305A207374M4421M8464N3117N8297O3001O6717P0455P5080P9205Q0293P7597
62294A924021P2501O6093N8067M8467L8620K9313J9408P778m235j3948k0697k6592
62282B198796l3682m1624m8723n4354n9234o3569o6030o5184o1537n7377n4480
$$ plain form
62271 1593002 1540498 1490390 1443219 1398266 1354230 1311109 1270579 1234239 1201995 1172426 1144329
62260 1144329 1117477 1092362 1069786 1050598 1035128 1022598 1011541 1001139 992056 985587 982016 980079
62248 980079 978104 975471 972806 970890 969711 968646 967287 965717 963948 961425 957418 951889 945688 939762
62234 939762 934349 929145 924171 920104 917587 916528 916471 917553 920581 925942 932887 940292 947880 956221 965709
62219 965709 976257 988137 1002410 1019980 1040589 1063203 1087036 1111691 1136675 1161761 1187949
62208 1187949 1217172 1250501 1287115 1325450 1364986 1406488 1450852 1498378 1548980 1602503 1658794
62197 1658794 1717857 1779910 1844781 1911040 1976004 2036697 2090706 2136294 2172209 2197609 2211954
62186 2211954 2214933 2206697 2188140 2160595 2125172 2082674 2034095 1980776 1923924 1864448 1803464 1742616
$$ packed form
62271A593002n2504n0108m7171m4953m4036m3121m0530l6340l2244k9569k8097
62260A144329k6852k5115k2576j9188j5470j2530j1057j0402r083o469l571j937
62248I80079j975k633k665j916j179j065j359j570j769k523m007n529o201n926
62234I39762n413n204m974m067k517j059n7J082L028N361O945P405P588Q341R488
62219I65709J0548J1880J4273J7570K0609K2614K3833K4655K4984K5086K6188
62208A187949K9223L3329L6614L8335L9536M1502M4364M7526N0602N3523N6291
62197A658794N9063O2053O4871O6259O4964O0693N4009M5588L5915K5400J4345
62186B211954K979q236j8557k7545l5423m2498m8579n3319n6852n9476o0984o0848
$$ plain form
62174 1742616 1683606 1627631 1575350 1527005 1482258 1440355 1400966 1364803 1333117 1306585 1284823
62163 1284823 1266835 1251783 1239452 1230076 1223642 1219360 1216089 1213281 1211070 1209424 1207816 1206024 1204727
62150 1204727 1204735 1205934 1207461 1208698 1209747 1211175 1213656 1217552 1222461 1227460 1232197 1237429 1244162 1252713 1263095
62135 1263095 1275649 1290435 1306475 1322638 1339158 1357359 1377971 1400723 1425552 1452940 1482659
62124 1482659 1513144 1542652 1570473 1596671 1621421 1645120 1668558 1692528 1717627 1744543 1773805
62113 1773805 1805054 1837503 1871527 1908748 1949889 1993654 2038816 2086403 2138221 2193479 2248397
62102 2248397 2299285 2344755 2384712 2418636 2445790 2466290 2480864 2489782 2492814 2490230 2483136 2472524
62090 2472524 2458571 2441329 2421805 2401551 2381018 2359165 2335440 2311683 2290934 2274382 2260548
$$ packed form
62174A742616n9010n5975n2281m8345m4747m1903l9389l6163l1686k6532k1762
62163A284823j7988j5052j2331r376o434m282l271k808k211j646j608j792j297
62150A204727QJ199J527J237J049J428K481L896M909M999M737N232O733Q551J0382
62135A263095J2554J4786J6040J6163J6520J8201K0612K2752K4829K7388K9719
62124A482659L0485K9508K7821K6198K4750K3699K3438K3970K5099K6916K9262
62113A773805L1249L2449L4024L7221M1141M3765M5162M7587N1818N5258N4918
62102B248397N0888M5470L9957L3924K7154K0500J4574Q918L032k584p094j0612
62090B472524j3953j7242j9524k0254k0533k1853k3725k3757k0749j6552j3834
$$ plain form
62079 2260548 2247707 2235933 2226152 2218363 2211907 2206739 2203165 2200731 2198648 2197213 2197660 2200494 2205016 2210656
62065 2210656 2217819 2227135 2238721 2252503 2268489 2286355 2305530 2326112 2349121 2375356 2404429 2435235
62053 2435235 2467011 2499803 2534384 2571887 2612838 2656337 2700706 2745206 2790546 2837613 2886595
62042 2886595 2937608 2991182 3047418 3105532 3164948 3226155 3289647 3354670 3419822 3484233 3547308
62031 3547308 3608061 3666144 3723151 3781480 3841945 3903659 3966055 4029368 4092876 4154457 4212841
62020 4212841 4269195 4325473 4382225 4439155 4496984 4557234 4620244 4684602 4748722 4812311 4876334
62009 4876334 4942358 5011875 5085313 5161385 5238068 5314459 5391064 5468069 5544146 5617397 5686637
61998 5686637 5751045 5809389 5860858 5906463 5948369 5987455 6022392 6051449 6074403 6092157 6105355
$$ packed form
62079B260548j2841j1774r781p789o456n168l574k434k083j435M47K834M522N640
62065B210656P163R316J1586J3782J5986J7866J9175K0582K3009K6235K9073L0806
62053B435235L1776L2792L4581L7503M0951M3499M4369M4500M5340M7067M8982
62042B886595N1013N3574N6236N8114N9416O1207O3492O5023O5152O4411O3075
62031C547308O0753N8083N7007N8329O0465O1714O2396O3313O3508O1581N8384
62020D212841N6354N6278N6752N6930N7829O0250O3010O4358O4120O3589O4023
62009D876334O6024O9517P3438P6072P6683P6391P6605P7005P6077P3251O9240
61998E686637O4408N8344N1469M5605M1906L9086L4937K9057K2954J7754J3198
$$ plain form
61987 6105355 6114311 6119913 6123530 6125899 6126781 6125843 6123371 6120049 6116617 6113875 6112352 6111607 6110358 6107787 6104449
61972 6104449 6101566 6099657 6098176 6096141 6092726 6087487 6080534 6072459 6063753 6054324 6043790 6032154 6019909
61959 6019909 6007727 5996337 5986424 5978098 5970535 5962717 5954575 5946950 5940378 5934530 5929102 5924613 5921701
61946 5921701 5919899 5917803 5914635 5911217 5909133 5909196 5911022 5913919 5917484 5921034 5922977 5921639 5916777 5909511
61932 5909511 5900433 5888413 5871871 5850615 5825658 5797674 5766792 5733809 5700332 5667113 5633085
61921 5633085 5596715 5557689 5516661 5473986 5429673 5384305 5338944 5294016 5249084 5203986 5159517
61910 5159517 5116540 5074814 5033157 4990594 4947075 4903415 4860933 4820922 4783847 4748829 4714271
61899 4714271 4679365 4644922 4612547 4583035 4555804 4529886 4505194 4482574 4462767 4445619 4430405
$$ packed form
61987F105355Q956N602L617K369Q82r38k472l322l432k742j523p45j249k571l338
61972F104449k883j909j481k035l415n239o953q075q706r429j0534j1636j2245
61959F019909j2182j1390r913q326p563p818q142p625o572n848n428m489k912
61946E921701j802k096l168l418k084O3J826K897L565L550J943j338m862p266
61932E909511r078j2020j6542k1256k4957k7984l0882l2983l3477l3219l4028
61921E633085l6370l9026m1028m2675m4313m5368m5361m4928m4932m5098m4469
61910E159517m2977m1726m1657m2563m3519m3660m2482m0011l7075l5018l4558
61899D714271l4906l4443l2375k9512k7231k5918k4692k2620j9807j7148j5214
$$ plain form
61888 4430405 4416679 4404682 4395042 4388288 4384553 4383587 4385052 4388898 4395374 4404555 4416004 4429301 4445037
61875 4445037 4464918 4490509 4521907 4557969 4597783 4641526 4689804 4742754 4800382 4863553 4933900
61864 4933900 5012566 5099491 5194288 5297433 5410284 5534302 5670779 5821164 5987067 6169935
61854 6169935 6371232 6592994 6837677 7107299 7403287 7727501 8082893 8472509 8898083
61845 8898083 9360317 9860625 10401995 10987804 11619920 12297790 13018260 13774957 14557202
61836 14557202 15349312 16130392 16873900 17547393 18114343 18538960 18792279 18856760 18728408
61827 18728408 18416934 17944041 17339462 16635809 15864533 15053897 14227772 13404592 12597516
61818 12597516 11816354 11069277 10362524 9699246 9079807 8503502 7969724 7477844 7026881
$$ packed form
61888D430405j3726j1997r640o754l735r66J465L846O476R181J1449J3297J5736
61875D445037J9881K5591L1398L6062L9814M3743M8278N2950N7628O3171P0347
61864D933900P8666Q6925R4797J03145J12851J24018J36477J50385J65903J82868
61854F169935K01297K21762K44683K69622K95988L24214L55392L89616M25574
61845H898083M62234N00308N41370N85809O32116O77870P20470P56697P82245
61836A4557202P92110P81080P43508O73493N66950M24617K53319O4481j28352
61827A8728408l11474m72893o04579p03653p71276q10636q26125q23180q07076
61818A2597516p81162p47077p06753o63278o19439n76305n33778m91880m50963
$$ plain form
61809 7026881 6615327 6240733 5899472 5587719 5302897 5043677 4808543 4595049 4400568
61800 4400568 4222976 4060434 3911459 3775645 3653364 3543970 3444882 3353288 3268378 3191116
61790 3191116 3122116 3060488 3004619 2953351 2906388 2864154 2827369 2796367 2770623 2749044 2730469
61779 2730469 2713776 2698078 2683422 2670964 2661802 2655774 2651857 2649454 2648652 2649521 2652059 2656805 2664681
61766 2664681 2676034 2690388 2707142 2725978 2746724 2769663 2795992 2826968 2862277 2900095 2939259
61755 2939259 2980611 3025764 3075311 3129013 3187119 3250626 3320441 3397006 3480571 3571156 3668351
61744 3668351 3771863 3882406 4001575 4130599 4269446 4417318 4573914 4740191 4917960
61735 4917960 5108718 5312887 5530334 5761520 6007757 6270378 6550288 6848823 7168632
$$ packed form
61809G026881m11554l74594l41261l11753k84822k59220k35134k13494j94481
61800D400568j77592j62542j48975j35814j22281j09394r9088r1594q4910p7262
61790C191116o9000o1628n5869n1268m6963m2234l6785l1002k5744k1579j8575
61779B730469j6693j5698j4656j2458r162o028l917k403q02Q69K538M746P876
61766B664681J1353J4354J6754J8836K0746K2939K6329L0976L5309L7818L9164
61755B939259M1352M5153M9547N3702N8106O3507O9815P6565Q3565R0585R7195
61744C668351J03512J10543J19169J29024J38847J47872J56596J66277J77769
61735D917960J90758K04169K17447K31186K46237K62621K79910K98535L19809
$$ plain form
61726 7168632 7513194 7885608 8288239 8723317 9193470 9701843 10252261 10849241 11497403
61717 11497403 12200818 12963199 13788498 14680661 15642653 16676180 17782577 18963281 20218454
61708 20218454 21544160 22929705 24356061 25795006 27208300 28547090 29752941 30762151
61700 30762151 31513412 31956882 32062043 31822455 31256371 30402801 29314104 28047842 26660426
61691 26660426 25203132 23719755 22245413 20806383 19420647 18099105 16847816 15670802
61683 15670802 14571495 13551861 12611024 11745794 10952501 10227708 9567373 8966464 8419774
61674 8419774 7922522 7470026 7057641 6681555 6339028 6027271 5742487 5480558 5238408
61665 5238408 5014382 4807710 4618013 4444741 4286367 4140401 4004858 3879404 3764244
$$ packed form
61726G168632L44562L72414M02631M35078M70153N08373N50418N96980O48162
61717A1497403P03415P62381Q25299Q92163R61992J033527J106397J180704J255173
61708B0218454J325706J385545J426356J438945J413294J338790J205851J009210
61700C0762151P51261M43470J05161k39588n66084q53570j088697j266262j387416
61691B6660426j457294j483377j474342j439030j385736j321542j251289j177014
61683A5670802j099307j019634r40837q65230p93293p24793o60335o00909n46690
61674H419774m97252m52496m12385l76086l42527l11757k84784k61929k42150
61665E238408k24026k06672j89697j73272j58374j45966j35543j25454j15160
$$ plain form
61656 3764244 3658034 3557927 3461966 3370635 3285589 3207395 3135096 3067466 3003895 2943978 2886932
61645 2886932 2831865 2778485 2727287 2678923 2633430 2589973 2547265 2504312 2461037 2418426 2378011
61634 2378011 2340859 2306820 2274784 2243681 2213105 2182975 2153042 2123114 2093615 2065541 2039745
61623 2039745 2016349 1994695 1973685 1952385 1930767 1909803 1890440 1872512 1855100 1838001 1822223
61612 1822223 1808697 1797029 1786039 1775248 1765156 1756048 1747144 1737180 1725566 1712785 1699905 1687923
61600 1687923 1677303 1667772 1658590 1649263 1640086 1631821 1624860 1618947 1613721 1609227 1605615 1602642 1599886 1597397
61586 1597397 1595645 1594755 1594199 1593510 1592800 1592243 1591464 1590147 1589081 1589814 1592875 1596894 1599938 1601633 1603599 1607765
61570 1607765 1614353 1621468 1626665 1629060 1630032 1631717 1634821 1638016 1639438 1638487 1636119 1633767 1632136 1630729
$$ packed form
61656C764244j06210j00107r5961r1331q5046p8194p2299o7630o3571n9917n7046
61645B886932n5067n3380n1198m8364m5493m3457m2708m2953m3275m2611m0415
61634B378011l7152l4039l2036l1103l0576l0130k9933k9928k9499k8074k5796
61623B039745k3396k1654k1010k1300k1618k0964j9363j7928j7412j7099j5778
61612A822223j3526j1668j0990j0791j0092r108q904r964j1614j2781j2880j1982
61600A687923j0620r531r182r327r177q265o961n913n226m494l612k973k756k489
61586A597397j752q90n56o89p10n57p79j317j066P33L061M019L044J695J966M166
61570A607765O588P115N197K395R72J685L104L195J422r51k368k352j631j407
$$ plain form
61556 1630729 1628326 1624160 1618835 1613736 1609277 1604116 1596514 1586193 1574398 1562450 1550882 1539782 1529057
61543 1529057 1518113 1506171 1493483 1481795 1472905 1466950 1462593 1458723 1455348 1452829 1451004 1449567 1448911
61530 1448911 1449980 1453268 1458399 1464828 1472587 1482073 1493430 1506534 1521487 1538657 1558163 1579699
61518 1579699 1602985 1627971 1654390 1681581 1709217 1737921 1768743 1802160 1838082 1876554 1917700
61507 1917700 1960933 2005031 2049415 2094709 2141420 2188520 2234204 2278062 2321645 2366397 2411515
61496 2411515 2454491 2493673 2529638 2563791 2596187 2625406 2650440 2671983 2691536 2709581 2725048
61485 2725048 2736395 2742948 2745339 2744909 2742678 2738746 2732835 2725393 2717616 2710175 2702492 2693962 2685488 2678971
61471 2678971 2675459 2674694 2676452 2681428 2690559 2704378 2723415 2748327 2779005 2814160 2852659 2895087
$$ packed form
61556A630729k403m166n325n099m459n161p602j0321j1795j1948j1568j1100j0725
61543A529057j0944j1942j2688j1688q890n955m357l870l375k519j825j437o56
61530A448911J069L288N131O429P759R486J1357J3104J4953J7170J9506K1536
61518A579699K3286K4986K6419K7191K7636K8704L0822L3417L5922L8472M1146
61507A917700M3233M4098M4384M5294M6711M7100M5684M3858M3583M4752M5118
61496B411515M2976L9182L5965L4153L2396K9219K5034K1543J9553J8045J5467
61485B725048J1347O553K391m30k231l932n911p442p777p441p683q530q474o517
61471B678971l512p65J758M976R131J3819J9037K4912L0678L5155L8499M2428
$$ plain form
61459 2895087 2943589 3000500 3067416 3144852 3232039 3327618 3431487 3545743 3672932 3813616
61449 3813616 3966681 4132009 4311555 4507353 4719482 4946855 5189234 5447424 5721589
61440 5721589 6010172 6310489 6619494 6933298 7245813 7547924 7828066 8074223 8276500
61431 8276500 8428775 8528414 8574751 8568310 8511634 8410308 8272378 8106309 7919405 7717784
61421 7717784 7507057 7292656 7079803 6873384 6677364 6493872 6323371 6166361 6024575
61412 6024575 5899708 5791468 5698279 5620108 5559262 5517598 5493925 5485011 5488359 5503031 5528507
61401 5528507 5564182 5609833 5665213 5728942 5798798 5873371 5952409 6035068 6118802 6200774 6279843
61390 6279843 6356426 6430908 6503201 6573801 6644195 6715551 6787340 6857782 6925599 6990867 7054056
$$ packed form
61459B895087M8502N6911O6916P7436Q7187R5579J03869J14256J27189J40684
61449C813616J53065J65328J79546J95798K12129K27373K42379K58190K74165
61440E721589K88583L00317L09005L13804L12515L02111K80142K46157K02277
61431H276500J52275R9639M6337o441n6676j01326j37930j66069j86904k01621
61421G717784k10727k14401k12853k06419j96020j83492j70501j57010j41786
61412F024575j24867j08240r3189p8171o0846m1664k3673q914L348J4672K5476
61401E528507L5675M5651N5380O3729O9856P4573P9038Q2659Q3734Q1972P9069
61390F279843P6583P4482P2293P0600P0394P1356P1789P0442O7817O5268O3189
$$ plain form
61379 7054056 7114710 7171577 7223912 7272085 7316687 7357356 7392672 7421049 7441599 7454415 7460258
61368 7460258 7459806 7453137 7440112 7421180 7397269 7368886 7336100 7299744 7261834 7224186 7187251 7151033
61356 7151033 7116414 7084551 7055470 7028555 7004273 6984147 6968863 6957585 6949370 6943938 6940387 6936203
61344 6936203 6928744 6917464 6903968 6890065 6876297 6862329 6848325 6835925 6827927 6826934 6834325 6850683
61332 6850683 6876973 6914888 6966255 7032849 7116730 7219981 7343810 7488529 7654575 7842829
61322 7842829 8053620 8286060 8538808 8810928 9101549 9408988 9730188 10060173 10391528
61313 10391528 10714940 11020601 11298673 11538668 11730124 11865401 11941678 11959833 11922293 11832700
61303 11832700 11696370 11518987 11304608 11056079 10777520 10475316 10156321 9825984 9488567
$$ packed form
61379G054056O0654N6867N2335M8173M4602M0669L5316K8377K0550J2816N843
61368G460258m52o669j3025j8932k3911k8383l2786l6356l7910l7648l6935l6218
61356G151033l4619l1863k9081k6915k4282k0126j5284j1278q215n432l551m184
61344F936203p459j1280j3496j3903j3768j3968j4004j2400p998r93P391J6358
61332F850683K6290L7915N1367O6594Q3881J03251J23829J44719J66046J88254
61322G842829K10791K32440K52748K72120K90621L07439L21200L29985L31355
61313A0391528L23412L05661K78072K39995J91456J35277P6277J8155l7540q9593
61303A1832700j36330j77383k14379k48529k78559l02204l18995l30337l37417
$$ plain form
61294 9488567 9148393 8810189 8478452 8156668 7846813 7549521 7265285 6995858 6744229
61285 6744229 6513026 6303150 6113970 5944352 5793256 5659812 5543450 5444013 5361394 5294990
61275 5294990 5243742 5206792 5183866 5174659 5177950 5191802 5214911 5247305 5289209 5339401 5395344 5454880
61263 5454880 5517228 5582256 5649454 5717691 5785172 5849318 5907548 5958974 6004913 6047225 6086464
61252 6086464 6121936 6152773 6178188 6197318 6209859 6216560 6218115 6213718 6201737 6181874 6155688 6124653
61240 6124653 6088516 6046010 5996562 5940707 5879218 5812557 5741299 5666724 5590655 5514639 5439258
61229 5439258 5364341 5289852 5216589 5146189 5080669 5021701 4969682 4923345 4880829 4841373 4805532
61218 4805532 4773552 4744296 4716309 4689301 4663802 4639695 4615821 4590938 4564620 4537430 4510764
$$ packed form
61294I488567l40174l38204l31737l21784l09855k97292k84236k69427k51629
61285F744229k31203k09876j89180j69618j51096j33444j16362r9437q2619o6404
61275E294990n1248l6950k2926r207L291J3852K3109L2394M1904N0192N5943N9536
61263E454880O2348O5028O7198O8237O7481O4146N8230N1426M5939M2312L9239
61252F086464L5472L0837K5415J9130J2541O701J555m397j1981j9863k6186l1035
61240F124653l6137m2506m9448n5855o1489o6661p1258p4575p6069p6016p5381
61229E439258p4917p4489p3263p0400o5520n8968n2019m6337m2516l9456l5841
61218D805532l1980k9256k7987k7008k5499k4107k3874k4883k6318k7190k6666
$$ plain form
61207 4510764 4486235 4464693 4446012 4430254 4418621 4412601 4412567 4417953 4428618 4445337 4469216 4501411
61195 4501411 4543338 4596396 4661345 4738359 4827424 4928056 5038963 5158794 5287008 5423025
61185 5423025 5564416 5706592 5844202 5971954 6084136 6174368 6236436 6265183 6256989 6210465
61175 6210465 6127097 6010779 5866651 5700582 5519117 5328574 5133839 4938577 4746405 4560860
61165 4560860 4384235 4217433 4061003 3915338 3779919 3653734 3536839 3430370 3334548 3247796
61155 3247796 3168368 3095834 3030340 2971546 2919238 2874129 2836947 2807071 2782883 2763228 2747994
61144 2747994 2737532 2731895 2730388 2731732 2735174 2741425 2751573 2764856 2778554 2790491 2800498 2808770
61132 2808770 2814126 2815059 2811647 2805098 2796016 2784272 2770125 2754106 2735903 2714449 2689197 2660575
$$ packed form
61207D510764k4529k1542j8681j5758j1633o020l4N386J0665J6719K3879L2195
61195D501411M1927N3058O4949P7014Q9065J00632J10907J19831J28214J36017
61185E423025J41391J42176J37610J27752J12182R0232O2068K8747q194m6524
61175F210465q3368j16318j44128j66069j81465j90543j94735j95262j92172j85545
61165D560860j76625j66802j56430j45665j35419j26185j16895j06469r5822q6752
61155C247796p9428p2534o5494n8794n2308m5109l7182k9876k4188j9655j5234
61144B747994j0462n637j507J344L442O251J0148J3283J3698J1937J0007Q272
61132B808770N356R33l412o549r082j1744j4147j6019j8203k1454k5252k8622
$$ plain form
61120 2660575 2629369 2596452 2562915 2529607 2496491 2463028 2428986 2394257 2358304 2320745 2282388
61109 2282388 2244699 2208111 2171425 2132912 2091629 2048013 2003919 1961710 1922427 1884971 1847769
61098 1847769 1810810 1775080 1740626 1706788 1674171 1644419 1617442 1590628 1561900 1532131 1503151
61087 1503151 1474457 1443838 1410975 1378670 1350143 1326263 1305781 1287098 1269144 1251507 1234800
61076 1234800 1220581 1209987 1202427 1196257 1190726 1186593 1184748 1184990 1186617 1189632 1194663 1201889 1210646 1220090
61062 1220090 1229762 1239534 1249537 1260298 1272456 1286031 1300171 1313832 1326445 1337829 1347842 1356590
61050 1356590 1364923 1374200 1385053 1396301 1405519 1411283 1414760 1418375 1422736 1425779 1425519 1422644 1419296 1416050
61036 1416050 1411734 1406002 1400195 1395154 1389775 1382678 1374063 1364869 1355159 1344629 1334007 1324554 1316415
$$ packed form
61120B660575l1206l2917l3537l3308l3116l3463l4042l4729l5953l7559l8357
61109B282388l7689l6588l6686l8513m1283m3616m4094m2209l9283l7456l7202
61098A847769l6959l5730l4454l3838l2617k9752k6977k6814k8728k9769k8980
61087A503151k8694l0619l2863l2305k8527k3880k0482j8683j7954j7637j6707
61076A234800j4219j0594p560o170n531m133j845K42J627L015N031P226Q757R444
61062A220090R672R772J0003J0761J2158J3575J4140J3661J2613J1384J0013Q748
61050A356590Q333R277J0853J1248R218N764L477L615M361L043k60k875l348l246
61036A416050m316n732n807n041n379p097q615r194r710j0530j0622r453q139
$$ plain form
61023 1316415 1308622 1300632 1292798 1285328 1277839 1270189 1262881 1256164 1249286 1241272 1232303 1223989 1218074 1214857
61009 1214857 1212956 1210627 1207150 1202821 1198151 1193759 1190770 1190119 1191210 1192289 1192682 1193839 1197405 1203041
60995 1203041 1209019 1214533 1220533 1228512 1239144 1251913 1265484 1278602 1291102 1303994 1318354 1334415
60983 1334415 1351801 1369990 1388421 1407013 1426969 1450083 1476635 1504975 1533907 1564378 1597801
60972 1597801 1633836 1671301 1710508 1753126 1800143 1851437 1907108 1967625 2032629 2101045 2172647
60961 2172647 2248437 2329212 2414793 2504925 2600097 2701109 2808315 2921482 3040209 3164857
60951 3164857 3297394 3440598 3595723 3761654 3937088 4122488 4318783 4525339 4741134
60942 4741134 4967502 5208194 5467366 5749167 6058419 6399353 6773869 7183162 7630707
$$ packed form
61023A316415p793p990p834p470p489p650p308o717o878q014q969q314n915l217
61009A214857j901k329l477m329m670m392k989o51J091J079L93J157L566N636
60995A203041N978N514O000P979J0632J2769J3571J3118J2500J2892J4360J6061
60983A334415J7386J8189J8431J8592J9956K3114K6552K8340K8932L0471L3423
60972A597801L6035L7465L9207M2618M7017N1294N5671O0517O5004O8416P1602
60961B172647P5790Q0775Q5581R0132R5172J01012J07206J13167J18727J24648
60951C164857J32537J43204J55125J65931J75434J85400J96295K06556K15795
60942D741134K26368K40692K59172K81801L09252L40934L74516M09293M47545
$$ plain form
60933 7630707 8121406 8658479 9244726 9887471 10599281 11393070 12279652 13270944 14381793
60924 14381793 15627172 17022255 18588663 20356840 22358793 24623839 27185716 30076969
60916 30076969 33277643 36636663 39845478 42526598 44399315 45404575 45704176 45581206
60908 45581206 45333614 45209180 45354220 45748402 46167960 46247876 45640590 44173255 41901655
60899 41901655 39048483 35894062 32688717 29609548 26753257 24153098 21807388 19703346
60891 19703346 17826245 16158376 14678154 13362917 12192238 11149242 10220333 9394209
60883 9394209 8660815 8010886 7435788 6926896 6475106 6071780 5710173 5385126 5091484
60874 5091484 4823957 4578696 4353616 4146504 3953677 3771222 3596842 3429878 3270227
$$ packed form
60933G630707M90699N37073N86247O42745P11810P93789Q86582R91292J110849
60924A4381793J245379J395083J566408J768177K001953K265046K561877K891253
60916C0076969L200674L359020L208815K681120J872717J005260K99601j22970
60908D5581206k47592j24434J45040L94182M19558P9916o07286j467335k271600
60899D1901655k853172l154421l205345l079169k856291k600159k345710k104042
60891A9703346j877101j667869j480222j315237j170679j042996r28909q26124
60883I394209p33394o49929n75098n08892m51790m03326l61607l25047k93642
60874E091484k67527k45261k25080k07112j92827j82455j74380j66964j59651
$$ plain form
60865 3270227 3118047 2974040 2839052 2713286 2596194 2487043 2385342 2290912 2203783 2123862
60855 2123862 2050525 1982710 1919518 1860512 1805347 1753417 1704157 1657501 1613745 1572903 1534341
60844 1534341 1497228 1461399 1427587 1396576 1368234 1341721 1316571 1293120 1271932 1253396 1237840
60833 1237840 1225121 1213914 1202460 1190660 1180513 1173732 1169838 1167473 1166503 1167497 1169969 1172881 1176476
60820 1176476 1181769 1188152 1193353 1196300 1198523 1201946 1206490 1210676 1213618 1215426 1216303 1216253 1215466 1214252 1212504
60805 1212504 1209538 1204626 1197924 1191045 1186134 1183667 1181587 1177620 1172163 1167716 1165642 1165047 1164998 1166077 1169065
60790 1169065 1173697 1179835 1188558 1200725 1215390 1230958 1247106 1264285 1282056 1299420 1316338 1333368
60778 1333368 1350038 1365098 1378356 1390838 1403046 1414483 1425137 1435802 1446327 1455054 1461046 1465762
$$ packed form
60865C270227j52180j44007j34988j25766j17092j09151j01701r4430q7129p9921
60855B123862p3337o7815o3192n9006n5165n1930m9260m6656m3756m0842l8562
60844A534341l7113l5829l3812l1011k8342k6513k5150k3451k1188j8536j5556
60833A237840j2719j1207j1454j1800j0147o781l894k365r70R94K472K912L595
60820A176476N293O383N201K947K223L423M544M186K942J808Q77n0p87j214j748
60805A212504k966m912o702o879m911k467k080l967n457m447k074n95m9J079K988
60790A169065M632O138Q723J2167J4665J5568J6148J7179J7771J7364J6918J7030
60778A333368J6670J5060J3258J2482J2208J1437J0654J0665J0525Q727N992M716
$$ plain form
60766 1465762 1471254 1477419 1482372 1485186 1487003 1489478 1493298 1498477 1504996 1512420 1519481 1524868 1528371 1530832
60752 1530832 1532938 1534351 1534037 1531338 1526760 1521700 1517096 1512102 1504426 1492516 1477452 1462245 1449144
60739 1449144 1437939 1426949 1415116 1402778 1390926 1380423 1371836 1365271 1360118 1355379 1350528 1345836
60727 1345836 1341717 1338116 1334858 1332423 1332118 1335450 1343316 1355481 1370601 1386949 1403501 1420407 1438296
60714 1438296 1457250 1476658 1496046 1515718 1536431 1558605 1582095 1606687 1632374 1658764 1684323
60703 1684323 1706847 1725162 1740172 1753765 1766709 1778058 1786675 1792721 1797287 1801051 1803943 1805993
60691 1805993 1807722 1809441 1810678 1810829 1810135 1809423 1808847 1807427 1804159 1799376 1794590 1791043 1788661 1786299 1782624
60676 1782624 1776684 1768213 1757888 1747217 1737684 1729617 1721858 1712716 1701523 1689464 1678751 1670663 1664445
$$ packed form
60766A465762N492O165M953K814J817K475L820N179O519P424P061N387L503K461
60752A530832K106J413l14k699m578n060m604m994p676j1910j5064j5207j3101
60739A449144j1205j0990j1833j2338j1852j0503q587o565n153m739m851m692
60727A345836m119l601l258k435l05L332P866J2165J5120J6348J6552J6906J7889
60714A438296J8954J9408J9388J9672K0713K2174K3490K4592K5687K6390K5559
60703A684323K2524J8315J5010J3593J2944J1349Q617O046M566L764K892K050
60691A805993J729J719J237J51o94p12n76j420l268m783m786l547k382k362l675
60676A782624n940q471j0325j0671r533q067p759r142j1193j2059j0713q088o218
$$ plain form
60663 1664445 1658350 1651612 1644933 1639131 1634187 1630021 1627412 1627246 1629172 1631856 1634478 1637118 1639619 1640998
60649 1640998 1640505 1638630 1636450 1634297 1631642 1628037 1623592 1618444 1612332 1604996 1596821 1588817 1581929 1576390
60635 1576390 1571632 1566737 1561020 1554382 1547219 1539970 1532704 1525132 1517043 1508581 1499930 1490868 1480900 1469814
60621 1469814 1457745 1444560 1429615 1412460 1393640 1374461 1355963 1338223 1320599 1302551 1284447
60610 1284447 1267696 1253863 1243433 1235608 1229463 1224956 1222558 1222333 1223844 1226638 1230233 1233838 1236721
60597 1236721 1238873 1240691 1242137 1242961 1243872 1246496 1251545 1257562 1262367 1265636 1269292 1275114 1282523 1289192
60583 1289192 1293594 1296375 1299232 1303092 1307816 1313124 1318876 1324530 1329350 1333615 1338927 1346628 1356328 1366599
60569 1366599 1376809 1387682 1400384 1415705 1433839 1454196 1475513 1496818 1518273 1540524 1563501
$$ packed form
60663A664445o095o738o679n802m944m166k609j66J926K684K622K640K501J379
60649A640998m93j875k180k153k655l605m445n148o112p336q175q004o888n539
60635A576390m758m895n717o638p163p249p266p572q089q462q651r062r968j1086
60621A469814j2069j3185j4945j7155j8820j9179j8498j7740j7624j8048j8104
60610A284447j6751j3833j0430p825o145m507k398k25J511K794L595L605K883
60597A236721K152J818J446Q24R11K624N049O017M805L269L656N822P409O669
60583A289192M402K781K857L860M724N308N752N654M820M265N312P701R700J0271
60569A366599J0210J0873J2702J5321J8134K0357K1317K1305K1455K2251K2977
$$ plain form
60558 1563501 1586679 1610363 1635665 1662991 1691383 1719580 1746892 1772813 1796848 1819255 1840974
60547 1840974 1861849 1879561 1891452 1897270 1899149 1898715 1894929 1885219 1868334 1845602 1819465 1791316
60535 1791316 1761230 1729575 1698038 1668555 1641748 1617184 1594901 1575730 1560058 1547264 1536696
60524 1536696 1528380 1522188 1516986 1511332 1504811 1498261 1492958 1489826 1488967 1489464 1489888 1489407 1488331 1487554 1487820
60509 1487820 1489609 1493006 1497328 1501533 1505502 1510392 1517251 1526002 1536366 1548881 1563830 1579677 1594074
60496 1594074 1606570 1619121 1633522 1649265 1664488 1678099 1690285 1701592 1712681 1724841 1739618
60485 1739618 1757344 1776629 1796074 1816298 1839503 1866958 1897814 1930974 1967182 2007954 2052503
60474 2052503 2097100 2137894 2173362 2203429 2227284 2243225 2250157 2248228 2238309 2221855 2201131 2178587
$$ packed form
60558A563501K3178K3684K5302K7326K8392K8197K7312K5921K4035K2407K1719
60547A840974K0875J7712J1891N818J879m34l786r710j6885k2732k6137k8149
60535A791316l0086l1655l1537k9483k6807k4564k2283j9171j5672j2794j0568
60524A536696q316o192n202n654o521o550n303l132q59M97M24m81j076p77K66
60509A487820J789L397M322M205L969M890O859Q751J0364J2515J4949J5847J4397
60496A594074J2496J2551J4401J5743J5223J3611J2186J1307J1089J2160J4777
60485A739618J7726J9285J9445K0224K3205K7455L0856L3160L6208M0772M4549
60474B052503M4597M0794L5468L0067K3855J5941O932j929r919j6454k0724k2544
$$ plain form
60462 2178587 2155829 2133864 2114251 2099238 2090640 2089263 2095387 2108838 2128323 2151608 2177029 2204479
60450 2204479 2234597 2267565 2303107 2341089 2381525 2424465 2470747 2522738 2583559 2655202 2737729
60439 2737729 2830431 2933514 3048564 3177741 3322859 3485003 3664455 3860702 4072908 4300970
60429 4300970 4546314 4811370 5098184 5407892 5741623 6101258 6488320 6901511 7334585
60420 7334585 7774979 8202891 8591746 8911668 9135275 9242779 9224370 9080779 8823223 8472042
60410 8472042 8053009 7592422 7113298 6633673 6166399 5719754 5298714 4906320 4544286
60401 4544286 4212866 3910818 3635996 3386262 3160121 2956688 2774912 2612714 2467207
60392 2467207 2336205 2219395 2117284 2028740 1950135 1877456 1809153 1746508 1691259 1643227 1600211
$$ packed form
60462B178587k2758k1965j9613j5013q598j377O124J3451J9485K3285K5421K7450
60450B204479L0118L2968L5542L7982M0436M2940M6282N1991O0821P1643Q2527
60439B737729R2702J03083J15050J29177J45118J62144J79452J96247K12206K28062
60429D300970K45344K65056K86814L09708L33731L59635L87062M13191M33074
60420G334585M40394M27912L88855L19922K23607J07504j8409j43591k57556l51181
60410H472042m19033m60587m79124m79625m67274m46645m21040l92394l62034
60401D544286l31420l02048k74822k49734k26141k03433j81776j62198j45507
60392B467207j31002j16810j02111q8544p8605p2679o8303o2645n5249m8032m3016
$$ plain form
60381 1600211 1559802 1521094 1484812 1451943 1422339 1394730 1368124 1342812 1319647 1298644 1278931
60370 1278931 1260077 1242753 1227766 1214938 1203355 1192336 1181719 1171556 1162043 1153564 1146335 1140102
60358 1140102 1134616 1130176 1127256 1125727 1124986 1124759 1125257 1126661 1129058 1132828 1138298 1144847 1150991 1155679 1159096
60343 1159096 1162117 1165595 1170343 1176917 1184827 1192591 1199329 1206035 1214604 1225742 1238284 1250392 1260890
60330 1260890 1269618 1277134 1284237 1291311 1297881 1302891 1305532 1305900 1305013 1304284 1304653 1305997 1307400 1308083 1307847
60315 1307847 1306676 1304466 1301425 1298165 1294900 1291055 1286429 1282425 1281236 1283628 1288089 1292317 1295026 1296258
60301 1296258 1296772 1297658 1300091 1304614 1310597 1316827 1322854 1329495 1337951 1348634 1361013 1374196 1387248
60288 1387248 1399142 1409254 1418278 1428148 1440317 1454233 1467953 1480169 1491100 1501467 1511213 1519428
$$ packed form
60381A600211m0409l8708l6282l2869k9604k7609k6606k5312k3165k1003j9713
60370A278931j8854j7324j4987j2828j1583j1019j0617j0163r513q479p229o233
60358A140102n486m440k920j529p41k27M98J404K397L770N470O549O144M688L417
60343A159096L021L478M748O574P910P764O738O706Q569J1138J2542J2108J0498
60330A260890Q728P516P103P074O570N010K641L68q87p29L69J344J403O83k36
60315A307847j171k210l041l260l265l845m626m004j189K392M461M228K709J232
60301A296258N14Q86K433M523N983O230O027O641Q456J0683J2379J3183J3052
60288A387248J1894J0112R024R870J2169J3916J3720J2216J0931J0367R746Q215
$$ plain form
60276 1519428 1525083 1527673 1527582 1526023 1524341 1523267 1523038 1523965 1526267 1529606 1533657 1539058 1546610 1555258 1562128
60261 1562128 1565291 1565481 1564288 1561725 1556729 1549234 1540334 1530748 1520522 1510103 1500439 1491920 1484274 1477512
60247 1477512 1471928 1467089 1462102 1457233 1454116 1453712 1454963 1456161 1456895 1457886 1459461 1461124 1462525 1464150 1466878
60232 1466878 1471129 1476415 1481602 1485748 1488798 1491372 1493985 1496890 1500709 1506499 1514726 1524579 1534908 1545671
60218 1545671 1557780 1571436 1585265 1597578 1608245 1618772 1630518 1643399 1656564 1669781 1683558
60207 1683558 1698344 1714604 1733577 1756644 1783343 1811083 1837885 1864870 1895059 1930056 1968927
60196 1968927 2010177 2053741 2100914 2153192 2211468 2275678 2345019 2419005 2498407 2584604 2678065
60185 2678065 2778168 2884606 2998177 3119968 3250394 3389334 3536516 3691408 3853167
$$ packed form
60276A519428N655K590r1j559j682j074k29R27K302L339M051N401P552Q648O870
60261A562128L163J90j193k563m996p495q900r586j0226j0419r664q519p646o762
60247A477512n584m839m987m869l117m04J251J198P34R91J575J663J401J625K728
60232A466878M251N286N187M146L050K574K613K905L819N790Q227R853J0329J0763
60218A545671J2109J3656J3829J2313J0667J0527J1746J2881J3165J3217J3777
60207A683558J4786J6260J8973K3067K6699K7740K6802K6985L0189L4997L8871
60196A968927M1250M3564M7173N2278N8276O4210O9341P3986P9402Q6197R3461
60185B678065J00103J06438J13571J21791J30426J38940J47182J54892J61759
$$ plain form
60176 3853167 4020890 4193459 4368957 4544906 4719307 4890801 5057418 5215726 5361742
60167 5361742 5492439 5606184 5702403 5781407 5844148 5891412 5923090 5938517 5937632 5921947 5894666
60156 5894666 5859927 5821605 5782709 5745803 5713479 5687899 5670206 5661207 5662439 5675752 5702014 5741359
60144 5741359 5794806 5864421 5951334 6054545 6172108 6302490 6444180 6594938 6752203 6913372
60134 6913372 7074854 7231659 7378900 7513288 7632562 7734336 7816462 7877662 7916641 7931359
60124 7931359 7920664 7886275 7831753 7759818 7672146 7571602 7462860 7350480 7237999 7129405
60114 7129405 7029764 6943086 6870605 6812383 6769867 6745691 6741392 6756653 6790658 6843072 6913363
60103 6913363 6999942 7100342 7211626 7330150 7451280 7569976 7681863 7783740 7873276 7948681
$$ packed form
60176C853167J67723J72569J75498J75949J74401J71494J66617J58308J46016
60167E361742J30697J13745R6219P9004O2741M7264L1678J5427q85j5685k7281
60156E894666l4739l8322l8896l6906l2324k5580j7693q999J232J3313K6262L9345
60144E741359N3447O9615Q6913J03211J17563J30382J41690J50758J57265J61169
60134F913372J61482J56805J47241J34388J19274J01774Q2126O1200L8979J4718
60124G931359j0695l4389n4522p1935q7672j00544j08742j12380j12481j08594
60114G129405r9641q6678p2481n8222m2516k4176m299J5261L4005N2414P0291
60103F913363Q6579J00400J11284J18524J21130J18696J11887J01877Q9536P5405
$$ plain form
60093 7948681 8008960 8054421 8086594 8107454 8118828 8122702 8121955 8120506 8122675 8132398 8152879 8186681
60081 8186681 8236207 8304224 8393699 8506717 8643627 8803811 8987465 9196384 9432985 9699122
60071 9699122 9996019 10324653 10685410 11077390 11498478 11945970 12416668 12906432 13410195
60062 13410195 13922628 14438368 14951163 15453041 15934719 16386919 16801302 17170497 17487960
60053 17487960 17748151 17946715 18080223 18145842 18141572 18066963 17923563 17714636 17444684 17119577
60043 17119577 16747395 16339012 15907257 15464775 15022201 14588218 14170965 13778695 13418602
60034 13418602 13095214 12810420 12565138 12360664 12198404 12078706 12000297 11960708 11956797 11984615
60024 11984615 12038878 12113044 12200285 12294386 12389411 12478668 12554739 12611127 12643751 12650645 12630675
$$ packed form
60093G948681O0279M5461L2173K0860J1374L874p47j449K169R723K0481L3802
60081H186681M9526O8017Q9475J13018J36910J60184J83654K08919K36601K66137
60071I699122K96897L28634L60757L91980M21088M47492M70698M89764N03763
60062A3410195N12433N15740N12795N01878M81678M52200M14383L69195L17463
60053A7487960K60191J98564J33508O5619m270p4609j43400k08927k69952l25107
60043A7119577l72182m08383m31755m42482m42574m33983m17253l92270l60093
60034A3418602l23388k84794k45282k04474j62260j19698p8409l9589l911K7818
60024A1984615N4263P4166Q7241R4101R5025Q9257P6071N6388L2624O894j9970
$$ plain form
60013 12630675 12583179 12508625 12408686 12285320 12140103 11974531 11790345 11589169 11372239 11141047
60003 11141047 10898367 10648521 10396681 10147797 9905808 9673682 9454229 9250791 9066738
59994 9066738 8904215 8763834 8645884 8551642 8483295 8442681 8430132 8444232 8482552 8542950 8624346
59983 8624346 8726126 8846669 8982692 9129966 9284118 9440459 9593490 9737126 9865472
59974 9865472 9973401 10056970 10113786 10142822 10143428 10114546 10055184 9965758 9848825 9708493 9549106
59963 9549106 9374475 9188445 8996184 8804318 8618987 8443766 8280191 8130281 7997509
59954 7997509 7884938 7793630 7723954 7677573 7656664 7661465 7690107 7741228 7815619 7914703 8038407
59943 8038407 8185333 8354334 8544751 8755038 8981788 9220180 9464737 9709351 9947059
$$ packed form
60013A2630675m7496p4554r9939j23366j45217j65572j84186k01176k16930k31192
60003A1141047k42680k49846k51840k48884k41989k32126k19453k03438j84053
59994I066738j62523j40381j17950r4242o8347m0614j2549J4100L8320O0398Q1396
59983H624346J01780J20543J36023J47274J54152J56341J53031J43636J28346
59974I865472J07929Q3569N6816K9036O06k8882n9362q9426j16933j40332j59387
59963I549106j74631j86030j92261j91866j85331j75221j63575j49910j32772
59954G997509j12571r1308o9676m6381k0909M801K8642N1121P4391R9084J23704
59943H038407J46926J69001J90417K10287K26750K38392K44557K44614K37708
$$ plain form
59934 9947059 10170571 10373453 10551023 10700239 10818860 10904759 10955946 10971076 10949833 10892814
59924 10892814 10801298 10677450 10525017 10349874 10159607 9962181 9764762 9573523 9394048
59915 9394048 9231278 9088938 8969329 8873954 8804277 8761623 8746363 8757415 8792762 8850605 8930018
59904 8930018 9030379 9150236 9286893 9437017 9597224 9763953 9933378 10102034 10267261
59895 10267261 10426644 10577329 10716602 10843071 10956770 11058397 11149152 11231167 11307099 11379208
59885 11379208 11449651 11521847 11600590 11690526 11795376 11918945 12065823 12240375 12445911 12685519
59875 12685519 12962708 13279981 13637131 14031807 14461381 14923339 15414059 15927893 16456864
59866 16456864 16990057 17513202 18009741 18462548 18854527 19168766 19390294 19508969 19520751
$$ packed form
59934I947059K23512K02882J77570J49216J18621Q5899N1187J5130k1243n7019
59924A0892814r1516j23848j52433j75143j90267j97426j97419j91239j79475
59915I394048j62770j42340j19609r5375o9677m2654j5260J1052L5347N7843P9413
59904H930018J00361J19857J36657J50124J60207J66729J69425J68656J65227
59895A0267261J59383J50685J39273J26469J13699J01627R0755Q2015P5932P2109
59885A1379208P0443P2196P8743Q9936J04850J23569J46878J74552K05536K39608
59875A2685519K77189L17273L57150L94676M29574M61958M90720N13834N28971
59866A6456864N33193N23145M96539M52807L91979L14239K21528J18675J1782
$$ plain form
59857 19520751 19426682 19231757 18944971 18579383 18151084 17677507 17175673 16660481 16143911
59848 16143911 15635965 15146120 14683208 14254046 13863100 13513480 13207377 12945617 12728131
59839 12728131 12555333 12427989 12345252 12304134 12301795 12337182 12409149 12513882 12645582 12798977
59829 12798977 12969090 13148382 13325908 13490097 13631186 13740248 13807383 13822835 13780140 13677455
59819 13677455 13515984 13298159 13027662 12710398 12354626 11969923 11565909 11151408 10734185
59810 10734185 10321004 9917654 9528798 9158000 8808162 8481827 8180841 7905827 7656294
59801 7656294 7431201 7229223 7048824 6888688 6747917 6625117 6517259 6420335 6331361 6249000
59791 6249000 6172070 6098645 6027388 5958762 5893852 5832778 5775444 5723090 5677326 5637713 5601843
$$ packed form
59857A9520751r4069j94925k86786l65588m28299m73577n01834n15192n16570
59848A6143911n07946m89845m62912m29162l90946l49620l06103k61760k17486
59839A2728131j72798j27344q2737m1118k339L5387P1967J04733J31700J53395
59829A2798977J70113J79292J77526J64189J41089J09062O7135J5452m2695j02685
59819A3677455j61471k17825k70497l17264l55772l84703m04014m14501m17223
59810A0734185m13181m03350l88856l70798l49838l26335l00986k75014k49533
59801G656294k25093k01978j80399j60136j40771j22800j07858r6924q8974q2361
59791F249000p6930p3425p1257o8626o4910o1074n7334n2354m5764l9613l5870
$$ plain form
59780 5601843 5567978 5536030 5505373 5473117 5435607 5391015 5339913 5284072 5225487 5165949 5106835
59769 5106835 5049458 4995647 4947323 4905209 4868707 4837310 4811362 4791125 4776127 4766025 4761381
59758 4761381 4763100 4771953 4788999 4815270 4850297 4892002 4938920 4991561 5050693 5115547 5184969 5259316
59746 5259316 5339616 5425366 5514529 5605123 5695415 5782977 5865106 5940135 6007403 6066506 6117954
59735 6117954 6164070 6207775 6250780 6294299 6340942 6394108 6455781 6526867 6609531 6707105 6821484
59724 6821484 6952793 7102116 7272418 7465882 7682384 7922001 8187508 8482952 8810826
59715 8810826 9171672 9565139 9989843 10442740 10919328 11412719 11910018 12389286 12821441
59706 12821441 13176302 13428690 13562744 13574993 13475212 13283427 13024309 12722322 12399265 12073348
$$ packed form
59780E601843l3865l1948l0657l2256l7510m4592n1102n5841n8585n9538n9114
59769E106835n7377n3811m8324m2114l6502l1397k5948k0237j4998j0102m644
59758D761381J719Q853J7046K6271L5027M1705M6918N2641N9132O4854O9422P4347
59746E259316Q0300Q5750Q9163R0594R0292Q7562Q2129P5029O7268N9103N1448
59735F117954M6116M3705M3005M3519M6643N3166O1673P1086Q2664R7574J14379
59724F821484J31309J49323J70302J93464K16502K39617K65507K95444L27874
59715H810826L60846L93467M24704M52897M76588M93391M97299M79268M32155
59706A2821441L54861K52388J34054J2249r9781j91785k59118l01987l23057l25917
$$ plain form
59696 12073348 11758797 11465688 11199892 10963684 10757779 10583711 10443946 10339591 10269171
59687 10269171 10230564 10223292 10248009 10304623 10392311 10511043 10661768 10845048 11060481 11307561
59677 11307561 11586298 11896978 12240205 12617440 13030922 13482740 13974131 14505546 15077129
59668 15077129 15689601 16345284 17048002 17801186 18606045 19461879 20367612 21322004 22322253
59659 22322253 23363027 24436701 25533629 26641985 27748211 28838594 29901047 30926409
59651 30926409 31909533 32850003 33751828 34622150 35469878 36304530 37134905 37967614 38806015
59642 38806015 39649428 40492331 41324137 42130270 42894071 43598327 44226355 44763277 45197389
59633 45197389 45521107 45731859 45833376 45836318 45756806 45613601 45426167 45214346 44998302 44797790
$$ packed form
59696A2073348l14551k93109k65796k36208k05905j74068j39765j04355p0420
59687A0269171l8607p272K4717N6614Q7688J18732J50725J83280K15433K47080
59677A1307561K78737L10680L43227L77235M13482M51818M91391N31415N71583
59668A5077129O12472O55683P02718P53184Q04859Q55834R05733R54392J000249
59659B2322253J040774J073674J096928J108356J106226J090383J062453J025362
59651C0926409R83124R40470R01825Q70322Q47728Q34652Q30375Q32709Q38401
59642C8806015Q43413Q42903Q31806Q06133P63801P04256O28028N36922M34112
59633D5197389L23718K10752J01517K942p9512j43205j87434k11821k16044k00512
$$ plain form
59623 44797790 44631292 44515438 44464459 44489928 44601390 44807185 45114041 45525900 46043968 46668230
59613 46668230 47397850 48229120 49153139 50155685 51218057 52316097 53417697 54482041
59605 54482041 55461972 56307463 56968390 57397700 57556403 57418931 56976221 56236247 55223397
59596 55223397 53976524 52544086 50977245 49324721 47631295 45937290 44276192 42671723
59588 42671723 41137613 39679699 38297152 36981658 35716841 34479825 33244834 31988443
59580 31988443 30695994 29366320 28010976 26648421 25298271 23979169 22708252 21499173
59572 21499173 20359763 19292318 18296191 17369786 16510862 15716613 14984244 14311160 13694505
59563 13694505 13130996 12617317 12150262 11726359 11341780 10992926 10676969 10391616 10134340
$$ packed form
59623D4797790j66498j15854n0979K5469J11462K05795L06856M11859N18068O24262
59613D6668230P29620Q31270R24019J002546J062372J098040J101600J064344
59605E4482041R79931Q45491O60927M29310J58703j37472m42710p39974j012850
59596E5223397j246873j432438j566841j652524j693426j694005j661098j604469
59588D2671723j534110j457914j382547j315494j264817j237016j234991j256391
59580C1988443j292449j329674j355344j362555j350150j319102j270917j209079
59572B1499173j139410j067445r96127r26405q58924p94249p32369o73084o16655
59563A3694505n63509n13679m67055m23903l84579l48854l15957k85353k57276
$$ plain form
59554 10134340 9901904 9690869 9498697 9324028 9165276 9018993 8880237 8744624 8609331
59545 8609331 8472204 8331235 8185745 8037039 7886685 7734727 7580677 7425706 7272513
59536 7272513 7123327 6979505 6843026 6716549 6601266 6495944 6399019 6310786 6232699 6165402
59526 6165402 6108679 6062897 6029279 6008496 5999692 6001075 6010977 6028308 6052532 6083453 6120825 6164066
59514 6164066 6212527 6265975 6324522 6388108 6456455 6529586 6608020 6692310 6782690 6879478 6983594
59503 6983594 7096413 7219160 7352794 7498456 7657787 7832530 8023821 8231977 8457120
59494 8457120 8700013 8962071 9244265 9546141 9866369 10204331 10560584 10935260 11326318
59485 11326318 11729950 12142468 12561111 12982972 13403794 13818073 14219945 14604029 14966070
$$ packed form
59554A0134340k32436k11035j92172j74669j58752j46283j38756j35613j35293
59545H609331j37127j40969j45490j48706j50354j51958j54050j54971j53193
59536G272513j49186j43822j36479j26477j15283j05322r6925q8233p8087o7297
59526F165402n6723m5782l3618k0783q804J383R902J7331K4224L0921L7372M3241
59514F164066M8461N3448N8547O3586O8347P3131P8434Q4290R0380R6788J04116
59503F983594J12819J22747J33634J45662J59331J74743J91291K08156K25143
59494H457120K42893K62058K82194L01876L20228L37962L56253L74676L91058
59485A1326318M03632M12518M18643M21861M20822M14279M01872L84084L62041
$$ plain form
59476 14966070 15302960 15611567 15887599 16126667 16327046 16490711 16621323 16722042 16795802
59467 16795802 16846495 16878682 16896812 16905888 16912350 16922936 16942970 16976890 17029921 17107340 17211449
59456 17211449 17339942 17487044 17645029 17804716 17955932 18087953 18188758 18244424 18241473 18170823
59446 18170823 18028581 17813105 17523431 17161687 16735395 16255828 15734904 15184567 14617679
59437 14617679 14047248 13484480 12938265 12415880 11923054 11463565 11039730 10653183 10304708
59428 10304708 9993819 9719290 9479787 9273653 9099098 8955591 8844398 8766583 8720850 8704183
59418 8704183 8714107 8749459 8809689 8894826 9005805 9143434 9306841 9493820 9702501 9931753
59408 9931753 10180089 10445168 10724146 11013257 11306894 11597999 11879333 12143326 12380725
$$ packed form
59476A4966070L36890L08607K76032K39068K00379J63665J30612J00719P3760
59467A6795802N0693L2187J8130R076O462J0586K0034L3920N3031P7419J04109
59456A7211449J28493J47102J57985J59687J51216J32021J00805N5666k951p0650
59446A8170823j42242k15476k89674l61744m26292m79567n20924n50337n66888
59437A4617679n70431n62768n46215n22385m92826m59489m23835l86547l48475
59428A0304708l10889k74529k39503k06134j74555j43507j11193p7815m5733j6667
59418H704183R924L5352O0230Q5137J10979J37629J63407J86979K08681K29252
59408I931753K48336K65079K78978K89111K93637K91105K81334K63993K37399
$$ plain form
59399 12380725 12580927 12734595 12835479 12879510 12863230 12784163 12642604 12442443 12190219 11893431
59389 11893431 11559647 11196851 10814030 10420514 10024153 9630308 9242790 8865253 8501159
59380 8501159 8152957 7822206 7510435 7219201 6949360 6700763 6472609 6263747 6072963
59371 6072963 5899552 5743502 5604749 5482491 5375557 5282974 5203711 5136459 5080365 5035537
59361 5035537 5002089 4979159 4965653 4961480 4967090 4982020 5004817 5034363 5070751 5115092 5168744 5231645
59349 5231645 5300248 5367812 5428464 5481350 5530418 5580858 5636812 5701530 5777477 5865972 5968109
59338 5968109 6086075 6221732 6373240 6534571 6699583 6866340 7037624 7218695 7415157
59329 7415157 7631663 7871195 8135484 8426405 8746652 9098947 9485083 9905890 10361742
$$ packed form
59399A2380725K00202J53668J00884M4031j6280p9067j41559k00161k52224k96788
59389A1893431l33784l62796l82821l93516l96361l93845l87518l77537l64094
59380H501159l48202l30751l11771k91234k69841k48597k28154k08862j90784
59371F072963j73411j56050j38753j22258j06934r2583p9263o7252n6094m4828
59361E035537l3448k2930j3506m173N610J4930K2797K9546L6388M4341N3652O2901
59349E231645O8603O7564O0652N2886M9068N0440N5954O4718P5947Q8495J02137
59338E968109J17966J35657J51508J61331J65012J66757J71284J81071J96462
59329G415157K16506K39532K64289K90921L20247L52295L86136M20807M55852
$$ plain form
59320 10361742 10853203 11381887 11950735 12562775 13219415 13920109 14662863 15443719 16255748
59311 16255748 17089554 17934747 18779923 19611564 20414853 21176636 21887312 22540322 23131608
59302 23131608 23660146 24127540 24535901 24886577 25181041 25421459 25609032 25742179 25817063
59293 25817063 25829476 25775748 25652586 25457172 25187843 24844933 24431487 23953289 23417562 22831380
59283 22831380 22201563 21535726 20842308 20129060 19401913 18665363 17923472 17180817 16443523
59274 16443523 15719393 15016123 14339154 13691874 13077384 12498677 11957140 11452458 10984396
59265 10984396 10553398 10159081 9799526 9472694 9177367 8912192 8675130 8464661 8280514
59256 8280514 8122352 7988483 7876432 7783938 7708982 7649794 7605423 7575506 7559231 7555501 7564233
$$ packed form
59320A0361742M91461N28684N68848O12040O56640P00694P42754P80856Q12029
59311A6255748Q33806Q45193Q45176Q31641Q03289P61783P10676O53010N91286
59302B3131608N28538M67394M08361L50676K94464K40418J87573J33147P4884
59293B5817063J2413n3728j23162j95414k69329l42910m13446m78198n35727n86182
59283B2831380o29817o65837o93418p13248p27147p36550p41891p42655p37294
59274A6443523p24130p03270o76969o47280o14490n78707n41537n04682m68062
59265A0984396m30998l94317l59555l26832k95327k65175k37062k10469j84147
59256H280514j58162j33869j12051r2494p4956n9188m4371k9917j6275l730Q732
$$ plain form
59245 7564233 7586057 7620296 7664801 7718365 7781673 7854967 7936322 8023315 8114950 8210706 8309088
59234 8309088 8408571 8508840 8609561 8708768 8803807 8893189 8976538 9053876 9126355 9196680 9267347
59223 9267347 9339282 9413545 9493226 9581813 9680408 9788337 9905843 10034167 10173234 10320974
59213 10320974 10474556 10630239 10782019 10922505 11045973 11149489 11231032 11288120 11318858 11322983
59203 11322983 11301064 11253466 11180734 11084593 10968337 10836682 10695209 10549308 10403476 10261758
59193 10261758 10128169 10005840 9896113 9799386 9716550 9648602 9595131 9554353 9524700 9505532
59183 9505532 9496295 9495900 9502987 9516170 9534122 9556161 9582590 9613944 9650375 9692608 9743016 9804689
59171 9804689 9879841 9970133 10078047 10206618 10358087 10534210 10737691 10971810 11238383 11537311
$$ packed form
59245G564233K1824L4239M4505N3564O3308P3294Q1355Q6993R1635R5756R8382
59234H309088R9483J00269J00721R9207R5039Q9382Q3349P7338P2479P0325P0667
59223I267347P1935P4263P9681Q8587R8595J07929J17506J28324J39067J47740
59213A0320974J53582J55683J51780J40486J23468J03516Q1543N7088L0738M125
59203A1322983k1919m7598p2732r6141j16256j31655j41473j45901j45832j41718
59193A0261758j33589j22329j09727r6727q2836o7948n3471m0778k9653j9168
59183I505532r237l95P087J3183J7952K2039K6429L1354L6431M2233N0408O1673
59171I804689P5152R0292J07914J28571J51469J76123K03481K34119K66573K98928
$$ plain form
59161 11537311 11868057 12230069 12621274 13037106 13471003 13914391 14355750 14780815 15174167
59152 15174167 15520030 15802252 16005892 16119991 16137941 16055313 15869706 15584160 15209080 14758864
59142 14758864 14247315 13687581 13095015 12486935 11878368 11279185 10695922 10134976 9602676
59133 9602676 9102776 8635491 8199733 7795665 7424365 7085384 6775805 6492165 6232541
59124 6232541 5996190 5781777 5586976 5409708 5249019 5104525 4975387 4859953 4756236
59115 4756236 4662950 4580157 4508493 4447490 4395272 4350204 4311972 4280514 4255110 4235713 4224130
59104 4224130 4222138 4228923 4242121 4261067 4286990 4319985 4358129 4400455 4448752 4505027 4568424 4636167
59092 4636167 4706740 4780893 4860221 4945980 5038832 5138378 5242925 5350594 5460754 5573737
$$ packed form
59161A1537311L30746L62012L91205M15832M33897M43388M41359M25065L93352
59152A5174167L45863K82222K03640J14099J7950q2628j85607k85546l75080m50216
59142A4758864n11549n59734n92566o08080o08567n99183n83263n60946n32300
59133I602676m99900m67285m35758m04068l71300l38981l09579k83640k59624
59124F232541k36351k14413j94801j77268j60689j44494j29138j15434j03717
59115D756236r3286q2793p1664o1003n2218m5068l8232l1458k5404j9397j1583
59104D224130j992O785J3198J8946K5923L2995L8144M2326M8297N6275O3397O7743
59092D636167P0573P4153P9328Q5759R2852R9546J04547J07669J10160J12983
$$ plain form
59082 5573737 5689204 5805441 5920320 6032500 6141665 6247911 6350789 6448504 6538115 6617018
59072 6617018 6684489 6741664 6790063 6830425 6863187 6889739 6912535 6933621 6953523 6972375 6992122
59061 6992122 7016722 7049817 7092895 7146200 7210544 7287385 7377743 7482041 7600604 7733261 7878846
59050 7878846 8036298 8206169 8389936 8587859 8798573 9020683 9253466 9495741 9745258
59041 9745258 9999514 10256080 10511476 10760367 10995990 11210466 11394687 11539414 11637556 11685094
59031 11685094 11680014 11621786 11512569 11357695 11164002 10938052 10686110 10414376 10128118 9831250
59021 9831250 9527405 9220437 8912944 8605314 8297655 7992283 7693134 7402874 7121569
59012 7121569 6848090 6581973 6323975 6075498 5837617 5610410 5393433 5186975 4992120
$$ packed form
59082E573737J15467J16237J14879J12180J09165J06246J02878R7715Q9611P8903
59072F617018O7471N7175M8399M0362L2762K6552K2796K1086J9902J8852J9747
59061F992122K4600L3095M3078N3305O4344P6841R0358J04298J18563J32657J45585
59050G878846J57452J69871J83767J97923K10714K22110K32783K42275K49517
59041I745258K54256K56566K55396K48891K35623K14476J84221J44727R8142M7538
59031A1685094n080n8228j09217j54874j93693k25950k51942k71734k86258k96868
59021I831250l03845l06968l07493l07630l07659l05372k99149k90260k81305
59012G121569k73479k66117k57998k48477k37881k27207k16977k06458j94855
$$ plain form
59003 4992120 4809132 4636644 4473342 4319747 4177203 4045535 3922930 3808024 3700822
58994 3700822 3601352 3508487 3420695 3337314 3258658 3185256 3117282 3054419 2995981 2941216 2889433
58983 2889433 2839701 2790797 2741925 2693362 2645872 2599604 2554196 2509994 2468552 2431646 2400064
58972 2400064 2373339 2350260 2329724 2311592 2296818 2286276 2279395 2274513 2270659 2268358 2268474 2270898 2274693
58959 2274693 2278805 2282053 2283176 2281991 2280335 2280876 2284703 2290619 2296799 2302376 2307420 2312365 2318082 2325666
58945 2325666 2335324 2345891 2356143 2366189 2376771 2387635 2397663 2406631 2415765 2426245 2437880 2449558
58933 2449558 2460381 2470172 2479470 2489232 2500035 2511509 2523231 2536026 2551333 2569143 2587837 2606499
58921 2606499 2626157 2648014 2671725 2696368 2721962 2748827 2776441 2804454 2834132 2867253 2903872
$$ packed form
59003D992120j82988j72488j63302j53595j42544j31668j22605j14906j07202
58994C700822r9470r2865q7792q3381p8656p3402o7974o2863n8438n4765n1783
58983B889433m9732m8904m8872m8563m7490m6268m5408m4202m1442l6906l1582
58972B400064k6725k3079k0536j8132j4774j0542o881m882l854k301J16K424L795
58959B274693M112L248J123j185j656N41L827N916O180N577N044M945N717P584
58945B325666R658J0567J0252J0046J0582J0864J0028Q968R134J0480J1635J1678
58933B449558J0823R791R298R762J0803J1474J1722J2795J5307J7810J8694J8662
58921B606499J9658K1857K3711K4643K5594K6865K7614K8013K9678L3121L6619
$$ plain form
58910 2903872 2942551 2982519 3024217 3067909 3113307 3160735 3211322 3265606 3322862 3382159 3443357
58899 3443357 3506973 3573734 3644207 3718203 3794651 3872673 3952438 4034366 4118278 4204400 4294384
58888 4294384 4389794 4490330 4595512 4707535 4829892 4962904 5103152 5248319 5400404 5562923
58878 5562923 5736901 5921308 6116043 6322563 6542295 6776007 7024361 7287827 7566391
58869 7566391 7860518 8172336 8505120 8861688 9243711 9652063 10087264 10550028 11041946
58860 11041946 11565426 12122734 12715552 13345466 14014015 14722033 15469979 16259028 17090290
58851 17090290 17961979 18868489 19803246 20761199 21736974 22720972 23698362 24651228 25560321
58842 25560321 26404941 27162563 27809424 28322112 28680257 28869712 28884074 28723779 28395067
$$ packed form
58910B903872L8679L9968M1698M3692M5398M7428N0587N4284N7256N9297O1198
58899C443357O3616O6761P0473P3996P6448P8022P9765Q1928Q3912Q6122Q9984
58888D294384R5410J00536J05182J12023J22357J33012J40248J45167J52085J62519
58878E562923J73978J84407J94735K06520K19732K33712K48354K63466K78564
58869G566391K94127L11818L32784L56568L82023M08352M35201M62764M91918
58860A1041946N23480N57308N92818O29914O68549P08018P47946P89049Q31262
58851A7090290Q71689R06510R34757R57953R75775R83998R77390R52866R09093
58842B5560321Q44620P57622O46861N12688L58145J89455J4362j60295l28712
$$ plain form
58833 28395067 27910523 27289088 26553269 25725484 24826975 23878769 22901629 21914427 20933019
58824 20933019 19970110 19035024 18133627 17269556 16445952 15665678 14930321 14239979 13593985
58815 13593985 12990914 12427972 11901544 11408878 10948629 10519501 10119112 9744701 9394453
58806 9394453 9067523 8763044 8479772 8216858 7974385 7752566 7550483 7366143 7197953
58797 7197953 7045532 6908660 6786000 6675752 6577307 6491470 6419133 6360578 6315819 6284469
58787 6284469 6265185 6256532 6258796 6273793 6302295 6342699 6392925 6452806 6523910 6607818 6705256 6816184
58775 6816184 6939954 7075779 7223583 7384014 7557574 7744641 7946485 8165079 8401363
58766 8401363 8654890 8925819 9216063 9527764 9862014 10220030 10604145 11016213 11456288
$$ packed form
58833B8395067m84544o21435p35819q27785q98509r48206r77140r87202r81408
58824B0933019r62909r35086r01397q64071q23604p80274p35357o90342o45994
58815A3593985o03071n62942n26428m92666m60249m29128m00389l74411l50248
58806I394453l26930l04479k83272k62914k42473k21819k02083j84340j68190
58797G197953j52421j36872j22660j10248r8445q5837p2337n8555m4759l1350
58787F284469j9284q653K264J4997K8502M0404N0226N9881P1104Q3908R7438J10928
58775F816184J23770J35825J47804J60431J73560J87067K01844K18594K36284
58766H401363K53527K70929K90244L11701L34250L58016L84115M12068M40075
$$ plain form
58757 11456288 11924539 12423607 12957433 13528436 14137521 14786158 15476397 16208677 16981156
58748 16981156 17791298 18636706 19514122 20418485 21342700 22276687 23206030 24112233 24974500
58739 24974500 25770844 26478122 27072800 27532884 27839734 27979540 27945209 27737798 27365879
58730 27365879 26843466 26188574 25422386 24567574 23646220 22679003 21685316 20682595 19685144
58721 19685144 18704231 17749180 16827637 15944913 15103967 14306213 13551962 12840555 12170895
58712 12170895 11541787 10951488 10397685 9878739 9394140 8942517 8519993 8122184 7747643
58703 7747643 7397703 7072808 6770585 6487924 6223536 5977653 5750126 5539619 5344238
58694 5344238 5162480 4993751 4837998 4694508 4561248 4435973 4317803 4207218 4104778
$$ packed form
58757A1456288M68251M99068N33826N71003O09085O48637O90239P32280P72479
58748A6981156Q10142Q45408Q77416R04363R24215R33987R29343R06203Q62267
58739B4974500P96344P07278N94678M60084L06850J39806l4331k07411l71919
58730B7365879n22413o54892p66188q54812r21354r67217r93687j002721r97451
58721A9685144r80913r55051r21543q82724q40946p97754p54251p11407o69660
58712A2170895o29108n90299n53803n18946m84599m51623m22524l97809l74541
58703G747643l49940l24895l02223k82661k64388k45883k27527k10507j95381
58694E344238j81758j68729j55753j43490j33260j25275j18170j10585j02440
$$ plain form
58685 4104778 4010480 3923979 3844528 3770805 3701482 3635818 3573197 3512613 3453439 3396123 3341186
58674 3341186 3288109 3236303 3186387 3138918 3092421 3044608 2995640 2948291 2904482 2863153 2821980
58663 2821980 2779649 2735831 2690465 2644045 2597585 2551350 2504420 2456181 2407479 2359631 2313050
58652 2313050 2267507 2223034 2179838 2137959 2097806 2060535 2026965 1996108 1965486 1933197 1899647
58641 1899647 1867143 1837700 1811222 1785986 1760868 1736383 1713178 1690447 1666883 1642675 1619421
58630 1619421 1598187 1578785 1560845 1544400 1529265 1514959 1501614 1490149 1481256 1474926 1470995 1469283
58618 1469283 1469013 1469091 1469312 1470586 1473660 1478326 1484055 1490597 1497553 1503932 1508600 1510891 1510755 1508786 1506161
58603 1506161 1504094 1503276 1503909 1505795 1507909 1508571 1506972 1504094 1501318 1498823 1496545 1495979 1499206 1506225 1514991
$$ packed form
58685D104778r4298q6501p9451p3723o9323o5664o2621o0584n9174n7316n4937
58674C341186n3077n1806m9916m7469m6497m7813m8968m7349m3809m1329m1173
58663B821980m2331m3818m5366m6420m6460m6235m6930m8239m8702m7848m6581
58652B313050m5543m4473m3196m1879m0153l7271l3570l0857l0622l2289l3550
58641A899647l2504k9443k6478k5236k5118k4485k3205k2731k3564k4208k3254
58630A619421k1234j9402j7940j6445j5135j4306j3345j1465q893o330l931j712
58618A469283k70P8K21J274L074M666N729O542O956O379M668K291j36j969k625
58603A506161k067q18O33J886K114O62j599k878k776k495k278n66L227P019Q766
$$ plain form
58588 1514991 1524344 1535267 1548879 1564810 1582322 1601736 1623791 1648536 1675682 1705359 1737881
58577 1737881 1773361 1812075 1854723 1901910 1953745 2010008 2070259 2133864 2200601 2271128 2346166
58566 2346166 2425639 2509658 2599937 2698790 2806796 2923019 3047634 3182766 3330326 3490499
58556 3490499 3662771 3846996 4042976 4250581 4470923 4705719 4954465 5213600 5479496
58547 5479496 5750861 6026732 6302939 6571675 6823546 7048699 7236986 7379248 7469213 7503895
58537 7503895 7482791 7407798 7283733 7117735 6917675 6691233 6446022 6189591 5928856 5669509
58527 5669509 5415740 5170249 4934672 4710335 4498767 4301557 4119815 3953539 3801410
58518 3801410 3661698 3533798 3418384 3315599 3223752 3140594 3065138 2997015 2934581 2875125
$$ packed form
58588A514991R353J0923J3612J5931J7512J9414K2055K4745K7146K9677L2522
58577A737881L5480L8714M2648M7187N1835N6263O0251O3605O6737P0527P5038
58566B346166P9473Q4019R0279R8853J08006J16223J24615J35132J47560J60173
58556C490499J72272J84225J95980K07605K20342K34796K48746K59135K65896
58547E479496K71365K75871K76207K68736K51871K25153J88287J42262Q9965L4682
58537G503895k1104p4993j24065j65998k00060k26442k45211k56431k60735k59347
58527E669509k53769k45491k35577k24337k11568j97210j81742j66276j52129
58518C801410j39712j27900j15414j02785r1847q3158p5456o8123o2434n9456
$$ plain form
58508 2875125 2816776 2758912 2701123 2643516 2588002 2537223 2491526 2448391 2405392 2362344 2320146
58497 2320146 2279154 2239507 2201507 2164496 2126447 2085770 2042996 1999994 1958281 1918625 1881402
58486 1881402 1846607 1813975 1783395 1754564 1726425 1698152 1670805 1646576 1625913 1606761 1587230
58475 1587230 1567687 1549538 1533244 1518413 1504830 1492474 1481320 1471653 1463706 1456610 1448773 1439750
58463 1439750 1430671 1422480 1414980 1407949 1401633 1395577 1388459 1379835 1370586 1361094 1350632 1339391 1329157
58450 1329157 1320701 1312191 1301771 1290260 1279689 1270394 1261294 1252068 1243227 1234722 1226127 1217803 1210408
58437 1210408 1203524 1196036 1187711 1179451 1172210 1166375 1161817 1157888 1153814 1149573 1145790 1142381 1138235 1132815
58423 1132815 1127073 1122061 1117575 1112858 1107740 1102462 1097431 1093751 1092786 1094372 1096534 1097679 1097938 1097771 1096824
$$ packed form
58508B875125n8349n7864n7789n7607n5514n0779m5697m3135m2999m3048m2198
58497B320146m0992l9647l8000l7011l8049m0677m2774m3002m1713l9656l7223
58486A881402l4795l2632l0580k8831k8139k8273k7347k4229k0663j9152j9531
58475A587230j9543j8149j6294j4831j3583j2356j1154r667p947p096p837r023
58463A439750r079q191p500p031o316o056p118q624r249r492j0462j1241j0234
58450A329157q456q510j0420j1511j0571r295r100r226q841q505q595q324p395
58437A210408o884p488q325q260p241n835m558l929m074m241l783l409m146n420
58423A132815n742n012m486m717n118n278n031l680r65J586K162J145K59j67r47
$$ plain form
58408 1096824 1095141 1094003 1094290 1095249 1095971 1096712 1097624 1097710 1096541 1095666 1096753 1099418 1102365 1105425 1108850 1111845
58392 1111845 1113786 1116005 1120349 1126393 1131837 1135351 1137480 1139009 1139838 1139378 1137011 1132398 1126132 1119631
58378 1119631 1113681 1107799 1101603 1095716 1090445 1084768 1077827 1070367 1063524 1057249 1051062 1045216 1039820 1034070
58364 1034070 1027892 1023277 1022257 1024313 1027289 1030132 1033260 1036921 1040672 1044044 1046595 1047945 1048784 1051120
58350 1051120 1056567 1065055 1075787 1088197 1101242 1113338 1124140 1135020 1146894 1159241 1172152 1186998
58338 1186998 1203590 1219110 1231889 1243968 1257504 1270852 1281077 1288589 1296032 1303867 1310308 1314887
58326 1314887 1319034 1323473 1327711 1331802 1336244 1340488 1343761 1346850 1350938 1355262 1358162 1359765 1361492 1363682
58312 1363682 1365990 1369285 1374582 1380709 1385565 1389293 1393953 1400584 1408740 1418127 1428244 1437282 1444035 1450169
$$ packed form
58408A096824j683j138K87R59P22P41R12Q6j169q75J087K665K947L060L425K995
58392A111845J941K219M344O044N444L514K129J529Q29m60k367m613o266o501
58378A119631n950n882o196n887n271n677o941p460o843o275o187n846n396n750
58364A034070o178m615j020K056K976K843L128L661L751L372K551J350Q39K336
58350A051120N447Q488J0732J2410J3045J2096J0802J0880J1874J2347J2911J4846
58338A186998J6592J5520J2779J2079J3536J3348J0225P512P443P835O441M579
58326A314887M147M439M238M091M442M244L273L089M088M324K900J603J727K190
58312A363682K308L295N297O127M856L728M660O631Q156R387J0117R038O753O134
$$ plain form
58298 1450169 1457976 1466684 1473864 1479636 1486157 1493447 1499283 1503374 1508170 1514905 1521845 1527299 1531823 1536656
58284 1536656 1542132 1548220 1554708 1560560 1565027 1569534 1576441 1585935 1596049 1605604 1615052 1624695 1634408 1645058
58270 1645058 1657853 1672201 1686277 1699688 1713592 1728430 1743614 1759187 1775769 1793250 1811612
58259 1811612 1832318 1856441 1881967 1905505 1926384 1946769 1968247 1990656 2013634 2036805 2059104
58248 2059104 2080348 2102617 2127561 2153553 2178421 2203517 2231461 2261085 2288817 2314542 2341871
58237 2341871 2372620 2405037 2437841 2472229 2509288 2548587 2589770 2632726 2676362 2720160 2766392
58226 2766392 2817375 2871118 2923369 2973571 3025012 3079660 3137027 3197897 3264603 3337241 3413467
58215 3413467 3492205 3573771 3656637 3738480 3820564 3906809 3998374 4093294 4191288 4294361 4402676
$$ packed form
58298A450169P807Q708P180N772O521P290N836M091M796O735O940N454M524M833
58284A536656N476O088O488N852M467M507O907R494J0114R555R448R643R713J0650
58270A645058J2795J4348J4076J3411J3904J4838J5184J5573J6582J7481J8362
58259A811612K0706K4123K5526K3538K0879K0385K1478K2409K2978K3171K2299
58248B059104K1244K2269K4944K5992K4868K5096K7944K9624K7732K5725K7329
58237B341871L0749L2417L2804L4388L7059L9299M1183M2956M3636M3798M6232
58226B766392N0983N3743N2251N0202N1441N4648N7367O0870O6706P2638P6226
58215C413467P8738Q1566Q2866Q1843Q2084Q6245R1565R4920R7994J03073J08315
$$ plain form
58204 4402676 4514608 4631272 4756486 4891861 5036186 5189447 5352824 5525166 5704701
58195 5704701 5894050 6098012 6316343 6544384 6781056 7030471 7295460 7575544 7871831
58186 7871831 8187709 8523972 8879310 9256355 9661169 10096196 10560005 11054389 11584918
58177 11584918 12153757 12758684 13399777 14080041 14799028 15553546 16345577 17181891 18065242
58168 18065242 18993897 19970252 21001193 22089464 23234133 24440549 25720010 27078372
58160 27078372 28515097 30034748 31648692 33364156 35183125 37113797 39171575 41367769
58152 41367769 43710747 46220497 48928828 51864039 55050841 58527454 62346029 66553143
58144 66553143 71186829 76294909 81937796 88173482 95065513 102711957 111243967 120793320
$$ packed form
58204D402676J11932J16664J25214J35375J44325J53261J63377J72342J79535
58195E704701J89349K03962K18331K28041K36672K49415K64989K80084K96287
58186G871831L15878L36263L55338L77045M04814M35027M63809M94384N30529
58177A1584918N68839O04927O41093O80264P18987P54518P92031Q36314Q83351
58168A8065242R28655R76355J030941J088271J144669J206416J279461J358362
58160B7078372J436725J519651J613944J715464J818969J930672K057778K196194
58152D1367769K342978K509750K708331K935211L186802L476613L818575M207114
58144F6553143M633686N108080N642887O235686O892031P646444Q532010R549353
$$ plain form
58136 120793320 131486860 143468346 156883818 171841755 188439843 206854424 227381634
58129 227381634 250429218 276551011 306356503 339879086 375451368 409050040 435163654
58122 435163654 448993067 448483336 434827155 411442058 382438004 351445172 321022747
58115 321022747 292548028 266467095 242720801 221095807 201384522 183428499 167132742
58108 167132742 152451119 139345732 127769685 117683405 109056449 101842648 95969615
58101 95969615 91347652 87860514 85348931 83634867 82555875 81917773 81383466 80457034
58093 80457034 78654041 75732238 71781690 67125581 62148033 57170065 52405206 47970313
58085 47970313 43918804 40267252 37003115 34087372 31467944 29097078 26938967 24970028
$$ packed form
58136A20793320J0693540J1981486J3415472J4957937J6598088J8414581K0527210
58129B27381634K3047584K6121793K9805492L3522583L5572282L3598672K6113614
58122D35163654J3829413n09731j3656181k3385097k9004054l0992832l0422425
58115C21022747k8474719k6080933k3746294k1624994j9711285j7956023j6295757
58108A67132742j4681623j3105387j1576047j0086280q626956p213801n873033
58101I5969615m621963l487138k511583j714064j078992o38102n34307r26432
58093H0457034j802993k921803l950548m656109m977548m977968m764859m434893
58085D7970313m051509l651552l264137k915743k619428k370866k158111j968939
$$ plain form
58077 24970028 23179159 21563734 20118784 18830490 17680913 16653411 15730209 14890559
58069 14890559 14116321 13395898 12719878 12077989 11464345 10880891 10331082 9813558 9325261
58060 9325261 8866335 8437706 8037334 7662719 7313839 6989733 6684903 6392506 6109073
58051 6109073 5834023 5567760 5312737 5073128 4850550 4642562 4447086 4264873 4095497
58042 4095497 3934846 3779609 3631088 3491654 3360316 3234641 3114343 3000222 2892052
58033 2892052 2790088 2696270 2611417 2533372 2459953 2391365 2327614 2266252 2205057 2144611 2086083
58022 2086083 2028866 1972731 1919921 1872441 1829058 1787245 1746374 1707049 1669064 1632046 1596517
58011 1596517 1562500 1528741 1494926 1463053 1434966 1410051 1386672 1364253 1342904 1322821 1305215
$$ packed form
58077B4970028j790869j615425j444950j288294j149577j027502r23202q39650
58069A4890559p74238p20423o76020o41889o13644n83454n49809n17524m88297
58060I325261m58926m28629m00372l74615l48880l24106l04830k92397k83433
58051F109073k75050k66263k55023k39609k22578k07988j95476j82213j69376
58042D095497j60651j55237j48521j39434j31338j25675j20298j14121j08170
58033B892052j01964r3818q4853p8045p3419o8588o3751o1362o1195o0446n8528
58022B086083n7217n6135n2810m7480m3383m1813m0871l9325l7985l7018l5529
58011A596517l4017l3759l3815l1873k8087k4915k3379k2419k1349k0083j7606
$$ plain form
58000 1305215 1291758 1281864 1272374 1261022 1248242 1234767 1219961 1203826 1188150 1174095 1160736 1147305
57988 1147305 1134659 1123269 1112142 1101101 1091662 1084162 1076447 1067032 1057134 1047849 1037839 1025855
57976 1025855 1013427 1003105 995921 992148 992234 995076 997535 997710 996742 995727 993256 988190 982558 979085
57962 979085 977576 976090 974084 972005 969302 965162 960066 954507 947404 937683 926257 914722 903416
57949 903416 892319 882218 873140 863356 851981 840966 832437 825545 818085 809745 801550 793522 785328
57936 785328 778047 772928 769250 765541 761957 759474 757769 756041 754933 755550 757575 760353 764594 770553
57922 770553 775573 776278 772856 768792 766687 766599 768084 771179 775028 777687 777993 776442 774143 772208 771937
57907 771937 774058 777673 781048 783247 783976 782436 777912 771339 764832 759580 755238 751276 747801 744891
$$ packed form
58000A305215j3457r894r490j1352j2780j3475j4806j6135j5676j4055j3359j3431
57988A147305j2646j1390j1127j1041r439p500p715r415r898r285j0010j1984
57976A025855j2428j0322p184l773Q6K842K459J75r68j015k471n066n632l473
57962I79085j509j486k006k079k703m140n096n559p103r721j1426j1535j1306
57949I03416j1097j0101r078r784j1375j1015q529o892p460q340q195q028q194
57936G85328p281n119l678l709l584k483j705j728j108O17K025K778M241N959
57922G70553N020P05l422m064k105q8J485L095L849K659L06j551k299j935k71
57907G71937K121L615L375K199P29j540m524o573o507n252m342l962l475k910
$$ plain form
57893 744891 741940 737966 732449 726147 720940 718076 716611 714704 712328 710954 710533 709133 706394 704744
57879 704744 705796 707848 708772 709083 709946 710232 708234 704725 701540 698349 693514 687157 680578 673441 664245
57864 664245 653244 642430 633043 625331 620135 618155 618011 617571 616973 617932 620350 622209 622717 622957 623398
57849 623398 623502 624120 627573 634504 642883 650844 658441 665880 672213 676885 680813 684861 688530 691008 692232
57834 692232 692353 691442 690217 689591 688909 686026 679883 671781 663498 655375 646929 638251 629968 622570 616257
57819 616257 610828 605579 600127 595310 592254 590607 589004 587347 587184 589565 593854 599012 604777 611086
57805 611086 617589 624263 631518 639271 646840 653975 660856 666867 670666 672012 672325 672883 673446 673068 671187
57790 671187 667340 660910 651962 641680 631392 621723 612908 605213 598610 592651 586921 581156 574982 568267
$$ packed form
57893G44891k951l974n517o302n207k864j465j907k376j374m21j400k739j650
57879G04744J052K052R24L11Q63K86j998l509l185l191m835o357o579p137r196
57864F64245j1001j0814r387p712n196j980j44m40n98R59K418J859N08K40M41
57849F23398J04O18L453O931Q379P961P597P439O333M672L928M048L669K478J224
57834F92232J21r11j225o26o82k883o143q102q283q123q446q678q283p398o313
57819F16257n429n249n452m817l056j647j603j657j63K381M289N158N765O309
57805F11086O503O674P255P753P569P135O881O011L799J346L13N58N63l78j881
57790F71187l847o430q948j0282j0288r669q815p695o603n959n730n765o174o715
$$ plain form
57776 568267 561630 555722 550167 544216 538288 533591 530214 526918 522914 518413 513133 505837 496105 485366
57762 485366 475332 466186 456819 446149 433942 421303 410538 403399 399053 394870 389569 384479 381256
57749 381256 379636 378110 375680 372220 368162 364662 363228 364424 367527 371855 377471 384183 390996 397266
57735 397266 403312 409089 413376 415337 415953 416832 418321 419893 421702 424439 428059 431850 435659 439907 444370
57720 444370 447841 449323 448955 447623 445992 444020 441143 436837 431132 424586 417815 411306 405644 401437
57706 401437 398754 396910 394973 392428 389565 387565 387944 391153 395800 399982 403407 407391 412687 418374
57692 418374 423326 427852 433146 439709 446985 454244 461270 468368 476030 484301 492288 498687 503184 507116
57678 507116 512476 520439 530882 542824 554849 565334 573020 577964 581996 587652 595966 605525 614474
$$ packed form
57776E68267o637n908n555n951n928m697l377l296m004m501n280p296r732j0739
57762D85366j0034r146r367j0670j2207j2639j0765p139m346m183n301n090l223
57749C81256j620j526k430l460m058l500j434J196L103M328N616O712O813O270
57735C97266O046N777M287J961O16Q79J489J572J809K737L620L791L809M248M463
57720D44370L471J482l68j332j631j972k877m306n705o546o771o509n662m207
57706D01437k683j844j937k545k863k000L79L209M647M182L425L984N296N687
57692D18374M952M526N294O563P276P259P026P098P662Q271P987O399M497L932
57678E07116N360P963J0443J1942J2025J0485P686M944M032N656Q314R559Q949
$$ plain form
57665 614474 623323 634581 649380 665888 681882 697450 713968 731743 750340 770209 792032 815051
57653 815051 837958 861063 885725 912123 939683 969319 1002727 1039293 1076279 1112681 1150635
57642 1150635 1192174 1236826 1283454 1332448 1384853 1440961 1500951 1565353 1633933 1705798 1781643
57631 1781643 1864180 1955115 2053418 2157858 2269595 2390778 2522300 2664603 2819197 2987532
57621 2987532 3169570 3365178 3575563 3801412 4040706 4290454 4549556 4817748 5092208
57612 5092208 5367051 5635542 5890949 6125860 6332700 6504498 6633247 6708088 6717816 6656318
57602 6656318 6525269 6332833 6091936 5818909 5530194 5238278 4951028 4674377 4413698
57593 4413698 4172383 3951019 3748746 3564401 3396325 3242875 3103772 2979833 2871052
$$ packed form
57665F14474Q849J1258J4799J6508J5994J5568J6518J7775J8597J9869K1823K3019
57653H15051K2907K3105K4662K6398K7560K9636L3408L6566L6986L6402L7954
57642A150635M1539M4652M6628M8994N2405N6108N9990O4402O8580P1865P5845
57631A781643Q2537R0935R8303J04440J11737J21183J31522J42303J54594J68335
57621B987532J82038J95608K10385K25849K39294K49748K59102K68192K74460
57612E092208K74843K68491K55407K34911K06840J71798J28749P4841R728o1498
57602F656318j31049j92436k40897k73027k88715k91916k87250k76651k60679
57593D413698k41315k21364k02273j84345j68076j53450j39103j23939j08781
$$ plain form
57584 2871052 2776145 2694162 2625114 2568619 2523378 2488502 2463913 2448734 2440610 2437609 2440005 2449424
57572 2449424 2466982 2492799 2526579 2567959 2616911 2674234 2741108 2817832 2903661 2998174 3102131
57561 3102131 3216641 3342091 3478053 3623494 3776846 3936606 4101980 4271965 4443296
57552 4443296 4609873 4764456 4900358 5011624 5092861 5139628 5148636 5117775 5047225 4940991
57542 4940991 4806180 4649856 4476882 4290833 4095750 3896275 3696873 3501536 3313409
57533 3313409 3133898 2962766 2799769 2645735 2501659 2367646 2243490 2129487 2025657
57524 2025657 1930746 1843089 1762186 1688523 1621916 1560935 1504039 1450619 1400854 1355053 1313308
57513 1313308 1275443 1241145 1210223 1182608 1158040 1136117 1116855 1100862 1088506 1079168 1071723 1065676
$$ packed form
57584B871052r4907q1983o9048n6495m5241l4876k4589j5179q124l001K396R419
57572B449424J7558K5817L3780M1380M8952N7323O6874P6724Q5829R4513J03957
57561C102131J14510J25450J35962J45441J53352J59760J65374J69985J71331
57552D443296J66577J54583J35902J11266Q1237M6767R008l0861p0550j06234
57542D940991j34811j56324j72974j86049j95083j99475j99402j95337j88127
57533C313409j79511j71132j62997j54034j44076j34013j24156j14003j03830
57524B025657r4911q7657q0903p3663o6607o0981n6896n3420m9765m5801m1745
57513A313308l7865l4298l0922k7615k4568k1923j9262j5993j2356r338p445o047
$$ plain form
57501 1065676 1061462 1059714 1060430 1062790 1065666 1068521 1072022 1077588 1086115 1097309 1110315 1124683 1140466
57488 1140466 1157830 1177086 1198887 1223710 1250917 1278900 1306676 1335298 1367220 1404148 1445932
57477 1445932 1491823 1542179 1598039 1659192 1723925 1791257 1862513 1939857 2023974 2114276 2210990
57466 2210990 2315788 2430135 2553864 2685411 2822694 2963497 3105707 3247463 3386674
57457 3386674 3520228 3643864 3752576 3840758 3902656 3933973 3933432 3902342 3842870 3757597 3650521
57446 3650521 3527094 3392685 3251570 3107437 2963760 2823191 2687309 2557379 2434734
57437 2434734 2320192 2213833 2115757 2026507 1946511 1875688 1813755 1760218 1713974 1673770 1639339
57426 1639339 1611394 1590328 1575621 1566560 1562645 1563254 1568050 1577796 1593489 1614309 1637867 1663132
$$ packed form
57501A065676m214j748P16K360K876K855L501N566Q527J1194J3006J4368J5783
57488A140466J7364J9256K1801K4823K7207K7983K7776K8622L1922L6928M1784
57477A445932M5891N0356N5860O1153O4733O7332P1256P7344Q4117R0302R6714
57466B210990J04798J14347J23729J31547J37283J40803J42210J41756J39211
57457C386674J33554J23636J08712Q8182O1898L1317n41l1090n9472q5273j07076
57446C650521j23427j34409j41115j44133j43677j40569j35882j29930j22645
57437B434734j14542j06359r8076q9250p9996p0823o1933n3537m6244m0204l4431
57426A639339k7945k1066j4707r061l915O09M796R746J5693K0820K3558K5265
$$ plain form
57414 1663132 1691923 1726935 1769537 1820063 1878598 1944202 2014703 2088820 2167757 2253511 2346463
57403 2346463 2445836 2551499 2663539 2780488 2899439 3017711 3133049 3242300 3341000 3424094
57393 3424094 3486203 3521926 3527523 3502381 3447962 3365758 3257792 3128839 2986169 2836209 2682319
57382 2682319 2526123 2369853 2216597 2068886 1927765 1793227 1665316 1544869 1433034
57373 1433034 1330069 1235171 1147766 1068187 996443 931076 870212 813159 759929 709801 661712
57362 661712 615825 573423 535204 500699 469246 440515 414180 389989 367953 347528 327151
57351 327151 305926 285315 267511 252328 237483 222043 207671 195959 186291 177103 167736 158167
57339 158167 148257 138173 128444 118795 108032 95909 84039 74104 66165 59471 53683 48320 42258
$$ packed form
57414A663132K8791L5012M2602N0526N8535O5604P0501P4117P8937Q5754R2952
57403B346463R9373J05663J12040J16949J18951J18272J15338J09251R8700Q3094
57393C424094O2109L5723N597k5142n4419q2204j07966j28953j42670j49960j53890
57382B682319j56196j56270j53256j47711j41121j34538j27911j20447j11835
57373A433034j02965r4898q7405p9579p1744o5367o0864n7053n3230n0128m8089
57362F61712m5887m2402l8219l4505l1453k8731k6335k4191k2036k0425k0377
57351C27151k1225k0611j7804j5183j4845j5440j4372j1712r668r188r367r569
57339A58167r910j0084r729r649j0763j2123j1870r935p939o694n788n363o062
$$ plain form
57326 42258 35147 28469 23839 20956 18472 16235 15161 15221 15034 13525 10888 7823 4779 2057 -206
57310 -2344 -4954 -8321 -12410 -17170 -22229 -26547 -29120 -30008 -30188 -30451 -30923 -31581 -32713 -34778 -37942 -41552
57294 -41552 -43986 -43708 -40958 -37911 -36629 -37260 -38654 -39963 -40826 -40747 -39631 -38703 -39583 -42245 -44894 -46195
57278 -46195 -46786 -48238 -51226 -55200 -59339 -63276 -67036 -70570 -73439 -75035 -75306 -75138 -75646 -77062 -78588
57263 -78588 -79315 -79043 -78235 -77466 -76987 -76641 -76167 -75553 -74831 -73462 -70498 -65870 -61146 -58284 -57542 -57129 -55122
57246 -55122 -51338 -47096 -43364 -39568 -34300 -26834 -17557 -7035 4593 17002 29252 40887 52951
57233 52951 66821 82224 97567 112224 127208 143495 161149 180508 202670 227892 254947 283168
57221 283168 313891 348599 386654 426247 466482 506913 545967 581738 613792 642207 665183
$$ packed form
57326D2258p111o678m630k883k484k237j074O0j87j509k637l065l044B057b06
57310b344k610l367m089m760n059m318k573q88j80k63m72o58j132k065l164l610
57294d1552k434K78K750L047J282o31j394j309q63P9J116R28q80k662k649j301
57278d6195n91j452k988l974m139l937l760l534k869j596k71J68n08j416j526
57263g8588p27K72Q08P69M79L46M74O14P22J369K964M628M724K862P42M13K007
57246e5122L784M242L732L796N268P466R277g035D593J2409J2250J1635J2064
57233E2951J3870J5403J5343J4657J4984J6287J7654J9359K2162K5222K7055K8221
57221B83168L0723L4708L8055L9593M0235M0431L9054L5771L2054K8415K2976
$$ plain form
57210 665183 679761 685085 682952 674909 660871 641294 618561 594660 568777 538801 504672 469077
57198 469077 435190 404656 377466 352823 329920 308328 287903 268555 250416 234028 219674
57187 219674 206562 193487 180592 169725 162606 159207 158300 158994 161172 164805 169516 174881 180916 188204
57173 188204 197486 208906 221803 235489 250146 266504 284755 304200 324046 344310 366088 391123
57161 391123 420661 454174 489517 524767 559609 594637 630253 667078 706438 748893 792788
57150 792788 835877 878259 922043 968055 1014681 1060464 1106144 1153140 1201320 1249421 1296913
57139 1296913 1344337 1392096 1439736 1486448 1532065 1577623 1624739 1674031 1724441 1774728 1825109
57128 1825109 1876524 1928812 1980930 2032686 2084710 2136845 2188399 2240187 2294512 2352465 2412775
$$ packed form
57210F65183J4578N324k133q043j4038j9577k2733k3901k5883k9976l4129l5595
57198D69077l3887l0534k7190k4643k2903k1592k0425j9348j8139j6388j4354
57187B19674j3112j3075j2895j0867p119l399r07O94K178L633M711N365O035P288
57173A88204R282J1420J2897J3686J4657J6358J8251J9445J9846K0264K1778K5035
57161C91123K9538L3513L5343L5250L4842L5028L5616L6825L9360M2455M3895
57150G92788M3089M2382M3784M6012M6626M5783M5680M6996M8180M8101M7492
57139A296913M7424M7759M7640M6712M5617M5558M7116M9292N0410N0287N0381
57128A825109N1415N2288N2118N1756N2024N2135N1554N1788N4325N7953O0310
$$ plain form
57117 2412775 2473916 2535759 2598280 2660116 2719483 2775557 2828222 2877497 2923804 2967594 3008083
57106 3008083 3043628 3073957 3100605 3124500 3144759 3160808 3173932 3185513 3195485 3204204 3214405 3229207
57094 3229207 3248830 3270881 3293138 3314406 3333092 3346684 3352697 3349076 3333724 3304608 3260493 3201240
57082 3201240 3127669 3041265 2943433 2834845 2716147 2588944 2454677 2312406 2159148 1992311
57072 1992311 1809835 1607660 1379335 1118831 821557 481940 92804 -351394 -853230 -1415859
57062 -1415859 -2045890 -2751309 -3539114 -4416892 -5394262 -6480634 -7683950 -9014018 -10484984
57053 -10484984 -12112294 -13909536 -15890694 -18073086 -20475458 -23115862 -26014861 -29199270
57045 -29199270 -32700662 -36553805 -40801341 -45499239 -50715332 -56524789 -63009044 -70254035
$$ packed form
57117B412775O1141O1843O2521O1836N9367N6074N2665M9275M6307M3790M0489
57106C008083L5545L0329K6648K3895K0259J6049J3124J1581R972Q719J0201J4802
57094C229207J9623K2051K2257K1268J8686J3592O013l621j5352k9116m4115n9253
57082C201240p3571q6404r7832j08588j18698j27203j34267j42271j53258j66837
57072A992311j82476k02175k28325k60504k97274l39617I2804c51394n01836n62629
57062a415859o30031p05419p87805q77778r77370j086372j203316j330068j470966
57053a0484984j627310j797242j981158k182392k402372k640404k898999l184409
57045b9199270l501392l853143m247536m697898n216093n809457o484255p244991
$$ plain form
57037 -70254035 -78342745 -87349023 -97339634 -108376143 -120506949 -133757512 -148131193
57030 -148131193 -163614304 -180169179 -197715762 -216123617 -235243497 -254993373 -275454599
57023 -275454599 -296845721 -319249399 -342174679 -364288878 -383625647 -398204476 -406654892
57016 -406654892 -408495575 -404060686 -394273293 -380389101 -363714443 -345336944 -325977056
57009 -325977056 -306008490 -285576200 -264722736 -243500508 -222069497 -200744213 -179955096
57002 -179955096 -160147499 -141678440 -124753716 -109419112 -95604007 -83193821 -72086819
56995 -72086819 -62206523 -53483795 -45840527 -39186736 -33424241 -28452571 -24176232 -20507684
56987 -20507684 -17363836 -14664633 -12339213 -10331180 -8595101 -7090659 -5782715 -4642911
$$ packed form
57037g0254035q088710r006278r990611j1036509j2130806j3250563j4373681
57030a48131193j5483111j6554875j7546583j8407855j9119880j9749876k0461226
57023b75454599k1391122k2403678k2925280k2114199j9336769j4578829q450416
57016d06654892j840683M434889R787393J3884192J6674658J8377499J9359888
57009c25977056J9968566K0432290K0853464K1222228K1431011K1325284K0789117
57002a79955096J9807597J8469059J6924724J5334604J3815105J2410186J1107002
56995g2086819R880296Q722728P643268O653791N762495M971670M276339L668548
56987b0507684L143848K699203K325420K008033J736079J504442J307944J139804
$$ plain form
56979 -4642911 -3646315 -2767940 -1985644 -1284152 -652725 -80671 441871 921052 1360878 1766483
56969 1766483 2142878 2491983 2813859 3109775 3381656 3629929 3854118 4053574 4225028
56960 4225028 4361681 4458325 4516535 4542513 4541650 4518067 4477449 4426291 4368855 4307674 4246063
56949 4246063 4187295 4132522 4082708 4041717 4014870 4006366 4021734 4069819 4154293 4259980 4351519
56938 4351519 4389608 4350196 4231782 4050912 3833162 3603583 3379270 3167863 2971479 2790190
56928 2790190 2622275 2464595 2314968 2173172 2039095 1911549 1789735 1674106 1564670
56919 1564670 1459823 1357838 1258438 1162280 1070232 983746 904412 832191 765422 703416 647671
56908 647671 599469 557608 519772 485239 455008 430021 410454 396151 386640 381041 378792 380112
$$ packed form
56979d642911R96596Q78375P82296P01492O31427h0671D41871M79181M39826M05605
56969A766483L76395L49105L21876K95916K71881K48273K24189J99456J71454
56960D225028J36653R6644N8210K5978q63k3583m0618n1158n7436o1181o1611
56949D246063n8768n4773m9814m0991k6847q504J5368M8085Q4474J05687R1539
56938D351519L8089l9412j18414j80870k17750k29579k24313k11407j96384j81289
56928B790190j67915j57680j49627j41796j34077j27546j21814j15629j09436
56919A564670j04847j01985r9400r6158r2048q6486p9334p2221o6769o2006n5745
56908F47671m8202m1861l7836l4533l0231k4987j9567j4303r511n599k249J320
$$ plain form
56896 380112 384938 391744 398057 401879 402100 398008 389274 376350 360389 342853 325457 310031 297679
56883 297679 288088 280156 273448 268806 267545 270297 276747 286302 298777 314422 333645 357016 385237
56870 385237 418300 454182 488644 516630 533984 538555 530861 514010 491973 467224 440472 412661
56858 412661 385872 361678 339950 320337 303696 290840 280963 272843 266629 262779 260076 256801 253501
56845 253501 252574 255190 260448 267431 275982 285278 293794 301318 309100 317383 324677 330372 336187 343774
56831 343774 352453 360694 368514 376917 386012 395376 405573 417512 430316 441106 447145 447575 443266
56818 443266 435816 426871 417789 409557 402895 398193 395454 394814 397211 404022 415872 432271 452375 475448
56804 475448 500737 528034 558597 594321 635376 679343 722870 763093 796990 820899 832184
$$ packed form
56896C80112M826O806O313L822K21m092q734j2924j5961j7536j7396j5426j2352
56883B97679r591p932o708m642j261K752O450R555J2475J5645J9223K3371K8221
56870C85237L3063L5882L4462K7986J7354M571p694j6851k2037k4749k6752k7811
56858D12661k6789k4194k1728j9613j6641j2856r877q120o214l850k703l275l300
56845B53501r27K616N258O983Q551R296Q516P524P782Q283P294N695N815P587
56831C43774Q679Q241P820Q403R095R364J0197J1939J2804J0790O039M30m309
56818D43266p450q945r082q232o662m702k739o40K397O811J1850J6399K0104K3073
56804D75448K5289K7297L0563L5724M1055M3967M3527M0223L3897K3909J1285
$$ plain form
56793 832184 831091 820246 802877 782156 761392 743463 729748 719965 712950 707626 704003 703691 708916
56780 708916 720697 738584 762268 792360 829149 871769 919324 971548 1026991 1081300 1128496
56769 1128496 1163630 1183604 1186726 1173349 1146804 1112267 1074347 1036220 1000278 968091 939771
56758 939771 914646 892787 874984 861346 851142 844380 842603 847605 859862 878371 901556 928211
56746 928211 957967 990534 1023705 1052173 1069372 1071250 1058285 1034148 1002945 967572 929660 890419
56734 890419 851562 815308 783232 755364 730897 709596 691996 678532 669254 664261 663508 666120
56722 666120 670849 677544 687271 700296 714370 725623 731120 730223 723624 711570 693420 669058 640398
56709 640398 610891 583251 558062 534736 513102 493404 475450 458965 444656 433814 426514 421024
$$ packed form
56793H32184j093j0845j7369k0721k0764j7929j3715r783p015n324l623l12N225
56780G08916J1781J7887K3684L0092L6789M2620M7555N2224N5443N4309M7196
56769A128496L5134J9974L122j3377k6545l4537l7920l8127l5942l2187k8320
56758I39771k5125k1859j7803j3638j0204o762j777N002J2257J8509K3185K6655
56746I28211K9756L2567L3171K8468J7199J878j2965k4137l1203l5373l7912l9241
56734H90419l8857l6254l2076k7868k4467k1301j7600j3464r278m993p53K612
56722F66120M729O695R727J3025J4074J1253N497q97o599j2054j8150k4362k8660
56709F40398k9507k7640k5189k3326k1634j9698j7954j6485j4309j0842p300n490
$$ plain form
56697 421024 415337 408812 402180 396578 392771 390562 388594 385420 381245 377964 376829 376656 375206 372109
56683 372109 369320 368474 368771 368226 366360 364502 363390 361778 358226 353486 349776 347788 345719 341716 336349
56668 336349 331923 329998 330218 331004 330629 328054 323597 318612 313931 309062 303619 298978 297273 298719 301045
56653 301045 301807 300402 297757 295048 293176 292514 292441 291697 289757 287452 285778 284671 283554 282468 281805 281168
56637 281168 279577 277002 274855 274430 275368 276304 276798 277875 280525 284338 288023 290914 293412 296246 299849
56622 299849 304330 309306 313751 316717 318389 319890 321895 324168 326561 329452 332696 335152 336144 336686 338278
56607 338278 340991 343698 345719 347239 348367 348942 349251 350009 351492 353306 354901 355780 355650 355187 356117 359353
56591 359353 363384 365837 366415 366747 367383 366852 364338 361466 360145 359884 358624 355543 351644 347900 344119
$$ packed form
56697D21024n687o525o632n602l807k209j968l174m175l281j135j73j450l097
56683C72109k789q46K97n45j866j858j112j612l552m740l710j988k069m003n367
56668C36349m426j925K20P86l75k575m457m985m681m869n443m641j705J446K326
56653C01045P62j405k645k709j872o62p3p44j940k305j674j107j117j086o63o37
56637B81168j591k575k147m25R38R36M94J077K650L813L685K891K498K834L603
56622B99849M481M976M445K966J672J501K005K273K393K891L244K456R92N42J592
56607C38278K713K707K021J520J128N75L09P58J483J814J595Q79j30m63R30L236
56591C59353M031K453N78L32O36n31k514k872j321k61j260l081l899l744l781
$$ plain form
56576 344119 339845 335545 332477 331458 331750 331244 328239 323149 317950 313916 310594 307187 303838 300925 298151
56561 298151 295434 293943 294903 297626 300007 301023 301619 302916 304700 306264 307745 309659 311559 312358 312082
56546 312082 312341 314491 317855 320447 321107 320252 318766 317184 316069 316015 316586 316274 314466 312706 312886 314731
56530 314731 316387 317089 317690 318636 319100 318601 317942 317806 317620 316689 315400 314418 313584 312611 312100 312758 314132 315162
56512 315162 315669 316379 317677 319221 320624 321840 322976 324378 326730 330475 335273 340494 345999 351978 358300
56497 358300 364587 370689 376557 382034 387238 392718 398602 404036 408307 412078 416516 421401 425189 426971
56483 426971 427320 426987 425862 423815 421658 420423 420007 419225 417110 413706 409657 405556 401916 399341 398195
56468 398195 398030 397794 396883 395728 394933 394163 392481 389653 386318 382785 378631 373873 369662 367062 365663
$$ packed form
56576C44119m274m300l068j019K92n06l005n090n199m034l322l407l349k913k774
56561B98151k717j491R60K723K381J016N96J297J784J564J481J914J900P99k76
56546C12082K59K150L364K592O60q55j486j582j115n4N71l12j808j760J80J845
56530C14731J656P02O01R46M64m99o59j36j86r31j289r82q34r73n11O58J374J030
56512C15162N07P10J298J544J403J216J136J402K352L745M798N221N505N979O322
56497C58300O287O102N868N477N204N480N884N434M271L771M438M885L788J782
56483D26971L49l33j125k047k157j235m16p82k115l404m049m101l640k575j146
56468C98195j65k36r11j155p95p70j682k828l335l533m154m758m211k600j399
$$ plain form
56453 365663 364159 361894 359142 356225 353152 350038 347292 345430 345024 346422 348868 350351 349285 346313
56439 346313 343606 342309 341576 340390 339383 340015 342362 344611 345008 343783 342688 342864 343767 344352 344613 345298
56423 345298 346542 347760 348840 350358 352334 353715 353708 352981 352960 354447 357332 361088 364970 368314 371133 373993
56407 373993 376932 379268 380972 383345 387504 392967 398567 403995 409468 414563 418632 421943 425245 428560
56393 428560 431520 434398 437571 440310 441507 441400 441230 441359 441215 440986 441560 442530 442057 439563 437003 436401
56377 436401 437319 437879 437274 435959 434086 431237 427616 424318 422195 421151 420702 420608 420693 420543 419800 418686 417942
56360 417942 418049 418524 418159 416075 412520 408573 405299 403213 402192 401615 400808 399642 398404 397034 395071
56345 395071 392636 390667 389571 388441 386525 384755 384594 385771 386517 385925 384805 384220 384515 386004 389134
$$ packed form
56453C65663j504k265k752k917l073l114k746j862m06J398K446J483j066k972
56439C46313k707j297p33j186j007O32K347K249L97j225j095J76R03N85K61O85
56423C45298J244J218J080J518J976J381pp27k1J487K885L756L882L344K819K860
56407C73993K939K336J704K373M159N463N600N428N473N095M069L311L302L315
56393D28560K960K878L173K739J197j07j70J29j44k29N74R70m73k494k560o02
56377D36401R18N60o05j315j873k849l621l298k123j044m49r4Q5j50p43j114p44
56360D17942J07M75l65k084l555l947l274k086j021n77q07j166j238j370j963
56345C95071k435j969j096j130j916j770j61J177P46n92j120n85K95J489L130
$$ plain form
56330 389134 393381 397067 399001 399600 399989 400827 402442 405211 409029 413047 416546 419605 422460 424806 426319
56315 426319 427401 428839 431006 433845 437261 441101 444957 448454 451640 454904 458544 462402 465747 467772
56301 467772 468597 469669 472638 477912 484665 491916 498957 505173 510436 515494 520923 525887 529218 531596
56287 531596 535005 539629 543026 543403 542351 543015 546515 551528 556717 561974 567344 572228 576250 580122 584997
56272 584997 591173 597882 604434 611256 619393 629000 638915 648190 657414 667756 679088 690172 700568
56259 700568 711187 722805 735119 747507 759703 771497 782993 795572 811204 829903 848960
56248 848960 865712 880293 894629 909528 924050 937360 949856 962280 974652 986397 997055
56237 997055 1006597 1015376 1023958 1033001 1043136 1054654 1067106 1079556 1091824 1105309 1121922 1142331
$$ packed form
56330C89134M247L686J934N99L89Q38J615K769L818M018L499L059K855K346J513
56315D26319J082J438K167K839L416L840L856L497L186L264L640L858L345K025
56301D67772Q25J072K969N274O753P251P041O216N263N058N429M964L331K378
56287E31596L409M624L397L77j052O64L500N013N189N257N370M884M022L872M875
56272E84997O176O709O552O822Q137R607R915R275R224J0342J1332J1084J0396
56259G00568J0619J1618J2314J2388J2196J1794J1496J2579J5632J8699J9057
56248H48960J6752J4581J4336J4899J4522J3310J2496J2424J2372J1745J0658
56237I97055R542Q779Q582R043J0135J1518J2452J2450J2268J3485J6613K0409
$$ plain form
56225 1142331 1165902 1192234 1221840 1255249 1292312 1332502 1375092 1419115 1464223 1511723 1563628
56214 1563628 1620523 1681604 1746998 1818419 1896753 1980478 2067760 2159289 2257944 2366244 2484923
56203 2484923 2613348 2750508 2896177 3051901 3220415 3403379 3600115 3808901 4028716
56194 4028716 4259045 4498694 4745511 4996776 5249207 5499092 5742903 5977307 6198172
56185 6198172 6400290 6578575 6728991 6848151 6933116 6982551 6997661 6981512 6937689 6869567
56175 6869567 6779972 6671267 6546394 6409533 6264469 6112429 5953102 5787878 5620160 5452102
56165 5452102 5283083 5112155 4939769 4765986 4589309 4409194 4228021 4048724 3871954
56156 3871954 3697468 3526819 3362351 3204512 3052365 2906075 2766852 2635012 2510175
$$ packed form
56225A142331K3571K6332K9606L3409L7063M0190M2590M4023M5108M7500N1905
56214A563628N6895O1081O5394P1421P8334Q3725Q7282R1529R8655J08300J18679
56203B484923J28425J37160J45669J55724J68514J82964J96736K08786K19815
56194D028716K30329K39649K46817K51265K52431K49885K43811K34404K20865
56185F198172K02118J78285J50416J19160Q4965M9435J5110j6149m3823o8122
56175F869567q9595j08705j24873j36861j45064j52040j59327j65224j67718j68058
56165E452102j69019j70928j72386j73783j76677j80115j81173j79297j76770
56156C871954j74486j70649j64468j57839j52147j46290j39223j31840j24837
$$ plain form
56147 2510175 2392958 2284497 2184459 2091344 2004634 1924960 1852332 1785937 1725727 1672493 1626025
56136 1626025 1584534 1546279 1510813 1478379 1448924 1421867 1396345 1371799 1348738 1328387 1311114
56125 1311114 1295876 1281810 1269534 1260189 1254220 1251828 1253319 1257882 1263288 1268199 1273756 1281531 1291066
56112 1291066 1300978 1311368 1323420 1337498 1353335 1371252 1391526 1413377 1436169 1460644 1487307
56101 1487307 1514796 1541872 1569819 1600434 1632485 1662719 1689838 1714995 1738858 1760894 1781567
56090 1781567 1802748 1825718 1850904 1879694 1914317 1955600 2002819 2055933 2116023 2183418 2257488
56079 2257488 2338817 2429844 2532842 2648505 2776437 2915335 3062332 3213338 3363948 3509218
56069 3509218 3643809 3764561 3872588 3971038 4061291 4143031 4216598 4282037 4336022 4372815 4389006
$$ packed form
56147B510175j17217j08461j00038r3115q6710p9674p2628o6395o0210n3234m6468
56136A626025m1491l8255l5466l2434k9455k7057k5522k4546k3061k0351j7273
56125A311114j5238j4066j2276r345n969k392J491M563N406M911N557P775R535
56112A291066R912J0390J2052J4078J5837J7917K0274K1851K2792K4475K6663
56101A487307K7489K7076K7947L0615L2051L0234K7119K5157K3863K2036K0673
56090A781567K1181K2970K5186K8790L4623M1283M7219N3114O0090O7395P4070
56079B257488Q1329R1027J02998J15663J27932J38898J46997J51006J50610J45270
56069C509218J34591J20752J08027R8450R0253Q1740P3567O5439N3985L6793J6191
$$ plain form
56058 4389006 4385462 4364940 4330437 4285688 4233821 4174198 4102636 4015730 3913496 3797813 3670749
56047 3670749 3535084 3394456 3252217 3111653 2977201 2853231 2741118 2639496 2547721 2467140
56037 2467140 2398728 2341526 2293812 2253975 2220050 2190359 2164841 2144032 2126804 2110888 2095252
56026 2095252 2079888 2063919 2046474 2028983 2013818 2000926 1988601 1977197 1968792 1963300 1958420 1953715
56014 1953715 1951299 1951988 1954147 1957051 1962154 1970345 1981117 1995024 2013523 2035579 2057846 2079201 2101773
56001 2101773 2126545 2151473 2175243 2199545 2226215 2255149 2286164 2319782 2354994 2389551 2423750
55990 2423750 2460822 2502384 2546668 2592151 2639406 2688285 2737054 2785735 2836710 2890638 2945559
55979 2945559 3001444 3061547 3127449 3196673 3267242 3340784 3418997 3500649 3584231 3670120 3758318
$$ packed form
56058D389006l544k0522l4503m4749n1867n9623p1562q6906j02234j15683j27064
56047C670749j35665j40628j42239j40564j34452j23970j12113j01622r1775q0581
56037B467140o8412n7202m7714l9837l3925k9691k5518k0809j7228j5916j5636
56026B095252j5364j5969j7445j7491j5165j2892j2325j1404q405n492m880m705
56014A953715k416O89K159K904N103Q191J0772J3907J8499K2056K2267K1355K2572
56001B101773K4772K4928K3770K4302K6670K8934L1015L3618L5212L4557L4199
55990B423750L7072M1562M4284M5483M7255M8879M8769M8681N0975N3928N4921
55979B945559N5885O0103O5902O9224P0569P3542P8213Q1652Q3582Q5889Q8198
$$ plain form
55968 3758318 3847790 3939890 4038613 4145515 4258349 4376615 4504085 4643543 4793299 4951427
55958 4951427 5119197 5297677 5485129 5680556 5885943 6102536 6328994 6565567 6815724
55949 6815724 7081177 7359820 7651121 7958893 8286214 8632558 8998462 9387819 9802923
55940 9802923 10242904 10709963 11211201 11750974 12327356 12939108 13589372 14278995 15003744
55931 15003744 15762770 16562710 17408596 18298194 19230715 20213547 21254282 22353538 23512137
55922 23512137 24738082 26039654 27418885 28878781 30429610 32080979 33835335 35696807
55914 35696807 37678906 39796678 42060476 44486007 47102276 49942209 53035882 56421741
55906 56421741 60153428 64285795 68865608 73945569 79594227 85882408 92877567 100666463
$$ packed form
55968C758318Q9472R2100R8723J06902J12834J18266J27470J39458J49756J58128
55958D951427J67770J78480J87452J95427K05387K16593K26458K36573K50157
55949F815724K65453K78643K91301L07772L27321L46344L65904L89357M15104
55940I802923M39981M67059N01238N39773N76382O11752O50264O89623P24749
55931A5003744P59026P99940Q45886Q89598R32521R82832J040735J099256J158599
55922B3512137J225945J301572J379231J459896J550829J651369J754356J861472
55914C5696807J982099K117772K263798K425531K616269K839933L093673L385859
55906E6421741L731687M132367M579813N079961N648658O288181O995159P788896
$$ plain form
55898 100666463 109367804 119109964 130018365 142243773 155983534 171463878 188940845
55891 188940845 208744104 231266674 256853924 285721933 317949894 353254908 390302491
55884 390302491 425991433 455654039 474533634 479690353 471026013 450910877 422968220
55877 422968220 390866057 357554567 324982020 294190091 265624308 239434628 215626193
55870 215626193 194101673 174695775 157219731 141486844 127327583 114611263 103250602
55863 103250602 93171276 84281168 76473202 69640717 63674515 58455383 53865450 49803805
55855 49803805 46184303 42928315 39971651 37272933 34805307 32543536 30464486 28552135
55847 28552135 26792965 25170785 23672121 22290838 21021105 19851286 18770244 17773418
$$ packed form
55898A00666463Q701341R742160J0908401J2225408J3739761J5480344J7476967
55891A88940845J9803259K2522570K5587250K8868009L2227961L5305014L7047583
55884C90302491L5688942K9662606J8879595N156719q664340k0115136k7942657
55877D22968220l2102163l3311490l2572547l0791929k8565783k6189680k3808435
55870B15626193k1524520j9405898j7476044j5732887j4159261j2716320j1360661
55863A03250602j0079326q890108p807966o832485n966202n219132m589933m061645
55855D9803805l619502l255988k956664k698718k467626k261771k079050j912351
55847B8552135j759170j622180j498664j381283j269733j169819j081042r96826
$$ plain form
55839 17773418 16856687 16010253 15224684 14497251 13826266 13204622 12624711 12084019 11579832
55830 11579832 11103950 10648930 10214491 9801568 9404965 9018430 8642478 8280635 7931934
55821 7931934 7593635 7267754 6958350 6664972 6384634 6117585 5865592 5626914 5398181
55812 5398181 5179050 4970487 4771198 4580475 4401840 4238876 4089620 3949453 3817090
55803 3817090 3693407 3577057 3466028 3361416 3265195 3176170 3091850 3011795 2935190 2858046
55793 2858046 2777443 2696195 2618807 2545239 2473042 2403057 2337996 2277451 2219312 2164404 2114762
55782 2114762 2068815 2023250 1978539 1937931 1901971 1868547 1837483 1810553 1787555 1766596 1747683
55771 1747683 1731952 1717876 1702259 1684528 1666360 1647699 1627011 1604880 1583316 1561737 1537406
$$ packed form
55839A7773418r16731q46434p85569p27433o70985o21644n79911n40692n04187
55830A1579832m75882m55020m34439m12923l96603l86535l75952l61843l48701
55821G931934l38299l25881l09404k93378k80338k67049k51993k38678k28733
55812E398181k19131k08563j99289j90723j78635j62964j49256j40167j32363
55803C817090j23683j16350j11029j04612r6221q9025q4320q0055p6605p7144
55793B858046q0603q1248p7388p3568p2197o9985o5061o0545n8139n4908m9642
55782B114762m5947m5565m4711m0608l5960l3424l1064k6930k2998k0959j8913
55771A747683j5731j4076j5617j7731j8168j8661k0688k2131k1564k1579k4331
$$ plain form
55760 1537406 1509799 1481060 1452309 1422902 1393107 1364096 1335444 1305856 1276142 1248268 1221991
55749 1221991 1195891 1171284 1151350 1136347 1123307 1110641 1099542 1090614 1082713 1075671 1070703 1067284
55737 1067284 1062915 1056922 1051473 1047689 1043474 1036357 1026124 1013595 999186 983864 969571 957427
55725 957427 946892 937228 928285 919567 910273 900771 892481 886027 880878 876549 872210 865347 853164 835844
55711 835844 816529 797820 780116 763385 748162 734201 720187 705628 691355 677628 663424
55700 663424 648133 632242 615809 597965 578795 560177 543768 529141 514691 499686 484978
55689 484978 472247 462576 455168 447714 438784 429368 421277 414887 409705 406104 404550 403683 401169 396445
55675 396445 391096 386853 384764 385713 389622 394381 397630 399488 401623 403865 404084 401457 397515 393534 389109
$$ packed form
55760A537406k7607k8739k8751k9407k9795k9011k8652k9588k9714k7874k6277
55749A221991k6100k4607j9934j5003j3040j2666j1099q928p901p042m968l419
55737A067284m369n993n449l784m215p117j0233j2529j4409j5322j4293j2144
55725I57427j0535r664q943q718r294r502q290o454n149m329m339o863j2183j7320
55711H35844j9315j8709j7704j6731j5223j3961j4014j4559j4273j3727j4204
55700F63424j5291j5891j6433j7844j9170j8618j6409j4627j4450j5005j4708
55689D84978j2731r671p408p454q930r416q091o390n182l601j554q67k514m724
55675C96445n349m243k089R49L909M759L249J858K135K242K19k627l942l981m425
$$ plain form
55660 389109 383888 378666 373960 369220 364215 359726 356235 353271 350412 347602 344358 340345 336959 336560
55646 336560 339641 344326 348968 353434 357514 360156 361148 361693 362207 361187 357457 352299 348221 346603 347356
55631 347356 349810 353005 356028 358990 363037 368850 375834 383177 390821 398961 407402 415751 423398 429147
55617 429147 431900 431971 430742 428981 426670 424546 424130 425586 426970 426448 424247 421756 419873 418986 419627 422090
55601 422090 425821 429692 432541 433525 432914 432596 434553 438466 442003 443989 445978 449900 455280 459853 462193
55586 462193 462605 461795 459627 455352 448644 440249 431524 423246 415112 406661 398083 389512 380266 369913
55572 369913 359577 350737 342865 333749 322361 310083 298755 288730 279256 269643 259549 249031
55560 249031 238830 229994 222978 217615 213747 211014 208290 204579 200445 197292 195255 193131 190458 188122
$$ packed form
55660C89109n221n222m706m740n005m489l491k964k859k810l244m013l386l99
55646C36560L081M685M642M466M080K642R92N45N14j020l730n158m078j618P53
55631C47356K454L195L023K962M047N813O984P343P644Q140Q441Q349P647N749
55617D29147K753P1j229j761k311k124m16J456J384n22k201k491j883q87O41K463
55601D22090L731L871K849R84o11l18J957L913L537J986J989L922N380M573K340
55586D62193M12q10k168m275o708q395q725q278q134q451q578q571r246j0353
55572C69913j0336q840p872r116j1388j2278j1328j0025r474r613j0094j0518
55560B49031j0201q836p016n363l868k733k724l711m134l153k037k124k673k336
$$ plain form
55546 188122 186610 185208 183524 182475 182946 184504 186065 186909 186569 184665 181479 178019 175079 172832 171268
55531 171268 170155 168625 165991 163049 161362 161174 161342 161387 161997 163131 163318 161631 159032 157074 156465 157425
55515 157425 160003 163211 165254 165652 166096 168222 171560 174590 176875 179163 182148 186062 190832 195836 199981
55500 199981 202674 204179 204715 203973 201899 199029 195652 191526 186899 182728 179293 175659 171180 166585 162916
55485 162916 160254 158175 156519 154990 152879 150053 147542 146461 146863 148088 149535 150744 151588 152858 155834
55470 155834 160803 166586 171714 175275 176824 176844 177354 180338 185104 188878 190601 192315 195843 199940 202106
55455 202106 201700 199797 197297 194718 192845 191940 191003 189044 186328 183341 179620 174865 170041 165878 161369
55440 161369 155493 149482 145305 142425 138284 132019 125742 121635 119357 117054 113840 110464 108001 106483
$$ packed form
55546A88122j512j402j684j049M71J558J561Q44l40j904l186l460k940k247j564
55531A71268j113j530k634k942j687j88J68M5O10J134J87j687k599j958o09R60
55515A57425K578L208K043L98M44K126L338L030K285K288K985L914M770N004M145
55500A99981K693J505N36p42k074k870l377m126m627m171l435l634m479m595l669
55485A62916k662k079j656j529k111k826k511j081M02J225J447J209Q44J270K976
55470A55834M969N783N128L561J549K0N10K984M766L774J723J714L528M097K166
55455B02106m06j903k500k579j873r05r37j959k716k987l721m755m824m163m509
55440A61369n876o011m177k880m141o265o277m107k278k303l214l376k463j518
$$ plain form
55426 106483 104809 102025 98631 96142 95177 94682 93416 91423 89454 87764 86293 85282 84802 84204 82916
55411 82916 81312 80086 79302 78802 78864 79528 79828 78658 76111 73283 71155 70230 70524 71212 70954 69337 67344
55394 67344 65742 64024 61819 60235 60495 62037 63315 63827 64012 63804 62816 61610 61383 62482 64342 66540
55378 66540 68764 70133 69898 68675 67776 67438 66855 65773 64910 64884 65709 67155 68618 69003 67868 66510 66626
55361 66626 68036 68895 68054 66011 63613 61216 59303 58638 59260 60157 60287 59357 57602 55559 54084 53871
55345 53871 54853 56571 58947 61946 64814 66575 67194 67487 67986 68618 69253 69768 69888 69724 70036 71067 71674
55328 71674 70795 69290 68944 69913 70649 70150 68705 66398 62655 57815 53660 51573 51175 51348 51625 51917 51776
55311 51776 50731 48977 47244 46276 46463 47511 48554 49176 50113 52150 54656 56386 57534 59506 62385
$$ packed form
55426A06483j674k784l394k489r65m95j266j993j969j690j471j011m80n98j288
55411H2916j604j226p84n00O2O64L00j170k547k828k128r25K94O88k58j617j993
55394F7344j602j718k205j584K60J542J278N12J85k08r88j206k27J099J860K198
55378F6540K224J369k35j223q99l38n83j082q63k6Q25J446J463L85j135j358J16
55361F6626J410Q59q41k043k398k397j913o65O22Q97J30r30j755k043j475k13
55345E3871R82J718K376K999K868J761O19K93M99O32O35N15J20j64L12J031O07
55328G1674q79j505l46R69P36m99j445k307l743m840m155k087l98J73K77K92j41
55311E1776j045j754j733r68J87J048J043O22R37K037K506J730J148J972K879
$$ plain form
55296 62385 64162 63200 60211 56929 53861 50407 46533 43215 41411 41335 42568 44346 45866 46784 47403 48220
55280 48220 49380 50647 51608 51864 51272 50107 48655 46710 43890 40528 37855 37069 38329 40603 42343
55265 42343 42548 41538 40666 41022 42629 44889 47170 48533 47747 44537 40461 37613 36641 36695 36930 37099 36993
55248 36993 36429 35851 35976 36695 37041 36363 34997 33848 33848 35472 38108 40232 40990 41274 42369 44037 45042
55231 45042 45171 45421 46335 47477 48521 49623 50673 51409 52276 53900 55704 56427 56136 56242 57245 58009 57726
55214 57726 57069 56719 56201 55166 54639 55813 58251 60195 60216 58090 54718 51682 50174 49826 49248 48053
55198 48053 47451 48290 49468 49231 47487 45948 46127 47808 49510 50257 50753 52456 55233 56763 55174 51622
55182 51622 48848 47646 46585 45120 44725 46170 47694 47286 45440 44284 44858 46524 48274 49443 49656
$$ packed form
55296F2385J777r62k989l282l068l454l874l318j804p6J233J778J520R18O19Q17
55280D8220J160J267R61K56n92j165j452j945k820l362k673p86J260K274J740
55265D2343K05j010q72L56J607K260K281J363p86l210m076k848r72N4K35J69j06
55248C6993n64n78J25P19L46o78j366j149%J624K636K124P58K84J095J668J005
55231D5042J29K50R14J142J044J102J050P36Q67J624J804P23k91J06J003P64k83
55214E7726o57l50n18j035n27J174K438J944K1k126l372l036j508l48n78j195
55198D8053o02Q39J178k37j744j539J79J681J702P47M96J703K777J530j589l552
55182E1622k774j202j061j465l95J445J524m08j846j156N74J666J750J169K13
$$ plain form
55167 49656 49103 48571 48552 48735 48827 49192 50113 51217 52199 53375 54916 56310 57174 57756 58033 57289 55307 53168
55149 53168 52103 52289 53329 54836 55967 55642 54267 54009 56160 59253 61045 61272 61031 60505 59077 57079
55133 57079 55554 54556 53274 51719 50863 51163 52251 53919 56052 57730 57788 56462 55312 55360 56248 57214 57857
55116 57857 57930 57378 56716 56574 57069 58362 61223 65715 69826 71150 69975 69064 70120 72082 73274 73501
55100 73501 73171 71936 69449 66458 63961 61965 60087 58720 58513 59054 59064 57850 55907 54199 53407 53667
55084 53667 54456 54811 54172 53023 52322 52341 52377 51629 50139 48821 48753 50408 53468 57133 60486 62662 63191
55067 63191 62586 62267 63349 65550 67644 68831 69211 69171 68963 68883 69276 70335 72392 76142 81748 87796 92212
55050 92212 94535 96304 98752 101055 101705 100850 100221 100986 102562 103560 103177 101574 99444 97503 96163 95533
$$ packed form
55167D9656n53n32j9J83R2L65R21J104R82J176J541J394Q64N82K77p44j982k139
55149E3168j065J86J040J507J131l25j375k58K151L093J792K27k41n26j428j998
55133E7079j525r98j282j555q56L00J088J668K133J678N8j326j150M8Q88R66O43
55116E7857P3n52o62j42M95J293K861M492M111J324j175r11J056J962J192K27
55100G3501l30j235k487k991k497j996j878j367k07N41J0j214j943j708p92K60
55084E3667P89L55o39j149p01J9L6p48j490j318o8J655L060L665L353K176N29
55067F3191o05l19J082K201K094J187L80m0k08q0L93J059K057L750N606O048M416
55050I2212K323J769K448K303O50q55o29P65J576R98l83j603k130j941j340o30
$$ plain form
55034 95533 95692 96787 98734 101086 103434 105735 107995 109880 111045 111604 111870 111728 110779 109118 107516 106693
55018 106693 106677 107038 107496 108189 109441 111381 113751 116092 118150 119899 121052 120878 118989 116247 114348 114333
55002 114333 115873 118051 120343 122582 124489 125733 126250 126043 124909 122825 120514 119093 119016 119668 119975 119114
54986 119114 116719 112934 108573 104984 103461 104542 107536 110652 112136 111790 111026 110865 110484 108724 106507
54971 106507 106160 108207 110465 111052 110754 111346 112831 113900 114288 115007 116516 118089 119024 119289 119033 118535 118581
54954 118581 119840 121830 123433 124329 124922 125128 124510 123482 122970 122836 122233 121695 123055 126555 129750 130421
54938 130421 129272 128505 128853 129425 129670 129936 130326 130302 129502 128160 126733 125685 125473 126168 127177 127716 127373
54921 127373 126154 124540 123659 124526 126693 128535 129457 130733 133329 135968 136670 135483 134213 133926 134273 135234
$$ packed form
55034I5533J59J095J947K352K348K301K260J885J165N59K66j42r49j661j602q23
55018A06693j6L61M58O93J252J940K370K341K058J749J153j74j889k742j899j5
55002A14333J540K178K292K239J907J244N17k07j134k084k311j421p7O52L07q61
54986A19114k395l785m361l589j523J081K994L116J484l46p64j61l81j760k217
54971A06507l47K047K258N87k98N92J485J069L88P19J509J573R35K65k56m98M6
54954A18581J259J990J603Q96N93K06o18j028n12j34o03n38J360L500L195O71
54938A30421j149p67L48N72K45K66L90k4q00j342j427j048k12O95J009N39l43
54921A27373j219j614q81Q67K167J842R22J276K596K639P02j187j270k87L47R61
$$ plain form
54905 135234 137851 142589 147998 151742 152657 151521 150263 150614 153207 157673 163444 170153 177338 184517 192039
54890 192039 201165 212632 225702 239285 253403 268586 284325 299285 312996 326376 340548 355779
54878 355779 371347 385625 396505 402647 404214 401715 394593 382147 365600 347810 330699 314127
54866 314127 297507 281206 265709 250680 235877 222324 211560 203985 198670 194595 191439 189259
54854 189259 187973 187362 187388 188324 190490 193799 197698 201792 206368 212007 218826 226553 235303 245741 258334
54839 258334 272741 288061 303380 318097 331997 344987 356389 364547 367663 365184 358126 347910
54827 347910 335279 320454 303984 287032 270731 255409 240570 225727 211129 197528 185465
54816 185465 175165 166980 161183 157216 153854 150391 147008 143724 140004 135987 133180 132833 134104 134824
$$ packed form
54905A35234K617M738N409L744R15j136j258L51K593M466N771O709P185P179P522
54890A92039R126J1467J3070J3583J4118J5183J5739J4960J3711J3380J4172J5231
54878C55779J5568J4278J0880O142J567k499p122j2446j6547j7790j7111j6572
54866C14127j6620j6301j5497j5029j4803j3553j0764p575n315m075l156k180
54854A89259j286o11K6R36K166L309L899M094M576N639O819P727Q750J0438J2593
54839B58334J4407J5320J5319J4717J3900J2990J1402Q158L116k479p058j0216
54827C47910j2631j4825j6470j6952j6301j5322j4839j4843j4598j3601j2063
54816A85465j0300q185n797l967l362l463l383l284l720m017k807l47J271P20
$$ plain form
54802 134824 133768 131461 129142 127833 128018 129213 129999 129352 127807 126555 125745 124608 122884 120976 118853
54787 118853 116037 112812 110398 109670 110445 111956 113048 112129 108333 103164 99738 99758 101915 103687 103861 102862
54771 102862 101511 100323 99584 99388 99565 99834 100006 100101 100470 101605 103497 105441 106858 107952 109072 110017
54755 110017 110731 112068 114759 118108 120952 123585 127229 131769 135634 138126 140323 143224 146466 149489
54741 149489 152691 156725 161673 167488 174348 182128 190468 199703 210589 222805 235086 247350 261239
54728 261239 277753 295779 313892 332139 350752 368338 382932 394068 402336 407468 408383 404811
54716 404811 397645 387781 375738 362421 349368 338017 329052 322140 315946 309004 301179 293864 288246
54703 288246 284062 280630 278206 277473 278385 280483 283785 288382 293659 298902 304333 310773 318701 328395 340412
$$ packed form
54802A34824j056k307k319j309J85J195P86o47j545j252q10j137j724j908k123
54787A18853k816l225k414p28P75J511J092r19l796n169l426K0K157J772J74r99
54771A02862j351j188p39j96J77K69J72R5L69J135J892J944J417J094J120R45
54755A10017P14J337K691L349K844K633L644M540L865K492K197K901L242L023
54741A49489L202M034M948N815O860P780Q340R235J0886J2216J2281J2264J3889
54728B61239J6514J8026J8113J8247J8613J7586J4594J1136Q268N132R15l572
54716D04811p166r864j2043j3317j3053j1351q965o912o194o942p825p315n618
54703B88246m184l432k424p33R12K098L302M597N277N243N431O440P928R694J2017
$$ plain form
54688 340412 355058 371975 391092 413180 438313 464481 489119 511587 532713 552262 568468
54677 568468 580001 586778 588548 584195 573174 556743 537123 515906 493543 469894 445076 420098
54665 420098 396562 375337 355821 336995 318747 301571 285629 271045 258482 248171 239025 230084
54653 230084 222310 217179 213781 209403 203147 196847 191880 187271 182105 177775 175974 175808 174819 172228 169395
54638 169395 167394 165843 164253 163113 163125 164166 165465 166337 166535 166337 166471 167629 169813 172269 174187 175569
54622 175569 177482 181251 186898 192481 195664 196129 195808 196479 197945 199064 199747 201084 203947 208373 213944
54607 213944 219949 225419 229904 234074 238739 243450 247120 250078 254277 260979 269214 277127 283941 289788
54593 289788 294492 297882 301036 305735 312219 318500 322618 325007 327900 332775 339182 346003 353088 361428
$$ packed form
54688C40412J4646J6917J9117K2088K5133K6168K4638K2468K1126J9549J6206
54677E68468J1533O777J770m353j1021j6431j9620k1217k2363k3649k4818k4978
54665D20098k3536k1225j9516j8826j8248j7176j5942j4584j2563j0311r146q941
54653B30084p774n131l398m378o256o300m967m609n166m330j801j66r89k591k833
54638A69395k001j551j590j140J2J041J299Q72J98j98J34J158K184K456J918J382
54622A75569J913L769N647N583L183M65l21O71J466J119O83J337K863M426N571
54607B13944O005N470M485M170M665M711L670K958M199O702Q235P913O814N847
54593B89788M704L390L154M699O484O281M118K389K893M875O407O821P085Q340
$$ plain form
54579 361428 372311 386607 404381 424624 445613 466248 487221 510389 536534 563863 589064
54568 589064 609898 626427 639593 649038 652908 649723 639745 624310 604501 581115 555469 529260
54556 529260 503555 478632 454967 433611 415175 399002 383925 369526 356205 344311 333706
54545 333706 324018 314922 306180 297719 289620 282003 275112 269481 265417 262016 257412 250672 243017 236390
54531 236390 231228 226488 221596 217162 213598 210128 205828 200937 196474 192904 189719 186104 181644 176553
54517 176553 171575 167453 164298 161693 159554 158357 158099 157560 155436 152082 149390 148725 149544 150256 149863 148449
54501 148449 146579 144851 143844 143796 144162 143882 142356 140081 138347 138404 140673 144280 147412 148793 149130 150624
54485 150624 154660 160223 164917 167225 167539 167487 168784 172259 177231 181985 185520 188667 192893 198356 204051
$$ packed form
54579C61428J0883J4296J7774K0243K0989K0635K0973K3168K6145K7329K5201
54568E89064K0834J6529J3166R445L870l185r978j5435j9809k3386k5646k6209
54556E29260k5705k4923k3665k1356j8436j6173j5077j4399j3321j1894j0605
54545C33706r688r096q742q461q099p617o891n631m064l401m604o740p655o627
54531B36390n162m740m892m434l564l470m300m891m463l570l185l615m460n091
54517A76553m978m122l155k605k139j197k58n39k124l354k692o65Q19P12l93j414
54501A48449j870j728j007m8L66k80j526k275j734N7K269L607L132J381L37J494
54485A50624M036N563M694K308L14n2J297L475M972M754L535L147M226N463N695
$$ plain form
54470 204051 209601 215749 223024 231207 240411 251331 263688 275623 285711 294762 304454 314755 323786
54457 323786 329871 332586 332086 328714 323443 317582 311463 304016 294069 281739 268351 255360 243523
54444 243523 232871 223253 214881 208101 202581 197208 191205 184960 179283 174338 170028 166936 165861 166441
54430 166441 167221 167173 166324 164865 162709 160340 159020 159381 160451 160867 160602 160675 161384 161765 160964 159516 158892
54413 158892 160080 162934 166677 170589 174140 176812 178249 178674 178836 179387 180410 181622 182813 183854 184480
54398 184480 184320 183183 181183 178732 176516 175262 175274 176247 177625 178946 179785 179693 178461 176243 173293 169937
54382 169937 166912 165158 164800 164637 163197 160135 156278 152605 149672 147779 147057 147284 147914 148274 147749 146220
54366 146220 144499 143800 144436 145622 146876 148725 151262 152990 152375 150118 148599 149261 151713 155133 159086
$$ packed form
54470B04051N550O148P275Q183R204J0920J2357J1935J0088R051R692J0301R031
54457C23786O085K715n00l372n271n861o119p447r947j2330j3388j2991j1837
54444B43523j0652r618q372o780n520n373o003o245n677m945m310l092j075N80
54430A66441P80m8q49j459k156k369j320L61J070M16k65P3P09L81q01j448o24
54413A58892J188K854L743L912L551K672J437M25J62N51J023J212J191J041O26
54398A84480j60j137k000k451k216j254J2R73J378J321Q39r2j232k218k950l356
54382A69937l025j754l58j63j440l062l857l673k933j893p22K27O30L60n25j529
54366A46220j721o99O36J186J254J849K537J728o15k257j519O62K452L420L953
$$ plain form
54351 159086 162828 165334 166617 167943 170176 172806 175082 177172 179594 182309 185004 187584 189861 191531
54337 191531 193114 196159 201663 208748 215671 221702 227224 232303 236155 238094 238316 237508 236072 233964 231139
54322 231139 228020 225438 223896 222918 221372 218519 214476 209658 204300 198675 193356 188936 185666 183407
54308 183407 181647 179653 177109 174612 172915 171707 169928 167479 165658 165487 166459 167501 168405 169524 170795
54293 170795 171960 173174 174503 175301 175213 175342 177101 179941 181669 181464 181219 183048 186452 189166 190245 190901
54277 190901 192238 193548 193530 192274 191004 190338 189916 189665 190162 191243 191372 189381 186198 183710 182202 180076
54261 180076 176253 171679 167986 165433 162892 159415 155189 151139 147978 145653 143505 141026 138407 136064
54247 136064 133768 130796 127034 123317 120333 117751 114887 111857 109433 107874 106480 104583 102627 101841
$$ packed form
54351A59086L742K506J283J326K233K630K276K090K422K715K695K580K277J670
54337A91531J583L045N504P085O923O031N522N079L852J939K22q08j436k108k825
54322B31139l119k582j542r78j546k853m043m818n358n625n319m420l270k259
54308A83407j760j994k544k497j697j208j779k449j821j71R72J042R04J119J271
54293A70795J165J214J329P98q8J29J759K840J728k05k45J829L404K714J079O56
54277A90901J337J310j8j256j270o66m22k51M97J081J29j991l183k488j508k126
54261A80076l823m574l693k553k541l477m226m050l161k325k148k479k619k343
54247A36064k296k972l762l717k984k582k864l030k424j559j394j897j956p86
$$ plain form
54233 101841 102718 104159 104610 103932 103460 104009 104771 104901 105361 107856 112212 116149 117855 117689 117090 116880 116986
54216 116986 116884 115796 113290 110198 108162 107840 108232 108177 107686 107351 107337 107609 108336 109440 110467 111546 113617
54199 113617 116943 120236 122111 122724 123056 123311 123108 122661 122664 123363 124704 126895 129712 131710 131427 129277 127090
54182 127090 125918 125404 125133 125285 125801 126176 126367 126809 127188 126410 124383 122807 123347 125700 128244 130067 131452
54165 131452 132751 133785 134513 135465 136985 138369 138439 137103 135852 136260 138144 139684 139394 137513 135469 134600
54149 134600 135486 137676 139578 139294 136355 132444 129991 130286 132946 136382 138319 137020 133048 129188 127508
54134 127508 127025 125324 121891 118491 116579 115884 115585 115467 115534 115593 115592 115471 114662 112773 110882 110848 112965 115503
54116 115503 116976 117685 118388 118845 118611 118218 118305 118283 117126 115161 113939 114355 115791 117129 117821 117717 116466
$$ packed form
54233A01841Q77J441M51o78m72N49P62J30M60K495M356L937J706j66n99k10J06
54216A16986j02j088k506l092k036l22L92n5m91l35j4K72P27J104J027J079K071
54199A13617L326L293J875O13L32K55k03m47LO99J341K191K817J998k83k150k187
54182A27090j172n14k71J52N16L75J91M42L79p78k027j576N40K353K544J823J385
54165A31452J299J034P28R52J520J384P0j336j251M08J884J540k90j881k044q69
54149A34600Q86K190J902k84k939l911k453K95K660L436J937j299l972l860j680
54134A27508m83j701l433l400j912o95k99j18O7N9jj21q09j889j891l4K117K538
54116A15503J473P09P03M57k34l93Q7k2j157j965j222M16J436J338O92j04j251
$$ plain form
54099 116466 113585 109189 104512 101411 100941 102422 104236 105463 106139 106080 104582 101812 99562 99639 101807 104105
54083 104105 104940 104261 102894 101518 100465 99938 100042 100584 100880 99980 97492 94280 91867 90920 90743 90452 90048
54066 90048 89936 89995 89838 89648 89976 90806 91503 91779 92228 93692 96251 98981 100708 101136 101105 101377 101341 99741
54048 99741 96844 94775 94997 96427 97197 97520 99233 102635 105572 106212 105334 104949 105645 106448 106664 106582 106514 106344
54030 106344 106300 107221 109448 112011 113547 113818 113807 114402 115478 116272 116213 115222 113674 112373 112215 113368 114947
54013 114947 115952 116484 117462 119072 120201 119825 118498 117830 118687 120482 122192 123410 124208 124572 124544 124681 125829
53996 125829 128345 131792 135413 138566 140718 141523 141335 141400 143007 146411 150878 155640 160277 164163 166406
53981 166406 166906 167039 168595 172138 176855 181802 186766 192062 198226 205832 214856 224052 231745 237646 243315
$$ packed form
54099A16466k881m396m677l101m70J481J814J227O76n9j498k770k250P7K168K298
54083A04105Q35o79j367j376j053n27J04N42K96r00k488l212k413r47j77k91m04
54066I0048j12N9j57j90L28Q30O97K76M49J464K559K730J727M28l1K72l6j600
54048I9741k897k069K22J430P70L23J713L402K937O40q78l85O96Q03K16q2o8j70
54030A06344m4R21K227K563J536K71j1N95J076P94n9r91j548j301j58J153J579
54013A14947J005N32R78J610J129l76j327o68Q57J795J710J218P98L64k8J37J148
53996A25829K516L447L621L153K152Q05j88O5J607L404M467M762M637L886K243
53981A66406N00J33J556L543M717M947M964N296O164P606R024R196P693N901N669
$$ plain form
53966 243315 250442 259240 268859 278649 288248 297025 304501 311238 318377 326119 333390 339271 344057 348515
53952 348515 352677 355879 357638 357909 356700 354078 350621 347270 344463 341652 337934 332960 327002 320329
53938 320329 312880 304609 295906 287602 280617 275521 272144 269568 266756 263311 259469 255394 250937 246278
53924 246278 242235 239330 236833 233432 228804 223925 219846 216982 215769 217006 220723 225308 228811 231036
53910 231036 233426 236696 239463 239749 237350 234174 232486 233240 235819 238777 240772 241310 240792 239693 237784
53895 237784 234614 230759 227932 227459 229036 231391 233767 236220 238785 241212 243622 246720 250918 255654
53881 255654 259861 262948 265163 267338 270436 275061 281111 287920 294773 301179 306902 312221 318012 324865
53867 324865 332051 338144 342867 347405 352402 356687 358950 359993 362062 366120 370925 374881 377861 380935
$$ packed form
53966B43315P127Q798R619R790R599Q777P476O737P139P742P271N881M786M458
53952C48515M162L202J759K71j209k622l457l351k807k811l718m974n958o673
53938C20329p449q271q703q304o985n096l377k576k812l445l842m075m457m659
53924B46278m043k905k497l401m628m879m079k864j213J237L717M585L503K225
53910B31036K390L270K767K86k399l176j688P54K579K958J995N38n18j099j909
53895B37784l170l855k827m73J577K355K376K453K565K427K410L098M198M736
53881B55654M207L087K215K175L098M625O050O809O853O406N723N319N791O853
53867C24865P186O093M723M538M997M285K263J043K069M058M805L956K980L074
$$ plain form
53853 380935 385005 390110 395634 400963 406146 411850 418366 424957 430791 436299 442856 451064 460023 468229
53839 468229 474482 478007 478754 477926 477323 477623 477848 476930 475102 473261 471527 469083 465084 459207 451572 442623
53823 442623 432979 423105 413179 403337 393729 384260 374693 365066 355565 346001 336213 327110 320273 315794
53809 315794 311376 304559 295461 286445 279341 273962 269215 264640 260518 257138 254378 251686 248236 243424
53795 243424 237467 231285 225587 220206 214589 208872 204167 201475 200386 199277 197037 194237 192103 190763
53781 190763 189239 187066 184858 183027 180986 178237 175416 173457 172303 171351 170719 171090 172481 174042 175047
53766 175047 175395 175232 174892 175166 176729 179109 181006 181932 182825 184622 186809 187975 187435 185881 184664 184882
53750 184882 186924 190263 193589 195554 195810 195443 196326 199850 206006 213502 220807 227169 232701 237720 242321
$$ packed form
53853C80935M070N105N524N329N183N704O516O591N834N508O557Q208Q959Q206
53839D68229O253L525P47q28o03L00K25r18j828j841j734k444l999n877p635q949
53823D42623r644r874r926r842r608r469r567r627r501r564r788r103o837m479
53809C15794m418o817r098r016p104n379m747m575m122l380k760k692l450m812
53795B43424n957o182n698n381n617n717m705k692j089j109k240k800k134j340
53781A90763j524k173k208j831k041k749k821j959j154r52o32L71J391J561J005
53766A75047L48j63l40K74J563K380J897R26Q93J797K187J166n40j554j217K18
53750A84882K042L339L326J965K56l67Q83L524O156P496P305O362N532N019M601
$$ plain form
53735 242321 246683 251491 257598 265114 272995 279881 285477 290884 297294 304465 310821 315116 317636 319596
53721 319596 321715 323711 325058 325860 326843 328532 330432 331113 329397 325657 321760 319440 318690 317744 314629
53706 314629 308761 301261 293806 287127 280770 274508 269591 267764 268932 270595 270221 267681 264793 262956
53692 262956 262030 261256 260249 258876 256977 254780 253162 252901 253743 254593 254618 253798 252403 250361 247554 244482
53676 244482 242048 240582 239576 238636 238104 238178 237974 236461 234126 232600 232370 231944 229880 226810 224569 223810
53660 223810 223396 222013 219662 217543 216948 218221 220371 221826 221943 221734 222788 225628 229503 233530 237442
53645 237442 241201 244475 246820 248188 249096 250295 252121 254077 255259 255490 255909 258152 262854 269013 274789
53630 274789 278891 281436 283578 286283 289598 293173 297137 301842 306941 311531 315261 318523 321410 323410
$$ packed form
53735B42321M362M808O107P516P881O886N596N407O410P171O356M295K520J960
53721C19596K119J996J347Q02R83J689J900O81j716l740l897k320p50r46l115
53706C14629n868p500p455o679o357o262m917j827J168J663l74k540k888j837
53692B62956r26p74j007j373j899k197j618k61Q42Q50K5q20j395k042k807l072
53676B44482k434j466j006r40n32P4k04j513k335j526k30m26k064l070k241p59
53660B23810m14j383k351k119n95J273K150J455J17k09J054K840L875M027L912
53645B37442L759L274K345J368R08J199J826J956J182K31M19K243M702O159N776
53630B74789M102K545K142K705L315L575L964M705N099M590L730L262K887K000
$$ plain form
53616 323410 324503 325670 327690 330069 331707 332066 331250 329678 328117 327204 326406 324387 321046 318114 316896
53601 316896 316611 316133 316133 317834 320496 322015 321620 320196 318318 315785 312946 310576 308431 305737 303205 302508
53585 302508 303498 304100 303649 304130 306939 310404 312141 312335 312923 314602 316407 317605 318407 319158 320181 322172
53569 322172 325562 329650 333337 336471 339666 343112 346488 349658 352549 354727 356142 358009 361811 367406
53555 367406 373067 377458 380767 383941 387691 392364 398010 404188 410117 415237 419545 423567 428276 434482
53541 434482 441716 448207 452745 456318 461091 467989 476099 484179 491760 498843 505528 512142 518776 524487
53527 524487 527831 528538 528016 527987 529287 532051 536055 540430 543911 546061 547708 549718 551904 553625 554847
53512 554847 555993 557211 558393 559479 560134 559664 557995 556414 556426 558083 560178 561936 563613 565522 567582
$$ packed form
53616C23410J093J167K020K379J638L59q16j572j561r13p98k019l341k932j218
53601C16896k85m78%J701K662J519l95j424j878k533k839k370k145k694k532o97
53585C02508R90O02m51M81K809L465J737J94N88J679J805J198Q02P51J023J991
53569C22172L390M088L687L134L195L446L376L170K891K178J415J867L802N595
53555C67406N661M391L309L174L750M673N646O178N929N120M308M022M709O206
53541D34482P234O491M538L573M773O898Q110Q080P581P083O685O614O634N711
53527E24487L344P07n22k9J300K764M004M375L481K150J647K010K186J721J222
53512E54847J146J218J182J086O55m70j669j581J2J657K095J758J677J909K060
$$ plain form
53497 567582 570055 573665 578381 582899 586059 588195 590373 592941 595751 599285 604309 610389 615966 620291
53483 620291 624351 629388 635298 641153 646540 651603 656255 660305 664121 668289 672708 676871 681072 686473
53469 686473 693771 702554 712280 723127 735367 748420 761239 773455 785754 799177 814392 831588
53457 831588 850758 871851 894454 917358 939003 959045 979356 1002597 1029465 1057871 1085235
53446 1085235 1111108 1137165 1165073 1194974 1225935 1257326 1289555 1323541 1359525 1396586 1433558
53435 1433558 1470258 1507307 1544936 1582684 1620402 1658704 1697984 1737603 1776510 1814195 1850724
53424 1850724 1886478 1922260 1958968 1996505 2033608 2069362 2104232 2138851 2172532 2204166 2234208
53413 2234208 2264596 2296617 2329725 2362420 2393486 2422401 2449391 2475206 2500207 2523678 2544524
$$ packed form
53497E67582K473L610M716M518L160K136K178K568K810L534N024O080N577M325
53483F20291M060N037N910N855N387N063M652M050L816M168M419M163M201N401
53469F86473P298Q783R726J0847J2240J3053J2819J2216J2299J3423J5215J7196
53457H31588J9170K1093K2603K2904K1645K0042K0311K3241K6868K8406K7364
53446A085235K5873K6057K7908K9901L0961L1391L2229L3986L5984L7061L6972
53435A433558L6700L7049L7629L7748L7718L8302L9280L9619L8907L7685L6529
53424A850724L5754L5782L6708L7537L7103L5754L4870L4619L3681L1634L0042
53413B234208L0388L2021L3108L2695L1066K8915K6990K5815K5001K3471K0846
$$ plain form
53402 2544524 2562368 2577221 2588660 2596492 2601845 2606011 2608160 2605883 2598397 2587570 2575018 2559964
53390 2559964 2541180 2519590 2497200 2474535 2450979 2427021 2403949 2381310 2356753 2329097 2299981
53379 2299981 2271566 2243927 2215882 2187429 2159907 2134093 2109433 2085236 2061555 2038632 2016302
53368 2016302 1994452 1973619 1954571 1937586 1922546 1909577 1899094 1891231 1885623 1881843 1879731 1879166
53356 1879166 1879900 1881861 1885367 1890681 1897559 1905655 1915302 1927295 1941835 1958246 1976164 1996549 2020875
53343 2020875 2049411 2080875 2113920 2148484 2185372 2224883 2266375 2309181 2353520 2400230 2449759
53332 2449759 2501714 2555397 2610491 2667127 2725562 2786133 2849315 2915369 2983777 3053481 3123901
53321 3123901 3195406 3268392 3342144 3415141 3486527 3556819 3626987 3697183 3766592 3834174 3899190
$$ packed form
53402B544524J7844J4853J1439P832N353M166K149k277p486j0827j2552j5054
53390B559964j8784k1590k2390k2665k3556k3958k3072k2639k4557k7656k9116
53379B299981k8415k7639k8045k8453k7522k5814k4660k4197k3681k2923k2330
53368B016302k1850k0833j9048j6985j5040j2969j0483p863n608l780k112n65
53356A879166P34J961L506N314O878Q096R647J1993J4540J6411J7918K0385K4326
53343B020875K8536L1464L3045L4564L6888L9511M1492M2806M4339M6710M9529
53332B449759N1955N3683N5094N6636N8435O0571O3182O6054O8408O9704P0420
53321C123901P1505P2986P3752P2997P1386P0292P0168P0196O9409O7582O5016
$$ plain form
53310 3899190 3961147 4019687 4074618 4125827 4172976 4215299 4251789 4281697 4305014 4322474 4334814
53299 4334814 4341865 4342565 4336067 4322717 4303710 4279950 4251555 4218187 4179336 4134297 4082672 4025450
53287 4025450 3965250 3904930 3845781 3787116 3727412 3665725 3602278 3538117 3474191 3410689 3347352
53276 3347352 3284409 3222804 3163264 3105498 3048742 2992818 2938135 2884803 2832351 2780455 2729528
53265 2729528 2680480 2634219 2591365 2552024 2515649 2481467 2449240 2419385 2392198 2367238 2343679
53254 2343679 2321143 2299926 2280382 2262112 2243874 2224454 2203749 2182818 2162782 2143939 2126129
53243 2126129 2109587 2094974 2082796 2073270 2066637 2063064 2062210 2063264 2065388 2067895 2070397 2073334 2078062
53230 2078062 2085689 2095958 2108014 2122030 2139048 2159283 2181714 2205615 2231450 2259867 2290742
$$ packed form
53310C899190O1957N8540N4931N1209M7149M2323L6490K9908K3317J7460J2340
53299D334814P051P00o498j3350j9007k3760k8395l3368l8851m5039n1625n7222
53287D025450o0200o0320n9149n8665n9704o1687o3447o4161o3926o3502o3337
53276C347352o2943o1605n9540n7766n6756n5924n4683n3332n2452n1896n0927
53265B729528m9048m6261m2854l9341l6375l4182l2227k9855k7187k4960k3559
53254B343679k2536k1217j9544j8270j8238j9420k0705k0931k0036j8843j7810
53243B126129j6542j4613j2178r526o633l573q54J054K124K507K502K937M728
53230B078062P627J0269J2056J4016J7018K0235K2431K3901K5835K8417L0875
$$ plain form
53219 2290742 2323557 2357673 2391700 2423787 2453415 2482026 2510962 2539519 2565910 2589291 2609738
53208 2609738 2626978 2640577 2651063 2659541 2666228 2670387 2671632 2670233 2666186 2659099 2649145 2637090 2623075
53195 2623075 2606274 2586150 2563351 2538987 2513564 2486917 2458710 2428685 2396762 2363185 2328482
53184 2328482 2293354 2258693 2225291 2193041 2160753 2127386 2093256 2059522 2026865 1995299 1964756
53173 1964756 1934919 1904926 1874436 1844754 1817509 1792186 1766356 1738598 1710015 1682587 1657402
53162 1657402 1634964 1615663 1598915 1582933 1566488 1550194 1535180 1521261 1507478 1493769 1480832
53151 1480832 1468581 1455854 1441720 1426441 1411066 1396366 1381885 1365727 1345938 1322714 1298814
53140 1298814 1277087 1257921 1239627 1220686 1200847 1180613 1160791 1142347 1125657 1109795 1093299
$$ packed form
53219B290742L2815L4116L4027L2087K9628K8611K8936K8557K6391K3381K0447
53208B609738J7240J3599J0486Q478O687M159J245j399m047p087r954j2055j4015
53195B623075j6801k0124k2799k4364k5423k6647k8207l0025l1923l3577l4703
53184B328482l5128l4661l3402l2250l2288l3367l4130l3734l2657l1566l0543
53173A964756k9837k9993l0490k9682k7245k5323k5830k7758k8583k7428k5185
53162A657402k2438j9301j6748j5982j6445j6294j5014j3919j3783j3709j2937
53151A480832j2251j2727j4134j5279j5375j4700j4481j6158j9789k3224k3900
53140A298814k1727j9166j8294j8941j9839k0234j9822j8444j6690j5862j6496
$$ plain form
53129 1093299 1075629 1057206 1038254 1018573 998427 978713 959960 941910 924303 907400 891369
53118 891369 875786 860071 844071 827971 812038 796583 781774 767318 752811 738559 725544
53107 725544 714272 704049 693783 683187 672774 662846 652959 642575 631965 622110 613518 605412
53095 605412 596555 586858 577540 569426 561799 553484 544393 535132 525673 515606 505529 496864 490043 483974
53081 483974 477631 471037 464285 456849 448879 442167 438508 437512 437132 436098 434654 433028 430444 426136 420535
53066 420535 414880 410037 406055 402595 399486 396998 395613 395325 395207 394026 391398 388021 384843 382366 380771
53051 380771 380069 379798 379048 377205 374434 371223 367835 364570 362086 360790 360108 359068 357625 356741 356942 357453
53035 357453 357295 356806 357369 359661 362725 365069 366343 367609 370008 373432 376659 378625 379262 378984 377696
$$ packed form
53129A093299j7670j8423j8952j9681k0146j9714j8753j8050j7607j6903j6031
53118H91369j5583j5715j6000j6100j5933j5455j4809j4456j4507j4252j3015
53107G25544j1272j0223j0266j0596j0413r928r887j0384j0610r855q592q106
53095F05412q857r697r318q114p627q315r091r261r459j0067j0077q665o821o069
53081D83974o343o594o752p436p970o712l659r96l80j034j444j626k584m308n601
53066D20535n655m843l982l460l109k488j385k88j18j181k628l377l178k477j595
53051C80771p02k71p50j843k771l211l388l265k484j296o82j040j443q84K01N11
53035C57453j58m89N63K292L064K344J274J266K399L424L227J966O37k78j288
$$ plain form
53020 377696 374825 370481 366029 363005 361490 359993 356965 352118 346233 340190 334530 329568 325337 321422
53006 321422 317265 312778 308413 304566 301151 297804 294221 290243 286014 282203 279590 278017 276125 272758
52992 272758 268414 264581 261676 258474 253914 248682 244520 242555 242949 245482 249321 252458 252740 249957 246081
52977 246081 242937 240388 237399 234019 231267 229438 227682 225386 223073 221523 220737 220219 219844 219817 219997 219873
52961 219873 219332 218997 219446 220272 220289 218818 216467 214392 213017 211983 211240 211486 213157 215540 217465 218487
52945 218487 218809 218375 216876 214601 212474 211017 209945 209003 208613 209294 210863 212618 213935 214468 214206 213716
52929 213716 213968 215414 217462 219165 220099 220257 219564 218171 216918 216760 217735 219150 220736 222906 225724 228300
52913 228300 229625 229554 228680 227753 227689 229454 233039 236675 238183 237572 237526 240503 245599 249192 248852 245963 244131
$$ packed form
53020C77696k871m344m452l024j515j497l028m847n885o043n660m962m231l915
53006C21422m157m487m365l847l415l347l583l978m229l811k613j573j892l367
52992B72758m344l833k905l202m560n232m162j965L94K533L839L137K82k783l876
52977B46081l144k549k989l380k752j829j756k296k313j550p86n18l75k7J80j24
52961B19873n41l35M49Q26J7j471k351k075j375j034p43K46J671K383J925J022
52945B18487L22m34j499k275k127j457j072r42l90O81J569J755J317N33k62m90
52929B13716K52J446K048J703R34J58o93j393j253j58R75J415J586K170K818K576
52913B28300J325p1q74r27o4J765L585L636J508o11m6K977N096L593l40k889j832
$$ plain form
52896 244131 245569 249652 254566 259271 263676 267889 272058 276533 281335 285599 288398 290351 293639 299792
52882 299792 307817 315184 320527 324690 329024 333518 337245 340034 342734 345808 348585 350232 350650 349932 347603
52867 347603 343377 338367 334572 332938 332603 332127 330810 328607 325580 322041 318715 316070 313699 310920 307893
52852 307893 305526 304332 303931 303772 303841 304298 304771 304504 303280 301942 301714 302958 304750 305806 305742 305262 305180
52835 305180 305583 305964 305891 305382 304900 305136 306500 308522 310010 310234 309899 310556 312906 315992 318179 318768 318467
52818 318467 318443 319129 319950 320011 318956 317366 316526 317632 320779 324610 327316 328159 327716 326542 324374 321325
52802 321325 319207 320289 324554 329292 331932 332452 332428 332592 332376 331406 330282 329748 329861 330178 330288 329998 329478
52785 329478 329375 330420 332739 335753 338808 341637 344319 347191 350777 355329 360242 364347 367042 368841
$$ packed form
52896B44131J438M083M914M705M405M213M169M475M802M264K799J953L288O153
52882B99792Q025P367N343M163M334M494L727K789K700L074K777J647M18p18k329
52867C47603m226n010l795j634l35m76j317k203l027l539l326k645k371k779l027
52852C07893k367j194m01j59O9M57M73k67j224j338k28J244J792J056o4m80q2
52835C05180M03L81p3n09m82K36J364K022J488K24l35O57K350L086K187N89l01
52818C18467k4O86Q21O1j055j590q40J106L147L831K706Q43m43j174k168l049
52802C21325k118J082M265M738K640N20k4J64k16r70j124n34J13L17J10k90n20
52785C29478j03J045K319L014L055K829K682K872L586M552M913M105K695J799
$$ plain form
52771 368841 370493 371846 372031 370800 369208 368708 369622 370846 371160 370647 370570 371948 374518 377119 378735 379020
52755 379020 378168 376628 374850 373034 371020 368510 365343 361642 357902 354943 353350 352762 351894 349519 345285
52740 345285 339576 332933 325852 318799 312038 305625 299691 294431 289663 284914 280239 276434 273916 271964
52726 271964 269804 267989 267714 268795 269259 267314 263197 258843 256008 254830 253855 251392 247072 241985 237220
52711 237220 232742 228229 224452 222665 222655 222464 220433 216771 212806 209449 206901 205170 204163 203459 202428
52696 202428 200466 197099 192423 187626 184291 182625 180951 177595 172931 168803 166243 164545 162553 160200
52682 160200 158622 159152 162170 166410 169486 169718 167679 165512 164538 164062 162712 160275 157620 155352 153472
52667 153472 152249 152357 153677 154714 153900 151145 147519 143825 140297 137469 136231 136732 138035 139196 139916
$$ packed form
52771C68841J652J353J85j231j592n00R14J224L14n13p7J378K570K601J616K85
52755C79020q52j540j778j816k014k510l167l701l740k959j593n88q68k375m234
52740C45285n709o643p081p053o761o413n934n260m768m749m675l805k518j952
52726B71964k160j815k75J081M64j945m117m354k835j178r75k463m320n087m765
52711B37220m478m513l777j787j0j91k031l662l965l357k548j731j007p04j031
52696B02428j962l367m676m797l335j666j674l356m664m128k560j698j992k353
52682A60200j578N30L018M240L076K32k039k167r74m76j350k437k655k268j880
52667A53472j223J08J320J037q14k755l626l694l528k828j238N01J303J161P20
$$ plain form
52652 139916 139840 138333 135772 134159 135181 138011 140158 140336 139416 138603 137926 136947 135934 135669 136500 138024
52636 138024 139399 139823 139053 137647 136497 136220 137139 139313 141969 143542 143335 142791 143845 146237 147977 148544
52620 148544 149774 152975 156918 159845 162055 165084 169314 173877 178263 182570 186565 189785 192367 194672
52606 194672 196318 196680 196083 195383 194503 192622 189901 187872 187691 188719 189099 187349 183489 179222 176848 177254
52590 177254 178942 179568 178289 176035 173900 172177 170654 168771 165668 161143 156551 153602 152241 150939
52576 150939 149126 148051 148904 151383 154602 158133 161481 163826 165239 167116 170274 173423 174615 173651 171993
52561 171993 170727 169724 168589 167309 165899 164194 162173 159977 157605 155086 152894 151650 151293 150969 149843
52546 149843 147868 145786 144555 144663 145879 147762 150313 153770 157768 161309 163749 165234 166064 166319 166403
$$ packed form
52652A39916p6j507k561j613J022K830K147J78r20q13o77r79j013k65Q31J524
52636A38024J375M24p70j406j150k77R19K174K656J573k07n44J054K392J740N67
52620A48544J230L201L943K927K210L029M230M563M386M307L995L220K582K305
52606A94672J646L62n97p00q80j881k721k029j81J028L80j750l860m267k374M06
52590A77254J688O26j279k254k135j723j523j883l103m525m592k949j361j302
52576A50939j813j075Q53K479L219L531L348K345J413J877L158L149J192r64j658
52561A71993j266j003j135j280j410j705k021k196k372k519k192j244l57l24j126
52546A49843j975k082j231J08J216J883K551L457L998L541K440J485Q30K55Q4
$$ plain form
52531 166403 167012 168030 168273 167096 165494 164762 164736 164448 163908 164025 165021 166218 167370 169092 171810 175270
52515 175270 179142 183165 186563 188342 188544 188445 189249 191206 194041 197341 200321 202182 203152 204350 206270
52500 206270 208240 209781 211421 213480 215029 215151 214634 215239 217467 220045 221658 222335 222902 223702 224318 224292
52484 224292 223854 223878 225168 227836 231380 235158 238490 240530 240686 239364 237906 237649 239295 242980 248174
52469 248174 253450 257280 259436 260888 262087 262297 261104 259438 258330 257642 257116 257712 260359 263850 265586
52454 265586 264554 262398 261462 262831 266219 270360 273196 273024 270292 267467 266465 266865 267095 266576 265995 266048
52438 266048 266681 267266 267023 265552 263464 262132 262323 263234 263282 261617 258619 255323 252911 252498 254699 259099
52422 259099 264299 268686 271427 273049 274946 277871 280934 282602 282696 282650 283550 284707 284739 283429 281850 281220
$$ packed form
52531A66403O09J018K43j177j602p32k6k88n40J17R96J197J152J722K718L460
52515A75270L872M023L398J779K02r9Q04J957K835L300K980J861R70J198J920
52500B06270J970J541J640K059J549J22n17O05K228K578J613O77N67Q00O16k6
52484B24292m38K4J290K668L544L778L332K040J56j322j458k57J646L685N194
52469B48174N276L830K156J452J199K10j193j666j108o88n26N96K647L491J736
52454B65586j032k156r36J369L388M141K836j72k732k825j002M00K30n19n81N3
52438B66048O33N85k43j471k088j332J91R11M8j665k998l296k412m13K201M400
52422B59099N200M387K741J622J897K925L063J668R4m6R00J157L2j310j579o30
$$ plain form
52406 281220 282320 285542 290455 295407 298503 299348 299398 300494 303378 307465 311412 313795 313862 312027 309481
52391 309481 307181 305387 304102 303510 303704 304340 304823 304922 305034 305800 307374 309083 309938 309604 308689 308000 307659
52374 307659 307208 306461 305968 306590 308736 311943 315116 317183 317644 316621 314624 312462 311038 310724 311030 311396
52358 311396 312160 313985 316295 317231 315663 312535 309787 308684 309641 312624 316672 319761 320480 319559 318719 318386
52342 318386 317774 316969 317291 319169 321106 321509 320666 320131 320837 322581 324799 327023 328760 329645 329758 329468 328955
52325 328955 328117 326884 325546 324757 325062 326181 327043 327026 326940 328016 329933 330843 329733 327924 327515 329003 331263
$$ packed form
52406B81220J100L222M913M952L096Q45N0J096K884M087L947K383O7j835k546
52391C09481k300j794j285n92J94O36M83R9J12P66J574J709Q55l34r15o89l41
52374C07659m51p47m93O22K146L207L173K067M61j023j997k162j424l14L06L66
52358C11396P64J825K310R36j568l128k748j103R57K983M048L089P19r21q40l33
52342C18386o12q05L22J878J937M03q43n35P06J744K218K224J737Q85J13k90n13
52325C28955q38j233j338p89L05J119Q62j7q6J076J917R10j110j809m09J488K260
$$ [...]
##END NTUPLES=NMR SPECTRUM
##END=
