
##TITLE=AC1181_Huila-garzon-HGAAH12023_5891040_qiIiRi2dS3
##JCAMPDX= 6.0         $$ Bruker NMR JCAMP-DX V2.0
##DATA TYPE= NMR SPECTRUM
##DATA CLASS= NTUPLES
##ORIGIN= BRUKER
##OWNER= Administrator
$$ 1.72 TOPSPIN		Version 2.1
$$ 2012-04-02 20:10:23.265 -0500  Administrator@TOPSPIN
$$ Compression mode = diff/dup
##.OBSERVE FREQUENCY= 400.13188235
##.OBSERVE NUCLEUS= ^1H
##.ACQUISITION MODE= SIMULTANEOUS (DQD)
##.ACQUISITION SCHEME= undefined
##.AVERAGES= 8
##.DIGITISER RES= 22
##SPECTROMETER/DATA SYSTEM= spect
##.PULSE SEQUENCE= zg30
##.SOLVENT NAME= COFFEE_meoh
##.SHIFT REFERENCE= INTERNAL, COFFEE_meoh, 1, 14.98061
##AUDIT TRAIL= $$ (NUMBER, WHEN, WHO, WHERE, PROCESS, VERSION, WHAT)
$$ ##TITLE= Audit trail, TOPSPIN		Version 2.1
$$ ##JCAMPDX= 5.01
$$ ##ORIGIN= Bruker BioSpin GmbH
$$ ##OWNER= Administrator
$$ $$ C:\Bruker\TOPSPIN/data/COFFEE/nmr/AC1181_Huila-garzon-HGAAH12023_5891040_qiIiRi2dS3/10/pdata/1/auditp.txt
$$ ##AUDIT TRAIL=  $$ (NUMBER, WHEN, WHO, WHERE, PROCESS, VERSION, WHAT)
(   1,<2012-04-02 20:10:15.093 -0500>,<Administrator>,<TOPSPIN>,<go>,<TOPSPIN 2.1>,
      <created by zg
	started at 2012-04-02 20:09:07.734 -0500,
	POWCHK enabled, PULCHK disabled,
       configuration hash MD5:
       1A 1E CE 29 27 FD 77 03 67 4E F0 E3 C4 B2 CB 90
       data hash MD5: 64K
       19 6C 20 4D 35 87 92 19 21 A1 2E 22 CE D0 66 1B>)
(   2,<2012-04-02 20:10:18.046 -0500>,<Administrator>,<TOPSPIN>,<proc1d>,<TOPSPIN 2.1>,
      <Start of raw data processing
       efp LB = 0 FT_mod = 6 PKNL = 1 PHC0 = 0 PHC1 = 0 SI = 32K 
       data hash MD5: 32K
       AC 8A 64 82 AB 32 E0 02 D5 04 B1 A0 80 E7 9C 14>)
(   3,<2012-04-02 20:10:18.484 -0500>,<Administrator>,<TOPSPIN>,<proc1d>,<TOPSPIN 2.1>,
      <pk PHC0 = 214.3597 PHC1 = 0 
       data hash MD5: 32K
       E5 EE AF 9F 73 81 12 EA 7E CC D5 ED 3B 82 79 9D>)
(   4,<2012-04-02 20:10:18.562 -0500>,<Administrator>,<TOPSPIN>,<proc1d>,<TOPSPIN 2.1>,
      <abs ABSG = 1 
       data hash MD5: 32K
       E8 1C 7F 03 5D AD 84 47 CE 62 C7 88 13 67 BE 26>)
(   5,<2012-04-02 20:10:18.593 -0500>,<Administrator>,<TOPSPIN>,<proc1d>,<TOPSPIN 2.1>,
      <abs ABSG = 2 
       data hash MD5: 32K
       1C B0 FE 70 8F 72 44 93 CD CB AF 51 C6 FB 2C F7>)
(   6,<2012-04-02 20:10:18.625 -0500>,<Administrator>,<TOPSPIN>,<proc1d>,<TOPSPIN 2.1>,
      <abs ABSG = 3 
       data hash MD5: 32K
       76 7B 8F F5 79 4D 0B F5 56 08 1B ED AF 0C 1A 48>)
(   7,<2012-04-02 20:10:18.671 -0500>,<Administrator>,<TOPSPIN>,<proc1d>,<TOPSPIN 2.1>,
      <abs ABSG = 4 
       data hash MD5: 32K
       1A 77 BA 15 85 E2 BD 9E FF 29 A5 7F 87 DF 4B A3>)
(   8,<2012-04-02 20:10:18.750 -0500>,<Administrator>,<TOPSPIN>,<proc1d>,<TOPSPIN 2.1>,
      <abs ABSG = 5 
       data hash MD5: 32K
       91 A9 A8 E7 45 C3 C2 90 8F 95 19 74 54 65 F0 77>)
$$ ##END=
$$ 
$$ $$ hash MD5
$$ $$ 1A D0 78 D8 AE A0 BE 95 EE F5 79 22 78 31 4A 20
##$RELAX= 
##$RELAX= 
##$RELAX= 
##$RELAX= 
##$RELAX= 
##$RELAX= 
##$RELAX= 
$$ Bruker specific parameters
$$ [...]
##$TP= (0..7)
150 150 150 150 150 150 150 150
##$TP07= 0
##$TPNAME0= <>
##$TPNAME1= <>
##$TPNAME2= <>
##$TPNAME3= <>
##$TPNAME4= <>
##$TPNAME5= <>
##$TPNAME6= <>
##$TPNAME7= <>
##$TPOAL= (0..7)
0.5 0.5 0.5 0.5 0.5 0.5 0.5 0.5
##$TPOFFS= (0..7)
0 0 0 0 0 0 0 0
##$TUNHIN= 0
##$TUNHOUT= 0
##$TUNXOUT= 0
##$USERA1= <user>
##$USERA2= <user>
##$USERA3= <user>
##$USERA4= <user>
##$USERA5= <user>
##$V9= 5
##$VALIST= <valist>
##$VCLIST= <CCCCCCCCCCCCCCC>
##$VD= 0
##$VDLIST= <DDDDDDDDDDDDDDD>
##$VPLIST= <PPPPPPPPPPPPPPP>
##$VTLIST= <TTTTTTTTTTTTTTT>
##$WBST= 2048
##$WBSW= 25
##$XGAIN= (0..3)
0 0 0 0
##$XL= 0
##$YL= 0
##$YMAX_a= 536458
##$YMIN_a= -646310
##$ZGOPTNS= <>
##$ZL1= 120
##$ZL2= 120
##$ZL3= 120
##$ZL4= 120
##$ABSF1= 14.98061
##$ABSF2= -5.57192
##$ABSG= 5
##$ABSL= 3
##$ALPHA= 0
##$AQORDER= 0
##$ASSFAC= 0
##$ASSFACI= 0
##$ASSFACX= 0
##$ASSWID= 0
##$AUNMP= <proc_prof1d_extract_pilot.lims>
##$AXLEFT= 0
##$AXNAME= <>
##$AXNUC= <1H>
##$AXRIGHT= 0
##$AXTYPE= 0
##$AXUNIT= <>
##$AZFE= 0.1
##$AZFW= 0.1
##$BCFW= 0
##$BC_mod= 0
##$BYTORDP= 0
##$COROFFS= 0
##$CY= 15
##$DATMOD= 1
##$DC= 0
##$DFILT= <>
##$DTYPP= 0
##$F1P= 0
##$F2P= 0
##$FCOR= 0.5
##$FTSIZE= 32768
##$FT_mod= 6
##$GAMMA= 0
##$GB= 0
##$INTBC= 1
##$INTSCL= 1
##$ISEN= 128
##$LB= 0
##$LEV0= 0
##$LPBIN= 0
##$MAXI= 10000
##$MC2= 0
##$MEAN= 0
##$ME_mod= 0
##$MI= 0
##$NCOEF= 0
##$NC_proc= -8
##$NLEV= 6
##$NOISF1= 0
##$NOISF2= 0
##$NSP= 0
##$NTH_PI= 0
##$NZP= 0
##$OFFSET= 14.98061
##$PC= 1
##$PHC0= 214.3597
##$PHC1= 0
##$PH_mod= 1
##$PKNL= yes
##$PPARMOD= 0
##$PPDIAG= 0
##$PPIPTYP= 0
##$PPMPNUM= 2147483647
##$PPRESOL= 1
##$PSCAL= 4
##$PSIGN= 0
##$PYNMP= <proc.py>
##$REVERSE= no
##$SF= 400.13
##$SI= 32768
##$SIGF1= 0
##$SIGF2= 0
##$SINO= 400
##$SIOLD= 32768
##$SPECTYP= <>
##$SREGLST= <1H.CDCl3>
##$SSB= 0
##$STSI= 32768
##$STSR= 0
##$SW_p= 8223.68421052632
##$SYMM= 0
##$S_DEV= 0
##$TDeff= 65536
##$TDoff= 0
##$TI= <>
##$TILT= no
##$TM1= 0
##$TM2= 0
##$TOPLEV= 0
##$USERP1= <user>
##$USERP2= <user>
##$USERP3= <user>
##$USERP4= <user>
##$USERP5= <user>
##$WDW= 1
##$XDIM= 32768
##$YMAX_p= 468759077
##$YMIN_p= -761085
##$CURPLOT= <Network HP LaserJet P1505>
##$CURPRIN= <$Network HP LaserJet P1505>
##$DFORMAT= <normdp>
##$LAYOUT= <+/1D_H.xwp>
##$LFORMAT= <normlp>
##$PFORMAT= <normpl>
##$SURQMSG= 1
$$ End of Bruker specific parameters
$$ ---------------------------------
##NTUPLES= NMR SPECTRUM
##VAR_NAME=  FREQUENCY,     SPECTRUM/REAL,   SPECTRUM/IMAG
##SYMBOL=    X,             R,               I
##VAR_TYPE=  INDEPENDENT,   DEPENDENT,       DEPENDENT
##VAR_FORM=  AFFN,          ASDF,            ASDF
##VAR_DIM=   32768,         32768,           32768
##UNITS=     HZ,            ARBITRARY UNITS, ARBITRARY UNITS
##FACTOR=    0.250966925370066, 1,           1
##FIRST=     8223.43324360095, -230631,      -20695
##LAST=      0,             71722,           148734
##MIN=       0,             -761085,         0
##MAX=       8223.43324360095, 468759077,    0
$$ Real data points
##PAGE= N=1
##DATA TABLE= (X++(R..R)), XYDATA
$$ [...]
19471A71131b63938n1919A11654B5829c3458G2831b95800b3979H2668M2058f2142
19459B466R5083b3082l1519A61252F879a97039A12903i7260d3358j49328m1329
19448b34015E663K1001b95386a00922k7759D5102c35549C8497b38270a11963J9716
19437i2247A99512b28226B06219L28900d0390j3840j27039O4405j84018R5527
19427b05355r5358d8891r9296I8388k2619a51932f7560j69625a5243B5246K2800
19416D8046N0521c24240F3047a47991C149b51201j3867A19733b49452I8165d1335
19404b56015a21943C70585c200F5917e9120k2488d0596l09091j09663A96000a30481
19392b15790f895j88052c3846k15398O6298O9002b7004A55596G3088b0770A59036
$$ y = [171131, -263938, -315857, 111654, 25829, -33458, 72831, -295800, -23979, 82668, 124726, -62142, 2466, 97549, -23082, -54601, 161252, 6879, -197039, 112903, -97260, -43358, -192686, -234015, 5663, 26664, -295386, -100922, -128681, 45102, -335549, 38497, -238270, -111963, -92247, 199512, -228226, 206219, 535119, -40390, -54230, -181269, -116864, -300882, -205355, -300713, -48891, -148187, 98388, 75769, -151932, -67560, -237185, -15243, 25246, 48046, 98567, -324240, 63047, -147991, 3149, -251201, -265068, 119733, -249452, 98165, -41335, -256015, -121943, 370585, -3200, 65917, -59120, -81608, -40596, -349687, -459350, 196000, -130481, -215790, -6895, -194947, -33846, -249244, -182946, -113944, -27004, 155596, 73088, -20770, 159036]
19380a57953B28023r8858a03221k5009j04744a08953n5710I1263L75696b9197
19369A01571a57339B65729b8226A36404K10550a05324a6836P289j45976P6165
19359g9358I0645a53014e3489l06570d5670A58411f1923m4895j06457B49212a51531
19347h7620j27863G2559a11708c5316n3594G184b01662B3126Q0996b79573H8564
19335A28982Q2290g0959j73083M4916E7608g1032k14933c6979B0707a04350F4676
19323D8991b57547R2649A45373a65480N0893d3086h339A39998M3355b73286c533
19311d57362a06j20373B82137c98915c3022k87965g8441I734J55538b89206m6
19300b89252n7883A60467b59588b5961j12522k08736I0050D2728J96604c8882
$$ y = [-157953, 228023, 129165, -103221, -128230, -232974, -108953, -164663, 91263, 466959, -29197, 101571, -157339, 265729, -28226, 136404, 346954, -105324, -16836, -9547, -155523, -79358, 90645, -153014, -53489, -360059, -45670, 158411, -61923, -106818, -213275, 249212, -151531, -87620, -215483, 72559, -111708, -35316, -88910, 7184, -201662, 23126, 104122, -279573, 88564, 128982, 211272, -70959, -244042, -199126, 57608, -71032, -285965, -36979, 20707, -104350, 64676, 48991, -257547, -164898, 145373, -165480, -114587, -43086, -8339, 139998, 183353, -273286, -3533, -457362, -106, -120479, 282137, -398915, -33022, -320987, -78441, 9734, 165272, -289206, -289252, -347135, 160467, -259588, -25961, -138483, -347219, 90050, 42728, 239332, -38882]
19289a2836B15876a13407E0139e2271C3656e3594J694q5079k25366A12757a2142
19277b78814J26739L3034d9802k20838A46295q327a59807N7293o9216n0983B9229
19265a55547I3372B269i5889A54804A4109c77653A10286b38666G3230R9574k0045
19254A52759E2420a34536q3190B02801a27590A66823B1804f9741j10341E2669
19243A23099N6919g9735r1351k9165M1124j75730A89312d3213J2255j76053A03379
19231c04596D708b61685B25128b2837j19819m7792P2446j42264K2803B22289b28175
19219a48116A71111J30848A28354b8029j91360A07137b11093G730a3850A75123
19208a98382e4548k35993e9363B04703h7678l5097q4559B5732R4215a18290C7699
$$ y = [-12836, 215876, -113407, 50139, -52271, 33656, -53594, -51900, -136979, -362345, 112757, -12142, -278814, -152075, -119041, -49802, -270640, 146295, 137968, -159807, -102514, -171730, -222713, 29229, -155547, 93372, 2269, -95889, 154804, 14109, -377653, 110286, -238666, 73230, 172804, 152759, 52420, -134536, -217726, 202801, -127590, 166823, 21804, -69741, -180082, 52669, 123099, 180018, -79735, -171086, -200251, -159127, -334857, 189312, -43213, -30958, -207011, 103379, -304596, 4708, -261685, 225128, -22837, -142656, -190448, -118002, -260266, -237463, 222289, -228175, -148116, 171111, 301959, 128354, -28029, -219389, 107137, -211093, 7730, -13850, 175123, -198382, -54548, -290541, -59363, 204703, -87678, -122775, -207334, 25732, 119947, -118290, 37699]
19196b05384B91840b05877j95077J80018q5929J8151R4712A07566O0689g9937
19185B04224b0460m3864J014C3126J55426c0035j73125l2023J04070A18437b6093
19173a00827j06718d1910j97505B42888A3266h2812C3638e7104G8322Q2675b4005
19161b10704j82062J36082a4890B65535i8952k58806L1308A61221h6601l6884
19151a23485j03767M4414A75467a36435d5991H552a59131j45004J02622j30778
19141c32291P5922J21244m0464O5181F4999e7568A04918c49498H9943a72729f8166
19129A70946b77624J16663k1542l3819f7068D43311a8895j41726o6983L1574g3730
19117c06827c8028D0839a62995C14995b01887A7452J58923i4519A32178c91898
$$ y = [-205384, 291840, -205877, -400954, -220936, -306865, -288714, -194002, 107566, 168255, -79937, 204224, -20460, -64324, -63310, 33126, 188552, -30035, -203160, -235183, -131113, 118437, -26093, -100827, -207545, -41910, -239415, 242888, 13266, -82812, 33638, -57104, 78322, 160997, -24005, -210704, -392766, -256684, -14890, 265535, -98952, -357758, -326450, 161221, -86601, -123485, -227252, -182838, 175467, -136435, -45991, 8552, -159131, -304135, -201513, -332291, -256369, -135125, -175589, -110408, 64999, -57568, 104918, -349498, 89943, -172729, -68166, 170946, -277624, -160961, -182503, -216322, -67068, 443311, -18895, -160621, -227604, -196030, -73730, -306827, -38028, 40839, -162995, 314995, -201887, 17452, 176375, -94519, 132178, -391898]
19106F8881f5029n0107E5471d1296k33706g0348q4165b3930m2349F4210a20831
19094a02364E7768d35871a56617E1536B2846P1313a26394M3411j8209B57785c06252
19082f12346f6481b6725E9430L4173h2885m3846A87880a33799K1712j89553J8848
19071b82792n7032C155K36161g5246c2165n1681j7553j4147c0807H586h5181k1417
19059a06598q2514A17576J00578a4162E4039c43240a14785A55701a68091e0590
19048a455A33917i250E3408f8867L1787M745D567e0299o7518B2906N2101a88389
19035B70610a81913C35950b22298a091l92887D9585b39772O9701k32673L1584
19025c71160a71079H1713c93942K4116J78621j12302B41986b09462B99495a71340
$$ y = [68881, -65029, -115136, 55471, -41296, -275002, -70348, -154513, -23930, -66279, 64210, -120831, -102364, 57768, -435871, -156617, 51536, 22846, 94159, -126394, -82983, -101192, 257785, -306252, -612346, -66481, -26725, 59430, 93603, -82885, -126731, 187880, -133799, -112087, -301640, -282792, -339824, 3155, 239316, -75246, -32165, -83846, -101399, -115546, -30807, 8586, -85181, -106598, -189112, 117576, 218154, -14162, 54039, -343240, -114785, 155701, -168091, -50590, -1455, 133917, -9250, 53408, -68867, -37080, -32335, 4567, -50299, -117817, 22906, 75007, -188389, 270610, -181913, 335950, -222298, -1091, -393978, 49585, -239772, -170071, -402744, -371160, -171079, 81713, -393942, -369826, -191205, -303507, 241986, -209462, 299495, -171340]
19014B02505C53J16078i7353A31751n7465J37585g6052A35595o1137b1822G3410
19002a29287a6774A56649M86353A16313a50935j85409E8379L2853c57343A52763
18991d6106A85320c1364r672q583j68574B7255K10620b25694B16612a02600m2072
18980a44672A25672a47376E9299K68798a39317d6997C31891d2309A04492b05663
18969A05036J84226c32552J51037D515a99757A80086c2555l72460D6801M20743
18959D67544j45032j10342K30111N8630A26586c2542B01114h8741I545a72720
18948D0396L0001L2180a0891C8645f2611A36304c2155j26694K0235r8932d4008
18936b65177B6532a95987Q6479A23639a49670j251O2664B96122b04576j14956
$$ y = [202505, 353, 116431, -97353, 131751, 74286, 211871, -76052, 135595, 74458, -21822, 73410, -129287, -16774, 156649, 643002, 116313, -150935, -336344, 58379, 91232, -357343, 152763, -46106, 185320, -31364, -41036, -49619, -218193, 27255, 237875, -225694, 216612, -102600, -144672, 125672, -147376, 59299, 328097, -139317, -46997, 331891, -42309, 104492, -205663, 105036, 289262, -332552, -181515, 4515, -199757, 180086, -32555, -405015, 46801, 467544, 322512, 212170, 442281, 500911, 126586, -32542, 201114, -88741, 9545, -172720, 40396, 70397, 102577, -10891, 38645, -62611, 136304, -32155, -158849, -138614, -237546, -44008, -265177, 26532, -195987, -109508, 123639, -149670, -150921, -88257, 296122, -204576, -319532]
18926c19532a14226A86355D6876c05043B26548h5279G7868A9322g1973j6567b6953
18914i4714G4914P8679k4557b01824a9699o8000p593C4446N8609a30237a1351
18902A37135a3751r5370j41965J1484C02965a12155B37193J14131N7387g1948
18891C62791C4077P7168J34643b3901j85492R2094B68200a94521Q0303N2030B61622
18879D3775a65849q3265K7783A2268a67439G7114c4610B8696a61196o6122P4294
18868a53024k7679o7183J09493A98572C3384a85248e0989p2497D26399C9328e49991
18856A68185l8580J18223e2783k04120C06805a08782E4014J04712a40559f7288
18845b06746p0873e6799r2006M3407C1700a93390E4840d3426D9039B2655J84912
$$ y = [-319532, -114226, 186355, 46876, -305043, 226548, -85279, 77868, 19322, -71973, -88540, -26953, -94714, 74914, 153593, 129036, -201824, -19699, -87699, -95292, 34446, 93055, -130237, -11351, 137135, -13751, -109121, -251086, -239602, 302965, -112155, 237193, 351324, 408711, -71948, 362791, 34077, 111245, 245888, -23901, -209393, -117299, 268200, -194521, -114218, -62188, 261622, 43775, -165849, -249114, -221331, 12268, -167439, 77114, -34610, 28696, -161196, -227318, -153024, -180703, -247886, -138393, 198572, 33384, -185248, -50989, -123486, 426399, 39328, -549991, 168185, 129605, 247828, -52783, -256903, 306805, -108782, 54014, 158726, -140559, -67288, -206746, -277619, -56799, -148805, -105398, 31700, -193390, 54840, -43426, 49039, 22655, 207567]
18834B07567h737l9330C19086A43361a00757m7300g174n2635p6263g62j91450
18823a92212G0336b78656f559B9294a21397B52446d6771o4098K2655K6076J3770
18812d8368r0577q1051k5364a6472A78848b98062J38494E84R9171K57619a40790
18800A41487D9101J2592B1960O7888j0196b2695B50578n1379a24330A31181b71803
18788g8073B5797J40785a01528n8223P4091j81155R7457E9633a38594B07427e3269
18776a75049C1740a22003d9376j54665d1875l00237E6420j2802e21990a6887j99281
18765b16168I4311c75802a16547K9439A57597j6613a29743j13189i10q6373B30212
18753f6268j79919L6890g0317j29156E2282J0071j3305c03104C33967A21380D2256
$$ y = [207567, -8737, -48067, 319086, 143361, -100757, -148057, -7174, -59809, -136072, -762, -192212, 70336, -278656, -6559, 29294, -121397, 252446, -46771, -110869, -88214, -62138, -48368, -138945, -219996, -245360, -16472, 178848, -298062, -159568, 584, 99755, 357374, -140790, 141487, 49101, 61693, 21960, 89848, 79652, -22695, 250578, 199199, -124330, 131181, -271803, -78073, 25797, 166582, -101528, -159751, -85660, -266815, -169358, 59633, -138594, 207427, -53269, -175049, 31740, -122003, -49376, -204041, -41875, -342112, 56420, 43618, -521990, -16887, -216168, 94311, -375802, -116547, -87108, 157597, 140984, -129743, -242932, -910, -87283, 230212, -66268, -246187, -209297, -70317, -199473, 52282, 62353, 49048, -303104, 333967, 121380, 42256]
18741F1050A3899J86552a61436B31800C9848a83113j68061a11191B10041a4838
18730B3470b25454R7015f2753k38947B38291b2105o9378A7763f0067p5325A9363
18718A8590a56202C4164c60374a53631j1423j33020G0005a85981B08366b81709
18707c6297A65594b78439i9417M4497B5664a45178O7449A97035o9411a6159p537
18696b3696p492j37740e2874j04993A88572f3118I7447a45510G6109L436J25300
18685B04845o0167G052K00328c25322q093a24283A58768K0160b42341d3117k9950
18674g3067k45857A12990L5158a14177B2685b33316A79995a30345B17245D7261
18663c4703k25734K7954N8915K229j83225i7733A58855O2817H73a80303a210j99601
$$ y = [61050, 13899, 200451, -161436, 231800, 39848, -183113, -351174, -111191, 210041, -14838, 23470, -225454, -128439, -62753, -301700, 238291, -22105, -91483, 17763, -60067, -135392, 19363, 18590, -156202, 34164, -360374, -153631, -165054, -298074, 70005, -185981, 208366, -281709, -36297, 165594, -278439, -99417, -54920, 25664, -145178, -77729, 197035, 127624, -16159, -23696, -31188, -168928, -52874, -157867, 188572, -63118, 97447, -145510, 76109, 79545, 204845, 144678, 7052, 207380, -325322, -333415, -124283, 158768, 178928, -242341, -43117, -73067, -318924, 112990, 148148, -114177, 22685, -233316, 179995, -130345, 217245, 47261, -34703, -260437, -232483, -173568, -171339, -354564, -97733, 158855, 221672, 873, -180303, -1210, -200811]
18651b00811A00021l5232i9048q4566d6612A25098h6715L0411m308l8443m303
18640a03358K5801E3364c08899a10939d7647b2350l67293J74531n9065L4297A29399
18628I3766h9516A55224P851a94118H0080b61190N0715P5011j08118a08638j49038
18617b57676J04845e1600o6538F613J64751K0258b494A8829q688K8354c71249
18605A61740a16596j96975C0863d0490B02519a38463A33228j4950l6327a66112
18594a46493C06073c37639A81659A8333a18897r2393H2230h2082B23811a57027
18583c28865F7199a42063A55319a04683K4587j65507L5848e7264A26676b13280
18572A17695M4492a20287m7963j07670b7007A18670L8036d9845n2327O339G3798
$$ y = [-200811, 100021, 64789, -99048, -183614, -46612, 125098, -86715, -56304, -60612, -99055, -103358, -77557, 53364, -308899, -110939, -47647, -22350, -389643, -215112, -274177, -239880, 129399, 93766, -89516, 155224, 163075, -194118, 80080, -261190, -210475, -135464, -243582, -108638, -257676, -152831, -51600, -118138, 6613, 171364, 191622, -2494, 18829, 10141, 38495, -371249, 161740, -116596, -313571, 30863, -40490, 202519, -138463, 133228, 118278, 81951, -166112, -146493, 306073, -337639, 181659, 18333, -118897, -211290, 82230, -82082, 223811, -157027, -328865, 67199, -142063, 155319, -104683, -80096, -245603, -209755, -57264, 126676, -213280, 117695, 162187, -120287, -168250, -275920, -27007, 118670, 156706, -49845, -102172, -95833, 73798]
18560a48045L5756A44545b2391k58856C42096F6046L4883c037C52587a91800C0202
18548d7280q5774f5031m7836A5718d6549A90041a60510j53955r5672A33841i4743
18536d4385l2312j71416J23375A5869L11188h2399A23693G184L2616a51660B40187
18524a96296k8918A41051b20766B0799b97684J18149d4557k9763J926Q821j5879
18513g9452c3864k3889C9875e810A26414j2058E1321i9512A07094e4909J1903
18502d3006E946J40107a54544O0239B57236A13934b31669f9905o5805j74758Q6842
18491b23626k35989b2010n8942j25568A92704I3034d7851k41615J42680b1428
18480d33950A11183a78105f8251C47047g9492k23793B14276B5904g7257k25979
$$ y = [-148045, -112289, 144545, -22391, -281247, 342096, 66046, 100929, -3037, 352587, -191800, 30202, -47280, -133054, -65031, -112867, 15718, -46549, 190041, -160510, -314465, -410137, 133841, -94743, -44385, -76697, -248113, -124738, 15869, 327057, -82399, 123693, 7184, 39800, -151660, 240187, -196296, -225214, 141051, -220766, 20799, -297684, -179535, -44557, -74320, -72394, -63573, -79452, -33864, -57753, 39875, -5810, 126414, 114356, 51321, -99512, 107094, -54909, -43006, 5946, 146053, -154544, -94305, 257236, 113934, -231669, -69905, -135710, -310468, -223626, -459615, -22010, -80952, -206520, 192704, 93034, -47851, -289466, -146786, -21428, -433950, 111183, -178105, -68251, 347047, -79492, -303285, 214276, 25904, -77257, -303236]
18470c03236J34977D7550b33484d6856A21024C0660g2159j01282b3435j38297
18460a61732I5280a24502A50424i9628o7235d9181j51922A61642g3184q9196A1668
18448b21541D8696a85348E6543a75737A27595a99481a8624j38994n7666L7900
18438a77384A73392N561k0604G3843a97244b3383o1249k49264B0736i080r5536
18427a04616b8219f664m0934E0040a97328g276r681a442j18852C833O2748B1379
18414d31965b0573j58270e9236q0747r8420N2621I1690b87190N7700A93656a2692
18402H9684a5145k4904A33102F2622f1053K2450k38097J03009L6340K4333p4203
18391a87221j12461H3919j5182K84017h3220h167A94633a64026C43562A8917f3873
$$ y = [-303236, -168259, 47550, -233484, -46856, 121024, 30660, -72159, -173441, -23435, -161732, 95280, -124502, 150424, -99628, -166863, -49181, -201103, 161642, -73184, -162380, 11668, -221541, 48696, -185348, 56543, -175737, 127595, -199481, -18624, -157618, -215284, -177384, 173392, 178953, 158349, 73843, -197244, -23383, -84632, -333896, 20736, -9080, -104616, -28219, -6664, -47598, 50040, -197328, -7276, -16957, -1442, -120294, 3833, 66581, 21379, -431965, -20573, -178843, -59236, -139983, -238403, -185782, 91690, -287190, -229490, 193656, -12692, 89684, -15145, -40049, 133102, 62622, -61053, -38603, -276700, -173691, -137351, -113018, -187221, -299682, 83919, 68737, 352754, -83220, -8167, 194633, -164026, 343562, 18917, -63873]
18379a94510Q2268a7893m21151g2753A48705d17159b930A1639K47141a30815D9044
18367C99855g4034E0368b87141B73867H753a93596G1821d0563A25121a61850g5371
18355g4516A04381e8602K4174A0721e436j5699B79319o0415f4225B40902b09572
18343a77100P5868j888A7337N4974b49750e5576Q403Q753r6590N3685l6786G1504
18330B23434c25629N3989e1419K0313n6488A01184a22752A98442l6612E4723I987
18318A25943a33228J655B30301H3971e42237i5636R371A01114J05960c8043k40585
18307b78628c1642E970a04615o6037d2645A19848a48040A65184c32362J45648
18297a86714N3111F2290M2753e4992k5801j28396B22258a02899c5648l2428o7706
$$ y = [-194510, -112242, -17893, -439044, -72753, 148705, -417159, -2930, 11639, 258780, -130815, 49044, 399855, -74034, 50368, -287141, 273867, 8753, -193596, 71821, -40563, 125121, -161850, -75371, -74516, 104381, -58602, -34428, 10721, -5436, -21135, 279319, 218904, -64225, 240902, -209572, -177100, -101232, -103120, 17337, 72311, -249750, -55576, -47173, -38420, -135010, -81325, -118111, 71504, 223434, -325629, -271640, -51419, -31106, -87594, 101184, -122752, 198442, 161830, 54723, 9987, 125943, -133228, -131573, 230301, 83971, -542237, -95636, -86265, 101114, 207074, -38043, -278628, -31642, 5970, -104615, -170652, -42645, 119848, -148040, 165184, -332362, -186714, -133603, 62290, 105043, -54992, -80793, -209189, 222258, -102899, -35648, -68076, -135782]
18286a35782D10662j29276a6025A93286c59340A88828a97439d8322j70037J03701
18276a14658L3758j57521R3227A62455a35311j76000h2677m4430A81476H9687
18265I200L772L1333a16525F415J04243e6776a5486J034C11851A54719Q7273q6696
18253A55296b16784H0934J40125l7115f8846L549A52880o4755a56929K9697E3364
18241B08705a4799C5039L02114j23960C0471K55860a52360o7087e5360B09083
18230a8409A6784P4905A1417N215Q9601b53773j94565B66347C1885a61058A55241
18218G2107K67300g9847G768e8114l21091a18915L8881C8954a05727A78616R5847
18207B74463b99382a5944D8862m938K2648a19099H5165g8743B18250M9640D9443
$$ y = [-135782, 410662, 281386, -16025, 193286, -359340, 188828, -197439, -48322, -218359, -114658, -80900, -238421, -145194, 162455, -135311, -311311, -82677, -127107, 181476, 89687, 9200, 12972, 44305, -116525, 6415, 110658, -56776, -15486, -14452, 311851, 154719, 241992, 155296, -216784, 80934, 221059, 183944, -68846, -65297, 152880, 88125, -156929, -127232, 53364, 208705, -14799, 35039, 337153, 213193, 30471, 286331, -152360, -219447, -55360, 209083, -18409, 16784, 91689, 11417, 16632, 106233, -253773, -448338, 266347, 31885, -161058, 155241, 72107, 339407, -79847, 7768, -58114, -379205, -118915, -80034, 38954, -105727, 178616, 274463, -299382, -15944, 48862, 43924, 66572, -119099, 85165, -78743, 218250, 267890, 49443]
18195C3042J89161If9197l7654A9976h9813j1933d987B05943a64411A37899c7777
18182c1884m5066a2877A19828h6896k01606e8551A1147J39639J18353g5920A01031
18170d51847O4871J93367G8195l5835P9738e3833j57759I802d8548o2449d7634
18158A50018j701a40969A75749a37290A57872J61702b5565o6942A30274C3415
18147a496A23522K22954a89067A59309a13053M0197j62823g4606F0553L8824c06696
18135A3934J05218b4058C06310a25775j25313H0572M6272b47443e3890H707J9751
18124B8458b23462j05387a50759L4521b4668I040J25804c14250J33220A8854L2388
18113E1242a55936A3849a44316A26607b35640C4520J15447b27146b8605A05834
$$ y = [33042, 222203, 9, -69197, -106851, 19976, -89813, -101746, -4987, 205943, -164411, 137899, -37777, -31884, -76950, -12877, 119828, -86896, -288502, -58551, 11147, 150786, 269139, -75920, 101031, -451847, -386976, -193609, 78195, 42360, 122098, -53833, -211592, 9802, -48548, -110997, -47634, 150018, 148317, -140969, 175749, -137290, 157872, 319574, -25565, -92507, 130274, 33415, -1496, 123522, 346476, -189067, 159309, -113053, -72856, -235679, -74606, 60553, 99377, -306696, 13934, 119152, -24058, 306310, -125775, -251088, 80572, 126844, -247443, -53890, 8707, 28458, -223462, -328849, -150759, -116238, -24668, 9040, 134844, -314250, -181030, 18854, 51242, -155936, 13849, -144316, 126607, -235640, 34520, 149967, -227146, -28605, 105834]
18102I2857b52126o6692a8879n5103B74710a0894I2052R2337Q082H5954b48156
18090b88686e7326j75838A24775k1718b1116B01921b82466C00522g6817J5647
18080f1170r2920j72254C2938i4023b2983C0165a79016A42269f07123e6887j63130
18069b20017j32457a10791F1391J1848M9272n2778a50989j91279i8504c002A26770
18057A0981b63826h9870d065l0823A89409a5653k91135Q6240B11658a79217a955
18045g7701D26243I3285q687d5727B19570B8820j3632a01556A82011B3585f0008
18033a43732q9795B54418a12346B1970c83304J55204B51161N9537L1523E3333
18022a57473o4181i4630G3959M446O5622a13986j8809B4511b41112g7622B2904
$$ y = [92857, -252126, -318818, -18879, -73982, 274710, -10894, 92052, 184389, 192471, 85954, -248156, -288686, -57326, -233164, 124775, 103057, -21116, 201921, -282466, 300522, -76817, -61170, -154090, -326344, 32938, -94023, -22983, 30165, -179016, 142269, -607123, -56887, -220017, -352474, -110791, 61391, 73239, 122511, 69733, -150989, -342268, -98504, -3002, 126770, 10981, -263826, -89870, -4065, -34888, 189409, -15653, -306788, -220548, 211658, -179217, -1955, -77701, 426243, 93285, 84598, -45727, 219570, 28820, 15188, -101556, 182011, 23585, -60008, -143732, -233527, 254418, -112346, 21970, -383304, -228100, 251161, 310698, 342221, 53333, -157473, -221654, -94630, 73959, 78405, 144027, -113986, -132795, 24511, -241112, -77622, 22904]
18010A10593b1998A43522a42881L4637C17058F0675L6609j5561k5665M4852K72335
17999C73245A19307b8971j18897E25052k45984a9898r8240p0327Q6679A3979g6212
17987H101j713J3277A734N9021J72301K20523G0227L28546f9321I6506a36852
17975B4294h6037k7509F2841a9148G6077J2579R9251h229A2638a23997C19237
17963E0894K31383a39684r0518A4720b9878k2393A2730J70040J02099c45260a01837
17951b61458A34528J51236c41680f3734q5327B06144b5188j45264I8814e7781
17940c35354h4805j74715F9600K91648j27960F6470l2477j476L0978f4077K3543
17929d0534o6082r3802A21646a04264B3762J94530M7722A00783a64090k5226B82517
$$ y = [110593, -21998, 143522, -142881, -108244, 317058, 60675, 97284, 81723, 56058, 100910, 373245, 119307, -28971, -147868, 525052, 279068, -19898, -118138, -188465, -101786, 13979, -76212, 8101, 6388, 19665, 1734, 60755, 233056, 453579, 70227, 398773, -69321, 96506, -136852, 24294, -86037, -113546, 62841, -19148, 76077, 88656, 187907, -8229, 12638, -123997, 319237, 50894, 282277, -139684, -230202, 14720, -29878, -52271, 12730, 182770, 284869, -345260, -101837, -261458, 134528, 285764, -341680, -63734, -149061, 206144, -25188, -170452, 98814, -57781, -335354, -84805, -259520, 69600, 361248, 233288, 66470, 33993, 32517, 63495, -64077, -40534, -106616, -200418, 121646, -104264, 23762, 218292, 266014, 100783, -164090, -189316, 282517]
17917a90591C1174a89897M6765b1809C22083I5930b22917c6248p9340c6522r0565
17906a27087n8531C5273N08396A30658b02716a7687p9181j44577C36757b62961
17895e9043k61661A79152f744H3008J67553g1367j57844c4923k0870m7069B09592
17883f4095B77260I8873b23019a11317L2912A85576a04053B71533G4916B7105
17872C39469A7174N1902e03129a05712A83052L3620k20C1794K13754k8909m060
17861B12579A8321K09275G8120k2449a7332D4238P3846c6784j56962I0231J39288
17850B29519a75447e7356o840k81581A99195h161m6767k10408a9384B52435H0362
17838e8088l97578E6239J46713n1693b88254g0620p8318A29959P113F8396d4132
$$ y = [-190591, 31174, -189897, -143132, -21809, 322083, 95930, -222917, -36248, -115588, -36522, -127087, -185618, 35273, 543669, 130658, -202716, -17687, -96868, -241445, 336757, -262961, -59043, -320704, 179152, -6744, 83008, 250561, -71367, -229211, -34923, -55793, -102862, 209592, -64095, 277260, 98873, -223019, -111317, -78405, 185576, -104053, 271533, 74916, 27105, 339469, 17174, 69076, -503129, -105712, 183052, 216672, 216452, 31794, 245548, 216639, 212579, 18321, 227596, 78120, 55671, -17332, 44238, 118084, -36784, -193746, 90231, 229519, -175447, -57356, -64196, -345777, 199195, -8161, -54928, -265336, -19384, 252435, 80362, -58088, -455666, 56239, 202952, 151259, -288254, -70620, -148938, 129959, 137072, 68396, -44132]
17826I9488L34199j00904A48967O7537J33948A44854f8344a6425n1741A26976
17815B49496G1205b57519D30403B2200K77360J30576b7065q427D06292F8620F522
17803a30089j45198a23497B37908A9987K2529d5351k2158G9887A6891O7889J13147
17792A97927a71805L0145E1519K69728a09576j05754C12078a49737M3240a380
17781a4665A59620o2195b05974B11823o9836J55519G4664c31937i0274j26431
17771b16705D9307N7505D5891L83930H4908J84140a43142E6411a36279A09766
17760f5575D72299c03917E5091Q3809K21324a06080B95186a51448A82253D4871
17749a68766F6305f1968Q682k8356J7218I4216P5339B0123b38148g8556a7630
$$ y = [99488, 433687, 332783, 148967, 216504, 350452, 144854, -68344, -16425, -68166, 126976, 249496, 71205, -257519, 430403, 22200, 299560, 430136, -27065, -35492, 406292, 68620, 6522, -130089, -275287, -123497, 237908, 19987, 42516, -45351, -67509, 79887, 16891, 84780, 197927, -171805, -141660, 51519, 321247, -109576, -215330, 312078, -149737, -106497, -1380, -14665, 159620, 97425, -205974, 211823, 141987, 297506, 74664, -331937, -90274, -216705, 49307, 106812, 45891, 429821, 84908, 269048, -143142, 56411, -136279, 109766, -65575, 472299, -303917, 55091, 138900, 360224, -106080, 295186, -151448, 182253, 44871, -168766, 66305, -61968, -53286, -81642, -64424, 94216, 169555, 20123, -238148, -78556, -17630]
17737A97643K5859K08151j04759q3228p8047N100B4490g2944G351g4886k18062
17726b92948A89500a35932B8321J96267c16203f8315a1103C1788A0665J93441
17716B04106f7137B98688h6468A38354a2201k2908H7014c5900B22184D0525c112
17704H6552D0792J10891a49509B52575M7101h4670B72473I6192d9607k6248l29418
17693d05273a39032A84654l1016b53286B34894B7236L13681e1747r9484A20829
17682B28827j6331J45162F5881b46626B20214b29393A09497l0752a4453k27716
17672b42169A18778M4876g6183B20596O7317A35324R074e783E5206a11199C03682
17660C0610K40161h1125K7500A02750A1176f4955B69475j17376F8103J54413A02391
$$ y = [197643, 223502, 431653, 326894, 243666, 165619, 170719, 24490, -72944, 7351, -74886, -292948, 189500, -135932, 28321, 224588, -316203, -68315, -11103, 31788, 10665, 204106, -67137, 298688, -86468, 138354, -12201, -35109, 87014, -35900, 222184, 40525, -3112, 86552, 40792, 151683, -149509, 252575, 299676, -84670, 272473, 96192, -49607, -75855, -405273, -139032, 184654, 153638, -253286, 234894, 27236, 340917, -51747, -151231, 120829, 228827, 212496, 357658, 65881, -246626, 220214, -229393, 109497, 78745, -14453, -242169, 118778, 163654, -76183, 220596, 287913, 135324, 144398, -5783, 55206, -111199, 303682, 30610, 270771, -81125, -53625, 102750, 11176, -64955, 269475, 152099, 68103, 222516, 102391]
17648A49473a04828p3808H6519K28987H1833b68797G4412K02739A5226L89050
17638D04276j63954E623M47100g3018H3670f9742B62583B9309K58485D2001a07518
17626H969L8598K57065A28178b99347J47538B62487n2095G2275i3863j06648B59570
17614D21889A73085h2731A44057f308C90470j81017B8593R4002B0284K0491a11707
17602B25188j7953c773B49723n3796M4432J74326o9329b48317C33453A27143Q4163
17591B11306p2676N3388C0869N3092e9858B5086L0023J8831i4058H1628c0157
17579A41736J26383p1641G0976L33287A12870Q0531o6844k1964a71437A06496
17568b39748A76417O2259o9757G4256Q3379j4787l362C9051b94249A46204i2523
$$ y = [149473, -104828, -178636, 86519, 315506, 81833, -268797, 74412, 277151, 15226, 404276, 240322, 5623, 452723, -73018, 83670, -69742, 262583, 29309, 287794, 42001, -107518, 8969, 47567, 304632, 128178, -299347, -151809, 262487, 210392, 72275, -93863, -200511, 259570, 421889, 173085, -82731, 144057, -6308, 390470, 209453, 28593, 122595, 20284, 40775, -111707, 225188, 207235, -3773, 249723, 195927, 240359, 414685, 345356, -248317, 333453, 127143, 211306, 138630, 192018, 30869, 83961, -59858, 25086, 55109, 73940, -94058, 81628, -30157, 141736, 268119, 196478, 70976, 404263, 112870, 193401, 126557, 104593, -171437, 106496, -239748, 176417, 238676, 168919, 74256, 157635, 142848, 139486, 39051, -294249, 146204, -92523]
17556C13355A21238c8516A7093M674J71914p684K92002A46253J05388q2999C3565
17544I2000L4273O6504b4982D55039f8389B80489j11533J13137D9460N82774B68575
17532B00347h370A64360k4219L0921p3798J94200r22P164a79441A22716a05289
17520c811B99681i6171C98858E7933a7238A79732M38681j16698j27064K15086
17510E89737L4871K29839m4277j1263l26640J72015j30709K8574j68013q5642
17500B88492K91146p0129j26344L22981B54613K5687O28674l01234K48976j43016
17490G13700q5581p0008N0523B80411j04458A3957Q4819J82357J30070l9713j2097
17479C59393c3342D03946G2356M59015A05220L04624j9211A60332M32725B17615
$$ y = [313355, 121238, -38516, 17093, 21767, 193681, 185997, 477999, 146253, 251641, 168642, 33565, 92000, 126273, 192777, -24982, 455039, -68389, 280489, 168956, 282093, 49460, 632234, 268575, 200347, -8370, 164360, 140141, 171062, 97264, 291464, 290542, 297706, -179441, 122716, -105289, -3811, 299681, -96171, 398858, 57933, -17238, 179732, 618413, 501715, 374651, 589737, 624608, 854447, 810170, 798907, 472267, 644282, 513573, 542147, 374134, 288492, 579638, 509509, 383165, 706146, 254613, 280300, 908974, 607740, 856716, 713700, 628119, 558111, 608634, 280411, 175953, 13957, 98776, 281133, 411203, 371490, 359393, -33342, 403946, 72356, 531371, 105220, 409844, 390633, 160332, 593057, 217615]
17468B07236p8265J55558K21730A90078q6799K19301A08825a49598C96810G6925
17457d3182D54765o1499h669B32336J31982j79709J62924H2726l552J70482o7857
17446A81799J37697a063A26291a37917B88288J11011c0387A78916O190K22256
17436D07362H362K35583n3494K45214A56300L81496J5400k74688j9528J31052
17426C90032A54122J52703j11572m4327K6595q0242M14171k40445N7883J73421
17416E02309C9540L51664p7266o1597j22914L85329A26528J88168l7163K01962
17406D79495j48656j05854J8909g0137n067C46714J53551m4609j16783M8030A77704
17394B45806K17594A61186M34521B32140K02800j06266O9290D7958J64409K64832
$$ y = [207236, 128971, 284529, 506259, 190078, 103279, 322580, 108825, -149598, 396810, 76925, -43182, 454765, 393266, -8669, 232336, 364318, 184609, 347533, 82726, 79174, 249656, 181799, 319496, -1063, 126291, -137917, 288288, 399299, -30387, 178916, 185106, 407362, 8362, 243945, 190451, 435665, 156300, 537796, 553196, 278508, 258980, 390032, 154122, 306825, 195253, 150926, 177521, 97279, 511450, 271005, 328888, 502309, 39540, 391204, 313938, 252341, 129427, 514756, 126528, 314696, 277533, 479495, 330839, 224985, 243894, -70137, -75204, 346714, 500265, 455656, 338873, 386903, 177704, 245806, 463400, 161186, 595707, 232140, 434940, 328674, 397964, 47958, 212367, 477199]
17384D77199F6970J23273M1486K23797k25569J92637k00713f0905D3995P8833
17374A22828a35318B01161K11651I2938N8378o9199L29922B7872K52973J87761
17364D68606j72566D6068M54031k35114r4160J53172n2269O1355K35225B33837
17353C08749a80336j5029C62626J98074I8725K49435q4779R1184h6324B34930
17342F6868J71950O6945d663B53468p9337M04331j58301p3106J53420A29757K69948
17331C99705j26859b5319C68670a44880A42396J40331F3467K65266H4783J11957
17321A96740D5642Q0607J18563C9038K09028M7673a11200A76682Q0687g464C75209
17309A26423M27638B22403K6963p0452H6437J28160d2530A48061N27367B40298
$$ y = [477199, 66970, 190243, 231729, 455526, 229957, 422594, 221881, -60905, 43995, 122828, -135318, 201161, 412812, 92938, 151316, 82117, 412039, 27872, 280845, 468606, 296040, 46068, 500099, 264985, 170825, 323997, 271728, 333083, 568308, 233837, 308749, -180336, -195365, 362626, 560700, 98725, 348160, 263381, 354565, -86324, 234930, 66868, 238818, 305763, -4663, 253468, 174131, 578462, 420161, 347055, 500475, 129757, 399705, 272846, -25319, 368670, -144880, 142396, 282727, 63467, 328733, 84783, 196740, 45642, 126249, 244812, 39038, 248066, 295739, -111200, 176682, 257369, -7464, 375209, 126423, 554061, 222403, 249366, 178914, 86437, 214597, -42530, 148061, 675428, 240298]
17298C67827F9145K47813j46059i9705C46481j23293h9474A91992n8500J03879
17288B37371B6313J05353R096K22930p5521k9637J77091N2793a6098E99863k93887
17277C05976J84162j41915j22078a39433C04479a12397E26380k23300q3119l035
17267B16926J64618K5021l9334A74937P1251n796m1937L16615B15103M5354p2729
17256A87728N7959K32910K4753j5988p5639j09431A31162C9490O39843B53185
17245B57572l3489m4613K43323J11179B52984Q4564O4491n0792J66861K2037j94581
17234C45564H3681J57186J22327J22225K12732C07111J76567K9438O9272k65530
17224C16858q2903j16337J755L4588j7404K47866H4711K04534l7176c4374B68568
$$ y = [367827, 69145, 316958, 170899, -99705, 346481, 223188, -89474, 191992, 133492, 237371, 26313, 131666, 140762, 363692, 288171, 258534, 435625, 488418, -16098, 599863, 305976, 490138, 348223, 226145, -139433, 304479, -112397, 526380, 303080, 219961, 216926, 381544, 406565, 367231, 174937, 246188, 240392, 198455, 515070, 215103, 260457, 187728, 245687, 478597, 503350, 487362, 411723, 302292, 131162, 39490, 679333, 253185, 257572, 224083, 179470, 422793, 533972, 252984, 337548, 402039, 351247, 518108, 540145, 345564, 83681, 240867, 363194, 485419, 698151, 307111, 483678, 513116, 582388, 316858, 233955, 117618, 119373, 153961, 136557, 384423, 84711, 289245, 252069, -34374, 268568]
17212C5688O4863K04077D5084J727K25711L82226J0852A58446L77296k19734R9940
17201D15948j22034E9496M52349k08630K08120A49452N00992j99039k09428L83794
17191F25771A94328J47583L6004J40795k26998M3255J2608R2922q1258J7439L35177
17180G11855l22544D8755K49954k5971K9793Q899j48822J6338N75230A90131J95370
17169C85501j07558m794L95722c315B64612j2482j16367K69718Q96O6162p3006
17158C99533A76231K93052j42966r1023K55720k34033K7320J89260H3340L32634
17148D15974q7759L13717L008N2210A08704J47337M44443q6862k30860K35982
17138F18744J18006K8003r6634j88364J20832J72904k87515k29089L26199j60398
$$ y = [35688, 100551, 304628, 45084, 46811, 272522, 654748, 665600, 158446, 535742, 316008, 415948, 293914, 59496, 511845, 303215, 511335, 149452, 650444, 451405, 241977, 625771, 194328, 341911, 377915, 518710, 291712, 334967, 347575, 440497, 359239, 376678, 711855, 389311, 48755, 298709, 272738, 302531, 311430, 162608, 178946, 754176, 190131, 385501, 277943, 273149, 668871, -3315, 264612, 252130, 135763, 405481, 406377, 472539, 399533, 176231, 469283, 326317, 235294, 491014, 256981, 284301, 473561, 83340, 415974, 328215, 641932, 644940, 697150, 108704, 256041, 700484, 613622, 382762, 618744, 736750, 764753, 668119, 479755, 600587, 773491, 485976, 256887, 583086, 422688]
17128D22688J3136K09367B43254J30145M02849j50105j03430B14021K26848o041
17118D34828l1197K12520k61473K42385k39504J60886j80940L58486k39175Q1290
17108E38106j20929j116J46016J15295k97048A25751M83042k82701J45627j77254
17098B94465J27641r1554K37302k10900L67503j35754N020K8155J03544j65589
17088E59833J24625j01842J60706K11746D35287J93983A91164L61342M02955j09241
17078H46220j74863J09983l59254L08248j23071J62151k35402J55220K1650N4977
17068G65859k17881K25219n8019k77284K28169L6073k582o8283j9916L828k24265
17057C90918N04017l38963Q9761J73671p5780L32085C50732M78893k89145L15720
$$ y = [422688, 435824, 645191, 243254, 373399, 776248, 626143, 522713, 214021, 440869, 434828, 403631, 616151, 354678, 597063, 357559, 518445, 337505, 695991, 456816, 538106, 417177, 416061, 562077, 677372, 380324, 125751, 608793, 326092, 471719, 294465, 422106, 330552, 567854, 356954, 724457, 588703, 593723, 621878, 725422, 559833, 684458, 582616, 743322, 955068, 435287, 629270, 191164, 552506, 955461, 846220, 671357, 781340, 422086, 730334, 607263, 769414, 534012, 689232, 710882, 765859, 547978, 773197, 715178, 437894, 666063, 702136, 699554, 631271, 611355, 615183, 390918, 894935, 555972, 645733, 819404, 743624, 1075709, 350732, 829625, 540480, 856200]
17047H56200j22443o7913K5567k55346L52394N9237Q3337j90944j6067k62270
17037D61752L15121j06932Q4523j35981L99074k32391K3715j41371K73407m40242
17027E00675M83501k45956R5076K79172j34560k35743l9111J96113p6445o8433
17017G54289K95632J5660m49988L79167J21324l78125J68061p442j13850M4716
17007H29444L90860l14379R4126p3866J23347j14013j33148J58825L6352J60790
16997A158338j82518k5630k3864J97541j79149N9703L1524j3810N4643k29418
16987H47360L76388K31216l49857k7862J08120k22650L5189J03786M6326K31741
16977A379757k62814J87581l33268L8471N2746k5034K4890K35863j31863l4355
$$ y = [856200, 733757, 665844, 691411, 436065, 788459, 847696, 931033, 740089, 724022, 461752, 776873, 669941, 754464, 618483, 1017557, 785166, 808881, 667510, 940917, 500675, 984176, 738220, 833296, 1112468, 977908, 742165, 703054, 899167, 822722, 754289, 1049921, 1065581, 615593, 994760, 1116084, 737959, 906020, 898578, 784728, 829444, 1220304, 905925, 1000051, 926185, 1049532, 935519, 802371, 961196, 997548, 1158338, 975820, 950190, 926326, 1123867, 944718, 1004421, 1035945, 1022135, 1076778, 847360, 1223748, 1454964, 1105107, 1077245, 1185365, 962715, 997904, 1101690, 1148016, 1379757, 1116943, 1304524, 971256, 1009727, 1062473, 1037439, 1062329, 1298192, 1166329, 1131974]
16967A131974j7053K02652K58367m56580K45586k99341J88136J10315k23819J14898
16957A255135P3879q2206J25910k63062K52975k76226L04083j1011O132M9132
16947A434741K95420l63975o2958Q1012K39318k72030O9526N2016K9168R8389
16937A600627q0308k33206K82221J25929k56135J42180K76284l3959r9484K60146
16927A984295n80395M84113k23593J04703L15581k50120k34513J92034J2930M1962
16917A846997K09900n677m94381L26078J08519l7925j42208j06798N87215k31470
16907B060250J07879k7948k54206J58998J31445M3775J73980m13183L15196l39999
16897A956187L35111j78135J0420K11011l20018P05923k68671k26269L72473j84831
$$ y = [1131974, 1114921, 1317573, 1575940, 1119360, 1364946, 1065605, 1253741, 1364056, 1140237, 1255135, 1329014, 1246808, 1372718, 1109656, 1362631, 1086405, 1390488, 1379477, 1385609, 1434741, 1730161, 1366186, 1303228, 1384240, 1623558, 1351528, 1421054, 1473070, 1502238, 1600627, 1520319, 1287113, 1569334, 1695263, 1439128, 1581308, 1857592, 1823633, 1724149, 1984295, 1403900, 1888013, 1664420, 1769123, 2084704, 1834584, 1600071, 1792105, 1805035, 1846997, 2056897, 2051220, 1556839, 1882917, 1991436, 1953511, 1811303, 1704505, 2291720, 2060250, 2168129, 2140181, 1885975, 2044973, 2176418, 2220193, 2394173, 1980990, 2296186, 1956187, 2291298, 2113163, 2123583, 2334594, 2014576, 2720499, 2451828, 2225559, 2598032, 2413201]
16887B413201J16151L57664j81722k72211J13490J90062p0961L12344j72846j34217
16877B670955K60386l7963m43277M12721Q049l63366L61899j32046L00666k91587
16867B746437M52621N3952L5728j77738J97865r0196j43148K91374j16706N84427
16857C834616l02606K19740q2059n4029J7608J96418j3583R367J51391k84762
16847C692101L42976j92644L64751K36948m8646k20801L50499j85447p4461L77051
16837D642327k0965K56971j42475J91112j73032K69553M6439K56937m15790O40472
16827E551549j87533J00143r511k12071P20560j67559L1574J18131O9591L77022
16817F391896k87547N209N07505L23859J51397j25002q2071L14077k11726L62161
$$ y = [2413201, 2529352, 2887016, 2705294, 2433083, 2546573, 2736635, 2665674, 2978018, 2805172, 2670955, 2931341, 2893378, 2450101, 2862822, 2870871, 2507505, 2869404, 2737358, 3038024, 2746437, 3199058, 3253010, 3288738, 3111000, 3308865, 3218669, 3075521, 3366895, 3250189, 3834616, 3532010, 3751750, 3669691, 3615662, 3633270, 3829688, 3816105, 3825472, 3976863, 3692101, 4035077, 3842433, 4207184, 4444132, 4395486, 4174685, 4525184, 4339737, 4265276, 4642327, 4621362, 4878333, 4735858, 4926970, 4753938, 5023491, 5069930, 5326867, 4911077, 5551549, 5364016, 5464159, 5454648, 5242577, 5963137, 5795578, 5827152, 5945283, 6014874, 6391896, 6104349, 6109558, 6617063, 6940922, 7092319, 6967317, 6885246, 7199323, 6987597, 7349758]
16807G349758N31812J15251K58228k53001J81512K64143N5188J49138M77994r951
16797I120072K84292K20139k25308M72652K07280K25276J42243N77952k55603
16788A0768995O39587l0503N77552Q7120K74572K70494N65031M5710K95477M03487
16778A3897522L31368L10145N01808N99400K76889p4030Q12240K54054R29923
16769A7839319L33612N64891M39386N81834O14252O58567J67916Q92796R47976
16760B3040549Q90665M04304J229369L69492J162638O96268J001869R27706J045111
16751C0767971J370819J176855J202193Q34148J275928J640230J670862J294465
16743D1233471J481744J622975J884430K063670J958563K233844K068835K104006
$$ y = [7349758, 7881570, 7996821, 8255049, 8002048, 8183560, 8447703, 8502891, 8652029, 9130023, 9120072, 9404364, 9624503, 9399195, 9871847, 10079127, 10304403, 10446646, 11024598, 10768995, 11408582, 11378079, 11955631, 12042751, 12317323, 12587817, 13152848, 13198558, 13494035, 13897522, 14228890, 14539035, 15040843, 15640243, 15917132, 15843102, 16655342, 16909396, 17839319, 18172931, 18737822, 19177208, 19759042, 20373294, 21031861, 21199777, 22092573, 23040549, 23931214, 24335518, 25564887, 25934379, 27097017, 27793285, 28795154, 29722860, 30767971, 32138790, 33315645, 34517838, 35351986, 36627914, 38268144, 39939006, 41233471, 42715215, 44338190, 46222620, 48286290, 50244853, 52478697, 54547532, 56651538]
16735E6651538K545124K721274K527605K405634L136894L094184L117098L157646
16727G9356997L258582L705267L627959L805009L922951L595201M168203L648801
16719A09088970L775310M149903L654578L922961L637603K983074L104981K582971
16711A36900351K599980K007320J305218J223264Q57429O41260l73895j072653
16703A44088274j577676j650447j939889k547249k882560l010646l887115l220391
16695A23372301l612530l862472m068958m176503l874675l974507m110026l398384
16687I2294246m170628l440141l507120l499583l140951l318630k893633k590804
16679F5732756l257225k670386k166600k463763k483055j920205k225722j657120
$$ y = [56651538, 59196662, 61917936, 64445541, 66851175, 69988069, 73082253, 76199351, 79356997, 82615579, 86320846, 89948805, 93753814, 97676765, 101271966, 105440169, 109088970, 112864280, 117014183, 120668761, 124591722, 128229325, 131212399, 134317380, 136900351, 139500331, 141507651, 142812869, 144036133, 144893562, 145534822, 145160927, 144088274, 142510598, 140860151, 138920262, 136373013, 133490453, 130479807, 126592692, 123372301, 119759771, 115897299, 111828341, 107651838, 103777163, 99802656, 95692630, 92294246, 88123618, 84683477, 81176357, 77676774, 74535823, 71217193, 68323560, 65732756, 62475531, 59805145, 57638545, 55174782, 52691727, 50771522, 48545800, 46888680]
16671D6888680k469681j303943j644338j719085j416480j644593j235334j377011
16663C4078215j381842r78005j389703q08401q80267r07269j061886j166389p71139
16654B4733314r70666m81920o17467r60341m94545o69655p00293n08238q02510
16645A8527679j62208p69620q02582L6616l63972o01975m05088n81733n94078
16636A4283039N8464o20445k20559l97402m75646r3094l71486l46246k38846r1351
16626A1486428q30488k4162L6680j10177k37670k52170m27190k42612j24730m0168
16616I233741l34804k15568j405l10419l71571L32068o34352J41635m14906R8003
16606G522422l99939K84089l90580m32904M18696m43332k3585J31300n15096j90561
$$ y = [46888680, 44418999, 43115056, 41470718, 39751633, 38335153, 36690560, 35455226, 34078215, 32696373, 31718368, 30328665, 29520264, 28639997, 27732728, 26670842, 25504453, 24733314, 23762648, 23280728, 22663261, 21702920, 21208375, 20538720, 19838427, 19330189, 18527679, 18365471, 17595851, 16793269, 16829885, 16465913, 15863938, 15458850, 14877117, 14283039, 14341503, 13721058, 13500499, 13103097, 12627451, 12534357, 12162871, 11816625, 11577779, 11486428, 10655940, 10631778, 10668458, 10558281, 10320611, 10068441, 9641251, 9398639, 9273909, 9233741, 8898937, 8683369, 8681964, 8371545, 7999974, 8332042, 7697690, 7839325, 7424419, 7522422, 7122483, 7406572, 7015992, 6583088, 7001784, 6558452, 6534867, 6666167, 6151071, 5960510]
16596E960510l12944L88324m02213L8270K4006k54458N1125l02728l04227M2823
16586D928488n3269J03460k08553J38826j07206N5982m15671L72103m40171j1410
16576D362579r7688p7299j88696L5733J15745l67482J5824M13328m17741j1005
16566C783298J00426j29506P2925k41740M065L9784j43797k3169N351K57036n74978
16555C149695J05183J17375k70839l77743N53548l54741J97522j74504p8788n0344
16545B816364O3115j91942J88497J85503m94315J38591L132k30881j37081j87689
16535B153294M30861J60304k96430m38021N96846k95517J01166m7499k24236M158
16525B144926n5939K25614J87045l11313L2080l64667L90337k00566N1149J03753
$$ y = [5960510, 5647566, 6035890, 5633677, 5671947, 5695953, 5441495, 5492620, 5189892, 4885665, 4928488, 4875219, 4978679, 4770126, 4908952, 4801746, 4857728, 4442057, 4814160, 4373989, 4362579, 4264891, 4187592, 3998896, 4034629, 4150374, 3782892, 3798716, 4212044, 3794303, 3783298, 3883724, 3754218, 3827143, 3585403, 3589468, 3629252, 3485455, 3462286, 3467637, 3724673, 3149695, 3254878, 3372253, 3101414, 2723671, 3277219, 2922478, 3120000, 2945496, 2866708, 2816364, 2879479, 2687537, 2876034, 3061537, 2567222, 2705813, 2708945, 2478064, 2340983, 2153294, 2584155, 2744459, 2448029, 2010008, 2606854, 2311337, 2412503, 2365004, 2140768, 2144926, 2088987, 2314601, 2501646, 2190333, 2222413, 1857746, 2248083, 2047517, 2098666, 2202419]
16515B202419j74330k3009j55139j26382L85563m82826R5581J1423K59630n6759
16505A936171K2294n7061j62297J09940k05789m7843M82044k94777J96057q3695
16495A895044j07057m63397O50227l88472o3125L26155j87504l87298L07804O8029
16485A650406J3182p4767j60975P9456J90739o3356L6838q012p4527q214k61866
16474A318904O5272m8973J62997k13029J34781j76314j9684L1027L2569J25099
16464A412649j01379j92891L73616j69243j28008L4207p186K02230k02235r5254
16454A126506K43847l5056k8064l64687J71288J16991l72551j3858N75162j97075
16444A222503j88431j15344L3805K52795n0495l9909L7951N2702o5289P2364j55613
$$ y = [2202419, 2028089, 2005080, 1849941, 1723559, 2109122, 1626296, 1721877, 1733300, 1992930, 1936171, 1958465, 1901404, 1739107, 1849047, 1643258, 1595415, 2077459, 1782682, 1978739, 1895044, 1787987, 1324590, 1974817, 1586345, 1523220, 1849375, 1661871, 1274573, 1582377, 1650406, 1663588, 1588821, 1427846, 1507302, 1698041, 1634685, 1671523, 1663511, 1588984, 1580770, 1318904, 1384176, 1335203, 1498200, 1285171, 1419952, 1243638, 1223954, 1254981, 1287550, 1412649, 1311270, 1118379, 1491995, 1322752, 1194744, 1228951, 1221765, 1423995, 1221760, 1126506, 1370353, 1335297, 1307233, 942546, 1113834, 1230825, 858274, 844416, 1419578, 1222503, 1034072, 918728, 952533, 1205328, 1154833, 1114924, 1152875, 1205577, 1140288, 1212652, 1057039]
16433A057039k1638j59559J23368J52964R7853m16523o5135n7938K80082k77489
16423G13024K18734J50318r214p6826N90621k73250F25903L54070j88803K206
16413G93376p197J6822J60646J2021k42445M31787k11038k57692J33753J91782
16403A021815r8025k5167N9360m9420K64971k03621l55436J94209r3833J56441
16393H71294r2655L5172J43203l486k22012p2694q2479L81398j86053L69672E60810
16381H57005k65783K33648B81967N75817k72193L15566C75544K58273J8917J09448
16371G62182r1481j40402O82920m10148k0843q3711q3961K02915j49517J98346
16361H66300k45563j4614p1925L37544j52531L96123E36255K30251k38969q2706
$$ y = [1057039, 1035401, 875842, 999210, 1152174, 1250027, 833504, 768369, 710431, 990513, 713024, 931758, 1082076, 1072862, 996036, 1586657, 1313407, 625903, 979973, 791170, 793376, 786179, 803001, 963647, 975668, 733223, 1165010, 953972, 696280, 830033, 1021815, 923790, 898623, 957983, 908563, 1173534, 969913, 614477, 808686, 714853, 871294, 778639, 813811, 957014, 953528, 731516, 658822, 576343, 957741, 771688, 1141360, 560810, 857005, 591222, 824870, 281967, 857784, 585591, 901157, 375544, 633817, 652734, 762182, 670701, 530299, 1213219, 803071, 782228, 698517, 614556, 817471, 667954, 866300, 620737, 606123, 534198, 871742, 719211, 1115334, 536255, 766506, 527537, 444831]
16351D44831L58749r3890C15420N0105M15680j96117l6516J33001J16054j71050
16341F26577L5635M9844q0055J64171j50708r6402M45956l46401J8555j24872
16331E42300q122j64129M63714j09174o1516j56405K7780J75962l15231J81650
16321E76829o1894j35020o0230J75663j5141K15970p0944B70830J94165L5543
16311E00538m5735L3141N2522k04741o587K83245q3005K21978o5681B33309J34172
16300C67481K08919O2399J9601B46418L71374J5431j9604j7196n2403j09507L39643
16289G74156l24135r9415R6536j13710L94801k51025k08278J09322p6185j25294
16279A76773J06738N96396l85457n3026O4521K90010m7227C16015K69495k28578
$$ y = [444831, 803580, 709690, 315420, 365525, 781205, 585088, 548572, 681573, 797627, 626577, 662212, 712056, 632001, 796172, 645464, 549062, 995018, 648617, 667172, 542300, 534178, 370049, 833763, 724589, 663073, 506668, 534448, 710410, 395179, 576829, 514935, 379915, 319685, 495348, 480207, 696177, 625233, 270830, 464995, 500538, 454803, 487944, 540466, 335725, 329138, 612383, 529378, 751356, 685675, 233309, 367481, 576400, 638799, 658400, 246418, 617792, 633223, 613619, 596423, 544020, 434513, 774156, 450021, 350606, 447142, 333432, 728233, 477208, 268930, 378252, 302067, 176773, 283511, 879907, 494450, 441424, 505945, 795955, 748728, 316015, 585510, 356932]
16269C56932J48750k25256J4442J81453j19373K13197k35388Q0d1575C92082J69802
16258E61884L7775k84899l0863J128L63664B21814K93180L5502k1115k55961P5208
16247C48628K03049k23104r6976L22328j69255m2129L82051l07967A93769O4713
16237B58482q5577n7577L18687j33682A44836J78994O5593j53463J98790q6960
16227C47790J06964J57336j86385J02152q7532j2631J32705j13117m7880K22581
16217F21983A56343L87367k39848p1880J79515L3756j76823q6553J75773P07L83726
16206G42083m4710k02945A80263J39967E9549J08162b8965A63575a15616C30118
16195a32731C84440j10404j00600L91218k28604A30296M8396J27752J47001j36856
$$ y = [356932, 505682, 280426, 294868, 476321, 356948, 570145, 334757, 334837, -41575, 392082, 561884, 599659, 314760, 283897, 285025, 648689, 221814, 514994, 550496, 529381, 273420, 348628, 551677, 328573, 231597, 553925, 384670, 342541, 724592, 416625, 193769, 258482, 172905, 115328, 434015, 300333, 144836, 323830, 389423, 235960, 434750, 347790, 454754, 612090, 425705, 527857, 440325, 427694, 560399, 447282, 399402, 621983, 156343, 543710, 303862, 231982, 411497, 445253, 268430, 181877, 357650, 358357, 742083, 697373, 494428, 180263, 320230, 59549, 167711, -28965, 163575, -115616, 330118, -132731, 384440, 274036, 173436, 564654, 336050, 130296, 178692, 306444, 453445, 316589]
16185C16589P5864j04820K1498J04631I9137C3483a38989B28331K3168G7683A3252
16173D22839j40188G8420b7367A32182R2613o2921k2190J43588M6408e0191G2354
16161A7722K75797K13294o5446A67265K04016j53899A04781M14576A87947P4680
16151B62627L09398A58337J43046p1663q5370J22696J4353H7406j0372B247J71738
16140A73985J18205j06828J82007D9224J42111m4326F8287J67398j1858L0462
16130B54289d4754A27839J30538p0281J70130Q5177a81412B49711H4204a85621
16119C84745D1693J85724q4791C0942B953a6630I8326m5103R365K43722J95612
16108E01922E0118J61047J497C0739P3690E1225F707a26716A17285K62862j50073
$$ y = [316589, 392453, 287633, 309131, 413762, 99137, 33483, -138989, 228331, 251499, 77683, 13252, 422839, 282651, 78420, -27367, 132182, 224795, 161874, 139684, 283272, 329680, -50191, 72354, 17722, 293519, 506813, 441367, 167265, 371281, 217382, 104781, 519357, 187947, 262627, 572025, 158337, 301383, 229720, 144350, 267046, 281399, 87406, 77034, 2247, 173985, 292190, 185362, 367369, 49224, 191335, 147009, 68287, 235685, 223827, 254289, -44754, 127839, 258377, 188096, 358226, 443403, -181412, 249711, 84204, -185621, 384745, 41693, 227417, 142626, 30942, 2953, -16630, 98326, 53223, 62588, 306310, 501922, 50118, 211165, 212662, 30739, 104429, 51225, 6707, -126716, 117285, 380147, 230074]
16097B30074G3652J44812l2169P2006e36254B47982m3150m0855k0861K4853g8059
16085C14208A07373J77091J12430a9998j78719j10049a21181L8299a3702B31365
16074A6019M12815A04530J56336j03675K99719B13811a05461A39659g2909J4445
16064e8464I053f1634A77146c4701O763B9920b49417C19599A06750a22299C66867
16052b98631G4098b03645A82048C2428J45069M2222r8766M2556k5149H497M1213
16041D9710K01574q9745J82052B2895J8819J30796J38583j45098b46956B7562
16030a93058q5363a02182i558A40692a18597A74377a69840H42R6597L29125A54767
16018A0657a6874G0526O6306J86363j17418f1753k33944a25355e7577C5190d91742
$$ y = [230074, 73652, 218464, 186295, 258301, -536254, 247982, 204832, 163977, 143116, 167969, -78059, 314208, 107373, 284464, 396894, -19998, -198717, -308766, -121181, -82882, -13702, 231365, 16019, 428834, 104530, 260866, 157191, 456910, 213811, -105461, 139659, -72909, -58464, 9053, -61634, 177146, -34701, -27938, 29920, -249417, 319599, 106750, -122299, 366867, -298631, 74098, -203645, 182048, 32428, 177497, 219719, 120953, 163509, 138360, 8497, 49710, 251284, 161539, 343591, 22895, 41714, 172510, 311093, 165995, -246956, 27562, -193058, -278421, -102182, -9558, 140692, -118597, 174377, -169840, 842, 97439, 426564, 154767, 10657, -16874, 70526, 136832, 323195, 205777, -61753, -295697, -125355, -57577, 35190, -491742]
16006b12937F1092J35214C6995K40130i9589j30167C03784n6390C0626k278M8157
15995G6505d7088H711J50244J237J59516j37880p2569A2407a82689F0848f2923
15983c9256A04484a4913C0363d5495H8900K15360b6715C64419j9890M7358H0982
15971E85077Q0901K88172k1869k17565j79100L11434B81212J8104i6060c2107
15960i7054K2427C3254a6881I9026p264g7662p3309m3684C18669a64454B45747
15948g1593F4172c14584A95047a44619g122n824A08338j9329b71972A27762P5969
15937B03731f9443k44871a52355k7842A08250a89245D3492L93985a55569D6524
15926a52559o1269k07568A30924h9066q1100B18538K0174k5454A065b53022d8474
$$ y = [-212937, 61092, 196306, 36995, 277125, -99589, -229756, 303784, 247394, 30626, 28348, 76505, -47088, 8711, 158955, 160192, 319708, 181828, 109259, 12407, -182689, 60848, -62923, -39256, 104484, -14913, 30363, -45495, 88900, 304260, -26715, 364419, 344529, 391887, 80982, 585077, 665978, 954150, 932281, 714716, 535616, 847050, 281212, 299316, -96060, -32107, -97054, -74627, 33254, -16881, 99026, 91762, -77662, -150971, -194655, 318669, -164454, 245747, -71593, 64172, -314584, 195047, -144619, -7122, -12946, 108338, 89009, -271972, 127762, 203731, -69443, -314314, -152355, -180197, 108250, -189245, 43492, 437477, -155569, 46524, -152559, -213828, -421396, 130924, -89066, -170166, 218538, 238712, 213258, 1065, -253022, -48474]
15914C24359b56419J00449J323d005p6949B256c12710q5390H465K41664b6455
15902a03268F0557a60859D9874j6386i1223E9151a75130A03685J94806e5063C2172
15890b24583e8182r1538m3927B45928P7502a30001C34497b03577B98768a72749
15879a88923j03850N3690Q3468J3303B5494K23148a23046M7690A32082d8554B36439
15867b50477A9877b24794H6890M8745P6696g248l6583A24068d21500O1329A72747
15855a66845k8934G19L0937O3601a3707j59655B002a28589J3707j31181G4818
15843G8218a92010A17905b62872C99119A79716R8871A2291b89888g7306A10574
15832B70680C2092P4125M06869g4493C14092a79572A69493G2457i2587H4422e4416
$$ y = [324359, -256419, -155970, -154647, -4005, -80954, 2256, -312710, -398100, 8465, 250129, -26455, -103268, 60557, -160859, 49874, 33488, -91223, 59151, -175130, 103685, 298491, -55063, 32172, -224583, -58182, -149720, -193647, 245928, 323430, -130001, 334497, -203577, 298768, -172749, -188923, -292773, -239083, -155615, -142312, 25494, 248642, -123046, -75356, 132082, -48554, 236439, -250477, 19877, -224794, 86890, 135635, 212331, -7248, -43831, 124068, -421500, -360171, 172747, -166845, -195779, 719, 31656, 95257, -13707, -173362, 2002, -128589, -114882, -246063, 74818, 78218, -192010, 117905, -262872, 399119, 179716, 278587, 12291, -289888, -77306, 110574, 270680, 32092, 106217, 513086, -74493, 314092, -179572, 169493, 72457, -92587, 84422, -54416]
15820b64594A38602D3693R2202K4749g0573o1826a9927B11179a85242I5400J02842
15809A98242b1195B42723h5434C42461A67016a30332O178g473l11717F4853k9476
15798C5377f53841c6893m3345j5129M3604C7763a37769c4044j9132C853J02058
15787A05911g564k90750J19067A77047a51693b235j61883B370J53440E4143i3270
15775A28481c13526O4652p6804c8492k06483C22781a82461k8727C23294c64840
15764G5473K56718H4621a00350i720D0022f6500k13037K1193r5078d8101l5032
15753h3133E4434P4406b879j74601B327a77716A85995a09634j11209a076A75631
15741a65088P5949B04327o5290g9833B36124d01577B60510b667C59057d1931g909
$$ y = [-264594, 138602, 43693, 135895, 160644, -70573, -132399, -19927, 211179, -185242, 95400, 198242, -21195, 242723, -85434, 342461, 167016, -130332, -124154, -7473, -319190, 64853, 35377, -653841, -36893, -80238, -95367, -51763, 37763, -137769, -34044, -53176, 3853, 105911, -7564, -298314, -179247, 177047, -151693, -2235, -164118, 2370, 155810, 54143, -93270, 128481, -313526, -248874, -325678, -38492, -244975, 322781, -182461, -211188, 323294, -364840, 75473, 332191, 84621, -100350, -9720, 40022, -66500, -279537, -258344, -353422, -48101, -83133, 54434, 128840, -2879, -177480, 2327, -177716, 185995, -109634, -220843, -1076, 175631, -165088, -89139, 204327, 139037, -79833, 236124, -401577, 260510, -2667, 359057, -41931, -7909]
15729b33103B24765b67386a07132k36660B01545o3424e3570C14997G3986a85827
15718a65927P2071H4910l3296d8246q0999a1048p474o4510c4664j1135k07470
15707b53269B4890h0699j57501J06490b6697m7756B35510o7258D7155i276L447
15696e829H2796a04627A75019c96863A59972D9695J9339a27912p3822B61648A7773
15684a56456B44332e0125F1805R6124P4582G8549c8208G9946a00090A95488o4161
15673A31327L52789G607c6218C45373b04076r195d9626q7019A333a4403A78125
15661a26321m6616d6089C7397a67014A12176J26035a45023c0937A61465a4270
15650c24138B00792G6493b43632A71039a08173c2785A59543E9764K14800A01907
$$ y = [-233103, 224765, -267386, -107132, -343792, 201545, 138121, -53570, 314997, 73986, -185827, -165927, -93856, 84910, 51614, -48246, -129245, -11048, -18522, -83032, -34664, -45799, -253269, 24890, -80699, -238200, -131710, -26697, -74453, 235510, 168252, 47155, -9276, -5829, 82796, -104627, 175019, -396863, 159972, 49695, 69034, -127912, -201734, 261648, 17773, -156456, 244332, -50125, 61805, 157929, 232511, 78549, -38208, 79946, -100090, 195488, 131327, 484116, 7607, -36218, 345373, -204076, -213271, -49626, -136645, 1333, -14403, 178125, -126321, -172937, -46089, 37397, -167014, 112176, 238211, -145023, -30937, 161465, -14270, -324138, 200792, 76493, -243632, 171039, -108173, -32785, 159543, 59764, 274564, 101907]
15639a76193O2143a3074A20476b24282J02532C5945K54520A25576a17724c0802
15628A99204F4687a00314a808j66087M1267N8168c319j81243I7229d0246l35051
15617c75297A1858c4069A94571G4342a42545N7168F999a06319A85016B8741a4269
15605b64525J00860D3580a20359p5195Q2960l5677C9715e9933B1875b25396F3392
15593D7019a8405j23016B08240b22050i5154F9790G04a85167C21385D9977M3361
15582I3338L6764K2717B4057O3582a26680N2191c3482B12481a77024k859B4546
15570a7582D28P5875K0728B8222K55269b10835L2098H5341i9187A71003b54371
15558d08519H2880D341a15624p228e3411n2939d9236b883j53315A68982c37013
$$ y = [-176193, -114050, -13074, 120476, -224282, -121750, 35945, 290465, 125576, -117724, -30802, 199204, 64687, -100314, -1808, -167895, -126628, -68460, -3319, -184562, 97229, -40246, -375297, 11858, -34069, 194571, 74342, -142545, -85377, 6999, -106319, 185016, 28741, -14269, -264525, -163665, 43580, -120359, -195554, -112594, -148271, 39715, -59933, 21875, -225396, 63392, 47019, -18405, -141421, 208240, -222050, -95154, 69790, 704, -185167, 321385, 49977, 93338, 130102, 152819, 24057, 87639, -126680, -74489, -33482, 212481, -177024, -179883, 24546, -17582, 428, 76303, 97031, 28222, 283491, -210835, -178737, 85341, -99187, 171003, -254371, -408519, 82880, 4341, -115624, -122852, -53411, -106350, -49236, -2883, -156198, 168982, -337013]
15546h2639F7360e5835H7332a7654A86004M6608B1333a28477B28561h1124n230
15535h6354B0140K66706F1433b8636A91163d5678k3183C21503h3547A81988i9192
15523a11673B15959g8870m4924c855p1104J4097B03306a08650G303d4556j03755
15512a48311e3725A02066K062k0616c8951C2408g719j19517A6460K77059a04024
15500a65867A23298c34591B06463D7209L38060j86376R0783q7990J40092A20723
15489B59053K29818F8443Q4628C7603O1735M1601D7813M3741Q6980q4405l9514
15478E4615J69207p9585G2070L86590i6405B75020k2317j17669P0303H9180a072
15466B35456a27760A1638J452K03092A04951K53589j12949K57654j03374A74860
$$ y = [-82639, 67360, -55835, 87332, -17654, 186004, 232612, 21333, -128477, 228561, -81124, -86354, 20140, 286846, 61433, -28636, 191163, -45678, -68861, 321503, -83547, 181988, -99192, -111673, 215959, -78870, -123794, -3855, -74959, -60862, 203306, -108650, 7303, -44556, -148311, -53725, 102066, 104128, 83512, -38951, 32408, -7719, -127236, 16460, 293519, -104024, -165867, 123298, -334591, 206463, 47209, 385269, 198893, 289676, 201686, 341778, 120723, 259053, 488871, 68443, 153071, 37603, 99338, 140939, 47813, 91554, 178534, 94129, 54615, 223822, 144237, 72070, 458660, -96405, 275020, 252703, 135034, 205337, 89180, -1072, 235456, -127760, 11638, 13090, 216182, 104951, 358540, 245591, 503245, 399871, 174860]
15455F06268p2779B66035c7648D32286A13048c7529H2730e38466a28871m8278
15445a77149G6543i6769A84051F0538K75725a17693D2595p506J2693h2760j96512
15434b79272B72049A10526a50477A90406B8981L49939K59560B81035Q3996L00016
15424F65047J13970j13544P6649A16798g973A95143a5533A70427J59066E8738
15413B5181L22061l050G7509a93394A64316b3924A21261K33996A0490K74912N0434
15402C35836b10948B62964c21605h8214A7659a37860A11883f4259r9946a4429
15391a67314E5020b49274j12157B1581a43239B17735a1677H4434a19412B02188
15380a02173L1241j5905L1292a2239A7187a00997B18349c49708A23715a6837o0499
$$ y = [606268, 533489, 266035, -37648, 432286, 113048, -37529, 82730, -538466, -128871, -177149, 76543, -96769, 184051, 60538, 336263, -117693, 42595, 35089, 47782, -82760, -279272, 272049, 110526, -150477, 190406, 28981, 378920, 638480, 281035, 365031, 665047, 779017, 665473, 742122, 116798, -7973, 195143, -15533, 170427, 329493, 58738, 25181, 347242, 344192, 77509, -193394, 164316, -23924, 121261, 355257, 10490, 285402, 335836, -210948, 262964, -321605, -88214, 17659, -137860, 111883, -64259, -164205, -14429, -167314, 55020, -249274, -361431, 21581, -143239, 217735, -11677, 84434, -119412, 202188, -102173, -70932, -86837, -55545, -12239, 17187, -100997, 218349, -349708, 123715, -16837, -77336]
15369g7336A88216i464k4040j2293B08104l9296F0758J97056j00037P098K3469
15358A88344L1295o7868J79756o7579J99913A96877b8373A81930B6189K68187
15348B94376K05108H533J67739N52945h7748C19222K3928I5169b0410k6717D15978
15336a0834A21882J1880J13492D2729F722M15780j31694A10676l4327J23680q5509
15325A14520K49997B0894Q2254b40745B73109m8679Q7006K1658j45755b00948
15314A63068i3553k9855C58030B1026L40185l8190j1596A04838A2412a55985C2348
15302h8363j52754O1266I4051D710J08439a25641e9984o2742C75627A38672a37094
15290A12649K41010A54711E692K25053j4616J52689E3331J94469N123B9606J41687
$$ y = [-77336, 188216, -9464, -33504, -45797, 208104, 168808, 60758, 257814, 157777, 164875, 188344, 219639, 151771, 331527, 263948, 463861, 196877, -28373, 181930, 26189, 294376, 499484, 8533, 176272, 729217, -87748, 319222, 343150, 95169, -20410, -47127, 415978, -10834, 121882, 133762, 247254, 42729, 6722, 422502, 290808, 110676, 76349, 200029, 114520, 364517, 20894, 103148, -240745, 273109, 224430, 311436, 333094, 187339, -200948, 163068, -93553, -123408, 358030, 21026, 361211, 323021, 311425, 104838, 12412, -155985, 32348, -88363, -241117, -179851, 94051, 4710, 113149, -125641, -59984, -122726, 375627, 138672, -137094, 112649, 353659, 154711, 5692, 230745, 216129, 368818, 53331, 247800, 252923, 29606, 171293]
15279A71293A6580b11098B24892B1262b9019A73886l8691g0794A20336f272H51
15267a63508k40492a63968N9640B21749q4752A5139K52526e2029A07103B9266
15256e5150E58802B65426H9460L6402i5237g117k9537A88579K68681e839o1295
15245f7134A47350o3002H925P6199J09744o9895k8250a2025j18012j61423A96066
15233B33363j04253J15250L26820J52168O68997k11142L82961j89355n31604k91264
15223E51941H6745J17999B9559J90908p0545F7176K33694A08745a04098M668A44744
15211d0390A69155d9494A07511J78277d0272D89348g273k3797A62586m3932h8293
15199c67153H1808K23753H42a38431B33104D0075J07245L40251b39431C06707
$$ y = [171293, 16580, -211098, 224892, 21262, -29019, 173886, 135195, -70794, 120336, -6272, 851, -163508, -404000, -163968, -104328, 221749, 136997, 15139, 267665, -52029, 107103, 29266, -55150, 558802, 265426, 89460, 125862, -95237, -7117, -36654, 188579, 457260, -5839, -67134, 147350, 84348, 8925, 85124, 194868, 124973, 96723, -12025, -130037, -291460, 196066, 233363, 129110, 244360, 571180, 723348, 1392345, 1181203, 1564164, 1374809, 843205, 551941, 86745, 204744, 29559, 220467, 149922, 67176, 300870, 108745, -104098, -99430, 144744, -40390, 169155, -49494, 107511, 285788, -40272, 489348, -7273, -31070, 162586, 118654, -88293, -367153, 81808, 305561, 842, -138431, 233104, 40075, 147320, 487571, -239431, 306707]
15188a00902B40346I3525L2127B0025N76011A92728k954g5588b8309n0081G7521
15176a95532E8991K87438q0702b90994C037b52302j69773J32529B38332d668A43446
15164f9543C11239A5989f6526C58747A64819K65228j94665q5354K08427e2195
15153D5270i9372A67368A3659K19739G3806K98293n7052D1945J39234i3073A12193
15141c58966C59188a9140C61070A12438P1220E5206O8039h934C13140C0619j2719
15130A7900K53762G9327L4078J76864e0545A63670J90485H8913J69314O6914A29573
15118G0095L36960N492j03175j24369c15392e290A43385N0103K50410k6361B55
15106C8808K22155P9346F8165M81664K7776B64455b03080K2986p0770F2588J15967
$$ y = [-100902, 240346, 93525, 125652, 20025, 596036, 192728, 189774, -75588, -28309, -78390, 77521, -195532, 58991, 346429, 265727, -290994, 3037, -252302, -422075, -289546, 238332, -4668, 143446, -69543, 311239, 15989, -66526, 358747, 164819, 430047, 235382, 150028, 358455, -52195, 45270, -99372, 167368, 13659, 233398, 73806, 372099, 315047, 41945, 181179, -93073, 112193, -358966, 359188, -19140, 361070, 112438, 183658, 55206, 123245, -8934, 313140, 30619, 17900, 271662, 79327, 113405, 290269, -50545, 163670, 354155, 88913, 258227, 325141, 129573, 70095, 407055, 412547, 309372, 185003, -315392, -5290, 143385, 193488, 443898, 417537, 255, 38808, 260963, 340309, 68165, 549829, 577605, 264455, -203080, -180094, -250864, 62588, 178555]
15095A78555l6314a78131C68245A61726J44607d2441b485E1229a39599A41900
15084B95401E8651b9488a4288A59300J21536j04877c6676C10484g6722l7713B47181
15072E9833K6943e4894B24344q9790J90354A38251J49685j23994a64199C77335
15061A43678J8712J70223J01877A27068J5770J78477K43356j20739f712B51219
15050a3590l480B09339K8155K85240B44414L54793A84772L03166a07977n4405
15040a62382A60973H364L9142f2089A13326M3713k4952J48931M5820q6856k7730
15029B12252J23444J7423J40148B16372K2596J82765K2266K06521j90484j43563
15019C16473G4611O78200C32617O7193J04067M98620j68865l24183q8646m2241
$$ y = [178555, 142241, -178131, 368245, 161726, 306333, -42441, -2485, 51229, -139599, 141900, 295401, 58651, -29488, -14288, 159300, 280836, 175959, -36676, 310484, -76722, -114435, 247181, 59833, 86776, -54894, 224344, 134554, 324908, 138251, 287936, 163942, -164199, 377335, 143678, 162390, 332613, 434490, 127068, 142838, 321315, 564671, 443932, -6712, 251219, -13590, -17070, 209339, 237494, 522734, 244414, 599207, 184772, 487938, -107977, -162382, 160973, 8364, 47506, -62089, 113326, 157039, 132087, 281018, 326838, 239982, 212252, 335696, 353119, 493267, 216372, 238968, 421733, 443999, 650520, 460036, 316473, 74611, 752811, 332617, 399810, 503877, 1002497, 833632, 509449, 420803, 378562]
15009C78562K42407j57015n9090O23b2954D22492J37228o5963J44470j68952E2950
14997E30471F1131J02135K84784e3596C15461p7686R468N46506k80926j96798
14987C16025J11146j93280J98755A20811L71143l2572k5616j31020m264R2408
14977C90890J91743A80692P0928O2606O8646L12405j25373m4472J78250r6793
14967F06889Q7319q2430L14855o1814j11700Q3201k66517K618M6427j51564K35566
14956G02850J65737m09643K4187R4754j05071A72258J58711p381A53097K77560
14946D30657A47254k1418K47356j35905J20777J04472j34797N0153A86398K615
14936A89013J60014J56392R1331k92320N91995C73025A53164K72861M922K78596
$$ y = [378562, 620969, 463954, 404864, 405487, -22954, 422492, 559720, 493757, 638227, 469275, 52950, 530471, 61131, 163266, 448050, -53596, 315461, 237775, 247243, 793749, 512823, 316025, 427171, 233891, 432646, 120811, 491954, 459382, 433766, 302746, 298482, 390890, 582633, 180692, 251620, 314226, 382872, 695277, 569904, 525432, 703682, 606889, 694208, 611778, 926633, 864819, 753119, 836320, 569803, 572421, 618848, 467284, 702850, 868587, 458944, 483131, 577885, 472814, 172258, 330969, 323588, 153097, 430657, 147254, 125836, 373192, 237287, 358064, 462536, 327739, 377892, 186398, 189013, 349027, 505419, 596750, 304430, 896425, 373025, 153164, 426025, 430947, 709543]
14926G09543J69572C88315M74587j00122C08868K05008k7523D7802N26650j2855
14916E61597k5431R1089L84073J9340j1233N49308k45866p3188L22468M2332k86080
14905A328409K63078n39965M28805J44567N8419L62676j11621m73035j62909k3713
14895A274711J636m41001j72641K42931k83932H2887M41196A71267J39703L95141
14885G06111l07265p728K9324K3454J42840B57423J78415L12476k87277B17611
14874C18215K92225k37606K14032l6347p5637J56070p9201M74947L8930j27669
14864I37959j00907l39656J35794K52279j40706j99908j58810L57923B90421K32744
14854E23165K38486C00935J08385N34915m10962P6461J78212n6095p1385J30475
$$ y = [709543, 879115, 388315, 862902, 762780, 308868, 513876, 486353, 47802, 574452, 561597, 536166, 627255, 1011328, 1030668, 1019435, 1568743, 1322877, 1249689, 1572157, 1614489, 1328409, 1591487, 1051522, 1480327, 1624894, 1683313, 2045989, 1934368, 1461333, 1298424, 1274711, 1276347, 835346, 662705, 905636, 621704, 82887, 524083, 171267, 310970, 706111, 398846, 391118, 420442, 443896, 586736, 257423, 435838, 748314, 461037, 217611, 318215, 610440, 372834, 586866, 550519, 474882, 630952, 551751, 1026698, 1065628, 937959, 837052, 497396, 633190, 885469, 744763, 544855, 386045, 743968, 290421, 523165, 761651, 300935, 409320, 944235, 533273, 609734, 787946, 731851, 660466, 790941]
14844G90941B5398K03246K53162J56331Q6968l34011J40769k0721l8439N0643
14834E23346q8958r7356j05027J27382J7520L55384k2843p050L91245R0384J7136
14823A201163k94156J90684k17759J08841j65447k46007K39049j35738k46596
14814D34034L52385J43802m51681J00117j71642J73622N6066L1179r0437P2604
14804F50049q266J3123L0117R7416k60774L9845L06672J01535k23835k29236N1290
14793E67936J4604K91508M9646D36874L25451Q2499J0241J19401m501o5796m22190
14782D81979J42529L26517q8698k88828K13743l15364K50384k51642K15694k4110
14772F62204J36371K69958k41669j90213J62006r2421J11331l82497j86637N00365
$$ y = [790941, 25398, 228644, 481806, 638137, 725105, 391094, 531863, 511142, 472703, 523346, 434388, 337032, 232005, 359387, 376907, 732291, 709448, 702398, 1093643, 1184027, 1201163, 907007, 1097691, 879932, 988773, 823326, 577319, 816368, 680630, 434034, 786419, 930221, 478540, 578657, 407015, 580637, 636703, 667882, 577445, 650049, 641783, 654906, 685023, 782439, 521665, 561510, 868182, 969717, 745882, 516646, 567936, 582540, 874048, 923694, 436874, 762325, 844824, 855065, 974466, 969965, 904169, 481979, 624508, 951025, 862327, 573499, 787242, 471878, 722262, 470620, 686314, 662204, 798575, 1068533, 826864, 636651, 798657, 706236, 817567, 435070, 248433, 748798]
14762G48798o1266J80090N5851o7578D20741L95336l8406j53582J38417p5138
14752F87368k63714J2910q5154M50898k07083K47809j96633l9934j41730O3207
14742E27944J17777J03697p0702n6914J15076J1766P7110k56191K96201k66433
14732E99331O8168K8268K89360j36827C78107J99262j04673P05018E12350J45894
14722F58244J10302j14446J39600J95916k99118J92021k0971J88619q1602k35073
14712G33492N39013k16012M48260o4745K47392j68675p2785j54868K18954m37696
14702A072330j96666K30053l89666K40676M8685l10068J24136K82731j43798J57204
14692A115617p2723l61883P54380n52207N12127K50857k92026K75597J4747J42928
$$ y = [748798, 687532, 867622, 923473, 855895, 420741, 816077, 777671, 624089, 762506, 687368, 423654, 436564, 351410, 802308, 595225, 843034, 646401, 606467, 464737, 527944, 645721, 749418, 678716, 621802, 736878, 748644, 825754, 569563, 865764, 599331, 667499, 695767, 985127, 848300, 378107, 577369, 472696, 1177714, 512350, 658244, 768546, 654100, 793700, 989616, 690498, 882519, 861548, 1050167, 968565, 733492, 1272505, 1056493, 1504753, 1440008, 1687400, 1518725, 1445940, 1291072, 1510026, 1072330, 875664, 1105717, 716051, 956727, 1005412, 695344, 819480, 1102211, 958413, 1115617, 1042894, 681011, 1435391, 883184, 1395311, 1646168, 1354142, 1629739, 1644486, 1787414]
14682A787414m20283J60012j97921n01748M45876m00711K6059k48410M05420k92658
14672G63050J40661l5851k0789J51951n0409J40889j24346J78525K16294n31884
14662H28091J69465k2776J41706k73123R4766K41171q462K58125n64748K31620
14652A095835j64887J67524Q3468l21721J83994K50700m56799J09128L54442k23871
14642A077813j12964L08856k20256L13997k34211L52164M358j30062K06374l56683
14632A209386L68424o89902N56531K29461j35849l72412J01216o2924j42261K26954
14622A288624k08009M38967k76178J96455R0781k57840o7971R1728l05701L24790
14612A315646J76015o8711j40176R8771q6401J95458O3594K38274l59431O9674
$$ y = [1787414, 1367131, 1527143, 1329222, 827474, 1273350, 872639, 898698, 650288, 1055708, 763050, 903711, 867860, 847071, 999022, 948613, 1089502, 965156, 1143681, 1359975, 828091, 997556, 974780, 1116486, 843363, 938129, 1179300, 1170838, 1428963, 864215, 1095835, 930948, 1098472, 1181940, 860219, 1044213, 1294913, 838114, 947242, 1301684, 1077813, 964849, 1273705, 1053449, 1367446, 1133235, 1485399, 1489757, 1359695, 1566069, 1209386, 1577810, 887908, 1444439, 1673900, 1538051, 1165639, 1266855, 1203931, 1061670, 1288624, 1080615, 1519582, 1243404, 1439859, 1530640, 1272800, 1204829, 1296557, 990856, 1315646, 1491661, 1422950, 1282774, 1381545, 1295144, 1490602, 1554196, 1792470, 1433039, 1502713]
14602A502713p4982J22739P0078m63632J06994J181M96532j89733p3683L01766
14592A799973j52457r2570J1609R3571K3935L7727r6138k46401N26199j47692
14582A757756O6791j07321J65165J51917m35467L52721l4334J25242m347k37905
14572A800218L79104O3385k92049M8755J2574n7846j35258P3040J46295K4008
14562B062226j05953R9181j64141L71837J16942k23055R0920j32040j12169L37676
14552B341424k95379M12055J68917k42953J99307L30028r2825K0162L64774k64151
14542B941359L69421K50259N95528j6488O26214L43663J075478J501080K681962
14533A0368476M092371O037175J0213165J645999j3007753p805126m174289j628222
$$ y = [1502713, 1427731, 1550470, 1620548, 1156916, 1263910, 1265091, 1761623, 1571890, 1498207, 1799973, 1647516, 1554946, 1566555, 1660126, 1684061, 1721788, 1625650, 1379249, 1905448, 1757756, 1824547, 1717226, 1882391, 2034308, 1598841, 1951562, 1917228, 2042470, 2038123, 1800218, 2179322, 2242707, 1950658, 1999413, 2011987, 1954141, 1818883, 1891923, 2038218, 2062226, 1956273, 2055454, 1891313, 2263150, 2380092, 2157037, 2247957, 2115917, 2003748, 2341424, 2046045, 2458100, 2627017, 2384064, 2583371, 2913399, 2820574, 2840736, 3205510, 2941359, 3310780, 3561039, 4156567, 4140079, 4766293, 5109956, 6185434, 7686514, 10368476, 14460847, 20498022, 30711187, 32357186, 19349433, 11544307, 7370018, 5741796]
14525E741796m43217J28074j271723o44359o76147j44596l37030q8741J12527
14516B376584J02529N4537j04796J8978j20978j32402J13307p1555L85025l5638
14506B585591k32300L55236j13676L7882j64911K38492J42116j69896n5571P1338
14496B694301M3830J50151o7074J05587J81163L2642k55929M44059n04418J14705
14486B939017M9519N42882k71338j46510m9092M07212n6023j12782j96339K61329
14476C367875K01457L9087K49153L432K6324r4197j43917m153l0942K3444K58019
14465C895582J18075j570K51269j99349K01192j42556L05135k85157O141J13260
14455D262022j11352K97783N0054L21757J7443m35566J93830k0158M23280j84752
$$ y = [5741796, 5298579, 5426653, 4154930, 3510571, 2834424, 2689828, 2352798, 2264057, 2376584, 2479113, 2533650, 2428854, 2447832, 2326854, 2194452, 2307759, 2236204, 2621229, 2585591, 2353291, 2708527, 2594851, 2632733, 2467822, 2706314, 2848430, 2678534, 2622963, 2694301, 2738131, 2888282, 2821208, 2926795, 3107958, 3140600, 2884671, 3328730, 2824312, 2939017, 2988536, 3531418, 3260080, 3113570, 3064478, 3471690, 3415667, 3302885, 3106546, 3367875, 3569332, 3608419, 3857572, 3861004, 3887328, 3793131, 3649214, 3645061, 3614119, 3637563, 3895582, 4013657, 4012087, 4263356, 4064007, 4265199, 4122643, 4427778, 4142621, 4148762, 4262022, 4150670, 4448453, 4498507, 4820264, 4837707, 4402141, 4595971, 4575813, 4999093, 4814341]
14445D814341L41959k97750K83609J23055M494j72467K5104L05298J52886j90722
14435E389807K55159k9588M0902Q1964J96270L80099m28256L73237J66136m01067
14425F024663M11884r7803K0570O7348L04555j1081L03698P7669J1259M25019
14415G537781k81088M20215m72061J5433L80871L69275m5875j74352K42044M05171
14405H397414J01231k20067K12814O56013k61785K85293q056J19416l0640k9260
14395I222373L73889j40582N46648n8005K24115k15876O43351K59808K30494R8195
14385A1184410m5069L18439J11540J67716J55420k16258O77297n4513J68456Q3497
14375A2550935L36431K84623R0568M44886M61630l35062M49891P41181j88140
$$ y = [4814341, 5156300, 4858550, 5142159, 5265214, 5269708, 5097241, 5122345, 5427643, 5580529, 5389807, 5644966, 5615378, 5656280, 5738244, 5934514, 6314613, 5886357, 6259594, 6425730, 6024663, 6436547, 6338744, 6359314, 6426662, 6731217, 6720136, 7023834, 7101503, 7112762, 7537781, 7256693, 7676908, 7204847, 7220280, 7601151, 7970426, 7924551, 7750199, 7992243, 8397414, 8498645, 8278578, 8491392, 9147405, 8885620, 9170913, 9162857, 9282273, 9251633, 9222373, 9596262, 9455680, 10002328, 9944323, 10168438, 9952562, 10595913, 10855721, 11086215, 11184410, 11139341, 11457780, 11569320, 11737036, 11892456, 11676198, 12353495, 12298982, 12467438, 12550935, 12887366, 13171989, 13262557, 13707443, 14169073, 13834011, 14283902, 15025083, 14836943]
14366A4836943J46742M67799M6402L90149O13374M04451J0853O24633L96383j8799
14356A7918930O93716Q9825M66307M83151J53021M15215M50397M64037N40157
14347B1674756P07829L89688L25136N21045M20890L95026P30756O36898L01892
14338B6103916P65644O87690L26108J029895O59159M50453J174718J105424M20227
14329C2723234J073583M15713J298831R58176P93965Q37214J142883J596928R35384
14320D1775911J228649J132509J581318J479371J122098J434161K015033J635852
14312E3404902J645487J703632J985770J977364K618389J709625K573128K713316
14304G0331613K413192K727724L098953K399065L283584L170307L933526L415491
$$ y = [14836943, 14983685, 15451484, 15497886, 15888035, 16501409, 16905860, 16916713, 17541346, 17937729, 17918930, 18612646, 18702471, 19168778, 19651929, 19804950, 20220165, 20670562, 21134599, 21674756, 22382585, 22772273, 23097409, 23618454, 24039344, 24434370, 25165126, 25802024, 26103916, 26869560, 27557250, 27883358, 28913253, 29572412, 30022865, 31197583, 32303007, 32723234, 33796817, 34212530, 35511361, 36469537, 37263502, 38100716, 39243599, 40840527, 41775911, 43004560, 44137069, 45718387, 47197758, 48319856, 49754017, 51769050, 53404902, 55050389, 56754021, 58739791, 60717155, 63335544, 65045169, 67618297, 70331613, 72744805, 75472529, 78571482, 80970547, 84254131, 87424438, 91357964, 94773455]
14296I4773455M131987M129344M239803M695646M928693N013847N536101O548907
14288A33997783N656341O423526P303882P360478P798411Q249385Q654626R235275
14280A94679707R623015J0681653J0891152J1358213J2154834J2757149J3311800
14273B75457523J3811703J4209891J4165381J4683302J4414814J4302730J4055839
14266C75101183J4076807J2889879J1938680J0950836J0287329R471308Q402301
14259D53118323O549702L439697J650993J846551K153811o39727n976160n114423
14251D57028767p248360j0722505j1792711j1915607j2774211j3415485j3801535
14244C75358353j3540356j4451595j4172386j4147086j3982294j3077980j3253533
$$ y = [94773455, 98905442, 103034786, 107274589, 111970235, 116898928, 121912775, 127448876, 133997783, 139654124, 146077650, 153381532, 160742010, 168540421, 176789806, 185444432, 194679707, 204302722, 214984375, 225875527, 237233740, 249388574, 262145723, 275457523, 289269226, 303479117, 317644498, 332327800, 346742614, 361045344, 375101183, 389177990, 402067869, 414006549, 424957385, 435244714, 444716022, 453118323, 459668025, 463107722, 464758715, 466605266, 468759077, 468119350, 462143190, 457028767, 449780407, 439057902, 427265191, 415349584, 402575373, 389159888, 375358353, 361817997, 347366402, 333194016, 319046930, 305064636, 291986656, 278733123]
14237B78733123j2424902j2515769j0967823j1416514j2073567j1148448j0988979
14230A97197121r835676r185060q733032q154544p837327p022089o814115o155153
14222A33460125n647291n889824n159819n190555m901563m111153m180584l641595
14214I4737741l805903l612025l603848k911540l121342k937157k964702k429038
14206F9352186j980028k434067k223639k162206k033353j919374j544652j127080
14198E3927787k268429j160423j921690j050798j709058j045777j186870j123728
14190D2461014j120618j398641j354637o53422j038363r89075o21982j062364
14182C4221912q72174j083388j045876l43779o99585r06198p14656q14458l72746
$$ y = [278733123, 266308221, 253792452, 242824629, 231408115, 219334548, 208186100, 197197121, 187361445, 178176385, 169443353, 161288809, 153451482, 146429393, 139615278, 133460125, 127812834, 121923010, 116763191, 111572636, 106671073, 102559920, 98379336, 94737741, 90931838, 87319813, 83715965, 80804425, 77683083, 74745926, 71781224, 69352186, 67372158, 64938091, 62714452, 60552246, 58518893, 56599519, 55054867, 53927787, 51659358, 50498935, 48577245, 47526447, 45817389, 44771612, 43584742, 42461014, 41340396, 39941755, 38587118, 37933696, 36895333, 35906258, 35284276, 34221912, 33349738, 32266350, 31220474, 30876695, 30177110, 29270912, 28556256, 27741798, 27369052]
14173B7369052j020047n12795o08071l51978r05792k34466o30713l06539o08321
14164B2190330n69831n52334j24035l52538n90726k8073q14736l00332n64984
14155A8292741J11242p10682m35554r1054m33872j83225n55803r2790o95813m6709
14145A5158481M8217p42781Q766k64577j37151l66612k83967j85743J38540q34244
14135A2538929K05042n16957j05332p7776k34308j86143j13485m2941p4654l07301
14125A1085074j59273l41350k35164m6839j68918L62317m50736l41758n3540K7791
14115I677604k30272j06103j52632k19342K4425k90950K56964k46090m34103j48320
14105H131181P9212n42974N8980J82940m68664O6104K19825k44995l83371K09596
$$ y = [27369052, 26349005, 25836210, 25228139, 24876161, 23970369, 23735903, 23105190, 22798651, 22190330, 21620499, 21068165, 20944130, 20591592, 20000866, 19972793, 19158057, 18857725, 18292741, 18403983, 17693301, 17257747, 17166693, 16732821, 16549596, 15993793, 15901003, 15205190, 15158481, 15206698, 14463917, 14472683, 14208106, 14070955, 13704343, 13420376, 13234633, 13373173, 12538929, 12743971, 12227014, 12121682, 12043906, 11809598, 11623455, 11509970, 11467029, 11392375, 11085074, 10925801, 10584451, 10349287, 10302448, 10133530, 10495847, 10045111, 9703353, 9649813, 9677604, 9447332, 9341229, 9188597, 8969255, 8993680, 8702730, 8959694, 8713604, 8279501, 8131181, 8210393, 7667419, 7726399, 7909339, 7440675, 7506779, 7726604, 7481609, 7098238, 7307834]
14095G307834L3191j00584j27517l18838Q8544K68619p17039K32738J10685l69545
14085F408088p5019o4513j29921O9441j55772J63293j12309m06080R4366J42882
14075E934456n83274J51821J20253k69705J70332k33838K42913r1164k82324l05382
14065D854088L92137M6944l17310j3738l2694r7395P4881K4344l23535J54667
14055D762389k21582J17283J05787k33947m9006j99655k4896K90892j27873k21971
14045D197421K50332j17641k20287J55567j77474n4179o8319J70105l65581j41515
14035C628429J16052j3054J01399Q6350n18845L52837m29928J30039J03675k96092
14025C260862L0687j3421j18370K72775l9260Q4593n1000k69118j12124K46076
$$ y = [7307834, 7341025, 7240441, 7112924, 6794086, 6882630, 7151249, 6434210, 6666948, 6777633, 6408088, 6333069, 6268556, 6138635, 6208076, 6052304, 6215597, 6103288, 5697208, 5791574, 5934456, 5351182, 5503003, 5623256, 5353551, 5523883, 5290045, 5532958, 5441794, 5159470, 4854088, 5246225, 5293169, 4975859, 4962121, 4929427, 4832032, 4906913, 4931257, 4607722, 4762389, 4540807, 4658090, 4763877, 4529930, 4480924, 4281269, 4256373, 4547265, 4419392, 4197421, 4447753, 4330112, 4109825, 4265392, 4087918, 4033739, 3965420, 4135525, 3769944, 3628429, 3744481, 3731427, 3832826, 3919176, 3400331, 3753168, 3323240, 3453279, 3556954, 3260862, 3291549, 3278128, 3159758, 3432533, 3393273, 3477866, 3426866, 3157748, 3045624, 3291700]
14015C291700k27948j16268N01969o7426l19902j20749J04726R115j65755O7317
14005B956779k22958l996j04967K97245l57227L46543m91646O259M49151l29726
13995B545457L39475j56462l72178Q2679J72349m8551l24153K51652j26761j53817
13985B209690L84828j99645j81381N20827k10808L49152K02940j9540L80879J54421
13975C591363J187192J970400L304730N256458J0908130P936209j0201931q309389
13967A5643162n531183l065223r71393j183091l79968k41355m89389l28616j75574
13958C277370k8124J16824o21752J23622k28543n6657M7901j73173k8502k16571
13948B212395J26948J71895o08311M55427j81666l86882M37987j02773k12732
$$ y = [3291700, 3063752, 2947484, 3449453, 3382027, 3062125, 2941376, 3046102, 3055217, 2889462, 2956779, 2733821, 2729825, 2624858, 2922103, 2564876, 2911419, 2419773, 2426032, 2875183, 2545457, 2884932, 2728470, 2356292, 2438971, 2611320, 2562769, 2238616, 2490268, 2363507, 2209690, 2594518, 2394873, 2213492, 2734319, 2523511, 2872663, 3075603, 3056063, 3436942, 3591363, 4778555, 6748955, 10053685, 15310143, 26218273, 34154482, 23952551, 15643162, 10111979, 7046756, 6075363, 4892272, 4512304, 4270949, 3781560, 3452944, 3277370, 3249246, 3366070, 2744318, 2867940, 2639397, 2582740, 2630641, 2457468, 2428966, 2212395, 2339343, 2511238, 1902927, 2358354, 2176688, 1789806, 2227793, 2125020, 1912288]
13939A912288J43220P0118j94377K17925j96990K07751j6741j94106L12370k86423
13929A975035k65272J88747n1750r7339J2663M38829m26955p3775k8896J7981
13919A689268K75322m0669l5434l07830J64081M2401J3989j76602J27943K25046
13909A977515l75337K16896j18687J75245m07905k28743M19066M4744j41404P3133
13899A634523l96159J93529j5522J20333J33725k29777J14083j8149k05570O6586
13889A397602J44295K02087l55651R0900K11288k8951n95768N95721l24278K44175
13879A581420k54273K30863k83677k1000j02825N87150m33609M6116j32691j03287
13869A114187J19014L03366m9041k98217L13237l3436M5288q6048r1923K3926
$$ y = [1912288, 2055508, 2125626, 1931249, 2149174, 1952184, 2159935, 2143194, 1949088, 2261458, 1975035, 1709763, 1898510, 1846760, 1749421, 1762084, 2200913, 1773958, 1700183, 1671287, 1689268, 1964590, 1923921, 1888487, 1580657, 1744738, 1787139, 1801128, 1624526, 1752469, 1977515, 1602178, 1819074, 1700387, 1875632, 1467727, 1238984, 1658050, 1702794, 1561390, 1634523, 1238364, 1431893, 1416371, 1536704, 1670429, 1440652, 1554735, 1536586, 1331016, 1397602, 1541897, 1743984, 1388333, 1479233, 1690521, 1661570, 1065802, 1661523, 1337245, 1581420, 1327147, 1558010, 1274333, 1253333, 1150508, 1737658, 1304049, 1350165, 1217474, 1114187, 1233201, 1536567, 1487526, 1189309, 1502546, 1469110, 1514398, 1428350, 1336427, 1360353]
13859A360353m9201j72339n2806K32702n2399l40571M85274r5104j07381o5667
13849A142861q1737l15625L91961k0257J35382j30624L24790k03811l37681K56079
13839A161338m5640K53295j04000K9320j43687J27427j3529o4214l87323N0314
13829H63301M4880K47376j63024k63803L68726m7606Q5823J25494j32526k59428
13819H69213J4624m2354J77345j70253J11786M5381l56685K45503o0734P3759
13809I07585J16507r3340l03191K71608L3154k217J50659k73545J28145o0440
13799H74925Q873j69003J0890P1120N2921Q200L18138l22146K19594m39480L89473
13788A023505J51242l65960j02586K65527N2516k89436J7147K3615k58035B29862
$$ y = [1360353, 1311152, 1138813, 1086007, 1318709, 1266310, 925739, 1411013, 1315909, 1208528, 1142861, 1061124, 745499, 1137460, 1117203, 1252585, 1121961, 1446751, 1242940, 905259, 1161338, 1115698, 1368993, 1264993, 1294313, 1150626, 1278053, 1264524, 1200310, 812987, 863301, 908181, 1155557, 992533, 728730, 1097456, 1049850, 1135673, 1261167, 1128641, 869213, 883837, 841483, 1018828, 848575, 960361, 1005742, 649057, 894560, 833826, 907585, 1024092, 930752, 627561, 899169, 932323, 930106, 1080765, 807220, 935365, 874925, 883798, 714795, 725685, 796805, 849726, 857926, 1176064, 853918, 1073512, 634032, 1023505, 1174747, 808787, 706201, 971728, 1024244, 734808, 751955, 775570, 517535, 229862]
13777F39125P3371J72301j83949N36381l13958l53209L03920o5637r8118j84547
13767E25680K58044N5005j41132j63519Q2305j55779N56657j63984J95401l22281
13757G26397Q1958k3208l09040M02091j04335j5346j88748K55749J26407l47820
13747F04105J18937n9654j71372J97070n8553l0153J55645k541J05121j26323
13737G32282J55963l98080K98750l08196J52140K14108B64846O62824k36457k54441
13727D36772K75618l20433L34186o3987j44623k0404K24941o5083j85039J27880
13717E99828J3586J21338r3726P9572B92943K14975J01156J05683p7814k78162
13707C58781K99343k31651P8532Q8188j6374O8773j73198J00723L32022C83080
$$ y = [639125, 712496, 884797, 700848, 1237229, 923271, 570062, 873982, 808345, 710227, 525680, 783724, 838729, 697597, 534078, 616383, 460604, 1017261, 853277, 1048678, 726397, 808355, 785147, 476107, 878198, 773863, 758517, 569769, 825518, 951925, 604105, 723042, 663388, 492016, 689086, 630533, 600380, 756025, 753484, 858605, 732282, 888245, 490165, 788915, 480719, 632859, 846967, 264846, 927670, 691213, 436772, 712390, 391957, 726143, 662156, 517533, 497129, 722070, 656987, 471948, 599828, 613414, 734752, 641026, 720598, 292943, 507918, 609074, 714757, 636943, 358781, 658124, 426473, 505005, 593193, 576819, 645592, 472394, 573117, 905139, 383080]
13696G84176j59013N3017j07603m4594J43129n0876N6328j82940Q8750L17689
13686H98063m39729J87286P0382q7533m9704r6527K37818k64308B25679K10670
13676D36349j19722J0176L93791p6592j88779r6838K276M42644q8237K7366l48221
13665C94213K30345j00507K11245j74012p0761j50280J08191j23793K52263k8586
13655E48318n9774J38734Q886q3838O4872B21131J23789L90407k20580J66830
13645F81577k53860j12860J78175B00665K39391J24801r1028J60546q2020j2216
13635E40139j67123K5338j25571J13864L53409k69085m1386o821K59349r8945
13625E83168k28097K2067R9608j14840K01723j89122P2750j29866A25217L04400
$$ y = [784176, 625163, 678180, 570577, 525983, 669112, 618236, 674564, 491624, 580374, 898063, 458334, 645620, 716002, 628469, 578765, 482238, 720056, 455748, 225679, 436349, 316627, 326803, 720594, 644002, 455223, 358385, 360661, 803305, 715068, 742434, 394213, 624558, 524051, 735296, 561284, 490523, 340243, 448434, 324641, 576904, 548318, 488544, 627278, 636164, 552326, 617198, 221131, 344920, 735327, 514747, 681577, 427717, 314857, 493032, 200665, 440056, 564857, 473829, 634375, 552355, 540139, 373016, 398354, 272783, 386647, 740056, 470971, 429585, 422764, 682113, 583168, 355071, 377138, 476746, 361906, 563629, 374507, 447257, 317391, 125217, 429617]
13615D29617M1133k30385N2094J15131J68100A51777L20516j85069R0925l739
13605C74410J50926O6106A89425J27198A45208J84032M9193k0899J2257m76A82211
13593E83269j18810K34345B76789O1056j58633K12292J31003j91313M3313J47564
13583E22071J1315A60007L68772B36310R9686p3476L1419J70999j62485p87q8280
13572B13386a0396A19064M16679B53361L59221k8862l1107O5114A88814Q4310
13562B73124L53600k00213L4698n919A39880L8443Q9362R2441K67719I3191K9187
13551A22378m8918K65349k307P0725j65454n9928N74957k59853n5330A05676K29772
13540C35448n1884J46958j19678m0086a4552B85296k0337L06128k36330K82172
$$ y = [429617, 470750, 240365, 292459, 407590, 575690, 151777, 472293, 287224, 378149, 374410, 525336, 591442, 189425, 316623, 145208, 329240, 378433, 357534, 369791, 369315, 182211, 583269, 464459, 698804, 276789, 337845, 179212, 391504, 522507, 331194, 374507, 522071, 533386, 160007, 528779, 236310, 335996, 262520, 293939, 464938, 302453, 301666, 213386, -10396, 119064, 535743, 253361, 612582, 583720, 552613, 617727, 188814, 273124, 626724, 426511, 461209, 455290, 139880, 178323, 267685, 360126, 627845, 93191, 122378, 73460, 338809, 336502, 407227, 241773, 181845, 756802, 496949, 441619, 105676, 335448, 283564, 430522, 310844, 270758, -14552, 285296, 264959, 571087, 334757, 616929]
13530F16929j70845o4760E0907J48568d3104D9961J76651M76255A96740K87478
13520D84218A97818P9269o1560J26613j20153G8127b8440E70061F8986M32386
13510E01372B15213R5968A2424L93192q3462J83370r9182j80529J25178n094j48219
13499A97678J35965J06A24654K03609q4487l8737q4733J29350J48161A78531E8088
13487A42728P7418J11133A49971J49788q0309M3424l1952J14999A08752O52600
13477G61352l47779C3798K51823L4278A22452J50684N4575J8318Q511I8229q20
13466I7409L19849j91704P4044A28509L14849n9799A59087K62511k9060j59544
13456B32994M9742L4501C4316K13954b10337C31419G4765N19195k14428j42940
$$ y = [616929, 446084, 381324, 50907, 199475, -43104, 49961, 226612, 702867, 196740, 484218, 197818, 277087, 215527, 342140, 221987, 78127, -28440, 570061, 68986, 501372, 215213, 311181, 12424, 405616, 322154, 505524, 406342, 225813, 350991, 345897, 197678, 333643, 333749, 124654, 328263, 243776, 205039, 120306, 249656, 397817, 178531, 58088, 142728, 220146, 331279, 149971, 299759, 219450, 262874, 230922, 345921, 108752, 761352, 413573, 33798, 285621, 319899, 122452, 273136, 327711, 346029, 354540, 98229, 97409, 417258, 225554, 299598, 128509, 443358, 383559, 159087, 421598, 392538, 232994, 282736, 317237, 34316, 248270, -210337, 331419, 74765, 593960, 379532, 236592]
13446B36592M2421A35018N78436C56034j19777Q4893M7943j15063r691o1706J03785
13435B86418j21004K22493j3574N6702k5293j1454p4730n7387r6859l3124K5448
13424A57636B8507L07560j224C2906Q0542k3623J65843d2209C42194A36788l176
13413A33612J06777p505J46013J15948B10925B010K54706K51976B23760O7162
13403B90922j45394i987C23758j36960J29537F9874K00389o4842H6773f8194E66191
13391A35324g1151B68004k7484J07940j58226a00279b1532q2984D32771A6150
13380C35594e6143A70644B8211K42437b16589K9557R2393B69829n4027P1903J3894
13369C01599L3143R7170E7243J30733F5706J06436O8368r5234M7985Q9042j08040
$$ y = [236592, 279013, 135018, 713454, 356034, 236257, 321150, 369093, 254030, 244339, 182633, 286418, 165414, 387907, 374333, 431035, 405742, 394288, 319558, 262171, 165312, 132188, 157636, 28507, 336067, 334843, 32906, 113448, 89825, 255668, -42209, 342194, 136788, 133612, 240389, 232884, 378897, 494845, 210925, 2010, 256716, 508692, 223760, 290922, 145528, -9987, 323758, 186798, 316335, 69874, 270263, 205421, 86773, -68194, 566191, 135324, -71151, 268004, 240520, 348460, 190234, -100279, -21532, -104516, 432771, 16150, 335594, -56143, 170644, 28211, 270648, -216589, -187032, -94639, 269829, 215802, 287705, 301599, 334742, 431912, 57243, 187976, 65706, 172142, 240510, 145276, 193261, 282303, 174263]
13358A74263J80473p1643K55850A35284L79430F8212J52878J00158K29661B65787
13347b09170D92540A51070j9670D3660O1160G198J49121K75133j98313A8739J10301
13336A29040M23426A84381f8130B48606p6549R8526n5784o856O7207q1385M77336
13325F71101A59J33981K17651r5561J89641C4981K59971j32156N2798G6871j6557
13314F0314L69587p5437e5390k75914B76578a95353A46648J46511J5283q8739
13304B19703A08712N3497a9283C59675l7582j01794a82580C6526K57754j39576
13294A54704l5005N7993j2708K4923m8053c51166G9126K37936h1083p8262A05085
13282B43107K03427A50341G3605a47841H5821J70390a17057C76274c9064A6293
$$ y = [174263, 354736, 283093, 538943, 135284, 514714, 68212, 221090, 321248, 550909, 265787, -209170, 492540, 151070, 131400, 43660, 104820, 7198, 156319, 431452, 233139, 18739, 129040, 552466, 184381, -68130, 248606, 172057, 270583, 214799, 207943, 275150, 193765, 671101, 159, 134140, 351791, 256230, 445871, 34981, 294952, 162796, 215594, 76871, 60314, 429901, 354464, -55390, -331304, 276578, -195353, 146648, 293159, 308442, 219703, 108712, 162209, -19283, 359675, 322093, 220299, -182580, 36526, 294280, 154704, 119699, 177692, 164984, 189907, 141854, -351166, 79126, 317062, -81083, -159345, 105085, 243107, 446534, 150341, 73605, -147841, 85821, 256211, -117057, 376274, -39064, 16293]
13271B29298a3345p8643h078B55194J8573a58406M3665b1595B89086A15013k125
13260A12888M4105K5273a49790A30183B3918K39545l965q1239j8541F3347J30894
13249A94241F0101K85206b05411D25205A11915L4165f5443B16936r062O9938q8555
13238A89257b04195C96968j36972j27879n2060L76058g2279A51210L15J25647
13228B77172r6068N8734k824c4428j25018A84855H9110J38000o4285N5704L05183
13217E23712b0980B39763a03977E5353O1661J98032i0843C65808A45636K43402
13207C89038b9812k3432B13507J94253r7978d50310c1252A22441j7857M7722q813
13196A43493B7431g3401C05326j49762n5647L4586l5636L45132b40715E76032
$$ y = [229298, -13345, -91988, -8078, 255194, 273767, -158406, -114741, -21595, 289086, 115013, 112888, 156993, 182266, -149790, 130183, 23918, 263463, 259498, 178259, 159718, 63347, 194241, 60101, 345307, -205411, 425205, 111915, 146080, -65443, 216936, 207874, 277812, 189257, -204195, 396968, 259996, 132117, 80057, 456115, -72279, 151210, 151525, 277172, 181104, 239838, 237014, -34428, -159446, 184855, 89110, 227110, 162825, 218529, 523712, -20980, 239763, -103977, 55353, 117014, 315046, -90843, 365808, 145636, 389038, -29812, -53244, 213507, 407760, 309782, -450310, -31252, 122441, 104584, 152306, 143493, 27431, -73401, 305326, 155564, 99917, 134503, 98867, 443999, -240715, 576032]
13185A83000N0246E909a39676B10374a9204l59377A8806h9938A84380q2342O4791
13174A66829J54633j19879O6751A10298J85598q8828K38011f7001B9776J9273
13164D9049F223a09910m4619B89932r6708L15723A44381c50867D1810c4843C9523
13152A52845m452c18587A35928P177k962j8098J54110A11416a74413C83530a37441
13140A19031J1070a20717B43425l9100M5178d05285a1823E4746R8915K20036R478
13129C83175A37655l9204O746C967d486A04589c7342B39680e5896B31900a27945
13117A58840J81870a5627l2614B18904g6754A29987k5505b87373A90764h838p2029
13106h0867j49557C2532A0913J64955M6598m5908b19793A51728a9416I5111J6237
$$ y = [183000, 233246, 5909, -139676, 210374, -19204, -378581, 18806, -89938, 184380, 102038, 166829, 321462, 201583, 268334, 110298, 295896, 207068, 445079, -67001, 29776, 49049, 6223, -109910, -154529, 289932, 193224, 508947, 144381, -350867, 41810, -34843, 39523, 152845, 148393, -318587, 135928, 143105, 140143, 122045, 276155, 111416, -174413, 383530, -137441, 119031, 130101, -120717, 243425, 204325, 249503, -405285, -11823, 54746, 153661, 373697, 383175, 137655, 98451, 105197, 3967, -4486, 104589, -37342, 239680, -55896, 231900, -127945, 158840, 340710, -15627, -48241, 218904, -76754, 129987, 104482, -287373, 190764, -8838, -80867, -230424, 32532, 10913, 175868, 222466, 176558, -219793, 151728, -19416, 95111, 111348]
13095A11348i2869a2710k4081A0278K0141O2200a71376A53445J7818H4813J24905
13084B09718a25475I7633J83000G8768J57529P8260b623A94438d4917C17291A985
13072A80642C070f1916A88403a56291A24011P2818p2729m9977M9848b7991A52942
13060i5291l729E4841N0240N7133C5217K31918F9730k7000g7523A76130J36241
13049C12371A54872E2727O2992J32550L2418f0501B87504D5603K79339E5633a31179
13037D45772A89275m9009k1047J03249J69934j87926j1589G3548r398R1234J38033
13026B93417d1821A4559L59504A2886J37974p080L1744A6508a60934A26992M1520
13015A68512B6684c34579B424g3457c5277B5993Q1319P459D0684h1297A24527
$$ y = [111348, -92869, -12710, -36791, 10278, 30419, 92619, -171376, 153445, 171263, 84813, 209718, -125475, 97633, 280633, 78768, 236297, 314557, -2623, 194438, -44917, 317291, 1985, 180642, 3070, -61916, 188403, -156291, 124011, 196829, 124100, 74123, 123971, -27991, 152942, -95291, -99020, 54841, 105081, 162214, 35217, 267135, 69730, 42730, -77523, 176130, 312371, 154872, 52727, 115719, 248269, 280687, -60501, 287504, 45603, 324942, 55633, -131179, 445772, 189275, 140266, 119219, 222468, 392402, 204476, 192887, 73548, 64150, 155384, 293417, -41821, 14559, 374063, 12886, 150860, 143780, 175524, 16508, -160934, 126992, 168512, 26684, -334579, 2424, -73457, -35277, 25993, 107312, 114771, 40684, -81297, 124527]
13003g0350D6454g1501C19141D5133K2759c29005A34179j2104r157J30733A4444
12991E42289A67242J16795j36949C4387a99969B34180a32948B13362B2252N4151
12981G6403a85345n1531E5644P1623O0972a96878P7974c7116A89007L48440b6045
12969B46696J31217A45112A1954M10932b8255I1588L8736D7198J24529a34264
12958b29428A89268e4697j08062k3628b5791A71343E2547j2334a1384B39828F9762
12946G428b03101A74542o6381R8706j301a03975j8356A98208b18943g4349F21123
12934A80036A7203J89861q9896a43389C9368e2300E5408c7301A55708c450G6334
12922C7046N7392d8274C37561a48463P077j1579j11094J05580d5530B16896c0286
$$ y = [-70350, 46454, -71501, 319141, 45133, 67892, -329005, 134179, 122075, 112918, 243651, 14444, 542289, 167242, 284037, 147088, 34387, -199969, 234180, -132948, 213362, 22252, 76403, -185345, -236876, 55644, 127267, 188239, -196878, -118904, -37116, 189007, 537447, -26045, 246696, 377913, 145112, 11954, 422886, -28255, 91588, 130324, 47198, 171727, -134264, -229428, 189268, -54697, -162759, -186387, -25791, 171343, 52547, 40213, -11384, 239828, 69762, 7428, -203101, 174542, 108161, 206867, 205566, -103975, -122331, 198208, -218943, -74349, 621123, 180036, 17203, 207064, 117168, -143389, 39368, -52300, 55408, -37301, 155708, -3450, 76334, 37046, 94438, -48274, 337561, -148463, -141386, -152965, -264059, -158479, -45530, 216896, -30286]
12910c8296B58217G6969a29082J0075J1566C0155q354b68510A02369A834b41891
12898A01001e03A95189c7186B60414A07746g6062p9464E6672c61599a01679k77156
12887c78835F0272J52104o4607D2966a92635H2128j601M0911a52669g4349A77396
12875i316o278k75387c9838I3952J09810b210p8024C3753a6268j24590L0382a3387
12862D7196J8508a98065A04759f0181A79043A6314J25591a53652G9441O5367a00831
12850a18325C92945B6913J52449b10445M0569c7831B09510J10951a04109E1906
12839A5254K23492a7982o3915M0735A63951a63863f7013k861a7643k549H5069
12827C71570a76148H1707q16E21J259K85555j21555K81648F5126C1813F245L43584
$$ y = [-38296, 258217, 76969, -129082, -119007, -107441, 30155, 21801, -268510, 102369, 1834, -241891, 101001, -503, 195189, -37186, 260414, 107746, -76062, -155526, 56672, -361599, -101679, -378835, 60272, 212376, 147769, 42966, -192635, 82128, 80527, 121438, -152669, -74349, 177396, -9316, -15594, -290981, -39838, 93952, 203762, -2210, -80234, 33753, -16268, -140858, -110476, -13387, 47196, 65704, -198065, 104759, -60181, 179043, 16314, 141905, -153652, 79441, 144808, -100831, -118325, 392945, 26913, 179362, -210445, -169876, -37831, 209510, 320461, -104109, 51906, 15254, 238746, -17982, -81897, -41162, 163951, -163863, -67013, -69874, -17643, -20192, 85069, 371570, -176148, 81707, 80891, 521, 1780, 287335, 165780, 447428, 65126, 31813, 6245, 349829]
12815C49829b1954E7753L3886a67848B40119A2309K95065j25094b61675b0607
12804g7277A0671J22231P4319a52868K6564B4148R5064B2677a49640O1266a9143
12792b42100H6832c0490A55706a90643I7404O9138i1135j04064C03590A35277
12781a32569c710j95507A90457f1216A24994a54196B08726a42643A57019b95533
12770B1644a51685H8249a58582m562A26372C4723K0449h735A84507D7731J42275
12759A90006H6474e3563n7091A86534c04699C56185A18984R7503b6440m6128j54622
12748b27190A02100d9534j00423M5682A68396A0771K3506O4156d2662F3544e9580
12736G768J73526a2411q3789l6438A79392E3470b6428j97704a7234l49138a39726
$$ y = [349829, -21954, 57753, 91639, -167848, 240119, 12309, 307374, 182280, -261675, -20607, -77277, 10671, 132902, 207221, -152868, -126304, 24148, 119212, 22677, -149640, -88374, -19143, -242100, 86832, -30490, 155706, -190643, 97404, 166542, -91135, -195199, 303590, 135277, -132569, -3710, -199217, 190457, -61216, 124994, -154196, 208726, -142643, 157019, -295533, 21644, -151685, 88249, -158582, -163144, 126372, 34723, 55172, -8735, 184507, 47731, 190006, 86474, -53563, -110654, 186534, -304699, 356185, 118984, 216487, -26440, -72568, -227190, 102100, -49534, -149957, -104275, 168396, 10771, 34277, 98433, -42662, 63544, -59580, 7768, 181294, -12411, -96200, -132638, 179392, 53470, -26428, -224132, -17234, -366372, -139726]
12724e7545D4488p007K15562C2889K8027b34688A19530N1223b03386d5807B57703
12712e4266A67820l9916h5557A97770b82035A71672p0450i8041A88289b07174
12701A16444d443l7066A51254a90025A66993c07742D20393C8242K48455A13884
12690A17167B894L10596M5276C9262L20605I7625c44789H8266B6330a02202A36889
12678A91838a2604k42552D12023c8192j31977g2110B62379A29157b51447C28220
12667C50079h2148L6279I8479J98596H6237J91637f4235A27476f2327A67793J53448
12656C21241j18288e771C74241g8395j85726H4189J13328a10029A37383a26763
12645B99310b5061B88104h7907C82599C6590K0180Q1147a59809C05407r1824J21641
$$ y = [-57545, 44488, 37481, 253043, 32889, 60916, -234688, 119530, 170753, -203386, -45807, 257703, -54266, 167820, 127904, -85557, 197770, -282035, 171672, 101222, -98041, 188289, -207174, 116444, -4443, -41509, 151254, -190025, 166993, -307742, 420393, 38242, 286697, 113884, 117167, 2894, 313490, 358766, 39262, 359867, 97625, -344789, 88266, 26330, -102202, 136889, 191838, -12604, -255156, 412023, -38192, -170169, -72110, 262379, 129157, -251447, 328220, 350079, -82148, -45869, 98479, 297075, 86237, 277874, -64235, 127476, -62327, 167793, 321241, 202953, -5771, 374241, -78395, -264121, 84189, 197517, -110029, 137383, -126763, 299310, -25061, 288104, -87907, 382599, 36590, 56770, 137917, -159809, 305407, 213583, 335224]
12634C35224A48883n8902a58577C20680j54199K0059c01746B36615c42849d2056
12623A42446f7873A4645b45672D1547a14985B31196A0095L7704K37595P845G3241
12611b00519D68172A63598R0889N6114J2821A08047a2658A56478d7799A43754
12600i6470q637A53053a92356L5209B21845h590I5078J7503J13792a1925B20912
12588e1946j5837D12640c3602B70228J42936F0202j012i5844a259q0751A66325
12576A88812G9442n110M4812k2471m310C9930Q4473n6405h5370j4982E2310L83381
12564D35691E9103J19820b05395j12080B23479a90988A1016b67181a07584C58528
12553a04811j28684K4574D26292e38381B34745l8415m5131a11003a6111B04690
$$ y = [335224, 148883, 89981, -158577, 320680, 166481, 186540, -301746, 236615, -342849, -42056, 142446, -67873, 14645, -245672, 41547, -114985, 231196, 10095, 47799, 285394, 293239, 73241, -200519, 468172, 163598, 254487, 310601, 323422, 108047, -12658, 156478, -47799, 143754, -96470, -105107, 153053, -192356, -157147, 221845, -8590, 95078, 112581, 226373, -11925, 220912, -51946, -67783, 412640, -33602, 270228, 413164, 60202, 59190, -95844, -1259, -82010, 166325, 188812, 79442, 74332, 119144, 96673, 92363, 39930, 124403, 67998, -85370, -100352, 52310, 435691, 59103, 178923, -205395, -317475, 223479, -190988, 11016, -267181, -107584, 358528, -104811, -233495, -208921, 426292, -538381, 234745, 196330, 151199, -111003, -16111, 204690]
12542H7197f9701q2682B81355c581k20303A13415J85587a59399j05500a25694
12531a0590A29378c7045A7606f5992l354A7408b6712D5332d19447F097d1329k08107
12519b49436j36356B11949i8569c5084a1824A29311i9832l1297a8070o2344k16200
12508b96614h8897A41864b65497O6443O2052O5489n0508j39156a07290D82294
12497f214j8441b176B47213B5880c949m2292k8325C99363a78844A91367q7962
12486A03405a78215J1773F5648i8617r5401K0233m1278L5021B505d76068H2103
12474a68894f7662l89264d8060C29797j0814d284j19464A48965b88618A99757
12463a33253k54849a43969m5206I3701K45806h8301E9768j6978K1266f6653E6708
$$ y = [87197, -69701, -152383, 281355, -3581, -223884, 113415, 299002, -159399, -264899, -125694, -10590, 129378, -37045, 17606, -65992, -69346, 17408, -26712, 45332, -419447, 6097, -41329, -249436, -385792, 211949, -98569, -35084, -11824, 129311, -99832, -131129, -18070, -80414, -296614, -88897, 141864, -265497, -199054, -137002, -71513, -122021, -261177, -107290, 482294, -6214, -24655, -2176, 247213, 25880, -3949, -46241, -74566, 399363, -178844, 191367, 103405, -178215, -166442, 65648, -98617, -194018, -173785, -215063, -180042, 2505, -476068, 82103, -168894, -67662, -456926, -48060, 329797, 318983, -4284, -123748, 148965, -288618, 199757, -133253, -388102, -143969, -189175, 93701, 339507, -88301, 59768, 42790, 64056, -66653, 56708]
12451I4139b3362A10361f3978j31739h8255C738J42707Q8078I8500M7020B7016
12439i8383A89503a27072A75922b4652k32171B14256e0737q6652A42125N1353
12429A93478a29984b5969r7501H499b30083Q8428B6957K1175b45516i7641A25363
12417b5564A45330a3626A23477k8595L1736j0547B5291c0276G0470L68758E2639
12405A1174J88653q9934M15512a25440C19430b01503R3482r129l35963b15544
12394B65748e4607G0716b07531d9391m84k96171I059f7401k06729B14538m115
12383B10423b0431j74575b7694j30135E9738J02924d7272p7725I0535b1323A17779
12371A54563F0723b3230A65528a45574C691J67460H075L44237B8344J2108L34640
$$ y = [94139, -23362, 110361, -63978, -195717, -88255, 3738, 146445, 234523, 98500, 145520, 27016, -98383, 189503, -127072, 175922, -24652, -256823, 214256, -50737, -137389, 142125, 193478, -129984, -25969, -123470, 8499, -230083, -141655, 26957, 48132, -245516, -97641, 125363, -25564, 145330, -13626, 123477, 94882, 126618, 116071, 25291, -30276, 70470, 439228, 52639, 11174, 199827, 109893, 525405, -125440, 319430, -201503, -108021, -117150, -453113, -215544, 265748, -54607, 70716, -207531, -49391, -49875, -346046, 9059, -67401, -274130, 214538, 210423, -20431, -195006, -27694, -157829, 59738, 162662, -47272, -124997, 90535, -21323, 117779, 154563, 60723, -23230, 165528, -145574, 3691, 171151, 8075, 352312, 28344, 40452, 375092]
12360C75092C0313M7000i9656L8218j65647E75399a02123K0007F2422J43984D1534
12348B8501A2643h1670C9114e817I3778d2209j42125e7826j5017b1972j05654
12337a27626D3796J1339M719K12725c9342B05834i7861j50976g7561C44040a2663
12325B84481b52166P8036b0482j18012d5690C58122A28521L4520E7056a38842
12314B60471q8133E4689K99763m5808l309j12781a97531A07040K61059j62240
12304B05859J66422K4185j56427I3370a66744A02035l0440a72040D24727I9423
12293c59017e5207A89508b07635C78315b8955j70747c3790C76688a88392e1530
12282f6948H0146J8611h0570C19067B3928e5228k618A88791q6390g9993A08034
$$ y = [375092, 30313, 77313, -99656, -61438, -227085, 575399, -102123, -82116, 62422, 206406, 41534, 28501, 12643, -81670, 39114, -5817, 93778, -42209, -184334, -57826, -72843, -21972, -127626, 43796, 55135, 59854, 272579, -39342, 205834, -97861, -248837, -77561, 344040, -12663, 284481, -252166, -174130, -20482, -138494, -45690, 358122, 128521, 163041, 57056, -138842, 260471, 172338, 54689, 354452, 308644, 305335, 192554, -197531, 107040, 368099, 205859, 372281, 396466, 240039, 93370, -166744, 102035, 71595, -172040, 424727, 99423, -359017, -55207, 189508, -207635, 378315, -28955, -199702, -33790, 376688, -188392, -51530, -66948, 80146, 98757, -80570, 319067, 23928, -55228, -57846, 188791, 102401, -79993, 108034]
12270A9762K22783J83467a41594D2798J65606G5443J4058a03199F1151j862N2712
12259A12001b305D16648A05951a17341A88217a26351A01491J18430J7744a2787
12248A37548M4571J56930A68965c4257F7695L21375A00927e9524B58567p7297
12238A81270p1685a49340b0948H3699B894P019J18384L11259j03532r5116A15737
12226c895A42719j9227K265L5043e0196B05645n5690A2453b68644A98839O4349
12215B63188A20124a3934B16813p6355R0715C6250A2566f6453B28984B3645K4569
12204D8214N05187A16784J36255l5625m3505O2070a50218A1659K42663G7026a26116
12192A57875L12489A68283P892o5873R6521J81714M7296A54864J88530D4217a45315
$$ y = [19762, 242545, 426012, -141594, 42798, 208404, 75443, 89501, -103199, 61151, 59289, 112001, -2305, 416648, 105951, -117341, 188217, -126351, 101491, 219921, 237665, -12787, 137548, 182119, 339049, 168965, -34257, 67695, 389070, 100927, -59524, 258567, 181270, 109585, -149340, -20948, 83699, 2894, 9913, 128297, 439556, 336024, 240908, 115737, -3895, 142719, 123492, 125757, 160800, -50196, 205645, 149955, 12453, -268644, 198839, 263188, 120124, -13934, 216813, 140458, 231173, 36250, 12566, -66453, 228984, 23645, 48214, 553401, 116784, 253039, 217414, 173909, 235979, -150218, 11659, 254322, 77026, -126116, 157875, 470364, 168283, 176175, 110302, 206823, 388537, 435833, 154864, 343394, 44217, -145315]
12180E28688B15412D4996d8367m3841G4706L4152J3260K15833j63246o9098J36913
12169B42520o8534M732j5288B6039K96539E6984d5337H1928b85168A08278J08320
12158B16598I3936K4734R0379b8927B01823r7379c0849A92049P9731c9485F08300
12146E2247a83316C17399A05087B3672K6668A9983L30993b53410J14645B38213
12135a75121q5348M0961H4197a79887C614a39787A37452j4339b10169i1605A19683
12123C1554f7346C2082J48821n0969R7557d2027q1756d0973j73431n3069A20906
12111F4461a23507a1383A45197J84831A13964E3057J43007d2866E2082M7635O2031
12100A61748b650m4469B04257N1318N572j06052J5206o8034c46159A6068K84500
$$ y = [528688, 215412, 44996, -48367, -92208, 74706, 108858, 122118, 337951, 174705, 105607, 242520, 173986, 178718, 163430, 26039, 322578, 56984, -45337, 81928, -285168, 108278, 216598, 93936, 118670, 209049, -28927, 201823, 104444, -30849, 192049, 271780, -39485, 608300, 52247, -183316, 317399, 105087, 23672, 50340, 19983, 350976, -253410, -138765, 238213, -175121, -260469, -219508, 84197, -179887, 3614, -139787, 137452, 123113, -210169, -91605, 119683, 31554, -67346, 32082, 180903, 129934, 227491, -42027, -123783, -40973, -214404, -267473, 120906, 64461, -123507, -11383, 145197, 330028, 113964, 53057, 196064, -42866, 52082, 99717, 161748, -2650, -47119, 204257, 255575, 261147, 155095, 170301, 102267, -346159, 16068, 300568]
12089C00568A24442i8614B32999g5560A51576b9719m6117A56952J48546J15409
12079D20907j52487q3330D1020L2480J41923o1242O2751M848F4664a37155B25625
12067b42840C1575e1199B95818D9545o103J71655N7417a66740c6850B01464a6157
12055D07669j63161c4827A89035n9180b22315M0871K7567A06009C4479K48133
12045B82612j05656q4648M3688J68730b66317H8746I262a23593m0365B15956A6356
12033a0864j29794A63285J38075g2060A22407P7818a22192j418l7346d9608a0197
12021F6325J02801a63738C5877k42g139r0946B13685a97474m161b5314A63191
12009a79453D793e8306J4283B63837A01937P5448J9773b13765Q0028M9289D9861
$$ y = [300568, 124442, -98614, 232999, -75560, 151576, -29719, -75836, 156952, 305498, 420907, 268420, 185090, 41020, 73500, 215423, 154181, 216932, 221780, 64664, -137155, 225625, -242840, 31575, -51199, 295818, 49545, 43442, 215097, 272514, -166740, -36850, 201464, -16157, 407669, 244508, -34827, 189035, 129855, -222315, -181444, -153877, 106009, 34479, 282612, 176956, 92308, 135996, 304726, -266317, 88746, 9262, -123593, -163958, 215956, 16356, -10864, -140658, 163285, 301360, -72060, 122407, 200225, -122192, -123610, -160956, -49608, -10197, 66325, 169126, -163738, 35877, 35635, -7139, -98085, 213685, -197474, -201635, -25314, 163191, -179453, 4793, -58306, -44023, 263837, 101937, 177385, 197158, -213765, -133737, -84448, 49861]
11997g3649A05195J750c148j64922k06572A36493M9893a96416B21891D4719a20678
11985A60610o2469a30100j49943B69828j20727a07949I3232b83003C4353i904
11974A3998a93544i64l04585r316E1557g4541C7406O5012g8547B62383B6453O2749
11962H9202b16705p7976A04537R2746a50870g4084j20321C5579b23236O6944A70286
11950a89604i0312F4240d1043m8647A68341O9086i9152M1004j40035g0468c0141
11938F0084i7510I254K0498a62743d1377m5670K6795m0412k48621J55123I2693
11926a07080c1362A06009o316J27023G4418b14361B4553J39079a94772A45841
11915C6014b40151I2943K07250f0705A28242d77392H8645K26803A31293h4136
$$ y = [-73649, 105195, 106945, -3148, -168070, -374642, 136493, 186386, -196416, 221891, 44719, -120678, 160610, 98141, -130100, -280043, 269828, 149101, -107949, 93232, -283003, 34353, -9904, 13998, -193544, -964, -305549, -314865, 51557, -74541, 37406, 102418, -78547, 262383, 26453, 89202, -216705, -294681, 104537, 197283, -150870, -74084, -194405, 35579, -223236, -156292, 170286, -189604, -90312, 64240, -41043, -89690, 168341, 237427, -99152, -58148, -198183, -70468, -30141, 60084, -97510, 9254, 29752, -162743, -41377, -87047, -60252, -100664, -349285, -194162, 92693, -107080, -31362, 106009, 99693, 226716, 74418, -214361, 24553, 163632, -194772, 145841, 36014, -240151, 92943, 300193, -60705, 128242, -477392, 88645, 315448, 131293, -84136]
11904A23059A5073a6702p5290k61719a65981A51071d1859G0723c1375e881I1b18237
11891a66942A88256a66488A56302o3252l9119a43282D7206F718b05825D1073J00865
11880A41938O5246a64726m2002A32166a28270J0087A01993a10256A11793j9503
11870I2290c1901j44846I8218g7098B59133R0553G3432b0533G0859J71793e5854
11858a81662k7771g4733j8871O602k2398l70592H9561J9039C4992f8198p3341
11847a41539B53984A23155f0709h174r9077R230A38320a3527p076B33985F1428
11835a49959g4622j51356k25598e5611q36G2953J49092e9794a5186o0917j00987
11824a77090p8927N7499j29998a4094k1401B2699a8048j25963r1857g9353i069
$$ y = [123059, 15073, -16702, -91992, -353711, -165981, 151071, -41859, 70723, -31375, -5881, 91, -218237, -166942, 188256, -166488, 156302, 93050, 53931, -143282, 47206, 6718, -205825, 41073, 141938, 207184, -164726, -206728, 132166, -128270, -118183, 101993, -110256, 111793, 92290, -31901, -176747, 98218, -77098, 259133, 349686, 73432, -20533, 70859, 242652, -55854, -181662, -209433, -74733, -93604, -87002, -109400, -479992, 89561, 108600, 34992, -68198, -141539, 253984, 123155, -60709, -8174, -107251, -98021, 138320, -13527, -20603, 233985, 61428, -149959, -74622, -225978, -451576, -55611, -56447, 72953, 222045, -59794, -15186, -76103, -177090, -256017, -198518, -328516, -14094, -35495, 22699, -18048, -144011, -235868, -79353, -9069]
11812H6125b4332A78626a82796E1361O610A871a10849c1982E620f0791E07230
11800F6323a35365A47175H315b75346B3121J42711f2020j97788O789A89822K27144
11789D16966b46686a02706B9202c26423H7403i9023A52829b79675O5578e6304
11778b47081A0305K8987G32J17577c01591r1673a89011A43916b52443a05600B21055
11766A78799j8685p9989n675N5982c3310I5518a91522A0817b89962A22170K62905
11755C85075E925K26150A937b2432k2223A52104C0292a35154a0142B03092a33969
11743A00605c65897a03575K5877J2753A06655c06060F0749r193a5961r2592F2293
11731B93065D74K00518b28162j18886E5123B0262a06222j73821K7393A69300b4570
$$ y = [86125, -24332, 178626, -182796, 51361, 57971, 1871, -110849, -31982, 5620, -60791, 507230, 66323, -135365, 147175, 8315, -275346, 23121, 165832, -62020, -259808, -253019, 189822, 416966, -246686, -102706, 29202, -326423, 87403, -99023, 152829, -279675, -214097, -56304, -247081, 10305, 39292, 732, 118309, -301591, -393264, -189011, 143916, -252443, -105600, 221055, 178799, 160114, 80125, 74450, 130432, -33310, 95518, -191522, 10817, -289962, 122170, 385075, 5925, 232075, 1937, -22432, -44655, 152104, 30292, -135154, -10142, 203092, -133969, 100605, -365897, -103575, -77698, -64945, 106655, -306060, 60749, 51556, -15961, -108553, 62293, 293065, 474, 200992, -228162, -347048, 55123, 20262, -106222, -280043, -252650, 169300, -24570]
11719b18612A60286J27742g8661A41489E7560a75888A07532K4348h3820H8294
11708f40q2624B56417c99333e2499k25589A46804n9943c642C769a48012B47182
11696C85846a8497F1784B083a57739A1113a35422j89739J03574R9669c9915A30292
11684C23613G6875j3970c14470D0414K44603b2398C04647B9719f7846H4263a13513
11672a24123B66943c8181j89684Q7532C68276j49773J3175C0306K3833J22297
11662A76436H1737a5569C68973A1365h1270B27935K03588A13481A0714L3828L17724
11651C62266I9847a02698d043l6501I6897f9328A39579b5854E5891e7280j09756
11640a67036A47640B0973b2289A7582b77156f1523j16940B36773e2836F9833k5441
$$ y = [-218612, 160286, 288028, -78661, 141489, 57560, -175888, 107532, 131880, -83820, 88294, -640, -83264, 256417, -399333, -52499, -278088, 146804, 86861, -3642, 3769, -148012, 247182, 385846, -18497, 61784, 2083, -157739, 11113, -135422, -325161, -221587, -121918, -39915, 130292, 323613, 76875, 62905, -314470, 40414, 285017, -22398, 304647, 29719, -67846, 84263, -113513, -124123, 266943, -38181, -227865, -140333, 368276, 218503, 231678, 30306, 54139, 176436, 81737, -15569, 368973, 11365, -81270, 227935, 431523, 113481, 10714, 44542, 362266, 99847, -102698, -4043, -40544, 96897, -69328, 139579, -25854, 55891, -57280, -167036, 147640, 20973, -22289, 17582, -277156, -61523, -178463, 236773, -52836, 69833, 44392]
11629D4392D623b78881A48059a13209B8067J88847i3982D1325b2275E6521b13386
11617a27366k40082a11618p9219A62372h6380k50139B39552g815G8265J09336
11607A87601P8433F5622a0097D11429a57007E5504I234K10862a2060A53434a33970
11595H4298F492J51217g4701J5742B49311b37852a13869n7555b7440B3378K4736
11584D8114a26405K2395B20883a07878J3540A97814G7361O0877h3246B8986K72321
11573C01307a43091B60132a55476l466A34757M4270a73860f3815B73621r0431
11563A83190b56371C01405g8736E8244j7894j8357a78064B09615I2962P1124G6854
11551F4303c6488A54357N668k7864a40214A42453a3253B95222A28180h5591B51395
$$ y = [44392, 4623, -278881, 148059, -113209, 28067, 216914, -93982, 41325, -22275, 56521, -213386, -127366, -367448, -111618, -190837, 162372, -86380, -336519, 239552, -7815, 78265, 187601, 266034, 65622, -10097, 411429, -157007, 55504, 9234, 220096, -12060, 153434, -133970, 84298, 6492, 157709, -74701, -58959, 249311, -237852, -113869, -171424, -27440, 23378, 48114, -126405, -104010, 220883, -107878, -94338, 197814, 77361, 138238, -83246, 28986, 301307, -143091, 260132, -155476, -158942, 134757, 179027, -173860, -63815, 273621, 183190, -256371, 301405, -78736, 58244, 40350, 21993, -178064, 209615, 92962, 164086, 76854, 64303, -36488, 154357, 160025, 132161, -140214, 142453, -13253, 295222, 128180, -85591, 251395]
11539F6625K34414k5620E3675a51807c9499o3648C1995A1415R2448a17130D44645
11527E4628a24890d8021D20890B00737f9538A197K06320D4982K51814F2090a9948
11515A28704A9399L87337A71548B6728N7300h5255G1293a06232G258a21005o9291
11504a90296A29548M430a94036n3716d0690j32102b8984B37281j05723C8201A0196
11492G8928b59174C24016j55318h9020j42747A6308e0483A16277L995c04106B31456
11480a43591C9101R948J32617o5956K4576n6598R9829D700R2552f2066B08575
11468A580a48994P3207B12618F9908K76652g9975A80991m9317b39647a13190D85768
11456b9064C09695a75122k5100C77297a77674g2005I6625L50179I4061J84582
$$ y = [66625, 301039, 275419, 53675, -151807, -39499, -103147, 31995, 11415, 103863, -117130, 444645, 54628, -124890, -48021, 420890, 200737, -69538, 1197, 207517, 44982, 296796, 62090, -19948, 128704, 19399, 406736, 171548, 26728, 84028, -85255, 71293, -106232, 7258, -121005, -190296, 129548, 133978, -194036, -247752, -40690, -172792, -28984, 237281, 131558, 38201, 10196, 78928, -259174, 324016, 168698, -89020, -231767, 16308, -50483, 116277, 120272, -304106, 231456, -143591, 39101, 49049, 181666, 115710, 140286, 83688, 183517, 4700, 97252, -62066, 208575, 1580, -148994, -75787, 212618, 69908, 346560, -79975, 180991, 131674, -239647, -113190, 485768, -29064, 309695, -175122, -200222, 377297, -177674, -72005, 96625, 446804, 94061, 278643]
11446B78643e6680j732A06428a97637B25304Q5129a081q7951A2864b81327A00068
11434I5383b13523H3723i2887L0856k1414J6002o3769G5407a07797A17584E8109
11422E8615J3245c9189B24950a91958A81699B1832a08333G6320C6371J71216J48646
11411C56233B4612h8277j78321g9881F6091e3946a7162H1831L46490B06118J68099
11400C74217J45198A27067b05210I7490D3287K38762b42528A93375A5141K4801
11390C9942L0951g5702J940L3219o7106a0096E7457k6357G689a16368M2752b5264
11377a76901E05605A40120Q3555a18311I4992C4431M0978b82706i0525R864A80992
11365a93810q2604b6711k38014d2166o113C35274i0528A53804b83732f8182o7478
$$ y = [278643, -56680, -58412, 106428, -197637, 225304, 310433, -1081, -89032, 12864, -281327, 100068, 95383, -213523, 83723, -92887, -62031, -83445, -67443, -131212, 75407, -107797, 117584, 58109, 58615, 71860, -39189, 224950, -191958, 181699, 21832, -108333, 76320, 36371, 207587, 356233, 24612, -88277, -266598, -79881, 66091, -53946, -17162, 81831, 428321, 206118, 374217, 519415, 127067, -205210, 97490, 43287, 282049, -242528, 193375, 15141, 39942, 70893, -75702, -73762, -40543, -107649, -10096, 57457, 31100, 7689, -116368, -73616, -25264, -176901, 505605, 140120, 223675, -118311, 94992, 34431, 75409, -282706, -90525, -80661, 180992, -193810, -276414, -26711, -264725, -42166, -48279, 335274, -90528, 153804, -283732, -68182, -135660]
11354a35660F0494B3411K7563b92553C8174J51742b31601j66732B59628b07393
11343b7763E9727B8443c9837n5417k699A48153K7131b50880J20392i674A87821
11331B5802b81853J3589A77368a77449b8317n1954I3910F462L14012b86277B11449
11319e406I7810R6901L5384r6205M3443a11371O019p9079Q7A52219A1607b7806
11306a58652j69999F4937K8774l1336b38641a03668A47273F2570a01470A89266
11295H3571c6874l086j884B57874e2169n507C13036D475J64963a1985p050E9553
11282b32754B4723N1388h2231K6130C82934c64463C49247a07692e332k90358A38683
11270A02901N8815b12415c0073I7304m0198b90025j28684b1310k08364c6192j7569
$$ y = [-135660, 60494, 23411, 50974, -292553, 38174, 189916, -231601, -398333, 259628, -207393, -27763, 59727, 28443, -39837, -95254, -97953, 148153, 175284, -250880, -130488, -9674, 187821, 25802, -281853, -268264, 177368, -177449, -28317, -80271, 93910, 6462, 320474, -286277, 211449, -5406, 97810, 194711, 230095, 133890, 177333, -111371, -105352, -184431, -184344, 152219, 11607, -27806, -158652, -328651, 64937, 93711, 62375, -238641, -103668, 147273, 62570, -101470, 189266, 83571, -36874, -39960, -41844, 257874, -52169, -57676, 313036, 4475, 169438, -11985, -19035, 59553, -232754, 24723, 76111, -82231, -56101, 382934, -364463, 349247, -107692, -5332, -295690, 138683, 102901, 161716, -212415, -30073, 97304, 57106, -290025, -418709, -21310, -229674, -36192, -53761]
11259e3761n6021p6928M679N6547o1123k6903Q7530k69884a72940h0138J2656
11248f7482A24586b63294B04961k0509g9466b5022A2769h8749m1634A88079A8158
11236A27118a83847d0548B89042a31536d4409k59683A70449a19922j48137B2721
11225b33420j4265c3619N727B17780d0373j42029K0528c009l57728g7692j18845
11214a96537h6624k27573a04300K7369k04335J13363j10083B11301k7091p5858
11204A08352f5429m8996R086A20215g9435B7300K09119b11381B03511b0381j86619
11193b07000B71373b88334a16250p4708j78651a34582B79664c7700l25932b2215
11182b33260a0182q8474A10771r574b76971k19J26175O8948A64278a12719c0641
$$ y = [-53761, -109782, -186710, -182031, -125484, -186607, -213510, -125980, -395864, -172940, -80138, -67482, 124586, -263294, 204961, 184452, -79466, -25022, 12769, -88749, -130383, 188079, 18158, 127118, -183847, -40548, 289042, -131536, -44409, -304092, 170449, -119922, -268059, 22721, -233420, -247685, -33619, -27892, 217780, -40373, -182402, -161874, -3009, -360737, -77692, -196537, -86624, -314197, -104300, -76931, -281266, -167903, -277986, 211301, 184210, 108352, -65429, -114425, -105339, 120215, -79435, 27300, 236419, -211381, 203511, -20381, -207000, 271373, -288334, -116250, -190958, -369609, -134582, 279664, -37700, -363632, -22215, -233260, -10182, -98656, 110771, 101197, -276971, -277190, -151015, -82067, 164278, -112719, -30641]
11170A59939f3044G6305B671J2086b84175h4365B12645b73967a18175a3980j72815
11159a86795A30232J4536i6091B3683b04679I5233J18000b77428C9587H377J58945
11148A67322N7120c08037A86474b64478A71180d86496d3145J9411G2004B6529
11137b5943C5736g0461l38849B17823n1343p9339e22244a0755p8340l822G1063
11125b17085P9350A59680b9762C8395i7747D2765b23110d557j89669H4501a60268
11113b34065r486a05917k5806A84276M0918E5750O580B6658K5786L9975a96512
11101b58109C71187L1836i2245A5655a21369D60849a12279A58778b21788K9596
11091a92192A83319o6804a8511j61111G1884J67412e1929k2655g452A06375m4338
$$ y = [159939, -63044, 76305, 2671, 14757, -284175, -84365, 212645, -273967, -118175, -13980, -186795, 130232, 144768, -96091, 23683, -204679, 95233, 213233, -277428, 39587, 8377, 167322, 224442, -308037, 186474, -264478, 171180, -486496, -43145, -23734, 72004, 26529, -25943, 35736, -70461, -409310, 217823, 166480, 87141, -522244, -10755, -89095, -92917, 71063, -217085, -137735, 159680, -29762, 38395, -97747, 42765, -223110, -4557, -194226, 84501, -160268, -234065, -243551, -105917, -131723, 184276, 225194, 55750, 62330, 26658, 52444, 92419, -196512, -258109, 371187, 403023, -92245, 15655, -121369, 460849, -112279, 158778, -221788, -192192, 183319, 116515, -18511, -179622, 71884, 239296, -51929, -74584, -7452, 106375, 62037]
11080F2037L20648e3725D4981c7591G3424j8753N3663h737D2329J47310J48792
11069C38431i7288B67596j12716D9211J34067K180f1131A99529J44433A50318
11058B06224p0235D6607K80777h827D11711A37338P1599R9261O3883N7057k03677
11047B25461p6636O2422r7198O27433B32764M8857J44268K32953j38016j85286
11037C35540j23238L83315j80333J42041m2911m7919L49982k43731j41640J39850
11027E70956r8586j48125J65806r4521O8485K68919J01968k7191j92358j39019
11017D76334K64759N8389C11435K23296P7396j00546K43025L3321C77698o1044
11007C16654J21728J26361j32662r1634m534j08583P094P0029O5083j30956J96055
$$ y = [62037, 382685, -53725, 44981, -37591, 73424, 54671, 108334, -8737, 42329, 189639, 338431, -97288, 267596, 154880, 49211, 183278, 185458, -61131, 199529, 343962, 150318, 206224, 135989, 46607, 327384, -8827, 411711, 137338, 208937, 308198, 372081, 429138, 225461, 148825, 211247, 114049, 741482, 232764, 281621, 425889, 658842, 520826, 335540, 212302, 595617, 415284, 557325, 514414, 466495, 816477, 572746, 431106, 570956, 472370, 324245, 490051, 395530, 464015, 732934, 834902, 807711, 615353, 476334, 741093, 799482, 311435, 534731, 612127, 511581, 754606, 787927, 377698, 316654, 438382, 564743, 432081, 340447, 335913, 227330, 234424, 304453, 369536, 238580, 434635]
10996D34635O3196N7344R9435j56067n3156A51516N54128k71047K0785J28099
10986E83481B36236K26750J63677j3345B34100M23274j17090J86398K1131k15735
10976E32078J83280o8712k10749J46854N7089j38180L31448k08428j0101K06017
10966H20596j4015p0230q7544M22175k75257J03559N52334l12242J17811L84597
10956A641784R8666K7681j56776P68263k63761l43294R9261r0586l77033k39785
10946A164420J59724K5720o8411K66060k28456p005J36086K00348k27337N0721
10936A471870j71927K10537m06842k03736k04422p0548L9537k72120o4414B3527
10925E06592A98812E0088M32268B38194I8370k7936R0238i7456A3769J92111b17661
$$ y = [434635, 497831, 555175, 654610, 498543, 445387, 151516, 705644, 434597, 455382, 583481, 236236, 462986, 626663, 613318, 234100, 657374, 540284, 726682, 747813, 532078, 715358, 646646, 435897, 582751, 639840, 501660, 833108, 624680, 614579, 820596, 806581, 736351, 648807, 1070982, 795725, 899284, 1451618, 1139376, 1257187, 1641784, 1740450, 1768131, 1611355, 2379618, 2115857, 1772563, 1871824, 1781238, 1404205, 1164420, 1324144, 1349864, 1281453, 1547513, 1319057, 1312052, 1448138, 1648486, 1421149, 1471870, 1299943, 1510480, 1103638, 899902, 695480, 624932, 664469, 392349, 327935, 23527, 506592, 198812, 50088, 482356, 238194, 98370, 70434, 160672, -97456, 13769, 205880, -217661]
10913a23937A10466m9822a85740B1038h300A48448b1070k2632D5890f9402a8449
10901h2668j18328B61096a55476d5485k05904d4317B3688a3993A9241i2563a0983
10889c00844m0839o5225A21888e0933n720j43194C27412a01919j6790j26537b5240
10877d6442k15324a26024m7208c0033m5553p3686m0358P7297j28175D12132b3404
10865C473J57509G30O3370J69200c5344B9434a79978k53299A84316b40326A36691
10853A25524b6772r7998D2385b77523a21423L7358A90898a75551n1878A44615
10842i6064b3647E8804b0166l57769N3232N8468e5631a9406n6648K7677o2475
10831a10852E9687b8070B38339b21607B05447e1476C50212c8982J9099r4485E7014
$$ y = [-123937, 110466, 60644, -185740, 21038, -8300, 148448, -21070, -43702, 45890, -69402, -18449, -82668, -200996, 261096, -155476, -45485, -251389, -44317, 23688, -13993, 19241, -92563, -10983, -300844, -341683, -406908, 121888, -50933, -56653, -199847, 327412, -101919, -118709, -245246, -25240, -46442, -261766, -126024, -173232, -30033, -75586, -149272, -189630, -112333, -240508, 412132, -23404, 3473, 160982, 730, 64100, 233300, -35344, 29434, -179978, -433277, 184316, -240326, 136691, 125524, -26772, -124770, 42385, -277523, -121423, -84065, 190898, -175551, -227429, 144615, -96064, -23647, 58804, -20166, -377935, -324703, -266235, -55631, -19406, -76054, -48377, -110852, 59687, -28070, 238339, -221607, 205447, -51476, 350212, -38982, -19883, -114368, 57014]
10819d6477I5184J13268a77066n6189I0181d7480j48588F2181a39135A296Q6664
10808H7960N2931b90825J09426G5326d37172a08745L322j8717k50151E76385A03550
10796B2305J99083a27649j55745a20639a5527l4711H6004K53955c12150C44022
10785a99707i326p1993l66057c8217G6141P9067a15750q3110B54747b01632O3359
10774a38273a2264k34494B5409b96075a35125c233j53042k8362A9229K64067c27630
10762f268n6059j19380A09755j7841b21515B63549b65660B50392e8127R331D231
10750B94982M658b93j17467G0228A5933a8790o769p4891p5863E7074g2861Q981
10738f3880j0314l7881k526a3151r6577k13700M5821A20335L2189Q7908a71813
$$ y = [-46477, 95184, 208452, -177066, -233255, 90181, -47480, -196068, 62181, -139135, 1296, 87960, 140891, -290825, -181399, 75326, -437172, -108745, -105423, -124140, -374291, 576385, 103550, 22305, 221388, -127649, -283394, -120639, -15527, -50238, 86004, 339959, -312150, 344022, -199707, -9326, -81319, -447376, -38217, 76141, 155208, -115750, -198860, 254747, -201632, -138273, -12264, -246758, 25409, -296075, -135125, -3233, -156275, -184637, 19229, 283296, -327630, -6268, -62327, -181707, 109755, 91914, -221515, 263549, -265660, 250392, -58127, -48796, 4231, 294982, 299640, -293, -117760, 70228, 15933, -18790, -25559, -100450, -176313, 57074, -72861, -63880, -74194, -112075, -114601, -13151, -109728, -323428, -277607, 120335, 152524, 240432, -171813]
10726I8166J47185C0815a49620b6028q9373A26780b17688A53179Q837J82724b14576
10714a58739A56000F786c42955b5988j9431a5920q9632b1214k19117b0032j85406
10703b05438G6823L1795D6413N6374d6447A31689b38466h7086A80526a80478N8025
10692a22453a8835j99408H7524f7839k1333H3191b98791f9045j60295e8866k82647
10681c41513e1065j94311R9698O0057L8426B05082j0926m6616d25880q5771B00381
10669A1192J53912h3400H2963J29564r9677K7520a64584d9596j78234c0640E9968
10657F0381b04567D749c59226J05996I3162e8635D2924p498J65190F0151b92655
10645a67929g5266j12144e9786J6198j42215e6658o5929j55987J03535B44400
$$ y = [98166, 245351, 30815, -149620, -26028, -115401, 126780, -217688, 153179, 162016, 344740, -214576, -158739, 156000, 6786, -342955, -25988, -45419, -15920, -105552, -21214, -240331, -20032, -205438, 76823, 108618, 46413, 102787, -46447, 131689, -238466, -87086, 180526, -180478, -122453, -18835, -218243, 87524, -67839, -89172, 83191, -298791, -69045, -229340, -58866, -341513, -51065, -245376, -145678, -85621, -47195, 205082, 194156, 147540, -425880, -511651, 200381, 11192, 165104, -83400, 82963, 212527, 112850, 140370, -164584, -49596, -227830, -30640, 59968, 60381, -204567, 4749, -359226, -253230, 93162, -58635, 42924, 35426, 200616, 60151, -292655, -167929, -75266, -187410, -59786, -43588, -185803, -56658, -122587, -278574, -175039, 244400]
10634d07947b7062l66060a32442k4726j19248A89798e42311A09552a16888r2859
10624b09747R0993l3261L7584A01706b6762j72077B4783N2036e1851k61812M177
10613c09486D5938P2451a95788k7324K0427R1154B71048a6891l9216B3330J00297
10602A23627b22568i7174d4844l91609A74071b65701A13245f6863j46632m2423
10592b55918C5555b45273O0549e6802A61187L654b82280f7578c0590m77169J82935
10581c24824E0960g6334A4836c53p9253j24333j22378f665l30678C4974K9342
10570F4316b62701a22359N9109j39043L2962j41311A77198E0976N9955d64671
10559d1613A96556E017K0408J49261a1733r8677G7952M9965h4899B16222A9353
$$ y = [-407947, -27062, -393122, -132442, -157168, -276416, 189798, -542311, 109552, -116888, -209747, -118754, -152015, -114431, 101706, -26762, -198839, 24783, 76819, -51851, -313663, -309486, 45938, 118389, -195788, -223112, -202685, -111531, 271048, -16891, -56107, 23330, 123627, -222568, -97174, -44844, -436453, 174071, -265701, 113245, -66863, -213495, -255918, 35555, -245273, -184724, -56802, 161187, 164841, -282280, -67578, -30590, -507759, -324824, 50960, -76334, 14836, -353, -79606, -203939, -326317, -6665, -337343, 34974, 64316, -262701, -122359, -63250, -202293, -169331, -310642, 177198, 50976, 110931, -464671, -41613, 196556, 5017, 25425, 174686, -11733, -110410, 77952, 127917, -84899, 216222, 19353]
10547I4079P7541k7988d8862B4881K2792K0674h5161k8951p9205A48338a28036
10535F944a06285C06234c27200J31468Q2270A94317c03100j0462A78578a56253
10524F9731d34089J71297f0211p0307q0947R1133A25853a00001p6662A35588d66493
10512b84249a27472j10289j12715g04A15832R4033q5898a4677k10322D6790n80
10501D6210l328a4683l59883J02412e7134I1412a65174j70467c8215A04521A946
10489b46170A28884g3514k42054A6539k340O0232a8856A35607a29016a5808H4683
10477a19817k07788d8617A11160J20434a37732A81693B4952a60306B31648a6919
10466A3209O7913L0502D7907L39795H5667L62063m8409j03230p9386J25543G2395
$$ y = [94079, 171620, 143632, -48862, 24881, 47673, 68347, -85161, -114112, -193317, 148338, -128036, 6944, -106285, 306234, -327200, -195732, -113462, 194317, -303100, -313562, 178578, -156253, 69731, -434089, -262792, -60211, -130518, -211465, -120332, 125853, -100001, -176663, 135588, -466493, -284249, -127472, -237761, -350476, -704, 115832, 209865, 123967, -14677, -224999, 46790, 46210, 42882, -14683, -374566, -272154, -57134, 91412, -165174, -335641, -38215, 104521, 1946, -246170, 128884, -73514, -315568, 16539, 14199, 74431, -18856, 135607, -129016, -15808, 84683, -119817, -327605, -48617, 111160, 231594, -137732, 181693, 24952, -160306, 231648, -16919, 13209, 81122, 111624, 47907, 387702, 85667, 447730, 399321, 296091, 216705, 342248, 72395]
10454F8328B8874J42499a45158A95466Q3892a88075B84826A28522o0561b09031
10443a50621O6870B31163a12131n658r5857I0383a85038M9460j34354d559j83156
10432a87715E3921a41317A8420e7246l89815A17744a62762M5216m9566A95282
10421B00645e7787A111b52565D1320K5630d57986f9346A25419C0599H146a60761
10409a11426j02077a0449l92911A38723F1508R5302k5992a48386b9010b026k28142
10398b30168M4090N4529B6822b47999C2256e3662H8294b10683b7217j45941f5959
10386B21064d8064a1758j21903e2531J9844A72587a67465l0882m6843J2690C359
10374b19205h0237A38264b05455D3824a09012D7392h1379A41770A5964a73937
$$ y = [68328, 28874, 171373, -145158, 195466, 279358, -188075, 284826, 128522, 67961, -209031, -150621, -83751, 231163, -112131, -117789, -213646, 90383, -185038, -135578, -269932, -4559, -187715, 53921, -141317, 18420, -57246, -447061, 117744, -162762, -117546, -167112, 195282, 200645, -57787, 1111, -252565, 41320, 66950, -457986, -69346, 125419, 30599, 8146, -160761, -111426, -213503, -10449, -403360, 138723, 61508, 156810, 130818, -148386, -29010, -2026, -230168, -186078, -131549, 26822, -247999, 32256, -53662, 88294, -210683, -27217, -173158, -65959, 221064, -48064, -11758, -133661, -52531, -32687, 172587, -167465, -198347, -245190, -232500, 3359, -219205, -80237, 138264, -205455, 43824, -109012, 47392, -81379, 141770, 15964, -173937]
10363B23829R9658m0682n0940G7032c6788B28491F6269J30314A932c7865B28896
10351a9350F7354J32126K26517j14979D8438L35812j41374F1183K16834r4097
10341A83920a44336B19693g4764j49900j8576B27062K50963K4559n7998d8333
10330F975L36829j08112J49375b21411C23154j24781n4198m246R6498G4485a58986
10318a59461a3862B29137g356C29203B0882a56795p6808R3846N8135H5719N6574
10307A42293e0048D75767j50734b00919e0268C3489a54533A18739Q6138D4430
10296A19285C6731K40409l6157O3065F4755j9118a54297A79037A9488h724k5650
10285c4374B09824a12380L3280b2685j36885A78044a52981A0084O1081J21014
$$ y = [223829, 323487, 282805, 231865, 77032, -36788, 228491, 66269, 196583, 1932, -37865, 228896, -19350, 67354, 199480, 425997, 311018, 48438, 384250, 242876, 61183, 278017, 183920, -144336, 219693, -74764, -224664, -243240, 227062, 478025, 502584, 444586, -48333, 6975, 343804, 235692, 385067, -221411, 323154, 198373, 144175, 139929, 236427, 74485, -158986, -159461, -13862, 229137, -7356, 329203, 20882, -156795, -233603, -139757, -81622, 85719, 142293, -50048, 475767, 325033, -200919, -50268, 33489, -154533, 118739, 204877, 44430, 119285, 36731, 277140, 240983, 304048, 64755, 45637, -154297, 179037, 19488, -8724, -34374, 209824, -112380, -79100, -22685, -159570, 178044, -152981, 10084, 71165, 192179]
10275A92179a26454c0017A3272b75112a13844C0214J6128a47685F5695g600r8834
10264a06434G1580j0992i7378k66834C0434J11286O0656P063a287G4963k5901
10253D9062J31190d3462B2307b72425J12610A45221d5003k06527B16977C2810
10242D9993g7888D01362H4508L03225j55411r0081K16117r4095G7729C5191e8031
10230F0978O3556D2581d6981n8366a383A32007R5342F9355a60895n3477c5382
10218f7206l95849J35485G6071b8537A57416a73922D4711a98244f2138l85710
10208d47848I2823b74079A4148K66053D3712b17497J0355h8760G4353g8336A5619
10196A50679o3637g2932E3178b58259d814A69960a57670H8816L389a82455I993
$$ y = [192179, -126454, -30017, 13272, -275112, -113844, 30214, 46342, -147685, 65695, -7600, -106434, 71580, 60588, -97378, -364212, 30434, 141720, 202376, 209439, -1287, 74963, 49062, 180252, -43462, 22307, -272425, -159815, 145221, -45003, -251530, 216977, 32810, 49993, -77888, 401362, 84508, 387733, 232322, 142241, 358358, 264263, 77729, 35191, -58031, 60978, 124534, 42581, -46981, -105347, -1383, 132007, 227349, 69355, -160895, -214372, -35382, -67206, -463055, -327570, 76071, -28537, 157416, -173922, 44711, -198244, -62138, -447848, 92823, -274079, 14148, 280201, 43712, -217497, -207142, -88760, 74353, -78336, 15619, 150679, 87042, -72932, 53178, -258259, -4814, 169960, -157670, 88816, 92205, -182455, 9993]
10184E7656k094a77767N3185a5475j72625H4412f135o9426E7788b6604E5008a39973
10171D010b45158B54253h333q9964g220q9240k13087H2803a22741o9321A49290
10159G1024g9803j82388O7831J7700n0696J07785j94240B79942I1615P8085d72047
10147A73838d8506D6586b30710j13038A73200a64428q2139E3483a45908C09603
10136A40378a15896D5470d07808D2592a4233B25257c87635B4643M058K04820f5137
10124c78721a37953l5105j39098F0498a41389j63570k34632H7982a70724h3321
10113a47507k43524A30569a93175L2375k6676L5732F6788h2047r0474F0928L20640
10102C81568F5644A0673b43419A20778d39412e7005k12638G1453E851J35082b31313
$$ y = [57656, 55562, -177767, -124582, -15475, -188100, 84412, -6135, -75561, 57788, -26604, 55008, -139973, 4010, -245158, 254253, -8333, -98297, -7220, -96460, -309547, 82803, -122741, -192062, 149290, 71024, -79803, -262191, -194360, -176660, -227356, -119571, -313811, 279942, 91615, 169700, -472047, 173838, -48506, 46586, -230710, -343748, 173200, -164428, -246567, 53483, -145908, 309603, 140378, -115896, 45470, -407808, 42592, -14233, 225257, -387635, 24643, 28701, 233521, -65137, -378721, -137953, -173058, -312156, 60498, -141389, -304959, -539591, 87982, -170724, -83321, -147507, -391031, 130569, -193175, -160800, -187476, -151744, 66788, -82047, -172521, 60928, 381568, 65644, 10673, -243419, 120778, -439412, -57005, -269643, 71453, 5851, 140933, -231313]
10090c72155a12334A30064b29577A03330a60609B51816a59097P0740r6286d2252
10079G2269K36389e6155q6942M0643q4708A9013J8537J7763n555a71037k3649
10068a94686h6807L7880j58548A00290h5815b9797q8914A04587J6601b58059a24593
10056F6241J11763g7565N074O573j9837k9899L2439l541j18490E1698j7986J1854
10044D5566Q5675g9395B29989m122p6524g0111H2119d0257m8826r6668A23217
10032D9243a04180j02187B28166h4530k36658N2404A7547c3271H4722a57147q6433
10021b43580I9818m678a4256m4494j61268I2069b38966J18045J3320C0818a5596
10009A96874i9522q5936C7622L54902A2786a67405C15371b39030A3403J10438
$$ y = [-372155, -112334, 130064, -229577, 103330, -160609, 251816, -159097, -88357, -184643, -42252, 72269, 308658, -56155, -143097, -102454, -187162, 19013, 37550, 55313, 49758, -171037, -194686, -86807, -48927, -207475, 100290, -85815, -29797, -118711, 104587, 121188, -258059, -124593, 66241, 178004, -77565, -72491, -65918, -85755, -115654, -83215, -86756, -205246, 51698, 33712, 45566, 131241, -79395, 229989, 225867, 149343, -70111, 82119, -40257, -89083, -185751, 123217, 49243, -104180, -206367, 228166, -84530, -321188, -268784, 17547, -33271, 84722, -157147, -243580, 99818, 95140, -14256, -58750, -220018, 92069, -238966, -120921, -107601, 30818, -15596, 196874, -99522, -185458, 37622, 392524, 12786, -167405, 315371, -239030, 13403, 123841]
9999A23841d8551A70782g4087A07761a7190l7614A67355D0550h5747a1535j19451
9988a30986j4349j20550J5288O9249M0892h709A35998n3891b10684A94894I1048
9976A3712b25183d3257j5938m53687e051E6828A9147h390k20461f5983o6459J3068
9964a19374e6295B5569e63428C9569i1799n6654H0581K61825f8217j6592c2814
9952B94092a65947o1694d7124H2349b43876G5229J4618b33170e8355m4198q3705
9941a86258h0216l12655c6987k13137a1269C09595j34281l7004j9003b77468b4820
9929i2112M947m6305O3359b6952D762e2722K4332A75360A7619a25282o2845A07453
9916i3346c7767l25002a69927B64124c23720B44950a11269k53523I0788P1926
$$ y = [123841, -48551, 170782, -74087, 107761, -17190, -54804, 167355, 40550, -85747, -11535, -130986, -145335, -265885, -250597, -181348, -140456, -8709, 135998, 82107, -210684, 194894, 91048, 13712, -225183, -43257, -59195, -512882, -5051, 56828, 19147, -8390, -228851, -65983, -132442, -119374, -56295, 25569, -563428, 39569, -91799, -148453, 80581, 342406, -68217, -84809, -32814, 294092, -165947, -227641, -47124, 82349, -243876, 75229, 89847, -233170, -58355, -102553, -186258, -80216, -392871, -36987, -250124, -11269, 309595, 175314, 138310, 119307, -277468, -24820, -92112, -87165, -133470, -70111, -26952, 4762, -52722, -28390, 175360, 17619, -125282, -188127, 107453, -93346, -37767, -362769, -169927, 264124, -323720, 244950, -111269, -364792, 90788, 162714]
9906A62714b61188B06669H7521b1681o0898H8834c17656a41021F7780A2027h6261
9894b95848j12967a7258o1181q7756D8300e01562J57050A01676f21185b44037
9883b47895o5192J2254E3137b77758c0258A95766B1021a35342M3792C3622b61979
9871i2493F7470a3057l02292e5622k3612k93773a78973a7818k637p63l84940C71738
9858b54900d5791q7505B7404b14830I6493J29788i0705b1063j53101C4496L46126
9847C80622d37161g9761j14986h1722A40289J00213a25225B2261a58773P8617
9837h0156m3544j37362J13112e9197k13119h0284o5744n4690B48824g9996o9656
9826a49652H4857A079d6382j38045C7360a76006A45032e7038A57468a76243k0191
$$ y = [162714, -261188, 206669, 87521, -21681, -82579, 88834, -317656, -141021, 67780, 12027, -86261, -295848, -408815, -17258, -78439, -166195, 48300, -501562, -344512, 101676, -621185, -244037, -247895, -313087, -300833, 53137, -277758, -30258, 195766, 21021, -135342, -91550, 33622, -261979, -92493, 67470, -13057, -315349, -55622, -79234, -373007, -178973, -17818, -20455, -21218, -406158, 371738, -254900, -45791, -133296, 27404, -214830, 96493, 226281, -90705, -21063, -174164, 34496, 380622, -437161, -79761, -194747, -81722, 140289, 240502, -125225, 22261, -158773, -80156, -123700, -261062, -147950, -59197, -272316, -80284, -146028, -200718, 248824, -79996, -149652, 84857, 1079, -46382, -184427, 37360, -176006, 145032, -57038, 157468, -176243, -196434]
9815a96434e0424A64127B3211a58171j65301J34406h2778j40711l7719P9051N4503
9804a27654C5780O8373l8536a75365A41763P865i479N7l8620B56669c1724l06819
9792c38543a21735B69858j5088c9107A20675a1913l63072j859c597k15121P3792
9781a44926c5601l6405q5392A64527b20305B7193N5214b74833G6008l5032a03550
9769a03353q857A87072d53291F6654J70765d00073a03966B10151b95097P6480
9759b18617A94434a66881J9686p2685A47643B1023a13688k04899L3698B23398
9748b45725E5817J4922K593c96785i1812p5522J1111N6808l38221A72616b84809
9736b22813B3584a92838B3377L56177b73603J20491A55471a44446J6411b3373
$$ y = [-196434, -50424, 164127, 23211, -158171, -323472, -189066, -82778, -223489, -261208, -182157, -127654, 35780, 104153, 65617, -175365, 141763, 149628, -9479, -9422, -48042, 256669, -31724, -338543, -121735, 269858, 254770, -39107, 120675, -11913, -374985, -376844, -3597, -218718, -144926, -35601, -72006, -157398, 164527, -220305, 27193, 82407, -274833, 76008, 40976, -103550, -103353, -112210, 187072, -453291, 66654, 237419, -400073, -103966, 210151, -295097, -218617, 194434, -166881, -147195, -219880, 147643, 21023, -113688, -318587, -284889, 223398, -245725, 55817, 70739, 73332, -396785, -91812, -167334, -156223, -99415, -437636, 172616, -284809, -222813, 23584, -192838, 23377, 379554, -273603, -153112, 155471, -144446, -128035, -23373]
9725c59573a18117C3607c6370G0361p962M8669d2457A1144a53218o1914q9603
9714c04735R692J35936e3866B93491A25263O92d21341a54347J9332k9366A37832
9702d98761H6476O3890d0684j07062c8121B68730a54907J932G232b97897i4092
9690a26786F4584J71779d04733I9344L5992b0572j67415l2446O8439k63762J62162
9679b53594B26805a96976h1796E7828a98365H9220N2682e6397k781q7127k49518
9668c95823B07887a6745j50535a8633d367j42278k9430C0714O4725b25726k0937
9657b46663A07837g6749j37708G7826a71739g210k22452N6853l9076Q6429C7310
9645G2574a70540l4421B2366a7011q000h971j19523j52880q5837a47676l4449
$$ y = [-359573, -118117, 33607, -36370, 70361, 62399, 111068, -42457, 11144, -153218, -215132, -304735, -295043, -159107, -53866, 293491, 125263, 125955, -421341, -154347, -135015, -164381, 137832, -498761, 86476, 150366, -40684, -147746, -38121, 268730, -154907, -152975, 7232, -297897, -94092, -126786, 64584, 236363, -404733, 99344, 135336, -20572, -187987, -220433, -151994, -415756, -253594, 226805, -196976, -81796, 57828, -198365, 89220, 141902, -56397, -59178, -146305, -395823, 207887, -16745, -167280, -18633, -4367, -146645, -176075, 30714, 95439, -225726, -246663, 107837, -76749, -214457, 77826, -171739, -7210, -229662, -172809, -211885, -125456, 37310, 72574, -170540, -204961, 22366, -17011, -25011, -8971, -128494, -281374, -367211, -147676, -182125]
9634a82125D9608g6778l5707F7680b09254h7963b7836B40180b38081A12433a80917
9622d3585j70673h4845A0756e330A37442a89250D3488J27578h107k4560B151a35862
9609A50564B1942c27578B0502O262b2507j34639d2765j90655F7639l0125b0262
9597F5351a07685a0509j98561h5404K8890E6112a68148l2645A678b80604J34858
9586a45746o8011C5813b21772j03404J18238P5714C1118d9146l48678a56468j68560
9575c25028I215O7676c20421J29787f9955a3214j28686B2260a66914g0887A74357
9563a33787B51943a96478O6924j74575f5229j81674a12846c9272o0273K160k51134
9552c48519J13379h9761p296j11854B10237K19c34159a6417k85753J22686l2692
$$ y = [-182125, 49608, -76778, -112485, 67680, -209254, -87963, -27836, 240180, -238081, 112433, -180917, -43585, -214258, -84845, 10756, -5330, 137442, -189250, 43488, 171066, -8107, -32667, 2151, -135862, 150564, 21942, -327578, 20502, 26764, -22507, -157146, -42765, -233420, 67639, 37514, -20262, 65351, -107685, -10509, -209070, -85404, -56514, 56112, -168148, -200793, 1678, -280604, -145746, -213757, 35813, -221772, -325176, -206938, -131224, 31118, -49146, -397824, -156468, -325028, 9215, 76891, -320421, -190634, -69955, -13214, -141900, 22260, -166914, -70887, 174357, -133787, 251943, -196478, -129554, -304129, -65229, -246903, -112846, -39272, -99545, -97385, -348519, -235140, -89761, -97057, -208911, 210237, 210456, -334159, -16417, -302170, -179484, -212176]
9541b12176m5904B7197b67499M7067a09429l4062K2029B93709e9014B46887r0130
9530A56757a61310g7077J7287r4821K4349A61456a96103e5424D5597d25343F4915
9518a37202R327I9916g2294A79671P6142F9187J42492b12223A73377p4397a45335
9506a59516c1509B85578e3589j85601g8761k4074D4737M1539A0196a09759I5270
9494b43053K2297d872A48599g7686h722A61457b67578J25830A34936F6105B8298
9482b00399f0105k72892A3488a25879J1103B42a60069f608E0544J98981M408G9055
9469a51196B84306a35929j57236m4377A16458b57642a16082L1648c6003A20362
9458E2462c68044A01911P5521C5794L0792J41739d8176q34I9994b90156J20672
$$ y = [-212176, -258080, 27197, -267499, -220432, -109429, -143491, -121462, 293709, -59014, 246887, 156757, -161310, -77077, -59790, -154611, -130262, 161456, -196103, -55424, 45597, -425343, 64915, -137202, -127875, 99916, -72294, 179671, 255813, 69187, 211679, -212223, 173377, 98980, -145335, -159516, -31509, 285578, -53589, -239190, -78761, -102835, 44737, 86276, 10196, -109759, 95270, -243053, -220756, -4872, 148599, -77686, -8722, 161457, -267578, -141748, 134936, 66105, 28298, -200399, -60105, -332997, 13488, -125879, -114776, 242, -160069, -6608, 50544, 249525, 253933, 79055, -151196, 284306, -135929, -293165, -337542, 116458, -257642, -116082, -84434, -36003, 120362, 52462, -368044, 101911, 177432, 35794, 66586, 208325, -48176, -49010, 99994, -290156, -169484]
9447a69484D1717Q382m663r045a91725Q0613C1453a98417j24863h0980K4171A30456
9434a44232A15454A0159Q9193c93385J34459J3800J22201q1300q9458a42825j77404
9423c20229B78927E1126b54655E4013i4977c0319q4352m33613K41123A73271h9065
9411I8411d3982A9393P1421m2045l980g7432j15766h6673j08849e7691A72298
9399A02927h0900B1040J06417K29827a59257a4224p5660j32437f6788o7059j3452
9388a47299n8176m853b6976k27215j92203J81793d2858B25561a68354b1152k0674
9377d1826A8131M5927a02600H7213c59723a60329b3754A58474b75769M8426f8600
9365c71456K8167P1397q5822i0620k26574a00180B06902E3683j8407b130o76j56885
$$ y = [-169484, 41717, 50099, 45436, 36391, -191725, -111112, 31453, -198417, -323280, -80980, -56809, 130456, -144232, 115454, 10159, 99352, -393385, -258926, -245126, -122925, -204225, -293683, -142825, -320229, 278927, 51126, -254655, 54013, -94977, -30319, -114671, -548284, -307161, 173271, -89065, 98411, -43982, 19393, 90814, 48769, 44789, -77432, -193198, -86673, -195522, -57691, 172298, 102927, -80900, 21040, 127457, 357284, -159257, -14224, -89884, -222321, -66788, -133847, -147299, -205475, -210328, -26976, -254191, -446394, -264601, -42858, 225561, -168354, -21152, -41826, 18131, 64058, -102600, 87213, -359723, -160329, -23754, 158474, -275769, -227343, -68600, -371456, -343289, -271892, -357714, -90620, -317194, -100180, 206902, 53683, 35276, -2130, -2806, -159691]
9353a59691c7184D1711a85678A26553b13586e2928j58167j5313P0721A1698d9053
9341f6591K2225n4835n0211E3894N8940b1668D8913A7598J77345A4791K16861
9330B31652e6761j14565C9171a94333A34364e0471p811A854O0683c48546A14312
9318i4423j12470A94117q2518f9209F9028d5013C4369b39929P6034b7734C15114
9306a69611A82335m7164b72850F5329g5596j30298B4463b26927b0404A09222d02108
9294b07700d6248j0461l15569i7240m02523A75618F957a89578O1247e4496I4381
9282H9198a61581k5594h5007J1588n764j37960A85325j9005a6748l9860k6447
9271h3055k17069C08721g3420Q469L341A99026c1420r048A06578a82420a9826
$$ y = [-159691, -37184, 41711, -185678, 126553, -213586, -52928, -211095, -226408, -155687, 11698, -49053, -66591, -44366, -99201, -149412, 53894, 112834, -21668, 48913, 17598, 194943, 14791, 231652, -56761, -171326, 39171, -194333, 134364, -50471, -58282, 1854, 62537, -348546, 114312, -94423, -206893, 194117, 111599, -69209, 69028, -45013, 34369, -239929, -163895, -27734, 315114, -169611, 182335, 135171, -272850, 65329, -75596, -205894, 24463, -226927, -20404, 109222, -402108, -207700, -46248, -56709, -372278, -97240, -499763, 175618, 6957, -189578, -128331, -54496, 94381, 89198, -161581, -187175, -85007, -73419, -79183, -217143, 185325, 166320, -16748, -56608, -83055, -300124, 308721, -73420, -64951, -61610, 199026, -31420, -40468, 106578, -182420, -19826]
9259H958Q5370a24277D73228b32517j50230a62499G8944J05286d50880a01078
9248a90847g8159C0323a71290B43138I1052b51869n0878A18427k0600D4472a78010
9236b93449b3451l07646g224j29858R790A92825a91699B61986b72941b0302j10309
9225a30611C4795A480a97680B07325b59954A37932a60010C1286J72897a72274
9214A32149D52b29908b1447l53027a62937A67739a44860j2612B85541a19146k9299
9203a48445M1861j68641C5264J75891e821A1375J38613a42267B87920i6855A76971
9191d54755a41364B40830A06458c9164j64330A08100i2678k02850c6696G1236
9180d11939J87828D2248h7038j02281G8078j0684c66863C56892a37186M8367c1407
$$ y = [8958, 94328, -124277, 473228, -232517, -382747, -162499, 78944, 184230, -450880, -101078, -190847, -78159, 30323, -171290, 243138, 91052, -251869, -302747, 118427, 97827, 44472, -178010, -293449, -23451, -331097, -7224, -137082, -127292, 192825, -191699, 261986, -272941, -20302, -130611, 34795, 1480, -197680, 207325, -259954, 137932, -160010, 31286, 204183, -172274, 132149, 452, -229908, -21447, -374474, -162937, 167739, -144860, -157472, 285541, -119146, -148445, -106584, -275225, 35264, 211155, -5821, 11375, 149988, -142267, 287920, -96855, 176971, -454755, -141364, 240830, 106458, -39164, -203494, 108100, -92678, -295528, -36696, 71236, -411939, -224111, 42248, -87038, -189319, 78078, 67394, -366863, 356892, -137186, -88819, -31407]
9168A31986b9980q2282k377h381m9213J6968F390e4439j5602m65855a33668h894
9155a90684H6374i0406a106k8224l10534A16111a2072B3321c27913f644B06035
9143a31106K8994j58640Q3915j11110l4963g1693C9604N4703L6683d0281A42291
9131C0702e545I8712d74454A1578a26869I7696h4774a1958n83776a45046A47043
9119A03649c84634i9291A39275c22071C458g046k6571j68101P2338N3786G6218
9107D3415a85367A86358q644k8391a6344A85195l0785K3148D92a14934J0190K2866
9095h1878p8566N7948j73086Q4274A65063a92162e5106m8879G0793i8149B02857
9083a11437A86715r1569a55376j72133n2495P1367C4732c30523a63573a3571j73341
$$ y = [131986, -29980, -112262, -114639, -8381, -57594, -40626, 6390, -54439, -70041, -535896, -133668, -8894, -190684, 86374, -90406, -1106, -29330, -339864, 116111, -12072, 23321, -327913, -6644, 206035, -131106, -102112, -260752, -176837, -287947, -322910, -71693, 39604, 94307, 130990, -40281, 142291, 30702, -5545, 98712, -474454, 11578, -126869, 97696, -84774, -11958, -595734, -145046, 147043, 103649, -384634, -99291, 139275, -322071, 3458, -7046, -33617, -201718, -129380, -75594, 76218, 43415, -185367, 186358, 177714, 149323, -16344, 185195, 154410, 177558, 492, -114934, -104744, -81878, -160444, -102496, -275582, -191308, 165063, -192162, -55106, -103985, 70793, -98149, 202857, -111437, 186715, 95146, -155376, -327509, -380004, -308637, 34732, -330523, -163573, -13571, -186912]
9072a86912e6814q2105F4371O4637g9017G0891d1337A62439d6270q8653l8976
9061a73899A22994a3969k942l64836g1235q6787C8144J89210a30304k31642a05694
9049i9422r7159n6755E2096b17970A4630i4422C05506a5348k39634A04070c62637
9037d2770j25035l222C65555c47037H9156d3085k18264B55073a46520j41797A93706
9025f9514j3928H4116l5150a20136C3552P8910h1273j04578C6035d780m5498k17993
9013b68271A74766a56562l4409A58777g7118I4323m1562g4772l7543J0249j23624
9002b25690a9232q2095A63242a1377A73918c23291f5830r972k00687J4655A51687
8990c01736J40375C70905a48961k01515B29411j13361d3318k90335k7685B18015
$$ y = [-186912, -56814, -138919, 64371, 129008, -79017, 70891, -41337, 162439, -46270, -134923, -173899, 122994, -13969, -16911, -381747, -71235, -158022, 38144, 227354, -130304, -361946, -105694, -99422, -196581, -253336, 52096, -217970, 14630, -94422, 305506, -15348, -254982, 104070, -362637, -42770, -167805, -171027, 365555, -347037, 89156, -43085, -261349, 255073, -146520, -288317, 193706, -69514, -83442, 84116, 48966, -120136, 33552, 112462, -81273, -185851, 36035, -4780, -50278, -268271, 174766, -156562, -190971, 158777, -77118, 94323, 52761, -74772, -112315, -102066, -225690, -19232, -101327, 163242, -11377, 173918, -323291, -65830, -75802, -276489, -261834, 151687, -301736, -161361, 370905, -148961, -350476, 229411, 116050, -43318, -333653, -361338, 218015]
8979i9138A17111a38015B34347b27534L4637d1847j194C3192e6877G3843d3829
8967c9205j04361M3005m6293k65324J87867c4419f417j24434q3764R9252H0403
8955A06523K05145B5942J11333a18520C1927J43394C8113o340Q9318F500J28880
8944A35380P2706c06431C39633a56631g3354j95798m326O8963c777A14441c8933
8932b45617H7975d27874a87927g3480f297o4700l66342a09872L8337D9549b86487
8920I5130a24752A32653a19246M7167A49090q536a42016c3446C34866r6454j00265
8909A38147L57301Q8558L12606M29318J241577K741125L495455C965117j890676
8900B074441q02330F13863A84226q893e6421P466a6952F8451j0172K12289j10135
$$ y = [-99138, 117111, -138015, 234347, -227534, -192897, -41847, -43041, 33192, -56877, 73843, -43829, -39205, -143566, -100561, -146854, -412178, -224311, -34419, -6417, -130851, -214615, -115363, 80403, 106523, 311668, 25942, 137275, -118520, 31927, 175321, 38113, 31773, 121091, 6500, 135380, 208086, -306431, 339633, -156631, -73354, -269152, -273478, -204515, -3777, 114441, -38933, -245617, 87975, -427874, -187927, -73480, -6297, -70997, -437339, -109872, -71535, 49549, -286487, 95130, -124752, 132653, -119246, -72079, 149090, 140554, -142016, -33446, 334866, 238412, 138147, 495448, 584006, 896612, 1325930, 2567507, 5308632, 8804087, 3965117, 2074441, 1272111, 613863, 184226, 175333, -56421, -48955, -16952, 68451, 58279, 270568, 160433]
8889A60433n247D1472J73809b64408a07645n8477A28969b61690P0949C22210f2001
8877B4453J76553o9239i3911q4746h1391a8194j23161e5645K2047k21790a19295
8865f7250B16814p7785a15505A74992E6793a29215N0658H9206k0773a50649k05630
8854c56279a0634l39264I8719R3649J63452c4623A74061a02653B63395b29030
8843A62319a19127B04424p0119B438J2594J13556a14472a7388E9832J56854c43279
$$ y = [160433, 155186, 41472, 215281, -264408, -107645, -166122, 128969, -261690, -190741, 322210, -62001, 24453, 201006, 131767, -93911, -178657, -81391, -18194, -141355, -55645, -33598, -255388, -119295, -67250, 216814, 139029, -115505, 174992, 56793, -129215, -78557, 89206, 68433, -150649, -356279, -10634, -349898, 98719, 192368, 355820, -34623, 174061, -102653, 263395, -229030, 162319, -119127, 204424, 134305, 2438, 15032, 128588, -114472, -17388, 59832, 216686, -343279]
$$ [...]
##END NTUPLES=NMR SPECTRUM
##END=
