
##TITLE=AC1181_Huila-garzon-HGAAH12023_5891040_qiIiRi2dS3
##JCAMPDX= 6.0         $$ Bruker NMR JCAMP-DX V2.0
##DATA TYPE= NMR SPECTRUM
##DATA CLASS= NTUPLES
##ORIGIN= BRUKER
##OWNER= Administrator
$$ 1.72 TOPSPIN		Version 2.1
$$ 2012-04-02 20:24:00.703 -0500  Administrator@TOPSPIN
$$ Compression mode = diff/dup
##.OBSERVE FREQUENCY= 400.13188235
##.OBSERVE NUCLEUS= ^1H
##.ACQUISITION MODE= SIMULTANEOUS (DQD)
##.ACQUISITION SCHEME= undefined
##.AVERAGES= 64
##.DIGITISER RES= 22
##SPECTROMETER/DATA SYSTEM= spect
##.PULSE SEQUENCE= noesygpps1d.comp
##.SOLVENT NAME= COFFEE_meoh
##.SHIFT REFERENCE= INTERNAL, COFFEE_meoh, 1, 14.96825
##AUDIT TRAIL= $$ (NUMBER, WHEN, WHO, WHERE, PROCESS, VERSION, WHAT)
$$ ##TITLE= Audit trail, TOPSPIN		Version 2.1
$$ ##JCAMPDX= 5.01
$$ ##ORIGIN= Bruker BioSpin GmbH
$$ ##OWNER= Administrator
$$ $$ C:\Bruker\TOPSPIN/data/COFFEE/nmr/AC1181_Huila-garzon-HGAAH12023_5891040_qiIiRi2dS3/12/pdata/1/auditp.txt
$$ ##AUDIT TRAIL=  $$ (NUMBER, WHEN, WHO, WHERE, PROCESS, VERSION, WHAT)
(   1,<2012-04-02 20:23:55.187 -0500>,<Administrator>,<TOPSPIN>,<go>,<TOPSPIN 2.1>,
      <created by zg
	started at 2012-04-02 20:12:22.937 -0500,
	POWCHK enabled, PULCHK disabled,
       configuration hash MD5:
       1A 1E CE 29 27 FD 77 03 67 4E F0 E3 C4 B2 CB 90
       data hash MD5: 64K
       12 FA 0F C5 37 9E 7E 8B 73 12 FD ED 70 40 E0 60>)
(   2,<2012-04-02 20:23:58.328 -0500>,<Administrator>,<TOPSPIN>,<proc1d>,<TOPSPIN 2.1>,
      <Start of raw data processing
       efp LB = 0.3 FT_mod = 6 PKNL = 1 PHC0 = 0 PHC1 = 0 SI = 128K 
       data hash MD5: 128K
       7D 7D 67 35 4A C1 A1 1E 5F 37 E6 BD 06 5B 96 0F>)
(   3,<2012-04-02 20:23:59.750 -0500>,<Administrator>,<TOPSPIN>,<proc1d>,<TOPSPIN 2.1>,
      <pk PHC0 = 36.39771 PHC1 = 0 
       data hash MD5: 128K
       AA FD 7C 1C B0 78 D9 9D AD C1 73 05 42 7F 00 6E>)
(   4,<2012-04-02 20:24:00.062 -0500>,<Administrator>,<TOPSPIN>,<proc1d>,<TOPSPIN 2.1>,
      <abs ABSG = 1 
       data hash MD5: 128K
       7E A6 C6 60 7E C9 E4 45 88 0B 7B 76 23 80 29 39>)
(   5,<2012-04-02 20:24:00.281 -0500>,<Administrator>,<TOPSPIN>,<proc1d>,<TOPSPIN 2.1>,
      <abs ABSG = 2 
       data hash MD5: 128K
       FD 4E 86 0D 0F 44 6C 35 86 32 8B 3E 77 A4 6C E3>)
(   6,<2012-04-02 20:24:00.453 -0500>,<Administrator>,<TOPSPIN>,<proc1d>,<TOPSPIN 2.1>,
      <abs ABSG = 3 
       data hash MD5: 128K
       42 EA 74 1E B2 34 28 D3 F0 3B 08 C0 8E FE 9F AF>)
(   7,<2012-04-02 20:24:00.515 -0500>,<Administrator>,<TOPSPIN>,<proc1d>,<TOPSPIN 2.1>,
      <abs ABSG = 4 
       data hash MD5: 128K
       AE 86 95 0D 05 13 A3 79 A6 17 4A DD DE B9 6C 10>)
(   8,<2012-04-02 20:24:00.593 -0500>,<Administrator>,<TOPSPIN>,<proc1d>,<TOPSPIN 2.1>,
      <abs ABSG = 5 
       data hash MD5: 128K
       0E 24 84 27 FE DB 82 3A C7 C3 A0 FB 51 F1 29 0E>)
$$ ##END=
$$ 
$$ $$ hash MD5
$$ $$ C0 26 98 AC 04 72 9C 49 26 A0 C3 D6 DF D4 48 A9
##$RELAX= 
##$RELAX= 
##$RELAX= 
##$RELAX= 
##$RELAX= 
##$RELAX= 
##$RELAX= 
##$RELAX= 
$$ [...]
##$TP07= 0
##$TPNAME0= <>
##$TPNAME1= <>
##$TPNAME2= <>
##$TPNAME3= <>
##$TPNAME4= <>
##$TPNAME5= <>
##$TPNAME6= <>
##$TPNAME7= <>
##$TPOAL= (0..7)
0.5 0.5 0.5 0.5 0.5 0.5 0.5 0.5
##$TPOFFS= (0..7)
0 0 0 0 0 0 0 0
##$TUNHIN= 0
##$TUNHOUT= 0
##$TUNXOUT= 0
##$USERA1= <user>
##$USERA2= <user>
##$USERA3= <user>
##$USERA4= <user>
##$USERA5= <user>
##$V9= 5
##$VALIST= <valist>
##$VCLIST= <CCCCCCCCCCCCCCC>
##$VD= 0
##$VDLIST= <DDDDDDDDDDDDDDD>
##$VPLIST= <PPPPPPPPPPPPPPP>
##$VTLIST= <TTTTTTTTTTTTTTT>
##$WBST= 2048
##$WBSW= 25
##$XGAIN= (0..3)
0 0 0 0
##$XL= 0
##$YL= 0
##$YMAX_a= 12585721
##$YMIN_a= -5987003
##$ZGOPTNS= <>
##$ZL1= 120
##$ZL2= 120
##$ZL3= 120
##$ZL4= 120
##$ABSF1= 14.96825
##$ABSF2= -5.58428
##$ABSG= 5
##$ABSL= 3
##$ALPHA= 0
##$AQORDER= 0
##$ASSFAC= 0
##$ASSFACI= 0
##$ASSFACX= 0
##$ASSWID= 0
##$AUNMP= <proc_prof1d_extract.lims>
##$AXLEFT= 0
##$AXNAME= <>
##$AXNUC= <1H>
##$AXRIGHT= 0
##$AXTYPE= 0
##$AXUNIT= <>
##$AZFE= 0.1
##$AZFW= 0.1
##$BCFW= 0
##$BC_mod= 0
##$BYTORDP= 0
##$COROFFS= 0
##$CY= 15
##$DATMOD= 1
##$DC= 0
##$DFILT= <>
##$DTYPP= 0
##$F1P= 0
##$F2P= 0
##$FCOR= 0.5
##$FTSIZE= 131072
##$FT_mod= 6
##$GAMMA= 0
##$GB= 0
##$INTBC= 1
##$INTSCL= 1
##$ISEN= 128
##$LB= 0.3
##$LEV0= 0
##$LPBIN= 0
##$MAXI= 10000
##$MC2= 0
##$MEAN= 0
##$ME_mod= 0
##$MI= 0
##$NCOEF= 0
##$NC_proc= -3
##$NLEV= 6
##$NOISF1= 0
##$NOISF2= 0
##$NSP= 0
##$NTH_PI= 0
##$NZP= 0
##$OFFSET= 14.96825
##$PC= 1
##$PHC0= 36.39771
##$PHC1= 0
##$PH_mod= 1
##$PKNL= yes
##$PPARMOD= 0
##$PPDIAG= 0
##$PPIPTYP= 0
##$PPMPNUM= 2147483647
##$PPRESOL= 1
##$PSCAL= 4
##$PSIGN= 0
##$PYNMP= <proc.py>
##$REVERSE= no
##$SF= 400.130004947894
##$SI= 131072
##$SIGF1= 0
##$SIGF2= 0
##$SINO= 400
##$SIOLD= 131072
##$SPECTYP= <>
##$SREGLST= <1H.CDCl3>
##$SSB= 0
##$STSI= 131072
##$STSR= 0
##$SW_p= 8223.68421052632
##$SYMM= 0
##$S_DEV= 0
##$TDeff= 65536
##$TDoff= 0
##$TI= <>
##$TILT= no
##$TM1= 0
##$TM2= 0
##$TOPLEV= 0
##$USERP1= <user>
##$USERP2= <user>
##$USERP3= <user>
##$USERP4= <user>
##$USERP5= <user>
##$WDW= 1
##$XDIM= 131072
##$YMAX_p= 508563203
##$YMIN_p= -420632848
##$CURPLOT= <Network HP LaserJet P1505>
##$CURPRIN= <$Network HP LaserJet P1505>
##$DFORMAT= <normdp>
##$LAYOUT= <+/1D_H.xwp>
##$LFORMAT= <normlp>
##$PFORMAT= <normpl>
##$SURQMSG= 1
$$ End of Bruker specific parameters
$$ ---------------------------------
##NTUPLES= NMR SPECTRUM
##VAR_NAME=  FREQUENCY,     SPECTRUM/REAL,   SPECTRUM/IMAG
##SYMBOL=    X,             R,               I
##VAR_TYPE=  INDEPENDENT,   DEPENDENT,       DEPENDENT
##VAR_FORM=  AFFN,          ASDF,            ASDF
##VAR_DIM=   131072,        131072,          131072
##UNITS=     HZ,            ARBITRARY UNITS, ARBITRARY UNITS
##FACTOR=    0.0627417313425165, 1,          1
##FIRST=     8223.62146879498, -387,         -88954
##LAST=      0,             1908,            -89126
##MIN=       0,             -420632848,      0
##MAX=       8223.62146879498, 508563203,    0
$$ Real data points
##PAGE= N=1
##DATA TABLE= (X++(R..R)), XYDATA
$$ [...]
66880 2689546 2721763 2754728 2790447 2828644 2866924 2903376 2938289 2973278 3009649 3047758 3086900
66869 3086900 3125457 3162214 3197909 3234554 3272808 3311160 3348241 3384705 3421897 3459772 3497332
66858 3497332 3534412 3571749 3609668 3647803 3685928 3724084 3762018 3799374 3836439 3873952 3912043
66847 3912043 3949775 3985703 4018722 4048745 4076954 4104982 4133373 4161216 4187562 4212625 4237026
66836 4237026 4260601 4282749 4303418 4322815 4340590 4356311 4370522 4384352 4398080 4410821 4421554
66825 4421554 4429724 4435077 4437795 4438785 4439082 4438895 4437816 4435738 4432780 4428516 4422196 4413680 4403272 4390782
66811 4390782 4375819 4359145 4342548 4326928 4311304 4294026 4274138 4251314 4225551 4197613 4168907
66800 4168907 4140076 4110207 4078172 4044387 4010568 3977993 3946503 3914987 3882303 3847916 3812133
66789 3812133 3775807 3739652 3703868 3668329 3632596 3595702 3556684 3515803 3474709 3434790 3395715
66778 3395715 3356163 3315618 3274775 3234376 3194441 3154767 3115613 3077652 3041419 3006838 2973078
66767 2973078 2938874 2903274 2866106 2827767 2788855 2750180 2712627 2676467 2641051 2605787 2571235
66756 2571235 2538478 2507321 2475958 2442864 2408556 2374937 2343221 2313019 2283314 2253647 2224142
66745 2224142 2194830 2165465 2135921 2106368 2076877 2047232 2017442 1988182 1960200 1933323 1906618
66734 1906618 1879767 1853579 1828661 1804210 1779093 1753836 1730382 1709529 1689687 1668864 1647116
66723 1647116 1626073 1606453 1587222 1567239 1546598 1525940 1505294 1484427 1463772 1444197 1425940
66712 1425940 1408476 1391386 1374701 1358277 1341563 1324339 1307135 1290436 1273899 1256978 1239980
66701 1239980 1223778 1208559 1193748 1179321 1166222 1154802 1143640 1130975 1116908 1102903 1089104
66690 1089104 1073745 1056085 1038623 1024749 1014647 1005196 994064 982287 972100 963636 955096 945359
66678 945359 934955 924664 914448 904003 893418 882976 873012 864073 856431 849244 841033 831370 821373
66665 821373 812203 803825 795750 788023 780627 772532 762523 750877 739414 729871 722732 717373 712603
66652 712603 707226 700885 694421 688768 683630 677987 671787 666046 661080 655787 649270 642239 635973 630538
66638 630538 624963 618796 612567 606822 601546 596571 591881 587409 583101 579217 575966 572748 568460 562846
66624 562846 556892 551459 546102 539903 533034 526682 521506 517013 512579 508301 504401 500454 495898 491007
66610 491007 486636 483054 479677 476078 472636 469882 467661 465334 462482 458990 454730 449710 444444 439654
66596 439654 435526 431719 428212 425643 424451 424011 423058 420856 417592 413632 408888 403168 396963 391431 387443
66581 387443 384783 382500 380035 377721 376116 375149 374289 373398 372841 372556 371516 368735 364672 361069 359211
66566 359211 358742 358384 357409 356005 354513 352888 350957 348735 346318 343743 341089 338395 335383 331647 327373
66551 327373 323505 320816 319006 317134 314834 312714 311497 311124 310777 309670 307811 306078 305398 305755 306259
66536 306259 306226 305709 304735 302768 299661 296451 294084 291688 287543 281845 277071 275060 274983 275024 274877 275423 276748
66519 276748 277901 278332 278361 278319 278177 277963 277556 276115 272780 268175 264229 262135 261241 260306 259002 257564 255640
66502 255640 252451 247989 243404 240066 238557 238597 239582 240945 242109 242435 241502 239501 237125 234994 233357
66487 233357 232420 232574 234013 236296 238496 239609 238838 236037 232234 229095 227338 226193 225006 224626 226074
66472 226074 228311 228826 226703 223818 222407 222367 221689 218942 214625 210417 207670 206534 206161 205748 205290 205117
66456 205117 204940 203991 202125 200087 198482 197105 195499 193632 191746 190052 188747 187796 186633 184777 182908
66441 182908 182500 183964 185853 186316 184776 182031 179537 178885 180779 183770 184924 182791 179130 176888 177123
66426 177123 178744 180468 181744 182182 181453 179938 178512 177553 176754 175798 174568 172911 170968 169522 169288 170056
66410 170056 171301 173225 176139 179082 180317 179375 177467 175688 173922 171931 170418 170265 171377 172892 174087
66395 174087 174693 174812 174945 175580 176304 175770 173123 169261 166187 165160 165702 166309 165830 164080 161302 157466
66379 157466 152649 148031 145583 146125 148278 150067 151037 151858 152427 151729 149475 146537 143687 141171 139729
66364 139729 140519 143386 146457 148202 148932 149573 150172 150486 150934 151692 151662 149736 146549 143630 141166 138064
66348 138064 134252 131504 131446 133708 136562 138761 140192 141114 141402 140699 139101 137380 136272 135670 134993 134311
66332 134311 134446 135771 137631 139257 140458 140963 140089 137944 136107 135931 136729 136801 135821 134863 134330 133401 131716
66315 131716 130189 129574 129350 128628 127400 126271 125566 125155 124747 124079 123306 123256 124637 126933 128908 130350 132180
66298 132180 134485 135690 134544 131947 129698 128109 126076 123075 119870 117350 115800 115350 116010 116919 116614
66283 116614 114741 112886 112965 115060 117458 118699 118992 119527 120861 122390 123111 122500 120564 117507 113742 110077
66267 110077 107430 106193 106088 106688 107811 109343 110991 112410 113357 113570 112822 111416 110401 110775 112330 113589
66251 113589 113188 111276 109385 108880 109751 111079 112408 114130 116438 118530 119359 118834 117729 116571 115281
66236 115281 113834 112626 111986 111803 111763 111570 110948 109946 109237 109427 109936 109363 107304 105010 103704 103004 101803
66219 101803 100203 99627 101075 103983 106856 108632 109381 110002 111043 111613 109899 105363 100111 97312 98250
66204 98250 101460 104617 106545 107341 107394 106939 106229 105584 105132 104671 103952 103202 103237 104751 107406 109956 111367
66187 111367 111411 110089 107310 103672 100804 99966 100596 101074 100620 99629 98507 97386 96940 98157 100834 103317
66171 103317 104209 103521 101814 99285 96413 94537 94668 96198 97701 98706 99824 101356 102807 103752 104350
66156 104350 104767 104822 104531 104418 104789 104996 103952 101436 98587 96931 97058 98372 100058 101927 104115 106333
66140 106333 108036 109293 110815 112750 114107 114008 113246 113810 116676 120542 123015 122793 120463 117472 114818
66125 114818 112827 111710 111643 112186 112165 110645 107879 104949 102708 101449 101288 102040 102721 102102 100115 98096
66109 98096 97264 97536 98180 98875 99480 99466 98485 97142 96342 96042 95470 94424 93440 92758 92042 91330 91335 92411 93925
66090 93925 95144 96149 97332 98426 98641 97522 95268 92494 90175 89419 90510 92155 92453 90911 89022
66075 89022 88448 89018 89066 87601 85563 84646 85324 86481 86884 86515 86344 87146 88815 90571 91450 90734 88487
66058 88487 85832 84264 84312 85057 85356 85313 86018 87790 89387 89479 88445 87987 89061 90864 91970 91761 90462
66041 90462 88499 86431 84956 84289 83872 83381 83619 85570 88845 92079 94699 97112 99085 99357 97498 94906
66025 94906 93079 91807 90143 88332 87485 87764 88214 88365 88807 89958 91221 91784 91541 90820 89687 87935
66009 87935 85562 82989 80901 79818 79732 80259 81191 82516 83708 83754 82485 81356 82007 84358 86983 89034
65993 89034 90793 92582 94319 96127 98066 99137 97951 94935 92577 92652 94289 95630 96338 97324 98841
65978 98841 100292 101482 102655 103342 102555 100431 98644 98637 100168 101948 103143 103778 104170 104582 105306 106633 108610
65961 108610 110900 112824 113593 112723 110407 107425 104616 102427 100818 99401 97691 95473 93072 91149 90154
65946 90154 90022 90466 91394 92926 95070 97517 99809 101569 102484 102286 101043 99446 98323 97726 96924 95671
65930 95671 95013 96086 98304 99576 98571 96116 94007 93053 92832 92930 93628 95315 97748 100096 101504 101528
65914 101528 100239 98146 95939 94088 92484 90581 88189 86135 85729 87367 90097 92831 95411 97966
65900 97966 99862 100386 100218 101009 103312 105969 107784 108737 109099 108517 106843 104977 103912 103468 102873 102109 101739
65883 101739 101733 101419 100517 99454 98790 98949 100329 102888 105742 107858 108999 109298 108314 105639 102508 101540 104218
65866 104218 109210 113673 115777 115634 114360 112969 112060 112045 113253 115597 118108 119188 117853 114689 111249
65851 111249 108652 107100 106429 106394 106439 105940 104945 104091 103682 103393 103098 103265 104147 105164 105575 105222 104062 101533
65833 101533 97336 92708 89991 90451 93057 95703 97241 97806 97612 96403 94372 92812 92978 94525 95865
65818 95865 96113 95971 96435 97341 97663 96682 94361 91072 87624 85158 84282 84416 84604 84800 85653 87201 88582
65801 88582 89113 89022 88900 88963 89037 88887 88489 88302 89167 91430 94224 96149 96652 96236 95431 94349 93322 93166
65783 93166 94356 96427 98480 100047 101321 102830 104905 107155 108648 109009 109068 109748 110664 110738 110000 109563 109693
65766 109693 109225 107381 104952 103034 101685 100708 100831 102941 106597 110261 112759 113819 113609 112549 111335
65751 111335 110467 109878 109457 109491 110071 110577 110495 110302 110767 111746 112447 112538 112077 110739 108240 105495 104238 105257
65733 105257 107814 110892 114106 117185 119526 120886 121791 122736 123487 123731 123941 124889 126502 127781 127823 126477
65717 126477 124073 121066 118080 115847 114638 113855 112527 110355 108096 106847 107020 107974 108438 107352 104752
65702 104752 102072 101093 102126 103564 103772 103062 103099 104647 106833 108534 109441 109548 108646 106810 104604 102448
65686 102448 100453 99086 99019 99896 100316 99524 98073 96338 93775 90521 88247 88047 88697 88633 88526 89919 92112
65669 92112 92680 90950 88775 87652 87031 85946 84558 83442 82854 83284 85332 88361 90620 91345 91488 91826
65653 91826 91804 91015 90401 90918 92208 93589 95099 96422 96041 93075 89201 87177 87792 89458 90377 89910 88196
65636 88196 85806 83733 82713 82478 82319 82140 82269 82720 83553 85439 88792 92621 95392 96865 98056 99560
65620 99560 100981 101884 102187 101637 100022 97991 96590 95925 95295 94662 94783 95734 96610 97078 97944 99584 101044
65603 101044 101536 101740 102614 103731 103938 103168 102529 102857 104027 105518 106828 107441 107161 106468 105919 105226 103607
65586 103607 101097 98839 97858 98043 98571 98887 99005 99275 100205 102156 104689 106403 106039 103916 101822 101270
65570 101270 102237 103840 105671 107764 109590 110148 109289 108046 107210 106307 104649 102727 101721 102020 103005 104012
65554 104012 104634 104356 102936 101145 100131 99911 99273 97280 94038 89962 85395 81208 78603 77750 77623 77718
65538 77718 78860 81378 83593 83458 81159 78762 77502 76749 75745 75135 76168 79002 82319 84381 84360 82933
65522 82933 81715 81879 83307 85097 86571 87514 87885 87857 87899 88299 88808 89250 90106 91708 93161 93018 91050
65505 91050 88489 86434 84972 84007 83837 84314 84366 83254 81722 80952 80701 79550 77065 74740 74275 75488
65489 75488 76625 76561 76019 76321 77576 78794 79633 81069 83865 87071 88903 88832 87971 87461 87339 87226 87306 88123
65471 88123 89904 92459 95300 97467 97835 96275 94292 93843 95520 98296 100883 102861 104510 106179 108005
65456 108005 109821 111011 110765 108904 106450 105067 105788 108306 111370 113703 114599 114058 112657 111179 110090
65441 110090 109368 108899 108777 108848 108381 106992 105801 106566 109292 111743 112130 111367 111583 113111 114431 114749 114963
65424 114963 115818 116619 116456 115500 114341 112949 111218 109838 109810 111406 114121 117077 119123 119378 118449 118291
65408 118291 119963 122057 122360 120537 118184 116626 115774 114906 113449 111024 107744 104481 101981 99810 97186
65393 97186 94708 93967 95178 96387 95533 92357 87887 83199 79437 78041 79671 83137 86244 87669 87575
65378 87575 86740 85838 85402 85797 86972 88573 90344 92177 93814 94739 94478 93004 90971 89512 89463 90571
65362 90571 91711 92127 92202 92769 93959 95160 95989 96805 98084 99659 100780 100793 99536 97270 94721 93258
65346 93258 94386 98334 103231 106330 106336 104259 102067 101116 101897 104303 107505 110209 111717 112326 112371 111804 111317
65329 111317 112658 116489 120790 123074 123635 124773 127151 129124 129870 130844 133204 135818 137126 137469 138212
65314 138212 139832 142278 146044 151359 157178 162405 167310 172379 176814 180032 183854 190996 201579 213137
65300 213137 224099 235142 246709 257298 265229 270427 273309 273205 269322 262454 254431 246223 237762
65287 237762 229396 222292 217104 212929 208158 202211 196053 190880 186537 181707 175696 169398 164058 159680
65273 159680 155374 150774 146128 141305 135935 130538 126303 123474 121016 118258 115779 114169 112963 111541
65259 111541 110226 109551 109003 107327 103876 99117 94221 90538 88850 88484 87668 85506 83127 82128 82261 81631
65243 81631 79122 75797 73766 74242 76887 80535 84174 87301 89550 90416 89840 88879 88960 90094 90585 89115
65227 89115 86479 84598 84362 85262 86667 88397 90103 91051 90738 89223 86951 84816 84078 85288 87200 87638
65211 87638 85691 82469 79637 77995 77669 78732 80943 83491 85623 87327 88992 90712 92326 93871 95564
65196 95564 97456 99319 100691 100933 99622 97147 94538 92449 90696 89165 88573 89580 91397 92212 91221
65181 91221 89550 88841 89476 90695 92029 93820 96218 98324 98825 97327 94629 91687 88706 85442 82141
65166 82141 79714 78895 79408 80094 79882 78636 77169 76442 76754 77736 79021 80672 82843 85283 87461 89019
65150 89019 89816 89705 88676 87252 86250 85955 85800 85004 83260 80689 77570 74472 72305 71719 72481 73802
65134 73802 75176 76457 77209 76658 74664 72288 70931 71026 71967 73194 74796 76889 78858 79646 78796 76914
65118 76914 75109 74130 74018 74400 74964 75680 76643 77698 78340 78092 77026 75803 75136 75244 75839 76559 77391 78686
65100 78686 80751 83356 85726 87185 87846 88520 89788 91287 92071 91630 90427 89351 88794 88436 88002 88009 89388
65083 89388 92252 95405 97416 98031 98119 98347 98496 98202 97773 97780 98198 98425 97994 96857 95120 92974 90898 89458
65065 89458 88816 88769 89321 90818 93368 96505 99617 102379 104560 105827 106147 106129 106463 107071 107250 106644 105642
65048 105642 104751 104030 103434 103323 104138 105753 107587 109469 111970 115629 120094 124343 127747 130663 133910
65033 133910 137909 142557 147751 153621 160084 166579 172683 178816 185748 193314 200213 205403 209184 212346
65019 212346 214758 215608 214857 213479 212134 210448 207893 204585 200793 196395 191373 186070 180373 173434 165099
65004 165099 156840 150110 144331 137933 131071 125635 122405 119896 116594 112790 109278 105705 101664 98404
64990 98404 97777 99688 101917 102427 100819 97672 93671 89621 86389 84383 83503 83587 84322 84918 84740 84264 84477
64973 84477 85281 85540 84943 84669 85551 86646 86541 85324 84216 83717 83244 82433 81747 81659 82066 82726 83573 84393
64955 84393 84854 85134 85899 87246 88227 87988 87047 86778 87756 89149 89818 89504 88817 88398 88318 88177 87683 87134 87188
64936 87188 87927 88348 87282 84888 82690 81984 82705 84139 86122 88821 91680 93475 93608 92770 92067 91844
64920 91844 91504 90231 87810 84986 83111 83215 85290 88517 91910 94546 95692 95418 94845 94913 94974 93473
64904 93473 90156 86701 84967 85460 87651 90546 92545 92126 89670 87512 87102 87083 85484 82865 81586 82513
64888 82513 84173 84953 84306 81880 77493 72544 69560 69358 70022 69639 68758 69064 70849 73115 75224 76960
64872 76960 77673 77050 76484 78036 81798 85570 87422 87434 86483 84603 81468 77771 75023 74074 74556 75798
64856 75798 77686 80440 84017 88060 92147 95656 97561 97018 94433 91489 89587 88498 87082 85146 83864
64841 83864 84335 86474 89482 92655 95381 97051 97638 97947 98689 99569 99729 98744 96742 93936 90600 87238
64825 87238 84278 81884 80503 81013 83615 86974 89377 90570 91645 93301 95138 96501 97033 96385 94475
64810 94475 92243 91113 91361 91951 92293 92977 94237 94927 94123 92708 92083 91961 90870 88531 86223 84827
64794 84827 83973 83418 83798 85325 86913 87564 87691 88011 87854 85956 82730 80347 80176 81132 81077 79220 76629
64777 76629 74899 74867 76301 78239 79587 79697 78504 76284 73635 71620 71229 72353 73858 75082 76634
64762 76634 79135 81919 84022 85892 88709 92034 93686 92498 89972 88432 88509 89308 90118 90844 91399 91915
64746 91915 93192 95674 98210 99097 98432 98067 98947 99761 98804 96196 93426 91487 90268 89248 87955 86154
64730 86154 84350 83814 85355 88216 90818 92457 93636 94928 96284 97492 98548 99311 99385 98619 97280 95555
64714 95555 93358 90907 89012 88427 89191 90886 93113 95339 96666 96433 95026 93703 93601 95188 98382
64699 98382 102506 106053 107299 105779 102865 100451 99188 98380 97410 96638 96719 97477 97874 97037 95164 93383
64683 93383 92743 93238 93863 93812 93540 94294 96539 99252 101058 101651 101645 101319 100274 98439 96762 96365 97189 97903
64665 97903 97248 95392 93867 94100 95901 97474 97172 95180 93211 92551 92853 92925 92200 90969 89529 87808
64649 87808 85987 85075 86456 90701 96800 102663 106609 108495 109365 110051 110488 110417 110182 110343 110791 110796 109841 107999
64631 107999 105642 103276 101584 101028 101274 101506 101425 101543 102342 103678 105179 106725 108188 109176 109461 109260 108645
64614 108645 107025 103867 99792 96339 94506 93935 93651 93208 92899 93122 93930 95237 97211 100149 103826 107258
64598 107258 109473 110489 111110 111762 112108 111948 111803 112148 112572 112256 110908 108711 105829 102632 99943 98171
64582 98171 96485 93946 91315 90553 92234 94631 95874 96041 96380 97284 98021 98089 97884 98032 98623 99101 98605
64565 98605 96698 94118 92556 93181 95568 98437 101109 103674 105982 107259 106929 105364 103592 102502 102412
64550 102412 103255 104986 107697 111134 114205 115418 114083 110809 106736 102751 99583 97880 97564 97654 97484
64535 97484 97734 99394 102003 103848 104085 103808 104735 107347 110608 113172 114577 115407 116359 117234 117140 115809 114136
64518 114136 112946 111814 109839 107122 104531 102366 100357 98825 98532 99274 99924 100330 101914 105603 110152
64503 110152 113465 114863 115091 114620 113099 110398 107268 104782 103605 103852 105169 106860 108306 109361 110177
64488 110177 110610 110049 108012 104983 102529 102189 103889 105794 106313 106018 106840 109461 112497 114440 115245 115454
64472 115454 114872 113168 111041 109530 108410 106471 103564 101370 101693 104565 108391 111645 113977 115801 117222
64457 117222 117692 116760 114771 112473 110137 107704 105709 105194 106326 107849 108409 107893 106931 105800 104510 103410
64441 103410 102783 102203 101176 100194 100209 101182 102112 102616 103477 105297 107466 109093 110395 112372 115173 117439
64425 117439 117621 115717 113393 112324 112771 113911 115035 115750 115434 113567 110805 108654 107655 106900 105913 105865
64409 105865 107903 111149 113666 114741 114881 114072 111776 108691 106814 107141 108453 108984 108378 107411 106699 106393
64393 106393 106588 107275 108136 108824 109252 109397 109134 108541 108080 108268 109290 110873 112276 112562 111400 109550 108189
64376 108189 107915 108825 111146 114850 118779 121190 121416 120310 119034 118167 118070 119058 120847 122569 123641 124092
64360 124092 124028 123625 123622 124738 126430 127430 127778 128930 131286 133139 133080 132111 132033 132804 133032 132386 131814 131567
64342 131567 130664 128574 126196 124704 124215 123975 123299 121990 120215 118262 116393 115087 115283 117774 122036
64327 122036 126351 129674 132632 135908 138390 138240 135512 132417 130843 130697 130870 130803 130568 130143 129328 128158
64311 128158 127018 126388 126466 126872 126848 126024 124866 124155 124251 125116 126586 128228 129415 130185 131452 133581 135229
64294 135229 134722 132303 129863 128552 127844 127056 126478 126615 127432 128916 131396 134653 137545 139270 140377 141778
64278 141778 143311 144070 143792 143187 142958 143116 143240 143143 143208 144069 145720 147104 147150 146200 145726 146526 148067 149819
64260 149819 152129 155096 157642 158788 159147 160020 161533 162948 164475 167146 170674 172971 172609 170806 170011
64245 170011 171144 173138 174797 176020 177080 177706 177511 176986 177376 179448 182621 185511 187253 188255 189808
64230 189808 193010 197828 202983 206935 209313 211253 213970 217193 219663 221212 223396 227496 232562 236327
64216 236327 237803 238057 238482 239212 239581 239393 239052 238737 238007 236217 233029 228566 223322 218031 213406 209865
64200 209865 207496 206229 205970 206521 207428 208035 207845 206817 205307 203757 202628 202513 203934 206756 210031 212630
64184 212630 213943 213889 212672 210969 210090 211297 214712 219164 223233 226245 228363 230158 232243 235010 238447
64169 238447 242273 246300 250484 254624 258228 260729 261775 261528 260917 261187 262475 263008 260765 256235 252496
64154 252496 251833 253083 253357 251788 250250 250477 251855 252591 251976 250676 249522 248976 249548 251748 255391 259494
64138 259494 263067 265732 267520 268593 269442 270887 273282 275854 277406 277761 277966 278850 280015 280812 281721 283762
64122 283762 286732 289152 290206 290647 291332 292016 292456 293508 295705 297541 297045 294918 294243 296661 300547 303631
64106 303631 305816 308267 311127 313744 316363 319910 324436 329302 334848 342468 352673 364239 375683
64093 375683 386779 398214 410514 423777 437955 452937 468627 485085 502236 519403 535578
64082 535578 550257 563469 574923 583739 589367 592197 592911 591583 587817 581512 573127 563302 552422
64069 552422 540486 527374 513391 499481 486654 475234 464813 454845 445062 435692 427633 422019
64057 422019 418903 416621 413310 408932 404987 402323 400365 398726 398381 400460 404545 408856 411845 413271
64043 413271 414114 415730 418732 422548 426494 431219 438290 448235 459832 471551 482806 493655 504470
64030 504470 516404 530812 547266 563090 575955 586190 595594 604664 612022 616064 616277 613482 609576
64017 609576 606209 602880 597190 588078 577748 568980 561580 553344 543820 534929 528060 522700 518145 514598
64003 514598 512162 510500 509890 510909 512751 513847 514774 518384 525916 534930 542537 548974 556292 565162 575070
63988 575070 586531 600632 616802 633231 649497 666843 685703 704769 722942 740634 758519
63977 758519 776470 794459 813226 832967 852252 869291 883754 896457 907757 917329 925450 933473
63965 933473 942715 953430 965224 978047 992271 1007902 1024246 1040605 1057034 1073971 1091315 1108480
63953 1108480 1125449 1142952 1160943 1177511 1190392 1199505 1207039 1214898 1223136 1231378 1240625 1252514
63941 1252514 1267360 1284365 1303786 1327502 1356733 1390198 1425577 1462334 1502092 1546325 1594765
63930 1594765 1646387 1701069 1759726 1823274 1892091 1966191 2045515 2130335 2221741 2321296 2429639
63919 2429639 2545773 2668434 2798013 2936469 3085495 3245503 3416376 3598382 3792256
63910 3792256 3999331 4222200 4464737 4730984 5024241 5347288 5702847 6093641 6522854
63901 6522854 6995337 7517947 8098029 8741597 9453253 10237221 11097405 12036048 13052432
63892 13052432 14142569 15299556 16514191 17775579 19071313 20386948 21705279 23005798
63884 23005798 24264257 25452734 26541420 27502228 28312227 28954697 29418047 29694194 29777406
63875 29777406 29663908 29352716 28847506 28157924 27299278 26291586 25159143 23929696 22631898
63866 22631898 21292195 19933527 18576086 17238241 15936628 14686034 13499168 12385851
63858 12385851 11352228 10401164 9533193 8746455 8036245 7396252 6821007 6306332 5847102
63849 5847102 5435959 5065607 4731862 4433190 4167332 3929479 3713872 3516126 3333568
63840 3333568 3164250 3006605 2859778 2723350 2596418 2477355 2364754 2258352 2158632 2065551
63830 2065551 1977900 1894085 1813311 1735801 1661890 1591214 1522947 1456720 1393089 1332957 1276578
63819 1276578 1223258 1172142 1123183 1077134 1034661 995780 960189 927610 897404 868316 839391
63808 839391 811162 785239 762450 741916 722243 703087 685041 668448 653087 638858 626027
63797 626027 614682 604591 595866 589137 584585 581313 578240 575347 573413 572733 572850 573442 574460 575059 573461
63782 573461 568807 562555 556872 551798 545107 535162 522796 509789 496455 481837 465845 449998 435730
63769 435730 422769 409682 395712 381668 369131 359064 351117 344001 336406 327716 318080 308031
63757 308031 298091 288683 280254 273350 268332 264904 262062 258877 255322 252075 249525 247378 245326 243531
63743 243531 242091 240518 238273 235474 232465 229029 224894 220931 218868 219471 221773 224480 227306 230190
63729 230190 231968 231090 227615 223380 219859 216720 213046 209241 206766 206108 205901 204439 201637 199153 198652
63714 198652 200133 201879 202009 200183 197878 196845 197260 197576 196296 193598 190977 189554 189177 189124 189123 189337 189716
63697 189716 189867 189632 189369 189441 189586 189040 187267 184506 181699 179997 180073 181512 182983 183556 183971 185976 190066
63680 190066 194510 197240 198197 198962 200462 202197 203678 205272 207147 208516 208726 208400 208791 210640 214205
63665 214205 219613 226377 233318 239690 245621 250634 253034 252256 250801 251691 254498 256134 255523 254995 256386
63650 256386 258304 258668 257952 257984 258891 259352 259184 259630 261185 262752 263166 262343 260712 258444 255517 251896 247612
63633 247612 243114 239322 236700 234542 231912 229085 227193 226594 226471 226114 225836 226415 228173 230763 233488
63618 233488 235822 237946 240642 244412 248972 253873 259066 264310 268686 271563 273680 276286 279464 282178
63604 282178 283749 284338 284161 283315 282353 282007 282121 281625 279699 276399 272360 268665 266612 266459 266675 265773 264719
63587 264719 265869 269387 272582 273529 273613 275361 279227 283960 289014 294855 301411 307861 313953 320289 327267
63572 327267 334808 343325 353985 367565 383501 400331 416809 432589 448232 464734 482843 502736
63560 502736 524348 547808 573450 601544 632074 664595 698379 733140 769435 807584 846097
63549 846097 882055 913418 940083 962259 979045 989675 995318 998131 998798 996306 990157 981618 972522
63536 972522 963781 955345 946683 936791 924481 909316 891880 872706 851353 827133 800605 773867
63524 773867 749257 727840 709035 691528 674626 658913 645587 635143 626787 619089 611073 602665
63512 602665 594428 587289 582465 581119 583440 587995 592509 595880 599387 605592 616031 630239 646887
63499 646887 665306 685765 708694 734012 761118 789456 819161 850944 884947 919943 954205
63488 954205 987002 1018268 1046812 1070157 1086873 1098055 1105520 1109340 1108444 1103279 1096459 1090510 1085815
63475 1085815 1081010 1074563 1065699 1054400 1040851 1024496 1003620 976545 943613 907485 871037 835241
63463 835241 799391 762986 726815 692162 659506 628427 598780 571505 547787 527513 509134
63452 509134 491251 473886 457948 444067 432373 422738 414441 406098 396940 387995 381055 376479 372941
63439 372941 369360 365975 363314 361274 359870 359895 361879 364999 367934 370476 373455 377241 381167 384463 387170
63424 387170 390000 393766 398974 405415 411970 417218 420531 422492 424139 425999 427859 429134 429249 427795
63410 427795 424701 420346 415443 410677 406437 402874 400168 398638 398556 399966 402672 406211 409758 412437 414230
63395 414230 416504 421095 428616 437921 447330 455994 463875 470967 477213 483153 490006 498780 509450 521307
63381 521307 534022 548117 564199 581929 600186 618552 638325 661506 688712 718554 749308
63370 749308 780830 814526 851788 892810 936586 981606 1026727 1071932 1118213 1166218 1215038
63359 1215038 1262795 1308284 1351308 1391158 1425619 1452117 1469541 1478432 1479845 1474784 1464597 1451072
63347 1451072 1435783 1419661 1403155 1386212 1367924 1346760 1321575 1292212 1259080 1222638 1183519
63336 1183519 1142606 1100598 1057929 1015575 975444 939192 906879 877483 850534 826495 805563
63325 805563 787056 770295 755484 743370 734649 729985 729819 733512 739209 745407 752593 762706 777017
63312 777017 795029 815398 837307 860763 886125 913907 944920 979986 1019015 1060424 1101994
63301 1101994 1142694 1183360 1225065 1267037 1306833 1342458 1373306 1398797 1417259 1427153 1428814 1424167
63289 1424167 1415228 1403706 1391338 1379059 1365824 1349675 1330385 1309918 1289736 1268688 1244314
63278 1244314 1215444 1182710 1147204 1109738 1071145 1032298 993722 955788 919254 884990 853259
63267 853259 823862 796888 772544 750219 728605 707219 687130 669639 654694 641280 629021
63256 629021 618645 610818 605076 600156 595062 589646 584404 579921 576449 573879 572062 570959 570362 569615
63242 569615 567979 565360 562456 560147 558848 558346 557882 556418 553387 549463 546193 544488 543711 542576 540674
63227 540674 538735 537649 537761 538993 540978 542951 543979 543650 542459 541516 542032 544829 549813 555824 561408
63212 561408 565952 569969 574358 579674 585918 592523 598625 603939 609379 616128 624032 631679 638298 644658
63198 644658 651652 658968 666115 674055 684496 697401 710243 720200 726917 733008 742007 755638 772616
63185 772616 790059 806311 822289 840048 860611 883716 909120 937139 967822 1000469 1034320
63174 1034320 1069241 1105481 1143197 1182447 1223295 1265537 1308448 1350921 1391853 1430587 1467372
63163 1467372 1503406 1540096 1578145 1617420 1657424 1697440 1736340 1772922 1806634 1837538 1865379
63152 1865379 1889190 1907947 1921049 1927764 1926771 1917047 1899110 1874662 1844797 1809114 1767131 1720280
63140 1720280 1671882 1625010 1580824 1539194 1500335 1465063 1433677 1405609 1380653 1359954 1345174
63129 1345174 1336873 1334080 1335268 1339453 1346630 1357540 1372923 1392692 1415824 1441022 1467184 1493369
63117 1493369 1519122 1545130 1572696 1601944 1631215 1658897 1685098 1710623 1735143 1757673 1778248
63106 1778248 1797447 1814312 1826354 1831904 1831070 1824063 1810244 1789681 1764280 1735998 1704648 1668619
63094 1668619 1627406 1582571 1536579 1491548 1448798 1408722 1371044 1335685 1303182 1273865 1247059
63083 1247059 1221764 1197887 1176012 1156124 1137402 1119514 1103464 1090614 1081000 1073035 1065013 1056781
63071 1056781 1049637 1044633 1041524 1039692 1039362 1040876 1043150 1044246 1043751 1043391 1044765 1047609 1050946 1054653 1058801
63056 1058801 1062433 1064525 1065671 1067528 1070883 1075434 1081065 1087859 1094926 1100821 1105451 1110261 1116071 1121978
63042 1121978 1127009 1131721 1137213 1143427 1149417 1154837 1160329 1166751 1174725 1184542 1195593 1206013 1213755
63029 1213755 1218316 1221116 1224171 1228780 1235339 1243835 1254125 1265918 1278636 1291424 1303525 1314945
63017 1314945 1326727 1340338 1356698 1375824 1397149 1419947 1443637 1468116 1493924 1521802 1551936
63006 1551936 1583827 1617057 1652086 1690050 1731715 1776692 1823751 1871927 1921351 1973059 2028073
62995 2028073 2086675 2148391 2212510 2278681 2347191 2418718 2493671 2571724 2652089 2734081 2817121
62984 2817121 2900341 2982656 3063461 3142774 3220446 3295755 3368358 3439295 3510261 3581798 3652791
62973 3652791 3721756 3787934 3850947 3909992 3963687 4010057 4046286 4069252 4077102 4069947 4048424 4012151
62961 4012151 3960634 3895320 3819546 3736409 3647869 3555959 3463344 3371938 3282291 3195457 3114482
62950 3114482 3042567 2980370 2926547 2880686 2844058 2817335 2799233 2788259 2784618 2789377 2802459 2822508
62938 2822508 2848284 2879080 2913848 2950976 2989352 3028996 3070075 3111488 3150979 3186808 3219114
62927 3219114 3249393 3278690 3306455 3331013 3350583 3363505 3367897 3361816 3343909 3313681 3271255 3217333
62915 3217333 3153376 3081254 3002429 2917712 2827800 2733699 2636538 2537492 2438117 2340399 2246126
62904 2246126 2156342 2071403 1991251 1915596 1844253 1777490 1715708 1658719 1605855 1556984 1512872
62893 1512872 1474125 1440148 1409485 1380854 1353518 1327153 1301963 1278749 1258308 1240660 1225076
62882 1225076 1210743 1197157 1184039 1171137 1158035 1144077 1128765 1112446 1096338 1081591 1068517
62871 1068517 1056835 1046260 1036478 1026908 1017027 1006865 996935 987785 979759 972824 966236 958651 949016
62858 949016 937394 924920 913294 904321 899037 896553 894275 890228 885015 880855 878877 878156 877222 875491
62844 875491 873055 870101 867142 865202 865022 866246 867735 868545 868462 867955 867902 869064 871454 874310 876812 878566
62828 878566 879195 878038 874930 871099 868432 867498 866809 864509 860598 856988 855395 855661 856233 855818 854157 851514
62812 851514 847997 843530 838093 831761 824739 817660 811707 807969 806339 805149 802310 797045 790332 783566
62798 783566 777209 771154 765794 761586 757636 752198 745271 739423 736858 736645 736239 735013 734498 735457 736763
62783 736763 737423 737783 738020 737248 735217 733426 733207 733886 734244 734757 736709 739726 741945 742599 743039 745137 749676
62766 749676 756204 763261 768790 771608 772734 774336 777306 780872 784709 789985 797631 806610 814857 821447
62752 821447 827127 833131 840196 848584 858253 868768 879411 889763 900265 912036 925990 942175
62740 942175 960115 979702 1001303 1024954 1050050 1076166 1103689 1133291 1165314 1200090 1238296
62729 1238296 1280352 1326000 1375209 1429015 1488531 1553452 1622508 1695286 1772669 1855573 1944244
62718 1944244 2038922 2140188 2248249 2362502 2482065 2606211 2733988 2863840 2993690 3121039
62708 3121039 3242990 3356628 3459375 3548707 3621855 3676405 3711027 3725013 3717513 3688131 3638133
62697 3638133 3570090 3486297 3388431 3278606 3159541 3033448 2901820 2766774 2631633 2499627
62687 2499627 2372629 2251475 2136673 2028265 1925768 1829017 1738724 1655829 1580623 1512744
62677 1512744 1451508 1395859 1344523 1296706 1252496 1212387 1176676 1145260 1117540 1092420 1068950
62666 1068950 1047088 1027483 1010587 996536 985687 978422 974376 972693 973103 975914 980981 987728 996375
62653 996375 1008005 1022979 1040321 1059165 1079942 1103571 1130336 1160104 1192963 1229160 1269096
62642 1269096 1313636 1363505 1418093 1475988 1537211 1603727 1677085 1756625 1840722 1928510 2019325
62631 2019325 2111672 2204200 2296875 2389690 2480602 2565980 2642754 2709144 2763898 2806067 2835056
62620 2835056 2849554 2846784 2824328 2782745 2725272 2655123 2574397 2485420 2391319 2294491 2195642
62609 2195642 2095043 1994012 1894601 1798466 1706618 1619744 1538287 1462404 1392074 1326958 1266209
62598 1266209 1209061 1155753 1107300 1064036 1024878 988409 954274 923058 895040 869533 845513
62587 845513 822548 800872 780613 761297 742385 724154 707631 693649 682280 673102 665367 657882
62575 657882 649570 640643 632542 626154 620650 614693 608271 602580 598469 595730 593616 591363 588471 585225
62561 585225 582879 582728 585073 589422 595265 602005 608685 614813 621354 629889 640575 651694 661524 670278
62547 670278 680028 692976 709787 729371 750219 772028 795740 822135 851205 883126 918789 958588
62535 958588 1001583 1046844 1094870 1146539 1201384 1258418 1318192 1382282 1450490 1519877 1586896
62524 1586896 1649439 1706731 1758481 1804476 1843924 1874749 1894430 1901790 1897191 1881121 1853955 1817305
62512 1817305 1773919 1725423 1671506 1612273 1550193 1488483 1428383 1369330 1311213 1255110 1202099
62501 1202099 1152559 1106730 1064926 1026988 992266 960368 931384 905138 880769 857393 834961
62490 834961 814132 795360 778314 762274 747008 732948 720400 708932 697964 687754 679266 673024
62478 673024 668634 665420 662983 661004 659131 657418 656432 656657 658119 660805 664992 670833 678021 686240 695718
62463 695718 707061 720785 737172 756360 778314 802846 829690 858451 888660 920387 954699
62452 954699 992848 1034895 1079662 1126076 1173739 1222028 1269716 1316320 1363011 1410970 1458906
62441 1458906 1503129 1540305 1569522 1591404 1605786 1610945 1605172 1588723 1563885 1533217 1498051 1458708
62429 1458708 1415619 1369646 1321620 1272297 1222908 1175218 1130686 1089772 1052102 1017076 984371
62418 984371 954200 927167 903624 883230 865396 849926 836778 825404 815006 805330 796580 788569
62406 788569 780707 772989 766358 761912 760205 761264 764553 768816 772700 775879 779158 783483 789422 797322
62392 797322 806936 816831 825318 832412 840002 849743 861548 874276 886744 897682 905987 911753 916026
62379 916026 918828 918506 913870 905907 896398 885846 873845 860526 846351 831192 814906 798239 781924
62366 781924 765569 748830 733083 720246 710172 700820 691031 681701 674139 668643 664847 662147 659550
62353 659550 656460 653958 654109 657693 663728 671322 680427 690318 699068 705661 711436 718328 726697 736121
62339 736121 747326 761674 778862 796431 811771 823943 833687 842387 850959 859071 865409 869118 870842
62326 870842 871973 873226 874513 875808 877305 878933 880466 882156 884660 888493 894187 902738 914966 930482
62312 930482 948233 968173 991320 1017881 1046610 1076802 1110028 1148808 1194170 1245506 1302285
62301 1302285 1364554 1431744 1502354 1575310 1650728 1728755 1808213 1886879 1962533 2033190 2096772
62290 2096772 2151244 2195021 2227010 2246723 2254762 2252787 2242291 2223505 2195888 2159352 2114461 2061837
62278 2061837 2002361 1937944 1871171 1803876 1736672 1670129 1605662 1544716 1487565 1433518 1382103
62267 1382103 1333658 1288928 1248428 1212082 1179020 1147641 1116223 1083982 1051887 1022415 997982
62256 997982 979163 964527 952352 942192 934471 929177 925712 923619 922504 921468 919766 918017 917549
62243 917549 918311 918666 917639 916010 914536 912560 909522 906540 904865 903659 901096 897298 894384 893543 893803
62228 893803 894067 894841 897167 901073 906015 912002 919313 927591 936207 945362 956103 969160 984253 1000570
62214 1000570 1017743 1036284 1057133 1080675 1106246 1132883 1160578 1190465 1223666 1260374 1300290
62203 1300290 1343511 1390529 1441521 1496118 1553972 1615259 1680403 1749274 1820700 1892723 1963266
62192 1963266 2030480 2092493 2147077 2191855 2225041 2246168 2256198 2256706 2248406 2230323 2200875 2160095
62180 2160095 2110459 2055134 1995804 1932747 1866700 1799739 1734094 1670696 1609408 1550455 1495188
62169 1495188 1445221 1400949 1361223 1324738 1291565 1262864 1239205 1219846 1203794 1190709 1180283
62158 1180283 1171583 1163898 1157727 1153975 1152536 1152591 1153912 1156608 1159698 1161318 1160818 1159661 1159847 1162279 1166946
62143 1166946 1173569 1181262 1188453 1194092 1198665 1203515 1209558 1217159 1226626 1238096 1251218 1265619 1281381
62130 1281381 1298572 1316692 1335157 1353966 1373234 1392538 1411623 1431444 1453428 1477607 1502515
62119 1502515 1527206 1552497 1579715 1609082 1640115 1673144 1709435 1749736 1793392 1839158 1886577
62108 1886577 1936345 1989544 2046660 2107115 2169417 2231757 2292670 2351163 2406051 2455122 2495316
62097 2495316 2524241 2541833 2550376 2552732 2550491 2543821 2532715 2517776 2499689 2478506 2454080 2427026
62085 2427026 2398633 2369673 2339907 2309202 2278727 2250487 2225910 2205359 2188725 2175635 2165163
62074 2165163 2156326 2149278 2145164 2144240 2144912 2145427 2145981 2148204 2152895 2159300 2166583 2175006 2185319 2197738
62060 2197738 2211983 2227846 2245426 2265078 2287283 2312286 2339769 2369241 2400710 2434492 2470370
62049 2470370 2507544 2545587 2584849 2625723 2668219 2712727 2760606 2813240 2870523 2930676 2991456
62038 2991456 3051374 3109948 3167140 3222589 3275458 3325348 3373413 3422066 3473177 3526812 3581880
62027 3581880 3637523 3693270 3748133 3800430 3849062 3894937 3940821 3989484 4041715 4096274 4151877
62016 4151877 4208945 4268979 4332552 4398703 4466310 4535202 4605642 4677622 4751286 4827403 4906684
62005 4906684 4988977 5073625 5160109 5247590 5334136 5417151 5494617 5565614 5629997 5687976 5739539
61994 5739539 5783818 5819700 5847855 5871349 5892913 5911971 5925708 5932813 5934665 5932961 5928276 5921631
61982 5921631 5915455 5911456 5908751 5905649 5902370 5900336 5899437 5897961 5895199 5892347 5890497 5889215 5887669 5885799
61968 5885799 5883625 5880491 5875935 5870498 5864797 5858589 5851726 5845238 5840175 5835727 5829798 5821410 5811345 5800408
61954 5800408 5788507 5775998 5764666 5756300 5750806 5746573 5742274 5737610 5732703 5727694 5722937 5718811 5715238
61941 5715238 5711875 5708829 5706604 5705245 5704050 5702285 5699630 5695674 5689607 5680894 5669888 5657091 5642081
61928 5642081 5623941 5602873 5580534 5558155 5534811 5508323 5477800 5444503 5410050 5374613 5337506
61917 5337506 5298873 5259837 5221141 5182626 5144148 5106112 5068743 5031579 4994242 4957022 4920083
61906 4920083 4882679 4844000 4804454 4765232 4726823 4688930 4651862 4616835 4584417 4553559 4522923
61895 4522923 4492618 4463852 4437185 4412021 4387831 4365021 4344256 4325509 4308317 4292582 4278521
61884 4278521 4265979 4254542 4244516 4237113 4233205 4232278 4233157 4235538 4240276 4248408 4260538 4277016 4297890
61871 4297890 4322538 4350100 4380605 4415083 4454395 4498716 4548517 4605193 4670057 4743329 4824763
61860 4824763 4914633 5013341 5120926 5238155 5367760 5513218 5676242 5856595 6054690 6273403
61850 6273403 6516876 6788272 7089204 7420863 7785153 8184893 8623202 9102526 9624119
61841 9624119 10188447 10795833 11446204 12137985 12866993 13625394 14400433 15173432 15919777
61832 15919777 16609560 17208695 17681750 17997147 18132600 18078134 17836886 17424953 16869245
61823 16869245 16201990 15454566 14655097 13829544 13001654 12190244 11407550 10661230 9957293
61814 9957293 9300597 8693509 8135362 7623355 7154000 6724388 6332470 5975963 5651446
61805 5651446 5355580 5086939 4845030 4627178 4428028 4242954 4070705 3911958 3766695
61796 3766695 3634093 3513649 3404873 3306522 3217260 3136399 3063150 2996138 2934717 2879650 2831140
61785 2831140 2787299 2746123 2707967 2674192 2644251 2616430 2591094 2570660 2555974 2544856 2534929
61774 2534929 2526119 2519500 2515156 2512245 2510158 2508887 2509019 2511878 2518704 2529185 2541710 2555456 2571107
61761 2571107 2589040 2608077 2626982 2646300 2667835 2693000 2722483 2756649 2795285 2837496 2882829
61750 2882829 2932130 2986500 3045927 3109797 3178262 3252109 3331639 3416833 3508631 3608899 3718798
61739 3718798 3837911 3965334 4101064 4245936 4400676 4565640 4741562 4930120 5133365
61730 5133365 5352396 5586940 5836785 6103678 6391258 6702930 7040487 7405348 7800545
61721 7800545 8230528 8699327 9209998 9766071 10372521 11034639 11756507 12541294 13392617
61712 13392617 14314615 15310509 16381713 17528380 18749565 20041406 21394589 22793109
61704 22793109 24213811 25624570 26981588 28229323 29305221 30147441 30702621 30932826
61696 30932826 30821533 30376697 29628790 28624662 27420068 26072608 24635751 23155395
61688 23155395 21669891 20211332 18805087 17468217 16210241 15036606 13951056 12954668
61680 12954668 12044288 11213548 10455563 9764396 9134770 8561573 8039773 7564349 7130438
61671 7130438 6733956 6371899 6041636 5740148 5464269 5211272 4978640 4763685 4564198
61662 4564198 4379368 4209280 4053324 3909679 3776460 3652709 3537952 3431303 3331616 3238288
61652 3238288 3151324 3070508 2994901 2923374 2855449 2791359 2731458 2675825 2624232 2575962 2529589
61641 2529589 2483672 2438152 2394593 2354332 2316615 2279255 2241021 2202632 2165363 2129540 2094796
61630 2094796 2061055 2028672 1997933 1968924 1941660 1915988 1891489 1867661 1844003 1820044 1795840
61619 1795840 1772517 1751553 1733087 1715578 1697675 1679832 1663383 1648641 1634850 1621781 1610187
61608 1610187 1600407 1591344 1581356 1569833 1557508 1545379 1533627 1521652 1509071 1496476 1484975 1475003
61596 1475003 1465959 1457218 1449020 1442002 1436245 1431312 1427004 1423501 1420865 1418929 1417687 1417280 1417532 1417991 1418535
61581 1418535 1419552 1421319 1423545 1425705 1427626 1429553 1431752 1434180 1436510 1438532 1440459 1442653 1444975 1446763
61567 1446763 1447663 1448093 1448548 1448867 1448784 1448775 1449480 1450294 1449522 1446305 1441712 1437418 1433826 1430098 1425672 1420929 1416220
61550 1416220 1410738 1402878 1391819 1378651 1365738 1354894 1346207 1338689 1331713 1325453 1320141 1315472 1310943
61537 1310943 1306467 1302478 1299566 1298040 1297617 1297613 1297715 1298483 1300741 1304606 1309690 1316203 1325071 1336671 1350149
61522 1350149 1364484 1379691 1396356 1414425 1433200 1452390 1472634 1494971 1520213 1548644 1579893
61511 1579893 1613252 1648513 1686308 1727139 1770375 1814809 1859936 1905842 1951983 1997229 2041394
61500 2041394 2085598 2130431 2174567 2216086 2254624 2291314 2326884 2360803 2392356 2421634 2449094
61489 2449094 2474644 2497556 2517055 2532748 2544573 2552485 2556298 2555974 2552092 2545740 2537777 2528580 2518660
61476 2518660 2508820 2499057 2487974 2474422 2459692 2447009 2438665 2434597 2433959 2436922 2444209 2455847 2471454
61463 2471454 2491423 2516918 2548878 2587619 2633174 2685465 2744456 2810799 2886091 2971800 3068185
61452 3068185 3174893 3292403 3421992 3564473 3720014 3889440 4074712 4277555 4498112
61443 4498112 4735325 4988070 5255447 5536367 5829306 6132080 6441085 6750387 7051501
61434 7051501 7334130 7587613 7802573 7971891 8090419 8154369 8161963 8115117 8019952 7885021
61424 7885021 7718832 7528788 7321577 7103731 6881601 6660943 6446440 6241571 6049049
61415 6049049 5871284 5710066 5565825 5437804 5325288 5228447 5148000 5084621 5038821 5010597
61405 5010597 4998669 5000571 5014243 5039305 5076198 5124360 5181847 5246603 5317492 5394043 5475683
61394 5475683 5561285 5649021 5736626 5822225 5905148 5985831 6064971 6142920 6219577 6294381 6366423
61383 6366423 6435010 6500206 6562451 6621560 6676475 6726255 6771172 6812677 6852212 6889886 6924155
61372 6924155 6952884 6974889 6990365 6999880 7003456 7001032 6993274 6981084 6964427 6942549 6915637 6885609
61360 6885609 6854753 6824004 6792966 6761272 6729461 6698723 6670236 6644604 6621566 6600257 6580086
61349 6580086 6561252 6544009 6527576 6510359 6491435 6471231 6450360 6428278 6403832 6377000 6349372
61338 6349372 6322766 6298118 6276315 6259620 6251379 6254210 6269133 6296792 6339003 6398475 6477192 6575680
61326 6575680 6694088 6833536 6995812 7181696 7390154 7619658 7870011 8142126 8435696
61317 8435696 8747476 9071988 9403268 9735356 10061465 10373443 10661992 10917006 11128241
61308 11128241 11286974 11387740 11428531 11409933 11335021 11209733 11041384 10835712 10595955 10325412
61298 10325412 10029861 9716451 9391003 9057722 8721056 8386243 8057667 7737832 7428482
61289 7428482 7132039 6851417 6588871 6345398 6120874 5914518 5725595 5554109 5400783
61280 5400783 5266219 5150196 5051741 4969710 4903297 4852176 4816097 4794195 4784903 4786899 4799832
61269 4799832 4823653 4857415 4899424 4948492 5004299 5066319 5133114 5202992 5274655 5346692 5416989
61258 5416989 5483407 5544859 5601247 5652473 5698087 5737891 5772285 5801742 5826183 5845178 5858655
61247 5858655 5867097 5870867 5869403 5861316 5845368 5821222 5789158 5749330 5701776 5647219 5587580 5525433
61235 5525433 5462833 5400402 5337239 5271910 5203985 5134783 5066315 4999501 4933806 4868767 4805437
61224 4805437 4745976 4692068 4643956 4600763 4561293 4524641 4490446 4458767 4429587 4402348 4376015
61213 4376015 4349546 4322343 4294438 4266393 4238836 4211852 4185007 4158453 4134135 4115418 4104871
61202 4104871 4102285 4105164 4111306 4120778 4135545 4157842 4189358 4231361 4284507 4348385 4422119 4505907
61190 4505907 4601368 4709712 4829952 4959473 5095996 5238106 5383703 5528412 5665597 5787677
61180 5787677 5887614 5959947 6000870 6007403 5976882 5908003 5802611 5666015 5505215 5326778 5136201
61169 5136201 4938516 4738804 4541848 4351205 4168616 3994604 3830052 3677056 3537858
61160 3537858 3412994 3300896 3199293 3106656 3022433 2946506 2878562 2817666 2762414 2711985 2666978
61149 2666978 2628717 2597618 2572748 2552896 2537449 2526250 2519512 2518088 2522873 2533364 2547449 2563132
61137 2563132 2579811 2597391 2614862 2630510 2643068 2652042 2657359 2659450 2659168 2656818 2651537 2642404 2629802
61124 2629802 2614895 2598113 2579119 2558066 2535758 2512474 2487711 2461378 2434330 2407303 2380001
61113 2380001 2351672 2322062 2291458 2260352 2229365 2198955 2168768 2137659 2104722 2069934 2033617
61102 2033617 1995869 1956933 1917685 1879233 1842255 1806979 1773329 1740816 1708861 1677809 1648982
61091 1648982 1622971 1598273 1572440 1544351 1514468 1483135 1449948 1415183 1380765 1348979 1320677
61080 1320677 1295301 1272150 1250969 1231619 1214013 1198497 1185772 1176238 1169578 1164918 1161253 1158032
61068 1158032 1155806 1156046 1159724 1166084 1173399 1180981 1189722 1200513 1212870 1225612 1238201 1250772 1263422
61055 1263422 1276271 1289920 1304902 1320773 1336483 1351565 1366030 1379221 1389950 1398172 1405371 1412622
61043 1412622 1419188 1423810 1426483 1427829 1427480 1424625 1419878 1415094 1411059 1406622 1400568 1393237 1385718 1378490
61029 1378490 1371688 1365939 1361880 1359082 1356241 1352328 1347129 1341060 1335058 1330365 1327718 1326762 1326589 1326546 1326069
61014 1326069 1324294 1320715 1316005 1311322 1306885 1302081 1296930 1292403 1288985 1285869 1282045 1277592 1273440 1270384
61000 1270384 1268709 1268260 1268445 1268670 1269148 1270771 1273765 1277176 1280315 1284096 1290115 1298723 1308889 1319721
60986 1319721 1331334 1344366 1359518 1377416 1397974 1419832 1441481 1463290 1487364 1514874 1544465
60975 1544465 1574176 1604174 1636466 1672258 1710881 1751395 1794067 1839696 1888405 1940008 1995147
60964 1995147 2055199 2121114 2193046 2271041 2355294 2445511 2540845 2640983 2746660 2858527 2976168
60953 2976168 3099221 3229191 3368940 3520072 3681583 3851461 4029034 4215555 4413216
60944 4413216 4624088 4849737 5091720 5352835 5637805 5951948 6299257 6682858 7107439
60935 7107439 7579954 8107818 8698276 9360391 10105752 10945872 11890609 12950727 14140463
60926 14140463 15476772 16979771 18677187 20605127 22800596 25297516 28132195 31329158
60918 31329158 34833229 38421885 41703395 44263153 45873141 46594416 46698368 46505718
60910 46505718 46286423 46240348 46467215 46885779 47193402 46970724 45894396 43897373 41162091
60901 41162091 37986775 34651069 31356990 28229762 25334849 22695217 20311115 18176581
60893 18176581 16283871 14620294 13168331 11909509 10825133 9893566 9090350 8392331
60885 8392331 7780696 7240598 6760130 6330027 5942815 5591838 5271955 4980544 4716086
60876 4716086 4475866 4256438 4055727 3872484 3703595 3544168 3390893 3243547 3102658
60867 3102658 2967598 2837939 2714866 2599798 2492573 2392088 2297778 2209389 2126145 2047159
60857 2047159 1972086 1900533 1831674 1765405 1703179 1646552 1595254 1547571 1502225 1459055 1418291
60846 1418291 1380199 1345247 1313583 1284245 1255562 1226561 1197607 1169740 1143855 1120510 1100115
60835 1100115 1083030 1069402 1058672 1049316 1039562 1028678 1017327 1006687 997693 991106 987366 985822
60823 985822 984794 983152 981552 981610 984110 988440 993418 998170 1002488 1006779 1011492 1016300 1020157 1022353 1023050
60808 1023050 1022632 1021152 1018767 1015985 1012934 1009257 1005396 1003118 1003539 1005163 1005205 1002822 999900 998591 999220
60793 999220 1000883 1003039 1005855 1009729 1015285 1023499 1035110 1049775 1066108 1082656 1098735 1114311 1129177
60780 1129177 1142502 1153532 1162749 1171865 1182225 1193408 1203757 1212161 1218950 1225177 1231554 1238185 1244882
60767 1244882 1251385 1257401 1262771 1267674 1272508 1277426 1282128 1286430 1291092 1297494 1305961 1314734 1321306 1324780
60753 1324780 1326312 1327381 1328403 1329068 1328943 1327285 1323149 1316522 1308804 1301452 1294543 1287240 1279141 1270331
60739 1270331 1260458 1248797 1235305 1220954 1206890 1193751 1181878 1171517 1162509 1154061 1145271 1135980
60727 1135980 1127062 1119801 1114916 1112292 1111675 1113212 1116949 1122223 1128289 1135335 1143979 1153887 1163969 1174058
60713 1174058 1185177 1197834 1211361 1225614 1241879 1260997 1281702 1302173 1322391 1343541 1365718
60702 1365718 1387708 1408654 1428343 1445998 1460423 1471687 1481356 1490579 1498981 1505906 1511781 1517620
60690 1517620 1523732 1529574 1534715 1539590 1545175 1551740 1557900 1561430 1561334 1558588 1554503 1549206 1542393 1534570
60676 1534570 1526339 1517258 1506910 1496565 1488032 1480958 1472993 1462822 1451486 1440444 1429947 1419855
60664 1419855 1410451 1401546 1392112 1381865 1372258 1364849 1359371 1354253 1348551 1342672 1337746 1334903 1334666 1336468
60650 1336468 1339072 1341744 1344453 1346919 1348472 1349207 1350068 1351220 1351480 1350222 1348624 1347807 1346756 1343663 1338727
60635 1338727 1333960 1330375 1327017 1323021 1319083 1316144 1313692 1310354 1305679 1300439 1295200 1289285 1281501 1271649
60621 1271649 1260925 1250634 1240773 1230234 1218222 1204909 1190659 1175357 1158973 1142241 1126212
60610 1126212 1111453 1098180 1086824 1077738 1070449 1063864 1057389 1051548 1047486 1046070 1047364 1050589 1054549
60597 1054549 1058388 1062003 1065636 1069222 1072380 1074977 1077449 1080567 1085096 1091486 1099575 1108450 1116837 1123927
60583 1123927 1129852 1135249 1140263 1144121 1145963 1146026 1145573 1145514 1145605 1145363 1145217 1146153 1148610 1152556 1158380 1166786
60567 1166786 1177731 1190215 1203192 1216075 1228538 1240808 1254211 1270355 1289345 1309614 1329734
60556 1329734 1349526 1369240 1388899 1408995 1430523 1453420 1475974 1496806 1516509 1536122 1554712
60545 1554712 1569843 1580051 1585514 1586524 1582743 1574245 1562036 1547053 1529374 1508920 1486436 1463444
60533 1463444 1441465 1421377 1403192 1386410 1370871 1357132 1345722 1336286 1328031 1320828 1315273 1311650
60521 1311650 1309457 1308029 1307107 1306605 1306222 1305533 1304380 1303063 1302187 1302127 1302587 1302948 1303124 1303677 1304872 1306203 1307208
60504 1307208 1308190 1309676 1311842 1315162 1320887 1329814 1340987 1352814 1365273 1379790 1396884 1415223 1433375
60491 1433375 1451389 1470100 1489847 1510644 1532934 1557191 1582992 1609312 1635909 1664076 1695779
60480 1695779 1732100 1772573 1816168 1862845 1913542 1968044 2023149 2073661 2115228 2145666 2163826
60469 2163826 2168521 2159320 2137873 2107715 2072821 2036464 2000955 1967876 1938463 1913873 1894970 1881997
60457 1881997 1874826 1873521 1878201 1888310 1902578 1919917 1939844 1962030 1986248 2013255 2045017 2083323
60445 2083323 2128449 2179704 2237029 2301597 2375222 2459702 2556434 2665990 2788171 2923145 3072504
60434 3072504 3238570 3422590 3624053 3841763 4074939 4323182 4586372 4865497 5163478
60425 5163478 5484463 5831846 6206407 6605081 7019617 7435075 7829523 8176322 8448462
60416 8448462 8622996 8683998 8624205 8446002 8161663 7791913 7362473 6899576 6425932 5958310
60406 5958310 5507362 5079522 4679482 4311232 3977195 3677187 3408914 3169492 2956291
60397 2956291 2766711 2598004 2447629 2313422 2193328 2085450 1988499 1901598 1823321 1751548
60387 1751548 1684928 1623904 1569409 1520766 1475932 1433884 1395616 1362162 1332508 1304356 1276635
60376 1276635 1250410 1227333 1207799 1190706 1174626 1158941 1143978 1130160 1117330 1105171 1093989
60365 1093989 1084262 1075332 1065556 1054434 1043718 1035501 1029825 1025181 1020806 1017077 1013917 1010452 1006630
60352 1006630 1003908 1003693 1006017 1010153 1015574 1021731 1027777 1033195 1038069 1042308 1045496 1048058 1051603 1057299
60338 1057299 1064689 1072892 1082006 1092224 1102430 1111184 1118709 1126407 1134502 1141558 1146567 1150256 1153948
60325 1153948 1158090 1162414 1166649 1170503 1173532 1175575 1176995 1178172 1179078 1179498 1179282 1178232 1176220 1173572 1170933
60310 1170933 1168537 1166101 1163579 1161467 1160118 1159264 1158651 1158705 1160066 1162757 1166193 1169827 1173417 1176998 1181152
60295 1181152 1187178 1196295 1208383 1221855 1235010 1247252 1258811 1269704 1279647 1289001 1299083 1311034
60283 1311034 1324618 1338551 1351764 1363744 1373815 1380905 1384412 1384888 1383578 1381581 1379542 1377644 1375683
60270 1375683 1373677 1372687 1374380 1379217 1385511 1390865 1394199 1395876 1396416 1396077 1395410 1395022 1394365 1391503 1384711
60255 1384711 1374236 1362328 1351710 1343907 1338578 1334182 1329468 1324520 1320363 1317616 1315699 1313382 1310033
60242 1310033 1306248 1303233 1301588 1300942 1300861 1301699 1303983 1307241 1310202 1312173 1313438 1314343 1314913 1315521 1316763 1318277
60226 1318277 1318863 1318412 1318587 1320766 1324422 1328538 1333384 1339591 1346610 1353893 1362769 1375139 1390563 1406618
60212 1406618 1422090 1437908 1454715 1471503 1487324 1502734 1518742 1535619 1553489 1572846 1593650
60201 1593650 1615037 1636713 1659686 1684887 1712226 1741958 1775906 1815911 1861504 1910262 1960407
60190 1960407 2012381 2068109 2129438 2197181 2271170 2351210 2438053 2533130 2637269 2750244 2871597
60179 2871597 3001101 3138056 3281070 3429121 3582236 3740636 3903831 4071007 4241363
60170 4241363 4413221 4583304 4747651 4902855 5045914 5173771 5284159 5376685 5452126 5510688
60160 5510688 5551615 5574455 5580050 5570311 5547557 5514295 5473405 5428387 5383097 5340737 5303100 5271544
60148 5271544 5248818 5238953 5244754 5266098 5301362 5349897 5412371 5489435 5581191 5687719 5809043
60137 5809043 5944272 6091174 6246587 6406936 6568708 6728891 6884746 7032774 7168335
60128 7168335 7286893 7385437 7462319 7516238 7546136 7551790 7533704 7492508 7429156 7345786 7245986
60117 7245986 7134215 7015161 6893348 6772900 6657732 6551986 6459601 6383005 6322790 6279239
60107 6279239 6253593 6247288 6260719 6293687 6346404 6418719 6508469 6611647 6724089 6841966 6960823
60096 6960823 7075661 7182678 7280209 7367468 7443058 7505277 7553464 7588569 7612555 7627584 7635706
60085 7635706 7639281 7641770 7647837 7662218 7688459 7728970 7786061 7862446 7960678 8082476 8228694
60074 8228694 8399807 8596549 8820170 9071785 9351464 9658683 9994048 10359643 10756685
60065 10756685 11183282 11635415 12109587 12603252 13112797 13632275 14154194 14670292 15171311
60056 15171311 15647309 16089075 16488763 16838955 17132070 17361465 17522693 17613181 17631132 17575253
60046 17575253 17445424 17243605 16974670 16646738 16270242 15856254 15415709 14959945 14500920
60037 14500920 14050231 13618006 13212662 12840893 12507358 12214856 11965436 11761118 11603241
60028 11603241 11491375 11423067 11394190 11399396 11432983 11490058 11566515 11657283 11754869 11850328 11935758
60017 11935758 12005704 12056703 12086326 12092712 12074298 12029670 11958074 11860279 11738588 11595689 11433465
60006 11433465 11252874 11054666 10840205 10611989 10373677 10129375 9882574 9635944 9392469
59997 9392469 9156498 8933052 8726025 8537677 8369973 8225504 8106229 8011928 7941098 7893436
59987 7893436 7870428 7873168 7900563 7950399 8021524 8114276 8228897 8363933 8515762 8679114 8848232
59976 8848232 9017864 9182959 9337420 9474112 9586931 9672607 9729970 9757971 9755070 9720113
59966 9720113 9652908 9554310 9426666 9274121 9101740 8914351 8716773 8514721 8314389 8121007
59956 8121007 7938348 7769404 7616756 7482458 7368462 7277054 7210086 7168066 7151042 7160115
59946 7160115 7196758 7260647 7349617 7462081 7598235 7758420 7941511 8145421 8367849 8605615
59936 8605615 8854015 9107483 9360014 9604570 9833310 10039444 10218174 10365425 10477024
59927 10477024 10550262 10585198 10583067 10544138 10468386 10357649 10215925 10048320 9861251 9663117
59917 9663117 9462752 9266765 9079506 8905551 8750671 8619982 8516309 8440831 8394162 8376212
59907 8376212 8385890 8421616 8481706 8563992 8665860 8784961 8919093 9064939 9217865 9373779
59897 9373779 9530848 9688771 9846652 10001894 10150652 10288943 10413932 10524993 10623494 10711243
59887 10711243 10789409 10859303 10923551 10985689 11048884 11116043 11191232 11280038 11388038 11519342 11677003
59876 11677003 11864386 12085521 12344202 12643088 12983453 13365065 13785814 14241614 14726964
59867 14726964 15235509 15759651 16289379 16811520 17310175 17767856 18166586 18489046 18720181
59858 18720181 18849038 18869999 18783059 18593509 18311262 17949749 17524445 17051542 16547135 16026573
59848 16026573 15503638 14989850 14494555 14025740 13590533 13194722 12842072 12534731 12274448
59839 12274448 12062797 11899814 11783162 11709777 11678315 11688950 11740482 11828690 11948042 12093881
59829 12093881 12261734 12445100 12635299 12823291 13000201 13155895 13278720 13357869 13385551 13356478
59819 13356478 13266428 13113056 12898198 12628229 12311543 11955989 11568856 11158536 10735127
59810 10735127 10308811 9887606 9476754 9080040 8701130 8343310 8008566 7697924 7412724
59801 7412724 7154561 6923590 6717914 6535542 6376244 6240324 6125824 6028244 5943224 5868527
59791 5868527 5803062 5745047 5691901 5641424 5592328 5543970 5496284 5449926 5405943 5365143 5327849
59780 5327849 5293899 5262338 5231227 5198353 5162394 5123186 5080761 5034407 4983121 4927122 4868713
59769 4868713 4811233 4756790 4705090 4654605 4604609 4555764 4509174 4465830 4427244 4395813 4373814
59758 4373814 4362034 4359351 4363288 4371128 4381561 4395892 4417013 4446636 4484065 4528144 4579447 4639496
59746 4639496 4708487 4785098 4868237 4957521 5051751 5148014 5242727 5333006 5417059 5494195 5564725
59735 5564725 5629069 5686761 5737136 5781130 5821529 5861262 5902388 5947031 5998169 6058849 6131462
59724 6131462 6218316 6321938 6444019 6584856 6744743 6925459 7129771 7360105 7618431 7906704
59714 7906704 8226484 8578486 8963284 9381833 9834132 10317154 10824094 11344173 11861115
59705 11861115 12351384 12785285 13131846 13365451 13471833 13451493 13318620 13095764 12807822
59696 12807822 12478756 12130299 11780356 11441714 11123066 10831302 10572057 10348569 10161589
59687 10161589 10010838 9895851 9815627 9768753 9754201 9771229 9818646 9895344 10001550 10138265
59677 10138265 10305363 10501698 10727529 10985320 11277421 11604235 11965592 12362732 12797812
59668 12797812 13272525 13788607 14349088 14957539 15616139 16325456 17085954 17898663 18764192
59659 18764192 19681760 20649145 21662586 22716127 23801093 24906290 26018758 27124895
59651 27124895 28211704 29267670 30283488 31253561 32177852 33061909 33914184 34743045 35555907
59642 35555907 36359330 37157546 37950004 38730848 39490708 40218161 40899382 41517907 42056525
59633 42056525 42500489 42839907 43070522 43193423 43214310 43142901 42992994 42782836 42534332 42270396
59623 42270396 42012040 41777423 41583020 41444819 41377919 41395120 41506144 41717985 42035532 42461779
59613 42461779 42997858 43643132 44394989 45247918 46192214 47213011 48289908 49396995 50503019
59604 50503019 51571264 52559103 53418331 54097947 54549644 54733947 54624773 54211977 53502406
59595 53502406 52519244 51299262 49888644 48338430 46699797 45019605 43337835 41687770
59587 41687770 40096925 38586108 37167145 35842053 34604269 33439631 32326249 31235678
59579 31235678 30137823 29008325 27834623 26618026 25371457 24114457 22867860 21650232
59571 21650232 20476497 19357932 18302678 17316376 16402325 15561014 14790001 14085045 13441667
59562 13441667 12855671 12322885 11839344 11401731 11006914 10651005 10329568 10038829 9776090
59553 9776090 9538848 9324134 9128899 8950495 8786714 8635705 8495626 8363631 8235406
59544 8235406 8106714 7975631 7842513 7707788 7570651 7429848 7284652 7134990 6982066
59535 6982066 6829354 6681593 6541838 6410250 6286197 6170389 6064125 5967713 5880905 5804170
59525 5804170 5738365 5683651 5639742 5606757 5584829 5573233 5570773 5576698 5590562 5611770 5640127 5676131
59513 5676131 5719661 5768868 5821600 5877499 5937500 6001616 6068769 6138877 6213719 6295333 6384621
59502 6384621 6481782 6587104 6700921 6823819 6957458 7104430 7266704 7444746 7638610 7849286
59492 7849286 8078406 8327095 8595701 8884250 9192454 9519307 9863306 10223194 10598035
59483 10598035 10986172 11384295 11787819 12191972 12592052 12982797 13358432 13713928 14045464
59474 14045464 14348668 14617137 14844541 15028804 15173050 15282052 15359034 15406434 15427855 15427386
59464 15427386 15407997 15372758 15327610 15281251 15241991 15215832 15207540 15222024 15264017 15337332 15444693
59453 15444693 15586986 15761625 15961936 16178385 16399884 16613849 16806228 16962572 17069227
59444 17069227 17113792 17085803 16978310 16789001 16519740 16175463 15763877 15295542 14783259 14240966
59434 14240966 13682985 13123430 12575150 12048544 11551124 11087949 10662245 10275824 9929310
59425 9929310 9622278 9353430 9121023 8923509 8759918 8629699 8532243 8466609 8431743 8426984
59415 8426984 8452211 8507214 8590839 8700985 8835543 8993213 9173411 9375725 9599532 9843525
59405 9843525 10105107 10380295 10664209 10951097 11233590 11502581 11748583 11963095 12138467
59396 12138467 12267238 12342701 12360112 12316844 12211806 12045923 11823458 11551949 11240112 10895837
59386 10895837 10526227 10138974 9742983 9347174 8958376 8580237 8214412 7862876 7528764
59377 7528764 7214909 6922318 6650686 6399799 6169652 5959632 5768687 5596300 5442310
59368 5442310 5305580 5183789 5075068 4979271 4897050 4828072 4770702 4723373 4685748 4658359 4641386
59357 4641386 4634125 4635636 4645407 4663139 4688405 4721248 4762543 4812338 4867350 4921215 4968157 5006207
59345 5006207 5036991 5063806 5090716 5122096 5161222 5209434 5267538 5337291 5419933 5513401 5612546
59334 5612546 5712618 5812133 5912839 6018326 6132973 6261117 6406445 6572037 6760412 6972808
59324 6972808 7208950 7468694 7753881 8067756 8412856 8790512 9202076 9649323 10133826
59315 10133826 10657370 11223055 11834336 12492377 13195400 13940660 14725345 15544488 16388980
59306 16388980 17246419 18103329 18946386 19763026 20542283 21275047 21953548 22571683 23126517
59297 23126517 23618673 24050558 24424592 24742976 25007502 25218195 25372443 25466021 25494371 25452536
59287 25452536 25334916 25136216 24852511 24481402 24022678 23480205 22862667 22181330 21447148
59278 21447148 20670407 19862175 19034534 18199279 17367138 16548008 15750868 14983004 14249703
59269 14249703 13554674 12900405 12288249 11718762 11192206 10708663 10267750 9868370 9508478
59260 9508478 9185076 8894880 8635366 8404968 8202231 8025261 7872074 7740763 7628912
59251 7628912 7533610 7452811 7386276 7334482 7296869 7271800 7258096 7255895 7265948 7288513 7323105
59240 7323105 7368983 7425660 7492849 7569838 7655034 7746518 7843080 7944291 8049353 8156293 8262642
59229 8262642 8366741 8468214 8567400 8664549 8759518 8852215 8943353 9034558 9127481 9223169 9322782
59218 9322782 9428413 9542060 9663477 9789660 9916668 10041468 10162145 10277357 10386159
59209 10386159 10487832 10581399 10665244 10736895 10792553 10827186 10836158 10817159 10770240 10696527 10598133
59198 10598133 10479105 10344723 10199272 10045615 9887289 9729519 9577347 9433925 9301441
59189 9301441 9182383 9078620 8990195 8916329 8857044 8812706 8782517 8764614 8757280 8758982 8767521
59178 8767521 8780308 8795664 8813295 8833595 8856938 8883372 8912592 8944648 8981200 9025781 9082389
59167 9082389 9154148 9243515 9352923 9484641 9640742 9823800 10036855 10281941 10559411 10869442
59157 10869442 11213150 11590880 11999730 12433589 12884797 13344335 13800619 14239371 14644817
59148 14644817 15000498 15289887 15498262 15614857 15632976 15548596 15360261 15070798 14688567 14226815
59138 14226815 13701937 13131503 12532232 11918835 11304390 10700920 10118557 9564242 9042046
59129 9042046 8554702 8104121 7690547 7312203 6966201 6649650 6360267 6096533 5857235
59120 5857235 5640449 5443358 5263633 5100560 4954042 4822851 4704785 4598358 4503397 4419944
59110 4419944 4347238 4283891 4228505 4180322 4139733 4107827 4084779 4069035 4058899 4054562 4057605 4068708
59098 4068708 4086912 4111127 4141251 4177545 4219839 4267842 4321673 4381668 4447900 4520031 4597405
59087 4597405 4679380 4765833 4857222 4953924 5055755 5162237 5272667 5385454 5498230 5609462
59077 5609462 5719413 5828517 5935301 6036873 6131035 6216830 6293441 6360025 6416756 6464789
59067 6464789 6504853 6536810 6560874 6578558 6592218 6604180 6616275 6629546 6644571 6662679 6686539
59056 6686539 6718636 6759567 6808966 6867869 6938674 7022652 7118889 7226182 7344907 7476546 7622407
59045 7622407 7783292 7959470 8150202 8353871 8569083 8795270 9031937 9277710 9529989
59036 9529989 9784564 10035289 10274791 10495731 10690743 10851441 10969097 11037341 11053795 11018847
59026 11018847 10933982 10802089 10628592 10420931 10186640 9932007 9662069 9381135 9093082
59017 9093082 8801260 8508116 8215210 7923952 7636188 7353689 7077451 6808271 6547745
59008 6547745 6297677 6058374 5828512 5606957 5394078 5191218 4999784 4820865 4654534
58999 4654534 4499057 4351866 4211986 4080683 3959152 3846573 3741361 3643549 3554782 3476101
58989 3476101 3406551 3343904 3286288 3233243 3185464 3143224 3104820 3067121 3027978 2987428 2945980
58978 2945980 2902597 2855504 2804679 2752239 2700109 2648244 2595664 2542587 2490792 2442103 2397187
58967 2397187 2355973 2318667 2285864 2257770 2233768 2212859 2194307 2177860 2163673 2152090 2143047
58956 2143047 2135504 2127949 2119838 2112143 2106091 2101783 2098535 2096089 2094741 2094511 2094898 2095441 2096048 2096988 2099032
58941 2099032 2103267 2110055 2118305 2126467 2134038 2141451 2148788 2155571 2161862 2168650 2176926 2186919 2198328 2210718
58927 2210718 2223653 2236964 2250923 2265748 2281198 2297273 2315026 2335760 2359395 2384334 2409089
58916 2409089 2433540 2458733 2485956 2515792 2547521 2579823 2612583 2647300 2684865 2723841 2762390
58905 2762390 2801216 2842731 2887548 2933781 2980055 3027323 3077191 3130159 3186252 3245738 3308188
58894 3308188 3372176 3436996 3503658 3573247 3645370 3719255 3795462 3875337 3959329 4046765 4136853
58883 4136853 4229233 4324240 4423357 4528826 4642046 4762886 4891169 5028053 5175128 5332778
58873 5332778 5500417 5678040 5866746 6067992 6283065 6513240 6760122 7025976 7313579
58864 7313579 7624846 7959235 8314579 8690472 9090332 9519318 9980635 10474700 11001508
58855 11001508 11562807 12161787 12801198 13482012 14203678 14965435 15767001 16607671 17484964
58846 17484964 18394614 19331294 20288088 21254998 22218784 23164162 24073842 24927116 25700054
58837 25700054 26368445 26910549 27307550 27543783 27608805 27499698 27221329 26785235 26208570
58828 26208570 25512591 24720287 23854698 22938567 21993455 21037683 20085736 19150129 18242545
58819 18242545 17372035 16543380 15758826 15020697 14330888 13688657 13090915 12534613 12017247
58810 12017247 11535140 11083171 10657049 10254827 9875614 9517738 9178892 8857542 8553537
58801 8553537 8267504 7999964 7750880 7519740 7305928 7108875 6927887 6762235 6611597
58792 6611597 6476114 6355768 6250066 6158414 6080252 6014547 5959905 5915797 5883151 5863093 5855462
58781 5855462 5859191 5873769 5899610 5937079 5985842 6045262 6115173 6196246 6289605 6395804 6514158
58770 6514158 6643690 6784909 6939967 7110663 7296944 7497863 7713446 7945065 8194589
58761 8194589 8463942 8755135 9069956 9409657 9775330 10168474 10590989 11044963 11532780
58752 11532780 12057011 12619761 13222251 13865149 14548899 15273554 16038662 16843323 17685581
58743 17685581 18561151 19462798 20380755 21303123 22215913 23103209 23947028 24726262 25416416
58734 25416416 25992426 26432840 26721381 26846046 26799793 26583376 26205953 25681922 25028301
58725 25028301 24265312 23416576 22506007 21554633 20580973 19602600 18635151 17690319 16776041
58716 16776041 15897935 15059335 14261111 13503248 12786308 12110350 11473597 10873947 10311176
58707 10311176 9785865 9296507 8839389 8411241 8010522 7636234 7286932 6961117 6657536
58698 6657536 6375021 6112747 5870221 5646096 5437519 5241832 5058491 4888187 4730588
58689 4730588 4584255 4448334 4322809 4207147 4100004 4000264 3907275 3820196 3738189 3661046
58679 3661046 3588627 3520027 3454470 3392592 3335460 3282569 3232246 3183853 3138053 3094873 3052981
58668 3052981 3011231 2969740 2929099 2889465 2850581 2811767 2771859 2730072 2686820 2642761 2597332
58657 2597332 2549413 2499227 2448195 2396981 2345167 2293072 2242329 2194001 2147285 2100811 2054441
58646 2054441 2009269 1966433 1926429 1889093 1853956 1820761 1789604 1760365 1732467 1705656 1680356
58635 1680356 1656463 1632496 1607036 1580472 1554218 1528794 1504021 1480493 1459121 1439392 1419878
58624 1419878 1400538 1382928 1367902 1354735 1342887 1333004 1325564 1319948 1315676 1313359 1313626 1316004 1319634
58611 1319634 1324353 1330451 1337951 1346610 1356000 1365252 1373425 1380522 1387442 1394454 1400318 1403280 1402471 1398020
58597 1398020 1390521 1380947 1370727 1361291 1353460 1347386 1343068 1340908 1341680 1345624 1351712 1358505 1365973 1375735
58583 1375735 1389185 1406271 1426481 1449746 1475449 1501870 1528090 1555617 1586619 1621222 1658106
58572 1658106 1697181 1739824 1786603 1836517 1888788 1944131 2004057 2069841 2142118 2220584 2304394
58561 2304394 2393774 2490687 2596766 2711381 2833394 2964222 3107234 3264229 3434350 3616545
58551 3616545 3811327 4019743 4242016 4477481 4724593 4980889 5244053 5512778 5785064
58542 5785064 6055587 6315908 6556896 6769612 6944784 7074130 7152818 7179153 7152102 7071474
58532 7071474 6940899 6768402 6563053 6332423 6083524 5823950 5560806 5299689 5045266
58523 5045266 4801385 4570008 4351601 4147438 3960279 3792065 3642004 3507598 3386479
58514 3386479 3276887 3177537 3087685 3006654 2933180 2865975 2804515 2747984 2693931 2639817 2585793
58503 2585793 2534025 2485172 2437501 2389760 2342885 2298318 2256263 2216072 2176820 2137305 2097129
58492 2097129 2057801 2020946 1985612 1949568 1913075 1878537 1846113 1812823 1776984 1740545 1705663
58481 1705663 1671838 1638212 1606174 1577436 1551336 1526051 1501010 1476519 1452661 1430173 1410750
58470 1410750 1394680 1379698 1364012 1348989 1336864 1327024 1316670 1304414 1291364 1279091 1268113
58459 1268113 1258093 1248413 1238723 1229515 1221627 1214917 1208439 1202153 1197089 1193463 1190334 1187617 1186417 1186490
58445 1186490 1185490 1182099 1178015 1175313 1173455 1170509 1165850 1160099 1153688 1147032 1140936 1135463 1129468 1122386
58431 1122386 1115142 1108228 1100597 1091990 1084689 1081057 1080367 1079729 1077255 1072977 1067666 1062193 1057336 1053112
58417 1053112 1048955 1044950 1041661 1038500 1034284 1029994 1028481 1030217 1031840 1030461 1026912 1022848 1017361 1009233
58403 1009233 1000459 994393 991626 990405 989952 990602 991499 990943 988769 986281 984282 983023 983410 986210 990508
58388 990508 994668 998348 1002168 1006313 1011084 1017715 1026640 1035781 1042574 1047111 1051487 1056595 1061344 1064523
58374 1064523 1065799 1065255 1063309 1060707 1057570 1053162 1047398 1041384 1035573 1028942 1021245 1014346 1009748 1006427
58360 1006427 1002764 998916 995540 992060 988386 986630 988599 992865 996652 999448 1002539 1006324 1010596 1016316
58346 1016316 1024594 1034622 1044775 1054846 1065301 1075630 1085666 1097151 1111422 1126739 1140424
58335 1140424 1152624 1165226 1178044 1188977 1197545 1205721 1215554 1227951 1243141 1260220 1276791 1290902
58323 1290902 1302619 1312260 1318732 1321697 1323708 1327615 1333110 1338207 1342603 1346941 1350425 1352249 1354055 1357797
58309 1357797 1362295 1365114 1366831 1370146 1375577 1381308 1386708 1392750 1399446 1406021 1413349 1423265 1435631 1448609
58295 1448609 1461390 1474254 1486697 1498029 1508925 1519882 1529358 1536153 1542303 1550574 1560424 1569623
58283 1569623 1578427 1588564 1599320 1608480 1616323 1624961 1634548 1643819 1653517 1665423 1678711 1691183 1703462
58270 1703462 1717983 1734398 1750059 1764728 1780833 1799304 1819025 1840072 1863637 1888990 1914280
58259 1914280 1939888 1967282 1995376 2022095 2048717 2078138 2109521 2139330 2167150 2195550 2224607
58248 2224607 2251852 2277705 2305489 2335549 2364640 2392119 2421647 2455453 2491592 2528259 2566437
58237 2566437 2606827 2648124 2689750 2732857 2777666 2823067 2869177 2916979 2965535 3013118 3060637
58226 3060637 3110054 3160259 3208971 3257700 3309830 3364732 3419430 3475271 3536736 3603890 3672494
58215 3672494 3741789 3815510 3894593 3975592 4057488 4143563 4235202 4330190 4428674 4534680 4650118
58204 4650118 4773054 4902962 5041538 5187372 5336498 5489761 5653188 5829626 6016416
58195 6016416 6212370 6419992 6639428 6867645 7105488 7358204 7626949 7907082 8197055
58186 8197055 8501819 8825266 9166603 9526144 9907133 10309795 10731399 11174303 11646028
58177 11646028 12149417 12681008 13240955 13835680 14468811 15139227 15850905 16615055 17439288
58168 17439288 18323652 19269573 20282503 21363108 22506607 23714065 24994080 26351320
58160 26351320 27785124 29301734 30915166 32633897 34461194 36412048 38514651 40790988
58152 40790988 43251162 45910701 48797051 51935983 55351735 59087425 63207555 67777010
58144 67777010 72860155 78545593 84945030 92157798 100261345 109345006 119526683 130932557
58136 130932557 143698801 158004720 174062746 192059819 212151343 234530780 259476191
58129 259476191 287361894 318696669 353970515 392876061 433067332 469632603 496395497
58122 496395497 508563203 504791292 487213751 459840335 426819548 391514606 356291756
58115 356291756 322603894 291204189 262431298 236425446 213204591 192691938 174768174
58108 174768174 159303041 146140211 135097005 126000543 118697470 113021016 108777544
58101 108777544 105752477 103654109 102012507 100194091 97608548 93950986 89270364 83847280
58093 83847280 78025630 72106762 66310508 60776478 55588376 50796983 46424928 42467997
58085 42467997 38909521 35732889 32915921 30423472 28216748 26264612 24538238 23002438
58077 23002438 21622099 20372234 19234289 18188673 17218822 16316846 15476948 14687869 13938894
58068 13938894 13228482 12559736 11931565 11340758 10787998 10274505 9796082 9347028 8926857
58059 8926857 8537155 8174455 7831559 7503417 7187111 6879175 6577947 6286290 6007701
58050 6007701 5741737 5486156 5240365 5003620 4773692 4551044 4340750 4146360 3965079
58041 3965079 3792516 3628553 3474731 3329597 3191103 3060625 2940222 2828366 2722206
58032 2722206 2621692 2527892 2439644 2355175 2274617 2197883 2122775 2048367 1977331 1911619 1848645
58021 1848645 1785221 1722508 1663520 1608402 1555896 1506889 1462465 1420574 1378761 1338672 1304069
58010 1304069 1275543 1250506 1227209 1205621 1185374 1165750 1146891 1128805 1110339 1091128 1072981
57999 1072981 1057389 1043462 1030195 1018396 1007996 996038 980374 963365 948861 937199 926165
57988 926165 915251 905824 898296 892045 887134 883580 879993 875336 870903 868322 866918 865335 864223 864779
57974 864779 865919 865563 863666 861541 859200 855780 851643 847832 844250 840355 836572 833099 828607 822197
57960 822197 815282 809421 803834 797382 791342 787371 783994 778202 769756 761007 752995 744494 734721 724432
57946 724432 714360 704692 695913 688311 681088 673830 668095 665262 663386 658792 650836 642778 637684 635522
57932 635522 634617 633941 633124 631674 629172 625781 622150 619090 617093 615835 614561 613221 612491 612427 612300 612211
57916 612211 613394 616084 618608 619646 619920 620507 621037 620914 620744 620914 620092 616783 611238 604490 596960 589545
57900 589545 584344 582232 581051 578318 574507 571610 569640 566961 563243 559761 557359 556126 556428 558251
57886 558251 560079 560409 559902 560337 562147 564686 567919 571772 574719 575317 574611 574812 576074 576611 575350 572237
57870 572237 566500 557235 545599 534148 523919 514220 505078 497555 491437 484864 476830 468333 460734
57857 460734 454513 449866 446951 445363 444739 445834 449569 455211 461061 466682 472732 478859 483766 487509
57843 487509 491766 497428 503531 508903 513386 517033 519501 520637 520688 519793 518187 516620 515467 513851 510875
57828 510875 507132 503457 498930 492028 483352 475126 468183 461544 454802 448701 443217 437396 431539 427378
57814 427378 425477 424420 423308 423208 425293 429134 433627 438172 442312 445748 449463 455393 464131 474060
57800 474060 483228 490868 496690 500343 502400 504539 507729 511087 513034 512570 509063 502153 492642 482374
57786 482374 472522 462827 452989 443727 435878 429275 423082 416524 409083 400909 393189 387089 382189 377018
57772 377018 371150 365465 360250 354654 348352 342183 336571 330736 324069 316873 309086 299740 288556 276876
57758 276876 266194 256845 248733 242085 236692 231642 226538 221855 217509 212547 207141 203276 202196 202511
57744 202511 202307 201970 203280 206622 210855 215466 221074 227784 234367 239316 241889 242215 241322 241033 242956
57729 242956 247183 252296 256623 259363 260884 262419 265214 269461 274127 277960 280338 280997 279520 275607
57715 275607 269601 262398 255007 248188 242034 235849 229072 222439 217477 214607 212575 210160 207615 205827
57701 205827 204771 203633 202082 200601 199604 198793 197606 196188 195767 197842 202812 209772 217860 227167 237623
57686 237623 247668 255326 260478 264870 269842 275177 280224 284921 289452 294023 299159 305062 310547 314113
57672 314113 316442 320294 327208 335704 343632 350872 358601 367156 376064 385384 395624 406742 418350
57659 418350 430541 443602 457262 471093 485310 500401 516293 532605 549409 567128 586017
57648 586017 606330 628577 653060 679406 707024 735709 765538 796751 829998 865961 904359
57637 904359 944145 985231 1029184 1077540 1130212 1186313 1245787 1309375 1377579 1450592 1528987
57626 1528987 1613874 1706789 1809696 1924241 2050467 2187334 2335340 2497599 2677216 2874389
57616 2874389 3087322 3315221 3558962 3819243 4095606 4387228 4693165 5011026 5335278
57607 5335278 5655883 5957159 6218363 6417473 6536703 6566562 6507345 6368840 6167968 5923950
57597 5923950 5653336 5368170 5077299 4787941 4506116 4236799 3984085 3750615 3536869
57588 3536869 3341818 3164494 3004606 2861833 2735219 2623252 2523980 2435365 2356373 2287724
57578 2287724 2230685 2184918 2148174 2118264 2094723 2078364 2069859 2069109 2075672 2089328 2110224 2138549
57566 2138549 2174183 2216897 2266874 2324689 2390690 2465004 2548482 2642919 2749627 2868134 2996886
57555 2996886 3134977 3282626 3440225 3607416 3782698 3963114 4144270 4321058 4488128
57546 4488128 4639376 4767543 4865266 4926723 4948283 4928400 4867824 4769666 4638519 4479505
57536 4479505 4298396 4101787 3896007 3685929 3475495 3268911 3070242 2881945 2704733
57527 2704733 2538835 2384495 2241362 2108496 1985205 1871144 1765660 1668039 1578494 1497769
57517 1497769 1425250 1358407 1294771 1233889 1176870 1124718 1077786 1036275 1000128 968285 938859
57506 938859 910579 883865 860159 840218 823390 808607 795628 784890 776370 769312 763216 758394
57494 758394 755197 753222 751842 751293 752679 756933 764021 773061 783109 794024 806708 822290 841127
57481 841127 862902 887502 915073 945218 977095 1010693 1047248 1087918 1132696 1180997 1232601
57470 1232601 1287683 1346697 1410700 1480955 1557739 1640426 1729236 1825864 1931803 2047035 2170918
57459 2170918 2302937 2441631 2584192 2728420 2873804 3019084 3159807 3289798 3404002
57450 3404002 3498273 3567717 3607754 3616539 3594501 3542243 3461239 3356146 3233705 3098885 2954090
57439 2954090 2802256 2648361 2497323 2352391 2216029 2090161 1974633 1867389 1767235
57430 1767235 1675096 1592002 1517690 1451980 1395636 1348691 1309449 1276301 1249081 1227644 1210648
57419 1210648 1197035 1187422 1182864 1183465 1189314 1201326 1219845 1243676 1271825 1304900 1343434 1386364
57407 1386364 1433014 1485343 1546115 1615598 1692058 1774845 1864927 1962789 2067843 2179798 2298580
57396 2298580 2422848 2550282 2679324 2808545 2933812 3047936 3143952 3217468 3265317 3283749
57386 3283749 3269544 3222363 3145018 3041872 2917584 2776799 2624027 2463630 2299925 2136941
57376 2136941 1977716 1824154 1677790 1540292 1412813 1295110 1185768 1083465 988029 900268
57366 900268 820733 748745 682777 621619 564713 511493 461354 414569 372152 333991 298015
57355 298015 262319 227426 195125 165666 137762 111259 87746 67889 49805 31262 12405
57343 -4989 -20244 -34392 -48351 -61757 -73951 -85184 -96266 -107396 -117862 -126934 -134852 -142803
57331 -142803 -151887 -162115 -172426 -181675 -189561 -196784 -204507 -213501 -223423 -232913 -240716 -246832 -252263 -257582
57317 -257582 -262194 -265340 -267471 -270049 -273968 -278585 -282525 -285220 -287351 -289913 -293178 -296685 -299996 -303143
57303 -303143 -306458 -310263 -314744 -319853 -325204 -330248 -334744 -338997 -343538 -348576 -353785 -358603 -362742 -366370
57289 -366370 -369756 -372819 -375399 -378028 -381807 -387058 -392490 -396399 -398500 -399980 -402018 -405070 -409375 -414932
57275 -414932 -420611 -424375 -425053 -423300 -420454 -417289 -414491 -413398 -415072 -418838 -422629 -424828 -425335 -425090 -425120
57260 -425120 -425955 -427432 -428959 -430013 -430310 -429640 -428182 -426975 -427178 -428401 -428693 -426755 -423379 -419947 -416427
57245 -416427 -411923 -406531 -401305 -396631 -391779 -385930 -378571 -369010 -356688 -342218 -327212 -312668 -297915
57232 -297915 -281025 -259802 -232795 -200377 -164764 -128211 -91262 -53348 -14411 25472 67768
57221 67768 114868 167213 222304 277280 331427 385467 439393 491832 540739 583800 618676 643903
57209 643903 659489 666226 664652 654972 637501 612745 581474 545069 505246 462946 418017 370637
57197 370637 322703 277192 236244 200269 168632 140672 116155 95264 78343 65589 57037 52712
57185 52712 52278 54465 57356 59579 60987 62112 63530 65848 69451 73696 77030 78737 80248 84042 91463
57170 91463 102228 115692 131627 149698 169080 189125 209900 231617 253812 275664 297183 319578
57158 319578 343993 369872 395064 417945 439306 461892 488218 519161 554408 593445 635822
57147 635822 680997 728338 777085 826220 874793 922573 970008 1017326 1063981 1109080 1151775
57136 1151775 1191140 1226538 1258778 1290147 1322249 1354004 1382776 1407567 1430219 1453206 1477055
57125 1477055 1500505 1522589 1543713 1564808 1586333 1608445 1631453 1655395 1679382 1702035 1722649
57114 1722649 1741405 1758423 1773191 1785058 1793558 1797949 1797272 1791493 1781882 1769638 1755014 1738621
57102 1738621 1722516 1708375 1695062 1679642 1660582 1638309 1612968 1583838 1551397 1517657 1483411
57091 1483411 1447048 1407364 1365756 1323858 1280333 1231761 1175645 1110623 1034589 944823 839914
57080 839914 719906 584707 433915 268041 88100 -106163 -316088 -541911 -782355 -1036647
57070 -1036647 -1305540 -1589974 -1890205 -2206789 -2541046 -2893837 -3265213 -3656337 -4071021
57061 -4071021 -4514772 -4993420 -5513553 -6083279 -6711057 -7403869 -8167438 -9008244 -9934905
57052 -9934905 -10958093 -12090303 -13346478 -14744781 -16306307 -18053523 -20008965 -22196321
57044 -22196321 -24643948 -27388005 -30473220 -33953164 -37892784 -42372269 -47489071 -53357222
57036 -53357222 -60104996 -67870537 -76794577 -87011845 -98642892 -111785625 -126506746
57029 -126506746 -142834960 -160752584 -180181514 -200981777 -222999557 -246156450 -270475108
57022 -270475108 -295918132 -322070458 -347899676 -371838098 -392183867 -407556432 -417134821
57015 -417134821 -420632848 -418160481 -410113961 -397115727 -379958362 -359531062 -336742655
57008 -336742655 -312454696 -287428124 -262291063 -237537081 -213549216 -190631401 -169031114
57001 -169031114 -148947477 -130526406 -113849859 -98930315 -85717831 -74116196 -63999134
56994 -63999134 -55222706 -47636187 -41092307 -35454025 -30596576 -26407276 -22785743 -19644562
56986 -19644562 -16909548 -14519207 -12423039 -10578790 -8950166 -7506329 -6222169 -5077448
56978 -5077448 -4055082 -3140212 -2320350 -1585161 -925479 -332555 201808 684623 1120993
56969 1120993 1513979 1865816 2179973 2461846 2717128 2950153 3164374 3363417 3550239
56960 3550239 3725582 3888711 4039661 4179455 4308018 4423500 4524500 4612279 4690472 4763424
56950 4763424 4834556 4904775 4972192 5035476 5098377 5167906 5243869 5309199 5332831 5284625 5149962
56939 5149962 4933762 4654825 4337472 4005135 3676531 3363997 3073682 2807077 2563230
56930 2563230 2340933 2139877 1960147 1801025 1660777 1537561 1430031 1336870 1256024 1184502
56920 1184502 1118738 1055355 992217 929021 866582 805475 745683 687557 632471 582120 537426
56909 537426 498379 464688 436263 413202 395566 383177 375656 372868 375214 383040 395635 411259
56897 411259 428476 446930 466264 484739 499855 510414 517211 521394 522910 521291 517540 514177 513101
56884 513101 514050 515658 517585 520976 526944 535350 545361 556671 569693 584799 601984 621320 643223
56871 643223 667936 694766 721773 745949 763714 771970 769624 758470 742211 724186 705892 687431
56859 687431 668832 650548 633081 616767 601944 588801 577023 566151 556429 548661 542934 538247
56847 538247 534021 531369 531941 535849 541665 548331 556015 565008 574942 585566 597344 610609 624833
56834 624833 639492 655165 672959 693098 714729 736943 759413 782151 805172 828186 849950
56823 849950 867926 879280 882688 879077 870615 859150 845508 829933 813061 796483 782207 771440
56811 771440 764018 759181 756700 757137 761444 770555 784896 803701 825032 847180 870160 895464 924227
56798 924227 955648 986695 1012867 1029645 1034319 1027061 1010367 987601 962083 936829 914026 894389
56786 894389 877520 863209 852200 845741 844755 849550 860022 876079 898069 926782 962704 1005256
56774 1005256 1052928 1103882 1155879 1205529 1248073 1278298 1292112 1288120 1268527 1238285 1202456
56763 1202456 1164020 1124292 1084911 1048324 1016249 988700 965067 945532 930976 922160 919698 924301
56751 924301 936183 954258 976670 1002244 1030859 1061968 1093025 1119813 1138348 1146340 1142963 1127941
56739 1127941 1101743 1066706 1027122 987388 949959 915247 883054 853667 827856 806549 790558
56728 790558 780140 774646 772902 773936 777180 782410 790034 801114 816174 833765 850786 864239 872198
56715 872198 873394 867106 853882 835507 813645 789119 762923 737028 713325 692151 672650 654315
56703 654315 637447 622307 608668 596355 585666 576903 569785 563551 557552 551681 546281 541703 537999
56690 537999 535042 532764 531057 529725 528927 529457 531791 534792 536187 534866 532043 529621 527960 526029 523335
56675 523335 520746 519324 519164 519559 519630 518530 515703 511518 507309 504147 501622 498374 493939 489518 486482
56660 486482 484491 481841 477778 473702 471505 471197 471030 469893 468591 468338 468896 469102 468832 469295 471123 473099
56644 473099 473428 471780 469346 467212 465582 464662 465241 467723 471231 474485 477172 479687 481855 483020 483323
56629 483323 483707 484461 484960 485280 486752 490018 493566 495351 495106 493882 492012 489039 485367 482400 480847
56614 480847 480083 479437 479005 478946 479005 479241 480375 482835 485908 488261 489041 488510 487993 488948 491425 493624 493842
56597 493842 492702 492455 494182 496646 497964 497268 494634 490608 486075 481488 475970 468456 459981 453301 449561
56582 449561 446792 442707 437659 433592 431091 428873 425591 420903 415241 409764 406282 406081 408679 412270
56568 412270 415319 417340 418581 419527 420335 420290 418292 414404 410391 408166 408163 409650 411888 414409 416880 419376
56552 419376 422197 424862 426128 425677 424852 424899 425401 425388 424858 423940 421618 417083 411828 408641 408600 410457 412822
56535 412822 415425 418269 421059 423768 426597 429165 430883 432106 433655 435077 434839 432726 430675 430492 431761
56520 431761 432793 432807 432395 432500 433834 436964 442050 448419 454704 459587 462417 463414 463396 463254 463671 465236
56504 465236 468355 472826 478009 483854 491154 500164 509602 518017 525697 534058 543320 551970 558655 563530
56490 563530 567540 571347 575228 579111 582322 584101 584698 585273 586454 587727 588484 588738 588380 586636 583056
56475 583056 578382 573585 568484 562188 554748 547446 541224 535537 529303 522705 517411 514833 514602 515059 514946
56460 514946 514109 512769 510866 508247 504890 500718 495831 491075 487670 485839 484499 482645 480320 477864
56446 477864 475197 472519 470727 470178 469762 468182 465526 462684 459970 457368 455389 454419 453872 453237 453335 455085
56430 455085 457629 459359 460407 462397 465841 469524 472444 474556 475458 474294 471581 469454 469238 470087 470741
56415 470741 471454 473272 476332 479708 482389 483986 485090 487173 491296 496633 501173 504050 506302 509147
56401 509147 512645 516447 520721 525673 530908 535712 539407 541428 541955 542556 545034 549392 553939 557503 560242
56386 560242 562114 562261 560656 558832 557900 557029 555042 552548 551171 551084 550464 547405 541800 535338 529831 525438
56370 525438 520834 515570 511521 510740 512325 513214 512062 510430 509738 509237 508068 507274 508229 510432 512444 513885
56354 513885 514957 515057 513621 511751 511258 512338 513516 513713 513111 512152 510919 509575 508473 507669 507075 507028
56338 507028 508039 509980 512131 514027 515784 517634 519536 521234 522427 522930 522762 522041 520911 519835 519613
56323 519613 520520 521747 522504 523345 525316 528039 530064 531212 533039 536574 541006 545062 548284 550461 551391
56308 551391 551959 553908 557604 561456 564478 567786 572323 576766 579455 581136 583837 587910 592068 595776
56294 595776 599699 604023 608079 611622 615071 618359 620786 622135 622975 623820 624907 626749 629952 634362 639112
56279 639112 643622 647987 652393 656584 659971 662094 663296 665035 668924 675165 682400 689358 695926 702460
56265 702460 709034 715794 722962 729903 735271 738934 742842 749143 758148 768729 779808 790670 800838
56252 800838 810655 821299 833466 846648 860173 874026 888154 902129 916063 930571 945110 957874
56240 957874 968175 977396 986602 994877 1001396 1007508 1015127 1024377 1034389 1045016 1056132 1066770 1076944
56227 1076944 1089050 1105278 1124628 1144593 1164705 1186038 1208127 1229212 1249466 1271625 1298198
56216 1298198 1329848 1366337 1407087 1450811 1496456 1544859 1598064 1657039 1721387 1791051 1866802
56205 1866802 1949154 2038138 2133964 2236833 2346759 2464919 2594234 2736753 2891082 3054334
56195 3054334 3225907 3407213 3598144 3796257 3999361 4206454 4415725 4623680 4826693
56186 4826693 5021630 5204609 5370981 5516993 5640108 5737682 5807199 5848238 5862653 5852461
56176 5852461 5819098 5765038 5694423 5611253 5517848 5415376 5304928 5187969 5066561 4942958
56166 4942958 4818027 4690564 4559314 4425009 4289110 4151498 4011268 3869007 3726075
56157 3726075 3582163 3436239 3289850 3146974 3010148 2878937 2752627 2632081 2518149
56148 2518149 2410318 2308013 2211712 2121877 2038020 1959570 1886710 1819981 1759917 1706895 1660178
56137 1660178 1617387 1576362 1537410 1502303 1471485 1443952 1419301 1397705 1378177 1359321 1341942
56126 1341942 1328409 1318908 1310631 1301463 1292409 1285503 1281044 1277902 1275194 1272893 1271755 1272946 1276821 1282330
56112 1282330 1288826 1297703 1310376 1325284 1339329 1352081 1366035 1382685 1401093 1420692 1442714 1467867
56100 1467867 1494873 1522463 1550980 1581069 1612329 1643882 1674974 1704921 1734051 1764504 1798119
56089 1798119 1833688 1868580 1902940 1939788 1981065 2026439 2076265 2132588 2196477 2267302 2345780
56078 2345780 2435240 2538770 2657097 2789557 2934338 3086922 3240889 3391261 3534956 3668118
56068 3668118 3786619 3890285 3983213 4068271 4143992 4207940 4259692 4298670 4322282 4328750 4319563
56057 4319563 4297187 4262639 4217076 4163030 4101375 4028835 3940945 3836470 3717555 3587416 3449684
56046 3449684 3308620 3168187 3031588 2902096 2782618 2673947 2575495 2488205 2414277 2353475
56036 2353475 2302583 2259473 2224770 2198483 2178164 2161955 2150401 2143570 2139432 2136952 2137790 2142840
56024 2142840 2149816 2156278 2162250 2167838 2171228 2171627 2171574 2173715 2177500 2181396 2186027 2192698 2201038 2210457 2221781
56009 2221781 2235167 2248629 2261119 2275104 2293600 2316309 2340761 2365619 2391024 2417510 2446331
55998 2446331 2478979 2514867 2551513 2588204 2626967 2668618 2710746 2751354 2791657 2833387 2876059
55987 2876059 2918678 2961532 3004680 3047470 3090917 3137417 3186794 3236149 3285031 3336792 3393338
55976 3393338 3452877 3514646 3581044 3652596 3725731 3798549 3874174 3955468 4041251 4130974 4227924
55965 4227924 4333826 4445247 4559806 4681301 4814011 4956210 5104146 5258396 5421460
55956 5421460 5592938 5772015 5961113 6162287 6373387 6592276 6821425 7064149 7320092
55947 7320092 7588550 7871988 8171795 8484735 8808058 9144012 9495492 9862444 10246830
55938 10246830 10655241 11091482 11552357 12036155 12549193 13098306 13683530 14304831 14969487
55929 14969487 15685478 16453449 17272189 18145730 19077761 20065792 21108656 22213169 23385789
55920 23385789 24625404 25932934 27320291 28800923 30380106 32064736 33874120 35830201
55912 35830201 37945462 40231520 42710899 45409686 48349867 51562740 55100612 59023988
55904 59023988 63391365 68276788 73782019 80011673 87048578 94971227 103880248 113891017
55896 113891017 125125702 137744239 151969953 168066493 186321464 207079311 230739440
55889 230739440 257661886 288084821 322066098 359138861 397500218 433347499 461425006
55882 461425006 476969734 477785437 464891202 441492996 411380684 377862003 343427009
55875 343427009 309767101 277899516 248364876 221429563 197192050 175614725 156567433
55868 156567433 139880283 125353586 112745984 101796786 92266747 83946546 76643838
55861 76643838 70191158 64463168 59366052 54812589 50721010 47029025 43689950 40658088
55853 40658088 37891285 35361956 33050949 30934066 28986184 27193106 25546612 24032076
55845 24032076 22632466 21340017 20152095 19059038 18047014 17109479 16244933 15445956
55837 15445956 14700522 14002021 13348724 12735596 12155599 11607228 11092372 10608196 10148557
55828 10148557 9711514 9298105 8905625 8529216 8168419 7825515 7499280 7186721 6888911
55819 6888911 6608593 6343845 6090246 5847493 5617890 5400207 5191018 4990377 4800390
55810 4800390 4619875 4445882 4278647 4119648 3966921 3817939 3675130 3542716 3419879
55801 3419879 3302710 3190832 3085708 2983874 2878659 2768585 2658522 2552717 2451721
55792 2451721 2355654 2265106 2178699 2094539 2014184 1941035 1874995 1812710 1752584 1695595 1641759
55781 1641759 1590005 1541142 1497128 1457853 1422176 1391196 1366666 1347098 1329425 1313586 1301484
55770 1301484 1292446 1284147 1277221 1274378 1275266 1276549 1276742 1276423 1273762 1264628 1248014 1227325 1205435 1181954
55756 1181954 1156101 1128810 1101053 1072960 1045354 1019580 995500 972149 950400 932267 917559
55745 917559 903974 890501 878055 866907 856372 847055 840494 836389 832859 829467 827251 825766 823072
55732 823072 818989 815618 814144 813545 812796 811873 810235 806682 801279 795418 789666 783470 777066 771673 767516
55717 767516 763388 758182 751247 741601 728630 713343 697229 680439 662759 645447 629898 615374
55705 615374 600470 586051 574122 564371 554492 543469 531954 519874 506477 492468 479392 467113
55693 467113 454555 442572 433102 425573 417189 407037 397062 388700 381325 374459 368788 364370 360199
55680 360199 356058 352663 349824 346785 344365 344045 344780 343670 340414 338245 339509 342837 345632 346878 346414
55665 346414 343750 339083 333889 329439 325942 323468 321897 319693 314932 308263 302883 300743 300510 299978 298648
55650 298648 297185 296034 295455 295507 295483 294778 294554 296842 301620 306500 309620 311022 310911 308774 304986 301319
55634 301319 298991 297715 297262 298232 300676 303643 306680 310167 313811 316773 319790 325035 332998 341578 349254
55619 349254 357164 366779 377330 386947 394819 400797 404215 404705 403290 401236 398373 393700 387269 380678
55605 380678 375907 373967 374235 375065 375604 376776 379608 383089 385135 385490 385946 387561 389317 389887 389194 387854
55589 387854 386497 385907 386410 386867 385788 383580 382006 381271 379565 375978 371828 368363 365007 360854 356171
55574 356171 351263 345225 337037 327027 316523 306796 298513 291056 282329 270793 257884 246722 238230
55561 238230 230506 222361 215060 209640 204882 199459 194158 190273 187355 184255 181151 178803 176783 174094
55547 174094 170912 168361 167001 166523 166384 165903 164468 162444 161166 161304 161927 161839 161010 160080 159408 159282 160115
55530 160115 161661 162835 162987 162495 161518 159262 155325 150825 147234 144755 142612 140316 137952 135782 134197
55515 134197 133522 133398 132843 131255 128992 127029 126543 128446 132247 135709 137021 137136 138519 141791 145377
55500 145377 148321 151151 153598 153913 151519 148290 145946 143954 141282 138554 136934 136167 135253 133922 132235
55485 132235 129763 126616 124344 124395 126185 127810 128199 127703 127117 126842 126637 125787 124059 122497 122331 123093 123109
55468 123109 121891 120550 119841 119731 121193 126077 134200 142554 148597 152545 155455 157155 157547 158014 159799
55453 159799 162475 165494 169473 174269 177580 177657 175976 175023 174531 172230 167535 162231 157895 154523 151403
55438 151403 147611 141893 133672 124160 115389 108479 103597 100775 99468 98159 95726 92709 90166 88084
55424 88084 85876 83405 80356 75868 70288 66051 65017 65831 65750 64270 63079 63190 64027 64877 65384 65059
55408 65059 64017 63743 65411 67906 69242 69423 69967 71075 71342 70178 68447 66600 64124 61121 58672
55393 58672 57250 56185 55059 54245 53859 53512 53389 54183 55660 56560 56315 55747 55647 55680 55132 53997 52936
55376 52936 52689 53595 55176 56304 56347 55946 56133 57060 58167 59054 59397 58659 56812 54812 53484 52578 51753
55359 51753 51623 52625 53758 53813 53157 52905 53110 53381 54460 57252 60744 62923 63610 64533 66563 68679 69732
55342 69732 69526 68047 65324 62321 60447 59832 59379 58579 57885 57341 56372 55042 53932 52679 50382 47697
55326 47697 46709 48113 50134 50974 50879 51049 51763 52562 53329 54345 55823 57763 59676 60386 58973 56086 53433
55309 53433 51920 51192 50884 51157 51865 52352 52261 51625 50266 48205 46463 46070 46385 45851 44359 43230 42913
55292 42913 42527 41965 42469 44516 46883 48524 49741 50692 50364 48005 44239 39968 35581 31882 30194 30436
55276 30436 30676 29828 29349 30969 34060 36821 38897 41132 43592 45613 47239 48791 49330 47327 43112
55261 43112 39252 38009 39324 41546 43247 43946 43781 43129 42419 41951 41798 41882 42167 42777 43820 44923 45203
55244 45203 44078 41940 39630 37440 35174 32881 30848 29121 27826 27695 29223 31503 33160 34425 36857
55229 36857 40749 44230 45714 45988 47012 49519 52645 55212 56599 56906 56898 57355 58021 57746 55997 53593
55213 53593 51589 50246 49482 49525 50436 51573 52105 51709 50561 49215 48590 49282 50723 51934 53158 55442
55197 55442 58366 59750 58465 56096 54682 54019 52576 50158 48051 46962 46271 45220 43689 41811 39869
55182 39869 38724 39460 42282 46198 49915 52694 54355 54933 54664 54206 54527 56071 57893 58272 56758 55013
55166 55013 54791 55687 56075 55685 55516 55499 54376 52316 51492 53103 55674 57438 58631 60057 61027 60627 59804
55149 59804 60332 62468 65274 68421 71854 74394 74612 72827 70454 67710 63925 60025 58502 60261 63172
55134 63172 64648 64443 64088 64556 65432 65863 65502 64616 63684 62900 62044 60892 59526 58097 56717 55831 56105
55117 56105 57379 58414 58366 57902 57972 58154 57359 55738 54619 54740 55721 57115 58766 60170 60684 60500 60322
55100 60322 60075 59089 57610 56789 56956 57228 57362 58633 62057 66643 70310 71859 71410 69605 67173 64874
55084 64874 63196 62278 62239 63096 64262 64919 65077 65355 65434 63974 60754 57548 55774 54530 52573 51254 53298
55067 53298 58836 64817 68763 71093 72911 73591 72319 70575 70850 73362 76068 77927 80092 83379 86495
55052 86495 87945 88221 88717 89510 89907 90495 92764 96673 100310 102380 103657 105341 107173 108073 107749 106693
55036 106693 105083 102628 99329 95759 92626 90477 89660 90278 92256 95500 99586 103377 105637 106369 106810
55021 106810 107749 108598 108625 108205 107957 107431 105858 103780 102605 102589 102512 101625 100765 100923 101592 101461 100385 99699
55003 99699 100355 101400 100913 98444 95967 95973 98794 102271 103987 103279 101055 98537 96644 95952 96465 97616
54987 97616 98925 100296 101320 100945 98659 95646 93828 93772 94320 94254 93541 92853 92688 93333 94968 97240 99129
54970 99129 99836 99744 100099 101718 104292 107018 109608 112331 115034 116608 115883 112978 109338 106390 104598 103830
54954 103830 104038 105267 107405 110235 113370 115965 117115 116898 116430 116426 116364 115736 115432 116880 120099 123643 126395
54937 126395 128431 129992 130725 130457 129988 130344 131535 132563 132536 131350 129336 126668 123394 119896 116926 114979
54921 114979 113819 112885 112107 111904 112447 113402 114532 115987 117763 119386 120562 121710 123410 125619 127799
54906 127799 129478 130334 130148 129219 128547 129035 130644 132656 134513 136033 137268 138790 141772 146914 153234
54891 153234 158554 161488 162701 164230 167751 173494 180599 188489 197743 209357 223307 238501 254134
54878 254134 270167 286192 300949 313712 325104 335472 343302 346586 345227 340674 333465 322714
54866 322714 308214 291635 275152 259998 246729 235749 226727 218359 209568 200625 192523 185666 179834
54853 179834 175215 172716 172876 174726 176211 176127 175545 176722 180449 185167 189110 192472 196565 201578 206621
54838 206621 211855 219099 229843 243651 259033 275063 291499 307808 322569 333653 339030 338030
54826 338030 332039 323355 313173 301215 287355 272698 258622 245510 232999 220923 209479 198807
54814 198807 188906 179715 171035 162731 155185 149090 144558 140953 137856 135521 134027 132737 131278 130443
54800 130443 131214 133150 134534 134028 131684 128512 125744 124361 124473 124986 124504 122846 121146 120233 119497 117807
54784 117807 115069 112271 110205 108760 107395 105675 103245 100067 97052 95787 96865 98717 98926 96709
54770 96709 93577 91648 91992 94558 98577 102478 104270 103049 100065 97784 97870 100127 102936 104427 103755
54755 103755 101816 100476 100811 102445 104733 107727 111420 114902 117279 118963 121082 123950 127017 130031
54741 130031 133251 136712 140286 144342 149380 155099 160841 166887 174139 182521 190992 199437 209170 220989
54727 220989 233872 246478 258956 272298 286591 301025 315304 329909 344814 358605 369128
54716 369128 374706 374848 370390 363180 355143 347049 338029 326766 313513 300758 291259 285419 281140 276366
54702 276366 270966 265852 261413 257747 255577 255591 257240 259331 261623 264662 268270 271695 275418 281466 291353
54687 291353 304582 319462 334622 349564 364794 381720 401471 423452 445872 467822 489698
54676 489698 511248 530510 545212 554088 556262 550844 538297 521133 501894 480995 457705 432617
54664 432617 407861 385068 364213 344469 325338 306927 289764 274447 261135 249515 239445
54653 239445 231230 224913 219861 215501 211926 209215 206759 203892 200683 197421 193901 190062 186723 184680
54639 184680 183424 181825 179902 178765 178763 178802 177838 176136 174572 173359 172166 171195 171486 173878 177789 181286
54623 181286 182714 182283 181764 182524 184308 186203 188128 190699 193969 197184 199869 202536 205998 210275 214496
54608 214496 217930 221064 225448 232138 240370 248226 254652 260198 265601 270415 273624 275113 275874 277065
54594 277065 279328 282712 286674 290336 293181 295334 297054 298531 300525 304302 310078 316140 320661 324081
54580 324081 328669 335853 345089 355343 366513 379064 393366 410003 429861 453131 478597 504604
54568 504604 530455 556250 581468 604301 622522 634666 640293 639438 632274 619414 602242 582459
54556 582459 561101 538290 514202 490057 467629 447755 429826 413002 397618 384917 375364 367745
54544 367745 360258 352201 344006 335722 326413 315558 304326 294473 286294 278589 270511 262325 254341 246341
54530 246341 238547 231943 226855 222179 216891 211431 206545 201475 194715 186360 178447 172948 170324 169910
54516 169910 170503 170474 168586 165304 162447 160978 159830 157374 153392 149005 145268 142585 141058 140534 140363
54501 140363 139777 138594 137147 135680 134360 133813 134780 136956 138865 139494 139642 140942 143802 147020 149440
54486 149440 151127 152666 154039 154823 155082 155473 156573 158463 160766 162842 164257 165361 167085 169890 173415
54471 173415 177508 182851 189797 197315 204182 210803 218672 228268 238714 249426 260710 272530 284028
54458 284028 294728 305011 314844 323100 328738 331697 331993 328966 322255 312758 301784 289880 277254
54445 277254 264738 253438 243748 235253 227269 219152 210714 202735 196310 191172 185515 178226 170594 164929
54431 164929 162061 160944 160157 158976 157388 155823 154634 153472 151742 149989 149881 152070 155048 156934 157588
54416 157588 157919 158009 157314 156177 155748 156492 157855 159300 160794 162348 163812 164997 165584 165341 164848 165203 166396
54399 166396 166925 165860 164217 163244 162509 161188 160149 160786 162494 163345 163049 163195 164491 165668 165381 163605
54383 163605 160825 157460 154437 152800 152183 151061 149065 147786 148653 151110 153463 154507 153777 151228 147542
54368 147542 144098 141988 141300 141449 141729 141629 141258 141404 142508 143956 145222 147143 150729 155083 158117 159319
54352 159319 160089 161256 162083 162156 162458 163805 165767 168007 171288 176173 181894 187408 192614 197835 203238
54337 203238 209463 217465 226721 234828 240071 243472 247128 251392 254920 256838 257545 257681 257443 256869 256029
54322 256029 254882 253188 250371 245555 238566 230981 225123 221573 218774 215498 212280 209657 206582 202074
54308 202074 197262 194071 192491 190893 188720 187078 186512 185758 183471 180270 178184 178304 179521 179764 178309
54293 178309 176485 175938 176761 178115 180180 184083 189729 195120 198596 200631 202719 205472 208682 212240 215977
54278 215977 219333 222131 225047 228515 231870 234389 236308 237900 238467 237455 235683 234112 232016 227922
54264 227922 222021 216177 211640 207967 204072 199121 192536 184448 176381 170371 166986 164840 162140 158112
54250 158112 153094 148044 143938 140895 137944 134268 130485 127924 126938 126873 127476 129125 131498 133068 132490
54235 132490 129919 126674 124027 122494 121887 121777 121941 122251 122156 120865 118407 115862 114047 112545 110657 108565
54219 108565 106762 105053 103229 102102 102643 104442 106242 107707 109395 111271 112640 113518 114653 116068 116904
54204 116904 116933 116953 117433 118008 118706 120310 122930 125407 126830 127588 128168 127959 126342 124246 123501 124790 127044
54187 127044 128707 129011 128126 126628 124983 123322 121620 119972 118508 117206 116145 115827 116693 118330 119675
54172 119675 120108 119963 120043 121094 123584 127266 131028 133884 136148 138802 141769 143798 144313 144315 144981 146224
54156 146224 147235 147678 147708 147510 147589 148900 151727 154666 155648 154053 151182 148560 146393 144017 141347 139210
54140 139210 138168 137579 136379 134564 133201 132905 133057 132949 132785 132751 131846 128898 124455 120442 117962 116621
54124 116621 116061 116745 118728 120889 122204 122927 123727 124449 124611 124523 124929 125774 126137 125372 123747 121960 120436
54107 120436 119124 117816 116664 116270 116856 117387 116205 112907 109087 106866 107086 109166 112049 114708 116253
54092 116253 116359 115539 114537 113513 112115 110205 108225 106968 107062 108302 109437 109189 107795 106904 107460 108336
54076 108336 107793 105764 103767 102825 102554 102327 102319 102921 103918 104865 105785 106767 107082 105545 102061 98305 96314
54059 96314 96570 97845 98883 99643 100682 101863 102347 101728 100657 100213 100967 102678 104533 105606 105351 103869
54043 103869 101685 99464 98104 98653 101504 105617 109118 110877 111254 111347 111856 112697 113236 112819 111418 109785
54027 109785 108695 108159 107843 108051 109552 112429 115726 118400 120041 120651 120461 120148 120417 121097 121310 120863 120607
54010 120607 120958 120915 119371 116862 115191 115522 117535 120213 122808 125028 126874 128542 130308 132413 134968
53995 134968 137646 139562 139969 139352 139434 141704 146139 151463 156269 159677 161404 161793 161748 162451 164971 169757
53979 169757 175983 181698 185488 188066 191384 196076 200840 204764 209150 216199 226562 238944 251573
53966 251573 263272 273589 282671 290774 297581 302617 306695 311999 319760 328506 335562 339772 341854 342766
53952 342766 342948 342782 342424 341233 338405 334128 329159 323422 316178 307604 299041 291522 285064 279503 274930
53937 274930 270989 266793 262070 257644 254401 252376 251029 249619 247179 243147 238362 234535 232323 230818
53923 230818 229372 228761 229711 231267 231700 230521 228588 226673 224933 223492 222573 222105 221981 222562 224098 225710
53907 225710 225936 224450 222457 221158 220573 220221 220113 220321 220202 219089 217753 218242 221711 226793 230620 231369
53891 231369 229470 226564 223865 221696 220117 219437 220219 222963 227646 233296 238326 241808 244354 247390 251581
53876 251581 256415 261265 266293 272115 278989 286499 293766 300003 305242 310505 316695 323323 329005 333299
53862 333299 337056 340628 342923 343157 342672 343618 346231 348808 350456 352561 357117 364585 373860 383494 392433
53847 392433 400417 408446 418243 430349 442992 453541 460873 465633 468503 469220 467547 464348 460966 457688
53833 457688 453296 446443 437522 428927 423061 419949 417254 412779 406359 398928 390692 381374 371828 363840
53819 363840 357909 352324 345073 335957 326263 317127 308916 301694 295475 290142 285581 281571 277275 271414
53805 271414 263620 255179 247798 241971 237190 233240 230294 227934 225159 221558 217735 214430 211807 209680
53791 209680 207816 205914 203740 201302 198517 195038 191075 188018 187166 187919 188318 187564 186865 187456 188793 189288
53775 189288 188018 185228 181920 179397 178351 177865 176198 173137 170636 170354 171557 172503 173038 174383 176795
53760 176795 178900 179459 178718 177844 177895 179466 182559 186500 190491 194365 198427 202697 206741 210108 212385
53745 212385 213173 212768 212662 214457 218252 222897 227806 233579 240715 248686 256733 264674 272389 279296 285098
53730 285098 290552 296644 303143 308685 312320 314446 316134 317979 319908 321804 323871 326174 328107 328741
53716 328741 327799 325986 324120 322104 319007 314067 307426 300074 293255 287714 283267 279230 275445 272563
53702 272563 271012 270163 269084 267903 267721 269016 270624 270558 267774 263163 258889 256612 256251 256647 257288 258668
53686 258668 260817 262455 262281 260331 257322 253436 248776 244228 240453 236608 231699 226911 224743 225674 227520
53671 227520 228441 228664 228548 227114 223963 220986 220178 220858 221014 220681 221727 224475 226697 226493 224463 222370
53655 222370 221135 221040 222582 225748 229107 230961 231301 231776 233801 237434 242085 247357 252834 257669 261065
53640 261065 263068 264555 266437 268938 271504 273252 273786 273833 274785 277143 279667 280819 281065 282779 287394
53625 287394 293478 298404 301286 303268 305416 307641 309680 311703 313518 314289 313742 312805 312305 311813 310621
53610 310621 309274 309074 310294 311742 312014 310562 307646 304021 300677 298217 296305 294176 291724 289723 288953
53595 288953 289457 290628 291635 291876 291448 291147 291612 292446 292622 291741 290555 290187 291130 292942 294623 295416 295594
53578 295594 296345 298505 301680 305078 308864 313802 319674 325041 328760 330793 331261 329870 327173 325428 326837
53563 326837 331025 335374 338107 340173 343720 349314 355276 359542 361716 363320 366318 371385 377432 382768
53549 382768 386817 390661 395820 402616 409999 416973 423635 430421 436776 441434 444203 446656 450530 455936
53535 455936 461727 467166 472385 477500 482295 486947 492010 497241 501242 502857 502484 501567 501371 502625 505547
53520 505547 509329 512186 512990 512728 513314 515054 516303 515784 514162 512863 512261 511750 510986 510234 509802 509839 510621
53503 510621 512439 515137 518078 520606 522320 523027 522822 522323 522589 524577 528418 533055 536804 538711 539448
53488 539448 540452 542232 544185 546190 549419 554843 561574 567582 571839 575003 578246 582248 587264 593286
53474 593286 599949 606906 614483 623502 634366 646603 659165 670770 680445 688722 698052 710912 727299
53461 727299 744940 761968 778218 793897 808638 822695 837715 855079 874259 893862 913596
53450 913596 934231 956313 980061 1005912 1033937 1063148 1092613 1122883 1155047 1188694 1222266
53439 1222266 1255291 1288649 1322471 1355498 1387186 1419026 1452787 1488386 1524350 1559540 1593544
53428 1593544 1626165 1657555 1688520 1719726 1750858 1781187 1810711 1840035 1869393 1898534 1927451
53417 1927451 1956503 1985741 2014685 2042899 2070311 2096843 2122141 2145955 2168619 2190889 2213260
53406 2213260 2235322 2255793 2273294 2287285 2298225 2306827 2313235 2316965 2317468 2314614 2308736 2300278 2289481
53393 2289481 2276504 2261817 2246117 2229605 2211713 2192014 2171047 2149582 2127311 2103222 2077374
53382 2077374 2051374 2026713 2003460 1980964 1958891 1936800 1913566 1888573 1863330 1840716 1822195
53371 1822195 1806434 1791042 1775266 1760537 1748559 1739349 1731437 1723866 1717519 1714024 1713599 1714620 1715450
53358 1715450 1716091 1717714 1721192 1726688 1734224 1743805 1755034 1767255 1780347 1795070 1812467 1833035 1856400
53345 1856400 1881616 1907858 1935053 1963870 1994978 2028377 2063481 2099744 2137214 2176726 2219584
53334 2219584 2266656 2317599 2371221 2426724 2484241 2544052 2605753 2668444 2731454 2794622 2858234
53323 2858234 2922815 2988518 3054577 3119881 3184292 3248673 3313267 3376805 3437802 3496034 3552047
53312 3552047 3605877 3657046 3705192 3749712 3789292 3822897 3850995 3874727 3894087 3907996 3915988
53301 3915988 3918502 3915386 3905413 3887857 3863646 3834483 3801478 3764872 3724262 3678813 3628197 3573815
53289 3573815 3518260 3462981 3407148 3349288 3289266 3228125 3166988 3107074 3049912 2996191 2944615
53278 2944615 2893095 2841068 2789701 2739872 2691136 2643019 2596248 2551940 2510169 2470128 2431389
53267 2431389 2394273 2359047 2325477 2293408 2263289 2235628 2210186 2186250 2163730 2143460 2126015
53256 2126015 2110420 2094513 2076645 2056812 2036131 2015531 1995180 1974961 1955191 1936734 1920443
53245 1920443 1906597 1894962 1885334 1877750 1872105 1867919 1864876 1863388 1864154 1867235 1872034 1878253 1886283 1896387
53231 1896387 1907985 1920255 1933312 1948319 1966301 1987044 2009292 2032037 2055480 2080585 2107671
53220 2107671 2135762 2163500 2190344 2216429 2241551 2265079 2287028 2308440 2330212 2351772 2371233
53209 2371233 2386608 2396786 2401838 2402900 2401524 2398602 2393902 2386797 2377255 2365776 2352534 2337009 2318452
53196 2318452 2296503 2271545 2244791 2217817 2191405 2164738 2136233 2105373 2073308 2041376 2009523
53185 2009523 1976729 1942845 1909307 1877828 1848839 1821500 1794911 1768742 1742851 1716959 1690993
53174 1690993 1665387 1640622 1616657 1593120 1569953 1547544 1526274 1506220 1487368 1469786 1453413
53163 1453413 1437772 1422103 1405905 1389405 1373459 1358831 1345581 1333313 1321889 1311499 1302039
53152 1302039 1292988 1284055 1275248 1265836 1254080 1238857 1221085 1202547 1183717 1164012 1143992 1125654
53140 1125654 1109884 1095026 1078960 1061732 1045015 1029598 1014642 999187 983374 968055 953928
53129 953928 941016 928391 914479 898377 880972 864171 848952 834697 820352 805468 790006
53118 790006 774054 758286 744076 732402 722738 713407 703058 691693 680485 670662 662252 653855
53106 653855 644119 633545 624145 616953 610624 603262 594941 587273 580748 573937 565685 556887 549343 543603
53092 543603 538681 533270 526498 518188 509370 502089 497463 494098 489570 483459 477618 473292 469480 464888
53078 464888 459976 455789 451838 446823 441067 436520 434214 433040 431433 429078 426367 423135 418829 413653
53064 413653 408792 405357 403251 401139 397804 393746 390958 390521 390838 389236 385068 380052 375525 370903 365382
53049 365382 359726 355238 351957 349069 346450 344541 343140 341639 340339 340329 341878 343837 344808 344173 341984
53034 341984 338759 335623 333802 333501 333769 333776 333783 334668 336910 340226 343839 347054 350068 354171 360353 367559
53018 367559 373237 376094 377502 379508 382228 384174 384665 384678 385271 386280 386948 386910 385932 383312 378509 372278
53002 372278 366421 361997 358155 353109 346164 338433 331523 325895 320783 315475 310049 304729 299095 292584
52988 292584 285622 279615 275509 272690 269560 265063 259492 254108 250228 248452 248324 248696 248608 247796 246220
52973 246220 243485 239277 234266 229902 227117 225699 225033 224824 224739 224084 222493 220511 218782 216973 214383
52958 214383 211406 209405 208994 209310 209309 208973 208837 208995 209214 209447 209601 209169 207844 206334 205848 206757 208321 209808
52940 209808 211297 213183 215318 216998 217578 216794 214695 211675 208660 206855 206841 207952 208949 209430 210205 211968
52924 211968 213997 214777 213744 211747 209739 207808 205794 204208 203842 204782 206349 207890 209274 210690 212389
52909 212389 214578 217244 220033 222565 224925 227637 230933 234082 235780 235634 235165 236669 240666 245107 247750
52894 247750 248767 249983 252001 253574 253942 254208 255692 258147 260584 262883 265537 268577 271825 275659 280480
52879 280480 285919 291471 297314 303422 308579 311784 314345 319028 326980 336662 345861 353484 359257 363175
52865 363175 365943 368945 373036 377920 382966 387801 391775 393865 393746 392317 390625 388837 386645 383995
52851 383995 380915 377216 372935 368731 365489 363862 364098 365528 366161 363955 359118 354194 351181 349414 347040
52836 347040 343619 340154 337291 334829 332695 331038 329298 326539 323285 322020 324894 330962 336365 337625
52822 337625 334805 331282 330353 332274 334753 335706 334785 332609 329845 327452 326568 327332 328448 328624 327863 326837
52806 326837 325827 325062 325247 326684 328467 329614 330462 331800 333212 333628 333231 333234 333798 333714 332514 331414 331454
52789 331454 331916 331542 330512 330229 331562 334083 336748 338748 339899 340785 342445 345461 349208 352150 353050
52774 353050 352076 350737 350365 350513 349453 346704 344206 343891 344807 344322 342081 340781 342412 345526 347417 347543
52758 347543 347266 347386 347775 348859 351354 354511 356409 356439 356023 356293 356498 355631 354476 354730 356690 359100 361076
52741 361076 362950 364992 366342 365850 363524 360560 358049 356110 354219 352041 349654 347053 343659 338572
52727 338572 331450 323110 315087 308497 303343 298917 294710 290726 286962 282884 277686 271103 263893 257368
52713 257368 252393 248784 245636 242178 238260 234130 230050 226355 223681 222650 223177 224309 224935 224533 223175
52698 223175 221070 218398 215386 212214 208828 205065 201031 197208 194158 192198 191266 190945 190617 189680 187702
52683 187702 184504 180375 176196 172981 171057 169897 168898 167997 167280 166387 164771 162393 159732 157242 155171
52668 155171 153736 152991 152517 151612 149825 147246 144630 143447 145134 149510 154287 157047 157564 157383 157393 157011
52652 157011 155736 154148 152854 151677 150545 150088 150424 150260 148401 145694 144315 145192 147061 148006 147207 145203
52636 145203 143188 142217 142565 143652 144787 145866 147140 148602 150039 151381 152584 153456 154010 154556 154924 154217
52620 154217 152189 150414 150907 153647 156572 158172 159045 160627 163423 166975 170629 173725 175841 177625 180774
52605 180774 186283 193074 199148 203808 207910 212069 215688 218164 220239 223391 228011 232787 236082 237625
52591 237625 238548 239782 240743 239851 236351 231304 226601 223079 219844 215522 209928 204256 199734 196582 194465
52576 194465 193390 193452 194020 194083 193598 193601 194565 195504 195344 194383 193403 191921 188665 183699 178867 175731 173909 171948
52558 171948 169153 166093 163710 162425 161865 161266 160232 159146 158582 158485 158387 158299 158759 159961 161407 162513 163025
52541 163025 162888 162374 162336 163524 165492 166982 167563 168079 169214 170688 172296 174721 178373 182167 184383 184447
52525 184447 183184 181689 180604 180152 180237 180669 181707 183937 187196 190101 191316 190911 189955 189217 188946 189511
52509 189511 191420 194778 199190 203991 208201 210732 211288 210791 210469 210849 211919 213596 215422 216545 216688
52494 216688 216599 216919 217425 218108 219845 222760 225029 225012 223778 223603 224528 224662 223731 223763 225707 227743 228200 228291
52476 228291 230358 234663 239375 243000 245570 247923 250769 254116 257049 258687 259665 261673 264947 267460
52462 267460 267496 265869 264407 263355 261761 259704 258420 258462 259210 260179 261500 263035 264170 264685 265017 265539
52446 265539 266410 268032 270741 273989 276623 278036 278342 277612 275930 274139 273326 273300 272593 270385 267524 265239
52430 265239 263826 263124 263307 264253 264866 264176 262869 262731 264524 267257 269729 271963 274589 277400 279348 279974
52414 279974 280131 280915 282335 283518 283933 283745 283116 281984 280811 280699 282222 284716 287269 289889 293020 296371
52398 296371 299067 300664 301265 300938 299946 299325 300177 302337 304690 306788 309034 311109 311591 309920 307665 306847
52382 306847 307675 308868 309667 310494 311857 313558 315034 315809 315668 315013 314990 316486 318908 320590 320615 319706 319171
52365 319171 319554 320538 321601 322214 321700 319508 315741 311250 307191 304408 302944 302078 301102 300189 300122 300969 301618
52348 301618 301138 300185 300255 301651 302998 302913 301531 300174 300111 301906 305202 308706 310984 311957 313144 315832
52332 315832 319455 322545 324738 326850 329250 331374 332881 334147 335374 336236 336770 337620 339002 340421 341903
52317 341903 344330 347738 350369 350646 349427 349046 350544 353002 355258 356930 357851 357842 357404 357585 358724 360240
52301 360240 361918 364508 368371 372344 374834 375814 376975 379869 384330 388896 392456 395178 397896 400979
52287 400979 404199 407490 411119 415031 418747 422389 427081 433611 441146 448091 454059 460269 468061 477453
52273 477453 486845 493761 496631 496719 497736 502443 509949 517334 523312 528825 534598 540247 546061 553501 563078
52258 563078 573379 583306 593822 606248 620008 633532 646563 660240 675453 692370 711149 731841
52246 731841 753804 776212 799044 822916 848260 875294 904082 933704 962231 988860 1015527
52235 1015527 1044856 1076771 1108722 1139150 1168973 1199401 1230082 1260258 1290232 1320522 1350480
52224 1350480 1378846 1405068 1429160 1450890 1470125 1487538 1503958 1519131 1531987 1542087 1550118
52213 1550118 1556990 1563045 1568141 1571891 1573806 1573827 1572820 1571941 1571374 1570194 1567614 1563803 1559425 1555111 1551757
52198 1551757 1550478 1551495 1553654 1555910 1558933 1564201 1571647 1579463 1586528 1593949 1603628 1616226 1631276
52185 1631276 1648363 1667056 1686189 1704562 1722473 1741583 1763061 1786508 1810735 1834721 1857574
52174 1857574 1878368 1896498 1911882 1924730 1935634 1945821 1956421 1967068 1975891 1981232 1982841 1981201
52162 1981201 1976627 1969591 1961110 1951853 1941309 1928636 1914112 1898944 1883755 1867915 1850404 1830826
52150 1830826 1809592 1787646 1766179 1746211 1728112 1711393 1694965 1677845 1660000 1642563 1626915
52139 1626915 1613511 1601927 1591848 1583365 1576323 1570225 1565019 1561059 1557914 1554148 1549006 1543621 1539679
52126 1539679 1537403 1535591 1533146 1529869 1526210 1523000 1520939 1519556 1517113 1512470 1506627 1501511 1497601 1493797
52112 1493797 1489330 1484588 1480046 1475585 1471121 1466852 1462510 1457156 1450224 1442255 1434343 1427298 1421468 1416803
52098 1416803 1412777 1408553 1403428 1397082 1389735 1382395 1376471 1372343 1368621 1363620 1357360 1351312 1346384 1342127
52084 1342127 1337824 1333258 1328323 1322999 1317949 1314135 1311574 1309470 1307823 1307698 1309279 1310750 1309993 1306686
52070 1306686 1301968 1296782 1291512 1286761 1283374 1281623 1281027 1281028 1281477 1282499 1284227 1286671 1289726 1293401 1298092
52055 1298092 1304282 1312030 1321185 1332106 1345451 1361038 1377669 1394621 1412796 1433739 1457822 1483972
52043 1483972 1511015 1538735 1567581 1597754 1628851 1660471 1692993 1727383 1763908 1801373 1838124
52032 1838124 1873623 1908443 1942980 1976876 2009515 2040118 2067435 2090581 2110445 2129184 2147728
52021 2147728 2164700 2178232 2187865 2194094 2197167 2197271 2195014 2190705 2183782 2173995 2162533 2150890 2139062
52008 2139062 2125962 2111354 2096247 2081489 2067017 2052609 2038505 2025063 2012455 2000890 1990728
51997 1990728 1982386 1976427 1973395 1973043 1974214 1976263 1980202 1987414 1997366 2007713 2016782 2024935 2033261 2042017
51983 2042017 2050990 2060526 2071262 2083156 2095383 2107061 2117604 2126548 2133618 2139060 2143562 2147567 2150708
51970 2150708 2152046 2150816 2146813 2140052 2130416 2118040 2103834 2088985 2073769 2057373 2039096 2019188
51958 2019188 1998179 1975991 1952255 1927052 1900659 1872914 1843503 1812681 1781071 1748967 1716456
51947 1716456 1683945 1651722 1619119 1585074 1549721 1514583 1480707 1447238 1412381 1375510 1337934
51936 1337934 1301661 1267702 1235433 1203363 1170408 1136412 1101645 1066255 1030508 995236 961491
51925 961491 929769 899838 871300 844045 818229 794026 771317 749458 727583 705378 683324
51914 683324 661969 641393 621715 603575 587401 572459 557413 541837 526653 513103 501726
51903 501726 492288 484173 476811 470033 464007 458674 453544 448295 443142 438330 433919 430472 428994 429218
51889 429218 428840 425824 420969 416701 413661 410225 405456 400630 397129 394354 390783 386131 381502 378026
51875 378026 376050 375121 374246 372650 370573 368702 366792 363811 359660 355506 351975 348234 343553 338501 333696
51860 333696 328629 322955 317931 315199 314693 314944 314882 314278 313055 311346 309706 308159 305639 301565 297219
51845 297219 294162 291944 289015 285377 282345 279951 276747 272350 268175 265147 262679 260588 259983 261098
51831 261098 261969 260779 258191 255916 254075 251587 248328 245224 242627 240098 237643 235968 235617 236796 239553
51816 239553 243051 245248 244828 243234 243220 245321 247317 247421 246392 245837 245883 245568 244601 243614 243268 243960 245979
51799 245979 249147 252637 255810 258957 262654 266662 270127 272699 274859 277162 279551 281452 282366 282457 282594
51784 282594 283499 284801 285494 285402 285500 286444 287513 287537 286241 284129 281800 280154 280422 282804 285537 286512 285670
51767 285670 284762 285005 286113 287464 288883 290153 290982 291718 292970 294286 294429 293248 292026 291516 291036 290196
51751 290196 290042 291391 293193 293880 293542 293413 293855 294181 294072 293830 293395 292294 290575 288886 287674 287018 286929
51734 286929 287007 286245 284290 282528 282630 284171 284991 283905 281763 279787 278301 277453 277739 279044 280286 280820
51718 280820 281371 282898 285279 287749 289866 291404 292094 292304 293305 295919 299273 301690 302559 302656 302850 303200
51702 303200 303277 302849 302262 302419 304235 307917 312961 318832 325094 330805 334804 337225 340004 344926 351501
51687 351501 357601 362020 365701 370493 377295 385411 393331 400184 406658 414198 423052 431743 438981 445412
51673 445412 452598 460716 468346 474321 478682 481765 483575 484457 485347 486612 487215 485754 482089 477524 473651
51658 473651 471409 471015 472192 474279 476347 477455 477131 475815 474721 474829 475853 476505 475967 474821 474310 474911
51642 474911 476026 477007 478006 479467 481073 481831 481384 480640 480657 481340 481993 482844 484922 488258 491400 493344 495040
51625 495040 498050 502420 506946 511090 515436 520338 525182 529139 531906 533684 535185 537596 541553 545998
51611 545998 549015 550085 550642 552111 554337 556406 558119 559917 562066 564619 567623 570614 572414 572245 570802
51596 570802 569475 568681 567527 564895 560289 553879 546425 538982 532027 524976 517100 508720 500843 493815
51582 493815 487202 481000 475946 472229 468637 463652 457140 450647 446120 444298 444010 443082 440403 437062 434866
51567 434866 433917 432611 430104 427462 425719 423973 420586 415474 409912 404676 399825 396026 394332 394394 394433
51552 394433 393593 392938 393336 393719 392699 390887 390144 391057 392596 393987 395376 396509 396161 393571 389606 385945
51536 385945 383661 382881 383191 383986 384956 386599 389790 394679 400546 406814 413454 420151 426033 430778 435130
51521 435130 439617 443603 446488 449047 452239 455169 455776 453687 451021 449836 449795 449049 446721 443662 441112
51506 441112 439442 438214 436945 435581 434347 433299 432183 430861 429785 429683 430708 432196 433388 434205 435120
51491 435120 436527 438368 440206 441509 442075 442403 443516 446146 450092 454506 458763 462805 466625 469740 471466
51476 471466 471650 470778 469322 467380 465225 463747 463743 464853 465903 466361 466821 467806 468860 469337 469534 470401 472408
51459 472408 475238 478256 480828 482518 483644 485294 487947 490250 490071 486950 482792 479900 478838 478371 476976
51444 476976 474180 470765 467844 465533 462667 458250 452928 448361 445219 442550 439278 435476 431957 429341
51430 429341 427863 427473 427616 427350 426034 423550 419831 414975 410158 407629 408963 413594 419541 425248 430338
51415 430338 435055 439584 443833 447500 450559 453821 458538 465096 472509 479583 486188 493002 500484 508536
51401 508536 516712 524287 530611 535959 541618 548544 556243 563396 569022 572500 573147 570912 567172 563902
51387 563902 562080 561510 561818 562695 563434 563363 562767 562563 563094 564164 566117 569742 574854 580002 583934 586559
51371 586559 588234 589120 589569 590167 590812 590514 588677 585821 582538 578611 573938 569506 566415 564331 561880
51356 561880 558378 554372 550575 547040 543462 539765 536236 533256 530832 528345 525163 521697 519280 518522
51342 518522 518405 517649 516475 516204 517481 519733 522170 524455 526489 528444 530980 534600 538635 541628 542828
51327 542828 542641 541615 539888 537731 535528 532758 528057 521021 513179 506341 500644 495136 489679 484936
51313 484936 480658 475325 467938 459169 450177 441033 431114 420680 411099 403384 397157 391392 385787 380827
51299 380827 376628 372304 366843 360316 353719 347695 341966 336162 330756 326704 324342 323000 321624 319552
51285 319552 316812 314068 312171 311334 310694 309151 306809 305113 305209 306496 307219 306346 304354 302288 300705 299714
51269 299714 299373 299498 299497 299103 299137 300744 303692 306180 306822 306284 306355 307845 310179 312833 316180 320648 325754
51252 325754 330500 334382 337721 341310 345923 351627 357255 361013 362112 361517 360682 360049 359317 358575 358112 357287
51236 357287 354863 350780 346466 342746 338405 331865 323745 316473 311377 307329 302663 297439 292930 289540
51222 289540 286330 282588 278788 275660 273029 270194 266995 263912 261395 259764 259438 260414 261501 260999 258514
51207 258514 255401 253069 251573 250468 250213 251634 254242 256173 256012 254016 251380 249067 247674 247746 249420
51192 249420 251811 253375 253319 252518 252693 254404 256142 255945 253744 251328 249878 248632 246578 244345 243201
51177 243201 242926 242214 240921 240318 240957 241711 241383 239997 238135 236249 235167 235958 238454 241003 242498 243567
51161 243567 244887 245628 244934 243895 244441 246844 249769 252263 254189 255188 254955 254461 255112 256511 256719 255152
51145 255152 253611 253797 255265 256712 258073 260114 262731 264829 265612 265244 264486 264195 264787 265710 265784 264432
51129 264432 262196 259894 257911 256552 256132 256084 254906 251999 248968 248012 249273 250724 250462 248157 244485
51114 244485 240368 237072 235919 237154 239529 241581 242967 244102 244868 244426 242417 239804 238171 238279 239482
51099 239482 240379 239787 237279 233347 229316 226673 226000 226622 227416 227706 227197 225673 223452 221674 221116 220866
51083 220866 219199 215973 213147 212475 213475 214252 213762 212784 213106 216095 221413 226749 229463 229056 227512 226835
51067 226835 226992 226852 226277 226241 227409 229646 232686 236300 239931 242985 245495 247740 249338 249461 247998 245819
51051 245819 243815 242093 240092 237163 233315 229804 228492 229943 232602 234622 235963 237660 239568 240432
51037 240432 240122 240108 241259 242533 242642 241910 241642 242423 243904 245669 247556 249529 251778 254527 257403 259591
51021 259591 261007 262540 264571 266091 266052 264901 263864 263340 262983 262756 262713 262204 260708 259323 259920 262606
51005 262606 265388 266818 267628 269090 271010 272414 273249 274140 275013 275326 275413 276267 277928 279302 279804 280015 280337
50988 280337 280272 279837 280493 283397 287434 290468 292313 294998 299893 305958 311298 315206 317934 319546 320156
50973 320156 320671 322036 323916 325106 325148 324666 324133 323286 322012 320924 320641 321058 321763 322683 323814 324778 325254
50956 325254 325750 327346 330574 334839 339065 342679 345732 348272 350087 351330 353042 356505 362016 368765
50942 368765 376011 383827 392436 401464 410379 419256 428512 438256 448506 459714 472278 485663 498836
50929 498836 511595 524798 539251 555099 572420 591605 612813 635495 658804 682262 706122
50918 706122 731475 759884 792261 828122 866581 907928 953329 1002974 1055701 1110921 1169813
50907 1169813 1233864 1303118 1376918 1455777 1541212 1633515 1730539 1829171 1927791 2027076 2128441
50896 2128441 2231832 2335041 2435058 2529681 2617746 2698519 2771661 2837394 2895612 2944729 2982318
50885 2982318 3007133 3019871 3022099 3015521 3002391 2985204 2965277 2942568 2917518 2891951 2867355 2843245
50873 2843245 2818259 2792160 2765611 2738428 2709041 2675557 2636739 2592246 2542377 2487230 2425986
50862 2425986 2357847 2283900 2206687 2127257 2044172 1956682 1867489 1780679 1697985 1618902 1543529
50851 1543529 1473057 1407804 1346959 1290286 1238161 1189991 1144664 1102796 1066453 1036135 1009935
50840 1009935 986302 965717 948768 934373 921043 908531 897301 887769 881000 878577 880442 884167
50828 884167 887603 891084 895868 901873 908583 916809 927454 939293 950107 959659 969696 981236 993848
50815 993848 1007633 1024003 1043929 1066918 1092198 1119600 1148781 1178862 1209624 1242101 1277431
50804 1277431 1315968 1358012 1404436 1455856 1511951 1572421 1638056 1710103 1788980 1874401 1966590
50793 1966590 2066798 2176674 2297444 2429556 2572842 2727215 2893295 3071938 3262804
50784 3262804 3463867 3672783 3888405 4110326 4337137 4565825 4792942 5015654 5231144
50775 5231144 5435280 5622500 5787314 5925970 6036835 6119697 6175148 6204496 6209681 6192927
50765 6192927 6156797 6104989 6042749 5975787 5908474 5843118 5780848 5722703 5669609 5621461 5576362
50754 5576362 5530665 5479887 5419998 5348361 5263734 5165639 5053690 4927292 4785782 4629088
50744 4629088 4458538 4276894 4087347 3892637 3695355 3498640 3305880 3119650 2941404
50735 2941404 2772251 2613455 2465955 2329906 2205197 2092281 1992025 1904518 1828060 1759576
50725 1759576 1696461 1638239 1586217 1541300 1502511 1468000 1437011 1409977 1386730 1365682 1345265
50714 1345265 1325513 1307558 1291942 1278055 1265070 1252784 1241500 1231594 1223483 1217643 1214270 1212947
50702 1212947 1212850 1213376 1214354 1215688 1217158 1218925 1221984 1227487 1235536 1245200 1255966 1268598 1284198 1302925
50688 1302925 1324263 1348167 1375332 1406641 1442948 1484949 1532424 1583889 1638016 1695228 1756941
50677 1756941 1823490 1894180 1969511 2051662 2142038 2239639 2342858 2451752 2567271 2689076
50667 2689076 2815461 2944955 3076489 3208247 3337779 3463420 3584337 3698824 3803689
50658 3803689 3896060 3975000 4040578 4091798 4126235 4141754 4138183 4117293 4081436 4032456 3972047
50647 3972047 3903121 3830491 3759749 3695196 3638633 3589732 3547205 3509738 3476083 3444551 3412791
50636 3412791 3378576 3340725 3298483 3249903 3191845 3122244 3041601 2951496 2852627 2745605 2632992
50625 2632992 2518711 2405361 2293616 2184593 2081205 1986244 1900091 1821182 1748080 1680494
50615 1680494 1618971 1564378 1517214 1476887 1442107 1412330 1388124 1369691 1355854 1345343 1338308
50604 1338308 1335592 1337004 1341407 1348241 1357958 1371024 1387283 1406306 1427625 1450642 1474977 1501069
50592 1501069 1530116 1563473 1602208 1646476 1694726 1744277 1793908 1845575 1902563 1966248 2035793
50581 2035793 2110520 2190662 2275572 2363151 2452108 2543391 2638225 2735681 2833296 2929222 3022471
50570 3022471 3111678 3195044 3271410 3340325 3401091 3452706 3494687 3526990 3549121 3560315 3560922 3552867
50558 3552867 3538552 3519822 3498080 3474493 3449813 3424709 3400684 3379913 3363714 3351737 3343102
50547 3343102 3337640 3335261 3334713 3334018 3331997 3328404 3322462 3312134 3295213 3270458 3237184 3194313 3140580
50534 3140580 3075657 3000656 2917619 2828895 2736867 2643636 2550584 2458391 2367642 2279213 2193931
50523 2193931 2112161 2033999 1959795 1890297 1826379 1768774 1717859 1673320 1634011 1598481 1565809
50512 1565809 1535957 1509512 1487375 1470497 1459327 1453283 1451011 1451400 1454205 1459775 1468534 1480732 1496274
50499 1496274 1514617 1535234 1558259 1584135 1612488 1642077 1672298 1703960 1737919 1773719 1810594
50488 1810594 1849167 1890735 1934961 1979801 2024070 2068788 2115388 2163780 2213110 2263536 2316196
50477 2316196 2371995 2431448 2495227 2563844 2637107 2715081 2799369 2892288 2994667 3105643 3224843
50466 3224843 3353538 3492989 3642663 3800921 3966609 4138900 4316000 4495120 4673681
50457 4673681 4849637 5020596 5183574 5335904 5475566 5600116 5705891 5789053 5847374 5880551
50447 5880551 5888930 5872518 5831445 5767015 5681931 5579533 5462995 5335334 5200007 5061334
50437 5061334 4924194 4793186 4671928 4562989 4468351 4389910 4329474 4288084 4265203 4258552 4264947
50426 4264947 4281300 4304589 4330783 4354272 4368955 4369959 4354013 4318346 4260191 4178212 4074171
50415 4074171 3952377 3817311 3672252 3520136 3364685 3209785 3057970 2910300 2767771
50406 2767771 2632264 2505908 2389958 2284536 2189126 2102986 2025274 1955263 1892612 1837318
50396 1837318 1789284 1747971 1712560 1682548 1658085 1639507 1626545 1618380 1614637 1615873 1622542 1633721
50384 1633721 1647512 1662776 1679862 1699564 1721967 1746571 1772959 1800922 1830387 1861606 1895026
50373 1895026 1930511 1967099 2003982 2041217 2078820 2115631 2150067 2181902 2212351 2242219 2270844
50362 2270844 2297200 2321293 2343969 2365920 2387464 2408885 2430401 2451993 2473914 2497415 2524627
50351 2524627 2557576 2597285 2643561 2695395 2751766 2812376 2877578 2947394 3020626 3094909 3167526
50340 3167526 3236270 3300063 3358904 3412701 3459832 3497337 3523048 3537040 3540333 3532499 3511402 3475174
50328 3475174 3423665 3358095 3280359 3193007 3099009 3000946 2900950 2801711 2706788 2619223 2540305
50317 2540305 2470230 2409373 2358207 2316592 2284264 2261810 2250076 2248465 2254647 2265985 2280296 2294974
50305 2294974 2306487 2311476 2307864 2294631 2271293 2238250 2196843 2148258 2092951 2031913 1967849 1903959
50293 1903959 1841840 1781463 1722805 1666347 1612278 1560607 1512101 1467767 1427338 1389801 1355638
50282 1355638 1326670 1302845 1281105 1258972 1237828 1220802 1208515 1198987 1191012 1185147 1181439 1178619
50270 1178619 1176306 1175983 1178866 1184378 1191808 1201901 1215470 1231496 1248091 1264661 1281906 1300283
50258 1300283 1319729 1340423 1362531 1385438 1408325 1431345 1455127 1479298 1502595 1524447 1545272
50247 1545272 1565181 1583464 1599665 1614155 1627209 1638347 1647113 1653884 1659406 1663944 1667262 1669017
50235 1669017 1668885 1666697 1662733 1657501 1650909 1641994 1629901 1615014 1598950 1583503 1569441 1555970 1541254
50222 1541254 1523901 1504141 1483538 1463678 1445337 1428678 1413627 1399931 1387149 1374659 1361666
50211 1361666 1347713 1333569 1321006 1310914 1302154 1293200 1284340 1276859 1270512 1263726 1256461 1250708 1247343
50198 1247343 1244481 1240432 1236629 1235730 1237778 1240251 1241269 1240755 1238669 1234253 1227556 1220091 1213308 1207468
50184 1207468 1202371 1197933 1193459 1187554 1179653 1170960 1163143 1156654 1150814 1144916 1138572 1131519 1123812 1115919
50170 1115919 1108174 1100521 1093282 1087647 1084756 1084493 1085706 1087328 1088854 1090136 1091486 1093767 1097630 1102563
50156 1102563 1107284 1111154 1114714 1118735 1123235 1127534 1130754 1132056 1130925 1127658 1123282 1118572 1113334 1107014
50142 1107014 1099786 1092444 1085244 1077438 1068183 1057337 1044964 1030624 1014079 996616 980692 967756
50130 967756 957004 946764 936580 927206 918928 910888 902266 893381 885261 878646 873729 870371 867988
50117 867988 865428 861546 856037 849574 843202 837753 833598 830480 827555 824000 819836 815970 813134 810854
50103 810854 807747 802955 797024 791147 785654 779613 771976 762746 752819 742931 733227 723757 714945 707272
50089 707272 700606 694047 686572 677980 669270 661949 656883 653885 652338 651877 652234 652886 653339 653692 654530 656198
50073 656198 658400 660412 661539 661590 661219 661578 663314 666076 669387 673482 678643 684240 689545 695428 703921
50058 703921 715573 728321 739761 749771 760021 771532 783782 796001 808230 820856 833872
50047 833872 847042 860387 874071 887869 901019 912802 923405 934170 946652 961099 975943
50036 975943 988878 998356 1004224 1007518 1010029 1013536 1018692 1024598 1029854 1034068 1038052 1042691 1048041 1053588
50022 1053588 1058949 1064054 1068860 1073258 1077485 1082495 1089594 1099343 1110990 1123369 1136341 1150820 1167342
50009 1167342 1185376 1204361 1224704 1246993 1270597 1293932 1316113 1337760 1360083 1383638 1407923
49998 1407923 1431776 1454135 1474751 1494180 1512794 1529972 1544710 1556875 1567261 1576341 1583527 1587931
49986 1587931 1589471 1588907 1586934 1583445 1577653 1568917 1557422 1543893 1528677 1511530 1492568 1472987 1454321
49973 1454321 1437217 1421378 1406422 1392305 1379201 1367585 1358027 1350242 1342727 1334503 1327043 1323152
49961 1323152 1323593 1326000 1327615 1327999 1328299 1328987 1329488 1329525 1329563 1330009 1330819 1331882 1332982 1333311 1331799 1328244 1323755
49944 1323755 1319777 1316795 1313999 1310068 1304354 1297501 1290924 1285666 1281816 1278929 1276477 1273794 1270080 1264874
49930 1264874 1258199 1249999 1240028 1228756 1217857 1208969 1202116 1195878 1189013 1181443 1173988 1167746 1163440
49917 1163440 1160494 1156699 1149588 1138400 1124278 1108561 1091526 1072926 1053020 1032613 1012342 992121
49905 992121 971181 948787 925341 902533 881832 862911 844374 825998 809208 795032 782646
49894 782646 770619 758713 747461 736547 724870 712166 699558 688115 677552 666866 655970
49883 655970 646177 638913 634092 630049 625221 619696 614844 611600 609649 608151 606516 604346 601459 598497
49869 598497 596754 596768 597722 598859 600742 604139 608272 611461 613267 614729 616472 617975 618966 620185 622088
49854 622088 623969 625247 626718 629475 633218 636725 639651 642761 646431 649915 652346 653806 655188 657393
49840 657393 660748 664771 668467 671264 673757 677211 682407 689304 697692 707470 718128 728567 737855 746009
49826 746009 753879 762563 773065 786041 801404 818178 835085 851495 867944 885687 905463 926396
49814 926396 946335 963825 979727 996308 1014586 1033153 1049902 1064290 1077327 1089805 1101426
49803 1101426 1111672 1120709 1128989 1136298 1141601 1143782 1142368 1137533 1129525 1118231 1103486 1085911 1067122
49790 1067122 1048645 1030498 1011303 990047 967497 945470 924898 905089 884963 864454 844372
49779 844372 825315 807263 790062 773719 758198 743524 730283 719366 710849 703571 696317 689074
49767 689074 682645 677430 673141 669411 665914 662113 657692 653129 649028 644969 640059 634699 630510 628028
49753 628028 625682 621988 617787 615132 614573 614919 615416 616714 619346 622412 624490 625369 626301 628589 632078
49738 632078 635021 635582 633678 631084 629545 629302 629835 631191 633467 635590 636176 635602 635811 637720 640149 641737
49722 641737 642447 642436 640940 637687 634346 633023 633885 635732 638337 642525 648118 653705 658795 664499 671320
49707 671320 677752 682257 685584 689943 696500 704827 714378 725180 737058 749411 762182 776283 792577
49694 792577 810747 829544 847903 865640 883123 900314 916155 929210 939238 947698 956149 964400
49682 964400 971177 976581 982759 991543 1002220 1012297 1019730 1023522 1022849 1017122 1007110 994794 981580
49669 981580 967450 952265 936994 922847 909912 897674 886513 877452 870387 863693 856073 848015
49657 848015 840865 835069 829995 825028 820009 814932 810114 806778 806388 808752 811408 811758 809727 807652 807435
49642 807435 808470 808682 807065 804597 802883 802631 803540 805085 806865 808519 809771 810605 811171 811557 811950 812881
49626 812881 814805 817282 819071 819490 819496 820935 824599 829355 833311 835628 836954 838327 840116 842129 844321
49611 844321 846898 849777 852416 854374 855740 856731 857182 856889 856295 856273 857145 858378 859556 861156 863930 867767
49595 867767 871661 874700 876588 877280 876753 875483 874678 875487 877915 880714 882342 881983 879965 877412 875419
49580 875419 874329 873828 873837 875002 877874 881771 884947 886086 885387 884204 883985 885569 888857 892713 895518 896246
49564 896246 895031 892631 889766 887234 886177 887642 891992 899052 908439 919215 929654 938338 945606 953233
49550 953233 962598 973691 985806 998337 1010747 1022665 1034406 1046689 1059539 1072279 1085004 1099087
49538 1099087 1115528 1133561 1151689 1169454 1187334 1205625 1224437 1244235 1265263 1286865 1308526
49527 1308526 1331177 1356082 1382729 1409445 1436118 1464527 1495526 1527714 1559883 1593313 1630285
49516 1630285 1671291 1715031 1760336 1806584 1852766 1897894 1942508 1988425 2036525 2085835 2135294
49505 2135294 2185536 2238128 2293478 2350298 2407114 2463696 2520777 2578711 2636808 2694007 2749819
49494 2749819 2804512 2858750 2913345 2968841 3024480 3077768 3126056 3168843 3207759 3244029 3276947
49483 3276947 3305443 3330099 3352495 3373012 3390364 3403130 3410898 3414231 3414457 3413408 3412286 3410551 3406680
49470 3406680 3400113 3391813 3382969 3374202 3366256 3360425 3357664 3357917 3360818 3366361 3374356 3383911 3394310 3406052
49456 3406052 3420201 3436963 3455608 3475684 3497463 3521057 3545765 3570599 3594911 3618171 3639556
49445 3639556 3658355 3674652 3689182 3702447 3714173 3723394 3728609 3727976 3720150 3705478 3686016 3663821
49433 3663821 3639342 3611665 3579820 3543256 3501526 3454679 3403984 3351237 3297009 3240516 3181511
49422 3181511 3121192 3060584 2999122 2935893 2871438 2807071 2742989 2678564 2614339 2552295 2493794
49411 2493794 2438283 2384293 2330819 2277598 2225025 2174252 2126589 2082466 2041448 2003242 1967824
49400 1967824 1934565 1902393 1871201 1842008 1815257 1789951 1765157 1741370 1719601 1699910 1681677
49389 1681677 1664619 1648665 1633500 1619277 1607243 1598496 1592293 1586490 1579634 1571962 1564666 1558927 1555369
49376 1555369 1553472 1551556 1548247 1544130 1541381 1541780 1545612 1552295 1561167 1571504 1582647 1594619 1608357
49363 1608357 1624913 1644413 1665797 1687845 1711052 1738378 1772802 1812984 1851989 1881616 1898122
49352 1898122 1903432 1901904 1897549 1893629 1892388 1894046 1897274 1901399 1907159 1915043 1924404 1935096 1948580
49339 1948580 1966120 1986808 2008619 2030706 2053380 2076478 2099298 2121921 2145064 2168464 2190734
49328 2190734 2211279 2231258 2251982 2273160 2293415 2312082 2329813 2347584 2365675 2383739 2401565
49317 2401565 2419618 2438816 2459789 2482394 2505951 2529829 2553720 2577631 2601875 2626928 2653065
49306 2653065 2680208 2708381 2738137 2770160 2804380 2839751 2875032 2909798 2944721 2980858 3018586
49295 3018586 3057431 3097223 3139181 3184995 3234679 3286167 3337575 3389099 3441963 3496342 3551470
49284 3551470 3607433 3665500 3726694 3791199 3859218 3931051 4005818 4081350 4156361 4232013 4310487
49273 4310487 4392481 4476904 4562565 4649256 4737220 4826303 4915794 5004799 5092928 5180886 5269926
49262 5269926 5360111 5449425 5535323 5617114 5696172 5773826 5849826 5922930 5992119 6056688 6115797
49251 6115797 6168760 6215678 6257185 6293482 6323985 6348062 6365825 6377967 6385005 6387057 6384428 6378182
49239 6378182 6369855 6360585 6350641 6339777 6327844 6315059 6301928 6289097 6277216 6266799 6258150 6251355
49227 6251355 6246302 6242854 6241219 6242025 6245728 6252005 6260134 6270015 6282342 6297615 6315404 6334748 6354734
49214 6354734 6374473 6393185 6410936 6428760 6447189 6464751 6478589 6486627 6488573 6484938 6475778 6460622
49202 6460622 6439082 6411102 6376767 6336082 6289069 6236263 6179126 6119347 6057285 5991602 5921154
49191 5921154 5846901 5771106 5694993 5618272 5540898 5463952 5388418 5314251 5241214 5169652 5099727
49180 5099727 5030898 4963081 4897516 4835425 4776314 4718708 4662152 4607372 4554780 4504044 4455106
49169 4455106 4408441 4364024 4321112 4279353 4239094 4200310 4162334 4125408 4091382 4061646 4034910
49158 4034910 4008337 3980918 3954597 3931848 3913145 3897243 3882956 3869602 3856231 3841809 3826527
49147 3826527 3811967 3799302 3787930 3776734 3766228 3758348 3753973 3751724 3749772 3748007 3747582 3748871 3751012
49134 3751012 3753452 3756927 3762539 3770562 3780686 3792902 3807413 3823795 3840893 3857778 3874494 3891706
49122 3891706 3909934 3929352 3950116 3972507 3996757 4022978 4051180 4080983 4111329 4141114 4170425
49111 4170425 4200689 4233129 4267552 4303171 4340124 4379188 4420233 4462092 4504108 4546734 4590277
49100 4590277 4634150 4678010 4722782 4769711 4819043 4870302 4923265 4977852 5033640 5090366 5148483
49089 5148483 5208301 5268925 5328875 5387521 5445088 5501592 5556579 5609585 5659933 5706460 5748507
49078 5748507 5787051 5823894 5859895 5894890 5928917 5962232 5994354 6024608 6053673 6083097 6112935
49067 6112935 6141362 6167127 6191112 6214864 6238805 6262554 6285858 6308387 6329475 6348814 6366757
49056 6366757 6383733 6400339 6418008 6437918 6458623 6476634 6490493 6502719 6516446 6531679 6546456
49045 6546456 6560089 6573151 6585409 6596241 6606561 6618003 6630412 6642244 6653314 6664834 6676624
49034 6676624 6686792 6694905 6703211 6713395 6723858 6731648 6736013 6738781 6742207 6747599 6755221 6764289 6773410
49021 6773410 6781917 6790458 6799769 6809572 6819496 6830346 6843304 6858225 6873787 6889237 6904953 6921011
49009 6921011 6935995 6947860 6955849 6961164 6965529 6969166 6970603 6968565 6963413 6956050 6945960 6931531 6912234
48996 6912234 6889295 6864004 6836592 6807291 6777109 6746568 6714618 6680053 6643444 6606510 6569887
48985 6569887 6532542 6493401 6452723 6411850 6372148 6334207 6297661 6261918 6227265 6194803 6164926
48974 6164926 6136576 6108665 6081532 6056062 6032058 6008780 5986874 5968266 5953809 5942157 5931339
48963 5931339 5920473 5909552 5898605 5888009 5878982 5872844 5869799 5868842 5868566 5867640 5864869 5859673 5852705 5845518
48949 5845518 5839215 5833412 5826662 5817947 5807809 5798012 5789964 5783304 5776033 5766234 5753830 5740631 5728425
48936 5728425 5716901 5703705 5686796 5666495 5644879 5623308 5601081 5576516 5548790 5518606 5487582
48925 5487582 5457076 5427037 5395857 5362008 5325882 5289192 5252337 5213623 5171781 5128061 5084565
48914 5084565 5041378 4996925 4950808 4904718 4860441 4818239 4777341 4736923 4696422 4655975 4616880
48903 4616880 4580705 4547765 4517381 4489635 4465709 4446285 4430844 4418881 4410401 4404742 4400455 4397430
48891 4397430 4397872 4403925 4415121 4429361 4445546 4464005 4484989 4508188 4533460 4560757 4589520 4619255
48879 4619255 4650545 4684362 4720511 4757745 4795228 4832816 4870192 4907169 4944913 4985362 5028943
48868 5028943 5073988 5118959 5164204 5211011 5259889 5310441 5362109 5414484 5467643 5522703 5581194
48857 5581194 5643141 5706534 5769577 5832823 5898285 5966977 6038336 6111595 6186523 6262795 6339734
48846 6339734 6416975 6494794 6573594 6653584 6734997 6817981 6901930 6985358 7066862 7146067 7223400
48835 7223400 7298921 7371571 7439798 7503072 7562508 7619481 7673651 7722941 7765573 7801430 7831191
$$ [...]
##END NTUPLES=NMR SPECTRUM
##END=
