
##TITLE=AC1182_Huila-garzon-HGAAH12019_5891150_33Rp9NvRbp
##JCAMPDX= 6.0         $$ Bruker NMR JCAMP-DX V2.0
##DATA TYPE= NMR SPECTRUM
##DATA CLASS= NTUPLES
##ORIGIN= BRUKER
##OWNER= Administrator
$$ 1.72 TOPSPIN		Version 2.1
$$ 2012-04-02 21:29:33.062 -0500  Administrator@TOPSPIN
$$ Compression mode = diff/dup
##.OBSERVE FREQUENCY= 400.13188235
##.OBSERVE NUCLEUS= ^1H
##.ACQUISITION MODE= SIMULTANEOUS (DQD)
##.ACQUISITION SCHEME= undefined
##.AVERAGES= 8
##.DIGITISER RES= 22
##SPECTROMETER/DATA SYSTEM= spect
##.PULSE SEQUENCE= zg30
##.SOLVENT NAME= COFFEE_meoh
##.SHIFT REFERENCE= INTERNAL, COFFEE_meoh, 1, 14.98061
##AUDIT TRAIL= $$ (NUMBER, WHEN, WHO, WHERE, PROCESS, VERSION, WHAT)
$$ ##TITLE= Audit trail, TOPSPIN		Version 2.1
$$ ##JCAMPDX= 5.01
$$ ##ORIGIN= Bruker BioSpin GmbH
$$ ##OWNER= Administrator
$$ $$ C:\Bruker\TOPSPIN/data/COFFEE/nmr/AC1182_Huila-garzon-HGAAH12019_5891150_33Rp9NvRbp/10/pdata/1/auditp.txt
$$ ##AUDIT TRAIL=  $$ (NUMBER, WHEN, WHO, WHERE, PROCESS, VERSION, WHAT)
(   1,<2012-04-02 21:29:24.656 -0500>,<Administrator>,<TOPSPIN>,<go>,<TOPSPIN 2.1>,
      <created by zg
	started at 2012-04-02 21:28:17.578 -0500,
	POWCHK enabled, PULCHK disabled,
       configuration hash MD5:
       1A 1E CE 29 27 FD 77 03 67 4E F0 E3 C4 B2 CB 90
       data hash MD5: 64K
       EF CC FD E5 74 B5 FB 4B 55 1E 99 71 16 B1 F7 5C>)
(   2,<2012-04-02 21:29:27.781 -0500>,<Administrator>,<TOPSPIN>,<proc1d>,<TOPSPIN 2.1>,
      <Start of raw data processing
       efp LB = 0 FT_mod = 6 PKNL = 1 PHC0 = 0 PHC1 = 0 SI = 32K 
       data hash MD5: 32K
       E1 7D 94 A0 0E B4 75 52 AC 4E FA 4B F1 39 2B 88>)
(   3,<2012-04-02 21:29:28.218 -0500>,<Administrator>,<TOPSPIN>,<proc1d>,<TOPSPIN 2.1>,
      <pk PHC0 = 212.7722 PHC1 = 0 
       data hash MD5: 32K
       69 48 55 D8 AC 45 5B 80 9E 28 9C 53 69 DC BF BC>)
(   4,<2012-04-02 21:29:28.296 -0500>,<Administrator>,<TOPSPIN>,<proc1d>,<TOPSPIN 2.1>,
      <abs ABSG = 1 
       data hash MD5: 32K
       6D 38 38 0F EB 09 33 63 70 C0 C1 BE E2 03 F6 6B>)
(   5,<2012-04-02 21:29:28.343 -0500>,<Administrator>,<TOPSPIN>,<proc1d>,<TOPSPIN 2.1>,
      <abs ABSG = 2 
       data hash MD5: 32K
       15 02 98 A1 17 4B 04 4A FD 94 D5 E4 A2 C5 0F 43>)
(   6,<2012-04-02 21:29:28.375 -0500>,<Administrator>,<TOPSPIN>,<proc1d>,<TOPSPIN 2.1>,
      <abs ABSG = 3 
       data hash MD5: 32K
       1C 69 DE E8 18 4F F0 8B 7E E7 2F E0 F5 48 64 DA>)
(   7,<2012-04-02 21:29:28.421 -0500>,<Administrator>,<TOPSPIN>,<proc1d>,<TOPSPIN 2.1>,
      <abs ABSG = 4 
       data hash MD5: 32K
       CF 80 7A 4E 27 79 2A D7 9C 92 4F C0 72 12 18 80>)
(   8,<2012-04-02 21:29:28.453 -0500>,<Administrator>,<TOPSPIN>,<proc1d>,<TOPSPIN 2.1>,
      <abs ABSG = 5 
       data hash MD5: 32K
       CF D8 00 07 92 9F 47 E3 52 F5 6A F3 15 B3 C0 16>)
$$ ##END=
$$ 
$$ $$ hash MD5
$$ $$ 79 3A F1 55 BF 24 47 5A DB 4A F7 54 26 59 C9 91
##$RELAX= 
##$RELAX= 
##$RELAX= 
##$RELAX= 
##$RELAX= 
##$RELAX= 
##$RELAX= 
$$ Bruker specific parameters
$$ [...]
150 150 150 150 150 150 150 150
##$TP07= 0
##$TPNAME0= <>
##$TPNAME1= <>
##$TPNAME2= <>
##$TPNAME3= <>
##$TPNAME4= <>
##$TPNAME5= <>
##$TPNAME6= <>
##$TPNAME7= <>
##$TPOAL= (0..7)
0.5 0.5 0.5 0.5 0.5 0.5 0.5 0.5
##$TPOFFS= (0..7)
0 0 0 0 0 0 0 0
##$TUNHIN= 0
##$TUNHOUT= 0
##$TUNXOUT= 0
##$USERA1= <user>
##$USERA2= <user>
##$USERA3= <user>
##$USERA4= <user>
##$USERA5= <user>
##$V9= 5
##$VALIST= <valist>
##$VCLIST= <CCCCCCCCCCCCCCC>
##$VD= 0
##$VDLIST= <DDDDDDDDDDDDDDD>
##$VPLIST= <PPPPPPPPPPPPPPP>
##$VTLIST= <TTTTTTTTTTTTTTT>
##$WBST= 2048
##$WBSW= 25
##$XGAIN= (0..3)
0 0 0 0
##$XL= 0
##$YL= 0
##$YMAX_a= 529628
##$YMIN_a= -644718
##$ZGOPTNS= <>
##$ZL1= 120
##$ZL2= 120
##$ZL3= 120
##$ZL4= 120
##$ABSF1= 14.98061
##$ABSF2= -5.57192
##$ABSG= 5
##$ABSL= 3
##$ALPHA= 0
##$AQORDER= 0
##$ASSFAC= 0
##$ASSFACI= 0
##$ASSFACX= 0
##$ASSWID= 0
##$AUNMP= <proc_prof1d_extract_pilot.lims>
##$AXLEFT= 0
##$AXNAME= <>
##$AXNUC= <1H>
##$AXRIGHT= 0
##$AXTYPE= 0
##$AXUNIT= <>
##$AZFE= 0.1
##$AZFW= 0.1
##$BCFW= 0
##$BC_mod= 0
##$BYTORDP= 0
##$COROFFS= 0
##$CY= 15
##$DATMOD= 1
##$DC= 0
##$DFILT= <>
##$DTYPP= 0
##$F1P= 0
##$F2P= 0
##$FCOR= 0.5
##$FTSIZE= 32768
##$FT_mod= 6
##$GAMMA= 0
##$GB= 0
##$INTBC= 1
##$INTSCL= 1
##$ISEN= 128
##$LB= 0
##$LEV0= 0
##$LPBIN= 0
##$MAXI= 10000
##$MC2= 0
##$MEAN= 0
##$ME_mod= 0
##$MI= 0
##$NCOEF= 0
##$NC_proc= -8
##$NLEV= 6
##$NOISF1= 0
##$NOISF2= 0
##$NSP= 0
##$NTH_PI= 0
##$NZP= 0
##$OFFSET= 14.98061
##$PC= 1
##$PHC0= 212.7722
##$PHC1= 0
##$PH_mod= 1
##$PKNL= yes
##$PPARMOD= 0
##$PPDIAG= 0
##$PPIPTYP= 0
##$PPMPNUM= 2147483647
##$PPRESOL= 1
##$PSCAL= 4
##$PSIGN= 0
##$PYNMP= <proc.py>
##$REVERSE= no
##$SF= 400.13
##$SI= 32768
##$SIGF1= 0
##$SIGF2= 0
##$SINO= 400
##$SIOLD= 32768
##$SPECTYP= <>
##$SREGLST= <1H.CDCl3>
##$SSB= 0
##$STSI= 32768
##$STSR= 0
##$SW_p= 8223.68421052632
##$SYMM= 0
##$S_DEV= 0
##$TDeff= 65536
##$TDoff= 0
##$TI= <>
##$TILT= no
##$TM1= 0
##$TM2= 0
##$TOPLEV= 0
##$USERP1= <user>
##$USERP2= <user>
##$USERP3= <user>
##$USERP4= <user>
##$USERP5= <user>
##$WDW= 1
##$XDIM= 32768
##$YMAX_p= 465964550
##$YMIN_p= -744722
##$CURPLOT= <Network HP LaserJet P1505>
##$CURPRIN= <$Network HP LaserJet P1505>
##$DFORMAT= <normdp>
##$LAYOUT= <+/1D_H.xwp>
##$LFORMAT= <normlp>
##$PFORMAT= <normpl>
##$SURQMSG= 1
$$ End of Bruker specific parameters
$$ ---------------------------------
##NTUPLES= NMR SPECTRUM
##VAR_NAME=  FREQUENCY,     SPECTRUM/REAL,   SPECTRUM/IMAG
##SYMBOL=    X,             R,               I
##VAR_TYPE=  INDEPENDENT,   DEPENDENT,       DEPENDENT
##VAR_FORM=  AFFN,          ASDF,            ASDF
##VAR_DIM=   32768,         32768,           32768
##UNITS=     HZ,            ARBITRARY UNITS, ARBITRARY UNITS
##FACTOR=    0.250966925370066, 1,           1
##FIRST=     8223.43324360095, 212654,       -144516
##LAST=      0,             16328,           -150916
##MIN=       0,             -744722,         0
##MAX=       8223.43324360095, 465964550,    0
$$ Real data points
##PAGE= N=1
##DATA TABLE= (X++(R..R)), XYDATA
$$ [...]
19471E5726E236a65064q0553O8174A28803i9967q9479O9822M9925k29050g1360
19459b17067Q1725l013G9993P1643b08332d9112l33281A38303C5817R3137B7032
19447d2345D9280a21116l00870B1736e6375q7415R28e3956m9766F7508P8826E7609
19434a63248Q406H2175b7003B64882h10j79782d8069r5460l4729A33252c13430
19422c58677A10941c21614F361f2595A34962E1353Q8356N9082d1665q175p9370
19411a29210j80339B24763d7341j4493l32403J83733K8981A7094L9682a15088
19400G5326b34501A15609c20835j08721C1103a89021f2391k72573B68234a71957
19389b0019A56451C4087e66465a47723B83614e0710r0425F2416A1147M0518d5090
$$ y = [55726, 5236, -165064, -245617, -177443, 128803, -99967, -189446, -119624, -69699, -298749, -71360, -217067, -135342, -138355, 79993, 151636, -208332, -49112, -382393, 138303, 35817, 128954, 27032, -42345, 49280, -121116, -421986, 21736, -56375, -143790, -142862, -53956, -103722, 67508, 146334, 57609, -163248, -154842, 82175, -27003, 264882, -810, -180592, -48069, -143529, -178258, 133252, -313430, -358677, 110941, -321614, 6361, -62595, 134962, 51353, 139709, 198791, -41665, -49840, -129210, -309549, 224763, -47341, -61834, -394237, -210504, -181523, 17094, 56776, -115088, 75326, -234501, 115609, -320835, -429556, 31103, -189021, -62391, -334964, 268234, -171957, -20019, 156451, 34087, -566465, -147723, 283614, -50710, -141135, 62416, 11147, 51665, -45090]
19377B55333b4953p5983A46896c9114A22163a00687b6990k05739B930b82689a19337
19365b37673h7837C21081A59500a90526l8443A04887Q6991b58296C11154F8233
19354A4571i7839B7214i5706o8765r3763F3434a41399e5149A46527a20365A48776
19342b61790J19380l59807b33604F2895a56777G9122a15935a2512A7496h4515
19331b29973I3240c00737O9914E489a63719l8217B4986b27917F4742b28577d0446
19319d9482k42253A28168b96111C7058a01579A33204a68991C58963a46517L9830
19309a06687G4949c35520a31681k7890d6587B06293a04173j98466a25568C9047
19298e29A50370a32176j33117d9140E7220A0085a38473A82280A2951J57395b10577
$$ y = [255333, -24953, -100936, 146896, -39114, 122163, -100687, -26990, -232729, 2930, -282689, -119337, -237673, -87837, 321081, 159500, -190526, -228969, 104887, 191878, -258296, 311154, 68233, 14571, -97839, 27214, -95706, -164471, -258234, 63434, -141399, -55149, 146527, -120365, 148776, -261790, -142410, -502217, -233604, 62895, -156777, 79122, -115935, -12512, 17496, -84515, -229973, 93240, -300737, -230823, 5489, -163719, -201936, 24986, -227917, 64742, -228577, -40446, -49482, -291735, 128168, -296111, 37058, -101579, 133204, -168991, 358963, -146517, -106687, 74949, -335520, -131681, -159571, -46587, 206293, -104173, -302639, -125568, 39047, -529, 150370, -132176, -265293, -49140, 57220, 10085, -138473, 182280, 12951, 170346, -210577]
19286A15660a33251r2854l07101A51094b5819C1331J03172b57513P6946a4456
19275e3117A89867j3772a98994j9100B90490j37009c83299a58124E8354J71466
19265B29820a96993E2958R3363A6412a97589a3122B25501q8436b6382m2631j23876
19254a92889M126k40310a53265f7562B1333a72559g6577n31875B5638a38099D1700
19242a65046K8118B83153I1573e674j631B17536c78948c715k99331n3546a54963
19230e1037I8409E59d21577A76926a3327j5990j33510d1868A1090N4525b40471
19218a72387j35152d2243A67167a29098b0162A32196c51706B349b41439l96922
19208f38361g315G2016O9803a09329I7026R8123d17336h3910H9385a9927o0446
$$ y = [115660, -133251, -226105, -533206, 151094, -25819, 31331, 134503, -257513, -180567, -14456, -53117, 189867, 176095, -198994, -218094, 290490, 153481, -383299, -158124, 58354, 229820, -196993, 52958, 146321, 16412, -197589, -13122, 225501, 137065, -26382, -69013, -192889, -188763, -429073, -153265, -67562, 21333, -172559, -76577, -608452, 25638, -138099, 41700, -165046, -136928, 283153, 91573, -5674, -7305, 217536, -378948, -3715, -303046, -356592, -154963, -51037, 98409, 559, -421577, 176926, -13327, -29317, -162827, -41868, 11090, 65615, -240471, -172387, -307539, -42243, 167167, -129098, -20162, 132196, -351706, 2349, -241439, -638361, -7315, 72016, 141819, -109329, 97026, 195149, -417336, -83910, 89385, -19927, -80373]
19197h0373m8035A01506d2419l5866o3956o708D33656I6446a68809F65c0691r5453
19185a26144G6807a95723i3952k0198A75295b09016O9401F5085a32498K415A2761
19173G271b21157B21035A1476a94630B97756c25523B4156b78073a4010k69729
19163b83739a20881j9127j88304a56294f3189o4839A26911b5676E5948J14143
19153A70091d0927A1253J72201b65980a08909k2761D7903c4486l1470B47943i1260
19141a83024C14675E7018b50032d8564o6175R182C26223A27740a88082h9090j13778
19130b02868D1166f5184A58673f0290p7142e4981j22979g9319j16120d9599E9834
19118b49475C2573h735B87717c63515C03821D8223a5731p5356A50957B6092J07249
$$ y = [-80373, -128408, 101506, -42419, -78285, -142241, -148949, 433656, 96446, -168809, 665, -30691, -126144, 76807, -195723, -93952, -114150, 175295, -209016, -139615, 65085, -132498, -130083, 12761, 7271, -221157, 221035, 11476, -194630, 297756, -325523, 24156, -278073, -14010, -283739, -120881, -140008, -328312, -156294, -63189, -128028, 126911, -25676, 55948, 170091, -40927, 11253, 183454, -265980, -108909, -131670, 47903, -34486, -65956, 247943, -91260, -183024, 314675, 57018, -250032, -48564, -114739, -105557, 326223, 127740, -188082, -89090, -202868, 41166, -65184, 158673, -60290, -137432, -54981, -177960, -79319, -195439, -49599, 59834, -249475, 32573, -8735, 287717, -363515, 303821, 48223, -15731, -91087, 150957, 26092, 133341]
19107A33341a40737n9140L9079j251A75059a02951I5262J44803a94155A43517
19096H5932a8774j92706n7355M0299a13402l9217j48998K1623A45568c41318J20117
19085b21201A74016D9546j4239a04101B07389J30175a21508H5739a53693E4730
19074a7645D500c08660B9400K1147d41243A8088g1954p3202A14305b6698g849
19062a53023B17626o3746b75115A17741B1849J93006m6090o8991A3063b85981
19051b58208a06841I2383O9820b38398L8528g0336r0703J5292B78185I1062Q5181
19040A76243p5122b44291i2443j21834N5755b1286D2511e9625Q262A08066b37128
19028b03623h621r2062m3606E4555M1887P8942h1901q5185p1101B18371J59004
$$ y = [133341, -140737, -199877, -160798, -162049, 175059, -102951, 95262, 240065, -194155, 143517, 85932, -18774, -211480, -268835, -228536, -113402, -152619, -301617, -279994, 145568, -341318, -221201, 174016, 49546, 35307, -104101, 207389, 337564, -121508, 85739, -153693, 54730, -17645, 4500, -308660, 29400, 50547, -441243, 18088, -71954, -145156, 114305, -26698, -7849, -153023, 217626, 153880, -275115, 117741, 21849, 214855, 168765, 99774, 13063, -285981, -258208, -106841, 92383, 162203, -238398, -199870, -70336, -161039, -145747, 278185, 91062, 176243, 101121, -244291, -92443, -214277, -158522, -21286, 42511, -59625, -51363, 108066, -237128, -203623, -8621, -100683, -144289, 54555, 96442, 175384, -81901, -167086, -238187, 218371, 377375]
19017C77375b1115p5807k5767C54783a01463c8320j31205f2069K107A02523k2978
19006G9545P0066N4303c72933A25642f0326j72459K5338J00523n9740a3217A38890
18994b85849c7579l0653H3768b490I2243a2893o7581j17787f4231j17093A9790
18982h6568B7062a1072C95729G1077a07246M4838H369e4419a1390p543B3775j0573
18970A3202K01320K3628a86635e7284m7871k23027J01395A73828g44722A3215
18959B9432K98660L2877O03310m64876j14016j62163a07949H5300i4488j37020
18949b31508A77791a44343b8303A59628i866k20750Q3135n2102r0667B02893b64256
18937a41208a9335B61Q4398a92892c1098k04821C7505c2110j50051j08031C4306
$$ y = [377375, -21115, -96922, -122689, 354783, -101463, -38320, -169525, -62069, -59962, 102523, 79545, 149611, 203914, -372933, 125642, -60326, -232785, -207447, -106924, -166664, -13217, 138890, -285849, -37579, -68232, 83768, -2490, 92243, -12893, -80474, -198261, -64231, -181324, 19790, -86568, 27062, -11072, 395729, 71077, -107246, -62408, 8369, -54419, -11390, -18933, 23775, 13202, 214522, 238150, -186635, -57284, -105155, -328182, -226787, 173828, -744722, 13215, 29432, 328092, 360969, 964279, 499403, 385387, 223224, -107949, 85300, -94488, -231508, 177791, -144343, -28303, 159628, -9866, -230616, -147481, -199583, -290250, 202893, -264256, -141208, -19335, 261, 84659, -192892, -31098, -235919, 37505, -32110, -182161, -290192, 34306]
18925c85752l6564J70398c8389q1367E7308k3131P743b36065B32035q6692N5132
18914B00475R6083b92550C9423q457K3157a68481A0634a24620j17270A0260e56044
18902a01126j89824J45384B2948K01194a76290B1276J07630O9912M66382k5515
18892F39685B20407j08052A7565a78616c8837K44B0586J49219J43675i892r7870
18881a07762l13256a64250A16685D5113J1090o588i8760F8273Q8306F6258R9931
18870A66189b13599A18745a75000p5885M9174d4928j25766j17607b8597B69130
18859b44040J3599E5015O5129a78941I7374a84478L8906g078j38473q1795a08937
18847h2792B74652h9061l96679a24261F366f2828j92243I9747b23663E4969a74548
$$ y = [-385752, -422316, -251918, -38389, -119756, 57308, 34177, 41920, -236065, 232035, 145343, 200475, 296558, -292550, 39423, 30966, 54123, -168481, 10634, -124620, -241890, 10260, -556044, -101126, -290950, -145566, 22948, 224142, -176290, 21276, 128906, 198818, 665200, 639685, 220407, 112355, 17565, -178616, -38837, -38593, 20586, 169805, 313480, -9892, -107762, -421018, -164250, 116685, 45113, 56203, 49615, -98760, 68273, 156579, 66258, 166189, -213599, 118745, -175000, -250885, -201711, -44928, -170694, -288301, -28597, 269130, -244040, -230441, 55015, 120144, -178941, 97374, -184478, -145572, -7078, -145551, -227346, -108937, -82792, 274652, -89061, -485740, -124261, 6366, -62828, -255071, 99747, -223663, 54969, -174548]
18835d9904j2697K6536j46443O7512b0943F3448b16247D3505L9956P9185a69551
18823c11547J21510b1751j48688K530d3503k6991b4254o2882l91841A35090D3133
18811E4640J7412i7526K4359k72264a6829l7859j52067R2976A56298M3691a99712
18799G2805P4401l4233b34964A46121m0982Q7063I3656b7541n4659F758M6432
18788E3190K0835f8230G9897a43850f0069K2272D3133a13744A22283K5383a45702
18776E4262K7221j7019b02717o9346B52854j01597a51899a6138G316K27418a76680
18764I6902J05436E7681a48293N5567o4653m1892B32181a04786k7322a296r5529
18753i6825q6307f6999o371a1999l9499j68465k7345j623c7047A04820b0718B2520
$$ y = [-49904, -62601, -36065, -182508, -114996, -20943, 63448, -216247, 43505, 83461, 162646, -169551, -311547, -190037, -21751, -170439, -167909, -43503, -70494, -24254, -87136, -478977, 135090, 43133, 54640, 72052, -97526, -73167, -345431, -16829, -54688, -206755, -113779, 156298, 199989, -199712, 72805, 147206, 112973, -234964, 146121, 105139, 192202, 93656, -27541, -82200, 6758, 53190, 74025, -68230, 79897, -143850, -60069, -37797, 43133, -113744, 122283, 147666, -145702, 54262, 81483, 64464, -202717, -272063, 252854, 151257, -151899, -16138, 7316, 234734, -176680, 96902, 202338, 57681, -148293, -92726, -157379, -199271, 232181, -104786, -132108, -1296, -96825, -183132, -66999, -73370, -11999, -51498, -219963, -247308, -248931, -37047, 104820, -20718, 22520]
18740e6871F1241e1718A20899B2481B976a05645G3128j1243a7034j27664E9156
18728B76461c38558J30117h2912l4341A16069b09463B04010b05624k3732l9564
18718b68920A73597G2893a60534l7827j023c3310k32917B29835c48031c9372D6409
18706H6551m2402N2540a40047H3485a26198B04276b49558k202J5979o7336N9486
18695b43631D4438a54794B12307a76433j30456b9510E2672a92211k2478k84339
18685d99028B88845b16994D3112L1223f6209B98489a50242j18509C3188J27418
18675A60606a37339I684c16329d6296l25274H3253a68969e2308H5247c06366O0483
18664b45883G6584a14226p1343d7229a9214j58483L5153k32895l4546b2245A0462
$$ y = [-56871, 61241, -51718, 120899, 22481, 2976, -105645, 73128, 61885, -17034, -144698, 59156, 276461, -338558, -208441, -82912, -117253, 116069, -209463, 204010, -205624, -229356, -268920, 173597, 72893, -160534, -198361, -199384, -33310, -266227, 229835, -348031, -39372, 46409, 86551, 44149, 96689, -140047, 83485, -126198, 204276, -249558, -251760, -235781, -303117, -243631, 44438, -154794, 212307, -176433, -306889, -29510, 52672, -192211, -214689, -499028, 288845, -216994, 43112, 74335, -66209, 298489, -150242, -268751, 33188, 160606, -137339, 9684, -316329, -46296, -371570, 83253, -168969, -52308, 85247, -306366, -245883, 76584, -114226, -185569, -47229, -19214, -177697, -142544, -375439, -409985, -22245, 10462]
18652c03354j20647g3530C66411p5158a66161j78429g2846k17694B26812g6178
18641b29894O1054B64953F9109b79087d0600A70523K7627G3939P2500a0404r4154
18630a04558C1733d47303a30341k5026d8449D4861a93238a4706k0855l08285b5294
18618A85192i5569A92237J28675d8906q0221c5062j58498N4011C32277A16811
18607A37158O396d08911i7158G8098a06206d9786A854b26366A03936a87499C30838
18595H4844a16180A56122b37648E6257a16466p8500F9745f8574l30617C876f1076
18583g5204C59768j34734a4674q2711j22193N4906j46234J25887O6839H7632h3993
18571D6137K02598b91073J29427A74469D9231f8553k20353B84996a87121J6636
$$ y = [-303354, -424001, -73530, 366411, 291253, -166161, -344590, -72846, -290540, 226812, -76178, -229894, -168840, 264953, 69109, -279087, -40600, 170523, 198150, 73939, 146439, -10404, -104558, 31733, -447303, -130341, -155367, -48449, 44861, -193238, -14706, -35561, -343846, -25294, 185192, -95569, 192237, 320912, -48906, -129127, -35062, -193560, -139549, 332277, 116811, 137158, 143554, -408911, -97158, 78098, -106206, -49786, 1854, -226366, 103936, -187499, 330838, 84844, -116180, 156122, -237648, 56257, -116466, -194966, 69745, -68574, -399191, 3876, -61076, -75204, 359768, 225034, -14674, -97385, -219578, -164672, -310906, -185019, -118180, 87632, -83993, 46137, 248735, -291073, -161646, 174469, 49231, -68553, -288906, 284996, -187121, -170485]
18561a70485j03352A08121k0298a48778K3465j22488a05195M6817o1636k01502
18551c21516A94612A5006d261D4041h0130b724l037k76140i7116F2417L38588
18540D01005j83678A08433a63633n4319E4195j5586L6079d6613j22433C9240f598
18528I0608j0189a38526j56274m7450J62201P6986k9309A16543c28424h7531C76516
18516D9291a61343q3264c3987G9139a14700b0147B21251a95206a5470j54525A35177
18504a69643O4227D4356a1705j0185n2568j96706B06738C9139a38355A84232a18497
18492a12472r5341k06912e6889B37232D5181P7356k2147b23491B7027a10484G3809
18480a56279A0580J17693a60238n2959C4922b03492A57502b8054j29698A6563
$$ y = [-170485, -273837, 108121, 87823, -148778, -125313, -247801, -105195, -58378, -120014, -321516, 194612, 15006, -4261, 44041, -80130, -2724, -5761, -281901, -97116, 62417, 401005, 217327, 108433, -163633, -217952, 54195, 38609, 74688, -46613, -169046, 39240, -6598, 90608, 80419, -138526, -294800, -342250, -180049, -103063, -132372, 116543, -328424, -87531, 376516, 49291, -161343, -244607, -33987, 79139, -114700, -20147, 221251, -195206, -15470, -169995, 135177, -169643, -105416, 44356, -11705, -21890, -74458, -271164, 206738, 39139, -138355, 184232, -118497, -112472, -207813, -414725, -56889, 237232, 45181, 122537, 100390, -223491, 27027, -110484, 73809, -156279, 10580, 128273, -160238, -213197, 34922, -203492, 157502, -28054, -157752, 16563]
18469b00067A17953c7285j09951A62519B0549c07071A2841P9967J3634a10472
18458E9770k8224d0838M868m58971a76690A35786L0873Q0817a54308C6506J27074
18447A63580D6193b00194L2869e3845A04673b27698A12584i2297m2373p9895h4571
18435A39082a87259E2528B5044b28046B06296j9425f8962j0816A926h6852q043
18424i4895E4430a906j09725l89448K03158a01623m5331c7002B50816k9896d9572
18412A31686A2837b09796j32056P5876a07515q3671b4071k59425a4603m4970A40634
18400h1739j97257A68146j0935J03163L1685h9157A05502b6542j28109F3110a85073
18388B5191C082a09319A03718b11997e5281K810j17063j93710J77434g0457A77726
$$ y = [-200067, 117953, -37285, -147236, 162519, 20549, -307071, 12841, 92808, 106442, -110472, 59770, 31546, -40838, -35970, -494941, -176690, 135786, 166659, 247476, -154308, 36506, 163580, 46193, -200194, -167325, -53845, 104673, -227698, 112584, -92297, -134670, -214565, -84571, 139082, -187259, 52528, 25044, -228046, 206296, 186871, -68962, -79778, 1926, -86852, -94895, 54430, -1906, -111631, -501079, -297921, -101623, -146954, -37002, 250816, 220920, -49572, 131686, 12837, -209796, -341852, -265976, -107515, -191186, -24071, -283496, -14603, -59573, 140634, -81739, -278996, 168146, 157211, 260374, 292059, -89157, 105502, -26542, -154651, 63110, -185073, 25191, 3082, -109319, 103718, -211997, -55281, -52471, -169534, -363244, -185810, -70457, 177726]
18376c40366a1155H2012a3471k45893N9555B39542a41547A06715a60242j47238
18366c07480j00814J20501c8972P902B5604b21747A16590k4235i7502b8614r9435
18355a28049M7844p0695q9951C7633a60412B9578L0530a91062m7752A69345b44583
18343b17573d153l80330J61505e0507M276L912j82352e1914m10047G1956J28004
18332A99960A6309d2910D1058r217M2299a51209C73790F5804M21793A1596O8890
18321H0486N0020a6961j40004E3734a02570j31657E2128j8586K07760E2147h4818
18309D4293N8897Q39b6337A141J30162o0660A3563d2222B02131a14459A2783i8935
18296A8944b04865b6521D52830a01060r313k4231A85055B7235a69694k6494n0715
$$ y = [-340366, -11155, 82012, -13471, -259364, -199809, 239542, -141547, 106715, -160242, -307480, -408294, -287793, -38972, -31070, 25604, -221747, 116590, 92355, -97502, -28614, -128049, -80205, -150900, -240851, 37633, -160412, 29578, 60108, -191062, -238814, 169345, -244583, -217573, -4153, -384483, -222978, -50507, -46231, -42319, -224671, -51914, -461961, 71956, 199960, 16309, -42910, 41058, 31841, 74140, -151209, 373790, 65804, 487597, 11596, 80486, 130506, -16961, -156965, 53734, -102570, -234227, 52128, 33542, 241302, 52147, -84818, 44293, 103190, 104029, -26337, 1141, 131303, 70643, 13563, -42222, 202131, -114459, 12783, -98935, 18944, -204865, -26521, 452830, -101060, -110373, -134604, 185055, 27235, -169694, -196188, -246903]
18285b46903g054p957G1078B7334a5105E4015P3979J51481C6897a67089l4154
18274b01243D2275K859J7553Q499J08698p9056a28259H5559g9123A2258C369f8069
18261D24985C0119J78146a47169A3713g5046C5283b54792a02776p5856a9381m8614
18250f7995m0237c9129F5704a96264H815a6196A45508b43390b6726j32357A60146
18238b12680e181A14019K17076I7286Q5462G5618P1953f1837A51889a0065n5113
18227f5178D8208A4425b84160B28324D86a36505e2270D2192b46877b5281B19280
18215c59695B8598g9987l4877H7210C0990g5743p7569e8711A53717c16672L2532
18204b84140D0361f6149j073A06545b832B33867b52369e3104G4518J55631b7684
$$ y = [-246903, -7054, -15011, 71078, 27334, -15105, 54015, 127994, 279475, 36897, -167089, -201243, 42275, 45134, 62687, 71186, 179884, 100828, -128259, 85559, -79123, 12258, 3369, -68069, 424985, 30119, 208265, -147169, 13713, -75046, 35283, -254792, -102776, -178632, -19381, -67995, -108232, -39129, 65704, -196264, 8815, -16196, 145508, -243390, -26726, -159083, 160146, -212680, -5181, 114019, 331095, 97286, 182748, 75618, 147571, -61837, 151889, -10065, -65178, 48208, 14425, -284160, 228324, 486, -136505, -52270, 42192, -246877, -25281, 219280, -359695, 28598, -79987, -114864, 87210, 30990, -75743, -153312, -58711, 153717, -316672, -284140, 40361, -66149, -67222, 106545, -2832, 233867, -252369, -53104, 74518, 230149, -27684]
18192a56073c4620C21410b84376a6652B74058G450b36316O4446l1775i6805a0001
18180a84276c6625l29473M8270a03637E7971K3591j6785J31328c18663i0931m2275
18169a33206E3050c44191R6412B02532b51616b9320k31603J10547a4079m2438
18159e6517F5468a8812j61872a233q6598j811C9169b21427n6357B1966i4106A43264
18146A48711A0327f3390A25834k5495a17124A38220e6214l8168H9560a93226A52864
18134f9577A40117j9500A0512J08672n415c55113a54727j66198G7824b3979n8629
18123h2608H4735a42247l7394D2374b1270A20015b35555P4959j63658B86060a93462
18111c66610F5504b1997B5965J7528O2044M1488J99669a66290j56134a959o7813
$$ y = [-156073, -34620, 321410, -284376, -16652, 274058, 7450, -236316, -171870, -203645, -96805, -10001, -184276, -36625, -366098, -317828, -103637, 57971, 81562, 64777, 196105, -318663, -90931, -133206, 53050, -344191, -247779, 202532, -251616, -29320, -260923, -150376, -14079, -56517, 65468, -18812, -180684, -1233, -87831, -89642, 39169, -221427, -277784, 21966, -94106, 143264, 148711, 10327, -63390, 125834, 100339, -117124, 138220, -56214, -94382, 89560, -193226, 152864, -69577, 140117, 120617, 10512, 119184, 113769, -355113, -154727, -320925, 77824, -23979, -82608, 84735, -142247, -179641, 42374, -21270, 120015, -235555, -160596, -324254, 286060, -193462, -366610, 65504, -21997, 25965, 43493, 105537, 147025, 346694, -166290, -322424, -1959, -69772]
18100f9772k69613a51171B33442b24193B33460j0836a0015j76896L8717D9897
18089F103K43043H7587a07405A46937f8082j66492f3815A1631K58209I4394J54557
18078B48951L1605j02086d02970a59767G290M63145A09315i0293B3845N0772c23078
18066E8902J48595I4275b09898J00481f709A73352J29667j37009J07310p5095
18056A98225I6350d3271n6165A72865a31349B73953G2673J4512e3515j49752O6376
18045a36891E111a32958B7679Q2585a38851B21089F6639B0014r83J88935g9095
18033A01557c71644A30821J44666I490K71871C063M0594b8057C27325a60014c5264
18021a30581E7563b335A0423L1449J3511a82792B42620a21050J8333k11637D9931
$$ y = [-69772, -339385, -151171, 233442, -224193, 233460, 222624, -10015, -186911, -148194, 49897, 6103, 249146, 87587, -107405, 146937, -68082, -234574, -63815, 11631, 269840, 94394, 248951, 280556, 178470, -402970, -159767, 7290, 470435, 109315, -90293, 23845, 74617, -323078, 58902, 207497, 94275, -209898, -109417, -6709, 173352, 303019, 166010, 273320, 198225, 96350, -43271, -99436, 172865, -131349, 273953, 72673, 87185, -53515, -203267, -136891, 5111, -132958, 27679, 110264, -138851, 221089, 66639, 20014, 19031, 207966, -79095, 101557, -371644, 130821, 275487, 9490, 281361, 3063, 43657, -28057, 327325, -160014, -35264, -130581, 57563, -2335, 10423, 41872, 55383, -182792, 242620, -121050, -102717, -314354, 49931]
18009A08643M5348c23764Q2791J8625L904P1440N1528a3214B63041a26671B1503
17997B8031b80865g7984a8032C2784P2542c26985F284a58975d0570B05695r8982
17986A06713h4843b0497A19967C7965Q0895b18556A24185a6337j82670A53917
17975h7871B7454G417a01278B04468I2415h0744F8238D165i0421C11913C6103
17963B13568A02801a75926O3412I5228D4616j419N7315a6392J201j58574P3897
17952i9868B32674K1683a03491n5125A38578b23690A34080g2284n9872k4876A2603
17940I9313a78306M6374C26183q3119a2945j58958F807N187K1655D636L3614c51771
17927c71212a28371K9750G3029j2939h1865L7338g752C73939A6416b56767H8312
$$ y = [108643, 153991, -323764, -240973, -222348, -218444, -147004, -95476, -13214, 263041, -126671, 21503, 28031, -280865, -77984, -18032, 32784, 105326, -326985, 6284, -158975, -40570, 205695, 106713, -84843, -20497, 119967, 37965, 118860, -218556, 124185, -16337, -199007, 153917, -87871, 27454, 7417, -101278, 204468, 92415, -80744, 68238, 4165, -90421, 311913, 36103, 213568, 102801, -175926, -112514, 95228, 44616, 43197, 100512, -16392, -15191, -173765, -99868, 232674, 254357, -103491, -158616, 138578, -223690, 134080, -72284, -132156, -157032, 12603, 99313, -178306, -131932, 326183, 243064, -12945, -171903, 6807, 11994, 33649, 4636, 38250, -351771, -371212, -128371, -98621, 73029, 60090, -81865, -44527, -7752, 373939, 16416, -256767, 88312]
17915D8959L04805A16934g0572K8633P323H8823e9027B5926e180D8595g302B32901
17902C09543n5921a04058d3026B86225a14576M9867l0242I7475c0726A39204B7924
17890B48431j04421b31711A12353J38001F3705a1072j49075M9575A66759a12132
17879B89396a56137e0857A92814a85256B09514d2538p1775A26686i936G063g21
17867A91738D7792b35396B3679a01142A74903A1499b12655a1636j35726m368B18555
17855A56132b47130J12282D85171E8882J9449B9274A1129L3581g0475j90999n3104
17844c14578B44490a20970p4013A31209i859g81n6442A12571L1204b01277h7776
17832A22604d09593A8376P1682g756A6280K44020A26993E1442A6719b35214C5565
$$ y = [48959, 353764, 116934, -70572, -41939, -34616, 88823, -59027, 25926, -5180, 48595, -7302, 232901, 309543, 253622, -104058, -43026, 286225, -114576, -64709, -94951, 97475, -30726, 139204, 27924, 248431, 144010, -231711, 112353, 250354, 63705, -11072, -160147, -110572, 166759, -112132, 289396, -156137, -50857, 192814, -185256, 209514, -42538, -114313, 126686, -9936, 7063, -721, 191738, 47792, -235396, 23679, -101142, 174903, 11499, -212655, -11636, -147362, -151730, 218555, 156132, -247130, -134848, 485171, 58882, 78331, 29274, 11129, 44710, -70475, -261474, -314578, 244490, -120970, -194983, 131209, -9859, -781, -57223, 112571, 143775, -201277, -87776, 122604, -409593, 18376, 90058, -7756, 16280, 260300, 126993, 51442, 16719, -235214, 35565]
17820b5711A24381e4143F727J08751J55519e3428B0052L68828D2629a13129M9734
17809f3395j00328H4742L01363j06185K3581c50857J28219h8650l5630f0897B2010
17797h157k22505f5909J5262p1863e2033b0445A57754k3976e3617A35750b31285
17785H2266i6381A63182a9575l41492B39787d6134k76225A53582m9156e5967B96147
17773i7512B72424H9273O3682b41597G2376b81156F6593a83900B31487f1043I8820
17761h2283B67558a08477C16453c1958A20386A0027a53792c8117q08B25755K18189
17750D43944k15124b14084d2480j03438o4890A32570N1370a22491A98065a72512
17739D5667c8286A44950K7031e1965B6989g519p2927B26979c9401j76849B81590
$$ y = [-25711, 124381, -54143, 6727, 115478, 270997, -53428, 20052, 388880, 42629, -113129, -63395, -163723, 84742, 386105, 279920, 303501, -350857, -222638, -88650, -124280, -60897, 22010, -8157, -230662, -65909, -50647, -122510, -52033, -20445, 157754, 133778, -53617, 135750, -231285, 82266, -96381, 163182, -19575, -361067, 239787, -46134, -322359, 153582, 104426, -55967, 296147, -97512, 272424, 89273, 152955, -241597, 72376, -281156, 66593, -183900, 231487, -61043, 98820, -82283, 267558, -108477, 316453, -31958, 120386, 10027, -153792, -38117, -38925, 225755, 443944, 228820, -214084, -42480, -145918, -210808, 132570, 183940, -122491, 198065, -172512, 45667, -38286, 144950, 171981, -51965, 26989, -7519, -80446, 226979, -39401, -216250, 281590]
17727B57767a29859B3953J31637l0722n8119e9730A17111J29124d2119D15640
17716h8363C1488J96302J69403I4143a41998A84743K36054a5514F8369f7145A6098
17704A62964N2923f7071C15531E5640K5179K0119m0571J76692j13348a22292B36409
17692B46861q3013C6040L7166a04667A60792a9348l6353F3141J16419m556H5438
17680a29863M6475b4536j05529B80918r9489A1431J53457j4779a7662E6794e8467
17668c6869C11891k3299f4683A43401b9685D20765e7811D0614e2168j5789B5379
17656C6298K09728J2965j05364a88857B10020I6300i6385m1302B60541k2398N3111
17645B91254A08282M0704l6118a82574B39965h5766H8211J9442O3411K7092H3930
$$ y = [257767, -129859, 23953, 155590, 124868, 66749, -59730, 117111, 246235, -42119, 415640, -88363, 31488, 227790, 397193, 94143, -141998, 184743, 420797, -15514, 68369, -67145, 16098, 162964, 215887, -67071, 315531, 55640, 80819, 100938, 60367, 237059, 123711, -122292, 236409, 246861, 163848, 36040, 73206, -104667, 160792, -19348, -55701, 63141, 179560, 175004, 85438, -129863, -83388, -24536, -130065, 280918, 181429, 11431, 164888, 150109, -17662, 56794, -58467, -36869, 311891, 288592, -64683, 143401, -29685, 420765, -57811, 40614, -52168, -67957, 25379, 36298, 246026, 258991, 153627, -188857, 210020, 96300, -96385, -137687, 260541, 238143, 291254, 108282, 148986, 112868, -182574, 239965, -85766, 88211, 107653, 171064, 198156, 83930]
17633B2486j805J29913B1517K24275r836B3153O4194A9807P2477a00319D6880
17621b50688a03574m8823B1814a01326B4299J12007b9795D93638j38507a31605
17610D29729E9964j9449e1265j96601J23350A12520D7317J85290i0020a4775B22557
17598B93875E4944J67186a05612A6395P6085k665a9592l9638j76122D39816j91767
17587B48049E8449a92599d8705C19837A51091L7089o6176J35976o1907R8023A09966
17575e7165q3924A30268J85618A57367J6391f6590C25504P889j13119J41855d1842
17563H3345o02C6544K77851f1605F6700N46988b28285G1306Q4769o1003L4228
17552A29300L86237A28653m1906J07766K37512B2572a81710A09940b27508F8937
$$ y = [22486, 20681, 150594, 21517, 245792, 235956, 23153, 87347, 19807, 92284, -100319, 46880, -250688, -103574, -152397, 21814, -101326, 24299, 136306, -29795, 493638, 355131, -131605, 429729, 59964, 40515, -51265, -247866, -124516, 112520, 47317, 232607, -90020, -14775, 222557, 293875, 54944, 222130, -105612, 16395, 92480, 89815, -19592, -59230, -235352, 439816, 248049, 58449, -192599, -48705, 319837, 151091, 188180, 122004, 257980, 196073, 294096, 109966, -57165, -141089, 130268, 315886, 157367, 173758, -66590, 325504, 333393, 220274, 362129, -41842, 83345, 82743, 36544, 314395, -61605, 66700, 613688, -228285, 71306, 156075, 95072, 129300, 515537, 128653, 86747, 194513, 432025, 22572, -181710, 109940, -227508, 68937]
17541h2298J5145A89544M73223A53733k8413L1561p7285M74570B04822K28929
17531D33751B4021a06992E07588j37650J2303j58143r5425a09555D36645j06941
17521C29704M1236j14376b0238C41296c1474D54251a12360A59140E8636L91919
17511D50555q6872K84394p8767K51417p7452K06798l50252J56536B81269A4092
17500C12850M42144l55750R4255a2733F57736R458K2068r865K17429k57200L7884
17489F77510k77256l9692j62756J12678l8644q4656L91447B01447C55J87505e4499
17477B08688L60991I2510L81820j22407m2169O2760l4558j66643n9367M21279
17467E33225j77794j8566A28004K00161J67555k38755k7486K5704o5522K42652
$$ y = [-82298, -67153, 189544, 662767, 153733, 125320, 156881, 79596, 554166, 204822, 433751, 24021, -106992, 507588, 369938, 382241, 224098, 128673, -109555, 436645, 329704, 370940, 256564, -20238, 341296, -31474, 454251, -112360, 159140, 58636, 450555, 363683, 648077, 569310, 820727, 743275, 950073, 599821, 756357, 281269, 14092, 312850, 754994, 399244, 493499, -12733, 657736, 667194, 689262, 679397, 896826, 639626, 677510, 400254, 360562, 197806, 310484, 271840, 187184, 578631, 201447, 355, 187860, -54499, 208688, 569679, 92510, 474330, 351923, 309754, 372514, 337956, 171313, 111946, 533225, 355431, 336865, 128004, 328165, 495720, 256965, 229479, 255183, 189661, 432313]
17457D32313k00383p0979N72171C39464j62179d1670C95167j00995A25844a48499
17446B20810J15864j27880J71821a0584D66675j52536O0031r8402A1452K28181
17436B39633J41190P8640A92861L10182B16557L19326A08674M63783j89113J09562
17426D92906r3989j11051M8673I5066L38155o4566a3385B0968K86854k987j0503
17415B94332R5004A14259L29725D3834K43182J1854O039D4021O34443B66631K4556
17404B91187A11481O01414k02664B38509K54347K01328A72124m4714P7094J89331
17394C93835J00046k36147J41702o6847H7675D2250L41061j25594L5140H6122
17383H3570a37818A46581M3000L55518j99387j58218J14280J97366j1489A52842
$$ y = [432313, 231930, 160951, 733122, 339464, 177285, -41670, 395167, 294172, 125844, -148499, 220810, 336674, 208794, 380615, -10584, 466675, 314139, 374170, 275768, 11452, 239633, 380823, 459463, 192861, 503043, 216557, 535883, 108674, 572457, 383344, 492906, 398917, 287866, 336539, 95066, 433221, 368655, -13385, 20968, 307822, 304835, 294332, 389336, 114259, 443984, 43834, 287016, 298870, 304909, 44021, 678464, 266631, 291187, 111481, 712895, 510231, 238509, 492856, 694184, 172124, 127410, 204504, 393835, 493881, 257734, 399436, 332589, 87675, 42250, 383311, 257717, 292857, 86122, 83570, -137818, 146581, 189581, 545099, 345712, 187494, 301774, 499140, 487651, 152842]
17372G1579L07975L0994B6534L39641j59630J11117m4321g0981A66763J08657
17362B75420J68814A60212L05638A54983n586A3310J88302J44307j15523J85576
17352D15972e4573B43168r5041c2275G6880J19035K00735j70015K74869j25686
17342C75818n8160E7002K39669A33833l7446L9260P660n6560l2429K95837G0496
17330B50049j17609K90067o0918P2614A51524J61402H1860L66773H4160P2149
17320A56309P3757N6831o0632e6766A70850L0675J30011g6440B93450a25350E45631
17308B25575j03821K25121B0392e2720E02732l6338j94964b0892A64172Q482J2559
17297A85213O6494J09843K70750A36294L36592j87129A04834K79921R5949A51825
$$ y = [71579, 379554, 410548, 26534, 366175, 206545, 317662, 273341, -70981, 166763, 275420, 444234, 160212, 465850, 154983, 149397, 13310, 201612, 345919, 230396, 415972, -54573, 243168, 148127, -32275, 76880, 195915, 396650, 226635, 501504, 375818, 317658, 57002, 296671, 133833, 96387, 135647, 143307, 86747, 54318, 350155, 70496, 250049, 132440, 422507, 361589, 434203, 151524, 312926, 81860, 448633, 84160, 156309, 230066, 286897, 226265, -56766, 170850, 201525, 331536, -76440, 293450, -125350, 545631, 225575, 121754, 346875, 20392, -52720, 502732, 466394, 271430, -20892, 164172, 172654, 185213, 251707, 361550, 632300, 136294, 472886, 285757, 104834, 384755, 480704, 151825]
17286B61167E3891M97228A94629J67222A80845L91651j91756h0445E30497j42945
17276C87552j89183O4334J53224m4450A32039C980K88796K83721r813A27298J51991
17265B79289J56449A06347K60465n7926J23052K69340C29717q576Q8463j15366
17255B94238A14641Q1433K82678k18826l1155A04414J65534O4495K7491H1031
17244H11752A71563M10292j81456p2405A42181K94128g8581B60712I4073K27292
17234C21365E0260L04299j44563o5126n6427K31929K65802A70608J88422p1247
17224B87783F4968A5766K34316m5461j7881J26048A27772m8943M96781A50553
17213C31605b0452C52491A67574Q4163J98732B20385J66826Q444j14376J93654
$$ y = [261167, 53891, 551119, 194629, 361851, 180845, 572496, 380740, -80445, 530497, 387552, 198369, 262703, 415927, 371477, 132039, 3980, 292776, 576497, 566684, 127298, 279289, 435738, 106347, 366812, 308886, 431938, 701278, 329717, 321141, 409604, 294238, 114641, 196074, 478752, 259926, 228771, 104414, 269948, 334443, 361934, 81031, 811752, 171563, 581855, 400399, 327994, 142181, 436309, -78581, 260712, 94073, 321365, 50260, 354559, 209996, 144870, 88443, 320372, 586174, 170608, 359030, 287783, 64968, 15766, 250082, 204621, 186740, 312788, 127772, 78829, 575610, 150553, 331605, -20452, 352491, 167574, 251737, 450469, 220385, 387211, 395655, 281279, 474933]
17203D74933B36561l2026k3430N42756j90177j52157J16279J96707j76336N07
17193E18684B51461K03785B13209K93989n7332r445d9713D32948J95674A7170
17182C39426J24669j60650J60501J67736j96793A75925q3202K01972L57293B34381
17171C49715K18056n0287Q8790A66047L05889J14794o333j43706j8116j19862
17161B98713k5720L02451k47116M04939A50580R2427N88760B26672M21878l04641
17151C43909L88200B79381M79198C61596J09720n1013R6762j30126Q8682K46755
17141G22376k20759m9559Q099j79588K18075K13024k00165J60577k08472j54893
17131C08715R0229N9815Q8371B06370J54157J29216j16618m0340M9531L34252
$$ y = [474933, 236561, 204535, 181105, 723861, 533684, 381527, 497806, 694513, 518177, 518684, 251461, 455246, 213209, 507198, 449866, 440421, -49713, 432948, 628622, 17170, 339426, 464095, 303445, 463946, 631682, 434889, 175925, 92723, 294695, 651988, 234381, 349715, 567771, 517484, 606274, 166047, 471936, 586730, 580397, 436691, 418575, 298713, 272993, 575444, 328328, 733267, 150580, 243007, 831767, 226672, 648550, 343909, 732109, 279381, 758579, 361596, 471316, 420303, 517065, 386939, 475621, 722376, 501617, 452058, 460157, 280569, 498644, 711668, 511503, 672080, 463608, 308715, 398944, 458759, 547130, 206370, 360527, 489743, 373125, 332785, 382316, 716568]
17121G16568B65294L51293k06860J45366L24474k37409p7078j50308J5091Q1689
17111E11552K58193j71837p8q0052j27881L13203j08277p8755J1329k34372J30698
17100D23723J6497K25419l13854J36603o9825M37421p3821J41573m4598B46414
17089F37327q9167l0159J34312j83034j49562M65529l5532m8943r1732M0643j29699
17078E19983j16089k1497N4657O6583K96340j84250J0591M7899K5413n0235j88899
17067D60496L91667l44518j1793L11955j58198j84981K34469j79635J0175K50431
17057G80068j65255J08151N5136N9935j6915k83240M40143m04450R2578j2236
17047F53915K12154k03292K03192k07557k06329L22320n072j59510K29031J11759
$$ y = [716568, 265294, 616587, 409727, 555093, 879567, 642158, 565080, 414772, 429863, 511552, 769745, 597908, 597830, 517778, 389897, 703100, 594823, 516068, 527397, 293025, 423723, 440220, 665639, 351785, 488388, 418563, 855984, 782163, 923736, 879138, 246414, 637327, 548160, 518001, 652313, 469279, 319717, 785246, 749714, 700771, 609039, 649682, 519983, 403894, 382397, 437054, 503637, 799977, 615727, 626318, 674217, 699630, 649395, 460496, 852163, 507645, 495852, 807807, 649609, 464628, 699097, 519462, 529637, 780068, 614813, 722964, 778100, 838035, 821120, 537880, 978023, 573573, 666151, 653915, 866069, 662777, 865969, 658412, 452083, 774403, 769331, 609821, 838852, 950611]
17037I50611l43133M6670n9692J90745j56251m1441L89736m43201k2649M30032
17027I41427D06639L50449L71105k43418O3600l85854N8877K59340K42561m33453
17017F89846K13412K89881l07844M7500j41188R5314J60435k02965n1887l2578
17007G59926M07318j19404K20617K0118l86793k6425K92668k76856o3567K82899
16997A110501l63621N30518p0237n01912K81097q052j76510K84128M1304j85075
16987I42141L07341l27928L03112k41659j0436O7840k2081J54606r9060J5647
16977A089523k42126j71656N55006l11460L48737j30246j52554L98420k49435
16968A134209J01230k75363K83385J42594l24886L30303N032K34839m83459J16646
$$ y = [950611, 607478, 654148, 594456, 785201, 628950, 587509, 977245, 534044, 511395, 941427, 406639, 757088, 1128193, 884775, 948375, 562521, 621398, 880738, 1123299, 689846, 903258, 1193139, 885295, 932795, 791607, 886921, 1047356, 844391, 792504, 759926, 1167244, 1047840, 1268457, 1288575, 901782, 875357, 1168025, 891169, 827602, 1110501, 746880, 1277398, 1207161, 705249, 986346, 978294, 801784, 1085912, 1127216, 942141, 1249482, 921554, 1224666, 983007, 972571, 1040411, 1018330, 1172936, 1073876, 1089523, 847397, 675741, 1230747, 919287, 1268024, 1137778, 985224, 1383644, 1134209, 1235439, 960076, 1243461, 1386055, 1061169, 1391472, 1396504, 1631343, 1147884, 1264530]
16958A264530j66109J85761J38443q0160m37013O68180j55894k38998R8943K72065
16948A549748l08008J46327K04661l42218N8540M49352l28267L36505j87895J8711
16938A597456K86539k51044k81232K41798Q8960j09930J2955K04235q7285j7567
16928A684885l98739M34090J81909k75479k094j1322j98754M12334K05641j21541
16918A910930k41253K91861k89259L18985j87248K614k45353M24238P2467k38733
16908A819249K04790j5502j25173M8725L08539l57112K70653J80934N89j38111
16898B197581j61231J55645o3733J92226n3296K00621p7300N3586J03270j00742
16888B446627j63412K03418J6822R7650r7682L912k30237N31066J7603Q5531J9365
$$ y = [1264530, 1098421, 1284182, 1422625, 1342465, 905452, 1573632, 1417738, 1178740, 1277683, 1549748, 1241740, 1388067, 1592728, 1250510, 1309050, 1758402, 1430135, 1766640, 1578745, 1597456, 1883995, 1632951, 1351719, 1593517, 1682477, 1572547, 1585502, 1789737, 1702452, 1684885, 1286146, 1720236, 1902145, 1626666, 1624572, 1613250, 1414496, 1826830, 2032471, 1910930, 1669677, 1961538, 1672279, 1991264, 1804016, 1806630, 1561277, 1985515, 2057982, 1819249, 2024039, 2008537, 1883364, 1932089, 2240628, 1883516, 2154169, 2335103, 2335692, 2197581, 2036350, 2191995, 2128262, 2320488, 2267192, 2467813, 2390513, 2444099, 2547369, 2446627, 2283215, 2486633, 2503455, 2601105, 2503423, 2507335, 2277098, 2808164, 2825767, 2911298, 2930663]
16877B930663j49941k40704O23123l58037Q1069O3382J4880J53971k97827J72904
16867B993483k2923J04577L19259j47643J27235j21530P0631K74702j12421k0159
16857C465211M4238j21521L23955k43685J97865J18658J28J7044K2810N0717M39508
16846D314928M1764p6422o2355p6521P0032K39298p6581K25606K47182k79075
16836D567856J05532K47142j31182j57K12438j21347M73097l07565L02347J57581
16826E505742J37689j1622J60465K02147j82288K38517K62606M2619k11352M25506
16816F570029K30449j7477J02649P0653N0993J95630J26883M43333r1274N7231
16806G739099n6788K05056J07677J76413L90507J72917K53824J4825J14684j33920
$$ y = [2930663, 2780722, 2540018, 3163141, 2805104, 2886173, 2949555, 2964435, 3118406, 2820579, 2993483, 2970560, 3075137, 3394396, 3246753, 3373988, 3252458, 3323089, 3597791, 3485370, 3465211, 3509449, 3387928, 3711883, 3468198, 3666063, 3784721, 3784849, 3801893, 3824703, 3875420, 4314928, 4356692, 4280270, 4217915, 4141394, 4211426, 4450724, 4374143, 4599749, 4846931, 4567856, 4673388, 4920530, 4789348, 4789191, 5001629, 4880282, 5353379, 5045814, 5348161, 5505742, 5643431, 5631809, 5792274, 5994421, 5812133, 6050650, 6313256, 6355875, 6144523, 6570029, 6800478, 6783001, 6885650, 6956303, 7007296, 7202926, 7329809, 7773142, 7681868, 7739099, 7682311, 7887367, 7995044, 8171457, 8561964, 8734881, 8988705, 9003530, 9118214, 8984294]
16796H984294N43095J16077L23952J51835o6880M90073K53663L23341J10813Q7610
16786A1317873M19655N9623N60946J99080K38773N31869L25617N30601K49744
16777A4433781K06531M90350K12634Q89992K4240L43275O20497N67120N01236
16768A8289656N65725L42352M19567N94830N79516Q07211L89053R36800Q18475
16759B3743185L75757J242676M77682J384935M97047R72215Q82980J171280J055840
16750C1803597R92119J165076J367581J777335R44352J239365J902555J402971
16742D2594951J703206J542582J980529K394651J477542K125762K619531K188403
16734E8627157K648762K158315L060984L042807K846586K869467L213868L369538
$$ y = [8984294, 9527389, 9643466, 9967418, 10119253, 10052373, 10542446, 10796109, 11119450, 11230263, 11317873, 11737528, 11797151, 12358097, 12557177, 12795950, 13327819, 13653436, 14184037, 14433781, 14640312, 15130662, 15343296, 16233288, 16257528, 16600803, 17221300, 17788420, 18289656, 18855381, 19197733, 19617300, 20212130, 20791646, 21598857, 21987910, 22924710, 23743185, 24118942, 25361618, 25839300, 27224235, 27721282, 28693497, 29576477, 30747757, 31803597, 32795716, 33960792, 35328373, 37105708, 38050060, 39289425, 41191980, 42594951, 44298157, 45840739, 47821268, 50215919, 51693461, 53819223, 56438754, 58627157, 61275919, 63434234, 66495218, 69538025, 72384611, 75254078, 78467946, 81837484]
16726H1837484L128832L732998L201990L896179L186253M109154L520976M166218
16718A10780084L404338L663685L593090L465959K837880K904016K448584K506951
16710A35604587J576954J414347J157649R88249k49782l01902o83331r38997j872639
16701A36695135j771414k662207k909536k867258k928186l084674m013074l451856
16693A13006930l895621l941594l525687l717591l576411l837428l557226l388353
16685H3567019l329552l200084l210187k969126l075266k918775k351561k671731
16677E9840737k621132k298254k225524k125391k049358k013728j729827j888155
16669D2889368j410825j566255j474023j460957j255265j680868j010853j623365
$$ y = [81837484, 84966316, 88699314, 91901304, 95797483, 98983736, 103092890, 106613866, 110780084, 114184422, 117848107, 121441197, 124907156, 127745036, 130649052, 133097636, 135604587, 137181541, 138595888, 139753537, 140741786, 140492004, 140190102, 139506771, 138567774, 136695135, 134923721, 132261514, 129351978, 126484720, 123556534, 120471860, 116458786, 113006930, 109111309, 105169715, 101644028, 97926437, 94350026, 90512598, 86955372, 83567019, 80237467, 77037383, 73827196, 70858070, 67782804, 64864029, 62512468, 59840737, 57219605, 54921351, 52695827, 50570436, 48521078, 46507350, 44777523, 42889368, 41478543, 39912288, 38438265, 36977308, 35722043, 34041175, 33030322, 31406957]
16661C1406957q63000j091756r56326r09449p61866j058515p17822q76558p24003
16652B3447662p99202n06662j050304m78552o34424p47683l63882p12643j82117
16643A7972193p15817m69707l38720k98107p73075m31668m58656m99889k05426
16634A3781128k79760l92175j91247j54555p23047j6713l90974l11835j38548
16625A1182274k78219l98927j52449k5594m04013J66053n55390j47204k93522
16616I093009L055n3068m65804l53904j987L08579p30679j29392l87670n3129
16606G229010N8986k16222o8324l151m43295Q900j59469P2241j90928J29585j02114
16595F315219l23798r3276l9284l182l48137K04556k77636J04912j33898l68215
$$ y = [31406957, 30543957, 29452201, 28495875, 27586426, 26824560, 25766045, 25048223, 24171665, 23447662, 22648460, 22141798, 21091494, 20612942, 19978518, 19230835, 18866953, 18154310, 17972193, 17256376, 16786669, 16447949, 16149842, 15376767, 14945099, 14486443, 13986554, 13781128, 13501368, 13109193, 12917946, 12763391, 12040344, 12023631, 11632657, 11320822, 11182274, 10904055, 10505128, 10352679, 10327085, 9923072, 10089125, 9533735, 9386531, 9093009, 9096064, 9042996, 8577192, 8223288, 8221301, 8529880, 7799201, 7669809, 7282139, 7229010, 7287996, 7071774, 7003450, 7000299, 6557004, 6565904, 6406435, 6478676, 6287748, 6417333, 6315219, 5991421, 5898145, 5858861, 5855679, 5507542, 5712098, 5434462, 5539374, 5405476, 5037261]
16585E037261K6957k62961K78643l19986m5398j5805k53860L12389m81178N7782
16575D333844k28448L6448j6414Q4086k77967j34352J61942j91427K25174n53754
16565C439132L64135l12009j0831L34305k35186k65948L04941k90234k4842J82233
16555C485696j45144k04113J12625J06050k39051p1713J33941M0077l40580N26853
16545C404641o70351Q0036j25795l583k87334L88898l4639k07389Q9526j4021
16535B619989m06204J69902L3022K37499j21722m41824N18278l113l25188J07312
16525B387951j2539j94590K25706m41022j6636J04461K14653k05399K353K27429
16515B292367r1182r2378K2611j17895j02262L54973p22673M42155j35986J05433
$$ y = [5037261, 5064218, 4801257, 5079900, 4759914, 4714516, 4698711, 4444851, 4757240, 4276062, 4333844, 4105396, 4141844, 4125430, 4209516, 3931549, 3797197, 3959139, 3767712, 3992886, 3439132, 3803267, 3491258, 3480427, 3814732, 3579546, 3313598, 3618539, 3328305, 3303463, 3485696, 3340552, 3136439, 3249064, 3355114, 3116063, 3044350, 3178291, 3218368, 2877788, 3404641, 2734290, 2814326, 2688531, 2684948, 2397614, 2786512, 2751873, 2544484, 2634010, 2619989, 2213785, 2383687, 2416709, 2654208, 2532486, 2090662, 2608940, 2605827, 2280639, 2387951, 2375412, 2180822, 2406528, 1965506, 1948870, 2053331, 2267984, 2062585, 2064938, 2292367, 2201185, 2108807, 2131418, 2013523, 1911261, 2266234, 1543561, 1985716, 1849730, 1955163]
16505A955163M6209q7170l3007m5001P1837j29702j61087J35196J23123q0413
16495A795148k8292J88467m35528K63725r0189J34016m6525m0796k55715Q9818
16485A574129l66713K32572j66351N07479j6707p4706q121m07282K38508K64632
16475A777440o19062L59625j52953k46749Q8198L54999l46919K56372K7500l553
16465A494898o7716M601j648j73457L3912J07863r9039k50633K75145j7244J40044
16454A446726k30042J21142k39602J92098j26377n1813k04950J34438o4854O82336
16444A659102m70281j08038K49102n53379M5656M87602k84107l62041N98817k67515
16434I94918Q0662k4150l142j1738l1616J98626j98785n0036J82232J21547j54252
$$ y = [1955163, 2001372, 1914202, 1881195, 1836194, 1908031, 1778329, 1617242, 1752438, 1875561, 1795148, 1766856, 1955323, 1519795, 1783520, 1693331, 1827347, 1780822, 1740026, 1484311, 1574129, 1207416, 1439988, 1273637, 1781116, 1764409, 1689703, 1681582, 1274300, 1512808, 1777440, 1158378, 1518003, 1365050, 1118301, 1206499, 1561498, 1214579, 1470951, 1498451, 1494898, 1427182, 1431783, 1430135, 1256678, 1290590, 1398453, 1299414, 1048781, 1323926, 1306682, 1446726, 1216684, 1337826, 1098224, 1290322, 1163945, 1112132, 907182, 1041620, 976766, 1659102, 1188821, 1080783, 1329885, 776506, 822162, 1309764, 1025657, 663616, 1262433, 994918, 1075580, 1051430, 1048288, 1036550, 1004934, 1203560, 1004775, 954739, 1136971, 1258518, 1104266]
16423A104266j0276J9531m84920K72117J29065j17190q9403L14345l2010J50256
16413A255781l37307J68463p2037r125J25002l49039j31061L80791j76383L5995
16403H91080J1623N437J20268k83479P7828O20350o23688K13280J5584k19511
16393H28772J1159j65399J05370J11938k6070j46570J49905M7854k00925J69695
16383H85729q2285M772k82658j99815N06256Q9774j25697J5875K81332l66604
16373G26679j4052o8954J57844l36859L03550j6334N8780j90727m350m3141j72096
16362D00340J87575r2491O9151J89776J62722q9966j01843j35791J57446j42391
16352F04528m4200l2045K55984l23959O38431m57018j37877J11465J4689L50249
$$ y = [1104266, 1093990, 1113521, 628601, 900718, 1029783, 912593, 823190, 1137535, 1105525, 1255781, 918474, 1086937, 1014900, 1005775, 1130777, 781738, 650677, 1031468, 855085, 891080, 902703, 908140, 1028408, 744929, 822757, 1443107, 819419, 1032699, 1048283, 828772, 839931, 674532, 779902, 891840, 865770, 719200, 869105, 916959, 716034, 885729, 803444, 808216, 525558, 325743, 831999, 921773, 796076, 811951, 1093283, 726679, 712627, 643673, 801517, 464658, 768208, 751874, 810654, 619927, 615577, 572436, 400340, 587915, 495424, 564575, 754351, 917073, 827107, 725264, 589473, 746919, 604528, 560328, 528283, 784267, 460308, 1098739, 641721, 503844, 615309, 629998, 980247]
16342I80247D43225M35465k21845B23784L94103r9282j00468m534j55606L53985
16332F11982j1909K69696j23591k94575L00041k79906L4124N8180J31514j78559
16322E16997K5528O7015K029J58004A59663K74339J30783B38993J58064R4237
16312D91294J08188J46789j08540A92969L82790j23781L89344D13949j19415R3242
16302C87776O9747j25472J13533k0689R3749M5345N9195p1022N1907J95771C93430
16290C03598j04330M22578B93217Q9082M5662K9043A87342K80973k28884K25548
16280D64979n0084A20733L48016j35173A52318K32793J9061J72195J9906J17365
16270G13638r2150k12414m7173K17j08401r3284J48043L06288B63146A11655P2159
$$ y = [980247, 443225, 878690, 656845, 223784, 617887, 518605, 418137, 413603, 257997, 611982, 600073, 869769, 746178, 451603, 751644, 471738, 505862, 564042, 695556, 516997, 542525, 609540, 611569, 769573, 159663, 434002, 564785, 238993, 397057, 491294, 599482, 746271, 637731, 192969, 575759, 451978, 841322, 413949, 294534, 387776, 457523, 332051, 445584, 424895, 518644, 563989, 623184, 552162, 604069, 799840, 393430, 303598, 199268, 621846, 293217, 382299, 427961, 457004, 187342, 468315, 239431, 464979, 414895, 120733, 468749, 333576, 152318, 385111, 404172, 576367, 596273, 713638, 621488, 409074, 361901, 362118, 253717, 160433, 308476, 614764, 263146, 111655, 183814]
16259A83814J76182E2631N90685k31942A64807L14901j8317L30515A67592M4401
16249B11993L22192k38568R8483J25220B52942M8006L4500J73679k45005p1970
16239A92152N39757A52167J42018j2846K61918k30303L4863F1690M03478K83176
16229G48344C00563J48447A80748L8853K02685K28199B93682N4601j1491J47495
16219D84287N6625j98883J69673A05794L02332l2466A83681E4867K74686j34774
16209A94779p4301J52678Q4812h9663b012B25901O3789I3593J67839F2745O90179
16198G52924B25108o45J27331o951A33521K80465A97074K1636N9091l6978B60
16186B34961O6594o1788m500P4234G3429K40251D7879c9870D20931h0163A83006
$$ y = [183814, 359996, 52631, 643316, 411374, 164807, 479708, 461391, 791906, 167592, 211993, 534185, 295617, 394100, 519320, 252942, 300948, 335448, 509127, 264122, 192152, 731909, 152167, 294185, 281339, 543257, 312954, 347817, 61690, 465168, 748344, 300563, 449010, 180748, 219601, 422286, 650485, 293682, 348283, 336792, 484287, 540912, 342029, 511702, 105794, 408126, 375660, 183681, 54867, 329553, 194779, 120478, 273156, 357968, -89663, -2012, 225901, 289690, 93593, 261432, 62745, 752924, 225108, 224463, 351794, 344843, 133521, 413986, 197074, 218710, 277801, 240823, 260, 234961, 301555, 239767, 235267, 309501, 73429, 313680, 47879, -39870, 420931, -80163, 183006]
16174A62438J78889n971j62377C7292K14789L30647A10388J42406L2550o6128
16164B19216K8167q8466Q2081O0918r4366Q370f1194B0953a04310d7701J8245
16153b9456B45192J27509A66973J37413J77091p5580a06652B11527N9788n134
16143B66181A13644l8965J51017K03344g6012B46310D6793K24019M373J39394
16133D14579o3270j63768Q5836k7596I9979j2259N49476A75139B0887K50265b03690
16121A59655e1832D10607j49446G3434R2108a3806B08895K29686J32987B22584
16110A26379O3139L1227b2834B26356b25659C88272E1803k676J65717C491M55232
16099D58723g1011A99508G2900c9289D74269A51567a17974L1189A77808G4531
$$ y = [162438, 341327, 335356, 172979, 37292, 252081, 582728, 110388, 252794, 285344, 219216, 247383, 158917, 240998, 301916, 207550, 215920, -61194, 20953, -104310, -47701, -29456, 245192, 372701, 166973, 304386, 481477, 405897, -106652, 211527, 271315, 266181, 113644, 74679, 225696, 429040, -76012, 246310, 46793, 270812, 275185, 414579, 351309, 187541, 273377, 245781, 99979, 87720, 637196, 175139, 20887, 271152, -203690, 159655, -51832, 410607, 261161, 73434, 165542, -13806, 208895, 438581, 571568, 222584, 126379, 189518, 220745, -22834, 226356, -225659, 388272, 51803, 49127, 214844, 3491, 458723, -71011, 199508, 72900, -39289, 474269, 151567, -117974, -86785, 177808, 74531]
16088B06526M3597g8377A45505N1360p6156A1510J59890j4890a30401j1575O5507
16077g6469B15646a85858A23718h8397l6929A50887J7106F3323b6677o4479K2114
16066f9042D1101K32734a34677D2717b49650G3946g090l09404a17917B98168C6254
16054B02788C0881K8755N4922O2320J30817h6196A17566R3819b80128A00890b7896
16042h4298p2517A36221d7073A92781c26085B80405c1963o9765K3406D8608c20287
16030B74611H7474O3877B9296O1427C0077c3413B56428I2502J44080d6823B05862
16018b90466A36131j5931J72047j20235b86969A48313D2538R3971n4701g4423
16007H1510P2603A3543b30388g2696K9790l7427A42621a6497A62033e6526j25487
$$ y = [206526, 250123, -78377, 145505, 196865, 120709, 11510, 171400, 156510, -130401, -141976, -76469, 215646, -185858, 123718, -88397, -125326, 150887, 167993, 63323, -26677, -91156, -69042, 41101, 273835, -134677, 42717, -249650, 73946, -7090, -316494, -117917, 298168, 36254, 202788, 30881, 59636, 114558, 176878, 307695, -86196, 117566, 211385, -280128, 100890, -27896, -84298, -156815, 136221, -47073, 192781, -326085, 280405, -31963, -101728, -78322, 48608, -320287, 274611, 87474, 151351, 29296, 90723, 30077, -33413, 256428, 92502, 236582, -46823, 205862, -290466, 136131, 120200, 292247, 172012, -286969, 148313, 42538, 136509, 81808, -74423, 81510, 154113, 13543, -230388, -72696, -42906, -80333, 142621, -16497, 162033, -56526, -182013]
15996a82013K6866C06323g6790d336C02062O8715b90035B9854a3556C4716J95366
15985B30082C3252a23005B82471e24D14561a70170c2304k66584C78395k8620j11928
15974B37847m4044J79224m2569M14540K05098p039j54047k75153J51046k23241
15964D41662j2295j44328f1662B1665N0828L00771b78989F5150b75290I8080O5986
15953A64066a64855A30534a85569B62218a98062E3910b7608j06149A2262R0392
15943A02654N3142n425k3556L4965b3356j73202I3698g319B45530n2493O8151
15932B61188J43181i2129a5087j10511I2300b84044A6936a55267j67066H7619
15921f8655H179c18844J10532A01669d989q6241c135j94346i0353F7495a91132
$$ y = [-182013, -155147, 306323, -76790, -4336, 302062, 370777, -290035, 29854, -13556, 34716, 230082, 33252, -123005, 282471, -524, 414561, -170170, -32304, -298888, 378395, 349775, 237847, 193803, 373027, 330458, 744998, 950096, 943057, 789010, 513857, 664903, 441662, 429367, 285039, -61662, 21665, 72493, 373264, -278989, 65150, -275290, 98080, 164066, -164855, 130534, -185569, 262218, -198062, 53910, -27608, -133757, 12262, 102654, 155796, 150371, 126815, 161780, -23356, -196558, 93698, -7319, 245530, 193037, 261188, 404369, -92129, -15087, -125598, 92300, -284044, 16936, -155267, -322333, 87619, -68655, 8179, -318844, -208312, 101669, -4989, -91230, -3135, -197481, -90353, 67495, -191132]
15909B26364J6045c037q6400D298b09265j77924C2517c1387k5195B88695A15536
15897D5148J19276a87869k23898c5558D53795E2867J355a04324d6745B98004c93709
15885D0522j8933Q6403e216G219d4888a2316p9690K0743K8198a4238C4805a3021
15872a28698A38391a16530A12072K42857b18302g9553j04772B27443a15083j05616
15862b20699B42254a74602K8634B29093I0430c5775j05635A3260M2909K7904a3421
15850b93746q453C9430a36536d3214A82920G400M1667N3677h403j58519j40594
15839c07516a18603k15860A30532b11267A772a47185l3810B24072m1295c546j40137
15828a43683A15140a33436c1613A82330A0904K13032c60234D74499B529J92009
$$ y = [226364, 242409, -3037, -89437, 4298, -209265, -387189, 32517, -31387, -56582, 288695, 115536, 45148, 164424, -187869, -411767, -35558, 453795, 52867, 54222, -104324, -46745, 298004, -393709, 40522, 21589, 107992, -5216, 7219, -44888, -12316, -92006, -71263, -43065, -14238, 34805, -13021, -128698, 138391, -116530, 112072, 354929, -218302, -79553, -184325, 227443, -115083, -220699, 242254, -174602, -145968, 229093, 90430, -35775, -141410, 13260, 56169, 84073, -13421, -293746, -302199, 39430, -136536, -43214, 182920, 7400, 49067, 102744, -8403, -166922, -307516, -118603, -334463, 130532, -211267, 1772, -147185, -180995, 224072, 182777, -3546, -143683, 115140, -133436, -31613, 182330, 10904, 223936, -360234, 474499, 2529, 194538]
15818A94538k5205R9037A4864i1424k34612a50092a1131n29403b43090A418d5021
15806G7028a43268A58646C6878i444p6981L5694F6246a36347r6107P3276k88613
15795d47791a20793A05752a74477Q2719B6009h7892l1159A41017k6111f9981j211
15784g1192A09731B9959J60074O2420r6828l0473E3942i3719k55273i8964p1376
15773a70340b6125A21385R863J9963a3762j47755B5760K1708a12323A61444K4418
15762A85862d46372i9698f864q9303q8060A601J41629j0374b28991N7277O3563
15751a08151A38798b07772G1399l2657g9459a9841D6458N6598D6375J44104n1892
15740A38587R2271g4026L0916H1880l7701j4626c5353l3652A33573K15258A43175
$$ y = [194538, 169333, 268370, 14864, -91424, -326036, -150092, -11131, -540534, -243090, 1418, -45021, 77028, -143268, 158646, 36878, -9444, -86425, -50731, 66246, -136347, -232454, -159178, -447791, -120793, 105752, -174477, -91758, 26009, -87892, -119051, 141017, 114906, -69981, -71192, 109731, 29959, 190033, 252453, 155625, 125152, 53942, -93719, -348992, -98964, -170340, -26125, 121385, 131248, 151211, -13762, -161517, 25760, 47468, -112323, 161444, 185862, -446372, -99698, -6864, -96167, -184227, 1601, 143230, 132856, -228991, -171714, -108151, 138798, -207772, 71399, 38742, -79459, -19841, 46458, 103056, 46375, 190479, 138587, 230858, -74026, -43110, 81880, 44179, 29553, -35353, -69005, 133573, 348831, 143175]
15728a3203A97051a8361m68947A28566C601a42397f1110o6890A02643q30a82670
15716a22009a8161k76424D08155a53310A33697k2237Q795e3604A30391c42994
15705A971L17086f3734j28243D6766J0215b97128B57866a41294A48452F9437L2138
15694A01575a07256K9404m8848o2257r2048A36798n4578a1949E8945L9373a81079
15682g1785j6056o9410A74784D6074J23233b4317H7209a61352M6000j17043B91756
15670A85345a66193j70734A68265a72209A75806b25868p5747J07604n1523k7114
15660b72648l5790d3584B5587O7091a33831d005B19879L2020a51916K9029H9448
15648h5306j50124B0445d7208I466J90999H9111a06451p8663P7246J5422j41048
$$ y = [-13203, 197051, -18361, -487308, 128566, 3601, -142397, -61110, -128000, 102643, 101813, -182670, -122009, -18161, -294585, 408155, -153310, 133697, 111460, 120255, -53604, 130391, -342994, 1971, 319057, -63734, -191977, 46766, 56981, -297128, 257866, -141294, 148452, 69437, 101575, -107256, -77852, -126700, -188957, -281005, 136798, 82220, -11949, 58945, 98318, -181079, -71785, -87841, -157251, 174784, 46074, 169307, -24317, 87209, -161352, -115352, -232395, 291756, 185345, -166193, -336927, 168265, -172209, 175806, -225868, -301615, -194011, -245534, -272648, -308438, -43584, 25587, 92678, -133831, -4005, 219879, 251899, -151916, -122887, 89448, -85306, -235430, 20445, -47208, 9466, 200465, 89111, -106451, -185114, -107868, -92446, -233494]
15637b33494K2905B77019d20636c5214A79836c30434J62232e1494k0737C52755
15626a24981B379b6001j47772j5202E4004K7490i9066j02217f6763k55700D9984
15614A02999b00244A51278b7146o6217k3299c4402A32950k8478P9534b7104G206
15602e8675B7972a63006j73117B36037M0930a33586A46493E3276i3295a5622j82066
15591a97688B08229A00965q29J72111l2685l3974J71899a06193A52224i4622j1951
15580a06573p0127A84617e3614G7662l2138j7138J09917a22196f735j83973L2868
15569a57840A09941J3273b10878k2753a16175A39168a43135e798k695j05453G3205
15557a4759l15638c0889r330A81254b3017B17419E5403R5965c67396C970a77878
$$ y = [-233494, -210589, 277019, -420636, -35214, 179836, -330434, -168202, -51494, -72231, 352755, -124981, 2379, -26001, -173773, -188975, 54004, 81494, -99066, -201283, -66763, -322463, 49984, 102999, -200244, 151278, -27146, -93363, -116662, -34402, 132950, 104472, 184006, -27104, 7206, -58675, 27972, -163006, -336123, 236037, 276967, -133586, 146493, 53276, -93295, -15622, -197688, 208229, 100965, 100136, 272247, 239562, 205588, 377487, -106193, 152224, -94622, -106573, -176700, 184617, -53614, 77662, 45524, 28386, 138303, -122196, -6735, -190708, -157840, 109941, 123214, -210878, -233631, -116175, 139168, -143135, -5798, -8493, -113946, 73205, -14759, -330397, -30889, -40219, 181254, -23017, 217419, 55403, 151368, -367396, 3970, -177878]
15545E1346a3987C0139a05062C5050L9824i369k7491j22841n6488b7910A06129
15533a2444D4629K78992c2298H0630k3646i8681n5486c909j26560L8496C00578
15521G3660a47193B11864A3776a92145B37204b4718j42467b4066k6708E3199J78268
15510B31467l5004J55981b90293h1768k02614a02502m564k45796e9602A76388
15499C42484r9830H4759c98379C46954A21530J20172I1635o38d2495D04817A81211
15487A1724J41100E6099g392F1322K21144M065A30060a26242D89939G7097d9468
15475B0065K42017R68O1425K1958l4132a8492A74436g3970E6017g484A234a8809
15462h7903A07740a15508k1701B65320J96683m8358J08133k38815p2454b69699
$$ y = [51346, -13987, 30139, -105062, 35050, 74874, -9369, -36860, -159701, -216189, -27910, 106129, -12444, 44629, 323621, -32298, 80630, 56984, -98681, -154167, -3909, -130469, -91973, 300578, 73660, -147193, 211864, 13776, -192145, 237204, -24718, -167185, -24066, -50774, 53199, 231467, 196463, 352444, -290293, -81768, -284382, -102502, -107066, -352862, -59602, 176388, 342484, 242654, 84759, -398379, 346954, 121530, 241702, 91635, 90997, -42495, 404817, 181211, 11724, 152824, 56099, -7392, 61322, 282466, 286531, 130060, -126242, 489939, 77097, -49468, 20065, 262082, 263050, 324475, 346433, 312301, -18492, 174436, -73970, 56017, -7484, 1234, -18809, -87903, 107740, -115508, -137209, 265320, 462003, 413645, 521778, 282963, 210509, -269699]
15451H3870I510R7499L6921h3037l2882A40446B6477A1859P1034a14458I6879
15439a71396A09771m8095N5330M2797p3294e0717G7368b0672B55393e9945A85253
15427G09089C04411K51523N1414N08376j96323C62705I4293P9263l224i6996A75125
15415D14858j65373c22790f8336A77692A0897K44676g8010B11730N6026A7286
15404A35291B4156a12023j51680A52867n9531O7755c8959m4829B53708e7613b4217
15392f5204A06625a15420A69781f0267j42916A11824b75423L3202j8430a29539
15381A40815P9465g5390A1505a07568d925C15959A10363E649J7938J52727R780
15370A86094o2740b46078J03919A3319e8662B39303q0085a11932A16386a38775
$$ y = [83870, 9510, 107009, 143930, -83037, -115919, 140446, 26477, 11859, 82893, -114458, 96879, -171396, 109771, 61676, 117006, 159803, 86509, -50717, 77368, -20672, 255393, -59945, 185253, 709089, 304411, 555934, 607348, 1115724, 919401, 362705, 94293, 173556, 170332, -96996, 175125, 414858, 249485, -322790, -68336, 177692, 10897, 255573, -78010, 211730, 267756, 17286, 135291, 24156, -112023, -263703, 152867, 93336, 161091, -38959, -83788, 253708, -57613, -24217, -65204, 106625, -115420, 169781, -60267, -203183, 111824, -275423, -242221, -260651, -129539, 140815, 220280, -75390, 11505, -107568, -4925, 315959, 110363, 5649, 23587, 176314, 186094, 123354, -246078, -142159, 13319, -58662, 239303, 159218, -111932, 116386, -138775]
15359c7752B12487k1769a11283B26340b55576I3016a36187k563K447f1837A66317
15347B17244o3092R9221l0702J50495j00136J58470k15046I5305J34541q4696
15337A45150a30546D14995E7061a6693G6566Q3158a45858A54546M1552A0101J63499
15326A73600K15697j39025Q7994N6913G0907J30368I7620b82496b1857B0978M08771
15315D29749a37681B07614R4503D9598M3701K85084A72803A2514J43789b9369
15304A68407e1151A67412a20284P471B2525c11431A34858b00603C7510d8234J8220
15293c0014q340A17192C1069L45484A15535b1824C1532g1573D28506f7079C02455
15281A0139Q5138m5140J83695e5597A07878A2543P7462c1796q3331j83036A75419
$$ y = [-37752, 212487, 190718, -111283, 226340, -255576, 93016, -136187, -138750, -136303, -61837, 166317, 217244, 154152, 253373, 222671, 373166, 273030, 431500, 216454, 95305, 229846, 145150, -130546, 414995, 57061, -16693, 76566, 159724, -145858, 154546, 196098, 10101, 173600, 389297, 250272, 338266, 395179, 70907, 201275, 97620, -282496, -21857, 20978, 429749, -137681, 207614, 302117, 49598, 93299, 378383, 172803, 12514, 156303, -29369, 168407, -51151, 167412, -120284, -112813, 22525, -311431, 134858, -200603, 37510, -48234, -30014, -38354, 117192, 31069, 376553, 115535, -21824, 31532, -71573, 428506, -67079, 302455, 10139, 95277, 50137, 233832, -55597, 107878, 12543, 90005, -31796, -115127, -298163, 175419]
15269B74840p2795L35784A74424a40907A44325A3509J69607d0968A56568b15305
15258A1125b9159D22451c298A39772b18417h7547K3013B48636E3837e947A29301
15246A45207P0431b65006A32772a65700B15371a16031n6174A85074l7139i0386
15235C02408k6672H4746j0878J00964J38188M17319K86264O37369n1855o622m83494
15224A112001m34383C03223j16925J85645A17442L38243I4898A9346a3253B40911
15213A19692J74418g7454K4296d128A84484h1129A33193E0125R8951K52979n1920
15202C50135A70454N2348I5357h2824o0894A59231h1325b9326m8359E8490M84
15191E8974L8522j8666a11052B07313A5268R2675l1202J66586H9820i9j6395q0492
$$ y = [274840, 202045, 537829, 174424, -140907, 144325, 13509, 183116, -40968, 156568, -215305, 11125, -29159, 422451, -3298, 139772, -218417, -87547, -64534, 248636, 53837, -5947, 129301, 145207, 215638, -265006, 132772, -165700, 215371, -116031, -172205, 185074, 147935, -90386, 302408, 275736, 84746, 73868, 174832, 313020, 730339, 1016603, 1653972, 1602117, 1595495, 1112001, 677618, 303223, 186298, 371943, 117442, 455685, 94898, 19346, -13253, 240911, 119692, 294110, -77454, -53158, -4128, 184484, -81129, 133193, 50125, 149076, 402055, 350135, 170454, 222802, 95357, -82824, -143718, 159231, -81325, -29326, -77685, 58490, 58974, 97496, 78830, -111052, 207313, 15268, 107943, 76741, 243327, 89820, -99, -16494, -96986]
15179i6986E6309e3085n6153C29214d4175j79902O0022E0891k3949d5426D20162
15167C79214A45966g7401B20129d6241A66598A5967J89082E3923O558b3194B38901
15155g859q7303B43695K41129b4740B858L674N8496J97169g0337D86424D1277
15143E5825K20246a92910B48875p7790l6737b83729B13074d5478h448m0768j38461
15132a87677J8309F33761j64963j04307L212A34675a80374r8462i1262k1787C09217
15120A99942m2535K18660j79418J58767q1003j2360J50180H4761a02762F6678
15109B77818a6081C8009J22204i6348B49612J26315j84438J81067j15083K19250
15099D76723A52499a84732C29786l9336b95271A24448E642M2078N6154d7502B92108
$$ y = [-96986, 56309, -53085, -109238, 329214, -44175, -224077, -164055, 50891, 26942, -45426, 420162, 379214, 145966, -77401, 220129, -46241, 166598, 15967, 205049, 53923, 60481, -23194, 238901, -7859, -95162, 243695, 484824, -24740, 2858, 6532, 65028, 262197, -70337, 486424, 41277, 55825, 276071, -192910, 248875, 171085, 134348, -283729, 213074, -45478, -8448, -49216, -187677, -169368, 633761, 468798, 364491, 367703, 134675, -180374, -278836, -91262, -113049, 309217, 199942, 157407, 376067, 196649, 355416, 274413, 262053, 412233, 84761, -102762, 66678, 277818, -16081, 38009, 160213, -96348, 249612, 375927, 191489, 372556, 257473, 476723, 152499, -184732, 329786, 290450, -295271, 124448, 5642, 47720, 103874, -47502, 292108]
15087A63228Q2955e6562B40676N9463j38739L07143B26660d723B67618j14396
15077A53222K23639A36820L30438B09928q25J37818F6040b10736A21539D2618
15066E73478B73221o4970a23256J3181A47597K6931K6781a72236E6896b75j07156
15055a07431C33958F4804J07410N4756L46036k39862k6343D3028K61530e4625
15044A99304d8049B08484j6137l5006M9431N1162J07190r7083F7431M1047j3564
15033I4914l2823A3876J70753K50010A89364L09108j39241A78015J24606j39262
15023A63359m7808j8575L08018I3597J54091N5679M1702P6224M0473o8902l5651
15012C57213J82889k06776J62134A88719O47930C43347K70536k16542J11660n7418
$$ y = [163228, 246183, -56562, 240676, 300139, 161400, 468543, 226660, -4723, 267618, 153222, 376861, 136820, 467258, 209928, 209103, 346921, 66040, -210736, 121539, 42618, 573478, 273221, 208251, -123256, -110075, 147597, 174528, 201309, -172236, 56896, -275, -107431, 333958, 64804, 172214, 226970, 573006, 333144, 306801, 43028, 304558, -54625, 199304, -48049, 208484, 192347, 157341, 206772, 257934, 365124, 268041, 67431, 108478, 94914, 62091, 13876, 184629, 434639, 189364, 498472, 359231, 178015, 302621, 163359, 115551, 96976, 404994, 93597, 247688, 303367, 345069, 421293, 461766, 392864, 357213, 540102, 333326, 495460, 188719, 836649, 343347, 613883, 397341, 509001, 451583]
15002D51583Q9349A86100J51751J04788P0346j04681A34364J64110L44L6523K29221
14991E64562a03443D57067r4227K14667B48074N8476o6654J35039J23641r2268
14981D06308J44505B5140M80570j79514J34130B04169K26489K73760A92243K71814
14971D64057N5482o8266l7454J19555K15231k99642N29345k14757J01655j15552
14961G49654k52062j48583P967K6259M51621l01544L45028j21160C06268r7780
14951B08488L57296a7647D15360D1674M45412A96790L9366a4553B74163J35566
14941D09729A57690L0589P7590O8397J86590A28800K55300L1218N1573L0547m491
14930D92947m702B32968J70072j86103K84698K6180j84363N8398L01902n6662
$$ y = [451583, 540932, 186100, 337851, 442639, 512985, 408304, 134364, 298474, 298818, 335341, 564562, -103443, 457067, 362840, 577507, 248074, 306550, 239896, 374935, 498576, 406308, 550813, 25140, 505710, 326196, 460326, 204169, 430658, 704418, 192243, 464057, 519539, 451273, 413819, 533374, 748605, 448963, 978308, 763551, 865206, 749654, 497592, 349009, 356976, 383235, 834856, 533312, 878340, 757180, 306268, 208488, 565784, -17647, 415360, 41674, 487086, 196790, 236156, -14553, 274163, 409729, 157690, 188279, 265869, 334266, 520856, 128800, 384100, 415318, 466891, 497438, 492947, 488245, 232968, 403040, 216937, 501635, 527815, 343452, 401850, 703752, 647090]
14920F47090M3091J04102C57309m8423K84765j21763M86575K86663J05725l70110
14910I80741M06349r4000J50232n8023M137j02488L4782J72824m9364M98760j83241
14899A760709k89589m4631j99076K02104k10514j1033k87011k38865k92131L40039
14889G30002k91105m7452L91740j86004j88107K60249j33022k30241J36544J59989
14879F02593I6719J95000N6712O7627l7189q5777M45242j99268M8127n0776L26078
14868H62495j94955J00090J52314k92123M5070L0842K93316j59257j5584j57407
14858F64801j56874A91634M48703o9763J20050B13922M35213J07043j91443J49488
14848G14223j0306P7920j13307k93880J38776j19816K26318j6906k32623R8651
$$ y = [647090, 690181, 794283, 357309, 308886, 593651, 471888, 958463, 1245126, 1350851, 980741, 1387090, 1293090, 1443322, 1385299, 1389436, 1286948, 1321730, 1494554, 1445190, 1943950, 1760709, 1471120, 1426489, 1227413, 1429517, 1219003, 1207970, 920959, 682094, 389963, 730002, 438897, 391445, 783185, 597181, 409074, 669323, 536301, 306060, 442604, 602593, 96719, 291719, 348431, 416058, 378869, 293092, 738334, 539066, 587193, 536417, 862495, 667540, 767630, 919944, 627821, 672891, 703733, 997049, 837792, 822208, 664801, 507927, 191634, 640337, 570574, 690624, 213922, 649135, 756178, 564735, 714223, 703917, 781837, 668530, 374650, 513426, 393610, 619928, 603022, 370399, 469050]
14838D69050k00247R9061L61297j13858j80789n3794q8661L2074K04442o9375
14828D59200Q0725M55568m26115L86630r8552L92884L9205l96754K22003n37644
14818E77150R0784R4030j57897p2376O78034r2915m33240k53538K68202k07405
14808D90829L405K33109j31643J93147N9330j94063q493L88919k68665k22819
14798E43056L85831p6380R937k48824j82204J82295j47991O37M68721l01576M15479
14787A048981k18220M7662C50641K99517k12973R7171J62931m1364l21602N26766
14777H61087j00724l19232K63372k66176P8072k24184K60441O2112O1510l5494
14767F40784j05156J96078j23086L32675k36206j9654m6678K66510j39398J87886
$$ y = [469050, 268803, 367864, 729161, 615303, 434514, 380720, 292059, 324133, 528575, 459200, 539925, 995493, 569378, 956008, 857456, 1250340, 1289545, 892791, 1114794, 577150, 667934, 761964, 604067, 531691, 1209725, 1116810, 683570, 430032, 698234, 490829, 494234, 727343, 595700, 788847, 848177, 654114, 645621, 1034540, 765875, 543056, 928887, 852507, 862444, 613620, 431416, 613711, 465720, 466357, 935078, 633502, 1048981, 830761, 878423, 350641, 650158, 437185, 534356, 697287, 655923, 334321, 861087, 760363, 441131, 704503, 438327, 516399, 292215, 552656, 614768, 676278, 640784, 535628, 731706, 608620, 941295, 705089, 685435, 638757, 905267, 765869, 953755]
14757I53755k848J4926m78959M58745p8695k70211M6542J58375l96299L32456
14747G37787L3284k98177L41357J27537q8049m08188K19225j51062K76589m6193
14737G44110R1856q6454J30270l4515j34494j69873K74859j01410M07022j25205
14727I96166l35028j66617M54431k28976J36222R7198m28244K95090l22288K28371
14717G26325n6483L9396K42194J13944J66902k39469n8394O22572J39887j36786
14707A560088k06892k5835j9285m22173M13089m22745n5748Q5255o8539j8406
14697H18809L66398N1379j19663k66563j7375K19760Q882k41374Q777J69373K2871
14686A021274M87177l84804R39846k42598k19761j83178j98522O0557k98026J47791
$$ y = [953755, 950907, 965833, 486874, 945619, 866924, 596713, 643255, 801630, 405331, 737787, 771071, 472894, 814251, 941788, 853739, 445551, 664776, 513714, 790303, 744110, 835966, 749512, 879782, 845267, 710773, 540900, 815759, 714349, 1121371, 996166, 661138, 494521, 948952, 719976, 856198, 953396, 525152, 820242, 497954, 726325, 669842, 709238, 951432, 1065376, 1232278, 992809, 934415, 1556987, 1696874, 1560088, 1353196, 1327361, 1308076, 885903, 1298992, 876247, 820499, 905754, 837215, 818809, 1185207, 1236586, 1116923, 850360, 832985, 1052745, 1061627, 820253, 829030, 998403, 1021274, 1508451, 1123647, 2063493, 1820895, 1601134, 1417956, 1219434, 1279991, 981965, 1129756]
14676A129756r2886k04368L94490k47817k21722J13795l92038M29209J88890J42257
14666A239566l82059J55443m06635L89113j50716J85370p4383L482J11596J34279
14656A205056k19856K71012l58839p6881K26063j56427Q3329Q1038K32619j36303
14646A150811k1838k97504p0928J28501k68O3625K51364j42498J88767q49j79994
14635A069189n4558P1505R3755P0433l17990N03531k01696J5083K43076l45737
14625A146591o4912L38133l9117l97072Q9369L34057k46939P4241k0498K66496
14615A480349j17472n19419M45060j21690j37857K28019K6301K86083j66848K65040
14605A667566l28580j12663n5650L99457j39853L68107j66385l12194M97397k63660
$$ y = [1129756, 1036870, 832502, 1226992, 979175, 757453, 871248, 479210, 908419, 1097309, 1239566, 857507, 1012950, 606315, 995428, 844712, 1030082, 955699, 959181, 1070777, 1205056, 985200, 1256212, 897373, 820492, 1046555, 890128, 973457, 1054495, 1287114, 1150811, 1128973, 831469, 760541, 889042, 888774, 952399, 1203763, 1061265, 1250032, 1249183, 1069189, 1014631, 1086136, 1179891, 1250324, 932334, 1435865, 1234169, 1249252, 1492328, 1146591, 1081679, 1419812, 1380695, 983623, 1072992, 1407049, 1160110, 1234351, 1213853, 1480349, 1362877, 843458, 1288518, 1166828, 1028971, 1256990, 1283291, 1569374, 1402526, 1667566, 1338986, 1226323, 1170673, 1570130, 1430277, 1798384, 1631999, 1319805, 1817202, 1553542]
14595A553542j9045J53049k82295k0509m2322K74920j73150k84153L00691J75549
14585A636277P938K052N820J46867L96760o13565J24402k06653M93070l84399
14575A608569K15121q8585l5622j9470j71926K78417J47704j88868J15415O6359
14565A927114j92722K17177L11296k28097m27410L74074K32434j96545k7232L76795
14555B366884n1901j21774J74840M6676n6459m1168M04758n53010J17633L69801
14545B656280K64990P387K49125J09965K49414K94983M11307K69742M94359R61338
14535E968890J354997K655320L959072O230356R889135J417221j2371931p502639
14527A1600421m381111j629274m02947M55934q20595j569136l12194o0765m44301
$$ y = [1553542, 1534497, 1687546, 1405251, 1384742, 1342420, 1617340, 1444190, 1160037, 1460728, 1636277, 1644215, 1646267, 1652087, 1798954, 2195714, 1582149, 1706551, 1499898, 1992968, 1608569, 1823690, 1735105, 1699483, 1680013, 1508087, 1786504, 1934208, 1745340, 1860755, 1927114, 1734392, 1951569, 2262865, 2034768, 1607358, 1981432, 2213866, 2017321, 1990089, 2366884, 2314983, 2193209, 2368049, 2414725, 2358266, 2317098, 2721856, 2168846, 2286479, 2656280, 2921270, 2928657, 3177782, 3287747, 3537161, 3832144, 4243451, 4513193, 5007552, 5968890, 7323887, 9979207, 13938279, 20168635, 30057770, 31474991, 19103060, 11600421, 7219310, 5590036, 5187089, 5643023, 4822428, 3253292, 2941098, 2880333, 2436032]
14518B436032j09688K10035l14978K64144m9629j95362J07823j25671J16611L66880
14508B706197l78579K97106L3417l18004L05774k26818K09560j77526K68050J37083
14498B856260o5821J92006m5894o08916M94263j77336M24970j53259J51313o4132
14488C003454j66064L63853j29475J44194j53715n9460Q1635j2665J20594N5161
14478C247512Q8832J36342k42849K55167Q277K97082l40713K60340K23063l87981
14468C545072K22669J00767o7593M20031n41663J62506k8773L97458J07693l87128
14458C931039J19494K10663K21562l94213M31682J67024k91752K7112K37288k3180
14448D636719K46678j85859j03573N31649j84732J01504j23958M26745k83208
$$ y = [2436032, 2326344, 2536379, 2221401, 2485545, 2435916, 2240554, 2348377, 2222706, 2339317, 2706197, 2327618, 2624724, 2658141, 2340137, 2645911, 2419093, 2628653, 2451127, 2719177, 2856260, 2790439, 2982445, 2936551, 2327635, 2821898, 2644562, 3069532, 2916273, 3067586, 3003454, 2837390, 3201243, 3071768, 3215962, 3062247, 3002787, 3084422, 3071757, 3192351, 3247512, 3336344, 3472686, 3229837, 3485004, 3493281, 3790363, 3449650, 3709990, 3933053, 3545072, 3767741, 3868508, 3800915, 4220946, 3679283, 3841789, 3813016, 4210474, 4318167, 3931039, 4050533, 4261196, 4482758, 4088545, 4520227, 4687251, 4395499, 4422611, 4659899, 4636719, 4883397, 4697538, 4593965, 5125614, 4940882, 5042386, 4918428, 5345173, 5061965]
14439E061965k1878L97319k91887M04565n0964j65299M76517K3264j65101N9708
14429E728209L47753j61488J01686l0451K06161j59024M54162o686l90271N30610
14419F620661l4824J49526L7528J73789K72067j48249M00048r5619L20894j73572
14409G522249L00278L49098m00014L14873L15942j49677L69238K91102k59544
14400H653545m914N19861k14138j46029L49375J48207K31425N4440J60467J73918
14390I926157J06181J40742N11187M17920l58477M46148P725j52830L25881n723
14380A1364911M00P03078k6429L70305K76722k88505L64262L81648J53690L2261
14370A3332343L17773N45609m2644N10608J73495J56861N06629M30818J79521
$$ y = [5061965, 5040087, 5437406, 5145519, 5550084, 5499120, 5333821, 5810338, 5833602, 5668501, 5728209, 6075962, 5914474, 6016160, 5985709, 6191870, 6032846, 6487008, 6480322, 6090051, 6620661, 6585837, 6735363, 6772891, 6946680, 7218747, 7070498, 7470546, 7374927, 7695821, 7522249, 7822527, 8171625, 7771611, 8086484, 8402426, 8252749, 8621987, 8913089, 8653545, 8648631, 9168492, 8954354, 8808325, 9157700, 9305907, 9537332, 9591772, 9752239, 9926157, 10032338, 10173080, 10684267, 11102187, 10743710, 11189858, 11197583, 11044753, 11370634, 11364911, 11365311, 12068389, 12041960, 12412265, 12688987, 12400482, 12764744, 13146392, 13300082, 13332343, 13650116, 14195725, 14153081, 14663689, 14837184, 14994045, 15500674, 15931492, 16111013]
14361A6111013L23272L68445j55826J000654J83172J60586N10030M77447r3812
14352A8884981N53663O22516R9120N97232O29978K42503L60902M39692N42043
14343B2972630R80861K09966M04989L23067Q36493N36382N09433Q19253R02740
14334B8495814M60946P31310R10900P59998Q13956N04207J159117Q47835Q53438
14325C5537521R77467J385727J068020P46950J460685J084564J332461J294175
14317D4887570J498548J495311J140542J677232J721321J703669J623305K312466
14309E8059964J899133J617926K570157J795954K838033K619268K684111K775955
14301G6860501L236605K575572L438647L754387L353904M161723M324500M166690
$$ y = [16111013, 16434285, 16802730, 16646904, 17647558, 17830730, 17991316, 18501346, 18978793, 18884981, 19438644, 20061160, 20160280, 20757512, 21387490, 21629993, 21990895, 22430587, 22972630, 23953491, 24163457, 24568446, 24891513, 25728006, 26264388, 26773821, 27593074, 28495814, 28956760, 29688070, 30598970, 31358968, 32172924, 32677131, 33836248, 34684083, 35537521, 36514988, 37900715, 38968735, 39715685, 41176370, 42260934, 43593395, 44887570, 46386118, 47881429, 49021971, 50699203, 52420524, 54124193, 55747498, 58059964, 59959097, 61577023, 64147180, 65943134, 68781167, 71400435, 74084546, 76860501, 80097106, 82672678, 86111325, 89865712, 93219616, 97381339, 101705839, 105872529]
14293A05872529M498322N141122N072051N859498N798475O455065O385360O809520
14285A51891942P253688P824155Q395384Q742018R302028J0083991R991781J0833704
14277B24318691J1735785J2443387J3019634J3459856J3937146J4119730J4443183
14270C17477412J4629450J4974317J4476309J4493848J4135573J3216157J2403709
14263D15806775J0529694J0025495Q968394P997830O326003L152508R51223R57507
14255D64715429J249121j666616p318379n725396q009759j0720729j1224173j2931833
14247D08367665j3218999j3074762j3294119j3687346j4470476j3369234j4444316
14240C12808413j4012712j3423210j2339473j1838550j1718884j1345588j1283311
$$ y = [105872529, 110370851, 115511973, 120584024, 126443522, 132241997, 138697062, 145082422, 151891942, 159145630, 166969785, 175365169, 184107187, 193409215, 203493206, 213484987, 224318691, 236054476, 248497863, 261517497, 274977353, 288914499, 303034229, 317477412, 332106862, 347081179, 361557488, 376051336, 390186909, 403403066, 415806775, 426336469, 436361964, 445330358, 453328188, 459654191, 462806699, 463757922, 464715429, 465964550, 464297934, 456979555, 451254159, 443244400, 432523671, 421299498, 408367665, 395148666, 382073904, 368779785, 355092439, 340621963, 327252729, 312808413, 298795701, 285372491, 273033018, 261194468, 249475584, 238129996, 226846685]
14233B26846685j1462453j1209928j0654512r486746r377564q559343q101631
14226A57994508p371953p230882o471761o137611n752044n427189n765039n155453
14218A08682576m393508m069363l829575l586247m127364l468816l319951k834143
14210G9053609l160979k892320k515201k244766k533796k220732k199553k059082
14202E9227180k097982j888842j316302j956777j430497j378789j770177j294188
14194D6093626j382599j171704q44619j246733j554389j126497r67661r01078
14186C6898346r80399o48622p27489j505744q52071q01108p38279m52287q27365
14177B9364982p27378n83438j034250l22961r72902j63032r77210m62115q69112
$$ y = [226846685, 215384232, 204174304, 193519792, 184033046, 174655482, 166096139, 157994508, 150622555, 143391673, 136919912, 130782301, 125030257, 119603068, 113838029, 108682576, 104289068, 100219705, 96390130, 92803883, 88676519, 85207703, 81887752, 79053609, 75892630, 73000310, 70485109, 68240343, 65706547, 63485815, 61286262, 59227180, 57129198, 55240356, 53924054, 51967277, 50536780, 49157991, 47387814, 46093626, 44711027, 43539323, 42694704, 41447971, 39893582, 38767085, 37799424, 36898346, 35917947, 35269325, 34541836, 33036092, 32184021, 31382913, 30644634, 30192347, 29364982, 28637604, 28054166, 27019916, 26696955, 25724053, 25561021, 24583811, 24121696, 23252584]
14168B3252584k38466l22345o33766m55643j9893n21973o49369o57941j79380
14159A9573808m69480K991n51343l55768o95962j27319k98695j87328r87516Q9747
14149A5993135N0289n04613l73109K0138m08941j84808m37074j82325k77982m09245
14139A3285465O4659k72024j6525m84435j6475N812l53486m87996j58655k23503
14129A1342837m2360O0260j16347n22206k92233J01074K12151m86146l91585k35259
14119I630186j98436J15741r4106n22459K22901l26072j5879J55856n8352p82769
14109H126611M79525l56290l20652l625m7488j76278K70182k89928j21116O1677
14099G622618k7961l44483q9448j54483L17167n46465m69385M11880m9655j84851
$$ y = [23252584, 23014118, 22691773, 22058007, 21602364, 21582471, 21060498, 20411129, 19753188, 19573808, 19104328, 19107319, 18555976, 18200208, 17504246, 17376927, 17078232, 16890904, 15903388, 15993135, 16043424, 15538811, 15165702, 15185840, 14776899, 14592091, 14155017, 13972692, 13694710, 13285465, 13350124, 13078100, 13061575, 12577140, 12560665, 12566477, 12212991, 11724995, 11566340, 11342837, 11300477, 11360737, 11244390, 10722184, 10429951, 10531025, 10743176, 10257030, 9865445, 9630186, 9431750, 9547491, 9453385, 8930926, 9153827, 8827755, 8811876, 8967732, 8909380, 8126611, 8606136, 8249846, 7929194, 7925569, 7878081, 7701803, 7971985, 7682057, 7560941, 7622618, 7594657, 7250174, 7160726, 7006243, 7323410, 6776945, 6307560, 6719440, 6669785, 6484934]
14089F484934j06968R7617j47350k29103M17507l66303J71126k65408j6644k62114
14079E777294K19053m53470j1390j45671m05J5235r2496K0091L37519m82725K74760
14068E457795O2766j23155k49300k76428K98871l90232q3922M9523J43649k79413
14058D610154J42686p1829j17025O5239j43925j64931K60657k40589K31034k48772
14048D322699j91065K55317L5124k61716p3722K16660k31234J1730j7680k07J31955
14037D197861n10997K26464k24320J1060o9283L15783k74975J94915k99234j06492
14027C460782Q2362k04370M9778j6449P9880k4995l19122Q1266l4720j72501K19971
14016C201882K4114j19341J28649K49350k78308m60830K68198l13776j26926M04070
$$ y = [6484934, 6377966, 6475583, 6328233, 6099130, 6516637, 6150334, 6321460, 6056052, 6039408, 5777294, 5996347, 5542877, 5531487, 5385816, 5385411, 5400646, 5308150, 5328241, 5665760, 5183035, 5457795, 5520561, 5397406, 5148106, 4871678, 5170549, 4780317, 4696395, 4745918, 4889567, 4610154, 4752840, 4681011, 4563986, 4629225, 4485300, 4320369, 4581026, 4340437, 4571471, 4322699, 4131634, 4386951, 4422075, 4160359, 4086637, 4303297, 4072063, 4083793, 4066113, 4065906, 4197861, 3686864, 3913328, 3689008, 3700068, 3630785, 3946568, 3671593, 3866508, 3567274, 3460782, 3543144, 3338774, 3388552, 3372103, 3451983, 3426988, 3107866, 3189132, 3154412, 2981911, 3201882, 3225996, 3106655, 3235304, 3484654, 3206346, 2745516, 3013714, 2699938, 2573012, 2977082]
14006B977082m43354N30878m90150m9336n3230J20585k09249L93523l5720r3179
13996B647850k30751K54684J09387k33846k47227Q5816k85347L22153l55142K61250
13986B328827j47401Q7395j82808K40735O8604r2683N56539j56297L53315K40281
13976C296507M18883J138211J436525L510286N279366J0585423P350388j0411316
13968B2604273p391105m339103k871553j879814p81182o23490p65012p8372n7138
13959C817504l24679m46941P9340l3573m00212K23131l93904J48779j82884j66945
13949B319616j6436R5590l97050M64880j26120j62981K22648j60754P088j79500
13939B066981L2582N7082j64191K61573j47157n0537k56657M6516J96542m12339
$$ y = [2977082, 2533728, 3064606, 2574456, 2525120, 2471890, 2592475, 2383226, 2776749, 2741029, 2647850, 2417099, 2671783, 2781170, 2547324, 2300097, 2385913, 2100566, 2422719, 2067577, 2328827, 2181426, 2268821, 2086013, 2326748, 2395352, 2302669, 2859208, 2702911, 3056226, 3296507, 3715390, 4853601, 6290126, 9800412, 15079778, 25665201, 33015589, 22604273, 15213168, 10874065, 8002512, 6122698, 5341516, 4718026, 3953014, 3874642, 3817504, 3492825, 3045884, 3125224, 3091651, 2691439, 2914570, 2520666, 2669445, 2486561, 2319616, 2303180, 2398770, 2001720, 2466600, 2340480, 2177499, 2400147, 2239393, 2246481, 2066981, 2099563, 2156645, 1992454, 2254027, 2106870, 2056333, 1799676, 1846192, 2042734, 1630395]
13929A630395L45536J18081l73350K12964l12626L76811J23438o75098J76289
13920A622440J57479j16412j28950j0780N71259o22107O66576m77286K3597j41639
13910A544177n6054K1175K32080j84348j00648J72970K61645n60865J27471M24571
13900A882174l83044M904R7256k05295j7180J33440J27618j67101O6315M8587
13890A587674j26073j12920M49848k56873j2816M9276l06892L94801m48523K69477
13880A486979L7127o3524j07202r8859K80738j65065K10597l57264q514n8375
13870A156638J266m8451p2866K43535J2244Q9555j92755M4425J42481k50223J62351
13859A288200j93772J31722q8214k30222N8622L64211k18435J42754r517L051
$$ y = [1630395, 1975931, 2094012, 1720662, 1933626, 1621000, 1997811, 2121249, 1446151, 1622440, 1779919, 1663507, 1534557, 1523777, 2095036, 1472929, 2139505, 1662219, 1685816, 1544177, 1488123, 1509298, 1741378, 1557030, 1456382, 1629352, 1890997, 1330132, 1457603, 1882174, 1499130, 1504034, 1601290, 1395995, 1378815, 1512255, 1639873, 1472772, 1539087, 1587674, 1461601, 1348681, 1798529, 1541656, 1528840, 1578116, 1271224, 1666025, 1217502, 1486979, 1524106, 1460582, 1353380, 1254521, 1535259, 1370194, 1580791, 1223527, 1215013, 1156638, 1157904, 1109453, 1036587, 1280122, 1292366, 1381921, 1189166, 1233591, 1376072, 1125849, 1288200, 1094428, 1226150, 1137936, 907714, 966336, 1330547, 1112112, 1254866, 1245349, 1248400]
13849A248400j15695L48790k70950k96178M1431j97224O16591m99929J69578L41318
13839A386132m12359O2848K69476j13617m15547K97296J91228n40593J36591j29052
13829G32403K58378K97563k89565j20532M30901k7878j98050j16578P9460p6580
13819I69522K541k03909K63685K7687r6881j99323M85618k73474J17435l5391
13809A057510J25847k19262k97478N13443n426l21045J91060J17983m44880J64859
13799H82611J9133P0852j88481k02007J19054j0774L43336k45101P8738l1108
13789H36253l5094J77826j89503J103K9313J80589j77460L0166K12843j31738
13779I34298j01493K5568L6438O7740q220m42404J98952J24496k24366j8400j69151
$$ y = [1248400, 1132705, 1481495, 1210545, 914367, 955798, 758574, 1375165, 875236, 1044814, 1386132, 973773, 1036621, 1306097, 1192480, 776933, 1074229, 1265457, 724864, 861455, 732403, 990781, 1288344, 998779, 878247, 1309148, 1281270, 1083220, 966642, 1046102, 969522, 972063, 768154, 1031839, 1059526, 962645, 763322, 1248940, 975466, 1092901, 1057510, 1183357, 964095, 666617, 1180060, 1174634, 853589, 1044649, 1162632, 717752, 882611, 901744, 972596, 784115, 582108, 701162, 690388, 1033724, 788623, 867361, 836253, 801159, 978985, 789482, 790585, 819898, 1000487, 823027, 853193, 1066036, 934298, 832805, 858373, 894811, 962551, 954331, 511927, 710879, 835375, 611009, 592609, 423458]
13768D23458J60072q0273o2857K97373k78123O49806k17792k79259K49442J5494
13758H77341l57925J81987k47770O39414l33718k71026J22602k30517M68533n0774
13748G98147j20937J21102J8814k99315L02186J64421k72944J4754K03833D39573
13737F58023J02152j70298k14003K58819J91019k63593J96322l33094O49750D17663
13726E61452j34681J06729k61785N25322B53041R0250K75488L6491k14624o0794
13716C79852K90847q925J50442j55873m005k32731J75230J47746C13584M54468
13706G68052L25581k73264C91483L22562M896k8390C34573Q8693L66728J8864
13696H08858C28723M86662j59620j71896j50229L13405j83048J36432P0611j73707
$$ y = [423458, 583530, 503257, 440400, 737773, 459650, 1109456, 891664, 612405, 861847, 877341, 519416, 701403, 453633, 1093047, 759329, 488303, 610905, 380388, 848921, 798147, 677210, 798312, 817126, 517811, 819997, 984418, 711474, 726228, 930061, 439573, 658023, 760175, 589877, 375874, 634693, 825712, 562119, 758441, 425347, 1075097, 417663, 561452, 426771, 533500, 271715, 797037, 253041, 343291, 618779, 655270, 440646, 379852, 670699, 661774, 812216, 656343, 652338, 419607, 594837, 742583, 313584, 768052, 1093633, 820369, 391483, 714045, 718941, 690551, 334573, 423266, 789994, 808858, 328723, 815385, 655765, 483869, 333640, 647045, 463997, 600429, 671040, 497333]
13686D97333J35699r4946j83390K02806L22931k48167k01441L3560j09970j26121
13676B28294K18093J96936k21676N066K08067k62277J46535K37786k47215j33599
13666C76010o4622L46490j34003P368Q2189k64855K08602k24858l9248Q4381K64718
13655F42172J13527j91909j43965j10607j47414L97662o5441n0658A97612L96197
13645E93809A23632O93561C13196J23973j6290j67636Q6529m7707R4275K34167
13635F20507j22883J4140K01405C02719K38890k53228M4181M6721r012j48029
13625B22242K05298O4238j4644R2591j85120K21618B69902K74919k22150j60861
13615A61810L62473M4914P092j71092K31959J07187C52822o6266E1356L93140
$$ y = [497333, 633032, 538086, 354696, 557502, 880433, 632266, 430825, 464385, 354415, 228294, 446387, 643323, 421647, 426713, 634780, 372503, 519038, 756824, 509609, 376010, 311388, 657878, 523875, 531243, 613432, 348577, 557179, 332321, 293073, 377454, 642172, 755699, 563790, 419825, 309218, 161804, 559466, 494025, 443367, 197612, 593809, 123632, 817193, 313196, 437169, 420879, 253243, 339772, 292065, 386340, 620507, 497624, 511764, 713169, 302719, 541609, 288381, 332562, 379283, 370271, 222242, 427540, 491778, 477134, 569725, 384605, 606223, 269902, 544821, 322671, 161810, 524283, 569197, 576289, 405197, 637156, 744343, 352822, 286556, 51356, 444496]
13605D44496L27816k60424j02755k1684L43665B42655L01584B21984K28607k4733
13595D25858o5059j10542K8188o5600J6463k3935K28378M2607K8012A17633M04339
13584E21972A38775J38596j6634J97535N3554J43792B49434r1598F9200M75675
13574E44875q7830j97293K8522J31078A34401J61216A10598K98759A05882L74216
13564D80098B01207O4089L56874k58708j3885J36493R8294q4665n394r3684E7776
13552C89259H9637L42940A50962K18173J5987L19526k37994J26253A99163l9961
13542A59202L31197k4349j80838L18550k73487K9817J12264j43635j43790O9380
13532B54311a06551E00679j70328e1456A82126K32086j23085M39394B99416l2125
$$ y = [444496, 772312, 511888, 409133, 387449, 731114, 242655, 544239, 221984, 450591, 425858, 360799, 250257, 278445, 212845, 229308, 205373, 433751, 476358, 504370, 117633, 521972, 138775, 277371, 260737, 458272, 511826, 655618, 249434, 157836, 69200, 544875, 457045, 259752, 288274, 419352, 134401, 295617, 110598, 409357, 105882, 480098, 201207, 265296, 622170, 363462, 349577, 486070, 584364, 499699, 494305, 400621, 57776, 389259, 89637, 432577, 150962, 369135, 385122, 704648, 466654, 592907, 199163, 159202, 490399, 466050, 285212, 603762, 330275, 360092, 472356, 328721, 184931, 254311, -106551, 500679, 330351, -51456, 182126, 414212, 291127, 730521, 299416, 267291]
13522B67291K60259B35826K41504J4804R7491B59717a36614A85293J36464A20142
13511C74768J6860l223m5311j16230l3968K58271r5239j04754J24420I0589J32084
13500B22673j00856J40044n8860G1585K07722Q8777q4270C8055J14689L39002
13490D91746G4306K55865J17298j62784r8288Q9764D0273M06794k05107J1513
13480B53473R4891O4255j27820A11207K54599j69155J88650J50510n6775j52287
13470C26749K9883I4873L41175j61704G5918k7184M95798k00054n7500O3035j19839
13459B30174J52543m4785j45150J39873j12424R3000A12301L24534I9713K32348
13449C32061n1108A25041J36957l9982G5720P0050J55816j24972j3106K57912
$$ y = [267291, 527550, 235826, 477330, 492134, 589625, 259717, -136614, 185293, 321757, 120142, 374768, 391628, 388405, 343094, 226864, 192896, 451167, 355928, 251174, 375594, 90589, 222673, 121817, 261861, 203001, 71585, 279307, 368084, 283814, 38055, 152744, 491746, 74306, 330171, 447469, 284685, 186397, 276161, 40273, 447067, 241960, 253473, 348364, 412619, 284799, 111207, 365806, 196651, 385301, 535811, 479036, 326749, 356632, 94873, 436048, 274344, 75918, 48734, 544532, 344478, 286978, 350013, 230174, 382717, 337932, 192782, 332655, 220231, 313231, 112301, 436835, 99713, 332061, 280953, 125041, 261998, 222016, 75720, 145770, 301586, 176614, 163508, 421420]
13439D21420I0241K25426o3430C4556n139J39547K46132j05751k2047o8388J52445
13428C71355H131P0122L67042j32513j00481q5076P5268I3183h0662A58544L4602
13417A93146a8255F8880J45454a02847E8826J51136C7819O3672i6298A85331M7190
13406B32521q0832J75027A52653L28522A76356K58316R4503c4732C6229N1818
13396H8047N9694J2598P1953r0341E4268K26595F7105K89717O3679k2465A24683
13384A58002J81788B1986J90422E9367J62388K0561A04392L0256K4503n6417M63158
13373E65892B42461A13217J80157D0111J57126I0513J09766a1493E4784J03409
13363A58193J18892a3843D61650m3146A36801b26492B69303n5560a07763B938
$$ y = [421420, 90241, 315667, 252237, 34556, 29417, 168964, 415096, 309345, 287298, 218910, 371355, 8131, 78253, 445295, 312782, 212301, 127225, 202493, 93183, -80662, 158544, 193146, -18255, 68880, 214334, -102847, 58826, 209962, 37819, 101491, -96298, 185331, 232521, 151689, 326716, 152653, 481175, 176356, 434672, 529175, -34732, 36229, 88047, 147741, 160339, 232292, 141951, 54268, 280863, 67105, 356822, 420501, 398036, 124683, 158002, 339790, 21986, 212408, 59367, 221755, 242316, 104392, 134648, 159151, 102734, 565892, 242461, 113217, 293374, 40111, 197237, 90513, 200279, -11493, 54784, 158193, 277085, -13843, 461650, 418504, 136801, -226492, 269303, 213743, -107763, 2938]
13352B4416J10473J10400J34567e5375B60658h2413C00676K37190k11349J00039
13342D26556A50462J19924b2442B16166q0624L939j8647J00931J47806A1925N2969
13331F4894K51158b72488D62111A96113J71750j32008N2329J70614F2998N33817
13321E96815B49867A18725j904J02196b14627A39475l4438j4797N710M6723M535
13310A47208J3947J16853m7864J42952g1769B51007L43519A15305i0710D18760
13299A11930J51673a97680A83080J96963n212j20030J6236J4744B6480O9623i0553
13287B64464b63026J5883G7189P2416m4583O9230E3826A2040K01597J78284A95821
13275h3099A48161K0054L06486k13691l6439B4598O5198L18580N9076D0789K52527
$$ y = [24416, 134889, 245289, 379856, -55375, 260658, -82413, 300676, 537866, 326517, 426556, 150462, 270386, -22442, 216166, 135542, 139481, 120834, 221765, 369571, 11925, 64894, 316052, -272488, 462111, 196113, 367863, 235855, 288184, 458798, 62998, 596815, 249867, 118725, 116821, 219017, -214627, 139475, 105037, 90240, 95950, 142673, 147208, 161155, 278008, 230144, 373096, -71769, 251007, 594526, 115305, -90710, 418760, 111930, 263603, -197680, 183080, 380043, 374831, 254801, 271037, 285781, 26480, 96103, -90553, 264464, -263026, -247143, 77189, 149605, 105022, 174252, 53826, 12040, 213637, 391921, 195821, -83099, 148161, 168215, 474701, 261010, 224571, 24598, 89796, 408376, 467452, 40789, 293316]
13264B93316n9525q663b38989I9975J2060M3256Q555l6856l6474N3607c7562l127
13252d0689j64762A05981h4058F31463H4348K93011a770C81084i0676B69250j14605
13241A54645F8493b10167E3122b3134C97564A01465N5980J39067j01032R99M5918
13230B42397j20977K81726b14712A70197J77011G4990J8865K17906h6147A88690
13219A00359K21113N0909j73683d4542j97586g1055A50120K77745A15068Q1500
13209A96568g3927B6725L93178c8681l887B47580q1325j8873b6611j83978m6080
13198b56669A36381n7523a29378A63581j1175b1613j07359e5567F3331M3204J33325
13187B39860j01670J85548p7854M8889B3046K12173b71411C26157p0802d609C38635
$$ y = [293316, 233791, 225128, -238989, 99975, 112035, 155291, 163846, 126990, 90516, 144123, -37562, -40689, -205451, 105981, -84058, 631463, 84348, 377359, -1770, 381084, -90676, 269250, 154645, 68493, -210167, 53122, -23134, 397564, 101465, 157445, 296512, 195480, 196479, 242397, 121420, 403146, -214712, 170197, 347208, 74990, 93855, 311761, -86147, 188690, 100359, 321472, 372381, 198698, -44542, -242128, -71055, 150120, 427865, 115068, 196568, -73927, 26725, 419903, -38681, -42568, 247580, 166255, 147382, -26611, -210589, -256669, 136381, 78858, -129378, 163581, 152406, -21613, -128972, -55567, 63331, 106535, 239860, 138190, 323738, 245884, 294773, 23046, 235219, -271411, 326157, 255355, -4609, 338635]
13175B87090p8724R9309C9871j1973j032L0986a76295G2513j5823f9780k2921
13164i2701A262J6054J6894K59426a0972F698J80582f2567H6400J4837M3255j5528
13152A28964j2330a35027A18163N212J4650J0500g2761p8174l229D22560c5792
13140C48468G6198e4578C91856o2699A3888O4329K3513J02708f4630k85160F8045
13128C17269A39157J09953m8355d6682C4410P7008J71449c2004m8401K8711F1253
13116D8790K80994o2813i5028A01248K49543F928J16687J48332g9076G0572N9253
13105A29825a31778K7520B29196m3278O2047b879A20317l2041f3351C65927G4782
13093a78702C1346a25847K2676K8756k5987A49369E8410J15539d5744r0186D2169
$$ y = [287090, 208366, 307675, 39871, 27898, 26866, 57852, -176295, 72513, 56690, -69780, -92701, 1262, 17316, 34210, 293636, -10972, 6698, 187280, -62567, 86400, 101237, 144492, 128964, 116634, -135027, 118163, 123375, 138025, 148525, -72761, -150935, -154164, 422560, -35792, 348468, 76198, -54578, 391856, 329157, 13888, 78217, 101730, 204438, -64630, -349790, 68045, 317269, 139157, 249110, 200755, -46682, 34410, 111418, 282867, -32004, -80405, -51694, 61253, 48790, 329784, 266971, -95028, 101248, 350791, 6928, 123615, 271947, -79076, 70572, 129825, -131778, -104258, 229196, 185918, 247965, -2879, 120317, 88276, -63351, 365927, 74782, -178702, 31346, -125847, -103171, -74415, -100402, 149369, 58410, 173949, -45744, -135930, 42169]
13081B45881K38058A53842D6086J92630K1541f1821H3034d1280r3900d2536I0880
13069B54242h7956l1032d763l8317A52410A5175c6215l44185B05752F9936b12210
13057D5869K8521N04311b29114B48960a0296I6132K07578a81557B42683m3622
13047A99061F661L20787J6262c14653i5299A02806b03432f2654C53874g2869B07770
13035F9584a30706e7930B04823K3284a42139E06467D6224L9334J44316G2823c9933
13023a82849A65232i3832B62889r3766J05805c0884C6826b57A40040a69011C6886
13011a6649b726C913J26601k9140D9587K00122a09807B81162n5968J54466a85993
12999g5215A49676O4390a08650B40434i3094c377C21980b4365A48996Q5563p3037
$$ y = [245881, 483939, 153842, 46086, 238716, 260257, -61821, 83034, -41280, -135180, -42536, 90880, 254242, -87956, -118988, -4763, -43080, 152410, 15175, -36215, -380400, 205752, 69936, -212210, 45869, 74390, 578701, -229114, 248960, -10296, 96132, 303710, -181557, 242683, 199061, 6661, 327448, 343710, -314653, -95299, 102806, -203432, -62654, 353874, -72869, 207770, 69584, -130706, -57930, 204823, 228107, -142139, 506467, 46224, 85558, 229874, 72823, -39933, -182849, 165232, -93832, 262889, 169123, 274928, -30884, 36826, -257, 140040, -169011, 36886, -16649, -2726, 3913, 130514, 101374, 49587, 249709, -109807, 281162, 225194, 379660, -185993, -75215, 149676, 214066, -108650, 240434, -93094, -3377, 321980, -24365, 148996, 234559, 161522]
12988A61522J15313D41K13713D0457O7915n746c04411A7941o513f6602J5072j67347
12976b18877E0815j3155O2163a03813l0673H7857h174j00791b4036B34026a91543
12964f2816B3501J27493h8823D6299d5867A15535L133h480j70598B83975A09364
12952D6670a09561l874B80242A15331d5737I4940a68103C1174b24044C19727a35532
12940a74953B81478H4520J07246E0499J17420d858B02195J33822a44142K8051
12930a16091A25221a53954O6970F8464g7656l3923d9125l30828g9073L6972k7190
12919f9291M572B58069j23827h8776A39677a31279F2282b22215B38799B6186f8319
12907a1194k91936B59229c32498e180j85050i2794A52719P2700H9798b23329f9229
$$ y = [161522, 276835, 441, 214154, 40457, 108372, 102626, -304411, 17941, 11428, -66602, -51530, -218877, 50815, 37660, 99823, -103813, -134486, 87857, -8174, -108965, -24036, 234026, -191543, -62816, 23501, 150994, -88823, 46299, -45867, 115535, 118668, -8480, -179078, 283975, 109364, 46670, -109561, -113435, 280242, 115331, -45737, 94940, -168103, 31174, -224044, 319727, -135532, -174953, 281478, 84520, 191766, 50499, 167919, -4858, 202195, 336017, -144142, -116091, 125221, -153954, -86984, 68464, -77656, -111579, -49125, -379953, -79073, -42101, -69291, -64719, 258069, 134242, -88776, 139677, -131279, 62282, -222215, 238799, 26186, -68319, -11194, -303130, 259229, -332498, -5180, -190230, -92794, 152719, 225419, 89798, -223329, -69229]
12895a04330j78841C29904A53964b3236j69502c3306k81001A32734a27604c4947
12884d9999A22827K43202E5074J88368k1479k9268a66175D96593j20641A41628
12873a38606j37576B71634F4229d4259j31402j74472B00688h6050A64734D0742
12862I687M1322f6831p3847e3717C12731a00530B57493m0168b26180f7009A39337
12850A91404E5882G012a16168d6032F8525L20221A63211b73384D84998c794H1226
12838b49666h2619C96274H5948j3895c6740j10906A17384b43276D0746E474J16137
12827A21611K42872a78588b2379k24550f057C82527A61769b59730c1655Q156j9199
12816d2698A97358J01896F464f2286l7079k0268I1474h0335A08119a50555C45591
$$ y = [-104330, -283171, 329904, 153964, -23236, -192738, -33306, -314307, 132734, -127604, -34947, -49999, 122827, 366029, 55074, 243442, 221963, 192695, -166175, 496593, 375952, 141628, -138606, -276182, 271634, 64229, -44259, -175661, -350133, 200688, -86050, 164734, 40742, 9687, 51009, -66831, -140678, -53717, 312731, -100530, 257493, 217325, -226180, -67009, 139337, 191404, 55882, 7012, -116168, -46032, 68525, 388746, 163211, -273384, 484998, -3794, 81226, -249666, -82619, 396274, 85948, 72053, -36740, -147646, 117384, -243276, 40746, 5474, 121611, 364483, -178588, -22379, -246929, -6057, 382527, 161769, -259730, -31655, -23499, -42698, 197358, 299254, 6464, -62286, -99365, -119633, 91474, -80335, 108119, -150555, 345591]
12804f0167r5898c0735F3029J5782j2999L03718B1310h1286C38922j22706J9777
12793B35993a00276b9392j21773C8507J0045N5801a6576B50019j00449b11601
12782F4893a62346p054M0642k01784J44286k27920A39968b39381P8870B47476
12771A41400o6747a51563D8201a40981N9475k12370A85356L9645f6518A64630
12760H3570M0991a16715a0079A20097J43747a73823d7629I8730a53588d6854n4824
12749a01678k54356B80509j05331b00461B24421Q9445b4480A48019F8956J322
12739G0278A6146M8833a96993g8192A20903a26405a6296p0719G7350C3372J55556
12728A88928b93565C3139K75664E4895O4226J69042G7428J0268k8675b799j0194
$$ y = [-60167, -156065, -30735, 63029, 78811, 65812, 369530, 21310, -81286, 338922, 216216, 235993, -100276, -29392, -151165, 38507, 48552, 104353, -16576, 250019, 149570, -211601, 64893, -162346, -169400, -128758, -330542, -186256, -414176, 139968, -239381, -160511, 247476, 141400, 74653, -151563, 48201, -140981, -81506, -293876, 185356, 225001, -66518, 164630, 83570, 124561, -116715, -10079, 120097, 263844, -173823, -47629, 98730, -153588, -46854, -101678, -356034, 280509, 175178, -200461, 224421, 313866, -24480, 148019, 68956, 70278, 16146, 64979, -196993, -78192, 120903, -126405, -16296, -87015, 77350, 33372, 188928, -293565, 33139, 308803, 54895, 119121, 288163, 77428, 87696, 59021, -2799, -12993]
12717a2993A71807c6421B7591O3144a2805B92565j1339a96159A27301D7379G618
12705E3140h5624L0583A8692E109M01214i8372A63929K42446a38096B56640A14448
12693A43721J587J77109A43756e2454C06596K9340N2749a30325A32760J3577F956
12681A46055a49158A26581b31245B48221H5711C0762r315N6553a46705A16286
12670a23277i062k75898A6173R7997P1235G1416b14118B858e7880A36309m5838
12659I0471f2312C63482B5698J80607a26968f1051H1219J11972a88853A19753
12648H5004c96605A84816b3668j43198B11657F1168J5264q427c47505E0268N6172
12637A06440O4882b10C7357J57239a36474A75257q4078a93433A06318f381q9281
$$ y = [-12993, 171807, -36421, 27591, 90735, -12805, 292565, 281226, -196159, 127301, 47379, 7618, 53140, -85624, -55041, 18692, 5109, 406323, -98372, 163929, 406375, -138096, 256640, 114448, 143721, 145308, 322417, 143756, -52454, 306596, 335936, 388685, -130325, 132760, 146337, 6956, 146055, -149158, 126581, -231245, 248221, 85711, 30762, 21447, 78000, -146705, 116286, -123277, -9062, -284960, 16173, 114170, 185405, 71416, -214118, 2858, -57880, 136309, 90471, -62312, 363482, 25698, 206305, -126968, -61051, 81219, 193191, -188853, 119753, 85004, -396605, 184816, -23668, -166866, 211657, 61168, 76432, 68005, -347505, 50268, 106440, 171322, -210, 37357, 194596, -136474, 175257, 91179, -193433, 106318, -6381, -95662]
12626i5662r4442a5504n0721n0086a1762A16148E7183k2557R579q784d2572A57291
12613C76499b36703e1877B63329d4895A18505d4029k9995B43479B6542K5274K14435
12602B66251a77556g117n0252k7928B38137c41125A48596M0137G7531J37602H2461
12590B25865f6025Q511j52754D68935b4558D59446H2995f6971j51583H8313K20736
12579C09049i5580M0978p1504A65897F1492M394O5877a25572B67778q7044q8361
12568I2373f7372B25169b15605R5412A0145P1252O7639a90592B27296E1515k1229
12557C0286i6819B3016a98967C10252D7151d9381H2456J9747m8272a68895k47168
12546d16063A55267i4023C8841j0559K3841k1165M6052J36467A02823c70048A63808
$$ y = [-95662, -190104, -15504, -66225, -116311, -11762, 116148, 57183, 34626, 44205, 35421, -42572, 157291, 376499, -236703, -51877, 263329, -44895, 118505, -44029, -74024, 243479, 26542, 51816, 266251, -177556, -7117, -57369, -85297, 238137, -341125, 148596, 188733, 77531, 215133, 82461, 225865, -66025, -57514, -210268, 468935, -24558, 459446, 82995, -66971, -218554, 88313, 309049, -95580, -54602, -126106, 165897, 61492, 65886, 131763, -125572, 267778, 180734, 92373, -67372, 225169, -215605, -120193, 10145, 81397, 149036, -190592, 227296, 51515, 30286, -96819, 23016, -198967, 310252, 47151, -49381, 82456, 102203, 53931, -168895, -416063, 155267, -94023, 38841, 28282, 52123, 30958, 77010, 213477, 102823, -370048, 163808]
12534a59228f4347F7481c81698E0698P7207K9629b19214E4179i1767E645J51766
12523A57411O4823p3834K31563c1711o5997c3030k8425B4871K0774a25297E6178
12511h5164A82039l7919h7808B46087p2978k5290G0603N780a07345C45179p1327
12500B73852R5709I4678A7763d5900k4082C6027P7207A5258d6336A42054m1011
12489A01043K45457a89656i1513C13234E4694N1436P6782h8896a4988A34988g1800
12477b65694A79279D920O2434b5492A29761a81350b8214j41581M2831F3329a32979
12465A51266E6812a66378C1761i1108k53483f4890p8934j10031c1062r5939a0076
12453a9462k38996h0532a351D7600N4686d31211H2167G330c17593A57171n3934
$$ y = [-159228, -64347, 67481, -381698, 50698, 127905, 157534, -219214, 54179, -91767, 5645, 157411, 222234, 148400, 379963, -31711, -97708, -33030, -61455, 24871, 45645, -125297, 56178, -85164, 182039, 144120, -87808, 246087, 173109, 147819, 70603, 76383, -107345, 345179, 273852, 369561, 94678, 17763, -45900, -69982, 36027, 113234, 15258, -46336, 142054, 101043, 346500, -189656, -91513, 313234, 54694, 106130, 182912, -88896, -14988, 134988, -71800, -265694, 179279, 4920, 67354, -25492, 129761, -181350, -28214, -169795, -126964, 63329, -132979, 151266, 56812, -166378, 31761, -91108, -344591, -64890, -143824, -253855, -31062, -127001, -10076, -19462, -258458, -80532, -1351, 47600, 102286, -431211, 82167, 7330, -317593, 157171, 103237]
12442A03237g7077A22346a00770D657J65450K3144m9644d3552j61849C98532a90061
12430F2005J728J6876c54691I328R7505J2644O7324b49032a13828j5776B21809
12418c19528f6218C52530a05547A56572g121j40251A98899F6867C0690d0639H1694
12406a36278p7546A23923B1776q465J15564a29189c3917k72531A66113J25917
12396B92030a00388C964K8895a30416E5948a13354A03473d6220A72745q0414c89194
12384A49349E568b01320E7291J17470g8479k68199J41160G7229e81136G2825j2413
12373F0412J14335a78416A86834N8521C0137e705k3380D01358I193a43523A81909
12361A83541f1978A58842L14928b69922A9040a86760A46563a29502j83801d5780
$$ y = [103237, -77077, 122346, -100770, 4657, 170107, 193251, 143607, -43552, -205401, 398532, -190061, 62005, 63733, 80609, -354691, 9328, 106833, 119477, 186801, -249032, -113828, -129604, 221809, -319528, -66218, 352530, -105547, 156572, -7121, -147372, 198899, 66867, 30690, -40639, 81694, -136278, -213824, 123923, 21776, 13311, 128875, -129189, -33917, -306448, 166113, 292030, -100388, 3964, 32859, -130416, 55948, -113354, 103473, -46220, 172745, 92331, -389194, 149349, 5568, -201320, 57291, 174761, -78479, -346678, -205518, 77229, -581136, 72825, 60412, 174747, -178416, 186834, 245355, 30137, -5705, -29085, 401358, 9193, -143523, 181909, 183541, -61978, 158842, 473770, -269922, 19040, -186760, 146563, -129502, -313303, -45780]
12350B2698R5755E2854J89409d4750A76785d0013j28504K3410N0553M0692a2602
12338c17799B60019C5309J09200h5870A25941o1141j5837e4377A02628a28893
12327A77554K6944a27330A46743C7268f6972B9641j043M37252A29472C1345j2990
12316A8355b99274A26823J1994O3532K4446M5831K9281b4655C61132e0365N874
12305d4491C43546q2013E5682A2997K21846j03075C4554J67542h9002D65530k19296
12294B46234A19085i4900C5056B274J62686m0134K9396h6086C13087b16098A78143
12282A17299Q8824e2140B78594H10f4416J7268r6957l147A83658q3845C3094N5689
12270H8783a9995B90492b65544k7592A32574A9782R0522h4516B01442P4450p0004
$$ y = [22698, 118453, 52854, 242263, -44750, 176785, -40013, -168517, -145107, -94554, -53862, -12602, -317799, 260019, 35309, 144509, -85870, 125941, 64800, 48963, -54377, 102628, -128893, 177554, 204498, -127330, 146743, 37268, -66972, 29641, 28598, 465850, 129472, 31345, 18355, -299274, 126823, 138817, 202349, 226795, 272626, 301907, -24655, 361132, -50365, -44491, 343546, 261533, 55682, 12997, 234843, 131768, 34554, 202096, -89002, 465530, 246234, 119085, -94900, 35056, 2274, 164960, 124826, 154222, -86086, 313087, -216098, 178143, 117299, 206123, -52140, 278594, 810, -64416, -47148, -144105, -147252, 183658, 99813, 33094, 88783, -19995, 290492, -265544, -293136, 132574, 19782, 110304, -84516, 201442, 275892, 205888]
12259B05888c222B48079e9028L4C28269j48680b4737F5759J81923k7534N1733
12248B71881b51729A23673m5605K7884f897B22381A08924J48555N0587J91292
12238D99358j19336A66462L1545n4274D7488j1340L21331q9446r9326a54878A06913
12226h5738B05285K08963c8819A70574G0564a62393A06285q821J45885n9763b0644
12214a8481D1814d59493A32661o3480a23344b6842j12825C28213A55908b2256
12203F4439a18181G6006L38611H2087e1115K2908p189C68726A64863l6416f5043
12191D5357M67988c1041B56565b57389J11097b025A10332I051K01764K2820J40197
12180C73832a29875D48167a05151j68587B59667o0512g8737C43074A21994K95037
$$ y = [205888, -3222, 248079, -59028, -58994, 328269, 179589, -24737, 65759, 247682, 220148, 271881, -251729, 123673, 78068, 105952, -6897, 222381, 108924, 257479, 308066, 499358, 380022, 166462, 198007, 143733, 47488, 36148, 357479, 268033, 168707, -154878, 106913, -85738, 205285, 414248, -38819, 170574, 70564, -162393, 106285, 97464, 243349, 183586, -20644, -18481, 41814, -459493, 132661, 69181, -123344, -26842, -139667, 328213, 155908, -22256, 64439, -118181, 76006, 414617, 82087, -51115, -28207, -35396, 368726, 164863, 128447, -65043, 45357, 513345, -31041, 256565, -257389, -146292, -2025, 110332, 9051, 210815, 233635, 373832, -129875, 448167, -105151, -273738, 259667, 199155, -78737, 343074, 121994, 417031]
12170D17031c8185k1585j78041i405C4834L56869j91916m1900n956C7951h7536
12158A22764C1521O3645K66529r1409n6441a30867A83577J9305J53568j3915J48368
12147D90903J7753B18345P0174q9557N9752C6103a06811A6560K0283J11819J31138
12136B79800D6578K5453J82229B4513h9081p835B19907g1348o115g952A20772
12124C46357d5452C4863J52477B8160b80180C81542f6843j29644D52047A53831
12113A6365Q2831n418a52353I6516J14845a02510m1964C28204b3019O000B56844
12101B02023a3363A53457D5513e6397F5473h9507B56797a30195D7943J69132Q7181
12090C04256J62223i2159A83678a999q966B97643g7809A35048l5900J26913a04551
$$ y = [417031, -38185, -59770, -237811, -9405, 34834, 391703, 199787, 157887, 151931, 37951, -87536, 122764, 31521, 95166, 361695, 270286, 213845, -130867, 183577, 202882, 356450, 342535, 490903, 508656, 218345, 288519, 198962, 258714, 36103, -106811, 16560, 36843, 148662, 279800, 46578, 72031, 254260, 24513, -89081, -96916, 219907, -71348, -77463, -7952, 120772, 346357, -45452, 34863, 187340, 28160, -280180, 381542, -66843, -196487, 452047, 153831, 16365, 99196, 93778, -152353, 96516, 211361, -102510, -144474, 328204, -23019, -17019, 256844, 202023, -13363, 153457, 45513, -56397, 65473, -89507, 256797, -130195, 47943, 217075, 304256, 466479, -92159, 183678, -1999, -10965, 297643, -77809, 135048, 99148, 226061, -104551]
12078e34C10733A8433J89026a16035F081N2276e8348A10153m3291A9532J62364
12067A81896c46438D12555c1629j46416B77792i7640E2526K01989A07765m3287
12057F4478J58167d0650j39495C75425H8319N4808P6879r5090n2147b07507A69229
12045B47558n3411o150K6322r9689b19703H6674B3706P6368i4141A23744d22655
12033A256a97825L8044B58423a13642B3662a02633b7167j43354a7568m28427F9397
12021a97717E7000R2103j1435b1834k9125j68999C63861D3051b33425A9149J3378
12010C2527a54826E78d2088B66550c4008B05227O8961c28282b5502B23726a3437
11998A01982a53531g2613D49870i259k02618a6780c07k7199B19365H2916b1232
$$ y = [-534, 310733, 18433, 207459, -116035, 6081, 58357, -58348, 110153, 66862, 19532, 181896, -346438, 412555, -31629, -178045, 277792, -97640, 52526, 254515, 107765, 64478, 222645, -40650, -180145, 375425, 88319, 143127, 220006, 124916, 72769, -207507, 169229, 247558, 194147, 187997, 214319, 114630, -219703, 86674, 23706, 100074, -94141, 123744, -422655, 1256, -197825, -159781, 258423, -113642, 23662, -102633, -27167, -170521, -17568, -445995, 69397, -197717, 57000, 149103, 137668, -21834, -50959, -219958, 363861, 43051, -233425, 19149, 32527, -154826, 578, -42088, 266550, -34008, 205227, 274188, -328282, -25502, 223726, -13437, 101982, -153531, -72613, 449870, -9259, -211877, -16780, -307, -27506, 219365, 82916, -21232]
11986A62393c110j37845A1634c40535C8472K9640a99389E6369J4251d8824E589
11974B62418c1612A55598b75972L6377I656d6488k77921J44248h1217C18769e483
11962a24191j40038h8051M2870B8929a49378e059H2165a11912B25395F8161c87597
11950a45273c1492r7466M0486B54245j16451a13594F0627d5469j36731a8371G585
11938a21647m0298h229j07177D0501d6312j31053B47302b33426K1867f9961I688
11926G130B580a73695L1966A89747a58833j0376D8867B3777b219B46869e9273
11914B57822l6677g061D8416j7984a25732f796k33842A50022f7545I0206b30557
11902E5794C260a92035M6358C5696a87761B4097N2439K4272a28458J2355G9430
$$ y = [162393, -3110, -140955, 11634, -340535, 38472, 68112, -199389, 56369, 70620, -48824, 5589, 262418, -31612, 155598, -275972, -239595, 9656, -46488, -324409, -180161, -81217, 318769, -5483, -124191, -264229, -88051, -45181, 28929, -149378, -5059, 82165, -111912, 225395, 68161, -387597, -145273, -31492, -128958, -88472, 254245, 137794, -113594, 60627, -45469, -182200, -18371, 7585, -121647, -161945, -8229, -115406, 40501, -46312, -177365, 247302, -233426, -211559, -69961, 9688, 7130, 2580, -173695, -141729, 189747, -158833, -169209, 48867, 23777, -2219, 246869, -59273, 257822, 221145, -7061, 48416, 30432, -125732, -6796, -240638, 150022, -67545, 90206, -230557, 55794, 3260, -192035, -145677, 35696, -187761, 24097, 76536, 100808, -128458, -116103, 79430]
11890A04762R825K63072d3413C6614J79405C9871a73600I6663b2462m1388m71
11879f4321k11475b0025q6434b0730J0276n743p3682A52332a77961e6760r423
11868f6183p1044q4869A62680F4406b11032A07771d1001a0539j77722B46954b79731
11856b9533j62200Q3904K8497C2258a8356q4726D4688A52K62289a93176L7553
11845a55623B42139E145O5319a73007Q2449h699l65611B86688E3711B3452c6551
11833B63886b25506j61586B6378c37340b2483c034j04242D5200f0634n2931e1194
11821I5263b6885m4216E4333J05001e4757A25604E1129c7545a1987J619j96789
11810b07157E7988f3972C6646Q0203J7092c80965J45362d6490I5086e2051k9328
$$ y = [104762, 114587, 377659, -43413, 36614, 216019, 39871, -173600, 96663, -22462, -63850, -64321, -275796, -20025, -106459, -20730, -10454, -16197, -89879, 152332, -177961, -56760, -66183, -137227, -222096, 162680, 64406, -211032, 107771, -41001, -10539, -188261, 246954, -279731, -29533, -191733, -107829, -79332, 32258, -18356, -103082, 44688, 152, 262441, -193176, -155623, 242139, 5145, 70464, -173007, -90558, -8699, -374310, 286688, 53711, 23452, -36551, 263886, -225506, -387092, 26378, -337340, -22483, -3034, -107276, 45200, -60634, -113565, -51194, 95263, -26885, -71101, 54333, 159334, -54757, 125604, 51129, -37545, -11987, -10368, -207157, 57988, -63972, 36646, 116849, 133941, -380965, -235603, -46490, 95086, -52051, -81379]
11799h1379G9764a26883B7862K21799A2910b54714a15858M8628k99896a79796
11788D0783e7004I1140b86971B36427B9839a5545n6743j93259A64739c70642a60086
11776c9832E7777J22471B7783c48675a48400E6102B2662o630N45045A52489O2541
11765B15030r984e7678C3114c87843A211b87816d4476B22179e7289C48019H727
11753B2798a27175b9168A90598q5705b04348A0369P9162Q2677a71806A06433a85843
11741a2397r4128D7733N3012e02825c5109A51758a47687c4720D9136b45953b40
11729f1584o7556D7517R1252J46079r1446a61226i107C3362L2392m275K35898
11718B97377f1851J1670A71563J69101A50937R894d2290j6555j34472G885a91376
$$ y = [-81379, 79764, -126883, 27862, 249661, 12910, -254714, -115858, -67230, -367126, -179796, 40783, -57004, 91140, -286971, 236427, 29839, -15545, -72288, -265547, 164739, -370642, -160086, -39832, 57777, 180248, 27783, -348675, -148400, 56102, 22662, 16032, 561077, 152489, 215030, 205046, -57678, 33114, -387843, 1211, -287816, -44476, 222179, -57289, 348019, 8727, 22798, -127175, -29168, 190598, 104893, -204348, 10369, 89531, 172208, -171806, 106433, -185843, -12397, -106525, 47733, 100745, -502825, -35109, 151758, -147687, -34720, 49136, -245953, -240, -61584, -129140, 47517, 138769, 284848, 193402, -161226, -9107, 33362, 65754, 61479, 297377, -61851, -50181, 171563, 340664, 150937, 160831, -42290, -58845, -193317, 7885, -191376]
11706I8966a41624O1467I39f5709B05327a29091j00829A0675c2113B80217e5328
11694a57284e3078p2271a8351C68563C718a30797A8678K46420C9788f6646b9904
11682f7536b4576j945A7409N3903c02414J35692J6216j4228A42618g4878l976
11671g8854h966A10485i5614E19757i5575G062b02048k2519A42834j4364C7974
11659D3050h4850b049k3127k00607I8956g4253K6238m6188A30495k1112b26796
11647a07922B1537J01803L2763b11017B8245c74244D3544b8735n8897B1175K67416
11636B88591b92050e6340B2812R6672k0939K4547C1985a57588B15003o2821f3696
11624e5269A683c08674e8067H5357i0431D9437a70638F8743J58900b5523j80287
$$ y = [98966, -141624, -80157, 939, -65709, 205327, -129091, -229920, 10675, -32113, 280217, -55328, -157284, -53078, -125349, -18351, 368563, 3718, -130797, 18678, 265098, 39788, -66646, -29904, -67536, -24576, -26521, 17409, 71312, -302414, -166722, -150506, -164734, 142618, -74878, -78854, -8966, 110485, -95614, 519757, -95575, 7062, -202048, -224567, 142834, 128470, 37974, 43050, -84850, -2049, -25176, -225783, 98956, -74253, -48015, -94203, 130495, 109383, -226796, -107922, 21537, 123340, 156103, -211017, 28245, -374244, 43544, -28735, -87632, 21175, 288591, -292050, -56340, 22812, 119484, 98545, 123092, 31985, -157588, 215003, 152182, -63696, -55269, 1683, -308674, -58067, 85357, -90431, 49437, -170638, 68743, 227643, -25523, -205810]
11613b05810B0935J22894a7524B73416A7026a32000C9085L6309l2295K92056a63074
11601d5789A33420c1369j87034A9560a92215A09504Q2224a00656C12754j51307
11591A61447c99902J93175A08361a10085k36235I3093R959m0264O9669K04392
11581C36849a77917f7130R290A43438J7153r505h5006F2061a10733b4545I9437
11569b38086A82495E5099J14672b4146A38828j4616Q6496a9502B68075o6465a32489
11557C47431b63764A54303f4478B5435c86536C85392A16834b32651B22486k9645
11547A92841c1402B08790a32686D7066J1340e1770A85251a9670j35210C20968
11536a17637I4363j9426L51091A59050K3754b08208I7478a61925Q641I0492J01330
$$ y = [-205810, 20935, 143829, -17524, 273416, 17026, -132000, 39085, 75394, 43099, 335155, -163074, -45789, 133420, -31369, -218403, 19560, -192215, 109504, 191728, -100656, 312754, 161447, -399902, -206727, 108361, -110085, -346320, 93093, 103052, 62788, 132457, 336849, -177917, -67130, -57840, 143438, 160591, 151086, -85006, 62061, -110733, -24545, 99437, -238086, 182495, 55099, 169771, -24146, 138828, 124212, 210708, -19502, 268075, 201610, -132489, 347431, -263764, 154303, -64478, 25435, -386536, 385392, 116834, -232651, 222486, 192841, -31402, 208790, -132686, 47066, 58406, -51770, 185251, -19670, -154880, 320968, -117637, 94363, 74937, 426028, 159050, 182804, -208208, 97478, -161925, -153284, 90492, 191822]
11525A91822B7316a22627B27561J7152O1441k1471R9928b06939i6260b0965i47
11513e6050d679A36299a45016D3497a83123k25218E33365k66117q8431E2608K16035
11502B68643b96B25104q9318b08768A54284a40368E7226O8304R5405A10259a87725
11490C15688a76922O2402d4968B69363a36123A94601p2870G077J98737m4118g7645
11478G318J83759g1381j62448J6389f9582B73701H0337b7520a1248k9664m3540
11467h4452C70023M6174A14977b0436o2214j32495C35390b74233A12517M4256
11457A56773p8368K83973q2898a01412B20691F6309J20528e432r1595A75888q6403
11446H9485J70180p6640E712J11566R471b1854n1355A99507a19768I9879O6994
$$ y = [191822, 27316, -122627, 227561, 244713, 306154, 284683, 384611, -206939, -96260, -20965, -947, -56050, -4679, 136299, -145016, 43497, -183123, -408341, 533365, 267248, 178817, 52608, 268643, -296, 225104, 135786, -208768, 154284, -140368, 57226, 125530, 220935, 110259, -187725, 315688, -176922, -114520, -44968, 269363, -136123, 194601, 121731, 7077, 205814, 161696, -77645, 7318, 191077, -71381, -233829, -217440, -69582, 273701, 80337, -27520, -11248, -40912, -84452, 370023, 416197, 114977, -20436, -82650, -215145, 335390, -274233, 112517, 156773, 78405, 362378, 279480, -101412, 220691, 66309, 186837, -5432, -97027, 175888, 89485, 259665, 183025, 5712, 117278, 126749, -21854, -73209, 199507, -119768, 99879, 166873]
11435A66873m3375R383L283J72257j27351B9624P9585d23j75715A16084a38043
11423a80212B54876n222K262i6261A4280J89878J1272K20751i2084C78918a6902
11411F7379b74854e9151B05067F3131a60807C09473b70112D4025D284c0004A04103
11399B53096a30321b9017j203j45504d0964j06106o5900A30006h2187J5894A0930
11387a09954j3138D3393K67455A6989a57892a2056j19445I1946B5430K54724f3935
11375a48013A30713A30P0119f3132k18654K3273J01315A2071Q9789c97412A4542
11363B07420b73799O4276J5172P1951H467g5746F7289J47260h9332k1835A29029
11351g8397I217b1484G7113c22049J45042A52187D4655h8123k4235F8832j6857
$$ y = [166873, 123498, 132881, 136164, 308421, 181070, 29624, 109209, -423, -176138, 116084, -138043, -180212, 254876, 249654, 251916, -96261, 14280, 204158, 215430, 436181, -92084, 378918, -16902, 67379, -274854, -59151, 205067, 63131, -160807, 309473, -270112, 44025, 4284, -30004, 104103, 253096, -130321, -29017, -30220, -175724, -40964, -147070, -212970, 130006, -82187, -66293, 10930, -109954, -123092, 43393, 310848, 16989, -157892, -12056, -131501, 91946, 25430, 280154, -63935, -148013, 130713, 130, 70249, -63132, -281786, -258513, -157198, 12071, 101860, -397412, 14542, 207420, -273799, -209523, -194351, -122400, 8467, -75746, 67289, 214549, -89332, -111167, 129029, -78397, 9217, -21484, 77113, -322049, -177007, 152187, 44655, -88123, -112358, 68832, 51975]
11340E1975f1044a2687C4078J85937E7501J2831R7358d25920a60796B3862J42138
11329A66000b12801i9162k71045A01274b01789A1362b815l5927j43925O4820B48789
11317B07566H9972b50327B1755a05421A9848J22980l1862a5820o3728I2558c57495
11305A13423a43393A79598B7415P3291J42334j07559a78863A40075j1468c70838
11294d6751A8341a92767e41G1556F200M2149b3449j66555G6043d68879A10721
11282d65269A71723c03458J18337a8466j18980n6244l8733B621a38257F7383b46892
11270c6873m28901B07823B2358J78746F4045K23682H4780l2159i9973b0222G1761
11258a5173j33470c6057B90307a39766F3964a00280r7752P53B80562A8825d8663
$$ y = [51975, -61044, -12687, 34078, 220015, 57501, 70332, 167690, -425920, -160796, 23862, 166000, -212801, -99162, -370207, 101274, -201789, 11362, -2815, -38742, -182667, -117847, 248789, 207566, 89972, -250327, 21755, -105421, 19848, 142828, 110966, -15820, -79548, 92558, -357495, 113423, -143393, 179598, 27415, 100706, 243040, 135481, -178863, 140075, 128607, -370838, -46751, 18341, -192767, -541, 71556, 6200, 48349, -23449, -190004, 76043, -468879, 110721, -465269, 171723, -303458, -185121, -18466, -137446, -193690, -232423, 2621, -138257, 67383, -246892, -36873, -465774, 207823, 22358, 201104, 64045, 287727, 84780, 52621, -99973, -20222, 71761, -15173, -148643, -36057, 290307, -139766, 63964, -100280, -198032, -197279, 280562, 18825, -48663]
11246F4822D798K20797a6290A59293b80121J37035H1449J67227B9755M7563B5887
11234a48967B08016a25879A35829B7741b1533l67530J59839J02676m5943I6255
11223B07701a24669c4522B34443a73708o7097A65137Q4555i4815A74971d22137
11212c455j67458I7924a5086j08139J7207j65742J32801N2126J1151A95381d1340
11200F0445P0692e2571A58685p463c27319A53626b42771f4977D02741a90217C6683
11188b1178j76706j54191g7247J0261K947l1725E4219i2678k60750O1154K7227
11177b65047a16935k20246D0100K9991a7144k01839g9425R337j37964A67447i9245
11165A50821b29864N3856d9228C11510j47319k5600f2945j70065e265k25076N7556
$$ y = [64822, 4798, 225595, -16290, 159293, -280121, -143086, 81449, 248676, 29755, 77318, 25887, -148967, 208016, -125879, 135829, 27741, -21533, -389063, -229224, -126548, -172491, 96255, 207701, -124669, -34522, 234443, -173708, -240805, 165137, 249692, -94815, 174971, -422137, -3455, -170913, 97924, -15086, -123225, -106018, -271760, -138959, -86833, -75682, 195381, -41340, 60445, 131137, -52571, 158685, 151222, -327319, 153626, -242771, -64977, 402741, -190217, 36683, -21178, -197884, -352075, -77247, -66986, -64039, -95764, 54219, -92678, -353428, -292274, -265047, -116935, -337181, 40100, 70091, -17144, -218983, -79425, -70088, -208052, 167447, -99245, 150821, -229864, -176008, -49228, 311510, 164191, 138591, -62945, -233010, -5265, -230341, -172785]
11154a72785A64364J88127g0053A67441n1183c4128E1560J8542a70532h0759j39696
11143b20455m0361f9916B14907i2352L6671o0760K3306p4231f9796j24395E0909
11131C19567a07962c7192k865B3647b26602A76312J93357A63716B3323a64074
11120a34212C04080a93269J5634m6622f6734A15173f6824r738k3314E6731a19300
11108A05397b72132A2830e8042k46197D7033C690a9874B09899b88199D0952j8772
11097B2180e5963k3345f577A0524b27756B17685b46344A89762K8914A980K28023
11086B30003o2068a41449G5116g7152H6409K79507F0498O899R416k8524J03502
11075A51791b86696A32215O687M9933K14679a3321C62508c9400C66274G4871J00001
$$ y = [-172785, 164364, 352491, -70053, 167441, 116258, -34128, 51560, 70102, -170532, -80759, -220455, -260816, -69916, 214907, -92352, -55681, -116441, -93135, -167366, -69796, -194191, 50909, 319567, -107962, -37192, -40057, 23647, -226602, 176312, 369669, 163716, 23323, -164074, -134212, 304080, -193269, -177635, -224257, -66734, 115173, -66824, -76562, -99876, 56731, -119300, 105397, -272132, 12830, -58042, -304239, 47033, 3690, -19874, 209899, -288199, 40952, 22180, -55963, -79308, -6577, 10524, -227756, 217685, -246344, 189762, 218676, 1980, 230003, 167935, -141449, 75116, -77152, 86409, 365916, 60498, 67397, 76813, 48289, 151791, -286696, 132215, 138902, 188835, 403514, -13321, 362508, -39400, 366274, 74871, 174872]
11064A74872b2240H8216L17205a52427d7810B27094N4759e7520p284C01787D4501
11052B90675J27760B00994L22775B54173Q1067p3946m2238L99387A46281n6054
11042I0227M49673o4666J56783k76006q8387K20456M6241K20833o921j56649j23148
11031D68436B33707N18040j65292K52006k14577r6208K61819C31556L41988C14503
11020H68401l71532P584L7926K84480N5295l22930j82404M31878j45781k2087
11010F40830k73916M88677m24252j53399L33721k23376p8033o753J37766J26292
11000E67557J71158j92832j43458K30083p2192n0434j07432J5541K4964p5161
10990C67794m4588L10385K96999G5027M37186P6078J54164B28764J52786m9816
$$ y = [174872, -22240, 88216, 405421, -152427, -47810, 227094, 281853, -57520, -64804, 301787, 44501, 290675, 418435, 200994, 523769, 254173, 335240, 261294, 219056, 618443, 146281, 90227, 539900, 475234, 632017, 356011, 267624, 488080, 534321, 755154, 748233, 591584, 468436, 233707, 751747, 586455, 838461, 623884, 527676, 789495, 331556, 673544, 314503, 868401, 496869, 504453, 542379, 826859, 882154, 559224, 376820, 808698, 662917, 640830, 366914, 855591, 431339, 277940, 611661, 388285, 310252, 303499, 441265, 567557, 738715, 545883, 402425, 632508, 560316, 509882, 402450, 417991, 442955, 367794, 323206, 633591, 930590, 75027, 512213, 588291, 742455, 228764, 381550, 331734]
10980C31734L53814C30696J50232j7357K70004m9183p6292K51894k7371m071j79196
10969F49356r4799J28624J96157k95153O10472l80304J36624l9451K43226o5310
10959A089442K43265O324J17397N3505L64641K87023l34845L52926k91375l05284
10949A583019J19138l27558K027n0655j13838j17792K75479j07057L58275k72742
10939A348296J89684J42147k68417J52740m88447L26513n66713N33188E27061
10929C81423K56922J0065k68600I0489J43020P7907A30288g656p1858i680B00406
10917b24476O9469j01154B48314k2834o426E0721b9722J4711q6754B85743I2870
10905b36331b0650j24422A58227C0052L6815n879b63545i3291I6192c9085E3229
$$ y = [331734, 685548, 330696, 480928, 463571, 733575, 684392, 608100, 859994, 832623, 828552, 649356, 554557, 683181, 879338, 584185, 1194657, 814353, 950977, 911526, 1154752, 1089442, 1332707, 1339031, 1456428, 1509933, 1874574, 2161597, 1826752, 2179678, 1888303, 1583019, 1702157, 1374599, 1376626, 1325971, 1212133, 1094341, 1369820, 1262763, 1621038, 1348296, 1537980, 1680127, 1411710, 1564450, 1076003, 1402516, 835803, 1368991, 527061, 381423, 638345, 648410, 379810, 90489, 233509, 311416, 130288, -7656, -79514, -9680, 200406, -224476, -155007, -256161, 248314, 225480, 219054, 50721, -29722, -15011, -101765, 285743, 92870, -236331, -20650, -145072, 158227, 30052, 66867, 60988, -263545, -93291, 96192, -39085, 53229]
10893f6872l6213C6234c2642I8139a27407A95540e0285A9596N7298k8568o15a25538
10880b51340A55434j4694c10754k47985B64860b19516D01464j85864d49348E2398
10869A30158b39871B8110d23736a40230F1052a25597j57837a5923A39951B286
10858h4064b1411r88B15536b88013D9790a6552A32797n9394N4358M8780a50532
10846C6726R5187a3666k53703f6073K2584D5826a12051k5946q9219f8092p4797
10835a42889C17826q0913I3525h6706G1473j4730D483c60074d7527j83179B1272
10823a78973B2828f872A55003a42459N0377C79065a02105A11758K02111a0437
10812b6141L124o2708k35253d8791A16887c348C4517a31050A33910M5378F1958
$$ y = [-66872, -103085, 36234, -32642, 98139, -127407, 195540, -50285, 19596, 76894, 48326, 47711, -125538, -251340, 155434, 140740, -310754, -558739, 264860, -219516, 401464, 215600, -449348, 52398, 130158, -239871, 28110, -423736, -140230, 61052, -125597, -283434, -15923, 139951, 2286, -84064, -21411, -22399, 215536, -288013, 49790, -16552, 132797, 73403, 127761, 176541, -150532, 36726, 131913, -13666, -267369, -66073, -43489, 45826, -112051, -137997, -227216, -68092, -142889, 317826, 236913, 93525, -86706, 71473, 56743, 4483, -360074, -47527, -230706, 21272, -178973, 22828, -6872, 155003, -142459, -92082, 379065, -102105, 111758, 313869, -10437, -26141, -23017, -85725, -320978, -48791, 116887, -3348, 34517, -131050, 133910, 179288, 61958]
10800i0599A75486j5514C761b21562e2973k83129c3939r3516l7078b2889j19362
10789a42251b175A2010d33102K13491K771D9490J0510i79o2515P292k85562i8468
10776e6666F0907L52962i817l5581B64991b57849b439G5529J78356c03058A13364
10764A82776m0402i3850M1982l15754a30468C913M6179c75825J82269j6208f1683
10752B05484k3882G7000b3479G148J66541a23429K9920K9948K1956a3431A19529
10740c17378R393g6376i347r9142j40881l856B02232a91806A19117a77600A73016
10728G8337J05081B1324K16065A14057d0534m313A25779B6422a64998A7797i0131
10716A0133i4388l0688e8153j35134h4580k6614A89793a24302M9166j38892A17457
$$ y = [-90599, 175486, 159972, 3761, -221562, -52973, -336102, -33939, -127455, -164533, -22889, -142251, -2175, 12010, -433102, -219611, -216840, 49490, 60000, -979, -63494, -56202, -341764, -98468, -56666, 60907, 413869, -9817, -45398, 264991, -257849, -2439, 75529, 253885, -303058, 113364, 182776, 142374, -93850, -51868, -367622, -130468, 3913, 50092, -375825, -193556, -209764, -61683, 205484, 181602, 77000, -23479, 7148, 173689, -123429, -93509, -63561, -41605, -13431, 119529, -317378, -307985, -76376, -9347, -108489, -249370, -253226, 202232, -191806, 119117, -177600, 173016, 78337, 183418, 21324, 237389, 114057, -40534, -44847, 125779, 26422, -164998, 17797, -90131, 10133, -94388, -125076, -58153, -193287, -84580, -111194, 189793, -124302, -75136, -214028, 117457]
10704b39806e1913p1111c2310m1817G0619a59455F2763j8319a65383m8505A81638
10692b10310A2048d69404a68151B16546g4887K3588j08353H41c1579k54215g7899
10680a00021j4993j53382F3565b81266a27652j53660a26490j5139E1183J60352
10670B11535a01805A0583b10760C0009a01298M8782B62425a90785k35649A60684
10659A48131h9064A48437L2040p9449A1114J35071a73046a7895l50317c4984m6571
10648h1555k45472a15813j03092f8529p5914c5886j01381L3118p4895n3434J2610
10637b19868J04803j83566R6502n9939A44912i7214I4803g097H9020c15285a24950
10625f512l10801g2060k99789I075G72a54907n985a4563I9925J99768j14904j611
$$ y = [-239806, -51913, -123024, -32310, -74127, 70619, -159455, 62763, 44444, -165383, -213888, 181638, -210310, 12048, -469404, -168151, 216546, -74887, -51299, -159652, 841, -31579, -285794, -77899, -100021, -115014, -268396, 63565, -281266, -127652, -281312, -126490, -141629, 51183, 211535, -101805, 10583, -210760, 30009, -101298, -52516, 262425, -190785, -426434, 160684, 148131, -89064, 148437, 180477, 101028, 11114, 146185, -173046, -17895, -368212, -34984, -81555, -327027, -115813, -218905, -68529, -144443, -35886, -137267, -104149, -179044, -232478, -219868, -115065, -298631, -202129, -262068, 144912, -97214, 94803, -7097, 89020, -315285, -124950, -6512, -317313, -72060, -371849, 9075, 772, -154907, -160892, -14563, 99925, 299693, 184789, 183178]
10613A83178i6305F9219a07089A99963i4856l2770Q549L7903A91756c9240j64968
10602b04208P266F3144a20458B8713J37250b36897a7137A09918a70923c4261k53090
10591b87351J03214c8395o412E9917J07138q0747N6090l5433b05168B39822a88984
10579a17597I9823a64612k74025J59386F0456a03386A46563h1154l63798K15537
10569b29415j0443B46438q1726l2607R7146A10596a16589I8133L2479K3690H989
10557b44386N3096A19193b72057J4926j07790e8009A09748c1592B09795d4203
10546C0434b3046d605C5418i6291B49485p1729D2341A0364g3627j78306A80552
10534a8297A4034J87984a4165F8888a48400F9837c67055L8991A87106h5866G5015
$$ y = [183178, -96305, 69219, -107089, 199963, -94856, -127626, -119077, -81174, 191756, -39240, -204208, -196942, 63144, -120458, 28713, 165963, -236897, -17137, 109918, -170923, -34261, -287351, -184137, -38395, -44807, 59917, 167055, 86308, 142398, 106965, -205168, 239822, -188984, -117597, 99823, -164612, -438637, -279251, 60456, -103386, 146563, -81154, -444952, -229415, -239858, 246438, 164712, 132105, 229251, 110596, -116589, 98133, 130612, 154302, 8989, -244386, -191290, 119193, -272057, -257131, -364921, -58009, 109748, -31592, 209795, -44203, 30434, -23046, -4605, 35418, -96291, 249485, 177756, 42341, 10364, -73627, -251933, 180552, -18297, 14034, 202018, -14165, 68888, -148400, 69837, -367055, -328064, 187106, -85866, 75015]
10522a50829k6306i120B50559c34605l03046a69180G0488b35136F70i6439k42936
10511c39375a21405A13252h2703c232l43472J64320H2561e9076C220J8697P8816
10500A00733a54140M957A02867b84815Q949a30283F0961Q5721c67806A70057f579
10488e9959q047I0525l0747J31724B6036a5409B0735J9619e0880j70495A85329
10476A600J94805C8930g5295A86498p0007a99585A39022k4346e866A0644g4952
10464I2499Q6846k675J31412I9725K52599m4231l0136J40104a68511D4914J68375
10453B13289b89580A45918Q033a21119m532j11606A44610a04118a6454H543N4168
10442F2711d45798d6438A87249p0810a3475E4112g8959m509r4967K3746l1765
$$ y = [-150829, -177135, -9120, 250559, -334605, -637651, -169180, 70488, -235136, 670, -96439, -339375, -121405, 113252, -82703, -3232, -346704, -182384, 82561, -59076, 3220, 21917, 100733, -154140, -149183, 102867, -284815, -275866, -130283, 60961, 146682, -367806, 170057, -6579, -59959, -68006, 90525, 59778, 191502, 26036, -15409, 20735, 40354, -50880, -221375, 185329, 1600, 196405, 38930, -75295, 186498, 116491, -199585, 139022, 114676, -5866, 10644, -74952, 92499, 179345, 176670, 308082, 99725, 352324, 308093, 277957, 418061, -168511, 44914, 213289, -289580, 145918, 153951, -121119, -125651, -237257, 144610, -104118, -16454, 8543, 62711, -445798, -46438, 187249, 116439, -13475, 54112, -78959, -83468, -178435, -154689, -186454]
10431a86454A0296a10491J6416C6107d0823A50442G1340a2680E6037Q5699f9469
10419e9758m6777B4526d5128l6309E7K76363b60019g560l84172C16806j18429
10408A98377G9727b88215f9580F1112a91209j32727A41949R506a43384l7589A06353
10396b88953E3166d1688j28095B11336c695G023K3866J44805f8502B7788J0650
10385C8438c19228E7311C789A377e0615G5490B0139P3489b68649F2076K85193
10374C47269A69619a4794q4002C07613n3828A15362e65740a35104e6655l2416
10364h9071A03763K12313Q8765B02077c8681A18012J83207j11863D2566K70931
10354C13497P1638A62724Q9400F4148K54473K29201J4574A94588J52915A37410
$$ y = [-186454, 10296, -110491, -94075, 36107, -40823, 150442, 71340, -12680, 56037, 141736, -69469, -59758, -106535, 24526, -45128, -81437, 57, 276420, -260019, -7560, -391732, 316806, 198377, 79727, -288215, -69580, 61112, -191209, -323936, 141949, 151455, -143384, -180973, 106353, -288953, 53166, -41688, -169783, 211336, -3695, 7023, 30889, 175694, -68502, 27788, 38438, -319228, 57311, 3789, 1377, -50615, 75490, 20139, 93628, -268649, 62076, 347269, 169619, -14794, -98796, 307613, 253785, 115362, -565740, -135104, -56655, -89071, 103763, 316076, 404841, 202077, -38681, 118012, 301219, 189356, 42566, 313497, 385135, 162724, 252124, 64148, 318621, 547822, 562396, 194588, 347503, 137410]
10343d6208B72067l3926m7464K81310B16462L0217p0350L67661d81789B40048
10332F49192C19425J28603B20284r7497e9601D54320m1580K74840g9732F963P54064
10321G61027I5265M81798G1559a19892M1728j35017f9403A22820m9973c4577D4243
10309a12468O152I4063m402A1585L1443M4091I873e9116A02818a43122G9187A7221
10296C2421L0980L70550B7156J70278k0874J21661q6921H1242b71859C7585M8679
10285H6264b01655k8100E7632j6422P0831d9380A10649a20277j34532R9186d4007
10273b8935H4551C9210h8622d0330A4962P1978f1934B71098b88413f7966B44216
10261D4800J44896F8558a16159l57373C33821d9062j96310R9412A63605b47850
$$ y = [-46208, 272067, 238141, 190677, 471987, 216462, 246679, 176329, 543990, -481789, 240048, 649192, 319425, 448028, 220284, 122787, -59601, 454320, 412740, 687580, -79732, 6963, 761027, 95265, 577063, 71559, -119892, -78164, -213181, -69403, 122820, 72847, -34577, 44243, -112468, -106316, 94063, 89661, 11585, 43028, 87119, 9873, -59116, 102818, -143122, 79187, 17221, 32421, 63401, 433951, 27156, 197434, 176560, 298221, 211300, 81242, -271859, 37585, 86264, -201655, -229755, 57632, 41210, 112041, -49380, 110649, -120277, -254809, -155623, -44007, -28935, 84551, 39210, -88622, -40330, 14962, 86940, -61934, 271098, -288413, -67966, 244216, 44800, 189696, 68558, -116159, -473532, 333821, -49062, -245372, -145960, 163605, -247850]
10250f7378j94515C7438a74722B09943d3769C24441A26203C3918J95374Q3650
10240C12942K26838A39334J53372k0122A10806E2553k2513c5895q0810m7673m470
10229a68848f9181A59524a26150f1844j33808M1759J128O1592k85214a34578a4235
10217c77971a77618j19297H8578a31587b5592B83183D8941h7852q2980B58283
10206a02822m7167A52896a70510A73615J07598G7054e72415a86249N745b0389
10195a63937f1711F3281O3048b52509a13509H3872P7517R5846g555l73495D8084
10183g3141E273a25634B36032D2168b48549e4189a1265k82168B56660j18247c45813
10171b7854F6257J5854J64969a21200q4671A93049c10725A74178b54335k06708
$$ y = [-67378, -261893, 37438, -174722, 209943, -43769, 324441, 126203, 33918, 229292, 312942, 539780, 139334, 292706, 272584, 110806, 52553, 30040, -35895, -116705, -164378, -168848, -69181, 159524, -126150, -61844, -195652, -153893, -152765, -91173, -376387, -134578, -14235, -377971, -177618, -296915, 88578, -131587, -25592, 283183, 48941, -87852, -170832, 258283, -102822, -149989, 152896, -170510, 173615, 281213, 77054, -572415, -186249, -180504, -20389, -163937, -61711, 63281, 126329, -252509, -113509, 83872, 161389, 257235, -7555, -381050, 48084, -73141, 5273, -125634, 236032, 42168, -248549, -54189, -11265, -293433, 256660, 138413, -345813, -27854, 66257, 82111, 247080, -121200, -205871, 193049, -310725, 174178, -254335, -461043]
10161d61043A26475L0811G5976f6233j72568J04275C3421b12296n1268B4247b06482
10149d09137a7214l05190j32907C0055J42938j0438b81030C20364a64067A2585
10138a01390p6792d3077A86245a02812B1364b83509d0202j84971B25068a54832
10127h1490G1535a73768c4789n3911k10509K9329E5299h9011j3161k14232J47211
10116a69193f4451C1945b9134j51335I4107f1763r1697O9865A16736b03421H3257
10104i3041p7220A664K43513F9622b2878n3375j73426K8573h0528j2724j80019
10093b73271e5990j29728k1106i1776G6048b24594l1542N9161f5298A30035l0968
10082I9067m4062b6520k1366j59273L4126F8700h0661I375J06002b55007O2319
$$ y = [-461043, 126475, 157286, 75976, -66233, -238801, -134526, 33421, -212296, -263564, 24247, -206482, -409137, -17214, -322404, -455311, 30055, 172993, 162555, -281030, 320364, -164067, 12585, -101390, -178182, -43077, 186245, -102812, 21364, -283509, -40202, -225173, 225068, -154832, -81490, 71535, -173768, -34789, -88700, -299209, -269880, 55299, -89011, -102172, -316404, -169193, -64451, 31945, -29134, -180469, 94107, -61763, -153460, -83595, 116736, -203421, 83257, -93041, -170261, 1664, 245177, 69622, -22878, -76253, -249679, -221106, -80528, -93252, -273271, -55990, -185718, -206824, -91776, 76048, -224594, -256136, -196975, -65298, 130035, 99067, 55005, -26520, -47886, -207159, -173033, 68700, -80661, 9375, 115377, -255007, -192688]
10071a92688F2985a99765a4577j22435j00728j1357i5030j16652K021a00010p9527
10060a79537B5557E883a85832I1013b22823B09918I3070L8475a69910b1187Q904
10049a2283k73680G2862J8984P0406a53705n1518G1549a70333g9367E2821L7430
10038I0251c6519B6741c97826d37j3164n4718A91069I3643i619D5316b43813a1553
10025C0057a83832h8853A10450c51493d2687n05175a46749j8776a0465B82032
10014b86137f3397b6247D8967g3493i44k77411h1915C70659i4553A12231J33731
10003B45962f2617A00244M9812k9953J49611b32852d9793m4182l0863k3516k18163
9992c66517a50708j33378A19610b20457A34258O489h5042m94128C4699b15866
$$ y = [-192688, 62985, -199765, -14577, -137012, -237740, -249097, -95030, -211682, -209661, -100010, -179537, 25557, 5883, -185832, 91013, -222823, 209918, 93070, 131545, -169910, -21187, -12283, -285963, 72862, 91846, 162252, -153705, -205223, 71549, -170333, -79367, 52821, 90251, -36519, 26741, -397826, -437, -13601, -68319, 191069, 93643, -9619, 45316, -243813, -11553, 30057, -183832, -88853, 110450, -351493, -42687, -547862, -146749, -165525, -10465, 282032, -286137, -63397, -26247, 48967, -73493, -944, -278355, -81915, 370659, -94553, 112231, 245962, -62617, 100244, 150056, 120103, 269714, -232852, -49793, -93975, -124838, -148354, -366517, -150708, -284086, 119610, -220457, 134258, 140747, -85042, -579170, 34699, -215866]
9981c4115r3024E4655c87692A03978E1678b74152A44480a00898M0998D4766h6735
9969a79314k07201a76183l5069D0716b9293A4537K3622f0066k51904G2921R1990
9958A64911b10455N0545B60485a03248q1522E5490L30367i25k81157H6392a31036
9946h2734B99462F314a36348k15271M8065A05375d75667f3554J5165C5016K68322
9935C03338b8811B03861b83245f7157G9038c27509C6669J95923a41529B10031
9924a71988A40594J04385f4965j32710K6118a4386E579K4749N9813R7653c5874
9912A6976J4115b4731C77141o6459d95500A02301b13260F3429I209b60998B8119
9900g4242o505j66476A29937b17030M0681B59149F0438c77366A36505a35859n6068
$$ y = [-34115, -127139, 54655, -387692, 103978, 51678, -274152, 144480, -100898, -59900, 44766, -86735, -179314, -386515, -176183, -211252, 40716, -29293, 14537, 38159, -60066, -311970, 72921, 164911, -210455, -159910, 260485, -103248, -184770, 55490, 385857, -925, -282082, 86392, -131036, -82734, 299462, 6314, -136348, -351619, -303554, 105375, -475667, -63554, -48389, 35016, 303338, -28811, 203861, -283245, -67157, 79038, -327509, 36669, 232592, -141529, 210031, -171988, 140594, 244979, -64965, -197675, -171557, -14386, 5579, 30328, 90141, 187794, -35874, 16976, 31091, -24731, 377141, 310682, -495500, 102301, -213260, 63429, 9209, -260998, 28119, -74242, -80747, -247223, 129937, -217030, -176349, 259149, 60438, -377366, 136505, -135859, -191927]
9889a91927g9781E6429g0305q3384A65534a49198A5872K896a06908a3792k6888
9878d0680j2932j76362B68880a16630M0098j51912a09115j0952k50320d9324H4982
9866e17062a62675C0429b99896A88809a37138A99675H4525J62570b87725J752
9856b85973a13460c9833j60571C3499a3284G853c55446J16028e4987k76725e9553
9844a53522o636A36675e3469P314m402D3172e6483E6044b68335B26464c46516
9832a22729F185J64187a64627d7345l873k46578g6442q1435d2883j35444Q4687
9821i3640o268E3920f1174G4112l0779J2995a43995C0835b5424j25036M2905R266
9809i8289c7762E8284i8258j11416j20395a10657l2795D7410e6591k78539a21853
$$ y = [-191927, -79781, 56429, -70305, -153689, 165534, -149198, 15872, 18768, -106908, -13792, -40680, -53612, -229974, 268880, -116630, -76532, -228444, -109115, -120067, -370387, -49324, 84982, -517062, -162675, 30429, -299896, 188809, -137138, 199675, 84525, 247095, -287725, -285973, -113460, -39833, -200404, 33499, -13284, 7853, -355446, -239418, -54987, -331712, -59553, -153522, -160158, 136675, -53469, -46155, -50557, 43172, -56483, 56044, -268335, 226464, -346516, -122729, 6185, 170372, -164627, -47345, -51218, -297796, -76442, -157877, -42883, -178327, -93640, -99908, 53920, -61174, 74112, 43333, 56328, -143995, 30835, -25424, -150460, -107555, -98289, -37762, 58284, -98258, -209674, -330069, -110657, -143452, 47410, -56591, -335130, -121853]
9797a09873o2547J6449K233J2692K6696k07478f9124I6285b15512e5628H9923
9785b43410N1115L0903n7573j69964J31912J9856I2309a33038j24295E8277a34010
9773A55346a85677j15414h482B28023h8285q41H0137L4567a58656j23533M1717
9762b40472j06523B4928J15200c69A89268a68864c3764j90321B3144e9165C07012
9750E6183b41329I404a66902D3577R0415B8208J47254f9669k04094C8158c89167
9738b35441R4006M2535d1060j03588l4222j18294J02569i281D6972a02025a1719
9726d64963c9238A3684K8247b74726H5542a00390J1101q0085Q2208j99919k347
9715b89432A0949p33P2753h9214n1676O0245j43254Q0408A01573B2068c54178
$$ y = [-109873, -172420, -155971, -153738, -141046, -114350, -321828, -69124, 96285, -215512, -55628, 89923, -243410, -192295, -161392, -218965, -388929, -257017, -237161, 92309, -133038, -257333, 58277, -134010, 155346, -185677, -301091, -8482, 228023, -88285, -89126, 80137, 114704, -158656, -282189, -240472, -346995, 24928, 140128, -369, 189268, -168864, -33764, -224085, 23144, -59165, 307012, 56183, -241329, 9404, -166902, 43577, 133992, 28208, 175462, -69669, -273763, 38158, -389167, -235441, -141435, -98900, -41060, -144648, -178870, -297164, -194595, -9281, 46972, -102025, -11719, -464963, -39238, 13684, 41931, -274726, 85542, -100390, -89289, -169374, -87166, -287085, -289432, 10949, 10216, 82969, -89214, -140890, -80645, -223899, -143491, 101573, 22068, -354178]
9703f827A45552c8185A25837l915i7750d6406a4091p3943G9879b07071d4727l5971
9691h0698d020A95540c7120l5317n9497j07050J4528A69652h4889Q687q7191C06927
9678A47352K2792i3910m9482O7102A03415d71831a00659B39291F1796a79530r6489
9667b76019c386l6802r0894A3329J08517P5525b78736O7313b6490k34901G9710
9655H9171b3438l45801B10009k3598p5485b07843A39959F7748d6011E093a47039
9643A01061d07315b4135F1110b949C714c41866L1172m1560J04512b8306p4293
9632a02599k58770A53129O9015l8306d28161a94268D2251L8919b18187j36360
9622c54547B35203h446j5816A3779J09720n2560K3529c45548K1544A60315f812
$$ y = [-6827, 145552, -38185, 125837, 121922, -97750, -46406, -14091, -88034, 79879, -207071, -44727, -80698, -4020, 195540, -37120, -72437, -131934, -238984, -224456, 169652, -84889, -76202, -163393, 306927, 147352, 170144, -93910, -143392, -76290, 103415, -471831, -100659, 239291, 61796, -179530, -276019, -3386, -40188, -131082, 13329, 121846, 197371, -278736, -211423, -26490, -261391, 79710, 89171, -23438, -369239, 210009, 186411, 110926, -207843, 139959, 67748, -46011, 5093, -147039, 101061, -407315, -24135, 61110, -2949, 3714, -341866, -310694, -352254, -247742, -28306, -102599, -361369, 153129, 222144, 183838, -428161, -194268, 42251, 81170, -218187, -354547, 235203, -8446, -24262, 13779, 123499, 70939, 94468, -345548, -324004, 160315, -6812]
9610C9604J18217h0060A00541a6288A31907Q6682h3320B89977a7002j70863A18465
9598A64927a74444L7239l22984A23179c02501c2138r9132N206q662K1723j0133
9587a23136c5919G1157b48909j13364G2923a0220j52645d6305A03514a61269k03832
9576c65101h373G1917a16096E7711a38409k8815o9234f5042R309k49654o138P9313
9564b32212b311j15785k4432A8932C093J99788a8398l65226h2229J8016A60646
9552B54962h4024c2303l4051r8453C8335g5225l7122A19893d55618A31217a10760
9540A10666j446a67703A82582d01761f9645j41688o702P3083K5402A57948c991
9528A02687a90823A19801J3089b68153n8978k7839f5963B39710c5229m66670b46143
$$ y = [39604, 157821, -80060, 100541, -16288, 131907, 218589, -83320, 289977, -17002, -187865, 118465, 164927, -174444, -137205, -460189, 123179, -302501, -32138, -131270, -126064, -134726, -113003, -123136, -35919, 71157, -248909, -362273, 72923, -10220, -162865, -46305, 103514, -161269, -365101, -8373, 71917, -116096, 57711, -138409, -167224, -236458, -65042, -55733, -305387, -311525, -232212, -2311, -118096, -142528, 18932, 3093, 202881, -18398, -383624, -82229, -64213, 160646, 254962, -84024, -32303, -66354, -164807, 38335, -75225, -112347, 119893, -455618, 131217, -110760, 110666, 109220, -167703, 182582, -401761, -69645, -211333, -218035, -144952, -119550, 157948, -3991, 102687, -190823, 119801, 132890, -268153, -327131, -354970, -65963, 239710, -35229, -501899, -246143]
9516a10150b4256q8586c8685j89488A12803h3697q2423P8406A08598m7643R1269
9505A52224o2947J92121n9070i2262J5393b7292q3670a1978l79471a67566f3773
9493b28360g7256E2099b33472h3936r7421j02888a0709o9248j03954e3644k2834
9482g6478B20175a18109A7146K26585a11850B9983L1728b11777J7897O5028A44697
9470a35777E9431b39594B48716C1904a31854L9582B1298J16673a6907C5967a5924
9458c5874o5912E592O743J52055B6772b8304J3179B47391a57658j9717l525d3378
9445b82555a24344k29519a27456o8291e8250A45469a26127j79053j56760B2755
9434b69231A0849Q5348c7864m691o1863d3130k6262B35022A02995e600l43124
$$ y = [-110150, -24256, -112842, -38685, -228173, 112803, -83697, -166120, -87714, 108598, 60955, 152224, 89277, 281398, 222328, -92262, -76869, -27292, -110962, -11978, -391449, -167566, -63773, -228360, -77256, 52099, -233472, -83936, -181357, -284245, -10709, -79957, -183911, -53644, -76478, 220175, -118109, 17146, 243731, -111850, 29983, 61711, -211777, -193880, -128852, 144697, -135777, 59431, -239594, 248716, 31904, -131854, -92272, 21298, 137971, -16907, 35967, -15924, -35874, -101786, 5592, 12335, 164390, 26772, -28304, -15125, 247391, -157658, -177375, -180900, -43378, -282555, -124344, -353863, -127456, -195747, -58250, 145469, -126127, -305180, -461940, 22755, -269231, 10849, 96197, -37864, -42555, -104418, -43130, -69392, 235022, 102995, -5600, -348724]
9423c48724a19670k37614G2183h7827l4260K3843q7029l7851a03404B8448a81663
9411i7003J1923A10401Q9587o8327a10664A49627j5712a44640O2868j4368D2831
9399G4050a22444a5316l22834A24368a65714J6645k6196j59475H1785L1200e3732
9387C6743a65333P6099j2345b5827k0610j36828j46376A23717c33019A18543b06317
9375c5360j10596B3484K53408G5504a89575B24465b92452a24533B19627f382l12182
9364c18564r8778a96679o8226B0886a71533G6329M1981i3179j31163M7463O304
9353a70575d5715G9009M0775b6411E0927P5136b22603A91242d7307B5657J02985
9342A28642a88054a550l09907J28336c2901l30583N8397H3342M6554B1427L3771
$$ y = [-348724, -119670, -357284, 72183, -87827, -122087, -98244, -185273, -223124, -103404, 28448, -181663, -97003, -85080, 110401, 199988, 131661, -110664, 149627, 133915, -144640, -81772, -96140, 42831, 74050, -122444, -15316, -338150, 124368, -165714, -149069, -175265, -334740, 81785, 112985, -53732, 36743, -165333, -89234, -101579, -25827, -46437, -183265, -329641, 123717, -333019, 118543, -206317, -35360, -145956, 23484, 276892, 75504, -189575, 224465, -292452, -124533, 219627, -6382, -318564, -417342, -196679, -264905, 20886, -171533, 76329, 118310, -93179, -224342, -176879, -170575, -45715, 79009, 119784, -26411, 50927, 126063, -222603, 191242, -47307, 25657, 128642, -188054, -1550, -311457, -183121, -32901, -363484, -305087, 83342, 129896, 21427, 55198]
9331E5198b68917A7605a48461N5463O374O300A24767a33530O0592D2808n295g4078
9318h9059C575c5275n7103c6939l8686R105n563A29734a34502a9293n26351C9693
9305a06716m79847b81341J27271e4556K5467m02446D8029b32770F2676J46852
9295B09528a17791c863j40940G247b37318d5742p6318r9365G5851c09981a2556
9283b38560e1768E6833c52601B5974B294d4660k6581j01685A17497n4316N1348
9272A14529b10813p1393k72c0661o7395k59944d6261j8149k11937a29111A9692
9260a11117q9051A5833J3324A1784N1831h9936B41399a5032A46143F5844d4933
9248C10871D1003C422J1573A981J4165i5837A29367e4143E8490b05263A37350
$$ y = [55198, -268917, 17605, -148461, -92998, -86624, -80324, 124767, -133530, -72938, 42808, 37513, -74078, -89059, 3575, -35275, -92378, -36939, -75625, -66520, -72083, 129734, -134502, -19293, -545644, 39693, -106716, -586563, -281341, -154070, -54556, -29089, -431535, 48029, -232770, 62676, 209528, -117791, -3863, -144803, 7247, -237318, -45742, -122060, -221425, 75851, -309981, -12556, -238560, -51768, 56833, -352601, 25974, 2294, -44660, -71241, -172926, 117497, 63181, 114529, -210813, -282206, -282478, -30661, -98056, -358000, -46261, -64410, -276347, -129111, 19692, -111117, -200168, 15833, 29157, 11784, 63615, -89936, 241399, -15032, 146143, 65844, -44933, 310871, 41003, 3422, 14995, 1981, 16146, -95837, 129367, -54143, 58490, -205263, 137350]
9236G2852a23485f0453j6740A39658i562q4727H0508C8053i0275l6702a1727j49078
9224a60805p648g002l63966A41736c15663I0774k7542a56394r3392f5861j01673
9213a67534A4159h1141B7532f5235D9797N3506J33976a43583k6627I9502J68284
9202B67786F0807d68949J57366C2577a39837k29825R4442c2720j33694L2300E0088
9190c8212P962q8869k6007j07467B27451H0659a17177q8067l9674A6415a65266
9178A07489a25832d4978F071c73838m6283A45887a38497b3793m7173j4928F8161
9166C4519O687c6848j92004j25556A57205a35909j80519B72135G6990b88584C3285
9154a31393q7559b8017l3146J4904o9225C6299i2695r3382A8648b23585j32888
$$ y = [72852, -123485, -60453, -77193, 139658, -9562, -94289, 80508, 38053, -90275, -126977, -11727, -160805, -168453, -7002, -370968, 141736, -315663, 90774, 63232, -156394, -249786, -65861, -167534, 14159, -81141, 27532, -65235, 49797, 103303, 237279, -143583, -170210, 99502, 267786, 60807, -468949, -311583, 32577, -139837, -369662, -275220, -32720, -166414, -134114, 50088, -38212, -30250, -119119, -145126, -252593, 227451, 80659, -117177, -205244, -244918, 16415, -165266, 107489, -125832, -44978, 6071, -373838, -420121, 145887, -138497, -23793, -70966, -85894, 68161, 34519, 41206, -36848, -228852, -354408, 157205, -135909, -316428, 272135, 76990, -288584, 33285, -131393, -218952, -28017, -61163, -46259, -115484, 36299, -92695, -186077, 18648, -223585, -356473]
9143c56473a54918L1379j52667J15182P7118C8503J09887A6712K19575e5171j10254
9132a65425a754j83948l5158n7239E7416j9871a57865A61938c32933a35475O849
9121a28626B5453e6584A24622b6664o0723q8097a9353p3812A67127M2931N833
9110B15891a22438j5197B30230I0965N5703b17383r8495d1500q7945l6314G4718
9098b92352B18731n4272p2740d1338j14884A06095a33457C2890d01574J59665
9088b41909C7475a73633L8924j11890A9321J40103a4133B04a44857m6774j32150
9077c23781R1862A61660k6387D5647L9064R9144n1061A4184e51793E8081l745
9066E4336a2057o1683j69521J06880q8776D0670c21362A18011E7932i0558A87038
$$ y = [-356473, -154918, -123539, -276206, -161024, -83906, 38503, 148390, 16712, 236287, -55171, -165425, -1754, -185702, -220860, -278099, 57416, 37545, -157865, 161938, -332933, -135475, -128626, 25453, -56584, 124622, -26664, -87387, -175484, -19353, -93165, 167127, 210058, 215891, -122438, -137635, 230230, 90965, 146668, -217383, -315878, -41500, -129445, -165759, 74718, -292352, 218731, 164459, 91719, -41338, -156222, 106095, -133457, 32890, -401574, -241909, 37475, -173633, -134709, -246599, 19321, 159424, -14133, 204, -144857, -191631, -323781, -231919, 161660, 135273, 45647, 84711, 183855, 132794, 14184, -551793, 58081, 54336, -12057, -73740, -243261, -136381, -225157, 40670, -321362, 118011, 57932, -90558, 187038]
9054b3510I6518j5655j3633i8810k46779B15183h3453k2782r3845A19414b25742
9042F0333a29898j11568a05564A0700i0199k00802a21133K0429A70676J23273
9032B93949a02161k39121H5980a51630n4681B242K17301C592g26j51340D15963
9020c8502F4029b24673p9793d3064D5511a49525A14450b41482M8158k43923J73397
9009b63850M9802L3470F9101k723f5173r5863f641k02812p9423A5188a96516A34805
8996a39682B05464k6435a57089A50616J77478b52355A09038h587j96654B58383
8985B73589b26830M0445a3811m3084A01915C8568d6206B4009p01J97691F6682
8973g7873i265k1231A45108a73402E5845a50864K2520j22427k5180A09302L9066
$$ y = [-23510, 96518, 80863, 67230, -98810, -345589, 215183, -83453, -106235, -200080, 119414, -225742, 60333, -129898, -241466, -105564, 10700, -90199, -291001, -121133, -100704, 170676, 293949, -102161, -341282, 85980, -151630, -206311, 2242, 219543, 3592, -726, -152066, 415963, -38502, 64029, -224673, -304466, -43064, 45511, -149525, 114450, -241482, -193324, -437247, -263850, -214048, -180578, 69101, 66378, -65173, -161036, -6641, -209453, -288876, 15188, -196516, 134805, -139682, 205464, 179029, -157089, 150616, 328094, -252355, 109038, -8587, -205241, 258383, 273589, -226830, -186385, -13811, -56895, 101915, 38568, -46206, 24009, 23308, 220999, 66682, -77873, -9265, -30496, 145108, -173402, 55845, -150864, -128344, -250771, -275951, 109302, 148368]
8962A48368j0211K5162K8413h9201A31781i8179j1181A84911a28279E9465a89316
8950b37261n5662a3670q4917A4192a7165j6382j28164B2116f0431A9043a55705
8938a14451C90e94853g7980B63848q0047k933F8337J04431b27760C29823o4555
8927B65268a26003r4435g3198E8924b30942J13718O716K9427J5302A47677K57998
8916D05675O8186n4924c18238J22838C87915A00143B2356M69060o5090O43731
8906A070057L04641J089112K803518L426768D073889j834950r33643n02915l49610
8897D52771J55632k59428l7248C6139K28725c6841C0304K07247c3882A78134j6063
8886A62071a74665C9928i5742c2733j14020j28524a10232A77117E9869c06671
$$ y = [148368, 138157, 163319, 191732, -89201, 131781, -98179, -109360, 184911, -128279, 59465, -189316, -237261, -292923, -13670, -98587, 14192, -17165, -33547, -161711, 22116, -60431, 19043, -155705, -114451, 390, -594853, -77980, 263848, 183801, 180868, 68337, 172768, -227760, 329823, 265268, -126003, -220438, -73198, 58924, -230942, -117224, -110508, -81081, -65779, 147677, 405675, 473861, 418937, -318238, -195400, 387915, 100143, 22356, 491416, 426326, 1070057, 1374698, 2463810, 5267328, 8694096, 4073889, 2238939, 1305296, 802381, 452771, 608403, 348975, 311727, 36139, 264864, -36841, 30304, 237551, -33882, 178134, 162071, -174665, 39928, -95742, -32733, -146753, -275277, -110232, 177117, 59869, -306671]
8875A25988m2796K04538I3087k3750g523r4056j18277A09519G311M2764J10782
8864A60857a86359B61491J02603d4733l5338a4132q5181n5465f7629b3921p2746
8853i6667F0761K95077A7726a66780A16682b61000r5264h4803m5327c9845j03220
8842a43065N0075M5447J5j32198A61177D8644a32148r998l6378j56079B300K46750
$$ y = [125988, 83192, 287730, 93087, 69337, -7523, -101579, -219856, 109519, 7311, 50075, 160857, -186359, 261491, 364094, -44733, -80071, -14132, -99313, -154778, -67629, -23921, -96667, 60761, 355838, 17726, -166780, 116682, -261000, -356264, -84803, -130130, -39845, -143065, -92990, -47543, -47528, -179726, 161177, 48644, -132148, -142146, -178524, -334603, 2300, 249050]
$$ [...]
##END NTUPLES=NMR SPECTRUM
##END=
