
##TITLE=AC1182_Huila-garzon-HGAAH12019_5891150_33Rp9NvRbp
##JCAMPDX= 6.0         $$ Bruker NMR JCAMP-DX V2.0
##DATA TYPE= NMR SPECTRUM
##DATA CLASS= NTUPLES
##ORIGIN= BRUKER
##OWNER= Administrator
$$ 1.72 TOPSPIN		Version 2.1
$$ 2012-04-02 21:43:10.578 -0500  Administrator@TOPSPIN
$$ Compression mode = diff/dup
##.OBSERVE FREQUENCY= 400.13188235
##.OBSERVE NUCLEUS= ^1H
##.ACQUISITION MODE= SIMULTANEOUS (DQD)
##.ACQUISITION SCHEME= undefined
##.AVERAGES= 64
##.DIGITISER RES= 22
##SPECTROMETER/DATA SYSTEM= spect
##.PULSE SEQUENCE= noesygpps1d.comp
##.SOLVENT NAME= COFFEE_meoh
##.SHIFT REFERENCE= INTERNAL, COFFEE_meoh, 1, 14.96826
##AUDIT TRAIL= $$ (NUMBER, WHEN, WHO, WHERE, PROCESS, VERSION, WHAT)
$$ ##TITLE= Audit trail, TOPSPIN		Version 2.1
$$ ##JCAMPDX= 5.01
$$ ##ORIGIN= Bruker BioSpin GmbH
$$ ##OWNER= Administrator
$$ $$ C:\Bruker\TOPSPIN/data/COFFEE/nmr/AC1182_Huila-garzon-HGAAH12019_5891150_33Rp9NvRbp/12/pdata/1/auditp.txt
$$ ##AUDIT TRAIL=  $$ (NUMBER, WHEN, WHO, WHERE, PROCESS, VERSION, WHAT)
(   1,<2012-04-02 21:43:04.953 -0500>,<Administrator>,<TOPSPIN>,<go>,<TOPSPIN 2.1>,
      <created by zg
	started at 2012-04-02 21:31:32.843 -0500,
	POWCHK enabled, PULCHK disabled,
       configuration hash MD5:
       1A 1E CE 29 27 FD 77 03 67 4E F0 E3 C4 B2 CB 90
       data hash MD5: 64K
       C3 CA 40 05 E7 2B AC 31 FE AD 96 27 A5 C5 CE EB>)
(   2,<2012-04-02 21:43:08.156 -0500>,<Administrator>,<TOPSPIN>,<proc1d>,<TOPSPIN 2.1>,
      <Start of raw data processing
       efp LB = 0.3 FT_mod = 6 PKNL = 1 PHC0 = 0 PHC1 = 0 SI = 128K 
       data hash MD5: 128K
       81 12 A7 D6 FA 0B 28 A2 0C 91 24 17 32 89 77 EF>)
(   3,<2012-04-02 21:43:09.609 -0500>,<Administrator>,<TOPSPIN>,<proc1d>,<TOPSPIN 2.1>,
      <pk PHC0 = 34.93103 PHC1 = 0 
       data hash MD5: 128K
       B0 71 7A 51 EF 71 AE 08 F6 D9 5A 4F 92 48 57 9A>)
(   4,<2012-04-02 21:43:10.203 -0500>,<Administrator>,<TOPSPIN>,<proc1d>,<TOPSPIN 2.1>,
      <abs ABSG = 1 
       data hash MD5: 128K
       C3 04 8B EC A5 2A 1A 2F 91 70 0C 8B A6 E2 65 9B>)
(   5,<2012-04-02 21:43:10.296 -0500>,<Administrator>,<TOPSPIN>,<proc1d>,<TOPSPIN 2.1>,
      <abs ABSG = 2 
       data hash MD5: 128K
       FB BF 31 32 69 76 06 D2 74 B2 2B 09 1D 98 76 84>)
(   6,<2012-04-02 21:43:10.359 -0500>,<Administrator>,<TOPSPIN>,<proc1d>,<TOPSPIN 2.1>,
      <abs ABSG = 3 
       data hash MD5: 128K
       C3 AE C7 66 D9 24 01 3B 07 2F 20 38 28 AC 18 43>)
(   7,<2012-04-02 21:43:10.437 -0500>,<Administrator>,<TOPSPIN>,<proc1d>,<TOPSPIN 2.1>,
      <abs ABSG = 4 
       data hash MD5: 128K
       29 EF 6A 86 68 CA 87 60 3C E2 CC 3E 86 6F 95 FF>)
(   8,<2012-04-02 21:43:10.500 -0500>,<Administrator>,<TOPSPIN>,<proc1d>,<TOPSPIN 2.1>,
      <abs ABSG = 5 
       data hash MD5: 128K
       83 3F 02 2C F6 25 50 0D D4 C3 A8 44 14 16 9E 31>)
$$ ##END=
$$ 
$$ $$ hash MD5
$$ $$ 76 73 7B 32 F7 06 7A 5E 75 3D A0 8A 9B 59 B9 D7
##$RELAX= 
##$RELAX= 
##$RELAX= 
##$RELAX= 
##$RELAX= 
##$RELAX= 
##$RELAX= 
##$RELAX= 
$$ [...]
##$TP07= 0
##$TPNAME0= <>
##$TPNAME1= <>
##$TPNAME2= <>
##$TPNAME3= <>
##$TPNAME4= <>
##$TPNAME5= <>
##$TPNAME6= <>
##$TPNAME7= <>
##$TPOAL= (0..7)
0.5 0.5 0.5 0.5 0.5 0.5 0.5 0.5
##$TPOFFS= (0..7)
0 0 0 0 0 0 0 0
##$TUNHIN= 0
##$TUNHOUT= 0
##$TUNXOUT= 0
##$USERA1= <user>
##$USERA2= <user>
##$USERA3= <user>
##$USERA4= <user>
##$USERA5= <user>
##$V9= 5
##$VALIST= <valist>
##$VCLIST= <CCCCCCCCCCCCCCC>
##$VD= 0
##$VDLIST= <DDDDDDDDDDDDDDD>
##$VPLIST= <PPPPPPPPPPPPPPP>
##$VTLIST= <TTTTTTTTTTTTTTT>
##$WBST= 2048
##$WBSW= 25
##$XGAIN= (0..3)
0 0 0 0
##$XL= 0
##$YL= 0
##$YMAX_a= 12555974
##$YMIN_a= -6170695
##$ZGOPTNS= <>
##$ZL1= 120
##$ZL2= 120
##$ZL3= 120
##$ZL4= 120
##$ABSF1= 14.96826
##$ABSF2= -5.58427
##$ABSG= 5
##$ABSL= 3
##$ALPHA= 0
##$AQORDER= 0
##$ASSFAC= 0
##$ASSFACI= 0
##$ASSFACX= 0
##$ASSWID= 0
##$AUNMP= <proc_prof1d_extract.lims>
##$AXLEFT= 0
##$AXNAME= <>
##$AXNUC= <1H>
##$AXRIGHT= 0
##$AXTYPE= 0
##$AXUNIT= <>
##$AZFE= 0.1
##$AZFW= 0.1
##$BCFW= 0
##$BC_mod= 0
##$BYTORDP= 0
##$COROFFS= 0
##$CY= 15
##$DATMOD= 1
##$DC= 0
##$DFILT= <>
##$DTYPP= 0
##$F1P= 0
##$F2P= 0
##$FCOR= 0.5
##$FTSIZE= 131072
##$FT_mod= 6
##$GAMMA= 0
##$GB= 0
##$INTBC= 1
##$INTSCL= 1
##$ISEN= 128
##$LB= 0.3
##$LEV0= 0
##$LPBIN= 0
##$MAXI= 10000
##$MC2= 0
##$MEAN= 0
##$ME_mod= 0
##$MI= 0
##$NCOEF= 0
##$NC_proc= -3
##$NLEV= 6
##$NOISF1= 0
##$NOISF2= 0
##$NSP= 0
##$NTH_PI= 0
##$NZP= 0
##$OFFSET= 14.96826
##$PC= 1
##$PHC0= 34.93103
##$PHC1= 0
##$PH_mod= 1
##$PKNL= yes
##$PPARMOD= 0
##$PPDIAG= 0
##$PPIPTYP= 0
##$PPMPNUM= 2147483647
##$PPRESOL= 1
##$PSCAL= 4
##$PSIGN= 0
##$PYNMP= <proc.py>
##$REVERSE= no
##$SF= 400.130004942993
##$SI= 131072
##$SIGF1= 0
##$SIGF2= 0
##$SINO= 400
##$SIOLD= 131072
##$SPECTYP= <>
##$SREGLST= <1H.CDCl3>
##$SSB= 0
##$STSI= 131072
##$STSR= 0
##$SW_p= 8223.68421052632
##$SYMM= 0
##$S_DEV= 0
##$TDeff= 65536
##$TDoff= 0
##$TI= <>
##$TILT= no
##$TM1= 0
##$TM2= 0
##$TOPLEV= 0
##$USERP1= <user>
##$USERP2= <user>
##$USERP3= <user>
##$USERP4= <user>
##$USERP5= <user>
##$WDW= 1
##$XDIM= 131072
##$YMAX_p= 495502890
##$YMIN_p= -474272597
##$CURPLOT= <Network HP LaserJet P1505>
##$CURPRIN= <$Network HP LaserJet P1505>
##$DFORMAT= <normdp>
##$LAYOUT= <+/1D_H.xwp>
##$LFORMAT= <normlp>
##$PFORMAT= <normpl>
##$SURQMSG= 1
$$ End of Bruker specific parameters
$$ ---------------------------------
##NTUPLES= NMR SPECTRUM
##VAR_NAME=  FREQUENCY,     SPECTRUM/REAL,   SPECTRUM/IMAG
##SYMBOL=    X,             R,               I
##VAR_TYPE=  INDEPENDENT,   DEPENDENT,       DEPENDENT
##VAR_FORM=  AFFN,          ASDF,            ASDF
##VAR_DIM=   131072,        131072,          131072
##UNITS=     HZ,            ARBITRARY UNITS, ARBITRARY UNITS
##FACTOR=    0.0627417313425165, 1,          1
##FIRST=     8223.62146879498, 1516,         -91958
##LAST=      0,             5160,            -93403
##MIN=       0,             -474272597,      0
##MAX=       8223.62146879498, 495502890,    0
$$ Real data points
##PAGE= N=1
##DATA TABLE= (X++(R..R)), XYDATA
$$ [...]
62937C017709M4455M8479N1034N2218N2623N2430N1311M9348M7358M5944M4493
62926C557402M1645L6740L0517K3996J6880P629m524j8238l1436m3603n5819o8612
62914C492577q0945r1538j00042j06324j09782j10323j09180j07654j05638j02373
62904B468778r8151r3946q9663q4262p7795p1947o7931o4870o0915n5316m8766
62893A655216m2280l6546l2023k8963k7194k6257k5735k5257k4382k2808k0651
62882A343120j8303j6091j4321j3319j3138j3287j3244j3122j3481j4388j5198
62871A185228j5375j5046j4531j3797j2899j2405j2727j3256j2929j1612j0081
62860A040570q684p017n223m564n822p830q526p202m989l373k976l518m164l940
$$ plain form
62937 3017709 3062164 3110643 3161677 3213895 3266518 3318948 3370259 3419607 3466965 3512909 3557402
62926 3557402 3599047 3635787 3666304 3690300 3707180 3714809 3710285 3692047 3660611 3617008 3561189 3492577
62914 3492577 3411632 3320094 3220052 3113728 3003946 2893623 2784443 2676789 2571151 2468778
62904 2468778 2370627 2276681 2187018 2102756 2024961 1953014 1885083 1820213 1759298 1703982 1655216
62893 1655216 1612936 1576390 1544367 1515404 1488210 1461953 1436218 1410961 1386579 1363771 1343120
62882 1343120 1324817 1308726 1294405 1281086 1267948 1254661 1241417 1228295 1214814 1200426 1185228
62871 1185228 1169853 1154807 1140276 1126479 1113580 1101175 1088448 1075192 1062263 1050651 1040570
62860 1040570 1031886 1024869 1019646 1015082 1009260 1001430 992904 985702 980713 977340 974364 970846 966682 962742
62846I62742k569r45k43o48j431k071k497k542k093j737k181k828k116K49K437
62831I41527K671J465P36J129J292j32k689m595m731l682k897l127l968m765n290
62816I12944n365m501k679j001o41j338j912k101k849m455n708n490m406m014
62802H66484m897o198o755o175m986m103m062m547m827m631m292m126m150m369
62788G98366m735m853m378l650l171k532r06J361K784K755K327K520L045L384
62774G92317L881M674M643K763l5j708j494l34Q48K076L554M914N510N063L954
62759H30626L196L709N194O198N878N159N391O330O525N523M605N225P416R938
62745I10913J1477J1697J1466J2006J3531J5045J5809J6425J7887K0142K2534
$$ plain form
62846 962742 960173 959228 958985 958337 956906 954835 952338 949796 947703 945966 943785 940957 938841 939090 941527
62831 941527 944198 945663 946399 947528 948820 948688 945999 941404 936673 932991 930094 926967 922999 918234 912944
62816 912944 907579 903078 900399 899398 898757 897419 895507 893406 890557 886102 880394 874904 870498 866484
62802 866484 861587 855389 848634 842459 837473 833370 829308 824761 819934 815303 811011 806885 802735 798366
62788 798366 793631 788778 784400 780750 777579 775047 774141 775502 778286 781041 783368 785888 788933 792317
62774 792317 796198 800872 805515 808278 808243 806535 805041 804707 805555 807631 811185 816099 821609 826672 830626
62759 830626 833822 837531 842725 848923 854801 859960 865351 871681 878206 883729 888334 893559 900975 910913
62745 910913 922390 934087 945553 957559 971090 986135 1001944 1018369 1036256 1056398 1078932
62734A078932K5063K8042L0834L2363L3066L5021L9478M5181M9830N2780N5632
62723A506222O0352O7143P4213P9594Q3182Q6734R1756R7922J03975J09446J14474
62712B475013J18379J19749J18160J14703J10253J03992R4374Q1071O5398M8893
62702C449985L1899J3653o234k6542m5076o0748p4436q7273r8764j07540j13472
62691B875452j17701j20600j21141j18731j14398j09465j04084r7941r1634q6166
62681A793591q1498p6600p0910o5003n9712n5184n0846m6089m0930l6210l2794
62670A177815l0330k7236k2451j6917j2697j0726j0072r282p723n592l365j579
62658A019845l37J347M971J0496J5514J7522J6956J6860J9363K3576K7468L0587
$$ plain form
62734 1078932 1103995 1132037 1162871 1195234 1228300 1263321 1302799 1347980 1397810 1450590 1506222
62723 1506222 1566574 1633717 1707930 1787524 1870706 1957440 2049196 2147118 2251093 2360539 2475013
62712 2475013 2593392 2713141 2831301 2946004 3056257 3160249 3254623 3335694 3401092 3449985
62702 3449985 3481884 3495537 3489303 3462761 3417685 3356937 3282501 3195228 3096464 2988924 2875452
62691 2875452 2757751 2637151 2516010 2397279 2282881 2173416 2069332 1971391 1879757 1793591
62681 1793591 1712093 1635493 1564583 1499580 1439868 1384684 1333838 1287749 1246819 1210609 1177815
62670 1177815 1147485 1120249 1097798 1080881 1068184 1057458 1047386 1038104 1030381 1024789 1021424 1019845
62658 1019845 1019508 1020855 1025826 1036322 1051836 1069358 1086314 1103174 1122537 1146113 1173581 1204168
62646A204168L3956L7996M2094M5983N0201N4848N9184O3051O7646P3956Q1159
62635A814242Q7622R2962R7965J02639J05616J05935J04420J02467R9915R5038
62625B808821Q6636P5379O2650M8533L1865J2377p998k6649m2783n7611p2126
62614B919094q5560r6290j03623j08171j10878j12180j11932j09852j06112j01502
62604A872994r6685r1366q4870p7698p1551o7326o3835n9376n3980m9140m5671
62593A111496m2865l9721l6097l2505k9480k7445k6525k6195k5492k3904k1678
62582G79589j9212j6696j4547j3571j4019j4708j3927j1467r105q562r288r052
62570F25435o722l706k233k868m370n327n091l516r44J507K697K724K610K734
$$ plain form
62646 1204168 1238124 1276120 1318214 1364197 1414398 1469246 1528430 1591481 1659127 1733083 1814242
62635 1814242 1901864 1994826 2092791 2195430 2301046 2406981 2511401 2613868 2713783 2808821
62625 2808821 2895457 2970836 3033486 3082019 3113884 3126261 3118263 3091614 3048831 2991220 2919094
62614 2919094 2833534 2737244 2633621 2525450 2414572 2302392 2190460 2080608 1974496 1872994
62604 1872994 1776309 1684943 1600073 1522375 1450824 1383498 1319663 1260287 1206307 1157167 1111496
62593 1111496 1068631 1028910 992813 960308 930828 903383 876858 850663 825171 801267 779589
62582 779589 760377 743681 729134 715563 701544 686836 672909 661442 652337 643775 634487 625435
62570 625435 618713 615007 612774 609906 605536 600209 595118 591602 590658 592165 594862 597586 600196 602930
62556F02930K561K088K281L653N506P178Q908J0770J1934J1973J1949J3031J4892
62543G09654J6600J8369K1116K4750K8234L0979L3115L4734L6101L8284M2220
62532A034156M7242N1742N5199N8281O0980O2090O0947N8440N5720N2775M8737
62521A646309M2867L4798K4576J3053J803p886j5856k2924l0025l7347m3886m8221
62509A557261n0185n1391n3344n5410n5640n3331m9602m5573m1363l7189l4081
62498A030152l2581l1618k9627k6404k3203k1145k0065j8966j7343j5820j5341
62487G78039j5785j5915j4900j3220j1569r704p343n478n356o372o392m371j376
62474F60258J210L169M721N530N411N164N837P522R473J1170J2775J4698J6998
$$ plain form
62556 602930 605491 607579 609860 613513 619019 626197 635105 645875 657809 669782 681731 694762 709654
62543 709654 726254 744623 765739 790489 818723 849702 882817 917551 953652 991936 1034156
62532 1034156 1081398 1133140 1188339 1246620 1307600 1369690 1430637 1489077 1544797 1597572 1646309
62521 1646309 1689176 1723974 1748550 1761603 1763406 1755520 1739664 1716740 1686715 1649368 1605482 1557261
62509 1557261 1507076 1455685 1402341 1346931 1291291 1237960 1188358 1142785 1101422 1064233 1030152
62498 1030152 997571 965953 936326 909922 886719 865574 845509 826543 809200 793380 778039
62487 778039 762254 746339 731439 718219 706650 696946 689603 684125 678769 672397 666005 661634 660258
62474 660258 661468 664637 669358 674888 680299 685463 691300 698822 708295 719465 732240 746938 763936
62461G63936J9147K0488K1129K2181K4644K8295L2242L6148M0090M3596M5992
62450A097888M7678M9876N2847N5467N6903N7585N7878N6796N2862M5899L7264
62439A668943K8531K0239J1814K530p416j6969k5486l3343m0714m6553m9725n0694
62427A461157n0872n0752m9929m8521m7076m5165m1894l7860l4824l3140l1215
62416I89909k8012k4378k1283j8523j6008j4621j4587j4413j2740j0060p540n412
62404H02332l670l014l580l819k240M38K412L392M494O097P449Q257R141J0327
62390H38016J1079J0771R772R026R254J0413J1525J1334R543P154N058K768p93
62377I44920n547r875j2069j2004j1583j3153j6841j9841j9585j7294j6571j8332
$$ plain form
62461 763936 783083 803571 824700 846881 871525 899820 932062 968210 1008300 1051896 1097888
62450 1097888 1145566 1195442 1248289 1303756 1360659 1418244 1476122 1532918 1585780 1631679 1668943
62439 1668943 1697474 1717713 1729527 1732057 1724641 1707672 1682186 1648843 1608129 1561576 1511851 1461157
62427 1461157 1410285 1359533 1309604 1261083 1214007 1168842 1126948 1089088 1054264 1021124 989909
62416 989909 961897 937519 916236 897713 881705 867084 852497 838084 825344 815284 807744 802332
62404 802332 798662 795648 792068 788249 786009 786447 788859 792251 796745 802842 810291 818548 827689 838016
62390 838016 849095 859866 869638 878664 887918 898331 909856 921190 930733 937887 942945 945713 944920
62377 944920 939373 929498 917429 905425 893842 880689 863848 844007 824422 807128 790557 772225
62365G72225j9413j7149j3083j0468r987r968r386q353o653m178k186j869k053
62352F57479m95K757N465O574P257Q420R331R328R026R097R412R998J1336J2960
62338G67945J3337J1982J0503J0649J2212J3586J3521J1672Q481N226L306K735
62326H85155K125P01o23q99p13j055j411l89K140M796O608Q061J0007J2484J5215
62311I42202J8549K3044K8258L2781L5855L8426M2054M7113N2781N8425O3976
62300A383464O8864P1993P3321P4342P6062P7437P6762P3671O8511O0784M9987
62289B155198L7571K6142J6577P459k493j2924k2980l2371m0872m8090n4227n9844
62277A969146o4443o6592o6033o4290o2548o0297n6929n3221m9999m6647m2562
$$ plain form
62365 772225 752812 735663 722580 712112 702125 692157 682771 674418 667765 663587 661401 659532 657479
62352 657479 656984 659741 665206 671780 679037 687457 696788 706116 715142 724239 733651 743649 754985 767945
62338 767945 781282 793264 803767 814416 826628 840214 853735 865407 873888 879114 882420 885155
62326 885155 887280 887981 887358 886459 885746 884691 883280 882891 885031 889827 896435 904496 914503 926987 942202
62311 942202 960751 983795 1012053 1044834 1080689 1119115 1161169 1208282 1261063 1319488 1383464
62300 1383464 1452328 1524321 1597642 1671984 1748046 1825483 1902245 1975916 2044427 2105211 2155198
62289 2155198 2192769 2218911 2235488 2242947 2240454 2227530 2204550 2172179 2131307 2083217 2028990 1969146
62277 1969146 1904703 1838111 1772078 1707788 1645240 1584943 1528014 1474793 1424794 1378147 1335585
62266A335585l9120l8273l9425l9506l6460l1435k7073k4620k3306k1865j9891
62255I94611j7763j5714j3365j0338p098m604l050j596K63J660J370m59k285k786
62241I18846k022j128j248k688m615n662n297m498m594n537n905m691k443l15
62227H68203J425L316N366O590O276N264N413P709J1267J4386J6217J7161J7889
62214I86482J8646J9554K1109K3792K7229L0152L1536L1807L2597L5176L9237
62203A297317M3482M7161N0567N4105N7595O0713O3551O6142O7849O7733O5397
62192A941612O1099N5235M8042L9595K9838J8824P129m403j5495k6320l6261m3682
62180B075213m7893n0634n4386n9378o3438o4760o3709o1723n9448n6513n2477
$$ plain form
62266 1335585 1296465 1258192 1218767 1179261 1142801 1111366 1084293 1059673 1036367 1014502 994611
62255 994611 976848 961134 947769 937431 930333 925729 922679 921083 921346 923006 924376 923917 921632 918846
62241 918846 916824 915696 914448 911760 907145 901483 896186 891688 887094 881557 875652 870961 868518 868203
62227 868203 869628 872944 878310 884900 891176 896440 901853 909562 920829 935215 951432 968593 986482
62214 986482 1005128 1024682 1045791 1069583 1096812 1126964 1158500 1190307 1222904 1258080 1297317
62203 1297317 1340799 1387960 1438527 1492632 1550227 1610940 1674491 1740633 1808482 1876215 1941612
62192 1941612 2002711 2057946 2105988 2145583 2175421 2194245 2201374 2196971 2181476 2155156 2118895 2075213
62180 2075213 2027320 1976686 1922300 1862922 1799484 1734724 1671015 1609292 1549844 1493331 1440854
62169A440854m7523m2455l8242l5299l3117l0707k7305k2592j6895j1501q052
62158A127166o747n787l562q09N42J74m94p41j305k447k946j779M62K566M118
62143A108411N232N801N843N838O046O143N978O133P190R072J1433J3977J6090
62130A213187J7094J7273J7784J9111K0571K1754K3202K5065K6234K5855K4645
62119A451775K3768K3393K3483K4878K8125L2042L5028L7357M0594M5033M9214
62108A814690N2078N4120N6141N7934N8705N7981N5785N2410M8030M2197L4121
62097B384192K4187J4785Q436N108K391j691o954j2172j6779k0976k4909k8210
62085B327408l0093k9824k7544k4404k1495j8867j6242j4116j3135j2792j2063
$$ plain form
62169 1440854 1393331 1350876 1312634 1277335 1244218 1213511 1186206 1163614 1146719 1135218 1127166
62158 1127166 1120419 1114632 1111070 1110261 1110803 1110977 1110483 1109742 1108437 1105990 1103044 1101265 1101727 1104293 1108411
62143 1108411 1113643 1119444 1125287 1131125 1137171 1143314 1149292 1155425 1162615 1171687 1183120 1197097 1213187
62130 1213187 1230281 1247554 1265338 1284449 1305020 1326774 1349976 1375041 1401275 1427130 1451775
62119 1451775 1475543 1498936 1522419 1547297 1575422 1607464 1642492 1679849 1720443 1765476 1814690
62108 1814690 1866768 1920888 1977029 2034963 2093668 2151649 2207434 2259844 2307874 2350071 2384192
62097 2384192 2408379 2423164 2431600 2436708 2439099 2437408 2430454 2418282 2401503 2380527 2355618 2327408
62085 2327408 2297315 2267491 2239947 2215543 2194048 2175181 2158939 2144823 2131688 2118896 2106833
62074B106833j1065j0606j0238q582n849m080m031l686j203K265M360N032O284
62061B065434R041J2141J4358J5753J6848J7840J9063K1021K3572K5945K7886
62050B268902K9975L2497L4903L6723L8252L9989M2081M4579M7589N0740N3350
62039B719580N5366N7378N9263N9829N8473N6376N5152N5009N5128N5330N6169
62028C343053N7641N8888N9266N8787N7589N5770N3912N2907N3007N3659N4413
62017C958892N5460N7087N9179O1439O3662O5750O7810P0210P3039P5685P7548
62006D685761P8904Q0267Q1187Q0792P9436P8432P7810P5789P1153O5049N9422
61995E514002N4641M9636M3731L7305L1175K6145K2680K0190J7184J3024R106
$$ plain form
62074 2106833 2095768 2085162 2074924 2066342 2060493 2056413 2052382 2048696 2047493 2049758 2054118 2059150 2065434
62061 2065434 2074475 2086616 2100974 2116727 2133575 2151415 2170478 2191499 2215071 2241016 2268902
62050 2268902 2298877 2331374 2366277 2403000 2441252 2481241 2523322 2567901 2615490 2666230 2719580
62039 2719580 2774946 2832324 2891587 2951416 3009889 3066265 3121417 3176426 3231554 3286884 3343053
62028 3343053 3400694 3459582 3518848 3577635 3635224 3690994 3744906 3797813 3850820 3904479 3958892
62017 3958892 4014352 4071439 4130618 4192057 4255719 4321469 4389279 4459489 4532528 4608213 4685761
62006 4685761 4764665 4844932 4926119 5006911 5086347 5164779 5242589 5318378 5389531 5454580 5514002
61995 5514002 5568643 5618279 5662010 5699315 5730490 5756635 5779315 5799505 5816689 5829713 5838819
61984E838819P412Q233J0204J2073J3484J4367J4731J5013J5675J6431J6559J5889
61972E998890J4843J3809J3177J3508J4611J4951J3127R786O837M911L036Q09
61960F122295p43j008j064k137l775m606m382m359n712q161j0171j0373q891p173
61946F049740o287n647m066j759l74r64k743m150m308l224j280R13K583L125K343
61931F023902L97k136m452o273q275j1091j4160j6307j7254j7722j8288j9153
61919E889188k0800k3547k6335k7389k6602k6097k7792l1176l4135l5331l5307
61908E574677l5720l7717m0655m2484m1950m0152l9067l9019l8847l8229l8004
61897E142833l8152l7326l5077l2896l2230l2760l3380l3575l3084l1450k8821
$$ plain form
61984 5838819 5846231 5854464 5864668 5876741 5890225 5904592 5919323 5934336 5950011 5966442 5983001 5998890
61972 5998890 6013733 6027542 6040719 6054227 6068838 6083789 6096916 6106702 6113539 6118450 6121486 6122295
61960 6122295 6121552 6120544 6119480 6117343 6113568 6108962 6104580 6100221 6094509 6086348 6076177 6065804 6056913 6049740
61946 6049740 6043453 6037806 6033740 6031981 6031607 6030643 6027900 6023750 6019442 6016218 6014938 6015851 6018434 6021559 6023902
61931 6023902 6024299 6022163 6017711 6011438 6003163 5992072 5977912 5961605 5944351 5926629 5908341 5889188
61919 5889188 5868388 5844841 5818506 5791117 5764515 5738418 5710626 5679450 5645315 5609984 5574677
61908 5574677 5538957 5501240 5460585 5418101 5376151 5335999 5296932 5257913 5219066 5180837 5142833
61897 5142833 5104681 5067355 5032278 4999382 4967152 4934392 4901012 4867437 4834353 4802903 4774082
61886D774082k6085k3575k0738j7518j4669j2124q772m655j534j48J323M625Q907
61873D659119J2392J4992J7686K0775K4545L0147L7700M4938M9986N4273O0399
61862E026952O8192P5644Q2778R1533J02240J13408J25165J39728J57743J77046
61852F160429J96197K16839K41060K68529K97792L28882L63031M00840M42061
61843H915660M86287N32741N79960O26507O71293P12726P48181P74537P88003
61834A4835895P82837P51494O87212N86506M49903K82525R5098r7404k80305m43098
61824A7650663n79437o85524p60161q05409q25446q24706q07645p79138p43325
61815A0839872p02180o56378o07490n58305n11154m67092m26663l90227l57178
$$ plain form
61886 4774082 4747997 4724422 4703684 4686166 4671497 4659373 4650601 4645946 4644412 4644264 4645587 4650212 4659119
61873 4659119 4671511 4686503 4704189 4724964 4749509 4779656 4817356 4862294 4912280 4966553 5026952
61862 5026952 5095144 5170788 5253566 5345099 5447339 5560747 5685912 5825640 5983383 6160429
61852 6160429 6356626 6573465 6814525 7083054 7380846 7709728 8072759 8473599 8915660
61843 8915660 9401947 9934688 10514648 11141155 11812448 12525174 13273355 14047892 14835895
61834 14835895 15618732 16370226 17057438 17643944 18093847 18376372 18471470 18374066 18093761 17650663
61824 17650663 17071226 16385702 15625541 14820132 13994686 13169980 12362335 11583197 10839872
61815 10839872 10137692 9481314 8873824 8315519 7804365 7337273 6910610 6520383 6163205
61806F163205l26076k96443k69665k47189k28283k10554j92715j75719j60785
61797D055776j47298j33799j20523j09388j01201r4273q6725p9001p2727o7788
61787C043053o2224n5034m7662m2252l9306l7575l5495l2408k8825k5658k2940
61776B613674j9586j4966j0233p040n264l351q30J098J783K385M151O732Q977
61763B577530J0415J1157J1422J2034J4299J8354K2437K4937K6409K8520L1746
61752B789260L5448L9636M4978N1168N6790O1199O5467P1032P8152Q6002R3649
61741C472781J00657J07309J14573J23438J33937J45090J55840J65953J76094
61732D695672J87554K01589K18381K36446K53860K70409K88188L09661L35515
$$ plain form
61806 6163205 5837129 5540686 5271021 5023832 4795549 4584995 4392280 4216561 4055776
61797 4055776 3908478 3774679 3654156 3544768 3443567 3349294 3262569 3183568 3110841 3043053
61787 3043053 2980829 2925795 2878133 2835881 2796575 2759000 2723505 2691097 2662272 2636614 2613674
61776 2613674 2594088 2579122 2568889 2561849 2556585 2553234 2552404 2553502 2555285 2557670 2561821 2568553 2577530
61763 2577530 2587945 2599102 2610524 2622558 2636857 2655211 2677648 2702585 2728994 2757514 2789260
61752 2789260 2824708 2864344 2909322 2960490 3017280 3078479 3143946 3214978 3293130 3379132 3472781
61741 3472781 3573438 3680747 3795320 3918758 4052695 4197785 4353625 4519578 4695672
61732 4695672 4883226 5084815 5303196 5539642 5793502 6063911 6352099 6661760 6997275
61723F997275L64739L96475M31185M70065N13882N62649O16093O74026P36314
61714A1762703Q02855Q73661R48656J027076J107145J186459J262419J331881
61706B0302855J390240J431056J446357J426840J361852J240509J055091Q05653
61698C0460453N02948J67201j76663n04487p96460j038827j224947j355316j435368
61689B4598534j471822j470798j438738j383504j313215j234261j150988j066693
61681A4068515r83839r03762q27300p55682o89870o29419n73110n20775m73391
61672G711367m31327l93751l59989l30149l03914k79770k56276k33522k12782
61663D909887j95191j80946j69054j57702j45655j33693j23779j16529j10362
$$ plain form
61723 6997275 7362014 7758489 8189674 8659739 9173621 9736270 10352363 11026389 11762703
61714 11762703 12565558 13439219 14387875 15414951 16522096 17708555 18970974 20302855
61706 20302855 21693095 23124151 24570508 25997348 27359200 28599709 29654800 30460453
61698 30460453 30963401 31130602 30953939 30449452 29652992 28614165 27389218 26033902 24598534
61689 24598534 23126712 21655914 20217176 18833672 17520457 16286196 15135208 14068515
61681 14068515 13084676 12180914 11353614 10597932 9908062 9278643 8705533 8184758 7711367
61672 7711367 7280040 6886289 6526300 6196151 5892237 5612467 5356191 5122669 4909887
61663 4909887 4714696 4533750 4364696 4206994 4061339 3927646 3803867 3687338 3576976
61654C576976j03543r5999q8632q1989p6391p2329o9598o6794o2700n7814n3632
61643B747555n0845m9019m7530m6090m4725m3812m3631m3431m1816l8812l6401
61632B261443l6021l6451l5607l3557l2138l2099l2348l1857l0581k8525k5574
61621A906685k2509k0607j9843j8915j7441j6476j6365j5767j3854j1862j1144
61610A721902j0990r982q573q378r408r967r298q604q911r573r666r548r937j0302
61596A588765r526p785o544o629p305p517p146o689o325n904n339m443k806n33
61582A504274J154R55p83k080j462M59J882J904J264J196K053L059L205K272J162
61567A520514J097K547M842O758P345O381M489K798J992J582M94j458l177l621
$$ plain form
61654 3576976 3473433 3377434 3288802 3206813 3130422 3058093 2988495 2921701 2859001 2801187 2747555
61643 2747555 2696710 2647691 2600161 2554071 2509346 2465534 2421903 2378472 2336656 2297844 2261443
61632 2261443 2225422 2188971 2153364 2119807 2087669 2055570 2023222 1991365 1960784 1932259 1906685
61621 1906685 1884176 1863569 1843726 1824811 1807370 1790894 1774529 1758762 1744908 1733046 1721902
61610 1721902 1710912 1700930 1692357 1683979 1674571 1664604 1655306 1646702 1637791 1628218 1618552 1609004 1599067 1588765
61596 1588765 1579239 1571454 1564910 1558281 1550976 1543459 1536313 1529624 1523299 1517395 1512056 1507613 1504807 1504274
61582 1504274 1505428 1506383 1505600 1503520 1502058 1502517 1504399 1506303 1507567 1508763 1510816 1513875 1517080 1519352 1520514
61567 1520514 1521611 1524158 1529000 1535758 1543103 1549484 1553973 1556771 1558763 1560345 1560839 1559381 1556204 1552583
61553A552583l086k816l667n517p602r042r331q756q210q183q311q240q478r603
61539A451741j0897j0836r067p090o366o445n684l560j365m60n35j01J588L863
61525A394786N803P381R168J1400J3812J6073J7929J9301K0726K3169K6625K9494
61513A595667L0405L0375L1636L4491L7048L8522M0660M4692M8679M9865M8508
61502B030548M7166M6828M6147M4362M2532M1173L8963L5163L1676L0890L2263
61491B467711L2682L0022K5094K0136J6436J3577J0323N937R76l162n709p325
61479B606698r158j1434j3513j4926j5615j5285j3470j0532p746n779l622J71
61467B485789N380J0063J2912J5095J9049K5638L3140L9374M4358N0206N8470
$$ plain form
61553 1552583 1549497 1546681 1543014 1537497 1529895 1520853 1511522 1502766 1494556 1486373 1478062 1469822 1461344 1451741
61539 1451741 1440844 1430008 1420941 1413851 1407485 1401040 1395356 1391796 1390431 1389971 1389436 1389335 1390923 1394786
61525 1394786 1400589 1407970 1417138 1428538 1442350 1458423 1476352 1495653 1516379 1539548 1566173 1595667
61513 1595667 1626072 1656447 1688083 1722574 1759622 1798144 1838804 1883496 1932175 1982040 2030548
61502 2030548 2077714 2124542 2170689 2215051 2257583 2298756 2337719 2372882 2404558 2435448 2467711
61491 2467711 2500393 2530415 2555509 2575645 2592081 2605658 2615981 2621918 2622894 2619732 2614023 2606698
61479 2606698 2597540 2586106 2572593 2557667 2542052 2526767 2513297 2502765 2495019 2489240 2485618 2485789
61467 2485789 2491169 2501232 2514144 2529239 2548288 2573926 2607066 2646440 2690798 2741004 2799474
61456B799474O8307P7647Q5781R4134J04437J16743J29623J42121J54864J69114
61446C942245J85216K02404K19905K37481K54740K70605K84114K95242L04132
61437F196084L09555L08787K99294K80005K50927K12455J65706J13121N7989L437
61427H197360m7820r3280j31218j61585j85610k04007k15989k20352k17305k08927
61417F511267j97907j86027j73628j60191j45304j29109j11983r4151p5975n8364
61407E178628m2347k8078j4706j342J2193K5464L7681M7786N5239O1041O7063
61396E398622P3665P8987Q1591Q2697Q4262Q5640Q4333Q0040P5605P3241P1976
61385F270659P0046O7855O6609O5455O2509N8146N4829N3392N1651M7457M1427
$$ plain form
61456 2799474 2867781 2945428 3031209 3125343 3229780 3346523 3476146 3618267 3773131 3942245
61446 3942245 4127461 4329865 4549770 4787251 5041991 5312596 5596710 5891952 6196084
61437 6196084 6505639 6814426 7113720 7393725 7644652 7857107 8022813 8135934 8193923 8197360
61427 8197360 8149540 8056260 7925042 7763457 7577847 7373840 7157851 6937499 6720194 6511267
61417 6511267 6313360 6127333 5953705 5793514 5648210 5519101 5407118 5312967 5236992 5178628
61407 5178628 5136281 5108203 5093497 5092155 5104348 5129812 5167493 5215279 5270518 5331559 5398622
61396 5398622 5472287 5551274 5632865 5715562 5799824 5885464 5969797 6049837 6125442 6198683 6270659
61385 6270659 6340705 6408560 6475169 6540624 6603133 6661279 6716108 6769500 6821151 6868608 6910035
61374F910035L5641L0899K6564K2200J7968J3520P789K97p901j5080k0557k5184
61362F996191k9920l4197l6365l5882l4279l3295l2726l1134k8296k5590k3931
61351F650576k2590k0556j8028j5913j4595j3910j3805j4386j5635j7518j9999
61340F463641k2512k3828k2930j9845j5292r793l335M500J4394K6975M2397O0278
61328F494650P9983J00622J21052J40768J60790J82666K06343K29912K51765K71954
61318H240505K90911L07906L21595L30921L34376L29275L13302K86498K50500
61309A1005789K06348J54485R6888L7573j9617p2880j21828j66106k05290k39382
61299A0675980k68591k92813l11751l25259l33323l35950l33515l27016l17757
$$ plain form
61374 6910035 6945676 6976575 7003139 7025339 7043307 7056827 7064616 7064913 7057012 7041932 7021375 6996191
61362 6996191 6966271 6932074 6895709 6859827 6825548 6792253 6759527 6728393 6700097 6674507 6650576
61351 6650576 6627986 6607430 6589402 6573489 6558894 6544984 6531179 6516793 6501158 6483640 6463641
61340 6463641 6441129 6417301 6394371 6374526 6359234 6349441 6346106 6350606 6365000 6391975 6434372 6494650
61328 6494650 6574633 6675255 6796307 6937075 7097865 7280531 7486874 7716786 7968551 8240505
61318 8240505 8531416 8839322 9160917 9491838 9826214 10155489 10468791 10755289 11005789
61309 11005789 11212137 11366622 11463510 11501083 11481466 11408586 11286758 11120652 10915362 10675980
61299 10675980 10407389 10114576 9802825 9477566 9144243 8808293 8474778 8147762 7830005
61290G830005l06716k94220k80072k63931k45843k26550k07127j88273j69922
61281E647351j51602j33067j14724r7506q2106o8200n4620m0479k5959j1860J244
61270D868472J3109K3557L2674M1048M9143N6424O1724O4622O6031O7161O8220
61259E412185O8351O6589O2583N6690M9816M3226L8077L4577L1582K7442K1648
61248E912766J5331R693M189k924j2082k1339k8394l3122l7438m2872m9059n4652
61236E660097n9028o2701o6304o9594p1609p1764p0605o9263o8270o7148o5160
61225D918651o2092n8330n4465n0903m7436m3254l7952l2610k9173k8390k8923
61214D445123k8923k7963k6944k6710k7290k8180k8574k7588k4851k0850j6351
$$ plain form
61290 7830005 7523289 7229069 6948997 6685066 6439223 6212673 6005546 5817273 5647351
61281 5647351 5495749 5362682 5247958 5150452 5068346 5000146 4945526 4905047 4879088 4867228 4868472
61270 4868472 4881581 4905138 4937812 4978860 5028003 5084427 5146151 5210773 5276804 5343965 5412185
61259 5412185 5480536 5547125 5609708 5666398 5716214 5759440 5797517 5832094 5863676 5891118 5912766
61248 5912766 5928097 5937790 5941979 5939055 5926973 5905634 5877240 5844118 5806680 5763808 5714749 5660097
61236 5660097 5601069 5538368 5472064 5402470 5330861 5259097 5188492 5119229 5050959 4983811 4918651
61225 4918651 4856559 4798229 4743764 4692861 4645425 4602171 4564219 4531609 4502436 4474046 4445123
61214 4445123 4416200 4388237 4361293 4334583 4307293 4279113 4250539 4222951 4198100 4177250 4160899
61203D160899j1578o319o03N215J0989J7107K4245L2832M2581N2605O2493P3213
61191D463679Q6099J00759J14792J26081J34478J40552J43812J43205J38664J30655
61181E722776J18413R9906P3810M0747K823l7129p5793j10147j38588j60986j77681
61170E358151j88947j95152j96625j93328j85622j75313j64902j55549j46596
61161C756117j37271j27772j18313j08295r7400q6660p7404o9541o1938n4251
61151B817272m7344m1747l6601l0746k4300j8522j4226j0801o981k275K671O981
61139B593381J0405J3155J5168J5925J5030J2699R599O331L219N80j217k265l615
61126B688395o636j1502j6653k0245k1893k2551k3056k3576k4341k5776k7557
$$ plain form
61203 4160899 4149321 4143002 4142399 4147614 4158603 4175710 4199955 4232787 4275368 4327973 4390466 4463679
61191 4463679 4549778 4650537 4765329 4891410 5025888 5166440 5310252 5453457 5592121 5722776
61181 5722776 5841189 5941095 6014905 6055652 6058475 6021346 5945553 5835406 5696818 5535832 5358151
61170 5358151 5169204 4974052 4777427 4584099 4398477 4223164 4058262 3902713 3756117
61161 3756117 3618846 3491074 3372761 3264466 3167066 3080406 3003002 2933461 2871523 2817272
61151 2817272 2769928 2728181 2691580 2660834 2636534 2618012 2603786 2592985 2586004 2583729 2586400 2593381
61139 2593381 2603786 2616941 2632109 2648034 2663064 2675763 2685362 2691693 2694912 2695492 2694275 2692010 2688395
61126 2688395 2681759 2670257 2653604 2633359 2611466 2588915 2565859 2542283 2517942 2492166 2464609
61115B464609k8490k8080k7534k8403l0521l2083l1835l0629l0535l2623l5799
61104B128077l7977l8383l8248l8917l9911l9714l8079l6251l4925l3341l0894
61093A721437k8526k7679k8651l0630l2603l3767l3805l3280l2985l2563l0870
61082A376078k8079k5947k5095k3700k0296j6392j4385j3942j2729j0193q153
61071A177167p526o738m205o10K281L992N438P420R771J1674J2389J1865J0873
61058A233791J0238J0113J0276J0793J1667J2241J1922J1353J1839J3493J4936
61047A362662J5050J4067J2531J0147O458K169r76j833j079n82j480l060l906
61034A410168l841l987m859n489m956l861l452l986m821n522o010o115n800n371
$$ plain form
61115 2464609 2436119 2408039 2380505 2352102 2321581 2289498 2257663 2227034 2196499 2163876 2128077
61104 2128077 2090100 2051717 2013469 1974552 1934641 1894927 1856848 1820597 1785672 1752331 1721437
61093 1721437 1692911 1665232 1636581 1605951 1573348 1539581 1505776 1472496 1439511 1406948 1376078
61082 1376078 1347999 1322052 1296957 1273257 1252961 1236569 1222184 1208242 1195513 1185320 1177167
61071 1177167 1169641 1162903 1158698 1158088 1160369 1164361 1169799 1177219 1186990 1198664 1211053 1222918 1233791
61058 1233791 1244029 1254142 1264418 1275211 1286878 1299119 1311041 1322394 1334233 1347726 1362662
61047 1362662 1377712 1391779 1404310 1414457 1420915 1423084 1422108 1420275 1419196 1418614 1417134 1414074 1410168
61034 1410168 1406327 1402340 1397481 1391992 1387036 1383175 1379723 1375737 1370916 1365394 1359384 1353269 1347469 1342098
61020A342098m827l651j964j092j978l747m939n424n970o642o840o564o245n854
61006A276361n303n172n795o171n175l284j758o46P96K225K572K024J909K642
60992A255225L392L739M178M931N778P024R208J1887J4078J5865J8106K0653K2351
60979A396415K2771K2723K3024K3983K5780K8177L0285L1888L4201L7838M1122
60968A718207M2467M3324M6202N0641N4098N6371N9847O5246P0482P4355P8345
60957B359585Q3763Q9882R5977J02724J10452J18265J26004J34941J45560J56514
60947C523667J66566J75698J84066J92072K01807K15932K34737K56607K81268
60938E432420L09600L40523L71908M05050M44388M92605N50268O20133P05831
$$ plain form
61020 1342098 1337271 1333620 1331656 1330564 1328586 1324839 1319900 1314476 1308506 1301864 1295024 1288460 1282215 1276361
61006 1276361 1271058 1265886 1260091 1253920 1248745 1245461 1243703 1243057 1243853 1246078 1248650 1250674 1252583 1255225
60992 1255225 1258617 1262356 1266534 1271465 1277243 1284267 1293475 1305362 1319440 1335305 1353411 1374064 1396415
60979 1396415 1419186 1441909 1464933 1488916 1514696 1542873 1573158 1605046 1639247 1677085 1718207
60968 1718207 1760674 1803998 1850200 1900841 1954939 2011310 2071157 2136403 2206885 2281240 2359585
60957 2359585 2443348 2533230 2629207 2731931 2842383 2960648 3086652 3221593 3367153 3523667
60947 3523667 3690233 3865931 4049997 4242069 4443876 4659808 4894545 5151152 5432420
60938 5432420 5742020 6082543 6454451 6859501 7303889 7796494 8346762 8966895 9672726
60929I672726Q05226R11689J024184J149308J291193J448243J624139J831560
60921A9758268K077544K356243K664355L000414L313348L456465L247040K622503
60913D2496180J738324Q81535K74233l4186j04537k19K14450L98029L35897j18583
60903D6081123r04556j779309k490586k922951l101222l101814k987686k803171
60895B5989828k584504k355422k123838j892932j670758j465574j279087j110224
60887A1507489r61177q34933p30076o42201n68249n06404m53918m08305l69186
60878F033040l36488l08267k82331k58579k37707k19092k01907j87017j75694
60869C825958j67283j59944j52891j46377j40196j33695j26830j19982j13139
$$ plain form
60929 9672726 10477952 11389641 12413825 13563133 14854326 16302569 17926708 19758268
60921 19758268 21835812 24192055 26856410 29856824 33170172 36626637 39873677 42496180
60913 42496180 44234504 45116039 45390272 45356086 45251549 45251330 45465780 45863809 46199706 46081123
60903 46081123 45176567 43397258 40906672 37983721 34882499 31780685 28792999 25989828
60895 25989828 23405324 21049902 18926064 17033132 15362374 13896800 12617713 11507489
60887 11507489 10546312 9711379 8981303 8339102 7770853 7264449 6810531 6402226 6033040
60878 6033040 5696552 5388285 5105954 4847375 4609668 4390576 4188669 4001652 3825958
60869 3825958 3658675 3498731 3345840 3199463 3059267 2925572 2798742 2678760 2565621
60860B565621j06211r9633r3879q8827q4137p9652p5020o9740o4055n8992n5059
60849A690416n1815m8971m6886m5391m3440m0561l7706l5761l4209l2064k9444
60838A244168k7361k6358k5936k4944k2336j8103j3691j0839r833r445q540o955
60826A039827m924k714r58k67l10j80K43L70L22J021K589L915M193L876L662L497
60810A054162K993K093J049L51N85J636K412K164J509J021k00k690m309k466J523
60795A061833L282J218j356j075J196K715L196M393O788R064J0354J1087J1844
60782A124539J2588J2933J2348J0586Q562Q073R706J1726J1985J0321Q256O913
60770A248536O238N833N518N172M751M545N038O408Q203R407R136P696O586O831
$$ plain form
60860 2565621 2459410 2359777 2265898 2177071 2092934 2013282 1938262 1868522 1804467 1745475 1690416
60849 1690416 1638601 1589630 1542744 1497353 1453913 1413352 1375646 1339885 1305676 1273612 1244168
60838 1244168 1216807 1190449 1164513 1139569 1117233 1099130 1085439 1074600 1064767 1055322 1046782 1039827
60826 1039827 1034903 1032189 1031231 1030964 1030654 1030474 1030717 1031087 1031409 1032430 1035019 1038934 1043127 1047003 1050665 1054162
60810 1054162 1057155 1059248 1060297 1060648 1061233 1062869 1065281 1067445 1068954 1069975 1069775 1067085 1062776 1060310 1061833
60795 1061833 1065115 1066333 1064977 1063902 1065098 1067813 1071009 1075402 1082190 1091254 1101608 1112695 1124539
60782 1124539 1137127 1150060 1162408 1172994 1181556 1189629 1199335 1211061 1223046 1233367 1241623 1248536
60770 1248536 1254774 1260607 1266125 1271297 1276048 1280593 1285631 1292039 1300242 1309649 1318785 1326481 1333067 1339898
60756A339898P788Q334Q531Q956R095Q113O627N726M541J175l812p399q149p909
60742A381515q622r834j0546j1193j2242j2889j2859j3630j5969j7859j6869j3423
60730A225580r834p322n847n634o653p357o131l583j615o13O58K772M960O602
60716A185983P835Q849R821J1301J3357J4780J4562J3800J4569J7086J9563K0729
60704A352235K0935K0715J9853J8405J7230J6890J6804J6057J4416J2323J0399
60693A536262R162Q694Q516Q141P608P062O176M652L012K235K596L425L731K737
60679A614009K26k972n305n968n860o378p745r119r962j0425j0611j0305r456
60666A520129q446p852q248r759j1538j2173j1170r453q053o981n941n214m924
$$ plain form
60756 1339898 1347686 1356020 1364551 1373507 1382602 1390715 1397342 1403068 1407609 1408784 1404972 1397573 1389424 1381515
60742 1381515 1372893 1363059 1352513 1341320 1329078 1316189 1303330 1289700 1273731 1255872 1239003 1225580
60730 1225580 1215746 1208424 1202577 1196943 1190290 1182933 1176802 1173219 1171604 1170991 1171649 1174421 1179381 1185983
60716 1185983 1193818 1202667 1212488 1223789 1237146 1251926 1266488 1280288 1294857 1311943 1331506 1352235
60704 1352235 1373170 1393885 1413738 1432143 1449373 1466263 1483067 1499124 1513540 1525863 1536262
60693 1536262 1545424 1554118 1562634 1570775 1578383 1585445 1591621 1596273 1599285 1601520 1604116 1607541 1611272 1614009
60679 1614009 1614235 1611263 1605958 1599990 1594130 1587752 1580007 1570888 1560926 1550501 1539890 1529585 1520129
60666 1520129 1511683 1503831 1495583 1485824 1474286 1462113 1450943 1441490 1433437 1426456 1420515 1415301 1410377
60653A410377m205k312j36N60o77k541l588l498k784k003j447j197j419k500m471
60638A378159o292o619n585m794n028n043l514j130L63M13k50j040j857k433k660
60623A332690l204m763o998r098j0911j2562j3566j3547j3375j4232j5804j6698
60611A197932j6415j5646j4746j3213j0871q318o103m417l585l812m403m353l780
60598A088270l619l780k865k40K748M414M716M766M944M570L466K873M110O574
60584A120947P898O525L549J270L56l96j599k153j088P95K106K666L113L703M550
60569A152242O206Q741J0929J1609J1321J1384J1979J2504J3308J5480J9017K2612
60557A307332K5267K6902K7469K6814K5610K5170K5937K6996K7341K6778K5544
$$ plain form
60653 1410377 1406172 1403860 1403724 1404284 1403607 1401066 1397478 1393980 1391196 1389193 1387746 1386549 1385130 1382630 1378159
60638 1378159 1371867 1365248 1359663 1354869 1349841 1344798 1341284 1340154 1340517 1340930 1340680 1339640 1337783 1335350 1332690
60623 1332690 1329486 1324723 1317725 1308627 1297716 1285154 1271588 1258041 1244666 1230434 1214630 1197932
60611 1197932 1181517 1165871 1151125 1137912 1127041 1118723 1112620 1108203 1104618 1100806 1096403 1092050 1088270
60598 1088270 1084651 1080871 1078006 1077766 1080514 1084928 1089644 1094410 1099354 1103924 1107390 1110263 1114373 1120947
60584 1120947 1128845 1135370 1138919 1140189 1140545 1140149 1138550 1136397 1135309 1136104 1138210 1140876 1143989 1147692 1152242
60569 1152242 1158448 1167189 1178118 1189727 1201048 1212432 1224411 1236915 1250223 1265703 1284720 1307332
60557 1307332 1332599 1359501 1386970 1413784 1439394 1464564 1490501 1517497 1544838 1571616 1597160
60546A597160K3739K1301J7933J3134O902K35n677j0475j4329j7229j9394k1638
60534A591662k4151k5506k4248k1063j8045j6159j4885j4025j3884j3714j1963
60523A394019q695o042n452n868n511m184k804j755r60q53j983l764m701m027
60509A337420k546j590j344n60J893N358P815Q116P272P074Q120R783J1489J3086
60495A411386J4394J5393J6561J8180J9708K0673K1734K3708K6054K7597K8431
60484A643819K9606L1228L2483L3604L6067M0376M5042M8339M9719M8953M5334
60473B084570L8580K9605J9557Q841k330j3176k2704l0159l4778l5969l4171l0683
60461A977183k6268k0731j4173p474j074N454J1919J6886J9659K1727K4846K8606
$$ plain form
60546 1597160 1620899 1642200 1660133 1673267 1680169 1680404 1674727 1664252 1649923 1632694 1613300 1591662
60534 1591662 1567511 1542005 1517757 1496694 1478649 1462490 1447605 1433580 1419696 1405982 1394019
60523 1394019 1385324 1379282 1373830 1367962 1362451 1358267 1355463 1353708 1352748 1351895 1349912 1346148 1341447 1337420
60509 1337420 1334874 1333284 1331940 1331380 1333273 1338631 1346446 1354562 1361834 1368908 1377028 1386811 1398300 1411386
60495 1411386 1425780 1441173 1457734 1475914 1495622 1516295 1538029 1561737 1587791 1615388 1643819
60484 1643819 1673425 1704653 1737136 1770740 1806807 1847183 1892225 1940564 1990283 2039236 2084570
60473 2084570 2123150 2152755 2172312 2181153 2178823 2165647 2142943 2112784 2078006 2042037 2007866 1977183
60461 1977183 1950915 1930184 1916011 1908537 1907463 1912917 1924836 1941722 1961381 1983108 2007954 2036560
60449B036560L1477L3628L6941M2285M8642N5239O2898P2442Q3112R3835J05114
60438B702173J18291J33510J49887J67542J87681K10065K31961K50849K67274
60429D419233K83892L02447L23056L45673L70091L94097M12895M20669M11766
60420G683819L80882L24586K43752J43366K9764r0034k06180l06573l82460m32525
60410G388397m60191m68865m61732m43841m20568l94144l64292l31992k99998
60401C742774k69800k40923k13640j89763j69958j52658j36577j22306j10320
60392B136829r9407q8479p8509p1088o5968o1368n6052n0108m4189l8990l5125
60381A447546l2805l1591l0691k9342k7106k4252k1684j9985j8798j7734j7211
$$ plain form
60449 2036560 2068037 2101665 2138606 2180891 2229533 2284772 2347670 2420112 2503224 2597059 2702173
60438 2702173 2820464 2953974 3103861 3271403 3459084 3669149 3901110 4151959 4419233
60429 4419233 4703125 5005572 5328628 5674301 6044392 6438489 6851384 7272053 7683819
60420 7683819 8064701 8389287 8633039 8776405 8806169 8716135 8509955 8203382 7820922 7388397
60410 7388397 6928206 6459341 5997609 5553768 5133200 4739056 4374764 4042772 3742774
60401 3742774 3472974 3232051 3018411 2828648 2658690 2506032 2369455 2247149 2136829
60392 2136829 2037422 1948943 1870434 1799346 1733378 1672010 1615958 1565850 1521661 1482671 1447546
60381 1447546 1414741 1383150 1352459 1323117 1296011 1271759 1250075 1230090 1211292 1193558 1176347
60370A176347j7428j7265j5655j3519j2650j2959j2717j1383j0271j0070r661
60359A032769q078n914m076k482p96Q25K257L597M534M680M672N474O455N996
60345A049913M256L393M377N622N689N393N993P050P455P166O743O323O140O668
60331A132181P287O444M216L032M353O350O561N307M473M173L118J443P80J547
60317A191265K270J764M18j005k464m039n153m988l363j131L28L75pP00K561M191
60301A181722M857N159N381M849L718L637N347P328Q176Q754J0291J1893J2142
60288A273254J1809J2558J3809J3612J2162J1668J2556J2441R653N627K702J335
60276A393186N68k9k12o6k7k17l34o6P39J990L351M518N368N640M766K590j62
$$ plain form
60370 1176347 1158919 1141654 1125999 1112480 1099830 1086871 1074154 1062771 1052500 1042430 1032769
60359 1032769 1024691 1018777 1014701 1012219 1011423 1012248 1014505 1018102 1022636 1027316 1031988 1037462 1043917 1049913
60345 1049913 1054169 1057562 1061939 1067561 1073250 1078643 1084636 1091686 1099141 1106307 1113050 1119373 1125513 1132181
60331 1132181 1139468 1145912 1150128 1153160 1157513 1163863 1170424 1175731 1180204 1184377 1187495 1188938 1189718 1191265
60317 1191265 1193535 1195299 1195717 1194712 1192248 1188209 1183056 1178068 1174705 1173574 1173902 1174277 1174270 1174970 1177531 1181722
60301 1181722 1186579 1191738 1197119 1201968 1205686 1209323 1214670 1221998 1230174 1238928 1249219 1261112 1273254
60288 1273254 1285063 1297621 1311430 1325042 1337204 1348872 1361428 1373869 1383522 1389149 1391851 1393186
60276 1393186 1393754 1393725 1393513 1393447 1393420 1393203 1392869 1392803 1393542 1395532 1398883 1403401 1408769 1414409 1419175 1421765 1421603
60259A421603k727n231p994j0298j0848r406p140n408m852n403o321o416n077
60246A334482l081j647r17k67K35j49j319k024j394P4J366K049K271K253K064
60231A333996J595O85l80p36J48J613K568K981L775N282O658P147P208P959R837
60216A390336J2035J3273J3171J2896J3925J5958J6873J5396J3074J2406J3653
60205A542996J5053J5930J7643K0980K4406K6207K7090K9076L2480L5791L8463
60194A826115M1974M7373N3146N6915N8772O1469O7221P5397Q3748R1026R7677
60183B560833J04683J12528J21003J29436J37300J44984J53385J62066J68650
60174C794868J71102J70103J67973J65599J61793J55356J46167J34213J19331
$$ plain form
60259 1421603 1418876 1413645 1405651 1395353 1384505 1375099 1367959 1362551 1357699 1352296 1345975 1339559 1334482
60246 1334482 1331401 1329754 1328837 1328570 1328805 1328656 1327337 1325313 1323919 1323993 1325359 1327408 1329679 1331932 1333996
60231 1333996 1335591 1336276 1335896 1335160 1335308 1336921 1339489 1342470 1346245 1351527 1358185 1365332 1372540 1380499 1390336
60216 1390336 1402371 1415644 1428815 1441711 1455636 1471594 1488467 1503863 1516937 1529343 1542996
60205 1542996 1558049 1573979 1591622 1612602 1637008 1663215 1690305 1719381 1751861 1787652 1826115
60194 1826115 1868089 1915462 1968608 2025523 2084295 2145764 2212985 2288382 2372130 2463156 2560833
60183 2560833 2665516 2778044 2899047 3028483 3165783 3310767 3464152 3626218 3794868
60174 3794868 3965970 4136073 4304046 4469645 4631438 4786794 4932961 5067174 5186505
60165E186505J02370Q5057O8106N0901L3482J7243K827j0819k4067l4714m0165
60154E436726m0646l8684l5953l2008k5735j6706n142Q378K3044L8152N3289O8107
60142E432822Q2502R7116J12683J28371J41802J51396J57741J61923J63573J61536
60132F791465J55375J45139J30430J11053Q8209O4120M0641J8546k548k3891m6177
60121G472362o7884q6132r9642j09400j15948j18003j14897j08302r9822q8655
60111F463677p3617n5888l7583j8975N82K0180L8355N5606P3161Q9783J02473
60100F657754J10054J13550J13277J08370R9296Q8249P6501O3627M9816L6691
60090G517185K5225J4974O047p5k394j280L175J1821K4741M0535N8195P8136J00600
$$ plain form
60165 5186505 5288875 5373932 5442038 5492939 5526421 5543664 5546491 5535672 5511605 5476891 5436726
60154 5436726 5396080 5357396 5321443 5289435 5263700 5246994 5241852 5250230 5273274 5311426 5364715 5432822
60142 5432822 5515324 5612440 5725123 5853494 5995296 6146692 6304433 6466356 6629929 6791465
60132 6791465 6946840 7091979 7222409 7333462 7421671 7485791 7526432 7544978 7542430 7518539 7472362
60121 7472362 7404478 7318346 7218704 7109304 6993356 6875353 6760456 6652154 6552332 6463677
60111 6463677 6390060 6334172 6296589 6277614 6278196 6298376 6336731 6392337 6465498 6555281 6657754
60100 6657754 6767808 6881358 6994635 7103005 7202301 7290550 7367051 7430678 7480494 7517185
60090 7517185 7542410 7557384 7563431 7563356 7560962 7559682 7562857 7574678 7599419 7639954 7698149 7776285 7876885
60077G876885J24521J48941J74172K00657K27913K55520K84035L14077L45275
60068I951996L76635M07098M35409M60494M82218N00686N14565N21428N20028
60059A4170557N10765M93642M67536M32146L88958L39406K83488K21279J54420
60050A7462197Q5026J4194n7425j28500j97334k62184l20473l68845m05182m29773
60040A5391701m43684m46965m39346m21786l96232l64485l28088k88566k46928
60031A2015621k03600j59558j16652p6117l7772j662L0425N6230P5123Q7865R4854
60020A1764757R5672R0018P8081O0283L7429J0913j7659m6755p4627r9680j21777
60009A1776655j42346j62445j81465j98466k13747k27812k39497k46527k47882
$$ plain form
60077 7876885 8001406 8150347 8324519 8525176 8753089 9008609 9292644 9606721 9951996
60068 9951996 10328631 10735729 11171138 11631632 12113850 12614536 13129101 13650529 14170557
60059 14170557 14681322 15174964 15642500 16074646 16463604 16803010 17086498 17307777 17462197
60050 17462197 17547223 17561417 17503992 17375492 17178158 16915974 16595501 16226656 15821474 15391701
60040 15391701 14948017 14501052 14061706 13639920 13243688 12879203 12551115 12262549 12015621
60031 12015621 11812021 11652463 11535811 11459694 11421922 11420260 11450685 11506915 11582038 11669903 11764757
60020 11764757 11860429 11950447 12028528 12088811 12126240 12137153 12119494 12072739 11998112 11898432 11776655
60009 11776655 11634309 11471864 11290399 11091933 10878186 10650374 10410877 10164350 9916468
60000I916468k44493k37683k27909k15159j99676j82019j62764j42194j20086
59991H184485r5976p0045m3487j7619P176L1374N5493P9530J02719J23501J40287
59980H497438J52514J60531J64169J62260J54086J40543J23054J01907P6558M7306
59970I780366J5726j6418m7995p8276j06540j32085j54294j72663j86801j96216
59960H704804k00138j98039j90570j79414j65767j49557j30454j08974q5891o1272
59950G234728l5079q357J7286M1533O5666R0733J16110J40389J63087J84844K05877
59939H216817K24847K39417K47761K49331K44455K33550K16901J94811J67780
59930A0235670J36610J02365O5989K8023j0952m9569q6056j19413j49365j74702
$$ plain form
60000 9916468 9671975 9434292 9206383 8991224 8791548 8609529 8446765 8304571 8184485
59991 8184485 8088509 8018464 7974977 7957358 7964534 7995908 8051401 8130931 8233650 8357151 8497438
59980 8497438 8649952 8810483 8974652 9136912 9290998 9431541 9554595 9656502 9733060 9780366
59970 9780366 9796092 9779674 9731679 9653403 9546863 9414778 9260484 9087821 8901020 8704804
59960 8704804 8504666 8306627 8116057 7936643 7770876 7621319 7490865 7381891 7296000 7234728
59950 7234728 7199649 7191292 7208578 7250111 7315777 7406510 7522620 7663009 7826096 8010940 8216817
59939 8216817 8441664 8681081 8928842 9178173 9422628 9656178 9873079 10067890 10235670
59930 10235670 10372280 10474645 10540634 10568657 10557705 10508136 10422080 10302667 10153302 9978600
59920I978600j92791k01710k02224j96519j85566j69089j47761j23864r9398p4619
59910H385059m8792k1603O273L3249N7454P8227R6941J15293J32775J46948J56313
59899I138137J61603J64029J63658J60174J54025J45938J36143J24874J12965
59890A0461546J01283R0067P9427P0019O2894N9171O0061O6370P7651R2565J10671
59879A1331725J33146J61307J94886K32146K71062L10125L48594L86354M23156
59870A3792501M57785M88357N13073N29716N34676N23960M95629M50220L88664
59861A8174581L11360K20016J19050J4023r0518j90802k82538l61314m24193m70309
59851A7019356n00291n15690n18476n10250m92012m64888m30642l91222l48228
$$ plain form
59920 9978600 9785809 9584099 9381875 9185356 8999790 8830701 8682940 8559076 8459678 8385059
59910 8385059 8336267 8314664 8320937 8354186 8411640 8489867 8586808 8702101 8834876 8981824 9138137
59899 9138137 9299740 9463769 9627427 9787601 9941626 10087564 10223707 10348581 10461546
59890 10461546 10562829 10652896 10732323 10802342 10865236 10924407 10984468 11050838 11128489 11221054 11331725
59879 11331725 11464871 11626178 11821064 12053210 12324272 12634397 12982991 13369345 13792501
59870 13792501 14250286 14738643 15251716 15781432 16316108 16840068 17335697 17785917 18174581
59861 18174581 18485941 18705957 18825007 18839030 18748512 18557710 18275172 17913858 17489665 17019356
59851 17019356 16519065 16003375 15484899 14974649 14482637 14017749 13587107 13195885 12847657
59842A2847657l02989k56629k09834j63098j17174p2620k9180J3220N2922Q7417
59832A1849692J16139J40820J62393J78882J87243J85984J74851J53151J20114
59823A3269269P6548K4898l2286r3109j55554k16579k72215l18972l55651l83586
59813A1542763m04261m17007m20190m14438m02949l88331l70879l50384l27740
59804H046584l03826k78604k52590k27545k04285j81424j57921j35519j16717
59795F188153j01404q7606p4909o5065n9358n7103n6754n6993n6705n5217n2791
59784E464248n0056m7067m3645m0195l7224l4567l2223l1403l3415l7858m3123
59773E033472m8386n3596n7803n9150n7025n2943m8887m5623m2870m0168l7046
$$ plain form
59842 12847657 12544668 12288039 12078205 11915107 11797933 11725313 11696133 11709353 11762275 11849692
59832 11849692 11965831 12106651 12269044 12447926 12635169 12821153 12996004 13149155 13269269
59823 13269269 13345817 13370715 13338429 13245320 13089766 12873187 12600972 12282000 11926349 11542763
59813 11542763 11138502 10721495 10301305 9886867 9483918 9095587 8724708 8374324 8046584
59804 8046584 7742758 7464154 7211564 6984019 6779734 6598310 6440389 6304870 6188153
59795 6188153 6086749 5999143 5924234 5859169 5799811 5742708 5685954 5628961 5572256 5517039 5464248
59784 5464248 5414192 5367125 5323480 5283285 5246061 5211494 5179271 5147868 5114453 5076595 5033472
59773 5033472 4985086 4931490 4873687 4814537 4757512 4704569 4655682 4610059 4567189 4527021 4489975
59762D489975l3013k7890k1852j4985p175J383R871J7123K2361K5907K9271L4099
59750D525075M0806M8668N7175O6412P5716Q3163Q7333Q8798Q9006Q8281Q5906
59739E336339Q1621P5909O9122O1381N3302M5927M0033L6178L5243L8034M4221
59728E917310N2311O1027P0641Q2785R8741J17788J37636J57188J78271K03446
59718G077144K32266K61456K89091L16918L47602L81128M14999M46564M73660
59709A0240828M93575N02330M94357M62617M01192L10064J97351P5996m1239j43979
59699A2993092k24808k81017l15442l33338l37978l30013l10241k81283k46912
59690A0332060k10877j75847j42139j08124p3093l8881p350K2522N2973Q3861
$$ plain form
59762 4489975 4456962 4429072 4407220 4392235 4385060 4386443 4396314 4413437 4435798 4461705 4490976 4525075
59750 4525075 4565881 4614549 4671724 4738136 4813852 4897015 4984348 5073146 5162152 5250433 5336339
59739 5336339 5417960 5493869 5562991 5624372 5677674 5723601 5763634 5799812 5835055 5873089 5917310
59728 5917310 5969621 6030648 6101289 6184074 6282815 6400603 6538239 6695427 6873698 7077144
59718 7077144 7309410 7570866 7859957 8176875 8524477 8905605 9320604 9767168 10240828
59709 10240828 10734403 11236733 11731090 12193707 12594899 12904963 13102314 13178310 13137071 12993092
59699 12993092 12768284 12487267 12171825 11838487 11500509 11170496 10860255 10578972 10332060
59690 10332060 10121183 9945336 9803197 9695073 9621980 9583099 9575749 9598271 9651244 9735105
59680I735105J13199J40955J69689K01013K33621K65567K96806L28703L62351
59671A1847009L98154M36136M76096N18070N62621O09923O58862P08111P57778
59662A6972760Q08751Q60481R10809R57935J001068J038879J068576J087025J092058
59653B5798342J083004J061114J029654R92475R52472R12294Q76062Q48510Q31810
59644C4385737Q24177Q21811Q21201Q19447Q13572Q00077P74774P33412O73549
59635D1467757N95921N03405L99281K87566J74284O6370l1000j14681j81433k27451
59625D2940019k50616k51757k33100j96499j43560p6120M219R6158J97616L05340
59615D2391700M16177N28194O40122P50038Q54663R49454J029220J088902J123611
$$ plain form
59680 9735105 9848304 9989259 10158948 10359961 10593582 10859149 11155955 11484658 11847009
59671 11847009 12245163 12681299 13157395 13675465 14238086 14848009 15506871 16214982 16972760
59662 16972760 17781511 18641992 19552801 20510736 21511804 22550683 23619259 24706284 25798342
59653 25798342 26881346 27942460 28972114 29964589 30917061 31829355 32705417 33553927 34385737
59644 34385737 35209914 36031725 36852926 37672373 38485945 39286022 40060796 40794208 41467757
59635 41467757 42063678 42567083 42966364 43253930 43428214 43494584 43463584 43348903 43167470 42940019
59625 42940019 42689403 42437646 42204546 42008047 41864487 41788367 41792586 41888744 42086360 42391700
59615 42391700 42807877 43336071 43976193 44726231 45580894 46530348 47559568 48648470 49772081
59606D9772081J127631J094128J016656Q90893P15115M90924K25593o6916l69000
59597E4897105o63872r36871j174738j367146j509744j603931j653332j661912
59589D4325559j635349j581723j509649j426831j341035j260966j195320j151425
59581C3223261j134282j144470j175695j215762j251630j274196j279052j264930
59573B3483244j232745j185318j126679j061104r92416r23276q54896p87904p23399
59564A4595507o62525o05454n51794n01894m56646m15961l78532l43287l10283
59555A0369131k80169k53502k30438k10410j92362j75975j62158j51642j43978
59546H568497j38852j37057j38704j41657j43746j45595j49041j53506j56365
$$ plain form
59606 49772081 50899712 51993840 53010496 53901389 54616504 55107428 55333021 55266105 54897105
59597 54897105 54233233 53296362 52121624 50754478 49244734 47640803 45987471 44325559
59589 44325559 42690210 41108487 39598838 38172007 36830972 35570006 34374686 33223261
59581 33223261 32088979 30944509 29768814 28553052 27301422 26027226 24748174 23483244
59573 23483244 22250499 21065181 19938502 18877398 17884982 16961706 16106810 15318906 14595507
59564 14595507 13932982 13327528 12775734 12273840 11817194 11401233 11022701 10679414 10369131
59555 10369131 10088962 9835460 9605022 9394612 9202250 9026275 8864117 8712475 8568497
59546 8568497 8429645 8292588 8153884 8012227 7868481 7722886 7573845 7420339 7263974
59537G263974j56422j54565j51313j46363j40363j34352j27391j17583j05620
59528F030002r4378q4620p4188o2085n0132l9536k9027j7946q051l73O953J5549
59516E592168K3987L0389L5656M1600M7823N2857N6854O0717O4093O6605O9794
59505F142543P5280Q2131Q8572R5473J05420J18724J32838J45804J58210J71618
59495G316613J86818K03824K22172K41044K60105K79989L00969L21750L40826
59486I674110L58345L75071L90110M01424M08308M11510M10893M04976L93262
59477A3228009L77269L58238L34930L04941K67881K26649J85643J48108J14986
59468A5546654Q5672N9417L6041J6050O67q533j0853p176J388J5277L5666O1754
$$ plain form
59537 7263974 7107552 6952987 6801674 6655311 6514948 6380596 6253205 6135622 6030002
59528 6030002 5935624 5851004 5776816 5714731 5664599 5625063 5596036 5578090 5570039 5569666 5576619 5592168
59516 5592168 5616155 5646544 5682200 5723800 5771623 5824480 5881334 5942051 6006144 6072749 6142543
59505 6142543 6217823 6299954 6388526 6483999 6589419 6708143 6840981 6986785 7144995 7316613
59495 7316613 7503431 7707255 7929427 8170471 8430576 8710565 9011534 9333284 9674110
59486 9674110 10032455 10407526 10797636 11199060 11607368 12018878 12429771 12834747 13228009
59477 13228009 13605278 13963516 14298446 14603387 14871268 15097917 15283560 15431668 15546654
59468 15546654 15632326 15691743 15727784 15743834 15744501 15735968 15725115 15717939 15719327 15734604 15770270 15832024
59456A5832024R0173J17629J43000J66146J85537J97569J97681J82135J49962
59447A7261856J03618M6735j8869r2687j72188k52090l27701l96855m57564n05941
59437A5188314n38562n55726n60442n55048n40359n17350m87935m54209m17990
59428A0560693l80754l43174l05299k67836k32304j99153j66952j34524j02659
59419H428038p2520m3530j4464J4526M2623P0170R7895J25047J50294J74068J98044
59408I170191K22263K44519K62800K76893K87223K93332K93853K87161K71831
59399A1610066K47140K13190J70257J18620N9844k434o4164j23237j79327k31829
59389A1818126k79013l19063l50858l73752l87491l92662l90723l83517l72863
$$ plain form
59456 15832024 15922197 16039826 16182826 16348972 16534509 16732078 16929759 17111894 17261856
59447 17261856 17365474 17412209 17393340 17300653 17128465 16876375 16548674 16151819 15694255 15188314
59437 15188314 14649752 14094026 13533584 12978536 12438177 11920827 11432892 10978683 10560693
59428 10560693 10179939 9836765 9531466 9263630 9031326 8832173 8665221 8530697 8428038
59419 8428038 8355518 8311988 8297524 8312050 8354673 8424843 8522738 8647785 8798079 8972147 9170191
59408 9170191 9392454 9636973 9899773 10176666 10463889 10757221 11051074 11338235 11610066
59399 11610066 11857206 12070396 12240653 12359273 12419117 12416683 12352519 12229282 12049955 11818126
59389 11818126 11539113 11220050 10869192 10495440 10107949 9715287 9324564 8941047 8568184
59380H568184l60080l45328l27852l07519k85794k64708k45209k26928k09021
59371E995745j90756j71940j53396j36573j22071j09022r6309q3737p1518n9436
59361D800987m7258l5462k4922j6075q604j591N993J4318K2545L0337L8685M7507
59349D826460N3211N1527M3154L4004K9039K8476L0845L6427M5503N6196O6975
59338E301817P9161R3770J07438J15079J16125J15324J17630J24695J36104J51363
59328F458506J70077J91807K16181K42343K69041K96248L25709L58429L93065
59319H921406M28484M66166N07598N50854N92945O34537O78583P24449P67048
59310A4272070Q02195Q29351Q47956Q54460Q45306Q20793P84159P38273O85013
$$ plain form
59380 8568184 8208104 7862776 7534924 7227405 6941611 6676903 6431694 6204766 5995745
59371 5995745 5804989 5633049 5479653 5343080 5221009 5111987 5015678 4931941 4860423 4800987
59361 4800987 4753729 4718267 4693345 4677270 4668666 4667075 4673068 4687386 4709931 4740268 4778953 4826460
59349 4826460 4879671 4931198 4974352 5008356 5037395 5065871 5096716 5133143 5178646 5234842 5301817
59338 5301817 5380978 5474748 5582186 5697265 5813390 5928714 6046344 6171039 6307143 6458506
59328 6458506 6628583 6820390 7036571 7278914 7547955 7844203 8169912 8528341 8921406
59319 8921406 9349890 9816056 10323654 10874508 11467453 12101990 12780573 13505022 14272070
59310 14272070 15074265 15903616 16751572 17606032 18451338 19272131 20056290 20794563 21479576
59301B1479576O26788N66708N07162M48944L91751L35263K79854K25966J72459
59292B5034471J16374N5312j0631q0362j54139k32503l13426l92689m67129n35761
59282B3019517n97647o50906o94385p28580p54198p71191p79675p80403p73780
59273A6488752p59681p38645p12167o81470o47039o09547n70118n29626m88980
59264A0751479m49853m13620l79428l45145l10491k77661k48327k21680j96142
59255G909132j71576j48931j28860j11326r5755q1007o6084n1206l7242k3998
59245F993147j0231M421J8726L1571M3276N4779O6488P8294Q9806J00248J09027
59234G579552J16547J23552J29715J34037J36640J38804J41037J42330J41581
$$ plain form
59301 21479576 22106364 22673072 23180234 23629178 24020929 24356192 24636046 24862012 25034471
59292 25034471 25150845 25206157 25195526 25115164 24961025 24728522 24415096 24022407 23555278 23019517
59282 23019517 22421870 21770964 21076579 20347999 19593801 18822610 18042935 17262532 16488752
59273 16488752 15729071 14990426 14278259 13596789 12949750 12340203 11770085 11240459 10751479
59264 10751479 10301626 9888006 9508578 9163433 8852942 8575281 8326954 8105274 7909132
59255 7909132 7737556 7588625 7459765 7348439 7252684 7171677 7105593 7054387 7017145 6993147
59245 6993147 6982916 6987337 7006063 7037634 7080910 7135689 7202177 7280471 7370277 7470525 7579552
59234 7579552 7696099 7819651 7949366 8083403 8220043 8358847 8499884 8642214 8783795
59225H783795J38657J33975J28393J23648J21340J21103J21171J21170J22744
59216I915996J26631J30490J30731J25774J16961J07022R8072R0086Q0673O7008
59206A0989444M8378K6351K555k2608m8983p5598j00989j23585j41694j54248
59196A0399023j61822j65789j66205j61784j52255j39468j25532j10982r5351
59187I119835p8555o0992m3042k5160q069P477K0898L2073M1833N1632O1681P0010
59175I189621P4667P6421P7854Q0324Q3628Q8290R5862J06600J19079J32827J49471
59164A0274644J70450J95219K22592K52191K83568L15359L46310L75863M02639
59155A2838835M23409M34694M34466M21497L94119L50837K91618K17911J31919
$$ plain form
59225 8783795 8922452 9056427 9184820 9308468 9429808 9550911 9672082 9793252 9915996
59216 9915996 10042627 10173117 10303848 10429622 10546583 10653605 10751677 10841763 10922436 10989444
59206 10989444 11037822 11064173 11066728 11044120 10995137 10919539 10818550 10694965 10553271 10399023
59196 10399023 10237201 10071412 9905207 9743423 9591168 9451700 9326168 9215186 9119835
59187 9119835 9041280 8980288 8937246 8912086 8904017 8911494 8932392 8964465 9006298 9057930 9119611 9189621
59175 9189621 9264288 9340709 9418563 9498887 9582515 9670805 9766667 9873267 9992346 10125173 10274644
59164 10274644 10445094 10640313 10862905 11115096 11398664 11714023 12060333 12436196 12838835
59155 12838835 13262244 13696938 14131404 14552901 14947020 15297857 15589475 15807386 15939305
59146A5939305L6598o4299j66724k66641l59796m41967n09827n61331n95625o13540
59136A2396153o17770o11241n95417n71250n41192n08473m74593m39547m04440
59127G632230l71581l41639l13141k85499k60333k38673k19069j99845j81406
59118E221044j64779j49590j35096j21842j10554j00467r0297q0091p0802o2671
59108D134855n5208m8048m0867l3181k5169j7856j1717n873O24P725J5102K2693
59096C943080K9761L4941L8425M2738M9958N9068O7376P3578P8290Q2538Q7152
59085D586905R2855R9517J05746J10406J14044J17848J21769J24811J26675J28099
59075E728675J29703J31145J31063J27705J20432J10933J01866R3869Q5260P5201
$$ plain form
59146 15939305 15975903 15911604 15744880 15478239 15118443 14676476 14166649 13605318 13009693 12396153
59136 12396153 11778383 11167142 10571725 10000475 9459283 8950810 8476217 8036670 7632230
59127 7632230 7260649 6919010 6605869 6320370 6060037 5821364 5602295 5402450 5221044
59118 5221044 5056265 4906675 4771579 4649737 4539183 4438716 4348419 4268328 4197526 4134855
59108 4134855 4079647 4031599 3990732 3957551 3932382 3914526 3902809 3896936 3897560 3905285 3920387 3943080
59096 3943080 3972841 4007782 4046207 4088945 4138903 4197971 4265347 4338925 4417215 4499753 4586905
59085 4586905 4679760 4779277 4885023 4995429 5109473 5227321 5349090 5473901 5600576 5728675
59075 5728675 5858378 5989523 6120586 6248291 6368723 6479656 6581522 6675391 6760651 6835852
59065F835852O5388N7476N0764M4091L8524L5980L6117L6920L8004M1276M8134
59054G328526N7711O8131P8272Q8095R8322J09997J23536J38138J52753J67381
59044H410862J82554J97831K11792K23445K32582K38697K40400K36208K25284
59035A0399655K07216J81609J48267J07750O1806J3201l5180q1204j23221j59215
59025A0720684j87305k07424k21645k32085k39103k42202k41974k40181k38154
59016H670611k36109k34134k32955k33184k34172k34257k32423k29371k26515
59007F577491k24105k21086k16751k11474k05441j98018j89246j80658j73289
58998D757423j65949j57065j47323j38546j30740j22372j13265j04820r7552r0633
$$ plain form
59065 6835852 6901240 6958716 7009480 7053571 7092095 7128075 7164192 7201112 7239116 7280392 7328526
59054 7328526 7386237 7454368 7532640 7620735 7719057 7829054 7952590 8090728 8243481 8410862
59044 8410862 8593416 8791247 9003039 9226484 9459066 9697763 9938163 10174371 10399655
59035 10399655 10606871 10788480 10936747 11044497 11106303 11119504 11084324 11003120 10879899 10720684
59025 10720684 10533379 10325955 10104310 9872225 9633122 9390920 9148946 8908765 8670611
59016 8670611 8434502 8200368 7967413 7734229 7500057 7265800 7033377 6804006 6577491
59007 6577491 6353386 6132300 5915549 5704075 5498634 5300616 5111370 4930712 4757423
58998 4757423 4591474 4434409 4287086 4148540 4017800 3895428 3782163 3677343 3579791 3489158
58988C489158q4010p8642p4353o9779o4915o1489o0078n9173n7854n7156n7662
58977B764047n7932n6598n4191n1706m9008m5777m2377l8827l4590l0323k7811
58966B274907k7077k5600k1758j7142j3998j2233j0561q883p766o937o039n581
58954B111332n743n484m128k478j152M98K562L537K710J823K556M007M582M719
58940B119341N769P526Q897R874J0877J1383J0942J0391J0385J0097R142R170
58928B233794J1513J4706J6538J7178J8062J9089J9376J9555K0730K2241K2949
58917B435731K3735K6033K8858L0117L0177L1223L3490L5075L5469L6406L8881
58906B785195M1800M4064M5916M7705M9179N0365N1566N2369N2148N1663N2598
$$ plain form
58988 3489158 3405148 3326506 3252153 3182374 3117459 3055970 2995892 2936719 2878865 2821709 2764047
58977 2764047 2706115 2649517 2595326 2543620 2494612 2448835 2406458 2367631 2333041 2302718 2274907
58966 2274907 2247830 2222230 2200472 2183330 2169332 2157099 2146538 2137655 2129889 2122952 2116913 2111332
58954 2111332 2105589 2100105 2095977 2093499 2092347 2092845 2095407 2098944 2101654 2103477 2106033 2110040 2114622 2119341
58940 2119341 2125110 2132636 2141533 2151407 2162284 2173667 2184609 2195000 2205385 2215482 2224624 2233794
58928 2233794 2245307 2260013 2276551 2293729 2311791 2330880 2350256 2369811 2390541 2412782 2435731
58917 2435731 2459466 2485499 2514357 2544474 2574651 2605874 2639364 2674439 2709908 2746314 2785195
58906 2785195 2826995 2871059 2916975 2964680 3013859 3064224 3115790 3168159 3220307 3271970 3324568
58895C324568N5450N9198O2897O6309O9307P2087P5641Q0494Q5418Q8863R1265
58884D131497R4451R9316J05551J12948J21219J29219J36308J43923J53973J66181
58874E394586J78896J91874K06134K21537K36915K52291K68875K86929L05822
58865G543859L26090L49235L75363M02971M31322M61161M93209N27620N64868
58856A1475698O05191O47206O88981P30447P72795Q15555Q56389Q93873R28195
58847A8414330R58593R81879R94078R91951R72613R33506Q73354P91886O88375
58838B6600565N61887M13634K48277P3045j03658k73606m30666n71614o94153
58829B5823711p94880q70835r22371r52643r64726r60994r44555r18774q85367
$$ plain form
58895 3324568 3380018 3439216 3502113 3568422 3637729 3709816 3785457 3865951 3951369 4040232 4131497
58884 4131497 4225948 4325264 4430815 4543763 4664982 4794201 4930509 5074432 5228405 5394586
58874 5394586 5573482 5765356 5971490 6193027 6429942 6682233 6951108 7238037 7543859
58865 7543859 7869949 8219184 8594547 8997518 9428840 9890001 10383210 10910830 11475698
58856 11475698 12080889 12728095 13417076 14147523 14920318 15735873 16592262 17486135 18414330
58847 18414330 19372923 20354802 21348880 22340831 23313444 24246950 25120304 25912190 26600565
58838 26600565 27162452 27576086 27824363 27897408 27793750 27520144 27089478 26517864 25823711
58829 25823711 25028831 24157996 23235625 22282982 21318256 20357262 19412707 18493933 17608566
58820A7608566q45004p99751p52826p06137o60037o15474n74131n36412n01342
58811A1617452m68550m38529m11058l85508l62416l42456l24036l04518k83905
58802H296476k64608k47390k30349k12503j95394j80170j65652j50619j35744
58793F514047j21980j08961r6228q4194p2755o0734m7853l5593k4867j4464l043
58782E843375Q753J9626K9947M1320N4422O8175Q0811R1433J01012J11748J24714
58771F575336J38474J51129J63190J76863J92934K10212K27924K46560K66296
58762H348918K86705L08290L32352L58996L87152M16739M48764M83002N17999
58753A1888917N53817N92387O34292O77493P20257P63084Q06396Q48185Q85328
$$ plain form
58820 17608566 16763562 15963811 15210985 14504848 13844811 13229337 12655206 12118794 11617452
58811 11617452 11148902 10710373 10299315 9913807 9551391 9208935 8884899 8580381 8296476
58802 8296476 8031868 7784478 7554129 7341626 7146232 6966062 6800410 6649791 6514047
58793 6514047 6392067 6283106 6186878 6102684 6029929 5969195 5921342 5885749 5860882 5846418 5843375
58782 5843375 5852128 5871754 5901701 5943021 5997443 6065618 6146429 6237862 6338874 6450622 6575336
58771 6575336 6713810 6864939 7028129 7204992 7397926 7608138 7836062 8082622 8348918
58762 8348918 8635623 8943913 9276265 9635261 10022413 10439152 10887916 11370918 11888917
58753 11888917 12442734 13035121 13669413 14346906 15067163 15830247 16636643 17484828 18370156
58744A8370156R15624R37193R47265R42918R21903Q81737Q19316P32646O22214
58735B6090972M90127L39229J73940Q83j72345l38626m91672o26433p39987q31317
58725B3894771r00086r46643r73048r82425r77089r58607r29741q94540q56050
58716A5476542q15348p73045p30301o88171o47392o08862n72764n37532n01712
58707I601415m66750m35722m09126l84360l59612l35727l13658k92767k72734
58698F330959k54621k38647k23133k07085j91953j79258j68062j56368j43856
58689D567976j31836j21414j12746j05328r8278r1049q4121p8179p2762o7046
58679C605217o1703n8281n6764n5702n4577n3903n3006n0226m5758m1925l9958
$$ plain form
58744 18370156 19285780 20222973 21170238 22113156 23035059 23916796 24736112 25468758 26090972
58735 26090972 26581099 26920328 27094268 27095151 26922806 26584180 26092508 25466075 24726088 23894771
58725 23894771 22994685 22048042 21074994 20092569 19115480 18156873 17227132 16332592 15476542
58716 15476542 14661194 13888149 13157848 12469677 11822285 11213423 10640659 10103127 9601415
58707 9601415 9134665 8698943 8289817 7905457 7545845 7210118 6896460 6603693 6330959
58698 6330959 6076338 5837691 5614558 5407473 5215520 5036262 4868200 4711832 4567976
58689 4567976 4436140 4314726 4201980 4096652 3998374 3907325 3823204 3745025 3672263 3605217
58679 3605217 3543514 3485233 3428469 3372767 3318190 3264287 3211281 3161055 3115297 3073372 3033414
58668C033414l8838l7837l7785l8957m0144m0827m2068m4241m5998m6569m7013
58657B573137m8155m9294m9855n0428n1264n1650n1471n1459n1273m9518m6263
58646B022507m3220m0849l7793l3944l1284l0714l0625k9771k8906k8501k7646
58635A659254k6369k6262k7376k7374k5303k3380k3318k3706k2854k1403k0120
58624A391789j7914j4416j1786j1473j1472r410o210m154l197j750M68K708M820
58611A308003O601P128O472O348P359P637O068M490M596M949L573J285j80j261
58597A373068l123m930n401n385o077o276m243r61J413L058N659R056J1616J3215
58583A380689J5224J8009K0691K2845K4593K5853K7170L0098L4888L9189M1219
$$ plain form
58668 3033414 2994576 2956739 2918954 2879997 2839853 2799026 2756958 2712717 2666719 2620150 2573137
58657 2573137 2524982 2475688 2425833 2375405 2324141 2272491 2221020 2169561 2118288 2068770 2022507
58646 2022507 1979287 1938438 1900645 1866701 1835417 1804703 1774078 1744307 1715401 1686900 1659254
58635 1659254 1632885 1606623 1579247 1551873 1526570 1503190 1479872 1456166 1433312 1411909 1391789
58624 1391789 1373875 1359459 1347673 1336200 1324728 1315318 1309108 1304954 1301757 1300007 1300475 1303183 1308003
58611 1308003 1314604 1321732 1328204 1334552 1341911 1349548 1355616 1360106 1364702 1369651 1373224 1374509 1374329 1373068
58597 1373068 1369945 1365015 1359614 1354229 1348152 1341876 1337633 1336672 1338085 1341143 1346802 1355858 1367474 1380689
58583 1380689 1395913 1413922 1434613 1457458 1482051 1507904 1535074 1565172 1600060 1639249 1680468
58572A680468M2830M6916N3027N8210O1431O4470O8823P4117P9567Q5162R1454
58561B406475R9313J09382J20782J31443J40776J50710J62830J76185J89441K03273
58551C890610K18643K34245K47980K59690K70263K78875K83034K80612K70403
58542F234355K51840K25436J92333J52324J04054M8514r614o5399j16470j61248
58532F856125j97347k23876k42763k55448k60718k58259k51638k44554k36325
58523D685197k24219k08463j91721j75393j59574j45190j32908j21228j08566
58514C217935r5972q5222p5904o7156o0340n6741n4449n1034m7664m6963m8115
58503B528375m7955m5829m3677m2160m0328l8518l7978l8096l7249l5884l5603
$$ plain form
58572 1680468 1723298 1770214 1823241 1881451 1942882 2007352 2076175 2150292 2229859 2315021 2406475
58561 2406475 2505788 2615170 2735952 2867395 3008171 3158881 3321711 3497896 3687337 3890610
58551 3890610 4109253 4343498 4591478 4851168 5121431 5400306 5683340 5963952 6234355
58542 6234355 6486195 6711631 6903964 7056288 7160342 7208856 7199242 7133843 7017373 6856125
58532 6856125 6658778 6434902 6192139 5936691 5675973 5417714 5166076 4921522 4685197
58523 4685197 4460978 4252515 4060794 3885401 3725827 3580637 3447729 3326501 3217935
58514 3217935 3121963 3036741 2960837 2893681 2833341 2776600 2722151 2671117 2623453 2576490 2528375
58503 2528375 2480420 2434591 2390914 2348754 2308426 2269908 2231930 2193834 2156585 2120701 2085098
58492B085098l5967l5447l4841l6213l8891m0025l8922l7546l6881l5885l4071
58481A680409l2142l0101k7480k5243k4861k5680k5711k4602k3341k1693j8700
58470A400855j5246j3270j2869j2699j2675j3629j4877j4898j3923j3271j2744
58459A250754j1241r295q364q264p824p256p407p579o652n267m424l317j195K88
58445A162957m96k128k717l504o127q298o694k748r86k460m283m979n730o698
58431A105109o625o001o417o939n323k618k202m230n413m484l597l869l875l145
58417A040371l088l725l419k527l406n910o771m627k146j980l582n137n884n710
58403I82459m794m219m698m874l206q89j99p39m22P83J475K110L898N436M497
$$ plain form
58492 2085098 2049131 2013684 1978843 1942630 1903739 1863714 1824792 1787246 1750365 1714480 1680409
58481 1680409 1648267 1618166 1590686 1565443 1540582 1514902 1489191 1464589 1441248 1419555 1400855
58470 1400855 1385609 1372339 1359470 1346771 1334096 1320467 1305590 1290692 1276769 1263498 1250754
58459 1250754 1239513 1230218 1221854 1213590 1205766 1198510 1191103 1183524 1176872 1171605 1167181 1163864 1162669 1162957
58445 1162957 1162461 1160333 1157616 1154112 1147985 1139687 1132993 1130245 1129259 1126799 1122516 1117537 1111807 1105109
58431 1105109 1098484 1092483 1086066 1079127 1073804 1071186 1068984 1064754 1059341 1054857 1051260 1047391 1043516 1040371
58417 1040371 1037283 1033558 1030139 1027612 1024206 1018296 1011525 1006898 1004752 1002772 999190 994053 988169 982459
58403 982459 977665 973446 968748 963874 960668 959779 959580 958841 958419 959202 960677 962787 966685 972121 976618
58388I76618K442K513M404N020M108M349O061O726N910N801O563N876L689K720
58374A042800L496L272O82k699n867r180j1490j0898q736q243r003p546l652r82
58360I71954p96m19J109J270o48j724n12P93J018K105M792O701O602O359O991
58345A005595O950N889N975P911R587J0055J0801J2035J1965J0852J1340J3481
58333A122436J4055J2106J0638J1323J2106J1551J1193J1990J2694J2983J4006
58322A257081J4801J2784Q670O230O213N592L573K814L510K235j630m094l133
58309A314646j487r15O34L814N576M700M281O064P467O781O178O946O886N096
58295A376667M391O283Q286Q580Q581Q820P384M526L561N024N419L784L740O763
$$ plain form
58388 976618 979060 981573 985977 990997 995105 999454 1005515 1012241 1018151 1023952 1030515 1036391 1040080 1042800
58374 1042800 1046296 1049568 1050250 1047551 1041684 1032504 1021014 1010116 1001380 993137 984134 976588 972936 971954
58360 971954 971158 970739 971848 973118 972470 970746 970234 971027 972045 974150 978942 985643 992245 998604 1005595
58345 1005595 1012545 1018434 1024409 1032320 1041907 1051962 1062763 1074798 1086763 1097615 1108955 1122436
58333 1122436 1136491 1148597 1159235 1170558 1182664 1194215 1205408 1217398 1230092 1243075 1257081
58322 1257081 1271882 1284666 1293336 1299566 1305779 1311371 1314944 1317758 1321268 1323503 1321873 1317779 1314646
58309 1314646 1313159 1312244 1312878 1316692 1322268 1326968 1331249 1337313 1344780 1351561 1357739 1364685 1371571 1376667
58295 1376667 1381058 1387341 1395627 1404207 1412788 1421608 1428992 1433518 1437079 1442103 1447522 1451306 1455046 1461809
58281A461809R333R282R150J0581J1427J1006J2102J4951J5530J2794J1374J3906
58269A603245J6868J7316J7406J8899J9443J7955J7606J9897K1714K1448K1906
58258A813703K4075K4585K2472K1598K3231K3460K1260K1315K5100K7271K5288
58247B073358K4388K8075L1818L1634L0913L2998L4715L3434L3010L6433L9708
58236B430484L9318L8747M1360M3824M2940M2071M4503M7183M7162M7339M9891
58225B914822N1304M9860N0318N5006N8342N6880N6374O1699O8087P0057P0949
58214C563698P5641Q1699Q5678R0329R7617J02670J02765J04109J11325J18698
58204D534229J20445J21098J26783J34766J40864J48518J61027J73338J81088
$$ plain form
58281 1461809 1471142 1480424 1489574 1500155 1511582 1522588 1534690 1549641 1565171 1577965 1589339 1603245
58269 1603245 1620113 1637429 1654835 1673734 1693177 1711132 1728738 1748635 1770349 1791797 1813703
58258 1813703 1837778 1862363 1884835 1906433 1929664 1953124 1974384 1995699 2020799 2048070 2073358
58247 2073358 2097746 2125821 2157639 2189273 2220186 2253184 2287899 2321333 2354343 2390776 2430484
58236 2430484 2469802 2508549 2549909 2593733 2636673 2678744 2723247 2770430 2817592 2864931 2914822
58225 2914822 2966126 3015986 3066304 3121310 3179652 3236532 3292906 3354605 3422692 3492749 3563698
58214 3563698 3639339 3721038 3806716 3897045 3994662 4097332 4200097 4304206 4415531 4534229
58204 4534229 4654674 4775772 4902555 5037321 5178185 5326703 5487730 5661068 5842156
58195E842156J89095K01466K12638K18103K24224K37011K51008K60153K69505
58186G905359K84900L01333L13515L27460L49265L72915L91860M11849M39265
58177A1097721M67942M91199N15577N48613N84675O17378O53777P01298P53444
58168A6431624Q03840Q60598R30497J003779J072191J146405J236474J331585
58160B4816993J419786J510647J616133J727011J832721J946455K084124K236640
58152C9190510K390965K559932K762134K992758L245832L543298L907531M328867
58144F4921827M798537N348528O017038O801801P692669Q717315R901033J1218306
58136A25417054J2647869J4234929J6021897J7961270J9990108K2149537K4538967
$$ plain form
58195 5842156 6031251 6232717 6445355 6663458 6887682 7124693 7375701 7635854 7905359
58186 7905359 8190259 8491592 8805107 9132567 9481832 9854747 10246607 10658456 11097721
58177 11097721 11565663 12056862 12572439 13121052 13705727 14323105 14976882 15678180 16431624
58168 16431624 17235464 18096062 19026559 20030338 21102529 22248934 23485408 24816993
58160 24816993 26236779 27747426 29363559 31090570 32923291 34869746 36953870 39190510
58152 39190510 41581475 44141407 46903541 49896299 53142131 56685429 60592960 64921827
58144 64921827 69720364 75068892 81085930 87887731 95580400 104297715 114198748 125417054
58136 125417054 138064923 152299852 168321749 186283019 206273127 228422664 252961631
58129B52961631K7232758L0355024L3995737L7555722L9081825L5860280K6403912
58122D83446889J2056001l574821j6888236k6102720l1299244l3401511l3390592
58115C50845766l2089940l0114850k7809003k5311565k2722261k0157781j7694138
58108A74946228j5360442j3195170j1239016r475124p844051o325281m952054
58101A06555090l747527k712096j899601j455190j522326k099508k992919l912302
58093H6213621m628392n065562n267439n295047n173834m923149m589864m226250
58085D7044084l855694l482975l121931k790388k490611k217182j975277j772236
58077B5337790j600180j445776j309397j197390j103565j016082r35776q70574
$$ plain form
58129 252961631 280194389 310549413 344545150 382100872 421182697 457042977 483446889
58122 483446889 495502890 491928069 475039833 448937113 417637869 384236358 350845766
58115 350845766 318755826 288640976 260831973 235520408 212798147 192640366 174946228
58108 174946228 159585786 146390616 135151600 125676476 117832425 111507144 106555090
58101 106555090 102807563 100095467 98195866 96740676 95218350 93118842 90125923 86213621
58093 86213621 81585229 76519667 71252228 65957181 60783347 55860198 51270334 47044084
58085 47044084 43188390 39705415 36583484 33793096 31302485 29085303 27110026 25337790
58077 25337790 23737610 22291834 20982437 19785047 18681482 17665400 16729624 15859050
58069A5859050q17596p66864p17236o73417o32496n88425n44986n10042m81265
58060A0126723m51010m20620l96709l77929l58644l41292l31914l27372l19610
58051F801623l08975l00995k93850k81523k66094k54519k45902k33832k18810
58042D397123k06845j97875j86643j73022j60923j49187j34138j19021j10358
58033B959111j06672j00928r2420q6329q3229p9133p4487p3171p3648p0680o5029
58022B053385o2205o2393o0645n6313n3474n2488m9770m5495m3213m2232l8437
58011A486720l2359k8561k7466k5410k2245k1205k1840k0607j7974j7437j8226
58000A233390j6578j3515j3468j5726j5305j2177j1446j4134j5800j4992j5137
$$ plain form
58069 15859050 15041454 14274590 13557354 12883937 12251441 11663016 11118030 10607988 10126723
58060 10126723 9675713 9255093 8858384 8480455 8121811 7780519 7448605 7121233 6801623
58051 6801623 6492648 6191653 5897803 5616280 5350186 5095667 4849765 4615933 4397123
58042 4397123 4190278 3992403 3805760 3632738 3471815 3322628 3188490 3069469 2959111
58033 2959111 2852439 2751511 2659091 2572762 2489533 2410400 2335913 2262742 2189094 2118414 2053385
58022 2053385 1991180 1928787 1868142 1811829 1758355 1705867 1656097 1610602 1567389 1525157 1486720
58011 1486720 1454361 1425800 1398334 1372924 1350679 1329474 1307634 1287027 1269053 1251616 1233390
58000 1233390 1216812 1203297 1189829 1174103 1158798 1146621 1135175 1121041 1105241 1090249 1075112
57989A075112j7014j6985j4159j2136j2087j0910p930o710q324r118p187n161
57977I47391m585l196r7J797P86o71l64M99M13L2j76j272l450n223n913o149n822
57960I14000m592m026n841q505r270q831r928j2211j2939j2126j2249j3297j2962
57947G87223j1498j1511j2864j2767j0980j0056j0262r166o659n414n782n064
57935F75200k658j211j753k211j675j749k648k314n37J18j371k992l434l618l822
57920F43325k977j472j015j188N4K178K298O3j724j868k124l296m097m413n549
57905F18195o704n593l163l134n999q055p481o699p277p173m988k729k173k172
57891E44855j593j430k137k203j046k03j59P28K715L602K623J980K941L734L042
$$ plain form
57989 1075112 1058098 1041113 1026954 1014818 1002731 991821 983891 977181 968857 959739 952552 947391
57977 947391 942806 939610 939513 941310 942096 941425 941061 941560 941973 942005 941829 940557 937107 931884 925971 919822 914000
57960 914000 909408 905382 899541 891036 881766 872935 863007 850796 837857 825731 813482 800185 787223
57947 787223 775725 764214 751350 738583 727603 717547 707285 698119 691460 686046 680264 675200
57935 675200 672542 671331 669578 667367 665692 663943 661295 658981 658444 658562 657191 654199 650765 647147 643325
57920 643325 640348 638876 637861 636673 636727 638905 641203 641266 639542 637674 635550 632254 628157 623744 618195
57905 618195 611491 605898 602735 599601 593602 585547 578066 571367 564090 556917 551929 549200 547027 544855
57891 544855 543262 541832 539695 537492 536446 536243 536084 536812 539527 543129 545752 547732 550673 554407 557449
57876E57449K175K070J279j148l777n421o869q518r285r156r766j1122j1001q949
57862D77961p474p690p366n104k861k154j289J130L127K605R08M33J088J738K857
57847D57909N080P138P740P817Q656R443Q752O923N069L270J480N80Q13P08q07
57832E30571k676l524l662m005m477m856n637o877p568p158o308n580m869m500
57818D58874m898n037l575j690j913l778l917j270J288J733J740L045M488M749
57804D49839M838N551N443L912L362N512P981P463M247Q59j807m299o289p189
57790D79423p691q330p922n701l525l670n658p329p843p640o779n277l988l459
57776C94611l120k924m082o708q672q546p718p799p987p171o561p755r847j0871
$$ plain form
57876 557449 559624 561694 562973 561825 558048 552627 545758 537240 527955 518799 509033 497911 486910 477961
57862 477961 470487 462797 455431 450327 447466 445312 444023 445153 448280 450885 451793 452226 453314 455052 457909
57847 457909 462989 470127 477867 485684 494340 503783 512535 519458 524527 527797 529277 529857 530670 531378 530571
57832 530571 527895 524371 520709 516704 512227 507371 501734 494857 487289 480131 473823 468243 463374 458874
57818 458874 453976 448939 445364 443674 441761 437983 434066 432796 434084 435817 437557 440602 445090 449839
57804 449839 454677 460228 465671 469583 472945 478457 486438 493901 498148 499007 497200 492901 486612 479423
57790 479423 471732 463402 455480 449779 446254 442584 436926 429597 421754 414114 407335 402058 398070 394611
57776 394611 391491 388567 384485 377777 369105 360559 352841 345042 337055 329884 323323 315568 305721 294850
57762B94850j0658j0119r209p862p314q267r203q646p510p059o549n194m390n183
57748A87687n480l045M85J904J419J695L068L556L078L729N795P071O623N986
57734B23571O012N473L709K111J908K541L165L944M949N338M533L136K060J558
57720B74008J280N57j160l411m737m573m341n448p055p384o469n818n871n748
57706B13830n153m664m268l422k452k213k389j763j70J325K184K790L223L158
57692B00016L014L767N390O751P248P409P775Q213Q353Q021P281O651O802P424
57678B94115P221N793M593M927O069O585O413O186N670M613M172N593Q154J0218
57664C80322J1475J2376J2322J0684Q880R018J0814J2179J2551J3315J5079J6921
$$ plain form
57762 294850 284192 274073 264864 257002 249688 241421 232218 223572 216062 209003 202454 197260 192870 187687
57748 187687 182207 179162 179647 181551 182970 184665 187733 191289 194367 198096 203891 210962 217585 223571
57734 223571 229583 235056 238765 240876 242784 245325 248490 252434 257383 262721 267254 270390 272450 274008
57720 274008 275288 275845 274685 271274 266537 261964 257623 252175 245120 237736 231267 225449 219578 213830
57706 213830 208677 204013 199745 196323 193871 191658 189269 187506 187336 188661 190845 193635 196858 200016
57692 200016 203030 206797 212187 218938 226186 233595 241370 249583 257936 265957 273238 279889 286691 294115
57678 294115 301336 307129 311722 316649 322718 329303 335716 341902 347572 352185 356357 361950 370104 380322
57664 380322 391797 404173 416495 427179 436059 445077 455891 468070 480621 493936 509015 525936
57652E25936J8391J9973K1375K1619K1182K1926K4468K7523L0116L2469L4452
57641G99430L5344L5746L7606M1590M6117M9730N2736N5849N9011O2349O6690
57630A342198P2262P8215Q4137R0780R8721J07705J17845J29993J44237J59412
57620B425505J74694J90364K06520K22583K38755K56163K74547K91223L03569
57611D583923L11304L15085L13749L03959K81714K43372J86613J12501K7006o0248
57601F618978j39454k03794k50879k81941k99349l04732k99647k87233k71402
57592D280547k54312k36036k16833j97989j79972j61751j43055j25760j11663
57583B653176j00003q8604p6654o5084n4754m5579l7175k9366k2080j5268q690
$$ plain form
57652 525936 544327 564300 585675 607294 628476 650402 674870 702393 732509 764978 799430
57641 799430 834774 870520 908126 949716 995833 1045563 1098299 1154148 1213159 1275508 1342198
57630 1342198 1414460 1492675 1576812 1667592 1766313 1874018 1991863 2121856 2266093 2425505
57620 2425505 2600199 2790563 2997083 3219666 3458421 3714584 3989131 4280354 4583923
57611 4583923 4895227 5210312 5524061 5828020 6109734 6353106 6539719 6652220 6679226 6618978
57601 6618978 6479524 6275730 6024851 5742910 5443561 5138829 4839182 4551949 4280547
57592 4280547 4026235 3790199 3573366 3375377 3195405 3033654 2890599 2764839 2653176
57583 2653176 2553173 2464569 2387915 2322831 2268077 2222498 2185323 2155957 2133877 2118609 2109919
57572B109919j642O617J5872K5044L3492M1491M9245N6463O3419P1284Q0740R1204
57560B643148J02038J13468J25567J37436J48374J58893J69298J78059J82926
57551C959207J83175J79425J71439J57405J35581J05924P0098L0556j0392n1073
57541D931345r0130j25560j54789j76359j91097k00878k06551k07886k05126j99463
57531C173506j91911j82618j71714j60200j49487j40245j31912j23294j13675
57522A808450j03445r3688q5117p7582p0643o4291n8786n4041m9539m4888m0292
57511A066138l6416l3827l2334l0888k8342k4506k0416j7463j6219j5878j4784
57500G95065j1918q163n670n466o006m824j397K520N227O717P856R071J0380J1989
$$ plain form
57572 2109919 2108277 2114894 2130766 2155810 2189302 2230793 2280038 2336501 2399920 2471204 2551944 2643148
57560 2643148 2745186 2858654 2984221 3121657 3270031 3428924 3598222 3776281 3959207
57551 3959207 4142382 4321807 4493246 4650651 4786232 4892156 4962254 4992810 4982418 4931345
57541 4931345 4841215 4715655 4560866 4384507 4193410 3992532 3785981 3578095 3372969 3173506
57531 3173506 2981595 2798977 2627263 2467063 2317576 2177331 2045419 1922125 1808450
57522 1808450 1705005 1611317 1526200 1448618 1377975 1313684 1254898 1200857 1151318 1106430 1066138
57511 1066138 1029722 995895 963561 932673 904331 879825 859409 841946 825727 809849 795065
57500 795065 783147 774984 769314 763848 757842 753018 751621 754141 759368 766085 773941 783012 793392 805381
57486H05381J4065J6354J8577K0804K3066K4969K6279K7695L0450L5099M0798
57475A083537M5885M9251N1342N3739N7520O2279O7139P2343P9081Q7800R7558
57464A807474J07158J16098J24197J31108J36679J41164J44599J46423J45874
57455C000774J42164J34058J20181J00367P6009M8484J7968j5148m8290p7536
57445C499031j00706j18578j32618j42470j46796j46017j42805j39236j34665
57436B295140j27507j18366j09781j02812r5782q7013p7313o8533o0909n3417
57426A393707m5831l8730l2045k5289j8932j3825r450m570N44M508P546J1562
57414A229195J7079K2332K6421L1094L7871M5350N1282N6142O2494P1426Q1516
$$ plain form
57486 805381 819446 835800 854377 875181 898247 923216 949495 977190 1007640 1042739 1083537
57475 1083537 1129422 1178673 1230015 1283754 1341274 1403553 1470692 1543035 1622116 1709916 1807474
57464 1807474 1914632 2030730 2154927 2286035 2422714 2563878 2708477 2854900 3000774
57455 3000774 3142938 3276996 3397177 3497544 3573553 3622037 3640005 3624857 3576567 3499031
57445 3499031 3398325 3279747 3147129 3004659 2857863 2711846 2569041 2429805 2295140
57436 2295140 2167633 2049267 1939486 1836674 1740892 1653879 1576566 1508033 1447124 1393707
57426 1393707 1347876 1309146 1277101 1251812 1232880 1219055 1209605 1205035 1205579 1210087 1217633 1229195
57414 1229195 1246274 1268606 1295027 1326121 1363992 1409342 1460624 1516766 1579260 1650686 1732202
57403A732202R0984R9334J06840J13806J20384J26238J30296J31533J29726J24745
57393B906088J15486J00519P9622N3934K4751o915l9577p0930r8624j21312j38950
57382B804092j52277j61612j66310j65900j61622j55755j49249j41292j31737
57373A418338j22369j14676j07790j00083r1766q4262p7810p1583o5650o0862
57363E21487n6895n2420m7404m3477m1377l9670l6747l2934k9721k7845k6904
57352H6093k6176k5082A1490i793j9687j8896j8433j7680j6537j5244j4076j3347
57340a43693j3225j3292j2837j1766j0645r686q444o848n838o222p345p676o695
57327b64212n567n638o582o579m499j523n4j072l211m656n163n559o036o004n462
$$ plain form
57403 1732202 1823186 1922520 2029360 2143166 2263550 2389788 2520084 2651617 2781343 2906088
57393 2906088 3021574 3122093 3201715 3255649 3280400 3273485 3233908 3162978 3064354 2943042 2804092
57382 2804092 2651815 2490203 2323893 2157993 1996371 1840616 1691367 1550075 1418338
57373 1418338 1295969 1181293 1073503 973420 881654 797392 719582 647999 582349 521487
57363 521487 464592 412172 364768 321291 279914 240244 203497 170563 140842 112997 86093
57352 86093 59917 34835 11490 -9793 -29480 -48376 -66809 -84489 -101026 -116270 -130346 -143693
57340 -143693 -156918 -170210 -183047 -194813 -205458 -215144 -223588 -230436 -236274 -242496 -249841 -257517 -264212
57327 -264212 -269779 -275417 -281999 -288578 -293077 -294600 -294654 -295726 -298937 -303593 -308756 -314315 -320351 -326355 -331817
57312c31817n348o335p901q878q524p090n766n866p447q784q079n658l761m001
57298d25255n780p327p612o963o410o665p260o650l907m20J125j28k022k125q54
57283d88253p41k907n505o046m283k246j768k857m332n277n375m539l021j748
57269e38898j576k094k000r32m2k43q54p73j14L26N37J032J508J115k9p95m93
57252e44325M48J244J428J009Q26K224N194P423O817M582L900N622P471P766P538
57237d80833P962Q136P095O218P493J0479J3068J4556J6122J8528K1134K3126
57225c26916K4393K5060K5288K5507K5973K6177K5573K4738K4816K5874K6708
57214d6809b0543C929K1679J8006J3426P961J964l607p740j0782j4585I887a6828
$$ plain form
57312 -331817 -337165 -343500 -351401 -360279 -368803 -375893 -381659 -387525 -394972 -403756 -411835 -417493 -421254 -425255
57298 -425255 -431035 -438362 -445974 -452937 -459347 -466012 -473272 -479922 -483829 -484249 -483124 -483252 -485274 -487399 -488253
57283 -488253 -488994 -491901 -497406 -503452 -507735 -509981 -511749 -514606 -518938 -524215 -529590 -534129 -537150 -538898
57269 -538898 -540474 -542568 -544568 -545500 -545542 -545785 -546639 -547412 -547526 -547200 -546663 -545631 -544123 -543008 -543037 -543832 -544325
57252 -544325 -543877 -542633 -541205 -540196 -539370 -537146 -531952 -524529 -517712 -513130 -509230 -503608 -496137 -488371 -480833
57237 -480833 -472871 -464735 -457640 -451422 -443929 -433450 -420382 -405826 -389704 -371176 -350042 -326916
57225 -326916 -302523 -277463 -252175 -226668 -200695 -174518 -148945 -124207 -99391 -73517 -46809
57214 -46809 -20543 3929 25608 43614 57040 65001 66965 63358 55618 44836 30251 9887 -16828
57200d7638l1332k9514k7464k6221k5287k3280j9258j4021r754p821p394o952
57188b75936o190n381l693J58N772J0960J3843J4114J2625J0970J1032J3416J6397
57175a81913J7882J8232J9451K1826K3381K3040K2321a2642A2899K8461L1062
57164G2422L2659L2685L1916L2389L4876L7587L8437L7645L6886L6900L7268L7768
57152D99438L8543L9189L9054L8361L8097L8682L9484L9653L9073L8481L8795
57141I26850M0153M1500M1500L9876L7451L5053L3121L2007L1615L0801K8390
57130A318317K4897K1908J9732J7176J3898J1112R468P971N955M302L698L316
57118A461750K359J254O1k601p420j2663j6220j8059j9139j9314j8096j6189j4422
$$ plain form
57200 -47638 -78970 -108484 -135948 -162169 -187456 -210736 -229994 -244015 -253769 -261590 -268984 -275936
57188 -275936 -282126 -287507 -291200 -291042 -285270 -274310 -260467 -246353 -233728 -222758 -211726 -198310 -181913
57175 -181913 -164031 -145799 -126348 -104522 -81141 -58101 -35780 -12642 12899 41360 72422
57164 72422 105081 137766 169682 202071 236947 274534 312971 350616 387502 424402 461670 499438
57152 499438 537981 577170 616224 654585 692682 731364 770848 810501 849574 888055 926850
57141 926850 967003 1008503 1050003 1089879 1127330 1162383 1195504 1227511 1259126 1289927 1318317
57130 1318317 1343214 1365122 1384854 1402030 1415928 1427040 1436508 1444479 1450434 1454736 1458434 1461750
57118 1461750 1464109 1465363 1465424 1462823 1455403 1442740 1426520 1408461 1389322 1370008 1351912 1335723 1321301
57105A321301j2414j0132r213j0654j2530j2589j1847j2801j4961j5282j2784
57094A186094r692p885p038o829q596j3912k3222l6260n2269o9575q6590j03277
57082G60949j20313j37167j52671j66992B550a93195k10500k26755k45551k65574
57072a141575k85137l05606l29785l57254l84784m11503m40332m73864n12089
57063d641929n54825o03195o57579p17002p81651q53734r35286j027416j131872
57054a1904489j250516j383070j528334j687731j864721k061092k277675k518703
57046b6476331k791363l101045l451482l849759m306454m830965n432499o126529
57038f0366427o934701p877303q970147j0226112j1648654j3219132j4895783
$$ plain form
57105 1321301 1308887 1298755 1289542 1278888 1266358 1253769 1241922 1229121 1214160 1198878 1186094
57094 1186094 1176402 1168517 1161479 1154650 1146054 1132142 1108920 1072660 1020391 950816 864226 760949
57082 760949 640636 503469 350798 183806 2550 -193195 -403695 -630450 -876001 -1141575
57072 -1141575 -1426712 -1732318 -2062103 -2419357 -2804141 -3215644 -3655976 -4129840 -4641929
57063 -4641929 -5196754 -5799949 -6457528 -7174530 -7956181 -8809915 -9745201 -10772617 -11904489
57054 -11904489 -13155005 -14538075 -16066409 -17754140 -19618861 -21679953 -23957628 -26476331
57046 -26476331 -29267694 -32368739 -35820221 -39669980 -43976434 -48807399 -54239898 -60366427
57038 -60366427 -67301128 -75178431 -84148578 -94374690 -106023344 -119242476 -134138259
57031a34138259j6626824j8360462k0045526k1629309k3047530k4210596k5035235
57024b83093741k5545398k5923872k6337014k6585917k5954156k3556630j8986039
57017d55982767j2672414n617416J221569P343473J2663956J7231662K1026321
57010d14785616K3956406K5961294K7085283K7467376K7273488K6635647K5641065
57003b30765057K4356814K2848031K1176475J9398994J7574436J5764169J4020562
56996i5625576J2379331J0864235R492214Q270643P195533O257078N444671M745705
56988c0976166M144771L627437L182420K799213K467393K179637J931665J717813
56980h925817J530387J364567J219995J095910R88452Q94200Q12197b79828C93567
$$ plain form
57031 -134138259 -150765083 -169125545 -189171071 -210800380 -233847910 -258058506 -283093741
57024 -283093741 -308639139 -334563011 -360900025 -387485942 -413440098 -436996728 -455982767
57017 -455982767 -468655181 -474272597 -473051028 -465707555 -453043599 -435811937 -414785616
57010 -414785616 -390829210 -364867916 -337782633 -310315257 -283041769 -256406122 -230765057
57003 -230765057 -206408243 -183560212 -162383737 -142984743 -125410307 -109646138 -95625576
56996 -95625576 -83246245 -72382010 -62889796 -54619153 -47423620 -41166542 -35721871 -30976166
56988 -30976166 -26831395 -23203958 -20021538 -17222325 -14754932 -12575295 -10643630 -8925817
56980 -8925817 -7395430 -6030863 -4810868 -3714958 -2726506 -1832306 -1020109 -279828 393567
56970A001859N46756M91818M43467M00471L63353L32572L06196K82293K61690
56961D430475K45620K32278K18543K03842J89750J76617J62919J47438J30142
56952F137624J11291R1400P1772N3605L6497J9239K789q192q723j034P96k2398
56940F484666p8840j56387k31828k89324l27330l49770l57453l50415l32937l11278
56930C699104k88515k64941k41582k20080k00433j81742j64261j48515j33692
56921A855343j19233j06880r8666r3771q9574q4941q0345p5566o9703o3063n6979
56910I16622n1905m7249m2658l8024l2865k7139k1890j7615j2952o656K7M930
56898F22626P964J0630J3148J4260J3320J0660O259J73n855r373r985r531r475
$$ plain form
56970 1001859 1548615 2040433 2483900 2884371 3247724 3580296 3886492 4168785 4430475
56961 4430475 4676095 4908373 5126916 5330758 5520508 5697125 5860044 6007482 6137624
56952 6137624 6248915 6340315 6412087 6465692 6502189 6521428 6524217 6516025 6507302 6506268 6507064 6484666
56940 6484666 6405826 6249439 6017611 5728287 5400957 5051187 4693734 4343319 4010382 3699104
56930 3699104 3410589 3145648 2904066 2683986 2483553 2301811 2137550 1989035 1855343
56921 1855343 1736110 1629230 1530564 1436793 1347219 1262278 1181933 1106367 1036664 973601 916622
56910 916622 864717 817468 774810 736786 703921 676782 654892 637277 624325 617669 617696 622626
56898 622626 630590 641220 654368 668628 681948 692608 698867 699040 693185 683812 673827 664296 654821
56885F54821r690r726r495q601o557l869j648p0J581L518N430P547J0283J3048
56871F46572J4894J6033J6961J6334J1800L260o566j5166k2045k7083k9181k7836
56859E97977k4671k2045k0741j9950j8759j6853j4208j0938p417m211j783p2J729
56846D38058M518P947J0312J0547R764R881J1201J2355J2305J1247R886R019R605
56833E66645J1965J4980J7108J8088J8670J9203J9749K0971K3157K4588K2762
56822G77886J7495J1184N878J712j624l771m777n570o495o629n260k946m88K005
56808G78600M527O719Q658J1018J4080J7610K1952K7757L4155L8617L9400L6709
56796A039802L0865K1163P965n477j5186k0021k1904k2968k3580k2883k0196j5793
$$ plain form
56885 654821 645131 635405 625910 617309 610752 606883 605235 605165 606746 610264 615694 623241 633524 646572
56871 646572 661466 677499 694460 710794 722594 725854 719288 704122 682077 654994 625813 597977
56859 597977 573306 551261 530520 510570 491811 474958 460750 449812 442395 438184 436401 436329 438058
56846 438058 442576 450523 460835 471382 481146 491027 502228 514583 526888 538135 548021 557040 566645
56833 566645 578610 593590 610698 628786 647456 666659 686408 707379 730536 755124 777886
56822 777886 795381 806565 812443 814155 812531 808760 803983 798413 791918 785289 780029 777083 776595 778600
56808 778600 783127 789846 798504 809522 823602 841212 863164 890921 925076 963693 1003093 1039802
56796 1039802 1070667 1091830 1099795 1094318 1079132 1059111 1037207 1014239 990659 967776 947580 931787
56784I31787j0780o113j669L252Q745J4441K0779K8644L7446M5069N0411N4255
56772A176267N6566N4508M5115K9079J0345p413k2413l3531l9798m1593m0930
56761A186202l9613l7731l4312k8954k2445j6061j0564n761j050L803Q641J3518
56749A015673J8718K4119K9028L2642L3908L1025K2448R080n444j7556k6220l2215
56737A135206l6030l7504l6868l4801l1670k7640k3340j9515j5989j1796o447
56726H53606o04M545Q220J0371J1453J2045J2507J2778J2175R318K977o246j5500
56713I27645k1950k5273k7031k8000k7589k5740k3536k1564j9383j7185j6027
56702F74367j5597j3803j0061p014p046q667q710o992o138p234q385p854o283
$$ plain form
56784 931787 921007 914894 913225 916477 925222 939663 960442 989086 1026532 1071601 1122012 1176267
56772 1176267 1232833 1287341 1332456 1361535 1371880 1364467 1342054 1308523 1268725 1227132 1186202
56761 1186202 1146589 1108858 1074546 1045592 1023147 1007086 996522 990761 989711 993514 1002155 1015673
56749 1015673 1034391 1058510 1087538 1120180 1154088 1185113 1207561 1216641 1211197 1193641 1167421 1135206
56737 1135206 1099176 1061672 1024804 990003 958333 930693 907353 887838 871849 860053 853606
56726 853606 853002 857547 865767 876138 887591 899636 912143 924921 937096 946414 949391 943145 927645
56713 927645 905695 880422 853391 825391 797802 772062 748526 726962 707579 690394 674367
56702 674367 658770 644967 634906 627892 620846 612179 603469 596477 590339 583105 574720 566866 560583
56689E60583m999m039k897j832j322r92j31J128J808J112p34k535l051k194j191
56674E38714j187j907k213j630p28j94k90j118k609m139m815m353l298k414k110
56659E05709k283k409j989j240j046j803k723k774j974j207j105j646k427k852
56645D78231k375j146m4M06O81J267J685J205k8j420k879m376n052m007j836l12
56629D60000l27j038j198o09OJ13mL96J562K791L210K922K825L324L899L927L144
56612D84943J350j108k571j446J237K382P90j240j356k53J13l71o55p87j217j121
56596D78690K46J390K30k654m744n105m859m582l721k586k499l634m747n165n187
56581D31073m564k728m92O57J012K086L612L752K519K155L344M043L156K550L694
$$ plain form
56689 560583 555584 551545 548648 546816 545494 544502 544371 545499 547307 548419 547685 545150 542099 539905 538714
56674 538714 537527 535620 533407 531777 531049 530855 530565 529447 526838 522699 517884 513531 510233 507819 505709
56659 505709 503426 501017 499028 497788 496742 494939 492216 489442 487468 486261 485156 483510 481083 478231
56645 478231 475856 474710 474666 475072 475753 477020 478705 479910 479882 478462 475583 471207 466155 462148 460312 460000
56629 460000 459673 458635 457437 456828 456834 456947 456943 457339 458901 461692 464902 467824 470649 473973 477872 481799 484943
56612 484943 486293 485185 482614 481168 482405 484787 485577 484337 482981 482728 482841 482470 481815 481028 479811 478690
56596 478690 478936 480326 480556 477902 473158 468053 463194 458612 454891 452305 449806 446172 441425 436260 431073
56581 431073 426509 423781 423289 423946 424958 427044 430656 434408 436927 439082 442426 446469 449625 452175 455869
56566D55869M937M163K073O49P5o14j115m97O81R92M13J58N65Q03M53k9m05r94
56548D68177j862k528k524j779p07j10n12j310j350n04K69P05J741L509M343K976
56532D68534O05n60j03N55M27J9K52J246K211K100O81q30q86M13J377J122P72
56515D77935J579K998L615L083K024R26K57Q35K809M735N005L937L356M210N638
56500E22942O327N943N094M497M345M259L894L562L806M432M683M491M565M889
56486E87729M275K102m26j669j552j337j936l172m314m663l979k789j951j705
56472E64613j734k171l526n312o023n075l662k970k705k239j968k380k818k485
56458E19545j879j997k678l000k816k656k509j936j148q51j137j456j548j480
$$ plain form
56566 455869 460806 464969 467042 467691 467766 467152 466037 465540 466221 467213 467626 467784 468349 469152 469605 469576 469171 468177
56548 468177 466315 463787 461263 459484 458777 458667 458155 456845 455495 454991 455260 455965 457706 461215 465558 468534
56532 468534 469139 468579 468476 469031 469458 469477 469729 470975 473186 475286 475967 475137 474251 474664 476041 477163 477935
56515 477935 479514 482512 486127 489210 491234 492160 492417 493252 496061 500796 505801 509738 513094 517304 522942
56500 522942 529269 535212 540306 544803 549148 553407 557301 560863 564669 569101 573784 578275 582840 587729
56486 587729 592004 594106 593680 592011 590459 589122 587186 584014 579700 575037 571058 568269 566318 564613
56472 564613 562879 560708 557182 551870 545847 540772 537110 534140 531435 529196 527228 524848 522030 519545
56458 519545 517666 515669 512991 509991 507175 504519 502010 500074 498926 498075 496938 495482 493934 492454
56444D92454r75K67J583J691K73j473k180j756j220j309j652j429n90J0j92o49
56428D82853n91j41J60M72J290K238K395J700R33M00l24j319k046k053j068J108
56412D86007L745M900L678K026K307L785M019L134L618N825P096O136M899M953
56398E46128N124M323L648L847L550K060J189K050K750J663L65N88P96j068l677
56383E73336m593m486n424o505n167j998l41j352k886l265l046k932k783k970
56369E25588m121n434n539m914n038n396m039j133Q46Q17L00N26Q68Q38J321K712
56353D98202L674K806L69k291l949l970k741j663j620j765r52J95K36p32j427
56338D84372j567j792j911j157P3P63J077J747K260J786J318K439M394M933L785
$$ plain form
56444 492454 491479 491746 493329 495020 495293 493820 491640 489884 488664 487355 485703 484274 483684 483694 483502 482853
56428 482853 482262 482121 482281 482753 484043 486281 488676 490376 491309 491709 491385 490066 488020 485967 484899 486007
56412 486007 489752 494652 498330 500356 502663 506448 510467 513601 517219 523044 530140 536276 541175 546128
56398 546128 551252 555575 559223 563070 566620 568680 569869 571919 574669 576332 576697 577285 578081 577013 573336
56383 573336 568743 564257 558833 552328 547161 545163 544822 543470 540584 537319 534273 531341 528558 525588
56369 525588 521467 516033 510494 505580 500542 495146 491107 489974 490820 491637 491937 492463 493331 494169 495490 498202
56353 498202 501876 504682 505051 502760 498811 494841 492100 490437 488817 487052 486100 486295 486531 485799 484372
56338 484372 482805 481013 479102 477945 478018 478781 479858 481605 483865 485651 486969 489408 493802 498735 502520
56323E02520K660K113J244L58Q70K250K225N98j47J032J970J007k48N08K999N197
56307E27156N861M916K835P62L9P87J979L149M447N010L496P75k42J565L914M386
56291E70835L443K939L394M165M898N398N018L451J577O68J173K536L634L470
56277F16599K341J957L309M963M991M015M312O169P530P328O822P167P849Q163
56263F93515Q282Q234P618O856P067Q310R641J0934J2716J4241J3992J2327J1185
56250H24918J0968J0277R155R648J2207J4366J4373J3565J3673J4032J3162J1228
56238I71572R281P633O418O414P910R945J1542J2627J3157J2789J1927J1689J2410
56225A105314J3681J5812J9273K2690K3925K3595K4859K8968L3693L7079M0069
$$ plain form
56323 502520 505180 507293 508537 508895 509765 512015 514240 514838 514691 515723 517693 518700 518452 518960 521959 527156
56307 527156 533017 537933 540768 541530 541569 542356 544335 547484 551931 556941 560437 561212 560970 562535 566449 570835
56291 570835 574278 577217 580611 584776 589674 595072 600090 603541 605118 605786 606959 609495 613129 616599
56277 616599 618940 620897 624206 629169 634160 638175 642487 648656 656186 663514 670336 677503 685352 693515
56263 693515 701797 710031 717649 724505 731572 739882 749523 760457 773173 787414 801406 813733 824918
56250 824918 835886 846163 855318 864966 877173 891539 905912 919477 933150 947182 960344 971572
56238 971572 980853 988486 994904 1001318 1009228 1019173 1030715 1043342 1056499 1069288 1081215 1092904 1105314
56225 1105314 1118995 1134807 1154080 1176770 1200695 1224290 1249149 1278117 1311810 1348889 1388958
56214A388958M4064M8468N2272N5970O0376O5328P0890P7929Q6267R4102J00495
56203B145119J06737J14312J23296J33571J45488J58381J70427J80947J90882
56194C469160K00376K08255K14500K20467K25657K27120K23391K16103K06390
56185E411419J92604J73370J50084J24468R6449O6423L6936R689j6591m2950o7088
56174F134813q6067j00157j11535j20951j28105j33679j38566j42253j44162j45337
56164D884001j47052j49091j51004j53457j56522j58246j56848j53148j49190
56155C509443j45760j42643j39732j36474j31787j25820j20104j14898j08462
56146B343763j00212r2249q6088q0233p2925o5203n9178n4990n1378m7634m3452
$$ plain form
56214 1388958 1433022 1481490 1533762 1589732 1650108 1715436 1786326 1864255 1950522 2044624 2145119
56203 2145119 2251856 2366168 2489464 2623035 2768523 2926904 3097331 3278278 3469160
56194 3469160 3669536 3877791 4092291 4312758 4538415 4765535 4988926 5205029 5411419
56185 5411419 5604023 5777393 5927477 6051945 6148394 6214817 6251753 6261442 6244851 6201901 6134813
56174 6134813 6048746 5948589 5837054 5716103 5587998 5454319 5315753 5173500 5029338 4884001
56164 4884001 4736949 4587858 4436854 4283397 4126875 3968629 3811781 3658633 3509443
56155 3509443 3363683 3221040 3081308 2944834 2813047 2687227 2567123 2452225 2343763
56146 2343763 2243551 2151302 2065214 1984981 1912056 1846853 1787675 1732685 1681307 1633673 1590221
56135A590221l8541l3808l1087l0399k9446k6868k3801k1172j8221j5040j3545
56124A308293j4159j4397j2575j0110q349o132k627M63J865K981M845N833M932
56111A260863M342O027Q551J0025J1464J4232J6925J7838J8130J9499K1119K1713
56099A430728K2388K4511K6940K8049K8284K8346K7476K5918K6149K9030L1674
56088A729493L2020L2413L5760M1232M6825N2953O0183O6788P2072P8950Q9539
56077B338228J01316J11301J20519J30350J37964J39913J37193J32335J24683
56068C473802J13255J01247R2386Q5326P6459O5837N5290M3274K7000P985r551
56057D132310k4173l6794m6925n4195o1661p2748q6438r9617j11909j23772j32493
$$ plain form
56135 1590221 1551680 1517872 1486785 1456386 1426940 1400072 1376271 1355099 1336878 1321838 1308293
56124 1308293 1294134 1279737 1267162 1257052 1248703 1242571 1239944 1240407 1242272 1245253 1250098 1255931 1260863
56111 1260863 1265205 1271232 1279783 1289808 1301272 1315504 1332429 1350267 1368397 1387896 1409015 1430728
56099 1430728 1453116 1477627 1504567 1532616 1560900 1589246 1616722 1642640 1668789 1697819 1729493
56088 1729493 1761513 1793926 1829686 1870918 1917743 1970696 2030879 2097667 2169739 2248689 2338228
56077 2338228 2439544 2550845 2671364 2801714 2939678 3079591 3216784 3349119 3473802
56068 3473802 3587057 3688304 3780690 3866016 3942475 4008312 4063602 4106876 4133876 4141861 4132310
56057 4132310 4108137 4071343 4024418 3970223 3908562 3835814 3749376 3649759 3537850 3414078 3281585
56046C281585j35064j32920j29035j22755j12457j00531r0359q0707o8722n6091
56036B252944m6542l9455l1852k4599k0557j8416j4548r421o243m798k604n94
56024B033315j496l928m128k423k175l478l783l368m375n635m193q19J490K957
56010A997961N678Q724J0149J1587J5173J8472J8552J8260K1753K6688K8095K7284
55998B208376K9139L2983L4261L3358L4529L7577L8651L8034L9144M1131M0400
55987B607583L8139L8532M0999M2013M2672M6326N0783N1540N0772N4011N9917
55976C123287O2720O3036O6407P2642P6604P8376Q2595Q8737R2092R3313R7063
55965C996872J02489J05182J07014J13420J22608J28545J32895J42408J56100
$$ plain form
56046 3281585 3146521 3013601 2884566 2761811 2649354 2548823 2458464 2377757 2309035 2252944
56036 2252944 2206402 2166947 2135095 2110496 2089939 2071523 2056975 2047554 2041311 2036513 2033909 2033315
56024 2033315 2031819 2027891 2023763 2021340 2019165 2015687 2011904 2008536 2004161 1998526 1994333 1993514 1995004 1997961
56010 1997961 2003639 2012363 2022512 2034099 2049272 2067744 2086296 2104556 2126309 2152997 2181092 2208376
55998 2208376 2237515 2270498 2304759 2338117 2372646 2410223 2448874 2486908 2526052 2567183 2607583
55987 2607583 2645722 2684254 2725253 2767266 2809938 2856264 2907047 2958587 3009359 3063370 3123287
55976 3123287 3186007 3249043 3315450 3388092 3464696 3543072 3625667 3714404 3806496 3899809 3996872
55965 3996872 4099361 4204543 4311557 4424977 4547585 4676130 4809025 4951433 5107533
55956E107533J67012J75027J85551J97201K03926K07916K16776K29203K37456
55947F927601K42770K53470K68908K80806K89912L05173L26491L44984L60697
55938I600812L82831M11575M37082M57858M82799N13625N43117N72013O09227
55929A4010939O54057O97290P41013P97174Q65121R31758R95751J069447J154629
55920B1917179J239321J321110J409941J505875J599321J695361J810765J944670
55912C4443543K081290K224210K396745K605478K837431L096786L407566L775904
55904E6868953M190321M665304N241214N934353O733058P646756Q703174R891704
55896A09874837J1176459J2578586J4175268J6007292J8074537K0432219K3172175
$$ plain form
55956 5107533 5274545 5449572 5635123 5832324 6036250 6244166 6460942 6690145 6927601
55947 6927601 7170371 7423841 7692749 7973555 8263467 8568640 8895131 9240115 9600812
55938 9600812 9983643 10395218 10832300 11290158 11772957 12286582 12829699 13401712 14010939
55929 14010939 14664996 15362286 16103299 16900473 17765594 18697352 19693103 20762550 21917179
55920 21917179 23156500 24477610 25887551 27393426 28992747 30688108 32498873 34443543
55912 34443543 36524833 38749043 41145788 43751266 46588697 49685483 53093049 56868953
55904 56868953 61059274 65724578 70965792 76900145 83633203 91279959 99983133 109874837
55896 109874837 121051296 133629882 147805150 163812442 181886979 202319198 225491373
55889B25491373K6275793K9607114L3018296L6109311L7640425L5533885K8153679
55882D51829876J5931909J562114j1634686k1585867k7958681l1376154l2584491
55875C44184020l2214065l0815362k8812514k6462114k3934697k1389489j8947076
55868A61608703j6664547j4580543j2739910j1153563r783386q590833p564326
55861H0531595o687833n925347n253670m675982m189307l770231l403320l092244
55853D3533661k831995k599516k382366k189500k024360j873393j729848j603109
55845B6299574j495059j391188j284425j185431j100749j022258r46465q82831
55837A6991168q34194p88792p40326o97041o62796o27781n86596n47897n17444
$$ plain form
55889 225491373 251767166 281374280 314392576 350501887 388142312 423676197 451829876
55882 451829876 467761785 469323899 457689213 436103346 408144665 376768511 344184020
55875 344184020 311969955 281154593 252342079 225879965 201945268 180555779 161608703
55868 161608703 144944156 130363613 117623703 106470140 96686754 88095921 80531595
55861 80531595 73843762 67918415 62664745 57988763 53799456 50029225 46625905 43533661
55853 43533661 40701666 38102150 35719784 33530284 31505924 29632531 27902683 26299574
55845 26299574 24804515 23413327 22128902 20943471 19842722 18820464 17873999 16991168
55837 16991168 16156974 15368182 14627856 13930815 13268019 12640238 12053642 11505745 10988301
55828A0988301m88066m54952m25083m03109l82625l59470l39550l25945l11938
55819G497563k94088k78871k69462k59251k45263k34725k31175k26974k16999
55810E240755k07152k01816j95097j82626j70604j64820j60825j52922j43305
55801C661588j35103j25722j14213j06236j04777j04286j00230r5924r4157r0946
55791B589994q3842p7727p6082p4709p0225o6425o6065o4608n8561n2216m9632
55780A849902m7466m2065l6445l3822l1304k6261k2084k1247j9451j3132o507
55769A550118m613n266m318l272n208q346r819j1259j4934j8856k0839k2852k6459
55756A394077k8841k8129k7578k9597l0867k8484k5707k6148k7176k4835k0728
$$ plain form
55828 10988301 10500235 10045283 9620200 9217091 8834466 8474996 8135446 7809501 7497563
55819 7497563 7203475 6924604 6655142 6395891 6150628 5915903 5684728 5457754 5240755
55810 5240755 5033603 4831787 4636690 4454064 4283460 4118640 3957815 3804893 3661588
55801 3661588 3526485 3400763 3286550 3180314 3075537 2971251 2871021 2775097 2680940 2589994
55791 2589994 2506152 2428425 2352343 2277634 2207409 2140984 2074919 2010311 1951750 1899534 1849902
55780 1849902 1802436 1760371 1723926 1690104 1658800 1632539 1610455 1589208 1569757 1556625 1550118
55769 1550118 1545505 1540239 1535921 1532649 1527441 1519095 1509276 1498017 1483083 1464227 1443388 1420536 1394077
55756 1394077 1365236 1337107 1309529 1279932 1249065 1220581 1194874 1168726 1141550 1116715 1095987
55745A095987j8404j6960j3946j0798r870r382o509k570m42J72P10K03k061l640
55731A002490k609r51o60j66J618J825j676n902p371p433q641r570p979n812o223
55716I40940q374r708j0856j3792j7411j9163j9241j9457j9837j9583j9334j9458
55704G44726j8301j4969j1661j0588j1031j1652j2895j4757j5404j4374j3907
55693E95187j4644j3710r808o369o574q805j0204j1126j2711j3597j2527j1059
55681D64053j0501r300o495m303m238m257k856k122l397m068k337j053k654m405
55667D02067l202j367k655n706o571n123m092l986l617l533m636n376m265l042
55653C44896l564m109k646j011j540k256q7L498M874M208M302N223M844L294K402
$$ plain form
55745 1095987 1077583 1060623 1046677 1035879 1026009 1016627 1010118 1007548 1007106 1007278 1007988 1008191 1006130 1002490
55731 1002490 999881 998930 998270 998104 999722 1001547 999871 993969 986598 979165 970524 960954 952975 947163 940940
55716 940940 932566 922858 912002 898210 880799 861636 842395 822938 803101 783518 764184 744726
55704 744726 726425 711456 699795 689207 678176 666524 653629 638872 623468 609094 595187
55693 595187 580543 566833 557025 550656 544082 535277 525073 513947 501236 487639 475112 464053
55681 464053 453552 444252 437757 433454 429216 424959 422103 419981 416584 412516 410179 409126 406472 402067
55667 402067 398865 397498 394843 389137 382566 377443 373351 369365 365748 362215 357579 352203 347938 344896
55653 344896 341332 337223 334577 333566 332026 329770 329683 333181 338055 342263 346565 351788 356632 359926 362328
55638C62328J837L4k180k830k451k781l118j759K97R20P40J878M068N613O766
55623C69362Q552R751Q744O943O787P739P699O849O460N598K791n61k124k395
55609D42195k925k814r47L27j664m776m789j939l0j05J48J492K412K913M339N744
55593D39581M786K202J080J824J993J078J136K481K911J602J2j392l610o000o437
55578D43247n061m416n440o571p160q332j0009j0419r264q465r154j0530j1859
55565C36567j2907j2528r732o210m846n666o237n921o377p816q218o855n416m896
55551B32942m317l183k537k783l025l077l696m458l808j673K72J193J715J848
55537B05413P79j054k003j571o67L55J620K016J84k824m411l967l156k842k362
$$ plain form
55638 362328 364165 364199 362019 359189 356738 353957 350839 349080 349377 350297 351037 352915 356983 362596 369362
55623 369362 377914 387665 396409 403352 410139 417878 425577 432426 438886 444484 447275 446714 444590 442195
55609 442195 439270 436456 435509 435836 434172 429396 424607 422668 422638 422533 422681 424173 426585 429498 433837 439581
55593 439581 444367 446569 447649 449473 451466 452544 453680 456161 459072 460674 460686 459294 455684 449684 443247
55578 443247 438186 433770 428330 421759 414599 406267 396258 385839 376575 368110 358956 348426 336567
55565 336567 323660 311132 301400 295190 290344 284678 278441 272520 266143 258327 250109 243254 237838 232942
55551 232942 228625 225442 222905 220122 217097 214020 210324 205866 202058 200385 200657 201850 203565 205413
55537 205413 206192 205138 203135 201564 200897 201252 202872 204888 205072 202248 197837 193870 190714 187872 185510
55522A85510j723j788k093j171O64J360K26j251j711r49R97L498M560L056J201
55507A90386J968M635N995N362M874N053M055J629p4m17j366l656n211m769l863
55492B04601l843l826l025k483k916l150k190q86k60l4K64M22N26J123J858J744
55476A87925J060R60J113J05j662k038n38R78J534K266L736M728M597M301M196
55461B13261L336J858J529K760L523K436P60J82O72J579K681L182J835q60k630
55446B36104k624k572l892n717o760p068o937o125n128n218o337o886o377o100
55432A58363o476o248n199n049o307o840n118k619j409j381j483j731k250k104
55418A04149p19R01J670J691J170o1j192p80M97j3k694m268k558O4L24j102j296
$$ plain form
55522 185510 183787 181999 179906 178735 179399 180759 180985 179734 178023 177074 178071 181569 186129 189185 190386
55507 190386 192354 196989 202984 208346 213220 218273 222328 223957 223883 223466 222100 218444 213233 208464 204601
55492 204601 200758 196932 193907 191424 188508 185358 183168 182282 182022 181988 182252 182674 183200 184323 186181 187925
55476 187925 188985 189945 191058 191163 189501 187463 186925 187903 189437 191703 195439 200167 204764 209065 213261
55461 213261 216597 218455 219984 222744 226267 228703 229463 229645 230317 231896 234577 237759 239594 238734 236104
55446 236104 233480 230908 227016 221299 214539 207471 200534 194409 189281 184063 177726 170840 164463 158363
55432 158363 151887 145639 140440 135391 129084 122244 117126 114507 113098 111717 110234 108503 106253 104149
55418 104149 103430 104331 106001 107692 108862 108801 107609 106829 107326 107313 104619 100351 97793 97857 98181 97079 95783
55401I5783J75J184O58n15j608k568k879j997p51m36q81r58o40q73j650j932j317
55384G8795m65J74P84J324J356Q87N91R25J556J680Q13o98j803j817j201r10j126
55367H0865j383j603j943j826n31J287K101J651J203J361J253K72p90r54j71J204
55351H1996K745L563K962J817J763K646K485M29j903k707k013q01L01P36j8j402
55335I2599k007j490r07q11n83l8J53N6O10J572J407m2r52l96L31J87r0j16j019
55316H8464k920l659k058k60n53j706j050J195K383J423k56j321j852k094j838
55301G3898j259r58r51o51Q6P18P80L44j45j27N56J225J056L06l8M1n10j888k791
55282F9692k233p99M93J356J733J486J179J791L074L489K342N23j229l071m490
$$ plain form
55401 95783 95958 97142 97800 97285 95677 93109 90230 88233 87482 87046 86165 85207 84567 83694 82044 80112 78795
55384 78795 78330 78504 79288 80612 81968 82855 83446 84371 85927 87607 88420 87722 85919 84102 82901 81991 80865
55367 80865 79482 77879 75936 74110 73579 74866 76967 78618 79821 81182 82435 82707 81917 80963 80792 81996
55351 81996 84741 88304 91266 93083 94846 97492 99977 100406 98503 95796 93783 92982 93283 94019 94001 92599
55335 92599 90592 89102 88195 87384 86801 86763 86916 86972 87582 89154 90561 90519 89567 89171 89502 89689 89599 89483 88464
55316 88464 85544 81885 79827 79567 79014 77308 76258 77453 79836 81259 81003 79682 77830 75736 73898
55301 73898 72639 71681 70730 70079 70165 70883 71663 72007 71862 71735 72291 73516 74572 74878 74840 74881 74371 72483 69692
55282 69692 67459 66660 67153 68509 70242 71728 72907 74698 77772 81261 83603 84126 82897 79826 75336
55267G5336m051j734L39N91k31r35j573k062j211J186L003K372K27j278j577j394
55251F7008j035o36q29j573j487J52J975K488K091J639N80j585l339k835o51J137
55235F3100J804K107K403K476K556K784K276M38j410j469p4P46j7j420j991r28
55219G3381J551L844L750R43j998k423p73L82j84j356j685r09L21J198J304J049
55203G8395J127J194R2k093l487k865j286k63L34J317K411K859K716K230J065
55188H3746o14j512r38%J88J30M79M50o82j958k237j927j566l00K170L755K517
55171H1701j62j450j102j028j682j653n62K89K58J90O10R17N47l87j495k057j075
55154G1859J334L234K967J265l0l92l97j05N61Q71M14J86Q25J084n5j115k70J491
$$ plain form
55267 75336 71285 69551 69890 70481 70250 69315 67742 65680 64469 65655 68658 71030 71257 69979 68402 67008
55251 67008 65973 65337 64508 62935 61448 61600 63575 66063 68154 69793 70373 68788 65449 62614 61963 63100
55235 63100 64904 67011 69414 71890 74446 77230 79506 79944 78534 77065 76991 77737 77720 76300 74309 73381
55219 73381 74932 78776 82526 83469 81471 79048 78275 78657 78473 77117 75432 74523 74844 76042 77346 78395
55203 78395 79522 80716 80808 78715 75228 72363 71077 70814 71148 72465 74876 77735 80451 82681 83746
55188 83746 83132 81620 80682 80682 80870 81000 81479 81929 81247 79289 77052 75125 73559 73259 75429 79184 81701
55171 81701 81539 80089 78987 77959 76277 74624 74062 74351 74609 74799 75409 76326 76873 76486 74991 72934 71859
55154 71859 73193 76427 79394 80659 80629 80237 79840 79735 80296 81167 81581 81767 82592 83676 83621 82506 82236 83727
55136H3727J873P70l06j114k187k457o32J739J899J83o12J84O04J32M62J732J750
55119H7747Q3o33R19K209P56k055l219k264j010n83o28o25m64k44l81j327k726
55102G5555l597l639l256k314m19J514J741K25r57m19R62J859K255K542K415J681
55086G6148R42N56k0j015j541q63L85J030Q30M96O86J286J423L89j093j282P5
55069G8432Q08o85k612k074O53K652K792K704L191K828J127J60J346K957K711
55054I6990J124L52R91J885K283K477K689K634K088J179K73j34J40N03L31Q3O78
55037A16566J759J904P67m25q29j006j503j844j648j413j410r06O90K781M294
55022A17777M622L599J540l52q37j99O1o09j241j099o35k22O15K090L419L782
$$ plain form
55136 83727 85600 86370 86064 84950 82763 80306 79674 81413 83312 83495 82883 83067 83671 83803 84265 85997 87747
55119 87747 87830 87197 88116 90325 91081 89026 85807 83543 82533 81950 81322 80697 80233 79989 79608 78281 75555
55102 75555 71958 68319 65063 62749 62330 63844 65585 65810 64853 64434 65396 67255 69510 72052 74467 76148
55086 76148 77090 77646 77626 76611 75070 74207 74592 75622 76452 76948 77634 78920 80343 80732 79639 78357 78432
55069 78432 79240 78555 75943 73869 74522 77174 79966 82670 85861 88689 89816 89976 91322 94279 96990
55054 96990 98114 98466 99457 101342 103625 106102 108791 111425 113513 114692 114965 114831 114971 115474 115805 115888 116566
55037 116566 118325 120229 120996 120571 119742 118736 117233 115389 113741 112328 110918 110012 110702 113483 117777
55022 117777 122399 125998 127538 127186 126349 126150 126211 125602 124361 123262 122627 122405 123020 125110 128529 132311
55006A32311K989J123j229k460j305J001J816N81o94q31j089k370l276k368n42
54991A23657N32P32O73J17j155k131j964j476j641j696n04J133J431L54m22o4
54975A17576M64k8j573l226l732k307M29K637L166K742K524K255R96r23j992j455
54959A17553rJ277J843J511M68n53p63q2R81K050L003L557L385K648J958J658
54943A40485J402O60m49r65m2J785K855K232P92l4p6j66o70j270j759k019j643
54926A41118p51o12k069l829l906k357p74M24J935L158K564P54M07K253L720K790
54910A44825P18m95q98j178p03Q41J828J027J6Q78K770L289K314J848K581L193
54894A62854L035L148M233N507O155O408O736P087P436Q197R734J2019J4794J7486
$$ plain form
55006 132311 135300 136423 135194 132734 131429 132430 134246 134827 134133 133302 132213 129843 126567 124199 123657
54991 123657 124189 124921 125594 125711 124556 122425 120461 118985 117344 115648 115144 116277 117708 118062 117640 117576
54975 117576 118040 118012 116439 113213 109481 107174 107603 110240 113406 116148 118672 120927 121923 121000 119008 117553
54959 117553 117544 118821 120664 122175 122643 122090 121327 121245 122226 124276 127279 130836 134221 136869 138827 140485
54943 140485 141887 142547 142098 141133 141091 142876 145731 147963 148755 148721 148645 148479 147809 146539 144780 142761 141118
54926 141118 140367 139755 137686 133857 129951 127594 126820 127244 129179 132337 134901 135655 136062 138315 142035 144825
54910 144825 145543 145048 144150 142972 142269 143110 144938 145965 145981 146859 149629 152918 155232 157080 159661 162854
54894 162854 165889 169037 173270 178777 184932 191340 198076 205163 212599 220796 230530 242549 257343 274829
54880B74829J9086J8831J7026J4752J2877J1593J0409Q227M086j624p272j1676
54868C71144j4978j7441j8546j7975j6367j4274j1500q527p239q663j0983j1514
54856B13137r889p726n949m242k728k043j734m87J807L837M989O002P136P487
54842B09597O994P431R992J3001J3737J2057J0587J1221J2901J3426J2278J0500
54830C43722Q491N454J086l484p153j0057j2586j4223j4490j4146j4030j3503
54818B55081j1702r838j0002j1687j1790q776m811k814l105m147m922n188m577
54805A61722l103j775j401j383p41K55O30K72j25k92n81j179j869k369k407j810
54789A43844q63k75n20j558l064m284m094k311n72n25j420j253m2K57p80j398
$$ plain form
54880 274829 293915 312746 329772 344524 357401 368994 379403 387630 391716 390092 382820 371144
54868 371144 356166 338725 320179 302204 285837 271563 260063 251536 244297 235634 224651 213137
54856 213137 203248 195522 189573 185331 182603 180560 178826 178339 180146 183983 188972 194974 202110 209597
54842 209597 216591 224022 234014 247015 260752 272809 283396 294617 307518 320944 333222 343722
54830 343722 352213 357667 358753 355269 348116 338059 325473 311250 296760 282614 268584 255081
54818 255081 243379 233541 223539 211852 200062 191286 186475 183661 180556 176409 171487 166299 161722
54805 161722 158619 156844 155443 154060 153319 153574 154204 154476 154351 154059 153478 152299 150430 148061 145654 143844
54789 143844 142981 142706 142186 140628 137564 133280 129186 126875 126303 125778 124358 123105 123063 123320 122540 121142
54773A21142j000j375l269m505l273r84J54L61J015J945K117J594Q97q4q67P9
54757A13947K693M255L097J281J139J490M14n56J153M176M958L498K972M049M115
54742A52681K434J607K930M329M398M783O725Q547Q694Q547R814J1383J1265R958
54728B48095R599J0869J2767J4572J6203J7244J7153J6084J4440J1971Q209L416
54716D00622j563n918r032j0616j1095j1170j0898r991q910q407p929o090l137
54703B95866j310j921l441l628k337j100p56o97%J575L577N326O595P965J0062
54688C15776J2449J4013J4485J4700J5300J6215J7573J9888K2825K4797K4461
54677E12482K1972J8342J4217R713M746p62o621j2170j6733k0199k2635k3823
$$ plain form
54773 121142 120142 118767 115498 110993 107720 106736 106890 107251 108266 110211 112328 113922 114819 114735 113868 113947
54757 113947 116640 120895 123992 125273 126412 127902 128316 127760 128913 133089 138047 141545 144517 148566 152681
54742 152681 155115 156722 159652 163981 168379 173162 179887 188434 197128 205675 215489 226872 238137 248095
54728 248095 257694 268563 281330 295902 312105 329349 346502 362586 377026 388997 397206 400622
54716 400622 399059 393141 384109 373493 362398 351228 340330 330339 321429 313022 305093 299003 295866
54703 295866 294556 292635 289194 285566 283229 282129 281373 280676 280676 282251 285828 291154 297749 305714 315776
54688 315776 328225 342238 356723 371423 386723 402938 420511 440399 463224 488021 512482
54677 512482 534454 552796 567013 576726 581472 580710 574089 561919 545186 524987 502352 478529
54665D78529k3879k3713k3726k2817k0045j6655j4625j3819j2696j1446j1764
54654B83344j3292j3220j0359p008n471n101m387l694l889m124l273k217k352
54641B04957k895j993J13J350R32Q1k51l26k76K24N23p54l278m521k833K21J793
54624A93067J168j39r94j686k361k057j85K082L090K874K843L502L853L294K676
54609B11027K777K976K482J899K286L384M083M077L789L159K023J212J717L049
54595B49940L955M429N332O292O049M833M185M260L627K248K124L945N648N782
54581C12649N981Q103J0928J2118J1971J2651J4639J6588J8176K0446K3229K4723
54569D92202K4293K3620K4085K4542K2848J8551J2846O572m50q122j5120j9800
$$ plain form
54665 478529 454650 430937 407211 384394 364349 347694 333069 319250 306554 295108 283344
54654 283344 270052 256832 246473 239465 233994 228893 224506 220812 216923 212799 209526 207309 204957
54641 204957 202062 200069 200182 201532 202464 202545 202294 201968 201692 201916 202439 201685 198407 193886 191053 191274 193067
54624 193067 194235 194096 193102 191416 189055 186998 186813 188895 191985 194859 197702 201204 205057 208351 211027
54609 211027 213804 216780 219262 221161 223447 226831 230914 234991 238780 241939 243962 245174 246891 249940
54595 249940 253895 258324 263656 269948 275997 280830 285015 289275 292902 295150 297274 301219 306867 312649
54581 312649 318630 326733 337661 349779 361750 374401 389040 405628 423804 444250 467479 492202
54569 492202 516495 540115 564200 588742 611590 630141 642987 649559 649109 640987 625867 606067
54557F06067k1853k2584k3477k4607k4772k3063j9982j6992j5283j4935j4942
54546C83577j4035j1916r740q928r531j0229r910q614p018n712n123n444o391
54533B70986p497q565r304q884o883m442l228l329l499l460m214n792o559n575
54519A89755l934k785j759n49l90k207m625n598n125m466l620j708N91J372L80
54504A55332l87M18J704J728L69j209k139k249j595m58N55J017J117J133Q69P8
54488A56283o81k94J498L411L921L164K812L716M603L974K556K301L178K951P45
54473A94138j025K49L684O120O377O312P597R259R312P678O375P040R231J1275
54459B83622J2218J2357J2005J0628P771M343J932Q81j84k634o332r989j2327
$$ plain form
54557 606067 584214 561630 538153 513546 488774 465711 445729 428737 413454 398519 383577
54546 383577 369542 357626 347886 338958 329427 319198 309288 300674 293656 287944 282821 277377 270986
54533 270986 263489 254924 245620 236736 229853 225411 222183 218854 215355 211895 207681 201889 195330 189755
54519 189755 185821 183036 181277 180728 180338 178131 173506 167908 162783 158317 154697 152989 153580 154952 155332
54504 155332 154945 155363 157067 158795 159164 157955 155816 153567 151972 151514 152069 153086 154203 155336 156205 156283
54488 156283 155602 155308 156806 160217 164138 167302 170114 173830 178433 182407 184963 187264 190442 193393 194138
54473 194138 193113 193362 197046 203166 209543 215855 223452 232711 242023 249701 256076 263116 272347 283622
54459 283622 295840 308197 320202 330830 338601 342944 344876 345757 345573 342939 336607 326618 314291
54446C14291j2777j1786j0703j0641j1272j1395j0632r630q522o642m093k244
54434B03954j893k250k460k858l725m082l132j858j688k269k061p43M41N86J05
54419A76067j37K99J318K271K112M70j621k637k076n16J284K705L106K251P24
54404A85620n42j006m96P78J909J897J068P96J254Q45j133k803k243m36K40n66
54388A85182j326j455j730k202j993j153p31q57p10m84j307k833l055j303M84
54373A64527M79p09j538j790k071k230j727q59l93l65k11K58P38R70R13O54N13
54356A57159P80J242J478J688K426L380L486K605J909K131K485K088J377J227
54342A85461J485J500J451K049L271M343M815M893M836M605M022K936J481L70
$$ plain form
54446 314291 301514 289728 279025 268384 257112 245717 235085 225455 216933 210291 206198 203954
54434 203954 202061 199811 197351 194493 190768 186686 183554 181696 180008 177739 175678 174935 175376 175962 176067
54419 176067 175930 176229 177547 179818 181930 182400 180779 178142 176066 175550 176834 179539 182645 184896 185620
54404 185620 185078 184072 183576 184354 186263 188160 189228 190024 191278 192123 190990 188187 185944 185508 185748 185182
54388 185182 183856 182401 180671 178469 176476 175323 174592 173735 173025 172541 171234 168401 165346 164043 164527
54373 164527 165006 164297 162759 160969 158898 156668 154941 154082 153689 153324 153113 153371 154109 155079 155992 156646 157159
54356 157159 157939 159181 160659 162347 164773 168153 171639 174244 176153 178284 180769 182857 184234 185461
54342 185461 186946 188446 189897 191946 195217 199560 204375 209268 214104 218709 222731 225667 227148 227518
54328B27518K79P10L66q36j248M9J423P29j629l359l549l272l018j828K67J062
54312B13664r67m111n482m867m546n623o527n527l118j084l05l88o51n99L3Q82
54296A70784J062L89o6N35J281O54j032j689q5K685M775N528N346M543L252J901
54280A99863R95N56K96J33J28J88J71Q0j36o45j311j600j176l77J86Q6r13k731
54262A93793m498m907l588j718p72j114k140l261m097m295l827l186k682j949
54248A51759p77K4n70k334l851m010k862j168L14J146J354J260R31M9j407k763
54232A37095l358l283k906k131p85M89N27j091l286m060k065J824M655M121J304
54217A27050m36L38J587J196J36N21J981K240P34p06q77p25j298j903j281N42
$$ plain form
54328 227518 227797 228507 228873 228037 226789 226838 228261 228990 227361 224002 220453 217181 214163 212335 212602 213664
54312 213664 212697 208586 203104 198237 193691 188068 181541 176014 172896 171812 171507 171119 170468 169869 169902 170784
54296 170784 171846 172235 172169 172704 173985 174639 173607 171918 171833 174518 179293 184821 190167 194710 197962 199863
54280 199863 200858 201414 201710 201843 201971 202159 202330 202410 202274 201629 200318 198718 197542 197165 197351 197437 196524 193793
54262 193793 189295 184388 180800 179082 178310 177196 175056 171795 167698 163403 159576 156390 153708 151759
54248 151759 150982 151006 150436 148102 144251 140241 137379 136211 136525 137671 139025 140285 141216 141265 139858 137095
54232 137095 133737 130454 127548 125417 124632 125121 125648 124557 121271 117211 115146 116970 121625 125746 127050
54217 127050 126614 126952 128539 129735 129871 130392 132373 134613 135347 134641 133764 133039 131741 129838 128557 129099
54201A29099K378L172K663J364K01k66m16q42j274j029k41L64P83J603K491K213
54185A42263O18o92l76Q89J488J006M35N53Q96M60r17k157k088q78J36J80k13
54168A41603m57r16j727j753p0K163L030K546K339K817K642J225j78n24m55q49
54152A51436j320j067k27M93O51K0j351k477k067m18M72m26j590j123M06O28j520
54135A40520m438n588l974j004Q75O25l30LJ522K272J276k51r44r92j069q84J02
54118A27721J412K052J660N13r31j883j561l65K67j86o40k84J82K08P00K175K950
54101A33990J241j792l154j872K11J381J868K422K756K126M50j706l506m100l304
54086A27011k097j669j990k196k127k290k350j102J486L506L195J026j041j795
$$ plain form
54201 129099 131477 134649 137312 138676 138877 138611 138195 137353 136079 135050 134809 135173 135956 137559 140050 142263
54185 142263 142881 142189 141813 142702 144190 145196 145631 146184 147080 147540 146623 144466 142378 141500 141636 141816 141603
54168 141603 141146 140230 138503 136750 136680 138843 141873 144419 146758 149575 152217 153442 153264 152740 152285 151436
54152 151436 150116 149049 148822 149315 149966 149986 148635 146158 144091 143673 144145 143719 142129 141006 141412 142040 140520
54135 140520 136082 130494 126520 125516 126391 127016 126686 126689 128211 130483 131759 131508 130564 129572 128503 127619 127721
54118 127721 129133 131185 132845 133358 132427 130544 128983 128618 128885 128699 128059 127775 127957 128165 128865 131040 133990
54101 133990 135231 133439 130285 128413 128624 130005 131873 134295 137051 139177 139627 137921 134415 130315 127011
54086 127011 124914 123245 121255 119059 116932 114642 112292 111190 112676 116182 119377 120403 119362 117567
54072A17567j542j026n57k52m72j433k481k311m08J906K639J413j63o10r1O65
54056A12844J727L057L400J679r87k372k097j761k072j771q2J514J223n08j627
54041A12167j067M46J762K437K560K250J539M91n53r12j64J069J551Q16l20q82
54025A23190o71O5J083J873J817J250J378K411K789J346p03j327n26Q2R7O92J968
54008A36814K150K92j956k586j879j328j025Q0J855K879K685K460K980L287K210
53993A48918K19j117r89J58J609L025M160M653M373L794L669M224M791M597L914
53978A89998L897M971O033O006N512N975P386Q339Q220P969Q283Q475P858P019
53964B85941O852P209P445P507P621P665P610P803P890O508L185k43j508o56M03
$$ plain form
54072 117567 116025 114999 114442 114190 113718 112285 109804 107493 107085 108991 111630 113043 112880 112270 112179 112844
54056 112844 114571 117628 121028 122707 121720 119348 117251 115490 113418 111647 111565 113079 114302 113794 112167
54041 112167 111100 111546 113308 115745 118305 120555 122094 122585 122032 121120 120956 122025 123576 124392 124072 123190
54025 123190 122519 122584 123667 125540 127357 128607 129985 132396 135185 136531 135828 134501 133975 134057 134154 134846 136814
54008 136814 138964 139256 137300 134714 132835 131507 130482 130562 132417 135296 137981 140441 143421 146708 148918
53993 148918 149137 148020 147031 147189 148798 151823 155983 160636 165009 168803 172472 176696 181487 186084 189998
53978 189998 193895 198866 204899 210905 216417 222392 229778 238117 246337 254306 262589 271064 278922 285941
53964 285941 292793 300002 307447 314954 322575 330240 337850 345653 353543 360051 363236 362993 361485 360829 361232
53949C61232M05n22k146m295n905n705m135l216m188o304q089q611p549n391l745
53934B91836m030n611o452n835m928m537m016l033k566l105l446k584j506j692
53920B38495k769l131k217q05L53J015R03P5n05O6J095R15q18k473k444j017K80
53903B27018P21J082K229L511L277J098j243j694l56R40J188J137J671K513K924
53888B46016K604J511j55j408r76J062L201M417N124N708N715N212N402O672P434
53873B97539O443N027N254O800P573O879N905N296M284K501R53O07J331K637M323
53858C63352N925O613O259N687N447N125M348L694L879M684N432O067P043Q214
53844D41769Q655P826O440N651N530M905K952L95j439k301k989l834m364m497
$$ plain form
53949 361232 361637 361115 358969 354674 348769 343064 338929 335713 331525 325221 317132 308521 300972 295581 291836
53934 291836 287806 282195 275743 269908 264980 260443 256427 253394 250828 247723 244277 241693 240187 238495
53920 238495 235726 232595 230378 229573 229926 230941 231844 231919 231414 231480 232575 233490 232672 230199 227755 226738 227018
53903 227018 227739 228821 231050 234561 237838 238936 237693 235999 235643 236583 237771 238908 240579 243092 246016
53888 246016 248620 250131 249976 248568 247592 248654 251855 256272 261396 267104 272819 278031 283433 290105 297539
53873 297539 303982 309009 314263 321063 328636 335515 341420 346716 351000 353501 354454 355061 356392 359029 363352
53858 363352 369277 375890 382149 387836 393283 398408 402756 406450 410329 415013 420445 426512 433555 441769
53844 441769 450424 458250 464690 470341 475871 480776 483728 484123 482684 480383 477394 473560 469196 464699
53830D64699n003o270p573q171q362q839r645j0272j0235r209p407o127o775q857
53816C51954j0143r573q605q730r081q065o070m763m442m029l217k835l255l986
53802B65160m755n524n709m944m203m532m948l584r66Q2j665l995m309k899k003
53787B11206k808m543n741n427l498q05J431K470K290J077o70j841j594o38n62
53772A90347j715k823k924k453k111j853j485j130o27M61J802K406K247K487L442
53757A86071L739K460Q32N19J326J998K426L433M815N267M251K696J618J157J177
53742B23785J884L326M910N973O553P183Q017Q395P496N513L897M028N583O805
53728C03348O463N160M317M377M478L650J939L12l37p2J91k62j170j878k391l231
$$ plain form
53830 464699 459696 453426 445853 437682 429320 420481 410836 400564 390329 381120 373713 367586 360811 351954
53816 351954 341811 332238 323633 314903 305822 297757 291687 286924 282482 278453 275236 272401 269146 265160
53802 265160 260405 254881 249172 244228 240025 235493 230545 226961 225995 226077 224412 220417 216108 213209 211206
53787 211206 208398 203855 198114 192687 189189 188384 189815 192285 194575 195652 194982 193141 191547 190909 190347
53772 190347 188632 185809 182885 180432 178321 176468 174983 173853 173226 173687 175489 177895 180142 182629 186071
53757 186071 189810 192270 193102 193621 194947 196945 199371 202804 207619 212886 217137 219833 221451 222608 223785
53742 223785 225669 228995 233905 239878 246431 253614 261631 270026 277522 283035 286932 290960 296543 303348
53728 303348 309811 314971 319288 323665 328143 331793 333732 334044 333707 333635 333826 333564 332394 330516 328125 324894
53712C24894m379n021m481k906j097j24q52l062n114n467m501l884m181m322l634
53697B71869k848k642k582k359k617l467l557k051l52j41o58J01J978K719J503
53682B54896J68K72Q72M61m60l59N63L54j956m856o020m780k512j030r06j282
53666B33425j066k30J66o77k138k712j642K01J254P45p00j728j286O88L206M900
53650B32406N090M297L517L042K319R03p74j764j338O29L451N695O082M782L373
53635B71710K993L068K449J349J175K649M943O681P058N931L729J541N68R40J497
53620C18281J101j03r67o04P81K108K333J458N73O18J266J390N45o28j330j323
53604C25499p44J07N90M2j362k542k623j836j118j093j602j949j584p28j82k32
$$ plain form
53712 324894 320515 315494 311013 308107 307010 306886 306034 302972 297858 292391 287890 284006 279825 275503 271869
53697 271869 269021 266379 263797 261438 258821 255354 251797 249746 249394 249253 248595 248696 250674 253393 254896
53682 254896 255064 255336 256208 256669 256209 255850 256413 256767 254811 249955 243935 239155 236643 235613 234707 233425
53666 233425 232359 232129 232295 231618 229480 226768 225126 225327 226581 227326 226626 224898 223612 224300 227506 232406
53650 232406 237496 241793 245310 248352 250671 251574 250800 249036 247698 248327 251778 257473 263555 268337 271710
53635 271710 274703 277771 280220 281569 282744 285393 290336 297017 304075 310006 313735 315276 315844 316784 318281
53620 318281 319382 319279 318312 317708 318489 320597 322930 324388 324961 325579 326845 328235 328780 328152 326822 325499
53604 325499 324755 324862 325452 325494 324132 321590 318967 317131 316013 314920 313318 311369 309785 309057 308875 308643
53588C08643j31P64J762J644N35q8N99J787K272J801Q22k12q01m28Q05K073K689
53571C24536K633J995Q02m02n49P08K379L338L628M116N285O763P622O980M863
53556C74697K669J991K699L045K062Q62R33K207L587M605N487O221O575O683O827
53541D31150O946O965P113P250O558M843L398L515M622N121M638M111L911L369
53527E03510K374J954K687L687L856L350L042L100K922K203J284O13K81J69J01
53512E35133k09r13j501q92J367M007M818K985K23r98j12J280J557O06o35j200
53496E45516m48J577L697M421L702K987L217L758L928M260N212N801N011L757
53482E96396L788N057N849N433M866N012N377N445N800O995Q304Q572P734O793
$$ plain form
53588 308643 308512 309276 311038 312682 313217 313129 313728 315515 317787 319588 320410 320198 319397 318969 319774 321847 324536
53571 324536 327169 329164 329966 329564 329015 329723 332102 335440 339068 343184 348469 355232 362854 369834 374697
53556 374697 377366 379357 382056 385101 387163 388025 388958 391165 394752 399357 404844 411065 417640 424323 431150
53541 431150 438096 445061 452174 459424 465982 470825 474223 477738 482360 487481 492119 496230 500141 503510
53527 503510 505884 507838 510525 514212 518068 521418 524460 527560 530482 532685 533969 534582 534863 535032 535133
53512 535133 534924 534011 532510 531618 532985 536992 541810 544795 545018 544020 543908 545188 546745 547351 546716 545516
53496 545516 545068 546645 550342 554763 558465 561452 564669 568427 572355 576615 581827 587628 592639 596396
53482 596396 600184 605241 611090 616523 621389 626401 631778 637223 643023 650018 658322 666894 674628 681421
53468F81421O680P661R435J1228J2145J1957J1419J1507J2533J4221J6220J8231
53456H24658J9945K1194K2039K2496K2473K2133K2000K2363K3007K3778K4979
53445A071065K6759K8454K9280K9568L0503L2492L4439L5111L4760L4727L5655
53434A422813L6728L6814L5824L4706L4324L4755L5416L5561L4814L3530L2542
53423A807827L2322L2409L1968L0835K9783K9683L0594L1609L1627L0452K9087
53412B148196K8584K8513K7383K4799K2244K0942J9921J7502J4089J1814J1474
53401B375461J1449J0012P168L688j88m225p546r628j1186j3188j5681j8278k0903
53388B306955k3255k4324k3621k2235k1704k2348k3605k5260k7147k8224k7438
$$ plain form
53468 681421 688101 695762 705197 716425 728570 740527 751946 763453 775986 790207 806427 824658
53456 824658 844603 865797 887836 910332 932805 954938 976938 999301 1022308 1046086 1071065
53445 1071065 1097824 1126278 1155558 1185126 1215629 1248121 1282560 1317671 1352431 1387158 1422813
53434 1422813 1459541 1496355 1532179 1566885 1601209 1635964 1671380 1706941 1741755 1775285 1807827
53423 1807827 1840149 1872558 1904526 1935361 1965144 1994827 2025421 2057030 2088657 2119109 2148196
53412 2148196 2176780 2205293 2232676 2257475 2279719 2300661 2320582 2338084 2352173 2363987 2375461
53401 2375461 2386910 2396922 2404090 2407778 2407590 2403365 2395819 2386191 2375005 2361817 2346136 2327858 2306955
53388 2306955 2283700 2259376 2235755 2213520 2191816 2169468 2145863 2120603 2093456 2065232 2037794
53377B037794k5450k4144k4354k5091k5120k4214k2635k0397j7671j5206j3668
53366A799844j2786j1567r440p044n613n425n041k763J172M648O148O206O058
53353A764397O072O368P777J0717J3915J5857J7137J9704K3825K7415K8749K8513
53341A970446K8650L0240L3057L6351L9409M1930M4248M6883M9598N1549N2507
53330B424868N3367N5173N8023O1175O3777O5416O6296O7011O7874O8569O8711
53319C120260O8457O7995O6873O4632O1888N9824N8556N6900N4003N0369M6957
53308C776714M3841M0155L5014K8434K1600J6084J2243Q466K722n161j3297j9789
53296C947026k4422k8290l2540l7617m3117m8042n1537n3499n4410n4843n5407
$$ plain form
53377 2037794 2012344 1988200 1963846 1938755 1913635 1889421 1866786 1846389 1828718 1813512 1799844
53366 1799844 1787058 1775491 1766051 1759007 1753394 1747969 1742928 1740165 1741337 1745985 1752133 1758339 1764397
53353 1764397 1770469 1776837 1784614 1795331 1809246 1825103 1842240 1861944 1885769 1913184 1941933 1970446
53341 1970446 1999096 2029336 2062393 2098744 2138153 2180083 2224331 2271214 2320812 2372361 2424868
53330 2424868 2478235 2533408 2591431 2652606 2716383 2781799 2848095 2915106 2982980 3051549 3120260
53319 3120260 3188717 3256712 3323585 3388217 3450105 3509929 3568485 3625385 3679388 3729757 3776714
53308 3776714 3820555 3860710 3895724 3924158 3945758 3961842 3974085 3982551 3985273 3980112 3966815 3947026
53296 3947026 3922604 3894314 3861774 3824157 3781040 3732998 3681461 3627962 3573552 3518709 3463302
53285C463302n6577n8013n8550n7635n6254n5459n4630n2553m9851m8633m9518
53274B865629n0628n0114m8309m6712m5918m5451m4823m3800m2146l9816l7220
53263B370692l4811l2629l0481k8253k5963k3806k2217k1453k1190k1026k1090
53252B087773k1538k1756k0958j9334j7580j5571j2848j0255r550j0905j2268
53241A915210j1740r313n890k077J343L289L889M917P609J1029J3656J5490J7324
53228A964736J8887J9364J9215J9931K1991K4358K5975K6866K7624K8601K9685
53217B227233L0297K9695K7688K4971K2415K0344J8627J6923J4567J1104P401
53206B451265N217M882M392J795k454o615j0141j3462j6166j7403j7917j9637
$$ plain form
53285 3463302 3406725 3348712 3290162 3232527 3176273 3120814 3066184 3013631 2963780 2915147 2865629
53274 2865629 2815001 2764887 2716578 2669866 2623948 2578497 2533674 2489874 2447728 2407912 2370692
53263 2370692 2335881 2303252 2272771 2244518 2218555 2194749 2172532 2151079 2129889 2108863 2087773
53252 2087773 2066235 2044479 2023521 2004187 1986607 1971036 1958188 1947933 1938383 1927478 1915210
53241 1915210 1903470 1894157 1888267 1886190 1887533 1890822 1894711 1899628 1907237 1918266 1931922 1947412 1964736
53228 1964736 1983623 2002987 2022202 2042133 2064124 2088482 2114457 2141323 2168947 2197548 2227233
53217 2227233 2257530 2287225 2314913 2339884 2362299 2382643 2401270 2418193 2432760 2443864 2451265
53206 2451265 2456482 2461364 2465756 2467551 2465097 2458482 2448341 2434879 2418713 2401310 2383393 2363756
53194B363756k2881k5721k6684k6584k6931k7809k8427k8751k9421l0485l1253
53183B058809l1268l0771l0308l0234l0463l0385k9376k7609k6111k5568k5546
53172A741170k5277k4789k4531k4211k2918k0616j8623j8107j8545j8414j7129
53161A508010j5590j4824j4823j4991j4959j4474j3130j1068r583j0019j2009
53150A362540j3733j4102j3875j4361j5795j7428j8506j8634j7753j6393j5546
53139A186414j5784j6689j7487j7764j7369j6312j5211j5041j5759j5909j4571
53128A008518j3057j3491j5964j8341j8815j7612j5952j4604j3863j3948j4720
53117H38151j5521j5870j5905j5769j5057j3468j1648j0650j0639j0652r857q675
$$ plain form
53194 2363756 2340875 2315154 2288470 2261886 2234955 2207146 2178719 2149968 2120547 2090062 2058809
53183 2058809 2027541 1996770 1966462 1936228 1905765 1875380 1846004 1818395 1792284 1766716 1741170
53172 1741170 1715893 1691104 1666573 1642362 1619444 1598828 1580205 1562098 1543553 1525139 1508010
53161 1508010 1492420 1477596 1462773 1447782 1432823 1418349 1405219 1394151 1384568 1374549 1362540
53150 1362540 1348807 1334705 1320830 1306469 1290674 1273246 1254740 1236106 1218353 1201960 1186414
53139 1186414 1170630 1153941 1136454 1118690 1101321 1085009 1069798 1054757 1038998 1023089 1008518
53128 1008518 995461 981970 966006 947665 928850 911238 895286 880682 866819 852871 838151
53117 838151 822630 806760 790855 775086 760029 746561 734913 724263 713624 702972 693115 684440
53105F84440q330r309j0580j0595r119p640p733r244j0601j0662r718q603p636
53092E64670o840o656p531q941r593q831p336o212n855o002o407o759o427n132
53078D66148l781l659m577m901l913k983l484m454l838j572J29l02k003l198l334
53063D20278l091l239m065n274n933n221l632k667k905l261k745j965k080l115
53049C71085m263n176n853n803m511k538j143q38j118j395j446j180p03l64r4
53034C34660Q41K416K909Q05k585m007j997J607M162M806M115K715J232N29P76
53019C52984R34J71p36m54Q79J775J449N97%o65k037l767m756m583m119m522n760
53002C27390o573n988m597l908m488n303n118m062l223l048k787j699k48L03o58
$$ plain form
53105 684440 676110 666801 656221 645626 636507 628867 621134 611890 601289 590627 580909 572306 564670
53092 564670 557830 551174 543643 534702 525109 516278 508942 502730 496875 490873 484466 477707 471280 466148
53078 466148 462367 458708 454131 449230 445317 442334 438850 434396 430558 428986 429115 428813 426810 423612 420278
53063 420278 417187 413948 409883 404609 398676 393455 389823 387156 384251 380990 378245 376280 374200 371085
53049 371085 366822 361646 355793 349990 345479 342941 341798 340960 339842 338447 337001 335821 335118 334754 334660
53034 334660 335501 337917 340826 341631 339046 335039 333042 334649 338811 343617 347732 350447 351679 352208 352984
53019 352984 353918 354089 353353 352899 353778 355553 357002 357599 357599 356934 354897 351130 346374 341791 337672 333150 327390
53002 327390 320817 314829 310232 306324 301836 296533 291415 287353 284130 281082 278295 276596 276348 276651 275993
52987B75993k388l558l531k813k332k459k758k598j844r47m82o97j370j941j871
52972B44404j131l94m85j426k314k450k294k770l644l514j814m8j14j763k790
52957B17453j796K01J274Q33k60j165j730j929j507m49O37R60L39n55p94q2R12
52940B12342J259P97L01N29J279J532N15j368k628j936M27K539K652J030m15k26
52924B18629J233K455K253O35j172j580j61J586J723K32r66m64J154K566L347
52909B31470L604L161J978Q32M67N44K81l03n80k71N47J828L093L218J827L79
52893B52075N66J962K669K106J710K662M351N548N842N411M483L658L682M334
52879C01059M380L382K625L357M887N546N012M512M895N586N646M940L889K689
$$ plain form
52987 275993 273605 270047 266516 263703 261371 258912 256154 253556 251712 250765 250283 249586 248216 246275 244404
52972 244404 243273 242879 242394 240968 238654 236204 233910 231140 227496 223982 222168 222120 222006 220243 217453
52957 217453 215657 215858 217132 217965 217705 216540 214810 212881 211374 210925 211562 212522 212861 212306 211512 211430 212342
52940 212342 213601 214398 214699 215228 216507 218039 218554 217186 214558 212622 213049 215588 218240 219270 218855 218629
52924 218629 219862 222317 224570 225205 224033 222453 222292 223878 225601 225833 224867 224403 225557 228123 231470
52909 231470 235074 238235 240213 241045 241512 242056 242337 242034 241454 241183 241730 243558 246651 249869 251696 252075
52893 252075 252641 254603 257272 259378 261088 263750 268101 273649 279491 284902 289385 293043 296725 301059
52879 301059 305439 308821 311446 314803 319690 325236 330248 334760 339655 345241 350887 355827 359716 362405
52865C62405J300j09j112j406j058m31j8k98j452k996l857l234j578l75o71k060
52849C43050l291l586k949j603J14J434J647J006M30J77l57j262j493m66O76M23
52833C33950r31j738j375q59q95p24L95J796K516K916L795M459L319N20j683j772
52817C43689p67l30l06M96J877K334J332j7p17j046j539j889j537o60J0m6q18
52800C40066j748j947j049J47O23O53J256K099J516q02k614j876N23K129K247
52785C41223K216K799L057K058M33m04J48J446K399K454K008J806J896J594P16
52770C65849O2J83L37l90j518j830j214o97q19j070r50n83j14N54J245J577J647
52753C62269J910K153J491k43j871k136j276p61j615l231l990l051j393p20j364
$$ plain form
52865 362405 363705 363596 362484 361078 360020 359589 359571 359273 357821 354825 350968 347734 346156 345781 345110 343050
52849 343050 339759 336173 333224 331621 331735 333169 334816 335822 336252 336429 336072 334810 333317 332851 333527 333950
52833 333950 333019 331281 329906 329047 328152 327428 327823 329619 332135 335051 338846 343305 346624 347144 345461 343689
52817 343689 342922 342592 342286 342782 344659 346993 348325 348308 347591 346545 345006 343117 341580 340920 340930 340884 340066
52800 340066 338318 336371 335322 335469 336092 336745 338001 340100 341616 340814 338200 336324 336847 338976 341223
52785 341223 343439 346238 349295 351353 351786 351382 351530 352976 355375 357829 359837 361643 363539 365133 365849
52770 365849 365911 366094 366431 366041 364523 362693 361479 360782 359963 358893 357943 357360 357246 357800 359045 360622 362269
52753 362269 364179 366332 367823 367580 365709 363573 362297 361536 359921 356690 352700 349649 348256 347536 346172
52738C46172k041j928j969l337n435o561o082m817l582k553j898j944k568l340
52724B98117m179n026n115l798j995j566l006m855n566m919l420j533l0J14j109
52709B52114k334k390j718j706k936m649n649n432m483l615l080k574k083k108
52695B07357k611k620j566l26Pl57o10q50j492j846r68M05N15r60k681l770m447
52678A83180m705m216l584l728l884k411J19J088k53j464o41Q91J122M15J65J87
52662A62281m65j316j213m04r0n24j060j469j841j902j679j980k966l294k030
52647A40048l46K62L76J322K339J377j592m193m610l214j197P21K066K587K628
52632A38574K477J544m30j797n10K785M991M289J958R4o97o71K67K000L471L706
$$ plain form
52738 346172 344131 342203 340234 336897 331462 324901 318819 314002 310420 307867 305969 304025 301457 298117
52724 298117 293938 288912 283797 279999 278004 276438 273432 268577 263011 258092 254672 253139 253109 253223 252114
52709 252114 249780 247390 245672 243966 241030 236381 230732 225300 220817 217202 214122 211548 209465 207357
52695 207357 204746 202126 200560 200234 200241 199884 199274 198424 196932 195086 194118 194523 195038 194078 191397 187627 183180
52678 183180 178475 174259 170675 166947 163063 160652 160771 161859 161606 160142 159501 160392 161514 161929 162094 162281
52662 162281 161816 160500 159287 158883 158793 158269 157209 155740 153899 151997 150318 148338 145372 142078 140048
52647 140048 139702 139964 140340 141662 144001 145378 143786 139593 134983 131769 130572 131293 133359 135946 138574
52632 138574 141051 142595 142165 140368 139858 142643 147634 151923 153881 153975 153278 152607 152874 154874 158345 162051
52616A62051L006K356K160K287K759L624M356M090K535M87o86k70R93J660J309
52601A92717R25J171J191K2j566k017j240n40m95m37l7J65lj1j4j051l184m763
52583A80833m478l052j944j362o43P5m9r78j484o39R81J896J321J7n12L29J598
52566A71909J982J205j79j810l441m182l129j002K03m06j493j376j31Q94P97k72
52550A59569j594k243j603k77Q3j260k921k923j052J286L100M524N546N447L920
52535A69602J949P93N87N04O8k86J0Q09J428J622J957K940L919L401R36j788k337
52518A86114j73K655L609K196R4q62l92N15J025J294J915K927L650L562L038K857
52502B14024L014K581J154j07K94K053L119K226M79k64K54Q38P77L97k3n63q12
$$ plain form
52616 162051 165057 167413 169573 171860 174619 178243 182599 186689 189224 189711 189025 188755 189748 191408 192717
52601 192717 193642 194813 196004 196026 194460 192443 191203 190663 190168 189731 189694 189859 189856 189845 189831 188780 185596 180833
52583 180833 176355 173303 171359 169997 169354 169429 169380 168402 166918 166279 167260 169156 170477 170494 169982 170311 171909
52566 171909 173891 175096 174917 173107 169666 165484 162355 161353 161556 161150 159657 158281 158150 159044 159841 159569
52550 159569 157975 155732 154129 153852 153935 152675 149754 146831 145779 147065 150165 154689 160235 165682 169602
52535 169602 171551 172344 172931 173435 173503 173217 173227 174036 175464 177086 179043 181983 185902 189303 190239 188451 186114
52518 186114 185941 188596 192205 194401 194495 193633 193241 193756 194781 196075 197990 200917 204567 208129 211167 214024
52502 214024 217038 219619 220773 220666 220960 223013 226132 228358 228837 228573 228827 229665 230442 230839 230816 230253 229441
52485B29441K3J677K682K264J457J618K614L293L137K638K414K614K939K814J892
52470B63517Q00P15J779K627K155J029O50J291K154K725L051L034K456J617J016
52455B90616O09N8n21p19n22k31jn1p14j664j802p83J53l6m87R6J027N38j348
52436B84218k757k722k033j248J71K112L067K139M19n08l41M40J589K766L117
52421B90429K210O86n72j203q81P55K953L764K216k82j628j451q34m43p3L40N17
52404B96503N08O65J005J287J548J921K028J333N7p60l19J061K120J734O2j315
52388C09438q28J411L682M512L902K761J861J549J655J409J50j508k152j460o79
52373C25703p05p93m3Q77P22l22q52k76N20N38j75q03n92N78K037K828K580J731
$$ plain form
52485 229441 229464 231141 233823 236087 237544 239162 241776 245069 248206 250844 253258 255872 258811 261625 263517
52470 263517 264317 265032 266811 269438 271593 272622 273272 274563 276717 279442 282493 285527 287983 289600 290616
52455 290616 291225 291283 290762 290043 289521 289290 289289 289238 288524 286860 285058 284275 284428 284392 283905 284001 285028 285566 284218
52436 284218 281461 278739 276706 275458 275629 277741 280808 282947 283366 282858 282517 282957 284546 287312 290429
52421 290429 292639 293325 292753 291550 290669 291424 294377 298141 300357 300075 298447 296996 296162 295719 295646 295986 296503
52404 296503 297011 297676 298681 299968 301516 303437 305465 306798 306855 306095 305776 306837 308957 310691 310753 309438
52388 309438 308610 310021 313703 318215 322117 324878 326739 328288 329943 331352 331502 329994 327842 326382 325703
52373 325703 324998 324205 324162 325039 325761 325439 324587 324311 324831 325369 325194 324391 323799 324377 326414 329242 331822 333553
52355C33553P02o01k163l354l594l084k387j755j216p42k3J251K546K794K006
52340C23933J386J262L56j800l192j881Q63K109J403J057K383L878L751K342J161
52325C39011R21J429K289K908K682J858J418J596J394K17r77q92M91K244L689
52310C60278M426L872J875m61j479o09J234K737L281L051K531K005J468J071J409
$$ plain form
52355 333553 334255 333654 331491 328137 324543 321459 319072 317317 316101 315359 315336 316587 319133 321927 323933
52340 323933 325319 326581 326937 325137 321945 320064 320927 323036 324439 325496 327879 331757 335508 337850 339011
52325 339011 339932 341361 343650 346558 349240 351098 352516 354112 355506 355723 354746 353854 354345 356589 360278
52310 360278 364704 368576 370451 369990 368511 367902 369136 371873 375154 378205 380736 382741 384209 385280 386689
$$ [...]
##END NTUPLES=NMR SPECTRUM
##END=
