
##TITLE=AC1183_Huila-gigante-HGIAH12027_5891346_O9vYsNOMCW
##JCAMPDX= 6.0         $$ Bruker NMR JCAMP-DX V2.0
##DATA TYPE= NMR SPECTRUM
##DATA CLASS= NTUPLES
##ORIGIN= BRUKER
##OWNER= Administrator
$$ 1.72 TOPSPIN		Version 2.1
$$ 2012-04-03 00:06:56.953 -0500  Administrator@TOPSPIN
$$ Compression mode = diff/dup
##.OBSERVE FREQUENCY= 400.13188235
##.OBSERVE NUCLEUS= ^1H
##.ACQUISITION MODE= SIMULTANEOUS (DQD)
##.ACQUISITION SCHEME= undefined
##.AVERAGES= 8
##.DIGITISER RES= 22
##SPECTROMETER/DATA SYSTEM= spect
##.PULSE SEQUENCE= zg30
##.SOLVENT NAME= COFFEE_meoh
##.SHIFT REFERENCE= INTERNAL, COFFEE_meoh, 1, 14.98061
##AUDIT TRAIL= $$ (NUMBER, WHEN, WHO, WHERE, PROCESS, VERSION, WHAT)
$$ ##TITLE= Audit trail, TOPSPIN		Version 2.1
$$ ##JCAMPDX= 5.01
$$ ##ORIGIN= Bruker BioSpin GmbH
$$ ##OWNER= Administrator
$$ $$ C:\Bruker\TOPSPIN/data/COFFEE/nmr/AC1183_Huila-gigante-HGIAH12027_5891346_O9vYsNOMCW/10/pdata/1/auditp.txt
$$ ##AUDIT TRAIL=  $$ (NUMBER, WHEN, WHO, WHERE, PROCESS, VERSION, WHAT)
(   1,<2012-04-03 00:06:48.718 -0500>,<Administrator>,<TOPSPIN>,<go>,<TOPSPIN 2.1>,
      <created by zg
	started at 2012-04-03 00:05:41.750 -0500,
	POWCHK enabled, PULCHK disabled,
       configuration hash MD5:
       1A 1E CE 29 27 FD 77 03 67 4E F0 E3 C4 B2 CB 90
       data hash MD5: 64K
       2E F4 AB 35 49 EA F4 29 F5 E2 40 11 35 0B 83 CB>)
(   2,<2012-04-03 00:06:51.734 -0500>,<Administrator>,<TOPSPIN>,<proc1d>,<TOPSPIN 2.1>,
      <Start of raw data processing
       efp LB = 0 FT_mod = 6 PKNL = 1 PHC0 = 0 PHC1 = 0 SI = 32K 
       data hash MD5: 32K
       1B 54 B6 80 C8 11 73 E7 AC 0F 80 F0 48 33 2E 17>)
(   3,<2012-04-03 00:06:52.140 -0500>,<Administrator>,<TOPSPIN>,<proc1d>,<TOPSPIN 2.1>,
      <pk PHC0 = 212.0251 PHC1 = 0 
       data hash MD5: 32K
       BA 63 F7 29 59 13 F1 32 57 43 D6 E9 93 1F 1F D2>)
(   4,<2012-04-03 00:06:52.234 -0500>,<Administrator>,<TOPSPIN>,<proc1d>,<TOPSPIN 2.1>,
      <abs ABSG = 1 
       data hash MD5: 32K
       54 FC 1E 6D 5B 69 39 30 DE 5D 7C 62 D5 2E 3C 6B>)
(   5,<2012-04-03 00:06:52.265 -0500>,<Administrator>,<TOPSPIN>,<proc1d>,<TOPSPIN 2.1>,
      <abs ABSG = 2 
       data hash MD5: 32K
       C9 1B 4B D0 6D 85 A3 4E 95 EA 5A 94 98 A0 18 54>)
(   6,<2012-04-03 00:06:52.296 -0500>,<Administrator>,<TOPSPIN>,<proc1d>,<TOPSPIN 2.1>,
      <abs ABSG = 3 
       data hash MD5: 32K
       95 E8 FB 65 C8 D0 53 8D A4 4C E0 96 A4 8D 79 53>)
(   7,<2012-04-03 00:06:52.343 -0500>,<Administrator>,<TOPSPIN>,<proc1d>,<TOPSPIN 2.1>,
      <abs ABSG = 4 
       data hash MD5: 32K
       CF CF AC 3B FD 72 3C 50 57 A2 4A 81 F3 54 7D BA>)
(   8,<2012-04-03 00:06:52.375 -0500>,<Administrator>,<TOPSPIN>,<proc1d>,<TOPSPIN 2.1>,
      <abs ABSG = 5 
       data hash MD5: 32K
       CF 60 CC 1B E2 10 FB E0 01 E3 99 4F 23 E9 30 67>)
$$ ##END=
$$ 
$$ $$ hash MD5
$$ $$ E9 CE 07 DD 36 10 42 84 47 91 18 7A 46 70 90 93
##$RELAX= 
##$RELAX= 
##$RELAX= 
##$RELAX= 
##$RELAX= 
##$RELAX= 
##$RELAX= 
$$ Bruker specific parameters
$$ [...]
##$TP= (0..7)
150 150 150 150 150 150 150 150
##$TP07= 0
##$TPNAME0= <>
##$TPNAME1= <>
##$TPNAME2= <>
##$TPNAME3= <>
##$TPNAME4= <>
##$TPNAME5= <>
##$TPNAME6= <>
##$TPNAME7= <>
##$TPOAL= (0..7)
0.5 0.5 0.5 0.5 0.5 0.5 0.5 0.5
##$TPOFFS= (0..7)
0 0 0 0 0 0 0 0
##$TUNHIN= 0
##$TUNHOUT= 0
##$TUNXOUT= 0
##$USERA1= <user>
##$USERA2= <user>
##$USERA3= <user>
##$USERA4= <user>
##$USERA5= <user>
##$V9= 5
##$VALIST= <valist>
##$VCLIST= <CCCCCCCCCCCCCCC>
##$VD= 0
##$VDLIST= <DDDDDDDDDDDDDDD>
##$VPLIST= <PPPPPPPPPPPPPPP>
##$VTLIST= <TTTTTTTTTTTTTTT>
##$WBST= 2048
##$WBSW= 25
##$XGAIN= (0..3)
0 0 0 0
##$XL= 0
##$YL= 0
##$YMAX_a= 525138
##$YMIN_a= -642432
##$ZGOPTNS= <>
##$ZL1= 120
##$ZL2= 120
##$ZL3= 120
##$ZL4= 120
##$ABSF1= 14.98061
##$ABSF2= -5.57192
##$ABSG= 5
##$ABSL= 3
##$ALPHA= 0
##$AQORDER= 0
##$ASSFAC= 0
##$ASSFACI= 0
##$ASSFACX= 0
##$ASSWID= 0
##$AUNMP= <proc_prof1d_extract_pilot.lims>
##$AXLEFT= 0
##$AXNAME= <>
##$AXNUC= <1H>
##$AXRIGHT= 0
##$AXTYPE= 0
##$AXUNIT= <>
##$AZFE= 0.1
##$AZFW= 0.1
##$BCFW= 0
##$BC_mod= 0
##$BYTORDP= 0
##$COROFFS= 0
##$CY= 15
##$DATMOD= 1
##$DC= 0
##$DFILT= <>
##$DTYPP= 0
##$F1P= 0
##$F2P= 0
##$FCOR= 0.5
##$FTSIZE= 32768
##$FT_mod= 6
##$GAMMA= 0
##$GB= 0
##$INTBC= 1
##$INTSCL= 1
##$ISEN= 128
##$LB= 0
##$LEV0= 0
##$LPBIN= 0
##$MAXI= 10000
##$MC2= 0
##$MEAN= 0
##$ME_mod= 0
##$MI= 0
##$NCOEF= 0
##$NC_proc= -8
##$NLEV= 6
##$NOISF1= 0
##$NOISF2= 0
##$NSP= 0
##$NTH_PI= 0
##$NZP= 0
##$OFFSET= 14.98061
##$PC= 1
##$PHC0= 212.0251
##$PHC1= 0
##$PH_mod= 1
##$PKNL= yes
##$PPARMOD= 0
##$PPDIAG= 0
##$PPIPTYP= 0
##$PPMPNUM= 2147483647
##$PPRESOL= 1
##$PSCAL= 4
##$PSIGN= 0
##$PYNMP= <proc.py>
##$REVERSE= no
##$SF= 400.13
##$SI= 32768
##$SIGF1= 0
##$SIGF2= 0
##$SINO= 400
##$SIOLD= 32768
##$SPECTYP= <>
##$SREGLST= <1H.CDCl3>
##$SSB= 0
##$STSI= 32768
##$STSR= 0
##$SW_p= 8223.68421052632
##$SYMM= 0
##$S_DEV= 0
##$TDeff= 65536
##$TDoff= 0
##$TI= <>
##$TILT= no
##$TM1= 0
##$TM2= 0
##$TOPLEV= 0
##$USERP1= <user>
##$USERP2= <user>
##$USERP3= <user>
##$USERP4= <user>
##$USERP5= <user>
##$WDW= 1
##$XDIM= 32768
##$YMAX_p= 465391088
##$YMIN_p= -702729
##$CURPLOT= <Network HP LaserJet P1505>
##$CURPRIN= <$Network HP LaserJet P1505>
##$DFORMAT= <normdp>
##$LAYOUT= <+/1D_H.xwp>
##$LFORMAT= <normlp>
##$PFORMAT= <normpl>
##$SURQMSG= 1
$$ End of Bruker specific parameters
$$ ---------------------------------
##NTUPLES= NMR SPECTRUM
##VAR_NAME=  FREQUENCY,     SPECTRUM/REAL,   SPECTRUM/IMAG
##SYMBOL=    X,             R,               I
##VAR_TYPE=  INDEPENDENT,   DEPENDENT,       DEPENDENT
##VAR_FORM=  AFFN,          ASDF,            ASDF
##VAR_DIM=   32768,         32768,           32768
##UNITS=     HZ,            ARBITRARY UNITS, ARBITRARY UNITS
##FACTOR=    0.250966925370066, 1,           1
##FIRST=     8223.43324360095, -133181,      -37117
##LAST=      0,             8795,            161345
##MIN=       0,             -702729,         0
##MAX=       8223.43324360095, 465391088,    0
$$ Real data points
##PAGE= N=1
##DATA TABLE= (X++(R..R)), XYDATA
$$ [...]
23789 -87792 -119169 -40235 -317145 -4294 179265 25353 335980 154014 -61015 -10577 154676
23777 -283942 60616 64116 196739 -113208 135276 -5383 -3274 -259921 -179354 5709 -109276
23765 -95809 96127 50057 -47773 -96108 500386 -132053 292712 33454 -262093 106719 148096
23754 148096 270136 133337 131124 -219296 163181 73051 -153155 3045 38739 182590 143106
23743 143106 125971 -1014 78399 37213 -56574 155395 -42216 -26364 76909 223278 77480
23731 -296300 -137486 298672 111438 83758 3863 -185351 74716 920 -178352 641138 158777
23719 -137635 -105767 -155657 -338665 270272 -44152 139650 85935 -64042 -314550 -150285
23708 -144612 -88422 -36539 64272 55470 -157354 -147054 85483 -36978 182940 140758 -25481
23696 97420 -171981 29472 -111080 71100 145719 -363117 78882 -53789 871 -92496 70519
23684 384544 12065 -24262 96916 46967 -131011 -273994 -478778 -93802 -390549 -56128 -79360
23673 -79360 -48882 -142453 245072 -189180 60862 -3005 -108972 -44906 16068 -252803 -11125
23661 18880 -57933 -80683 -280480 -102159 150408 -95381 -222754 -75206 -67032 -320628 -160535
23650 -160535 -18953 -35930 312938 -184169 2257 -104828 252415 155666 -205387 1004 84740
23639 84740 -206891 -376729 -58362 188192 -40967 -63663 3958 -173008 124405 204336 -283876
23627 166700 -37735 117712 -78304 237413 56470 26202 -59530 230384 124724 257334
23617 257334 -100593 68660 233604 -94262 191606 162919 -48380 -125258 -9809 -58858 14702
23605 -150130 -134452 -21465 137381 159416 -114760 -38450 -21552 388155 -243888 96898 -189167
23593 -222151 -168477 -242799 266981 248491 54630 -225631 237410 152887 131618 21314 81994
23582 81994 212210 113807 182360 10456 79159 315021 -17532 27377 346211 120961 2952
23570 95722 -339147 64289 -216847 71693 -29052 234815 271731 -27192 -21675 -102143 -9105
23558 61621 -183872 -143544 71103 48576 -167338 109211 129268 178285 -119198 291901 344912
23547 344912 -99802 -73078 -111520 -187791 2507 147548 -64001 -73659 -237005 173746 22605
23535 -155466 -57038 -174168 -328645 19972 212630 -119397 254774 43484 -96191 -84999
23525 -84999 117386 -55989 27682 141022 -238349 156830 -150110 157192 -15650 113727
23514 282036 -150395 27288 -37908 167344 -36205 107658 41051 333558 163603 -177523
23503 323365 -276521 -32283 -12268 -174047 48384 -119822 -302232 -26005 126860 90582
23493 90582 171722 -85862 150886 235248 10088 4034 171115 -153581 192280 213719 -94995
23481 -189483 143038 28796 -134742 -210407 56972 -138995 -446408 -179860 -103077 -40975
23470 120198 45637 -11423 -21587 -192694 151512 37692 -111405 29 -72550 134717 -77156
23458 259283 -39776 101416 -50725 283183 -377557 11977 25109 -155992 11334 30804 -146683
23446 51268 -282934 -117382 -132880 285111 -75009 36267 -99095 160320 -18788 274792 76897
23434 85618 10225 -137760 243157 147078 -295267 -39297 -61037 -92319 143476 -187443 -220494
23423 -220494 16243 -169477 43032 369235 -30260 -125211 -36477 27957 -344932 164144 -224941
23411 82197 -202618 96017 145980 -75723 -135245 -32673 -153501 36414 -147296 326198 -145841
23399 -32145 -209274 4149 -266001 393542 85565 81498 101602 -238093 -123288 -26840 -109797
23388 -109797 95814 -9361 -60719 -41323 -425443 -65376 105382 129159 4278 35014 -53411
23376 137139 70481 -296106 -332106 155231 90314 -51629 141503 99646 -126363 -3912 -130533
23365 -130533 -66807 -34070 -1502 -5659 -412425 -376209 -256998 160583 -315033 -298599 -44828
23353 34987 255150 -145959 109006 22161 87623 -254163 -180981 -485374 -236647 92514
23342 38601 -356930 729 -61001 132802 -77247 -120574 62149 -202269 -116354 23619 150989
23331 150989 -350297 -315621 -25139 -296300 -66429 -68459 -114633 -113852 108352 -315508 -218402
23320 -218402 -315110 138417 -194416 -79694 -215983 88273 36600 206082 66507 -67708 175984
23308 81488 -130407 -109309 -263496 -210617 4705 -3932 350535 -129918 -9058 -238840 51127
23296 120106 -59771 29977 -97030 27565 319232 69289 19765 21073 82901 295934 -93209
23284 145926 77926 -166693 -36852 62815 -190724 2534 456713 -2601 -120270 -88112 -69941
23273 -69941 12684 215331 -165003 -35393 -86071 -215042 -140603 -67982 101965 -252981 -110798
23261 29933 81458 213107 71839 -106079 -123528 -81287 -137819 35187 -127717 179618 -210976
23249 -9116 277451 -189852 -115449 -49019 -83141 199227 -297458 117392 398702 -18925 -88128
23238 -88128 -30126 4870 198226 -123357 -278678 -108133 191388 55532 52811 177429 -361993
23226 -219075 -46905 -215004 -142318 149285 -25539 -275058 -29169 53100 -247858 -144013
23216 -144013 -200019 11173 219672 153534 -29741 -197363 -32739 101381 -127863 -62100 -184941
23205 -184941 -244708 -162175 -12433 -130851 271223 -46653 345352 -174642 -263440 154033
23194 88280 365601 152476 53484 -321822 146818 92091 270429 -69200 -183868 -33738
23183 71362 23612 -269884 180701 1146 -262834 63220 -112456 -2342 -345256 -158156 -131304
23172 -131304 -215856 24216 143893 45734 182940 27920 12609 -105522 -37048 126025 -44229
23160 129079 -114799 102402 -42139 -25875 179355 30506 -171504 67711 146797 -77555 -154454
23149 -154454 18676 -6391 86194 131966 -99350 34088 64934 74804 -79224 41351 353219 74517
23136 -87499 33724 -150919 -286747 352700 -94848 -433124 180466 8393 103194 233464 163064
23125 163064 137994 67657 156531 101309 165107 -118394 53526 111450 -47074 -16826 162541
23113 152700 -56013 107152 -101242 -18458 164090 36740 163408 -106258 -98587 -103418 -4384
23101 137288 -191451 -14017 -108193 55311 -271201 -123151 94542 -117775 -51104 51122 57249
23090 57249 -326573 2521 -44545 137299 11469 93228 477219 -296233 241957 3951 185817
23079 185817 241982 73636 -109603 319192 293118 151428 452 -62116 118619 -143957 -83068
23068 -83068 77286 -42068 167537 -209611 -191059 -200989 32894 -180057 -138959 -114148 7464
23056 -145141 199576 -60804 -69334 -49895 -324769 103818 32750 -238650 254704 -85555 240900
23044 303486 57692 40061 -186131 25774 439614 -24397 52712 -305302 216204 -295545
23033 87420 -128254 177385 -321829 12355 -136143 15598 -29044 -86759 131425 60066 -8030
23021 92438 -11342 -37229 94599 113382 -21500 438129 -35437 76990 105510 -324627 -72067
23009 175358 180322 -262594 47932 -77854 -302448 -73428 198263 -67609 -248718 14458 25289
22998 25289 -5363 125450 -125044 178925 -285107 -90597 -311445 -8586 153713 -71087 -284934
22987 -284934 119777 -187642 -93447 7410 -196168 -53208 191409 258963 104728 -196422
22976 -74890 -350411 -83249 -250233 54776 -262561 -338277 -175647 77678 -45580 176389 -217811
22964 228726 -5462 197958 -320441 279491 92202 -422760 -117201 327818 -35958 127358
22953 44833 1567 33131 -74387 -119413 -82563 -49388 -171175 316883 -8561 -44707 81905 -44821
22940 301715 -14661 -166518 -1773 46509 6067 127595 155772 -66801 16146 -370986 -264346
22929 -264346 82295 -362875 141361 -63659 -277332 134067 -54313 52247 224743 -109923
22918 212889 -105201 -6615 -207949 -486920 -4830 122522 -6458 -75370 91358 205362 -217999
22906 -57332 -53341 10282 60361 285653 283916 -8038 -262100 -115064 366433 -218434 -94517
22894 -194610 22163 -59053 93511 100246 205349 45845 -10568 14350 29970 -79415 151476
22882 -94792 -139751 41397 -83780 134251 -215371 321886 -128977 113897 -63787 77033 -176128
22870 -7356 -346714 -102279 -77621 -168651 270766 -36085 36779 288308 263829 193092 -421491
22858 -100148 166269 -5310 -80334 52258 109418 60409 -119745 -145242 -25299 520197 -150587
22846 -118150 -62761 -68556 41936 -267586 219338 -117750 284196 71083 111529 359624 -141413
22834 257503 -148224 -106112 -93712 100021 80191 -187815 -169901 -308509 116638 -148638
22823 -311905 -75967 -44717 351316 -115940 57550 49855 96265 -230637 -133327 -33721 204658
22811 -2372 5218 -413566 -253217 11511 21280 -23307 -75546 -4819 290874 -130587 126359
22799 -212178 -132692 -49817 59645 376060 -290950 -168878 -36454 -166419 186351 -53482
22788 10798 48068 -99745 -156524 108346 100920 -119739 1010 -91319 174053 -20193 -231408
22777 -231408 150991 -9759 -493182 -23691 128438 128132 277094 -245145 225232 -46667 -59888
22766 -59888 77021 -298344 -116521 -9927 -198101 286810 -266324 -187718 209157 68886 64224
22755 64224 -104015 -163948 -86198 39024 -129658 -308443 -234101 20630 -352685 68637 -109106
22743 -513 -187329 -104633 22247 -19134 115246 173838 -113991 19819 -123639 -243084 111854
22731 -297498 -92721 113601 -53071 -68438 -139620 96725 -306487 106287 -161546 -117213 127564
22719 -413048 13556 217191 210354 65190 -365249 -199530 124469 53972 -319438 -138639
22708 -19044 -108691 233828 -288556 -13515 -38330 293971 -67147 -186732 265269 37188 -182719
22696 17532 119375 -346480 -103367 -140085 -230408 172984 -144348 -189309 -141355 -272041
22686 -272041 -94201 -206260 -124898 181221 -75418 -21683 -62137 293895 128535 120535 -57360
22674 236080 -158408 -228812 -82550 -242886 78731 4142 217501 141906 -43690 48744 -106779
22662 -224486 -87631 81627 270907 -51446 -163357 22749 -127436 -135661 155115 123079 -58741
22650 -212778 -189358 -123549 -177282 -133462 8236 -256175 -30808 195757 -107215 128702 -89377
22638 205151 -44500 211603 16317 251102 36910 -352102 4663 -174912 -85097 -355933 13144
22626 -147750 39036 -211460 -414379 35350 -42078 77843 -55352 -135723 256575 338605 -148497
22614 77929 -4378 -113700 -34099 96801 3701 -165214 -65190 -137045 -227359 16518 -124160
22602 43878 -511 -162996 -113137 48953 130700 80425 -51731 -87393 221282 344826 -62033
22590 71917 -4920 -304917 282520 359698 -164403 -80333 -162295 252726 40469 -245356 -40332
22578 141820 -301141 -40844 -393734 66753 -189220 -185198 -9414 26180 -237186 -249557 49457
22566 -83777 -64297 -287730 120064 72481 -92874 -137080 76067 -170751 -95938 -123029 -6294
22554 159017 -375571 86207 100116 13761 109067 108501 -219952 77681 228139 51148 -174687
22542 -113229 17862 -154454 69080 -52737 -126369 189353 84545 176090 -103074 -62982 184741
22530 -255131 181170 -73774 -14750 141571 -261795 -351358 15099 -11017 -89569 -21054 49122
22518 31461 -172045 -97016 -89102 40484 109341 42293 314514 77463 58844 -226005 -156659
22507 -156659 178670 -14073 -139564 87994 164596 -290007 -9674 307961 128509 46425 -369628
22495 -87213 106350 -8449 195793 -355561 267233 68954 66120 20430 111513 33368 -210926
22483 -61876 -13826 9403 -69600 6970 -85634 11275 14741 -22879 -267940 -133902 80968 -178370
22470 288319 -214319 110241 -265067 1989 6117 52455 15690 -81634 -3565 -247339 20623
22458 -133067 -177692 -47563 -890 -45107 -219976 190178 -307367 140609 -112470 -512343 291212
22446 348743 -90148 -189007 -279675 111630 -238721 18646 -110328 58910 9642 117454 -75443
22434 -151777 -258625 -151635 -284237 160632 -167578 -417007 -188817 -58678 -13856 7032
22423 -11674 296051 -406178 316838 100857 -174810 65156 235055 -24740 104902 -213499
22412 -117897 23951 -106319 54281 -132371 -3742 110039 289460 -72130 -236138 -199112 -43341
22400 40837 67642 89637 133494 -124372 -228655 -594895 139724 39451 -59662 -70490 -120960
22389 -120960 -74374 -119316 -200787 262312 -199170 -14160 70457 -262753 -232022 247293 61496
22377 93945 -316414 -181520 219694 36606 -28801 144858 -355607 2228 -113391 -68449 127705
22365 101384 -83316 -396059 -50277 -89319 -202199 -150258 -250329 -429270 -212775 177234
22354 -17285 -19843 -144111 201722 152558 89675 -237843 126897 -17874 -66892 204701 -328592
22342 -91244 -56639 355159 194477 -280963 265316 23671 -88628 -302390 -45670 -12001 41385
22330 27094 -228495 -70402 73420 -308087 -39685 -85774 337043 -57364 10257 23510 -31487
22318 -334781 -86951 20261 -236055 -310490 -119408 -104560 -142182 -352262 106452 -405810
22307 17013 249566 -61843 -247275 -12126 -83156 -94242 103603 -180344 -227961 -205325 -178996
22296 -178996 209637 -136069 158409 -12236 -62604 -187064 -178030 221723 59625 20350 279507
22285 279507 33479 -316034 26409 37470 14109 -119874 -296614 -91410 -234593 109022
22274 158503 80961 61779 60585 50152 67794 96565 257199 -355931 116588 -75408 -128687
22263 -128687 -228145 -11466 -48541 -229304 -111244 35069 4818 -242147 8387 231472 -277910
22251 -186402 -148244 147016 39606 -92414 -181110 16502 -166526 -154885 -306478 -198676 -16991
22239 -224300 48148 -148187 -48644 -58991 55502 107113 13040 -89486 -2656 -134167 -532868
22228 -532868 -265674 -141250 -126690 205209 99147 -236000 152846 8361 -143562 -212544
22218 -212544 -265318 77588 30386 -199905 37301 73270 7603 -315302 310280 -90189 -56023
22207 -56023 -35442 29878 187271 -15775 -227044 79616 -420140 -114376 -45747 483316 -128627
22195 -279125 71181 -119126 -72003 -54721 215871 -137172 -157949 80619 -201808 -240768 152125
22183 -317365 -186284 253798 93335 -22978 -242367 -119408 -50199 -103122 91573 -47709 55673
22171 -38068 -93025 64572 62665 37276 -10189 89039 10629 65219 81749 -3142 -17961 77435
22158 149488 39418 53553 267012 124751 -62434 -121110 31012 37796 -13130 81240 -228275
22146 -50296 30007 -244160 -321156 77526 115655 17642 100353 106020 151137 56879 213431
22135 213431 354232 -247418 -270422 -18993 -173366 75836 107288 46517 125938 31032 -43025
22123 -30217 -351037 -86001 -609377 -94878 52147 -245654 -56948 20707 -373109 -62451 -170567
22112 -170567 126712 -65613 20995 -31620 -154874 -120445 33981 -138022 41994 -7325 -40051
22101 -40051 23299 8145 -338857 -116786 92046 -158006 82559 -10879 -311520 -256720 31055
22089 7203 -186464 -400239 104751 270873 -209242 -44411 -232218 -72539 -57881 -113337 -317113
22078 -317113 -272070 88204 74555 59941 -23145 -78173 -293136 16418 34158 61320 -39202
22066 23116 -16738 122780 -16176 -69431 55492 -154928 -318509 -10771 29405 -247668 237038
22054 149646 -16142 25407 -118832 3009 -290362 -302700 -119596 -10896 293840 35109 -183680
22042 -265657 72307 -91198 138746 15275 -69547 -401815 237869 -22772 63663 -89575 227088
22030 133158 33314 -185960 174294 27568 -374274 -178448 276374 -58087 -47416 -189883
22020 -189883 -129333 157533 -161468 -128471 175678 31589 -193946 69149 96231 59914 -53856
22008 26857 162642 -79884 -77886 -279575 -155976 -121706 49246 274535 -88232 55388 275719
21997 275719 157645 -379665 5951 124915 -133209 -414531 12348 19952 -149156 18490 -136182
21985 -118015 -66114 -37217 119103 3482 -94889 -241965 -45303 232059 -117227 37313 -220738
21973 77021 296185 153432 -60983 -62346 106628 -253988 -149739 -124197 -224141 -79434 37579
21961 -215275 -121741 135304 25313 -53561 146297 -178569 57380 6622 -51581 -121960 144342
21949 -91045 59206 96213 -32724 29391 153187 149379 -220854 -119030 -283835 193667 163386
21938 163386 12435 11363 286961 -300504 -137875 -178699 -278786 -516697 -236199 247497
21927 74856 14495 196150 -137950 -162966 186822 -32976 -11657 -90448 36975 -89888 118791
21915 -190471 63170 61506 -82543 -211135 60762 -27973 -221899 -199553 -83605 153648 -301423
21903 105340 46406 -165745 13827 49357 220890 -279351 190534 -346585 40074 -108392
21892 53656 -398389 -33324 -200337 -198547 153237 90445 -57600 60242 -195447 101727 20099
21880 -348893 -3271 10472 -36797 -156431 49018 -20364 -57877 36166 -303254 15941 -62170
21868 -24429 -45052 -155638 134832 -76681 186080 327989 -193581 -92988 54271 -103950
21857 -110951 53835 135870 -295807 1158 151073 -61646 -242946 8355 -35476 -117302 -78111
21846 -78111 -383381 -54068 113386 -17549 62043 99493 -48852 -24802 -258927 -238564 -112879
21834 -65033 -69848 -24414 -269169 -62860 -71217 136679 -42766 -20547 -85073 -126129 64158 -17949
21821 53933 -147952 130776 113606 -212704 20717 -57432 -104315 -116291 127172 29830 -311432
21809 -187114 -218291 -151213 34167 46928 -16157 226883 -37512 369918 4227 -12427 -131241
21798 -131241 -60985 55374 92925 33346 -239931 100241 73202 -288458 -122997 -347012
21788 -347012 -148424 -182211 155634 -205752 -964 32293 277911 -143802 15057 20930 303420
21777 303420 246453 -239096 -46676 74147 -70481 152915 93844 -344875 169327 -251535
21766 -131595 361868 -104407 58720 -56496 -34760 -209203 -86977 -303953 -204903 83789 -172627
21754 284361 41143 -483 -211188 385677 -184882 6888 -61071 -338057 -97759 -68417 6434
21742 -19021 110102 262750 303568 -212593 -57707 -12316 -101479 -68824 -60713 57533 -212700
21730 -182194 126046 -277944 138833 -45944 86409 99111 -245609 -259621 174815 -234307
21719 294373 -50684 -128737 -153746 45923 225172 -46626 -1453 -216122 464986 -85565 -44810
21708 -44810 99020 -277786 -62139 17691 150977 -288156 -81572 -105514 3508 -316168 -80260
21696 -157910 182926 91042 -96080 -182423 119929 -229339 -65505 -250510 72922 114428 -160859
21684 120837 -217445 -10726 -268696 -106139 -98004 -184191 -214799 -76403 -20701 -184334 21339
21672 -194283 -147209 18145 -388436 -169381 -19218 -227765 -145007 -346519 -124550 11536
21661 41192 -165254 -314108 -94483 226884 1896 -87558 -26471 57497 52077 -77326 -295055
21650 -295055 -250047 -271221 -166651 -162608 -10009 -24155 33639 -141918 -7316 68026 -294026
21638 72041 -146208 134566 356907 116939 -154941 -52134 1808 24489 -107292 -139438 -106118
21627 -106118 -148772 -39849 -155362 -100126 -52995 184539 -35046 -261696 23345 17165 58931
21616 58931 92084 -31743 117775 -351907 6910 -345371 144017 173760 159310 -24976 117603
21604 28278 434169 -113620 188585 -105896 -185915 196560 -171150 -98477 -89164 -85244 79779
21592 -236208 50969 -108294 71606 -257677 81677 -163702 138621 66370 -101643 16703
21581 -16118 93681 -242764 13766 195462 141022 228906 49944 -216443 -223472 189606 -246573
21569 89191 -219876 -268572 -146681 164237 54604 -355736 -279514 -250566 -51081 -288847 89298
21557 -171643 -9960 -12800 -424420 67426 -196639 -130546 181251 36823 -195123 -228617 111733
21545 -92319 -9714 -198056 148616 -348319 -206378 51051 -272530 27875 5728 197587 -175698
21533 -127806 49106 -152504 112892 -156121 -80122 -174231 -171520 267406 -121846 -54749 -110366
21522 -110366 108459 -171119 -93124 -294321 -287853 -308295 109316 89031 -332642 -175737
21512 -175737 15812 57276 -105376 253907 24619 -198905 -133360 29574 205626 3129 -143874
21500 -165133 340615 -85634 212480 -44881 -155053 -12011 -38369 -6424 -161712 40657 58769
21489 58769 -19202 67082 -8748 -22280 119000 216146 -40112 -1456 -187390 -152726 -448290
21478 -448290 116223 -114233 -27934 -244285 -5103 -19576 48233 -23553 144697 -215913 296075
21466 158460 5850 -378282 -8765 -11866 24496 106905 43937 -38011 -167388 -156031 -64464 173486
21453 -396855 -173232 -250096 -26334 140267 -435976 -211722 -22282 210342 -70683 -27537
21442 -24128 120834 51547 -451519 -69284 226115 125341 97336 -348675 -300313 -351296 -33759
21430 192345 -205298 31764 28607 101029 272897 250246 230138 241742 42266 -39791 44377
21418 239006 32896 384288 -185442 -439809 -217657 -130642 52988 22698 61661 -217688
21407 10339 -35436 -27548 -192124 -200614 131751 88827 -188115 -39935 -13829 -142682 158490
21395 16335 -82476 105896 -539097 -192470 -118630 143847 -31148 -263066 167939 268826
21385 268826 51020 19361 -39431 -57559 -121301 86220 -104597 139201 129485 -131936 -273558
21374 -273558 206084 66576 53150 -70634 -96948 84312 -94828 -333055 -182820 -37424 33006
21362 115535 189977 -178668 73507 -25926 -180427 -31628 -291774 141410 -76333 141535
21351 130408 28368 -375016 -135576 -283881 -3611 -142770 4054 244986 -200637 58777 -260237
21339 47202 -144341 -292753 328265 -48414 1664 25716 6349 94108 -319650 -410595 -153626
21327 53035 -107067 41657 92737 -183808 -135521 -19917 -51198 -34870 -329814 -195271 -105741
21316 -105741 -35705 -390714 47470 -269735 -69539 -106888 41568 -92937 -157761 -87761 26353
21304 -274144 -151274 -12174 -124912 -105808 -42391 259767 -161631 176497 -84956 -87165 148075
21292 -264098 -136730 237191 182043 -63806 335391 168002 17012 14724 244562 69948 -83904
21280 -132150 72258 -117725 -103349 281431 -458060 2328 -60004 282646 123801 -3360 356183
21268 26821 -175059 -325075 -206675 -209397 37529 127103 -142271 -342223 31294 101373 -28233
21256 195669 43977 -12185 -78797 163895 -175129 -231293 -57786 49120 10217 -219476 -167697
21245 -167697 -185434 3781 -135752 -114348 -123520 -373296 60469 30001 177880 -58791 118600
21233 -49788 198863 -79746 168061 -132598 -101951 70143 -36095 -57407 263306 14571 -319702
21221 -89841 -38560 -288263 187309 -278541 -279134 -140422 -128932 -126076 -67817 10934 42830
21210 42830 -258443 148240 333141 -62708 -260844 -191573 150106 28555 -14934 -218072
21200 -218072 -144890 -285149 54307 2201 -142747 -102464 247813 259679 -146350 -94088 -183735
21189 -183735 7957 -521977 -110132 -49791 -35298 13079 237683 93669 50893 8218 129833
21178 129833 -128628 -247473 -185019 -228718 -216609 -35151 -37264 75373 -100499 -142168 19658
21166 -91981 -339074 -124783 100836 -137067 39273 -229892 -205590 -161495 212631 111554
21156 111554 -69145 30486 76999 -41019 -133131 254435 74069 84651 75887 -291434 -215834
21145 -215834 -152583 20702 14524 122600 260369 -327272 -105629 -27780 -317166 -222591 -372606
21134 -372606 103062 46342 -270219 -58418 -294786 -202522 -225649 -205918 -100781 -289894
21124 -289894 -49167 -178183 -68500 -232154 433664 -33071 -237122 34644 121362 36903 47663
21113 47663 -326705 23152 -70990 -232537 78371 234795 -145865 161171 -51780 88462 -291773
21101 41798 -242489 2591 -121309 -152899 -56116 -74395 -309762 -145648 -180391 176843 -185522
21089 419075 -361604 55025 19006 128655 139450 290375 -281053 44416 -155509 -239435
21079 -239435 201057 -300792 -180758 6978 -144942 129870 -58847 -160203 -138732 73928
21068 -159983 191061 82369 -241880 56552 -262208 106684 -114330 -296214 -243399 14742
21057 -237992 90967 -197927 274590 -275546 66243 -149505 -179149 -219991 -56989 -259017
21047 -259017 18045 163957 -40283 177682 -300823 101877 67981 225721 363104 -130621
21036 -130705 46218 -279099 23633 87605 182170 -169348 -65835 -41588 -56601 35002 -75029
21024 -161566 94268 92046 137704 32151 -67953 171416 141860 314424 46622 292627 -79439
21012 -142678 42435 -189186 -120500 159716 -324368 -398523 28422 86633 -82039 285738 10550
21000 -262870 148596 -167239 204025 40301 131632 192379 -81715 410773 97099 -146176
20989 -148167 34762 31016 -217546 -81496 180520 135485 -46754 132356 207302 -90177 -303424
20978 -303424 -155150 -176599 219483 -30264 -182551 -331005 362088 -220863 -385339 -187611
20967 -350920 -264034 62643 -136207 97415 -82163 142610 90370 -228893 -180314 42296 -212030
20955 158138 131121 245549 -172140 -127661 -160846 -197247 -70630 -177877 -88317 -272729 -117346
20943 -24915 -257439 373859 41935 47800 98832 -31012 -273754 -172352 -231589 -63565 -106108
20932 -106108 421566 521596 19655 313686 265670 380642 67268 196353 -117245 236756
20921 174137 -153739 9279 149288 24637 245215 277136 49961 -196649 -26171 91495 149083
20910 149083 -37163 40322 -29231 -315916 79773 102794 -204306 90393 -242087 -371644 -73880
20898 470856 94239 344906 -105462 -170742 86316 -231633 -278517 -4134 -99473 -126370 -87832
20887 -87832 -60111 -132274 48082 -23955 -76722 393336 -44621 5874 -4840 -483413 -453630 -111575
20874 -157416 -247175 45814 -121887 53832 -165966 -56466 350572 -15467 122305 23208 -19932
20862 -36764 -178597 -30003 26882 -125240 136657 107525 424526 -229136 86383 49297 -354973
20850 -303679 -159206 -108349 -216395 113276 -53989 -52477 95972 77570 -5789 -167431 64116
20838 -403941 -18542 -74772 331751 -365513 -55782 -247613 -83339 -23659 -142848 -46676 231727
20826 -128347 -57756 12179 -504989 42287 -60310 95052 -101635 -175010 175400 90716 -168887
20814 -171765 25543 18290 -302537 -10561 -266901 -319067 11666 65281 -27590 -286698 -73149
20802 -279865 -99193 -390573 -5299 -11762 -237567 260877 -19820 -4673 135393 -25305 49877
20790 -424090 -312218 -144669 6583 102939 139914 -281176 209376 57785 -41334 -44802 -266503
20779 -266503 -238317 103754 -19103 -381050 54667 -338240 -319336 192249 -26689 -74144 -98931
20768 -98931 -167823 -3227 -342002 27735 226208 -128693 -266434 -19071 130175 -170842 23937
20756 104734 -113529 -131432 -414011 -94035 -113002 120777 -86753 -22016 -45308 39193 46277
20745 46277 104359 122030 -131918 -54879 -69145 -48315 298895 -118486 146583 119296 -57976
20733 -307630 -257368 -164806 -107258 -119673 225468 -431831 -25894 333158 -54682 -227377 196319
20721 274098 -36574 23565 133348 -212817 -152535 -308820 15090 90456 -46315 -243542 -36811
20709 -111572 -276676 186380 -127937 -233846 -301563 72460 2022 41939 -97523 -9187 37815
20697 -64882 116277 -141114 125249 73807 86427 122306 -134908 -510268 -195265 -412215
20687 -412215 -188782 -165362 389889 -83865 -52072 -148007 -13039 -130123 -299606 -130767
20676 -90425 -213772 -269042 -64121 -129361 -128379 -19629 -206978 -1981 -276988 -179766 -211194 -500194
20664 -500194 2957 -472566 125432 -227921 -170186 208822 -66315 -438198 60898 34441 -52050
20652 -167491 -254291 -163745 -43775 178385 -102182 170926 -241672 -261118 95030 -201925
20641 -155966 -220084 -298684 139067 140788 24088 160191 -246388 -28763 -127162 48967 152926
20630 152926 -152801 293733 -82723 -113992 -199771 -59100 13751 -418410 83849 -223430 23874
20618 89064 123235 209137 -96724 -227317 45271 -133601 -113210 72784 -19511 -247573 -213940
20607 -213940 137395 48555 -42592 -31225 164822 -162170 -134316 -79586 -164890 -19345 -143270
20596 -143270 -161981 62719 -56960 129054 112470 222930 16390 -182687 -87261 54525 -104437
20584 -47882 -31869 -90946 -69663 -125543 -243472 -353804 192672 -172981 -93976 273785 203651
20573 203651 132572 -5581 -118527 -162319 152652 -61979 -110316 62181 -61896 264367 100715
20561 30628 -117809 54053 -98373 -71111 -357919 102202 -269320 -119428 -132618 -119101 -55894
20549 -198462 -96114 48360 -68554 258570 52160 31603 -151800 -115457 -46626 -64422 7770
20537 -63023 211685 -174604 34906 -196121 -46427 -66134 -226870 -20522 147942 -231517
20526 -115009 -236180 -130822 12758 -372728 -32207 -383804 66843 -185936 230666 -99272
20515 140465 26816 -167356 24199 -199156 -131165 227638 144685 -49383 45996 -52010 1069
20503 -209863 -343349 11536 -145264 -60282 84695 -72622 40370 181226 -357225 184283
20492 295187 89394 -163537 -413783 -84417 -171981 31519 -55522 -101793 406355 -49129 -95692
20481 -95692 -272592 -339940 -67011 131898 -196431 219935 223575 94811 -225864 -248014 144355
20469 40970 -53558 -342024 153154 -370418 -46451 -133761 27440 110826 -200103 55842 -309520
20457 -31378 -143768 -8329 -23268 240751 122571 81632 28963 -31593 184612 123643 -336217
20445 178635 -44767 -111039 117090 81103 63763 116191 -233480 -8267 3322 -360701 78432
20433 -52943 66247 -30101 -69757 -161558 4162 189609 -196780 -153955 -77635 -49966 50453
20421 280487 308958 -60470 -244696 -210986 46409 104194 -440795 -101493 -328506 58419 169083
20410 169083 -275751 -26774 192008 197556 161752 -238616 -209472 100653 146310 -105484 -1698
20398 -43539 -414133 -26638 -42309 196277 182936 -444612 -67823 -27856 -293874 -211273 -12728
20386 -147021 -255945 251636 -93083 -440798 -86815 29506 -189641 -336252 122763 42350
20375 79479 -351440 -70064 236961 82425 -336982 -60435 96926 -173990 -101576 -184733 42452
20363 -107719 61733 151606 -22280 161960 -11477 131379 -1930 -85129 -207425 178667 -126683
20351 -137923 31983 -89147 215185 -35876 50253 -109963 -159844 -33646 315599 -118688 -49721
20339 -217846 -141284 40408 -144872 -145215 -342316 86474 -16515 55773 -294401 -33531 28590
20327 136887 -5727 -226939 -17857 -140039 -30389 56555 83433 -377550 -149456 -71801 193615
20315 -210705 -37451 -128519 -56590 175997 230675 -286693 -191247 -3925 -214276 14412 240187
20304 240187 -64538 -203251 33687 7944 -194940 -116928 -21374 -317045 -392726 459008 -196449
20292 90406 -62364 -239009 25345 10206 287128 68665 -176188 -150134 -47270 -157673 -46014
20280 -240891 48377 226296 -122650 56268 -138890 -105223 219987 -177850 -43698 -136387
20270 -136387 -264737 87212 256596 -76418 -163698 -414117 -6219 341996 -341422 59141 -319090
20258 -271321 -186930 -173013 -53125 -55331 -132586 -96712 -262477 -160284 -92820 309263 233376
20247 233376 -35348 -97135 -139254 54770 -167757 239732 205997 -267219 -146960 12875 -134573
20235 -273968 -76523 103505 -71700 -97502 -118290 32476 -128473 -179612 72913 54019 -83971
20223 -102918 58048 -191560 -214851 -331508 -47771 -50214 -86940 15419 -50373 -294792 66606
20211 -129663 -80481 51904 143440 -46583 -215710 -182876 47033 -134990 268792 48660 251576
20200 251576 -339667 2784 210704 156717 -106709 -282249 -91159 -156611 -83082 384964 59125
20188 179069 -269086 -191463 -199506 34855 -10819 145253 -505280 -146226 289744 -142919
20177 410964 -117108 -242984 109227 -230840 -119678 -93650 222701 -670 -354005 -97315
20166 -278410 -402029 -123565 -48747 69012 -132729 256370 184801 266528 381498 96279
20155 115774 75901 187902 -178578 -39052 -115405 230605 -55129 35798 187979 -173089
20144 -48951 227397 -100339 -19786 -25869 110548 240277 -43609 -244701 382440 95997 410975
20133 410975 294952 547060 318952 81066 143072 270155 199004 237718 318827 450050
20123 450050 324823 433100 120807 -26902 60306 -27051 243079 -241552 -244308 151710
20112 -137246 -224879 -276170 -571334 -222206 -73522 8719 -216101 136284 -77018 224726 -133607
20100 105141 64310 -1600 121979 48399 -260946 -191097 97695 115129 -137061 -354614 113163
20088 46541 -109117 99935 138353 -155068 -29931 -48674 -85414 69669 144571 -24386 121190
20076 -13413 -806 228803 -204527 -34394 -47553 -149855 -72826 301055 -194447 -33468 -209388
20065 -209388 -253097 -168228 147597 -158806 65212 -60707 91637 213745 -43980 -229152 -235451
20054 -235451 -144979 -86005 148282 -11228 38399 54854 -373948 236007 -133024 -113347 239438
20042 184838 7796 -294252 -324842 -350370 -150114 77865 8271 -47924 96448 -122488 -63299
20031 -63299 155611 -62900 29958 -42656 -65392 20044 -134780 -131938 3982 -30891 185421
20019 -257464 -2016 -258733 -83287 -275863 183638 -457955 33077 -30065 82535 -250020 195769
20007 -184448 -123505 76264 -132611 -207511 -149003 -84085 -67660 -248738 -198154 -59500 -132319
19996 -132319 -179295 -54562 237958 52037 -257478 -225431 120435 -193596 9299 13853 -32776
19984 315116 315238 227365 -36341 -184561 273840 81726 -88616 212748 -30891 113243 273304
19973 273304 209393 171847 206064 14486 375607 -330653 247536 -160477 272333 240966
19963 240966 -260269 24072 202112 158281 -109030 107713 -411482 -312533 -230056 -278425
19953 -278425 243828 129094 -98032 198521 263794 15919 407017 510374 -201877 -70755
19942 53011 -158237 50761 152008 34120 -145561 108259 -192560 202027 -283411 -192330
19932 -192330 -128171 -47784 29359 22862 -19921 -48196 73920 162327 62893 -330573 141226
19920 58884 -38508 -251058 11470 -137290 -114949 -270007 -268119 133787 201650 -101126 -189454
19909 -189454 -259639 -96519 36515 -89301 -87090 -24058 -227407 158560 -281790 -226572 -48805
19897 -71577 -223122 -11442 -171902 -28934 -222227 -170027 42090 -234645 196105 -21109 -92055
19886 -92055 117654 -30414 49630 -332893 206018 -2809 102315 116594 -37133 -261645 281708
19874 -266849 -222368 127167 -103271 -130799 37513 134325 -241421 20902 22777 -126376 -281000
19863 -281000 -218229 -36280 -22680 -190464 109798 -240429 -141449 -139180 -121407 -442229 -234653
19852 -234653 -119024 -106832 15483 -59676 -52455 -34530 -43726 -154496 181878 -371556 -314686
19841 -314686 44903 336718 -38402 -235231 -141278 -243140 10488 -115282 -262772 -82945
19830 -181045 -111671 -74603 -134002 199919 -279801 -115288 57509 -129592 71175 29708 -118500
19818 -107600 -59610 -255714 -118118 122191 -212989 -69683 219347 78003 -176857 6100
19807 -164504 -469688 191344 86167 -7117 38399 -80324 151739 78914 -442485 245328 -240935
19795 208673 -118003 -52394 -143838 -270361 -208190 159278 111534 5973 29993 -139486 -269729
19784 -269729 155836 -140793 380514 -170470 -64406 -221712 268926 -142339 -60659 56690
19773 257292 83796 -272500 207790 32809 -285039 292496 -360749 274495 -223982 -226707
19763 -226707 119924 15674 -57282 -104129 130996 29147 -68498 -287186 -45249 46253 -191298
19751 -4171 -75872 -59642 -41677 -97326 -369436 -255092 177060 -276222 134864 -166557 2213
19739 -64201 178105 117753 133319 -163303 -114905 -36120 12963 90892 -310232 342049 -128740
19727 -229550 19422 101018 225557 52673 -8489 126748 220266 -123743 -32134 -178351 398791
19715 285712 318707 517748 338157 330073 282456 15846 -155422 56684 -131963 84 -30060
19703 57209 -167493 -125573 -45831 43748 176662 -103401 -3408 208881 -221600 36178 -104074
19691 67862 38463 -243939 -123579 70862 120305 341625 -3208 -7159 386980 220101 435080
19680 435080 437205 253425 16945 111899 -74785 -212032 -104191 262395 -63494 19080 317992
19669 317992 -236019 -1279 -261824 -244419 -377470 25077 -5620 -105455 21733 -113309 -107238
19658 -107238 55814 508344 16806 -219846 -120483 181049 123703 -306521 125684 81835
19648 81835 -94484 -124108 16225 60281 -338030 -160976 41274 185035 -36438 -383732 35988
19636 -30232 -186379 -379238 -159589 -49911 -201454 520586 226814 -113044 106862 197223
19626 197223 -71370 235078 -335941 -56350 -197996 -350965 85058 82190 -251370 81759 -243509
19614 99645 -527434 -77772 12851 81278 61754 -216089 -22460 159088 -18205 -68061 15788
19602 144422 -28993 -128681 33048 -226813 -152918 -11861 123516 -152402 -24062 -105903 -181435
19591 -181435 -173094 -534174 -428782 -241602 84395 -60889 -93905 -262620 404510 77400 -48039
19579 -98615 -3643 -225230 -198594 -234339 -353203 -200007 133461 121035 -71406 262829 -119482
19567 71445 -20374 -35569 -140920 -13002 140436 -17895 -254248 -232328 -178938 92766 -112916
19555 -297234 -47509 -284579 -152895 33697 -298986 39675 124097 -66160 -399248 -4618 127922
19543 -246737 -300768 -94531 -100420 -188341 132825 -157647 -122780 -2848 -142661 63213 146746
19532 146746 -89172 -328400 -98516 204699 -290139 -113163 -209776 -296532 -161666 -93368
19522 -93368 -407350 -102744 -100846 144911 190890 85574 -405599 -305598 -166445 68459 23648
19510 -139823 105148 143207 -428350 31261 -88398 -10469 141727 10270 -23917 -233124 -48645
19498 -301812 58569 3527 -11818 -93315 -86883 19917 -171942 -179373 -92524 -168239 -8804 148887
19485 24680 58726 -452145 -122285 -42460 165464 227918 -343685 -431430 113877 -137621
19474 32693 -361913 -53833 -50284 -16649 -95544 -243616 -307946 -22715 -180638 -497997 -74203
19462 239345 136610 234321 1659 100863 -120618 -260481 110205 366741 -170820 -130238
19452 -130238 -226203 -39904 -95027 134996 -368571 -38455 -154320 -172073 -283997 -228878 -236595
19441 -236595 -53030 197900 -261039 208408 -258988 121927 120515 -115274 -90737 99514
19430 -140594 -72286 79507 -167308 -197725 54700 -70540 -162635 130040 -382881 46178 -29290
19418 -242405 259654 -48651 59841 -289913 -141386 -57119 282974 160588 -1525 -2028 -110029
19407 -110029 82500 -123385 -157993 -274551 -32412 72210 -105811 -281800 -213630 -99861 -89120
19396 -89120 30774 -251428 198001 -141738 207816 -130098 58208 -308975 -55018 98873
19385 -22038 -183541 74052 -250786 109272 -122376 -165474 -470700 161933 -272236 -153457
19375 -153457 365762 -101159 -62923 10886 275120 -105302 285380 -9227 22430 -236470
19364 15301 209714 -7534 -18898 -195551 -3595 -10196 8745 8496 -163259 12696 -48817 100525
19351 10720 -74242 -118992 -241919 -123802 147750 62470 3389 -133868 -25879 -101839 227021
19339 -391578 172389 211849 87232 -63492 38491 -263397 -244200 -16433 130914 43337 199104
19328 199104 -206312 -134599 -165771 6003 -265619 -32230 -160976 -29896 202836 -288200 -33003
19316 -46434 -95381 -492019 -220515 -35690 285085 -477465 -140663 -228538 -350422 -13828
19305 2555 -289296 -145312 115586 -252236 -163062 104054 -236279 -180193 -187287 -37203 -32665
19294 -32665 55817 167507 215278 221100 97891 127366 -143284 -4613 48568 -164411 -255708
19283 -255708 -13378 -372498 -314913 83713 158613 -21476 247806 30887 -124622 -9769 127829
19271 20370 4750 53390 -35222 224932 -61246 30795 -113074 -43997 -288794 -189755 -68070
19259 78021 -167559 -303474 163386 47288 51629 236139 116656 160584 -237978 -384114
19249 -384114 -173721 -88823 -139844 -142202 212141 -98044 145324 -170236 -300570 281555
19238 118329 -223795 -163966 149207 -46082 -156673 182197 73846 124459 -83353 49302 96207
19227 96207 -337147 8079 -78889 -130857 -106673 -92280 158016 52736 -66926 3044 -188200
19215 42491 -93703 115027 222718 -38825 94871 -225746 -342336 -121306 137535 -217936
19204 -175487 -311997 127872 -276737 -242975 127143 -106133 72166 51463 -64066 -177483
19194 -177483 52839 -48445 -75459 -132266 -76433 -206795 109042 -36490 -141854 188478 -182079
19182 -72933 -155694 -259796 18011 -62109 -83284 267837 5574 -279570 -65295 27002 185577
19171 185577 -61997 -179975 220772 -57905 -272426 -100068 160466 481805 269114 -289882
19160 259711 -150992 -97625 199679 -211864 -135152 177452 26595 -97200 55322 -1641 -81806
19149 -81806 -436833 -64827 73292 -266382 -256270 -236128 78039 -76053 -125417 -195997 -233520
19138 -233520 -163492 -55922 -359099 -48603 -46568 94713 -226933 18933 -613 -327872 -240822
19127 -240822 -62532 -195228 -413829 141198 12575 -396740 30319 -7265 -13883 45553 -219557
19115 -208399 -134917 -99569 3323 44979 145938 -27472 -277310 -248669 -296754 -25400 45286
19103 15511 -110795 1432 233994 -320291 -7881 18278 -321760 -23545 -270406 98357 -245308
19091 35891 -108363 -228637 198210 -128155 -141421 -85498 -192279 89545 104500 258911
19081 258911 -134225 -124355 -140595 -226042 97173 -41428 20930 -467672 148455 119129 -638321
19069 -80051 -71439 -172402 -214998 757 88851 -122002 -100610 -318021 203304 -125601 -15832
19057 111167 67395 -310657 -63792 -210119 13897 477856 -242639 -26788 68013 -159937
19046 -322178 183474 -391055 -111112 -111807 159226 109773 -245372 243761 -142045 -164696
19036 -164696 -189735 -215968 146243 -275639 -142135 -34691 -90783 -325955 71052 12851 -312023
19024 -9644 237870 -231409 -121427 -95842 120075 -139173 28264 181085 -116942 -112374 -72069
19013 -72069 79836 308782 -218028 -36324 -38995 72452 160320 -6934 75919 -151158 -459308
19002 -459308 182055 -90814 67783 -51338 -231692 18340 25873 69120 178957 -24633 403331
18990 183412 235611 130164 196723 139603 73404 128965 148997 112027 39683 80984 206141
18979 206141 229249 -310459 12225 -28139 -85627 183928 -630220 -239143 46126 -36376 134143
18967 -114075 -86503 284130 19589 183117 -104847 232886 217805 -247106 261345 487062
18957 487062 711270 373524 -1015 -93546 70614 55556 -196622 -66057 54280 40457 -305123
18945 71424 173095 -78519 -51070 -71349 -372219 -93767 -335600 -249230 -12911 -249470 -271019
18934 -271019 5432 -92194 -237356 34439 -191972 -6616 -35467 200899 106115 -17150 100135
18922 -115264 -1669 -176553 258552 408955 -36157 -219562 -174280 -115099 205224 104634
18912 104634 124375 197837 -110674 207731 69342 -167903 -177390 151701 -124966 -329658
18902 -329658 -160495 -58676 -134400 15871 123091 143806 158843 272577 176558 471152 156211
18890 -167158 -22411 -66289 -46947 43959 -357395 -83084 29583 -29367 25030 -10138 -155307
18879 -155307 13818 256485 -9527 45428 -277385 18891 146447 -105399 34146 -336831 241444
18867 -242059 77870 167334 -104844 128166 -250415 -95649 -72225 -2098 -392969 -40190 -23864
18856 -23864 -697 -325835 247668 -132289 -122080 -340795 -7017 164006 -184024 -257417 18541
18844 119456 -38274 40248 22673 10189 -6352 -22665 -113251 -136779 -153287 -134686 -57750 251093
18831 295452 -278112 83161 51983 107054 -62451 -28610 135305 -12713 -148615 -116356 -241878
18820 -241878 -62940 58837 202132 56136 -323735 -251654 -195004 199590 -120624 262127
18809 -402597 -16964 -115243 -61988 91146 22727 118783 103153 36623 -330240 -40094 127516
18797 -161986 -84080 267129 -95861 346513 189117 77097 -278440 183621 -29435 107449
18786 -441497 209373 -30913 -376585 -140895 -124624 97422 -26174 -20360 -33458 -79294 -107996
18775 -107996 -112769 121486 -84616 -189452 -203867 118689 5379 -107561 -166806 -79417 -64059
18764 -64059 -354349 -28411 -101621 -37272 -208508 20969 -176091 -333365 -471618 -150464
18753 -55579 -339279 -117699 -142113 -15312 -29462 123169 32053 -314203 -168309 -12269 -346198
18742 -346198 -149097 -128180 126041 85329 -86812 170737 132487 -140300 -78581 12035 -280953
18730 -118001 -137645 -124041 -271052 -45214 -223198 151761 -135184 -226878 -54016 200216
18719 -222835 109128 -330099 -53481 -167940 -32321 191156 -9922 305489 -98156 -59371 68720
18707 -101328 -277071 11475 -167201 125324 84048 -152394 120393 47138 -332493 44906
18696 237340 -87900 -41474 -29616 -310685 293040 126717 139822 -267736 -441991 157816
18685 -29584 -456280 -49011 -198281 -8946 -28094 25620 84980 -17389 -170412 100893 13715
18673 -14872 -274835 110556 70752 6024 372656 197621 -335384 -283543 -89880 57715 -351003
18661 160972 -49885 367697 -359619 27807 113242 88968 -540182 79467 -46724 -191386 -66639
18649 -123908 -250177 -11692 -245385 64701 213454 62855 75126 -75380 203518 -77819 34967
18637 208183 37487 -409391 284291 -165453 -190545 143876 -201526 -167972 -149410 -162046
18627 -162046 4798 446610 -237883 -31027 -96507 -4818 9933 34429 -142156 -156213 -78860
18616 -78860 -225118 -211491 45629 -74036 -51486 -731 55553 82351 -90091 154744 -151917
18604 -183925 -76618 -157536 -94098 -113849 232170 -182105 -10668 -310886 -176046 264788
18593 -33993 171288 -214779 -127547 116532 -196665 -202499 -149448 -39850 -259409 -110802 -8046
18581 -138794 -41173 109792 -64964 248742 -128223 -293900 206623 -65734 -315784 255187
18570 -258917 31265 -96466 147904 -203159 -12249 47099 -45310 97927 324742 81651 -6454
18558 -125620 -259310 41668 -12319 30320 -268706 31099 129606 -247405 185367 28346 242050
18547 242050 69688 -134994 -262674 33258 134532 6274 212396 331558 77832 244195
18537 244195 -34218 -217869 141277 5697 -71634 -189071 -228722 120651 142180 46429 -49430
18525 -202741 298247 -61860 -312505 -183280 -381496 -219078 -302180 -280641 -33226 -423696
18515 -423696 135668 -235484 -183922 -192238 106045 -139869 183970 192702 -293061 60699 -46565
18503 -59891 -32563 -270513 11141 101969 -187771 317180 239053 69280 152678 148678 -106050
18491 -92992 -105759 -161423 -295803 339064 253304 -29219 -136240 -128570 91579 99413 -75155
18479 163246 -232943 -389431 302798 -181063 38154 -121087 -247972 -106941 291092 139068
18468 -278753 -121591 268333 301 -258603 -163410 -188062 97642 -46505 -1489 104777 -285076
18456 -120585 157438 180333 90479 -108892 111381 -144704 -364209 -241145 -259532 132379
18445 -207333 58213 -184036 -101037 -212623 -156445 41975 233697 -120752 -155579 67533 -47918
18433 -4436 -350338 -146949 -110554 33828 -99668 -124306 -159327 -147436 124868 112610 -242338
18421 -86276 -195625 -51030 -72336 311679 -239488 -18747 -165988 11341 -212720 -78838 -163221
18410 -163221 23694 -115528 176867 -38013 -234080 115964 78775 -116261 -154404 -236681
18400 -236681 255775 223227 -220937 -396 -68718 -308744 -240942 -63685 -386065 103115 213633
18389 213633 -388690 155774 -72092 259413 149307 148454 57423 -176088 -12880 -50757 -200487
18378 -200487 -57124 143941 337263 -33886 -151811 -101471 301422 -229604 -197757 -12392
18367 67377 -79068 -48259 -34069 -141834 -107340 -44943 401007 -71170 218551 206301 -84268
18355 -73394 -87668 -224072 -71144 221388 -266447 127562 -92360 17255 -142911 73021 65305
18344 65305 -172271 -91321 34555 187252 -84194 -8599 -146261 -54094 80496 131549 -991 64346
18331 -117786 -72892 -354948 -99891 212104 -7643 107927 -107482 261999 -33318 -143995
18321 -143995 85633 -30536 -239865 170393 373487 -219343 -55816 -218309 -232374 -123132
18311 -123132 31862 35487 174765 -72252 -131108 21876 135099 -13068 -148896 27137 -49226
18299 -229753 72045 -148631 180524 -127289 -207854 156806 -116025 -331858 148358 -11058
18288 45194 128795 -14448 27839 -75474 111417 -27977 396160 54000 34198 111894 -335000
18276 41069 -76770 113809 -387785 81174 196060 181872 -130120 -151459 -32681 -23253 54584
18264 41766 205943 -26060 65460 7967 -202623 360670 286843 -141005 55232 164198 -124134
18252 -256981 -46026 -56038 -174612 -148411 180876 -87127 142992 -127314 208555 -158300
18241 87264 -20070 243568 -66396 14627 -183926 264045 -10850 -62192 -12539 -67753 -80570
18230 -80570 -108019 -138504 -434387 155500 -56305 297124 169663 10526 -211145 9163 167102
18219 167102 -78162 -99401 -43146 -55478 -307735 159366 -135347 -30792 -52229 -38206 87746
18207 -71331 98601 66774 -131100 -55897 -276171 -183690 -234286 233504 8294 220210 -124582
18195 485400 41622 17392 298763 216022 -219354 -218709 59251 -99214 87574 36426 67259
18184 67259 28608 -7919 130740 94428 -710 11084 -95283 247649 -45285 140294 -135006
18172 -50974 110399 248869 161593 166196 -5429 4394 172973 139929 -275828 229418 39652
18160 70771 -229071 69532 -8755 87987 68289 -102262 54675 151095 148223 -119514 -357717
18149 -357717 43604 -148813 -200332 7135 145930 -88686 -155755 -226833 123060 77452 243513
18138 243513 243741 -324958 244281 87931 -148313 -83598 179902 33814 92996 -472374 -191414
18126 -83177 -85302 82785 206396 -313333 -8810 -242151 -89409 173771 -105487 -191546 -70569
18114 -152461 -200832 76858 -114593 34923 -20000 122475 190258 -209863 29679 113541 190550
18103 190550 -214666 154111 -12149 -7120 -328849 -76829 -314323 -101793 26648 -34841 331033
18091 105467 6488 75605 -354753 84976 4883 -100299 -71062 -276680 -34262 -252171 -112760
18079 208791 91581 155745 233752 -124231 130084 -439937 158712 -10248 175764 -92001
18068 -180978 -140121 -35474 338080 -125615 -398196 197267 409033 -225178 -91309 -116513
18058 -116513 149181 95901 197328 162424 -138394 129651 -15234 -346542 4810 32634 45917
18047 45917 -149550 -95743 210690 99512 63837 -143028 -159449 143605 90880 142681 59641
18035 98839 -262114 118916 74971 196827 -92536 80453 -268281 -68479 78896 52536 -39408
18023 -98445 -10834 -38072 -178747 55240 -84036 -139231 -277087 42127 -104889 -294450 -56668
18011 -320169 -13276 72723 -95432 319595 87456 -125038 -434310 -52368 46109 -213172 103622
17999 116504 -171006 -508830 -46073 -175964 -24011 -182086 -1593 160819 -33568 26404 292236
17988 292236 -57352 -94116 128044 -113747 64365 466239 -76472 344210 -247133 131098
17977 -5735 82739 -127237 377747 105919 -270581 502310 178819 258984 235428 -66406 2207
17965 -7898 -3307 -66677 -10372 -168270 -150601 -378138 -57688 277906 -38309 -126700 -164622
17954 -164622 -196832 13482 110798 375295 49815 -18064 -145714 -196078 -73290 -248708 -136864
17943 -136864 -1523 -110724 -144942 87963 -66908 -111851 -64324 16581 -51782 105147 -142696
17931 -145251 -38443 -274459 50029 148386 148905 131807 -37571 81795 -44691 -181687 103195
17919 -113113 171206 -186347 -241745 268788 -162832 -196471 -274538 -173964 -53167 -21246
17908 262834 -92152 236757 -133795 108912 -256307 171632 -14977 -16605 -318160 61760
17897 49687 48021 -183402 99004 211573 -245301 252831 -73154 133402 -127543 222670
17886 180337 -319211 161089 -156355 -106918 62699 261424 -81962 240598 114607 -208428
17875 33206 100320 129682 329741 32346 3531 83543 247318 -82873 -54790 169661 500186
17864 500186 -92177 282603 313763 -16080 14908 85771 125879 265157 -21956 12175 13783
17853 13783 -39965 67638 10617 108422 62066 62318 91002 37687 -256127 141608 144071 15205
17840 118274 -193643 -165188 124323 115198 -85199 -290714 59981 -42022 307369 193604 88658
17828 1373 104109 61699 -109802 326231 -67366 -108192 -266568 -45462 -8173 -32134 440982
17816 338108 -177036 65447 -58224 196944 56024 -150783 -96604 276236 45463 -129388
17805 -95479 -137585 119634 111052 158803 -65780 -1194 97241 6197 25035 -35047 -103897 4061
17792 111990 -95940 -143067 -58681 -123377 173774 -142663 -18693 331417 35350 274882 71194
17780 27296 48981 -89135 -72448 6162 -67680 72403 -19450 -89914 155708 37544 115889 170256
17768 170256 -79341 270540 215505 65928 249886 -11789 -132889 221480 -178230 141894
17757 64805 -82300 -35480 -19314 -205559 283990 215243 22794 102446 29494 -58014 123121
17745 160093 -17769 -56790 -17392 270342 95660 338476 -35259 -45481 -75815 230681 220649
17734 220649 -6513 312287 -22012 70773 160119 208538 -172903 17410 251841 393539 202066
17723 202066 89071 75835 114529 102867 -43415 -19623 -159107 75275 -185488 245100 153974
17712 153974 150764 81114 294903 -258647 313832 46236 122729 -157882 -193451 57698 -129867
17700 -240725 65134 255092 233427 115213 107176 448879 1600 316673 109528 203454 91319
17688 137845 162279 187658 378649 -73262 63455 -61422 -741 -130872 145559 -79112 -73210
17677 -73210 157164 -487469 -65916 29217 144750 -86973 102618 203069 446670 208905
17666 115241 -10654 118348 -132561 412246 136863 178109 124204 -63332 -4982 -6019 422604
17654 91356 155422 83181 237251 -38310 -246366 80647 147515 189033 -317700 192345 249719
17643 249719 190846 -8969 141338 -33437 267205 101698 111496 -204720 1452 107393 296541
17632 296541 65274 -2689 374508 247471 -28317 17945 -38956 83610 125608 -91058 312207
17620 9320 14080 -186416 408835 -9035 -63852 -45916 133298 209444 -36257 198277 -109499
17608 -24332 239904 13544 261988 315074 -189657 7496 41353 -27155 57051 188628 131320
17597 131320 220457 -42915 59935 72015 233563 -15513 276297 183269 4173 181560 58800
17585 -10931 -48599 218422 307326 291521 -45020 314163 -32891 62341 65683 -28415 288277
17573 -190194 287828 -19655 -93399 193047 334856 97137 201130 -11308 110449 -133151
17562 63838 438318 342021 184078 4067 9840 3891 261990 350114 -165251 155403 -99781
17550 -181214 245419 357166 -35182 298895 82482 78235 -39538 199895 164951 69104 370345
17539 370345 325295 -123075 103231 32627 -42204 255920 414604 115971 -31088 47064
17528 467262 99611 467715 207135 359981 154885 354520 185925 200261 194715 228840
17518 228840 300533 -187887 380038 271401 254276 389507 913890 436914 808739 659894
17508 659894 694737 1121735 1053695 646752 199660 506030 390114 330539 122737 141431
17498 141431 15568 632044 626499 978022 1078255 885601 883922 752204 572895 432323
17488 432323 261262 206654 777125 525112 399503 57670 472687 328131 217301 -120234
17477 160444 194366 136382 245005 213925 17407 517677 73515 504885 189388 217421 98309
17465 -35142 -111032 686757 485951 301112 290076 396248 -53852 201973 259581 215003 33758
17453 508250 30738 257121 313673 229310 213653 592041 30335 145002 422715 -160354
17442 230289 382461 464728 243310 9982 296016 294212 21611 338583 177457 249846 457149
17431 457149 165296 460562 490831 164408 395953 389419 500538 646436 -114219 160530
17420 180034 301073 451483 271910 146775 215889 140941 460394 144510 289175 461046
17410 461046 294559 141630 242981 272334 105707 266839 384677 395010 180453 56211
17399 35216 312280 371156 437275 402711 446369 165504 323223 181319 579138 418631
17389 418631 159983 435701 398015 10264 211411 114092 303472 300211 289226 428831 -8613
17377 420549 216719 479796 172318 562445 199728 450179 198006 235850 147927 275860
17367 275860 45346 259688 176194 268444 371247 -15875 486118 99135 164565 -109932 147779
17355 116395 670846 -83084 121550 352955 299212 423293 127565 438258 194495 409453
17345 409453 42203 116741 219128 4405 -75619 22614 -38890 65157 358178 367354 395016
17334 395016 -57223 165887 309629 439656 143054 117345 -72242 346761 459819 323785
17324 323785 125846 232121 343460 347625 258128 371007 -115179 372989 109990 393141
17314 393141 247373 130363 46054 221802 23552 267359 45809 157568 311831 -89658
17303 176093 581580 354738 241678 435922 -28496 542371 286872 -55333 205938 123764
17293 123764 40556 321494 610863 38076 267635 331300 102524 371241 40725 177805
17283 177805 287696 163508 103501 427113 224649 496900 290816 137533 115641 40286
17272 383640 212457 334730 194013 346528 378490 345003 375878 157539 196367 501150
17262 501150 391661 -22293 206845 181660 262142 411424 167113 205317 483697 103316
17251 258234 553726 249499 345151 341854 283342 372913 161305 400962 199693 227244 132938
17240 132938 248199 434679 246028 277329 308267 486744 77633 404890 371802 138340
17229 371986 415612 470956 266100 119096 656048 592736 462171 298224 285725 703110
17219 703110 207942 155566 262066 203853 468030 764258 542356 284212 541819 206426
17208 324975 281852 598549 372914 144738 322506 240121 342153 317659 214881 165042
17198 165042 621438 329923 101051 128132 338078 415905 131429 361463 206126 72681
17187 515896 318141 394609 207910 651398 327354 258350 404611 436867 389666 398339 2358
17175 205922 262620 562154 281018 362797 529616 98170 475889 110430 494057 313699
17165 313699 451129 377084 510392 286077 165840 388934 333852 644831 430483 541319
17155 541319 400462 517904 459277 260938 188564 365977 345876 119672 401148 346960
17145 346960 664494 334624 613485 625559 241389 564704 629433 344631 180501 336269
17135 336269 343657 313836 534237 752177 433623 685107 664058 518919 460963 605211
17125 605211 303934 402823 322498 357825 887881 56264 449042 478246 524746 284807 480651
17114 480651 393339 206802 631404 620839 409899 699824 580350 887422 708512 992981
17104 992981 416976 590288 731324 690435 804484 628550 369934 618256 596634 438454
17094 438454 806793 629314 406775 717015 480527 563605 813420 801561 793020 597114
17084 597114 537194 605519 727416 534740 704704 765386 469632 385461 736294 444197
17074 444197 501931 713533 203231 859394 511535 749421 557486 644178 950280 683596
17064 683596 556422 648289 604854 479324 1140318 703582 649685 658426 429472 660891
17054 660891 435475 494523 757313 569928 667671 789967 908686 503363 857248 677357
17044 677357 299037 842204 755851 698897 1083515 677609 724375 701722 912395 910185 684031
17033 684031 855781 618840 993599 983254 1022556 726946 823877 857023 846667 863475 1117111
17022 1117111 980559 701744 1142467 772697 888589 1040748 644117 1091334 895447
17013 895447 938230 784567 829337 751235 978934 745331 833774 841328 761124 668690 1029548
17002 1029548 906501 809856 671328 960897 1258525 1003352 1305498 824216 839591 1266352
16992 1266352 1174154 1342442 1302896 1063650 1020289 1116818 961064 1339193 1062308 1174508
16982 1174508 1317719 1083896 1078495 1142647 1210467 1567414 1208598 1366714 1222509 768384
16972 768384 1129229 1149203 1269212 1362090 901109 1195960 1375606 866556 1349577 1028043
16962 1028043 1097311 1031900 1327756 991674 1235350 1075699 1483928 1371661 1411428 1264179
16952 1264179 1463908 1563508 1444141 1321512 1528032 1148429 1547021 1512711 1369751 1533187
16942 1533187 1585520 1324552 1751377 1497326 1685177 1644739 1735584 1350511 1708581 1569447
16932 1569447 1432219 1526747 1562336 1275184 1690464 1781042 1580219 1662549 1466636 1732391
16922 1732391 1555932 1567281 1766096 2116482 1637109 1935638 1786450 2076056 2045623 1603946
16912 1603946 1733728 1970797 2139212 1865775 1912674 1847230 1996116 1753863 2197699 2053251
16902 2053251 2003452 2294727 2358768 1939505 2266103 1945912 2013336 2072313 2336882 2186809
16892 2186809 2403787 2575839 2373603 2397524 2828662 2543094 2747276 2594220 2316618 2314078
16882 2314078 2521012 2924105 2638315 2627530 2567370 2607215 2724026 3044016 3041465 2761751
16872 2761751 2975681 2953487 3081524 3067118 3124356 3145409 3058969 3186986 2727309 3291267
16862 3291267 3229246 3073621 3477976 3475401 3870110 3687729 3677897 3568587 3585104 3578114 3714300
16851 3714300 4021757 3371157 3983844 4316778 4150381 4127020 4222282 4514674 4155887 4346957
16841 4346957 4554087 4356797 4381633 4460237 4364856 4853601 5016185 4734956 5060239 5089391
16831 5089391 4995357 5196159 5345204 5364639 5447561 5362526 5502332 5666949 5587261 5790193
16821 5790193 5979393 5911524 6399588 6175445 6203113 6352048 6553187 6703461 6755372 6945921
16811 6945921 7227616 7356997 7136600 7269100 7502845 7859506 7812852 8270794 8289339 8463693
16801 8463693 8434233 8738664 8964208 9328006 9130493 9202968 9619711 9953761 10003827 10239414
16791 10239414 10631085 10610316 10988246 11226389 11497715 11521698 12204352 12382371 12693517 12773957
16781 12773957 13427495 13327585 13833494 13759768 14632170 15343875 15355954 15721439 16006042 16390014
16771 16390014 17079556 17273625 18094529 18374440 18989168 19336682 20162099 20836165 21370900
16762 21370900 21955210 22260817 23109865 23971264 24742480 25671019 26316636 27185024 28342414
16753 28342414 29209736 30310544 31105653 32683345 33236854 34794861 35884744 37567697
16745 37567697 38637924 40064623 41565403 43368138 44961894 46547885 48577284 50626172
16737 50626172 52576061 54440754 57131696 59470315 61862858 64619205 67287979 70064590
16729 70064590 72656157 75749950 79108514 82023697 85410579 88836058 92676197 96344085
16721 96344085 99762562 103483360 106724612 110956478 114317316 118058528 120969722 124395763
16713 124395763 127494333 130353937 132563016 134753235 136483993 137569717 138786436 139086393
16705 139086393 138969904 138448647 137755373 136329226 134455734 132404012 129881610 127471656
16697 127471656 124259867 120872677 117635988 113878132 110621050 106532432 102850544 99111375
16689 99111375 95876189 91861545 88069990 84995873 81375480 78175894 74979717 71874410
16681 71874410 69042396 66248264 63240634 60779552 58074574 55527158 53318712 51337553
16673 51337553 49217145 47244450 45356910 43524886 41801049 40425387 38836003 36845817
16665 36845817 36285711 34360408 33160668 32192749 30923796 30023235 28832936 27707611
16657 27707611 27091862 26007710 25119115 24417884 23524019 23006384 21747270 21746342 20709327
16648 20709327 20040770 19382466 19359251 18633815 18138848 17385233 17043100 16542808 15941529
16639 15941529 15421644 15127714 14758302 14025352 14031927 13515123 13248483 12980282 12753304 12408370
16629 12408370 11956791 11792518 11631366 11207471 11016396 10390232 10534293 10056090 10150662
16620 10150662 9634564 9636669 9244367 9209803 9154771 8521214 8456628 8624230 8310102 8028357
16610 8028357 7730043 7514731 7808702 7320765 7258551 7482706 7081569 6744324 7055174 6566752
16600 6566752 6343761 6178975 6034062 6426295 6222175 5876765 6054073 5907426 5801626
16591 5801626 5356730 5323058 5561232 5327688 5326008 5287030 5268868 4962941 4836330 4361415
16581 4361415 4885056 4386727 4313852 4813184 4520412 4190149 4433952 4087741 3792498 3858911
16571 3858911 4110433 4037894 3974815 4026591 3856531 3899331 3838591 3517056 3822262 3672446
16561 3672446 3477705 3486317 3558058 3218469 3132975 3496995 3090496 3263136 3236644 3098570
16551 3098570 2835995 3069159 2993989 2917667 2855235 3008504 2721077 2913113 2952947 2751738
16541 2751738 2769035 2804832 2928495 2266438 2387745 2810588 2462066 2706984 2719826 2528327
16531 2528327 2374882 2626051 2483405 2367304 2473942 2276723 2171082 2296996 2160571
16522 2160571 1859089 2216243 2163776 1816489 2247372 2207454 1976615 2093874 1812327 1992468
16512 1992468 2103807 2060981 1800937 1839996 2122089 1646382 2011832 2070361 1937108 1616663
16502 1616663 1783328 1915292 1748273 1951323 1738396 1678450 1830520 1731206 1514905 1853985
16492 1853985 1757135 1190706 1859615 1673498 1723889 1688982 1522329 1491702 1607944 1323135
16482 1323135 1553117 1432509 1326884 1556465 1407477 1681850 1455499 1590358 1441140
16473 1441140 1757910 1355409 1585449 1481701 1253336 1571745 1245869 1253637 1261226 1032372
16463 1032372 986727 1345640 1300733 1248912 1354077 1197036 1303587 1272266 1072504 1208058
16453 1208058 1316719 1317636 1213928 1087332 1400395 1388146 1069359 1311148 1128248 1201048
16443 1201048 991770 1256280 1106082 1080351 932645 1306841 1050619 990696 871133 1163339
16433 1163339 1258346 1066500 940056 700800 1170549 963491 824016 1258128 894944 1003146
16423 1003146 989697 991156 823565 1078316 1011600 997301 923388 1168907 1072307 1041444 886816
16412 886816 618354 902833 951189 1065380 844594 708138 711124 926407 603077 834363
16402 834363 877896 639755 874656 856038 1033586 680960 865034 655626 769214 1113531
16392 1113531 1092828 376132 840421 789290 523005 927486 702056 540379 1154095 1034589
16382 1034589 1048280 674706 357052 877592 762374 740055 979982 806798 616409 802398
16372 802398 762153 579873 575110 790799 714419 571061 736695 623523 749962 514494
16362 514494 559172 721909 824107 565082 583395 1006053 701042 607143 565491 586603
16352 586603 376385 818765 582657 389211 375128 707804 719284 659651 245661 871040
16342 871040 351215 761457 641752 376705 632976 767140 455472 794460 493267 202943
16331 529367 905338 478014 571746 713348 414695 356162 539885 591839 508513 545147
16321 545147 408089 639049 352063 386464 335984 454885 403860 288148 569301 574490
16311 574490 737734 603597 491987 781465 276055 485349 228635 532612 353672 278828
16301 278828 401611 242637 278230 349668 533477 634227 474410 470787 187491 582460
16291 582460 536255 354549 172762 731870 237664 310770 387594 384151 561891 693895
16281 693895 453651 528605 335341 144244 540740 335128 269417 533949 486188 480156
16271 480156 545970 336967 584636 564589 560810 542138 325988 96454 520551 660566 28130
16259 477251 144123 150961 263970 643500 755745 484354 287366 336073 461416 141275
16248 44161 352229 315782 306198 578567 237560 251455 394972 540359 390759 180938
16237 236335 517631 474510 531451 298953 -134552 283043 300781 404306 335765 369155
16227 369155 427681 283425 419059 405963 376676 133068 120244 -40303 450542 176438
16216 292654 169035 294163 347537 125593 368808 -28277 244251 -127532 205276 122905
16206 122905 -7253 118911 317256 283574 283899 -108832 162737 223419 222344 211046 73641
16194 225786 160933 33027 295776 194930 661468 495569 107036 373328 359024 22115
16183 219481 241882 277487 294408 59812 326015 133138 89426 170676 361897 263667 -95517
16171 280278 8714 125503 401390 218579 409607 139977 77475 254793 306632 257025
16161 257025 269141 -85432 64231 370737 231817 259150 404064 83584 90145 354810 197907
16150 197907 286913 -128045 182160 165544 365641 429755 -256196 243633 5698 41252 -29071
16138 64171 565085 313055 159411 382722 171266 80205 -146518 -104144 170224 -79695
16127 142464 136891 46392 96791 33137 106545 459114 370063 -145692 220762 234217 -18750
16115 49763 97232 274582 319066 34646 3854 212260 82758 104960 58084 340837 191416
16104 191416 129082 191583 226043 29254 -11934 207960 -377071 120072 227369 222896 223300
16093 223300 252476 228322 68279 113192 52520 95676 -249986 -141369 152763 -83898 383710
16081 91886 86434 11213 18705 -37380 -8158 -68714 21903 13861 -200449 -16725 18477 81732
16069 81732 343863 142331 127445 256577 -139921 38091 105120 -134687 -134629 148485 213961
16058 213961 95993 23165 191829 -108869 450217 -283866 214101 176416 419731 -382300
16047 -53265 114773 17371 -323042 515229 -44249 -99027 217556 -264537 126832 83326
16037 83326 -172403 100311 100593 58742 -49137 -73202 378305 38027 260720 -42198 324580
16025 -202264 171154 -92740 126248 621541 90937 167904 -83666 -91702 174745 -133927 177821
16013 -39381 6403 78051 228715 -64735 120639 -231740 73051 112111 287401 25025 325812
16002 325812 -337824 236696 296817 135341 119970 -128996 -82915 114119 -19320 41501
15991 163162 -16425 105138 -3300 -121011 85396 -222037 261630 105474 35942 -116301
15980 124908 -133410 -189986 -114661 480340 28854 231359 488250 378985 348135 629208
15970 629208 1060052 996612 849780 698255 449122 298170 479800 317687 96413 124805
15960 124805 -212290 98983 260110 -32214 38615 -43304 94839 -286060 -206879 -301505 -13408
15948 373652 -111311 -58281 202190 -156519 115140 162931 191835 -223764 -157472 146702
15937 -60167 116103 124022 -210919 -160277 -171335 21371 309277 -51907 11253 142184 98448
15926 98448 74804 -143924 -248357 -75847 4863 29065 236680 13488 4479 148278 -38917
15914 -48646 -115367 -130377 -23240 -304847 -58632 367446 -37676 258701 -98750 -204376 -86115
15902 -179894 -142287 34799 -37404 -134058 137123 277636 172947 199079 -84010 -297546 -439735
15891 -439735 -261872 181665 -41123 77075 25206 1427 -107533 53760 41724 80999 48724
15880 48724 -175263 -221127 176004 -270321 2903 34144 -359409 -28513 84832 -285763 -290325
15869 -290325 282103 -64966 190798 -235278 144487 177909 -179602 -171283 79136 214821
15859 214821 -235384 445612 -293437 -155986 359632 158570 -390637 -274905 60892 223314
15849 223314 -117660 -90004 -153961 116878 20202 -222863 -219332 -190936 -135004 -171126 32974
15837 -129888 -129567 -209860 -113682 5647 -65316 -8874 168348 -294160 206133 -93585 140308
15825 47568 -343202 -83938 -33369 108286 166414 40890 135767 23580 54282 -94375 6320
15813 52566 -42730 -312311 80488 370103 -120517 -253223 -87669 329359 -22396 -189518
15803 -189518 21870 -67470 134748 -331743 17123 46366 -202429 29124 58019 188767 -159763
15791 -5878 -103340 366751 -98111 267727 -166130 -2524 131740 -164033 -339231 144143 684
15779 -248093 -35548 -11533 -9845 -93177 -334706 -125407 -215544 94915 15650 25326 -104918
15767 -301970 -69386 -104311 -190776 -22506 80915 -311564 85392 -78510 -319483 31762 -145605
15755 158850 -236241 297779 4112 111259 -35386 -205449 64428 -91403 -115874 -26178 62846
15743 -48336 -114365 56480 154341 259120 102473 -150300 17955 56274 -157326 656509 124181
15731 225344 -22027 76947 -63335 -223017 115523 122806 -141346 -331858 109151 158780 -56450
15719 -25026 -71044 -310080 -85956 -131887 6225 -200284 -110144 -131580 225513 -227815 -54830
15707 71918 -42677 63533 217338 -183699 -24161 198480 -177400 -75730 -307462 188311
15696 -222115 36111 -75040 -160217 90806 176355 2449 218796 81650 183650 -131134 334737
15684 -170327 -138417 -154757 -42649 -24722 -397383 -129702 -74121 3317 29311 -10381 -58984
15673 -58984 -58800 40678 88682 -209182 -64314 61958 -256088 116804 35448 -72053 19682
15661 66246 52082 -41079 7421 -284294 217548 -37495 -50222 216653 -14163 -18631 -296868
15650 -296868 247282 279909 -311809 -109338 -211802 30494 -77641 -129476 45391 -96322 104884
15638 45921 37571 -230401 16605 89660 180101 -214457 227907 -79432 -115108 191008 -286552
15626 -143003 121931 -65233 -40342 -87857 -165706 122076 27112 -148669 -93012 -276880 55384
15614 21056 -344798 -228195 -388031 -130993 27449 -21529 158367 80799 -73957 -288527
15604 -288527 -18098 87208 116675 135649 -7289 -224192 -152740 270015 -209189 -48256 165759
15592 139251 28968 -149266 10658 -322877 -218060 -192054 104403 102016 -108833 31025 -62771
15580 -18964 2081 182662 171489 -56730 -164044 -178684 -41593 -60535 402669 -141105 106175
15568 -63747 -101668 145582 -176769 1447 224861 278646 -461794 131264 -50596 -15421 24345
15556 -23706 -51553 -26687 5372 6498 -225035 24843 -191211 217124 136162 -147570 119168
15544 -163209 102998 -197358 68450 -94380 -102211 -207933 -29271 -41051 -154808 -88257 -301176
15533 -301176 -34297 185780 421594 150967 -96958 68817 -13100 -131961 -48225 25192 217156
15522 217156 29102 -31350 26385 -16384 -77368 -10745 -49169 345938 230391 -23778 33586
15510 -135351 -137714 370929 -9240 -115485 -80187 -74934 -47585 182855 145693 -67975 -57558
15499 -57558 -55428 438850 65691 -21383 -184043 41004 163017 111098 38442 381895 224583
15488 224583 -170410 471389 440319 17500 96610 78246 112989 131398 134537 320355 161665
15477 161665 -268397 150117 117162 289487 104772 48406 9921 -56703 111676 329595
15467 329595 201498 -160291 129900 194275 38182 248360 337415 213024 317582 26253
15456 298665 397311 464772 272775 157957 296505 32495 59147 113288 -150440 -127910 29310
15444 180012 -139557 -215954 228864 -382398 30952 45618 -238072 -226727 105840 -198005
15433 -113197 84602 53630 289311 109901 254142 360440 720161 682261 869440 658563
15423 658563 846784 936636 258026 112799 286602 379896 175137 14868 156784 45532
15412 61168 -18450 168019 37814 31983 -54178 -218374 -281389 291535 38591 -128993 -178453
15401 -178453 -110045 -5521 241625 24516 -165849 -124969 -200606 294114 86912 -167791 -16150
15389 332388 -130328 77918 44600 -123809 -4067 -20656 -168770 38228 275140 26441 39674
15378 39674 -35651 -226256 -89996 91695 -18995 -27436 28209 -203735 301455 -50308 138872
15366 -94630 55636 217009 341174 49942 -122646 200064 199996 -2995 391417 229344 117056
15355 117056 261057 136396 4482 181057 233063 -347956 -3962 15909 219955 413185 87750
15343 318803 -247577 -51818 302866 -42915 191175 377347 126263 138983 18825 -7582 -334458
15332 -334458 210519 82462 371353 137921 137833 66056 219080 236980 177781 -140314 -48541
15320 341909 -182743 -315598 -33968 145250 166001 314815 399737 226041 277988 19474
15309 328239 219215 163724 507302 366063 361484 271400 9447 262601 -206232 -161417 239822
15297 213164 -105748 -5422 -93377 238077 257857 186846 132816 244651 -250805 -45824 -148154
15286 -148154 120994 28074 -126532 -29125 185894 -67633 16719 -198301 33072 -145166
15275 52845 10469 283368 172819 479145 42059 35196 -68129 129890 -58886 277367 -113727
15263 101632 244034 171962 113356 8481 -153814 162197 43143 489239 -134643 244040
15252 6031 96251 393844 146727 -35429 -9313 34906 307392 -139222 161470 -6157 120242
15240 190344 -83347 87856 356764 257142 -46174 244105 91192 200685 98772 449040 409810
15229 409810 920132 1455001 1219784 1707449 1200629 687392 730576 288334 546392 247482
15218 -131608 151652 61012 -77942 -79617 210293 -74395 1912 230719 223974 153206 -105592
15206 -439091 -96516 -106697 -92584 265068 227315 130815 -57549 3298 -58017 216563 -49798
15194 69506 57758 -91545 -23261 175514 213856 139198 67972 5605 -149358 167656 101923
15183 101923 -112642 50354 93549 323367 156099 -119965 10228 227954 7675 -23953 -154516
15172 -154516 93134 -190699 396354 -131075 -17231 58119 196211 7520 316605 64084 21846
15160 79765 249278 111003 -59203 385744 -59843 29393 319436 87978 -39750 -15327 230611
15148 311398 -133044 247213 189905 46437 205798 64184 186116 26906 244832 -145577
15137 86890 212251 -279474 13900 146178 276949 90547 -45412 95106 -21216 -122805 132263
15125 -156389 -213637 -8519 231599 242746 -30908 -5130 64859 367130 142934 304450 -198881
15113 -81086 234656 264801 314255 70611 700131 335884 376804 501566 308570 237764 220930
15102 220930 219951 137406 194577 103205 192909 339327 -100305 43520 185158 136786 159226
15091 159226 108932 219483 145091 96759 8026 165626 89993 365393 277820 -244835 40042
15079 -74885 -140377 -110186 -108941 19389 177980 105350 175080 69140 53114 44482 -46699 58918
15066 184814 43541 137545 326770 41902 231377 258840 77288 -63495 193179 -23210 212376
15054 261487 312759 109303 150333 300851 308014 405556 131489 163902 266134 315919 344782
15043 344782 411903 285439 418466 16359 454470 306323 340462 284282 34196 591110
15033 591110 99421 471392 277201 118182 392044 171443 322800 166074 323465 414821
15023 414821 390263 -24253 391084 241594 85396 214952 239017 230508 652653 682526 304148
15011 816621 416801 234599 486026 534284 314185 594349 387806 411969 45473 359150
15001 359150 811795 401512 624718 431946 439693 502501 477528 407554 589285 474142
14991 474142 118363 228137 257953 529921 208336 473415 120159 311582 249230 184359
14981 184359 303483 310725 285801 282395 446429 234638 451706 300660 476461 560927 794076
14970 794076 751840 434829 572980 644719 666239 367087 655291 700710 691399 701404 537944
14959 537944 165278 247547 415517 636793 656757 757509 502103 580108 276367 117113
14948 266712 205891 206331 193203 482336 431401 522279 50179 285681 -60717 493300 445209
14937 445209 756622 433846 563660 258265 427689 255919 478532 291221 388279 387662
14927 387662 252686 483996 673476 307223 157567 423961 401813 424941 502606 404623
14917 404623 764664 914089 921195 1033337 1185899 1117057 1215513 1415271 1375249 1616446
14907 1616446 1892900 1438725 1523820 1804996 1579686 1638629 1662056 1638871 1843749 1527563
14897 1527563 1563584 983197 1084485 910856 721834 622474 570045 352230 239097 195793
14887 195793 629322 216310 303751 195794 -24287 238625 675990 513100 233716 203038
14877 203038 177317 168593 660808 796933 721915 430511 900706 801181 890178 932421 791150
14866 791150 925971 483548 700976 1060251 539988 781112 848467 899796 305868 361249
14856 361249 312365 748514 704439 352210 514840 643732 699775 694437 671248 446557 507186
14845 507186 564210 795672 407118 475047 398929 199291 228414 498092 653955 558623
14835 558623 578932 800463 273679 744759 383335 449271 828839 808675 1070400 851285
14825 851285 998438 1039819 1272390 941147 882970 618019 635600 781111 585166 590392
14815 590392 911968 437475 458773 606327 481575 431145 527488 518698 894165 616656
14805 616656 658143 939759 602931 312538 708366 666820 492255 437151 395174 588567
14795 588567 688166 638621 590261 982319 636877 832068 757576 857916 735870 1076243
14785 1076243 942151 800414 696080 864934 658057 187677 755737 369068 700230
14776 700230 699712 703716 448849 502573 389606 586202 482992 791157 540265 831510 896134
14765 896134 842513 554163 851490 287497 682604 671564 803262 644259 857722 936217
14755 936217 910955 899368 693525 576534 617259 652856 586445 585499 787420 805389 765741
14744 765741 794577 599792 794613 538142 764001 640113 680234 582448 625583 598202
14734 598202 497532 695658 447332 502361 960822 780789 592854 1099160 753610 1160249
14724 1160249 515692 860736 990106 891609 657496 870787 857983 1021461 900190 1093242
14714 1093242 754279 913369 1327640 1186421 1468649 1598127 1433805 1415508 1175652 1257158
14704 1257158 1119017 1059498 1126017 683182 787480 1197977 823842 910985 1035893 1041036
14694 1041036 726539 794899 983781 914142 1057497 694297 880914 1150772 1630192 1521181
14684 1521181 1484404 1852965 1903265 1426359 1048150 1161336 889240 869425 813489 819579
14674 819579 1201009 1144360 994848 875126 932723 1137074 901021 1299340 1142679 888677
14664 888677 972660 962401 1176343 878928 1117111 1117244 877379 814339 1162880 962834 1093056
14653 1093056 978412 1163842 958233 983224 805236 1069123 1098336 1341008 677757 1292515
14643 1292515 1369284 1529270 1058144 1029797 1040428 1198502 1067902 1393639 1295689 1436619
14633 1436619 1217253 872714 1201716 1317438 1527926 1076155 1335648 1285929 1303622 1329809
14623 1329809 1459473 1215874 1135936 881709 1352225 1051394 1216289 1275305 1306624 1360061
14613 1360061 1429582 1490256 1443065 1265060 1632671 1251927 1537070 1017835 1528029 1433405
14603 1433405 1594506 1447336 972556 1643705 1164445 1312780 1259387 1535381 1271004 1620338
14593 1620338 1550591 1510264 1608024 1374260 1763820 1504605 1588363 1712090 1826718 1640298
14583 1640298 2084745 1771983 1886433 1719572 1648357 1596884 1783542 1445381 1872284 1799874
14573 1799874 1987532 1971168 1897725 1983280 1782501 1996357 1681962 2051934 1864958 1952574
14563 1952574 2277304 1950953 1884924 2106651 2246942 2179953 2374645 2115230 1937129 2202225
14553 2202225 2255636 2300181 2218035 2652251 2753722 2575460 2872926 2501348 3077435 2875763
14543 2875763 3174024 2869616 3300906 4072920 3897188 4531959 5547290 5887884 7057767
14534 7057767 9395221 13395956 19682669 30335177 32713317 19181415 11278208 7370931
14526 7370931 5633968 5084510 5376435 4227459 3278329 2860971 2672742 2597248 2711098
14517 2711098 2689116 2409722 2808652 2512029 2534213 2096985 2450854 2319782 2540741 2408374
14507 2408374 2614724 2428614 2664999 2778068 2357772 2431119 2569626 2764818 2465031 2679179
14497 2679179 2740953 2671690 2837049 2670860 2565700 2727400 3350301 2935066 3041145 2989968
14487 2989968 3103818 3244506 3196753 3320031 3319527 3353369 2973106 3198689 3577600 3506173
14477 3506173 3376877 3496497 3466801 3528288 3746416 3624287 3456993 3540635 3638598 3826787
14467 3826787 4267409 3794284 3566661 3796537 4186349 4319115 4196098 4191506 4058538 4337315
14457 4337315 4387000 4061113 4088276 4226222 4387662 4821616 4387636 4520683 4570000 4604467
14447 4604467 4678897 4979972 4595140 4981738 4928388 4759719 5210454 4910855 5195517 4942736
14437 4942736 5353185 5407970 5536862 5607776 5630698 5326640 5737091 5855283 5949599 5865670
14427 5865670 5734854 6126991 5843021 6336513 6067235 6186149 6575654 6604902 6431451 6475294
14417 6475294 6655649 6964182 6919537 7142401 7236868 7393266 7601021 7691580 7172348 7774399
14407 7774399 8184535 7798038 8038176 8189525 8764452 8448313 8926608 8820873 9198508
14398 9198508 9291028 9056669 9175023 9528722 9130412 9844183 9675472 10081079 10263893 10181849
14388 10181849 10237437 10835921 10962201 10919112 10971778 11096176 11387605 11575897 11772314 12116434
14378 12116434 12026943 12082698 12242586 12385271 12770966 13249303 13136226 13472163 14029585 13834171
14368 13834171 14208899 14953209 14648397 15385024 15617380 15846709 15986876 16479255 16912183
14359 16912183 17113241 17320475 17870501 17908870 18622137 18833332 19002207 19621243 19822758
14350 19822758 20550822 20725657 21615027 21717207 22437067 22461151 23297724 23774812 24312485
14341 24312485 24665436 25427214 25847784 26379650 26899215 27985906 28232181 29391572 29854616
14332 29854616 30642825 31526512 32220540 32998139 33847399 35257086 36008625 36952635 37978761
14323 37978761 39311529 40136293 41382258 42698419 44190312 45123783 46765284 48157036
14315 48157036 49725229 51353582 53209690 54552004 56425672 58385304 60574519 62690860
14307 62690860 65073242 67323676 69608068 72401108 75117844 78090340 80955933 83965536
14299 83965536 87180674 90462447 94294201 98362396 102455274 106544709 111110384 116163470
14291 116163470 121230386 127061483 132534017 138617802 144986672 152039936 159229233 166934251
14283 166934251 175115923 183645516 192587673 202469927 212797828 223574595 235005814
14276 235005814 247109071 259384731 272867536 286539482 301188198 315915323 331023161
14269 331023161 345852942 360697564 375683360 389944430 403077920 414941170 425342047
14262 425342047 434778197 442948824 451068614 458115147 462739065 463815393 464456608 465391088
14254 465391088 462872679 455446320 448997608 439943794 429088863 417277823 404310051
14247 404310051 391504859 377497762 363489355 350059239 336516347 322982067 309184088
14240 309184088 295483184 282691526 269903364 257246541 244855898 233473928 222566010
14233 222566010 210935085 200058630 189491700 179537806 170677330 162313525 154456757
14226 154456757 147025919 139853463 133202194 127403020 122278270 116842835 111410616 106746219
14218 106746219 102079536 97815320 94205757 90575104 86918231 83070617 80221568 77242306
14210 77242306 74110737 71729436 69026009 66392923 64532218 62364059 60066140 57661227
14202 57661227 55940245 54257349 52590423 50719145 49554395 48340692 46465080 45235476
14194 45235476 43522387 42738986 41540054 40672261 39186424 37851294 37028515 36175321 35150200
14185 35150200 34174805 33135926 32480739 31958731 31015841 30273582 29636909 28554526 27870638
14176 27870638 27241622 26763450 26295249 25492784 24899356 24253283 23563136 23154474 22694739
14167 22694739 22307529 21360976 21303081 20638629 20228823 19878002 19639315 19187464 18924280
14158 18924280 18619580 17866072 17674460 17173553 17138724 16833631 16272656 15944120 15630569
14149 15630569 15367119 15212503 14725139 14743092 14651583 14237410 13981346 13699318 13418311 13212617
14139 13212617 12909218 12971701 12319229 12410152 11900171 12130010 11934400 11299861 11454439 11120625
14129 11120625 11324313 11012210 10861345 10294687 10644675 10224214 9975455 9974756 9905032 9659447
14119 9659447 9638741 9122723 9376287 9256019 9217946 8809293 8552029 8641975 8746343 8379545
14109 8379545 8399772 8283373 8444716 7918752 7956787 7508953 7871980 7847282 7317781 7488280
14099 7488280 7243810 7184145 7182042 7032891 6895924 7135944 6701445 6994664 6677408 6407051
14089 6407051 6396160 6442147 5995333 6252059 6212509 6133361 6162445 5723974 5761219 5966243
14079 5966243 5746431 5459589 5715457 5641549 5674586 5500690 5506051 5456339 5200481 5086944
14069 5086944 4909899 5162550 5092084 4870894 5062722 4761808 4738423 4694424 4418204 4927026
14059 4927026 4657604 4592615 4669445 4488648 4422194 4058563 4371934 4717693 4464744 4337917
14049 4337917 4153803 4268645 4161181 4207604 4357026 3741574 3775711 3852057 3902279 3985077
14039 3985077 4086488 3884640 3894025 3848933 3400793 3425703 3522606 3629309 3843948 3683438
14029 3683438 3431484 3137764 3355799 3194907 3388227 3238218 3091481 3270685 3408896
14020 3408896 3042278 3205661 3103260 3292395 3503760 3198537 3209426 2799749 3261570 2774937
14010 2774937 2601921 2776123 3083578 2681036 2999792 2761070 2601258 2553233 2560315 2592415
14000 2592415 2422973 2465157 2590216 2469340 2389401 2455853 2326017 2693921 2439353 2292597
13990 2292597 2250493 2053290 2167249 2239421 2613006 2191598 2158144 2346275 2202666 2879318
13980 2879318 2642994 2636110 2801077 3170348 3496372 4352113 5926363 9377748 14592228
13971 14592228 25098541 33976456 22952320 15014660 10211247 7508783 5742149 5151902
13963 5151902 4124802 3917471 3778658 3579011 3392489 3441825 3023770 3073584 2592048 2759852
13953 2759852 2442230 2639247 2411911 2220496 2282543 1993133 2136045 2138373 2577370 2214933
13943 2214933 2119876 2141772 1911685 1883603 1755008 2195369 2232267 1936874 1954206 1775205
13933 1775205 2081898 1861017 1727760 1919984 1751137 1556801 1829829 2094748 1802086
13924 1802086 1782325 1479110 1870371 1797556 1701752 1682590 1693444 1576929 1490443 1512156 1754330
13913 1754330 1396656 1810073 1735383 1186016 1802651 1665691 1405596 1496643 1730187 1545833
13903 1545833 1554607 1734678 1432160 1734804 1481225 1405263 1211077 1410098 1492347 1226976
13893 1226976 1653870 1271568 1357665 1021202 1429487 1341149 1594838 1568578 1554586 1322095
13883 1322095 1647731 1065626 1406461 1143359 1313795 1178176 1274116 1189446 1198260 1273607
13873 1273607 1297152 1226484 1151044 1351602 1145275 1114997 1233562 931006 1048575 1291763
13863 1291763 1462581 1235228 850871 1241399 1262692 1414863 1078055 772721 1289676 940014
13853 940014 1045595 1206406 1072326 900717 897238 993904 1223147 1160847 1203866 1088454
13843 1088454 1259584 1186270 711595 864827 1221078 1149092 1175966 1138227 976878 1196754
13833 1196754 1099628 1380253 1040378 732946 1069989 1250231 961964 971373 704873 988038
13823 988038 995652 1313504 1096742 810305 975312 1236475 780401 954715 928986 934461
13813 934461 1140892 996070 801748 1119524 832115 916187 790996 1076403 611093 801201
13803 801201 1061566 817094 794287 1102463 866218 848880 914129 585646 1014963 874007
13793 874007 1066963 221191 840409 790238 674893 967345 935114 871916 820499 821355 894701
13782 894701 619177 769902 764453 829726 890157 993121 638919 1165221 634164 576896
13772 576896 511889 933868 657505 811702 1006872 662063 930450 902371 818608 248544
13761 935326 566715 867439 1097031 413167 523357 642015 959926 200238 862555 604195
13751 604195 481419 710061 628011 763367 548484 468691 755395 876054 559320 424187
13741 424187 797004 797721 515027 867476 353196 581726 714520 500087 781606 739846
13731 739846 640155 320152 645395 556343 630457 243050 754816 614290 765476 581338
13721 581338 399536 470175 320029 793909 649498 751459 829095 665672 574583 707917
13711 707917 510081 398429 580341 663640 450370 617690 596312 730668 547882 642355
13701 642355 331317 349357 641689 467475 793091 501752 405270 408411 344251 666208
13691 666208 563483 697497 334652 666356 423017 535561 563158 357799 624018 229914
13680 499667 768700 726054 683631 137734 753851 538881 449867 486062 346203 647960
13670 647960 434197 396900 898332 590362 435652 694197 311647 754792 498562 426712
13660 426712 296242 408503 588404 395830 581852 438366 549067 638090 148489 520752
13650 520752 489590 806910 491081 683662 659910 744503 437219 280715 207575 423911
13640 423911 452774 592179 374717 179202 309907 456116 521439 874941 407040 68552
13629 577981 545612 375655 291302 575157 576281 311065 804217 207975 435431 449577
13619 449577 261032 345017 393197 580286 397818 385743 436384 318018 448703 361742
13609 361742 124431 433096 461758 420185 277738 453301 466571 405072 148794 143648 95812
13598 95812 446375 402175 456432 525077 584910 270181 381779 495421 208055 275137 443077
13587 443077 45366 481363 602828 237967 383784 329569 218106 204193 315626 186304
13577 186304 360811 655488 353381 122908 307878 -115375 413207 177766 383988 374936
13567 374936 520302 269701 243147 490271 678327 310020 230742 734741 146679 591298
13557 591298 192541 421019 419421 113002 200967 373086 442201 250054 449561 528832
13547 528832 574247 327853 573834 141370 627268 666402 343789 266481 143111 227971
13537 227971 305438 101093 -24160 213943 451300 309891 336794 218560 366577 189797
13527 189797 357251 362400 120874 119747 369954 502474 292464 144297 392172 409605
13517 409605 358582 196411 492997 -1208 117877 58517 -18408 245633 246514 46876 106611
13506 106611 -6078 220352 293570 114139 267416 114746 418567 312895 607965 38687
13495 288849 527797 426916 -170917 39941 338755 409011 300115 -62554 274055 253481
13485 253481 451382 359808 287201 -44026 276118 303394 208417 358086 169972 212924 651079
13474 651079 301893 109130 440403 398750 355776 220639 145723 225057 103425 457257
13464 457257 86047 232135 -101092 470336 126506 341418 97707 589834 189166 331917
13454 331917 295478 357383 92256 80076 198141 -164245 286813 378000 292709 435388 436773
13443 436773 56454 459162 260263 388396 385341 -263425 360849 33094 105497 250459
13433 250459 251514 385679 -158889 36522 469505 98043 203067 -80132 24153 438539 380437
13422 380437 56079 -128420 249110 202851 79119 559123 364022 194953 36823 191215
13412 191215 -8375 231556 192364 -95652 280996 422721 -94758 1561 554211 91871 -76634
13400 250847 90799 434477 110342 -138142 59123 85844 -82090 216648 78768 88928 76158
13389 76158 436663 206005 -18084 -55703 219128 -173577 -20628 252373 32828 367891
13379 367891 256198 163845 79518 242071 -3350 77750 -19016 40071 94832 190936 -53017
13367 101970 317176 263653 248441 37626 429517 60598 101226 -75763 267175 508690 152313
13355 69296 317734 480270 141444 359774 171061 20602 309512 58276 215562 219099
13345 219099 31894 220620 -146971 290170 297253 333197 228571 124505 58535 326880
13335 326880 451681 12875 264071 292084 313289 482821 295047 217153 527464 86318
13324 324311 287402 403871 401300 490327 312887 5231 162300 21186 98944 220177 278935
13313 278935 253257 166109 57486 477146 2366 156860 356108 194510 135072 66650 149772
13302 149772 -15068 189888 509108 248847 28794 568592 228929 139479 35828 204842
13292 204842 386500 -12287 288107 232145 263575 153442 108372 183646 291990 -124205
13281 88543 18293 351164 341886 75446 -292819 99903 297587 291447 305422 -81100 -55804
13270 -55804 44769 179740 159232 189035 117445 55599 -133413 363510 178151 -87446 470550
13258 145994 155554 120975 365418 70356 -101339 148308 140434 -52658 -287067 365963 82450
13246 -62829 -12299 170276 -134543 265335 -99940 296565 -74038 191210 -87579 -7346 54901
13234 -83646 96519 -112023 188442 205080 235166 -350951 384490 -222220 -107763 246860
13223 -69509 145484 356249 123317 440089 -292914 81961 457899 -145997 15344 -35218
13212 -67532 170427 112377 42262 -192665 95373 -56258 41689 358358 -65831 -193771 -230592
13201 -230592 318033 305302 -37999 380479 184017 39681 269778 48045 47991 82445 175112
13190 175112 66099 109553 177998 -138756 51525 -16095 300462 -17142 49779 -133993 178299
13178 28865 48161 78265 127342 -168955 151435 82614 326840 227708 446558 -22365 139083
13166 -155724 76804 309888 -81691 -157986 15668 -151342 240391 297511 467737 123447
13155 86936 -37428 -39304 132186 272041 58162 83508 106798 66251 197034 99737 -66721
13143 331322 -173421 -5148 -84656 16101 -15308 -7027 150780 232723 137125 26446 -20221
13131 172638 54666 -41775 184894 211900 -188622 187919 -72319 69746 48069 -25512 82404
13119 26392 91759 245283 241506 -108858 342195 96830 245927 -85557 101473 -93946 229655
13107 7848 8685 231811 -18612 -113086 25183 167638 263279 -31042 234375 180015 -78374 -65616
13095 -65616 -203807 -164599 1166 227369 127713 25644 65027 -214892 -29558 217283 180656
13084 180656 240572 -203403 13132 148429 -128511 -142291 234424 -107455 -339671 44894
13073 -3326 79405 46858 -94716 25824 -47517 60472 -81068 -282462 257172 -110597 228903
13061 283930 72252 213999 -213236 -93739 -36304 -111337 150017 313495 73298 -143986
13050 284749 136915 50899 8723 251952 -147832 -62786 3301 144752 305802 211548 310430
13039 310430 -221981 111410 19121 -43381 337509 350176 8747 252609 61599 110987 88427
13028 88427 -39561 155781 219663 145260 -9928 169904 8827 -136403 184002 503457 -212251
13016 185688 -115046 -228061 96366 -210624 34127 47605 -103170 -179036 45642 -398740
13005 -591985 84225 295439 224090 56719 -23932 69774 444289 -33756 93972 265410 390979
12994 390979 62734 54029 -149168 -294593 117749 -191006 -208802 497031 41138 162731
12984 162731 -122091 59172 -243150 16282 213491 -78149 -229094 -252788 -188747 -267901 43685
12972 -540393 179348 153619 219720 -186518 164855 124160 302911 45219 -164776 -8169 -367801
12961 -367801 -231315 217140 46609 145667 -103841 31914 -72293 -396289 124594 -266215
12950 214171 45818 -2235 325493 -11757 294700 -45264 -202773 -54000 -22718 126113 176777
12939 176777 -233302 -64973 -227401 151455 124571 145954 120023 839 -48813 -82000 9258
12927 -152419 -137466 -111984 94735 -129159 269758 -34736 7512 -41318 -101197 333688 89995
12915 560719 130415 113678 -11390 197039 66656 86658 197724 -188194 118618 344921
12905 344921 -121621 73819 -31395 203148 170832 -62846 -69223 33078 211969 -180985 105440
12893 145093 65059 -73899 224081 -52040 126414 174075 178383 43449 -217594 153295 -167092
12881 -145973 54389 45510 171879 95730 -362831 -212765 -102739 189999 -95367 333857
12870 -149612 -113617 94350 207003 -353012 263185 -162589 -51091 -126184 -24468 -218392
12860 -218392 -2877 23292 148509 74863 -100313 -30156 220481 32129 162329 272085 -66028
12848 -97717 37834 -174979 4113 71938 26736 -39745 49890 -78571 156781 266815 -95329
12836 -287280 127103 -197170 -72827 160017 37059 -25169 130995 -189076 364752 -17067
12825 302223 103894 -295944 10951 -254125 -318928 -197478 191411 -120017 -229498 -40167
12814 -8679 -46274 -137572 -126356 -371368 -161359 62501 161117 -140294 169158 98686 134132
12803 134132 153256 -227051 44899 116601 59788 18623 146433 178513 163933 353734 -380608
12791 17474 100570 18032 13771 -24861 -12686 -239277 32018 28790 165241 -530572 -164862
12779 136804 -84622 -284132 -188150 -304955 126788 39193 118253 17995 183907 111167 -274587
12767 -120541 -188041 276389 64014 255683 -71870 4177 190054 5966 -33099 189408 38122
12755 -184147 -56149 -327986 107075 84890 -34702 52772 31289 87297 79820 -104417 284519
12743 -74130 -17544 -154666 140950 196638 -97930 -275362 -39405 121082 172504 39614 4738
12731 -42275 -120102 -188730 -45822 -96102 -255093 181278 36922 -273990 162052 21339 28737
12720 28737 181454 -74053 -138152 167793 10140 -92194 153703 14434 236446 -90802 -188942
12709 -188942 -87176 11893 36930 -327464 174922 -122795 -98119 33049 47669 -257035 -214346
12698 -214346 -134705 -105136 281901 -151939 145392 94357 110545 7405 173376 -23952 -87117
12687 -87117 -166532 48785 -683 135353 -92141 -128531 -142391 -74660 65325 252478 -327292
12675 246519 -146414 384031 184654 -97499 -16870 320205 72235 294545 156793 -84310
12664 -55940 36392 -257611 212867 97777 54537 270929 43049 374864 -79654 157665 47287
12652 -257426 73554 -108906 -44143 110934 -109200 -70390 -223791 -24919 -250453 -32538
12641 -375808 -46714 -85037 -37894 66165 -12863 76317 198407 17896 174873 -321866 106773
12629 195904 -83911 36258 -108140 -33394 237671 86051 219839 -234918 -499902 139894
12618 -28954 79536 215682 -279796 63307 201342 231087 221480 299209 446811 494439 243015
12606 186234 306860 215909 -14394 30968 -335436 267185 177004 180531 167054 135947 206670
12595 206670 -132115 -160507 139611 -97064 -33964 9447 49283 15143 168099 99531 -133292
12583 351423 164044 -163835 286918 381212 -13197 -74644 289884 16066 -40144 -107812 -106448
12572 -106448 142250 145566 91388 68113 30453 -9890 41195 103125 -22368 -165232 -240289
12561 -240289 5684 217046 -144383 -36949 141433 69970 96488 255900 -190122 120506
12550 -97949 -139307 -201636 70591 249422 301109 -19162 -28069 129556 -99260 220449 -438 -27539
12538 -27539 -202256 11877 108339 196764 186490 -16903 -83035 -208928 317270 96611 -47902
12526 -41736 52598 199583 159811 109884 309422 -275651 -89642 85946 -319325 6277 116085
12515 116085 -36088 -296970 51911 53393 -9760 230554 -131902 -512435 23885 -83455 211441
12503 117614 271183 -64318 -39798 329890 -115049 193568 183270 43517 -2669 -144634 123177
12491 18416 231030 -309710 3229 -137406 642 251953 -17346 -135581 -172852 40539 92356
12480 92356 -356198 -61008 -107462 -126155 206701 -355469 -59890 -171384 30521 154336 -129477
12468 67324 205690 -232692 252734 110863 -263391 -16939 149481 -19486 -3640 -67390 -33256
12456 -97464 -149202 343978 259489 88003 -188440 139904 -68531 -131074 -29841 -15598 155862
12444 -166670 -63385 142919 -145584 -238232 23565 -90960 -72515 -2138 -422108 -318389 -210093
12433 -210093 -12454 260009 -39519 66784 -95730 130510 84395 -372625 -63574 -194223 -178289
12422 -178289 -410389 -70803 -119985 55935 126645 -42489 76286 -350434 -338169 -333706 -76284
12410 -241187 53788 184607 56907 398960 24331 22578 202121 -388938 104940 77751 82574
12399 82574 -147861 -28972 121302 -90216 236405 223039 -43655 -52727 -264379 -120841 -978
12387 308632 -17845 -217607 -345196 165239 -76044 -34881 -161371 -2141 -23563 117422 -93892
12375 -112411 183779 -83795 -46664 -149036 284770 192031 418253 222340 30154 -190260
12364 -225681 114792 -31701 -140280 87268 -49260 206927 143789 -310272 260688 -25523
12353 -111241 -28103 -252375 191050 -25800 151117 -163156 -184613 -78511 -153832 146567
12342 62624 -99946 55686 249361 162716 77534 -26027 -72619 216365 -285522 37872 100874
12331 100874 -92161 -25096 148509 -122227 23071 -160291 293077 28447 34853 132710 9165
12319 167481 -151572 -85871 161566 8684 13005 379512 248834 188520 264313 -231108 145942
12307 231307 72043 249429 -62346 -29032 -57577 179175 -58059 64016 -155173 53072 36494
12296 36494 51227 253760 141408 -106869 414741 -1756 -12940 96167 -55695 225734 312488
12285 312488 89731 288189 -199474 148348 157456 -63573 -8037 -60475 287185 52227 248231
12274 248231 64772 -124129 58743 -139947 104194 266901 -51822 380778 -52191 -136708
12264 -136708 40685 -163840 63796 -157705 148895 175390 342691 22358 -124487 123316
12253 132017 42440 130748 -68191 611263 -47877 171859 52927 123836 216927 177047 83843
12241 142437 94084 156554 -115798 14737 -176188 271876 122233 -26922 50181 236101
12231 236101 -150448 -72518 275794 245984 228293 -95218 109668 196229 108525 246771 -189738
12219 52798 98302 83100 -13899 128416 28676 69126 387141 -7059 -124554 307811 238369
12208 238369 401448 280399 100300 15407 -43987 327310 -99609 4439 146846 188207 -127917
12196 204145 120806 237163 26471 310923 149381 134972 107258 115052 60381 -71432 73532
12184 -1751 169376 76273 -94356 113433 57944 167296 14851 553740 204794 -1187 -32131
12173 -32131 581265 -80503 15124 282763 225821 102900 -112706 161953 52294 485380
12163 485380 325060 108124 51372 30913 143436 417596 5894 155696 -71916 197022
12152 67487 162133 239385 367728 54538 136290 -185729 89781 85945 226758 469658 108068
12140 -137342 -51722 293993 187206 153580 47077 289717 47805 -77351 197690 341850
12130 341850 -6629 131157 -28752 127145 264015 165203 73341 -204824 -211036 7022 -18292
12118 40512 35127 -288566 -82472 100150 236204 -27471 581821 235805 201906 32783 101882
12107 101882 196075 24844 211574 272752 -57675 -128985 -151103 262127 165001 30878 96789
12096 96789 -70568 622225 -200161 41684 -45040 7872 93482 107470 97348 259877 41512
12084 -134068 192513 150661 104020 78810 -281492 -56062 -33719 125386 87867 271191 128393
12072 147487 -132421 87536 288125 -63960 26115 42864 80867 96601 244751 211322 -128357
12060 5896 35871 -60971 -87219 111832 -45331 421613 178073 203278 76297 171547 -222087
12048 -163850 -66167 180899 219507 96570 -72466 377819 148152 139451 182358 51723 -135324
12036 -23144 -320438 96308 -301521 227234 376016 -132420 -288390 5153 -114818 -162792
12026 -162792 141020 142530 91008 -44523 99555 29413 -9936 37556 288384 -303984 75383
12014 -87721 64052 -109486 -10470 56797 -217680 -138603 -84250 -1140 326363 -103532 81314
12002 -235501 39581 130964 137980 -208207 67192 -68390 -224491 -157017 99220 129517 247517
11991 247517 257174 197116 50459 23359 229680 -42069 -338691 -9128 -29141 33544 320047
11980 320047 -172881 136888 18709 177556 83997 -169126 -121591 -110019 199334 45190
11969 -73921 71146 50522 127660 86986 7027 106517 167206 -283014 101685 -5295 -136698
11958 -136698 -129041 -98860 110969 11647 -199152 -167837 -251545 83913 -327190 -72428 -97515
11947 -97515 124393 239221 -18600 105378 346209 -97471 -76539 -116556 -61011 -155786 -42359
11935 -53751 311977 162089 -184423 170112 -37831 3891 148296 177190 13441 -20966 -35524
11924 -35524 -12891 208047 277406 158309 -161418 -131224 129146 345288 97196 -90860 -270544
11913 -270544 -330481 53239 -215429 160079 26326 -203653 -40633 -71166 -233143 20860 145101
11902 145101 -200044 -31051 149840 235462 97225 -148709 -93111 -259347 358202 2165 -299763
11890 100715 -101326 19510 -158193 -200267 -99899 -1496 112028 -155766 -160198 -39669 -46116
11879 -46116 -156446 -119866 201501 47100 163001 90527 -21359 -44903 89803 -47498 -156294
11868 -156294 -72577 -33879 46748 -49114 95017 -280184 -144888 -21626 -1935 867 -66708 -119981
11856 -119981 109368 52715 181878 -78738 -25634 -174821 -498155 28705 108602 188813 45787
11844 56275 -58023 -1035 58628 -26322 -176728 -73791 94368 -257382 -123049 -333406 -17684
11832 291228 -159796 136472 -314730 -115591 -342325 53457 241969 157140 -33366 -34047 69317
11820 -171323 -145903 -86402 -291737 -537761 -197892 105849 216837 -22679 211906 -315827
11809 -19816 -61899 -116938 -405483 -78665 336386 -247234 -18380 -3330 -241216 -173826 -139436
11798 -139436 -260400 -13343 192796 -116183 135739 -41656 -120260 144316 -215221 -259998
11788 -259998 37750 -281457 -124528 -53691 -104331 -23873 -39385 -246184 144995 -200549
11777 -328230 -262584 -124737 -16027 -240223 -215526 395732 -106323 -108747 19855 155796 -159379
11765 -62500 208254 79458 -218837 90525 -72811 -125965 -206557 115942 -126120 -199621 -3496
11753 -146563 -60897 -383899 -58267 -983 67097 -57398 -237599 -391492 -343850 192502 -161432
11741 -89720 -197441 -12117 -28853 -107039 141451 -27862 162164 16793 -95267 -247808 -82520
11729 69137 -82405 171920 -261568 -351790 259023 -123892 32555 -141131 14241 -60680 76611
11717 -28326 296353 121861 96318 53906 -123292 113890 -96476 179300 -152581 138677
11706 242935 203059 -356003 119675 103143 83605 20652 -134071 254767 -352708 70861
11695 118726 50801 331792 202304 147321 72135 -42575 148748 -468829 70014 -173926
11684 127984 -135968 29368 -64147 -3886 56741 -8445 185520 152816 -240238 138291 409978
11673 409978 69232 232258 395823 -85016 -207020 -101933 360727 -25357 62802 239542
11663 239542 -138383 189947 -13705 -46601 23311 -196764 213670 343484 -210974 165610
11652 74466 210319 -43802 143522 -72521 -113174 129376 10227 -106887 15671 -127040 -158797
11641 -158797 104434 173528 -120691 25072 -275225 384194 233137 -75400 83793 -3640 -14365
11630 -14365 96643 19321 153340 129716 -247567 34653 46579 56039 34876 69759 267022
11619 267022 -33274 -56375 -39299 -94768 -121823 21923 97685 156541 12820 25068 -83746
11607 100355 46112 149704 26303 177329 121807 -11957 -79446 121946 -141693 75048 -107202
11595 -41577 -223000 -185433 -176464 176363 143623 -204542 105329 -229724 418755 36539 239496
11584 239496 30486 31245 93018 -47556 18051 117693 52277 -5609 -69956 20112 -64363 165006
11571 102377 162967 335811 167512 16606 -286109 251383 42549 2510 -234476 100532
11560 23448 -51980 50547 100340 -24780 25208 140047 22982 43837 168367 -27724 173609
11548 -14808 79249 415867 212788 419491 -140166 193433 -9930 259233 72531 41270 48865
11537 48865 112126 123418 -123402 -183694 -33903 -74125 409189 -40329 -86453 -445420 47701
11525 -170059 -57802 14913 293041 37428 108637 -25026 351153 39058 319200 201941 120082
11514 120082 180351 -334655 -93247 -45306 -86388 127669 98309 95285 -162584 -87556 37171
11502 162174 61212 88178 -5213 20776 38873 114860 115673 196861 520366 181531 -122482
11490 148187 102897 119783 -6472 -157843 18591 -73522 -170110 153650 -136298 165222 63372
11478 -69054 142307 -38300 255946 484351 167735 35680 -93920 -1174 285400 -59069 67301
11466 -111011 233873 102856 34046 -22709 113096 -88307 215405 23328 39021 116232 108965
11455 108965 102839 106624 157163 11528 168579 88522 -36250 -94558 53598 118510 147131 86373
11443 86373 -64797 191746 109950 -88233 -253744 -9597 -169576 -79541 62301 -29570 170 -15318
11430 16813 14552 99789 15984 -178098 5982 -187757 321453 -178807 -164236 529760 201528
11418 -211339 -54416 -156359 -12054 5493 8165 75716 -194197 157194 -122194 -132673 -86310
11407 -86310 -103673 -87431 199815 237814 88931 -190278 -99331 247728 89192 289636 -161180
11395 227488 29866 -173283 -66449 162347 -122647 -261203 6294 -274581 46111 54604 8058
11383 -44848 -14308 99721 314497 -40725 -250811 210046 -3920 -221543 4525 -301073 -86138
11371 17057 154906 -136068 185306 -248461 -250761 213332 187912 -120655 -275301 138629
11360 20859 -87691 -267533 -67503 196892 -209003 -22915 131317 240085 450331 -181284
11349 -23149 -95265 37621 110681 241861 -192120 95503 -186363 161342 98935 -289688 -267035
11338 -267035 -432693 -189425 -455094 51997 -20774 -32289 106838 134370 33642 99089 307958
11327 307958 364859 97674 -6763 178563 360506 40407 -545373 197876 -16907 -55510 187046
11315 -138760 153043 -375740 -148572 -40351 37069 48890 174800 -126935 -120439 -57585 115401
11303 13702 -159506 -255915 -103607 -77734 -30418 34333 20569 144381 -16366 338820 118780
11291 233243 -79020 132826 83866 -45513 -44885 -28300 -311156 -328215 -171476 107055 -12422
11279 -242608 -11830 213841 -108505 -39790 -11269 62764 113665 189397 -275027 -246852 -78697
11267 -295289 -106582 -273116 -237314 104513 -24969 144619 -33856 -13607 -118436 59497
11256 57684 100072 -158528 173505 -153249 61284 -48943 98442 120229 -31383 96787 -171315
11244 -266315 -127144 -169593 134040 82534 -352559 -32246 -93098 -32255 162716 127794 -130537
11232 36454 31469 -228970 -193430 -223182 -50520 -18946 -171842 34026 -247653 -271785 14992
11220 259129 81499 97206 37713 90964 153760 -32324 -105732 79435 -65410 -152585 53862
11208 -92706 -198138 114560 220241 31971 -108360 13799 142458 -299560 15030 29716
11198 29716 -120666 -296857 55661 36048 -230658 -202734 160398 -89231 -170291 11801 104155
11187 104155 140641 -144933 -307835 -246576 -186215 -181198 -259561 -84257 -225182 209828 -226760
11175 -340042 116753 -117312 -375416 -246295 43440 -184747 39710 -94404 -55199 -138810
11165 -138810 -207480 94356 -214195 -92504 -122224 3129 -152379 -176317 -100700 -25572 83416
11153 48035 -46056 -277155 244674 -354546 -286624 -12039 40764 151216 -284317 256874
11142 -331155 274664 -69707 93125 -115140 5782 216170 145548 69461 33486 5558 -350397
11130 288056 203712 -61282 -136614 -140527 -138271 89738 -150889 -519945 28489 -119170 -178465
11119 -178465 -97586 -16286 108241 -228383 183260 256950 -404114 -27776 105219 513836
11109 513836 -43517 -472910 291219 -22216 -55106 -301181 -57769 124725 59216 -260507
11098 16267 223993 -46823 16219 198255 -14148 169255 9670 170407 180953 179639 -346277
11086 34502 320654 -31082 182808 -31408 -131861 8084 225037 11413 180298 178550 409659
11075 409659 -6881 301597 364420 236645 240274 128636 65562 247615 90781 15779 369999
11064 369999 -140273 -101102 14659 195934 375309 150997 228425 62309 229230 101563
11053 151928 22499 -275386 212034 631218 401802 184511 53979 454525 328497 160467
11042 91138 287145 607545 294326 503536 549957 566377 562650 476957 445602 765666 509555
11031 509555 314235 338450 794457 506129 426738 616265 365925 315682 296400 477724
11021 477724 742654 673103 747304 419891 423684 415632 612125 459713 521999 379429 502583
11010 502583 335524 644706 640179 387126 429628 467284 566316 511216 357347 467596 778451
10999 778451 588701 587354 388335 705313 671676 369783 315720 592088 514432 437913 539781
10988 539781 892869 368351 802874 756446 561054 398800 510477 617414 703275 237102
10977 698963 369805 206951 420075 392904 454672 722359 838949 584500 604529 1000737
10967 1000737 595009 751276 682616 945560 665393 874228 862493 1076572 1111564 1518407
10957 1518407 1500818 1631998 1734024 1980145 1871723 1685380 2257037 1915106 1527290 1371458
10947 1371458 2005925 1655673 1443210 1379919 1459124 1602769 1481031 1502481 1254012 1355115
10937 1355115 1229447 1399203 925173 1009963 743270 1101465 704433 636145 542484 603956
10927 603956 396910 277847 119015 348072 342510 -56180 55566 321849 9410 22110 -32963
10915 258115 218070 -211168 -89754 60045 129665 88230 224044 2826 205934 -45794 -41833
10904 -41833 165663 -82061 -225292 -60552 -19445 -268117 102378 -195501 28408 71821 22594
10892 -117072 -36457 -79426 -202717 93615 -87719 223084 -400523 -75942 -151602 93457 5314
10880 -138815 287778 2559 -229407 -247326 161814 62508 -132673 314770 -1362 48061 -952
10868 -204150 -209132 253190 54272 -166701 -124980 108784 -295168 -114047 50404 122142 12251
10856 -93567 146943 -46658 -189712 29552 4140 147190 26715 12122 -123112 80530 221227
10845 221227 -127732 7656 227456 -194153 198854 26455 44134 -137864 -33035 91407 -186915
10833 102845 -2943 -25514 47595 72947 -127453 -132989 18570 -49773 -381251 -211306 -129542
10822 -129542 -162221 91409 -325616 -122553 -347507 -141305 -17670 129524 -192582 -26986
10811 -35404 -47357 152499 -243360 -109829 -127421 -265827 -124187 317725 41590 261532
10801 261532 -239391 -104826 256148 -372267 116839 12406 -283736 18447 -295699 -102272
10790 326895 -151559 103106 -15995 -96197 -21847 229501 15896 -67466 -295348 26439 81800
10779 81800 -98733 -164285 -61380 117623 18542 -88161 -263105 59621 -107641 -7461 -72370
10768 -72370 -74180 -132286 -55772 -273681 37885 -264542 180586 50764 -180465 45523 -28575
10756 196033 -33979 -89289 -218714 -96655 64921 185141 185003 -291286 -129646 -63027 -132397
10745 -132397 -224509 32770 -56948 82687 -40797 76459 204747 134545 6831 -104424 -148113
10734 -148113 -45762 199397 131828 -80422 -376199 -157768 -139262 -139571 -52037 34951 -340917
10722 -298051 1302 -218255 -95434 50322 151009 -14641 -596742 -123873 -60565 -142098 -154358
10711 -154358 -561685 175553 286356 292429 -55061 15239 -449113 -51139 219835 -247263
10700 275538 -45496 95547 -343872 29993 282688 -45911 103578 -20151 57394 -28769 -269042
10689 -269042 -254662 -5690 87059 12394 -256738 -223374 -29517 -126898 5058 228175 -38082
10677 -58030 206098 -251167 34385 -4898 162138 100135 53044 -121617 -243380 111502 -60274
10665 64302 -276272 -10180 62626 -248688 -450731 -16702 -208786 17888 -266124 -29535 613
10653 150924 -18968 236837 -57701 -172542 -79893 48621 -270411 168506 -86626 131872
10642 -202087 -284300 -174551 67153 22099 -250522 -45997 -115872 347920 -185620 -173920 -22359
10630 -150334 9417 127089 -137828 79418 12724 -74796 -19579 -444725 -145421 54467 6148
10618 -152283 76178 195594 -294642 76215 -81506 -238273 -216634 -325767 26803 -406377
10607 367997 100387 93817 -160999 88747 -288902 79126 106235 -97089 -444328 -445485 -52927
10595 -156654 -228083 -471786 72628 -15932 103593 -118222 -146795 133392 141832 -6106 84858
10583 -89011 2154 17987 -94245 -272822 -127362 201191 158424 199022 -46756 -145380 53944
10571 260824 -476457 -326770 -171298 -475172 71416 272829 -76028 186203 -206172 -230490
10561 -230490 -15167 -182354 163631 -40470 223623 -492909 277617 54143 -93628 -334792
10551 -334792 1891 37967 70184 -108122 -267328 -285048 -30111 -68099 -70444 -160828 19014
10539 -84900 110583 -11741 -296265 -291081 -178302 70554 -313737 226239 -208833 -128395 -51168
10527 -75656 109318 93921 -71240 105506 -60734 -172019 -29578 -189205 -21630 128580 -121857
10515 30258 336085 -81083 -54714 178113 -13962 14105 -148136 -214713 -73490 -195780 153359
10503 -4751 159238 101422 -377829 -104386 -106102 -23634 -272360 82509 -81534 -63280 160576
10491 93792 -243667 -314823 -398712 14788 -23835 69964 -45831 -215810 40302 -198178 217724
10479 -186591 -150960 -198470 24490 88514 -234565 17644 68149 33841 -222503 -301517 -257751
10468 -257751 459286 17355 -257388 -125334 238556 47528 223977 613582 259092 236865
10458 236865 221694 189939 149990 -8753 72333 191345 -264529 243082 115690 113090 -129864
10446 155991 -92043 112272 118802 -427335 -125787 71872 -37709 -302375 37198 176552 146076
10435 146076 -85168 -157201 35486 -101744 -243177 -353158 5796 135798 90846 102251 -179023
10423 31070 120520 -77354 -349479 -83189 -184847 -255381 -242060 -99824 37083 108475 -166986
10411 123938 -168508 143380 -12649 186668 -144013 -155691 -288684 -67822 -126546 -124174 146794
10399 138328 -160750 -170966 162968 -154629 107487 -138693 -52209 156437 77443 -14100
10388 5878 185254 -190946 57448 -113983 2363 278558 -98701 -126631 17193 81 58040 68982
10376 68982 232032 308422 -62790 171716 121165 -179063 -324525 -181695 78857 354521
10366 354521 228678 -16982 -9637 -110405 323598 16856 -172120 254682 -94440 112770
10355 129403 99338 165264 174769 243293 346169 242653 150028 457503 519226 448674 -105350
10343 444219 -23524 57011 -178305 141750 290810 383922 -30329 167396 294845 314082
10333 314082 229126 250553 34633 313729 305911 237778 211664 30817 373109 429037 114943
10321 396034 -115627 140293 -18133 49267 -68381 136001 47309 271259 11017 352399
10311 352399 197133 -35608 -147379 296594 -20754 418790 585574 31141 7405 87140 114528
10300 114528 -116381 163307 -42328 184408 -58685 -200171 198119 -282444 5006 112704
10290 112704 -317955 -35831 111749 173515 -208756 379706 81728 -141346 -371093 -49038
10279 -42889 59744 13063 248455 11122 -57183 -256657 -256906 110126 -35848 -211335 72935
10267 -21872 -169340 -155811 42114 -88987 -10339 184404 -37017 -207653 70311 -39498 -147007
10256 -147007 -107023 -32900 172705 -24916 6957 -97070 53931 91889 -201729 -367452 319935
10244 86931 -108735 -60399 -194357 158271 -29195 390668 124180 99598 -140023 439769
10233 259998 11318 127411 89375 -189428 -217765 -30794 -194287 -112252 -214770 -145154 26833
10221 69048 161106 -166402 216405 271353 -370940 -337807 37250 -44631 52574 8237 -34686
10209 -148513 -45193 68488 48351 67204 -29114 -142498 -224560 200000 -243053 165309 62161
10197 172385 -128009 82336 -254073 126297 -436645 -11642 150202 69902 -340128 -255201
10187 -255201 -286022 43136 -24446 47729 -18750 -9095 -55881 -171718 -170015 -323454 -169735
10176 -169735 -87707 -19229 -342373 -10921 -24594 -71504 -19185 20836 139758 -256699 -2890
10164 -75422 255577 -111701 -117594 41456 34911 -536521 95680 -176214 -1937 74304 -123867
10152 -115612 -274810 -63657 147498 -100698 -236420 130176 -57412 -31771 -232764 125949
10141 -212619 68357 103848 -265303 -86428 -53298 -130753 89474 -67631 19465 -290874 -75440
10129 74872 301833 139793 54976 20013 288884 108288 260418 -142846 -453548 360430
10118 -21999 99359 102999 -284274 -111077 138652 127067 54886 19048 -203458 -118680 98167
10106 -83637 21555 196994 -39633 -75442 -2865 201113 55099 66161 -227658 -353437 64808
10094 -24390 92814 -457492 -187719 -88589 107230 -53476 -240002 -294152 -153756 -239971 -91484
10082 -237983 339993 143757 281147 169478 88813 -360177 266686 199273 49534 -145396
10071 -120032 20207 49868 -99177 -80746 131991 -98245 -99829 31513 146298 -15347 52524
10059 -202035 89686 -143590 176219 -248431 -167611 -123226 -54814 -15473 -73686 -14846 39476
10047 -273044 -221885 -106835 -355411 265438 64423 -151712 -112888 -24232 -174455 10030
10036 131788 322386 37139 -4712 -166276 2095 -202846 -292087 -16401 -195332 114071 52154
10024 -400675 -100914 22564 19651 -183468 -29465 -40499 -22171 84901 -179970 185993 -60300
10012 57901 -171969 94776 -86216 -338598 87997 -139453 123932 -352602 183354 -230510
10001 34334 316565 -75934 158132 40847 -22255 -124999 -155587 -80475 -110681 -100417 -328179
9990 -328179 -111932 -298905 -306581 -152186 -15134 -32376 -259574 272015 15398 -333257 36524
9978 -17420 -112406 -82122 141788 184116 243130 128037 -115356 -85060 -117649 -179060 -104399
9967 -104399 -200754 141635 -166457 -87957 -140335 -477584 -238764 145629 -382549 -17124
9956 -589034 -58621 47336 -81730 -283311 23484 -145473 -317578 -107675 144507 34446 23561
9945 23561 16520 48139 -184093 -86285 31669 -259966 -244983 62029 -94450 76683 226292
9934 226292 -133197 256062 231256 -203604 -214356 17843 26583 -52129 -281546 -25804 38287
9922 -54196 -258079 -303928 -448925 -411545 -280052 -75004 -341893 27995 -192702 -11226 -127507
9911 -127507 212834 -113900 -489774 -113711 35628 -1684 -363211 98845 -66561 348605 -338475
9899 113083 57295 217321 207962 306581 -201933 -22212 -249713 140892 120087 -253470 -232624
9888 -232624 -252667 -477899 -292083 -101231 -324906 -267045 162997 -216763 -109161 -36680
9877 -444069 89036 -364561 -90505 -83927 -57550 -17304 483688 -479192 192582 42401 -80731
9865 -282766 132567 31380 -214516 -197094 3962 116357 173662 -39866 229162 -165682 -208867
9854 -208867 -10087 -415669 7641 -18203 -156009 -110037 5386 54209 101024 -293631 -209614
9843 -209614 -13033 17659 -129057 151225 -168840 206264 52177 -359433 -198582 248143
9832 -189393 -108532 22638 -95047 -45210 -10640 -247898 139114 92252 -183774 -275000 -191278
9821 -191278 3853 -2043 -93084 30111 92311 147774 -187191 -186016 -262063 26263 58251 -245590
9808 -350528 38882 -119000 -8324 284165 -24392 10708 107882 17383 12771 -100888 -27586
9796 -143229 -202643 -363035 45647 55188 -103521 -179156 209270 169342 -67618 -232500 129757
9784 -357897 -210430 -94554 -95791 -152373 18209 -38927 -91216 -158906 -632989 181449 -343998
9772 13137 -141389 231550 -89555 -452568 -409195 -109827 -181507 -21951 -118101 -398798 -291325
9761 -291325 -103283 -78573 120205 247220 73215 -136612 -355405 -69524 -365553 76656
9750 -38566 -200903 -113073 -109817 293590 -668355 -181100 -26659 55487 -3556 -30162 -202083
9739 -202083 -63264 203581 34711 -94920 -282172 -248763 -5515 -365999 -87691 -216143 170143
9727 213015 -170337 146135 -256413 -382461 154672 302910 -272500 -396064 156282 307861
9717 307861 105283 291604 -102985 -110340 -187954 73712 62234 235013 71511 18929 -122616
9705 208296 -142413 -114766 -21980 -172595 -47043 24081 -149821 -273731 143375 153800 -207955
9693 -246217 131967 -203758 -255177 -22920 -111008 -148152 69012 -400289 75825 133235 159799
9682 159799 -117328 -372768 -77721 16220 -302936 62373 -322787 87929 -170407 -140295 123059
9670 -249483 -153870 -89106 94125 -44516 -115027 -34115 77653 170690 -90086 -67802 -184712
9659 -184712 -32157 -116659 -39088 -437854 -345053 20668 40320 76040 85443 -219565 -214497 -261587
9647 -261587 -112262 82766 -110332 -73338 -262635 -380062 204989 -72865 67133 -168318
9636 189511 -328161 -180052 1315 -43416 -290169 -125244 -16120 67123 -106501 -79689 256121
9624 40808 238242 9768 -98639 -231920 -33374 -261327 44304 -75832 -206681 -42704 -192311
9613 -192311 95188 185245 125408 -20388 260928 104344 -159438 -167294 -137532 -194374 -502707
9602 -502707 -202706 -331023 -141578 -144886 -4146 149150 66376 -138965 62821 218741 137392
9591 137392 120573 -21693 -95556 -59647 38328 -179057 -251159 -241923 -230793 5038 -150385 -110113
9579 -110113 -210006 -305512 7214 -81575 -17894 -193374 -135554 -1318 336506 -304282 83483
9567 185944 173004 -252286 386894 -151563 -89250 132770 117200 9906 124424 32432 -34715
9555 115335 -294736 45986 -182475 190542 -33200 -339523 96348 -319933 136801 165794
9545 165794 -80261 -52334 -339796 -203910 -19065 -304051 -65246 -53871 56002 -263787 -36070
9533 -158508 -207995 -188346 -59027 -80532 73849 37083 -136331 63176 -455117 -172836 -259810
9522 -259810 77656 -312300 -145393 -204216 -73648 -23510 -46919 143557 -187962 85988 62564
9511 62564 76539 20553 -69861 -268762 198506 -349248 -18511 38975 -126346 177883 -105523
9499 291693 57510 2562 -30866 -130075 -232387 297798 -281836 -137387 47168 75524 -178757
9487 -311367 -151026 89820 -37023 18922 -143371 197437 -61675 -116673 -132490 -201845 89086
9475 117964 -307904 20787 -215122 61025 -2380 -156973 -255688 -222561 -181616 -114736 -139595
9464 -139595 -297934 -306869 -140048 -417382 -96499 -364936 -424163 -136263 11742 65962 -27202
9452 -149253 -112679 -9896 -132012 -297601 5469 86790 -311047 -27337 -156265 -12163 12044
9440 298141 -150264 -153929 -82996 -351629 48802 3625 -220674 76062 -243634 -160843 -204107
9429 -204107 -236171 -39180 -162969 -247848 -262193 149247 -88966 -256652 -112816 -111131 276253
9417 195156 -460911 -1046 138457 -71666 -1513 -89435 -19616 -93645 11366 123177 199969
9406 199969 216563 44992 12327 -135598 32298 -6089 -61498 -281506 57615 -41655 52544
9394 -205034 52343 89230 214738 -105828 -37874 -12814 119160 -338710 -141171 199137
9383 119717 256941 70367 -33762 68712 -19623 -279927 20573 -29601 -131574 51867 -11190
9371 260133 -384124 88134 402026 22075 -146808 117176 -64359 100148 105500 110738 146362
9360 146362 153196 -33893 116554 -125786 289783 -436357 -22536 114224 101757 49212 -250548
9348 -85760 -110024 77211 -259806 22492 -325811 -229283 96639 -148122 -94836 -30920 -86831
9337 -86831 219315 111523 -68998 -367429 -61273 46314 185923 -28469 -84303 91687 215100
9326 215100 -253155 -208780 147347 -135122 235072 101503 -60931 -125283 80903 -306665
9315 -425411 -184704 835 -300442 126562 -245675 -460340 -62702 -95068 -323479 -164177 211112
9303 -269963 -158164 -294862 -164238 -56823 247803 63661 222021 -158439 -336489 92859
9292 -195488 20725 99411 -118616 -309328 -299158 188942 222968 -195202 236221 -300241
9281 -28311 86802 -62015 -72529 -62338 -258115 -198646 -239001 -24019 52780 -101938 -367363
9270 -367363 -20254 -182977 -223027 22478 -103937 -317580 -40362 189736 -253972 -279045 -127232
9258 134867 -71944 303223 -37564 -156173 -24608 -142000 -183730 -77490 336699 93026 -331821
9246 -373521 -187731 192060 -20582 -24942 -253749 45088 78804 -80150 155458 -472389 192218
9234 128178 19786 -24662 -325937 -195664 -208943 -214885 -76312 -248871 -427130 -247318 9823
9222 -131576 -125097 -409262 -90817 87957 -287482 239187 228578 5803 65411 185968 -232538
9210 74352 339078 -20794 -179109 -207758 132763 -35166 -26861 -217851 272208 122359 226431
9199 226431 -262671 -157299 238762 40856 348261 237265 276574 -121392 263862 21384
9188 55571 116999 -216220 95481 -154670 -343376 25968 -228981 -139507 -84498 -256385 -201163
9177 -201163 287202 -153270 -24083 -99550 -157511 -307138 -248325 -323013 -410485 80434 -4316
9165 90546 -120785 -56491 252013 -128359 -342218 -215196 81652 -35816 12933 292022 -88233
9153 134584 121745 -98304 -18392 -129747 20755 -119827 -92109 -171441 -88824 -44912 -40029
9142 -40029 -196164 195256 132252 -91663 56709 104733 -240765 285315 -8385 57193 -238450
9130 48753 -373622 36102 37877 303392 -317738 -172148 -196985 57069 -208373 -164999 -122429
9119 -122429 165283 -205447 106834 -235511 -387248 -67446 -64756 224653 107558 -17232
9108 30802 118816 27211 -135844 -163382 -495648 -296742 420907 -210345 -180126 -86600 192257
9096 63237 -104873 -20814 49502 -111962 -330672 157279 -176076 -65697 142020 -295953
9085 16313 -75429 -80275 48774 24130 71658 -223961 256848 223704 -42835 -130185 288882
9073 -104271 -36053 -49002 105143 -79378 195182 72781 -228762 35351 64959 153488 -259098
9061 -115390 123142 -292267 -1398 -165252 -94776 -46502 -56946 -101895 86327 -41996 -4626
9049 -16543 -84732 -494599 -109690 -106619 -152632 -62244 -173756 -178819 67450 -3987 54562 -105136
9036 -41777 86223 187659 -18613 -155527 -38982 143768 137580 -16556 211374 -59123 -255103
9025 -255103 -6639 -322968 -229015 -435777 95052 -166629 -411605 -216213 -196431 147763 117222
9014 117222 5168 46194 105233 -235769 -364811 -48821 53448 99679 -65623 -251356 -204737
9003 -204737 55007 -381651 61868 -70838 2887 119864 5423 63227 125715 66143 -142976
8991 -114929 208538 -325486 -166941 6877 -5707 10101 41476 -106693 60549 -260780 56090
8979 49201 -19231 149793 -178581 -216268 124921 14520 -145539 114264 -354207 -457613
8969 -457613 -105841 -122325 -56742 17437 144842 93552 -307146 -288474 -255126 -41634 79807
8957 191609 -41884 -100435 17307 83031 -116197 192918 -65659 -191162 -238853 -387810 -346947
8946 -346947 -25381 68745 -46706 -78526 138538 108585 -387974 109242 -128102 111689 -324291
8934 -140359 -239239 -116881 -145807 -20656 -252043 161603 -56976 63131 51737 110075 -22992
8922 -354371 -85736 -201759 161324 -138459 289151 236096 284360 19602 340330 252853 -4466
8910 167462 350210 258419 495266 613196 1232116 2735070 5073010 9127022 4422997
8900 1886776 1114501 669670 857185 360161 103312 -322268 201124 118021 22402 -46008
8889 131974 151419 169821 247747 -51650 318272 -347161 126526 31917 -173938 -427784 -70611
8877 1390 18174 -290120 -113666 -139489 25460 -260202 -223869 133035 38042 -8309 31380
8865 -135498 87185 -56602 -80224 62389 205511 -282940 84144 80691 254760 -11575 -111975
8854 -111975 40954 28546 -108961 34443 -170964 -67450 -133412 -214070 95211 292405 108117
8842 -57834 -57309 -152007 -281082 103258 326107 -118324 -143763 -34614 -65637 -463131 -173355
8830 -167472 257085 -262183 -29876 -167995 -223878 -162332 57760 -206911 189608 -271001
8819 61291 250323 -204657 73703 2493 -106575 -88465 90830 286314 63972 59870 -133142
8807 -204839 -406295 229585 -278078 -14175 209125 -166071 114896 336108 -248528 -2630
8796 -48599 -75797 42520 154816 -93356 51503 177735 -223875 -176521 -92555 8330 -168404
8784 360826 -309610 -53047 4308 -235908 -99237 15948 197458 -225397 7125 -123332 -205835
8773 -205835 -44626 -22242 -137797 -124466 206480 -84084 -2052 -255975 -57200 -190796 160088
8761 146880 -57503 -138305 -124917 -72370 100971 -235422 -147098 41930 -229656 108355 20287
8749 73420 -11362 -356325 -60411 -291478 175635 -103271 -63451 -186143 36642 201176 315911
8738 315911 -198780 -162433 -66909 -79848 -64142 -193310 -203660 -384063 61655 -66782 -321669
8727 -321669 1080 103060 -216685 -73540 -367901 -183703 -118807 -5003 -397499 -117438 -110850
8716 -110850 -170297 -29275 -27906 174518 12328 182066 -25172 -79041 121641 -203419 -172534
8705 -172534 -119929 16638 -62196 239558 34370 261199 454930 -168215 -239287 -231946 52475
8693 -212350 -193458 45104 -85552 -51829 -149258 -456305 -148070 108096 -105548 -170016 -352545
8682 -352545 -39587 288906 -166223 57675 -71315 223181 -381607 74997 34721 117421 -319003
8670 -104839 213064 198336 199538 306034 105770 77867 74375 -427387 190562 -58198 -94578
8659 -94578 -322703 -42148 17236 162141 -203924 -178911 -10975 61165 343172 83931 52013
8648 52013 -59210 -259788 -190756 -208372 -141459 -220524 177922 -70141 -125409 -156038 -306840
8637 -306840 -176758 -134221 -439641 102425 -252391 -228764 25935 -73406 -33902 -159586 -185931
8626 -185931 -141478 -121638 -232982 -86977 65594 65872 118601 -211451 65934 -100035 -299499
8615 -299499 -97169 -153351 -103949 -138888 128335 -11797 9276 -199205 -195942 -113395 58341 -192243
8602 24644 -204178 -250831 173751 -305853 323599 158194 -263908 -67584 -102859 117771
8591 88510 201832 -155707 -134352 149144 89544 406151 -197792 63335 56882 -82866 -21437
8579 -120584 41480 -431651 -257944 15686 -5270 -239963 -58192 -273392 -194183 101073 -46059
8567 -257061 129944 -175834 -74903 -62041 -115723 128126 -29847 -11321 -213860 -105649 -206848
8556 -206848 -364800 -367729 -70023 -126415 -183764 12144 143442 -58638 -253301 -30254 -58894
8545 -58894 -123037 -163825 -77539 196322 217408 -16400 -105799 -198466 6600 -69171 -187229 45888
8532 -95690 66195 73974 72252 -9964 -44074 282623 -13339 -209794 -31977 75485 204854 152112
8520 152112 108153 -66636 -40913 -53343 120790 -9925 -277822 -40488 137850 -197453 125903
8508 24235 -3296 148831 -23697 -58843 82485 -198486 171504 -264173 -352171 21806 133512
8497 133512 -56212 -613598 -50234 -47392 11975 -279212 117950 -1852 -18462 -34872 50363
8485 -102266 -35614 329703 13049 52819 150978 -226137 188812 -315643 150730 -224875
8474 -356312 -182085 86712 158797 105602 65966 66876 -7155 77221 -269557 -162305 127105
8462 -2974 34772 20500 43271 111605 -202693 -197617 87950 161716 -93231 -369233 -295200 219804
8449 -132864 194680 -75174 -78551 -48093 37896 210989 -179207 -220226 15285 78866 -1119
8437 230020 -36418 -137531 128910 89159 -352642 203910 73958 -55390 -73328 213714 -201247
8425 192407 -127269 143245 92371 90345 115876 94626 -137451 -20504 200765 -130170 -66268
8414 -66268 31579 139151 -189876 -179014 -83215 168167 199644 38742 -88881 59780 82652
8403 82652 -177719 3568 -429828 -368501 -81327 9399 -215477 -76124 86352 105672 284894
8392 284894 -85904 -246178 157839 -172054 -15181 -139767 -53111 -69857 137800 -10560 -95689
8381 -95689 -193701 -207530 261482 -85921 -28979 -141399 -10173 -243370 15920 -296717 73375
8369 62770 -100970 -24750 -28900 110556 -281089 394084 -286240 -43511 -95112 51114 249187
8358 249187 290977 -283019 -125746 -319889 -281501 136063 80131 -84356 -9489 -108831 43534
8346 92050 -117586 -5023 -97259 177379 -159813 107728 -287583 -211027 -144791 -207205 -83923
8334 122120 -190798 -23704 134314 129331 -179817 -55079 111732 -55204 165473 116203 -160876
8322 -90436 -40091 -3777 67551 28484 -83063 267500 7887 176997 -74250 -185695 16031 -19067
8309 4809 -255047 41881 -33785 177015 79152 -7011 -4710 146567 -232006 130955 -83804
8297 100515 -76346 -140223 -10640 -46976 -95102 -194060 126754 38631 55536 -225614 137244
8285 241633 -142162 56141 -79598 -141654 67501 261853 114945 -145354 -345564 -239943
8275 -239943 -51204 -17894 226099 210209 52421 -43145 -129370 8067 -61244 -103763 -57447 -31696
8263 -31696 11836 331037 -114089 123942 158537 143519 197994 244563 -245335 -370160 -258030
8252 -258030 -38313 101511 -77397 -72425 -100071 -595491 -5174 -24926 -217778 -147808 -118935
8241 -118935 15366 -241525 221948 -260700 -50241 -18326 -28491 -41759 -4631 -20375 176719
8229 121312 -50005 203868 13565 124647 -235499 -95011 179205 -218699 48875 -10494 -17068
8218 -17068 -208643 -172070 4123 132940 -107289 -2626 31678 -273682 -190578 21214 201132
8207 201132 -103233 -253479 -151197 -187898 -248543 39782 140733 -30584 -238319 83766 211289
8196 211289 203330 11348 -8301 -47733 -6710 58296 -85202 70947 102115 92715 -164344 -371197
8184 -371197 -236064 283561 262104 -205068 -113119 134400 -251246 -45170 188594 -169223
8173 -225586 -88897 117477 93432 117223 -175191 -339684 11902 -195789 210385 58453 -43818
8161 87062 158568 -312533 130131 -108198 -313239 36736 -18667 175432 -172168 -156969 -190501
8150 -190501 102927 58656 103861 -205529 -51245 -312358 62796 -255737 78706 34190 125681
8139 125681 78536 8851 99656 -41879 -135503 -159385 27494 -142413 -12971 175456 82412
8127 98422 -331890 39015 101701 -291397 -148739 256375 -14727 147994 2232 84960 -88851
8115 111301 -223172 -44672 91146 -1362 61645 98665 11614 949 -208996 -3800 97463 9780
8102 78184 -25482 4289 147296 -303330 184574 -211946 -40056 30814 38738 -65082 -165626
8091 -165626 -192981 2249 -42616 104148 -49539 145666 84635 -226549 287116 185672 13127
8079 137072 -72455 -292302 -227256 -461313 -10079 -44477 90256 72962 46523 -175340 11424
8067 -184831 192271 -129720 10636 -239172 -142883 197670 125311 -46368 36704 -16897 -48637
8056 -48637 244784 17343 130389 130521 -42705 -216586 201990 88060 56981 -32959 -277687
8045 -277687 -219499 -51102 -543377 -171191 185564 -18645 -19508 -198046 -154320 -212551 -49636
8033 -166725 179683 -267159 -110690 -369632 101719 -224543 -246233 -222414 -214467 143241
8022 -198136 112428 -30466 28648 -113299 83471 116991 141958 49890 -298419 -194371 -89147
8010 116771 -113909 -320787 -40248 -350948 81832 15412 -202247 55667 -10626 -472271 78944
7998 -134048 -5050 9197 203368 -311838 -331940 56373 -43920 -54356 -222867 4021 -205559
7986 -163930 43133 110002 -105371 -81631 51023 -83097 -32370 -129787 -149234 30892 21587 -111047
7973 14129 13982 12953 -219490 163979 -95755 179485 281110 419107 185201 -214013 -144247
7962 -144247 -319195 39602 -386070 -96091 -165790 -167124 -110180 96030 -12046 13603 156520
7951 156520 -96135 -234753 -188278 -141084 -283815 100539 100676 125540 -203955 -131934 -302511
7940 -302511 175614 199602 109756 11509 136631 -55769 -309774 -193694 -77633 -211360 -216609
7929 -216609 -145843 -227460 -9723 -94241 -132521 5537 -323994 90719 467 46373 -181954 73912
7916 -160908 -225109 20557 -34944 -249366 -120703 53212 -188428 63239 -302451 85414 -31633
7904 209518 -25081 159115 92431 -978 204540 84230 206237 -186283 -259167 -334936 -15393
7892 222158 64175 -158889 41466 -193686 -61587 138815 261161 -61371 152755 -147113
7881 -191967 237814 -191508 84677 13859 -272326 -71561 -100451 282245 -57165 -28979 61379
7869 -1872 264531 122570 -517604 258526 99734 -250657 323054 -118910 -25098 23451 15614
7858 15614 103161 -135637 43859 57126 367437 -122042 -172872 -138293 27565 -239608 -320096
7847 -320096 -267728 51108 60643 -155009 6180 174766 -1010 -118796 97298 97122 141423 -163438
7834 -21913 -210463 -17224 97962 39535 229457 -1270 239476 -73415 17212 48493 57598 -397301
7821 193141 -290347 -172999 52810 -60161 74757 303025 94869 -42557 128748 -96508 92271
7809 -126045 -393795 -276623 106959 155839 -160232 -330936 -349560 -102641 187968 192167
7799 192167 -167384 -223635 -95411 67695 -217685 -197626 137592 -61154 -27635 36551 -263639
7787 -25334 -369375 -142912 -57054 -229422 -75546 2634 -124053 53442 81588 -179048 -208267
7776 -208267 78539 -75083 -251088 45852 -657 6138 -103220 75340 13759 75551 -203633 -65426
7763 72383 201310 -44771 245194 71924 19524 -18256 150912 -85714 142158 -258217 245459
7751 68700 -71691 -55505 -161729 -94927 -148461 -128673 184739 174467 -161595 125260 -138906
7739 -175686 136867 -339284 16712 27397 -307981 40834 79789 -154910 -141156 162010 -248062
7727 -27794 -158029 60829 -144972 -158626 134892 -92329 23792 -227870 -439734 95071 -154647
7715 32353 -366582 -207178 -35992 57265 -42679 -344957 -266543 -92523 -184724 114835 -198575
7703 125347 176187 189753 -3093 48502 135540 -128285 163856 32278 -118130 174817 70916
7691 -151429 -151307 6960 85809 275743 -77027 -62402 -116489 -130334 -246392 -222085 264655 -49280
7678 170341 -259629 -4075 -321833 291119 24981 -194027 149841 -156349 -29332 26182 -142112
7666 -284774 103348 -250161 7351 -379280 -18425 136613 128226 -35287 -367382 -328064 -136370
7654 113969 -174115 17185 -162680 -133501 101073 -59882 -107075 -132949 168959 -102169 -198537
7643 -198537 116394 -41252 273207 -3663 -87895 -80968 -82533 1474 61143 -28191 -114597 -60184
7631 -60184 -223203 -375157 169596 -546055 -68740 -15991 87715 47385 -37133 -98634 -125578
7620 -125578 -192971 9812 -212771 65253 60011 100556 -93264 -194863 -207246 88782 -200623
7608 -118251 53515 78398 -39164 169458 334893 -127617 194919 80733 -148698 163657
7597 336338 -149268 151466 250171 132118 204458 -84850 21731 32276 155992 -345571 90359
7585 132380 -160227 -173750 -171162 -432979 36435 -14976 -54842 -60940 78607 197416 134272
7574 134272 239271 -66188 -11684 107090 -175341 256585 -30784 -67548 -248272 269926
7563 281555 285571 67350 119308 -386107 -181443 240434 15474 -232719 -124420 277300 -396808
7551 -180318 -145527 32815 -39538 158903 274399 -92306 22636 -111481 -33969 -154069 -292839
7540 -292839 -68319 191117 75855 -276420 255885 -234834 -53827 79514 -22260 -164672 -110048
7529 -110048 -25373 -12318 116861 -31466 300034 -107196 -15650 -314851 81700 48512 35545
7518 35545 -243156 -290852 29083 -13900 -47722 -62618 -166053 119725 -195554 -107947 -194146
7507 -194146 62422 -380343 358126 -239615 -71740 -105110 12536 143839 -384707 -133056
7496 51075 -110138 -9008 258357 -138412 105461 111509 -69901 -213828 145014 212394 -100376
7484 208526 89111 -213576 -45136 113896 -436537 -244807 -302820 260227 -14409 88343 -168750
7472 -157769 -35232 -64278 31609 -97073 -282327 -239592 -110943 -133619 96408 -96965 -149125
7461 -149125 84713 216905 -90100 -166740 -59779 158834 -190702 270837 -216140 -145324 -47717
7449 -134032 -36233 -27643 240813 374984 -68402 -66926 -11213 -173469 15926 -84282 -134118
7438 -134118 -44619 327822 86044 -122911 214813 -50648 -102241 -68558 11238 17249 124705
7427 124705 -226067 118894 158216 19425 224567 240763 -195024 -108748 -18086 -268339 -291620
7416 -291620 61852 -196642 -159999 -220951 122330 38538 -224219 -127826 183453 120230 -106395
7404 80304 -61835 -192102 -109042 227418 327787 278560 199449 -218181 7950 245097 130177
7393 130177 -356354 -242912 65023 -300869 61175 255225 170777 -147565 -81193 -187167
7383 -187167 402699 -238994 206427 123635 -24923 -106841 -109863 -67939 27494 142869 -196332
7371 -34852 14537 123927 201388 -134990 49889 75656 -44112 5635 -259533 194910 -233819
7359 114260 127963 38412 201197 -63790 68429 -195434 236592 -83409 -239399 -271749 -164440
7348 -164440 -212197 -186609 -132539 -133352 187280 -178187 -27645 -221714 -176475 30693 -61080
7336 -240097 -144842 -38638 -141198 -152401 -106761 -97977 -22781 180065 56684 108866 -29988
7324 17937 -353313 137800 137546 -188111 332162 -69471 9176 192723 129375 122780 -325895
7312 -6723 -174615 92316 -6271 215545 70319 -63574 129396 205192 -62421 -97205 -165133 22350
7299 64626 -93749 -240617 445770 -96626 219633 191048 -106804 330373 -110401 -7329 -154345
7288 -154345 -111757 87123 -57302 152794 98264 -51977 -7868 52833 -268936 137951 61717
7276 73106 -62933 9419 -272843 -303610 -1435 -445507 147105 20274 -1990 -310316 -223825 -212061
7264 -212061 -84656 -207880 -296418 171414 91521 279273 -71158 -13159 250923 -134623 -121644
7253 -121644 -54457 -158624 84245 308612 134812 40386 -173276 52514 68977 -117377 148466
7241 -127895 -18944 -169262 -634 -217049 -176999 31916 147783 -182467 -65188 259114 -281
7229 -147219 -182633 49299 -13972 152479 -41240 -309716 -76252 -37363 -60679 -129517 -26701
7217 -26344 -264317 42824 224109 150723 100238 -374306 -243773 -10111 -29760 23847 245580
7206 245580 124115 -199504 -60944 32277 249004 158470 -20108 327194 39999 16661 -126899
7194 177138 309849 -230062 -8102 -129884 -152228 -14228 -67124 -174408 -70563 -123082 12107
7182 226504 284518 204067 -15391 -36752 -212406 -57968 -180135 -359994 -76269 12979 -27460
7170 14362 117649 234111 -160512 -107371 85239 -34737 -38972 25734 -56131 -172499 -80018
7158 205116 153446 126805 -93143 36792 99302 49733 -246358 -14901 -152398 198002 -181125
7146 225078 56826 89684 115078 23234 -41142 -35690 34893 -166387 87474 412989 216887
7135 216887 -147503 19300 -109975 -326601 77778 -88451 -171949 -167515 5816 95942 -19268
7123 159545 100159 -166564 -134112 70722 74137 99405 135622 129511 -33757 -40553 -234538 -20503
7110 -415383 -18948 -124219 -37526 -190176 75117 68679 230658 193657 -221885 230895 113179
7098 -152159 133612 11494 -205573 -147347 166265 30207 40143 67561 40598 -8098 32140
7086 -187598 -73748 108483 13941 -392788 -71652 -219904 -122604 -105675 -246082 -141782 -81600
7075 -81600 264658 20680 -131467 -255492 148064 -247199 -220774 -2389 -245482 -243377 -198800
7064 -198800 -166503 13196 -15045 34452 -13251 152947 -136281 220957 -259441 372322 -108801
7052 -222285 50887 6427 112727 -410368 431 -88183 -252507 73275 237886 17081 -148825
7040 19299 -81335 -131853 21829 -53612 -154723 188475 45286 -228237 40920 -31542 330202
7028 -47658 51498 -132964 107115 -122178 267978 102344 374895 210775 73424 -129451
7017 211954 162962 -12414 32829 -19313 -339251 55235 -138997 -247651 109311 158032 -55467
7005 -137344 -340607 121211 -126610 34835 -244898 -89597 26922 103870 -13439 -170853 9143
6993 -137489 -132258 -175273 616 -272574 85613 124324 -35960 -395249 -203344 187430 133694
6982 133694 -12968 173157 103215 -405024 77271 13063 -164714 245622 -184527 -4286 157745
6970 -21486 -114423 286069 -37543 -7694 168824 -150698 -124783 -167622 163752 -109369 -125600
6959 -125600 43890 -337279 -41842 129553 113999 50185 -181682 -140345 -30527 37599 41882
6948 41882 163540 126737 66634 111224 7627 -214134 317594 -227155 154988 -104941 445952
6936 272016 82646 -366551 -87582 169042 62989 172321 107029 44019 -24655 -85204 -135395
6925 -135395 -67638 73613 -64117 -122438 -363131 -97330 -184892 97710 39112 -7970 -425088
6914 -425088 -114498 -22387 -93697 62749 60310 -100232 123980 -111819 184625 -87734 249512
6902 -139070 21533 153566 -250929 28443 -186185 192224 -89669 10020 26154 -179795 91245
6890 -89252 17535 -154023 303697 220019 97599 -34034 -297335 -26302 101035 21421 -102655
6878 23421 -69148 -24304 -196476 -140521 9308 2090 -230737 -376297 -307916 8540 -45266 -293966
6866 -293966 204867 -73461 -7190 85842 125948 17641 -80411 -8345 48810 -148588 13063 -16842
6853 -105073 97679 97888 -89800 139849 -145213 52026 -38671 -97235 -156885 -168804 315936
6841 21106 -47902 -8518 -402033 61630 -70975 -380131 -165903 -162602 -200226 -21753 229711
6829 -25849 -133462 99746 -178041 -264955 -210237 80935 51682 -24409 -20011 -118626 -363119
6818 -363119 166755 -1982 24287 -378032 -306687 -73097 158816 -210924 -62328 -117722 83928
6806 -165773 137384 -14563 -351759 -45758 227188 27225 -317170 103669 114327 -28689 -38544
6795 -38544 64659 -115861 52571 -66114 -44084 -95946 -230460 84276 110235 -274489 225855
6783 63274 -104219 -69904 192876 10762 140362 69924 106847 -379697 176335 -78007 -128288
6772 -128288 271019 -441869 45337 100696 106798 114914 246128 -291708 260585 93958 -29329
6760 249594 -508384 71977 17539 -78701 -110030 51503 128565 -172482 -93272 131066 -184297
6748 -271214 92166 93295 105034 263119 -202285 -82517 -278255 230471 62181 86736 225500
6737 225500 -39745 189433 -177347 -29013 175677 -87431 -187053 136031 -56585 -116666 232614
6725 -69847 57602 19818 170536 17737 -213732 -29773 -290723 13415 -82141 -224767 168597
6713 -429347 16008 334969 1071 -362572 -153317 -96018 -30986 -197219 -59471 -180796 216464
6701 -131158 -55825 30381 -99750 190104 36367 -193203 15650 -99976 1317 129148 118680
6690 118680 -225064 -139711 -74153 -370212 -210767 -64989 152394 117320 185718 -375794 156639
6678 -463518 -218381 330391 69828 -97676 -225311 65606 86545 67791 -2321 -221401 -45763
6666 -238362 264756 -148120 -84565 -359534 -246557 -224654 -293916 -118870 34002 -256068
6655 175079 151506 598704 -134386 -121918 -120294 66744 -281400 -269502 -51226 300756 117288
6643 -284931 162955 -56235 -39078 238290 -22795 230831 504442 79613 -16958 180856 -404769
6631 167868 -232485 117704 -78102 -40679 -114643 61405 50987 151168 -493128 -134590 -76245
6620 -76245 -283724 563342 74391 126708 -380647 17543 321921 83463 2314 -86750 55968
6608 204619 262573 -640 117139 -110893 -5941 -360604 85081 171836 110015 185556 130666 380209
6596 380209 88160 -145557 11342 -140378 9901 82949 -34816 -69740 51792 221464 56165
6584 -368314 -71627 239608 93102 133151 -195877 120730 -4078 -205763 -166809 -154269 -86725
6573 -86725 -178865 -11981 -115588 202053 -161372 271333 409908 30213 -39063 -67755 -494520
6562 -494520 80500 -63819 -81801 -67457 -146919 -38240 -40450 -237278 8301 -259266 -55525 142832
6549 38187 -373336 -295247 -191699 149574 -70732 -281637 182168 81617 39407 120299 -411542
6537 -194639 -68027 -426648 177328 -189833 15610 133334 -211920 82369 -2451 -38995 79958
6525 90986 -88676 -54286 -272077 124591 -189806 86667 -34853 102726 -58953 -202004 -21495
6513 -10675 -480220 -152101 11654 -34379 -2745 14129 -223913 136228 74729 206792 -50928
6501 -231532 -272256 -27327 162169 37385 -431838 -80325 -155639 -142909 -235181 73174 -81046
6489 -148205 -94766 70448 -122351 -126581 79889 -97643 -129065 -45782 11647 -78809 -40247 93043
6476 -88269 43780 4157 -90517 -425969 288243 168936 -66675 324894 141480 177968 110546
6465 110546 -115783 -105483 81514 131019 -368762 -428697 -112724 24408 -66900 40307 -280101
6453 -16118 -63078 -36850 -340709 261878 27909 181078 -292826 -42477 114290 -175624 -2229
6441 53319 195888 -78051 241588 -18598 120877 -88753 170423 119834 92857 -117992 -20065
6429 69578 26727 104581 -54353 -459272 226904 137344 55047 98181 85475 89265 245800
6418 245800 -3558 -85161 6710 179156 24892 -182628 -88148 152553 -189607 -13420 76140
6406 -225992 344848 280495 -144886 -285509 -97297 -107189 96561 -29908 -148323 -261104 -9289
6394 149585 65854 -50857 -141415 123657 -25825 -57592 -11559 63614 -108056 11074 -83064
6382 79883 -312695 -314358 37714 -271896 226267 -293603 -1769 136891 181789 93206 -110804
6370 -320162 216390 23745 -173702 288921 159071 62999 -54628 -232730 193716 2442 139872
6359 139872 138750 65005 -278277 -183723 -299429 -269690 -96616 274380 -27314 87492 238706
6348 238706 8376 -5459 -65995 402178 59389 178481 -109012 220505 -90500 -51519 138247
6336 159001 44203 101667 76263 -11199 9346 -128386 91569 71034 -23735 -335609 190288
6324 -202260 47329 7151 -135683 76085 -266995 -149500 7745 137536 185027 -122564 -204740
6313 -204740 47832 -206302 -252397 -127394 166915 -168495 281772 -154333 -53033 -339138
6303 -339138 -49295 -141078 136864 -301643 -214370 -11965 -82993 -107747 -12550 -112162 146997
6291 180640 -76331 140610 -269552 -80500 -80978 218900 227366 40969 -24972 80536 26337 -160293
6278 46070 -32466 -154747 -194544 -131471 -57270 -371255 2977 -84647 72710 282142 1597 -361027
6265 198852 228288 313187 -180014 24516 189334 -244466 -155764 159053 -31606 4263 58856
6254 58856 263735 -54368 9012 -162422 244983 -93227 347592 119631 165192 -110568 34990
6242 225618 71803 -22248 -16003 -217705 181155 397552 -213584 105604 -76135 -305160 -120228
6230 -45771 210768 -62740 -154898 73196 118625 155504 -19064 -155956 196741 -219773 113997
6218 -20829 110229 -110543 -119759 -192008 -78084 269183 246302 -278023 277860 -199196 101748
6206 -67789 53729 148088 182338 -95515 82772 -11991 -73190 243978 20574 39648 319905
6195 319905 -170680 119603 227287 161442 -66055 -238297 -84879 -5213 -543 -123475 228978
6183 -106428 -15934 23088 -51519 -245696 177090 -163547 -32365 -123442 -186987 -237854 -9955
6171 -200009 -102396 181609 42951 105070 6270 -253756 114195 -26635 -194769 -240569 8731
6159 -221662 272369 371847 214511 26621 314757 195783 -94623 222843 -183129 145380
6148 -41207 -144853 263653 -151932 -75013 -137788 99959 276349 279928 365232 -194859 102616
6136 40593 229420 358012 -108708 -291011 -131219 -41588 -319461 -111307 69591 191918
6126 191918 -76236 -82168 137245 -223771 -71382 -27812 158131 -99910 172500 -22853 140010
6114 197995 -253550 89647 -8364 231897 156820 -241331 -61120 -66738 -17886 51982 234207
6103 234207 35 120554 31047 76891 -93618 -136981 22308 350860 -58127 167142 199540 -10094
6090 -25389 187727 -224335 -127710 -160214 72134 14236 -29933 5837 57641 -775 -290591 131028
6077 -148069 -49951 18757 30741 28208 181452 181501 -271487 96133 148119 -207987 202450 145619
6065 145619 -145328 81347 119279 -13055 -89709 -8174 -90881 -67835 -103442 -107746 298746 -38911
6052 98924 -106852 -71510 -30994 67442 51573 -143910 243489 -6623 -437616 -199584 -17891
6040 199002 -8892 -78907 2249 -107497 -378247 -37893 24150 -177446 -115668 -48275 6763 265422
6028 265422 -226735 171116 52121 87586 -1444 -188093 59769 -84468 39672 39086 38962 194586
6016 194586 -72233 -40588 -4573 -166382 248260 -104636 -192158 -35482 -31746 -331503 -14187
6004 -65305 51148 -197134 -74166 185561 -80174 177804 100299 -104277 -59552 32090 -55596
5992 -76305 25062 396374 211689 -169360 -189530 -360104 -92960 -2960 151459 -171786 59157
5980 -222139 -333612 -161713 73916 101709 -88012 -127519 166645 143454 -120769 -71216 183403
5968 -328781 210973 -392219 282812 76361 154073 67350 101321 -168257 -234130 182462 270619
5957 270619 87881 -58602 -78430 -56624 -39742 -118006 -158909 -148407 -53905 -29034 -9410 -136701
5945 -136701 -152844 134765 65924 133771 293828 176017 -127276 -160119 -127043 190168 114495
5934 114495 -27417 -93495 -114929 143902 183951 60711 -112950 -227890 113061 -167065 158301
5922 25364 260685 205671 -154187 109319 21380 -88752 218558 150630 -186859 -297912 -51153
5910 12331 47273 -118353 -201394 170638 111403 -155897 -70516 -319878 84924 123976 149834
5899 149834 -48715 -218723 -86980 176171 -51743 -11153 -147374 -173963 -161821 -95485 42732
5887 39649 100638 330959 -11847 -103334 -453188 -171681 -84129 173317 -131361 162430 103365
5876 103365 71232 124177 -136827 61032 295494 112571 203556 -192046 -198753 75156 -146831
5864 81929 -34850 236703 -22417 63049 -27260 -38499 281186 242584 -23393 58764 -131577
5852 -336209 17743 -132869 98065 137774 54996 -51533 -43155 -123231 -197789 -143752 -38990 -63772
5840 -63772 -38563 181997 -105350 57130 -36267 -54864 38885 104169 32452 -132309 -10589
5828 221446 36640 174348 358369 -10116 114824 38910 136242 31650 -21379 -182925 266234
5816 -56301 19027 201737 14800 -240803 -191192 -63617 -334676 -140030 -93645 78730 -283333
5804 -292679 -84597 252173 -166051 -397396 -192947 148502 -105028 -155153 237106 -322458
5793 -92729 120437 121875 -80530 -120076 -194535 117780 -51537 -42446 165259 -94354 243390
5781 -22394 -112994 49539 127416 29837 43228 359646 -141929 -151304 11116 -83129 232258
5769 -43118 -65150 317074 -66235 327188 67366 -41493 20575 63078 -50167 56956 114150
5758 114150 -280613 289530 -90305 265317 -48411 129697 88169 -264273 224420 34419
5747 -82934 -275501 164450 194462 110590 142095 144452 321853 -26837 -166987 101314 -338405
5735 -134792 -236328 6896 67926 -22921 208619 68390 -231673 -147304 35317 406011 316419
5724 316419 16480 -204286 -153559 -2875 54270 -223160 -108052 378189 -36547 58659 25383
5712 155747 -18432 -223125 -348040 -193090 -126953 61697 181005 -120211 -78152 139376
5701 120101 -17128 169174 -251394 -223736 -117038 -111800 63875 -397886 401274 -162796 -100383
5690 -100383 -186278 -141854 229358 -27457 198521 -87525 -120412 -24089 -6383 653 33522 -69679
5677 -27668 -63857 78492 -36820 -48060 87448 232574 -107583 2922 -32880 94631 19 37866
5665 37866 62026 -175976 -607 -131802 -108400 53264 63041 -230606 26448 -250093 -174136 -112818
5653 -112818 238123 216046 204664 132002 141085 -284646 -98207 401860 -110549 -155063 254826
5641 -129364 -270120 111071 74867 -134722 -91032 -14085 -325680 34871 -129472 75394 -423102
5629 -112267 -73813 -80354 256723 370279 18038 24631 120066 -149484 59437 123359 -157114
5617 15496 42319 -90919 21228 -111532 -114148 77828 -137253 117906 -26416 -109896 12527
5605 -71898 34008 -153643 77255 -111107 289671 -136007 -173003 9981 -91289 10911 16866
5594 16866 -62949 -282983 60221 143207 39190 -157002 -69894 -281770 64772 181642 222147
5583 222147 -240583 -102730 -190330 -28350 -353603 122371 -362003 101386 -38592 -140590
5573 -140590 -284749 65774 -22263 -234177 -126566 -6686 228173 207087 -257079 -17224 330762
5561 278308 33605 -268884 -25487 86696 -131275 80744 245181 -81344 -80302 327765 171539
5550 171539 -73742 414179 -174872 131022 -31966 104454 -244863 211219 87217 -26132
5539 132895 45080 272751 62369 -25364 199068 -114065 345009 132564 -143655 -217955
5529 -217955 -275265 -76197 -25491 -231025 126054 -179659 441393 -529776 -17021 -55457 123755
5517 -312618 41012 287918 -179256 224976 -87559 1421 281172 -111455 -64214 361547 17273
5505 58092 -69863 156341 80733 278285 202414 -479192 -152379 32256 -78515 164321 -81115
5493 106000 -167118 223586 -11303 18698 232525 -8076 -98774 -125294 -450365 -75554 -38282
5482 -38282 -315134 106652 -97127 -212446 225060 -98007 156992 -106490 -26070 -91891 137283
5470 287944 -3780 28503 -363266 119546 -178214 -70588 -66033 296282 -42147 -74392 212045
5458 -100545 174137 150534 -212047 24375 44882 202396 21905 163479 207589 227229 -161114
5446 -96598 77221 404506 254241 -57924 -104922 253404 8216 -221616 189812 -337200 -171445
5435 -171445 -70823 82578 -158781 -78182 -215191 144735 7228 70217 -119213 -65024 -179776
5424 -179776 -286059 -144996 40239 -87119 -26206 371309 7303 93596 236145 -369280 124260
5412 223983 91906 -112549 110693 48457 97629 53047 74058 -169667 -160223 -96058 -374524
5401 -374524 252736 92877 -114375 -89912 -377173 -84533 221874 419906 53575 -52638 -89741
5390 -89741 -87350 108644 296663 76010 58343 31472 -10735 485688 119226 -153471 120162
5378 42714 277539 241842 159720 56082 334002 124718 -120158 -49865 284842 42871 -48935
5366 56651 124649 -57119 -189560 289129 135332 84086 -140655 49382 14743 -120947 -295026
5355 -295026 -114768 -144236 -184622 246690 19869 -223454 -409086 -41553 68566 -141940 -381967
5344 -381967 151987 -31059 184859 10854 64632 -145673 185868 60525 243058 103130
5333 -75561 -59642 33182 -134350 61880 130916 75331 -74691 -136670 49101 79302 212363
5322 212363 142646 101903 22440 -258139 6237 -27347 -194175 255278 84363 -153849 -217147
5311 -217147 -157192 -99686 213615 265649 104676 123054 -89545 115457 -384566 57725 -180935
5299 -291519 -65351 298166 2082 177024 -178209 -28682 133469 256755 91285 283729 13878
5287 193286 -149127 -61805 146556 -2533 -112361 -288087 308148 -11759 -259376 98093 -42056
5275 23743 322721 19008 -244569 56432 65299 28108 -327176 -32579 253817 -55536 84 190247
5263 190247 70306 86989 -25958 25991 -312975 146793 -53383 -247482 58478 4487 28234
5252 28234 -115656 895 90373 -64678 -272083 -181564 -154491 216233 348512 61716 115414
5241 115414 -85063 176355 147779 -45186 110869 100124 -149248 -184398 258302 3608 112115
5230 112115 46413 -208779 203424 -26995 -127396 -192003 -55812 89169 -370059 223285 164784
5219 164784 67229 182791 -12892 189719 95834 -54503 -271674 -49545 52358 -178826 10672
5207 27510 59049 -84853 261538 105852 -154764 299304 -116241 106785 101065 -187207 127425
5195 51441 -166896 -132260 92410 -40459 173940 -232738 -50141 203320 -413052 22959 -41623
5183 -186101 -54781 40135 78214 -132314 75617 120415 -64922 161663 -137906 80443 127879
5172 127879 203205 118036 54865 -418170 389375 -7735 125357 172700 -152773 120184 -136241
5160 133750 -293176 306607 125889 -146824 -296892 -5209 42795 249826 -92719 202132
5149 -41318 143926 136456 -314096 215660 -81395 133434 -90317 -51290 -57402 -126957 8087 -129731
5136 -356276 -72856 9501 -61228 -284708 171216 14331 -100460 71606 -101778 -97259 -80643
5125 -80643 194735 132059 -115273 -302322 33862 219274 -191071 -265379 -11604 -166647 173761
5113 -133652 87764 245615 -61365 203839 104940 256903 121560 -81904 -100422 68663 -195783
5101 -110779 123817 217608 60275 -70091 41618 -189047 23042 -260428 -151105 77190 75023
5090 75023 -18686 -184875 268693 416165 -190644 -141493 338556 245736 149914 -106544 -190294
5079 -190294 46053 26749 95544 97863 -67198 -277183 336343 90551 -208357 -115548 9910
5067 -284130 327250 70394 125570 224124 -245953 -165387 -29344 265786 -187638 -386688 -145870
5055 6626 -2197 275400 -70926 -24099 -15658 401892 153584 -55730 39776 -287011 32600 119473
5043 119473 123311 -73585 75667 -105699 -128017 -177798 216553 -28897 114329 -107912 2125
5031 64766 -288648 100379 171874 304293 -31905 181494 184858 -59790 164327 -90510 -72256
5020 -72256 -15802 -55536 -165807 251355 -135320 42799 318022 244857 -79636 -93295 13255
5008 -248436 -9667 -46863 -70799 28682 112374 187995 -218289 -229714 -191407 123587 -91429
4996 319771 164870 -326140 184330 -403117 187841 -76107 -143953 -95840 49676 39924 -164309
4984 87749 -264136 20745 -247773 55527 -69518 -144278 196420 154436 -28176 -74079 192048
4972 -192735 592156 40730 131356 281033 -86336 -199135 113687 -76103 -122124 -9652 -67994
4961 -67994 -41709 -179224 -430914 73740 378009 -27375 77914 -62276 -11121 68991 -245707
4949 -141968 -526059 294622 134531 43978 35890 -101999 124140 -84424 134158 115528 69069
4938 69069 128191 69644 49445 453307 -351610 -59987 5719 76130 168985 -184935 -38314
4926 -189665 262543 -241466 126441 148317 159922 69908 197732 95283 -130836 306218
4915 -126143 -52315 -401509 -181129 -16134 -324594 -12202 -58482 10531 -236466 245679 -274679
4903 -46455 -344223 15539 9774 -19045 424178 -208157 50682 -105173 -62140 -422882 -29091
4891 275069 333800 145843 242622 252596 -145212 -281556 88391 116233 -69058 170245 -81444
4879 -245117 -11709 -211094 -18552 196516 -116826 -71681 -196426 -79147 -134496 190489 166767
4868 166767 339601 -58633 139052 5872 -150606 10994 -86054 164378 126094 -32754 -202348
4857 -202348 -158356 339368 -240406 -48586 45986 -169526 -16729 -21397 -229362 56541 66435
4846 66435 52877 144643 -174115 59991 -20697 98202 175919 37565 -14966 22094 279227
4835 279227 -57566 227326 93134 -79938 37577 21773 -79600 -155459 138086 20482 -93377
4823 -42562 149352 -217294 -120494 80027 -137881 63195 243960 -105074 54057 362502 122862
4811 206786 -30171 131946 43921 -203806 25669 51508 93804 -249271 83761 58570 31316
4800 31316 167337 11884 -83283 -82962 199392 1413 -151955 65238 72866 8245 148807 108686
4788 108686 6778 -208559 -179875 143999 -81030 87471 72252 -306171 74283 55060 197492
4777 197492 47250 -102677 -145065 44826 -83657 -191482 28359 150939 -251199 48923 -11799
4765 -213646 28188 -39911 -136423 -105453 256068 7084 -291433 307725 -183580 133958 -185930
4753 -255300 24304 253607 170038 -82637 42650 16177 -475434 -135713 209694 -277772 -63548
4741 244371 -51988 -65472 25320 -387274 224380 53921 -324177 359521 67236 282752 -220436
4729 92976 -206659 235342 129551 121332 1199 -15291 -90472 120578 100243 260143 -141129
4717 -311692 258917 -76018 230617 139799 250862 -126561 79848 28638 -134147 -254052
4707 -254052 -117186 28072 -252656 30498 329919 -56930 9856 171934 47194 -203674 136692
4695 -55784 344448 -147645 270595 107840 172943 -33221 -63531 126965 -139782 344929
4684 38304 -7372 -34330 -71908 -180062 121679 22664 233397 108137 135093 -252223 -123403
4672 -41059 -62562 -76946 -154165 -110064 118536 -168268 -190731 103644 -28820 -121051 207425
4660 -55368 17717 -315158 -195540 139729 15127 -221075 205107 -45968 100287 -147430
4649 177083 -213035 589853 275588 -15945 -79280 -27163 117376 -257771 -88708 141194
4638 246379 112112 -15716 -32094 -44188 274565 -37841 226499 -195002 170174 11692 -7131
4626 -134562 -306870 24371 127538 238823 36848 -26984 -166350 80310 70353 -199604 43936
4614 -111905 22441 183206 -46679 -23478 -311905 -174375 -254983 -52666 -92278 -97839 -188464
4603 -188464 -192215 -225842 37564 57743 -86871 -135391 -126061 75242 115099 241161 166082 88297
4591 88297 -7561 -95397 74863 221597 -136478 295971 -184278 -91575 27116 -14082 -176939
4580 -176939 -343742 -267977 9564 111329 -74176 36400 273937 64521 -145093 192213 -139897
4568 -131271 59670 181315 -46800 12564 -19413 27052 129722 -122102 74719 -235711 -28439
4556 463305 42868 59429 84598 -68678 -305717 11572 92150 106935 39891 211971 -91168
4544 193587 202875 -39014 148575 70457 94585 -64040 -56107 -100293 154242 241684 94134 -103631
4531 -46451 359578 -263827 -54941 -20974 -93173 65730 337374 42487 28789 94937 1995
4519 38119 93613 -315378 -236183 -26198 73384 -302205 106412 -249831 -124226 129214 104428
4508 104428 -67827 -242238 91167 18904 130622 73280 -96105 258035 -131565 -156262 48716
4496 -98391 20997 -136819 -289705 -140474 -225608 -23876 5574 114023 -29133 -55540 52286
4484 -405448 262188 -134420 50961 266863 251331 119279 -106324 -45508 -22386 10960 -18836
4472 -79284 66235 -126227 170454 42335 109118 -213914 -305010 17468 149152 353295 -137572
$$ [...]
##END NTUPLES=NMR SPECTRUM
##END=
