
##TITLE=AC1183_Huila-gigante-HGIAH12027_5891346_O9vYsNOMCW
##JCAMPDX= 6.0         $$ Bruker NMR JCAMP-DX V2.0
##DATA TYPE= NMR SPECTRUM
##DATA CLASS= NTUPLES
##ORIGIN= BRUKER
##OWNER= Administrator
$$ 1.72 TOPSPIN		Version 2.1
$$ 2012-04-03 00:20:34.515 -0500  Administrator@TOPSPIN
$$ Compression mode = diff/dup
##.OBSERVE FREQUENCY= 400.13188235
##.OBSERVE NUCLEUS= ^1H
##.ACQUISITION MODE= SIMULTANEOUS (DQD)
##.ACQUISITION SCHEME= undefined
##.AVERAGES= 64
##.DIGITISER RES= 22
##SPECTROMETER/DATA SYSTEM= spect
##.PULSE SEQUENCE= noesygpps1d.comp
##.SOLVENT NAME= COFFEE_meoh
##.SHIFT REFERENCE= INTERNAL, COFFEE_meoh, 1, 14.96826
##AUDIT TRAIL= $$ (NUMBER, WHEN, WHO, WHERE, PROCESS, VERSION, WHAT)
$$ ##TITLE= Audit trail, TOPSPIN		Version 2.1
$$ ##JCAMPDX= 5.01
$$ ##ORIGIN= Bruker BioSpin GmbH
$$ ##OWNER= Administrator
$$ $$ C:\Bruker\TOPSPIN/data/COFFEE/nmr/AC1183_Huila-gigante-HGIAH12027_5891346_O9vYsNOMCW/12/pdata/1/auditp.txt
$$ ##AUDIT TRAIL=  $$ (NUMBER, WHEN, WHO, WHERE, PROCESS, VERSION, WHAT)
(   1,<2012-04-03 00:20:28.921 -0500>,<Administrator>,<TOPSPIN>,<go>,<TOPSPIN 2.1>,
      <created by zg
	started at 2012-04-03 00:08:56.718 -0500,
	POWCHK enabled, PULCHK disabled,
       configuration hash MD5:
       1A 1E CE 29 27 FD 77 03 67 4E F0 E3 C4 B2 CB 90
       data hash MD5: 64K
       19 77 04 00 5D 17 9D 99 31 ED 2D 2B F0 35 DB 33>)
(   2,<2012-04-03 00:20:32.093 -0500>,<Administrator>,<TOPSPIN>,<proc1d>,<TOPSPIN 2.1>,
      <Start of raw data processing
       efp LB = 0.3 FT_mod = 6 PKNL = 1 PHC0 = 0 PHC1 = 0 SI = 128K 
       data hash MD5: 128K
       35 70 50 DD 85 8C 66 2C DE 4A 1D 1F D8 8A 1D EB>)
(   3,<2012-04-03 00:20:33.531 -0500>,<Administrator>,<TOPSPIN>,<proc1d>,<TOPSPIN 2.1>,
      <pk PHC0 = 34.3158 PHC1 = 0 
       data hash MD5: 128K
       4B F0 1D C5 99 E2 9D 90 04 8B 0E 7A 27 8F 70 BB>)
(   4,<2012-04-03 00:20:34.109 -0500>,<Administrator>,<TOPSPIN>,<proc1d>,<TOPSPIN 2.1>,
      <abs ABSG = 1 
       data hash MD5: 128K
       F5 44 66 DB 2F 71 26 DC 13 E2 3B E1 87 F4 1A FA>)
(   5,<2012-04-03 00:20:34.203 -0500>,<Administrator>,<TOPSPIN>,<proc1d>,<TOPSPIN 2.1>,
      <abs ABSG = 2 
       data hash MD5: 128K
       08 C2 FC DD E8 35 98 61 76 87 BD 30 CA 02 59 03>)
(   6,<2012-04-03 00:20:34.281 -0500>,<Administrator>,<TOPSPIN>,<proc1d>,<TOPSPIN 2.1>,
      <abs ABSG = 3 
       data hash MD5: 128K
       F5 EA 9D C6 39 D5 1E 33 8F C9 75 97 20 54 94 96>)
(   7,<2012-04-03 00:20:34.359 -0500>,<Administrator>,<TOPSPIN>,<proc1d>,<TOPSPIN 2.1>,
      <abs ABSG = 4 
       data hash MD5: 128K
       12 BE 82 8E 69 76 F6 C5 C6 D6 24 50 6F E6 D0 A9>)
(   8,<2012-04-03 00:20:34.421 -0500>,<Administrator>,<TOPSPIN>,<proc1d>,<TOPSPIN 2.1>,
      <abs ABSG = 5 
       data hash MD5: 128K
       49 41 62 A3 1C 17 68 87 5B 11 50 FD 04 B3 32 E7>)
$$ ##END=
$$ 
$$ $$ hash MD5
$$ $$ E8 EF BB 30 96 11 85 77 2B F6 19 7E 15 4B 75 30
##$RELAX= 
##$RELAX= 
##$RELAX= 
##$RELAX= 
##$RELAX= 
##$RELAX= 
##$RELAX= 
##$RELAX= 
$$ [...]
##$TP07= 0
##$TPNAME0= <>
##$TPNAME1= <>
##$TPNAME2= <>
##$TPNAME3= <>
##$TPNAME4= <>
##$TPNAME5= <>
##$TPNAME6= <>
##$TPNAME7= <>
##$TPOAL= (0..7)
0.5 0.5 0.5 0.5 0.5 0.5 0.5 0.5
##$TPOFFS= (0..7)
0 0 0 0 0 0 0 0
##$TUNHIN= 0
##$TUNHOUT= 0
##$TUNXOUT= 0
##$USERA1= <user>
##$USERA2= <user>
##$USERA3= <user>
##$USERA4= <user>
##$USERA5= <user>
##$V9= 5
##$VALIST= <valist>
##$VCLIST= <CCCCCCCCCCCCCCC>
##$VD= 0
##$VDLIST= <DDDDDDDDDDDDDDD>
##$VPLIST= <PPPPPPPPPPPPPPP>
##$VTLIST= <TTTTTTTTTTTTTTT>
##$WBST= 2048
##$WBSW= 25
##$XGAIN= (0..3)
0 0 0 0
##$XL= 0
##$YL= 0
##$YMAX_a= 13016162
##$YMIN_a= -5984008
##$ZGOPTNS= <>
##$ZL1= 120
##$ZL2= 120
##$ZL3= 120
##$ZL4= 120
##$ABSF1= 14.96826
##$ABSF2= -5.58427
##$ABSG= 5
##$ABSL= 3
##$ALPHA= 0
##$AQORDER= 0
##$ASSFAC= 0
##$ASSFACI= 0
##$ASSFACX= 0
##$ASSWID= 0
##$AUNMP= <proc_prof1d_extract.lims>
##$AXLEFT= 0
##$AXNAME= <>
##$AXNUC= <1H>
##$AXRIGHT= 0
##$AXTYPE= 0
##$AXUNIT= <>
##$AZFE= 0.1
##$AZFW= 0.1
##$BCFW= 0
##$BC_mod= 0
##$BYTORDP= 0
##$COROFFS= 0
##$CY= 15
##$DATMOD= 1
##$DC= 0
##$DFILT= <>
##$DTYPP= 0
##$F1P= 0
##$F2P= 0
##$FCOR= 0.5
##$FTSIZE= 131072
##$FT_mod= 6
##$GAMMA= 0
##$GB= 0
##$INTBC= 1
##$INTSCL= 1
##$ISEN= 128
##$LB= 0.3
##$LEV0= 0
##$LPBIN= 0
##$MAXI= 10000
##$MC2= 0
##$MEAN= 0
##$ME_mod= 0
##$MI= 0
##$NCOEF= 0
##$NC_proc= -3
##$NLEV= 6
##$NOISF1= 0
##$NOISF2= 0
##$NSP= 0
##$NTH_PI= 0
##$NZP= 0
##$OFFSET= 14.96826
##$PC= 1
##$PHC0= 34.3158
##$PHC1= 0
##$PH_mod= 1
##$PKNL= yes
##$PPARMOD= 0
##$PPDIAG= 0
##$PPIPTYP= 0
##$PPMPNUM= 2147483647
##$PPRESOL= 1
##$PSCAL= 4
##$PSIGN= 0
##$PYNMP= <proc.py>
##$REVERSE= no
##$SF= 400.130004941032
##$SI= 131072
##$SIGF1= 0
##$SIGF2= 0
##$SINO= 400
##$SIOLD= 131072
##$SPECTYP= <>
##$SREGLST= <1H.CDCl3>
##$SSB= 0
##$STSI= 131072
##$STSR= 0
##$SW_p= 8223.68421052632
##$SYMM= 0
##$S_DEV= 0
##$TDeff= 65536
##$TDoff= 0
##$TI= <>
##$TILT= no
##$TM1= 0
##$TM2= 0
##$TOPLEV= 0
##$USERP1= <user>
##$USERP2= <user>
##$USERP3= <user>
##$USERP4= <user>
##$USERP5= <user>
##$WDW= 1
##$XDIM= 131072
##$YMAX_p= 491791027
##$YMIN_p= -454748807
##$CURPLOT= <Network HP LaserJet P1505>
##$CURPRIN= <$Network HP LaserJet P1505>
##$DFORMAT= <normdp>
##$LAYOUT= <+/1D_H.xwp>
##$LFORMAT= <normlp>
##$PFORMAT= <normpl>
##$SURQMSG= 1
$$ End of Bruker specific parameters
$$ ---------------------------------
##NTUPLES= NMR SPECTRUM
##VAR_NAME=  FREQUENCY,     SPECTRUM/REAL,   SPECTRUM/IMAG
##SYMBOL=    X,             R,               I
##VAR_TYPE=  INDEPENDENT,   DEPENDENT,       DEPENDENT
##VAR_FORM=  AFFN,          ASDF,            ASDF
##VAR_DIM=   131072,        131072,          131072
##UNITS=     HZ,            ARBITRARY UNITS, ARBITRARY UNITS
##FACTOR=    0.0627417313425165, 1,          1
##FIRST=     8223.62146879498, -102,         -86252
##LAST=      0,             1610,            -88473
##MIN=       0,             -454748807,      0
##MAX=       8223.62146879498, 491791027,    0
$$ Real data points
##PAGE= N=1
##DATA TABLE= (X++(R..R)), XYDATA
$$ [...]
66826 5018406 5034213 5046599 5055803 5063328 5069821 5074873 5078414 5080888 5082031 5080658 5075939 5068182 5058462
66813 5058462 5048166 5038372 5028444 5015767 4998471 4978294 4958950 4941610 4923769 4902730 4878081 4850246
66801 4850246 4819059 4785095 4750385 4716171 4681544 4645827 4610645 4577704 4545909 4512852 4478066
66790 4478066 4442550 4405891 4366432 4324172 4281139 4238677 4196332 4153698 4111422 4069799 4027982
66779 4027982 3985322 3942262 3899341 3856476 3813739 3771655 3730127 3688027 3644490 3599880 3555096
66768 3555096 3510730 3467301 3425361 3384789 3344594 3303896 3262601 3220889 3178721 3136188 3093738
66757 3093738 3051774 3010540 2970509 2932227 2895608 2860015 2825135 2790975 2756833 2721255 2683477
66746 2683477 2644276 2605068 2566780 2529866 2494566 2460656 2427543 2395100 2363893 2334222 2305503
66735 2305503 2276995 2248597 2220493 2192451 2163916 2134576 2104670 2075008 2046649 2019947 1993886
66724 1993886 1967085 1939679 1913377 1889346 1866754 1843855 1819872 1795452 1771917 1750482 1731444
66713 1731444 1713478 1694269 1672584 1649452 1626946 1606216 1587028 1568554 1549910 1530480 1510543
66702 1510543 1491348 1473899 1457718 1441256 1423372 1404075 1384217 1365012 1347595 1332284 1318208
66691 1318208 1304068 1289315 1274355 1259823 1246036 1232979 1220292 1207285 1193387 1178699 1163953
66680 1163953 1149923 1136988 1125013 1113355 1101120 1087821 1073871 1060242 1047604 1035862 1024503
66669 1024503 1013281 1002551 992962 984758 977307 969379 959962 948945 937231 926180 916576 907803 898362
66656 898362 887629 876837 867778 860681 854089 846744 838795 830942 823146 814767 805612 796296 787633 779878
66642 779878 772562 765100 757594 750810 745134 740045 735106 730877 727864 724855 719625 711498 702067 693015
66628 693015 684429 675792 667456 660144 653830 648118 643141 639087 635280 630774 625664 620870 616685 612390
66614 612390 607391 601979 596778 591923 587028 581666 575856 570301 566015 563394 561618 559304 555765 551486
66600 551486 547354 543610 539603 534696 529401 525213 522833 520785 516663 509861 502244 495897 491099 487044
66586 487044 483628 481459 480457 479419 477144 473535 469610 466597 464797 463122 460176 455949 451922 449154
66572 449154 446963 444023 440134 436214 433041 430766 429212 427812 425582 422000 417751 413915 410637 407350
66558 407350 404022 401279 399394 398035 396980 396223 395226 392951 389000 384192 379717 376144 373373 371063 368897
66543 368897 366815 365133 364159 363661 363130 362570 362559 363296 363956 363276 360702 356899 353196 350490 348686 347263
66527 347263 346241 346057 346490 346437 345187 343233 341300 339169 336285 333086 330837 330253 330892 331619 331115 328428
66511 328428 323942 319457 316357 314058 311261 308222 306294 305400 303786 300809 298317 298271 300099 301472 300883
66496 300883 298378 294392 289159 283269 277886 274058 272057 271324 270908 270154 269147 268312 267625 266766 266102 266612
66480 266612 268376 269871 269536 267582 265476 264007 262754 261347 260329 260490 261788 263115 262914 260220 255646
66465 255646 251321 249206 249120 248836 246419 242182 238109 235773 235309 236095 237503 238674 238326 235723 231748 228339
66449 228339 226669 226358 226487 226605 226380 225126 222597 219902 218707 219455 220983 221870 221575 220349 218696 217104
66433 217104 215678 213986 211798 209935 209580 210653 211732 211931 211946 212676 213619 213592 212590 211930 212521 213738 214284
66416 214284 213687 212667 212155 212189 211886 210513 208367 206337 204774 203311 201722 200304 199168 197838 195965
66401 195965 193976 192568 191984 192234 193483 195563 197465 198120 197601 196909 196567 196095 194915 193224 191701 190703
66385 190703 189901 188516 185995 182801 180430 180143 181626 183364 184382 185145 186541 188550 190258 190814 189992
66370 189992 188134 185944 184188 183127 182347 181438 180694 180744 181568 182397 182702 182815 183307 184073 184359 183451 181150
66353 181150 177901 174827 173236 173407 173949 173081 170718 168625 168194 168720 168430 166731 164622 163112 162067 160835
66337 160835 159319 158000 157254 157061 157246 157721 158430 159139 159301 158228 155698 152519 150230 149902 151132 152413
66321 152413 152707 152590 153579 156185 158986 160045 159075 157616 157118 157524 157915 157716 156743 154821 152246 150159
66305 150159 149513 149853 150020 149991 150998 153620 156625 158198 157773 156278 154979 154373 153935 152732 150474 148033
66289 148033 146614 146572 147406 148673 150163 151278 151191 149859 148067 146221 143922 141125 138785 137743 137687 137899
66273 137899 138327 139046 139222 137706 134633 131648 130426 131355 133566 135734 136851 136710 135804 134719 133811 133468
66257 133468 134126 135602 136811 136708 135323 133630 132728 133386 135691 138541 140004 139001 136383 133714 131421
66242 131421 128968 126501 125167 125700 127598 129906 132066 133799 134939 135725 136617 137396 136934 134392 130428
66227 130428 126840 124980 124627 124341 122935 120699 119021 118766 119453 120298 121421 123308 125618 127558 129237
66212 129237 131490 134243 136153 136236 134879 132882 130511 128057 126327 125747 125727 125735 126261 127788 129410 129681 128508
66195 128508 127175 126702 127187 128506 130289 131123 129289 124966 120596 118281 117648 117122 116528 117236 120112 124417
66179 124417 128742 131967 133241 132022 128747 124899 121866 119968 118778 117966 117510 117475 117990 119118 120389
66164 120389 120804 119847 118275 117371 117520 118023 118200 118033 117702 117208 116720 116737 117475 118531 119449 120222 120824 120726 119586
66145 119586 118208 117980 119200 120513 120350 118615 116647 115766 116190 117272 118379 119423 120685 122303 123915
66130 123915 124789 124490 123554 123231 124079 124884 123689 120248 116827 115960 117932 121286 125209 129962 134987 138349
66114 138349 138878 137677 136497 135678 134774 134171 134487 134945 134072 131892 129806 128278 126311 123538 121069 119559
66098 119559 118033 115643 113216 111847 111129 110194 109449 109649 110029 109173 107404 106359 106286 105715 104190 103344 104314
66081 104314 105733 105585 103969 102655 102658 103525 104561 105482 106109 106447 106972 107917 108482 107715 105979 104488 103416
66064 103416 101623 98495 94951 92263 90852 90703 91925 94161 96283 97589 98734 100647 102972 104510
66050 104510 104868 104642 104079 102602 99856 96472 93514 91739 91470 92480 93611 93217 90664 87234 85080
66035 85080 85343 87469 90115 92370 94119 95536 96457 96409 95357 94227 94233 95519 96818 96756 95347 93879 93388
66018 93388 93614 93630 93230 93215 94168 95420 95847 95515 95659 96773 97636 97048 95797 95770 97455 99654 101707 104441
66000 104441 108206 111232 111155 107714 102862 98539 95278 92859 91253 90543 90555 91028 91925 93294 94885 96007
65984 96007 95916 94635 93393 93793 96186 99282 101719 103553 105615 107944 109820 111142 112673 114667 116177
65969 116177 116241 115123 113896 113291 113478 114463 116048 117602 118517 118888 119290 119989 120802 121628 122520 123174 122958 121813
65951 121813 120613 120126 119881 118701 116330 113929 112642 112110 110849 108017 104371 101389 99726 98765 97593
65936 97593 96167 95300 95533 96365 96905 97053 97532 98707 100064 101156 102394 104175 105789 106097 105172 104314 104386
65919 104386 105062 105870 106914 108026 108162 106565 104079 102416 102314 103001 103300 102656 101250 99691 98656 98432
65903 98432 98839 99685 101006 102620 103951 104777 105727 107429 109553 111271 112253 112520 111885 110552 109925 111497
65887 111497 114873 118002 119585 120100 120272 119960 119264 119423 121352 124013 125493 125309 124502 123676 122245 119814
65871 119814 117156 115263 114104 113013 111842 111111 111140 111593 112039 112670 114239 117211 121048 124422 126263 126583
65855 126583 126127 125281 123626 120746 117180 114182 112567 112213 112768 114298 116777 119285 120463 119895 118570
65840 118570 117742 117727 117958 117714 116488 114227 111798 110863 112472 115753 118547 119403 118456 116396 113331 109094
65824 109094 104208 99942 97421 96874 97741 99273 101029 102885 104746 106361 107499 108140 108433 108580 108798 109148
65808 109148 109323 108986 108454 108602 109707 110887 111277 111346 112265 114112 115507 115107 112865 109853 107524 107130 109011
65791 109011 112126 114834 116318 116786 116393 114921 112786 111304 111317 112183 112690 112379 111439 109991 108283 107101
65775 107101 107041 107619 107871 107728 108086 109671 112482 116245 120557 124466 126670 126584 124873 122743 121024 120029
65759 120029 119816 120126 120350 120021 119476 119747 121579 124567 127428 129161 129784 129899 129932 130102 130826 132401 134309
65742 134309 135508 135651 135458 135674 136255 136826 137126 136490 133775 128874 123874 121518 122416 124624 126155 127102
65726 127102 128885 132034 135402 137456 137927 137979 138774 140090 140606 139494 137222 134636 131847 128601 125257
65711 125257 122635 121032 120068 119417 119073 118863 118345 117318 116016 114741 113735 113307 113567 114019 113976 113362 112614
65694 112614 111887 111036 110288 110020 109735 108213 105106 101581 98907 97159 95847 95030 95019 95558 96169 96867 97599
65677 97599 97317 94806 90623 87292 86967 89269 91783 92513 91726 91538 93830 98446 103356 106509 107321 106479
65661 106479 104946 103582 103145 103775 104523 104125 102384 100361 99205 99288 100412 102148 103770 104545 104502 104420 104653
65644 104653 104454 102967 100597 98780 98450 99169 99788 99592 98741 97911 97726 98420 99822 101598 103518 105627
65628 105627 108091 110693 112434 112128 109787 107068 105662 105476 105171 104399 104333 105682 107399 108248 108684 109993
65612 109993 112072 113336 112677 110393 107333 104343 102573 102855 104251 104454 102430 99692 98131 97510 96320
65597 96320 94505 93934 96062 100200 104339 107003 108034 108220 108504 109193 109637 108873 106705 103988 101870 100989
65581 100989 101358 102649 104412 106188 107583 108298 108271 107823 107385 106932 106013 104654 103820 104437 106100 107332 107123
65564 107123 105795 104430 103839 104004 103974 102361 98515 93383 88889 86422 86201 87779 90424 93046 94619
65549 94619 95051 95073 95074 94614 93346 91719 90334 89232 88417 88566 90398 93406 95828 96121 94249 91558 89549
65532 89549 88747 88644 88641 88774 89274 89802 89811 89581 90019 91239 92208 92186 91713 91518 91297 90413 89230 88702 88965 89336
65512 89336 89605 90297 91549 92626 92834 92223 91149 89759 88280 87343 87641 89448 92496 95910 98344 98832
65496 98832 97789 96605 96052 95718 95270 95385 96639 98119 98278 97021 95880 95874 96144 95232 93010 90627 88971
65479 88971 88050 87694 87917 88297 87816 85992 83772 82641 82974 83837 84390 84817 85697 87069 88607 90316 92426
65462 92426 94644 96147 96670 97270 99429 103261 106952 108323 106862 103957 101301 99555 98566 98191 98470 99466
65446 99466 101346 104125 106835 107660 105864 103221 102419 104203 107138 110009 112962 116059 118446 119816 121302
65431 121302 123613 125331 124547 121496 118138 115605 113687 112676 113881 117659 122236 125280 125999 125244 124306
65416 124306 124070 124605 124917 123609 120381 116612 114033 113143 113263 113631 113905 113908 113573 113058 112478 111534 109806 107367
65398 107367 104746 102394 100561 99600 99809 100744 101197 100349 98725 97590 97512 98017 98675 99774 101483 102922
65382 102922 102846 101097 98660 96298 94014 92062 91566 93443 97208 101447 105057 107397 107815 106131 103511
65367 103511 101781 101441 101047 99029 95751 93307 93448 95978 99057 100827 100810 100008 99796 100712 102167 103103
65351 103103 102938 102080 101590 102184 103516 104631 105120 105487 106370 107806 109350 110427 110589 110069 110217 112442 116300
65334 116300 119548 120734 120793 121213 121663 120800 118782 117300 117261 117919 118464 119186 120721 123257 126811 131245 135733
65317 135733 139297 142292 146330 152118 158214 162542 164476 165012 165558 167127 170049 173889 177998 182475 188182
65302 188182 195716 204964 215623 227293 238929 249283 258088 265673 271122 272402 269141 263820 258964
65289 258964 254350 248394 241258 234747 229629 224866 219418 213201 206129 197728 188159 178547 169841 162182
65275 162182 155599 150306 145957 141578 136830 132530 129271 126246 122242 117422 113272 110853 109766 108937
65261 108937 107784 106287 104317 101554 98195 95113 92925 91201 89213 87269 86483 87119 88074 88413 88648
65246 88648 89798 91792 93589 94558 94946 95114 94945 94057 92306 90219 89003 89564 91184 91887 90699 88845
65230 88845 87954 87883 87333 85924 84426 83403 82995 83662 85595 87482 87446 85408 83107 81605 80408 79398
65214 79398 79852 82589 86547 90240 93384 96052 97591 97733 97713 98678 99805 99535 98108 97173 97328 97819 98507
65197 98507 100180 102623 104210 104162 103665 103882 104201 103580 102504 102212 102732 103221 103880 105879 109056 111019 109357
65180 109357 104222 98200 94027 92769 93658 95011 95387 94453 92946 91707 90771 89587 87937 86328 85429
65165 85429 85341 85512 85164 83807 81659 79724 79191 80345 82026 82507 81115 78944 77852 78727 80814 82727
65149 82727 83915 84825 85669 85553 83395 79556 75917 74100 74095 74835 75571 76161 76484 76381 76066 75858 75477 74304
65131 74304 72531 71353 71651 72940 74027 74307 74025 73703 73792 74599 75918 76916 76874 76078 75486 75530 75655 75160
65113 75160 74066 73015 72593 72936 73805 74858 76001 77518 79674 82037 83386 82608 79922 77152 76504 78715
65097 78715 82371 85272 86531 87106 88349 90624 93529 96636 99333 100557 99767 97959 96716 96279 95713
65082 95713 95085 96109 99920 105282 109905 112717 113936 113847 112865 112252 113162 114922 115598 114417 112449 110683
65066 110683 108778 106315 104100 103319 104162 106029 108378 110608 111758 111317 109956 108659 107523 106144 104759
65051 104759 104047 104103 104609 105973 109234 114657 121057 126668 130265 131721 132245 133831 137430 141668 144404
65036 144404 145639 147741 152504 159269 166489 173840 181669 189394 195969 201631 207825 215217 222732 228764
65022 228764 232623 234565 235045 234319 232429 229249 224788 219608 214804 211338 209255 207410 203999 197840 189498
65007 189498 180987 173983 168484 163477 158540 154085 150166 145964 140917 135771 131802 129186 126800 123742
64993 123742 120427 117750 115574 112903 109566 106774 105366 104163 101169 96269 91690 89548 89946 91777
64979 91777 94172 96258 96494 93829 89403 85887 84884 85798 87261 88635 89812 90628 91161 91952 93167 94069
64963 94069 93985 93332 92886 92362 90798 88318 86410 86009 86198 85537 84028 82830 82433 82212 81848 82066 83423
64946 83423 85186 86110 85875 85084 84204 83187 81952 80607 79437 79196 80982 84857 88861 90654 90296 90207
64930 90207 91926 94157 94830 94032 93629 94520 95594 95412 93875 91939 90394 89286 88212 86999 86228 86955
64914 86955 89589 93147 95985 97244 97316 97016 96672 96012 94681 92833 91285 90839 91232 91133 89552 87094 85432
64897 85432 85686 87585 89904 91258 90714 88314 85189 82883 82379 83673 85931 87885 88491 87692 86361 85268
64881 85268 84295 82856 80717 78220 76152 75597 77220 80166 82335 82373 80948 79589 79021 79302 80658 82943
64865 82943 84837 84966 83622 82274 81591 81159 80837 80934 80992 79848 77280 74488 72638 71983 72512 74194 76232
64848 76232 77432 77847 78835 80919 82802 83212 82573 82005 81819 81912 82610 83862 84443 83304 81335 80630 82198
64831 82198 85250 88412 90802 92083 92287 91555 89738 86691 83334 81590 82427 84614 86296 87151 87965 88759
64815 88759 88714 87596 85898 83838 81674 80865 83087 87572 90975 90808 87969 85073 83402 82636 82685 84140
64799 84140 86828 89209 89769 88499 86681 85662 86120 88021 90664 92826 93553 93225 93436 95234 97600 98382
64783 98382 96844 94542 93257 92856 91987 90309 88861 88341 88156 87548 86763 86565 87228 88559 90353 92142
64767 92142 92910 91955 90084 89246 90634 93435 95677 96141 95269 94330 93987 93790 92979 91500 89950 88590 86962
64750 86962 84839 83222 83673 86558 90477 93730 95825 97151 97791 97588 97152 97590 98861 99362 97940 95635
64734 95635 94454 94751 94808 93050 89878 87113 86284 87569 89868 91713 92547 93176 94545 96188 96615 95231
64718 95231 92969 90856 88909 86901 85222 84255 83657 83108 83248 84920 87873 91049 93939 96734 99230
64703 99230 100509 99974 98164 96365 95772 96963 99669 102875 105419 106663 106594 105604 104409 103696 103274 101917
64687 101917 98786 94893 92451 92702 94965 97699 99760 100475 99472 97101 94685 93740 94882 97537 100457
64672 100457 102400 102754 101933 101059 100918 101158 100675 98811 96129 94029 93665 95179 97748 100185 101561 101662
64656 101662 101216 101524 103408 106350 108827 109550 108233 105487 102436 100292 99584 99736 100037 100949 103445 106866
64640 106866 108741 107590 104963 103605 104311 105669 106392 106619 107062 108066 109549 110975 111398 110461 109280 109398
64624 109398 110862 112282 112841 113187 114283 116346 119069 121756 123028 121621 118001 114100 110962 107750 103684
64609 103684 99595 96530 94026 91206 88780 88339 89967 92098 93701 95150 96761 97871 98030 97984 98640
64594 98640 99709 100221 100010 99943 100869 102827 105153 106921 107431 106702 105561 104989 105490 107146 109739 112328 113201
64577 113201 111298 107716 104842 103611 102566 100171 97202 95836 96938 99359 101732 103718 105466 106992
64563 106992 108469 110072 111090 110203 107257 103876 101648 100613 100304 101081 103070 104581 103454 99964 96893
64548 96893 96477 98450 101273 103906 105817 106590 106583 107241 109734 113549 117081 119360 120611 121391 121867 121957 121654
64531 121654 120989 119896 118318 116443 114761 113716 113322 113314 113702 114714 115949 116183 114695 112401 110901 110562
64515 110562 110343 109448 108316 107853 108361 109358 109907 109220 107596 106617 107564 109740 111350 111916 112596 114030 115434
64498 115434 116301 117444 119348 120776 120265 118142 115821 113859 112020 110729 110995 112908 115378 117426 118845
64483 118845 119558 119266 117917 115891 113562 111146 108971 107399 106481 106026 105807 105382 104126 102086 100439 100323
64467 100323 101403 102362 102646 102967 104146 106288 109075 112027 114349 115364 115417 115667 116584 117182 116177 113630
64451 113630 111137 110502 112269 115288 117624 118069 116835 114839 112744 110932 109746 108952 107404 104368 101177
64436 101177 100375 102779 106269 108075 107614 106350 105462 104631 103129 101306 100506 101727 104687 108226 111341
64421 111341 113512 114208 112887 109986 107415 107129 109158 111609 112651 111885 109843 107123 104517 103183 103831
64406 103831 105865 107864 108938 109342 109917 111177 112901 114358 114981 114920 114888 115470 116738 118465 120357 122007
64390 122007 122973 123157 122858 122342 121610 120621 119311 117322 114361 111272 110119 112291 116597 120042 120719 119447
64374 119447 118394 118627 119448 119703 119073 118138 117758 118608 120811 123528 125191 124794 123185 122667 124871 129085
64358 129085 132858 134240 133307 131664 130903 131704 134172 138356 143900 149248 152056 151139 147801 144575 142678
64343 142678 141530 140711 141055 142903 144274 142293 136507 129721 125290 124245 125139 125854 125166 123210 121026
64328 121026 119461 118283 116660 114595 113331 113980 116172 118639 120902 123704 127547 131326 133046 132007
64314 132007 129759 128348 127936 127019 124989 123306 123384 124412 124608 124063 124650 127004 129252 129466 128148 127317
64298 127317 127949 129373 130709 131817 132831 133552 133581 132819 131787 131423 132294 134035 135921 137861 140064 141815
64282 141815 141794 140106 138833 139637 141714 143128 143361 143289 143312 143111 142988 143780 145236 146017 145810 146058 147853 150218
64264 150218 151492 151556 151611 152253 152880 152955 152908 153568 155175 157101 158340 158371 157790 157972 159730 162428 164731 166158
64246 166158 167401 169130 170999 172139 172321 172195 172405 172899 173400 174224 176124 179222 182636 185480 187774 189932
64230 189932 191804 192999 193943 195660 198400 201370 204128 207264 211182 215191 218839 223395 230547 239632
64216 239632 247500 251644 252565 252486 252489 251800 249484 245885 242177 239089 236445 233793 231157 229075 227829 226800
64200 226800 224847 221512 217642 214605 212973 212245 211725 211276 211092 211017 210393 208618 205860 203270 202292 203398
64184 203398 205435 206636 206482 206254 207536 210559 214431 218514 222801 227158 231189 235124 240005 246461 253741
64169 253741 260427 265651 269315 271790 273941 276800 280280 282648 282263 279594 276542 274024 271515 268942
64155 268942 267350 267061 266583 264502 261501 259289 258118 256588 253672 249793 245925 242714 240617 240086 241274
64140 241274 243923 247538 251299 254183 255954 257826 261188 265656 269329 271087 271577 271735 271579 271122 271288
64125 271288 272776 274721 275736 276033 277322 280460 284193 286657 287409 287497 287899 288549 288960 289399 291110 295192
64109 295192 301379 308109 313884 318411 322436 326796 331817 337344 343032 348703 354687 361774 370643 381318
64095 381318 393235 405789 418797 432707 448358 466266 485864 505622 524128 540938 556321
64084 556321 570478 583285 594497 603820 610776 614865 615955 614414 610803 605434 598262 589270 578945
64071 578945 568100 556983 544877 531143 516495 502659 490805 480948 472752 465966 459808 453067
64059 453067 445589 438968 434934 433418 432792 431524 428991 425263 420939 416978 414086 412552 412938 415992 421138
64044 421138 426060 429198 431993 437134 445056 453941 463024 473790 487381 502670 517899 532707 547435
64031 547435 561658 574884 587843 601644 615946 629179 640378 649744 657568 663687 668122 671247
64019 671247 672893 671930 667253 658979 648429 637106 625803 614556 603244 592184 582151 573915 567805
64006 567805 563569 560503 557890 555636 554383 554716 556456 559061 562518 567244 573303 580353 588247 596878
63992 596878 605498 613256 620680 629762 642144 657904 676297 696724 718522 740768 763028 785561
63980 785561 808218 830026 850665 871538 894355 919102 944197 968055 989618 1007978 1022762
63969 1022762 1034853 1045885 1057048 1068894 1081792 1095745 1110143 1124507 1139035 1153595 1166877
63958 1166877 1177853 1187608 1198192 1209739 1220299 1228661 1235793 1243026 1250268 1256891 1263259 1270410 1278887
63945 1278887 1288764 1300340 1314096 1330297 1349093 1370648 1394758 1420823 1448668 1479108 1513372
63934 1513372 1552355 1596618 1646475 1701580 1760934 1823947 1891205 1963775 2042074 2125956 2215732
63923 2215732 2312576 2417979 2532957 2657486 2790442 2930506 3077722 3234060 3402008 3582681
63913 3582681 3775668 3980643 4198790 4432743 4685587 4960109 5258833 5584543 5940605
63904 5940605 6330807 6759268 7231182 7753658 8335030 8982645 9701591 10495987 11370898
63895 11370898 12331733 13381109 14516502 15730858 17014729 18357269 19745685 21164600
63887 21164600 22596089 24019475 25410286 26739551 27975125 29085144 30041855 30823903
63879 30823903 31416396 31809336 31995696 31970492 31731412 31280337 30624750 29778678 28763149
63870 28763149 27605355 26335766 24984373 23578504 22142953 20700607 19272190 17875912
63862 17875912 16527953 15242720 14031743 12902289 11857573 10898288 10023676 9231490
63854 9231490 8517664 7876313 7300188 6781870 6315352 5896343 5520640 5182614 4876091
63845 4876091 4596571 4341834 4110365 3899895 3707461 3530031 3364811 3209562 3063084
63836 3063084 2925143 2795704 2674349 2560228 2452174 2348904 2249535 2153815 2061545 1972098
63826 1972098 1885083 1801109 1721088 1644975 1572076 1502509 1437191 1376213 1318370 1262809 1210257
63815 1210257 1161858 1117382 1075325 1034494 995005 957921 924258 894198 867024 841890 818579
63804 818579 797264 777783 759734 743290 729163 717594 707884 699063 690478 681783 673065 665194 659271
63791 659271 655482 653085 651609 651207 651593 651623 650544 648862 647282 645308 641558 635129 626157 615328 603228
63776 603228 589950 575134 558790 542095 526671 512830 499198 484398 468504 452522 437222
63765 437222 422931 409812 397848 387062 377996 371156 365579 358895 349612 338768 328710 320774 314587
63752 314587 308882 302393 294682 286819 280600 276564 273481 270308 267599 266145 265280 263673 261019 257824
63738 257824 254369 251199 249796 251037 253259 253462 250549 246144 242296 239662 237940 236668 235246 233238
63724 233238 230964 228952 226748 223337 218940 215292 213715 213751 213996 213472 211858 209247 206295 204073 203191
63709 203191 203252 203265 202419 200586 198571 197664 198342 199511 199638 198463 196903 195583 194419 193543 193468 194199 195097
63692 195097 195907 196996 198349 199245 199311 199130 199471 200530 202137 203994 205482 206022 205885 205939 206371 206504 206108
63675 206108 206055 207254 209786 213397 217937 222772 226618 228823 230336 232893 237572 244296 252044 259176 264303
63660 264303 267460 269965 272800 275669 277792 278724 278108 275782 272778 271054 271234 271524 270053 267579 266615
63645 266615 268229 270951 272620 272202 269903 266677 263855 262338 261804 261170 259868 258158 256360 254482 252528
63630 252528 250440 247725 243947 239747 236683 235768 236586 237976 239068 239567 239601 239612 240067 241209 243369 247326
63614 247326 253572 261070 267558 271676 274327 277474 281948 286889 291013 293829 295674 297079 298169 298390
63600 298390 296870 293404 289159 285999 284927 285310 285625 284719 282345 279050 276011 274622 275543 278025 280578
63585 280578 282423 283996 286126 289275 293660 299359 305859 312156 317872 323779 330628 338049 345443 353404
63571 353404 363067 374362 386288 398979 414004 432072 451805 471563 491392 512256 534374 557591
63559 557591 582694 610896 642163 675225 709135 743765 778767 813248 846780 879805 912488
63548 912488 943670 971243 993183 1008268 1016567 1019597 1019419 1017231 1013122 1007203 1000287 993262 986419
63535 986419 979691 972793 964588 953028 936612 915772 892343 867977 843611 819959 797429 775486
63523 775486 753094 730264 708671 690196 675197 662588 651410 641794 634314 628675 623434 617241
63511 617241 610386 604735 601810 601279 601891 603696 608248 616364 626737 637704 649646 664441 682944
63498 682944 704294 727759 753836 782961 814288 846579 879503 913154 946918 979809 1011431
63487 1011431 1041558 1068952 1091696 1108785 1120597 1127829 1130915 1130572 1127981 1124089 1119389 1114558 1110322
63474 1110322 1106159 1099921 1089444 1074116 1054515 1031096 1003941 973388 940233 905389 869675 833636
63462 833636 797348 760798 724774 690730 659311 629646 600819 573434 548868 527490 508648
63451 508648 491986 477474 464309 451296 438675 428109 420187 413153 405181 396938 390534 386422 382796
63438 382796 378131 373078 369440 368145 368690 369829 370313 369561 368268 368055 369922 373296 377036 381052 386234
63423 386234 392962 400480 407809 414557 420561 425477 429171 432010 434174 434994 433528 429689 424428 418983
63409 418983 414304 410915 408762 407269 405995 405188 405336 406409 408130 410804 415104 420907 427034 432331 436454
63394 436454 439522 441760 443793 446620 450820 456300 463029 471253 480549 489633 498027 507193 518843 532609
63380 532609 546739 560908 576793 595622 616733 639405 664831 694816 729140 765568 802338
63369 802338 839421 877262 915614 954231 993810 1035449 1079611 1126184 1174984 1225361 1275487
63358 1275487 1322914 1365910 1403644 1435166 1459097 1474662 1482405 1483493 1478923 1469883 1458296 1446123
63346 1446123 1434105 1421661 1407879 1392027 1373162 1350037 1321861 1288897 1251937 1211432 1167611
63335 1167611 1121594 1075969 1033667 996011 962098 930237 899712 870929 844510 821056 801449
63324 801449 786211 774390 764223 755327 749285 747504 749508 754093 761101 770903 782990 796471 811609
63311 811609 829526 850625 874485 901087 930895 963788 999133 1036791 1076796 1118215 1159765
63300 1159765 1201427 1243622 1284675 1321149 1351443 1377105 1399421 1416503 1425485 1426366 1421818 1413883
63288 1413883 1402680 1388127 1371324 1353923 1337072 1321017 1304964 1287340 1266753 1242614 1214591
63277 1214591 1182266 1146145 1108334 1071043 1034661 998224 961465 925398 891198 859534 830859
63266 830859 805196 781517 758262 734711 711322 688932 668336 650372 635377 622588 610991
63255 610991 600757 592901 587545 583573 580078 577086 574628 572236 569824 568099 567482 567381 567053 566515 566010
63240 566010 565175 563366 560382 556374 551498 546171 541314 537789 535822 535185 535457 535582 533846 529312 523374
63225 523374 519098 518557 521006 523835 525096 524888 524463 524576 525141 526310 529063 534160 540810 547080 551699
63210 551699 555098 558707 563677 570278 577934 585583 592425 598588 604841 611536 618201 624363 630390 637248
63196 637248 645644 655648 666899 678837 690865 702658 714415 726635 739578 752996 766540 780498
63184 780498 795974 814089 834954 857686 881430 906013 931472 957636 984727 1013879 1046267
63173 1046267 1081728 1118896 1156635 1194736 1233259 1272038 1311085 1350763 1391014 1430826 1469009
63162 1469009 1505427 1541137 1577406 1614686 1652340 1689095 1723785 1755749 1784581 1809629 1830015
63151 1830015 1845172 1855114 1860066 1859849 1853615 1840175 1818845 1790257 1756199 1718449 1677972 1635486
63139 1635486 1592462 1550962 1512527 1477662 1446340 1418539 1394338 1373992 1358040 1346997 1340942
63128 1340942 1339704 1343194 1351020 1361958 1374626 1388875 1405907 1426805 1451436 1478845 1507942 1537493
63116 1537493 1566194 1593511 1620098 1646818 1673530 1699303 1723650 1747031 1769996 1792158 1812117
63105 1812117 1828333 1840007 1847078 1849383 1845998 1835750 1818338 1794603 1765591 1731670 1692832 1649760
63093 1649760 1604378 1559196 1515967 1474954 1435655 1398227 1363686 1332420 1303110 1274026 1245241
63082 1245241 1218767 1196286 1177505 1161007 1146082 1133096 1122389 1113422 1105119 1096823 1088801 1081797
63070 1081797 1076121 1071357 1067041 1063236 1060030 1056864 1053098 1049241 1046836 1046784 1048318 1050021 1051571 1054061
63056 1054061 1058698 1065400 1072678 1078823 1083232 1086549 1089677 1093026 1096836 1101586 1107529 1114187 1120957 1128020
63042 1128020 1136114 1145578 1156072 1166832 1176693 1184531 1190726 1197653 1207392 1219104 1230055 1239132 1247687
63029 1247687 1256715 1265134 1271805 1277594 1284001 1290888 1297119 1302809 1309380 1317595 1326939 1337042 1348621
63016 1348621 1362694 1379501 1398445 1418670 1439660 1461635 1485266 1510729 1537267 1564068 1591323
63005 1591323 1620048 1651220 1685552 1723650 1765710 1811177 1859327 1910021 1963419 2019218 2076852
62994 2076852 2136358 2198459 2263838 2332809 2405543 2482009 2561710 2643913 2728031 2813191 2897677
62983 2897677 2979673 3058790 3136291 3213546 3290768 3367321 3442591 3516184 3587760 3657202 3724646
62972 3724646 3789896 3851865 3908861 3959241 4001520 4034038 4055007 4062952 4056813 4035673 3998948 3947230
62960 3947230 3882733 3808497 3727238 3641230 3552999 3465265 3379900 3297503 3218418 3143825 3075464
62949 3075464 3014830 2963155 2921654 2890824 2869679 2856592 2851028 2853770 2865472 2885715 2913401 2947111
62937 2947111 2984842 3024479 3065129 3107301 3151277 3195974 3239962 3282910 3325313 3367263 3408156
62926 3408156 3447093 3482810 3513386 3536698 3551100 3555424 3548820 3531165 3503102 3464827 3415137 3352603
62914 3352603 3277718 3193107 3101570 3004692 2903532 2799791 2695655 2592911 2492853 2396753
62904 2396753 2305664 2219577 2137397 2058348 1983160 1913415 1849777 1791490 1737641 1688172 1643308
62893 1643308 1602714 1565816 1532333 1501810 1473356 1446782 1423282 1403637 1386260 1368661 1350632
62882 1350632 1334061 1319456 1304895 1289254 1274333 1262156 1251731 1240443 1227706 1215213 1204019
62871 1204019 1193292 1181931 1169804 1157093 1143789 1130284 1117462 1105745 1094805 1084515 1075511
62860 1075511 1068386 1062754 1057366 1050907 1042786 1033602 1024888 1017955 1012889 1008883 1005335 1002210 999508 996916
62846 996916 994118 991170 988519 986696 985753 984922 983193 980408 977397 974948 973133 971725 970514 969022 966859
62831 966859 964770 964292 965679 967151 967045 965694 964155 962090 958413 953382 948446 944212 939926 934980 929806
62816 929806 925248 921910 919986 918829 916996 913614 909331 905010 900119 893664 886083 878713 871922 865512
62802 865512 860446 857904 856506 852854 845575 836939 829655 823955 818904 814731 812145 810558 808654 806064
62788 806064 803184 799995 796388 793151 791307 790682 790205 789487 789184 789853 791238 792696 793752 794361 795122 796988
62772 796988 800222 803910 807025 809601 812183 814501 815722 816022 816877 819340 822625 825018 825928 826506 828148
62757 828148 830853 833441 835296 837423 841565 848585 858004 868777 879924 890470 899535 906927 913530
62744 913530 920890 930372 942497 956779 972333 988945 1007479 1028960 1053445 1080085 1108024 1136806
62732 1136806 1166279 1196813 1229554 1265864 1306460 1351475 1401105 1455626 1514999 1579079 1648048
62721 1648048 1722046 1800723 1883976 1972827 2068532 2170922 2278641 2390987 2508274 2630130
62711 2630130 2754498 2878705 3000651 3118564 3230325 3333271 3424002 3498465 3553354 3587707
62701 3587707 3602158 3596536 3569673 3522057 3457146 3378912 3288970 3187242 3074766 2954785 2831337
62690 2831337 2707527 2584961 2464157 2345528 2230152 2119427 2014166 1914764 1822085 1737038
62680 1737038 1659024 1586095 1517333 1454006 1397624 1347783 1302775 1261413 1223354 1188346 1156277
62669 1156277 1127560 1102685 1081739 1064689 1051326 1040345 1029556 1018077 1007534 1000059 995856 993857
62657 993857 993997 997232 1003613 1011865 1021092 1031887 1045541 1062947 1084265 1108895 1135778 1164418 1195729
62644 1195729 1231249 1271506 1315624 1362544 1412311 1466341 1526686 1594673 1669802 1750172 1834225
62633 1834225 1921636 2012506 2106637 2203900 2304004 2404905 2502473 2593000 2675261 2748907 2811573
62622 2811573 2859127 2888479 2898921 2891182 2866727 2827757 2776207 2712445 2636222 2549054 2454505
62611 2454505 2355980 2255433 2154262 2054028 1955854 1860245 1767973 1680118 1596958 1518026 1443724
62600 1443724 1375550 1313922 1256927 1202348 1150213 1102216 1059124 1019936 983599 950483 921632
62589 921632 896926 874460 851902 828421 805151 783788 765092 748848 734653 722069 710345
62578 710345 698863 687890 678202 669903 662149 654081 645592 637194 629649 623545 618644 613820 608401 603457
62564 603457 600938 601456 603640 605759 607282 608910 611784 616586 622561 627562 630114 631547 635012 642287
62550 642287 652661 664933 678892 694192 709359 723248 736634 751268 768030 787042 808974
62539 808974 834918 865077 898562 934602 973466 1016173 1063547 1115301 1169862 1225657 1282804
62528 1282804 1342768 1405898 1470224 1533351 1594411 1652920 1706673 1752578 1789358 1817735 1837653
62517 1837653 1846874 1842997 1825862 1797471 1760544 1717765 1671285 1621871 1568965 1512484 1454271 1397076
62505 1397076 1342422 1290130 1239582 1190598 1143325 1098367 1057164 1021287 990753 963593 937595
62494 937595 912153 888126 866360 846904 829356 813304 798399 784323 770732 757107 743080
62483 743080 729162 716722 706558 697868 689384 681252 674832 670730 668177 666550 666212 667275 668777 670154
62469 670154 672680 678173 686703 696749 707354 718946 732032 746298 761336 777394 795012 814546
62457 814546 836367 861073 889233 921165 956874 995759 1036745 1079493 1125356 1175962 1230645
62446 1230645 1286365 1340604 1393216 1444702 1493789 1537995 1575978 1607869 1633269 1650204 1656574
62435 1656574 1651848 1636903 1612939 1581215 1543422 1501442 1456654 1409918 1362227 1314709 1267817
62424 1267817 1221249 1175223 1131331 1091277 1055038 1021294 989703 961542 937538 916253 895718
62413 895718 876005 858957 845716 835705 827942 822064 817726 814136 810785 808030 806445 806113 806902 808846
62399 808846 811807 815210 818547 821863 825534 829953 835626 843017 851931 861464 870919 880398 890233 900359
62385 900359 910666 921401 932548 943115 951686 957644 961296 962851 961678 956686 947163 933292 916217
62372 916217 897654 879201 861742 845337 829511 813687 797607 781551 766066 751438 737624
62361 737624 724684 713042 703205 695400 689459 684789 680591 676659 674099 674633 678714 684712 690438 695256
62347 695256 700321 706960 715384 725051 735778 748113 762604 778806 795093 809617 821598 831754
62335 831754 841507 851793 862418 872252 880024 885172 888202 890205 891988 893583 894412 893932 892326 890668
62321 890668 890045 890418 890913 891626 894401 900952 910671 921548 933253 948044 968243 993883 1023477 1056182
62307 1056182 1092285 1132210 1176238 1225207 1280588 1343386 1413065 1487535 1564230 1641552 1719530
62296 1719530 1798892 1879342 1959032 2035674 2107411 2172141 2226818 2268530 2296446 2312092 2317539
62285 2317539 2313618 2299828 2275525 2240944 2197249 2145797 2087619 2023922 1957024 1890066 1825141
62274 1825141 1761987 1699223 1636918 1577270 1522483 1472373 1424619 1377261 1330536 1286157 1245198
62263 1245198 1207078 1170516 1135070 1101570 1071365 1045333 1023477 1005173 989811 977116 966681
62252 966681 957468 948538 940466 935052 932922 932103 929896 925735 921191 917546 914567 911547 908237 904472
62238 904472 900030 895304 891199 887888 884463 880253 875805 872219 870091 869340 869304 869057 868647 870112 875833
62223 875833 885385 895496 903927 912005 922289 935240 949775 965910 984711 1006103 1028724 1052018
62211 1052018 1076793 1103448 1131156 1159373 1188979 1221432 1257727 1298685 1345307 1397983 1455755
62200 1455755 1516956 1580480 1646274 1714845 1786334 1859792 1933264 2004732 2072738 2135733 2191168
62189 2191168 2236003 2268203 2287378 2294123 2289218 2273262 2246412 2208612 2160763 2105660 2046950 1986864
62177 1986864 1925379 1861543 1795149 1727231 1659723 1594827 1534136 1478119 1426715 1380259 1339333
62166 1339333 1303876 1273151 1246582 1223960 1204900 1188904 1175927 1165950 1157797 1149477 1140199 1131358
62154 1131358 1124902 1121255 1119227 1117341 1114681 1110985 1106705 1102928 1100744 1100645 1102481 1105626 1109143 1112305
62140 1112305 1115306 1119008 1123766 1129071 1134737 1141829 1151700 1164416 1178778 1193815 1209754 1227537 1247688
62127 1247688 1269615 1291805 1312952 1333224 1354134 1376752 1400288 1423067 1444797 1467215 1492227
62116 1492227 1519923 1548894 1578242 1608829 1642498 1680526 1723175 1770391 1822264 1878439 1937610
62105 1937610 1998284 2059876 2122306 2184240 2242409 2293295 2335306 2368871 2394772 2413118 2424045
62094 2424045 2428597 2428222 2423491 2413775 2398184 2376598 2349857 2319489 2287395 2255306 2224007 2193326
62082 2193326 2163343 2135372 2111049 2090401 2071638 2053243 2035650 2020387 2007979 1997286 1986611
62071 1986611 1974957 1962473 1950324 1940052 1932549 1927563 1924399 1922885 1923304 1925734 1930060 1936458 1945281
62058 1945281 1956510 1969781 1984783 2001208 2018661 2037324 2058345 2082577 2109036 2135702 2162015
62047 2162015 2189526 2219820 2252874 2288065 2325717 2366721 2411207 2458567 2508446 2560869 2615364
62036 2615364 2670522 2724446 2775584 2823633 2870081 2917435 2967245 3019119 3071983 3125705 3180637
62025 3180637 3236076 3290342 3342503 3393164 3443409 3493865 3545130 3598204 3653805 3711707 3771391
62014 3771391 3832979 3896910 3963018 4030728 4100198 4172563 4248819 4328946 4412282 4498121 4585534
62003 4585534 4673138 4759722 4844848 4928108 5007821 5081253 5146414 5203239 5252881 5296413 5334401
61992 5334401 5367071 5394328 5415970 5432346 5444582 5453934 5461434 5468314 5475971 5484837 5494039 5503072 5513193
61979 5513193 5526073 5541648 5558684 5577153 5598402 5622829 5649044 5675845 5703475 5732050 5760163
61968 5760163 5786270 5810547 5834202 5857694 5880782 5903495 5925637 5945758 5962140 5974798 5985229
61957 5985229 5994146 6000790 6004702 6006948 6008936 6010878 6011993 6011644 6009848 6007248 6004945 6003729 6003131 6001834
61943 6001834 5999490 5997464 5997225 5998647 6000636 6002862 6005779 6009172 6011799 6012792 6012603 6012166 6011693 6010674 6008483
61928 6008483 6004499 5998092 5989293 5979308 5969693 5960864 5951980 5942411 5932686 5923585 5914723 5904626 5892045
61915 5892045 5876789 5859453 5840834 5821561 5801786 5781139 5759298 5736600 5713646 5690408 5666174
61904 5666174 5640339 5612622 5582579 5549797 5514865 5479225 5443620 5407607 5371261 5336173 5303489
61893 5303489 5271818 5238913 5205240 5174016 5147218 5123219 5099311 5075286 5053215 5034438 5018154
61882 5018154 5002861 4988221 4975451 4966515 4962748 4963689 4967443 4972811 4980786 4993302 5010791 5031901 5055554
61869 5055554 5082346 5113812 5151248 5195525 5247128 5305815 5370837 5442044 5520495 5607760 5705127
61858 5705127 5813611 5933912 6065936 6209247 6364907 6536405 6727986 6942415 7181154
61849 7181154 7446302 7741221 8069308 8433300 8836141 9281708 9774105 10316605 10911474
61840 10911474 11560146 12262687 13016636 13815929 14650121 15503705 16355321 17176766 17932455
61831 17932455 18581262 19081946 19400415 19515336 19420362 19123881 18647280 18021500 17282216
61822 17282216 16465144 15602739 14722246 13845181 12988288 12164855 11384627 10652800 9970526
61813 9970526 9337372 8753096 8216964 7726495 7277902 6867460 6491890 6148059 5833398
61804 5833398 5546430 5285902 5049271 4832802 4633465 4450164 4282779 4130450 3991229
61795 3991229 3863289 3745957 3639213 3542338 3453624 3371680 3296445 3228223 3166112 3108424 3054576
61784 3054576 3005318 2960795 2919702 2881102 2845872 2815169 2788358 2763863 2741563 2722840 2708283
61773 2708283 2696658 2686415 2677263 2670046 2665786 2664938 2666885 2670133 2673747 2678543 2686089 2696614 2708935
61760 2708935 2722524 2738455 2757873 2780504 2805306 2831897 2860728 2892433 2927721 2967592 3013030
61749 3013030 3064423 3121506 3183791 3251093 3323890 3403188 3489779 3583838 3685644 3796337 3917199
61738 3917199 4048288 4188717 4338292 4498030 4668978 4851681 5047173 5257407 5483938
61729 5483938 5726996 5986652 6264245 6561823 6880763 7222005 7587643 7981632 8409147
61720 8409147 8875831 9387409 9949078 10565015 11239028 11976055 12782731 13666226 14632503
61711 14632503 15685670 16828515 18062756 19387816 20798644 22284015 23825419 25395104
61703 25395104 26953202 28446625 29811927 30980753 31885733 32467732 32685811 32526360 32005153
61694 32005153 31161434 30049723 28733355 27277974 25743593 24179096 22622702 21105274
61686 21105274 19650998 18275535 16986189 15785258 14673042 13648252 12707547 11846184
61678 11846184 11059098 10341093 9686486 9089221 8543580 8044963 7590069 7176079 6799393
61669 6799393 6455403 6139729 5849302 5581943 5335444 5107798 4898065 4706125 4531373
61660 4531373 4372026 4225515 4089164 3960822 3839710 3726633 3622580 3526849 3437065 3351144
61650 3351144 3268743 3190731 3117981 3050965 2989751 2933649 2881070 2830289 2780433 2731563 2684032
61639 2684032 2638046 2593605 2550309 2507221 2463513 2419582 2377156 2337716 2300919 2265037 2228929
61628 2228929 2192959 2157940 2124099 2091618 2061347 2033913 2008559 1984018 1960363 1938732 1919213
61617 1919213 1900458 1881876 1864774 1850349 1837686 1825043 1812413 1801308 1792221 1783647 1773886 1762763
61605 1762763 1751211 1739936 1729157 1719141 1710270 1702414 1694653 1686064 1676817 1668131 1660852 1654359 1647388
61592 1647388 1639631 1631871 1624811 1618809 1614640 1613099 1613351 1613012 1610721 1607524 1604775 1601842 1597273 1591392
61578 1591392 1586172 1582942 1581679 1582204 1584409 1587259 1589167 1589808 1590469 1592278 1595206 1599038 1604012 1609780 1614830
61563 1614830 1617931 1619653 1621726 1625208 1629747 1634258 1637844 1640261 1641823 1642710 1642306 1639633 1634546 1628079
61549 1628079 1621369 1614694 1607808 1600798 1594157 1588165 1582471 1576357 1569538 1562708 1556976 1552448 1547714 1541260
61535 1541260 1533135 1524712 1517160 1510959 1506594 1504646 1505006 1506923 1510073 1514792 1521003 1527800 1534619 1542135
61521 1542135 1551526 1563337 1577463 1593776 1612346 1633442 1657604 1685247 1715968 1748778 1783325
61510 1783325 1820336 1860506 1903536 1948733 1996001 2045687 2097703 2151197 2204729 2256536 2305182
61499 2305182 2350587 2394142 2437283 2480055 2521295 2559893 2595553 2628646 2659691 2688699 2714820
61488 2714820 2737003 2755127 2769889 2781326 2788302 2790050 2787494 2782200 2774678 2764711 2752786 2739808
61476 2739808 2725625 2709322 2691367 2674168 2659809 2648319 2639010 2632570 2630556 2633255 2639503 2648803
61464 2648803 2662504 2682366 2708905 2741789 2781140 2827464 2880724 2940643 3007942 3084179 3170017
61453 3170017 3264665 3367752 3481022 3607263 3748021 3903377 4073768 4260942 4466873 4692495
61443 4692495 4937728 5201919 5483785 5781386 6092509 6414557 6743450 7072664 7393413
61434 7393413 7695386 7967339 8197966 8377619 8499942 8562415 8565997 8514747 8415303 8275760
61424 8275760 8104272 7908268 7694496 7469402 7239371 7010597 6788439 6576690 6377543
61415 6377543 6192460 6022985 5870665 5736440 5620472 5522663 5443191 5382330 5339588 5313126
61405 5313126 5300375 5299578 5310665 5334512 5371458 5420673 5480485 5548767 5623296 5702440 5785522 5871909
61393 5871909 5959761 6046393 6130039 6210603 6288537 6363888 6436911 6508771 6580576 6651987 6721591
61382 6721591 6788615 6853570 6917111 6978864 7037695 7092749 7143786 7190593 7232416 7268266 7297709
61371 7297709 7321074 7338739 7350398 7355283 7352904 7343269 7326674 7303838 7276237 7245656 7213142 7178747
61359 7178747 7142427 7104747 7066636 7029015 6993055 6960319 6932143 6908939 6890287 6875367 6863072
61348 6863072 6852076 6841269 6830065 6818171 6805264 6791077 6775558 6758708 6740413 6720608 6699539
61337 6699539 6677975 6657610 6641322 6632516 6633899 6647105 6673491 6714757 6772553 6848096 6942569 7057506
61325 7057506 7194354 7354044 7537429 7745793 7980295 8240858 8525752 8832102 9156541
61316 9156541 9495381 9844044 10196075 10542832 10874543 11181435 11453322 11678938 11847900
61307 11847900 11954450 11998541 11982883 11910227 11784220 11610848 11396726 11146506 10863849 10554619
61297 10554619 10226967 9887879 9541385 9190725 8840671 8496675 8162792 7841473 7534627
61288 7534627 7243937 6970577 6715433 6479398 6263007 6066194 5888782 5730769 5591787
61279 5591787 5470889 5367394 5281378 5212715 5160204 5122249 5097870 5086291 5086133 5096082 5116113
61268 5116113 5146903 5187956 5237237 5292835 5354012 5420247 5490072 5561390 5632304 5701157 5766395
61257 5766395 5827151 5883607 5936123 5984273 6027358 6065526 6099477 6129053 6152989 6170245 6180807
61246 6180807 6184803 6181573 6170165 6150271 6122137 6086180 6043463 5996083 5945868 5892584 5834332 5770049
61234 5770049 5700903 5629014 5555672 5481373 5406777 5332604 5258965 5185763 5113908 5045391 4982048
61223 4982048 4924625 4872950 4826329 4783668 4743971 4707117 4673761 4644112 4617148 4591291 4565354
61212 4565354 4538517 4509983 4479435 4447657 4416056 4385682 4357306 4332312 4312538 4298902 4290906
61201 4290906 4287984 4290764 4300480 4317672 4342302 4374971 4417278 4470965 4537271 4616986 4710247 4815998
61189 4815998 4932382 5058121 5193010 5336521 5486215 5637913 5786930 5928420 6056565
61180 6056565 6164204 6243725 6288451 6293635 6256960 6178871 6062837 5915196 5744029 5557023
61170 5557023 5359699 5155688 4948701 4743656 4545598 4358026 4182593 4019738 3868900
61161 3868900 3728770 3598546 3478988 3371346 3275153 3187880 3107067 3032180 2964242 2904239
61151 2904239 2852182 2807150 2767877 2733657 2704849 2682199 2665625 2654154 2647158 2645033 2648455 2657380
61139 2657380 2670797 2686874 2703338 2718608 2732857 2747104 2760798 2771276 2776399 2776876 2774942 2771250
61127 2771250 2764384 2753208 2738398 2721266 2702135 2680565 2656594 2631027 2604553 2576989 2547493
61116 2547493 2515518 2481706 2447851 2415727 2385795 2357107 2328347 2298607 2267261 2233752 2198061
61105 2198061 2161104 2124068 2087254 2050037 2012074 1974054 1936821 1900203 1863462 1826778 1791455
61094 1791455 1758359 1726943 1696288 1666319 1637110 1607502 1575654 1541105 1505410 1470533 1437386
61083 1437386 1406095 1376830 1349734 1324630 1301330 1279876 1260111 1241577 1224304 1209218 1197152
61072 1197152 1187826 1180443 1175102 1172911 1174669 1179850 1186953 1194557 1202203 1210505 1220210 1230919 1241152
61059 1241152 1250185 1259406 1270968 1285140 1299889 1313286 1325444 1337623 1350235 1362654 1374529 1386214
61047 1386214 1397748 1408320 1417138 1424205 1429728 1433317 1434518 1433882 1432678 1431395 1429163 1424919 1418682 1411470
61033 1411470 1404367 1397992 1392443 1387444 1382765 1378694 1375764 1373797 1371700 1368534 1364378 1359870 1355357 1350916
61019 1350916 1346632 1342334 1337524 1332161 1326995 1322394 1317288 1310180 1301060 1291627 1283800 1278519 1275545 1273498
61005 1273498 1270430 1265374 1259378 1254266 1250615 1247758 1245379 1243936 1243648 1244255 1245810 1248556 1251962 1255137
60991 1255137 1258456 1263567 1271347 1280970 1291469 1303230 1317279 1333909 1352563 1372416 1392637 1412755
60979 1412755 1433160 1454673 1477372 1500574 1524213 1549459 1577587 1608829 1642595 1678194 1715279
60968 1715279 1754333 1796798 1843883 1895221 1949620 2007074 2068931 2136017 2207862 2283909 2364244
60957 2364244 2448914 2537996 2632810 2735733 2848178 2969819 3100230 3240078 3390278 3551045
60947 3551045 3722105 3902750 4091842 4289384 4498308 4723012 4965924 5227388 5509096
60938 5509096 5815316 6150153 6515794 6914197 7348620 7823745 8347833 8935664 9605979
60929 9605979 10374697 11253781 12257199 13403137 14709476 16194417 17885356 19819693
60921 19819693 22031982 24549762 27405907 30623292 34131598 37673242 40827105 43193624
60913 43193624 44609077 45204722 45279583 45135031 45009349 45083514 45439742 45960248 46298263
60904 46298263 46022188 44849267 42778467 40034365 36912360 33665183 30474411 27460010
60896 27460010 24687896 22180004 19934434 17941466 16185494 14643885 13292692 12112051
60888 12112051 11083924 10188629 9407028 8723387 8123527 7592924 7119248 6694460 6312180
60879 6312180 5965331 5648424 5359506 5097097 4857045 4634735 4428470 4238018 4061098
60870 4061098 3893733 3733083 3577989 3427747 3282227 3142245 3008146 2878947 2754284
60861 2754284 2635990 2526050 2423994 2327856 2236757 2151034 2070711 1995321 1924462 1857347 1792744
60850 1792744 1730519 1672253 1619231 1570807 1525685 1483446 1443762 1405722 1369263 1335717 1305508
60839 1305508 1276992 1249151 1223587 1201762 1181988 1161620 1140970 1122471 1106922 1093124 1080485
60828 1080485 1069425 1059643 1050562 1043243 1039389 1038543 1038610 1039154 1041673 1046256 1050392 1052021 1052019 1052785 1055745 1060768
60812 1060768 1066663 1071671 1074754 1076921 1080308 1085602 1091448 1096535 1100991 1105405 1109735 1113651 1116950 1119251
60798 1119251 1120274 1120711 1121837 1123987 1126449 1129059 1132639 1137376 1142057 1145852 1149929 1156247 1165114 1174864
60784 1174864 1183793 1191765 1199816 1208647 1217833 1226541 1234622 1242587 1250614 1258324 1265732 1273494 1281618 1288719
60770 1288719 1293516 1296580 1299707 1303921 1308959 1314323 1319834 1325322 1330857 1337349 1346075 1357477 1370908
60757 1370908 1385375 1399835 1412894 1423106 1429953 1434346 1438172 1443206 1449791 1456235 1460242 1461336 1461073
60744 1461073 1460500 1458650 1454388 1448360 1441677 1433815 1423651 1411897 1400576 1390316 1379958 1368683 1356757
60731 1356757 1344096 1330012 1314933 1300826 1289251 1280107 1272816 1267565 1264728 1264034 1264988 1267496 1271569
60718 1271569 1276813 1282428 1287457 1291421 1295425 1302163 1313638 1329063 1346176 1364382 1384982 1408289
60706 1408289 1432278 1454794 1475659 1495808 1515533 1534514 1552662 1570046 1586606 1602572 1618406
60695 1618406 1633721 1646959 1656871 1663778 1668778 1672428 1674975 1677320 1680721 1685564 1691051 1696116 1700245
60682 1700245 1703458 1705905 1707577 1708274 1707808 1706072 1702849 1697788 1691016 1683668 1677220 1672168 1667658 1662413
60668 1662413 1655692 1647457 1638149 1628486 1619099 1610209 1601694 1593428 1585480 1578153 1571911 1566906 1562501 1557887
60654 1557887 1553327 1550014 1548261 1546721 1544120 1540960 1538626 1537519 1536951 1536225 1534794 1532025 1527816 1522766
60640 1522766 1516859 1509000 1499198 1489955 1483607 1479115 1473671 1466788 1460363 1455078 1449615 1443730 1439260 1437138
60626 1437138 1435860 1434017 1432065 1430352 1427598 1422974 1417738 1412955 1407186 1398362 1386633 1373420 1358916
60613 1358916 1342804 1326462 1311935 1298919 1285051 1269397 1253694 1239843 1228023 1217908 1210067
60602 1210067 1205037 1202068 1199853 1197882 1196302 1194977 1193593 1192490 1192564 1194195 1196779 1199496 1202186 1205115
60588 1205115 1208142 1210633 1212247 1213401 1214707 1216243 1217716 1219015 1220196 1221167 1221782 1222008 1221621 1220281 1218602
60573 1218602 1218601 1221941 1227850 1233965 1239311 1245298 1253459 1263383 1273612 1283751 1294926 1308521 1324946
60560 1324946 1343441 1362896 1383161 1405384 1430468 1457495 1484681 1511810 1540459 1571587 1604255
60549 1604255 1637210 1670280 1703231 1734282 1760955 1781866 1796934 1806462 1810794 1810217 1804419 1792674
60537 1792674 1775395 1754876 1733540 1711901 1689086 1664874 1640211 1616048 1592767 1570752 1550581
60526 1550581 1532496 1516269 1501809 1489561 1480191 1473966 1470194 1467218 1463394 1458396 1453183 1448559 1444367
60513 1444367 1440225 1436103 1431672 1426070 1419235 1412728 1408278 1406044 1405379 1406703 1411258 1419077 1428487 1437964
60499 1437964 1447660 1458841 1472469 1488487 1505810 1522819 1538524 1553664 1570290 1590053 1613109
60488 1613109 1638611 1665677 1693737 1722615 1752837 1785638 1822211 1862875 1907087 1954005 2002584
60477 2002584 2051142 2097337 2138993 2174758 2203554 2223619 2232833 2230194 2216469 2193312 2162750 2128067
60465 2128067 2093967 2064267 2039603 2018592 2001055 1988754 1983000 1983202 1988353 1998454 2013508 2032270
60453 2032270 2053296 2076627 2103272 2133343 2165844 2200345 2238040 2280808 2329677 2384615 2445893
60442 2445893 2515567 2597129 2693403 2805224 2932849 3078127 3243999 3431886 3641020 3870792
60432 3870792 4122500 4398111 4698484 5023708 5374184 5750308 6151513 6575663 7017209
60423 7017209 7463312 7891688 8273881 8581782 8792056 8887294 8857181 8701327 8431216 8068561
60413 8068561 7640489 7174023 6692230 6213142 5750543 5314365 4909920 4537911 4196719
60404 4196719 3885226 3603395 3350832 3125738 2925346 2746883 2588124 2447473 2323504
60395 2323504 2214243 2117080 2029566 1949979 1876959 1809188 1745794 1686547 1631199 1579172 1530406
60384 1530406 1485815 1446050 1410254 1376898 1345575 1317127 1292147 1270153 1250183 1231508 1213724
60373 1213724 1196839 1181371 1167850 1156011 1144740 1132931 1120219 1107027 1094193 1082555 1072614
60362 1072614 1064445 1057784 1052066 1046585 1041033 1035819 1031452 1027847 1024879 1023314 1024148 1026962 1030179 1033352
60348 1033352 1037936 1045072 1053670 1061665 1068381 1074704 1081490 1088826 1096414 1103828 1110736 1117558 1125477 1135036
60334 1135036 1145145 1154192 1161763 1168647 1175630 1183076 1191214 1199835 1207784 1213475 1216076 1216053 1214956 1214764
60320 1214764 1216633 1219770 1222095 1222454 1221546 1220500 1219739 1219769 1221572 1224891 1227268 1226364 1222718 1218886 1216411
60305 1216411 1215009 1214223 1214195 1214832 1215587 1216434 1218227 1221992 1228321 1237075 1247036 1256405 1264600 1273139 1283954
60290 1283954 1297380 1312554 1328868 1345747 1361805 1375761 1387836 1398943 1409018 1417548 1425087 1432502
60278 1432502 1439109 1443324 1445051 1445645 1445730 1445026 1444335 1445511 1448948 1452982 1456491 1460349 1465507 1471338 1476879
60263 1476879 1482210 1487469 1491595 1493207 1491929 1488040 1481683 1473232 1463618 1453556 1443215 1433191 1424679
60250 1424679 1417851 1411253 1403987 1397532 1393860 1392327 1390163 1386223 1382791 1383008 1387308 1393146 1397872 1401144
60236 1401144 1404400 1408565 1412910 1416177 1418165 1419665 1421194 1422458 1423026 1422930 1422570 1422501 1423394 1425787 1429822 1435489
60220 1435489 1442948 1452207 1462695 1473656 1484875 1496608 1509038 1522269 1536496 1551516 1566393 1580403
60208 1580403 1594203 1609338 1626685 1645963 1666500 1687787 1709571 1732214 1756748 1783887 1813362
60197 1813362 1845023 1880004 1919765 1964489 2013612 2067430 2126681 2190916 2259023 2331341 2409670
60186 2409670 2495077 2587373 2686978 2795524 2914055 3042166 3179434 3326118 3481764 3644625
60176 3644625 3813308 3987601 4166755 4348231 4529002 4706826 4879355 5043260 5195367
60167 5195367 5333567 5455808 5559609 5643779 5709283 5757037 5786165 5796164 5789561 5770368 5740740
60156 5740740 5701414 5655154 5607289 5562428 5522477 5488351 5461790 5444738 5438628 5445415 5467992 5508199
60144 5508199 5565229 5637333 5724539 5828384 5949332 6085805 6235649 6396998 6567110 6741515
60134 6741515 6915252 7084274 7244977 7393142 7524544 7636302 7726637 7793572 7835088 7850604
60124 7850604 7841144 7807885 7751824 7675188 7581857 7475660 7359434 7236505 7111915 6991162
60114 6991162 6878600 6777856 6692340 6623951 6572413 6537609 6521692 6527118 6553388 6597819 6659083
60103 6659083 6737744 6833208 6942080 7059731 7181581 7302614 7417688 7523237 7617415 7698319
60093 7698319 7763735 7813112 7848151 7870825 7882302 7884394 7880598 7874921 7871066 7873240 7886198 7913548
60081 7913548 7957328 8019873 8104383 8212729 8344338 8498589 8677055 8882295 9115892 9379106
60071 9379106 9674131 10002859 10364957 10758590 11182538 11636334 12118687 12626607 13155399
60062 13155399 13698459 14247600 14794596 15332046 15852140 16345482 16802068 17212847 17569744
60053 17569744 17865439 18094458 18253641 18340274 18350560 18281548 18134344 17914271 17628355 17284108
60043 17284108 16890563 16458924 16001535 15530702 15058382 14595986 14153828 13740588 13362943
60034 13362943 13025466 12731125 12481872 12278255 12118908 12001904 11926972 11894773 11903046 11944741
60024 11944741 12011107 12095592 12193598 12299654 12406467 12506124 12590935 12653897 12690142 12697967 12677443
60013 12677443 12628364 12550432 12444572 12312550 12155703 11975448 11774723 11557396 11326292 11083061
60003 11083061 10829933 10570450 10308584 10048390 9794576 9552075 9324624 9114449 8923416
59994 8923416 8753711 8607367 8485957 8390721 8322254 8280137 8263686 8273094 8309110 8371568 8458801
59983 8458801 8568409 8697937 8844759 9005647 9176251 9350626 9521717 9682862 9828617
59974 9828617 9954063 10054280 10125294 10164968 10172383 10147119 10089741 10001976 9885497 9741599 9573209
59963 9573209 9386200 9187298 8981554 8773253 8568195 8372910 8191880 8027268 7881046
59954 7881046 7755492 7651725 7569771 7510457 7475744 7466969 7484291 7528078 7599233 7697761 7822447
59943 7822447 7972397 8147451 8346533 8566832 8805038 9057900 9320726 9586382 9846675
59934 9846675 10094072 10321752 10523220 10692997 10827462 10924544 10982960 11001879 10980826 10919822
59924 10919822 10820288 10685897 10521992 10334412 10129699 9915968 9701987 9495009 9300417
59915 9300417 9123274 8968536 8839329 8736497 8660555 8612864 8594198 8603463 8638777 8698919 8782895
59904 8782895 8888965 9014913 9158401 9316162 9483609 9656177 9830547 10003877 10172726
59895 10172726 10333822 10485353 10626441 10755710 10871454 10973150 11061927 11139635 11208190 11269917
59885 11269917 11327863 11385739 11447992 11519934 11607266 11715294 11848840 12012721 12211796 12450264
59875 12450264 12730932 13055069 13422709 13833106 14284941 14775874 15301444 15854009 16422553
59866 16422553 16993457 17551576 18080732 18563304 18979949 19311187 19540845 19658900 19661579 19549971
59856 19549971 19329860 19012695 18614904 18154775 17649664 17115851 16569415 16025346 15495350
59847 15495350 14987348 14507683 14063345 13661321 13305953 12997859 12736026 12520561 12352831
59838 12352831 12233488 12161500 12135217 12153086 12212591 12309343 12438227 12594903 12775078 12972328
59828 12972328 13177365 13379356 13567245 13729880 13855965 13934764 13957186 13916741 13810128 13637207
59818 13637207 13400514 13105211 12759621 12374886 11962852 11533698 11095441 10655032 10219223
59809 10219223 9794517 9386673 9000075 8637226 8299209 7986965 7701696 7443790 7212228
59800 7212228 7005749 6823777 6665378 6528109 6409067 6306475 6218953 6143624 6076306 6013554
59790 6013554 5953508 5895122 5837961 5782654 5730008 5679444 5629626 5581009 5536373 5498076 5465589
59779 5465589 5436042 5406111 5372816 5333822 5288355 5237615 5183392 5126360 5066297 5003857 4941470
59768 4941470 4882244 4828102 4779002 4733773 4691465 4652005 4616175 4585636 4562763 4549450 4545706
59757 4545706 4549944 4560795 4577837 4600520 4627845 4659975 4698962 4746631 4802544 4865217 4934599
59746 4934599 5012013 5097971 5191087 5288609 5386993 5482717 5573833 5660275 5741625 5815529 5879862
59735 5879862 5935540 5985353 6030705 6071651 6109746 6148505 6190951 6238798 6294304 6360730 6440412
59724 6440412 6534381 6644613 6774894 6928592 7107211 7312006 7545648 7811297 8111101 8446286
59714 8446286 8817669 9225497 9669612 10149651 10663028 11201287 11748557 12282956 12777855
59705 12777855 13202525 13525998 13724911 13789866 13725983 13549728 13285355 12960790 12602618 12232848
59695 12232848 11868890 11524196 11207634 10923569 10674023 10460537 10284066 10144731 10042603
59686 10042603 9977499 9947330 9948287 9977893 10036827 10126888 10248517 10401236 10584942 10799344 11043459
59675 11043459 11317208 11622562 11961878 12336241 12746845 13196823 13689890 14227997 14811993
59666 14811993 15443897 16126769 16862751 17652865 18498246 19399664 20355548 21361715 22412878
59657 22412878 23502847 24622734 25759922 26899392 28026079 29126834 30191770 31214923
59649 31214923 32194367 33132534 34036548 34916808 35783825 36646105 37510442 38381759 39260306
59640 39260306 40139060 41004907 41842030 42633444 43360603 44004127 44546273 44973207 45276439
59631 45276439 45454262 45512488 45463276 45323154 45112098 44852861 44568885 44282141 44013258 43782787
59621 43782787 43610440 43512482 43500700 43584290 43772155 44073207 44494895 45041488 45713300 46507302
59611 46507302 47418161 48437611 49551618 50737884 51966009 53199227 54395081 55504994
59603 55504994 56474946 57248622 57772747 58003599 57913001 57491668 56749395 55713513 54426190
59594 54426190 52939542 51309131 49588929 47829067 46074015 44359736 42712121 41148298
59586 41148298 39678048 38302562 37012560 35789092 34606401 33434914 32245478 31016288
59578 31016288 29739280 28421066 27078487 25733016 24406448 23117686 21881139 20707399
59570 20707399 19604398 18576725 17624521 16744791 15934302 15190588 14510611 13889912 13323441
59561 13323441 12806502 12334895 11905016 11514002 11159220 10837665 10546352 10282905 10045056
59552 10045056 9829862 9634084 9454794 9288709 9131558 8979376 8830241 8683517 8537520
59543 8537520 8389218 8236397 8079093 7918612 7756055 7592077 7427322 7262789 7100247
59534 7100247 6942465 6792521 6652664 6523950 6406656 6300654 6205692 6121841 6049441 5988336
59524 5988336 5937678 5896950 5866601 5847108 5838125 5839144 5850051 5870057 5896975 5928850 5965777 6008908
59512 6008908 6058252 6112729 6171767 6235118 6301391 6368770 6437709 6511570 6594078 6687040 6790605
59501 6790605 6904477 7028393 7162627 7308804 7469633 7647310 7842545 8055255 8285737
59492 8285737 8535057 8804851 9096652 9410704 9745481 10099071 10470999 10861809 11270730
59483 11270730 11694536 12128692 12568520 13008675 13442425 13862674 14263956 14642923 14996312
59474 14996312 15318436 15601488 15839527 16032500 16185722 16305189 16394217 16454694 16489943 16505069
59464 16505069 16505547 16496989 16485850 16479030 16482926 16503746 16548062 16621380 16725842 16859931 17019943
59453 17019943 17200640 17394642 17592253 17781692 17948671 18076527 18148849 18153045 18081456 17929979
59443 17929979 17697174 17384797 16998042 16545104 16037229 15488657 14914773 14329557 13745054
59434 13745054 13172541 12622441 12102606 11617600 11169908 10761009 10391263 10059926 9765952
59425 9765952 9508418 9286251 9098238 8943361 8820550 8728169 8664449 8628496 8620442 8640750
59415 8640750 8689684 8766974 8871530 9002096 9158718 9342711 9554313 9791186 10050011 10328445
59405 10328445 10624139 10932758 11248356 11564624 11873944 12166093 12430076 12656879 12838677
59396 12838677 12966295 13030535 13026573 12955109 12819059 12621472 12367204 12064145 11721484 11348068
59386 11348068 10952925 10545401 10133503 9723252 9320144 8929652 8555443 8198747 7860485
59377 7860485 7542774 7247406 6974138 6721546 6488511 6274086 6077244 5897903 5737137
59368 5737137 5595146 5469728 5357826 5258032 5170722 5096376 5034644 4984652 4945488 4916714 4898703
59357 4898703 4891871 4895187 4906123 4922684 4945112 4975385 5015380 5065073 5121134 5176961 5225642 5264278
59345 5264278 5295532 5325009 5357820 5397326 5445543 5503900 5574423 5660327 5763910 5882900 6010124
59334 6010124 6138335 6265436 6394828 6531772 6680480 6844116 7026060 7230278 7460312
59325 7460312 7717946 8003327 8316869 8660815 9038461 9452472 9904994 10398982 10937862
59316 10937862 11523595 12156131 12834721 13558503 14325424 15131471 15970602 16833698 17707309
59307 17707309 18575269 19422672 20237735 21010162 21730024 22389763 22986371 23520619 23994700
59298 23994700 24410887 24771089 25076479 25327702 25525321 25668748 25754204 25774970 25724588 25599361
59288 25599361 25397777 25119041 24763113 24331474 23827578 23257596 22631075 21959258 21251616
59279 21251616 20514491 19753396 18975416 18188899 17402078 16622761 15858192 15114310 14395934
59270 14395934 13708093 13056012 12443057 11869730 11335264 10839144 10380583 9957990 9569983
59261 9569983 9215958 8894853 8604405 8342439 8107847 7899483 7715007 7551676 7407470
59252 7407470 7280928 7170857 7076828 6998872 6936062 6886460 6848960 6824044 6812191 6812886 6825795
59241 6825795 6851505 6890297 6941528 7004930 7081116 7169990 7270077 7380142 7499935 7628678
59231 7628678 7764796 7908145 8060427 8221961 8389889 8561102 8734978 8911425 9088306
59222 9088306 9263324 9437005 9611241 9785920 9959541 10132215 10305091 10476697 10642256
59213 10642256 10797092 10939113 11067931 11183159 11283847 11368208 11433478 11476666 11495187 11486299
59203 11486299 11447047 11376260 11276099 11150454 11002513 10835127 10652671 10460782 10264660 10068977
59193 10068977 9878744 9698569 9531367 9379256 9245086 9131429 9038556 8965316 8911750 8879017
59183 8879017 8866874 8873154 8896072 8935385 8990949 9061391 9144518 9237994 9339683 9448619 9565740
59172 9565740 9692515 9828772 9972844 10123751 10282267 10450294 10630732 10827795 11045780
59163 11045780 11287040 11552232 11842606 12160713 12508492 12885627 13289767 13716799 14159957
59154 14159957 14609140 15051365 15471416 15852254 16176222 16427030 16591182 16658354 16621612 16477783
59144 16477783 16227785 15877136 15436449 14920573 14346168 13729924 13088678 12439221 11795998
59135 11795998 11169003 10564723 9988510 9445045 8937169 8465755 8030633 7630798 7264142
59126 7264142 6928052 6620177 6338147 6079444 5842381 5626340 5430063 5250762 5086039
59117 5086039 4935455 4798706 4673590 4557780 4451532 4356306 4271352 4194126 4123805 4061838
59107 4061838 4008858 3963344 3923716 3889658 3860924 3836885 3818004 3806061 3802132 3805659 3815911 3832891
59095 3832891 3856402 3885724 3920650 3961480 4007677 4058142 4113233 4174835 4243827 4319056 4399461
59084 4399461 4485507 4577731 4675523 4778402 4887021 5001622 5120822 5243345 5369904 5501865
59074 5501865 5638601 5777525 5916357 6054170 6190348 6323632 6452379 6575203 6691367
59065 6691367 6800970 6904679 7002922 7095309 7181061 7259937 7332795 7401511 7468394 7535387 7603746
59054 7603746 7674569 7749382 7830021 7918299 8016255 8126300 8250472 8389675 8544063 8713797
59044 8713797 8898945 9099106 9313616 9541326 9779192 10021557 10261691 10493378 10709909
59035 10709909 10902204 11059638 11173087 11236740 11247964 11207148 11117631 10984474 10813258 10610856
59025 10610856 10386376 10149265 9906356 9662047 9420748 9186869 8962209 8745633 8536120
59016 8536120 8334353 8140525 7952439 7767045 7582685 7398694 7213912 7026913 6837194
59007 6837194 6645283 6452065 6258561 6065894 5874954 5686383 5501012 5319812 5143504
58998 5143504 4972917 4809546 4654616 4507645 4367217 4233328 4107588 3990730 3881328
58989 3881328 3777663 3679577 3587665 3501806 3421459 3346425 3276153 3208998 3143243 3078472 3014987
58978 3014987 2952241 2888877 2824316 2759564 2696377 2636214 2580172 2529344 2484499 2445240 2409946
58967 2409946 2377170 2347045 2320738 2298562 2279512 2262837 2248924 2237942 2228720 2220002 2211823 2204518
58955 2204518 2197344 2189649 2182695 2178535 2177340 2177443 2177783 2178649 2180162 2181862 2184010 2187603 2192730 2198418 2204464
58940 2204464 2211907 2221118 2230833 2239744 2247934 2256254 2265419 2276296 2289928 2306373 2324096 2341103 2356343
58927 2356343 2370115 2383910 2399747 2418665 2439705 2461225 2483074 2506417 2531612 2557663 2583977
58916 2583977 2611232 2640076 2670133 2700894 2732748 2766659 2803261 2842270 2882289 2921737 2960882
58905 2960882 3002371 3048494 3098514 3150107 3202646 3257119 3313366 3369957 3426974 3486432 3549393
58894 3549393 3614875 3682403 3753423 3829115 3908769 3991606 4078466 4170230 4265961 4364355 4466266
58883 4466266 4574478 4691391 4817762 4953233 5097345 5250359 5413381 5587416 5772552
58874 5772552 5968898 6177897 6401384 6639669 6892219 7160198 7446478 7752968 8079951
58865 8079951 8428549 8801856 9202797 9632583 10092145 10583427 11108455 11668837 12267148
58856 12267148 12907210 13591901 14321980 15097944 15921293 16792656 17709936 18669330 19666596
58847 19666596 20695545 21745963 22803875 23852755 24873223 25842448 26735152 27525102
58839 27525102 28185933 28692930 29026720 29176120 29137922 28915386 28517801 27960536 27264303
58830 27264303 26453912 25556443 24598114 23601428 22585395 21567640 20564187 19586993 18643771
58821 18643771 17740864 16884400 16078108 15322252 14615943 13958645 13348392 12780604 12250454
58812 12250454 11755137 11292637 10859790 10453098 10070344 9710212 9371403 9053155 8755396
58803 8755396 8477386 8217431 7974784 7750362 7544588 7355919 7182431 7023275 6877687
58794 6877687 6744387 6623261 6515923 6423106 6342976 6273423 6214545 6167535 6132556 6109265 6098041
58783 6098041 6099173 6111982 6135992 6171755 6219471 6278381 6348695 6432364 6530503 6641773 6764913
58772 6764913 6901147 7052435 7218955 7400101 7596404 7808677 8036816 8281314 8544564
58763 8544564 8828844 9134536 9462024 9813598 10191576 10596518 11029676 11495460 11998742
58754 11998742 12541183 13122801 13745765 14413777 15128856 15891545 16702917 17562940 18467320
58745 18467320 19408956 20381734 21379189 22389025 23391876 24365740 25288773 26137398 26884986
58736 26884986 27504520 27972029 28268315 28380788 28305663 28047685 27617486 27030379 26307222
58727 26307222 25473508 24555510 23577306 22560809 21526349 20491697 19471031 18475320 17513050
58718 17513050 16590321 15710872 14876515 14087686 13344192 12645925 11992416 11381451 10809132
58709 10809132 10271995 9768259 9296545 8854712 8440909 8054364 7693878 7356733 7040393
58700 7040393 6744185 6468026 6210665 5970392 5746139 5536458 5338987 5152682 4979182
58691 4979182 4820078 4674042 4538379 4411928 4294422 4184640 4081654 3986576 3900317 3820575
58681 3820575 3743646 3668438 3596220 3527424 3461521 3399242 3341783 3288082 3235787 3184750 3136819
58670 3136819 3092170 3048618 3004784 2961356 2918893 2876756 2834501 2792151 2748842 2703380 2656331
58659 2656331 2609483 2563099 2515812 2467335 2419010 2371465 2323938 2276238 2229234 2183051 2136816
58648 2136816 2090594 2045697 2002761 1961366 1921745 1884981 1851231 1819623 1789992 1762702 1736627
58637 1736627 1709608 1681494 1654688 1630936 1609278 1587769 1565659 1543259 1521063 1499592 1479072
58626 1479072 1459130 1439716 1421965 1406956 1394244 1383155 1374748 1370440 1369229 1368582 1367800 1368320 1370925
58613 1370925 1375041 1380530 1387691 1395430 1402017 1407861 1414967 1423261 1430034 1433680 1435504 1436979 1437496 1435900
58599 1435900 1432311 1427309 1420861 1413030 1404647 1396795 1390578 1387246 1387164 1388914 1391170 1395118 1403125 1415335
58585 1415335 1429798 1445727 1464162 1485407 1508410 1532986 1560187 1590058 1621520 1654934 1692353
58574 1692353 1734578 1780298 1828801 1881192 1938130 1998600 2061895 2128910 2200737 2277786 2360842
58563 2360842 2451066 2548535 2652802 2765291 2888889 3024691 3171459 3329046 3500028 3687057
58553 3687057 3890584 4110009 4345197 4596092 4862476 5144232 5439593 5742722 6045248
58544 6045248 6340491 6623636 6887314 7119950 7309685 7447776 7527980 7546199 7502864 7403495
58534 7403495 7255235 7064492 6838781 6588191 6322942 6050742 5777395 5507990 5246211
58525 5246211 4994255 4754603 4530305 4322730 4130883 3953799 3791842 3644970 3511933
58516 3511933 3392058 3285639 3191559 3106675 3028651 2957376 2892677 2832954 2777168 2725835 2678650
58505 2678650 2633365 2588467 2544875 2503469 2463043 2422424 2382856 2346367 2313032 2281284 2249718
58494 2249718 2217379 2183446 2147786 2110892 2072751 2032911 1991844 1950618 1909101 1866416 1823412
58483 1823412 1782476 1744567 1708685 1674605 1643515 1615370 1588403 1562141 1538239 1517251 1497156
58472 1497156 1476276 1455265 1435228 1416276 1398849 1383856 1370491 1356596 1342243 1330201 1321678
58461 1321678 1314343 1305746 1295825 1284885 1272293 1258849 1247378 1239086 1232000 1224756 1219081 1216721 1216733
58448 1216733 1217602 1219126 1220319 1218597 1213485 1208347 1205908 1204554 1201389 1196337 1190614 1183645 1174491 1164474
58434 1164474 1155652 1148126 1140975 1134196 1127703 1120197 1110991 1101383 1092719 1084875 1077837 1072378 1067834 1061992
58420 1061992 1054866 1049637 1047900 1046931 1043873 1039692 1036540 1034062 1030953 1027583 1024428 1020387 1015190 1010990
58406 1010990 1009011 1007142 1003340 998807 995280 992111 988762 987140 988165 988821 986110 981581 978560 977328
58392 977328 976576 977234 980968 986628 991870 996791 1002737 1009160 1014972 1021354 1029904 1039450 1047772 1054992 1062341
58377 1062341 1069244 1074603 1079315 1084536 1089076 1091310 1091798 1091219 1087877 1080414 1071019 1062691 1055227 1047028
58363 1047028 1038863 1032510 1027577 1023018 1019857 1019050 1018665 1016655 1014514 1014672 1016268 1017076 1017584 1019399 1021599
58348 1021599 1022742 1024656 1030113 1038279 1046473 1054937 1065652 1077864 1088958 1098711 1108638 1118183 1125606
58335 1125606 1131841 1139646 1149468 1159581 1169490 1179983 1190853 1201774 1214170 1229032 1244254 1257380
58323 1257380 1269478 1282981 1297378 1310607 1323065 1336541 1350645 1363826 1376269 1388266 1397543
58312 1397543 1401999 1403455 1405086 1406972 1407816 1408777 1411582 1415020 1417604 1421583 1429844 1440786 1450838 1460190
58298 1460190 1471248 1483225 1493153 1500891 1508507 1516106 1522735 1529781 1538873 1547989 1554158 1558395 1563550
58285 1563550 1569259 1573674 1578049 1584658 1592210 1598320 1604423 1613121 1623037 1631722 1641157 1654417 1669207
58272 1669207 1681093 1691217 1704325 1720800 1737301 1753844 1773509 1796129 1818840 1841936 1867762
58261 1867762 1894732 1918891 1940678 1963886 1988892 2013096 2036881 2062595 2088769 2111951 2133314
58250 2133314 2156925 2182672 2207609 2232854 2261929 2293357 2322310 2348752 2376746 2406725 2435944
58239 2435944 2465655 2500089 2538937 2578269 2617970 2660575 2704016 2743952 2782547 2826393 2876105
58228 2876105 2926398 2975913 3028309 3083930 3139277 3194744 3254219 3317064 3379065 3441027 3507601
58217 3507601 3578126 3647830 3717534 3792487 3871899 3949636 4025298 4104623 4189052 4275123 4364053
58206 4364053 4461237 4566149 4673584 4784912 4906788 5038641 5173324 5310584 5457689 5615989
58196 5615989 5779520 5948096 6129088 6324721 6530266 6746152 6978772 7227888 7486857
58187 7486857 7756998 8047520 8359047 8681496 9010729 9352905 9710175 10077595 10457435
58178 10457435 10861195 11293994 11752030 12238388 12765385 13338018 13951418 14607567 15317356
58169 15317356 16083083 16897288 17762392 18692546 19692469 20754559 21881008 23087809 24382570
58160 24382570 25760473 27226876 28800524 30489165 32286454 34198129 36244949 38434241
58152 38434241 40757580 43223946 45865273 48702422 51739677 55003118 58550676 62435725
58144 62435725 66699362 71409723 76668694 82571618 89210723 96732831 105340235 115220107
58136 115220107 126536098 139506538 154410901 171483141 190871433 212728037 237256044
58129 237256044 264694003 295447077 330168225 369049657 410224978 448735255 477763686
58122 477763686 491791027 489195934 472315843 445481936 413015017 378327548 343824791
58115 343824791 311001826 280624291 253020852 228307222 206431161 187190632 170341751
58108 170341751 155684796 143039221 132215550 123068946 115533111 109548149 104980129
58101 104980129 101637224 99309010 97717852 96438925 94932873 92709525 89498843 85314215
58093 85314215 80389339 75044570 69568636 64176256 59024605 54224560 49828516 45834650
58085 45834650 42220538 38965423 36041886 33410395 31035373 28894461 26966183 25223450
58077 25223450 23645550 22221439 20934186 19756211 18666226 17656886 16719774 15837953
58069 15837953 15000950 14213188 13479296 12793302 12149492 11551110 10999740 10487032 10004753
58060 10004753 9553103 9132438 8736870 8362379 8010961 7680441 7360480 7045215 6740113
58051 6740113 6450049 6170641 5897894 5636318 5390091 5155095 4926900 4708283 4501957
58042 4501957 4303999 4111285 3927751 3756740 3594633 3438402 3291952 3158562 3034251
58033 3034251 2915095 2804148 2704700 2613311 2525799 2443729 2368786 2297205 2226067 2159060 2099646
58022 2099646 2044177 1987934 1932478 1880971 1831602 1781770 1733799 1690437 1649298 1607477 1567159
58011 1567159 1531141 1497256 1462683 1429540 1400929 1375486 1350824 1328226 1309101 1291030 1272263
58000 1272263 1255917 1244722 1235639 1224586 1212487 1201662 1190327 1176012 1160944 1148784 1138888 1128437
57988 1128437 1117358 1106873 1096221 1084903 1075063 1067797 1060401 1051040 1042566 1037893 1035373 1032749 1031644
57975 1031644 1033606 1035519 1033767 1029671 1026202 1022600 1016932 1010788 1006619 1003197 998228 992679 987979 981861
57961 981861 971662 959280 948290 938625 928413 918437 910228 902200 892364 882642 875944 871005 864499
57948 864499 856193 847609 837767 825022 811495 801083 794222 788548 783196 778439 772744 764396 754847
57935 754847 746743 740043 733675 729142 728458 730100 731204 732425 736575 743653 751260 758810 767279 775700
57921 775700 781914 786209 790616 795229 798594 800951 803595 805696 805066 801604 797084 792281 787051 782104
57907 782104 777680 771601 761802 749857 738985 729681 720393 711442 704968 701708 700687 701129 701914 700450
57893 700450 695315 688931 684517 681551 677429 672420 669396 669406 670912 672815 675082 676946 677606 678194 680277
57878 680277 683094 684887 685850 686875 686761 683975 679911 676897 674069 668929 662031 656056 650903 643945 635123
57863 635123 627702 623445 620623 617314 613455 609144 604091 599377 596936 596764 597096 597539 599463 603225 607807
57848 607807 613320 621069 630782 640331 648552 655963 662616 667700 671404 674812 677879 679761 680845 681894
57834 681894 681580 677817 671553 666196 662964 659717 654784 649093 643773 638326 632112 625501 618822 611980
57820 611980 605468 599898 594476 588046 581595 577418 575710 574316 572073 570050 569276 569668 571566 576025 583020
57805 583020 591223 599769 608406 616241 622647 629175 637834 647370 653906 655646 654425 652457 650240 647894
57791 647894 645542 641700 634168 623528 613141 604736 596605 587216 577812 569867 562385 553681 544194 535733
57777 535733 529078 523640 518539 513051 506808 500159 493524 486416 478287 470114 463443 457853 451223 442509
57763 442509 432351 420956 407727 393351 379965 368643 358701 349897 343085 338142 333551 328797 325030
57750 325030 322662 320478 317919 316018 315220 314569 314043 315385 319314 324106 328407 333451 340811 349651 357796
57735 357796 364115 368391 370268 369946 368915 368657 369405 370970 373633 377237 380602 382841 384311 385546 386363
57720 386363 386694 387072 387485 386915 384667 381064 376419 370759 364995 360668 357738 354293 349339 344335 340981
57705 340981 338973 337003 334518 331465 327665 323601 320749 320145 321655 325210 331242 339034 346255 351454
57691 351454 355815 361353 368480 376381 384509 392472 399474 405132 410172 415446 421038 426907 433324 439944
57677 439944 445665 450293 455179 461346 468057 474215 480063 486458 493389 500284 507164 514651 523375 533867
57663 533867 546348 560243 574593 589103 603959 618822 633340 648466 665589 684341 703212
57652 703212 722445 743942 767772 791308 813011 834901 859916 888782 920826 955894 993809
57641 993809 1033585 1074884 1118912 1166422 1216271 1267301 1320173 1375903 1434239 1495216 1560887
57630 1560887 1633701 1714181 1801787 1896879 2000364 2112731 2235065 2369882 2519285 2683470
57620 2683470 2862574 3058611 3273674 3507461 3758497 4026765 4312942 4615650 4931095
57611 4931095 5254426 5579442 5897644 6199208 6473575 6706667 6878701 6968884 6964848 6868097
57601 6868097 6691655 6454247 6175590 5873463 5562268 5253059 4953857 4669380 4401700
57592 4401700 4152511 3924085 3717229 3529864 3359465 3205871 3069922 2950357 2844386
57583 2844386 2750757 2669949 2601528 2543507 2494464 2454340 2422851 2398903 2381967 2372615 2371285 2377653
57571 2377653 2391387 2412412 2440396 2475155 2517593 2569110 2629994 2699432 2777124 2864031 2961655
57560 2961655 3071408 3194344 3330581 3479335 3640294 3814193 4000680 4196087 4394488
57551 4394488 4590416 4779189 4955205 5111654 5241694 5338472 5394634 5404198 5365808 5283201
57541 5283201 5162437 5009670 4831195 4633673 4423427 4206106 3987025 3770894 3561068
57532 3561068 3359610 3167822 2986148 2814282 2652352 2501425 2361978 2232909 2113385
57523 2113385 2004505 1907236 1819509 1737571 1659949 1588078 1523167 1464502 1410918 1361919 1317054
57512 1317054 1275891 1238935 1206895 1178834 1152718 1128041 1106204 1087914 1071954 1056981 1042928
57501 1042928 1030107 1018516 1008698 1001740 997618 994833 992550 991936 994571 1000422 1008182 1016880 1026563 1037909
57487 1037909 1051600 1067691 1085572 1104969 1126608 1151213 1178424 1207813 1240317 1277167 1317828
57476 1317828 1360739 1405921 1455095 1509212 1567759 1630802 1699897 1776411 1860364 1951346 2049222
57465 2049222 2153769 2265081 2384537 2513744 2652253 2797881 2949301 3106239 3266621
57456 3266621 3425416 3576839 3715709 3836124 3931293 3996165 4028746 4027992 3992655 3923758 3826533
57445 3826533 3708011 3573644 3427395 3273681 3117412 2962779 2813141 2671205 2538235
57436 2538235 2413942 2298164 2191784 2095331 2008011 1929111 1858993 1797519 1742854 1693247 1648915
57425 1648915 1610914 1579414 1554511 1537334 1528421 1525970 1527639 1533401 1544705 1561463 1582044 1606160
57413 1606160 1635694 1672322 1715937 1765959 1822860 1887707 1960942 2042097 2130345 2225248 2327320
57402 2327320 2437714 2556897 2683855 2816896 2954643 3095616 3237334 3376418 3508895
57393 3508895 3629550 3731541 3807789 3852959 3864042 3840057 3782185 3693694 3578729 3441453
57383 3441453 3286878 3121573 2952077 2782657 2615371 2451949 2294709 2145971 2007523
57374 2007523 1880317 1763734 1655472 1553303 1457016 1367965 1286936 1213257 1145677 1083186
57364 1083186 1025092 971184 921862 877424 837330 800783 767742 738552 712840 689646 668489
57353 668489 649367 631715 614383 596916 580116 564952 551451 538993 527306 516669 507173 498160
57341 498160 488825 479472 471632 466306 462400 457871 452382 447658 444988 443612 442190 440655 439753 439808 441114
57326 441114 444623 450845 458452 465259 470396 474507 478038 480471 481307 480909 480144 479683 479684 479829 479902 480675 483746
57309 483746 489876 497775 505005 509907 512410 513619 515144 518260 523083 528881 535473 543523 552948 562020
57295 562020 568963 573894 578365 583537 589505 595815 601918 607703 614294 623523 635786 649242 662080
57282 662080 674727 688714 704078 719185 732665 744395 755024 765599 777230 790125 803336
57271 803336 816332 830184 846222 864234 883136 902713 923384 944804 966024 986667 1006775
57260 1006775 1026020 1044215 1062094 1080373 1098638 1116389 1134539 1154458 1176209 1199090 1223137
57249 1223137 1248543 1274447 1300218 1327187 1356889 1388152 1418393 1447755 1479377 1515167 1553470
57238 1553470 1591554 1628409 1664455 1700380 1737218 1776076 1816976 1859191 1903161 1950600 2002156
57227 2002156 2056524 2112595 2171060 2232975 2297910 2364397 2431250 2497688 2562935 2626304 2687071
57216 2687071 2743984 2795648 2841675 2882744 2919531 2952338 2981460 3006715 3026890 3041041 3050311
57205 3050311 3057046 3062256 3065649 3068174 3072621 3081164 3093894 3110176 3129756 3151976 3175470 3199359
57193 3199359 3223492 3247136 3268951 3288609 3306797 3323060 3335336 3342288 3344514 3342828 3337137 3327969
57181 3327969 3317500 3307920 3299992 3294033 3290947 3291471 3295804 3304835 3320431 3343576 3373540 3409701 3452817
57168 3452817 3503542 3560884 3623042 3688658 3756540 3825374 3894399 3963119 4029890 4092357 4149957
57157 4149957 4204305 4256357 4304982 4349229 4390034 4428462 4463989 4495933 4524998 4552143 4577512
57146 4577512 4601846 4627194 4654618 4682624 4709610 4736473 4765084 4795369 4825755 4855657 4885881
57135 4885881 4917193 4949722 4983067 5016027 5047231 5076994 5107433 5139823 5173121 5205927 5238248
57124 5238248 5270149 5300370 5327656 5351903 5372587 5387718 5395817 5397410 5393104 5381950 5363296 5338463
57112 5338463 5308774 5273589 5232210 5186050 5136953 5085010 5030094 4973942 4918522 4863681 4808352
57101 4808352 4752428 4695242 4633841 4565131 4488431 4403866 4310115 4206263 4094222 3976605 3853583
57090 3853583 3724370 3590183 3453054 3313320 3171325 3030173 2893711 2762733 2635597
57081 2635597 2510749 2385485 2253922 2109945 1951382 1778573 1590548 1386139 1167301
57072 1167301 937417 697248 445864 183867 -88425 -374823 -681037 -1009650 -1361370 -1740412
57062 -1740412 -2154654 -2611619 -3118624 -3685833 -4324430 -5042312 -5845794 -6744752 -7752076
57053 -7752076 -8879669 -10139897 -11549681 -13128304 -14893080 -16862884 -19064537 -21530126
57045 -21530126 -24290392 -27377576 -30833271 -34707287 -39052577 -43931416 -49426878 -55641995
57037 -55641995 -62692531 -70712887 -79868588 -90351416 -102359026 -116078982 -131673011
57030 -131673011 -149248262 -168837126 -190404665 -213836926 -238869873 -265055754 -291910953
57023 -291910953 -319157516 -346714704 -374257562 -400669202 -423954366 -441796574 -452353553
57016 -452353553 -454748807 -449088095 -436208318 -417405479 -394219564 -368245179 -340945667
57009 -340945667 -313491196 -286667803 -260897824 -236357259 -213111744 -191197895 -170648116
57002 -170648116 -151499675 -133801661 -117603632 -102928985 -89759838 -78042486 -67696360
56995 -67696360 -58617424 -50685224 -43775998 -37770647 -32554883 -28021464 -24076307 -20639072
56987 -20639072 -17637547 -15006214 -12690710 -10648240 -8841765 -7237410 -5807961 -4533951
56979 -4533951 -3399128 -2387656 -1486089 -683926 29440 665374 1232561 1736153 2181383
56970 2181383 2575286 2924146 3232263 3504253 3745542 3959500 4147002 4309948 4452209
56961 4452209 4575567 4677699 4756511 4814375 4855973 4883710 4897515 4897913 4886919 4866312 4837135
56950 4837135 4801362 4762938 4726310 4694092 4667028 4647081 4639397 4647377 4662589 4660795 4612013 4497084
56938 4497084 4315521 4080124 3807548 3513355 3210944 2911215 2622836 2352896 2106065
56929 2106065 1883156 1682384 1502481 1343086 1202381 1077088 965555 868304 784213 708472
56919 708472 636066 565662 498528 435273 375502 319223 266411 215846 166362 118984 76390
56908 76390 40419 11283 -11147 -26660 -35233 -37241 -32956 -22434 -5900 16131 42874 72991
56896 72991 104650 136107 165848 191991 212390 226040 234002 238542 241716 244853 248524 252461 256120
56883 256120 259701 264075 269640 276248 284584 296362 312384 331332 351258 371418 392050 413467
56871 413467 436328 461666 489095 515393 535994 547754 549771 542563 527778 508277 486973 465429
56859 465429 444119 423591 404425 386529 369697 354616 342237 332264 323439 315393 309214 305935
56847 305935 305188 305565 305785 305549 305784 307917 312277 317254 320614 321562 321161 321075 322390 325079 327845 329013
56831 329013 328538 328704 331803 337562 344068 350828 359193 369640 380305 388867 394615 397984 399257 398864
56817 398864 398216 399093 402310 407599 414700 423981 436049 451079 468607 488005 509188 532716 559045
56804 559045 587977 619155 652743 689135 728424 770560 815083 859399 897846 924355 936534
56793 936534 936295 926702 909844 887946 864360 842029 822054 804928 792206 785615 785219 789742 798415
56780 798415 811555 829736 853417 883159 919290 961477 1009255 1062394 1119431 1175729 1224061
56769 1224061 1257766 1273389 1270874 1252354 1221121 1181046 1136163 1090323 1046801 1007765 974023
56758 974023 945442 921647 902582 888883 881813 882351 890177 904005 922901 946549 974229 1004712
56746 1004712 1037479 1072335 1106407 1132601 1143152 1135258 1112562 1081391 1046424 1009563 971322
56735 971322 932520 894961 860679 830445 803538 779520 759524 744921 735395 729628 727456 729843
56723 729843 736839 747111 759631 774181 789672 803396 812685 816227 813163 802335 783666 759480
56711 759480 733230 707241 682360 659079 637857 618553 600585 583719 568193 554175 541614
56700 541614 530463 520616 511826 504113 497878 493089 488759 484055 479632 476904 475919 474997 472843 470071
56686 470071 467833 465635 461778 455955 450238 446892 445948 445738 445263 444993 445548 446829 448712 451425 454612
56671 454612 456950 457596 457282 457076 456638 454817 451589 448238 445700 443822 442238 440936 439784 438483 437259
56656 437259 436786 437148 437614 437621 437299 436833 436086 435133 434488 434618 435772 438230 441790 444946 445677 443547 440197
56639 440197 437427 435713 435032 435914 438647 442113 444514 445074 444358 443138 441546 439205 435774 431454 427172
56624 427172 423984 422134 421027 420217 419827 419779 419264 417521 414778 411991 409882 408492 407441 406435 405700 405933
56608 405933 407580 410264 413284 416362 419349 421606 422502 422297 421624 420497 418996 418492 420520 424342 427351
56593 427351 428250 428190 428379 428505 428430 429490 432504 435843 437083 435802 433476 431358 429699 428295 426719 424620
56577 424620 422620 422026 422816 423098 421692 419920 419335 418983 416839 413137 410108 408884 408582 408319 408249 408543 408993
56560 408993 409788 411235 412527 412204 409968 406886 403868 401317 400234 401934 406131 410609 413407 414368 414295
56545 414295 413698 412811 411867 410882 409856 409334 409909 411071 411644 411578 412156 413976 415833 416334 415751 415421 415867 416349
56527 416349 416079 415316 415218 416844 420214 424293 427961 430901 433432 435844 438237 440626 442687 443720 443413
56512 443413 442384 441490 441032 441267 443128 447363 453263 459285 464990 471378 479187 487711 495632 502408 508549
56497 508549 514878 521721 528653 535091 541166 547582 554498 561132 566853 571937 576681 580520 582785 583733
56483 583733 584012 583680 582448 580352 577509 573864 569835 566337 563376 559703 554785 549959 546364 542965 538221
56468 538221 532617 527655 523198 517901 511728 505937 500832 495608 490259 485697 481942 478015 473747 470002
56454 470002 467005 464041 460786 457519 454268 451292 449810 450280 450507 447882 443226 439841 438811 438088 436444
56439 436444 435213 435228 435121 434046 433482 434605 436158 436743 437344 439653 443397 447049 449878 451751 452153 451002
56423 451002 449504 448964 449655 451663 455341 459854 462957 463800 464543 467561 472303 476657 480230 484178 488558
56408 488558 492086 494496 497390 502353 509207 516297 521892 525369 527524 529612 532060 534665 537919 542870
56394 542870 549331 555543 560231 563802 566909 569190 570217 570351 569712 567553 563569 558695 553774 548758 544021
56379 544021 540793 539100 536945 533029 528787 526084 524303 521661 518214 515458 513829 512639 511884 512030 512335
56364 512335 511337 508952 506543 504994 504154 503851 503929 503457 501586 499213 498355 499710 502056 503999 504996 504705
56348 504705 502967 500890 500526 502691 506017 508875 511367 514465 517628 518431 515042 508577 502378 498995 498503
56333 498503 499842 502626 506585 510106 511124 509580 507556 506802 507464 509275 512203 515389 517266 517675 518354
56318 518354 520380 522711 524383 526500 530516 535778 540493 544220 547737 551137 553619 554860 555325 555585 556330
56303 556330 558616 563112 569484 577133 585792 594602 601646 605608 607263 608350 609702 611476 614318 618968
56289 618968 625233 632370 639957 647487 653784 657893 660111 661356 662167 662949 664288 666131 667467 667758 667927
56274 667927 669131 671444 674487 678341 683005 688045 693680 701028 710213 719457 727246 734306 742276 751500
56260 751500 761345 771607 782254 792782 803109 814238 826858 840208 853277 865990 878339 889887
56248 889887 901324 914827 931223 948207 963143 976279 989445 1002959 1015930 1028513 1041620
56237 1041620 1055080 1068015 1080499 1093080 1105277 1116205 1126133 1136005 1146131 1156704 1168665 1182602
56225 1182602 1197768 1213659 1231509 1252693 1276794 1302853 1331368 1363383 1398786 1437264 1479689
56214 1479689 1526767 1577623 1631639 1690247 1754800 1824123 1896635 1973726 2058456 2151848 2253020
56203 2253020 2362115 2480573 2609100 2747758 2897512 3059436 3233032 3417553 3614267
56194 3614267 3825109 4049563 4284705 4527309 4773806 5019449 5260155 5494169 5719277
56185 5719277 5929468 6117366 6279206 6414335 6520644 6594110 6633092 6640041 6618519 6571037
56175 6571037 6500029 6408592 6299851 6177308 6045401 5907616 5764473 5615450 5462202 5307647
56165 5307647 5152685 4996415 4838889 4680929 4521835 4360217 4196823 4033949 3872487
56156 3872487 3712227 3554558 3402069 3255762 3115156 2980441 2851758 2727389 2606070
56147 2606070 2490570 2385427 2291280 2204647 2123002 2046672 1975959 1910172 1849788 1796146 1748551
56136 1748551 1704660 1663860 1627110 1593609 1561212 1530307 1503633 1481705 1461920 1442704 1425058
56125 1425058 1409425 1394619 1380798 1370133 1363373 1358708 1354904 1352689 1352290 1352673 1354037 1358051 1364704
56112 1364704 1371810 1378642 1387334 1399743 1415298 1432662 1451097 1469758 1488111 1507361 1529192 1553132
56100 1553132 1577630 1603198 1631408 1661276 1690176 1718078 1747177 1777485 1806719 1834663 1863565
56089 1863565 1893933 1924188 1955109 1990368 2031753 2077849 2128427 2186162 2252956 2328477 2413465
56078 2413465 2510637 2621035 2742938 2875264 3018200 3169307 3322611 3472704 3616493 3750557
56068 3750557 3871135 3977982 4074564 4163340 4244120 4317083 4382724 4437857 4476220 4494544 4494482
56057 4494482 4478303 4447298 4404894 4355723 4299727 4231682 4148011 4049706 3937885 3812213 3675652
56046 3675652 3535393 3396593 3259786 3126396 3001789 2890347 2791999 2705744 2632022 2569547
56036 2569547 2514692 2466478 2427714 2399075 2376672 2357611 2343185 2334403 2329143 2325929 2325664 2327464
56024 2327464 2327689 2325300 2323161 2322056 2318886 2313012 2308637 2308245 2309215 2309704 2312238 2318645 2327011 2336582 2349988
56009 2349988 2367673 2385851 2402988 2422470 2445873 2469702 2491959 2515655 2542501 2569640 2596243
55998 2596243 2626584 2662462 2699107 2732986 2767224 2804983 2843982 2882295 2923094 2968645 3015681
55987 3015681 3061483 3108522 3158551 3208432 3256600 3307273 3363530 3422582 3482307 3545610 3613698
55976 3613698 3682335 3749585 3819800 3894936 3970013 4042626 4118617 4202277 4289301 4376022 4467220
55965 4467220 4567860 4675298 4786742 4905949 5035197 5169268 5305210 5449471 5607300
55956 5607300 5773951 5944889 6125579 6321883 6529612 6743379 6967403 7207637 7461519
55947 7461519 7725371 8003533 8299970 8609151 8925423 9253047 9596958 9952786 10316660
55938 10316660 10695719 11098190 11522754 11968764 12446675 12966509 13526231 14123306 14766484
55929 14766484 15463585 16209622 17000624 17847100 18759675 19734390 20767584 21871961 23061601
55920 23061601 24334765 25688781 27137638 28696428 30363185 32135555 34029792 36062591
55912 36062591 38230774 40531669 42987067 45624351 48453804 51491603 54786775 58398803
55904 58398803 62370938 66756373 71648318 77153663 83366678 90407400 98454518 107695929
55896 107695929 118282000 130381681 144251848 160199860 178529439 199591877 223819761
55889 223819761 251601523 283168485 318627986 357717120 398830277 437983754 469230175
55882 469230175 486982672 488635098 475373169 450855951 419280671 384233367 348411572
55875 348411572 313654655 281046172 251135845 224174921 200203537 179060267 160465495
55868 160465495 144136411 129812467 117228597 106139998 96366644 87771066 80206155
55861 80206155 73519754 67590901 62323162 57616073 53377021 49549141 46097095 42975593
55853 42975593 40136938 37555018 35213750 33082125 31124954 29326751 27680322 26161818
55845 26161818 24740893 23406759 22161570 20995992 19892985 18848577 17867860 16946174
55837 16946174 16073291 15250300 14483613 13767241 13088223 12444569 11841403 11274686 10735197
55828 10735197 10223832 9747002 9301020 8876180 8472177 8094697 7740610 7401000 7075401
55819 7075401 6769065 6479525 6199757 5931716 5683160 5453184 5233603 5022569 4824661
55810 4824661 4639516 4462155 4292640 4134149 3983432 3834243 3688346 3552436 3426056
55801 3426056 3303043 3182729 3068870 2959173 2846801 2731388 2618536 2509455 2401024
55792 2401024 2295183 2198348 2111655 2030687 1954292 1884931 1821105 1758383 1697710 1644316 1598738
55781 1598738 1556963 1518757 1487444 1461750 1436153 1409608 1386209 1367083 1349069 1331683 1318064
55770 1318064 1308393 1299095 1289082 1280576 1273448 1264719 1253844 1242885 1231538 1217260 1199865 1180830
55758 1180830 1159080 1132842 1104395 1077411 1051017 1022373 993473 968955 948378 927301 905096
55747 905096 885069 867576 849805 832216 818614 809607 802108 795497 792368 792939 794385 795915 799084
55734 799084 802987 804562 803830 803560 803766 801698 797136 792449 787437 779488 768957 759133 750698 741281 730720
55719 730720 721792 715357 709430 703146 697120 689942 678957 664503 649124 633109 615283 597349 582419
55706 582419 569885 556892 544106 534482 526827 516607 503195 490491 479974 468927 456296 444579
55694 444579 434749 424657 413840 405080 399734 395868 392102 389128 386687 383327 379683 377667 375959 370947
55680 370947 362700 355242 350229 345106 338413 332019 327040 322354 318466 318052 320959 322961 321154 316708
55666 316708 311163 304302 297116 292422 290502 287828 281975 274551 267921 262503 258472 256505 255407 252491
55652 252491 247677 243842 241999 239799 236149 233594 234432 237731 241834 246673 252025 256468 259611 262733
55638 262733 266052 267983 268044 267713 267533 266226 263496 260946 259591 259325 261203 266932 275561 283970 291206
55623 291206 298970 307413 314262 318915 323551 329135 333919 336932 339249 340831 340004 337436 336701 339178 341835
55608 341835 341718 339323 336111 332209 328225 326037 326032 326600 327604 330880 335969 339174 338827 337930 339583 343168
55592 343168 347124 351947 357952 363143 365998 367781 369807 370921 369913 367942 366390 364647 362060 359609
55578 359609 357526 353638 346342 337200 328573 320583 312137 302895 292530 280205 266536 254129 244591
55565 244591 236850 229594 222958 216582 208766 199303 190627 184317 178838 172516 166319 161800 158626 156015
55551 156015 154397 153721 152359 149623 147346 147128 147964 148180 147517 145770 141875 136266 131723 129772 128443
55536 128443 125699 122838 122227 123628 125036 125413 124533 121827 117531 113453 110867 109155 107926 108292 110369
55521 110369 111805 110976 109508 109395 109607 108107 105565 104493 105934 109172 113486 118077 121437 122878 123815
55506 123815 125999 129543 133870 138904 143828 146513 146106 144607 144000 143389 140885 136738 132453 128166 123132
55491 123132 117823 113452 110127 107118 104263 101762 99429 97351 96367 96839 97910 98739 99260 99241 98310 97488
55475 97488 98660 101716 104382 105710 107313 110226 113388 116550 121577 128885 135435 138686 140055 142147
55461 142147 144940 147237 149542 152678 155457 156536 156994 158554 160779 162328 163206 163472 161624 156877 151295
55446 151295 147092 143561 139178 134833 132095 130049 126824 122611 118223 112415 103945 94808 87957 83054
55432 83054 77861 72615 69294 67453 64777 61420 59923 60677 61050 59505 57444 56277 55495 54382 53240
55417 53240 52189 50808 49401 48764 48475 47305 45429 44315 44340 44425 44007 43463 42532 40273 36840 33563 31092
55400 31092 29052 27552 27481 29158 32007 35406 38561 40099 39385 37830 37218 37182 36106 34113 33142 34238
55384 34238 36573 39085 41298 42432 41446 38306 34146 30175 27310 26299 26973 28001 28635 29972 33113
55369 33113 36945 39324 39668 38808 37264 35553 35237 37452 40894 43260 44145 44602 44659 43571 42010 41585
55353 41585 42373 43081 43408 44092 44859 44657 43848 43992 45396 46931 48268 50097 52053 52660 51682 50503 49769
55336 49769 48556 46401 44435 43921 44942 46712 47986 47272 44190 40579 38798 38997 39442 39200 38805 38645
55320 38645 38595 39134 40798 42463 42154 39835 37668 37239 38136 39321 40246 40417 39516 38246 37616 37338 36374
55303 36374 34905 34115 34156 34091 33811 34062 34496 33641 31139 28253 25884 23788 22040 21461 22097 22833 22957 22673
55285 22673 21870 20027 17767 16925 18464 21478 24511 26744 27813 27845 27753 28203 28350 27030 25057 24538 25807
55268 25807 26866 26206 24513 23138 22431 22232 22666 23839 25564 27599 29409 29966 28908 27458 26905 26692
55252 26692 25564 23976 23410 23699 23202 21516 19862 18766 17572 16415 16439 17681 18937 20098 22389 25668
55236 25668 27771 27495 26241 25704 25824 26098 27050 28936 30331 29416 26036 21736 18532 17975 20329 24108
55220 24108 27310 29323 30794 31898 32176 31938 32059 32228 31267 29544 29104 30746 32677 32819 31002 28273
55204 28273 25627 24200 25257 28885 33498 37212 39094 39161 38322 38203 39623 41315 41535 40630 40220 40290 39395
55187 39395 37706 37150 38039 38208 36485 34683 34883 36697 38418 39153 38705 36990 34661 32894 31622 29495
55171 29495 26212 23299 21890 21574 22074 23949 26704 28360 28163 27720 28211 28477 27319 25719 25092 25127 25075
55154 25075 25549 27167 28905 29687 30414 32549 35786 38820 41408 43861 45458 45244 43836 42829 42875 43651
55138 43651 45028 46888 48376 48749 48488 48429 48363 47652 46623 46076 45888 45311 44363 43859 44277 45365 46620 47557
55120 47557 47838 47550 46974 45956 44287 42813 42966 44820 46757 47585 47795 48234 48847 49339 49743 49705 48624
55103 48624 47164 47035 48470 49551 49124 48644 49790 51772 52590 51739 50098 48164 45830 43167 40316 37493
55087 37493 35901 37177 40754 43347 42628 40105 38689 38745 38511 37326 36302 36287 37101 38510 40345 41888
55071 41888 42513 42716 43431 44692 45931 46920 47434 46824 45164 44025 44831 47126 49658 52246 55227 58079
55055 58079 60204 62325 65370 68610 70609 71581 73021 75248 77065 77836 78364 79485 81060 82571 83788
55040 83788 84705 85442 86194 86935 87600 88797 91390 94802 96923 96646 95412 95222 96265 97654 99235 101209
55024 101209 103136 104807 106928 109273 109558 106372 102174 100786 102398 103625 102351 99942 98417 97926 97831
55009 97831 98249 99343 100439 100808 100529 99968 99129 97864 96105 93830 91417 89754 89128 88253 85476 80827
54993 80827 75980 72457 70803 71118 73177 76132 79149 82059 84567 85584 84674 83468 83935 85633 86451
54978 86451 85778 85007 84927 84710 83855 83183 83115 82667 81166 79680 79648 81105 83176 85598 88706 92322 95443
54961 95443 97024 96780 95379 93957 93344 93805 95428 98145 101077 102815 103136 103665 105874 109170 112000 113962
54945 113962 115360 115583 113960 111868 111797 114033 116203 116550 115918 115891 116622 117348 117612 117034 115111 112293 110344
54928 110344 110529 112067 113208 113271 112941 113063 113891 115196 116494 117396 118005 118620 118873 117738 114886 111597 109818
54911 109818 110349 112093 112973 111682 108896 106792 107092 109716 113544 117859 122283 125849 127581 128181 129842
54896 129842 133728 138461 141884 143773 146000 150209 156062 162057 167661 174116 182989 194264 206433 218408
54882 218408 230666 244318 259753 276562 293979 310670 324765 335034 341725 345536 346164 342658
54870 342658 334792 323221 308654 291929 274652 258685 244877 233075 223258 215640 209531 203157
54858 203157 195146 185789 176619 169066 163579 159639 156488 154018 152843 153411 155437 158497 162665 168073
54844 168073 174267 180642 187205 194430 202743 212565 224395 238157 252856 267358 281138 293785 304368
54831 304368 311992 316533 318243 317044 312703 305275 295032 282516 268902 255409 242037 227993 213764
54818 213764 201371 191830 183752 175372 166473 157347 147631 137696 129441 123835 119194 113983 109825 109183
54804 109183 111248 112919 113077 112945 112748 111213 108488 106515 105941 105369 104349 104486 106570 108923 109723 108942
54788 108942 107030 103818 100003 97780 98342 100161 101110 100974 100530 99476 97008 93679 91085 89918 89379
54773 89379 88344 86365 83768 81350 79889 79648 80538 82579 85638 88798 90813 91277 90730 89799 88988 88973
54757 88973 90039 91463 92596 94212 97444 101653 104971 106916 108774 111310 113834 115837 117848 120221
54743 120221 122610 125104 128332 132056 135212 137826 141285 146269 152083 158534 166528 176062 185558 194267
54729 194267 203582 214912 227976 242439 259357 279184 299649 317426 331189 341606 349161 353420
54717 353420 353857 350123 342097 330723 318224 306420 295371 284510 274328 265926 259549 254540 250239
54704 250239 246093 241567 236815 232903 230625 229665 229409 229701 230254 230570 231383 234904 242225 251469 260018 267888
54688 267888 277309 289417 303061 316858 330900 346008 362441 379948 398525 418447 439474 460053
54676 460053 477502 489418 495087 495202 490330 480406 465810 447970 428438 408019 387197 366675
54664 366675 347067 328708 312065 297595 284814 272341 259355 246435 234754 225114 217755 212036
54652 212036 206196 198750 190540 184153 180831 179218 177616 175965 174805 173748 172140 170075 167672 164381
54638 164381 160053 155721 152396 150068 148752 149243 151613 154100 154941 154553 154642 155919 157839 159756 161079
54623 161079 161007 159407 157363 155815 154403 152799 152224 154101 157755 160940 162400 162741 163181 164630 167618
54608 167618 171940 176587 180940 185591 191104 196632 200919 204010 206749 209189 210898 212417 214856 218218
54594 218218 221474 224257 227172 230393 233268 235582 238224 242219 247695 253873 259547 263735 266548 269394
54580 269394 273944 280902 289955 300252 310677 320479 330376 342222 356900 373357 390367 408152
54568 408152 427154 446280 463805 479162 492216 501395 504363 500651 492264 481537 469374 455545
54556 455545 439775 422585 405601 390527 377175 363360 347849 332437 319744 309767 300405 290756
54544 290756 281832 274105 266441 257949 249304 241736 236011 232691 231887 232104 230700 226443 220885 216485 213899
54529 213899 211582 207526 200996 193031 185648 180324 177045 174836 172914 171003 168966 166748 164475 162054
54515 162054 158947 154870 150465 146751 144223 142867 142484 142461 141942 140958 140679 141715 142851 142473 140544 138218
54499 138218 136178 134580 133896 134352 134893 134118 132061 129950 128605 128326 129756 133230 137407 140220 141212 141566
54483 141566 141866 141389 139872 138470 138478 140119 142963 146549 150348 153996 157787 162168 166743 170693 174161
54468 174161 178331 184006 190800 197704 203923 209569 216068 225107 236249 246526 253713 259016 264828 270760
54454 270760 274157 274100 272339 270110 266503 260682 253585 246419 239087 231021 222210 212688 202386 192262
54440 192262 184186 178839 174835 170622 166164 162197 159023 156692 155215 153928 151834 149247 147872 148487
54426 148487 149723 150083 150005 150821 152471 153450 152695 150718 149052 148897 149965 150613 149723 148336 148531 150842 153988
54409 153988 156957 159665 161409 160849 158545 157630 160452 165662 170055 172342 173683 175273 176847 177396 176302
54394 176302 173877 171368 170010 169579 168569 166406 164572 164615 165711 165397 162483 158273 154967 153534 153207
54379 153207 152604 151246 149941 149489 149269 147809 144651 140810 137423 134964 133825 134308 135593 135991 134879
54364 134879 133419 132869 133327 134611 136895 139641 141330 141418 141400 142704 144684 146019 147032 149006 152035 155210
54348 155210 158376 161930 165195 166805 166843 167143 169126 172403 175700 178194 179863 181493 184508 189779 196329
54333 196329 201999 205559 207449 208384 208252 206834 204747 202996 201967 201323 200660 199869 198932 197600 195329 191670
54317 191670 186935 182366 179235 177680 176655 175132 173167 171604 170888 170478 169662 168750 168844 170155 171111 169894
54301 169894 166675 163604 162501 163151 163875 163130 160546 157193 155026 155346 157543 159895 161520 162687 163310
54286 163310 162573 160578 159029 159374 161254 163679 166677 170591 174579 177299 178803 180417 182784 185119 186443
54271 186443 186574 185780 184301 182487 180725 178943 176604 173360 169398 165203 161361 158442 156520 154791 152221
54256 152221 148742 145423 143350 142612 142395 141760 140130 137321 133449 129017 125036 122705 122521 123678 124737
54241 124737 124894 124203 122618 119637 115342 111116 108579 108040 108524 109096 109533 109860 109954 109851 109885 110162 110137 109204
54223 109204 107624 106425 106187 106376 106357 106652 108273 110719 111804 110110 106815 104257 103447 103981 105617 108401
54207 108401 111544 113855 115512 117882 121154 123531 123510 121883 120661 120840 121995 123308 124231 124567 124603 124799
54191 124799 124978 124318 122583 120781 120148 120921 122453 124081 125543 126880 128150 128989 128660 127184 125995 126360
54175 126360 127325 126717 124340 122524 122975 124767 126315 127694 129645 131598 132375 132100 131869 132011 132019 131880 132205
54158 132205 133206 134565 136117 137693 138585 138149 136841 135768 135352 135086 134500 133624 132751 132320 132734 133620 133640
54141 133640 131760 128441 124955 121952 119396 117461 116471 116160 115876 115485 115375 115609 115699 115230 114238 113115 112559
54124 112559 113293 115191 116794 116360 113535 109773 107185 106981 108640 110415 110990 110791 111219 112645 113965 114281
54108 114281 113987 113703 113101 111609 109626 108314 108573 110522 113293 115114 114577 112351 110711 110849 111687 111834
54092 111834 111348 110727 109579 107620 105810 105132 105104 104809 104534 105030 105954 106418 106294 105630 103698 100166 96375
54075 96375 93730 91583 88671 85887 85302 86640 87138 85375 83142 82848 84679 87084 88686 88950 88100 87162
54059 87162 87324 88720 90403 91697 92791 93905 94744 95042 94983 94928 95245 96229 97515 97870 96469 94108 92230
54042 92230 91088 89974 88942 88989 90536 92897 95291 97365 98894 100047 101793 104858 108375 110787 111833
54027 111833 112315 112239 110898 108778 107546 107769 108280 108213 108106 108436 108678 108583 108994 110480 112301 113589 114577 115901
54009 115901 117580 119346 121141 122630 123026 122123 120853 120342 120874 122012 123089 123511 123403 123925 125956 128539
53993 128539 129899 130004 130529 132101 133379 133546 133908 135963 139377 143023 146681 150438 153673 156104 158917
53978 158917 163323 168726 173787 178711 184918 192723 200911 208675 216624 225423 234434 242298 248487 253946
53964 253946 260295 268403 277597 286363 293752 299888 305198 309820 313846 317451 320493 322659 324299 326349
53950 326349 328909 330655 330267 327871 324543 320944 317027 312546 307233 300930 294176 288186 283585 279507
53936 279507 274635 268863 263355 259165 256330 254060 251294 247287 242252 237383 233769 231169 228164 223646
53922 223646 218115 213490 211530 212317 214294 215830 216430 216392 216005 215700 216256 217794 218948 218169 215754 213452
53906 213452 212161 211293 210361 209757 209698 209823 210300 211887 214241 215624 215284 214997 217107 221842 227485 232389
53890 232389 235875 237855 238736 239300 239838 239823 239062 238681 240220 244083 249383 254856 259555 263336 267110 271874
53874 271874 277126 281242 283982 287434 293539 301737 310111 317850 325273 332266 338162 342741 345963 347157
53860 347157 345860 343288 341588 341649 342718 344132 346291 349782 354559 360203 366354 372851 380063 388884 399556
53845 399556 410586 419658 425719 429646 433035 436923 441291 444982 446304 444637 441330 438203 435389 431622
53831 431622 426456 420994 416313 412275 408163 403526 397977 391082 383035 374822 367233 360061 352560 344238
53817 344238 335049 325377 316217 308846 303849 300644 298059 295075 290915 285023 277448 269076 261125 254412
53803 254412 249096 244759 240521 235420 229130 222432 216803 213301 211700 210693 209058 206687 204345 202490
53789 202490 200704 198396 195627 192805 189880 186414 182398 178517 175475 173381 171923 170823 169903 168862
53775 168862 167445 166075 166106 168801 173656 178091 179420 177193 173296 170009 168474 168765 170334 172070 172791
53760 172791 172291 171453 170988 170635 170042 169804 170911 173512 176849 180239 183623 187318 191621 196465 201133 204623
53744 204623 206736 208619 211769 216569 222025 226807 230333 233128 236455 241443 248295 256302 264594 272567
53730 272567 279639 285173 289002 291753 294319 297092 299731 301592 302488 303233 305095 308297 311400 312781 312249
53715 312249 310463 307416 302890 298115 295198 294535 294238 292584 289660 286155 282080 277554 273414 269979 266376
53700 266376 262103 258133 255388 253227 250656 248029 246260 245199 244125 243160 242909 243253 243619 243870 243945 243403
53684 243403 242348 241913 242703 243726 244156 244969 247181 249517 249851 248226 246358 244742 242533 239992 238607
53669 238607 238552 238295 237266 236816 237767 238858 238594 237249 236066 235625 235803 236319 236587 235859 234073 231884 229746
53652 229746 227844 226991 228274 231499 235204 238550 241883 245154 247391 248443 249798 252670 256443 259870
53638 259870 262683 265029 266557 267325 268679 271884 276431 280865 284802 288916 293369 297578 301463 305743
53624 305743 310734 315650 319413 321795 323595 325944 329321 333034 335775 336898 336960 336898 337092 337380 337484 337017
53608 337017 335648 333842 332986 334002 335977 336875 335642 333088 330591 328542 326377 323737 321080 319132 318174
53593 318174 318105 318868 320381 322095 323143 323074 322077 320430 318344 316492 315912 316850 318322 319490 320821 323012
53577 323012 325350 326355 325884 325584 327117 330739 335544 340339 344338 347789 351851 357069 362216 365616 367390
53562 367390 369213 371942 374860 377450 380353 383932 387133 388773 389233 390116 392681 397056 402367 407193 410534
53547 410534 412819 415443 419068 423092 427022 431348 436512 441968 447196 452968 460549 469884 479366 487372
53533 487372 493566 498776 503913 508941 512860 514949 515939 517414 520052 523232 526338 529411 532215 533913
53519 533913 534566 535914 539460 544260 547844 549131 549283 549639 549977 549375 547965 546877 546652 546570 545916 545251 545706
53502 545706 547333 549104 550650 552845 556113 559256 561010 561914 563330 565191 566255 566386 567016 569264 572969
53487 572969 577641 582866 587605 590680 592493 594824 598381 602144 605753 610760 618301 627046 635056 642502
53473 642502 650888 660336 669483 677790 686321 696030 706484 716640 726142 735569 745916 757933 771731
53460 771731 787005 803502 820871 838269 855086 872335 892134 915170 939668 963613 987001
53449 987001 1011059 1036242 1062160 1088645 1115651 1142796 1170313 1199890 1233055 1268988 1305346
53438 1305346 1341087 1377139 1414343 1452123 1489462 1525993 1561843 1597448 1633795 1671715 1710404
53427 1710404 1747572 1781674 1813403 1844493 1875744 1906910 1938006 1969733 2002408 2035130 2066540
53416 2066540 2096428 2126100 2156871 2188477 2219495 2249137 2277720 2305250 2330542 2352490 2371541
53405 2371541 2389127 2405960 2421478 2434544 2444008 2449053 2449821 2447650 2444004 2439134 2432082 2421735 2407610
53392 2407610 2390127 2370641 2350646 2330337 2308490 2284430 2259446 2235328 2212003 2187784 2161637
53381 2161637 2134149 2106414 2079069 2052384 2026217 1999851 1972873 1946260 1921579 1899012 1877296
53370 1877296 1855835 1835779 1818516 1804183 1792419 1783662 1778562 1776316 1774613 1771662 1767992 1765966 1767469
53357 1767469 1772165 1778175 1784304 1791051 1799348 1809233 1820502 1834044 1851313 1872452 1895951 1920379
53345 1920379 1945675 1972550 2001455 2032592 2066335 2102955 2142149 2183264 2225930 2270350 2317055
53334 2317055 2366515 2418871 2474002 2531778 2592082 2654523 2718474 2783575 2849862 2917217 2985182
53323 2985182 3053668 3123254 3194146 3265311 3335382 3404179 3472633 3541389 3610126 3677966 3743828
53312 3743828 3806543 3865364 3920256 3971192 4017482 4058467 4094321 4125127 4149673 4166436 4175603
53301 4175603 4178713 4176325 4167636 4152687 4133226 4110396 4082792 4048070 4005792 3957762 3906006 3851383
53289 3851383 3793918 3733782 3671982 3610215 3549690 3489906 3429300 3367433 3305726 3245626 3187071
53278 3187071 3129595 3073906 3020994 2970187 2919561 2868153 2816456 2764757 2712606 2660530 2610856
53267 2610856 2565554 2523938 2483674 2443768 2405504 2370469 2338822 2309894 2283572 2260234 2239646
53256 2239646 2220619 2201801 2182535 2163008 2143835 2125253 2106495 2086401 2065204 2045267 2029150
53245 2029150 2016987 2006623 1996392 1986739 1978889 1973047 1968710 1965894 1965092 1966429 1969669 1974705 1981408
53232 1981408 1989433 1998950 2011104 2026845 2045586 2065963 2087689 2111547 2137569 2164492 2191389 2218861
53220 2218861 2247915 2278314 2308740 2338272 2367025 2395328 2422780 2448435 2471696 2492619 2511078
53209 2511078 2526094 2536697 2543367 2547703 2550403 2550491 2547043 2540663 2532352 2521815 2508135 2491579 2473429
53196 2473429 2454207 2433319 2410343 2385503 2358879 2330336 2300337 2269800 2238926 2207110 2173990
53185 2173990 2139616 2103733 2066321 2028960 1994102 1962425 1932123 1901359 1870135 1839198 1808590
53174 1808590 1778353 1749377 1722216 1695999 1669942 1645184 1623469 1604235 1584591 1562433 1538493
53163 1538493 1514987 1493262 1473324 1454918 1438257 1423653 1410831 1398850 1386708 1374001 1360876
53152 1360876 1347408 1333318 1318318 1302368 1285436 1267294 1247779 1227109 1205857 1184775 1164613
53141 1164613 1145744 1127883 1110424 1093107 1076106 1059646 1043896 1029020 1014844 1000651 985843
53130 985843 970487 954569 937213 917895 898108 880301 864904 849835 833446 816498 800488
53119 800488 785451 770452 755116 739441 723096 706222 690245 676648 665400 655696 647506 641063
53107 641063 635327 628550 620296 611641 603404 595367 587285 579489 572292 565660 559513 553500 546648 538357
53093 538357 529687 522416 516639 510579 503043 494812 487160 480261 473814 468098 463457 459539 455993 453203
53079 453203 451341 449275 445563 440363 435468 432490 431601 431764 431340 428697 423214 416030 409200 403993 400418
53064 400418 398212 397303 397077 396137 393476 389410 384865 380239 375577 371396 368427 366551 364728 362214 359370
53049 359370 357094 355820 355229 354620 353432 351709 350077 348929 347667 345297 341892 338812 337117 336355 335364
53034 335364 333747 332011 330719 330147 330386 331081 331363 330822 330252 330557 331135 330382 327937 325427 324697 326075 328735
53017 328735 331917 335124 337659 338656 337574 334500 330213 325942 322605 320076 317541 314531 311091 307131
53003 307131 302422 297375 292959 289551 286594 283581 280579 277553 274170 270628 267664 265218 262196 258251
52989 258251 254697 252708 251698 250570 249549 249328 249328 248506 247373 247301 247936 247211 244311 240965 239093 238504 237750
52972 237750 236235 234553 233422 232995 232702 231344 228054 223718 220738 220630 222353 223633 223386 222069 220167
52957 220167 217517 214184 211033 208914 207804 207152 206857 207383 208845 210365 210755 209868 208880 209021 210279 211764
52941 211764 212993 214163 215188 215304 214068 212249 211174 211351 212113 212521 212327 212162 213005 215329 218527 221282
52925 221282 222676 222854 222447 221731 220778 220207 221022 223423 226293 228361 229657 231317 233975 236860 238627 238623
52909 238623 237126 234862 232765 231889 232797 235008 237473 239567 241194 242185 242389 242385 243168 244819 246438 247822
52893 247822 250140 254040 258008 259950 259952 260138 261887 264508 266790 268585 270489 273042 276794 282186 288689
52878 288689 294893 300184 305518 311695 317645 321697 324161 327241 332214 337791 341757 343317 343239 342394 341044
52863 341044 339318 337559 336024 334751 333854 333582 333850 334034 333552 332485 331397 330674 330371 330561 331284 331978 331423
52846 331423 328812 324853 321391 319768 319688 319778 319006 317390 315477 313608 311892 310685 310611 311943 314232 316760
52830 316760 319197 321583 323879 325902 327590 328896 329431 328741 327011 325122 323825 323204 323022 323152 323465 323670
52814 323670 323580 323302 323088 323354 324823 327963 332100 335784 338374 340514 342627 343966 343870 343010 342264 341125
52798 341125 338637 335443 333283 332529 331862 330657 330074 331098 332911 334212 335032 336101 337111 336900 335203
52783 335203 333274 332765 334436 337714 341043 343014 343653 344297 345824 347580 348545 348764 348702 347947 345999 344044
52767 344044 344189 346527 348516 348174 346749 346957 349341 351803 352542 352043 351766 352142 352702 353387 354536 355751
52751 355751 355942 354929 354132 354887 356581 357342 356410 354879 353855 352874 350751 347287 343233 338980 334362 329757
52735 329757 326194 323838 321245 316988 311609 307060 304337 302423 299697 295639 290870 286139 281863 278245
52721 278245 275141 271804 267342 261704 255989 251557 248948 247595 246397 244528 242013 239573 237722 235971
52707 235971 233292 229468 225559 222750 221091 219741 218123 216289 214350 212189 209796 207410 205238 203407
52693 203407 202146 201466 200587 198351 194545 190273 186588 183243 179367 175015 171282 168957 167677 166562 165235
52678 165235 164018 163426 163535 163672 162791 160464 157456 154957 153378 152299 151390 150640 149744 148192 146343 145469
52662 145469 146077 146991 146971 146648 147662 150155 152387 152919 151991 150392 148113 144946 141641 139502 139060 139742
52646 139742 140677 141338 141653 141895 142322 142663 142268 140983 139370 137725 135638 133080 131157 130809 131440 132043 133272
52629 133272 136779 142389 147374 149136 147644 144789 142430 141702 143124 146342 150272 154390 159308 165373
52615 165373 171236 174803 175431 174355 173182 172813 173700 176086 179580 183040 185336 186222 186532 187623 190259
52600 190259 193607 195661 195191 193086 191229 190336 189640 188439 186947 185386 183239 179953 175819 171708 168277
52585 168277 165794 164276 163420 162772 162355 162645 163475 163562 161961 159643 158533 159040 159649 159352 159250 160838 163610
52568 163610 165654 166210 166139 165843 164426 161608 159056 158557 159703 160634 160451 159585 158287 156404 154525 153697
52552 153697 153685 153099 151787 151464 153017 154585 153768 150803 148049 146897 146737 146802 147435 149098 151295 153195
52536 153195 154858 157264 161167 166045 170292 172613 173311 173771 174604 174985 174127 172562 171306 170550 170119 170475
52520 170475 172080 174182 175601 176514 178141 180636 182636 183220 183091 183315 183972 184641 185356 186402 187765 189365
52504 189365 191280 193375 195292 197154 199522 202127 203506 202776 201213 201059 202954 205456 207100 208033 209280
52489 209280 211083 212609 213196 213407 214561 217250 220465 222362 222038 220552 220140 222262 226209 229638 230697
52474 230697 229714 228622 228764 229710 230403 230851 232172 235276 240063 245729 251319 256042 259492 261697 262837
52459 262837 263119 263034 263272 264069 265069 266137 267578 269099 269438 267971 265852 264378 262990 260436 257414 256077
52443 256077 256829 257550 256674 255339 255478 257070 258487 258700 258046 257373 257335 258106 259087 259261 258366 257290 256840 256666
52425 256666 255834 253916 251210 248621 247685 249679 253934 257944 260025 261043 262546 264146 264237 262853 262125
52410 262125 263711 267064 270607 273509 275708 276970 276871 275580 274126 273597 274179 275181 276098 277369 279638
52395 279638 282455 284396 284605 283471 281689 279643 278216 279047 282838 288034 292233 294569 295733 296192 295764
52380 295764 294955 295270 297522 300563 302295 301698 299622 297941 298121 300238 303115 305415 306467 306107 304278
52365 304278 301350 298541 297341 298392 301137 304319 306563 307023 306112 305228 305161 305145 304204 302863 302381 302624 302131
52348 302131 300381 298553 297622 297094 296463 296725 299057 302636 305123 305332 304394 304174 305377 307461 309653 311542
52332 311542 313107 314633 316395 318139 319200 319611 320805 324365 329857 334624 336339 335407 334265 334664 336441
52317 336441 338723 341092 343164 344146 343768 343137 343664 345315 346692 346786 345950 345200 345269 346488 348850 351846 354580
52300 354580 356401 357343 357999 359179 361571 365218 369240 372492 374657 376507 379055 382819 387806 393698 399919
52285 399919 406003 412156 419123 427244 435914 444098 451037 456289 459571 461102 461916 463421 466587 471602
52271 471602 478005 484851 491096 496416 501594 507690 514964 523074 532069 542172 552478 561104 567552 574095
52257 574095 583568 596117 609474 622368 636095 652193 670037 687808 704920 722265 740625 759990
52245 759990 780087 800589 821118 841996 864563 889584 915828 941644 967629 995981 1027111
52234 1027111 1058787 1089141 1118719 1148607 1178100 1205633 1230887 1254732 1278028 1301747 1327340
52223 1327340 1355342 1383942 1410285 1433041 1452783 1470281 1485748 1499569 1512460 1524703 1536063
52212 1536063 1546479 1556015 1564196 1570296 1574331 1576964 1578402 1578116 1575827 1572149 1568228 1565127 1563390 1562715
52198 1562715 1562284 1561864 1562239 1564065 1567028 1570924 1576686 1585033 1594677 1603565 1611753 1621436 1633967 1648413
52184 1648413 1663478 1679296 1696568 1715194 1734672 1754989 1776277 1798255 1820642 1843488 1866478
52173 1866478 1888603 1909076 1927974 1945329 1960254 1971695 1979613 1984803 1988064 1990140 1991963 1994005
52161 1994005 1995525 1995096 1991884 1986093 1978286 1968702 1957121 1943197 1927059 1909680 1892336 1875432 1858235
52148 1858235 1839880 1820278 1799917 1779359 1759251 1740224 1722396 1705536 1690117 1677435 1667941
52137 1667941 1660052 1651571 1642134 1633433 1627149 1623476 1621551 1620381 1619100 1617082 1614244 1610812 1606661 1601479
52123 1601479 1595900 1591594 1589435 1587966 1584708 1578997 1572643 1567561 1563655 1559666 1555210 1550779 1546123 1540144
52109 1540144 1532851 1526196 1521956 1519352 1515694 1509169 1500294 1490883 1482408 1475330 1469233 1463358 1457403 1451927
52095 1451927 1447556 1443904 1439789 1434537 1428592 1422742 1417273 1412044 1406961 1402127 1397688 1393672 1389789 1385540
52081 1385540 1380778 1376019 1371864 1368227 1364533 1360547 1356529 1352604 1348487 1343912 1339102 1334794 1331919 1330852
52067 1330852 1330699 1329844 1327710 1325486 1324476 1324374 1324217 1324428 1326423 1330229 1334042 1336589 1338726 1342173 1347716
52052 1347716 1355299 1364947 1376815 1390941 1407493 1426678 1447913 1469764 1491336 1513257 1536848 1562862
52040 1562862 1591447 1622566 1655767 1690005 1724446 1759109 1794218 1829315 1863621 1897008 1929987
52029 1929987 1962871 1995330 2026544 2055593 2081975 2106097 2128868 2150481 2169923 2185983 2198346
52018 2198346 2207345 2213221 2216198 2216924 2216127 2213870 2209681 2203471 2195963 2187962 2179226 2168312 2153988 2137037
52004 2137037 2120171 2105604 2093020 2080614 2067711 2055396 2044830 2036318 2030080 2026484 2024930 2023698
51992 2023698 2021739 2019773 2019090 2020295 2023863 2030648 2040665 2052116 2062816 2072194 2081126 2090373 2100069
51979 2100069 2110105 2119932 2128385 2134604 2138866 2141825 2143547 2144162 2144705 2146028 2147198 2146164 2141898 2134945
51965 2134945 2126151 2115939 2104647 2092352 2078382 2062101 2044186 2026020 2007653 1987474 1964265
51954 1964265 1938674 1912245 1885716 1858712 1830575 1801085 1770726 1740416 1710610 1680661 1649458
51943 1649458 1616724 1583247 1549951 1517284 1485351 1453901 1422142 1389256 1355274 1320884 1286331
51932 1286331 1251126 1215051 1178854 1143690 1110222 1078457 1048020 1018385 989044 959656 930046
51921 930046 900332 871187 843581 817857 793440 769864 747552 726848 706911 686653 666553
51910 666553 648321 632625 618297 604169 590732 579259 569912 561328 551950 541371 530471 520348
51898 520348 511106 501983 492830 484884 479330 475478 471381 466187 460911 456745 453612 450753 447899 445266
51884 445266 442892 440393 437210 433059 428451 424527 421741 418964 414893 410184 406993 406223 406530 406408 405764
51869 405764 404719 402402 398368 394146 391661 390519 388388 384002 378401 373186 368975 365953 364488 364239
51855 364239 363576 361019 356880 352586 348585 343970 338279 332616 328371 325450 322547 318826 314581 310418
51841 310418 306787 304479 304442 306354 308103 307691 305310 302679 300568 298015 294029 289067 284457 281166 279473
51826 279473 279130 279245 278557 276575 274282 273248 274096 276058 277852 278686 278591 278088 277568 276946 276029 275139 274983
51809 274983 275761 276768 277097 276523 275460 274299 273178 272345 272378 273760 276171 278399 279291 278991 278966 280560 283731
51792 283731 287395 290662 293329 295572 297803 300592 303947 306777 307898 307602 307437 308317 309702 310848 311795
51777 311795 312573 312397 310635 308099 306442 306333 306908 307000 306434 306097 307020 309398 312400 315059 317299 319702
51761 319702 322278 324192 325066 325821 327520 329854 331546 332023 331879 331740 331394 330240 328205 325971 324421 323795
51745 323795 323245 321520 318472 315613 314622 315455 316437 316173 314750 313093 311857 311313 311742 313386 316059 319082
51729 319082 321511 322419 321373 319058 317215 317473 319951 323126 325158 325286 324041 322391 320948 319893 319261
51714 319261 318986 318692 317760 315914 313856 313161 315191 319824 325333 329774 332505 334224 335708 337074 338303
51699 338303 339769 341767 344047 346401 349236 352864 356562 359294 361175 363213 365625 367696 369624 373108
51685 373108 379149 386260 392115 396366 400453 404949 408664 410770 412523 416011 421914 429329 437408 446204
51671 446204 455870 465747 474745 482459 489647 497497 506424 515540 523296 528643 531653 533099 533717 533935 534012
51656 534012 533971 533307 531281 528015 525077 524193 525124 525434 522965 518189 513496 510422 508390 506089 503024 499276
51640 499276 494778 489791 485628 483835 484528 486153 486998 486548 485449 484726 485055 486285 487558 488348 489365 491838
51624 491838 495893 500451 504900 509857 515711 521412 525770 529232 533023 536876 539142 539255 538544 538060 537005
51609 537005 534278 530529 527600 526753 528444 532911 539536 546291 551528 556070 561905 568921 574731 577924
51595 577924 579500 580431 579720 576134 570397 564141 557802 550939 543754 536810 530023 523351 517698 513444 508709
51580 508709 501173 491501 482966 477377 473163 468082 462045 456424 451986 448599 445938 443412 440143 435994
51566 435994 432013 429103 426834 424312 421562 419141 416927 414269 411064 407774 404545 401140 397790 395293
51552 395293 394099 393744 393379 392468 390899 388741 386161 383453 381036 379322 378443 378095 377756 377165 376498 376225
51536 376225 376972 379253 382890 386823 390053 392787 396099 400432 405139 409644 414215 419231 424452 429668
51522 429668 435466 442566 450641 458456 465080 470479 475127 479596 484332 489199 493118 494743 493799 491476
51508 491476 489233 487360 485025 481669 477989 475279 474025 473611 473383 473427 474003 474713 474682 473242 470111 465447
51492 465447 460406 457141 457294 460556 465273 470103 474354 477338 478853 480258 483566 489149 495430 501029
51478 501029 505876 509877 512059 512007 510969 510526 510928 511658 512737 514441 516328 517501 517482 516270 514207 512467
51462 512467 512851 516066 520687 524621 527103 528609 529653 530673 532397 535164 538289 541103 544048 547744
51448 547744 551576 554423 556213 557340 557067 554251 549607 545494 543140 541517 539265 536233 532517 527490
51434 527490 520930 514150 508846 505198 501960 498118 493751 489374 485064 480409 475237 470328 467130 466325
51420 466325 466873 467117 466869 467545 469966 472895 474533 474997 476357 480085 485203 489455 492076 494760 499674
51405 499674 506997 515056 522613 530092 538319 547070 555618 564062 573089 582604 591448 598541 603748 607606
51391 607606 610686 613223 615075 616129 616799 617510 617411 614608 608677 602292 598947 599334 601151 602304 602848 603654
51375 603654 604782 605982 607664 610361 613735 616796 618816 619680 619772 619757 620007 620035 619018 617021 615023 613534
51359 613534 611952 609696 607064 604326 600728 595296 588299 581151 575019 570177 566429 563315 559772 554460
51345 554460 547098 539228 533138 529863 528492 527564 526723 526556 527103 527413 526814 525708 524633 523429 522186 522110
51329 522110 524094 526900 528362 528415 529302 532349 536043 538176 538575 538600 538734 538008 535545 531670 527455 523698
51313 523698 520252 516005 509769 501519 492331 482806 472208 459855 446791 435113 425730 417596 409256
51300 409256 400464 392083 384815 378315 371566 364215 357575 353733 353280 354299 354213 352293 349615 346895 343512
51285 343512 338890 333732 329201 325559 322389 319716 317968 316962 315879 314438 313246 312537 311319 308514
51271 308514 304569 301162 299471 299357 300009 300535 299997 297981 295497 294407 295484 297733 300033 302493 305515
51256 305515 308593 311154 313872 317799 322606 327035 330928 335471 341342 347832 353918 359004 362355 363216
51242 363216 362271 361976 364558 370096 376879 382848 386256 385952 382185 376808 371894 368202 365315 362720 360103
51227 360103 356912 352551 347153 341685 337061 333238 329212 323945 317459 310988 305892 302488 300196 298506
51213 298506 297208 295853 293819 291056 288010 284588 279948 273742 267014 261482 258210 257044 256860 256311 254876
51198 254876 253179 251783 250019 247029 243667 241874 242112 243025 244055 246364 250194 253305 253785 252968 253531
51183 253531 255742 257778 259129 261136 264099 266247 266377 265621 265502 265634 264541 261917 259050 257469 257834
51168 257834 259661 261588 262415 262360 262807 264398 266060 266473 265769 264917 263939 261912 258746 255948 255034 255679 256041
51151 256041 254899 253123 252795 254991 258712 262074 264117 265069 265230 264583 263679 263919 266101 269048 270571 269808
51135 269808 267979 266844 267065 268219 269581 270346 269743 267822 265940 265693 267253 269282 270367 269840 267315
51120 267315 262667 257017 252671 251028 251122 251175 251011 251678 253028 253239 251054 247213 243180 239609 236764 235327
51104 235327 235662 236850 237481 237197 236709 236638 237118 238226 239816 240944 240358 237879 234745 232383 231230 230880
51088 230880 230853 230920 230925 230655 229907 228684 227330 226327 225777 225183 224006 222352 220918 220193 219967 219684 219186 219003
51070 219003 219801 221547 223301 224037 223655 223059 223301 224811 227293 229949 231901 232845 233531 235268 238732 243392
51054 243392 248004 251491 253560 254969 256945 259722 261748 261157 258065 254642 252831 252883 254253 256711 259903
51039 259903 262820 264560 265041 264410 262544 259884 257862 257458 257921 257999 257950 259190 262218 265975 269080 270687
51023 270687 270362 268256 265537 263724 263357 263958 265099 266515 267351 266595 264724 263863 265670 269609 273757 276737
51007 276737 278490 279746 281340 283720 286666 289557 291972 293831 295033 295553 295830 296318 296433 294813 291243
50992 291243 287649 286374 287709 289795 290792 290452 289650 289230 289683 291245 293609 295762 296829 297236 298488 301597
50976 301597 306094 310842 315247 319134 321993 323391 324093 325786 329353 334063 338719 342819 346236 348592
50962 348592 349636 349776 349649 349713 350569 352954 356645 360062 361917 362773 364096 366208 368242 369789 371423 373683
50946 373683 376617 380413 385345 390812 395464 398783 401945 406648 413574 422195 431538 440808 449722 458596
50932 458596 467966 478162 489469 502449 517402 533592 549753 565619 582405 601565 623563 647952
50920 647952 674109 701610 730239 759941 790697 822549 855981 892013 931481 974523 1021341
50909 1021341 1073075 1130983 1194872 1263391 1336005 1413701 1497346 1586220 1678667 1773558 1870666
50898 1870666 1970161 2072097 2175739 2278834 2378034 2470739 2556359 2635382 2707503 2771077 2824287
50887 2824287 2866488 2898439 2921474 2936529 2944020 2944580 2939531 2930326 2917912 2903133 2887340 2871726
50875 2871726 2856212 2839809 2822027 2803022 2782371 2758832 2731561 2700456 2664809 2622837 2573407
50864 2573407 2517330 2456074 2389915 2318446 2242323 2163219 2082195 1999311 1915019 1830931 1748727
50853 1748727 1669051 1592024 1518452 1449916 1387659 1331739 1281339 1235636 1194215 1156714 1122447
50842 1122447 1090677 1061318 1035181 1013231 995473 980584 966892 953998 943223 936014 931923 928909
50830 928909 925801 923599 923709 925611 927345 927928 928353 930380 935278 943479 954250 965692 976330 987095
50816 987095 1000654 1018258 1038176 1057853 1076824 1096883 1120017 1146782 1176243 1207014 1238817
50805 1238817 1273268 1312470 1356530 1403396 1451645 1502527 1558488 1620675 1688965 1763662 1845681
50794 1845681 1935301 2032140 2136638 2250479 2375250 2511442 2659043 2818251 2989124 3171174
50784 3171174 3363829 3566703 3778692 3997134 4218749 4441431 4664154 4884562 5097252
50775 5097252 5295365 5473851 5630533 5764233 5873200 5956005 6013063 6046161 6056999 6047293
50765 6047293 6020114 5980005 5931584 5878760 5825130 5773947 5727306 5686035 5650446 5620109 5592471
50754 5592471 5562750 5526065 5479350 5420927 5349029 5261475 5156487 5033346 4892488 4735273
50744 4735273 4563578 4379712 4186964 3989726 3792056 3596233 3403645 3216798 3038937
50735 3038937 2871558 2713963 2565848 2428680 2303691 2190190 2087173 1995129 1914621 1844169
50725 1844169 1781297 1724885 1674799 1629896 1588541 1550828 1518278 1491031 1467035 1444429 1423195
50714 1423195 1403988 1386777 1371384 1358161 1347186 1337597 1328481 1319775 1311671 1303838 1296012 1288838 1283283
50701 1283283 1279417 1276470 1274004 1272517 1272805 1275097 1278964 1283949 1290299 1299133 1311712 1328318 1347801
50688 1347801 1368421 1389377 1411682 1437571 1468897 1506055 1548283 1594633 1644316 1696541 1750982
50677 1750982 1808712 1872043 1942942 2021870 2108276 2201696 2302069 2409518 2524179 2645712
50667 2645712 2772642 2902783 3034731 3168187 3302259 3434217 3560773 3679973 3790718
50658 3790718 3890850 3976880 4045752 4096152 4128122 4142098 4138297 4116668 4077844 4024834 3963319
50647 3963319 3899210 3835925 3774733 3717233 3666074 3623043 3587534 3557379 3530440 3505117 3479976
50636 3479976 3453255 3422413 3384238 3335993 3276581 3206165 3124950 3033118 2931764 2822951 2708911
50625 2708911 2592113 2475878 2363449 2256068 2153258 2055465 1965081 1883951 1811069 1744035
50615 1744035 1682145 1626796 1579241 1539178 1505504 1477335 1454059 1435312 1421387 1412973 1409937 1410643
50603 1410643 1412975 1416041 1420638 1428087 1438805 1451998 1466553 1482201 1499986 1521634 1548193 1579070
50591 1579070 1612550 1647546 1684687 1725370 1770104 1818463 1870513 1927243 1989244 2055862 2126210
50580 2126210 2200292 2278444 2360381 2445657 2534377 2626365 2720006 2813060 2904507 2994533 3082752
50569 3082752 3167506 3246951 3319744 3384581 3440241 3486558 3524328 3553673 3573357 3582599 3583125 3578732
50557 3578732 3572795 3566403 3558577 3548009 3534921 3521536 3510711 3504074 3501545 3502312 3505648 3510871 3517136
50544 3517136 3523432 3528394 3530188 3527090 3518097 3502452 3478727 3445081 3400341 3344146 3276314 3197210
50532 3197210 3108843 3014489 2916787 2816967 2716124 2616190 2519093 2425724 2336241 2250749 2169397
50521 2169397 2092537 2021093 1955938 1896637 1841815 1791155 1745833 1706344 1671206 1638897 1610037
50510 1610037 1586362 1568391 1555462 1547376 1544337 1545437 1548869 1554016 1562145 1574581 1591110 1610550
50498 1610550 1632188 1656068 1682351 1710782 1740682 1771413 1803161 1837257 1875293 1917737 1963413
50487 1963413 2010141 2055781 2099235 2141088 2183085 2226398 2270570 2314666 2359132 2405767 2456039
50476 2456039 2510292 2568496 2630784 2697062 2767160 2841968 2923739 3014658 3115467 3225926 3346078
50465 3346078 3476491 3617556 3769058 3930093 4098845 4272724 4449418 4627721 4806711
50456 4806711 4984052 5155727 5317594 5466734 5601091 5718426 5816070 5891363 5941913 5965905
50446 5965905 5962875 5934022 5881140 5805476 5708594 5594462 5469438 5339305 5207057 5074463
50436 5074463 4945136 4824593 4717330 4625300 4549735 4492976 4457082 4441073 4440881 4452242 4472691
50425 4472691 4500256 4530884 4557991 4574605 4575602 4557886 4519158 4457439 4372098 4264945 4139874
50414 4139874 4001393 3853494 3699458 3542089 3384107 3228627 3079022 2937705 2804978
50405 2804978 2679807 2561989 2452944 2353895 2263964 2180978 2104011 2034290 1973380 1921281 1876757
50394 1876757 1838945 1807771 1782935 1763464 1748670 1738921 1734796 1735913 1741383 1751158 1765880 1785211
50382 1785211 1807358 1830873 1856163 1884495 1916102 1950140 1986061 2023940 2063429 2103268 2142187
50371 2142187 2179862 2216814 2253646 2290201 2325208 2357013 2385154 2410838 2435370 2458657 2479978
50360 2479978 2499596 2518384 2536183 2552039 2566239 2580847 2597889 2618204 2642351 2671241 2705137
50349 2705137 2743227 2785208 2832433 2886468 2947092 3012561 3081193 3151733 3222670 3292310 3359375
50338 3359375 3422691 3480295 3529618 3568671 3596619 3613260 3618182 3610215 3587513 3548694 3494487 3427807
50326 3427807 3351616 3267084 3174538 3075818 2974659 2874724 2778211 2686731 2602698 2529044 2467617
50315 2467617 2418480 2380825 2354106 2337806 2330457 2329888 2334842 2345494 2361387 2379258 2394001 2401727
50303 2401727 2400841 2390340 2368742 2335479 2292103 2241106 2184326 2123365 2060630 1998578 1938185 1879234
50291 1879234 1821954 1767482 1716744 1669746 1626075 1585421 1547379 1511301 1476764 1444143 1414647
50280 1414647 1389600 1369432 1353267 1339665 1327653 1316798 1306798 1297899 1291434 1288726 1289275 1291269
50268 1291269 1294223 1299797 1309412 1322455 1337686 1355093 1375103 1397059 1419785 1442837 1465979 1488370
50256 1488370 1509687 1531221 1554267 1578042 1600863 1622830 1645500 1669168 1692251 1713330 1732038
50245 1732038 1747964 1760529 1770254 1778415 1784964 1788428 1788501 1787230 1786757 1787021 1786403 1783527 1777799 1769297 1758972
50230 1758972 1748084 1736793 1724103 1709622 1694254 1678533 1661532 1642391 1621898 1601381 1580887
50219 1580887 1559707 1538190 1517750 1499161 1481897 1465186 1448945 1433544 1419140 1405321 1391228
50208 1391228 1376225 1360601 1345240 1330423 1315668 1301224 1289050 1281369 1278410 1278158 1278229 1277580 1276630
50195 1276630 1276353 1277312 1279135 1280770 1281256 1280137 1277245 1272641 1267040 1261676 1257180 1252769 1247120 1240033 1232872
50180 1232872 1227280 1223493 1219905 1214331 1205963 1196079 1186671 1178514 1170959 1163284 1155480 1147698 1139889 1132371
50166 1132371 1126062 1121576 1118598 1116642 1115976 1117247 1120443 1124760 1129396 1134194 1139440 1145087 1150159 1153287
50152 1153287 1154272 1154739 1156507 1159533 1162374 1164426 1166390 1168380 1169024 1167033 1162430 1155546 1146004 1133609
50138 1133609 1119151 1103419 1086469 1068909 1052660 1039005 1026767 1013982 1000708 988456 977535
50127 977535 966908 956489 947484 940217 933436 926336 919663 914175 909418 904779 900466 896651 892807 888725
50113 888725 885089 882183 879067 874942 870264 865518 860100 853794 848303 845410 844077 841380 836238 830308
50099 830308 824773 818253 809017 797814 786968 777373 767888 757495 746782 737009 728614 721121 714024
50086 714024 707351 701542 697057 694128 692760 692896 694302 696285 697872 698580 698746 698808 698566 697683 696627 696324
50070 696324 696877 697446 697715 698733 701763 706755 712642 718774 725456 733191 742101 752205 763726 776789
50056 776789 790960 805328 819058 831978 844671 857784 871146 883879 895617 907208 919746
50045 919746 933247 946922 960636 975249 991267 1007764 1023060 1036255 1047757 1058492 1068903
50034 1068903 1078682 1087370 1094968 1101746 1107579 1112041 1115488 1119382 1124811 1130981 1136106 1139673 1142983 1147428
50020 1147428 1153170 1159693 1166626 1173491 1179587 1184971 1191008 1199231 1209895 1222262 1235963 1251400 1268936
50007 1268936 1288212 1308244 1327960 1346974 1366166 1387108 1410494 1435415 1460534 1485358 1509801
49996 1509801 1533087 1554193 1573213 1591276 1608965 1625624 1640398 1653184 1664178 1673130 1679447 1682631
49984 1682631 1682293 1678181 1670559 1660199 1647676 1633019 1616400 1598719 1581046 1563790 1546963 1530979
49972 1530979 1516405 1502816 1488672 1472815 1455793 1439345 1424870 1412706 1402526 1393768 1385776 1378286
49960 1378286 1371991 1368042 1366584 1366324 1366020 1365933 1367032 1369088 1370498 1370078 1368067 1365025 1360664 1354528 1347205
49945 1347205 1339826 1332380 1323355 1311394 1296878 1281546 1266815 1252720 1238403 1223312 1207779 1192506
49933 1192506 1177787 1163381 1149099 1135276 1122674 1112106 1104107 1098606 1094826 1091804 1089270 1087937
49921 1087937 1088816 1092325 1098023 1104886 1111776 1117973 1123558 1129117 1134941 1140654 1145735 1150148 1154232 1158150
49907 1158150 1161703 1164583 1166637 1167951 1168802 1169451 1169747 1168865 1165394 1157831 1145325 1128252 1107940 1085525
49893 1085525 1061172 1034653 1006442 977793 949868 923298 898479 875600 854349 834182 814954
49882 814954 796675 778778 760616 742927 727745 716268 707623 700196 693303 686889 680577 674122 668177
49869 668177 663448 659433 655020 650126 645795 642818 641158 640532 640626 640790 640435 639669 638781 637314 634735 631927
49853 631927 630724 631651 633243 634006 634036 634219 634879 635979 637689 639827 641337 641384 640653 640595 641508 642187 641582 640080
49835 640080 638926 638850 639542 640274 640800 641674 643625 646652 649999 653191 656814 661791 668066 674544 680412 686004
49819 686004 692109 698885 706006 713604 722323 732207 742241 751589 760935 771856 784986 799721 815847
49806 815847 834359 855970 879621 903537 927366 952111 978101 1004197 1029293 1053458 1076979
49795 1076979 1099238 1119487 1138256 1156989 1176357 1195665 1214037 1231477 1248439 1264806 1279753
49784 1279753 1292487 1302626 1309708 1312726 1310622 1303283 1291671 1276736 1258560 1236893 1212193 1185626
49772 1185626 1158127 1130048 1101743 1073863 1046823 1020472 994661 969842 946768 925804 906651
49761 906651 888415 869793 849761 828671 808368 790641 775630 762307 750356 740740 734076 729125
49749 729125 723625 716546 709040 703086 699504 697370 695058 691640 687454 683594 680849 679068 677534 675921
49735 675921 674510 673315 671392 667624 662100 656180 651125 647270 644610 643359 643314 643254 641819 638894 635537
49720 635537 632732 630869 630267 631231 633259 634885 634905 633488 631726 630364 629332 628429 628027 628919 631420 634716
49704 634716 637301 638324 638409 638952 640772 643804 647922 653353 660052 667248 674133 680756 687832 695788 704382
49689 704382 713310 722879 733910 746956 761634 776835 791763 806861 823544 842931 864758 887469
49677 887469 909304 929479 948584 967808 987636 1007285 1025490 1041694 1056269 1069871 1083014
49666 1083014 1096172 1109745 1123681 1137400 1150182 1161386 1170267 1175986 1177974 1176131 1170558 1161332
49654 1161332 1148583 1132579 1113754 1092919 1071408 1050591 1031098 1012757 995271 978611 962840
49643 962840 948107 934927 923925 915120 907946 902109 897750 894474 891040 886712 882417 879691 878654
49630 878654 877768 875588 872091 868251 864984 862761 861756 861945 863154 865219 867978 871097 874166 877103 880186
49615 880186 883516 886730 889614 892776 897072 902169 906270 907894 907759 908180 910490 913726 916131 917216 917763
49600 917763 918481 919622 921520 924269 926854 927880 927580 927977 930296 933153 934305 933560 932794 933275 934179 934070
49584 934070 932944 932213 933029 935074 937043 938077 938557 939380 940665 941594 941601 941113 940753 940419 939828 939492 940318 942416
49566 942416 945109 948062 951466 955026 957826 959714 962005 966067 971645 977306 982221 986844 991982 998035
49552 998035 1005250 1014069 1024730 1036810 1049615 1062879 1076768 1091215 1105677 1119771 1133832 1148439
49540 1148439 1163539 1178536 1193335 1208787 1225766 1244288 1263981 1284907 1307172 1330019 1352445
49529 1352445 1374939 1399566 1427686 1458227 1488986 1519187 1549999 1582849 1618166 1655710 1695120
49518 1695120 1735771 1776822 1818094 1860631 1905902 1954473 2005656 2058306 2111725 2165867 2220823
49507 2220823 2276196 2331125 2385251 2439549 2495658 2554203 2614206 2674408 2734539 2794681 2853874
49496 2853874 2910409 2963695 3015055 3066140 3116827 3165105 3208983 3248291 3284595 3319343 3352141
49485 3352141 3380988 3404266 3422194 3436102 3446654 3453332 3455500 3453370 3447933 3440524 3432340 3423697 3413777
49472 3413777 3402011 3389852 3380146 3374194 3370436 3366834 3363737 3363317 3366810 3373619 3382869 3394451 3408330
49459 3408330 3424010 3441222 3460243 3481031 3502756 3524822 3547748 3572393 3598641 3625469 3652039
49448 3652039 3678036 3702999 3725948 3745887 3762327 3775079 3783719 3787489 3785702 3778147 3765037 3746632
49436 3746632 3722962 3693919 3659594 3620519 3577604 3531678 3482967 3431126 3376058 3318505 3259324
49425 3259324 3198268 3134271 3067288 2999176 2932204 2867198 2803754 2741690 2681282 2622259 2563552
49414 2563552 2504377 2445032 2386633 2330584 2278123 2229656 2184294 2140515 2097345 2054623 2012563
49403 2012563 1971842 1933726 1898948 1866489 1834671 1803579 1775018 1749622 1725499 1700722 1675973
49392 1675973 1653397 1633719 1615918 1599272 1584093 1570383 1557246 1544272 1532466 1523008 1515502 1508141
49380 1508141 1499579 1490218 1481664 1475126 1470510 1466989 1464227 1462875 1463960 1468007 1474629 1482552 1490193 1496867
49366 1496867 1503611 1512382 1524244 1538877 1555940 1576108 1600263 1628535 1660797 1697121 1736249 1773772
49354 1773772 1803321 1820498 1825517 1822105 1814525 1805788 1797716 1791615 1788556 1789228 1793661 1801166 1810685 1821312
49340 1821312 1832629 1844755 1858181 1873394 1890471 1909017 1928498 1948437 1968307 1987531 2005713
49329 2005713 2022698 2038455 2053280 2068073 2083772 2100322 2116776 2132664 2148547 2164766 2180528
49318 2180528 2195165 2209821 2226750 2246951 2269289 2292013 2314370 2336588 2359110 2382329 2406715
49307 2406715 2432704 2460428 2489594 2519746 2550887 2583916 2619984 2659038 2699502 2739974 2780878
49296 2780878 2823759 2869263 2916712 2965546 3016137 3068930 3123740 3180449 3239751 3302568 3369021
49285 3369021 3438466 3510267 3584164 3660071 3737950 3817934 3900391 3985766 4074207 4165098 4257000
49274 4257000 4348598 4440023 4532954 4629013 4727965 4827685 4925867 5021663 5115736 5209054 5301897
49263 5301897 5393929 5484725 5573755 5659988 5742016 5818803 5890119 5956246 6017632 6074718 6127449
49252 6127449 6174785 6215375 6249096 6277183 6300366 6317731 6328431 6333895 6337033 6339337 6339857 6337123
49240 6337123 6331005 6322418 6312341 6301821 6292268 6284896 6279978 6276951 6275120 6274173 6274410 6276598 6281240 6287967
49226 6287967 6296126 6306061 6319056 6335716 6355007 6375350 6396144 6417829 6440978 6465900 6492544 6519931
49214 6519931 6545883 6568241 6586427 6601244 6613019 6620647 6622576 6618021 6606878 6589210 6565504 6536909
49202 6536909 6504090 6465894 6420152 6366186 6305704 6240790 6171922 6098871 6022742 5945673 5868635
49191 5868635 5790879 5711886 5632706 5554836 5478753 5404150 5330736 5258106 5185657 5113538 5043089
49180 5043089 4975607 4911251 4849848 4791850 4737377 4685068 4633367 4582663 4534786 4490494 4448769
49169 4448769 4408602 4370128 4333775 4299502 4267202 4236884 4208207 4180909 4155858 4134525 4117020
49158 4117020 4101737 4087327 4073813 4061247 4048685 4035476 4022479 4010782 3999923 3988616 3976861
49147 3976861 3966157 3957693 3951080 3944863 3937651 3928947 3919440 3910426 3902523 3895141 3887646 3880699 3875871 3874016
49133 3874016 3874442 3875611 3876382 3876821 3878068 3881229 3886121 3891404 3896140 3900768 3906289 3913021 3920634 3928899 3937743
49118 3937743 3946940 3956491 3967232 3980403 3996507 4014862 4034224 4053629 4072880 4092623 4113893 4137305
49106 4137305 4162764 4189956 4218791 4249137 4280562 4312776 4346149 4381500 4419537 4460574 4504477
49095 4504477 4550700 4598790 4649002 4702022 4757942 4816054 4875715 4936697 4998497 5060323 5122258
49084 5122258 5185479 5250442 5315573 5378569 5438366 5495047 5548677 5599537 5648859 5697810 5745794
49073 5745794 5791127 5833451 5874243 5914733 5954568 5992996 6030199 6066637 6101925 6135318 6167040
49062 6167040 6198232 6229443 6259654 6287226 6311796 6334995 6358896 6383837 6408252 6430730 6451484
49051 6451484 6471475 6491004 6510077 6529349 6549490 6570002 6589941 6609667 6630499 6652490 6674018
49040 6674018 6694106 6713952 6735339 6758383 6781629 6803719 6824161 6842994 6860508 6877106 6892898
49029 6892898 6907609 6921287 6934756 6948939 6963963 6979293 6994520 7009690 7025117 7041140 7057826
49018 7057826 7074830 7091930 7109710 7128973 7149195 7168486 7185722 7201951 7218791 7236139 7252635
49007 7252635 7267951 7283146 7298598 7312905 7324449 7333050 7339333 7343228 7344053 7341678 7336599 7328809 7317400
48994 7317400 7301586 7281713 7259038 7234885 7210234 7185548 7160392 7133292 7102672 7068375 7032075
48983 7032075 6995989 6961277 6927843 6895294 6863535 6832486 6801832 6771490 6741935 6713653 6686469
48972 6686469 6659957 6634511 6611434 6591737 6575243 6561140 6548925 6538300 6528556 6519096 6510807 6505971
48960 6505971 6506015 6509663 6514043 6517576 6521236 6527026 6535859 6546998 6558822 6569698 6578611 6585557 6591240 6596126
48946 6596126 6599969 6602478 6604086 6605599 6607274 6608663 6609204 6608403 6605474 6599448 6589940 6577554 6563276 6547688
48932 6547688 6530823 6512412 6491923 6468654 6442303 6413538 6383535 6352752 6320448 6285792 6249097
48921 6249097 6211323 6172287 6130228 6083728 6033702 5982807 5933041 5884434 5835802 5785891 5733807
48910 5733807 5679360 5623520 5567953 5513639 5460408 5408113 5357527 5309492 5263756 5219361 5175926
48899 5175926 5134091 5095116 5060571 5031748 5008358 4988085 4968444 4949193 4932241 4919260 4910292
48888 4910292 4904758 4902857 4905476 4913151 4925518 4941541 4960257 4981622 5006386 5034545 5064185 5092943
48876 5092943 5120798 5150289 5183420 5219292 5255536 5291358 5328078 5367094 5408417 5451284 5495214
48865 5495214 5540149 5586133 5633227 5681379 5730166 5779103 5828535 5879886 5934524 5992477 6052696
48854 6052696 6114513 6178292 6244456 6312502 6381623 6452057 6525076 6601455 6680608 6761529 6843979
$$ [...]
##END NTUPLES=NMR SPECTRUM
##END=
