
##TITLE=AC1184_Huila_5890903_WHsA5MCmmj
##JCAMPDX= 6.0         $$ Bruker NMR JCAMP-DX V2.0
##DATA TYPE= NMR SPECTRUM
##DATA CLASS= NTUPLES
##ORIGIN= BRUKER
##OWNER= Administrator
$$ 1.72 TOPSPIN		Version 2.1
$$ 2012-04-02 18:12:48.656 -0500  Administrator@TOPSPIN
$$ Compression mode = diff/dup
##.OBSERVE FREQUENCY= 400.13188235
##.OBSERVE NUCLEUS= ^1H
##.ACQUISITION MODE= SIMULTANEOUS (DQD)
##.ACQUISITION SCHEME= undefined
##.AVERAGES= 8
##.DIGITISER RES= 22
##SPECTROMETER/DATA SYSTEM= spect
##.PULSE SEQUENCE= zg30
##.SOLVENT NAME= COFFEE_meoh
##.SHIFT REFERENCE= INTERNAL, COFFEE_meoh, 1, 14.98061
##AUDIT TRAIL= $$ (NUMBER, WHEN, WHO, WHERE, PROCESS, VERSION, WHAT)
$$ ##TITLE= Audit trail, TOPSPIN		Version 2.1
$$ ##JCAMPDX= 5.01
$$ ##ORIGIN= Bruker BioSpin GmbH
$$ ##OWNER= Administrator
$$ $$ C:\Bruker\TOPSPIN/data/COFFEE/nmr/AC1184_Huila_5890903_WHsA5MCmmj/10/pdata/1/auditp.txt
$$ ##AUDIT TRAIL=  $$ (NUMBER, WHEN, WHO, WHERE, PROCESS, VERSION, WHAT)
(   1,<2012-04-02 18:12:40.234 -0500>,<Administrator>,<TOPSPIN>,<go>,<TOPSPIN 2.1>,
      <created by zg
	started at 2012-04-02 18:11:33.312 -0500,
	POWCHK enabled, PULCHK disabled,
       configuration hash MD5:
       1A 1E CE 29 27 FD 77 03 67 4E F0 E3 C4 B2 CB 90
       data hash MD5: 64K
       93 BE 92 CB 68 20 83 B2 16 01 E2 04 7D 44 A9 70>)
(   2,<2012-04-02 18:12:43.562 -0500>,<Administrator>,<TOPSPIN>,<proc1d>,<TOPSPIN 2.1>,
      <Start of raw data processing
       efp LB = 0 FT_mod = 6 PKNL = 1 PHC0 = 0 PHC1 = 0 SI = 32K 
       data hash MD5: 32K
       68 F0 CD BC 82 6C 01 01 B0 DB 03 F7 77 A3 41 1F>)
(   3,<2012-04-02 18:12:43.968 -0500>,<Administrator>,<TOPSPIN>,<proc1d>,<TOPSPIN 2.1>,
      <pk PHC0 = 211.6132 PHC1 = 0 
       data hash MD5: 32K
       18 4E B1 70 67 6C 20 18 1D 13 5D 7B 6E F0 DA 05>)
(   4,<2012-04-02 18:12:44.031 -0500>,<Administrator>,<TOPSPIN>,<proc1d>,<TOPSPIN 2.1>,
      <abs ABSG = 1 
       data hash MD5: 32K
       B5 DD 52 23 DA 32 90 1A A6 42 A6 7F A5 61 97 D9>)
(   5,<2012-04-02 18:12:44.078 -0500>,<Administrator>,<TOPSPIN>,<proc1d>,<TOPSPIN 2.1>,
      <abs ABSG = 2 
       data hash MD5: 32K
       B8 86 D5 71 2D 14 BC 49 08 0E E0 50 6B 5F 0B 43>)
(   6,<2012-04-02 18:12:44.125 -0500>,<Administrator>,<TOPSPIN>,<proc1d>,<TOPSPIN 2.1>,
      <abs ABSG = 3 
       data hash MD5: 32K
       53 94 A8 59 26 76 3E 93 AA 14 9B 66 50 CB 5E 16>)
(   7,<2012-04-02 18:12:44.156 -0500>,<Administrator>,<TOPSPIN>,<proc1d>,<TOPSPIN 2.1>,
      <abs ABSG = 4 
       data hash MD5: 32K
       94 06 5E 32 82 F1 62 A7 83 34 8C C7 5A 15 F7 FC>)
(   8,<2012-04-02 18:12:44.203 -0500>,<Administrator>,<TOPSPIN>,<proc1d>,<TOPSPIN 2.1>,
      <abs ABSG = 5 
       data hash MD5: 32K
       6C EB 90 09 1C F6 31 DE 50 BF BA FB BD EF 79 2A>)
$$ ##END=
$$ 
$$ $$ hash MD5
$$ $$ 9A 85 65 3F 26 32 DF 38 B0 A0 B3 DF 15 BF 4F 84
##$RELAX= 
##$RELAX= 
##$RELAX= 
##$RELAX= 
##$RELAX= 
##$RELAX= 
##$RELAX= 
$$ Bruker specific parameters
$$ --------------------------
$$ [...]
##$TP= (0..7)
150 150 150 150 150 150 150 150
##$TP07= 0
##$TPNAME0= <>
##$TPNAME1= <>
##$TPNAME2= <>
##$TPNAME3= <>
##$TPNAME4= <>
##$TPNAME5= <>
##$TPNAME6= <>
##$TPNAME7= <>
##$TPOAL= (0..7)
0.5 0.5 0.5 0.5 0.5 0.5 0.5 0.5
##$TPOFFS= (0..7)
0 0 0 0 0 0 0 0
##$TUNHIN= 0
##$TUNHOUT= 0
##$TUNXOUT= 0
##$USERA1= <user>
##$USERA2= <user>
##$USERA3= <user>
##$USERA4= <user>
##$USERA5= <user>
##$V9= 5
##$VALIST= <valist>
##$VCLIST= <CCCCCCCCCCCCCCC>
##$VD= 0
##$VDLIST= <DDDDDDDDDDDDDDD>
##$VPLIST= <PPPPPPPPPPPPPPP>
##$VTLIST= <TTTTTTTTTTTTTTT>
##$WBST= 2048
##$WBSW= 25
##$XGAIN= (0..3)
0 0 0 0
##$XL= 0
##$YL= 0
##$YMAX_a= 529868
##$YMIN_a= -648529
##$ZGOPTNS= <>
##$ZL1= 120
##$ZL2= 120
##$ZL3= 120
##$ZL4= 120
##$ABSF1= 14.98061
##$ABSF2= -5.57192
##$ABSG= 5
##$ABSL= 3
##$ALPHA= 0
##$AQORDER= 0
##$ASSFAC= 0
##$ASSFACI= 0
##$ASSFACX= 0
##$ASSWID= 0
##$AUNMP= <proc_prof1d_extract_pilot.lims>
##$AXLEFT= 0
##$AXNAME= <>
##$AXNUC= <1H>
##$AXRIGHT= 0
##$AXTYPE= 0
##$AXUNIT= <>
##$AZFE= 0.1
##$AZFW= 0.1
##$BCFW= 0
##$BC_mod= 0
##$BYTORDP= 0
##$COROFFS= 0
##$CY= 15
##$DATMOD= 1
##$DC= 0
##$DFILT= <>
##$DTYPP= 0
##$F1P= 0
##$F2P= 0
##$FCOR= 0.5
##$FTSIZE= 32768
##$FT_mod= 6
##$GAMMA= 0
##$GB= 0
##$INTBC= 1
##$INTSCL= 1
##$ISEN= 128
##$LB= 0
##$LEV0= 0
##$LPBIN= 0
##$MAXI= 10000
##$MC2= 0
##$MEAN= 0
##$ME_mod= 0
##$MI= 0
##$NCOEF= 0
##$NC_proc= -8
##$NLEV= 6
##$NOISF1= 0
##$NOISF2= 0
##$NSP= 0
##$NTH_PI= 0
##$NZP= 0
##$OFFSET= 14.98061
##$PC= 1
##$PHC0= 211.6132
##$PHC1= 0
##$PH_mod= 1
##$PKNL= yes
##$PPARMOD= 0
##$PPDIAG= 0
##$PPIPTYP= 0
##$PPMPNUM= 2147483647
##$PPRESOL= 1
##$PSCAL= 4
##$PSIGN= 0
##$PYNMP= <proc.py>
##$REVERSE= no
##$SF= 400.13
##$SI= 32768
##$SIGF1= 0
##$SIGF2= 0
##$SINO= 400
##$SIOLD= 32768
##$SPECTYP= <>
##$SREGLST= <1H.CDCl3>
##$SSB= 0
##$STSI= 32768
##$STSR= 0
##$SW_p= 8223.68421052632
##$SYMM= 0
##$S_DEV= 0
##$TDeff= 65536
##$TDoff= 0
##$TI= <>
##$TILT= no
##$TM1= 0
##$TM2= 0
##$TOPLEV= 0
##$USERP1= <user>
##$USERP2= <user>
##$USERP3= <user>
##$USERP4= <user>
##$USERP5= <user>
##$WDW= 1
##$XDIM= 32768
##$YMAX_p= 466101661
##$YMIN_p= -675303
##$CURPLOT= <Network HP LaserJet P1505>
##$CURPRIN= <$Network HP LaserJet P1505>
##$DFORMAT= <normdp>
##$LAYOUT= <+/1D_H.xwp>
##$LFORMAT= <normlp>
##$PFORMAT= <normpl>
##$SURQMSG= 1
$$ End of Bruker specific parameters
$$ ---------------------------------
##NTUPLES= NMR SPECTRUM
##VAR_NAME=  FREQUENCY,     SPECTRUM/REAL,   SPECTRUM/IMAG
##SYMBOL=    X,             R,               I
##VAR_TYPE=  INDEPENDENT,   DEPENDENT,       DEPENDENT
##VAR_FORM=  AFFN,          ASDF,            ASDF
##VAR_DIM=   32768,         32768,           32768
##UNITS=     HZ,            ARBITRARY UNITS, ARBITRARY UNITS
##FACTOR=    0.250966925370066, 1,           1
##FIRST=     8223.43324360095, -66288,       -67520
##LAST=      0,             -178477,         13494
##MIN=       0,             -675303,         0
##MAX=       8223.43324360095, 466101661,    0
$$ Real data points
##PAGE= N=1
##DATA TABLE= (X++(R..R)), XYDATA
$$ [...]
19482A34296a50252k06561a31525m2235j74595J39930J7378p0056A76514G5474
19471B3845O251a18237k86187a95159C6470L1675J1865a10209D4762b7268A50229
19459C7719i9210k53164d6607j33354e4308A00298b22662P6735j99366H8196b25816
19447e1728J9547B52736o7642a00428j37907A73320A9529a33848j93528a04171
19436a33487o7406j01546J28771B48544c2975j45069A79101B0116b3934k41007
19426b64941A9834K22886h9823l15318a47464k54420a32174l59730I1354f1990
19415c96350a41240D48485i0969Q306m71225B38294m9758a58279p790m3394B0125
19403b71851J21856A53439E0959c35821i4120m3692A88847a77755k06092C4235
$$ plain form
19482 134296 -150252 -356813 -131525 -173760 -348355 -208425 -191047 -261103 176514 75474
19471 23845 30096 -118237 -404424 -195159 36470 68145 80010 -110209 44762 -27268 150229
19459 37719 -99210 -352374 -46607 -179961 -54308 100298 -222662 -145927 -345293 88196 -225816
19447 -51728 -32181 252736 185094 -100428 -238335 173320 19529 -133848 -327376 -104171
19436 -133487 -200893 -302439 -173668 248544 -32975 -178044 179101 20116 -23934 -264941
19426 -264941 19834 242720 -89823 -405141 -147464 -401884 -132174 -491904 91354 -61990
19415 -396350 -141240 448485 -90969 -82663 -553888 238294 188536 -158279 -166069 -209463 20125
19403 -271851 -149995 153439 50959 -335821 -94120 -137812 188847 -177755 -383847 34235
19392h9388k20898j03954i187k14211A15029a70853A29419b70832Q5842A750J01663
19381A03413E0995c08797o2769F9771c62287a08228A15534e5701l0826F7377a47836
19369A32057F271a44733j90387G347i7796C800d25418J51271F0302i6587a4521
19357A85004g719p0248j52313j69312A09128e7173l65570B18645a46443m1281
19347a87724Q2741j0360A63252a38310J4369q812k6474p3899A03547b2544A04229
19335d8623K3480R776l9489l44041D6555b61337F7989O1283A9741a29989N9210
19324g0779r5719c812I2044j8475a1339j91736f3870A38458c45984N1133A04786
19312A38257b9416B41053a50687C3291g7910C2349a62371k83409a57022o5011
$$ plain form
19392 -89388 -310286 -414240 -9187 -223398 115029 -170853 129419 -270832 -184990 1750 103413
19381 103413 50995 -308797 -371566 69771 -362287 -108228 115534 -55701 -86527 67377 -147836
19369 132057 6271 -144733 -335120 7347 -97796 3800 -425418 -274147 60302 -96587 -14521
19357 185004 -7719 -77967 -230280 -399592 109128 -57173 -422743 218645 -146443 -187724
19347 -187724 -104983 -115343 163252 -138310 -123941 -132753 -159227 -233126 103547 -22544 104229
19335 -48623 -25143 -15367 -54856 -398897 46555 -261337 67989 129272 19741 -129989 -70779
19324 -70779 -166498 -3812 92044 73569 -11339 -203075 -63870 138458 -345984 -294851 104786
19312 138257 -29416 241053 -150687 33291 -77910 32349 -162371 -445780 -157022 -222033
19302b22033o3926A66481a35399I0754a93448g9250k281q8623O4147r3721L8184
19291a61544A23947e4328k0497H8090B8793J9213c02414b4453k33383E8389b75411
19279C97530b36757a3017F7258B1078Q4631a16175A86933L7664B3497c1737K540
19268b9197H7811l227B4088K55753A7130i7501p0874B38950a09688j7422a246
19256A09693l0200a15473D8943k3172J58019a24050j2173l0747j34210D0977a33179
19244D2210j5525b16004B07311d62842a98926B8815J11822a96301B31581G0792
19233f5897m01786R6430e9782k79642E0333a49708A7946a69663q921k4074k35267
19222d37925a77296n1003J07005m1875P2241m2939C33077a30028j08831E1967
$$ plain form
19302 -222033 -285959 166481 -135399 90754 -193448 -79250 -81531 -170154 -106007 -199728 -161544
19291 -161544 123947 -54328 -74825 88090 28793 48006 -302414 -24453 -257836 58389 -275411
19279 397530 -236757 -13017 67258 21078 105709 -116175 186933 224597 23497 -31737 -29197
19268 -29197 87811 84584 24088 279841 17130 -97501 -168375 238950 -109688 -127110 -1246
19256 109693 79493 -115473 48943 25771 183790 -124050 -136223 -166970 -301180 40977 -133179
19244 42210 26685 -216004 207311 -462842 -198926 28815 140637 -196301 231581 70792
19233 -65897 -467683 -371253 -59782 -339424 50333 -149708 17946 -169663 -178584 -202658 -437925
19222 -437925 -177296 -228299 -121294 -163169 -90928 -133867 333077 -130028 -238859 51967
19211a32830O0552A7872R077i0834M3087a0810A40442c3940l89236C3346c31434
19199e8647E4292a57354K9470l27607J07465b6205p9788A7389J29909b66994B01198
19187A72800a98864A50868A2981a20536j17966a4647k10549a01422k93105a2013
19176H8355N4886e01404J72564d4903F4169R3686a70802N7349E5644J10467a49671
19164D7204J05167j4179a4086c502n6865D62382f520j87549h0553n7811j75854
19153c14218N7786b9468j76700p0269j67250A4164b2983r6280A28763d8663H9307
19141e8807l39199a50995A1672a99636A7030c14787a37026N6004B08571P5781
19131B84352J86950a70918k0149j50441d836A81508K0658c05663a20006m3683
$$ plain form
19211 -132830 -72278 17872 26949 -90834 -47747 -10810 140442 -33940 -423176 33346 -331434
19199 -58647 54292 -157354 -127884 -455491 -348026 -26205 -105993 17389 147298 -266994 201198
19187 172800 -198864 150868 12981 -120536 -238502 -14647 -225196 -101422 -394527 -12013
19176 88355 143241 -501404 -328840 -44903 64169 157855 -170802 -113453 55644 166111 -149671
19164 47204 152371 138192 -14086 -3502 -60367 462382 -6520 -194069 -80553 -138364 -314218
19153 -314218 -256432 -29468 -206168 -276437 -443687 14164 -22983 -119263 128763 -48663 89307
19141 -58807 -398006 -150995 11672 -199636 17030 -314787 -137026 -81022 208571 284352
19131 284352 471302 -170918 -191067 -341508 -4836 181508 202166 -305663 -120006 -163689
19121a63689A34877a43985a4110A1144e628G4765p801d27857a31791A88124a27307
19109c6580A92459a45229n0648R6590B5398a10100m7275a6145K245m1650i388
19097b09666h6839p3023C5246J39987a71948h4456q1098B33881i9930B43369c98650
19085c8275A3012b11552R1895D12d0786A99368a89966A50753l4247i1498J6805
19074g4693k8985l50124J56590C0241k63c0373D2520J65595F22O9789b39752m7654
19062b87406a04650k6657K2180H8956b9315r8123a3849D9037j4360b94255C6228
19050B68935a02611I0115a59593P9043B90469j40960a69769D1485K14820a18902
19039a10466k6695j76801c4321A74088a61452j2175D55553A21654a12280C2750
$$ plain form
19121 -163689 134877 -143985 -14110 11144 -5628 74765 66964 -427857 -131791 188124 -127307
19109 -36580 192459 -145229 -195877 -99287 25398 -110100 -157375 -16145 -13900 -55550 -9388
19097 -209666 -86839 -159862 35246 175233 -171948 -84456 -165554 233881 -99930 243369 -398650
19085 -38275 13012 -211552 -119657 412 -40786 199368 -189966 150753 116506 -91498 -74693
19074 -74693 -103678 -453802 -297212 30241 29978 -30373 42520 208115 622 70411 -239752 -287406
19062 -287406 -104650 -131307 -109127 88956 -29315 -127438 -13849 49037 34677 -294255 36228
19050 268935 -102611 90115 -159593 -80550 290469 149509 -169769 41485 256305 -118902
19039 -110466 -137161 -313962 -34321 174088 -161452 -173627 455553 121654 -112280 32750
19028E2097a51104H5709e9053j06824A31094f8555p6827l5513A3521h5911j15962
19017b01873j80974o4922g2773b2089F166b79269b2419r2173A77631E0255J33844
19006A84099a91934C3352E830J29424a54480j25336b7225F0556J94703a04685
18995i3523k46497C4964f7879J7648A10246b17694e9367j66517M3934j5476A30104
18983i8640G4769A8293K88314a24919F8673c1349J3826p2201b418j29345d0472
18971a12041m6436o8102j47659A56611R5077G6492l5670c11310a06546k0972k2639
18960a50157m9397n0793A5937N12372J41786A23300k8005J21847E125J37725c06265
18948C08996A26347d9973l46220J45922M5638k40284G7965B195J23276L5409b18378
$$ plain form
19028 52097 -151104 85709 -59053 -165877 131094 -68555 -145382 -180895 13521 -85911 -201873
19017 -201873 -382847 -447769 -72773 -22089 6166 -279269 -22419 -114592 177631 50255 184099
19006 184099 -191934 33352 5830 135254 -154480 -279816 -27225 60556 255259 -104685
18995 -93523 -340020 34964 -67879 -50231 110246 -217694 -59367 -225884 -181950 -197426 130104
18983 -98640 74769 18293 306607 -124919 68673 -31349 -17523 -89724 -2418 -131763 -40472
18971 -112041 -158477 -226579 -374238 156611 251688 76492 40822 -311310 -106546 -127518 -150157
18960 -150157 -199554 -250347 15937 528309 670095 123300 95295 217142 5125 142850 -306265
18948 308996 126347 -49973 -396193 -250271 -204633 -444917 77965 2195 125471 160880 -218378
18936a37795q1435f6782k0288m9981A81366a31845d6156A06062m7579i3293j50822
18925b44115A62023c38444C0419a6520l6899A13924d4585F6901J80668a62618
18914E9901i6944q1304D8937c2271m6799a4251q7847C3220K3684J09831a36977
18902a39224d9244m4570H5367L62495F9564j153M3417M9482L66157B28191R447
18891B37638F4006J642k4840d4882K1989j0409k00789C59577c22582B3870a39014
18879A66490O859H92b06445G091J67221a43413A64228c49056a33823m8655A3921
18867d5090I5796a27927E5964K9728b0898D8704c47760K5337R456a56434A18004
18855A62812a19299B24745b7151k0270r9912j14395k1823a4488a252j53141J5029
$$ plain form
18936 -137795 -219230 -66782 -87070 -137051 181366 -131845 -46156 106062 58483 -93293 -244115
18925 -244115 162023 -338444 30419 -16520 -53419 113924 -44585 66901 247569 -162618
18914 59901 -96944 -178248 48937 -32271 -79070 -14251 -102098 33220 56904 166735 -136977
18902 -139224 -49244 -93814 85367 447862 69564 68411 111828 161310 527467 228191 237638
18891 237638 64006 65648 40808 -44882 -22893 -33302 -234091 359577 -322582 23870 -139014
18879 166490 173349 892 -206445 7091 174312 -143413 164228 -349056 -133823 -182478 13921
18867 -45090 95796 -127927 55964 85692 -20898 48704 -347760 -322423 -312967 -156434 118004
18855 162812 -119299 224745 -27151 -47421 -147333 -261728 -283551 -14488 -1252 -154393 -139364
18844a39364f0281j70753a3861C4883A2063b33666C50063B8585b08454B7898j2664
18833A5234d8528j14818L3259m2555A93676B4232a45382O9211j67686A32554a06499
18821a13009G0937a89436O8748l2338e1230A11718b54326B4152h9890j0912j29011
18810b29813J02613d5258A31854J58844B4494a48690A31311M3424c2378H5515
18799A5882g6434B86229A40308J26030P2478g98F5255K14339b56220e7167J6944
18788d0223G0960N8140f5741A45459c6078k0682j1014p3631L6023D4571e0590
18776b38290O9102E2544g4315F1687b05340r894a469k9507D7140a69088o8538
18765b37626f4881A03295f6915a3766j28673L6600l04793O4949i6302l9380A63605
$$ plain form
18844 -139364 -60281 -231034 -13861 34883 12063 -233666 350063 28585 -208454 27898 15234
18833 15234 -48528 -163346 -130087 -172642 193676 24232 -145382 -76171 -243857 132554 -106499
18821 -113009 70937 -189436 -120688 -153026 -51230 111718 -254326 24152 -89890 -100802 -229813
18810 -229813 -127200 -45258 131854 290698 24494 -148690 131311 174735 -32378 85515
18799 15882 -76434 286229 140308 266338 338816 -798 65255 279594 -256220 -57167 -40223
18788 -40223 70960 129100 -65741 145459 -36078 -56760 -67774 -141405 -105382 44571 -50590
18776 -238290 -169188 52544 -74315 61687 -205340 -215234 -1469 -30976 47140 -169088 -237626
18765 -237626 -64881 103295 -66915 -13766 -142439 -105839 -410632 -345683 -96302 -135682 163605
18753b83478O8270K0589j86947D8374h8923B8515Q4572b31562A49864E1113g796
18741a38069A02782a29148k80564F8459b28954P7327q1764B42226c54189G807
18730A99162c15340J42781g1669A5366J80265a90888l5070A0849a77125e312k23657
18719b28969A4751J32274B3041h1099G2268b92673A58830b75821K5701B2602J56710
18708A79312o9833C304b27109b2045B8503a15949j3783j32030b0770r5929D3307
18696c7571n6182k44833A45236D1806L01755b49912P4664j24912a8027k51595
18686b69622c2507r5585B61769j17953b18356f8140k9598b8679B71147C6021i9003
18674E330J65454e8671B22220i0658A9242a17202j71457c8782H397b36921b1817
$$ plain form
18753 -283478 -215208 -194619 -381566 48374 -88923 28515 113087 -231562 149864 51113 -7796
18741 -138069 102782 -129148 -409712 68459 -228954 -151627 -233391 242226 -354189 7807
18730 199162 -315340 -172559 -71669 15366 195631 -190888 -225958 10849 -177125 -5312 -228969
18719 -228969 14751 147025 23041 -81099 72268 -292673 158830 -275821 -250120 22602 179312
18708 179312 109479 3304 -227109 -22045 28503 -115949 -129732 -261762 -20770 -116699 43307
18696 -37571 -93753 -338586 145236 41806 343561 -249912 -175248 -300160 -18027 -269622
18686 -269622 -32507 -128092 261769 143816 -218356 -68140 -97738 -28679 271147 36021 -99003
18674 5330 170784 -58671 222220 -90658 19242 -117202 -288659 -38782 8397 -236921 -21817
18662D6853J78000l6220i504C8173a39980K7983q4880Q7516b6019F3697g1818
18650a7250k13085J04660a7217k35576B3266P137J9805a87626j99045a14731k26371
18639c41102G2509J25824a55953b3774j748A42251a96325B89741d04176A10077
18628b59354A5459c12017A74650b76955h139j48370H7971b34061i881n55589b39838
18616b36440a0748p530o8538C5514b63554F8235J21691N2363b57649e6279j4536
18605g0815H342c19290D9165a58903c0102F62g052J613o132q529r9810K4410E746
18591B7446K46796A25517n2147l817c2709k45468J24359I5021h2388k26478A02366
18579c44286d3251J1098J0065B01998q54a94086j97401A33895n2917a25185A1532
$$ plain form
18662 46853 224853 188633 -9504 38173 -139980 -111997 -196877 -109361 -26019 63697 -71818
18650 -17250 -230335 -125675 -17217 -252793 23266 30403 50208 -187626 -386671 -114731 -341102
18639 -341102 72509 198333 -155953 -23774 -25522 142251 -196325 289741 -404176 110077
18628 -259354 15459 -312017 174650 -276955 -8139 -156509 87971 -234061 -9881 -565470 -239838
18616 -236440 -10748 -18278 -86816 35514 -263554 68235 189926 242289 -257649 -56279 -70815
18605 -70815 8342 -319290 49165 -158903 -30102 662 -7052 -5439 -11571 -20100 -119910 -95500 5746
18591 27446 274242 125517 73370 69553 -32709 -278177 -153818 95021 -82388 -308866 102366
18579 -344286 -43251 -32153 -22088 201998 201144 -194086 -391487 133895 80978 -125185 11532
18567A03817d8086B64538a9603n2138b8298A96868a09910a818A58726a27882A01822
18555d5814A95866O8113A7203b6193l63475e8100R860C2886b5421k06231N6129
18544a75523e0825k69626O3176A06468J53425b13841A00387e0147A95153e4016
18533B28608b02619j30994A37475a72489m9135f159k41328J01510A36385J39405
18523B75790j916d56715g5522A79290i5004L5841E1219a13120k37220B43261g6455
18511C56908D8024a26310A56541I962c3164h983k48200j86841a40686M6345c526
18499a31534B16745a76269A2216b18274Q1731A58054i8689E9789b94824N2374
18489b42450B13776r8713A5340a02107C7252h4149m2766N7280B72959M2863a77363
$$ plain form
18567 103817 -48086 264538 -19603 -71741 -28298 196868 -109910 -1818 158726 -127882 101822
18555 -45814 195866 263979 17203 -26193 -389668 -58100 -48240 32886 -25421 -231652 -175523
18544 -175523 -50825 -320451 -257275 106468 259893 -213841 100387 -50147 195153 -54016
18533 228608 -202619 -333613 137475 -172489 -221624 -6159 -247487 -145977 136385 275790
18523 275790 273874 -456715 -75522 179290 -95004 -59163 51219 -113120 -350340 243261 -76455
18511 356908 48024 -126310 156541 9962 -33164 -8983 -257183 -444024 -140686 -94341 -3526
18499 -131534 216745 -176269 12216 -218274 -136543 158054 -98689 59789 -294824 -242450
18489 -242450 213776 115063 15340 -102107 37252 -84149 -126915 -69635 272959 315822 -177363
18477c32076G2115I197a6603j11274A40797J70049E5833a54414A04308b72696
18466b98944B40541o226a06344F338a93619M7589m6525P4988m854A99393c06291
18454E7259Q035I081b29074K8220D4907a27776r393a3908j7182C0593c03611a08574
18441A03094b43319A28541A4512a62272A09557R1970b19428Q4559j20871a02930
18430b55214a08489H6789b00650j44515J65488k09507e2687n6510j31579o0215
18420c00991I2236a28232q9600k23289a53321e1571K1562C20481a61873A58362
18409b62843a12377j81924A44035a04337D5167a95729n116L7301E7570N7612A0428
18397I7947a4430k0777D3295j098a67755G1510C0249a20270J6109B27256H5965
$$ plain form
18477 -332076 72115 9197 -16603 -127877 140797 310846 55833 -154414 104308 -272696
18466 -298944 240541 234315 -106344 6338 -193619 -146030 -192555 -117567 -122421 199393 -306291
18454 57259 65294 9081 -229074 -200854 44907 -127776 -137169 -13908 -31090 30593 -303611 -108574
18441 103094 -243319 128541 14512 -162272 109557 201527 -219428 -134869 -255740 -102930
18430 -255214 -108489 86789 -200650 -345165 -179677 -389184 -52687 -109197 -240776 -300991
18420 -300991 92236 -128232 -217832 -441121 -153321 -51571 -30009 320481 -161873 158362
18409 -262843 -112377 -294301 144035 -104337 45167 -195729 -200845 -163544 57570 115182 10428
18397 97947 -14430 -35207 43295 42197 -167755 71510 30249 -120270 -104161 227256 85965
18385B16037M1887a14772B5853L03587b80819A03212a89748K2206E7848P3099
18375A30947M0562b60396R0428K4362j00257j3506B66309H0105a30833q8931D161
18363b6155B67177a56486H5664j7081a45387G555a56751B35954c35269P87H8235
18351F3504J60495f031j33542N1601J0881G3678O6378e0481A27266j7750g811
18339f6587E3445a11793l7988B13094J31168a32782A786b26505G8059a67743k1958
18328a89701D6372c19160A4737K99193c28073E8165a8697o0477b9910D7072a25084
18316h6558j13528K6038B738c5457A865d6389D5706h4667K8229k74176a27160
18304E4052a65312L2152D4171a77525B93702B2352a07511d483j42204J909H132
$$ plain form
18385 216037 257924 -114772 25853 329440 -280819 103212 -189748 -167542 57848 130947
18375 130947 171509 -260396 -169968 -145606 -245863 -259369 266309 80105 -130833 -219764 4161
18363 -26155 267177 -156486 85664 68583 -145387 7555 -156751 235954 -335269 -334482 88235
18351 63504 223999 -6031 -139573 -87972 -77091 73678 140056 -50481 127266 109516 -7811
18339 -66587 53445 -111793 -149781 213094 344262 -132782 1786 -226505 78059 -167743 -189701
18328 -189701 46372 -319160 14737 313930 -328073 58165 -18697 -79174 -29910 47072 -125084
18316 -86558 -200086 -174048 2738 -35457 1865 -46389 45706 -84667 -56438 -330614 -127160
18304 54052 -165312 -133160 44171 -177525 293702 22352 -107511 -4483 -146687 -144778 8132
18292D4979K4435b30162J03891B08196e4701G9886J83665b29922B06083f4156
18281A91911h8762A05506d1101C94658b50969B59638b02745A44017C1037J25835
18271A56872F5721k1056a56110a6580A54837F4577a00195d8026k30179a28420
18260a1800k81780d1731a2866q9428A22384E3223h2294B03792a08525m687j58752
18249b71964E6695J03854K02172A68115c5264k85989A17968g2300C27764f7007
18238a38340Q911K9190C9919L7826J06700e9850j5964C8358a82384A79995o3315
18227A16680a30018G0536b05916A61925Q909b9485B45500c26348J18920A5551
18216b34048h2330m4660j70737C0343i6581A38811N267b94181K5182f2268B7822
$$ plain form
18292 44979 69414 -230162 -126271 208196 -54701 79886 263551 -229922 206083 -64156
18281 191911 -88762 105506 -41101 394658 -250969 259638 -202745 144017 31037 156872
18271 156872 65721 44665 -156110 -16580 154837 64577 -100195 -48026 -278205 -128420
18260 -11800 -293580 -41731 -12866 -102294 122384 53223 -82294 203792 -108525 -113212 -271964
18249 -271964 56695 160549 362721 168115 -35264 -321253 117968 -72300 327764 -67007
18238 -138340 -129429 -100239 39919 77745 184445 -59850 -75814 38358 -182384 179995 116680
18227 116680 -130018 70536 -205916 161925 170834 -29485 245500 -326348 -207428 15551
18216 -234048 -82330 -126990 -297727 30343 -96581 138811 144078 -294181 -268999 -62268 27822
18204b99967a38009A89967R5300B4820b91503d0576I3931i9543A6354a83871F6727
18192a69870B2811a17627j66596C7634a69840m0540I3835d7215m2433C0208a49312
18180a1830q8007J8235M060k5577H8055a76173B23969c37344L4777G1804J73054
18169B44858I8582l4020J43468a9179j20028q69F7233J32681G0410b0372E5598
18157F6096d8304A13976a18308f113p2121B4328b99295B31363b79944A05235b71001
18145i0669D43504k17247B5045a4932G8666d9039A91435J49450o4801b35970h7178
18133B7908c48919A0530M9698J37062b3001A5580d8455G2548L3802g6249E1100
18121b25955G0303c28481e0979m9851B0395Q8719d32698A75110c30j94493h024
$$ plain form
18204 -299967 -138009 189967 285267 24820 -291503 -40576 93931 -99543 16354 -183871 66727
18192 -169870 22811 -117627 -284223 37634 -169840 -210380 93835 -47215 -89648 30208 -149312
18180 -11830 -99837 -81602 -77542 -103119 88055 -176173 223969 -337344 -302567 71804 244858
18169 244858 98582 64562 208030 -19179 -139207 -140076 67233 199914 70410 -20372 55598
18157 66096 -48304 113976 -118308 -6113 -78234 24328 -299295 231363 -279944 105235 -271001
18145 -90669 443504 226257 25045 -14932 78666 -49039 191435 340885 276084 -235970 -87178
18133 27908 -348919 10530 60228 197290 -23001 15580 -48455 72548 106350 -76249 51100
18121 -225955 70303 -328481 -50979 -100830 20395 109114 -432698 175110 -330 -194823 -8024
18109D9087j1781D81P8523J27761r6510C9626k352a1653j61145m971f8280k9185
18097i7465B26424A11787d8531j53796h6648B39521j13436J72178a63828A0537
18086A76031Q1176A4813f555k7217j62206h6133B82948G6346f6020a7268G7427
18074D913c2313C1155b32917j66776a24385A9097J95440o9783J55975a68669O2555
18063a06114m8616a4755j25104d6519j4675j7781k53086a12639j11388B7875a67974
18051i0794a7192G5639j5948a21164A28622G880K52693e0011j11731B8850J59566
18040A88416r3389a18172e4338j8051j58465B5590h2301q059B01285l4338c66283
18028B55485c05221H8870a42465H3336R7324g6855A1254L1119J59360g4599m8715
$$ plain form
18109 49087 37306 481 79004 206765 110255 39626 37274 -11653 -172798 -177769 -68280 -97465
18097 -97465 226424 111787 -48531 -202327 -86648 239521 126085 298263 -163828 10537
18086 176031 257207 14813 -6555 -33772 -195978 -86133 282948 76346 -66020 -17268 77427
18074 4913 -32313 31155 -232917 -399693 -124385 19097 214537 144754 300729 -168669 -106114
18063 -106114 -154730 -14755 -139859 -46519 -61194 -78975 -332061 -112639 -224027 27875 -167974
18051 -90794 -17192 75639 59691 -121164 128622 7880 260573 -50011 -161742 28850 188416
18040 188416 95027 -118172 -54338 -72389 -230854 25590 -82301 -90360 201285 166947 -366283
18028 255485 -305221 88870 -142465 83336 180660 -76855 11254 42373 201733 -74599 -123314
18017a23314B68403c06683a27430B38d08708a2863l73806A52275G2748a51403
18006c1289j01551A09074n4531f4670j43750A00368J6985L5599D7558I817i3319
17994A24986B7510a08936r3097r4879J36821d3259q9215A35532K4879a97802Q2028
17983a15774A72157m7168b50065j48047e7740a7409A15022A8773a89117J9705
17973a69412K6153o1507A76097A0194a59598E3270a3984q3667j30049B24720j8043
17962B06677L65122b86989G0856b13509A84801a07839l4168h357B28692N9505
17952B88197l0171c28427C84667A13533a06265j12874m1923A05202J91981G160
17941i9271A32006F504c68847a51671C02188F056K42272G0862g7991B9295a40050
$$ plain form
18017 -123314 268403 -306683 -127430 238 -408708 -12863 -386669 152275 72748 -151403
18006 -31289 -132840 109074 54543 -64670 -208420 100368 117353 152952 47558 9817 -93319
17994 124986 27510 -108936 -202033 -296912 -160091 -43259 -132474 135532 160411 -197802 -115774
17983 -115774 172157 124989 -250065 -398112 -57740 -17409 115022 18773 -189117 -169412
17973 -169412 -143259 -204766 176097 10194 -159598 53270 -13984 -97651 -227700 224720 206677
17962 206677 571799 -286989 70856 -213509 184801 -107839 -142007 -8357 228692 288197
17952 288197 258026 -328427 384667 113533 -106265 -219139 -261062 105202 297183 7160
17941 -99271 132006 6504 -368847 -151671 302188 6056 248328 70862 -77991 29295 -140050
17929f485j93925R9351k63096a8552C37571A07152J15861a11229j88258g4819
17918C5109a88142c0k74396a23874A2449e5154J3648j77658e8470B04220G6786
17906A703J2688K74569I5809l3088g9343H2409Q7119f1297j10796j08271I1492
17894a2830k17849A76426b75813D7227c285k77752a25716d2898l2572C19345G4587
17882b27310A21539b15624m5444G5722a32308A32430i2267A02117d8576i372A08002
17870G887J37991M1027m0571D5511c16733A90418C1902a28663A12627B4335e9340
17858G6901a80635A17838d561A76683E9934g218k25421R4570B3917K98954a67365
17846a663j79788A04472h0620J77q2157N8837C41110h9167B51546m8148N0799
$$ plain form
17929 -6485 -200410 -101059 -364155 -18552 337571 107152 223013 -111229 -299487 -74819
17918 35109 -188142 -30 -274426 -123874 12449 -55154 -41506 -219164 -58470 204220 76786
17906 1703 14391 288960 95809 62721 -79343 82409 169528 -61297 -172093 -280364 91492
17894 -12830 -230679 176426 -275813 47227 -3285 -281037 -125716 -42898 -75470 319345 74587
17882 -227310 121539 -215624 -261068 75722 -132308 132430 -92267 102117 -48576 -9372 108002
17870 7887 145878 186905 146334 45511 -316733 190418 31902 -128663 112627 24335 -59340
17858 76901 -180635 117838 -4561 176683 59934 -7218 -232639 -138069 23917 322871 -167365
17846 -1663 -181451 104472 -80620 -80443 -162600 -103763 341110 -89167 251546 203398 254197
17835B54197b13780C55600e929A47795K1909G1202K05474C1486a69661a3169I2842
17823B06898D2738K02517A1334a03738E01119B24349a75349q694P0413a206k28558
17812b29764k5335i9100K2215j98154J32961A5561b9999B35650F8980B6217a60891
17800A34678a35356B35119A5551c7105A88399k874P0502B4489a96195h4786A5634
17788A33867K20817a24469A05802B5673L47899d6884k65860I5375G977L13331
17778C21308A05867Q3344k472j3558m356b52930b288F7151j8250a54986J9978
17767a35008r4124O6951r76A37636b48599B20902A8555K988a47198e6358a7310
17755H5562d79092I5872a10821n3776g4087C84055j39934h2487A50044b23246
$$ plain form
17835 254197 -213780 355600 -5929 147795 169704 71202 276676 31486 -169661 -13169 92842
17823 206898 42738 245255 11334 -103738 501119 224349 -175349 -184043 -113630 -1206 -229764
17812 -229764 -255099 -99100 -76885 -275039 -142078 15561 -29999 235650 68980 26217 -160891
17800 134678 -135356 235119 15551 -37105 188399 185525 256027 24489 -196195 -84786 15634
17788 133867 354684 -124469 105802 25673 373572 -46884 -312744 95375 7977 321308
17778 321308 105867 189211 186739 173181 168825 -252930 -2288 67151 48901 -154986 -135008
17767 -135008 -229132 -162181 -163157 137636 -248599 220902 18555 21543 -147198 -56358 -17310
17755 85562 -479092 95872 -110821 -164597 -74087 384055 244121 -82487 150044 -223246
17744i5714C6702L1388A0014a04962l3665k9558C59602F3117a14261A51253K3281
17733A74534M5326f1757K4823A79325c34347B54540j08774J62063b55203A2579
17722C0881a09640d9913O04A5737P0707j5353e0510C3520J39593g8k19645J6798
17710b02925M9802A13843K2206a44899c9035B66948D3224b12231i9649A271e3575
17698C89418r0071A29149d5839A03398c5481A39938b08750d1110F1153L44254
17688D05407k00316j00310m0264a87696A96000b21581B53663a02146p8295m9361
17678b29802g6704b4439o742C45198b5315j33312A01606B2043K0098f2396B35729
17666b02573O9714i470A47528a43253D07081I3191C6935K7744d6517F3697d4986
$$ plain form
17744 -95714 36702 68090 10014 -104962 -138627 -168185 359602 63117 -114261 151253 174534
17733 174534 219860 -61757 -36934 179325 -334347 254540 145766 307829 -255203 12579
17722 30881 -109640 -49913 -49309 15737 86444 71091 -50510 33520 173113 -78 -219723 -202925
17710 -202925 -153123 113843 136049 -144899 -39035 266948 43224 -212231 -99649 1271 -53575
17698 389418 299347 129149 -45839 103398 -35481 139938 -208750 -41110 61153 405407
17688 405407 205091 104781 64517 -187696 196000 -221581 253663 -102146 -180441 -229802
17678 -229802 -76704 -24439 -31181 345198 -25315 -158627 101606 22043 42141 -62396 235729
17666 -202573 -132859 -9470 147528 -143253 407081 93191 36935 64679 -46517 63697 -44986
17654D88619a85249F9819K5318J50338j7900E3024K47057I1910M7037j7378b29979
17642C94388j84237h4819B23250p8409g9726B81185H2359J65443L1033L6459j04391
17631B10903c8264A00754Q8948M5126f4366j18048B56686f9757B62747A30448
17620h314m1545O398B11740J90571a83046A1471K84132A37821a68416K0863E8642
17608B4121a7919A96179a69416A0870a6535A83542O9498m1036a92508C1669K17287
17597B48956o8997E8984b8006H9512J23889e8674r4459D0155K8466a62842m8516
17586b11358A52204F7913a57324C31404A56622M0899J64692h3471A29001I302
17575e4437k82968A12338A4042K45352n2021d334p4385A70079a8901A86593J79594
$$ plain form
17654 488619 -185249 69819 95137 245475 227575 53024 300081 91910 138947 121569 -229979
17642 394388 210151 -84819 223250 144841 -79726 281185 82359 247802 278835 315294 210903
17631 210903 -38264 100754 189702 234828 -64366 -182414 256686 -69757 262747 130448
17620 -8314 -49859 -43461 211740 402311 -183046 11471 295603 137821 -168416 -147553 58642
17608 24121 -17919 196179 -169416 10870 -16535 183542 253040 212004 -192508 31669 248956
17597 248956 179959 58984 -28006 89512 213401 -58674 -153133 40155 68621 -162842 -211358
17586 -211358 152204 67913 -157324 331404 156622 197521 362213 -83471 129001 9302
17575 -54437 -337405 112338 14042 259394 207373 -4334 -78719 170079 -18901 186593 366187
17564C66187k8006E8389K90012p9813j21927c0559B26070c7460E0406L9139J09510
17553A99055a15760B10816J46428d2104D58658A31476A0975N43879r2467a02240
17542C593M15003A13170J24167q4873l1556R3343Q3611a815E09100A99766Q4126
17531B83892A18450m1163J02289j0905p5967J32720o6120J09716B8781b24955
17520A02364J58019L93209I7775K45863j52563j8568K24346p9799R2921J23121
17510E33096O5426M6396J47715k61871L72182j52433k90926j18947J95368A56718
17499D51722j51926I3959N7888K10111J5532N7388M1454K77922K21509j39158
17489H36605j11944L6590C14963j22503J93644i2183C02984I8446L46243A59183
$$ plain form
17564 366187 338181 58389 348401 268588 146661 -30559 226070 -37460 50406 89545 199055
17553 199055 -115760 210816 357244 -42104 458658 131476 10975 554854 462387 -102240
17542 3593 418596 113170 237337 152464 120908 214251 297862 -1815 509100 199766 283892
17531 283892 118450 77287 179576 168671 92704 225424 159304 269020 28781 -224955
17520 102364 260383 653592 97775 343638 191075 172507 396853 317054 409975 533096
17510 533096 598522 644918 792633 530762 902944 750511 459585 340638 536006 156718
17499 451722 299796 93959 151847 361958 377490 434878 476332 754254 975763 836605
17489 836605 724661 761251 314963 192460 386104 -92183 302984 98446 444689 159183
17478D27753J48635d925A1254h1707B84627K06469A67335J52339c098A82238Q6826
17467B69064j11261a3821C65350E6934M20710a42500E49325H9446K84342N0440
17457D24228L6272j49971A6043Q3244C5486M15434q7512j31171J75034j25234
17447B82037j23259L0024J67043K17251A92343p5482J62859J15279j21284G0946
17436A88449N9780J88934A38844R4607K36220j42892M2455A46786h6318B80000
17425D07879j18761q3340R4278L0950L75903l40457J53760n1115A93630F9922
17414A04651N1779K65169M1652A00445L62337D8743k1992L58239P9661G9985M14167
17403D94152j91146J81491j34520J29165J10594B01251j4235J1901E8644K50134
$$ plain form
17478 427753 576388 -4925 11254 -81707 284627 491096 167335 319674 -3098 182238 269064
17467 269064 157803 -13821 365350 56934 477644 -142500 549325 89446 373788 424228
17457 424228 460500 310529 16043 99287 35486 450920 363408 232237 407271 282037
17447 282037 158778 188802 355845 573096 192343 116861 279720 394999 273715 70946
17436 188449 248229 437163 138844 233451 469671 326779 369234 146786 -86318 280000
17425 407879 289118 205778 300056 331006 706909 366452 520212 469097 193630 69922
17414 104651 156430 421599 463251 100445 462782 48743 26751 384990 464651 79985 494152
17403 494152 303006 484497 349977 479142 589736 201251 187016 198917 58644 308778
17393C08778q9573e66B19994D3759K23138a141A64295J6616n7636j1667m5478
17382F6130R1203L14145d3187B41920B6780L22833J7068q3727J3419r8584J76452
17371C74241L5418j61516L31876A30216a40979C11744K4336H1860J53336K59194
17361D94390F4120J72107a67935A74699L5863k9135K28416o852A32929K01924
17351C34853Q4015A77225J30401J59533A94875L026J84577O7695k23996j2148
17341B14029l5789k400N8390A16243L4516K49729I222J47417J11651O1597A55968
17329A7417L03286F3050K35415p9214J08730j43380q3906P0887K14571e8184C48482
17317I5289f723I3501Q0040J64469K04592j39948j69101K00039D2705L46190R5139
$$ plain form
17393 308778 219205 -566 219994 43759 266897 -1141 164295 180911 123275 111608 66130
17382 66130 157333 471478 -43187 241920 26780 349613 366681 282954 296373 197789 374241
17371 374241 409659 248143 580019 130216 -140979 311744 336080 81860 235196 494390
17361 494390 64120 236227 -167935 174699 210562 181427 409843 402991 132929 334853
17351 334853 418868 177225 307626 467159 194875 197901 382478 450173 226177 214029
17341 214029 178240 175840 234230 116243 150759 400488 9222 156639 268290 329887 155968
17329 17417 320703 63050 298465 219251 327981 184601 100695 171582 386153 -58184 348482
17317 95289 -6723 93501 173541 338010 542602 402654 233553 433592 42705 388895 484034
17306D84034O0657E9907J12961L36316h6158C15408Q258P3408j65431P3371k3398
17295B81616D2762K6739O9838K2052j4673a81320P459C02012k2589j5781K11337
17284D74979j43336j37837J32758j45498K26083j77182G9128Q6468L299R6413
17274B65308P4015B5615L07839l6889l4706g0222I3722K42332j00600K014Q7089
17263C24557J53354A56064P5968m2723J99786o1261L7331j45235I2537b67610
17252B84977P2442k55F4179M094J14332L93067A80623J33293K26493j54634j55799
17241B29976J07037k4679j28175J95666m4126m6916K2898K51955B03251J25990
17231C29241J78105o632j41698M4898n075K8296A02377K25186j3883r3730N2455
$$ plain form
17306 484034 544691 59907 172868 509184 -86158 315408 323666 397074 231643 305014 281616
17295 281616 42762 69501 139339 161391 146718 -181320 -173861 302012 279423 263642 474979
17284 474979 331643 193806 326564 181066 407149 229967 79128 165596 168895 265308
17274 265308 339323 25615 333454 296565 261859 -70222 93722 336054 235454 237468 324557
17263 324557 477911 156064 232032 189309 389095 327834 365165 219930 92537 -267610
17252 284977 357419 357164 64179 68273 182605 575672 180623 313916 540409 385775 229976
17241 229976 337013 312334 184159 379825 335699 288783 311681 563636 203251 329241
17231 329241 507346 500714 359016 403914 398839 427135 102377 327563 313680 219950 272405
17220B72405J76103j80963A28992L18219C8820K82203j55593l2050L34267A52208
17209D01417A39762O8092J49330k4149n9936p4528K82001j51827l0158A35851
17198D09090f3258C49500J2199Q8204j91239M40106k25953j28097A29992E4868
17187G31955B11676K26600G9559M9229R9860l7100J47436E8894M14015m682A90406
17175C14139K14135k43479e3398D34203k08797N84708j78941B89337J09616P8886
17165D77839N6989N263k18160N2195J24139n5350j88531j15091K7800M77103B48427
17153C4106M46269j31428J19165B18753K55106q8424A45183Q6857P14204m64745
17143D81499K1872k24095J15993q2053J20295P1276K35630C12381K13074K75010
$$ plain form
17220 272405 448508 267545 128992 447211 38820 321023 165430 133380 467647 152208
17209 401417 139762 207854 357184 333035 273099 198571 480572 328745 298587 135851
17198 409090 -63258 349500 361699 449903 258664 698770 472817 344720 129992 54868
17187 731955 211676 438276 79559 128788 228648 191548 338984 58894 472909 468227 190406
17175 314139 528274 284795 -53398 434203 225406 810114 631173 289337 398953 477839
17165 477839 534828 540091 321931 374126 498265 442915 254384 139293 167093 644196 248427
17153 34106 480375 348947 468112 218753 473859 385435 145183 232040 946244 481499
17143 481499 503371 279276 395269 313216 433511 504787 740417 312381 525455 800465
17133H00465A35955b03458D86765M8152j08189o5048J24145G5271N6289K03633
17123C35193E0271N14489A13485L83446A61132K82501m8844K90109M7423C00512
17112E14691M7388k165l0783B53788M17101O7250r4309J8395k73160L1630O7540
17101D88235k5250B08479M82386B02624J05783J96109r9905J57686j23530K69161
17091G07928k27829J41610N282p8713j43343j25081L07927B45195J44993K48957
17081F39145k86339K70903j26167J99268j47506k12429K97267K93217m47904N4442
17071E33897j31896K2930J06416j14539J57324K71305j53816r4370l8620K67528
17061H26159k49097J19200L9401N4176B97293L39946L8912j34548J12476o8557
$$ plain form
17133 800465 135955 -203458 486765 534917 426728 361680 485825 75271 131560 335193
17123 335193 50271 564760 113485 496931 161132 443633 394789 684898 732321 300512
17112 514691 562079 559914 529131 253788 670889 738139 643830 662225 389065 420695 488235
17101 488235 462985 208479 690865 202624 308407 504516 404611 562297 438767 707928
17091 707928 480099 621709 626991 548278 404935 279854 587781 245195 390188 639145
17081 639145 352806 623709 497542 696810 549304 336875 634142 927359 479455 533897
17071 533897 402001 424931 531347 416808 574132 845437 691621 597251 558631 826159
17061 826159 577062 696262 735663 789839 297293 637239 676151 541603 654079 585522
17051E85522K30735Q9735l61490j08057K18696j16092K30735J87207k01952l4346
17041G20693l24681K6367M26276j93922L29062o9989k82546M4777k07554K24531
17031F93014j67778o5831J74468J01508J1561k20280L24993j9184K60968j72199
17021I21240m2420o4959L08296p2921D17625P98280o03904J04766J23261J40701
17011I80729o3893j51586J09927K05961j78471l2389J6491L98818j00460E88347
17000A070331M6338k68710k63256M0808K19451N3504K86833j93146J32883O8211
16990A193247m05480J80101L39688j71629k47474Q7807k11960L26226Q0463k51972
16980I19017J89143p8255n3468J51447k85775J80634J33560n9367j70180J35871
$$ plain form
17051 585522 816257 905992 544502 436445 655141 539049 769784 956991 755039 720693
17041 720693 396012 422379 848655 654733 983795 913806 631260 676037 468483 693014
17031 693014 525236 459405 633873 735381 746942 526662 851655 832471 1093439 921240
17021 921240 878820 813861 1122157 1049236 417625 1215905 612001 716767 840028 980729
17011 980729 916836 765250 875177 1081138 902667 870278 886769 1285587 1185127 588347
17000 1070331 1116669 847959 584703 625511 844962 898466 1185299 992153 1125036 1193247
16990 1193247 787767 967868 1307556 1135927 888453 976260 764300 1090526 1170989 919017
16980 919017 1108160 1029905 976437 1127884 842109 1022743 1156303 1096936 926756 1062627
16970A062627p8009J19231m9254O6866J1837J01896m9949j04878O9350K91428
16960A441145n90908M38608k11175K06129l89221L04687J50063k17417K84865
16951A416776o3804j93623J70245j185q5104L30856k93589J8886M0100J14579
16941A454137j41399k37330L33863j07070K53345J3244j8136J22091p9933k97442
16931A295370K16703k38450M30926k76709K55538k42276L85575j29340L54638
16922B051975k47970m09714J27052M00513m20776L71699j49280j78529j45952
16913A399018N28290N4529j12212J69165l17104N6560J39556r3181N3263J84094
16903B061978j3689L2354q7515j63561J2263L23545j12877j0983J08625m9581
$$ plain form
16970 1062627 984618 1103849 1054595 1121461 1133298 1235194 1185245 1080367 1149717 1441145
16960 1441145 850237 1288845 1077670 1283799 894578 1199265 1349328 1131911 1416776
16951 1416776 1352972 1159349 1329594 1328409 1243305 1574161 1280572 1299458 1339558 1454137
16941 1454137 1312738 1075408 1409271 1302201 1555546 1568790 1550654 1672745 1592812 1295370
16931 1295370 1512073 1273623 1704549 1427840 1683378 1441102 1826677 1697337 2051975
16922 2051975 1804005 1394291 1521343 1921856 1501080 1872779 1723499 1544970 1399018
16913 1399018 1927308 1981837 1869625 2038790 1721686 1778246 1917802 1824621 1877884 2061978
16903 2061978 2048289 2080643 1993128 1829567 1841830 2165375 2052498 2041515 2150140 2100559
16893B100559J71685j75212J7788O8031J13875M7060P5736j2838K96134m15371
16883B287447O6291J55440p1231l0431L1816r3397L19297j31379J04723P2922
16873B711498n7853J82217k63906o6365N02587M8802k19316q4382L34924l62057
16863B726149M02121q4682L63171l42051m0899k19433m7410M54193L29168l7400
16853C502927m6439j23736M02191j94108J28564j82676M33632N4689L6649Q5965
16843D097658j10987K23313N1000l03187O70018l44263q2284K23018r7736r8933
16833D227617L57123m5382M96942l84915M33362o3869J69743o1049K74489j05574
16823E298487L97168k92911J29846K47180L56610l15472r0882L72382k47722N67430
$$ plain form
16893 2100559 2272244 2097032 2114820 2182851 2296726 2343786 2419522 2406684 2702818 2287447
16883 2287447 2353738 2509178 2437947 2407516 2439332 2345935 2665232 2533853 2638576 2711498
16873 2711498 2653645 2835862 2571956 2505591 3008178 3056980 2837664 2753282 3088206 2726149
16863 2726149 3128270 3043588 3406759 3064708 3023809 2804376 2756966 3211159 3540327 3502927
16853 3502927 3456488 3332752 3734943 3540835 3669399 3486723 3920355 3975044 4011693 4097658
16843 4097658 3986671 4209984 4260984 3957797 4627815 4283552 4201268 4424286 4326550 4227617
16833 4227617 4584740 4539358 5036300 4651385 5084747 5020878 5190621 5129572 5404061 5298487
16823 5298487 5695655 5402744 5532590 5779770 6136380 5820908 5730026 6102408 5854686 6422116
16813F422116J36415O3195j39391L02850L29461k94054M82493k2859M77117l43895
16803G413448L26391k1622N15619j89980J83251M23782j09374J87174L95283J33355
16793I257327N725K90988J70928M08141M5482L67450M02343K12350K25072L95848
16783A1781654J74333L01570Q4148N42429J81097J74495N33652N18730P37560
16774A5029668L45961L8640M22167M48908Q07068N7841Q31359N99075n6340Q62861
16764A9387208M72554P11919L05805P00483R16473O58443K75840J333981N17892
16755B5280598R95764J328512Q60883Q97946J211792O48294J565878J401548J252570
16746C5443785J218366J116940J623935J943984J491881J489178K184150K073119
$$ plain form
16813 6422116 6558531 6621726 6482335 6785185 7114646 6820592 7303085 7280226 7757343 7413448
16803 7413448 7739839 7718217 8233836 8043856 8227107 8650889 8541515 8728689 9123972 9257327
16793 9257327 9263052 9554040 9724968 10133109 10178591 10546041 10948384 11160734 11385806 11781654
16783 11781654 11955987 12257557 12341705 12884134 13065231 13239726 13773378 14292108 15029668
16774 15029668 15375629 15414269 15836436 16285344 17092412 17150253 17981612 18580687 18524347 19387208
16764 19387208 19859762 20571681 20877486 21577969 22494442 23152885 23428725 24762706 25280598
16755 25280598 26276362 27604874 28465757 29363703 30575495 31223789 32789667 34191215 35443785
16746 35443785 36662151 37779091 39403026 41347010 42838891 44328069 46512219 48585338
16738D8585338J998212K078384K283646K259549K752477K754419K639610K664981
16730F8016616L160880L297357L282598L121343L850779L389799L924799M478473
16722I6522644L813408M187397L767159M365461L932546M102375M027680L701532
16714A28420202L405664L794561K650417K939536K355163J729836J309396O87826
16706A47292601L37719K95033j235752j099046j917998k064037k595004l094576
16698A35918940l040747l572143l672558l927876m416691l926640m441514m007538
16690A04913233m068781m369940l775495m027688l835485l441010l359454l333851
16682G4701529l396398l211556k539447l198925k838623k524046j983111k656367
$$ plain form
16738 48585338 50583550 52661934 54945580 57205129 59957606 62712025 65351635 68016616
16730 68016616 71177496 74474853 77757451 80878794 84729573 88119372 92044171 96522644
16722 96522644 100336052 104523449 108290608 112656069 116588615 120690990 124718670 128420202
16714 128420202 131825866 135620427 138270844 141210380 143565543 145295379 146604775 147292601
16706 147292601 147630320 147925353 146689601 145590555 143672557 141608520 139013516 135918940
16698 135918940 132878193 129306050 125633492 121705616 117288925 113362285 108920771 104913233
16690 104913233 100844452 96474512 92699017 88671329 84835844 81394834 78035380 74701529
16682 74701529 71305131 68093575 65554128 62355203 59516580 56992534 55009423 52353056
16674E2353056k050848k061164k082903j664317j988298j618063j502263j375155
16666C8010045j514059j348946j586894r61357j286892j281077j352656m58176
16658B8219988j372995p54656q06001r23501p95649o54920r82136n40705n55304
16649B0834121o07440p29852m52531r90101m66417l51993m31968m58771m41483
16640A5903565k82613q18349j0351m08378n83036l26303m12869k00154l72319
16631A2489193n24769J718m19091l71215n0664j69478m10025k66300j54839j74164
16621I950366l11215p4994J0641p05364m7869l93350N3198m46600J71899j91032
16611H015680l12307J40347n22723J54678k60539k25724j72239r2957m4461l43298
$$ plain form
16674 52353056 50302208 48241044 46158141 44493824 42505526 40887463 39385200 38010045
16666 38010045 36495986 35147040 33560146 32598789 31311897 30030820 28678164 28219988
16658 28219988 26846993 26092337 25286336 24362835 23567186 22912266 21930130 21389425 20834121
16649 20834121 20226681 19496829 19044298 18054197 17587780 17235787 16803819 16345048 15903565
16640 15903565 15620952 14802603 14792252 14383874 13800838 13474535 13061666 12861512 12489193
16631 12489193 11964424 11966142 11547051 11175836 11125172 10955694 10545669 10279369 10124530 9950366
16621 9950366 9639151 9564157 9574798 8869434 8821565 8428215 8481413 8034813 8206712 8015680
16611 8015680 7703373 7843720 7320997 7475675 7215136 6989412 6817173 6724216 6679755 6336457
16601F336457k4492K13288j66315k93108j9520m60904J12823J20139j31564l49626
16591E337178j9742J05649k28111J81444m97560o9329L4879p1553k50810O08020
16581E130065q84594R2225O4411q9455j50429N4095k91457L19725k39892j19024
16571C885670L6917J15731j37288j23122o8643k02200N7643K47046j73400n17261
16561C121093N21190J32538o47839j09122J30171J89342J15045j67090k76522
16552C008806j40403K76467k04730k79135L57902k86040J10006L3631l10469l236
16542B562799m8223M4482J41130N5150n564j93490j72466L61249m80993J20233
16532B384307J00494p6370k97464J99323K56265Q170J9809n06572K21490j28084
$$ plain form
16601 6336457 6311965 6525253 6358938 6065830 6046310 5585406 5698229 5818368 5686804 5337178
16591 5337178 5317436 5423085 5194974 5376418 4878858 4809529 4844408 4772855 4522045 5130065
16581 5130065 4245471 4337696 4402107 4312652 4162223 4216318 3924861 4244586 4004694 3885670
16571 3885670 3922587 4038318 3901030 3777908 3709265 3507065 3564708 3811754 3638354 3121093
16561 3121093 3642283 3774821 3126982 3017860 3148031 3337373 3452418 3285328 3008806
16552 3008806 2868403 3144870 2940140 2661005 3018907 2732867 2842873 2876504 2566035 2562799
16542 2562799 2514576 2559058 2700188 2755338 2749774 2556284 2383818 2745067 2264074 2384307
16532 2384307 2484801 2408431 2110967 2310290 2566555 2574725 2594534 2087962 2309452 2181368
16522B181368l4604k4804j12182O5906j92616L68541m4915n8253m95893M61747
16512B114295r7797k97524p6495L47496j56742j04624J49152l22357K50161m269
16502A801296J20337j98507j5058J43417k69485K65396j75540Q2689o0829O3752
16492A757468j67399J6467K84345k95557q4458K1049J85951k87627R004J30890
16482A570133K8705k58944j57517J9239K56055K91146j12539k11833p0078J1746
16472A366113j95755M40872l07636K4271R8290k39559K84428j19838k20562J4556
16462A145180L78054j09207N7112j02995J43370k72029J16575k55337L07000j95228
16452A212495l12707L22914J15203k76004m1621L11887j39438j7894j03643O5718
$$ plain form
16522 2181368 2146764 2121960 2009778 2075684 1883068 2251609 2206694 2148441 1652548 2114295
16512 2114295 2016498 1718974 1642479 1989975 1833233 1728609 1877761 1555404 1805565 1801296
16502 1801296 1921633 1723126 1708068 1851485 1582000 1847396 1671856 1754545 1693716 1757468
16492 1757468 1590069 1606536 1890881 1595324 1510866 1531915 1717866 1430239 1439243 1570133
16482 1570133 1598838 1339894 1182377 1201616 1457671 1748817 1636278 1424445 1354367 1366113
16472 1366113 1170358 1611230 1303594 1327865 1426155 1186596 1471024 1351186 1130624 1145180
16462 1145180 1523234 1414027 1471139 1368144 1511514 1239485 1356060 1100723 1407723 1212495
16452 1212495 899788 1222702 1337905 1061901 1020280 1332167 1192729 1174835 1071192 1136910
16442A136910j57231R4851Q1300r7313k07004M27390m94411L46410m14042L23009
16432A039869L37679k94820k17385J13664k15869L65864n3480j93146o8426K73933
16422A087883K6283j96531N5822R7544k50551K23024n7968j43864K00358m9406
16412I92594P6163K7877j6849k60508N9486j16321j7045O4760L06562m17610L55768
16401A054877m26436M41373m95468K02664J22976J28689m11006R2347L15879k9937
16391I95958k83715o5210N4661L99206l98230J33716J02473j44172o4293K1008
16381G51402p1926J30519P0195r0864L6398j16108j13931M13633k71495K5903
16371G63726J2984k69296J61395K16268k92359M25442l20049L0491J72890l77005
$$ plain form
16442 1136910 979679 1074530 1155830 1058517 851513 1278903 784492 1130902 716860 1039869
16432 1039869 1377548 1082728 865343 979007 763138 1129002 1075522 882376 813950 1087883
16422 1087883 1114166 917635 973457 1071001 820450 1043474 985506 841642 1042000 992594
16412 992594 1068757 1096634 1079785 819277 878763 762442 745397 810157 1116719 699109 1054877
16401 1054877 628441 1069814 574346 777010 899986 1028675 617669 710016 1025895 995958
16391 995958 712243 647033 701694 1100900 702670 836386 938859 794687 730394 751402
16381 751402 679476 809995 880190 789326 825724 709616 595685 1009318 737823 763726
16371 763726 776710 507414 668809 885077 592718 1018160 698111 728602 901492 524487
16361E24487K83638k04512j53458J99887j64649J34215J99963l14060K64272L69054
16351A138837l59150j19048K71749A92071M95882k61430K46326J02876N8037l57409
16341D76353J47077K36157k71755R3560j27045K3899j03830m8945N2043n794L1754
16330E03474q9021J89994l3548J54158B52326L81329O5449j34125J25255k82535
16320D07699L94056k19224r5024j67491N213L39310K06545j04871l05012J90269
16310F51470C19328K08159j3242J56173k16946M7077K78339l79158J19979J37270
16300F56979o0804o1262p3150M96037m47813L32633l17466Q8585j37671n8191
16290D17877K24659r6179j12083j5928K95958j705k45663A70836N92125A73330
$$ plain form
16361 524487 808125 603613 450155 650042 485393 619608 819571 505511 769783 1138837
16351 1138837 779687 660639 932388 192071 687953 426523 672849 775725 833762 476353
16341 476353 623430 859587 587832 681392 554347 578246 474416 425471 477514 471720 503474
16330 503474 414453 604447 570899 725057 252326 633655 699104 564979 690234 407699
16320 407699 801755 582531 487507 320016 325229 664539 871084 766213 461201 651470
16310 651470 319328 527487 514245 670418 453472 500549 778888 399730 519709 656979
16300 656979 596175 534913 461763 957800 509987 842620 525154 613739 476068 417877
16290 417877 642536 546357 434274 418346 714304 712599 466936 170836 762961 173330
16279G37224C51597K06199q7510A84412N9414J03204K64675j60524L4773L3185
16269E19139q6448L3181k10340L54485k1358O5550k75652J41551j34437o9731
16259C15940N348m1354I6519L06613r614M9275L0070M7093K03390j01665A40450
16247D78596K31609j82880k3451B33235J37026m9460Q0205j17257j33241k3997
16237A26511L15254K59634l37580L65079B79268K62141J14579k79950L6145J52395
16227E64578A46852N72812A58134N49799A61719K41454j79821A06129L9973J65299
16217C11401J44756K34246C31753M44480E6644K01330K73826P8609G8203L21985
16207D00188l5110n9795A51765L69382j24188E112P6993K25979r8930J47311A59823
$$ plain form
16279 737224 351597 557796 470286 184412 243826 347030 611705 451181 485954 519139
16269 519139 432691 465872 255532 610017 588659 654209 378557 520108 385671 315940
16259 315940 321288 279934 96519 403132 393518 442793 472863 519956 723346 621681 140450
16247 478596 710205 527325 503874 233235 370261 320801 401006 283749 150508 126511
16237 126511 441765 701399 363819 728898 279268 541409 655988 376038 412183 564578
16227 564578 146852 719664 158134 707933 161719 403173 223352 106129 146102 311401
16217 311401 456157 690403 331753 776233 56644 257974 531800 610409 78203 400188
16207 400188 365078 305283 151765 521147 396959 5112 82105 308084 209154 356465 159823
16195C62654r1601j29261Q4644M24492k23188j25820E1765L7431O9111j1884K71514
16184D17937J80996B39166n1592J55866A64437J95540m3899n849N7428i2304D30242
16172D37503b53712C94571k2788L7673I7631K10928P7823A05739M39393A50037
16161a78523B11575J19962p8239Q6404m9843A09394K0660A1978J26280F4781J19758
16150A84539J50946K77471B81758N1076J22030J98351C11300b4190B71113r2244
16140A78869H5696L14527K56821B68710d5859P433B90381L7132m3471n512K54520
16129E33050H6407L68679d5853A06759J43779j05048K87925C4451L05158C6778
16118g1039B48595C896L67614n9856f0226A85315q5189a68448B81880p655K21601
$$ plain form
16195 362654 271053 141792 226436 650928 427740 301920 51765 89196 158307 146423 417937
16184 417937 598933 239166 187574 343440 164437 359977 316078 310229 367657 -92304 430242
16172 437503 -253712 394571 371783 409456 97631 308559 386382 105739 545132 150037
16161 -178523 211575 331537 253298 339702 289859 109394 130054 11978 138258 64781 184539
16150 184539 335485 612956 281758 332834 454864 653215 311300 -24190 271113 178869
16140 178869 85696 400223 657044 268710 -45859 -38426 290381 327513 284042 278530 533050
16129 533050 86407 455086 -45853 106759 250538 145490 433415 34451 339609 36778
16118 -71039 248595 3896 371510 311654 -60226 185315 100126 -168448 281880 274225 495826
16107D95826j66879b61616B65040F1253R9584J51188j00506a598j51730C6795
16096A68509i8547B57786F4629a05015B90314c4609C68737D8044J04369F0465
16085F2241J65292j9733a65329b2847H6172J83830a99608C2626J02132k5277P7638
16074A87119C0058M8599b23665j2522D06494a8200A0011b19042A30901K0835n9453
16063I2283b50187C53729m3806A50498o2273O1040c61789C10436p7591q4062c9195
16051a84182A62455p1855a54198d9514n2093F3728c40727a17817B58803l130J3936
16040B69609a94148i0015K8888k53668C14272F6201K9401b838k79256F984h8865
16028H957K89767D3627g9815A78800h6374C67003B4600a48510n1684A34160c03452
$$ plain form
16107 495826 328947 -261616 265040 61253 160837 312025 211519 -1598 -153328 36795
16096 168509 -98547 257786 64629 -105015 290314 -34609 368737 48044 152413 60465
16085 62241 227533 207800 -165329 -22847 86172 270002 -199608 32626 134758 109481 187119
16074 187119 30058 78657 -223665 -236187 406494 -18200 10011 -219042 130901 151736 92283
16063 92283 -250187 353729 309923 150498 88225 149265 -361789 310436 232845 148783 -39195
16051 -184182 162455 90600 -154198 -49514 -101607 63728 -340727 -117817 258803 255673 269609
16040 269609 -194148 -90015 -61127 -314795 314272 66201 95602 -2838 -282094 6984 -88865
16028 8957 298724 43627 -79815 178800 -86374 367003 24600 -148510 -200194 134160 -303452
16016B96661E18b22246G6393b43789g6526C52276c63801C2724J52901a9514k99952
16005c19466a43204j59099N7805B43508b73942A62510a28178c8003D9503J78727
15995B28230L7642f5199A59801A5420f0746A21204R7803A2652J72650o0443e1747
15983b30129E6995L7896c11476B11732A8589K91721p8997j06573E632d8180B44480
15971F61640k35248M79077m879j50911J2657r0960j89992A79617l5998K61702
15961D05321a29157j46491a28884l3883B64087M8786F3051e5020A29613B8085
15950c21914D7293a54938c0691A19405R3205C6645K47980F0090e4602c865k34986
15939b38851K5904B87169a55207O7150K6915A95894b63245f8225j13172P4491
$$ plain form
16016 296661 518 -222246 76393 -243789 -76526 352276 -363801 32724 185625 -19514 -319466
16005 -319466 -143204 -302303 -244498 243508 -273942 162510 -128178 -38003 49503 228230
15995 228230 265872 -65199 159801 15420 -60746 121204 219007 12652 185302 124859 -51747
15983 -230129 56995 94891 -311476 211732 18589 310310 231313 124740 5632 -48180 244480
15971 661640 426392 905469 900590 749679 762336 671376 481384 179617 143619 405321
15961 405321 -129157 -275648 -128884 -162767 264087 312873 63051 -55020 129613 28085
15950 -321914 47293 -154938 -30691 119405 212610 36645 284625 60090 -54602 -3865 -238851
15939 -238851 -212947 287169 -155207 -88057 -61142 195894 -263245 -68225 -181397 -106906
15929a06906e483k2104C72674A45910D1705a07742b638B779J28595a28459m1169
15918a69628D1189N2443a23785a1302C40474H2449l1742f9914j7442A35101l6219
15907I8882D9338g9959A76053E4339N5581h6644k6910F1515b34907k8172n3264
15896c16343B6705J20893a81750D37073E6660a27136A41792Q9814d58308J50025
15886c08283A9741b08093B258a57516c2515i798k09051b8479l93070G2077C4360
15874g3543A80442D9211J22791a23002j7508B3441a17565d2552F1294J57800j01639
15863A17455b76867i553I2804J26252a2726A68003p6270b00766C0875E506i1173
15851f1731l6879F2713M6861b57500C3615a57076j71897F5142a25060A06429l0715
$$ plain form
15929 -106906 -5483 -27587 372674 145910 41705 -107742 -2638 2779 131374 -128459 -169628
15918 -169628 41189 93632 -123785 -11302 340474 82449 50707 -69914 -87356 135101 98882
15907 98882 49338 -79959 176053 54339 109920 -86644 -113554 61515 -234907 -263079 -316343
15896 -316343 26705 147598 -181750 437073 56660 -127136 141792 231606 -458308 -308283
15886 -308283 19741 -208093 2258 -157516 -32515 -9798 -218849 -28479 -421549 72077 34360
15874 -73543 180442 49211 172002 -123002 -140510 23441 -117565 -42552 61294 219094 117455
15863 117455 -276867 -9553 92804 219056 -12726 168003 91733 -200766 30875 5506 -91173
15851 -61731 -98610 62713 109574 -257500 33615 -157076 -328973 65142 -125060 106429 75714
15840G5714h2929D0366K2192b74292a21491A19385c3185l93798b10677J3798P9027
15829a17852e3146j29621A25918c1347l32022C2439P0602c2763A26612J11397
15819B38009e0692H3413j7970I430d4626o7120G1377F099a54415N3157f533A91078
15806e871A31382a8017k24637o8992I4311a44463C02791G5724a97644A2710a13043
15794a94012e0517l948m6186M7349j4342n9005j7221A45628d7841H4029a51727
15782a84746Q8477k85698a82815r3891b9597r9349L5434l2344N9153j11825p9290
15771b57818B90870i4927j01981C2633c4762k6024F2272g9602D7597J7612g454
15759C32880j65597f3669G6950J26599a1577k78106A56774a72661L4822C7936
$$ plain form
15840 75714 -82929 40366 62558 -274292 -121491 119385 -33185 -426983 -210677 -196879 -117852
15829 -117852 -53146 -182767 125918 -31347 -363369 32439 103041 -32763 126612 238009
15819 238009 -50692 83413 65443 9430 -44626 -111746 71377 6099 -154415 -101258 -6533 191078
15806 -5871 131382 -18017 -242654 -311646 94311 -144463 302791 75724 -197644 12710 -113043
15794 -194012 -50517 -54465 -100651 -53302 -67644 -126649 -143870 145628 -47841 84029 -151727
15782 -184746 -96269 -381967 -182815 -276706 -29597 -128946 -93512 -125856 -66703 -178528 -257818
15771 -257818 290870 -94927 -196908 32633 -34762 -60786 62272 -79602 47597 65209 -7454
15759 332880 167283 -63669 76950 203549 -11577 -289683 156774 -172661 -137839 37936
15748E2227a40C67394i8385I1917L5082O3421o0893i9185C73674F317K10909a40434
15735B57285a46457F4173L4089b12322j5799I1551J40921j11236J07654l9741
15725A89149b42760k74293A49869h0010o3331B30514c91853A41448i4453k53655
15715c48108J31469M6271N5116j70986i4728l8137D6722J84358c72725a78412
15704d3662n0025A6510K5594J43786i8952d5688B56688a20108l9378f8634H1830
15692C7952J78797h9364B71192q9459e9497E9664K4546a25479p3145j7237g4333
15680C4102a27050p1445B07464a32353K8683A11853l4954N7304D4431a19519F1046
15668i931j53331E7893d0246k17141k7821B55814o8122a74401J5826J5855N3050
$$ plain form
15748 52227 -140 367394 -98385 91917 126999 190420 129527 -99185 373674 6317 217226 -140434
15735 257285 -146457 64173 98262 -212322 -228121 91551 232472 121236 228890 189149
15725 189149 -242760 -517053 149869 -80010 -143341 230514 -391853 141448 -94453 -348108
15715 -348108 -216639 -170368 -115252 -286238 -94728 -132865 46722 231080 -372725 -178412
15704 -43662 -93687 16510 42104 185890 -98952 -45688 256688 -120108 -159486 -68634 81830
15692 37952 216749 -89364 271192 181733 -59497 59664 84210 -125479 -198624 -215861 -74333
15680 34102 -127050 -198495 207464 -132353 -103670 111853 76899 134203 44431 -119519 61046
15668 -9931 -163262 57893 -40246 -257387 -285208 255814 187692 -174401 -158575 -142720 -89670
15657h9670j293o6126H105f8828B43057h7004F9342J0007A7041J52138c50223
15645A33177e2289j47254o8436B57485D7118a5316m2688a3174j0592j74713k48890
15634d47369G5749b83405A12881i0651F0119b22774J01276j19285A34861a66159
15623A74948H0889a70426k7518A19019P3000h3735L1717o7897H1292l0614K4975
15612G5653j8508a84313h53B63831m9091b31228A9732q061R003h0533j29809g0821
15599b38000b0359j51119B43171l7272d61682A27706f7365A53419b3926m9511
15589g3437K6561p4886n8706A25103C8553a91740E2661O8948O431d4819n5804
15578a00623I705b36418i6631o9159j11548Q6202B37944h5057n6671i246D781
$$ plain form
15657 -89670 -90963 -157089 8105 -68828 243057 -87004 69342 79349 17041 169179 -350223
15645 133177 -52289 -199543 -267979 257485 47118 -15316 -58004 -13174 -23766 -198479 -447369
15634 -447369 75749 -283405 112881 -90651 60119 -222774 -121498 -240783 134861 -166159
15623 174948 80889 -170426 -197944 119019 192019 -83735 -52018 -119915 81292 50678 75653
15612 75653 57145 -184313 -853 263831 214740 -231228 19732 11671 20674 -80533 -210342 -70821
15599 -238000 -20359 -171478 243171 205899 -461682 127706 -67365 153419 -23926 -73437
15589 -73437 -46876 -121762 -180468 125103 38553 -191740 52661 121609 128040 -44819 -100623
15578 -100623 9705 -236418 -96631 -165790 -277338 -191136 237944 -85057 -141728 -9246 4781
15566c38366A22980e9650j28354I9694m1739q969b87701J00734O0176A15369b81379
15554A104Q2426a92579a7715j03562k506C76475G3202c06602E4235a48500A17326
15542C3503e4887k05140A00296c45141H620b8158j32734A68872a46003j6015G713
15530A92980b8354C1826J6835j5688l152J22620b98592a36070G9281J30284c9624
15518G2642k9218A9988b09649g2684p9766j07481c646C5012M1035A3573J57654
15507A71227b77755G3555Q9106b3555p8717A40018J34311N5290H6098e61168b30167
15495a74478A17789J27530i6630A68295m8379M7126C7059h5920A12772C1527f424
15483c5872n68456b8719o0174A39452J86384c9732B25074M9499a38411j92158
$$ plain form
15566 -338366 122980 -59650 -188004 99694 57955 48986 -287701 -186967 -126791 115369 -281379
15554 1104 83530 -192579 -17715 -121277 -123783 376475 73202 -306602 54235 -148500 117326
15542 33503 -54887 -260027 100296 -345141 8620 -28158 -160892 168872 -146003 -162018 7713
15530 192980 -28354 31826 48661 32973 29821 152441 -298592 -136070 79281 209565 -39624
15518 72642 43424 19988 -209649 -72684 -152450 -259931 -3646 35012 76047 13573 171227
15507 171227 -277755 73555 162661 -23555 -102272 140018 274329 329619 86098 -561168 -230167
15495 -174478 117789 245319 -96630 168295 119916 167042 37059 -85920 112772 31527 -6424
15483 -35872 -604328 -28719 -88893 139452 325836 -39732 225074 274573 -138411 -330569
15473c30569A1840J08106c39931B52363P1151l1648a45322H2608d7365k0010C58495
15461F9585c39825A45154M49139k34056J02113K8529p8411d7935m2566L2914D8995
15449I0998h8671C07525A9156b7384E7071c12432A41406l7903O2283i0776A1122
15437G6601J15369b27133C0349J22918d1645o2902F9040a9049A35387K56067K33004
15426F24458C08762J14621O38678D05570p9663A42784P9226A09092J55046c4353
15415i535k9515r236G3155b1496I3072b36079I9301a51687A2791d6598A54837
15403F793M0240e1160l69584b09230c5755E54K50484a41027M7611D52294b61437
15391B13375D2384f0503b8538B71443j22540J890a91902i1633A50267b9358j41587
$$ plain form
15473 -330569 11840 119946 -339931 252363 323514 291866 -145322 82608 -47365 -67375 358495
15461 69585 -339825 145154 594293 360237 462350 490879 412468 -47935 -90501 -57587 48995
15449 90998 -88671 307525 19156 -27384 57071 -312432 141406 103503 165786 -90776 11122
15437 76601 191970 -227133 30349 153267 -41645 -104547 69040 -19049 135387 391454 624458
15426 624458 308762 423383 1062061 405570 325907 142784 222010 109092 264138 -34353
15415 -9535 -39050 -48286 73155 -21496 93072 -236079 99301 -151687 12791 -46598 154837
15403 6793 47033 -51160 -420744 -209230 -35755 554 251038 -141027 -93416 452294 -261437
15391 213375 42384 -60503 -28538 271443 148903 150793 -191902 -91633 150267 -29358 -170945
15380a70945A51490B5628g4779A41470J26961a12931m5145P3651B05141q5210
15370A19931b15024I8782J26165M9810d01783A91234D9640J12774G3683r138a28941
15358A75178l6119N8641L39849A76241J54723A42634J35200r0378c95575A44447
15347F01589I7769L87680d0178A78490a59015B39878F90J93577l8464m0237B0035
15335B4030L55831o9786b8976B11863m4069k3820a13118G8686K05084i9459G25368
15323A45403L0245q0443J70347B1921J66992o5611J3123B0875J7379K55146f8131
15311B26291r9166B0454R7050J90423B8859K4956K9366R1354b16742A03903J08370
15300B12273J0840b5330l46254E8515a06590C41160j36644o8677K55097a14754
$$ plain form
15380 -170945 151490 25628 -74779 141470 268431 -112931 -158076 -84425 205141 119931
15370 119931 -215024 98782 224947 274757 -401783 191234 49640 162414 73683 64545 -128941
15358 175178 139059 197700 537549 176241 330964 142634 277834 187456 -395575 144447
15347 601589 97769 485449 -40178 178490 -159015 239878 690 194267 155803 115566 20035
15335 24030 379861 310075 -28976 211863 167794 143974 -113118 78686 283770 -99459 725368
15323 145403 175648 95205 265552 21921 188913 123302 136425 20875 38254 293400 -68131
15311 226291 127125 20454 117504 307927 28859 53815 83181 174535 -216742 103903 212273
15300 212273 223113 -25330 -371584 58515 -106590 341160 204516 135839 390936 -114754
15289A21981O1411b62688B17100i3954I3745M0802l9689R244g1762k39794f935
15277A43710J782b48833C6637a34692j15186F5231k1945J7096f2075J4719k34847
15266b82203B66475o7235k7589j2468a59803C68403q9582A08637B795R7891b55193
15254c65516a06125C7018K539L5819L7589j5512K8790A6813i3551k52286A82608
15242e5631a8424o6011B76791D3178c8653H8000K41117D6071c5886A83594L64488
15231E48082K2626O59685J49164r138j00818l89444N1091C10273j26099N9642
15221B43816P9307l1794g2693F9688J54859B6263i8287k54554B38929b7971j23497
15210a51468C63962I8929c50584A53565K2089R1326j21654b70632K0153G9031
$$ plain form
15289 121981 183392 -262688 217100 -93954 93745 134547 94858 104102 -71762 -311556 -6935
15277 143710 145492 -248833 36637 -134692 -249878 65231 43286 60382 -62075 -47356 -282203
15266 -282203 266475 199240 171651 159183 -159803 368403 278821 108637 2795 100686 -255193
15254 -365516 -106125 37018 39557 75376 112965 97453 126243 16813 -93551 -345837 182608
15242 -55631 -18424 -84435 276791 43178 -38653 88000 329117 46071 -35886 183594 548082
15231 548082 570708 1230393 1379557 1370419 1269601 880157 931248 310273 184174 243816
15221 243816 323123 291329 -72693 69688 224547 26263 -98287 -352841 238929 -27971 -151468
15210 -151468 363962 98929 -350584 153565 175654 266980 145326 -270632 -250479 79031
15199g3704K0140B76006a60494D31832j54350j14395K0865p2943a24865J9744
15189a05121J868l7020I657J20060L8539E3088b7869m12336A37975b10785J5437
15178a95348L8752C09293c2947A3478h6098B26350a9398G8528k8154a40514E9090
15166A36154a85318C93885d0835A40311e9358B53622N8080m5285h7975A20402
15155h0464K4920J4382k32598E4016a4521B50779i7309A68217J30216n4656L04680
15144E48457B47867F7979B589b8789r6102N8803n4425B78654e2716E7752K89255
15133C47007A27662h0190D19636h4249H6607l5212M8161b4672C41080A66205n9256
15122A06949J07320D986J42743a22582a1007F1576N6624P4273c9602H0681N1996
$$ plain form
15199 -73704 -53564 276006 -160494 431832 277482 163087 183952 111009 -124865 -105121
15189 -105121 -103253 -140273 9657 129717 168256 53088 -27869 -440205 137975 -210785 -195348
15178 -195348 -156596 309293 -32947 13478 -86098 226350 -19398 78528 50374 -140514 59090
15166 136154 -185318 393885 -40835 140311 -59358 253622 311702 266417 -87975 120402
15155 -80464 -55544 -41162 -273760 54016 -14521 250779 -97309 168217 298433 243777 548457
15144 548457 247867 67979 2589 -28789 -124891 -66088 -120513 278654 -52716 57752 347007
15133 347007 127662 -80190 419636 -84249 86607 51395 99556 -24672 341080 166205 106949
15122 106949 214269 4986 147729 -122582 -11007 61576 118200 192473 -39602 80681 132677
15111A32677b55673B90944F6186J04591J62296q1466j01265L07754R9466j32172
15101D25390i0865A07517R0051H4479j8486a9463B01946K9340N5876F7314a65436
15089A71264B4808J7905Q0343m7250b30809A59336L42918j90173j19196k8192
15079A64693F0126b1081B17817J3355r5065D54J68207a20836A67900C0653J10336
15068A40989B6755M8260K27427G2063b93440B03078a12310A03640K192i7378A30449
15056B82530j16834o1567C1425i2227A44846K48630A02786c2057D28424F4858
15045A89022J01947A06053D5462R9388h0321H1098f39A42620M94138B29737l7969
15034A91768L81215B75268O1163L14700D8918K33083A32846J93928L8528k8497
$$ plain form
15111 132677 -255673 290944 66186 170777 333073 251607 150342 458096 557562 425390
15101 425390 -90865 107517 197568 84479 65993 -19463 201946 231286 287162 67314 -165436
15089 171264 24808 42713 123056 75806 -230809 159336 502254 312081 192885 164693
15079 164693 60126 -21081 217817 231172 136107 454 168661 -120836 167900 30653 140989
15068 140989 26755 75015 302442 72063 -293440 203078 -112310 103640 105832 -97378 130449
15056 282530 165696 104129 31425 -92227 144846 393476 102786 -32057 428424 64858
15045 189022 290969 106053 45462 144850 -80321 81098 -639 142620 636758 229737 191768
15034 191768 572983 275268 336431 651131 48918 282001 132846 326774 365302 336805
15024C36805K48870j80155j85247M6596A15759k150J01061J39023o4132K71463
15014E61024l1789j71257j39577N85418k23633C9998K25815j24230M04875j39663
15004D06795J9060r5613K49571B02632L22696K6306k60327C4603M25227n6736
14994D03094J76663k64189q0246K2735k2149J35289K08451B21119M98664B65562
14983C40504p2815L40964M6992B11533K9191r4619K79470A01357J16503K34419
14973D52279K9501O3202j53054E8289M59646k18153J012K46266J33289r0535o3475
14962E26339J58971J24928C77860j57657L04662r7433J0795l4947K84586j57270
14952E30596j49714K88598B17947K28018B21350l720c3870A16675L94824A65705
$$ plain form
15024 336805 585675 405520 220273 266869 115759 113609 214670 353693 289561 561024
15014 561024 529235 357978 218401 803819 580186 39998 265813 141583 546458 406795
15004 406795 425855 330242 579813 202632 525328 551634 291307 34603 459830 403094
14994 403094 579757 315568 235322 258057 235908 371197 579648 221119 719783 265562
14983 340504 267689 608653 655645 211533 240724 146105 425575 101357 217860 452279
14973 452279 481780 544982 391928 58289 517935 299782 300794 547060 680349 589814 526339
14962 526339 685310 810238 377860 220203 524865 427432 438227 403280 687866 530596
14952 530596 380882 669480 217947 445965 221350 217630 -33870 116675 511499 165705
14941C74331n8740j23125K93628r8632J44437n5238B4456K02606K54759I5504
14930E05617J28457k75248L6984A52594O08742P0922l56601J41416l06403j41228
14920A69442J87759O82912m99606n8808k23651K70483R4522K4610L25242p059
14910I65846K70293k28209L42047j96711K04523n43819P58112p7678q5924K63868
14900A672348o9728M3108j61488j6300l13260l2518j62493j50827J61018B87838
14889H39950D04756O4064K52262K592B10121a06824D04923J46445c4128D68558
14878B61474M0269j19580K16654j00308K11622o6170J4467j12339O6083L53025
14868G65197l00152m7925L17244o3269k21746K10268R1327K49641m18917L36482
$$ plain form
14941 374331 315591 192466 486094 387462 531899 476661 24456 227062 481821 95504
14930 505617 634074 358826 395810 152594 761336 832258 475657 617073 310670 169442
14920 169442 357201 1040113 540507 481699 258048 528531 623053 647663 972905 965846
14910 965846 1236139 1007930 1349977 1153266 1357789 813970 1572082 1494404 1408480 1672348
14900 1672348 1602620 1645728 1484240 1467940 1154680 1122162 959669 808842 969860 287838
14889 839950 404756 468820 721082 723674 210121 -106824 404923 551368 -34128 468558
14878 261474 301743 182163 398817 298509 510131 443961 458428 346089 412172 765197
14868 765197 465045 417120 734364 671095 449349 659617 750944 1000585 581668 918150
14858I18150C80973P5071P847J06827o6763K31523C49050K66531R2059p3930M105
14847F37815r3844j08165J07155A62862M88993j39203o8533B19824K25276j08797
14837C36303o5473J73460m6222L8949J4005q4429K09758j08769j83812L66545
14827F50315K38549k49916n4757L59206j15744J62131J70973m82209J23154N3017
14817H54719o5540l04524Q985j10068J29354q3642j2907L47686M8388j94315R7936
14806G16072j04257K99433n2378k42266l6981K5584K05802k66367J02585k31346
14796D15881K36642B40664M14697j81726K76749j37676r0256q5805J04626K85352
14786H26625j20049Q3695k1571p1811k53545J75269n3929j3124j83280J00394
$$ plain form
14858 918150 380973 456044 463891 570718 503955 735478 349050 615581 707640 633710 637815
14847 637815 543971 435806 542961 162862 651855 512652 444119 219824 445100 336303
14837 336303 270830 444290 398068 437017 451022 366593 576351 467582 283770 650315
14827 650315 888864 638948 584191 943397 827653 989784 1160757 678548 801702 854719
14817 854719 789179 484655 493640 383572 512926 429284 416377 764063 812451 618136 716072
14806 716072 611815 911248 858870 616604 579623 605207 811009 544642 647227 415881
14796 415881 652523 240664 655361 473635 750384 612708 522452 436647 541273 826625
14786 826625 706576 790271 768700 696889 443344 618613 564684 551560 368280 468674
14776D68674m1371l798q7395J85040N5420k3705L45055D47657J67766L40787l19613
14765F36597P5987j59654N5344J12580o0548K22731k9666J36622k42522K00324
14755I47795k24402J64300k90476k39981N20988M5059k43283k0411j42124J80834
14745F98299L47986m07420J28278B0556M66651L05765j20374k47233M54829k46562
14735F33632J398J75421l14586L6038M06539l78719l2056J80028q8640n4078L75873
14724I40850p3589k81304k0458P4509k15061M72424j62547L522P2026R5920k9511
14713H76781N8688L45427M0143j38524K02169J51072j33231O0027l33330L20719
14703A449941m39985J61200k7088l31888P8203L03284E42727L49052J1261p398
$$ plain form
14776 468674 427303 423505 336110 521150 576570 552865 897920 447657 615423 956210 636597
14765 636597 712584 552930 608274 720854 660306 883037 853371 989993 747471 947795
14755 947795 723393 887693 597217 357236 878224 923283 680000 659589 517465 698299
14745 698299 1046285 638865 767143 20556 487207 792972 672598 425365 880194 633632
14735 633632 635030 810451 495865 531903 938442 559723 527667 707695 619055 564977 940850
14724 940850 867261 585957 565499 640008 424947 897371 734824 738346 810372 906292 876781
14713 876781 935469 1280896 1321039 1182515 1384684 1535756 1402525 1462552 1129222 1449941
14703 1449941 1009956 1171156 1144068 812180 890383 1193667 542727 891779 903040 895642
14693H95642q6643K35652m19241K28565O66241j81830k46854j71797K62112M40350
14683A622197k1895q2411k4111n9037O3185l47825j017Q267k09074M7800j64323
14672H31756L9027K4288K40585m87220K45806l6941R5749l1851L10092p9502m09734
14661G42055K97719J48144j01605j58145o6650N5446J95755n4586n1607R7145
14651A103671j18861K28199k8505j52074O0017k31862Q3213J04057O8368L7558
14641A153781m6620j53906K97644n6294k87473N40933m58810P4194K41448p4073
14631A230824j44467J7607k4470R3943N9484K21620j64046K0459P7214J63601
14621A551769m14197o302j77164L72473j70441j71759M71308M7137j80542p3394
$$ plain form
14693 895642 808999 1044651 625410 853975 1520216 1338386 1091532 919735 1181847 1622197
14683 1622197 1600302 1517891 1493780 1434743 1497928 1150103 1149086 1157353 948279 996079 831756
14672 831756 870783 895071 1135656 648436 894242 857301 953050 921199 1231291 1151789 742055
14661 742055 1039774 1187918 1086313 928168 861518 916964 1112719 1058133 1006526 1103671
14651 1103671 984810 1213009 1184504 1032430 1092447 860585 943798 1047855 1116223 1153781
14641 1153781 1107161 953255 1250899 1194605 907132 1448065 989255 1063449 1304897 1230824
14631 1230824 1086357 1103964 1079494 1173437 1232921 1454541 1290495 1310954 1388168 1551769
14621 1551769 1137572 1131270 954106 1326579 1156138 984379 1455687 1502824 1322282 1248888
14611A248888J93176K5731J64788r742m46577K0538J87500n4197P7674Q643k22868
14600A193554K85805j88472O6829n056K22351j8964j24099K9411J88044j65054
14590A484349j92743J33068L5063N8283J15776k71103Q0082K6626L14682n27485
14580A256598K75983K26748J54548l11915N9471P4844m2171p649J89697N9728
14570A935882l21361P2621o5347K03365j6156j075J92581L8301N5225j1923l26508
14559A755605M70078O3758q535l0611P1219j62514K88423j50057m7077L24536
14549B574825n2384M6204O1551O6514M49689k42038L66549l54268O50747L9369
14539C606758O38728L88272Q47872N79334J460934K207842L458253O533305J0737893
$$ plain form
14611 1248888 1442064 1467795 1632583 1622841 1176264 1196802 1384302 1330105 1407779 1416422 1193554
14600 1193554 1479359 1290887 1357716 1352660 1575011 1556047 1431948 1461359 1649403 1484349
14590 1484349 1291606 1424674 1459737 1518020 1633796 1362693 1442775 1469401 1784083 1256598
14580 1256598 1532581 1759329 1913877 1601962 1661433 1736277 1694106 1686457 1876154 1935882
14570 1935882 1614521 1687142 1621795 1825160 1809004 1807929 2000510 2038811 2094036 2082113 1755605
14559 1755605 2225683 2289441 2280906 2250295 2321514 2159000 2447423 2297366 2250289 2574825
14549 2574825 2522441 2568645 2630196 2696710 3146399 2904361 3270910 2916642 3567389 3606758
14539 3606758 4245486 4633758 5481630 6060964 7521898 9729740 13187993 19721298 30459191
14530C0459191n94823j0375744o779293m084247j902135p81202r39770j569544
14522C432433r4029r07666M62469m61187l1021Q12k10335K44056k52827L09153
14512B491858l82916M57985l94550K09042j15794k23419O28762k51186q5755q9792
14502B244235L41631o3826J4408L71390l37659L5274j52536K7483L84260q3796
14492B780864J18018j86650P6123L60305j75714j50328L8483N75551n70140K41188
14482C107700J52722j45725O9503Q7397j29767L06548K74930m54708J53506J51694
14472C573800j16650J14565J50751n5360M9297j03735N5056M23451K4315n70848
14462C544642L86556K39717j19306J40214J35888k44709L73522o8441l2557m4856
$$ plain form
14530 30459191 29864368 19488624 12709331 8625084 6722949 5941747 5001977 3432433
14522 3432433 3338404 2430738 2893207 2432020 2400999 2401811 2191476 2435532 2182705 2491858
14512 2491858 2108942 2566927 2172377 2381419 2265625 2042206 2670968 2419782 2334027 2244235
14502 2244235 2585866 2522040 2536448 2907838 2570179 2605453 2452917 2480400 2864660 2780864
14492 2780864 2898882 2712232 2788355 3148660 2972946 2822618 2861101 3436652 2866512 3107700
14482 3107700 3260422 3114697 3184200 3271597 3141830 3448378 3723308 3268600 3422106 3573800
14472 3573800 3457150 3571715 3722466 3667106 3716403 3612668 3667724 4091175 4115490 3544642
14462 3544642 3931198 4170915 4051609 4191823 4327711 4083002 4456524 4388083 4355526 4310670
14452D310670j1010J41800n5745N36871l67601M89564k42568J91343J19374l52687
14442D760011N35743k86850p1661J44305N40400k82314J15137l5440K39111j93152
14432E465290L1698M55246j90064P4697J72282q5373K45390q7508J77562k7466
14422F231754J50230J34257J6621K36587l56571J65265Q3653L53663R8163K22717
14412G336339k5343k2370k28335M60301K51298j04366K46197J66444J83341K89002
14402H552508q9155N86733m0914l31266L42963J1403K0670M43865k07623J51737
14392I440921O0521L23219L01587j21728K31507M60169N442K74493M4445K77206
14382A1297782N6699n6038K45272L98036K09569J01091K74202K9345K33980K13955
$$ plain form
14452 4310670 4299660 4441460 4385715 4922586 4554985 5044549 4801981 4993324 5112698 4760011
14442 4760011 5295754 5008904 4937243 5081548 5621948 5339634 5454771 5419331 5658442 5465290
14432 5465290 5496988 5952234 5762170 5836867 6009149 5923776 6169166 6081658 6259220 6231754
14422 6231754 6381984 6516241 6532862 6769449 6412878 6578143 6661796 7015459 7113622 7336339
14412 7336339 7310996 7288626 7060291 7520592 7771890 7667524 7913721 8080165 8263506 8552508
14402 8552508 8463353 9050086 9009172 8677906 9020869 9032272 9052942 9496807 9289184 9440921
14392 9440921 9501442 9824661 10126248 10004520 10236027 10696196 10701638 10976131 11020576 11297782
14382 11297782 11354481 11298443 11543715 11941751 12151320 12252411 12526613 12555958 12789938 13003893
14372A3003893M49994J45363M09199J03143K89933j048M47525J63900O42807L25029
14362A5979738J22695P37563j17747L21089L15707K80021N55234J65001K47628
14353A8606929M60062M25493L82960O69647J95155O06790N36302K96690O05682
14344B2785710M07037k19499J046480M61083M26649J040596N39358K92291Q68893
14335B7648598M53474J006513Q49669N05610O67597J046288J154526O24499N81205
14326C4537979J201149J116840Q22353J235162J305080J125450J428624P70019
14318D3542656J363925J579909J203663J524373J562063J780159J646396J747242
14310E5950386K646048J416270K170548K400424K416569K229337K643990K992201
$$ plain form
14372 13003893 13453887 13599250 14008449 14111592 14401525 14400477 14848002 15011902 15654709 15979738
14362 15979738 16102433 16839996 16722249 17043338 17359045 17639066 18194300 18359301 18606929
14353 18606929 19066991 19492484 19875444 20545091 20740246 21347036 21883338 22180028 22785710
14344 22785710 23192747 22973248 24019728 24480811 24907460 25948056 26487414 26779705 27648598
14335 27648598 28102072 29108585 29958254 30463864 31131461 32177749 33332275 33956774 34537979
14326 34537979 35739128 36855968 37678321 38913483 40218563 41344013 42772637 43542656
14318 43542656 44906581 46486490 47690153 49214526 50776589 52556748 54203144 55950386
14310 55950386 58596434 60012704 62183252 64583676 67000245 69229582 71873572 74865773
14302G4865773K601853L048743L503704L223390L275274L605861M003723M671222
14294A02799543L813424N080628M791647N701669N490152O094889O071123P220540
14286A47063615P101210P269991Q349660Q410374Q841878R682505J0095431J0630795
14278B17445459J0903710J2119017J2405789J3298507J3813521J3841160J4217476
14271C08044639J4657142J4492968J4874794J4207969J4101150J3326757J2714024
14264D06419443J1230335J0191975R322459Q162244P224402O265517M393260K255792
14256D65465427O36234k41009o815961o502193m635017o454730r912508j1293396
14248D20246847j2638721j3922973j3937536j4089717j3324430j4867712j4252536
$$ plain form
14302 74865773 77467626 80516369 84020073 87243463 90518737 94124598 98128321 102799543
14294 102799543 106612967 111693595 116485242 122186911 127677063 133771952 139843075 147063615
14286 147063615 154164825 161434816 169784476 178194850 187036728 196719233 206814664 217445459
14278 217445459 228349169 240468186 252873975 266172482 279986003 293827163 308044639
14271 308044639 322701781 337194749 352069543 366277512 380378662 393705419 406419443
14264 406419443 417649778 427841753 437164212 445326456 452550858 458816375 463209635 465465427
14256 465465427 466101661 465860652 459044691 452542498 447907481 441452751 431540243 420246847
14248 420246847 407608126 393685153 379747617 365657900 352333470 337465758 323213222
14241C23213222j4188852j3852895j3146978j3241604j2502410j1242163j0455449
14234B34582871j1658969j1391989j0933707r886031r278103q783251q518261
14227A64132560q023929p538515o746255o804585n725626n716963n629244n046137
14219A12901306m713596m743325m161439l786408l608962l939955l611665l177981
14211H1157975l003151l162946k422648k598430k545064k100253k220170j865591
14203F1239722k359898j548496k028916j910626j144004j732886j973473j408685
14195D7132738j236571j201956j234505j168370q87980j224727j372176r67938
14187C7838515j183838p94240o21621j082593j146902n73873j187118l87960p91542
$$ plain form
14241 323213222 309024370 295171475 282024497 268782893 256280483 245038320 234582871
14234 234582871 222923902 211531913 200598206 190712175 181434072 172650821 164132560
14227 164132560 156108631 148570116 141823861 135019276 129293650 123576687 117947443 112901306
14219 112901306 108187710 103444385 99282946 95496538 91887576 87947621 84335956 81157975
14211 81157975 78154824 74991878 72569230 69970800 67425736 65325483 63105313 61239722
14203 61239722 58879824 57331328 55302412 53391786 52247782 50514896 48541423 47132738
14195 47132738 45896167 44694211 43459706 42291336 41403356 40178629 38806453 37838515
14187 37838515 36654677 35860437 35238816 34156223 33009321 32435448 31248330 30860370 30068828
14178C0068828p35250q20178p23482n78328p16312m73459m73784j204076k49803
14169B4094156p19232k08333l98854o45980o48847m71681k63427m65146n46182
14160A9726474M3233q35135l37529l23698k9568m14824m62879n94120r7844k43300
14150A6430810m21285j66346k83834o28266k42460l38873L68111k91825k78531
14141A4147501n18386K7123o33045Q3583j53511m29826n34355N36242o58378k8202
14131A1838746o16181Q3619j81757j02946Q0405n07717J69369l87916j65385k11679
14121I998558k63966K27626k69005l72328L42768k75043l4662l27825J04187j90409
14111H939901l18916j0498l44953J92205k14113m2258k87701k50660M01600m75370
$$ plain form
14178 30068828 29333578 28513400 27789918 27211590 26495278 26021819 25548035 24343959 24094156
14169 24094156 23374924 23166591 22767737 22121757 21472910 21001229 20737802 20272656 19726474
14160 19726474 19769707 18934572 18597043 18273345 18243777 17828953 17366074 16771954 16674110 16430810
14150 16430810 16009525 15843179 15559345 14931079 14688619 14349746 14717857 14426032 14147501
14141 14147501 13629115 13656238 13023193 13106776 12953265 12523439 11989084 12525326 11866948 11838746
14131 11838746 11222565 11306184 11124427 11021481 11101886 10594169 10763538 10375622 10210237 9998558
14121 9998558 9734592 9962218 9693213 9320885 9663653 9388610 9353948 9026123 9130310 8939901
14111 8939901 8620985 8610487 8265534 8457739 8243626 8201368 7913667 7663007 8064607 7589237
14101G589237l15817L94896j47857j26275k56384K98634k14643k20617o757J26762
14091G121179l79190K60429p53587J21975L33167l58383L60394m51499J50249
14082F404734n36789j50365L09606p4419k470m39438L17540k77307k47612L74479
14072E677959l47739o1564N6003J21004j18675m61143M06845l57796N1214m5853
14062D920255j06295K68683k84049k81781J93234J32023m95116J62670n0046p3520
14052D386058o915j26160J27377m87163L89189J78322N3125l09724r4375J88396
14042D298130j43613M2121M5435m10506J16582L72905n80536J18978l26092k21254
14032C312150L05876o4091r8810m25387M92748Q8360k78527Q3308O4408j36250
$$ plain form
14101 7589237 7273420 7668316 7520459 7394184 7137800 7436434 7221791 7001174 6994417 7121179
14091 7121179 6741989 7002418 6248831 6370806 6703973 6345590 6705984 6254485 6404734
14082 6404734 5867945 5717580 6027186 5952767 5950297 5510859 5828399 5551092 5303480 5677959
14072 5677959 5330220 5268656 5324659 5445663 5326988 4865845 5272690 4914894 4966108 4920255
14062 4920255 4813960 5082643 4798594 4516813 4710047 4842070 4346954 4509624 4459578 4386058
14052 4386058 4379143 4252983 4380360 3893197 4282386 4460708 4513833 4204109 4109734 4298130
14042 4298130 4154517 4196638 4242073 3831567 3948149 4321054 3740518 3859496 3533404 3312150
14032 3312150 3618026 3553935 3455125 3029738 3522486 3610846 3332319 3415627 3480035 3343785
14022C343785J85898m85976L8324K45711l8835P4037j80765J4306k09539P100
14012B994046j21978L18752k65303P5542L21224j70332l71082j6292K66834j55262
14002B876149l70518L24513K0543k3465j95725N17627o99068L63003n94036L79488
13992B598511l26926J05433j49o3376K85939J1384P7681m6931j3253l06237J9852
13981B341928L34589K2017K77531J81697N26525M07738P05334J528564K795116
13972I121039N672256J1448103M454499p999715o502204m905487l257849j586141
13964F444501j185319m78484k16505l93074m51172k36078l96993k22758l5446
13955B828672j04477j03514n4819J39679j77073N4261j00029m5646j47735q2539
$$ plain form
14022 3343785 3529683 3043707 3082031 3327742 3288907 3362944 3182179 3196485 2986946 2994046
14012 2994046 2872068 3190820 2925517 3001059 3322283 3151951 2780869 2764577 3031411 2876149
14002 2876149 2505631 2830144 2850687 2827222 2631497 3149124 2450056 2813059 2219023 2598511
13992 2598511 2271585 2377018 2376869 2313493 2599432 2610816 2688497 2641566 2628313 2322076 2341928
13981 2341928 2676517 2698534 2976065 3157762 3684287 4092025 4797359 6325923 9121039
13972 9121039 14793295 26241398 30695897 22696182 16193978 11288491 8030642 6444501
13964 6444501 5259182 4780698 4564193 4171119 3719947 3483869 3086876 2864118 2828672
13955 2828672 2724195 2620681 2565862 2705541 2528468 2582729 2482700 2437054 2289319 2206780
13945B206780N5047j70421R9423K0728J42207k14505K65486l18621j99276N3196
13935A940044J05368J27640k550o2206k15605j50636k59969N77211j35710L479
13925A927066m8382m5955l16906L26927o5637j89665J07226q1701L67322l97432
13915A582863J4068j7393K56406j39353J64591J8945j31959j38220j93202N81553
13905A998299m58346N5173K64514l79422J42053j73839J57814q1940k12085L69025
13895A681246j0080k45470R0285K91285n41151K67349k55822O4245k1292L0658
13885A351253j29852M84419o03602K41664J61796k1308k14702J1096K40010k64378
13875A256396J24699P9551j90962K94405n93767K20196K21433O7952k03222l48153
$$ plain form
13945 2206780 2261827 2091406 2190829 2211557 2353764 2139259 2404745 2086124 1886848 1940044
13935 1940044 2045412 2173052 2170502 2108296 1892691 1742055 1482086 2059297 1923587 1927066
13925 1927066 1878684 1832729 1515823 1842750 1777113 1587448 1694674 1612973 1980295 1582863
13915 1582863 1596931 1579538 1835944 1696591 1861182 1880127 1748168 1609948 1416746 1998299
13905 1998299 1539953 1595126 1859640 1480218 1622271 1448432 1606246 1524306 1312221 1681246
13895 1681246 1671166 1425696 1515981 1807266 1266115 1533464 1277642 1341887 1320595 1351253
13885 1351253 1221401 1705820 1102218 1343882 1505678 1484370 1269668 1280764 1520774 1256396
13875 1256396 1381095 1460646 1269684 1564089 970322 1190518 1411951 1479903 1276681 928528
13865I28528M34969M2529n77928K76149m2842K40113j9683R8215m06013L50357
13855A324394j82483J41302K18543m54821K65900r1002M8089L7930j03124q3602
13845A121126J16923j47511J24242n1746R1866k31560K96907l01228L89942o41921
13835G67040M14302k46110N3945n4374J4792K77262j85451j67965R0844k39479
13825G24806J09401L4835K17247J10546k74665K31283l34482K9678L3018q2925
13815G98742P6097K47719j68695N2641J57427k88106J83982l6463j42576K49300
13805A130068j17612l07431J66751J7077j99197J32011K48349P526P9181m36244
13795G20479J00460m3508J9055J81827j36317L69928m32585J76181l6320j28206
$$ plain form
13865 928528 1363497 1406026 828098 1104247 1061405 1301518 1281835 1380050 974037 1324394
13855 1324394 1141911 1283213 1501756 1046935 1312835 1221833 1269922 1307852 1204728 1121126
13845 1121126 1238049 1090538 1214780 1163034 1254900 1023340 1320247 1019019 1408961 767040
13835 767040 1181342 935232 989177 934803 949595 1226857 1041406 873441 964285 724806
13825 724806 834207 869042 1086289 1196835 922170 1153453 818971 848649 881667 798742
13815 798742 874839 1122558 953863 1006504 1163931 875825 1059807 1023344 880768 1130068
13805 1130068 1012456 705025 871776 888853 689656 821667 1070016 1077542 1156723 720479
13795 720479 820939 777431 796486 978313 841996 1211924 779339 955520 919200 790994
13785G90994p1600K55572j9257k54153L30522j42379D14393O43088J52156k23485
13775I86152J46439j02355m15176K38803j82766k7883K44958M7833l01643K28177
13765H62539L4915L2644l30235L40625L3012P7529l73649Q707n9194K61609l27720
13754E60782J11495J07259J51893m32940L38172K43655l05535m8756J14393J23913
13744I64331j48883j1681j23537J05204j97148K82892q0500r0965K9562K52938
13734I82213k46982j67941N3399j94174K79969n8275J64379J55897j41400L6992
13724H64077k19296p6220K54306j85557r9360N23184D49556N06384D16594J43668
13714E60262j16694N4875J74711j9975k64B13114M16094J67905L2980l7858l43873
$$ plain form
13785 790994 719394 974966 955709 701556 1032078 889699 414393 1057481 1209637 986152
13775 986152 1132591 1030236 615060 853863 671097 643214 888172 936005 634362 862539
13765 862539 897454 930098 599863 940488 973500 1051029 677380 686087 626893 888502 560782
13754 560782 672277 779536 931429 498489 836661 1080316 774781 726025 840418 964331
13744 964331 815448 803767 680230 785434 588286 871178 790678 699713 729275 982213
13734 982213 735231 567290 620689 426515 706484 648209 812588 968485 827085 864077
13724 864077 644781 568561 822867 637310 537950 1061134 449556 955940 416594 560262
13714 560262 443568 498443 673154 653179 652915 213114 629208 797113 830093 792235 448362
13703D48362L2754L12340j61841k60139L42291j82156Q4514j41109R3197A83789
13692D71343K56922k91887K63042l11060K1275M07809j27343J17194k8409j55116
13682F23770O7562k7120k0101j13806K34977j47714o8818J21743C04855M34088
13672G38943k17720M45363C65915K90106j17959O4138K70444D30100Q079N1709
13662D89888O036Q0511A70308J98801K38860J56541j64379k26092j61507M84395
13652F96927l8622j63102J9489N5482k3972L27081C32734J92656J47046k80919
13642C91517J44883j62637L59105k32946A96358N44933k81801j64751Q3346j0304
13632C67781J31668j59319J99162l1777J67535j83862j0354o4875L7129j10426
$$ plain form
13703 448362 481116 793456 631615 371476 713767 531611 616125 475016 568213 183789
13692 471343 728265 436378 699420 388360 409635 817444 690101 807295 778886 623770
13682 623770 691332 664212 644111 530305 765282 617568 548750 670493 304855 738943
13672 738943 521223 966586 365915 656021 538062 602200 872644 430100 438179 489888
13662 489888 495924 576435 170308 369109 607969 764510 600131 374039 212532 696927
13652 696927 658305 495203 514692 570174 546202 873283 332734 525390 672436 391517
13642 391517 536400 373763 732868 499922 196358 741291 459490 294739 378085 367781
13632 367781 499449 340130 539292 507515 675050 491188 480834 415959 453088 342662
13622C42662L96941l43210J0368A85442J49669J50437n1242B06233J88160j31567
13612B62826p7732L21570j29335J49260J2880J35440B81157M35457r2159Q0726
13602G05181A82412P7457K70328R0153j37494B06192K21048J86919K14578C20637
13591D86811A78395E6011L17327L24980A84743J95219J31763p8131j74555J50110
13581D09149R2374G2769N14025j98992a5994A27430P9405B609K94123K29377I3381
13569E06571e4822B90785N4820n6275m5622O4379j00968L77137J3503k28074J03478
13558D73163B8386L34321K47896k33170J71428k46638f4345A98051J16337J09140
13548D23528J62224j35774B12731J29811J64134q1158j23268q0001P238H1730
$$ plain form
13622 342662 739603 396393 406761 185442 335111 485548 434306 206233 394393 262826
13612 262826 185094 506664 377329 526589 539469 674909 281157 716614 624455 705181
13602 705181 182412 259869 530197 620350 482856 206192 427240 614159 828737 320637
13591 486811 178395 56011 373338 698318 184743 379962 511725 433594 259039 409149
13581 409149 501523 72769 586794 387802 -15994 127430 206835 2609 296732 526109 93381
13569 506571 -54822 290785 345605 289330 243708 308087 207119 584256 597759 369685 473163
13558 473163 28386 362707 610603 377433 548861 302223 -64345 198051 314388 423528
13548 423528 585752 449978 212731 342542 506676 425518 302250 222249 229487 81730
13537B58139J11413q1819o7946P2573K55489G3691K92307J03080j56304A08226
13526F60591F3850J5188N8495N4260J7844L38894k17916j13273J233K68909j74594
13515C12890J57969M1573j37684J29513A43429J65443j05281K27473j75043l1685
13505B24336L53807j82429A49572K43569H4866K83873j3920p9107n7079H0106
13494D32849k7565j53955m5498K43843L05329A98314J24752A35135K20141L32041
13484F87317n5086A16424L1020J55848Q6448n1660B9272P5543J85398n1574L39726
13473E78365k16267j75367K29353j22314n698J36777C3682L20778o3508E9646
13462D72174B8394K07361M33916j40223k12636o2075j2159p625J67944A78794
$$ plain form
13537 258139 369552 287733 219787 292360 547849 73691 365998 469078 312774 108226
13526 660591 63850 79038 137533 191793 209637 548531 330615 217342 218575 487484 312890
13515 312890 470859 512432 374748 504261 143429 308872 203591 431064 256021 224336
13505 224336 578143 395714 149572 393141 84866 368739 354819 275712 218633 80106
13494 432849 405284 251329 205831 449674 755003 198314 323066 135135 355276 687317
13484 687317 632231 116424 147444 303292 389740 338080 29272 104815 290213 238639 578365
13473 578365 362098 186731 416084 293770 288072 424849 33682 354460 290952 59646
13462 472174 28394 235755 669671 529448 316812 254737 242578 234953 402897 178794
13451B27835A9745a23549C09801j42842E3198M00906j49920Q2784A80922K02883
13441C83805a63518B54357L44521B9188K13983K3212J71876F3694K6646I448M30107
13430D39555B2138g8012C82845M3954K07582B29015J78794A80171Q4029A19311
13419E15447j97388a34348C08865q1075r6798J49064m1322E082K69325J69988
13409D44395k12645l8910H7392K07942K20306L8037I5009K42869r5116J0910j17700
13398A35972n7586L42283c6066C78869j60051A00877d1678A51275J60392c2326
13387A34985J64312a5756B80864I1231l5525K81785k890H1043J7355J46721K7324
13376B72443n5230H0780J84812e6550D87793B41017n397B2742M18470B12007J88023
$$ plain form
13451 227835 19745 -123549 309801 166959 53198 454104 304184 386968 180922 383805
13441 383805 -163518 254357 598878 29188 243171 266383 438259 63694 90340 9448 439555
13430 439555 22138 -78012 382845 426799 634381 229015 407809 180171 264200 119311
13419 515447 318059 -134348 308865 227790 130992 280056 238734 5082 274407 444395
13409 444395 231750 192840 87392 295334 515640 553677 95009 337878 242762 253672 135972
13398 135972 78386 420669 -36066 378869 218818 100877 -41678 151275 311667 -32326
13387 134985 299297 -15756 280864 91231 55706 337491 334601 81043 98398 245119 272443
13376 272443 217213 80780 265592 -56550 487793 241017 235620 22742 441212 212007 400030
13365D00030j19326K04991a52382C80759J10426A46653K52989E0039J48579j2241
13355A86377d9350A51259J99304A355L40477j42515Q7599J02497o5287l0316N7421
13344C51231G7413Q7616f2597R151D1844K36524G2762K45107l8913I9169M1977
13333A41146K42847J67892j96286j32672d5544C07062g9061B10314K46204q8423
13323C68095Q6068B14691l0146E5120J48317J54840O687m362A06144e518B91995
13311B67327l0320E9774K04876r4319c3751B01407K42083k07331N4616L4555Q1001
13300D06331A63103P4773p6564a16926C80306l498A55472d94B14351P164A09374
13288C65256k9585m2577I2460m3187J11324J12846B7240L13829j39800P5096m0837
$$ plain form
13365 400030 280704 485695 -152382 380759 491185 146653 399642 50039 198618 186377
13355 186377 -49350 151259 350563 1355 341832 199317 286916 389413 324126 293810 351231
13344 351231 77413 165029 -62597 -53446 41844 278368 72762 317869 278956 99169 141146
13333 141146 383993 551885 355599 222927 -45544 307062 -79061 210314 456518 368095
13323 368095 454163 214691 184545 55120 203437 358277 364964 360602 106144 -5518 291995
13311 267327 237007 59774 264650 170331 -33751 201407 443490 236159 290775 325330 406331
13300 406331 163103 237876 161312 -116926 380306 376808 155472 -494 214351 221515 109374
13288 365256 335671 293094 92460 49273 160597 273443 27240 341069 201269 276365 235528
13277B35528B810J89866q3835J1471K53190E6033J21715b57724A8612L38575D4372
13265a96979B03543l2297g4506A56698L029L5920e7556D25022b4936B02108E0930
13253B18835A3629J10719J37254a11087D4224J91954L09165F4898K2144K44421
13243C31463C9409K02266p6880G6914a5738B42400O593L0204A35443d8974B66524
13231E5826K48583j29214G8998Q5659L9640l151b22360h850B26697a0526D08488
13219F190d8877D56101B587K15692M3702K9397k0808A535L92595n8473q6849L5686
13207B84494R504A3275J89002l1262p3485L93070A70621b9257G0575J27421F5656
13195h4396e090B06235J89915l1118f9310B60729l5199a64208A7923J92730F677
$$ plain form
13277 235528 2810 192676 108841 120312 373502 56033 177748 -257724 18612 357187 44372
13265 -196979 203543 171246 -74506 156698 159727 195647 -57556 425022 -24936 202108 50930
13253 218835 13629 124348 261602 -111087 44224 236178 545343 64898 87042 331463
13243 331463 39409 241675 164795 76914 -15738 242400 248993 279197 135443 -48974 266524
13231 55826 304409 175195 78998 164657 204297 201146 -222360 -8850 226697 -10526 408488
13219 6190 -48877 456101 2587 218279 261981 291378 270570 1535 394130 335657 248808 284494
13207 284494 293998 13275 202277 171015 97530 490600 170621 -29257 70575 197996 65656
13195 -84396 -5090 206235 396150 365032 -69310 260729 225530 -164208 17923 210653 6677
13183D17071F9129Q5191L6686n682C9104a01905A73667B1061J66462L1210F0192
13171H2670J57634N3669J21933j61073m1064E517K13885M1544a85469B66541I7067
13159D11286A48845E9562h6079A41635J66469A569J80868d1536j13816A32441
13148i8733A34691a07879B3581K62335e4113e362j36746a8267C09644a65591B25296
13136A47884L56071A67178c31683a16591B1054b39088A80542H6616D0507d3921
13125D5289g9347L2612m5828r8541A46253D7875J63901F2640J6351N7188m0653
13114I5526a94060G9618K4506N7899o4533a8943B32675j15681c4826G001P0062
13103G7063L5158J45347b23621b1794A0894b18695b6787A7572b68101A71361F1109
$$ plain form
13183 417071 69129 154320 191006 185324 39104 -101905 173667 21061 187523 218733 60192
13171 82670 240304 293973 415906 254833 213769 5517 219402 260946 -185469 266541 97067
13159 411286 148845 59562 -86079 141635 308104 1569 182437 -41536 -155352 132441
13148 -98733 134691 -107879 23581 285916 -54113 -5362 -142108 -18267 309644 -165591 225296
13136 147884 503955 167178 -331683 -116591 21054 -239088 180542 86616 40507 -43921
13125 45289 -79347 -46735 -92563 -191104 146253 47875 211776 62640 78991 136179 95526
13114 95526 -194060 79618 104124 162023 97490 -18943 232675 116994 -34826 7001 77063
13103 77063 112221 257568 -223621 -21794 10894 -218695 -26787 17572 -268101 171361 61109
13091A87806g5306C04546r7574n3153B5080O586K7732M4417M5669B5057Q6150
13080A11207C5917h9064G6476f8268A0692a0292D0881R2723Q382K40259a4508
13068D0010J33565C9784M4408l4865c63970B0104N7175M5287J86382A52666c64750
13056B07798a20849A04389l2330L25010A79695a90061H1155l669f08A71325R654
13045A80979q3582a52832B6441L21759a2809A8182a68923b5753j20611G8335B7099
13033e336A22580A9971P5502a18887M3208N342D05109D1830J98418I6801b50791
13021I7658c7943D47887A34720K25686j04611K7114F1978O0255Q0841Q1284j08617
13010A75741J49070j11589i1451I948L89290j96856J77773b212D7983J16676d6884
$$ plain form
13091 187806 -75306 304546 206972 153819 25080 31666 59398 103815 149484 25057 111207
13080 111207 35917 -89064 76476 -68268 10692 -10292 40881 133604 141986 382245 -14508
13068 40010 173575 39784 84192 49327 -363970 20104 77279 122566 308948 152666 -364750
13056 207798 -120849 104389 72059 397069 179695 -190061 81155 77486 -608 171325 180979
13045 180979 97397 -152832 26441 348200 -12809 18182 -168923 -25753 -146364 78335 27099
13033 -5336 122580 19971 95473 -118887 -75679 -70337 405109 41830 240248 96801 -250791
13021 97658 -37943 447887 134720 360406 255795 282909 61978 122233 203074 284358 175741
13010 175741 324811 213222 -91451 9948 399238 202382 380155 -2212 47983 164659 -46884
12998B01644K28935C6277K37370c68895C8537L05777j10422O6984G2135A9106
12987I3705J21834C0421h1182j2174A32931Q2396a05762L7306A67023R3683m9465
12976B11241J1695e0007n7202B11426p9245e8873C1328b1132A38831f892C1354
12964f1223d750G2973J13902l5076m6604m6134J10609j6663l5869j6237K3635
12953A24536a61930b8698m70404a17079N1342A99737d1451j8960B73623J5140
12943B88763e1246j1161A55168b51963A305i8981b7097B28215O7552C1046a34372
12931G3877J11525p0890J0841N3548E9094J01100b00516c8409C3278K08923I1962
12919A59125a33727m6573D1984J37583p404m838K60333r4093b97357A1721J17430
$$ plain form
12998 201644 430579 36277 273647 -368895 38537 344314 233892 300876 72135 19106
12987 93705 215539 30421 -81182 -93356 132931 215327 -105762 -68456 167023 260706 211241
12976 211241 222936 -50007 -107209 211426 132181 -58873 31328 -21132 138831 -6892 31354
12964 -61223 -4750 72973 186875 151799 105195 59061 169670 153007 117138 100901 124536
12953 124536 -161930 -28698 -499102 -117079 -65737 199737 -41451 -60411 273623 288763
12943 288763 -51246 -62407 155168 -251963 1305 -98981 -27097 228215 295767 31046 -134372
12931 73877 185402 114512 125353 178901 59094 160194 -200516 -38409 33278 242201 91962
12919 159125 -133727 -180300 41984 179567 172163 167325 427658 333565 -297357 11721 129151
12908A29151l5930D3005e7709a9842A2720c0167A42203F7707c97931B72826l4277
12897B38549a44659c0920A68223O1863o5591l6756m6127M3264j2689a99552J4596
12886a84956K5563q1677B78799A38861J52708F8740c7281B2087J17455a60292
12875a9301I3380d1897B26766a44310j3310C36814i5775k60460i6820A81646q0101
12864A01545e6294H1713H872R1003a83906A55280J09746k8162D2189M8830J99303
12853B90322H2659C9469A4539K70940a02615E5520N1838P385O2994P0566b45964
12841b90739E4335b55960c8937k15067d7532q4574a1198B19374c05647A15709
12830A12178e3143B43534p4606C8382b4723n4878M70P399H6767a17876l5145J882
$$ plain form
12908 129151 93221 43005 -57709 -19842 12720 -30167 142203 67707 -397931 272826 238549
12897 238549 -144659 -30920 168223 230086 164495 127739 81612 124876 112187 -199552 -184956
12886 -184956 -159393 -241070 278799 138861 291569 68740 -37281 22087 139542 -160292
12875 -19301 93380 -41897 226766 -144310 -157620 336814 -95775 -356235 -96820 181646 101545
12864 101545 -56294 81713 8872 99875 -183906 155280 265026 236864 42189 91019 290322
12853 290322 82659 39469 14539 285479 -102615 55520 107358 114743 177737 248303 -245964
12841 -290739 54335 -255960 -38937 -254004 -47532 -132106 -11198 219374 -305647 115709
12830 112178 -53143 243534 168928 38382 -24723 -79601 -79131 -71732 86767 -117876 -153021 -151139
12818a51139B2355J2986i6466A18110f5546F3321l1556N9851H110J13241J34257
12807B55608I0722a98839M1649A85654J69341b75937C4348a39405F0043a58622
12796d6324q8039c0164j32019n6307b7460j26023A26388K5603a34328G8826N0779
12785A29605E5041R2272d5760D8743J4311b08213M6683l3514h0709A43549J11191
12774B54740h1536A67094a88155j01303n3939C49081E5635B0326J6081N6004J71337
12763B63748a08882B68776A04174h2890A01558i7022A37969o5956K85130n6769
12753C00374C3014J67215e4038C71550c4148F35311b28470r4802A66269e520A63578
12741a52773A34369a40631A66116a4769I35b00689m2132R0182d7977i311F9789
$$ plain form
12818 -151139 22355 35341 -96466 118110 -65546 63321 31765 91616 8110 121351 255608
12807 255608 90722 -198839 -157190 185654 354995 -275937 34348 -139405 60043 -158622
12796 -46324 -134363 -30164 -162183 -218490 -27460 -153483 126388 151991 -134328 78826 129605
12785 129605 55041 147313 -45760 48743 63054 -208213 -161530 -195044 -80709 143549 254740
12774 254740 -81536 167094 -188155 -289458 -343397 349081 55635 20326 36407 92411 263748
12763 263748 -108882 268776 104174 -82890 101558 -97022 137969 72013 357143 300374
12753 300374 33014 200229 -54038 371550 -34148 635311 -228470 -323272 166269 -5520 163578
12741 -152773 134369 -140631 166116 -14769 935 -200689 -242821 -152639 -47977 -9311 69789
12729B59672c21649a14489A71018A4342a50924A9697K27871I2132D1913P6808
12719A18721J23911J3425p7883A1468M97815H5525g8716C6616K89577E5395Q7825
12708A43220A7612L28108j60463G3804A0746c2939l1431C41740e1716j65327H3469
12696A1289K50473A22900P0821H9442R0984c0731C99491j81794a72163P1003E5747
12684c5204A45826a67417A85688a77469D0931J49659E8604J70172c8373A37316
12673a28116B18879J18687H4896J24751c1077I8980K66812H9362M0574R9067p9890
12662A49113a97390i0241C72599e0524j04828a3882B9601d49704C21428E9313
12651a23370c146j48499q924A54517b09574F7143b41364g1352E8687J45816a57058
$$ plain form
12729 259672 -321649 -114489 171018 14342 -150924 19697 247568 92132 41913 118721
12719 118721 242632 256057 178174 11468 509283 85525 -78716 36616 326193 55395 143220
12708 143220 17612 345720 185257 73804 10746 -32939 -64370 341740 -51716 -217043 83469
12696 11289 261762 122900 193721 89442 180426 -30731 399491 217697 -172163 -101160 55747
12684 -35204 145826 -167417 185688 -177469 40931 190590 58604 228776 -38373 137316
12673 -128116 218879 337566 84896 209647 -31077 98980 365792 89362 129936 229003 149113
12662 149113 -197390 -90241 372599 -50524 -155352 -13882 29601 -449704 321428 59313
12651 -123370 -3146 -151645 -160569 154517 -209574 67143 -241364 -71352 58687 204503 -157058
12639a99307b0885j82091C6324Q3072C0124L7931J93138j18431l8183D0645K40167
12628B80812c17920I8662J00271J84130a42965p463N2257c6776A67301c08039
12617a19454B28645A11612a8255H0016B1084J29025a22312C5491A0589L97423
12607D08012n6719p769A02093Q501O8274l8534a70378M3162A85466c9068G4776
12595a51526j79600J61265F1996a03906j39431A77939a36202d9341A90045M8348
12585B38393i3003e361C79117j75221N0693a40218H0559b0428A43523k5318c6013
12573B8083e9638A2572g6894j6841G1177J5576N5253M1448a95640C86939b25733
12561a00735C37985j47262c89857C00674c2656A66142J23093R3199A61938C750
$$ plain form
12639 -199307 -20885 -202976 36324 119396 30124 68055 261193 142762 104579 40645 280812
12628 280812 -317920 98662 198933 383063 -142965 -150428 -98171 -36776 167301 -308039
12617 -119454 228645 111612 -18255 80016 21084 150109 -122312 35491 10589 408012
12607 408012 351293 343524 102093 110594 178868 140334 -170378 -127216 185466 -39068 74776
12595 -151526 -331126 -169861 61996 -103906 -243337 177939 -136202 -49341 190045 238393
12585 238393 -93003 -5361 379117 203896 254589 -140218 80559 -20428 143523 118205 -36013
12573 28083 -59638 12572 -76894 -93735 71177 86753 142006 183454 -195640 386939 -225733
12561 -100735 337985 190723 -389857 300674 -32656 166142 289235 382434 161938 3750
12550c7986j25212F6838J20902p3987J08524j679a68896B23611B6727L5605a20907
12538a32845H5548c8313p6417C01598A7447O540M7571A0830K17951l4447b54880
12526a2039j81602I8807c84130B38560i043A96810J36032B2580J27575k0565n6010
12515G3580J54456a04662E1349B0261O6612K7272a43744C1258j5191a14175r277
12504a23452A14749A8662J60074F7980b504j05812B20581a60421H6396l9740a10297
12492b16734C61708C9620c1690q2859L3750A78793B4575L2647f2341e481A7366
12480C39176b17919a9168q2095I7262a04566A58591p7744a90094h8824B3b03793
12468C7593c6538n981k02872m589K4699A79969q2318P4834q3706a9694r2225H6803
$$ plain form
12550 -37986 -163198 66838 187740 113753 222277 220598 -168896 223611 26727 62332 -120907
12538 -132845 85548 -38313 -114730 301598 17447 23987 71558 10830 228781 194334 -254880
12526 -12039 -193641 98807 -384130 238560 -9043 196810 332842 22580 150155 129590 73580
12515 73580 228036 -104662 51349 20261 86873 114145 -143744 31258 16067 -114175 -123452
12504 -123452 114749 18662 178736 67980 -2504 -108316 220581 -160421 86396 46656 -110297
12492 -216734 361708 39620 -31690 -114549 -80799 178793 24575 57222 -62341 -5481 17366
12480 339176 -217919 -19168 -101263 97262 -104566 158591 80847 -190094 -88824 23 -203793
12468 37593 -36538 -42519 -245391 -249980 -225281 179969 97651 172485 88779 -19694 -111919 86803
12455A20119C8464c6512j59216A64342b8009A03436D9205K45160a43024r5H356
12443B79777B0205K99614b1167k66727d0564B70859j25239g3587j9746A5746c01480
12431E6701A3513a0136A89595b95237J25363A21186c02227J38205b8984H9229
12420A76273b35613B93250F4124N6165F719a04729j35082A5064a08180a3274j74338
12409a87612O7882k76644J84051A29562R9585a7302m7443B5115J1659j893J74009
12398B08890i8329o2506f0078k76733A34312b1640e442r5078a1081A27715b44298
12386b60493E3594J21692o9679a1277j59138L9245I940h3919A50076J00222a19079
12374B49361I6687a02892A80781m5716A3166J19808K8828a16051k0729b7313A97205
$$ plain form
12455 120119 38464 -36512 -195728 164342 -28009 103436 49205 294365 -143024 -143119 8356
12443 279777 20205 319819 -21167 -287894 -40564 270859 145620 -73587 -93333 15746 -301480
12431 56701 13513 -10136 189595 -295237 -169874 121186 -302227 -164022 -28984 89229
12420 176273 -235613 293250 64124 120289 6719 -104729 -239811 15064 -108180 -13274 -187612
12409 -187612 -119730 -396374 -212323 129562 229147 -17302 -64745 25115 36774 34881 208890
12398 208890 -98329 -160835 -60078 -336811 134312 -21640 -5442 -100520 -11081 127715 -244298
12386 -260493 53594 175286 105607 -11277 -170415 -131170 9940 -83919 150076 250298 -119079
12374 249361 96687 -102892 180781 135065 13166 132974 161802 -116051 -136780 -27313 197205
12362A73224K8973g3506B86473M881r4977C4326J19516o6467K25681D0883K85088
12351C25971d3296k26173c3834D459P7169J51388F6835f6149j30025B07376p5292
12340A32084e4059k38746i8226A74478F0759K18482E2599A3494b99112a180B43105
12328c46001A68842J27192c887j66084C13259K15567A63827g8359B10530J1448
12318B21978D7603h9784H7077J01223J37252a44709j02764d5800B23607E6393
12307c82784D22245j23462G0512e3086l8191B17415r1625G062Q3979M0063J99593
12296C30697A35590b08944h6069B69946j23924n9421K05742A45643a06364c1770
12285C06563a9382B64162a35032A84084F8793J895J03576a07136c255D24482I1965
$$ plain form
12362 173224 202197 -73506 286473 291354 196377 34326 153842 87375 313056 40883 325971
12351 325971 -43296 -269469 -33834 4459 81628 233016 66835 -66149 -196174 207376 132084
12340 132084 -54059 -292805 -98226 174478 60759 279241 52599 13494 -299112 -1180 243105
12328 -346001 168842 296034 -3887 -169971 313259 528826 163827 -78359 210530 221978
12318 221978 47603 -89784 87077 188300 325552 -144709 -247473 -45800 223607 56393
12307 -382784 422245 298783 70512 -53086 -91277 217415 125790 7062 91041 131104 330697
12296 330697 135590 -208944 -86069 269946 146022 86601 292343 145643 -106364 -31770
12285 306563 -19382 264162 -135032 184084 68793 70688 174264 -107136 -3255 424482 91965
12273C89718F2099k928b3289B98430e7528C91935n4768j9852A17670M69809n490
12262E81989A13295O5013C5746N04661a3313C01805b61663C74975A79885B6999
12251e0268A26313P755r995a52596D03813j53546e092C0970f4011H8807a68762
12239A50735J94432j40056q8138J48145j15580B0186R2010k139a54920D5495L11392
12228C56887j15116a87238J4255F4901c23847C81603c72361a71050J1541q164
12218a67673B69781m1703h2620a157A11491J613C5548Q5518K4843K6036E4765
12206C90825H6122L44026j79316f7095D89925e571C32002j32637J70689p714a05556
12194F6577J64645b34776B80402j36116E5903J24152l6932N3608g019o2007D36039
$$ plain form
12273 389718 62099 59171 -23289 298430 -57528 391935 337167 317315 117670 587479 581989
12262 581989 113295 178308 35746 540407 -13313 301805 -261663 374975 179885 26999
12251 -50268 126313 134068 124073 -152596 403813 250267 -5092 30970 -64011 88807 -168762
12239 150735 345167 205111 116973 265118 149538 20186 112196 110057 -154920 45495 356887
12228 356887 241771 -187238 -172983 64901 -323847 381603 -372361 -171050 -159509 -167673
12218 -167673 269781 228078 -82620 -1157 111491 113104 35548 121066 145909 171945 54765
12206 390825 86122 430148 250832 -67095 489925 -5571 332002 199365 370054 362340 -105556
12194 66577 231222 -234776 280402 144286 55903 180055 143123 196731 -7019 -69026 436039
12182b2238A85175a00722n5309J6297C51577G5333R1986R0372c46188f6522A95243
12170b08570A12742L4596A7069N9757A3534K98683H284J1020J99986j05374k4158
12159H9758K07723P6708g6213C88803j48668L3291j22276B9441c10682A53686
12148B66363a58359B24684a08564D08190a96699A50044B8305P1903r799K35779
12138C26188C9831J53191J79044A04188a03425A27612L34581b53877f0842B37991
12127F16Q6712e391j03498A63330a11920A92635H0200B9056L0572K23535b6740
12115f7644A78958H3249J67211m1191O4652G1270Q6627a89370e6641C4791h1879
12103E75935B69506j16201n9478A9020J67515B6940j0337J21988a14222C58744
$$ plain form
12182 -22238 185175 -100722 -156031 -139734 351577 75333 167319 257691 -346188 -66522 195243
12170 -208570 112742 147338 17069 76826 13534 312217 8284 19304 219290 113916 89758
12159 89758 297481 374189 -76213 388803 240135 273426 151150 29441 -310682 153686
12148 266363 -158359 224684 -108564 408190 -196699 150044 28305 100208 90409 326188
12138 326188 39831 193022 372066 104188 -103425 127612 462193 -253877 -60842 237991
12127 616 87328 -5391 -108889 163330 -111920 192635 80200 29056 59628 283163 -26740
12115 -67644 178958 83249 250460 209269 273921 71270 157897 -189370 -56641 34791 -81879
12103 575935 269506 153305 93827 19020 186535 26940 16603 138591 -114222 358744
12092a33755M9064A01704K81086j39875h6998o823b6614n5666A67006c45457D0744
12080d38457A3261E016b2919j28992N3517j02187D88087h8431C6085a81451A81439
12068b7831A54330K49925A30059D9004J47058o739a4422l2579B40830k1359o0337
12057A59134B2837c36351A73787A1097a42055C24537A12488B451b23271B35962
12046H9324P3410a20614B9440b54700D8346f8418j53478B70326o846b56455j21139
12035c77594E7813J44222G2696K0464a48798L8837A40283d40450A91644a02627
12024h0243G6483J14506i797A15854J54282a22004A74133n1521a65115b0954I872
12012B61788D9872a33326j00422B11387J88795i926j53380j01764B18629p2584
$$ plain form
12092 -133755 -84691 101704 382790 242915 -86998 -93821 -26614 -82280 167006 -345457 40744
12080 -438457 13261 5016 -22919 -151911 -98394 -200581 488087 -88431 36085 -181451 181439
12068 -27831 154330 404255 130059 49004 196062 189323 -14422 -47001 240830 219471 159134
12057 159134 22837 -336351 173787 11097 -142055 324537 112488 2451 -223271 235962
12046 89324 162734 -120614 29440 -254700 48346 -68418 -221896 270326 263480 -256455 -377594
12035 -377594 57813 202035 72696 93160 -148798 -109961 140283 -440450 191644 -102627
12024 -80243 76483 190989 -9797 115854 270136 -122004 174133 122612 -165115 -20954 9872
12012 261788 49872 -133326 -233748 211387 400182 -9926 -163306 -265070 218629 146045
12002A46045a56014o221B67949r110o8757n8463L195P2715R9818G4684b18507
11990G858a69419f9146A88863B3022O0528d9642E8856a46083r206A47489c18354
11978A91139e2124H9654b25481B89410b4014E9841R8124E64O6790a66884P7610
11967h9274A63b62814h0250d815C12878a43446A83046a13801N4016A44816A8933
11955a40768A9463n428i7585j03870D19265a7627l9042A73447o8654R8216F170
11943C2521b14363P1915I8783c8644k33951A15142C950b33637e122j51005P0541
11932h5586A84705a65371H4334e1335d369r4252j93252b1443n7550H7488n108
11921H2380J04819b45493a4203B4803J0861b48823C96110G5994C4861L4895a78550
$$ plain form
12002 146045 -156014 -162235 267949 258839 190082 131619 134814 207529 307347 74684 -218507
11990 7858 -169419 -69146 188863 23022 83550 -49642 58856 -146083 -155289 147489 -318354
11978 191139 -52124 89654 -225481 289410 -24014 59841 157965 564 67354 -166884 -89274
11967 -89274 163 -262814 -80250 -4815 312878 -143446 183046 -113801 -59785 144816 18933
11955 -140768 19463 14035 -97585 -201455 419265 -17627 -56669 173447 104793 203009 6170
11943 32521 -214363 -142448 98783 -38644 -272595 115142 3950 -233637 -5122 -156127 -85586
11932 -85586 184705 -165371 84334 -51335 -4369 -98621 -291873 -21443 -78993 87488 82380
11921 82380 187199 -245493 -14203 24803 35664 -248823 396110 75994 34861 69756 -178550
11909D2522K07584b18756A28071a04817A09636c5438l85343I1209e469A64716
11898I1446J8835C4826J19289A5161J00051h8445A47539O8647a61690A04737O6824
11887A71561a17479K1788A26405a1916k40049L7437A35245a11822B0050a5344
11876E616R1980K38609b01652K670D9890K58585d25086a83568k035m7044R2570
11865a40077G5039g619p6458C54860b54781A48366j1779h1614j27901j82027a9853
11853E0284a23602b5154j48755q9152A72995f3872j52764h3229B8192a40210B75826
11841g7127j23693A20591O4013F0524b31506J02438A90718g1332A60793d89209
11830a6836r4259a9111F9318j1942a30223d4762k80866A51336G0729a67447l04140
$$ plain form
11909 42522 250106 -218756 128071 -104817 109636 -35438 -420781 91209 -5469 164716
11898 91446 110281 34826 154115 15161 115212 -88445 147539 216186 -161690 104737 171561
11887 171561 -117479 -95691 126405 -11916 -251965 -214528 135245 -111822 20050 -15344
11876 5616 97596 336205 -201652 -198982 49890 308475 -425086 -183568 -185603 -232647 -140077
11865 -140077 75039 -7619 -84077 354860 -254781 148366 136587 -81614 -209515 -391542 -19853
11853 50284 -123602 -25154 -173909 -263061 172995 -63872 -216636 -83229 28192 -140210 275826
11841 -77127 -200820 120591 184604 60524 -231506 -129068 190718 -71332 160793 -489209
11830 -16836 -111095 -19111 69318 57376 -130223 -44762 -325628 151336 70729 -167447 -471587
11819d71587A39485o8049e8567B21559a94049N0730H4424b1563k60506E881b37179
11807H5603d5588A28677D8267M8673j036d29376A6100L31782f7701b4832b90j07248
11795a07538C2098a11630B45044c38377a36999o4031B28842a02126j30993a080
11784a48319P1073m952G9547k3048K91602j73327K2845i0427K8660a7206k09765
11773b26971a8718k32946B23246P5781b11732B14541D2112N6098J44979h5576
11762A19574a67821p3893D0461C974c02631h4143r2464l6536A14335C6739K27706
11751B64445d2817B4387a05791l4098I7487J22566b06964B91283e8900A26562
11740A59752J69978c58571B16245O41f7821j22889f45G1314O6491k0797f4319
$$ plain form
11819 -471587 139485 71436 -58567 221559 -194049 -143319 84424 -21563 -282069 5881 -237179
11807 85603 -45588 128677 48267 96940 95904 -429376 16100 347882 -67701 -24832 -290 -107538
11795 -107538 32098 -111630 245044 -338377 -136999 -201030 228842 -102126 -233119 -1080
11784 -148319 -77246 -82198 79547 56499 348101 174774 197619 -90427 -61767 -17206 -226971
11773 -226971 -18718 -251664 223246 299027 -211732 214541 42112 98210 243189 -85576
11762 119574 -167821 -241714 40461 3974 -302631 -84143 -176607 -213143 114335 36739 264445
11751 264445 -42817 24387 -105791 -139889 97487 220053 -206964 291283 -58900 126562
11740 159752 329730 -358571 216245 216886 -67821 -190710 -645 71314 137805 117008 -64319
11728A37112a17695N4722c413k14682j3223B7642e8072K8284C01268a10427r0483
11717b00910Q4646b8360A63622k5656F704K95415h0994F4298B2576J5116J15751
11706A53443b47993I0443a87640C7005J59687j6252K04128e5524A18499P6977
11696A95476o2595P4563i5957J1860j58016L8298q2519A62327J67967a28810f3962
11684A50261D1779f3359k51307I7324J92345p6557q9093d7263j38791B55181F0706
11672b92516c5724A78588j4867m061g9534A30609b90505B86503j43068a7606j48852
11661a66458B29001A11896d377j35901C8336K48952b01428A87723n0088j7180
11651A20455L41480j76288n0006p3442b27316H7989k3850h2317A52125J61215
$$ plain form
11728 137112 -117695 -62973 -3413 -218095 -231318 27642 -58072 -29788 301268 -110427 -200910
11717 -200910 -116264 -28360 163622 137966 6704 302119 -80994 64298 22576 37692 153443
11706 153443 -247993 90443 -187640 37005 196692 180440 384568 -55524 118499 195476
11696 195476 132881 207444 -95957 -84097 -242113 -203815 -286334 162327 330294 -128810 -63962
11684 150261 41779 -63359 -314666 97324 289669 213112 124019 -47263 -186054 255181 60706
11672 -292516 -35724 178588 163721 159660 -79534 130609 -290505 286503 143435 -17606 -166458
11661 -166458 229001 111896 -4377 -140278 38336 287288 -201428 187723 137635 120455
11651 120455 461935 285647 235641 162199 -227316 87989 64139 -82317 152125 313340
11641C13340J27371d8533m44343A96250H6844a48554A31936L0229J21145a13727
11630a73158P709P2733k51546J0191I7822a50198H0623Q1255K26382A89920b52572
11618A69120m9473P2338b71300E8273L5727e3590A05450J2948J2412D8187d0859
11606a65544l4434c0557B60575e5706B62481j24951h407k4450I3156a04194o5278
11595a69472J3331j05485B8961a90835D0470a15312J1856A93903H3525a16986
11584A96220m5575h436H4044a67766E1061J18335l6653F1745K97794g3513o9708
11573a43221L0746m122E0094k540K45964K570b7110C43891j41576e9593K4082
11562c5511A29082e3968B53172a14062A45557J06059d1855B60546a16033C30271
$$ plain form
11641 313340 440711 -48533 -492876 196250 86844 -148554 131936 162165 283310 -113727
11630 -173158 -165449 -92716 -344262 -334071 97822 -150198 80623 161878 388260 189920 -252572
11618 169120 119647 191985 -271300 58273 94000 -53590 105450 118398 130810 48187 -40859
11606 -165544 -199978 -30557 260575 -55706 262481 137530 -8407 -32857 93156 -104194 -169472
11595 -169472 -156141 -261626 28961 -190835 40470 -115312 -103456 193903 83525 -116986
11584 196220 150645 -8436 84044 -167766 51061 169396 132743 61745 359539 -73513 -143221
11573 -143221 -112475 -116597 50094 47554 293518 296088 -27110 343891 202315 -59593 -35511
11562 -35511 129082 -53968 253172 -114062 145557 251616 -41855 260546 -116033 330271
11551A33218C2345J6010L8978a342j85358A44634h627B34943q3080F2997f9197
11539A3283J64085J39480d11012B54486j23884C1062K4368K05026C6947Q5259
11529A22206f3702B42784c14936e8651j83814A83263a14454f033F9436a20577
11518b9058F5931F979a37800B22231F3213J67413P004m5358r1290R1284h1021
11506B04998g9344I0431N6423C3391a06458C71878e1698B18246q9674J63350a36876
11494I9908K06262a09821F4090M4275J64854c2676A98327f917G2410J3936k563
11483H3783K55870A18540K94874c09047J43727c2735l01709A32024a53716C5525
11472A61881K40372B2041a66472F430J6732L41942C7475I753J08086J92857a72034
$$ plain form
11551 133218 32345 48355 87333 -1342 -186700 144634 -8627 234943 151863 62997 -69197
11539 13283 177368 316848 -411012 254486 130602 31062 55430 260456 36947 122206
11529 122206 -63702 242784 -314936 -58651 -242465 183263 -114454 -6033 69436 -120577
11518 -29058 65931 6979 -137800 222231 63213 230626 237630 192272 100982 192266 -81021
11506 204998 -79344 90431 146854 33391 -106458 371878 -51698 218246 128572 291922 -136876
11494 99908 306170 -109821 64090 108365 273219 -32676 198327 -6917 72410 86346 83783
11483 83783 339653 118540 413414 -309047 -165320 -32735 -334444 132024 -153716 35525
11472 161881 402253 22041 -166472 6430 23162 365104 37475 9753 117839 310696 -172034
11460C60965D3146h9698G0657J9683d6218B51721I2951J34635a0676A80128k9135
11449A50993a77680B45553i1475o3017j33958A31212O820J3309K4433K3205k2425
11438A76554a47425A5813f3839B15780B6397a39003D89666j54795d4942B7604
11427c6873A78997J23632A8590N3199c25873J10831A71194K3061a6157a807F1014
11415C68672e1769E021b49846J05743A55010C667L0902f1171g310k6861j69016
11404b03187A50108I693i4510l0744E7229b3433G5166J14309c73110A13814a16042
11392b13428A0946J4478b92031D9523c05278A08376A9914P8454K2214c33762a59982
11380C69380i5021A99464i3685M3411m8229M807M6420A84633i85A91121a7122
$$ plain form
11460 360965 43146 -89698 70657 90340 -46218 251721 92951 227586 -10676 180128 150993
11449 150993 -177680 245553 -91475 -154492 -288450 131212 138032 151341 175774 198979 176554
11438 176554 -147425 15813 -63839 215780 26397 -139003 489666 334871 -44942 27604
11427 -36873 178997 302629 18590 71789 -325873 -215042 171194 194255 -16157 -1807 61014
11415 368672 -51769 5021 -249846 -144103 155010 3667 34569 -61171 -7310 -34171 -203187
11404 -203187 150108 9693 -94510 -125254 57229 -23433 75166 189475 -373110 113814 -116042
11392 -213428 10946 25424 -292031 49523 -305278 108376 19914 98368 120582 -333762 -159982
11380 369380 -95021 199464 -93685 -50274 -98503 -93696 -47276 184633 -985 191121 -17122
11368f7791B1638a20491G8329l4538a88429c1918A1315g2739k5477k4557N2677
11357g0096j63304B2267a42484B24339A289a31033a1244o1037j7566p3047M8904
11346a13990C8765J60389a88620j39374a54345C56445a92306j37943G467d0616
11335a72343A9404b83346J16486G4885N4277n5297B6243J12891a00607B4656b883
11323C3846J0345J23389h8464j588l29275J90157b0846l32959A18552g9233j37364
11312b16597A92074l3696c8213A87158J11107j31055F6622h0286G7322j5076J89742
11301B51988a91968D9488a08626j4205L7317j48C2208K32033a66554d6582k50154
11290b96736a5439j80308i038o4512A68802b06117f4449I0657j1801d2014k44829
$$ plain form
11368 -67791 21638 -120491 78329 43791 -188429 -31918 11315 -72739 -98216 -122773 -70096
11357 -70096 -233400 22267 -142484 224339 1289 -131033 -11244 -72281 -89847 -162894 -113990
11346 -113990 38765 199154 -188620 -327994 -154345 356445 -192306 -330249 7467 -40616
11335 -172343 19404 -283346 -166860 74885 129162 73865 26243 139134 -100607 24656 -2883
11323 33846 44191 167580 -88464 -90052 -419327 -229170 -20846 -353805 118552 -79233 -216597
11312 -216597 192074 158378 -38213 187158 298265 167210 66622 -80286 77322 62246 251988
11301 251988 -191968 49488 -108626 -122831 -85514 -85662 32208 264241 -166554 -46582 -296736
11290 -296736 -15439 -195747 -9038 -73550 168802 -206117 -64449 90657 78856 -42014 -286843
11279b86843g6905k2613b39j30762j9453j68016C8613K70214c08561A95511C469
11267B54760A10584b30322g1745I9076e5627m1645p8534A59775i4610A34080b95327
11255f046m0032m2936A5492D035J98361G0554h2232B06212c8147k22231g5065
11243a34661e9443B7517O6463a91789B4926a4372m3297j8700A94892a36901B73634
11231G2062c65239J72697j0363A75535E6471N4610a93062e9707F8949J59033D9634
11219e83516B02596n4022a68898K9735e2404r883A78797H6805O9328b76159f8504
11207f6193C59557A11943a40430G1905l853A0163a59280k38670g9698m2275r2100
11196b14073R4028d9172k48334J28595k1953j7801D58419C5901J6383e03401g6564
$$ plain form
11279 -286843 -76905 -99518 -239 -131001 -150454 -318470 38613 308827 -308561 195511 3469
11267 254760 110584 -230322 -71745 99076 -55627 -97272 -175806 159775 -94610 134080 -295327
11255 -6046 -46078 -89014 15492 4035 202396 70554 -82232 206212 -38147 -260378 -75065
11243 -134661 -59443 27517 93980 -191789 24926 -14372 -57669 -76369 194892 -136901 273634
11231 72062 -365239 -192542 -202905 175535 56471 111081 -193062 -59707 68949 227982 49634
11219 -583516 202596 148574 -168898 -139163 -52404 -62287 178797 86805 156133 -276159 -68504
11207 -66193 359557 111943 -140430 71905 68052 10163 -159280 -397950 -79698 -121973 -214073
11196 -214073 -120045 -49172 -297506 -168911 -190864 -208665 458419 35901 52284 -503401 -76564
11184H5453c5498k9259k40902a45728B31576b18968N0373C280M1648a39345k26821
11173c66166A84112a00397J7405j65111M7446A20983n9860a88958Q1448F9658
11162e20k57587N2704B9023a81740C0409a24971j18385a176m18378a967p2762
11151g4729j3363j53284b5840j8254r6827A35650e9430j99760l8260a34665N9172
11140g5493A54555f4450F3671a08745M3457K7631k4303J4175B11042i8522E35040
11128a38660j2328E0856K01176i8776j77085B31006b11580g0541a4695A42330
11117A32403b1669B79381d06467A55115l6936a26403F3736f8526A36593K7056
11107A63649A989J37604k4184J33850K009d8505D06196q7243A26114b49970A9538
$$ plain form
11184 85453 -35498 -64757 -305659 -145728 231576 -218968 -168595 3280 44928 -139345 -366166
11173 -366166 184112 -100397 -82992 -248103 -200657 120983 61123 -188958 -107510 69658
11162 -520 -258107 -205403 29023 -181740 30409 -124971 -243356 -1176 -419554 -1967 -74729
11151 -74729 -88092 -241376 -25840 -44094 -140921 135650 -59430 -259190 -297450 -134665 -75493
11140 -75493 154555 -64450 63671 -108745 -65288 -37657 -61960 -47785 211042 -98522 535040
11128 -138660 -150988 50856 252032 -98776 -275861 231006 -211580 -70541 -14695 142330
11117 132403 -21669 279381 -406467 155115 118179 -126403 63736 -68526 136593 163649
11107 163649 1989 139593 115409 249259 251268 -48505 406196 318953 126114 -249970 19538
11095G6830K21M1644R9000j3319a98937b871D9617L6621a38383a536B78381F7993
11082c13524E5122O5171D1344M2629L05633A1501J48222c00C46972j03667a6418
11070C31226j56239J36292A09393e2122B66227L06465I1513Q796a7533A03740
11059D59543A93264L6758p4369N499g7941G0294P1996c8314D32190k7110j08655
11048B96425M9282A49933j5978K81416m2739L24675l3830C12708K74937B51409
11037D27136K63369l7961Q8620A81897L20531n9204j36756M67424C24951J88150
11027E13101l5877J91295B44409M54250l6543j95023j46180K86283p1529Q3373
11017F19040C05210o3661M61544l26264K7746L48055k59416K78077O923k61209
$$ plain form
11095 76830 77051 118695 217695 204376 -198937 -2871 49617 86238 -138383 -1536 278381 67993
11082 -313524 55122 120293 41344 83973 389606 11501 159723 -300 346972 243305 -16418
11070 331226 174987 311279 109393 -52122 266227 572692 91513 100309 -17533 103740
11059 459543 193264 230022 155653 161152 -77941 70294 142290 -38314 432190 405080 296425
11048 296425 345707 149933 133955 415371 372632 697307 663477 312708 587645 251409
11037 427136 690505 652544 741164 181897 502428 443224 306468 773892 324951 513101
11027 513101 477224 668519 244409 698659 662116 467093 320913 607196 535667 619040
11017 619040 305210 241549 703093 376829 404575 752630 493214 771291 778214 517005
11007E17005j3876p0957K72009j97544L82327C29594K78892R224B43910L51966
10997E95876k24918J65970j73951k2946j1935k6797O1398K42950M41786l26061
10987G21372A97144K22716o1624j03098L65347J84475p982l81295K21340j94272
10977D42751P3067j01147K40954L567j46867J32507p5209M2161O7925k79896K84611
10966F84424J8411J15751l5613j62372K40943J9308R2703J04660L57946k1041
10956A415120O97603l49563K45403j83341J80239k01785p8918N6683n89175L08080
10946A500346J93587n34837K04857k08268K19119P7933M9303k72178L86129m43260
10936A172731L9602J34943k42014k90492j87219N7793j41111A47403L61904j20011
$$ plain form
11007 517005 503129 432172 704181 506637 888964 329594 608486 617710 243910 595876
10997 595876 370958 536928 362977 340031 328096 301299 362697 605647 1047433 721372
10987 721372 197144 419860 358236 255138 620485 804960 796978 415683 637023 442751
10977 442751 515818 414671 655625 659192 512325 644832 569623 611784 679709 399813 684424
10966 684424 702835 818586 782973 620601 861544 880852 973555 1078215 1436161 1415120
10956 1415120 2112723 1763160 2008563 1825222 2005461 1803676 1724758 1781441 1192266 1500346
10946 1500346 1693933 1159096 1363953 1155685 1374804 1452737 1502040 1229862 1615991 1172731
10936 1172731 1212333 1347276 1105262 814770 627551 685344 544233 147403 509307 389296
10926C89296j92928J42708C4878J93885p8484J48774A02357e1915B66457a35291
10915B5560L3575d6201j9208E9862a66354f4382r5045D4803f8844B54194o9805
10904A84389a42216C11657b53282A44554h0071j66035J09071k9250G1695A8280
10893H158e8608G5316J11900a55576G3121g7825j03007Q1736p3031q2901F9102
10881a05978L8058j67543R189J03908m8744M8275I0350h912j47632i933B7185
10869B28443a41328B86435k7652A23087L61140A1430K13398c8200B61626F4988
10858g9633o7000e8340A25748a25128J2465j97795E3758b20779Q1368B47114H2512
10846A34851o4237M1090a19528N4464n1159A40554a45389j75969E7176b79222
$$ plain form
10926 389296 196368 339076 34878 228763 150279 299053 102357 -51915 266457 -135291
10915 25560 59135 -46201 -65409 59862 -166354 -64382 -159427 44803 -68844 254194 184389
10904 184389 -142216 311657 -253282 144554 -80071 -246106 -137035 -166285 71695 18280
10893 8158 -58608 75316 187216 -155576 73121 -77825 -180832 -99096 -172127 -255028 69102
10881 -105978 -67920 -235463 -226274 -122366 -171110 -122835 90350 -8912 -156544 -9933 27185
10869 228443 -141328 286435 258783 123087 484227 11430 224828 -38200 261626 64988
10858 -79633 -146633 -58340 125748 -125128 -112663 -310458 53758 -220779 -139411 247114 82512
10846 134851 70614 111704 -119528 -65064 -116223 140554 -145389 -321358 57176 -279222
10835b47111A20955e8947B33708C6476a94576O7251I9124D737c23823E1613M8349
10824I9962j1879a28007H9092L2246J34981B6978e9484C0967c4143G0763b7852
10812a98508A60457M3262q8206K07150a42002B59857j11600i1086A27649e5064
10801a25881B08134a77489D4590a38996F4917e2762A10915b56818J04146O3852
10791h8820C40675a49641j16591a18275l42066E935b67038L7498I5025J4800M7610
10780A57435c20675a10830p038O028A77854a74793Q0410a8744j59848l2243g2368
10768I6773a36412C7333A0696b96268J39400l3627m4692Q0095d2826n7461c5218
10756b001q0919j2849B14754l2880k7518b70657B9119M4080d7328j30665g4158
$$ plain form
10835 -247111 120955 -58947 233708 36476 -194576 -127325 99124 4737 -323823 51613 99962
10824 99962 88083 -128007 89092 121338 256319 26978 -59484 30967 -34143 70763 -27852
10812 -198508 160457 203719 115513 322663 -142002 259857 148257 -91086 127649 -55064
10801 -125881 208134 -177489 44590 -138996 64917 -52762 110915 -256818 -152672 -88820
10791 -88820 340675 -149641 -266232 -118275 -460341 5935 -267038 -229540 95025 109825 157435
10780 157435 -320675 -110830 -117868 -111840 177854 -174793 -94383 -18744 -178592 -210835 -72368
10768 96773 -136412 37333 10696 -296268 -156868 -190495 -235187 -155092 -42826 -100287 -35218
10756 -2001 -82920 -95769 214754 181874 154356 -270657 29119 73199 -47328 -177993 -74158
10744b5671A67233i46j03518B88083G4330f1493G5253c2574b717j08023K0695
10733i0045n1867J7367k17556E2255P4085b35723c2614q8347E5857L0285m1010
10722D5132b26161A93659h9401n9406N4223k60815B4835K5735L1791J89913b1910
10710a33037J6903j57180A27932a26346p4117E5387b090k90965B86863B5698a55956
10698b9231k40811A71165C1933b55490D1558a07897r9345o0424J10390A8922a01464
10686a48175C8057K15540c48j54648B08329K2269a77066A40275b63383M687A08744
10674A08859h9855B8172J46122g5026b0395m33627G3403J51262J26400c14694
10663c56742R4016J16102G3391b92605A35966a08686j77582O4674A26801b52178
$$ plain form
10744 -25671 167233 -946 -104464 288083 74330 -61493 75253 -32574 -2717 -110740 -90045
10733 -90045 -141912 -124545 -342101 52255 126340 -235723 -32614 -120961 55857 86142 45132
10722 45132 -226161 193659 -89401 -148807 -94584 -355399 24835 50570 82361 272274 -21910
10710 -133037 -116134 -273314 127932 -126346 -200463 55387 -2090 -293055 286863 25698 -155956
10698 -29231 -270042 171165 31933 -255490 41558 -107897 -207242 -267666 -157276 18922 -101464
10686 -148175 38057 253597 -348 -154996 208329 230598 -177066 140275 -263383 -258696 108744
10674 108859 -89855 28172 174294 -75026 -20395 -454022 73403 224665 351065 -314694
10663 -356742 -262726 -146624 73391 -292605 135966 -108686 -286268 -221594 126801 -252178
10652a28211k05608A11929c0195D51679a34255N4757j76981q0027I5814h7140
10641a77149j00012A99992k5141a52790F275a88901n8535B2912C110a32114O2747
10630f9367J7713A17631C011c2114r7436b8361p0606K5316j20504A2602b21826
10618B29404G1850B1192J53039B3862j1366f1047A37939b24803e5413O080l01844
10607c51177g3638n3150D0987j8048g3882r4216r9389L0599o8552a22255A94296
10595b52183J07129C3000b79270A93179d03118B05518a2229D7414a23854B90793
10584a01793A5733J5999d39874J35285j45765F3496h0602A3128a9238j31847f6097
10572B44811D8179J52731n6212L27381H7877B6579b82555b0122I8180B1716J89631
$$ plain form
10652 -128211 -333819 111929 -30195 451679 -134255 -79498 -256479 -336506 95814 -87140
10641 -177149 -277161 199992 174851 -152790 6275 -188901 -247436 22912 3110 -132114 -69367
10630 -69367 -51654 117631 3011 -32114 -129550 -28361 -98967 -73651 -194155 12602 -221826
10618 229404 71850 21192 174231 23862 12496 -61047 137939 -224803 -55413 -49333 -351177
10607 -351177 -73638 -126788 40987 22939 -73882 -168098 -267487 -236888 -305440 -122255 194296
10595 -252183 -145054 33000 -279270 193179 -403118 205518 -12229 47414 -123854 290793
10584 -101793 15733 31732 -439874 -304589 -450354 63496 -80602 13128 -19238 -151085 -66097
10572 244811 48179 200910 144698 472079 87877 26579 -282555 -20122 98180 21716 211347
10561B11347K765I0503K26298b54019N2838I7713h5620D925J66311a8476E8639
10549f5542Q01A22777M992B8859b22993j8772l4133j56125a37487j82823B37376
10537f6392K8517A61527b07745B56862q8334a20940r5226C12658a13440b532k01721
10526b04253A54909b6967k09640i9570j5578e1203r1854L8042p1199a2966G161
10514a29457c9264B32998g6156c3910C392g1297o9345B12374b9083j5410m2570
10503h7063D7566a35351b4649A62052a90012j08290d3309o8249A20309i9531j98172
10492b97703b0587I0883b14493e7180j26753B79839H6796m2374O5778b05977e1272
10480I1647G285c6811j29008N0255i390k77074J37963j7871E5242c7282H9798
$$ plain form
10561 211347 214112 90503 316801 -254019 -201181 97713 -85620 4925 171236 -18476 58639
10549 -65542 -64741 122777 127769 28859 -222993 -241765 -275898 -432023 -137487 -320310 237376
10537 -66392 -37875 161527 -207745 256862 168528 -120940 -216166 312658 -113440 -2532 -204253
10526 -204253 154909 -26967 -236607 -99570 -115148 -51203 -143057 -105015 -176214 -12966 7161
10514 -129457 -39264 232998 -76156 -33910 3392 -71297 -140642 212374 -29083 -44493 -87063
10503 -87063 47566 -135351 -24649 162052 -190012 -298302 -43309 -111558 120309 -99531 -297703
10492 -297703 -20587 90883 -214493 -57180 -183933 279839 86796 44422 110200 -205977 -51272
10480 91647 7285 -36811 -165819 -115564 -9390 -286464 -148501 -166372 55242 -37282 89798
10468c45168E0029a31814B59285r9864o6646J33781D3748K25468Q1216J32629
10458D83061A47522p703K0804P7442I9148J66399h9277b9619A9319c69558J44973
10447b24585B74352a798E915O2610M939b21157A60176a45989C0331d6434k43346
10436b89780g422A5013a0939m9935k20494J19963L6973C7521a21806e4276A34038
10424b8058l5021k41568E5215J11430d342l6151o3150A96539a16260j73640e9295
10412f5971K0630a4581j48951B5762c8273A97643a37678I899J72482c30201B7652
10400G3528a63418d8199C16206b58489J1392B973c40977I599d3975A29527J0233
10389A39760a94573C915a52316a1597n1727j43303A97366a80157O6185J0980j02110
$$ plain form
10468 -345168 50029 -131814 259285 159421 92775 226556 43748 269216 350432 483061
10458 483061 147522 139819 160623 238065 99148 265547 -89277 -29619 19319 -369558 -224585
10447 -224585 274352 -1798 5915 68525 73464 -221157 160176 -145989 30331 -46434 -289780
10436 -289780 -7422 15013 -10939 -60874 -281368 -161405 -124432 37521 -121806 -54276 134038
10424 -28058 -63079 -304647 55215 166645 -4342 -40493 -103643 196539 -116260 -289900 -59295
10412 -65971 -45341 -14581 -163532 25762 -38273 197643 -137678 9899 182381 -330201 27652
10400 73528 -163418 -48199 316206 -258489 -247097 2973 -340977 9599 -43975 129527 139760
10389 139760 -194573 3915 -152316 -11597 -63324 -206627 197366 -180157 -113972 -102992 -205102
10378b05102J1177C4407a62242e8786Q497A26606J09020E1023b42991g7715A63079
10366H7898R2074a92229A38812a45226A0942J84538P8930A34142K56586j28364
10356B62364j23326L1661f0901A58363G1102J72329D4016M32169j94224Q0441
10346C62402G6305J18619i0951D5139c1021B24263J7858G0503N2917K0261J38837
10335B82518K4914G7535a17709B58703Q3437B012M9227N28646G6699K17357j8932
10324B75124P6608d4431n8782D17640A604J68198M9155A03916O0710K6313G9462
10312F3825a6289l6282n7749B05641C5004J08820M34M55162B1725c3157A07310
10300f760D95147A22133C0122a91495G9254A4817K01027c2845C94987j34068A191
$$ plain form
10378 -205102 -193925 34407 -162242 -58786 -50289 126606 235626 51023 -242991 -77715 163079
10366 87898 179972 -192229 138812 -145226 10942 195480 274410 134142 390728 262364
10356 262364 139038 170699 -60901 158363 71102 243431 44016 476185 281961 362402
10346 362402 76305 194924 -90951 45139 -31021 224263 242121 70503 123420 143681 282518
10335 282518 307432 77535 -117709 258703 342140 2012 51239 579885 76699 294056 275124
10324 275124 351732 -44431 -103213 417640 1604 169802 218957 103916 164626 190939 79462
10312 63825 -16289 -52571 -110320 205641 35004 143824 144258 599420 21725 -33157 107310
10300 -6760 495147 122133 30122 -191495 79254 14817 215844 -32845 394987 260919 1191
10288B23317l5664a58719g4136K4748A11357J27408K8057l757e8130B8840R4235
10277A23075i2530C219R0478B602J27275f75303a29684e1515j88153b0714l50046
10266c70760R5240i7598l64431K16707O8605j51835J12292A09618B0509K31139
10256B51648j09194b23625R1329C0283b54749J7399P6054C04968c44045D1600
10245a28376G69J22399P0501l0351n4311J48816a6229I9218N4209K06541c6798
10233A92950l9112a15394A901L0671a6383A30240a1407H7354a04169j03730b5784
10221a49581f2553A4708p292M3673a28370J1144j01649B39571J72281b1720k5313
10210d7033j84723j28564E1743M3192d0949p2486J1758a9742A48986i3317B70673
$$ plain form
10288 223317 187653 -158719 -74136 -49388 111357 238765 266822 263065 -58130 28840 123075
10277 123075 -92530 3219 93697 2602 129877 -675303 -129684 -51515 -239668 -20714 -370760
10266 -370760 -275520 -97598 -462029 -245322 -176717 -328552 -216260 109618 20509 251648
10256 251648 142454 -223625 -132296 30283 -254749 -237350 -161296 304968 -344045 41600
10245 -128376 769 123168 193669 163318 109007 257823 -16229 99218 153427 359968 -36798
10233 192950 153838 -115394 1901 32572 -16383 130240 -11407 87354 -104169 -207899 -25784
10221 -149581 -62553 14708 7416 51089 -128370 -117226 -218875 239571 411852 -21720 -47033
10210 -47033 -231756 -360320 51743 94935 -40949 -113435 -101677 -19742 148986 -93317 270673
10198A90557D5226a6043H0543b1538l09096a58958B04828b61433A819a07812A36078
10186c5164l442B68993E929M1516J9122a99498A14844c9617j68854b2414m4158
10175f6572A81238a14149G1685C3315O1494J20217a75071c545F9133M5490a17883
10163D0125b8447A23687f1261r5071D0785f9120A70770c4239H2110a6961k60910
10152b77871j1522E3049a35286m7423E7205i7398p432r7339e1437D8304c3865
10140A56930b5849A19434A8878L5314k0874L7748a71884E130L5657c18038d8214
10128E0489J39061b6940j52204g6015i728I373J33064e4136j10026j57913B62186
10116g2445O891C9556a64405K0796F1260a77192l9633h1909J8022G8374a43072
$$ plain form
10198 190557 45226 -16043 80543 -21538 -330634 -158958 204828 -261433 1819 -107812 136078
10186 -35164 -38606 268993 5929 47445 66567 -199498 114844 -39617 -208471 -22414 -66572
10175 -66572 181238 -114149 71685 33315 94809 215026 -175071 -3545 69133 114623 -117883
10163 40125 -28447 123687 -61261 -156332 40785 -69120 170770 -34239 82110 -16961 -277871
10152 -277871 -289393 53049 -135286 -182709 57205 -97398 -104830 -202169 -51437 48304 -33865
10140 156930 -25849 119434 18878 54192 33318 71066 -171884 5130 40787 -318038 -48214
10128 50489 189550 -26940 -179144 -76015 -9728 9373 142437 -54136 -164162 -322075 262186
10116 -72445 -65554 39556 -164405 -143609 61260 -177192 -216825 -81909 -63887 78374 -143072
10104B51785f9365j3745k09694r9945d6347k49396A19379e4105q3475P653k12763
10093c42690i3978I9374D4496c07429J29065h7682k04214d7888j50167j80007
10083c78062P9486l3188A41384b66332f2156k92395B15878Q2973a07269j8287
10073a25556A82567Q8436b73229a11639J1738d8746p6204j3161B07909C4830f7295
10061B76933f9698j42804a7697A39143b68168P4519A17716A9269b6113r2332K9973
10050h8472k21187A72277b8704B59521a784n0489k66300A94744a24038a4363p0841
10039h5204B78610b59880M0199J08761c8559C3070J00500a01704A0291b9880E7040
10027B01336h8193F6832c5453n1082n0585A76527p9398f4477A924M1032e752H2408
$$ plain form
10104 251785 -69365 -83110 -292804 -392749 -46347 -295743 119379 -54105 -137580 -129927 -342690
10093 -342690 -93978 99374 44496 -307429 -178364 -87682 -291896 -47888 -198055 -378062
10083 -378062 -298576 -331764 141384 -266332 -62156 -354551 215878 298851 -107269 -125556
10073 -125556 182567 271003 -273229 -111639 -99901 -48746 -124950 -138111 207909 34830 -67295
10061 276933 -69698 -212502 -17697 139143 -268168 -193649 117716 19269 -26113 -118445 -88472
10050 -88472 -309659 172277 -28704 259521 -1784 -52273 -318573 194744 -124038 -14363 -85204
10039 -85204 278610 -259880 -219681 -110920 -38559 33070 133570 -101704 10291 -29880 57040
10027 201336 -88193 66832 -35453 -86535 -137120 176527 97129 -64477 1924 42956 -5752 82408
10014A8231Q62L5767G507b95275B71905E073b78963C27306c99885J47469L9234
10003b13182B73844b42163c1055j92570G789b03246E129a46105j03996J4525f4184
9991h1733F8861c04079j8198I0975h7964C987J15725g3209m0592H5143J9698i6730
9978c52707f457k09707q2829j1262j9869F4526a23782B5051a44072D2565d38947
9966i1177a8287m630q2911l8557m12483A59542a61734O9715C71656G1240B0076
9954A66950d4707M160B36537A12552b40003Q4358j73361k8578A46682b33866C6269
9942b54985B17059b8551A71267b98608C6011b76330b4356j77862p5386B59829
9931g5973b4834B08956D3186C818R0630g9688F662b18217A46204a9307n22049
$$ plain form
10014 18231 19093 54860 7507 -295275 271905 5073 -278963 327306 -399885 -252416 -213182
10003 -213182 273844 -242163 -31055 -223625 7789 -203246 5129 -146105 -250101 -235576 -64184
9991 -81733 68861 -304079 -322277 90975 -87964 3987 119712 -73209 -113801 85143 104841 -96730
9978 -352707 -6457 -216164 -298993 -310255 -330124 64526 -123782 25051 -144072 42565 -438947
9966 -91177 -18287 -22917 -105828 -144385 -556868 159542 -161734 -92019 371656 71240 20076
9954 166950 -44707 -40547 236537 112552 -240003 -155645 -329006 -357584 146682 -233866 36269
9942 -254985 217059 -28551 171267 -298608 36011 -276330 -24356 -202218 -277604 259829
9931 -75973 -24834 208956 43186 3818 94448 -79688 6662 -218217 146204 -19307 -541356
9920e41356J30140G6730h7699A58210J12910C5983a46319q7806d2443J0029A4495
9908a24195e3326B6002N8034C6293b55920D99Q3250a60333j435O6065B61777b29427
9895B21527E9580P721c01212L2993F4324c95132B81736f311I6491a3034k9878
9884d2912B00129a90484A9360a90410A31393J83534A48026M3548d4393j70679
9874b15072h9621j22105l4702d6929B76442A08734c6452k72345k04655A31627
9863e823A92974e8887K2285q8397A44034F1162Q5578a29004f2387D8267e5450
9851f7777A4573b97190f8695G4608a01634A15629K1023l1230c24727B52609b41886
9839a0445n8504R192D1308e6919I2317a96200M8150e6312j62899E8149a04612
$$ plain form
9920 -541356 -411216 76730 -87699 158210 271120 35983 -146319 -234125 -42443 -32414 14495
9908 -124195 -53326 26002 84036 36293 -255920 499 83749 -160333 -161768 -95703 261777 -229427
9895 221527 59580 67301 -301212 -268219 64324 -395132 281736 -6311 96491 -13034 -42912
9884 -42912 200129 -190484 19360 -190410 131393 314927 148026 191574 -44393 -215072
9874 -215072 -89621 -211726 -246428 -46929 276442 108734 -36452 -308797 -513452 131627
9863 -5823 192974 -58887 -36602 -124999 144034 61162 146740 -129004 -62387 48267 -55450
9851 -67777 14573 -297190 -68695 74608 -101634 115629 136652 105422 -324727 252609 -241886
9839 -10445 -68949 -59757 41308 -56919 92317 -196200 -148050 -56312 -219211 58149 -104612
9827b21416N6088N377M678r0644M5327j66194A32572A8707f1337j18178A34733
9815e9767D2034f1739k5437c6550A03265B7402a25708p8755a9619A63247g3138
9803B86108d35255d2430j26678N1441k78673P3467A96761f668j5902k06471h2306
9791i0696n0474p438B94665c70675e0770A87583c76223D1880b91106g2871G3795
9779A64127a29075c9821A04629J10395G9026l9420K1997b78168a07294R082l8717
9768a36929H372a05968E6724B998d5022j361m62006h1187A92087m2956h0510A8955
9755F7778h5974D7929b08063K0606B81347d79882J76501P4041j31295N7066H1868
9743b8959j78887Q3085o5776b7863k13913a09568G6736o066i8286k7662F2079
$$ plain form
9827 -221416 -165328 -159951 -155273 -245917 -200590 -366784 132572 18707 -61337 -179515 134733
9815 -59767 42034 -61739 -87176 -36550 103265 27402 -125708 -204463 -19619 163247 -73138
9803 286108 -435255 -42430 -169108 -117667 -396340 -322873 196761 -6668 -22570 -229041 -82306
9791 -90696 -141170 -148608 294665 -370675 -50770 187583 -376223 41880 -291106 -72871 73795
9779 164127 -129075 -39821 104629 215024 79026 39606 61603 -278168 -107294 -98212 -136929
9768 -136929 8372 -105968 56724 2998 -45022 -46383 -508389 -81187 192087 149131 -80510 18955
9755 67778 -85974 47929 -208063 -187457 281347 -479882 -303381 -229340 -360635 -303569 81868
9743 -28959 -207846 -124761 -190537 -27863 -241776 -109568 76736 70670 -98286 -125948 62079
9731a27128D6566J7889c10387C3467b11193k2808e2579r1111n6467O4431A18731
9719c80537B19084c58211L8651A20964n5957b17326c4942J3392J0688H4002P7220
9708A61222b20863k65140i5190Q82j14632D783J16035J29121K2264b59292G8186
9696c20053B56062c43651c1809k0740A6828R7768J3946a50220e2806l41436e4564
9684a81740i0245B46380b05265P0841j10253m2081a01592j39508j5179N7515o718
9673b05482g4312r6072j2164A41881a91170I4646b7699p0647k8067f1390k7735
9662h9125j31713g0712j2272j41696o3243B2370c23900e9096a8489D4079E96a22397
9649A91499b03533k8673h8475D1081a32176B654b62880a20715l7353j45299O9626
$$ plain form
9731 -127128 46566 64455 -310387 33467 -211193 -234001 -52579 -143690 -200157 -135726 118731
9719 -380537 219084 -358211 -319560 120964 65007 -217326 -34942 -21550 -10862 84002 161222
9708 161222 -220863 -486003 -95190 -94308 -208940 4783 120818 249939 272203 -259292 78186
9696 -320053 256062 -343651 -31809 -52549 16828 114596 128542 -150220 -52806 -394242 -54564
9684 -181740 -90245 246380 -205265 -134424 -244677 -286758 -101592 -241100 -256279 -198764 -205482
9673 -205482 -74312 -170384 -182548 141881 -191170 94646 -27699 -98346 -126413 -61390 -89125
9662 -89125 -220838 -70712 -82984 -224680 -287923 22370 -323900 -59096 -18489 44079 596 -122397
9649 191499 -203533 -232206 -88475 41081 -132176 2654 -262880 -120715 -158068 -303367 -233741
9638b33741j53460d6235A43757a87325H1526a10493D6052c9491l93821b1003j88346
9627b09349e7919B31834j7392c6737j30815A4114a52147N6500c704n4895j2698
9616g1297j26331B9528a60181j00811f6532D65251c5488C54282a26757j16631
9606b43388D4113J4696a56273B70309B7721h1258j7948L3598A39228E1868M4400
9595I6268a30190k24436B39530d4690C8832J37538c1306r9295B64602d5418k38553
9584b83971J34077n4801B2076e9923k09559O2373k25655a24745C1628f5599m7347
9573a12946A16467a64788E2288c2039C5289a21091A35029a6137p5342A20791c2129
9561d4131l3652J0840A0527L7383c751p4867E7034a01212j33995J07545m0151
$$ plain form
9638 -233741 -387201 -46235 143757 -187325 81526 -110493 46052 -39491 -433312 -21003 -209349
9627 -209349 -57919 231834 214442 -36737 -167552 14114 -152147 -95647 -3704 -58599 -71297
9616 -71297 -197628 29528 -160181 -260992 -66532 465251 -35488 354282 -126757 -243388
9606 -243388 44113 58809 -156273 270309 27721 -81258 -99206 -65608 139228 51868 96268
9595 96268 -130190 -354626 239530 -44690 38832 176370 -31306 -130601 264602 -45418 -283971
9584 -283971 -149894 -204695 22076 -59923 -269482 -207109 -432764 -124745 31628 -65599 -112946
9573 -112946 116467 -164788 52288 -32039 35289 -121091 135029 -16137 -91479 120791 -32129
9561 -44131 -77783 -66943 10527 47910 -3751 -78618 57034 -101212 -235207 -127662 -167813
9550a67813O6513A35713E9409B7921a37917E3713a05804A07720i7323n0307N5017
9539i2613l45581J93905b8625A52643a79632A51399a75113j37353e1187j20472
9529a71659n1274m0196A97122I2954b89713h7927l0286B400f4720j85265d7284
9517B8197R670b82971q813J11688M8477j31696B56924A19960E6223K54278A34891
9505i4928K9578j36844F458c59675G3705a1808j174n46709h1829B54a72766d1657
9492b34742C16194a26612J5524L5207k56512C23747i2230b9867C4028b6561J559
9481b5002D1711f7456F5857M0764C82N4576a08466A30402a10661j76792N0580
9470b36873d2247D0650a53688f0583p4343a3968k15719A86435b89723k4019J13941
$$ plain form
9550 -167813 -101300 135713 59409 27921 -137917 53713 -105804 107720 -97323 -147630 -92613
9539 -92613 -438194 -244289 -28625 152643 -179632 151399 -175113 -312466 -51187 -171659
9529 -171659 -222933 -263129 197122 92954 -289713 -87927 -118213 2400 -64720 -249985 -47284
9517 28197 37867 -282971 -291784 -180096 -131619 -263315 256924 119960 56223 310501 134891
9505 -94928 -65350 -202194 6458 -359675 73705 -11808 -12982 -559691 -81829 254 -172766 -41657
9492 -234742 316194 -126612 -111088 -75881 -332393 323747 -92230 -29867 34028 -26561 -25002
9481 -25002 41711 -67456 65857 106621 382 54958 -108466 130402 -110661 -287453 -236873
9470 -236873 -42247 40650 -153688 -60583 -134926 -13968 -229687 186435 -289723 -313742 -199801
9459a99801B2103c4713k53732B63049a59073j53297P0844H1390i0105l1370f0066
9447A12275b96089B9726f7268J5605a1839B48719f0438I7311J35298h6083k85358
9436c71441a18319L8152k16846a45621a9487G6163a45805C50113m7505a10790
9425c4761j63071A43375o7796e4792A09861m2980C0581P2073a34085j30846H63
9413f6884k11962N5552A08647i6364j57918d3696B5828a38346C16717I9360b67930
9401B81886a8729B81213b43238P3790f3070k27112a4693C06776e40861A17075
9390G0618a27599c3944n1445j75547l005a3189k92153C1081a84267B04004A5445
9378a68322J0311f6667E394a18961e8990b202A54736e2009j8638q9871k4556j23572
$$ plain form
9459 -199801 22103 -34713 -288445 263049 -159073 -312370 -241526 81390 -90105 -121475 -60066
9447 112275 -296089 29726 -67268 -51663 -11839 248719 -60438 97311 232609 -86083 -371441
9436 -371441 -118319 -80167 -297013 -145621 -19487 76163 -145805 350113 302608 -110790
9425 -34761 -197832 143375 75579 -54792 109861 66881 30581 102654 -134085 -264931 863
9413 -66884 -278846 -223294 108647 -96364 -254282 -43696 25828 -138346 316717 99360 -267930
9401 281886 -18729 281213 -243238 -169448 -63070 -290182 -14693 306776 -540861 117075
9390 70618 -127599 -33944 -85389 -260936 -263941 -13189 -305342 31081 -184267 204004 15445
9378 -168322 -158011 -66667 5394 -118961 -58990 -2202 154736 -52009 -70647 -160518 -185074 -308646
9366c08646B01529c13489f0399k87987A77447F2152C0680e4161D0222a66573R544
9355a57029l0232B12992b01933K8640R801A83920F5656b96643i7769j95157j61217
9344d54143a28538N2867D1662f0142n4972A36661l0269Q3788J14383A17851a92990
9332D6774j8007b11817N7200N2744m2256j32429A55733a24403C8210A1939e9010
9320f827j7327E8378f6701j58414c1165E5713K82346j17501e26017c5225k28482
9309b63707Q1791A56118J7470c80758i0449k908F8640b01210n0663J8008f5403
9297a20083c4649I0067L912I374b63250i0298b6230G0856a00127l67870b7453
9285g4882j50534i3558C4348c78618I9656K9928e68798G0859a03536A15517q096
$$ plain form
9366 -308646 201529 -313489 -60399 -348386 177447 62152 30680 -54161 40222 -166573 -157029
9355 -157029 -187261 212992 -201933 -173293 -163492 183920 65656 -296643 -97769 -292926 -454143
9344 -454143 -128538 -75671 41662 -60142 -115114 136661 106392 190180 304563 117851 -192990
9332 46774 28767 -211817 -154617 -101873 -144129 -276558 155733 -124403 38210 11939 -59010
9320 -6827 -24154 58378 -66701 -225115 -31165 55713 338059 220558 -526017 -35225 -263707
9309 -263707 -181916 156118 173588 -380758 -90449 -93357 68640 -201210 -251873 -233865 -65403
9297 -120083 -34649 90067 93979 9374 -263250 -90298 -26230 70856 -100127 -467997 -27453
9285 -74882 -225416 -93558 34348 -378618 99656 129584 -568798 70859 -103536 115517 107421
9274A07421h2358j87144g1829D7805K6647J51181a83247H7051A6851J06006m9881
9263G2976h2109k69768a68664C88498a24480o729I1029Q5364a95393E4851b36029
9251a62872C88996C516d3044E6370J41514B1128A86a45364j80568I7331g5853
9239b25200J04897A19365c89619d9276j8203O791j18876d3706j770j49681g2635
9227a31905A3973d42782A49698J7250B7093a05684a5787B205K6080a18711B56571
9215i3835L6528k82588J48703P9272j4127A31869o4917j686b8604B78324a1362
9203b52913f1460r0359f4139G5659a55803a3485C37365b03823k57629A39033K73873
9192D12906g4222k7055H1025b04055M1430l2063F4163I241M5505e5399F1257Q2082
$$ plain form
9274 107421 -82358 -269502 -71829 47805 74452 225633 -183247 87051 16851 122857 72976
9263 72976 -82109 -351877 -168664 388498 -124480 -131209 91029 176393 -195393 54851 -236029
9251 -162872 388996 3516 -43044 56370 197884 21128 186 -145364 -325932 97331 -75853
9239 -225200 -120303 119365 -389619 -49276 -67479 -60688 -179564 -43706 -45476 -195157 -72635
9227 -131905 13973 -442782 149698 166948 27093 -105684 -15787 2205 28285 -118711 256571
9215 -93835 -57307 -339895 -191192 -111920 -126047 131869 66952 65266 -28604 278324 -11362
9203 -252913 -61460 -151819 -64139 75659 -155803 -13485 337365 -203823 -461452 139033 412906
9192 412906 -74222 -101277 81025 -204055 -162625 -194688 64163 9241 54746 -55399 61257 143339
9180A43339i2297j07627c5765p9776B80818a02148A5338e7597n1111L3073j30403
9169b06038c3376A11699Q5822b3093k51835n5441a01471m8252M0365c3057r8048
9158a31105j20919i1229j32001A51698a43598c0657E5973a45261j67080M2496
9148b69845D5769O7826k5417j3226c55024K8906B08117D9712d8997j34302j63858
9137c47157a32825A54755g0147k02056B90135b11364B60743J73490a24470k2316
9127a46786p7289A03603c43872a3529A6205b31375a13370k18723M1511c6266A56649
9115I7693a73876A2383N5625a06773L4046B8539p083c8691q1478J9977m1019E8367
9102D7573c74631A09713b42708H4057B9292R912d0460A05419a52745l64067K07750
$$ plain form
9180 143339 -92297 -199924 -35765 -115541 280818 -102148 15338 -57597 -108708 -75635 -206038
9169 -206038 -33376 111699 197521 -23093 -274928 -330369 -101471 -149723 -109358 -33057 -131105
9158 -131105 -252024 -91229 -223230 151698 -143598 -30657 55973 -145261 -312341 -269845
9148 -269845 45769 113595 88178 74952 -355024 -326118 208117 49712 -48997 -183299 -347157
9137 -347157 -132825 154755 -70147 -272203 290135 -211364 260743 434233 -124470 -146786
9127 -146786 -224075 103603 -343872 -13529 16205 -231375 -113370 -332093 -290582 -36266 156649
9115 97693 -173876 12383 68008 -106773 -72727 28539 21456 -38691 -120169 -100192 -141211 58367
9102 47573 -374631 109713 -242708 84057 29292 39204 -40460 105419 -152745 -516812 -309062
9091c09062B04632b86202j12856J31878L6577A39973J9872c49771O4919R7046
9081a87806Q5718g715D03666a02570l61888A72143E0575b23734E4262K21369d6747
9069a06397a8880m5830A44900d6977A91967a22922L7300L0100F0768h5601I2639
9057A47377a23027b8418e044j47099j01350J23386l6654m3756k6536D1084a51967
9045A07678f17637b81638I4581A4487a2147A88496a49168d7291A91306p9825a84763
9033e7371k0816r7246N8441A23028h7954c3795k33034d1948a3781j85015A99047
9021a2175k38062A8863e1095k64777D0458a210k65638a4677k15674b3171A1653
9009C9424b0947l6417j28974b3341j73638O9581e3214A006L11528j52265K6989
$$ plain form
9091 -309062 204632 -286202 -399058 -267180 -230603 139973 159845 -349771 -284852 -187806
9081 -187806 -102088 -7715 403666 -102570 -464458 172143 50575 -223734 54262 275631 -46747
9069 -106397 -18880 -64710 144900 -46977 191967 -122922 -85622 -55522 60768 -85601 92639
9057 147377 -123027 -28418 -5044 -152143 -253493 -130107 -166761 -210517 -237053 41084 -151967
9045 107678 -617637 -281638 94581 14487 -12147 188496 -149168 -47291 191306 111481 -184763
9033 -57371 -78187 -175433 -116992 123028 -87954 -33795 -266829 -41948 -13781 -198796 199047
9021 -12175 -250237 18863 -51095 -315872 40458 -1210 -266848 -14677 -230351 -23171 11653
9009 39424 -20947 -57364 -186338 -23341 -196979 -127398 -53214 1006 312534 160269 187258
8998A87258a18336G8667c58459g2897A01589b08939A3551P3945i9839I4514b19882
8986c0870G8612i0741j01380C20600a47141n9137G1330J3249k0983b02769H324
8974A17196c30080f229j38693j5108c0694k0207k6644C7368K24013e7354j17770
8963a75124d75A18577a11231j07229b0291p2767j5362b2007A88473E0812L6016
8952H6828k8235c03562C4246Q8733b12311A27892J70513d50625b9150A45245a7109
8940a77231A50405b48486b706n0135A1633b45074a7608k4293A29698a35525g318
8928C29310f4895j54838A91539g2073K7091c333j1510D8055K82424n8418G0625
8916a64457B52854K16430a45908G7681J15341m5745J37075M24312k93801O67851
$$ plain form
8998 187258 -118336 78667 -358459 -72897 101589 -208939 13551 87496 -99839 94514 -219882
8986 -30870 78612 -90741 -192121 320600 -147141 -206278 71330 84579 63596 -202769 8324
8974 117196 -330080 -6229 -144922 -160030 -30694 -50901 -77545 37368 261381 -57354 -175124
8963 -175124 -475 118577 -111231 -218460 -20291 -93058 -108420 -22007 188473 50812 86828
8952 86828 58593 -303562 34246 122979 -212311 127892 298405 -450625 -29150 145245 -17109
8940 -177231 150405 -248486 -2706 -52841 11633 -245074 -17608 -41901 129698 -135525 -7318
8928 329310 -64895 -219733 191539 -72073 -44982 -3333 -14843 48055 330479 272061 70625
8916 -164457 252854 469284 -145908 77681 193022 147277 284352 708664 414863 1082714
8906A082714M79267J650759L986656j49514l388090j648910r55832E11008B48543
8896C42084A46919K82979A32488b129E0794a67927A11757l7390N4742A8118b54055
8884a7336G4107b9369A65623b13073p2011A02458i1762A01649K05258a3596A30982
8872a1484A17460e7483C243a29452m6459j8013B59980i9095r5556M4914j29713
8861b79450J05333P7263l6812C2896b68123A80475b36716g8600K6530D1102K52667
8850B93769b56506H2638J11425n8749f7874b4426k81085H596a52028B3737a64919
$$ plain form
8906 1082714 1561981 3212740 7199396 7049882 3661792 2012882 1057050 511008 248543
8896 342084 146919 429898 132488 -2129 50794 -167927 111757 74367 129109 18118 -254055
8884 -17336 74107 -29369 165623 -213073 -285084 102458 -91762 101649 306907 -13596 130982
8872 -11484 117460 -57483 3243 -129452 -175911 -193924 259980 -99095 -194651 -149737 -279450
8861 -279450 -174117 -96854 -133666 32896 -268123 180475 -236716 -78600 -52070 41102 293769
8850 293769 -256506 82638 194063 135314 -67874 -24426 -305511 8596 -152028 23737 -164919
$$ [...]
##END NTUPLES=NMR SPECTRUM
##END=
