
##TITLE=AC1184_Huila_5890903_WHsA5MCmmj
##JCAMPDX= 6.0         $$ Bruker NMR JCAMP-DX V2.0
##DATA TYPE= NMR SPECTRUM
##DATA CLASS= NTUPLES
##ORIGIN= BRUKER
##OWNER= Administrator
$$ 1.72 TOPSPIN		Version 2.1
$$ 2012-04-02 18:26:27.546 -0500  Administrator@TOPSPIN
$$ Compression mode = diff/dup
##.OBSERVE FREQUENCY= 400.13188235
##.OBSERVE NUCLEUS= ^1H
##.ACQUISITION MODE= SIMULTANEOUS (DQD)
##.ACQUISITION SCHEME= undefined
##.AVERAGES= 64
##.DIGITISER RES= 22
##SPECTROMETER/DATA SYSTEM= spect
##.PULSE SEQUENCE= noesygpps1d.comp
##.SOLVENT NAME= COFFEE_meoh
##.SHIFT REFERENCE= INTERNAL, COFFEE_meoh, 1, 14.96806
##AUDIT TRAIL= $$ (NUMBER, WHEN, WHO, WHERE, PROCESS, VERSION, WHAT)
$$ ##TITLE= Audit trail, TOPSPIN		Version 2.1
$$ ##JCAMPDX= 5.01
$$ ##ORIGIN= Bruker BioSpin GmbH
$$ ##OWNER= Administrator
$$ $$ C:\Bruker\TOPSPIN/data/COFFEE/nmr/AC1184_Huila_5890903_WHsA5MCmmj/12/pdata/1/auditp.txt
$$ ##AUDIT TRAIL=  $$ (NUMBER, WHEN, WHO, WHERE, PROCESS, VERSION, WHAT)
(   1,<2012-04-02 18:26:22.000 -0500>,<Administrator>,<TOPSPIN>,<go>,<TOPSPIN 2.1>,
      <created by zg
	started at 2012-04-02 18:14:49.937 -0500,
	POWCHK enabled, PULCHK disabled,
       configuration hash MD5:
       1A 1E CE 29 27 FD 77 03 67 4E F0 E3 C4 B2 CB 90
       data hash MD5: 64K
       DF 08 DF CA 58 2D A3 F3 BA F9 7E 79 2F E6 1B 90>)
(   2,<2012-04-02 18:26:25.218 -0500>,<Administrator>,<TOPSPIN>,<proc1d>,<TOPSPIN 2.1>,
      <Start of raw data processing
       efp LB = 0.3 FT_mod = 6 PKNL = 1 PHC0 = 0 PHC1 = 0 SI = 128K 
       data hash MD5: 128K
       7F 39 66 A7 46 7E 35 4C DA E4 18 D5 CC 18 67 44>)
(   3,<2012-04-02 18:26:26.640 -0500>,<Administrator>,<TOPSPIN>,<proc1d>,<TOPSPIN 2.1>,
      <pk PHC0 = 33.27759 PHC1 = 0 
       data hash MD5: 128K
       27 10 A1 55 E3 29 F0 6E 00 93 68 58 56 68 E5 69>)
(   4,<2012-04-02 18:26:26.937 -0500>,<Administrator>,<TOPSPIN>,<proc1d>,<TOPSPIN 2.1>,
      <abs ABSG = 1 
       data hash MD5: 128K
       BB 89 AF 0C DA 58 03 01 E3 09 84 B4 D7 5A D3 C2>)
(   5,<2012-04-02 18:26:27.093 -0500>,<Administrator>,<TOPSPIN>,<proc1d>,<TOPSPIN 2.1>,
      <abs ABSG = 2 
       data hash MD5: 128K
       6C AC 32 25 F0 33 99 93 87 8C 5A 4F FE BB 63 48>)
(   6,<2012-04-02 18:26:27.296 -0500>,<Administrator>,<TOPSPIN>,<proc1d>,<TOPSPIN 2.1>,
      <abs ABSG = 3 
       data hash MD5: 128K
       97 3A 74 4F 23 1B E4 77 85 D7 22 D4 F3 5C 25 24>)
(   7,<2012-04-02 18:26:27.359 -0500>,<Administrator>,<TOPSPIN>,<proc1d>,<TOPSPIN 2.1>,
      <abs ABSG = 4 
       data hash MD5: 128K
       EB F1 86 2C CD 3C A9 6A B9 55 35 7D 0B 2B 0B FB>)
(   8,<2012-04-02 18:26:27.437 -0500>,<Administrator>,<TOPSPIN>,<proc1d>,<TOPSPIN 2.1>,
      <abs ABSG = 5 
       data hash MD5: 128K
       BB 8E A6 DE FA BC EC 46 63 65 76 D7 25 4B AC 00>)
$$ ##END=
$$ 
$$ $$ hash MD5
$$ $$ 3E 52 76 07 43 DD 1E 0C 62 66 E5 1D DA 0F 07 2F
##$RELAX= 
##$RELAX= 
##$RELAX= 
##$RELAX= 
##$RELAX= 
##$RELAX= 
##$RELAX= 
##$RELAX= 
$$ Bruker specific parameters
$$ [...]
##$TP07= 0
##$TPNAME0= <>
##$TPNAME1= <>
##$TPNAME2= <>
##$TPNAME3= <>
##$TPNAME4= <>
##$TPNAME5= <>
##$TPNAME6= <>
##$TPNAME7= <>
##$TPOAL= (0..7)
0.5 0.5 0.5 0.5 0.5 0.5 0.5 0.5
##$TPOFFS= (0..7)
0 0 0 0 0 0 0 0
##$TUNHIN= 0
##$TUNHOUT= 0
##$TUNXOUT= 0
##$USERA1= <user>
##$USERA2= <user>
##$USERA3= <user>
##$USERA4= <user>
##$USERA5= <user>
##$V9= 5
##$VALIST= <valist>
##$VCLIST= <CCCCCCCCCCCCCCC>
##$VD= 0
##$VDLIST= <DDDDDDDDDDDDDDD>
##$VPLIST= <PPPPPPPPPPPPPPP>
##$VTLIST= <TTTTTTTTTTTTTTT>
##$WBST= 2048
##$WBSW= 25
##$XGAIN= (0..3)
0 0 0 0
##$XL= 0
##$YL= 0
##$YMAX_a= 12428703
##$YMIN_a= -5398518
##$ZGOPTNS= <>
##$ZL1= 120
##$ZL2= 120
##$ZL3= 120
##$ZL4= 120
##$ABSF1= 14.96806
##$ABSF2= -5.584471
##$ABSG= 5
##$ABSL= 3
##$ALPHA= 0
##$AQORDER= 0
##$ASSFAC= 0
##$ASSFACI= 0
##$ASSFACX= 0
##$ASSWID= 0
##$AUNMP= <proc_prof1d_extract.lims>
##$AXLEFT= 0
##$AXNAME= <>
##$AXNUC= <1H>
##$AXRIGHT= 0
##$AXTYPE= 0
##$AXUNIT= <>
##$AZFE= 0.1
##$AZFW= 0.1
##$BCFW= 0
##$BC_mod= 0
##$BYTORDP= 0
##$COROFFS= 0
##$CY= 15
##$DATMOD= 1
##$DC= 0
##$DFILT= <>
##$DTYPP= 0
##$F1P= 0
##$F2P= 0
##$FCOR= 0.5
##$FTSIZE= 131072
##$FT_mod= 6
##$GAMMA= 0
##$GB= 0
##$INTBC= 1
##$INTSCL= 1
##$ISEN= 128
##$LB= 0.3
##$LEV0= 0
##$LPBIN= 0
##$MAXI= 10000
##$MC2= 0
##$MEAN= 0
##$ME_mod= 0
##$MI= 0
##$NCOEF= 0
##$NC_proc= -3
##$NLEV= 6
##$NOISF1= 0
##$NOISF2= 0
##$NSP= 0
##$NTH_PI= 0
##$NZP= 0
##$OFFSET= 14.96806
##$PC= 1
##$PHC0= 33.27759
##$PHC1= 0
##$PH_mod= 1
##$PKNL= yes
##$PPARMOD= 0
##$PPDIAG= 0
##$PPIPTYP= 0
##$PPMPNUM= 2147483647
##$PPRESOL= 1
##$PSCAL= 4
##$PSIGN= 0
##$PYNMP= <proc.py>
##$REVERSE= no
##$SF= 400.13000502093
##$SI= 131072
##$SIGF1= 0
##$SIGF2= 0
##$SINO= 400
##$SIOLD= 131072
##$SPECTYP= <>
##$SREGLST= <1H.CDCl3>
##$SSB= 0
##$STSI= 131072
##$STSR= 0
##$SW_p= 8223.68421052632
##$SYMM= 0
##$S_DEV= 0
##$TDeff= 65536
##$TDoff= 0
##$TI= <>
##$TILT= no
##$TM1= 0
##$TM2= 0
##$TOPLEV= 0
##$USERP1= <user>
##$USERP2= <user>
##$USERP3= <user>
##$USERP4= <user>
##$USERP5= <user>
##$WDW= 1
##$XDIM= 131072
##$YMAX_p= 467076087
##$YMIN_p= -294251430
##$CURPLOT= <Network HP LaserJet P1505>
##$CURPRIN= <$Network HP LaserJet P1505>
##$DFORMAT= <normdp>
##$LAYOUT= <+/1D_H.xwp>
##$LFORMAT= <normlp>
##$PFORMAT= <normpl>
##$SURQMSG= 1
$$ End of Bruker specific parameters
$$ ---------------------------------
##NTUPLES= NMR SPECTRUM
##VAR_NAME=  FREQUENCY,     SPECTRUM/REAL,   SPECTRUM/IMAG
##SYMBOL=    X,             R,               I
##VAR_TYPE=  INDEPENDENT,   DEPENDENT,       DEPENDENT
##VAR_FORM=  AFFN,          ASDF,            ASDF
##VAR_DIM=   131072,        131072,          131072
##UNITS=     HZ,            ARBITRARY UNITS, ARBITRARY UNITS
##FACTOR=    0.0627417313425165, 1,          1
##FIRST=     8223.62146879498, -3257,        -91779
##LAST=      0,             -301,            -91472
##MIN=       0,             -294251430,      0
##MAX=       8223.62146879498, 467076087,    0
$$ Real data points
##PAGE= N=1
##DATA TABLE= (X++(R..R)), XYDATA
$$ [...]
62986B491764P2346P1284P0811P1676P2387P1424O9480O8279O8025O7419O5865
62975C260760O4338O3869O3962O2891N9151N2469M3733L4072K3880J2652j10j3944
62963C727723k7574l9934n0859o0593o8856p4741p7743p8556p8417p7713p5778
62952C016959p2002o6459n9360n0878m1905l3876k7078k0126j2250m963J07M124
62940B632293R573J6224K1205K3473K5510K9326L3216L4470L3513L2894L3290
62929B924987L3063L1379K9231K7154K4055J9000J2557N602j913j0428k0039l0678
62917C043970m1989n2706o1528o8855p6129q2988q6985q7197q6130q6286q6509
62906B226668q4117p9534p5874p4063p1346o5496n8223n2975n0860n0108m8591
$$ y = [2491764, 2564110, 2635394, 2706205, 2777881, 2850268, 2921692, 2991172, 3059451, 3127476, 3194895, 3260760, 3325098, 3388967, 3452929, 3515820, 3574971, 3627440, 3671173, 3705245, 3729125, 3741777, 3741667, 3727723, 3700149, 3660215, 3609356, 3548763, 3479907, 3405166, 3327423, 3248867, 3170450, 3092737, 3016959, 2944957, 2878498, 2819138, 2768260, 2726355, 2692479, 2665401, 2645275, 2633025, 2628062, 2628169, 2632293, 2641866, 2658090, 2679295, 2702768, 2728278, 2757604, 2790820, 2825290, 2858803, 2891697, 2924987, 2958050, 2989429, 3018660, 3045814, 3069869, 3088869, 3101426, 3107028, 3105115, 3094687, 3074648, 3043970, 3001981, 2949275, 2887747, 2818892, 2742763, 2659775, 2572790, 2485593, 2399463, 2313177, 2226668, 2142551, 2063017, 1987143, 1913080, 1841734, 1776238, 1718015, 1665040, 1614180, 1564072, 1515481]
62895A515481m5538m1506l7683l4864l2496k9301k5318k2297k1425k1628k1084
62884A182341j9393j7211j4776j2294j0832j1100j1832j1182r486q737r465j0082
62872A035951r709r517j0501j1604j1338r949q786q475q756r414j0224j0518r755
62859I07405q234o690n619n248n454n333l875j631m93j050j525m09J142J172M
62844H64162n19j48l11j207j188M07J830J377k04j037p85o40j218j788j552p37
62828H56442j22K0M9K32K32l92j372j917j912k246l475m688m610l469k732l036
62812H27004l446l066k368k338k988l513l592l806m734o090o910o456m826k853
62798G70018j435j049j597k474k878k397j449q66r97j659k764m318n699n859m606
$$ y = [1515481, 1469943, 1428437, 1390754, 1355890, 1323394, 1294093, 1268775, 1246478, 1225053, 1203425, 1182341, 1162948, 1145737, 1130961, 1118667, 1107835, 1096735, 1084903, 1073721, 1064235, 1055498, 1046033, 1035951, 1026242, 1016725, 1006224, 994620, 983282, 973333, 964547, 956072, 947316, 937902, 927678, 917160, 907405, 899171, 892481, 886862, 881614, 876160, 870827, 866952, 865321, 864828, 863778, 862253, 861844, 862986, 864158, 864162, 863643, 863495, 863184, 861977, 860789, 861196, 863026, 864403, 864199, 863162, 862377, 861737, 860519, 858731, 857179, 856442, 856320, 856340, 856389, 856621, 856853, 856461, 855089, 853172, 851260, 849014, 845539, 840851, 836241, 832772, 830040, 827004, 823558, 820492, 818124, 815786, 812798, 809285, 805693, 801887, 797153, 791063, 784153, 777697, 772871, 770018, 768583, 767534, 765937, 763463, 760585, 758188, 756739, 755873, 754876, 753217, 750453, 746135, 740436, 734577, 729971]
62783G29971k888j395J34J737K579K482K859M758O879P166N636L927K627J170
62769G67642L5O44K694L870L142K353L307N014N425M578M266N241O501P008O694
62754H28414N770M283K632J722K234L991O140P747Q504R110J0650J3218J5626
62741I20041J6898J7618J9052K1258K2953K3376K3532K5012K8030L1222L3482
62730A182474L5348L8118M2018M6117M9938N4106N8971O3815O8263P3385Q0034
62719A792587Q6911R2037R5690R9963J05370J09954J12289J13375J14373J14134
62709B836683J10470J02903R2783Q1232O8197N3199L6053J7059k793k2026l9565
62698C334195n5186o8930q0727r0839r9787j07310j12310j14415j14651j13924
$$ y = [729971, 727083, 725688, 725822, 727559, 730138, 732620, 735479, 740237, 747116, 754282, 759918, 763845, 766472, 767642, 767677, 768321, 771015, 774885, 778027, 780380, 783687, 788701, 794126, 798704, 802970, 808211, 814712, 821720, 828414, 834184, 838467, 841099, 842821, 845055, 849046, 855186, 862933, 871437, 880547, 891197, 904415, 920041, 936939, 954557, 973609, 994867, 1017820, 1041196, 1064728, 1089740, 1117770, 1148992, 1182474, 1217822, 1255940, 1297958, 1344075, 1394013, 1448119, 1507090, 1570905, 1639168, 1712553, 1792587, 1879498, 1971535, 2067225, 2167188, 2272558, 2382512, 2494801, 2608176, 2722549, 2836683, 2947153, 3050056, 3142839, 3224071, 3292268, 3345467, 3381520, 3398579, 3395786, 3373760, 3334195, 3279009, 3210079, 3129352, 3038513, 2938726, 2831416, 2719106, 2604691, 2490040, 2376116]
62688B376116j11828j07876j02895r8104r3548q8596q3253p7820p1925o5234n8754
62677A416283n4023n1066m8255m4226l9087l3924k9918k7616k6157k3583j8985
62666A019443j4090j1515j1565j1905j0533p822n275l350j256J602M730P196Q905
62653I64565J0869J3838J6986J8866J9666K1315K4772K8646L1434L3913L7764
62642A222634M2882M7797N2146N6790O1775O6050O9352P2636P6365P9868Q2608
62631A930903Q4693Q5773Q4908Q1873P7199P0617O1084M8910L6188K4212J1816
62620B598176k469j7828l1933m3612n3557o2821p1552p9015q4230q6820q7530
62609A976809q7560q7207q5769q2819p8717p3815o8307o3136n9523n6986n3412
$$ y = [2376116, 2264288, 2156412, 2053517, 1955413, 1861865, 1773269, 1690016, 1612196, 1540271, 1475037, 1416283, 1362260, 1311194, 1262939, 1218713, 1179626, 1145702, 1115784, 1088168, 1062011, 1038428, 1019443, 1005353, 993838, 982273, 970368, 959835, 952013, 946738, 943388, 942132, 943734, 948464, 955660, 964565, 975434, 989272, 1006258, 1025124, 1044790, 1066105, 1090877, 1119523, 1150957, 1184870, 1222634, 1265516, 1313313, 1365459, 1422249, 1484024, 1550074, 1619426, 1692062, 1768427, 1848295, 1930903, 2015596, 2101369, 2186277, 2268150, 2345349, 2415966, 2477050, 2525960, 2562148, 2586360, 2598176, 2595707, 2577879, 2545946, 2502334, 2448777, 2385956, 2314404, 2235389, 2151159, 2064339, 1976809, 1889249, 1802042, 1716273, 1633454, 1554737, 1480922, 1412615, 1349479, 1289956, 1232970, 1179558]
62598A179558m8080m3146m0679l9535l7058l2990k9560k7982k6958k5002k2470
62587H06098k0535j9455j8651j7738j6645j5293j3742j2343j1408j0881j0537
62576F38870j0200r725r021q158p151n781l991k301j325j018q75p56q92j095p15
62561E75866M73J917L000L640M074M496N027N611N984O191P016R152J1993J4169
62547F58609J5370J6614J8343J9583J9803K0430K3050K6832K9374L0031L0878
62536I08917L3944L8819M3674M7596N0930N3942N6235N7418N7653N7419N7055
62525A463602N6408N4631N0537M3602L4545K4671J4810N193m023j2741k1200k9572
62513A680463l7119m2451m5025m5972m7030m8776n0189m9987m8277m6658m6496
$$ y = [1179558, 1131478, 1088332, 1047653, 1008118, 971060, 938070, 908510, 880528, 853570, 828568, 806098, 785563, 766108, 747457, 729719, 713074, 697781, 684039, 671696, 660288, 649407, 638870, 628670, 618945, 609924, 601766, 594615, 588834, 584843, 582542, 581217, 580199, 579324, 578568, 577676, 576581, 575866, 576339, 578256, 581256, 584896, 588970, 593466, 598493, 604104, 610088, 616279, 623295, 632447, 644440, 658609, 673979, 690593, 708936, 728519, 748322, 768752, 791802, 818634, 848008, 878039, 908917, 942861, 981680, 1025354, 1072950, 1123880, 1177822, 1234057, 1291475, 1349128, 1406547, 1463602, 1520010, 1574641, 1625178, 1668780, 1703325, 1727996, 1742806, 1747999, 1743976, 1731235, 1710035, 1680463, 1643344, 1600893, 1555868, 1509896, 1462866, 1414090, 1363901, 1313914, 1265637, 1218979, 1172483]
62502A172483m7085m6075m2095l6538l2136k9951k8586k6301k3065k0164j8520
62491H21967j7913j7535j6832j5794j4669j3439j1866j0230r488j0096j1014j0834
62479F62257r598q476p712o360m191k393j645r68O28K572L990N305P236R139J0033
62464F59817J0581J2308J5121J7290J7983J8280J9534K2054K5579K9667L3341
62453H81555L5585L6622L7713L9372M0891M1936M3218M5022M6225M5647M3449
62442A337235M0272L5817K9305K0895J1781L098m674j1517j7674k3424k8564l2419
62430A360131l4774l6502l8707m1284m2861m2240l9699l6714l4506l2967l1153
62419I48724k8639k5861k3085j9896j6294j3515j2659j2975j2624j0886q581o503
$$ y = [1172483, 1125398, 1079323, 1037228, 1000690, 968554, 938603, 910017, 883716, 860651, 840487, 821967, 804054, 786519, 769687, 753893, 739224, 725785, 713919, 703689, 694201, 684105, 673091, 662257, 652659, 644183, 636471, 630111, 625920, 623527, 621882, 620914, 621542, 624114, 628104, 633409, 640645, 649784, 659817, 670398, 682706, 697827, 715117, 733100, 751380, 770914, 792968, 818547, 848214, 881555, 917140, 953762, 991475, 1030847, 1071738, 1113674, 1156892, 1201914, 1248139, 1293786, 1337235, 1377507, 1413324, 1442629, 1463524, 1475305, 1478403, 1473729, 1462212, 1444538, 1421114, 1392550, 1360131, 1325357, 1288855, 1250148, 1208864, 1166003, 1123763, 1084064, 1047350, 1012844, 979877, 948724, 920085, 894224, 871139, 851243, 834949, 821434, 808775, 795800, 783176, 772290, 763709, 757206]
62407G57206m756l519l096l038k481j495p92m3J853M510N925N377M691N603P422
62392G73367Q627R225J0016J0783J0948J1067J1947J2886J2493J0822R175Q107
62380H99463O994N308K937l19m311p917j0285j2196j4773j7324j8217j7568j7054
62367G94738j7058j6149j3840j1821j1531j2214j2369j1692j0515q662o224m378
62355F58285l995m059k848k86K070L164L398L476L464L328L578M753O638Q468
62341F89434R830J1016J2376J3537J3682J2633J1317J0798J1086J1200J0270Q396
62329H25575O567N951O821P914P385M945K428J583K024K346K424L177M548N558
62315H89246O394Q458J1942J5194J7334J9780K3998K9216L3727L7300M0825M4545
$$ y = [757206, 752450, 748931, 745835, 742797, 740316, 738821, 738029, 737986, 739839, 744349, 750274, 755651, 760342, 765945, 773367, 781994, 791219, 801235, 812018, 822966, 834033, 845980, 858866, 871359, 882181, 891356, 899463, 906457, 911765, 914702, 914383, 910072, 902155, 891870, 879674, 864901, 847577, 829360, 811792, 794738, 777680, 761531, 747691, 735870, 724339, 712125, 699756, 688064, 677549, 668887, 662663, 658285, 654290, 650231, 647383, 647097, 649167, 652331, 655729, 659205, 662669, 665997, 669575, 674328, 680966, 689434, 699264, 710280, 722656, 736193, 749875, 762508, 773825, 784623, 795709, 806909, 817179, 825575, 832142, 838093, 844914, 852828, 860213, 865158, 867586, 869169, 871193, 873539, 875963, 879140, 883688, 889246, 895640, 904098, 916040, 931234, 948568, 968348, 992346, 1021562, 1055289, 1092589, 1133414, 1177959]
62303A177959M8307N2845N8954O5581P0375P2366P2854P3419P4065P3531P0443
62292A910699O4069N4900M4858L5989K8595K1209J2533K683p509j7430k6482l4008
62280B090106m0113m5921n2165n7888o1302o1766o0361n8570n7011n5491n3680
62269A485838n1405m8611m5427m2335l9975l8682l8219l7976l7313l5758l3200
62258A036937l0026k6822k3619j9843j5478j1831j0229j0029r078o481l771k701
62246H67029k957k993k165p24J427M255O267N517K299p29j666j225r02p05K03
62231H72931J617K356J808N24m15p9J750M120N532N769O356Q452J1063J2463J2743
62216I46990J3498J5305J7030J7832J8444J9976K2470K5189K7567K9498L1473
$$ y = [1177959, 1226266, 1279111, 1338065, 1403646, 1474021, 1546387, 1619241, 1692660, 1766725, 1840256, 1910699, 1974768, 2029668, 2074526, 2110515, 2139110, 2160319, 2172852, 2175535, 2168026, 2150596, 2124114, 2090106, 2049993, 2004072, 1951907, 1894019, 1832717, 1770951, 1710590, 1652020, 1595009, 1539518, 1485838, 1434433, 1385822, 1340395, 1298060, 1258085, 1219403, 1181184, 1143208, 1105895, 1070137, 1036937, 1006911, 980089, 956470, 936627, 921149, 909318, 899089, 889060, 879982, 873501, 869730, 867029, 864072, 861079, 858914, 858190, 859617, 863872, 870139, 875656, 877955, 877226, 875560, 874335, 873433, 872728, 872931, 874548, 876904, 878712, 879236, 878821, 878742, 880492, 884612, 890144, 895913, 902269, 910721, 921784, 934247, 946990, 960488, 975793, 992823, 1010655, 1029099, 1049075, 1071545, 1096734, 1124301, 1153799, 1185272]
62205A185272L4602L9665M5735N0785N4135N7266O1518O6037O9125P0648P1642
62194A806430P1964P0024O4967N7723M9428L9999K9159J7814P383j912j1073k0695
62182B181211l0182l8795m6636n4045o0482o4754o6354o6033o4879o3297o1215
62171A564539n8711n5874n2270m7400m1672l6283l1894k8047k4147k0362j7071
62160A150808j4029j0794p654n320l846k517q47R07K241K922K894K277J641J826
62146A120509L106M724N539N131M254M209N640P755Q991Q675P787P759Q964J0799
62132A213842J2846J4981J6589J6879J6264J6392J8112K0277K1258K1110K1293
62121A409843K2559K4022K4396K3556K2666K3184K5831L0208L5177L9664M3277
$$ y = [1185272, 1219874, 1259539, 1305274, 1356059, 1410194, 1467460, 1528978, 1595015, 1664140, 1734788, 1806430, 1878394, 1948418, 2013385, 2071108, 2120536, 2160535, 2189694, 2207508, 2214891, 2212979, 2201906, 2181211, 2151029, 2112234, 2065598, 2011553, 1951071, 1886317, 1819963, 1753930, 1689051, 1625754, 1564539, 1505828, 1449954, 1397684, 1350284, 1308612, 1272329, 1240435, 1212388, 1188241, 1167879, 1150808, 1136779, 1125985, 1118331, 1113011, 1109165, 1106648, 1105801, 1106708, 1108949, 1111871, 1114765, 1117042, 1118683, 1120509, 1123615, 1128339, 1133878, 1139009, 1143263, 1147472, 1153112, 1160867, 1169858, 1178533, 1186320, 1194079, 1203043, 1213842, 1226688, 1241669, 1258258, 1275137, 1291401, 1307793, 1325905, 1346182, 1367440, 1388550, 1409843, 1432402, 1456424, 1480820, 1504376, 1527042, 1550226, 1576057, 1606265, 1641442, 1681106, 1724383]
62110A724383M6260M9134N2340N5865N9031O0899O0993N9427N6367N1895M6428
62099B323022M0593L4344K6994J8639J0803M769j97n821j2306j8073k2073k4999
62087B375695k7745k9872l0502k9910k9038k7861k5483k1905j8603j6831j6067
62076B101878j4781j2387r774q050p290o629n158k554P23L601M996M797M242N011
62062B058625P677J1131J3666J4539J4516J5019J6895J9897K3173K6075K8512
62051B249725L0691L2711L4519L6110L7702L9684M2346M5536M8587N0771N1778
62040B700160N1617N0226M7724M5058M3721M4365M6148M7789M8750M8957M8083
62029C222598M6003M3584M2033M1624M1858M2636M4224M6239M7891M9300N1381
$$ y = [1724383, 1770643, 1819777, 1872117, 1927982, 1987013, 2047912, 2108905, 2168332, 2224699, 2276594, 2323022, 2363615, 2397959, 2424953, 2443592, 2454395, 2459164, 2458967, 2453146, 2440840, 2422767, 2400694, 2375695, 2347950, 2318078, 2287576, 2257666, 2228628, 2200767, 2175284, 2153379, 2134776, 2117945, 2101878, 2087097, 2074710, 2064936, 2056886, 2049596, 2042967, 2037809, 2035255, 2035978, 2039579, 2044575, 2049372, 2053614, 2058625, 2066302, 2077433, 2091099, 2105638, 2120154, 2135173, 2152068, 2171965, 2195138, 2221213, 2249725, 2280416, 2313127, 2347646, 2383756, 2421458, 2461142, 2503488, 2549024, 2597611, 2648382, 2700160, 2751777, 2802003, 2849727, 2894785, 2938506, 2982871, 3029019, 3076808, 3125558, 3174515, 3222598, 3268601, 3312185, 3354218, 3395842, 3437700, 3480336, 3524560, 3570799, 3618690, 3667990, 3719371]
62018C719371N4148N6368N7464N8510O0682O3652O6350O8431P0181P1772P3455
62007D420384P5769P8597Q0619Q0612P8886P6556P3954P0612O6162O0425N3252
61996E215828M5351L8595L4253L1306K7724K2952J7799J2454O460N32l528n135
61984E444591n613o090o186n502m768m491l800j811O20J745J058m29j607k128
61970E405589k100j779j416r57k32K54o33l028n219n407m057l388m559o441p450
61955E359177p581p853q390q137o586m896m627n657o209n139l411k719l250l658
61941E281064l031j824q36k49m9m81j565k832m104o042r224j3060j6171j7738
61927E203858j8160j8640k0254k3043k5748k6933k6637k6448k7588k9591l1286
$$ y = [3719371, 3773519, 3829887, 3887351, 3945861, 4006543, 4070195, 4136545, 4204976, 4275157, 4346929, 4420384, 4496153, 4574750, 4655369, 4735981, 4814867, 4891423, 4965377, 5035989, 5102151, 5162576, 5215828, 5261179, 5299774, 5334027, 5365333, 5393057, 5416009, 5433808, 5446262, 5452722, 5453254, 5449726, 5444591, 5438978, 5432888, 5426702, 5421200, 5416432, 5411941, 5408141, 5406330, 5406950, 5408695, 5409753, 5409324, 5407717, 5405589, 5403489, 5401710, 5400294, 5399337, 5399105, 5399359, 5398726, 5395698, 5390479, 5385072, 5381015, 5377627, 5373068, 5366627, 5359177, 5351596, 5343743, 5335353, 5327216, 5320630, 5315734, 5311107, 5305450, 5299241, 5294102, 5290691, 5287972, 5284722, 5281064, 5278033, 5276209, 5275373, 5275124, 5275075, 5274594, 5273029, 5270197, 5266093, 5260051, 5250827, 5237767, 5221596, 5203858, 5185698, 5167058, 5146804, 5123761, 5098013, 5071080, 5044443, 5017995, 4990407, 4960816, 4929530]
61916D929530l2322l2993l3153l2418l1235l0759l1529l2906l3957l4287l3856
61905D570115l2602l0720k9089k8912l0635l3118l4258l2871k9896k7318k5915
61894D234781k4808k3349k2337k2679k3640k3499k1703j9359j7646j6560j5266
61883D003935j3074r921o350l112m35K186N181Q168J0572J2649J5179J8271K1301
61870D064550K4095K7340L1588L6545M1636M6804N2410N8761O5931P3660Q1332
61859D604652Q8576R6137J05549J17563J31254J45186J59136J74218J91463K10844
61849F024578K31871K54766K80661L10520L44022L79788M16821M55437M96419
61840I194883N39381N82217O22105O56414O82364O96093O92648O67063O15521
$$ y = [4929530, 4897208, 4864215, 4831062, 4798644, 4767409, 4736650, 4705121, 4672215, 4638258, 4603971, 4570115, 4537513, 4506793, 4477704, 4448792, 4418157, 4385039, 4350781, 4317910, 4288014, 4260696, 4234781, 4209973, 4186624, 4164287, 4141608, 4117968, 4094469, 4072766, 4053407, 4035761, 4019201, 4003935, 3990861, 3980940, 3974590, 3971478, 3971043, 3973229, 3978410, 3986578, 3997150, 4009799, 4024978, 4043249, 4064550, 4088645, 4115985, 4147573, 4184118, 4225754, 4272558, 4324968, 4383729, 4449660, 4523320, 4604652, 4693228, 4789365, 4894914, 5012477, 5143731, 5288917, 5448053, 5622271, 5813734, 6024578, 6256449, 6511215, 6791876, 7102396, 7446418, 7826206, 8243027, 8698464, 9194883, 9734264, 10316481, 10938586, 11595000, 12277364, 12973457, 13666105, 14333168, 14948689]
61831A4948689N35879M28203K96066J47636n565j52573k86380m03596n01622n77693
61821A4429044o30950o63862o80288o82787o72842o52898o26521n96475n63846
61812H658575n29216m93594m57933m22761l88797l57143l28281l01568k76181
61803E103101k52207k30385k11076j93790j77563j61763j46784j33688j22749
61794C473096j12766j02560r2747q4677p7960p0709o2614n5788n1603m8435m4104
61783B669133l9139l5617l3487l0437k5441k0334j7162j5584j3893j1558r541
61772B416940q514p754n871k248K236N887P752Q575R906J2346J5097J7179J8439
61759B489970J9340K0348K1798K3760K5824K7542K9407L2672L7834M3807M9146
$$ y = [14948689, 15484568, 15912771, 16208837, 16356473, 16350908, 16198335, 15911955, 15508359, 15006737, 14429044, 13798094, 13134232, 12453944, 11771157, 11098315, 10445417, 9818896, 9222421, 8658575, 8129359, 7635765, 7177832, 6755071, 6366274, 6009131, 5680850, 5379282, 5103101, 4850894, 4620509, 4409433, 4215643, 4038080, 3876317, 3729533, 3595845, 3473096, 3360330, 3257770, 3165023, 3080346, 3002386, 2931677, 2869063, 2813275, 2761672, 2713237, 2669133, 2629994, 2594377, 2560890, 2530453, 2505012, 2484678, 2467516, 2451932, 2438039, 2426481, 2416940, 2408426, 2400672, 2394801, 2392553, 2394789, 2400676, 2408428, 2417003, 2426909, 2439255, 2454352, 2471531, 2489970, 2509310, 2529658, 2551456, 2575216, 2601040, 2628582, 2657989, 2690661, 2728495, 2772302, 2821448]
61748B821448N3507N7455O1420O5740P1283P8852Q7800R6222J02950J08839J15600
61737C721116J23887J33066J42551J52643J63834J75795J87522J98584K09971
61728E208969K23397K39645K57894K76908K96800L19210L45674L76185M09580
61719G954262M44997M82713N23881N69902O21770O79401P41427Q06241Q73432
61710A3698026R43668J016660J089530J157323J214512J255217J272383J257740
61702B2905059J203226J102600R52818P55613N18894K56205j5921k80858n23907
61693B6873729p34118r05909j038593j133602j192550j218362j216860j195393
61685A8238342j159720j113209j058638r99054r36595q72086q06854p43806o85557
$$ y = [2821448, 2874955, 2932410, 2993830, 3059570, 3130853, 3209705, 3297505, 3393727, 3496677, 3605516, 3721116, 3845003, 3978069, 4120620, 4273263, 4437097, 4612892, 4800414, 4998998, 5208969, 5432366, 5672011, 5929905, 6206813, 6503613, 6822823, 7168497, 7544682, 7954262, 8399259, 8881972, 9405853, 9975755, 10597525, 11276926, 12018353, 12824594, 13698026, 14641694, 15658354, 16747884, 17905207, 19119719, 20374936, 21647319, 22905059, 24108285, 25210885, 26163703, 26919316, 27438210, 27694415, 27678494, 27397636, 26873729, 26139611, 25233702, 24195109, 23061507, 21868957, 20650595, 19433735, 18238342, 17078622, 15965413, 14906775, 13907721, 12971126, 12099040, 11292186, 10548380, 9862823]
61676I862823o32058n81291n32118m85553m43159m05114l70214l37418l06920
61667E768978k79752k56420k36147k17620k00286j84557j70818j58816j48059
61658C916503j38214j28901j19677j10650j02512r5650q9652q4014p8723p3783
61648B894727o8833o3843n9515n6335n3710n0753m7441m4340m1811m0191l9974
61637B327981m0820m0961l9043l6127l4454l4472l4520l3454l1927l0712k9371
61626A942120k7341k5160k3764k3403k3805k4554k4774k3430k0619j7795j6091
61615A691384j5192j4263j3091j1742j0157q876r033j0734j2338j2420j1617j1447
61603A550474j2171j2995j3594j4051j3917j2862j1725j1422j1099r058n502k729
$$ y = [9862823, 9230765, 8649474, 8117356, 7631803, 7188644, 6783530, 6413316, 6075898, 5768978, 5489226, 5232806, 4996659, 4779039, 4578753, 4394196, 4223378, 4064562, 3916503, 3778289, 3649388, 3529711, 3419061, 3316549, 3220899, 3131247, 3047233, 2968510, 2894727, 2825894, 2762051, 2702536, 2646201, 2592491, 2541738, 2494297, 2449957, 2408146, 2367955, 2327981, 2287161, 2246200, 2207157, 2171030, 2136576, 2102104, 2067584, 2034130, 2002203, 1971491, 1942120, 1914779, 1889619, 1865855, 1842452, 1818647, 1794093, 1769319, 1745889, 1725270, 1707475, 1691384, 1676192, 1661929, 1648838, 1637096, 1626939, 1618063, 1609030, 1598296, 1585958, 1573538, 1561921, 1550474, 1538303, 1525308, 1511714, 1497663, 1483746, 1470884, 1459159, 1447737, 1436638, 1427580, 1422078, 1419349]
61591A419349k320l540m834n471n227l813j496N39J264P95j3m51k03N71J244J436
61575A397830J792L181M999N440L865J864J269J953K439K014J372J407J985J992
61561A433402M03k452m803n162m137l721m828o499p697q513r144q963p772o898
61547A353216p776r945j1519j1334r670p357n216m057m124m573m394l754l563
61534A265934l887l779k693j093N15K230M150N938P351Q544R605J0388J1100J2345
61520A326648J4156J5706J6515J7345J9183K1771K4006K5592K7381K9908L2499
61509A570710L4323L5628L7193L8917L9842L9709L9572M0381M1567M1655M0073
61498A999570L7830L6419L6483L7300L7241L5001L1002K7326K5601K5030K3353
$$ y = [1419349, 1417029, 1413489, 1408655, 1403184, 1397957, 1394144, 1392648, 1393187, 1394451, 1395246, 1395233, 1394782, 1394579, 1395150, 1396394, 1397830, 1399622, 1402803, 1407802, 1413242, 1417107, 1418971, 1420240, 1422193, 1424632, 1426646, 1428018, 1429425, 1431410, 1433402, 1433805, 1431353, 1426550, 1421388, 1417251, 1413530, 1408702, 1402203, 1394506, 1385993, 1376849, 1367886, 1360114, 1353216, 1345440, 1335495, 1323976, 1312642, 1302972, 1295615, 1290399, 1286342, 1282218, 1277645, 1273251, 1269497, 1265934, 1262047, 1258268, 1255575, 1254482, 1254997, 1257227, 1261377, 1267315, 1274666, 1283210, 1292815, 1303203, 1314303, 1326648, 1340804, 1356510, 1373025, 1390370, 1409553, 1431324, 1455330, 1480922, 1508303, 1538211, 1570710, 1605033, 1640661, 1677854, 1716771, 1756613, 1796322, 1835894, 1876275, 1917842, 1959497, 1999570, 2037400, 2073819, 2110302, 2147602, 2184843, 2219844, 2250846, 2278172, 2303773, 2328803, 2352156]
61487B352156J9687J5473J2396J0331P877M236j14m073o719p883q332r036r964
61474B376035j0129r104p721o749n694l697j000J571M199Q089J3764K0217K5932
61461B405713L0298L3925L8010M3392M9989N7096O4386P2212Q0779Q9685R8839
61450C064324J09143J21411J35031J48634J61875J75606J90479K06282K22611
61441D535396K39034K54398K66840K74893K77940K75475K66640K50732K27557
61432F868905J97129J59868J17366P2257K6994j6633n6770r1428j19787j42692
61422G015209j61064j74490j82172j84562j83023j78326j70637j60761j50028
61413E470146j38749j26007j11529r6725q2978o9700n5205l9284k3763j0270J499
$$ y = [2352156, 2371843, 2387316, 2399712, 2410043, 2417920, 2422156, 2422042, 2417969, 2411250, 2403367, 2395035, 2385999, 2376035, 2365906, 2356802, 2349081, 2342332, 2336638, 2332941, 2331941, 2333512, 2337711, 2345800, 2359564, 2379781, 2405713, 2436011, 2469936, 2507946, 2551338, 2601327, 2658423, 2722809, 2795021, 2875800, 2965485, 3064324, 3173467, 3294878, 3429909, 3578543, 3740418, 3916024, 4106503, 4312785, 4535396, 4774430, 5028828, 5295668, 5570561, 5848501, 6123976, 6390616, 6641348, 6868905, 7066034, 7225902, 7343268, 7415525, 7442519, 7425886, 7369116, 7277688, 7157901, 7015209, 6854145, 6679655, 6497483, 6312921, 6129898, 5951572, 5780935, 5620174, 5470146, 5331397, 5205390, 5093861, 4997136, 4914158, 4844458, 4789253, 4749969, 4726206, 4715936, 4717435]
61402D717435J2785K3794L3633M1945M9552N7157O4087O8981P1553P3020P4645
61391E288587P6251P6573P4911P2108O9762O8766O8746O8621O7427O4792O1137
61380F057681N7410N4247N1332M7943M3997L9986L5934L1290K6003K0740J5631
61369F482194R901L502k041n567q212j1834j6206j9468k1074k2400k4345k6231
61357F338219k7483k8532k9388k8916k6501k3117j9899j6938j4393j3370j4420
61346F095262j6406j8085j9721k1876k3696k4009k3308k2995k3144k2468k0048
61335E859506j5715r179k21J0460K2011L4727M9375O5519Q1954R8596J16482J35985
61323F449500J56313J76807J97464K18075K37909K56285K72411K84841K92112
$$ y = [4717435, 4730220, 4754014, 4787647, 4829592, 4879144, 4936301, 5000388, 5069369, 5140922, 5213942, 5288587, 5364838, 5441411, 5516322, 5588430, 5658192, 5726958, 5795704, 5864325, 5931752, 5996544, 6057681, 6115091, 6169338, 6220670, 6268613, 6312610, 6352596, 6388530, 6419820, 6445823, 6466563, 6482194, 6492095, 6495597, 6493556, 6487989, 6479777, 6467943, 6451737, 6432269, 6411195, 6388795, 6364450, 6338219, 6310736, 6282204, 6252816, 6223900, 6197399, 6174282, 6154383, 6137445, 6123052, 6109682, 6095262, 6078856, 6060771, 6041050, 6019174, 5995478, 5971469, 5948161, 5925166, 5902022, 5879554, 5859506, 5843791, 5834612, 5834391, 5844851, 5866862, 5901589, 5950964, 6016483, 6098437, 6197033, 6313515, 6449500, 6605813, 6782620, 6980084, 7198159, 7436068, 7692353, 7964764, 8249605, 8541717]
61314H541717K93775K89660K78528K58760K30221J94143J51705J04357N5225P996
61304A0406087l5950p7644j17619j54654j87667k16750k41654k61169k75032k84704
61294H553244k91218k93669k91145k84768k76559k67293k56661k44568k31047
61285F116316k15777j98871j81571j65068j49208j33295j17513j02532q8360p4518
61275D689603o0888m7490l3945k0074o680N086J4864K3079L0255L6946M3644N0079
61263D724479N5014N7513N8026N7738N7361N7081N6901N6318N4230N0079M4615
61252E329355L8907L3050K6662K0129J4394R724N387L94n816j3096k0494k6833
61240E411763l1883l6540m1520m6404n0387n3362n5751n7932o0222o2707o4622
$$ y = [8541717, 8835492, 9125152, 9403680, 9662440, 9892661, 10086804, 10238509, 10342866, 10398091, 10406087, 10370137, 10292493, 10174874, 10020220, 9832553, 9615803, 9374149, 9112980, 8837948, 8553244, 8262026, 7968357, 7677212, 7392444, 7115885, 6848592, 6591931, 6347363, 6116316, 5900539, 5701668, 5520097, 5355029, 5205821, 5072526, 4955013, 4852481, 4764121, 4689603, 4628715, 4581225, 4547280, 4527206, 4520526, 4525612, 4540476, 4563555, 4593810, 4630756, 4674400, 4724479, 4779493, 4837006, 4895032, 4952770, 5010131, 5067212, 5124113, 5180431, 5234661, 5284740, 5329355, 5368262, 5401312, 5427974, 5448103, 5462497, 5472221, 5477608, 5478002, 5472186, 5459090, 5438596, 5411763, 5379880, 5343340, 5301820, 5255416, 5205029, 5151667, 5095916, 5037984, 4977762, 4915055, 4850433]
61229D850433o4779o3243o1589o0713n9423n6277n1797m7584m4000m0284l6503
61218D264241l3696l2095l0710k8972k7582k7282k7760k8340k8917k9610k9908
61207C939369k8864k6131k2421j8642j4721r751l505K822Q069J2876J8876K6331
61195C884308L3979M1426N0046O0822P2681Q4040R4750J05345J15294J23272J28360
61184D794323J29919J27008J19134J06861R0470O8860M1121Q828k4477n5658q2976
61173E323413j05666j24013j39204j51610j59720j62257j60690j57947j54992
61164D007314j50520j43802j35801j27430j18550j09184j00082r1641q3549p5846
61154B870909o8947o2445n5382m8000m1750l6991l2311k6760k1263j6900j3055
$$ y = [4850433, 4785654, 4722411, 4660822, 4600109, 4540686, 4484409, 4432612, 4385028, 4341028, 4300744, 4264241, 4230545, 4198450, 4167740, 4138768, 4111186, 4083904, 4056144, 4027804, 3998887, 3969277, 3939369, 3910505, 3884374, 3861953, 3843311, 3828590, 3818839, 3815334, 3818156, 3826225, 3839101, 3857977, 3884308, 3918287, 3959713, 4009759, 4070581, 4143262, 4227302, 4322052, 4427397, 4542691, 4665963, 4794323, 4924242, 5051250, 5170384, 5277245, 5367715, 5436575, 5477696, 5486524, 5462047, 5406389, 5323413, 5217747, 5093734, 4954530, 4802920, 4643200, 4480943, 4320253, 4162306, 4007314, 3856794, 3712992, 3577191, 3449761, 3331211, 3222027, 3121945, 3030304, 2946755, 2870909, 2801962, 2739517, 2684135, 2636135, 2594385, 2557394, 2525083, 2498323, 2477060, 2460160, 2447105]
61143B447105q436l000K110N965Q377R619J0247J0737J0821R747P420M683K157
61130B517552l15k896n375p912j1125j4895j8055j9912k1152k2701k4582k6476
61118B342156k8310k9539k9019k6695k4471k4134k5182k5969k6279k7173k8672
61107B046713k9374k8668k7839k8377l0269l2517l4414l5532l5282l3492l1114
61096A699835k9448k8731k8140k7260k6699k7036k7774k8027k7796k7915k8824
61085A392185l0002l0649l0420k9397k7859k6121k4189k1600j8169j4888j3067
61074A125824j2460j1305q729n916m077k416N02M096O235O167N538O250Q424J0720
61060A128853J1737J0946R126Q069Q995J1134J2658J3043J3420J4427J4984J3911
$$ y = [2447105, 2438669, 2435669, 2437779, 2443744, 2452121, 2461740, 2471987, 2482724, 2493545, 2503292, 2510712, 2515395, 2517552, 2517237, 2514341, 2508966, 2501054, 2489929, 2475034, 2456979, 2437067, 2415915, 2393214, 2368632, 2342156, 2313846, 2284307, 2255288, 2228593, 2204122, 2179988, 2154806, 2128837, 2102558, 2075385, 2046713, 2017339, 1988671, 1960832, 1932455, 1902186, 1869669, 1835255, 1799723, 1764441, 1730949, 1699835, 1670387, 1641656, 1613516, 1586256, 1559557, 1532521, 1504747, 1476720, 1448924, 1421009, 1392185, 1362183, 1331534, 1301114, 1271717, 1243858, 1217737, 1193548, 1171948, 1153779, 1138891, 1125824, 1113364, 1102059, 1093330, 1087414, 1083337, 1080921, 1081423, 1085519, 1091754, 1097921, 1103459, 1109709, 1118133, 1128853, 1140590, 1151536, 1160662, 1168731, 1177726, 1188860, 1201518, 1214561, 1227981, 1242408, 1257392, 1271303]
61048A271303J1808J0354J0165J0155Q969O488L781J769J80j911m495o286o378
61035A315902n669n779o948p956p937p235o386n409m408m010m685o084p346p683
61021A228367o692m604k332p58nK81J50m71j178j392j213j196j466j707j723j268
61005A202793J29K166L131J747n99j134P78K997L761L697M179N309O482P569Q500
60990A251505Q754Q400Q769J0985J4316J6965J8089J8328J8804K0241K2836K6180
60978A444172K9458L1996L3597L4479L5280L7082M0614M5272M9546N2666N5306
60967A889468N8551O2808O7749P2724P7189Q1410Q6643R3923J02668J11318J19161
60956B823612J26727J34547J42619J50978J59802J68929J78249J88325J99822
$$ y = [1271303, 1283111, 1293465, 1303630, 1313785, 1322754, 1329242, 1333023, 1334792, 1334972, 1333061, 1328566, 1322280, 1315902, 1310233, 1304454, 1297506, 1289550, 1281613, 1274378, 1267992, 1262583, 1258175, 1254165, 1249480, 1243396, 1236050, 1228367, 1221675, 1217071, 1214739, 1213981, 1213976, 1214257, 1214407, 1213936, 1212758, 1211366, 1210153, 1208957, 1207491, 1205784, 1204061, 1202793, 1202922, 1205088, 1208219, 1209966, 1209367, 1208233, 1209011, 1212008, 1215769, 1219466, 1223645, 1228954, 1235436, 1243005, 1251505, 1260259, 1268659, 1277428, 1288413, 1302729, 1319694, 1337783, 1356111, 1374915, 1395156, 1417992, 1444172, 1473630, 1505626, 1539223, 1573702, 1608982, 1646064, 1686678, 1731950, 1781496, 1834162, 1889468, 1948019, 2010827, 2078576, 2151300, 2228489, 2309899, 2396542, 2490465, 2593133, 2704451, 2823612, 2950339, 3084886, 3227505, 3378483, 3538285, 3707214, 3885463, 4073788, 4273610]
60947D273610K12747K27225K44198K63913K84721L05271L27108L53052L83981
60938F875826M19873M62951N16311N80102O53102P37727Q38634R56155J087167
60929A3127848J234171J407150J614206J858336K146587K486186K850130L147048
60921B9871662L249291L073455K639011K049748J429119Q80718M90046L18513
60913D4001563L60163N06510N82715M44588N3968n25824j187227j824284k347725
60904D0064447k696372k856373k863283k772866k627667k450380k256671k060562
60896A9480273j868766j680807j497943j326634j172459j036248r17337q15336
60888I164743p27012o46614n71804n05490m49837m02298l59533l21383k88347
$$ y = [4273610, 4486357, 4713582, 4957780, 5221693, 5506414, 5811685, 6138793, 6491845, 6875826, 7295699, 7758650, 8274961, 8855063, 9508165, 10245892, 11084526, 12040681, 13127848, 14362019, 15769169, 17383375, 19241711, 21388298, 23874484, 26724614, 29871662, 33120953, 36194408, 38833419, 40883167, 42312286, 43193004, 43683050, 44001563, 44361726, 44868236, 45450951, 45895539, 45949507, 45423683, 44236456, 42412172, 40064447, 37368075, 34511702, 31648419, 28875553, 26247886, 23797506, 21540835, 19480273, 17611507, 15930700, 14432757, 13106123, 11933664, 10897416, 9980079, 9164743, 8437731, 7791117, 7219313, 6713823, 6263986, 5861688, 5502155, 5180772, 4892425]
60879D892425k58736k31462k08717j92447j80472j69312j58907j51052j44701
60870C196619j36691j26609j17402j10948j05917j00581r5169r0490q6168q1475
60860B145169p6647p2360o8626o4991o1339n7950n5101n2968n1608n0698m9499
60849A483382m7392m4482m1511l9049l6865l4319l1310k8474k6243k4305k2332
60838A107100k0654j9528j8434j6924j5648j5333j5139j3375r870o273l844k207
60826I49871p03L53M58R2L73J796L646M510L568J731J018K173L671M019L982M984
60810I85542O225N718L746K742L480L962K784J098J20q60k459l303k153l16J37
60795A006463n37m32J112L124M954O758Q353R144R239R321R544R542R367R460
$$ y = [4892425, 4633689, 4402227, 4193510, 4001063, 3820591, 3651279, 3492372, 3341320, 3196619, 3059928, 2933319, 2815917, 2704969, 2599052, 2498471, 2403302, 2312812, 2226644, 2145169, 2068522, 1996162, 1927536, 1862545, 1801206, 1743256, 1688155, 1635187, 1583579, 1532881, 1483382, 1435990, 1391508, 1349997, 1310948, 1274083, 1239764, 1208454, 1179980, 1153737, 1129432, 1107100, 1086446, 1066918, 1048484, 1031560, 1015912, 1000579, 985440, 972065, 962195, 955922, 952078, 949871, 949168, 949521, 949979, 950071, 950444, 952240, 955886, 960396, 963964, 965695, 966713, 968886, 972557, 976576, 980558, 985542, 991767, 997485, 1001231, 1003973, 1007453, 1011415, 1014199, 1015297, 1015417, 1014557, 1012098, 1008795, 1006642, 1006326, 1006463, 1005926, 1005494, 1006606, 1009730, 1014684, 1021442, 1029795, 1038939, 1048178, 1057499, 1067043, 1076585, 1085952, 1095412]
60781A095412R832J0079J0015R676R009Q222P861P987P838O954N952N333M404
60768A198574K511O88P37K941N767P646Q140P666P021P036P757Q128P183N242
60754A277037L354K035J336J511K466L071K234M70q39j513k686m851p058q426
60740A268141r281j0314j1419j1967j1764j1239j0907j0846j0564r493p849o708
60728A145790o770p293o915n309l392j984j023j00R79K340M099N981P402Q253
60714A142058R192J0793J2733J4158J4843J5477J6705J8166J8889J8592J8128
60703A309734J8382J9232J9943K0172J9904J8889J7016J5040J3855J3097J1597
60692A496861R323P615P122O821N690M243L383K847J718o7j722k607k528j659
$$ y = [1095412, 1105244, 1115323, 1125338, 1135014, 1144023, 1152245, 1160106, 1168093, 1175931, 1182885, 1188837, 1194170, 1198574, 1201085, 1201773, 1202510, 1205451, 1211218, 1218864, 1227004, 1234670, 1241691, 1248727, 1256484, 1264612, 1271795, 1277037, 1280391, 1282426, 1283762, 1285273, 1287739, 1290810, 1293044, 1293514, 1292675, 1291162, 1288476, 1283625, 1276567, 1268141, 1258860, 1248546, 1237127, 1225160, 1213396, 1202157, 1191250, 1180404, 1169840, 1160347, 1152498, 1145790, 1139020, 1131727, 1124812, 1119503, 1116111, 1114127, 1113104, 1113004, 1113983, 1116323, 1120422, 1126403, 1133805, 1142058, 1151250, 1162043, 1174776, 1188934, 1203777, 1219254, 1235959, 1254125, 1273014, 1291606, 1309734, 1328116, 1347348, 1367291, 1387463, 1407367, 1426256, 1443272, 1458312, 1472167, 1485264, 1496861, 1506184, 1513799, 1520921, 1527742, 1533432, 1537675, 1541058, 1543905, 1545623, 1545556, 1543834, 1541227, 1538699, 1537040]
60678A537040q68j459l758o540q455r435j0005j0155r791r515r834j0233j0077
60665A436915r766r939j0204r899r460r674r973q988o549l794j509K74J207P08
60651A349349o67j290m01J061J831J714J282J047J146J271Q04m39j770k557l137
60636A349244l978m422l575k197k164l898n786o415o107n722n226m296l450l645
60622A288363n118p273r417j1205j2583j3568j4118j4265j4455j5170j5968j5636
60610A139587j3963j2541j2705j3511j3108j1446r897q576o193k664J45R17M38
60597A036483M0K16J378M187P965J0374J0035Q267P036O389N316M019L665M386
60583A109756N107N034M217K972J851J764K973M353M673M349M787O264P562P705
$$ y = [1537040, 1536172, 1534713, 1530955, 1524415, 1515960, 1506525, 1496520, 1486365, 1476574, 1467059, 1457225, 1446992, 1436915, 1427149, 1417210, 1407006, 1397107, 1387647, 1377973, 1368000, 1359012, 1352463, 1348669, 1347160, 1347434, 1348641, 1349349, 1348682, 1347392, 1346991, 1348052, 1349883, 1351597, 1352879, 1353926, 1355072, 1356343, 1357147, 1356708, 1354938, 1352381, 1349244, 1345266, 1340844, 1337269, 1335072, 1332908, 1329010, 1323224, 1316809, 1310702, 1304980, 1299754, 1295458, 1292008, 1288363, 1283245, 1275972, 1266555, 1255350, 1242767, 1229199, 1215081, 1200816, 1186361, 1171191, 1155223, 1139587, 1125624, 1113083, 1100378, 1086867, 1073759, 1062313, 1052416, 1043840, 1037647, 1034983, 1035128, 1036045, 1036483, 1036523, 1036739, 1038117, 1042304, 1050269, 1060643, 1070678, 1078945, 1085981, 1092370, 1097686, 1101705, 1105370, 1109756, 1114863, 1119897, 1124114, 1127086, 1128937, 1130701, 1133674, 1138027, 1142700, 1147049, 1151836, 1158100, 1165662, 1173367]
60569A173367O969O249O294P537R802J2143J3746J4864J6232J7803J9036K0117
60557A324159K1699K3393K3854K2723K1474K1721K3420K5160K5492K3664J9795
60546A576554J5007J0764P402L767j183o820j1497j4442j6312j8030j9743k0998
60534A504469k1390k0926k0021j9169j8405j7239j5482j3985j3802j4451j3824
60523A315775j0524n859k627j956k251j648n39o90k316l351k042O40K068J039
60509A285719r76j693l62K006M203N941P511Q914R802J0138J0540J1629J3203
60496A366575J4327J4433J4131J4576J6057J7632J8481J9158K0817K3359K5365
60485A564911K6155K6895K8902L1747L4286L6879M0734M5032M6747M4118L8673
$$ y = [1173367, 1180336, 1186585, 1192879, 1200416, 1210218, 1222361, 1236107, 1250971, 1267203, 1285006, 1304042, 1324159, 1345858, 1369251, 1393105, 1415828, 1437302, 1459023, 1482443, 1507603, 1533095, 1556759, 1576554, 1591561, 1602325, 1609727, 1613494, 1612311, 1605491, 1593994, 1579552, 1563240, 1545210, 1525467, 1504469, 1483079, 1462153, 1442132, 1422963, 1404558, 1387319, 1371837, 1357852, 1344050, 1329599, 1315775, 1305251, 1299392, 1296765, 1294809, 1292558, 1290910, 1290371, 1289681, 1287365, 1284014, 1281972, 1282612, 1284680, 1285719, 1284743, 1283050, 1282688, 1284694, 1288897, 1294838, 1302349, 1311263, 1321065, 1331203, 1341743, 1353372, 1366575, 1380902, 1395335, 1409466, 1424042, 1440099, 1457731, 1476212, 1495370, 1516187, 1539546, 1564911, 1591066, 1617961, 1646863, 1678610, 1712896, 1749775, 1790509, 1835541, 1882288, 1926406, 1965079]
60474A965079L2658K6022J7518P598j853j0007j7237k3041k6031k6294k5723k5281
60462A893408k3734j9886j4417q519k336L913Q789J1288J2642J4662J7140J8747
60450A911697J9911K2630K7442L2720L7352M2311M8824N6609O4893P3774Q3521
60439B421684R3747J04512J17176J32638J49409J64885J78239J90833K04211K19292
60429C976626K37196K59009K84272L11235L38682L65455L87265L96263L85731
60420F941734L54134L02977K32628J43588M1526o2358j57467k38418l03344l50680
60410F904320l79911l93579l95753l89043l74821l55405l33609l10423k85444
60401C686332k59682k35694k14558j94835j75362j57172j41479j27516j13867
$$ y = [1965079, 1997737, 2023759, 2041277, 2048875, 2047022, 2037015, 2019778, 1996737, 1970706, 1944412, 1918689, 1893408, 1869674, 1849788, 1835371, 1826852, 1824516, 1828429, 1837218, 1848506, 1861148, 1875810, 1892950, 1911697, 1931608, 1954238, 1981680, 2014400, 2051752, 2094063, 2142887, 2199496, 2264389, 2338163, 2421684, 2515431, 2619943, 2737119, 2869757, 3019166, 3184051, 3362290, 3553123, 3757334, 3976626, 4213822, 4472831, 4757103, 5068338, 5407020, 5772475, 6159740, 6556003, 6941734, 7295868, 7598845, 7831473, 7975061, 8016587, 7954229, 7796762, 7558344, 7255000, 6904320, 6524409, 6130830, 5735077, 5346034, 4971213, 4615808, 4282199, 3971776, 3686332, 3426650, 3190956, 2976398, 2781563, 2606201, 2449029, 2307550, 2180034, 2066167]
60392B066167j00809q9677q0712p2982o5963n9742n4029m8339m3032l9039l6486
60381A375357l4549l2576l0439k7923k4948k2286k0851k0061j8270j5302j3167
60370A114985j3415j4803j4852j2968j0737r444q810q255q005q192p932o430m426
60357I86716l475l817l954k689o23R67J935L065M301M390K683M95JJ949M992P159
60341A004095P557O743N861N653N993O196N819N274N457O674Q105Q592P929P126
60327A097074P153P703P418N398K180p35k059j359Q82L320M207K691r5j831j377
60312A130570qJ96j125k294j795l5J421J789J558J342J108P57P09J379K473L433
60296A141478M315N616P297Q647R224R473J0143J1493J3140J4363J4514J3578
$$ y = [2066167, 1965358, 1875681, 1794969, 1721987, 1656024, 1596282, 1542253, 1493914, 1450882, 1411843, 1375357, 1340808, 1308232, 1277793, 1249870, 1224922, 1202636, 1181785, 1161724, 1143454, 1128152, 1114985, 1101570, 1086767, 1071915, 1058947, 1048210, 1038766, 1029956, 1021701, 1013696, 1005504, 997572, 991142, 986716, 983241, 979424, 975470, 972781, 972158, 973125, 975060, 978125, 982426, 986816, 989499, 989994, 989995, 991944, 996936, 1004095, 1011652, 1018395, 1024256, 1029909, 1035902, 1042098, 1047917, 1053191, 1058648, 1065322, 1073427, 1082019, 1089948, 1097074, 1104227, 1111930, 1119348, 1124746, 1126926, 1126191, 1124132, 1122773, 1123655, 1126975, 1131182, 1133873, 1133778, 1131947, 1130570, 1130562, 1130758, 1129633, 1127339, 1125544, 1125509, 1126930, 1128719, 1130277, 1131619, 1132727, 1133484, 1134193, 1135572, 1138045, 1141478, 1145793, 1151409, 1158706, 1167353, 1176577, 1186050, 1196193, 1207686, 1220826, 1235189, 1249703, 1263281]
60284A263281J2410J1906J1848J1150R262O735M220J848q8r04o46m81j038j212
60270A328291K31K572L980L956L460K828J250j416l868n053n442n950o589o983
60256A311267p332p909q197p463n923m546l890l795m053m639n171m810l086o30
60242A239823J196J553R28N50J044J881K186J678N91p39j727j528n3J367J262
60227A250012r4j092r90n92n44j79J435M171P132R520J0814J0907J0606J1116
60213A312222J2412J3001J2113J1174J2086J4648J6913J7759J7850J8088J8370
60202A476636J8231J7784J7521J7677J8251J9372K1355K4445K8565L3145L7265
60191A730247M0225M2186M4184M7424N2413N8563O4697P0222P5731Q2166Q9501
$$ y = [1263281, 1275691, 1287597, 1299445, 1310595, 1319857, 1326592, 1330812, 1332660, 1332572, 1331668, 1331022, 1330541, 1329503, 1328291, 1328522, 1331094, 1335074, 1339030, 1342490, 1345318, 1346568, 1345152, 1341284, 1336231, 1330789, 1324839, 1318250, 1311267, 1303935, 1296026, 1287829, 1280366, 1274443, 1269897, 1266007, 1262212, 1258159, 1253520, 1248349, 1243539, 1240453, 1239823, 1241019, 1242572, 1243500, 1244050, 1245094, 1246975, 1249161, 1250839, 1251430, 1250691, 1248964, 1247436, 1247383, 1248750, 1250012, 1249918, 1248826, 1247836, 1247244, 1246700, 1246521, 1247956, 1252127, 1259259, 1268779, 1279593, 1290500, 1301106, 1312222, 1324634, 1337635, 1349748, 1360922, 1373008, 1387656, 1404569, 1422328, 1440178, 1458266, 1476636, 1494867, 1512651, 1530172, 1547849, 1566100, 1585472, 1606827, 1631272, 1659837, 1692982, 1730247, 1770472, 1812658, 1856842, 1904266, 1956679, 2015242, 2079939, 2150161, 2225892, 2308058, 2397559]
60180B397559R6777J03483J10136J17310J24895J32781J41373J50443J57938J61217
60170C693912J59719J55625J51449J47379J41440J32028J19773J06605R3366P9035
60160D980331O2603M4986K8255J3275p21j4044k5262l2644l6132l6984l6005l2980
60148D914678k7622k0303j1770k506P573J9033L2250M6795O1753P6783R2153J07455
60136E296272J21097J31737J39690J46099J51014J52935J50119J41877J28914
60127F559754J12876R5448P7368N8470L8576J7856l676k5878m7225o5101p8298
60116F740170q8236r6495j02124j02920r8748r1793q3690p4126o2264m7963l1324
60105E860487j2692O396K3767L8716N2340O5232P6327Q4772R1201R5882R7014
$$ y = [2397559, 2494336, 2597819, 2707955, 2825265, 2950160, 3082941, 3224314, 3374757, 3532695, 3693912, 3853631, 4009256, 4160705, 4308084, 4449524, 4581552, 4701325, 4807930, 4901296, 4980331, 5042934, 5087920, 5116175, 5129450, 5128729, 5114685, 5089423, 5056779, 5020647, 4983663, 4947658, 4914678, 4887056, 4866753, 4854983, 4852477, 4860050, 4879083, 4911333, 4958128, 5019881, 5096664, 5188817, 5296272, 5417369, 5549106, 5688796, 5834895, 5985909, 6138844, 6288963, 6430840, 6559754, 6672630, 6768078, 6845446, 6903916, 6942492, 6960348, 6956672, 6930794, 6883569, 6818468, 6740170, 6651934, 6555439, 6453315, 6350395, 6251647, 6159854, 6076164, 6002038, 5939774, 5891811, 5860487, 5847795, 5854191, 5877958, 5916674, 5969014, 6034246, 6110573, 6195345, 6286546, 6382428, 6479442]
60094F479442R2790Q4381P4943O6018N6718M6415L6228K7417K0110J4564J2113
60083G011139J3535J7628K2880K9857M0263N4127O9707Q6211J04658J25475J47175
60072G722655J68595J90944K15899K42636K68704K93388L18263L44333L70499
60063A0135916L95312M18398M39126M55355M64938M67720M64694M55497M38008
60054A4134964M10489L73448L29221K80169K27251J70055J08169M2533k4624r0921
60044A5960754j54367k12972k64848l08856l44512l70962l87061l92712l89298
60035A3135166l78302l60473l36632l08246k76505k41878k05211j68166j31865
60026A0727888r6287o1803k9975j888K2813M3817N8686O5515O5861O2774N6777
$$ y = [6479442, 6572232, 6656613, 6731556, 6797574, 6854292, 6900707, 6936935, 6964352, 6984462, 6999026, 7011139, 7024674, 7042302, 7065182, 7095039, 7135302, 7189429, 7259136, 7345347, 7450005, 7575480, 7722655, 7891250, 8082194, 8298093, 8540729, 8809433, 9102821, 9421084, 9765417, 10135916, 10531228, 10949626, 11388752, 11844107, 12309045, 12776765, 13241459, 13696956, 14134964, 14545453, 14918901, 15248122, 15528291, 15755542, 15925597, 16033766, 16076299, 16051675, 15960754, 15806387, 15593415, 15328567, 15019711, 14675199, 14304237, 13917176, 13524464, 13135166, 12756864, 12396391, 12059759, 11751513, 11475008, 11233130, 11027919, 10859753, 10727888, 10631601, 10569798, 10539823, 10537935, 10560748, 10604565, 10663251, 10728766, 10794627, 10857401, 10914178]
60015A0914178M6162L0703J2412p285k8583n1164p3501r4970j16356j37374j55857
60004A0338365j70602j83137j95156k05861k13289k17004k17687k15103k08336
59995H512190j97691j84765j70632j55074j37627j18399r7852p6464n4711l2875
59985G286100j0807J1764L4684N7273P8655R8082J15133J29543J40592J46952
59975H087971J47801J43869J36468J25462J09354Q7713O2476L6261J0156j6245
59965H931286m3298p0447r6390j19567j38849j54031j65324j72430j74775j72521
59955G623654j66336j56261j42166j25446j08605r2339p4556n3337k9625n749
59945F669234J7472M0793O4647Q8754J12958J36989J59852J80671J99524K16031
$$ y = [10914178, 10960340, 10991043, 11003455, 10996170, 10967587, 10916423, 10842922, 10747952, 10631596, 10494222, 10338365, 10167763, 9984626, 9789470, 9583609, 9370320, 9153316, 8935629, 8720526, 8512190, 8314499, 8129734, 7959102, 7804028, 7666401, 7548002, 7450150, 7373686, 7318975, 7286100, 7275293, 7287057, 7321741, 7379014, 7457669, 7555751, 7670884, 7800427, 7941019, 8087971, 8235772, 8379641, 8516109, 8641571, 8750925, 8838638, 8901114, 8937375, 8947531, 8931286, 8887988, 8817541, 8721151, 8601584, 8462735, 8308704, 8143380, 7970950, 7796175, 7623654, 7457318, 7301057, 7158891, 7033445, 6924840, 6832501, 6757945, 6704608, 6674983, 6669234, 6686706, 6727499, 6792146, 6880900, 6993858, 7130847, 7290699, 7471370, 7670894, 7886925]
59935G886925K27881K32576K30327K23314K12160J95183J71550J43110J12163
59926I635189P9101M3585O794k9087o2896r4465j22766j45474j60836j69125j71936
59915H808084j70513j65036j55084j40466j21751j00289p7659n4875l2064q977
59905G781370J4263L6973N8394P8099R5867J11431J24506J34865J42134J45893
59895H723795J46480J45440J44298J42713J38555J30275J18688J05990R3568Q1634
59885I971436P0758O2780N9565O1157O5680P1400P8840R0534J08504J32345J60074
59874A0933073J90395K23334K58795K95614L32270L67649M00520M29003M51136
59865A3881789M65379M69934M62303M40353M03518L52336K87528K10676J25516
$$ y = [7886925, 8114806, 8347382, 8577709, 8801023, 9013183, 9208366, 9379916, 9523026, 9635189, 9714290, 9757875, 9764669, 9735582, 9672686, 9578221, 9455455, 9309981, 9149145, 8980020, 8808084, 8637571, 8472535, 8317451, 8176985, 8055234, 7954945, 7877286, 7822411, 7790347, 7781370, 7795633, 7832606, 7891000, 7969099, 8064966, 8176397, 8300903, 8435768, 8577902, 8723795, 8870275, 9015715, 9160013, 9302726, 9441281, 9571556, 9690244, 9796234, 9889802, 9971436, 10042194, 10104974, 10164539, 10225696, 10291376, 10362776, 10441616, 10532150, 10640654, 10772999, 10933073, 11123468, 11346802, 11605597, 11901211, 12233481, 12601130, 13001650, 13430653, 13881789, 14347168, 14817102, 15279405, 15719758, 16123276, 16475612, 16763140, 16973816, 17099332]
59856A7099332L7240m9787j33021k10435k79365l37087l81983m13766m33044m40941
59846A4457143m38785m27788m09175l84551l55566l23098k87425k49442k10883
59837A1370430j72715j34072r3836n2999j4245K0920N3342Q3966J11490J33387
59827A1305668J48394J56608J57383J48973J30612J03451O8724K6506k2422p4628
59817A2149269j25772j73875k19280k61537k98045l26148l45208l56255l60764
59808I682385l60264l55964l48008l35875l19931l01694k82216k61422k39609
59799F877402k18295j98463j79084j58675j37713j18206j01412q7181p5339o6255
59789E536779n9927n5503n2083m9308m7021m4916m2765m0613l8545l6545l4625
$$ y = [17099332, 17136572, 17086785, 16953764, 16743329, 16463964, 16126877, 15744894, 15331128, 14898084, 14457143, 14018358, 13590570, 13181395, 12796844, 12441278, 12118180, 11830755, 11581313, 11370430, 11197715, 11063643, 10969807, 10916808, 10902563, 10923483, 10976825, 11060791, 11172281, 11305668, 11454062, 11610670, 11768053, 11917026, 12047638, 12151089, 12219813, 12246319, 12223897, 12149269, 12023497, 11849622, 11630342, 11368805, 11070760, 10744612, 10399404, 10043149, 9682385, 9322121, 8966157, 8618149, 8282274, 7962343, 7660649, 7378433, 7117011, 6877402, 6659107, 6460644, 6281560, 6122885, 5985172, 5866966, 5765554, 5678373, 5603034, 5536779, 5476852, 5421349, 5369266, 5319958, 5272937, 5228021, 5185256, 5144643, 5106098, 5069553, 5034928]
59778E034928l3015l2254l3040l5520l8742m1387m3251m5382m8397n1535n3865
59767D578540n5503n6784n6940n4681m9815m3363l6508l0098k4808k0793j7417
59756D131830j4101j0958p822l231M292J4187K4292L3252M1349M9177N6828O4478
59744D383573P2230P9019Q3113Q4387Q4772Q5549Q5302Q1796P5125O7591O0856
59733E243313N4645M8527M3576M1360M1937M3971M6901N1978O0619P2343Q5164
59722E834334R7856J10935J25497J42087J61060J82877K07288K33135K59921K88906
59712G643896L21369L56206L90345M21090M46471M63138M65495M47889M07234
59703A1363133L43688K60408J63826O3266l1494j13295j78705k26790k57677k72412
$$ y = [5034928, 5001913, 4969659, 4936619, 4901099, 4862357, 4820970, 4777719, 4732337, 4683940, 4632405, 4578540, 4523037, 4466253, 4409313, 4354632, 4304817, 4261454, 4224946, 4194848, 4170040, 4149247, 4131830, 4117729, 4106771, 4098949, 4095718, 4100010, 4114197, 4138489, 4171741, 4213090, 4262267, 4319095, 4383573, 4455803, 4534822, 4617935, 4702322, 4787094, 4872643, 4957945, 5039741, 5114866, 5182457, 5243313, 5297958, 5346485, 5390061, 5431421, 5473358, 5517329, 5564230, 5616208, 5676827, 5749170, 5834334, 5932190, 6043125, 6168622, 6310709, 6471769, 6654646, 6861934, 7095069, 7354990, 7643896, 7965265, 8321471, 8711816, 9132906, 9579377, 10042515, 10508010, 10955899, 11363133, 11706821, 11967229, 12131055, 12194321, 12162827, 12049532, 11870827, 11644037, 11386360, 11113948]
59693A1113948k73601k65260k51159k33049k10792j84382j55369j25910r7026
59684I317400o8496m0092j2022J5691M3354P0999R8377J25616J53172J81104K09084
59673A0094187K37350K66836K98026L30398L63437L97670M34134M73203N14465
59664A3409706N57577O02783O50415P00014P50009P98476Q44366Q87713R28199
59655B0129258R63615R90221J004806J006330R95858R75495R47620R14867Q80404
59646B8808474Q47661Q19146P95490P76120P60739P49128P39188P26455P06507
59637C5728908O77105O37270N85695N21699M47065L65171K78688J89869J02808
59628C9534278K3068m5499j02028j46196j76137j89701j86372j66992j32563q4345
$$ y = [11113948, 10840347, 10575087, 10323928, 10090879, 9880087, 9695705, 9540336, 9414426, 9317400, 9248904, 9208812, 9196790, 9212481, 9255835, 9326834, 9425211, 9550827, 9703999, 9885103, 10094187, 10331537, 10598373, 10896399, 11226797, 11590234, 11987904, 12422038, 12895241, 13409706, 13967283, 14570066, 15220481, 15920495, 16670504, 17468980, 18313346, 19201059, 20129258, 21092873, 22083094, 23087900, 24094230, 25090088, 26065583, 27013203, 27928070, 28808474, 29656135, 30475281, 31270771, 32046891, 32807630, 33556758, 34295946, 35022401, 35728908, 36406013, 37043283, 37628978, 38150677, 38597742, 38962913, 39241601, 39431470, 39534278, 39557346, 39511847, 39409819, 39263623, 39087486, 38897785, 38711413, 38544421, 38411858, 38327513]
59618C8327513k4323M5342J22932K06951K95999L89176M85624N83038O77581P65610
59608D1875443Q44230R09282R54044R71215R55653R04223Q14068O82937N11748
59599D9422843L06171P5747j68025m13021o47254q59658j041222j186435j293857
59590D4195289j364906j402020j408418j388958j349725j296439j234612j171529
59582C3578682j116283j076513j055732j054050j069317j095926j124339j144886
59574B4841636j152501j146678j127690j095278j051067r99649r45593q90358
59566A6432822q33224p74402p15991o60041o06911n56052n07845m63758m24445
59557A0890153l88502l53938l20603k90061k63085k38547k15275j93657j74710
$$ y = [38327513, 38303190, 38348532, 38471464, 38678415, 38974414, 39363590, 39849214, 40432252, 41109833, 41875443, 42719673, 43628955, 44582999, 45554214, 46509867, 47414090, 48228158, 48911095, 49422843, 49729014, 49804761, 49636736, 49223715, 48576461, 47716803, 46675581, 45489146, 44195289, 42830383, 41428363, 40019945, 38630987, 37281262, 35984823, 34750211, 33578682, 32462399, 31385886, 30330154, 29276104, 28206787, 27110861, 25986522, 24841636, 23689135, 22542457, 21414767, 20319489, 19268422, 18268773, 17323180, 16432822, 15599598, 14825196, 14109205, 13449164, 12842253, 12286201, 11778356, 11314598, 10890153, 10501651, 10147713, 9827110, 9537049, 9273964, 9035417, 8820142, 8626485, 8451775]
59548H451775j58715j45794j36669j31534j29037j27804j28181j30909j34712
59539G228420j37067j37209j36624j36460j36084j34470j31390j26748j20199
59530F032169j12198j04195r6958q9523q0520o9899n8780m8187l8478k9518k0980
59519E282933j2791n352J128P417J4616K2703L0516L7194M2783M7381N0825N3458
59507E572811N6223N9666O3799O8972P5727Q3429R0503R6629J03467J12410J22948
59496F506584J34105J46213J59981J74892J89949K05291K21683K38931K56145
59487H233774K73110K90098L06602L21479L34158L44609L52463L57244L59022
59478A1172559L57418L50257L34872L10969K81031K47931K13528J79488J47439
$$ y = [8451775, 8293060, 8147266, 8010597, 7879063, 7750026, 7622222, 7494041, 7363132, 7228420, 7091353, 6954144, 6817520, 6681060, 6544976, 6410506, 6279116, 6152368, 6032169, 5919971, 5815776, 5718818, 5629295, 5548775, 5478876, 5420096, 5371909, 5333431, 5303913, 5282933, 5270142, 5264790, 5265918, 5273335, 5287951, 5310654, 5341170, 5378364, 5421147, 5468528, 5519353, 5572811, 5629034, 5688700, 5752499, 5821471, 5897198, 5980627, 6071130, 6167759, 6271226, 6383636, 6506584, 6640689, 6786902, 6946883, 7121775, 7311724, 7517015, 7738698, 7977629, 8233774, 8506884, 8796982, 9103584, 9425063, 9759221, 10103830, 10456293, 10813537, 11172559, 11529977, 11880234, 12215106, 12526075, 12807106, 13055037, 13268565, 13448053, 13595492]
59469A3595492J17533Q8399N9410L1920P478j3798l2013m5837n3391n4231m9279
59458A3651683l9287k4357m515K0078M8986Q0752J12904J43685J72902J99760
59448A4362591K20483K29839K24984K06245J74534J30046P4154J0513n7093j26725
59438A5449571j96906k64412l25049l76053m16400m45294m61996m67176m62958
59429A2033327m51179m32631m08337l80454l51108l21009k89910k57889k25528
59420H915282j93205j61004j29156r8006o7734l8553j0840J5599M2044O9597R7399
59409H441423J23269J46460J68472J90339K10280K25392K34879K39890K40521
59400A0220925K34934K21701K01100J73372J37684R4312M6307k869n2478j03229
$$ y = [13595492, 13713025, 13801424, 13860834, 13892754, 13900232, 13886434, 13854421, 13808584, 13755193, 13700962, 13651683, 13612396, 13588039, 13583524, 13603602, 13652588, 13733340, 13846244, 13989929, 14162831, 14362591, 14583074, 14812913, 15037897, 15244142, 15418676, 15548722, 15622876, 15633389, 15576296, 15449571, 15252665, 14988253, 14663204, 14287151, 13870751, 13425457, 12963461, 12496285, 12033327, 11582148, 11149517, 10741180, 10360726, 10009618, 9688609, 9398699, 9140810, 8915282, 8722077, 8561073, 8431917, 8333911, 8266177, 8227624, 8216784, 8232383, 8274427, 8344024, 8441423, 8564692, 8711152, 8879624, 9069963, 9280243, 9505635, 9740514, 9980404, 10220925, 10455859, 10677560, 10878660, 11052032, 11189716, 11284028, 11330335, 11327466, 11274988, 11171759]
59390A1171759j53559j99400k37806k68870k93788l12983l26695l35646l40014
59381H702998l39021l32564l22093l09162k94343k78387k62817k48127k32634
59372F083850k14878j96191j79205j64567j50804j36907j23085j09250r4824q0348
59362D633791o7569n7283m8364l9414l0235k1145j1920k153P979J7723K6073L1834
59350D439317L4097L2787K8515K2212J5617J1581J2407J7777K5426L3743M2432
59339D715911N0800N7363O1661O4791O7308O8280O7646O8059P2751Q2270R4698
59328E471538J08433J23368J39656J56866J74607J93138K13117K35090K59063
59319G074876K84235L09604L35291L62916L94062M28772M66012N05125N46120
$$ y = [11171759, 11018200, 10818800, 10580994, 10312124, 10018336, 9705353, 9378658, 9043012, 8702998, 8363977, 8031413, 7709320, 7400158, 7105815, 6827428, 6564611, 6316484, 6083850, 5868972, 5672781, 5493576, 5329009, 5178205, 5041298, 4918213, 4808963, 4714139, 4633791, 4566222, 4508939, 4460575, 4421161, 4390926, 4369781, 4357861, 4355708, 4363687, 4381410, 4407483, 4439317, 4473414, 4506201, 4534716, 4556928, 4572545, 4584126, 4596533, 4614310, 4639736, 4673479, 4715911, 4766711, 4824074, 4885735, 4950526, 5017834, 5086114, 5153760, 5221819, 5294570, 5376840, 5471538, 5579971, 5703339, 5842995, 5999861, 6174468, 6367606, 6580723, 6815813, 7074876, 7359111, 7668715, 8004006, 8366922, 8760984, 9189756, 9655768, 10160893, 10707013]
59310A0707013N88737O31815O73333P10704P41433P63999P77773P81926P75141
59301A7151874P56996P28948O93322O51868O05921N57211N07545M57919M08668
59292B2520272L60010L11509K61295K06756J46204P9470P121p0451j53285k41199
59282B3427702l32248m21756n04083n76117o38115o90671p32329p61375p78358
59273A7992650p84920p81185p66669p43288p15001o84173o50392o13171n73690
59264A1680161n33218m92008m50890m12094l76879l43647l10174k76858k46096
59255H238297k19003j94480j71394j49971j30542j12300r4354p7302o2669n0672
59245F975610l9374k6648j2524J069J2849K3520L4189M4502N3413O1131O8853
$$ y = [10707013, 11295750, 11927565, 12600898, 13311602, 14053035, 14817034, 15594807, 16376733, 17151874, 17908870, 18637818, 19331140, 19983008, 20588929, 21146140, 21653685, 22111604, 22520272, 22880282, 23191791, 23453086, 23659842, 23806046, 23885516, 23892637, 23822186, 23668901, 23427702, 23095454, 22673698, 22169615, 21593498, 20955383, 20264712, 19532383, 18771008, 17992650, 17207730, 16426545, 15659876, 14916588, 14201587, 13517414, 12867022, 12253851, 11680161, 11146943, 10654935, 10204045, 9791951, 9415072, 9071425, 8761251, 8484393, 8238297, 8019294, 7824814, 7653420, 7503449, 7372907, 7260607, 7166253, 7088951, 7026282, 6975610, 6936236, 6909588, 6897064, 6898133, 6910982, 6934502, 6968691, 7013193, 7066606, 7127737, 7196590]
59234G196590P6615Q2901Q6747Q8992R0780R1878R1472Q9807Q8078Q7182Q7475
59223H158517Q9322R2727R6501R8750R8574R6755R4560R2397R0020Q7738Q6837
59212I182698Q8470R2157R5596R6149R2413Q4332P2267N6701L8623J9245j078
59201I917573k2865m5874o8057q6964j01887j13869j23723j30777j33731j32201
59191H957625j27141j20058j12038j03292r3509q2621p1129n9589m8184l7140
59181H102924k7319j9569j3553q023k541J909M561O310Q637J1545J3912J5754
59169H094547J8831K4578L2639M2208N3780O8494Q6448J07014J30211J56391J84702
59158H999843K13529K42701K73620L06560L39191L68664L93814M13924M26378
$$ y = [7196590, 7273205, 7356106, 7442853, 7531845, 7622625, 7714503, 7805975, 7895782, 7983860, 8071042, 8158517, 8247839, 8340566, 8437067, 8535817, 8634391, 8731146, 8825706, 8918103, 9008123, 9095861, 9182698, 9271168, 9363325, 9458921, 9555070, 9647483, 9731815, 9804082, 9860783, 9899406, 9918651, 9917573, 9894708, 9848834, 9780777, 9693813, 9591926, 9478057, 9354334, 9223557, 9089826, 8957625, 8830484, 8710426, 8598388, 8495096, 8401587, 8318966, 8247837, 8188248, 8140064, 8102924, 8075605, 8056036, 8042483, 8034460, 8031919, 8033828, 8038389, 8044699, 8053336, 8064881, 8078793, 8094547, 8113378, 8137956, 8170595, 8212803, 8266583, 8335077, 8421525, 8528539, 8658750, 8815141, 8999843, 9213372, 9456073, 9729693, 10036253, 10375444, 10744108, 11137922, 11551846, 11978224]
59149A1978224M27282M14228L87104L46367K92079K25036J47811O3914k3529j11986
59139A4146530j98824k80714l53684m14114m60317m93163n14547n25318n25296
59130A0380553n15175m97476m75315m50857m25198l98964l72463l45666l18683
59121F580756k92162k67002k43735k22322k02359j83432j65444j48694j33507
59112D722099j19749j06933r4850q3854p4436o6530n9211n1125m1654l1806k3466
59101C968485j7410j2362o496M93P417J3307J8384K3478K9257L5945M3049M9417
59089D152964N4275N8315O2993O8696P4357P9009Q2823Q6266Q9126R1105R2749
59078D992678R4890R7203R8016R5829R0842Q4779P9208P4100O8252O1000N2972
$$ y = [11978224, 12405506, 12819734, 13206838, 13553205, 13845284, 14070320, 14218131, 14282045, 14258516, 14146530, 13947706, 13666992, 13313308, 12899194, 12438877, 11945714, 11431167, 10905849, 10380553, 9865378, 9367902, 8892587, 8441730, 8016532, 7617568, 7245105, 6899439, 6580756, 6288594, 6021592, 5777857, 5555535, 5353176, 5169744, 5004300, 4855606, 4722099, 4602350, 4495417, 4400567, 4316713, 4242277, 4175747, 4116536, 4065411, 4023757, 3991951, 3968485, 3951075, 3938713, 3932217, 3932710, 3940127, 3953434, 3971818, 3995296, 4024553, 4060498, 4103547, 4152964, 4207239, 4265554, 4328547, 4397243, 4471600, 4550609, 4633432, 4719698, 4808824, 4899929, 4992678, 5087568, 5184771, 5282787, 5378616, 5469458, 5554237, 5633445, 5707545, 5775797, 5836797, 5889769]
59067E889769M5019L7161K9312K2427J7928J6021J5522J5310J5263J5807J7532
59056F137071K1190K6990L3711L9716M5255N2506O2608P3813Q3749R2512J02151
59045F771272J13490J25209J36080J46667J58153J70673J83665J96911K09909
59036H212029K20607K26368K26588K23049K16707K05157J84747J54875J18642
59027I988769P9315L7911n131m7812q7743j24351j58183j88547k13657k32927
59017I047644k47514k58381k65412k68781k69729k69265k67215k63229k57797
59008F680321k51584k44539k36451k27695k18714k09287j98961j87956j77133
58999D728001j67367j59032j51563j43452j33509j22545j12871j05642r9589r3068
$$ y = [5889769, 5934788, 5971949, 6001261, 6023688, 6041616, 6057637, 6073159, 6088469, 6103732, 6119539, 6137071, 6158261, 6185251, 6218962, 6258678, 6303933, 6356439, 6419047, 6492860, 6576609, 6669121, 6771272, 6884762, 7009971, 7146051, 7292718, 7450871, 7621544, 7805209, 8002120, 8212029, 8432636, 8659004, 8885592, 9108641, 9325348, 9530505, 9715252, 9870127, 9988769, 10068084, 10105995, 10100864, 10053052, 9965309, 9840958, 9682775, 9494228, 9280571, 9047644, 8800130, 8541749, 8276337, 8007556, 7737827, 7468562, 7201347, 6938118, 6680321, 6428737, 6184198, 5947747, 5720052, 5501338, 5292051, 5093090, 4905134, 4728001, 4560634, 4401602, 4250039, 4106587, 3973078, 3850533, 3737662, 3632020, 3532431, 3439363]
58989C439363q6326q0567p5550o9731o2727n6183n1761m9280m7456m5593m3783
58978B770406m1957l9849l7933l7445l8886m0999m1898m1069l9582l8456l7595
58967B334737l6436l4698l2122k8416k4102k0536j8256j6163j3432j1292j1302
58956B087982j2429j1816q521m669k471j755j307r57j224j860j980j106P18L169
58942B041774N351N986M851L452L359M330M946M741M712N749P363Q306Q049P417
58928B120386P736R426J1604J3265J4461J5783J7025J7393J7009J7092J8347K0067
58916B299594K1240K1668K1660K1503K1749K3136K5535K7692K8652K8855K9364
58905B570648L0629L2472L4636L6786L8499L9684M0593M1315M1920M3081M5425
$$ y = [3439363, 3353037, 3272470, 3196920, 3127189, 3064462, 3008279, 2956518, 2907238, 2859782, 2814189, 2770406, 2728449, 2688600, 2650667, 2613222, 2574336, 2533337, 2491439, 2450370, 2410788, 2372332, 2334737, 2298301, 2263603, 2231481, 2203065, 2178963, 2158427, 2140171, 2124008, 2110576, 2099284, 2087982, 2075553, 2063737, 2055216, 2050547, 2048076, 2046321, 2045014, 2044057, 2042833, 2040973, 2038993, 2037887, 2038605, 2041774, 2047125, 2053111, 2057962, 2061414, 2064773, 2069103, 2074049, 2078790, 2083502, 2089251, 2096614, 2104920, 2112969, 2120386, 2128122, 2137548, 2149152, 2162417, 2176878, 2192661, 2209686, 2227079, 2244088, 2261180, 2279527, 2299594, 2320834, 2342502, 2364162, 2385665, 2407414, 2430550, 2456085, 2483777, 2512429, 2541284, 2570648, 2601277, 2633749, 2668385, 2705171, 2743670, 2783354, 2823947, 2865262, 2907182, 2950263, 2995688]
58894B995688M8135M9616N0008N1556N5662O0893O4997O7552O9490P1331P3460
58883C658388P7034Q2654Q8708R2871R5128R7788J02583J09098J16188J23539
58873D643979J31564J40720J51280J63037J75165J86972J98751K11234K24468
58864F227170K38077K52577K69383K89170L10782L32240L52725L73593L97286
58855I043003M24879M54729M84340N13629N45193N80836O19038O56835O93029
58846A4015511P28180P62244P93859Q21491Q43613Q57665Q60236Q48581Q21093
58837B1352473P76331P12750O29853N28946M12681K84468J48336Q725j29819k62634
58827B4462110l85165m93935n87068o63475p22088p62728p87223p98658p99475
$$ y = [2995688, 3043823, 3093439, 3143447, 3195003, 3250665, 3311558, 3376555, 3444107, 3513597, 3584928, 3658388, 3735422, 3818076, 3906784, 3999655, 4094783, 4192571, 4295154, 4404252, 4520440, 4643979, 4775543, 4916263, 5067543, 5230580, 5405745, 5592717, 5791468, 6002702, 6227170, 6465247, 6717824, 6987207, 7276377, 7587159, 7919399, 8272124, 8645717, 9043003, 9467882, 9922611, 10406951, 10920580, 11465773, 12046609, 12665647, 13322482, 14015511, 14743691, 15505935, 16299794, 17121285, 17964898, 18822563, 19682799, 20531380, 21352473, 22128804, 22841554, 23471407, 24000353, 24413034, 24697502, 24845838, 24854563, 24724744, 24462110, 24076945, 23583010, 22995942, 22332467, 21610379, 20847651, 20060428, 19261770, 18462295]
58818A8462295p90878p73669p49046p18916o85992o52886o20366n87103n52115
58809A2331324n16839m83887m54408m27799m03262l80362l58488l37272l17186
58800H651821k98601k80626k62238k44061k27486k12298j96841j80433j64128
58791F585109j49038j35356j22908j11153r8754q4852p0792n8738m8428l7364
58781E667726k4609j2242k074P072J7357K8701L9246M8110N6255O5095P5491Q7594
58769F053722J00667J13365J25059J36636J49333J63193J77343J91419K05984
58760G416721K21763K39150K58313K79090L00829L22929L45676L70260L97691
58751A0152422M27891M60019M93564N28715N65486O02974O40142O77028P13968
$$ y = [18462295, 17671417, 16897748, 16148702, 15429786, 14743794, 14090908, 13470542, 12883439, 12331324, 11814485, 11330598, 10876190, 10448391, 10045129, 9664767, 9306279, 8969007, 8651821, 8353220, 8072594, 7810356, 7566295, 7338809, 7126511, 6929670, 6749237, 6585109, 6436071, 6300715, 6177807, 6066654, 5967900, 5883048, 5812256, 5753518, 5705090, 5667726, 5643117, 5630875, 5628801, 5635873, 5653230, 5681931, 5721177, 5769287, 5825542, 5890637, 5966128, 6053722, 6154389, 6267754, 6392813, 6529449, 6678782, 6841975, 7019318, 7210737, 7416721, 7638484, 7877634, 8135947, 8415037, 8715866, 9038795, 9384471, 9754731, 10152422, 10580313, 11040332, 11533896, 12062611, 12628097, 13231071, 13871213, 14548241, 15262209]
58742A5262209P49462P80032Q02825Q16983Q21491Q13116P88206P45641O86176
58733B2266141O09492N14217M01104K74301J38919r05j41009k75946m00157n09954
58723B2876203o03724o80900p41270p84891q12361q25272q26274q18079q02540
58714A5980892p81157p55814p28111o98488o67056o34802o02732n70469n37297
58705A0004966n04122m72695m43133m14230l86019l59895l36053l13107k90755
58696F484957k70500k52926k36381k19605k03622j89747j77345j65042j52708
58687D617081j41039j30354j21033j13812j08377j02940r6404q9743q4040p8650
58677C550689p2809o7603o4477o2752o0513n7222n3832n0937m8519m6882m6048
$$ y = [15262209, 16011671, 16791703, 17594528, 18411511, 19233002, 20046118, 20834324, 21579965, 22266141, 22875633, 23389850, 23790954, 24065255, 24204174, 24203269, 24062260, 23786314, 23386157, 22876203, 22272479, 21591579, 20850309, 20065418, 19253057, 18427785, 17601511, 16783432, 15980892, 15199735, 14443921, 13715810, 13017322, 12350266, 11715464, 11112732, 10542263, 10004966, 9500844, 9028149, 8585016, 8170786, 7784767, 7424872, 7088819, 6775712, 6484957, 6214457, 5961531, 5725150, 5505545, 5301923, 5112176, 4934831, 4769789, 4617081, 4476042, 4345688, 4224655, 4110843, 4002466, 3899526, 3803122, 3713379, 3629339, 3550689, 3477880, 3410277, 3345800, 3283048, 3222535, 3165313, 3111481, 3060544, 3012025, 2965143, 2919095]
58666B919095m4715m1662l8018l6343l7375l9273m0189m0198m0328m1190m2982
58655B476822m5652m8435m9994m9750m8625m8070m8525m9002m7981m4833m0632
58644A955323l7363l6006l5650l4780l3033l1203l0000k9436k9121k8475k6899
58633A603357k4377k1816k0251j9821j9892k0036k0291k0692k1004k1011k0731
58622A373435k0364j9984j9135j6895j2914q454n606n136n606m921k251J629N124
58609A258922O830O672O330P557R834J0854R641P672O281M681J929q17j917j984
58595A332485k897m638n318m278l064k975l418l201j870P25M623Q626J0577R975
58581A335352R224J0913J4670J8094K0130K1784K3815K5661K7118K9355L3139
$$ y = [2919095, 2874380, 2832718, 2794700, 2758357, 2720982, 2681709, 2641520, 2601322, 2560994, 2519804, 2476822, 2431170, 2382735, 2332741, 2282991, 2234366, 2186296, 2137771, 2088769, 2040788, 1995955, 1955323, 1917960, 1881954, 1846304, 1811524, 1778491, 1747288, 1717288, 1687852, 1658731, 1630256, 1603357, 1578980, 1557164, 1536913, 1517092, 1497200, 1477164, 1456873, 1436181, 1415177, 1394166, 1373435, 1353071, 1333087, 1313952, 1297057, 1284143, 1275689, 1270083, 1264947, 1259341, 1254420, 1252169, 1253798, 1258922, 1265752, 1272424, 1278754, 1286311, 1296145, 1306999, 1316640, 1324312, 1330593, 1335274, 1337203, 1336386, 1334469, 1332485, 1329588, 1324950, 1319632, 1315354, 1312290, 1309315, 1305897, 1302696, 1300826, 1301551, 1306174, 1314800, 1325377, 1335352, 1344576, 1355489, 1370159, 1388253, 1408383, 1430167, 1453982, 1479643, 1506761, 1536116, 1569255]
58570A569255L7310M0322M2445M4995M7984N0367N2440N6064O1982O8545P4031
58559B145740P8792Q4097R0097R6285J03053J11325J21214J32286J44511J57767
58549C265167J70966J82987J93994K04629K14478K22748K29719K35857K39718
58540E160263K38346K29607K12917J88332J56680J20161Q0886L9006n761n1048
58530F369389r2374j26936j55008j77647j95083k07429k14929k17252k14392k08202
58520D560137k00920j92324j80693j66400j51904j38369j25294j13480j04712
58511C186041r8022r0216q1075p4110p0666o7524o2422n7728n5658n3851m9556
58500B425213m4892m3634m5065m5375m3526m1546m0189l8364l6261l5303l5262
$$ y = [1569255, 1606565, 1646887, 1689332, 1734327, 1782311, 1832678, 1885118, 1941182, 2003164, 2071709, 2145740, 2224532, 2308629, 2398726, 2495011, 2598064, 2709389, 2830603, 2962889, 3107400, 3265167, 3436133, 3619120, 3813114, 4017743, 4232221, 4454969, 4684688, 4920545, 5160263, 5398609, 5628216, 5841133, 6029465, 6186145, 6306306, 6387192, 6426198, 6420437, 6369389, 6277015, 6150079, 5995071, 5817424, 5622341, 5414912, 5199983, 4982731, 4768339, 4560137, 4359217, 4166893, 3986200, 3819800, 3667896, 3529527, 3404233, 3290753, 3186041, 3088019, 2997803, 2916728, 2842618, 2771952, 2704428, 2642006, 2584278, 2528620, 2474769, 2425213, 2380321, 2336687, 2291622, 2246247, 2202721, 2161175, 2120986, 2082622, 2046361, 2011058, 1975796]
58489A975796l4594l3364l2914l3065l2588l1889l2252l2790l1359k8384k6666
58478A625931k7289k8466k8637k8005k6753k4446k1647j9778j8950j7995j6808
58467A367157j6403j6579j5896j4189j2843j2200j1165r747r614j1278j2926j2895
58455A211422j1521r786p909o117n246n601o352o638o260n112l165j227m47p77
58441A135264j076r24j154k443m366o037o783o351n214m368m183m155m355n825
58427A078030q434r991r176p735p746q273p236n189m266m404l842k644k529l413
58413I93152l437k463k287l179l304k164j574k534l774m197m341m625m487l827
58399I46959l264k700j691j169k309l782l020k82J606J721J990L282M163M294
$$ y = [1975796, 1941202, 1907838, 1874924, 1841859, 1809271, 1777382, 1745130, 1712340, 1680981, 1652597, 1625931, 1598642, 1570176, 1541539, 1513534, 1486781, 1462335, 1440688, 1420910, 1401960, 1383965, 1367157, 1350754, 1334175, 1318279, 1304090, 1291247, 1279047, 1267882, 1258135, 1248521, 1237243, 1224317, 1211422, 1199901, 1190115, 1182206, 1176089, 1170843, 1165242, 1158890, 1152252, 1145992, 1140880, 1137715, 1136488, 1136041, 1135264, 1134188, 1133264, 1132110, 1129667, 1125301, 1119264, 1112481, 1106130, 1100916, 1096548, 1092365, 1088210, 1083855, 1078030, 1069596, 1059605, 1050429, 1042694, 1034948, 1026675, 1019439, 1014250, 1009984, 1005580, 1001738, 999094, 996565, 993152, 989715, 987252, 984965, 981786, 978482, 976318, 974744, 972210, 968436, 964239, 959898, 955273, 950786, 946959, 943695, 940995, 939304, 938135, 935826, 932044, 929024, 928742, 930348, 932069, 934059, 937341, 941504, 945798]
58385I45798N442P796Q845P681P016Q859J1128J0932Q707O720N618M715L987L577
58371A046821K785J323K29J28l0j177k725m053n556p059p127n359l490k841k594
58356A009275j910j706k686l496k628o52J085K423L625M265M274M635N640O147
58342A028291N774O092Q122J0471J1491J1639J2032J2281J1399R647P989P039
58330A142267P476R937J3196J4403J2535R907Q927R219R380R505J0024J0002Q666
58317A275444P192O898P029O250N093M915N502N581N031M819N392O325P065P089
58303A359625O195N203N295O260O804O939Q043J0053J0853R532P979P957Q711
58290A459449Q786Q208P564O819O267O722P749P760O826O946Q536R348Q142O588
$$ y = [945798, 951240, 959036, 967881, 975562, 982578, 991437, 1002565, 1013497, 1022204, 1028924, 1034542, 1039257, 1043244, 1046821, 1049606, 1050929, 1051158, 1051286, 1051256, 1050079, 1047354, 1043301, 1037745, 1030686, 1023559, 1018200, 1014710, 1011869, 1009275, 1007365, 1005659, 1002973, 999477, 996849, 996197, 997282, 999705, 1003330, 1007595, 1011869, 1016504, 1022144, 1028291, 1034065, 1040157, 1048279, 1058750, 1070241, 1081880, 1093912, 1106193, 1117592, 1127239, 1135228, 1142267, 1149743, 1159680, 1172876, 1187279, 1199814, 1209721, 1218648, 1227867, 1237247, 1246752, 1256776, 1266778, 1275444, 1282636, 1289534, 1296563, 1302813, 1307906, 1312821, 1318323, 1323904, 1328935, 1333754, 1339146, 1345471, 1352536, 1359625, 1365820, 1371023, 1376318, 1382578, 1389382, 1396321, 1404364, 1414417, 1425270, 1434802, 1442781, 1450738, 1459449, 1468235, 1476443, 1484007, 1490826, 1497093, 1503815, 1511564, 1519324, 1526150, 1533096, 1541632, 1550980, 1559122, 1565710]
58276A565710O122N997O012P899J1830J4764J4735J3889J4720J6210J6551J6744
58264A711183J8354K0197K0624K0875K2806K5324K6355K6553K7699K9028K8519
58253A977517K6572K5274K5107K5183K5620K6980K8374K8643K8434K8927K9706
58242B276337K9869K9916L0631L1719L3110L5607L8608L9710L8515L8072M0319
58231B662413M3149M4537M6299N0464N4891N6295N5261N4739N5654N7236N9564
58220C240502O2467O4092O3817O4374O7957P2642P5846P8657Q3306Q9013R3988
58209D056661R8958J05164J11462J16899J23350J32010J40359J46349J52345J60938
58199E344495J70311J78016J85721J95569K05410K12672K19591K29414K40875
$$ y = [1565710, 1571832, 1577829, 1583841, 1591740, 1603570, 1618334, 1633069, 1646958, 1661678, 1677888, 1694439, 1711183, 1729537, 1749734, 1770358, 1791233, 1814039, 1839363, 1865718, 1892271, 1919970, 1948998, 1977517, 2004089, 2029363, 2054470, 2079653, 2105273, 2132253, 2160627, 2189270, 2217704, 2246631, 2276337, 2306206, 2336122, 2366753, 2398472, 2431582, 2467189, 2505797, 2545507, 2584022, 2622094, 2662413, 2705562, 2750099, 2796398, 2846862, 2901753, 2958048, 3013309, 3068048, 3123702, 3180938, 3240502, 3302969, 3367061, 3430878, 3495252, 3563209, 3635851, 3711697, 3790354, 3873660, 3962673, 4056661, 4155619, 4260783, 4372245, 4489144, 4612494, 4744504, 4884863, 5031212, 5183557, 5344495, 5514806, 5692822, 5878543, 6074112, 6279522, 6492194, 6711785, 6941199, 7182074]
58190G182074K51570K63160K77669K92426L04720L17941L36679L59187L81051
58181I966477M02921M27843M54222M78538N02058N27987N55206N81848O11738
58172A4508838O50011O95473P44314P97591Q57785R22187R87593J057143J134407
58163B2355342J215671J296480J380131J470384J562493J652462J748671J862391
58155C4544025J993235K136605K297977K484909K691790K908749L139669L395350
58147E5592309L676781L984122M334979M753351N248041N823028O498557P296265
58139I7207433Q215767R258253J0462354J1879794J3527318J5405164J7545061
58132A83501144J9979311K2677013K5585490K8691855L1844470L4389023L5111909
$$ y = [7182074, 7433644, 7696804, 7974473, 8266899, 8571619, 8889560, 9226239, 9585426, 9966477, 10369398, 10797241, 11251463, 11730001, 12232059, 12760046, 13315252, 13897100, 14508838, 15158849, 15854322, 16598636, 17396227, 18254012, 19176199, 20163792, 21220935, 22355342, 23571013, 24867493, 26247624, 27718008, 29280501, 30932963, 32681634, 34544025, 36537260, 38673865, 40971842, 43456751, 46148541, 49057290, 52196959, 55592309, 59269090, 63253212, 67588191, 72341542, 77589583, 83412611, 89911168, 97207433, 105423200, 114681453, 125143807, 137023601, 150550919, 165956083, 183501144, 203480455, 226157468, 251742958, 280434813, 312279283, 346668306, 381780215]
58125C81780215L2790375K6939906J8090361P475230l425479j3192322k0736405
58118D29721881k5595258k8004811k8592364k7965191k6552671k4678592k2603850
58111B45729144k0481144j8366709j6303665j4331986j2416151j0466071q502021
58104A44861397o759085n560408n078185n227729n755893o383289o882977p110214
58096I6103617p027030o703125o262137n804270n369628m959653m573136m215035
58088E1189603l884722l573352l274871k990564k721359k464556k221784k002124
58080B8056271j811847j646492j498016j364316j246419j141773j046944r63268
58072A7337196q93439q34993p82594p34287o90585o49987o10443n72925n38853
$$ y = [381780215, 414570590, 441510496, 459600857, 467076087, 463650608, 450458286, 429721881, 404126623, 376121812, 347529448, 319564257, 293011586, 268332994, 245729144, 225248000, 206881291, 190577626, 176245640, 163829489, 153363418, 144861397, 138102312, 132541904, 127463719, 122235990, 116480097, 110096808, 103213831, 96103617, 89076587, 82373462, 76111325, 70307055, 64937427, 59977774, 55404638, 51189603, 47304881, 43731529, 40456658, 37466094, 34744735, 32280179, 30058395, 28056271, 26244424, 24597932, 23099916, 21735600, 20489181, 19347408, 18300464, 17337196, 16443757, 15608764, 14826170, 14091883, 13401298, 12751311, 12140868, 11567943, 11029090]
58063A1029090n06334m73236m41530m14293l91063l70292l53244l40856l29815
58054G408427l16708l03164k92024k81552k68777k55475k44993k35735k23967
58045D986032k10869k00390j91869j81243j68485j57453j48893j39818j29589
58036C457423j20858j14313j07942j01711r7710r5358r1580q6168q2077p9865
58026B479841p6780p2093o8495o7032o5121o0978n6067n1859m7847m4039m1908
58015A827622m1591m1202l9906l8773l7855l5637l2209k9823k9322k8925k7401
58004A444978k5729k4641k3357k1664k0690k0708k0512j9690j9145j8851j7548
57993A212443j5264j3709j3520j3494j3022j2827j2814j1733r742q756r422r983
$$ y = [11029090, 10522756, 10049520, 9607990, 9193697, 8802634, 8432342, 8079098, 7738242, 7408427, 7091719, 6788555, 6496531, 6214979, 5946202, 5690727, 5445734, 5209999, 4986032, 4775163, 4574773, 4382904, 4201661, 4033176, 3875723, 3726830, 3587012, 3457423, 3336565, 3222252, 3114310, 3012599, 2914889, 2819531, 2727951, 2641783, 2559706, 2479841, 2403061, 2330968, 2262473, 2195441, 2130320, 2069342, 2013275, 1961416, 1913569, 1869530, 1827622, 1786031, 1744829, 1704923, 1666150, 1628295, 1592658, 1560449, 1530626, 1501304, 1472379, 1444978, 1419249, 1394608, 1371251, 1349587, 1328897, 1308189, 1287677, 1267987, 1248842, 1229991, 1212443, 1197179, 1183470, 1169950, 1156456, 1143434, 1130607, 1117793, 1106060, 1096318, 1087562, 1078140, 1068157]
57981A068157r073p401n949m553l193k622k919l148l079l482m330m624m487n235
57967A004062o917p842p293o651p000p526p203o373n812n680o040p065q206q552
57953I05902q273q287q586q494q550r919j1865j2071r998p742o884o628n850m910
57939G87845m423m049l586l724m634n167m257j932J496N695R204R779O848K381
57925G91476j338l607m567m237l078k130j728j209n00o49k090l729m432m409m361
57910G49412m308l907l132k192j535j940l628n371n735n169n380o671p592p409
57896F85443p032p034o564n068l537l156l849m771n210m626k931j020J53R93K315
57881F34106L216J991o65j741j9K085J985K28j067j417j926l226n018o842q095
$$ y = [1068157, 1059084, 1051683, 1045734, 1041181, 1037988, 1035366, 1032447, 1029299, 1026220, 1022738, 1018408, 1013784, 1009297, 1004062, 997145, 989303, 982010, 975359, 968359, 960833, 953630, 947257, 941445, 935765, 929725, 922660, 914454, 905902, 897629, 889342, 880756, 872262, 863712, 853793, 841928, 829857, 819859, 812117, 805233, 798605, 792755, 787845, 783422, 779373, 775787, 772063, 767429, 762262, 758005, 756073, 757569, 763264, 772468, 782247, 789095, 791476, 790138, 786531, 781964, 777727, 774649, 772519, 770791, 769582, 769082, 768433, 766343, 762614, 758182, 753773, 749412, 745104, 741197, 738065, 735873, 734338, 732398, 728770, 723399, 717664, 712495, 707115, 700444, 692852, 685443, 678411, 671377, 664813, 659745, 656208, 653052, 649203, 644432, 639222, 634596, 631665, 630645, 630798, 631791, 634106, 637322, 639313, 638648, 636907, 636888, 638973, 640958, 641186, 640119, 638702, 636776, 633550, 628532, 621690, 613595]
57866F13595q040o907o330p552r695j0648r289o358l561k180k121k107j168K86
57852E37925J460K548L917M710M088L342M536P078Q172O956N570N387M903K783
57838F03375M35k84L2l00j335k168k929m129m980m328k721j914k722m526o365
57823E65141p465p348o396n653n323m417k603j114q22q30k45Q7p06j471n53J502
57807E21784K805L020L428M476N248N245M991M768M249L492K995K628J773N95
57793E71497o0j45o25j929l281l942m297n208o807q296q764q212p806q666j0159
57778D93300j0119p548m361l350m827o474o403n127m273m508n278n899o194o334
57764D12605o553o958p445p805p969q107q377q611q350p358o142n540n635n459
$$ y = [613595, 605555, 598648, 592318, 584766, 575071, 564423, 555134, 548776, 545215, 543035, 540914, 538807, 537639, 537925, 539385, 541933, 545850, 550560, 554648, 557990, 562526, 569604, 577776, 584732, 590302, 595689, 600592, 603375, 603810, 603526, 603558, 603258, 601923, 599755, 596826, 592697, 587717, 583389, 580668, 578754, 576032, 571506, 565141, 557676, 550328, 543932, 538279, 532956, 528539, 525936, 524822, 524000, 523170, 522925, 523012, 522306, 520835, 520282, 521784, 524589, 527609, 531037, 535513, 540761, 546006, 550997, 555765, 560014, 563506, 566501, 569129, 570902, 571497, 571437, 571292, 570667, 568738, 565457, 561515, 557218, 552010, 545203, 536907, 528143, 519931, 512125, 503459, 493300, 483181, 475633, 471272, 467922, 463095, 456621, 450218, 445091, 440818, 436310, 431032, 425133, 418939, 412605, 406052, 399094, 391649, 383844, 375875, 367768, 359391, 350780, 342430, 335072, 328930, 323390, 317755, 312296]
57750C12296m259k525j124O6J661L329M127M159M501N169M677K253p42k435k526
57735C28627j965j410q90l94K7M52R36J486K409L957N538O053N368M408L547K057
57719C60206l32k515l446l478l462l471l322l413m050m607m364l642l341l785
57705C12978m658n504n690m569k378m48J44l09p52m74O63K268L439L569L334L927
57689C05540N167N785N625N861O643O572N386M926O145P183O263M626M420N251
57675C85393N251M496M811O566Q079Q160P255O092M946M373N047O620P945Q498
57661D73532Q666Q823R171J0100J1630J2915J3314J3481J4274J5283J5687J5806
57649F22682J6440J7284J7574J7685J8547K0039K1536K3433K6326K9215L0576
$$ y = [312296, 308037, 305512, 304388, 304454, 306115, 309444, 313571, 317730, 322231, 327400, 332077, 334330, 333588, 331153, 328627, 326662, 325252, 324362, 323968, 323995, 324447, 325383, 326869, 329278, 333235, 338773, 344826, 350194, 354602, 358149, 360206, 359874, 357359, 353913, 350435, 346973, 343502, 340180, 336767, 332717, 328110, 323746, 320104, 316763, 312978, 308320, 302816, 297126, 292557, 290179, 289731, 289875, 289566, 288814, 288340, 289003, 291271, 294710, 298279, 301613, 305540, 310707, 316492, 322117, 327978, 334621, 341193, 346579, 351505, 357650, 364833, 371096, 375722, 380142, 385393, 390644, 395140, 399951, 406517, 414596, 422756, 430011, 436103, 441049, 445422, 450469, 457089, 465034, 473532, 482198, 491021, 500192, 510292, 521922, 534837, 548151, 561632, 575906, 591189, 606876, 622682, 639122, 656406, 673980, 691665, 710212, 730251, 751787, 775220, 801546, 830761, 861337]
57638H61337L0899L2220L5167L8355M0700M2517M4222M5828M7862N1108N5174
57627A325389N9003O2902O8362P5747Q3941R2489J02227J13315J24450J34825
57617B242650J45526J58329J74182J93021K13798K34559K53891K72285K90194
57608D178435L04329L07607K93589K60255K10057J48549Q3169K0815l4975q3600
57598E688230j24357j55926j78988j96490k09951k17710k18388k13964k07607
57589C964849k00094j90450j78795j66498j54304j42123j30146j18694j07386
57580B576359r5726q4038p2812o1894n1297m2031l4841k8937k3108j7316j1898
57569B052461o149P54Q057J4355J9838K5942L2930L9541M5260N1397N9379O8831
$$ y = [861337, 892236, 924456, 959623, 997978, 1038678, 1081195, 1125417, 1171245, 1219107, 1270215, 1325389, 1384392, 1447294, 1515656, 1591403, 1675344, 1767833, 1870060, 1983375, 2107825, 2242650, 2388176, 2546505, 2720687, 2913708, 3127506, 3362065, 3615956, 3888241, 4178435, 4482764, 4790371, 5083960, 5344215, 5554272, 5702821, 5785990, 5806805, 5771830, 5688230, 5563873, 5407947, 5228959, 5032469, 4822518, 4604808, 4386420, 4172456, 3964849, 3764755, 3574305, 3395510, 3229012, 3074708, 2932585, 2802439, 2683745, 2576359, 2480633, 2396595, 2323783, 2261889, 2210592, 2168561, 2133720, 2104783, 2081675, 2064359, 2052461, 2046312, 2047066, 2055123, 2069478, 2089316, 2115258, 2148188, 2187729, 2232989, 2284386, 2343765, 2412596]
57557B412596P8106Q6167R3679J02330J13043J24725J35111J43098J49513J55036
57547C593404J58243J56602J48777J34923J15276Q9928O0024K7848m638l6614
57537D443773o7405r5476j18928j36853j49946j59755j67125j71446j71707j68349
57527C036783j63244j57568j50674j41833j32200j23779j16888j09996j02081
57518A838520r3958q6945q1080p5216o8502o1309n4837m9870m5968m2077l7958
57507A140800l4450l1974k9498k5882k1737j8927j8243j8474j7931j6188j3957
57496H93539j1908j0082q240o382m776l489k007L15L312N985P690Q901J0349J1935
57482H95142J3170J4319J6219J8949K1630K3699K5700K8373L1447L3894L5173
$$ y = [2412596, 2490702, 2576869, 2670548, 2772878, 2885921, 3010646, 3145757, 3288855, 3438368, 3593404, 3751647, 3908249, 4057026, 4191949, 4307225, 4397153, 4457177, 4485025, 4480387, 4443773, 4376368, 4280892, 4161964, 4025111, 3875165, 3715410, 3548285, 3376839, 3205132, 3036783, 2873539, 2715971, 2565297, 2423464, 2291264, 2167485, 2050597, 1940601, 1838520, 1744562, 1657617, 1576537, 1501321, 1432819, 1371510, 1316673, 1266803, 1220835, 1178758, 1140800, 1106350, 1074376, 1044878, 1018996, 997259, 978332, 960089, 941615, 923684, 907496, 893539, 881631, 871549, 863309, 856927, 852151, 848662, 846655, 846970, 850282, 856267, 863957, 872858, 883207, 895142, 908312, 922631, 938850, 957799, 979429, 1003128, 1028828, 1057201, 1088648, 1122542, 1157715]
57471A157715L5939L7577M1125M6455N2333N7480O1798O6413P2308P9042Q5230
57460A793415R0304R5311J01562J08867J15809J21494J25955J28593J27477J21237
57450B930024J10847R8200Q3189O3807L9278J1863j4967l9132o0270p8524r3922
57439C050393j06265j14973j19450j20151j18769j16744j14034j09789j03822
57430B026396r6776q9278q1635p4161o7139o0499n3901m7156m0338l3586k6981
57419A354946k0578j4578r491n754k875O11N605J1188J5807J9374K3009K6947
57407A404211L0294L3081L6843M2394M8560N4063N9337O5401P2159P8995Q5965
57396B011303R2958R8655J01830J02997J03307J02287R8156Q9942P7895O2063
$$ y = [1157715, 1193654, 1231231, 1272356, 1318811, 1371144, 1428624, 1490422, 1556835, 1629143, 1708185, 1793415, 1883719, 1979030, 2080592, 2189459, 2305268, 2426762, 2552717, 2681310, 2808787, 2930024, 3040871, 3139071, 3222260, 3286067, 3325345, 3337208, 3322241, 3283109, 3222839, 3144315, 3050393, 2944128, 2829155, 2709705, 2589554, 2470785, 2354041, 2240007, 2130218, 2026396, 1929620, 1840342, 1758707, 1684546, 1617407, 1556908, 1503007, 1455851, 1415513, 1381927, 1354946, 1334368, 1319790, 1310299, 1304545, 1301670, 1302281, 1307886, 1319074, 1334881, 1354255, 1377264, 1404211, 1434505, 1467586, 1504429, 1546823, 1595383, 1649446, 1708783, 1774184, 1846343, 1925338, 2011303, 2104261, 2202916, 2304746, 2407743, 2511050, 2613337, 2711493, 2801435, 2879330, 2941393]
57386B941393M2081J8545o605l1277n4121p4403r1942j06993j19398j28106j32413
57375B256761j33270j32320j30117j26308j21116j15293j08889j01495r3650q6650
57365A107653q0895p5619p0223o4788n9379n4092m9663m6714m4368m1053l6609
57354D84250l2386k9287k7176k6113k6297k6680k5601k3244k1602k1383k0907
57343B03574j8984j6858j6035j5919j5197j4092j3561j3349j2606j1581j1021
57332D4371j0509r037o794m935l976l692A262d192o589o345m953l632k738j711
57318c0160p69r20k132l111l318l763n088o223n945m719l882l667l206k214j549
57303h0666j966l140m271n066n735o275o331n876n540n801o153n678m433l521
$$ y = [2941393, 2983474, 3002019, 2995414, 2964137, 2910016, 2835613, 2743671, 2636678, 2517280, 2389174, 2256761, 2123491, 1991171, 1861054, 1734746, 1613630, 1498337, 1389448, 1287953, 1194303, 1107653, 1026758, 951139, 880916, 816128, 756749, 702657, 652994, 606280, 561912, 520859, 484250, 451864, 422577, 395401, 369288, 342991, 316311, 290710, 267466, 245864, 224481, 203574, 184590, 167732, 151697, 135778, 120581, 106489, 92928, 79579, 66973, 55392, 44371, 33862, 24825, 18031, 13096, 9120, 5428, 1262, -4192, -10781, -17126, -22079, -25711, -28449, -30160, -30929, -31849, -33981, -37092, -40410, -44173, -49261, -55484, -61429, -66148, -70030, -73697, -76903, -79117, -80666, -82632, -85772, -90043, -95109, -100844, -107119, -113450, -119326, -124866, -130667, -136820, -142498, -146931, -150452]
57289a50452l501l553k790j723j651k896m553n721o136n737m498k840j518r01
57275a98470q52j188j722j880j127K33J301J664J518R08k76j516j929j494r89
57260b05819m33J111L732N870O226N456M942M852M579M321M777N636N867N356
57246a43527M954M829M219L122K910M488O717P627O787N735O176Q309J0939J2946
57232e3769J4338J5768f417A1502J7532J7254J8393K0634K2704K4435K6764K9638
57220A88856L1567L2000L2726L5607L9746M2378M2219M0538L8843L6901L3608
57209E94989K8860K3502J7814J1042K790n785j2876j7974k2124k6028k8713k8863
57197E36634k7005k5223k4795k4951k4199k1986j8855j5692j3254j1749j0576
$$ y = [-150452, -153953, -157506, -160296, -162019, -163670, -166566, -171119, -176840, -182976, -188713, -193211, -196051, -197569, -198470, -199322, -200510, -202232, -204112, -205239, -205006, -203705, -202041, -200523, -199615, -199891, -201407, -203336, -204830, -205819, -206252, -205141, -201409, -195539, -189313, -183857, -178915, -174063, -169484, -165163, -160386, -154750, -148883, -143527, -138573, -133744, -129525, -126403, -123493, -119005, -112288, -104661, -97874, -92139, -85963, -77654, -66715, -53769, -39431, -23663, -6417, 11502, 29034, 46288, 64681, 85315, 108019, 132454, 159218, 188856, 220423, 252423, 285149, 320756, 360502, 402880, 445099, 485637, 524480, 561381, 594989, 623849, 647351, 665165, 676207, 678997, 673212, 660336, 642362, 620238, 594210, 565497, 536634, 509629, 484406, 459611, 434660, 410461, 388475, 369620, 353928, 340674, 328925, 318349]
57186C18349q994p091n482m155k708j674k130l650m246l102j728j282n33J861
57172B73435M534N128L947L603N226P341Q533R124R833J0615J1562J3428J6411
57159C82720J9571K2114K4262K6440K8647L1158L4703L9280M3604M6323M7077
57148G45899M6147M4018M1804M0990M2017M3737M4754M4767M4254M3702M3635
57137A225724M4677M6995M9992N2708N4143N3566N1381M9489M9498N0582N0497
57126A779252M8876M7816M8784N0626N1463N1037N0090M8805M7091M5342M3697
57115B312879M1443L8238L5071L2910L1352K9660K8111K7016K5419K2459J9383
57104B643941J8405J9802K1742K2847K3369K3616K3049K1617K0648K1320K2883
$$ y = [318349, 309355, 302264, 296782, 292627, 289919, 288245, 286115, 282465, 278219, 275117, 273389, 272107, 271574, 273435, 277969, 283097, 287044, 290647, 295873, 303214, 311747, 320871, 330704, 341319, 352881, 366309, 382720, 402291, 424405, 448667, 475107, 503754, 534912, 569615, 608895, 652499, 698822, 745899, 792046, 836064, 877868, 918858, 960875, 1004612, 1049366, 1094133, 1138387, 1182089, 1225724, 1270401, 1317396, 1367388, 1420096, 1474239, 1527805, 1579186, 1628675, 1678173, 1728755, 1779252, 1828128, 1875944, 1924728, 1975354, 2026817, 2077854, 2127944, 2176749, 2223840, 2269182, 2312879, 2354322, 2392560, 2427631, 2460541, 2491893, 2521553, 2549664, 2576680, 2602099, 2624558, 2643941, 2662346, 2682148, 2703890, 2726737, 2750106, 2773722, 2796771, 2818388, 2839036, 2860356, 2883239]
57093B883239K3515K2736K2021K2749K4199K4138K1184J5819R044R67q583j8744
57081C042284k7899l5200m1045m6349n2042n8940o7304p6817q7865j02212j21268
57070B325343j44115j68550j93674k20024k47775k76633l07173l40419E0575c64613
57059h23760n11784n74260o44998p22741q07595q99213r96997j102663j219967
57050h303978j351326j497362j660014j843129k049755k282334k546258k849629
57042b4383785l198974l599377m060020m595193n217867n935815o754685p679239
57034f5424955q708068r829255j1020942j2252106j3485163j4684382j5814159
57027a51219030j6807675j7532979j7817158j7531782j6654573j5240742j3354672
$$ y = [2883239, 2906754, 2929490, 2951511, 2974260, 2998459, 3022597, 3043781, 3059600, 3068644, 3069611, 3061028, 3042284, 3014385, 2979185, 2938140, 2891791, 2839749, 2780809, 2713505, 2636688, 2548823, 2446611, 2325343, 2181228, 2012678, 1819004, 1598980, 1351205, 1074572, 767399, 426980, 50575, -364613, -823760, -1335544, -1909804, -2554802, -3277543, -4085138, -4984351, -5981348, -7084011, -8303978, -9655304, -11152666, -12812680, -14655809, -16705564, -18987898, -21534156, -24383785, -27582759, -31182136, -35242156, -39837349, -45055216, -50991031, -57745716, -65424955, -74133023, -83962278, -94983220, -107235326, -120720489, -135404871, -151219030, -168026705, -185559684, -203376842, -220908624, -237563197, -252803939, -266158611]
57020b66158611j1057589q449500n674915k859106n1709K752179N546205Q276199
57012b77676847J0846934J3138193J5019451J6378349J7156512J7365507J7076803
57005a70695098J6402592J5474369J4414679J3311943J2216873J1157045J0148105
56998g7569492R194940Q295053P447529O656167N923989N250406M635250M080545
56990b6085613L586448L149255K764550K428579K135649J878253J651288J452966
56982g038625J280667J129361R95292Q78030P77587O92234O19982a06198D00895
56972H60292M14726L75122L42159L14355K89596K67739K49432K34052K19975K05443
56962C772891J88576J68326J46339J26351J10918R9832R1929Q6910Q5052Q6362
$$ y = [-266158611, -277216200, -285665700, -291340615, -294199721, -294251430, -291499251, -285953046, -277676847, -266829913, -253691720, -238672269, -222293920, -205137408, -187771901, -170695098, -154292506, -138818137, -124403458, -111091515, -98874642, -87717597, -77569492, -68374552, -60079499, -52631970, -45975803, -40051814, -34801408, -30166158, -26085613, -22499165, -19349910, -16585360, -14156781, -12021132, -10142879, -8491591, -7038625, -5757958, -4628597, -3633305, -2755275, -1977688, -1285454, -665472, -106198, 400895, 860292, 1275018, 1650140, 1992299, 2306654, 2596250, 2863989, 3113421, 3347473, 3567448, 3772891, 3961467, 4129793, 4276132, 4402483, 4513401, 4613233, 4705162, 4792072, 4877124, 4963486]
56952D963486R0132R4167R5176R1861Q6943Q3120P6601N7371J7434m2073j11440
56941E502778j77814k30188k62754k76223k75676k66430k52068k35241k17986
56932C308398k00910j83913j67969j54598j43663j33688j24476j17407j12853
56923A968921j09481j06455j04293j03088j01940j00602r9567r8085r4357q8450
56913I62603q2742p8604p4713o9587o3625n7398n0059m0997l1461k3059j5918
56902C74440r455l700J312O231J1415J6186J9777K1861K1676J8183J1788M617
56890D94331j647o724j0220j1158r972q938r381j0034r393p966o870n847m276
56877C91905k754j916q85J457M498O738P819Q246P786N716K337j022l445n150
$$ y = [4963486, 5053618, 5147785, 5242961, 5334822, 5421765, 5504885, 5581486, 5638857, 5656291, 5614218, 5502778, 5324964, 5094776, 4832022, 4555799, 4280123, 4013693, 3761625, 3526384, 3308398, 3107488, 2923575, 2755606, 2601008, 2457345, 2323657, 2199181, 2081774, 1968921, 1859440, 1752985, 1648692, 1545604, 1443664, 1343062, 1243495, 1145410, 1051053, 962603, 879861, 801257, 726544, 656957, 593332, 535934, 485875, 444878, 413417, 390358, 374440, 364985, 361285, 362597, 368828, 380243, 396429, 416206, 438067, 459743, 477926, 489714, 494331, 492684, 485960, 475740, 464582, 454610, 445672, 436291, 426257, 416864, 408898, 402028, 396181, 391905, 389151, 387235, 386350, 387807, 392305, 399043, 406862, 415108, 422894, 428610, 430947, 429925, 426480, 421330]
56863D21330o993r595j2530j4263j3767j2218j1818j2709j2676j0412p284n019
56851B92046l472j855m43L84J348L026M625N406O180P835R519R875R123Q445Q171
56836C60213P992P970P859O499L553R42P28K296L426L484L549L903L517K048M34
56821D18413p41j843k849k886j626J05J589L121N181P410R000R755J0503J2529
56807D67661J6321K0756K3944K5355K6480K8998L2819L6424L8367L7776L4143
56796G89044K7689J9560J0931K337n595j1603j4881j6058j6214j5462j3408j0296
56784G46044o710k694J796O106R757J3598J8970K5905L3162L9820M5648M9884
56772I81286N0676M6143L5868K1512O047q004j9880k9742l6818l9730l8845l6676
$$ y = [421330, 414337, 404742, 392212, 377949, 364182, 351964, 340146, 327437, 314761, 304349, 297065, 292046, 288574, 286719, 286276, 286660, 288008, 291034, 295659, 301065, 307245, 315080, 324599, 334474, 343597, 352042, 360213, 368205, 376175, 384034, 390533, 394086, 395028, 395756, 398052, 401478, 404962, 408511, 412414, 415931, 417979, 418413, 417672, 415829, 412980, 410094, 408468, 408573, 410162, 413283, 418464, 425874, 434874, 444629, 455132, 467661, 483982, 504738, 528682, 554037, 580517, 609515, 642334, 678758, 717125, 754901, 789044, 816733, 836293, 847224, 849561, 843966, 832363, 817482, 801424, 785210, 769748, 756340, 746044, 739334, 736640, 738436, 744542, 754299, 767897, 786867, 812772, 845934, 885754, 931402, 981286, 1031962, 1078105, 1113973, 1135485, 1141532, 1133528, 1113648, 1083906, 1047088, 1007358, 968513, 931837]
56760I31837l4985l2995k9449k4933k0588j5924r791k664L959R866J5974K2249
56748H12556K7456L0624L1154K8033K0791J1112J599p071j5960k4842l1345l3743
56736H50364l3007l1396l0134k8970k6909k3051j7669j2775j0322r560p485k489
56724F16597L553P587Q765Q728R161R994R761P035J652n093j1416j6202j9247
56711F30875k0726k0927k0278j9106j7357j5058j2905j1799j1877j2290j2072
56700D56480j0844q929p083n909n362m967m599m489m438l869k904k434k688k756
56686C85209k028j017k02O33J151J86k068l266j983j28k96j994k823k396k257
56671C66721k536j664L46J211j91k098k579j975j604j690j822k044k388k387j984
$$ y = [931837, 896852, 863857, 834408, 809475, 788887, 772963, 763172, 760508, 764467, 774333, 790307, 812556, 840012, 870636, 901790, 929823, 950614, 961726, 963325, 956254, 940294, 915452, 884107, 850364, 817357, 785961, 755827, 726857, 699948, 676897, 659228, 646453, 636131, 626571, 619086, 616597, 620150, 627737, 636502, 645230, 654391, 664385, 674146, 681181, 682833, 677740, 666324, 650122, 630875, 610149, 589222, 568944, 549838, 532481, 517423, 504518, 492719, 480842, 468552, 456480, 445636, 436707, 429624, 423715, 418353, 413386, 408787, 404298, 399860, 395991, 393087, 390653, 387965, 385209, 383181, 382164, 381962, 382595, 383746, 383932, 381864, 378598, 376615, 376487, 376191, 374197, 371374, 368978, 366721, 364185, 362521, 362867, 364078, 363887, 361789, 359210, 357235, 355631, 353941, 352119, 350075, 347687, 345300, 343316]
56656C43316j925k461k663j819n45J90K86J09l15r53j389j362j173j118j249j866
56640C25063l243m647m687l210j790j734k589l353l964m655m794l728k238j842
56626B78589k714l423k938j938j609j784j177N83K067J851O38M49J820L150L199
56611B76763K741K878L032K132P02N9J71K05M96K009L994M411K875J140L42j97
56595C03753p91k45J975M193M480L036J357K29k86P3J211J829N07k414m937n415
56579C08555l961k057j194j674k506k620k034j452j080o77m51p56r82j15J472
56564B88468K135J259J06j41K66Q29J854L343M027K778K79j830k802k930k492
56549B95149j491j28J228K306K825K531J714J080Q34N68K81O59J856K976L267
$$ y = [343316, 341391, 338930, 336267, 334448, 333903, 334093, 334379, 334488, 334173, 333220, 331831, 330469, 329296, 328178, 326929, 325063, 321820, 317173, 312486, 309276, 307486, 305752, 303163, 299810, 295846, 291191, 286397, 282669, 280431, 278589, 275875, 272452, 269514, 267576, 265967, 264183, 263006, 263589, 265656, 267507, 268145, 268594, 270414, 273564, 276763, 279504, 282382, 285414, 287546, 288248, 288307, 288478, 288683, 289179, 291188, 295182, 299593, 302468, 303608, 303950, 303753, 302962, 302717, 304692, 308885, 313365, 316401, 317758, 317987, 317701, 317774, 318985, 320814, 321321, 318907, 313970, 308555, 304594, 302537, 301343, 299669, 297163, 294543, 292509, 291057, 289977, 289300, 288849, 288093, 287111, 286996, 288468, 290603, 291862, 291968, 291827, 292093, 292922, 294776, 298119, 302146, 304924, 305203, 303373, 300571, 297641, 295149, 293658, 293530, 294758, 297064, 299889, 302420, 304134, 305214, 306048, 306616, 306897, 307556, 309412, 312388, 315655]
56534C15655L060K886K519J627O91M97J138K069K670K501J566O72P96J830K658
56519C42835K699K441K233J690Q00M46J031J612J171L3p37n67M70K002L266L600
56503C65025L418L805M723M911M082L657M488N314M900M143M480N224M508K285
56489D24963M44J32O07R03J070J433J765J688J137M7j725l868n507o009n583m855
56473D06642l968k428r8J834J613q33l257l628k609k103j957k75K846M457K656
56458C98892p31k864l493m125m970m996m193l727l943l927l079j835p09K60J006
56443C57566J257Q59k13j849l357l647k558j299p70k70J110K624K777J547L16
56428C54093j39k67n03n84k19M70J183J469Q42m28j094l57R77J686J907K575L614
$$ y = [315655, 318715, 321601, 324120, 325747, 326438, 326935, 328073, 330142, 332812, 335313, 336879, 337551, 338347, 340177, 342835, 345534, 347975, 350208, 351898, 352698, 353144, 354175, 355787, 356958, 356991, 356254, 355687, 356157, 358159, 361425, 365025, 368443, 372248, 376971, 381882, 385964, 389621, 394109, 399423, 404323, 408466, 412946, 418170, 422678, 424963, 425407, 425539, 426146, 427049, 428119, 429552, 431317, 433005, 434142, 434189, 432464, 428596, 423089, 417080, 411497, 406642, 402674, 400246, 400148, 401982, 403595, 402762, 399505, 395877, 393268, 391165, 389208, 388933, 391779, 396236, 398892, 398161, 395297, 391804, 387679, 382709, 377713, 373520, 369793, 365850, 361923, 358844, 357009, 356300, 356560, 357566, 358823, 359682, 359469, 357620, 354263, 350616, 348058, 346759, 345989, 345719, 346829, 349453, 352230, 353777, 354093, 353954, 353687, 353184, 352600, 352381, 352851, 354034, 355503, 356345, 355917, 354823, 354466, 355443, 357129, 359036, 361611, 365225]
56411C65225M022L568L118L239L687M237N011N877O383O405O108N453M546M170
56397D31049M924O001O012M866L662K810J656R6r35j029r80j247j054oO25m84
56381D55966k545l653l521l610m406m412k724j084j705l919m925l792k585l046
56367D10039m194m476m400n050n441l793q79N49l18j366q70L88J012R17N15j17
56351C82516l35R88L343M320K780P07M65J643K171J362J92n36p88o55m44p94j719
56334C95216k201j642p75m34l72k61m90r77n25J332L070L177K173J395J019P27
56318D00432R79K023K801K515K041K166J865K48j102j27K356L690L138K392K718
56303D28135L714M622N051M671L801L747N003N940M992L226K721L399L702L479
$$ y = [365225, 369247, 372815, 375933, 379172, 382859, 387096, 392107, 397984, 404367, 410772, 416880, 422333, 426879, 431049, 435973, 441974, 447986, 452852, 456514, 459324, 460980, 461076, 460141, 459112, 458132, 456885, 455831, 455825, 456450, 455966, 453421, 449768, 446247, 442637, 438231, 433819, 431095, 430011, 428306, 424387, 419462, 415670, 413085, 410039, 405845, 401369, 396969, 391919, 386478, 382685, 381806, 382355, 382037, 380671, 379801, 380189, 381201, 382118, 382633, 382516, 382181, 383169, 386512, 390832, 393612, 394319, 394784, 396427, 398598, 399960, 400152, 399616, 398828, 398173, 397729, 396935, 395216, 393015, 391373, 390598, 390164, 389792, 389531, 389041, 388064, 387539, 388871, 391941, 395118, 397291, 398686, 399705, 400432, 401411, 403434, 406235, 408750, 410791, 412957, 414822, 415070, 413968, 413841, 416197, 419887, 423025, 425417, 428135, 431849, 436471, 441522, 446193, 449994, 453741, 458744, 464684, 469676, 472902, 475623, 479022, 482724, 486203]
56289D86203L750M255L891L138L477M625M954M424M513N259N080L666K583K634
56275E42452K996L251L969N051N664O021O939P668O607M285L018L442M076M476
56261F09915N706P268P071N472N780R078J1859J1082Q645Q141R609J0633J0777
56248G21036J1643J3339J4083J3349J2834J3839J5492J6266J5917J5277J4853
56237H77928J4369J3467J2487J2164J2604J3108J3342J3915J5037J5514J4401
56226A028336J3027J3628J6284J9047K0932K2760K4929K6648K7913L0101L3621
56215A277226L6963L9186M1632M5766N0817N5129N8778O3282O9320P6123Q2830
56204A897052Q9413R6392J04349J13695J24411J35888J47224J57711J67373J77115
$$ y = [486203, 489953, 494208, 498099, 501237, 504714, 509339, 514293, 518717, 523230, 528489, 533569, 537235, 539818, 542452, 545448, 548699, 552668, 557719, 563383, 569404, 576343, 584011, 590618, 594903, 597921, 601363, 605439, 609915, 615621, 622889, 629960, 635432, 641212, 650290, 662149, 673231, 681876, 690017, 699626, 710259, 721036, 732679, 746018, 760101, 773450, 786284, 800123, 815615, 831881, 847798, 863075, 877928, 892297, 905764, 918251, 930415, 943019, 956127, 969469, 983384, 998421, 1013935, 1028336, 1041363, 1054991, 1071275, 1090322, 1111254, 1134014, 1158943, 1185591, 1213504, 1243605, 1277226, 1314189, 1353375, 1395007, 1440773, 1491590, 1546719, 1605497, 1668779, 1738099, 1814222, 1897052, 1986465, 2082857, 2187206, 2300901, 2425312, 2561200, 2708424, 2866135, 3033508, 3210623]
56194C210623J87725J98387K06972K12394K15505K16766K14437K06686J94361
56185E063856J79645J62696J41830J16559Q8422N9111K9820K192k2272m3754o3200
56174E714905q0169r3620j04346j14299j23661j30908j35562j38541j40131j40346
56164D513322j40986j44191j48717j50844j49470j47262j46093j44629j41498
56155C199632j37736j34431j30660j25402j19388j13535j07413j00610r3908q8032
56145B048517q2668p7396p2152o6554o0577n5641n2806n0206m5125l8379l3425
56134A413588l1137k9091k6307k4617k4442k3441k0652j8058j6476j3963j0075
56123A175329p602p827p996o033l884l416k815l54J789J203j58J181N006Q556
$$ y = [3210623, 3398348, 3596735, 3803707, 4016101, 4231606, 4448372, 4662809, 4869495, 5063856, 5243501, 5406197, 5548027, 5664586, 5753008, 5812119, 5841939, 5844131, 5821859, 5778105, 5714905, 5634736, 5541116, 5436770, 5322471, 5198810, 5067902, 4932340, 4793799, 4653668, 4513322, 4372336, 4228145, 4079428, 3928584, 3779114, 3631852, 3485759, 3341130, 3199632, 3061896, 2927465, 2796805, 2671403, 2552015, 2438480, 2331067, 2230457, 2136549, 2048517, 1965849, 1888453, 1816301, 1749747, 1689170, 1633529, 1580723, 1530517, 1485392, 1447013, 1413588, 1382451, 1353360, 1327053, 1302436, 1277994, 1254553, 1233901, 1215843, 1199367, 1185404, 1175329, 1167727, 1159900, 1151904, 1145871, 1141987, 1138571, 1135756, 1135402, 1137191, 1138394, 1138236, 1139417, 1144423, 1152979]
56109A152979J0871J2815J4509J5742J7229J9011J9462J8297J8232K1061K4563
56098A344771K6079K6689K8766L1711L3369L3665L3728L3401L2763L3868L7773
56087A696583M1904M3677M4686M7875N2658N6661O0449O6573P5310Q5149R6100
56076B367625J08605J20171J26931J28117J25820J21198J14146J05889R8605R2885
56066C509992Q7916Q3190P7627O8702N5248L9578K4183Q377q675k4196l5180m3649
56054C843113n4197o7748q1888r5789j09889j21701j27162j26361j23435j20546
56044B814397j16077j09084j01282r3790q5462p5615o5589n6712m9059m2506l6984
56033A982237l1635k5672j9710j4570r740m937j578l50Q53L714O128N405L015
$$ y = [1152979, 1163850, 1176665, 1191174, 1206916, 1224145, 1243156, 1262618, 1280915, 1299147, 1320208, 1344771, 1370850, 1397539, 1426305, 1458016, 1491385, 1525050, 1558778, 1592179, 1624942, 1658810, 1696583, 1738487, 1782164, 1826850, 1874725, 1927383, 1984044, 2044493, 2111066, 2186376, 2271525, 2367625, 2476230, 2596401, 2723332, 2851449, 2977269, 3098467, 3212613, 3318502, 3417107, 3509992, 3597908, 3681098, 3758725, 3827427, 3882675, 3922253, 3946436, 3954813, 3946138, 3921942, 3886762, 3843113, 3788916, 3721168, 3639280, 3543491, 3433602, 3311901, 3184739, 3058378, 2934943, 2814397, 2698320, 2589236, 2487954, 2394164, 2308702, 2233087, 2167498, 2110786, 2061727, 2019221, 1982237, 1950602, 1924930, 1905220, 1890650, 1880910, 1875973, 1874395, 1874045, 1874898, 1878612, 1884740, 1890145, 1893160]
56020A893160K416L682M257L857M405N912O428N662N069M978M893N763Q540J1555
56006A970577J2827J3629J6232J9538K0986K1289K3006K5670K6847K6890K8122
55995B205613L0260L1289L1972L4792L8956M1263M1412M2053M3916M5266M5671
55984B632463M6214M6653M6453M7431N1154N5142N6171N5773N7573O1036O3221
55973C219284O5007O9528P5810Q0248Q3451Q9213R7388J04107J08631J13825J20221
55962D226713J25855J31562J40173J50736J59564J66490J74127J81961J87551
55953E644732J92505K00452K10349K18767K27270K39834K54454K65780K75063
55944G729206K88644L07345L26301L44572L65480L87760M06372M22307M41843
$$ y = [1893160, 1895576, 1899258, 1903515, 1907372, 1911777, 1917689, 1924117, 1929779, 1934848, 1939826, 1944719, 1950482, 1959022, 1970577, 1983404, 1997033, 2013265, 2032803, 2053789, 2075078, 2098084, 2123754, 2150601, 2177491, 2205613, 2235873, 2267162, 2299134, 2333926, 2372882, 2414145, 2455557, 2497610, 2541526, 2586792, 2632463, 2678677, 2725330, 2771783, 2819214, 2870368, 2925510, 2981681, 3037454, 3095027, 3156063, 3219284, 3284291, 3353819, 3429629, 3509877, 3593328, 3682541, 3779929, 3884036, 3992667, 4106492, 4226713, 4352568, 4484130, 4624303, 4775039, 4934603, 5101093, 5275220, 5457181, 5644732, 5837237, 6037689, 6248038, 6466805, 6694075, 6933909, 7188363, 7454143, 7729206, 8017850, 8325195, 8651496, 8996068, 9361548, 9749308, 10155680, 10577987, 11019830]
55935A1019830M65765M89342N13108N43263N80805O20783O62764P11258P65452
55926A6372370Q19859Q75510R38635J008072J076528J144414J218862J298911
55918B4753161J376707J454405J544178J650064J766272J894796K046283K220343
55910C8706209K404157K594769K804053L038240L293754L578069L912635M309827
55902F4641713M769991N305529N941093O684760P529824Q492647R615224J0923425
55894A23904206J2424704J4159961J6210724J8637539K1453433K4629390K7955820
55887B59375777L0765241L1896147L0187965K5185261J7413457Q051798j568106
55880D01307540j0255698j7115442k1726156k4223302k5106596k4908394k4014995
$$ y = [11019830, 11485595, 11974937, 12488045, 13031308, 13612113, 14232896, 14895660, 15606918, 16372370, 17192229, 18067739, 19006374, 20014446, 21090974, 22235388, 23454250, 24753161, 26129868, 27584273, 29128451, 30778515, 32544787, 34439583, 36485866, 38706209, 41110366, 43705135, 46509188, 49547428, 52841182, 56419251, 60331886, 64641713, 69411704, 74717233, 80658326, 87343086, 94872910, 103365557, 112980781, 123904206, 136328910, 150488871, 166699595, 185337134, 206790567, 231419957, 259375777, 290141018, 322037165, 352225130, 377410391, 394823848, 402875646, 401307540, 391051842, 373936400, 352210244, 327986942, 302880346, 277971952, 253956957]
55873B53956957k2693063k1143640j9496406j7818484j6166390j4605598j3175978
55866A28857398j1875835j0692696r623134q656565p769747o949898o202847n531165
55858F1555511m924455m377477l897749l487169l132778k822398k554052k324421
55850C4035012k123171j944792j792361j663886j547570j435736j331534j237319
55842B0958643j148305j062447r85084r18512q57231p98168p45485p00704o57992
55833A3084715o14228n74460n42268n13399m84058m57460m36930m19537m01366
55824H641009l82579l63249l40811l15725k93406k76556k61595k46043k33025
55815E928020k24587k16886k06385j95356j86918j79645j71234j62984j56572
$$ y = [253956957, 231263894, 210120254, 190623848, 172805364, 156638974, 142033376, 128857398, 116981563, 106288867, 96665733, 88009168, 80239421, 73289523, 67086676, 61555511, 56631056, 52253579, 48355830, 44868661, 41735883, 38913485, 36359433, 34035012, 31911841, 29967049, 28174688, 26510802, 24963232, 23527496, 22195962, 20958643, 19810338, 18747891, 17762807, 16844295, 15987064, 15188896, 14443411, 13742707, 13084715, 12470487, 11896027, 11353759, 10840360, 10356302, 9898842, 9461912, 9042375, 8641009, 8258430, 7895181, 7554370, 7238645, 6945239, 6668683, 6407088, 6161045, 5928020, 5703433, 5486547, 5280162, 5084806, 4897888, 4718243, 4547009, 4384025, 4227453]
55806D227453j50458j43158j36297j31349j27022j22560j19805j19255j18023
55797C059526j14311j10140j07121j03493r7879r2175q7977q3759p8236p2995
55787B111440o9261o5442o0411n5899n3270n1035m7915m5076m3110l9989l4489
55776A545543k8656k4551k1494j8658j7192j7480j7166j4572j1323r307p658n263
55764A352223l647m685p544j0337j3031j6376j9628k1497k2174k2725k3624k4953
55752A162002k6632k7643k6762k4654k3334k2980k1682j8927j6715j6167j5726
55741I20780j3847j1202r048p617p023p429p645o131l899l620n192n511l458j547
55727H27611j329r61P64J591l32k944l423k376k189l329m929p141j0404j3752
$$ y = [4227453, 4076995, 3933837, 3797540, 3666191, 3539169, 3416609, 3296804, 3177549, 3059526, 2945215, 2835075, 2727954, 2624461, 2526582, 2434407, 2346430, 2262671, 2184435, 2111440, 2042179, 1976737, 1916326, 1860427, 1807157, 1756122, 1708207, 1663131, 1620021, 1580032, 1545543, 1516887, 1492336, 1470842, 1452184, 1434992, 1417512, 1400346, 1385774, 1374451, 1365144, 1357486, 1352223, 1348576, 1343891, 1336347, 1326010, 1312979, 1296603, 1276975, 1255478, 1233304, 1210579, 1186955, 1162002, 1135370, 1107727, 1080965, 1056311, 1032977, 1009997, 988315, 969388, 952673, 936506, 920780, 906933, 895731, 886683, 879066, 872043, 864614, 856969, 850838, 846939, 843319, 838127, 832616, 829158, 827611, 826282, 825321, 826085, 827676, 827344, 824400, 820977, 818601, 816412, 813083, 808154, 801013, 790609, 776857]
55713G76857j6054j7632j8976j9326j8239j6898j6221j5277j3152j0801r503r094
55701E95684r119r904j1049j0782q514o264n829o223n591m057k937k701l245m782
55687E04687o895q160q096q070r028r960r764q985q422p838p255p607q694q577
55673C87336o438m129l349l479l601m285n514n347l084j497l205o560p951o718
55659C22179m991l880k752j595j375k248l480m768n913n812l721r55N07P10J318
55644B83224K900M186L801J561j618m143m608l117j194J6N32K50j250k951k567
55629B75022K24K746K956K185K468L346L404L112L614M285M099M159O023Q520
55615C26163Q992P155N078L775K422P99%L43O51Jj277k519l350l452k879k308
$$ y = [776857, 760803, 743171, 724195, 704869, 686630, 669732, 653511, 638234, 625082, 614281, 604778, 595684, 586565, 576661, 565612, 554830, 546316, 540052, 534223, 528000, 522409, 518352, 515415, 512714, 509469, 504687, 497792, 489632, 481536, 473466, 464438, 454478, 444714, 435729, 427307, 419469, 412214, 404607, 395913, 387336, 380898, 376769, 373420, 369941, 366340, 362055, 356541, 351194, 348110, 346613, 343408, 336848, 328897, 322179, 317188, 313308, 310556, 308961, 307586, 305338, 301858, 297090, 291177, 285365, 281644, 280689, 281196, 281906, 283224, 286124, 290310, 294111, 295672, 294054, 289911, 285303, 282186, 280992, 281008, 281540, 281790, 280540, 277589, 275022, 275246, 277992, 280948, 283133, 285601, 288947, 292351, 295463, 299077, 303362, 307461, 311620, 317643, 326163, 335155, 342310, 347388, 351163, 353585, 354384, 354384, 354727, 355378, 355379, 354102, 351583, 348233, 344781, 341902, 339594]
55599C39594j973j022R41K598K700K165K618L713L868K955K215J897J170J35j70
55584C63404J87j0r63j458r50m30p41j525k283l329n044o992q169p782n961m121
55568C13833m067o027q071q328p184o404o780p661q187p988p172o496o866p825
55554B14777p603n657l949m358o003o669n766m193k378n18K04j151l298m070l380
55539A55988k769k476j279Q50K185J810O93j37p91j471j695j269p95p18p24l42
55523A47060N75J794K524J781j43j358o60O65P32j44k65O28J420J895K785L984
55507A63273M837N921Q093J0064R445O516M073L107J435k349o282q084q377q833
55493A82839q948p048l528p84j64p34j150j359k095l588n183n961n560m412l178
$$ y = [339594, 337621, 336599, 337540, 340138, 342838, 345003, 347621, 351334, 355202, 358157, 360372, 362269, 363439, 363574, 363404, 363591, 363581, 362618, 361160, 360210, 359780, 359039, 357514, 355231, 351902, 346858, 339866, 331697, 323915, 317954, 313833, 309766, 303739, 295668, 287340, 280156, 273752, 266972, 259311, 251124, 243136, 235964, 229468, 222602, 214777, 207174, 201517, 197568, 193210, 187207, 180538, 174772, 170579, 168201, 167683, 167887, 166736, 163438, 159368, 155988, 153219, 150743, 149464, 150314, 152499, 154309, 155002, 154865, 154074, 152603, 150908, 149639, 148844, 148126, 147402, 147060, 147635, 149429, 151953, 153734, 153591, 152233, 151573, 152238, 152970, 152826, 152561, 153189, 154609, 156504, 159289, 163273, 168110, 174031, 182124, 192188, 201633, 208149, 212222, 215329, 216764, 214415, 208133, 200049, 191672, 182839, 173891, 166843, 163315, 162531, 162367, 161633, 160483, 159124, 157029, 153441, 148258, 142297, 136737, 132325, 129147]
55478A29147k101j183o72p64r50m25P74J710J701R85J67m10o45n27q1Q03K278
55461A29807M008N246N789O281O871O435M137J166l66P8J129J444Q26k91j339
55446A71221j744j492j477k424l843m788n142n235m950m310m158m928n476m696
55432A16558l531l620m565m602l550k990l541m073l737k863j734l31N17k80k068
55417G5590k959k637k603l263l021j167N38L16j232k448k886k984k735j914r16
55402D5679l00j14k35o62j064q72j76L64O62J187J695J325J76n39l01J09J80L58
55384D7472P76P32M0m65l47j89l02j73L85Q57J167J684J746J72k222k678k09K644
55366E1090L095J502L5n53j067j878k445k345j607m25O77J034P31N61P46P65O95
$$ y = [129147, 127046, 125863, 125191, 124427, 123477, 123052, 123826, 125536, 127237, 128222, 128389, 127979, 127334, 126807, 126726, 127529, 129807, 133815, 139061, 144850, 151131, 158002, 164437, 168574, 169740, 169374, 169452, 170581, 172025, 172851, 172560, 171221, 169477, 167985, 166508, 164084, 160241, 155453, 150311, 145076, 140126, 135816, 131658, 126730, 121254, 116558, 113027, 109407, 104842, 100240, 96690, 93700, 90159, 86086, 82349, 79486, 77752, 77421, 77938, 77658, 75590, 72631, 69994, 67391, 64128, 61107, 59940, 60478, 60794, 59562, 57114, 54228, 51244, 48509, 46595, 45679, 45379, 45265, 45030, 44368, 43304, 42432, 42256, 42620, 43282, 44469, 46164, 47489, 47665, 47126, 46825, 46934, 47114, 47472, 48248, 48980, 49020, 48555, 48208, 48019, 47717, 47544, 47929, 48786, 49953, 51637, 53383, 53555, 51333, 48655, 48446, 51090, 54185, 55687, 55722, 55169, 54102, 52224, 49779, 47434, 45827, 45402, 46079, 47113, 47844, 48405, 49151, 49916, 50611]
55349E0611J252K124J888K11j522k433l010l029j040K606M650K955k79j695j416
55334E1873j889l385l722j933N62K438L679M095K855K19j977k327j316k64K06
55319D9114L41O15J186J701J646J089O71N60J98o15j253j432j798k568k729j495
55303D5231L74J630J872J082p46k563k527o54M59p24k143j374M29N11r32j367
55287C8558k69M96L73P19J530Q88j391k754j845o99j301k479k231j121r65j505
55271B6004q91J140K755K727J797J160R55P62O30Q92J392J406M65r56j704j084
55255C7450L41J418J713J808K192K441J812M39n52k62Q27J287M84n36m80L30M85
55238E1197k92p99m97m44j326k071j572n22r1R0R28J747J148n04j453j170p52
$$ y = [50611, 51863, 53987, 55875, 56086, 54564, 52131, 49121, 46092, 45052, 47658, 52308, 55263, 54984, 53289, 51873, 49984, 46599, 42877, 40944, 41506, 43944, 47623, 51718, 54573, 54792, 52815, 50488, 49172, 48908, 49114, 49455, 50070, 51256, 52957, 54603, 55692, 56363, 56923, 57121, 56506, 55253, 53821, 52023, 49455, 46726, 45231, 45605, 47235, 49107, 50189, 49443, 46880, 44353, 43699, 44158, 43434, 41291, 39917, 40346, 40857, 39925, 38558, 38289, 38785, 39158, 39877, 41407, 42295, 40904, 38150, 36305, 35606, 34305, 31826, 29595, 28474, 27509, 26004, 25113, 26253, 29008, 31735, 33532, 34692, 35647, 36409, 37039, 37931, 39323, 40729, 41194, 40238, 38534, 37450, 37791, 39209, 40922, 42730, 44922, 47363, 49175, 49614, 49062, 48800, 49627, 50914, 51398, 50862, 50382, 50712, 51197, 50905, 50106, 49609, 49165, 47839, 45768, 44196, 43674, 43583, 43673, 44601, 46348, 47496, 46992, 45539, 44369, 43617]
55221D3617p42m74L03R29J256J833K315J460o34k068j677n83k25k57M32J707K389
55204D9581J884O15o83j402j338r73r39r63j95J160J691Q96R6L49O62m14k261
55187D7766k954k052j065j056j315q71j00R5j14J88R87J077j42j473j349p8M26
55170C7970p85k403k672j605n19M2P35J886K567J685n10k347k169L8K458L205
55154C7576K316J342J127J086R35J507K864L239J441r03j403k46N47M03M04O87
55138E2922K33p48p80J40L35m68m56R44J664L35j262r57M81Q43j38r76r91p09
55120E0412m53j85j79m68k19R62J911J428J55n48p79j499k381k129o84N40O33
55103D6517m8q90j543j561q52k51l83k64J442M012N203M194K321P06r26k567k905
$$ y = [43617, 42875, 42401, 42704, 43633, 44889, 46722, 49037, 50497, 49863, 47795, 46118, 45535, 45310, 45053, 45485, 47192, 49581, 51465, 52080, 51397, 49995, 48657, 47684, 46745, 45782, 45587, 46747, 48438, 49334, 49430, 49779, 50441, 50027, 47766, 44812, 42760, 41695, 40639, 39324, 38453, 38353, 38448, 38334, 38522, 39509, 40586, 40444, 38971, 37622, 37544, 37970, 37185, 34782, 32110, 30505, 29986, 30028, 30763, 32649, 35216, 36901, 36391, 34044, 31875, 31913, 34371, 37576, 39892, 41234, 42361, 43447, 44382, 45889, 48753, 51992, 53433, 52530, 51127, 50881, 51428, 51831, 52235, 52922, 53155, 52407, 51627, 51767, 52102, 51634, 51178, 52122, 53786, 54121, 52859, 51902, 52383, 53226, 53088, 52112, 51121, 50412, 49959, 49774, 49595, 49127, 48908, 49870, 51781, 53209, 53364, 52816, 52037, 50538, 48157, 46028, 45344, 45884, 46517, 46469, 45579, 44036, 42475, 41623, 41372, 40989, 40725, 42167, 46179, 51382, 55576, 57897, 58603, 57677, 55110, 52205]
55086E2205j200J140K114J420K24p61j836l234m416m566l415j559k3O27Q34J348
55070C8902K193K741K695K304J701Q10J4O5J000J864J851J187N09P3k02l91n95
55053E6721q15o52L00J555K092J806J701K259K655K314K161L116M258L955K368
55038H5794J292J463J621O21q50j476j141o58l84j07J52J91L61J297K893M209
55022I5278M483L707K279O99m20p79r21j566k280j840k70O00m92k203k170j55
55006I3950J717J773O13k02j31J66r8j078k163k371j391l25o20k098k877j682
54990H3183O50K403K874K318J013n89j349m10J392K142R49j267l085l872l657
54975H2695k644j325n67r06j836k121r31J342L401M229L896L060J971M62j059
$$ y = [52205, 51005, 52145, 54259, 55679, 55903, 55142, 53306, 50072, 45656, 41090, 37675, 36116, 36093, 36720, 37554, 38902, 41095, 43836, 46531, 48835, 50536, 51346, 51360, 51425, 52425, 54289, 56140, 57327, 57836, 57909, 57707, 57316, 56721, 55906, 55254, 55554, 57109, 59201, 61007, 62708, 64967, 67622, 69936, 72097, 75213, 79471, 83426, 85794, 87086, 88549, 90170, 90791, 89941, 88465, 87324, 86666, 86282, 86175, 86327, 86518, 86879, 88176, 91069, 95278, 99761, 103468, 105747, 106446, 106026, 105247, 104326, 102760, 100480, 98640, 98370, 98970, 98478, 96275, 94105, 93950, 95667, 97440, 98053, 97851, 97720, 97886, 97788, 96710, 94547, 92176, 90785, 90460, 89840, 87742, 84865, 83183, 83833, 86236, 89110, 91428, 92441, 91852, 90503, 90093, 91485, 93627, 94576, 93309, 90224, 86352, 82695, 80051, 78726, 78159, 77253, 75417, 73296, 72365, 73707, 77108, 81337, 85233, 88293, 90264, 90726, 89667]
54960H9667j445j95J596K338J709P26L34N29P44N33L0L1J312L357M305L005O87
54943A09263l44M58J414J016l43j266j052r4O79M04r68k277k155p06N65P53N45
54926A05892P47Q42m5j471k059j265J13J055J170N34n82j737k585l045k930j794
54910I2840J16J264K78k008l071j680O67J839J722J872L037M187M052K707J270
54895A09092N72O33J221K280L662M821N261N292N916P574R345R920R258Q590Q676
54880A92113Q880Q461Q080R115J1719J4431J5617J4628J1610P232K820k60k032
54867C02414m050p372j1045j3279j3691j3369j2982j2077j0399q803q090p679
54855A79578o362m174k683l144m892n938m986k502O1J573J705Q14kP68L596O808
$$ y = [89667, 88222, 88027, 89623, 91961, 93670, 94396, 94730, 95259, 96003, 96536, 96566, 96597, 97909, 101266, 105571, 108576, 109263, 108919, 109377, 110791, 111807, 111464, 110198, 109146, 109052, 109731, 110135, 109167, 106890, 104735, 104029, 104594, 105347, 105892, 106639, 107481, 107436, 105965, 103906, 102641, 102754, 103809, 104979, 105513, 104931, 103194, 100609, 97564, 94634, 92840, 92956, 94220, 94498, 92490, 89419, 87739, 88406, 90245, 91967, 93839, 96876, 101063, 105115, 107822, 109092, 109664, 110297, 111518, 113798, 117460, 122281, 127542, 132834, 138750, 146324, 155669, 165589, 174847, 183437, 192113, 200993, 209454, 217534, 226649, 238368, 252799, 268416, 283044, 294654, 301886, 304706, 304446, 302414, 298364, 290992, 279947, 266668, 252977, 239608, 226626, 214549, 204150, 195347, 187257, 179578, 173216, 169042, 166359, 163215, 158323, 152385, 147399, 144897, 144958, 146531, 148236, 149050, 149048, 149816, 153412, 160220]
54839A60220Q042P101O331P529R661J0690J0561J0785J1615J1581R917P677N796
54826B77506L575K1m344q028j0248j1218j1397j1211j1093j1089j0737r832q817
54813A73088q048p303o482o002n819m987l169j779k352m136m756l175q00M64J65
54798A14909p83j228n34R12J692O80j414k647k195j228j098j621j794j447j258
54783A00946j555j939j993j770j520j299r52k96N04Q04R7j115j628j038l59o24
54767H6263j350j296l72K40j5j95N64J548J453L97k83j9K77n4j55J023K858L625
54749I4509K734J374P79Q32P64M69M97J116J894K194J862J531K181M027N914O455
54733A29132N792N473O270P135O899O190O603Q454J0554J2026J3229J4662J5944
$$ y = [160220, 168262, 175363, 181694, 189223, 198884, 209574, 220135, 230920, 242535, 254116, 264033, 271710, 277506, 281081, 281102, 276758, 268730, 258482, 247264, 235867, 224656, 213563, 202474, 191737, 181905, 173088, 165040, 157737, 151255, 145253, 139434, 134447, 131278, 129499, 127147, 123011, 118255, 115080, 114280, 114744, 114909, 114126, 112898, 112364, 113276, 114968, 115648, 114234, 111587, 109392, 108164, 107066, 105445, 103651, 102204, 100946, 99391, 97452, 95459, 93689, 92169, 90870, 89918, 89622, 90126, 90930, 91027, 89912, 88284, 87246, 86887, 86263, 84913, 83617, 83245, 83485, 83470, 83275, 83839, 85387, 86840, 87237, 86954, 86935, 87212, 87158, 87003, 88026, 90884, 94509, 97243, 98617, 99396, 100228, 100992, 101461, 101958, 103074, 104968, 107162, 109024, 110555, 112736, 116763, 122677, 129132, 134924, 140397, 146667, 153802, 160701, 166891, 173494, 181948, 192502, 204528, 217757, 232419, 248363]
54720B48363J6336J5637J4040J1591Q310M696J533q93l090n625q178r627r340
54707B83753q141p511p890q221p408n651m041l328l375l517l059j668L99K498
54693B22840M030M490L498J521L62J658M723P234Q384R802J2578J5204J5987J5949
54679C28260J7170J9298K0079J8925J7407J6134J3556Q621K600k681o836j0231
54667D42302j2768j4415j5775j7109j7699j7127j6227j5873j5672j4840j3607
54656B71190j2782j2465j2095j1340j0215q709o970n410m255l426l160l824m761
54643A71778m534l020k042k806l914l355j498l60m54m27K90M61o98j939j663j07
54627A45712J185J429J138Q89N55j45q51p90L68J988K976K813K044J706K349L648
$$ y = [248363, 264699, 280336, 294376, 305967, 314277, 318973, 320506, 319613, 316523, 310898, 302720, 293093, 283753, 275612, 268101, 260211, 251990, 244582, 238931, 234890, 231562, 228187, 224670, 221611, 219943, 220342, 222840, 226870, 231360, 234858, 236379, 236741, 238399, 243122, 250356, 258740, 268542, 281120, 296324, 312311, 328260, 345430, 364728, 384807, 403732, 421139, 437273, 450829, 459450, 462050, 459369, 452533, 442302, 429534, 415119, 399344, 382235, 364536, 347409, 331182, 315309, 299637, 284797, 271190, 258408, 245943, 233848, 222508, 212293, 203584, 196614, 191204, 186949, 183523, 180363, 176539, 171778, 167244, 164224, 162182, 159376, 155462, 152107, 150609, 150249, 149795, 149368, 149658, 150119, 149421, 147482, 145819, 145712, 146897, 148326, 149464, 150353, 150908, 150763, 149912, 149122, 149490, 151478, 154454, 157267, 159311, 161017, 163366, 167014]
54611A67014M713M735L508J547l13j434j464k30J946M013M915M702M291M109L689
54596B05741K798K063J975K073J766J322J321J745K281K973L778M078L554L111
54582B40579L889N507O421O026N387N745P077Q531R689J0963J2877J5294J7335
54569C55320J8243J8180J7842J7286J5923J3882J2368J1762J0212N497j887q706
54557D85922j2308j3069j3330j4607j6311j6811j5419j3288j2246j2790j3768
54546C31975j4118j4050j3987j3382j1620r348p627o321m760l592m278o605q307
54533B13980p682n361l035j611j193j745k916l953m477m810n148n101m511l968
54519A58469l923l973l645l228l166l203k777j889r87l48j10n22j596k745l326
$$ y = [167014, 171727, 176462, 179970, 181517, 181204, 179770, 178306, 178076, 180022, 184035, 188950, 193652, 197943, 202052, 205741, 208539, 210602, 212577, 214650, 216416, 217738, 219059, 220804, 223085, 226058, 229836, 233914, 237468, 240579, 244468, 249975, 256396, 262422, 267809, 273554, 280631, 289162, 298851, 309814, 322691, 337985, 355320, 373563, 391743, 409585, 426871, 442794, 456676, 469044, 480806, 491018, 496515, 494628, 485922, 473614, 460545, 447215, 432608, 416297, 399486, 384067, 370779, 358533, 345743, 331975, 317857, 303807, 289820, 276438, 264818, 255470, 247843, 241522, 236762, 233170, 228892, 222287, 213980, 206298, 200937, 197902, 196291, 195098, 193353, 190437, 186484, 182007, 177197, 172049, 166948, 162437, 158469, 154546, 150573, 146928, 143700, 140534, 137331, 134554, 132665, 131678, 131330, 131220, 130698, 129102, 126357, 123031]
54504A23031l264k858k183j119K51J607K503K386J003q76j718q00Q23J421M76
54489A20683r76j591q05J015K875L630K734P99p80r50K18J776K884L533M257N091
54473A44393N235M084K313J325J758L083M502N551N947N728N651O541P954Q462
54459B12527P636O773P031P824P843O854N475L729J098k129m661n652n796o592
54445B41960q750j1315j2368j0800p539m786l966m836o398p795q166o837m413
54432A43991k633k259j973m89J110P44j362k567j275J068K090J381L45K5J43J66
54416A38505K14O60J251J203K10j013j496j084m17J2K17K40J09L06J325K522K507
54399A45271J282O43J638K815K465J350J293J815O10k566m927m300j820R4P25
$$ y = [123031, 119767, 116909, 114726, 113607, 113858, 115465, 117968, 120354, 121357, 120481, 118763, 117963, 118786, 120207, 120683, 119707, 118116, 117311, 118326, 121201, 124831, 127565, 128364, 127584, 126634, 126852, 128628, 131512, 135045, 139302, 144393, 149628, 153712, 156025, 157350, 159108, 162191, 166693, 172244, 178191, 183919, 189570, 196111, 204065, 212527, 220163, 226936, 233967, 241791, 249634, 256488, 261963, 265692, 266790, 264661, 260000, 254348, 248552, 241960, 233210, 221895, 209527, 198727, 191188, 186402, 182436, 177600, 171202, 163407, 155241, 148404, 143991, 141358, 139099, 137126, 136637, 137747, 138491, 137129, 134562, 133287, 134355, 136445, 137826, 138171, 138196, 138339, 138505, 138719, 139379, 140630, 141833, 142043, 141030, 139534, 138450, 138033, 138045, 138262, 138502, 138611, 138917, 140242, 142764, 145271, 146553, 147196, 148834, 151649, 154114, 155464, 156757, 158572, 159182, 156616, 151689, 147389, 145569, 145663, 146388]
54384A46388P61L18r60k477k858j586L67J543J110o43k384k738j700o54n37p63
54368A33187m60J17L94Q42K049K998J979p71k966l266k822l108l531k515p2K089
54352A24144K813K497J927J330Q88J126K115L074L478L876M737N134L865J694
54338A62698J044K971N630O524N399L934L330L377L491L396K750J258n71j791
54324B03440k273k707l155k780j535r10k022l824m431l777l631n012o736o967
54310A53680n418l465k447k355k121r82O18J520J145L5r24j261p68O90K568L401
54294A43916K153k33j553p26J199K549K707K017R33n9k12Q12K217K727K049J164
54278A61660J069J721K391K562K202J501Q08O23J125J619R88j014l194m124l773
$$ y = [146388, 147149, 147467, 146507, 144030, 141172, 139586, 139953, 141496, 142606, 141963, 139579, 136841, 135141, 134487, 133950, 133187, 132727, 132844, 133238, 134080, 136129, 139127, 141106, 140335, 137369, 134103, 131281, 128173, 124642, 122127, 122055, 124144, 126957, 129454, 131381, 132711, 133599, 134725, 136840, 139914, 143392, 147268, 152005, 157139, 161004, 162698, 163742, 166713, 172343, 178867, 184266, 188200, 191530, 194907, 198398, 201794, 204544, 205802, 205231, 203440, 201167, 198460, 195305, 192525, 190990, 190080, 188058, 184234, 179803, 176026, 172395, 167383, 160647, 153680, 148262, 144797, 142350, 139995, 137874, 136892, 137510, 139030, 140175, 140210, 139286, 138025, 137257, 137947, 140515, 143916, 146069, 145836, 144283, 143557, 144756, 147305, 150012, 152029, 152962, 152903, 152691, 153503, 155720, 158447, 160496, 161660, 162729, 164450, 166841, 169403, 171605, 173106, 173914, 174537, 175662, 177281, 178269, 177255, 174061, 169937, 166164]
54263A66164l503m281n405n391l886k080j165q72q9J296J834J65l115n807o384
54248A27481n421m461l948k954r27J061J387j22j751j706m1J391R07j263l270
54233A06363l522k108l90M76L64j46m12q7P36J547J856J637J200O52n0n70k81
54216A07265P88J613J235j50j540k239k175j399l7J272J533M41j055j587p60M90
54200A03695R37L87k04O6R69J581J567J449J557J500J079R65J636K288J764L97
54184A21633l12M6J30j070k528k564j192M8K44K4K70R07J362J440J194N07o00
54167A19539j485j386l83O51J174J571K418L432L640K462L87j485k296j816m15
54152A26008J110J807J177l86j935k844l176l101k363p22J206K086J164q43k389
$$ y = [166164, 162661, 158380, 152975, 147584, 143698, 141618, 140453, 139581, 139492, 140788, 142622, 142787, 139672, 133865, 127481, 122060, 117599, 113651, 110697, 109770, 110831, 112218, 112096, 110345, 108639, 108598, 109989, 110896, 109633, 106363, 102841, 100733, 100343, 100819, 101183, 101037, 100625, 100538, 101274, 102821, 104677, 106314, 107514, 108166, 108116, 107546, 107265, 108053, 109666, 110901, 110751, 109211, 106972, 104797, 103398, 103361, 104633, 106166, 106607, 105552, 103965, 103205, 103695, 104632, 105019, 104815, 104881, 105850, 107431, 108998, 110447, 112004, 113504, 114583, 115548, 117184, 119472, 121236, 121633, 121321, 121367, 121497, 120427, 117899, 115335, 114143, 114191, 114435, 114459, 114729, 115636, 116998, 118438, 119632, 120139, 119539, 118054, 116668, 116285, 116936, 118110, 119681, 122099, 125531, 129171, 131633, 132020, 130535, 128239, 126423, 126008, 127118, 128925, 130102, 129716, 127781, 124937, 121761, 118660, 116297, 115575, 116781, 118867, 120031, 119188, 116799]
54137A16799k580j723o68j9L6m14j081j683k202k659k601j474K23R00k41j836
54121I8777j873l42Q48O61L33J307K991L588K579J238Q87J527K193J956N61j367
54105A15864k767l138k969k806k407j469n91m56l86R26L137M121K636K1j549j533
54089A06634r60p55j148k174l597m512m025k374o51N25J288J637J199J32o12m38
54073I0169O9ko32j043q73n49m73l76K10J135J672J367N41j44m27n02n19m01j14
54054H9108J34J15j96o67j095j300j326j519j985k185j573o64o60j770k638j949
54038F9830l4J686K357K156J557Q83L94R0l50r15q95J87J561K024J569J290J720
54021H5110K164J782N46r94k130k137q75O50J186Q21P34J305J653J328J118J525
$$ y = [116799, 114219, 112496, 111828, 111809, 111845, 111431, 110350, 108667, 106465, 103806, 101205, 99731, 99954, 100854, 100613, 98777, 96904, 96562, 97410, 98071, 98404, 99711, 102702, 106290, 108869, 110107, 110994, 112521, 114714, 116670, 117231, 115864, 113097, 109959, 106990, 104184, 101777, 100308, 99717, 99261, 98875, 99801, 102938, 107059, 109695, 109716, 108167, 106634, 105674, 104919, 103771, 101597, 98000, 93488, 89463, 87089, 86438, 86963, 88251, 89888, 91087, 91219, 90607, 90169, 90238, 90236, 89604, 88561, 87688, 87139, 86666, 86290, 86500, 87635, 89307, 90674, 91215, 91071, 90644, 90142, 89623, 89222, 89108, 89242, 89357, 89161, 88494, 87399, 86099, 84773, 83254, 81269, 79084, 77511, 76847, 76187, 74417, 71779, 69830, 69796, 71482, 73839, 75995, 77552, 78435, 78829, 78919, 78569, 77654, 76759, 76946, 78507, 80531, 82100, 83390, 85110, 87274, 89056, 89602, 88608, 86478, 84341, 83466, 84116, 85302, 86123, 86857, 88162, 89815, 91143, 92261, 93786]
54005I3786J878J873K652M943P105O748L867Q17o23o72j67O84J765K615L103L593
53989A33967M032L801K886K295K682L360L381K916K832L394M135M776N452O111
53975A86020O401O200N853N656N566N568O050P358Q971R595Q486O528N366N422
53961B79040N424M332K917K625L421L874L166J929J006M49j3m79j230k657m423
53946B99381n527n598n305n100m646l966m059n374o715o734n701m699l883k882
53932B29192k164k401k827k042m11O9j447l520m536m431l677k126M8J528J354
53917B02609M60M88J439J811Q52l78m22J024L035M326M004K050n90k631l407l199
53901B11471k745k528k418j829m65J017J419M33p54p45L90J274J000J27k07K64
$$ y = [93786, 95664, 97537, 100189, 105132, 112237, 118985, 122852, 123669, 123046, 122374, 122207, 122891, 124656, 127271, 130374, 133967, 137999, 141800, 144686, 146981, 149663, 153023, 156404, 159320, 162152, 165546, 169681, 174457, 179909, 186020, 192421, 198621, 204474, 210130, 215696, 221264, 227314, 234672, 243643, 253238, 261724, 268252, 273618, 279040, 284464, 288796, 291713, 294338, 297759, 301633, 304799, 306728, 307734, 308183, 308170, 307691, 306461, 303804, 299381, 293854, 288256, 282951, 277851, 273205, 269239, 265180, 259806, 253091, 246357, 240656, 235957, 232074, 229192, 227028, 224627, 221800, 219758, 219347, 219416, 217969, 214449, 209913, 205482, 201805, 199679, 199727, 201255, 202609, 203069, 203557, 204996, 206807, 207659, 207281, 206859, 207883, 210918, 215244, 219248, 221298, 220708, 218077, 214670, 211471, 208726, 206198, 203780, 201951, 201486, 202503, 203922, 204355, 203601, 202856, 203246, 204520, 205520, 205647, 205440, 205704]
53885B05704P60N77L2J41J397L131M265M472M353M585N409O707Q030Q511P528
53870B65602N741M603M506M250K976J700J922L367M364M127L427L071K926K780
53856C15362K954L637M478N188N871O399O385O168O766Q208Q907P714N661M493
53842C98191M130L169J547Q27J501J833L53j871k794k341k203l141m188m612n086
53827C85315o259p434p606o946o287n891n773o548q473j0040r255o597m984o052
53813B87170p910p762n597l817l858m861n489n441m865l732k515k365l643m975
53799B20340m737l192k230k973m428m837l837k742k795l765m445m157l236k197
53785A70769j198m31k75n37k91P88J494N05j568k715k038o92j35n16j140j540
$$ y = [205704, 206464, 207041, 207073, 207214, 208611, 211742, 216007, 220479, 224832, 229417, 234826, 241533, 249563, 258074, 265602, 271343, 275946, 280452, 284702, 287678, 289378, 291300, 294667, 299031, 303158, 306585, 309656, 312582, 315362, 318316, 321953, 326431, 331619, 337490, 343889, 350274, 356442, 363208, 371416, 380323, 388037, 393698, 398191, 402321, 405490, 407037, 407864, 409365, 411198, 411551, 409680, 406886, 404545, 402342, 399201, 395013, 390401, 385315, 379056, 371622, 364016, 357070, 350783, 344892, 339119, 332571, 324098, 314058, 304803, 298206, 293222, 287170, 279260, 271498, 265901, 262084, 258226, 253365, 247876, 242435, 237570, 233838, 231323, 228958, 225315, 220340, 215603, 212411, 210181, 207208, 202780, 197943, 194106, 191364, 188569, 184804, 180359, 176202, 172966, 170769, 169571, 169140, 168865, 168328, 168037, 168825, 170319, 170824, 169256, 166541, 164503, 163811, 163676, 163160, 162020, 160480]
53769A60480j482p49L80J018O32k69q85r86o81O3J012J449J033M52N46J258K078
53752A65349L015M208N006M503K879J364R23J638L147M844N779N412M536M526
53738B17129N559O424O277N584N078M726M278L999M139M334M189M090M666N763
53724B86235O483O150M835L170J851J141N59o12k257l274k894j704j083j847l767
53709B92986n799o493m898j824L58O1j749k959l017l027l433l181j594K91J046
53694B56768N27n07j627k635k971k296j368j325k304l597m834o013o570n686l729
53679B11833k231k018k237j710m73N67Q09J70j099k290k519j765j046r17o78J50
53663A94546N23o03k083j635J017L645M363L512K376J484Q85Q13J203J378J155
$$ y = [160480, 158998, 158249, 158629, 159647, 160279, 160010, 159125, 158139, 157458, 157521, 158533, 159982, 161015, 161467, 162013, 163271, 165349, 168364, 172572, 177578, 182081, 184960, 186324, 187247, 188885, 192032, 196876, 202655, 208067, 212603, 217129, 222688, 229112, 235389, 240973, 246051, 250777, 255055, 259054, 263193, 267527, 271716, 275806, 280472, 286235, 292718, 298868, 303703, 306873, 308724, 309865, 310424, 309812, 307555, 304281, 301387, 299683, 298600, 296753, 292986, 287187, 280694, 275796, 273972, 274330, 274391, 272642, 269683, 266666, 263639, 260206, 257025, 255431, 255722, 256768, 257295, 256788, 255161, 252526, 249555, 247259, 245891, 244566, 242262, 238665, 233831, 227818, 221248, 215562, 211833, 209602, 207584, 205347, 203637, 203164, 203731, 204540, 204710, 203611, 201321, 198802, 197037, 195991, 195074, 194396, 194546, 195069, 194466, 192383, 190748, 191765, 195410, 199773, 203285, 205661, 207145, 208030, 208843, 210046, 211424, 212579]
53648B12579J414K842M740N838N700M712L456K682K978L688L215J312J1R02K601
53633B58670K670J283Q39K204L511L052J438K18J0O64J889K842K382O40p32p00
53617B80880j69l20p62m45M62Q63M08k51n35l64P8L47j19j087j329k03J131J047
53599B79632m12j750k046j694j341j147j107j181j074n93k5M86J491L163M217
53584B76619L222R22l36K94J129M89j080j937j425N7K107M227N358M715K968J603
53568B98932J237J288J204J166J499K110K781L562M517N309N394M610L429K485
53554C39523J885J263P42J302L586O456P781O872N348N015N727O116N822N832
53540D03270O688P502P089N518L979L455L805M160M016L780M117M780M624L094
$$ y = [212579, 213993, 216835, 221575, 227413, 233113, 237825, 241281, 243963, 246941, 250629, 253844, 255156, 255167, 256069, 258670, 261340, 262623, 263462, 265666, 269177, 272229, 273667, 273885, 273895, 274559, 276448, 279290, 281672, 282312, 281580, 280880, 280711, 280391, 279629, 279184, 279646, 280509, 280917, 280666, 280131, 279767, 279845, 280192, 280073, 278986, 277657, 277454, 278585, 279632, 279220, 277470, 275424, 273730, 272389, 271242, 270135, 268954, 267880, 267287, 267262, 267748, 269239, 272402, 276619, 279841, 280763, 280427, 280721, 281850, 282339, 281259, 279322, 277897, 277954, 280061, 284288, 289646, 294361, 297329, 298932, 300169, 301457, 302661, 303827, 305326, 307436, 310217, 313779, 318296, 323605, 328999, 333609, 337038, 339523, 341408, 342671, 343413, 344715, 348301, 354757, 362538, 369410, 374758, 379773, 385500, 391616, 397438, 403270, 409958, 417460, 424549, 430067, 434046, 437501, 441306, 445466, 449482, 453262, 457379, 462159, 466783, 469877]
53526D69877J217N33J202J910J592N87l6L17J419K528K715J510m15j625j460q57
53510D81014j104k162k799k205p63Q05K276L654M516M235K714O71q39j116k41
53495D88656J064K053K566K864L071L124L225L755M555M858M371L933M475N727
53481E38297O644O836O735O469N606M218L263L421M335N496P075R108J0491R991
53467F27985Q073O777P600J0205J3198J5545J6930J7492J7698J8182J9208K0347
53455G99240K0886K0512J9529J8523J8045J8563K0521K3961K7857L0292L0175
53444A048104K8843K8970L1482L4406L5471L4856L4376L4752L5179L5145L4981
53433A416565L4635L3581L2222L1835L2601L3204L3016L3077L3920L4103L2470
$$ y = [469877, 471094, 471627, 472829, 474739, 476331, 476918, 476882, 477199, 478618, 481146, 483861, 485371, 484956, 483331, 481871, 481014, 479910, 477748, 474949, 472744, 471981, 472786, 475062, 478716, 483232, 487467, 490181, 490852, 490013, 488897, 488656, 489720, 491773, 494339, 497203, 500274, 503398, 506623, 510378, 514933, 519791, 524162, 528095, 532570, 538297, 544941, 551777, 558512, 564981, 570587, 574805, 578068, 581489, 585824, 591320, 598395, 607503, 617994, 627985, 636058, 642835, 650435, 660640, 673838, 689383, 706313, 723805, 741503, 759685, 778893, 799240, 820126, 840638, 860167, 878690, 896735, 915298, 935819, 959780, 987637, 1017929, 1048104, 1076947, 1105917, 1137399, 1171805, 1207276, 1242132, 1276508, 1311260, 1346439, 1381584, 1416565, 1451200, 1484781, 1517003, 1548838, 1581439, 1614643, 1647659, 1680736, 1714656, 1748759, 1781229]
53422A781229L0516L0559L2301L3240L2204L0547K9707K9370K8679K7722K7005
53411B113079K6440K5648K4523K2896K0359J7102J4313J2895J2169J0473P044
53400B306941K934m9j189j761l923q340j3254j6304j7060j6973j7207j7789j8837
53387B177189k0991k3817k5331k4405k2746k2908k4903k6348k5871k4615k4052
53376A911202k3884k3162k2234k2072k2100k0275j5881j1116q961r793j1058j0337
53364A710329p894n750m888m287k476Q62M909Q493J0583J0844J0278J0679J2768
53351A754450J5403J7195J8313J9860K2026K4023K5661K7724L0645L3871L6838
53340B026009L9520M1625M2400M2053M2335M4653M8237N1329N3739N6790O0852
$$ y = [1781229, 1811745, 1842304, 1874605, 1907845, 1940049, 1970596, 2000303, 2029673, 2058352, 2086074, 2113079, 2139519, 2165167, 2189690, 2212586, 2232945, 2250047, 2264360, 2277255, 2289424, 2299897, 2306941, 2309875, 2309826, 2308637, 2306876, 2302953, 2294613, 2281359, 2265055, 2247995, 2231022, 2213815, 2196026, 2177189, 2156198, 2132381, 2107050, 2082645, 2059899, 2036991, 2012088, 1985740, 1959869, 1935254, 1911202, 1887318, 1864156, 1841922, 1819850, 1797750, 1777475, 1761594, 1750478, 1741517, 1731724, 1720666, 1710329, 1702435, 1696685, 1691797, 1687510, 1685034, 1685896, 1690805, 1699298, 1709881, 1720725, 1731003, 1741682, 1754450, 1769853, 1787048, 1805361, 1825221, 1847247, 1871270, 1896931, 1924655, 1955300, 1989171, 2026009, 2065529, 2107154, 2149554, 2191607, 2233942, 2278595, 2326832, 2378161, 2431900, 2488690, 2549542]
53329B549542O4383O5959O6150O6545O7624O8494O8347O7377O6205O5138O4214
53318C279978O3526O3206O3132O2827O1612N8996N5046N0363M5572M0929L6432
53307C881619L2121K7823K2806J6217Q163J4o807j2211j7374k3205k9312l4638
53295C865216l8863m2744m6995n1267n4576n6554n7800n9013o0139o0705o0615
53284C275945o0242n9843n9316n8566n7729n6891n5919n4788n3852n3451n3295
53273B652053n2550n0712m8288m6295m5087m3852m1514l7992l4185l0783k7697
53262B193098k4869k2887k2232k2373k2474k2552k2993k3158k1844j9295j7318
53251A951103j6787j6375j4782j2923j2408j2758j2032r794p530n928l820n57
$$ y = [2549542, 2613925, 2679884, 2746034, 2812579, 2880203, 2948697, 3017044, 3084421, 3150626, 3215764, 3279978, 3343504, 3406710, 3469842, 3532669, 3594281, 3653277, 3708323, 3758686, 3804258, 3845187, 3881619, 3913740, 3941563, 3964369, 3980586, 3988749, 3988763, 3981956, 3969745, 3952371, 3929166, 3899854, 3865216, 3826353, 3783609, 3736614, 3685347, 3630771, 3574217, 3516417, 3457404, 3397265, 3336560, 3275945, 3215703, 3155860, 3096544, 3037978, 2980249, 2923358, 2867439, 2812651, 2758799, 2705348, 2652053, 2599503, 2548791, 2500503, 2454208, 2409121, 2365269, 2323755, 2285763, 2251578, 2220795, 2193098, 2168229, 2145342, 2123110, 2100737, 2078263, 2055711, 2032718, 2009560, 1987716, 1968421, 1951103, 1934316, 1917941, 1903159, 1890236, 1877828, 1865070, 1853038, 1843244, 1835714, 1829786, 1825966, 1825409]
53239A825409K323L153K606K670M003N764P611J0273J4018J7970K1231K3658K5218
53226A965907K5572K4946K4569K5515K7398K8893K9192K8581K7764K7125K6500
53215B261962K5314K3062K0001J7144J5178J3503J0916P138L139j60k875n586
53203B388736q311j0757j3130j5926j8889k0935k1586k1934k3532k6472k9142
53192B178122l0147k9927l0180l1809l3937l4971l4286l2730l1606l1541l2232
53181A824756l2936l3014l2289l1192l0407l0142k9914k9256k8369k7622k6606
53170A493009k4537k1643j9397j8868j9386j9486j8738j7970j7795j7515j5830
53159A281844j2427q840p426r012j1636j2427j0918r504j0146j1882j2720j2738
$$ y = [1825409, 1827732, 1830885, 1833491, 1836161, 1840164, 1845928, 1853539, 1863812, 1877830, 1895800, 1917031, 1940689, 1965907, 1991479, 2016425, 2040994, 2066509, 2093907, 2122800, 2151992, 2180573, 2208337, 2235462, 2261962, 2287276, 2310338, 2330339, 2347483, 2362661, 2376164, 2387080, 2394218, 2397357, 2397197, 2394322, 2388736, 2380425, 2369668, 2356538, 2340612, 2321723, 2300788, 2279202, 2257268, 2233736, 2207264, 2178122, 2147975, 2118048, 2087868, 2056059, 2022122, 1987151, 1952865, 1920135, 1888529, 1856988, 1824756, 1791820, 1758806, 1726517, 1695325, 1664918, 1634776, 1604862, 1575606, 1547237, 1519615, 1493009, 1468472, 1446829, 1427432, 1408564, 1389178, 1369692, 1350954, 1332984, 1315189, 1297674, 1281844, 1269417, 1260577, 1253151, 1244139, 1232503, 1220076, 1209158, 1199654, 1189508, 1177626, 1164906, 1152168]
53147A152168j3531j5247j6323j6175j6035j6548j6485j4862j2717j1673j1874
53136I90698j2482j3128j3607j3265j2048j1315j2206j3808j4442j4095j3999
53125H46303j4222j3597j2041j1170j2007j3463j3832j2863j1709j1430j2017
53114G07952j2473j1665r533p468o968q008r248r654r184q244p376p228p860q260
53100E84783p627o827p253q445q551p190o088o389p116p116o830p046p288o820
53086D84197o058n771n700n225m641m533m672m638m739n126m803l035j040p19
53072D23497j983k987k785k258k269k485k387k252k585l348m139m563m378l805
53058C81273l605m162m739m425l539l161l505l808l666l329k837k055j576k152
$$ y = [1152168, 1138637, 1123390, 1107067, 1090892, 1074857, 1058309, 1041824, 1026962, 1014245, 1002572, 990698, 978216, 965088, 951481, 938216, 926168, 914853, 902647, 888839, 874397, 860302, 846303, 832081, 818484, 806443, 795273, 783266, 769803, 755971, 743108, 731399, 719969, 707952, 695479, 683814, 674281, 666813, 659845, 651837, 642589, 632935, 623751, 615507, 608131, 600903, 593043, 584783, 577156, 570329, 563076, 554631, 546080, 538890, 532802, 526413, 519297, 512181, 505351, 498305, 491017, 484197, 478139, 472368, 466668, 461443, 456802, 452269, 447597, 442959, 438220, 433094, 428291, 425256, 424216, 423497, 421514, 418527, 415742, 413484, 411215, 408730, 406343, 404091, 401506, 398158, 394019, 389456, 385078, 381273, 377668, 373506, 368767, 364342, 360803, 357642, 354137, 350329, 346663, 343334, 340497, 338442, 336866, 334714]
53044C34714l130k880j202M6p05k939n184o726p348o616m470j973m49k47q79j856
53028B88156k801l360l555l667l436k139L0J626J724J155J123J490J514J498K268
53013B81626L395L422J996N16K47P44P03j81p99K7K058L672L508J966N67o7q38
52996C02562k454m172m895m717m406l987k973j695j208j995l575n261o416o257
52982B48551m633k793k195k512k110o58K35n40j942k416k004j810k289l080l866
52967B15938m253l518j598J1k98k085l360l221k649k483k060o68Q89J309P69O57
52951A93380J540K434K171P12j048k084j829o54J68l28j396j405k38K63j041k668
52935A87977k552j022p1j66K05J667K751K308J368J282J463N95q40j073K04J336
$$ y = [334714, 331584, 328704, 327502, 327548, 326843, 323904, 318720, 311994, 304646, 298030, 293560, 291587, 291138, 290891, 290012, 288156, 285355, 281995, 278440, 274773, 271337, 269198, 269228, 270854, 272578, 273733, 274856, 276346, 277860, 279358, 281626, 285021, 288443, 290439, 290955, 291202, 291946, 292649, 292468, 291669, 291696, 293754, 297426, 300934, 302900, 303467, 303400, 302562, 300108, 295936, 291041, 286324, 281918, 277931, 274958, 273263, 272055, 270060, 266485, 261224, 254808, 248551, 243918, 241125, 238930, 236418, 234308, 233650, 233885, 233345, 231403, 228987, 226983, 225173, 222884, 219804, 215938, 211685, 208167, 206569, 206580, 206282, 204197, 200837, 197616, 194967, 192484, 190424, 189756, 190645, 191954, 192723, 193380, 194920, 197354, 199525, 200237, 199189, 197105, 195276, 194622, 194790, 194462, 193066, 191661, 191423, 191686, 190645, 187977, 185425, 184403, 184332, 184166, 184371, 186038, 188789, 191097, 192465, 193747, 195210, 195805, 194965, 193892, 194096, 195432]
52919A95432J036j65j084j388j466j557j516r78K96J804K303J203k95m37P03J306
52903A95197N51j66O08K172K742K047J499K087L218L775L420K469J239k0q28p78
52887B19232j18L30J69R0J089L053M563M487L260K206J916J966J958K006K171
52872B48378K233K257K646L364L659L006J815R73J104K436M722P006Q033P460
52858B99092O110M832L715K790K630L434M219L905K756J755R12n42k386l223k570
52843C27429j923k902m967n938m543j747M56R06q5j370j879j217Q9J006Q70mp69
52826C03412j089j356j835k066j545o59j80n1M97J482J726M47j444k414k159j572
52810B91194j160n07N63J298J007Q4n04m00l1J67J36q6l93k96Q38K803M221L791
$$ y = [195432, 196468, 196303, 195219, 193831, 192365, 190808, 189292, 188314, 188610, 190414, 192717, 193920, 193625, 193188, 193891, 195197, 195748, 195582, 196190, 198362, 201104, 203151, 204650, 206737, 209955, 213730, 217150, 219619, 220858, 220838, 220010, 219232, 219114, 219444, 219613, 219703, 220792, 223845, 228408, 232895, 236155, 238361, 240277, 242243, 244201, 246207, 248378, 250611, 252868, 255514, 258878, 262537, 265543, 267358, 268331, 269435, 271871, 276593, 283599, 291632, 299092, 305202, 310034, 313749, 316539, 319169, 322603, 326822, 330727, 333483, 335238, 336150, 335608, 333222, 329999, 327429, 325506, 322604, 317637, 311699, 307156, 305409, 305865, 306771, 306686, 305316, 303437, 302220, 302309, 303315, 304185, 304181, 303412, 302323, 300967, 299132, 297066, 295521, 294862, 294682, 294631, 295128, 296610, 298336, 298783, 297339, 294925, 292766, 291194, 290034, 289527, 290090, 291388, 292395, 292479, 291975, 291575, 291544, 291711, 291847, 291761, 291368, 291072, 291910, 294713, 298934, 302725]
52792C02725J849J08k80K07N84Q94J850L319M062L172J037j270k995l729l256
52777C08277j899o03k9J74O48J140Q10l68j329j307q38r36j736k470k549k066
52761B94919j331m42L99O88J57p42j303j436j631k129k552k458j877j144o67q33
52745B77618j597k006r08J438L228L202K130J500J442J103N05N91J483K105J711
52730B93545O52o00k011l241l536k974k751l570m617m889m715n066n938o295n362
52715B38632l457j716j224j975k743k455j648j590k164k060j196j160k570l870
52701B08804l803l328l573l615k225n22n54k087l069k859k713l257l586l129k437
52686A68047j872j216q33j452k548k639j573q19j076j389j150j124j747k169j971
$$ y = [302725, 304574, 304682, 304402, 304609, 305193, 306087, 307937, 311256, 315318, 318490, 319527, 318257, 315262, 311533, 308277, 306378, 305775, 305746, 305920, 306568, 307708, 308518, 308150, 306821, 305514, 304676, 303740, 302004, 299534, 296985, 294919, 293588, 293146, 293545, 294233, 294390, 293648, 292345, 290909, 289278, 287149, 284597, 282139, 280262, 279118, 278451, 277618, 276021, 274015, 273107, 274545, 277773, 280975, 283105, 284605, 286047, 287150, 287655, 288246, 289729, 291834, 293545, 294197, 293597, 291586, 288345, 284809, 281835, 279084, 275514, 270897, 266008, 261293, 256227, 250289, 243994, 238632, 235175, 233459, 232235, 230260, 227517, 225062, 223414, 221824, 219660, 217600, 216404, 215244, 212674, 208804, 205001, 201673, 198100, 194485, 192260, 191738, 191184, 189097, 186028, 183169, 180456, 177199, 173613, 170484, 168047, 166175, 164959, 164126, 162674, 160126, 157487, 155914, 155095, 154019, 152630, 151480, 150356, 148609, 146440, 144469]
52671A44469k131l110l547k214L6J590K166K198J386m38j909j540r9J80j310k847
52655A32880k805j395L36J840K809K649J121r21k207k491k731l621m351l446r26
52640A16741J285J701J243J722K854K507K5k532l166k363j621j080o8J051J337
52625A19636J041J277K119K538K171J772J768J673J283J316K232L228L059J485
52611A46598m89j629j530q00l23k86k16j6l33j414k194j353R13L067M015L936
52595A47946L382K547J655J260J655K382K745K601K400K522K780K606J739O96
52581A78916K97O45Q97K93q99j743j675q99n6K20k52q99q74j01N71N55K49J69
52563A75414qq55k168l281m013m566m681l808k039k48P28O62jk59P78K639L413
$$ y = [144469, 142338, 139228, 135681, 133467, 133503, 135093, 137259, 139457, 140843, 140405, 138496, 136956, 136857, 137037, 135727, 132880, 130075, 128680, 129016, 130856, 133665, 136314, 137435, 136514, 134307, 131816, 129085, 125464, 121113, 117667, 116741, 118026, 119727, 120970, 122692, 125546, 128053, 128078, 125546, 122380, 120017, 118396, 117316, 117248, 118299, 119636, 120677, 121954, 124073, 126611, 128782, 130554, 132322, 133995, 135278, 136594, 138826, 142054, 145113, 146598, 146109, 144480, 142950, 142150, 141827, 141541, 141325, 141309, 140976, 139562, 137368, 136015, 136928, 139995, 144010, 147946, 151328, 153875, 155530, 156790, 158445, 160827, 163572, 166173, 168573, 171095, 173875, 176481, 178220, 178916, 179213, 179858, 180755, 181048, 180149, 178406, 176731, 175832, 175776, 175996, 175744, 174845, 173971, 173870, 174441, 174996, 175245, 175414, 175406, 174551, 172383, 169102, 165089, 160523, 155842, 152034, 149995, 149747, 150475, 151137, 151136, 150877, 151655, 154294, 157707]
52546A57707J757j214l021k602j158k92k77l69L2R35J956K547K268J123k92r49
52530A58151qK259M161M097K487J249J084N73j334l345l642k464j350p67j82K77
52514A61246J96K79J337K303J500l17o80O69J305K30l05J572M263N104L997K664
52498A85363J785R86N94J180J923J493K21l55P6L86K29O65K212L711L824K612
52482B06905J131K03L9L57N49J61l58R2J988M454N969N610L755J808J134J712
52466B35509K101J189k55n41O61J928K120J751J862K407K556K061J339M92r41
52451B54239k973m607m640k791P0K493L307K485J375J438K364K126l72l369m080
52436B47065k107L22J379J359J047K34j120j837j081L8J09k71L54J568J607L55
$$ y = [157707, 159464, 158250, 155229, 152627, 151469, 151177, 150900, 150531, 150563, 151498, 153454, 156001, 158269, 159392, 159100, 158151, 158143, 160402, 164563, 168660, 171147, 172396, 173480, 174053, 172719, 169374, 165732, 163268, 161918, 161151, 160969, 161246, 161442, 161721, 163058, 165361, 166861, 166544, 165864, 166533, 167838, 168068, 167763, 169335, 173598, 178702, 182699, 185363, 187148, 188134, 188728, 189908, 191831, 193324, 193545, 193190, 193266, 193652, 193881, 194546, 196758, 200469, 204293, 206905, 208036, 208239, 208278, 208635, 209184, 209345, 208987, 209079, 211067, 215521, 221490, 227100, 230855, 232663, 233797, 235509, 237610, 238799, 238544, 238003, 238664, 240592, 242712, 244463, 246325, 248732, 251288, 253349, 254688, 255180, 254239, 251266, 246659, 242019, 239228, 239298, 241791, 245098, 247583, 248958, 250396, 252760, 254886, 254514, 251145, 247065, 244958, 245280, 246659, 248018, 249065, 249299, 248179, 246342, 245261, 245299, 245408, 245137, 245491, 247059, 248666, 249021]
52420B49021m36p4K35l4M19K212L732L576K851L156L664K374m33k263j840n38
52404B65622ll3L56J008R38M8m78L51K078L312L266K322J169J3r40q98O21K524
52386B81276K977J651J76n5M73M34m81j520j934j567p85l05n60r13k12J560K964
52369B83179K909J817N39p93k010k180q92N72O23m91j196q48k85k02k19K05Q15
52352B81543Q60J1j153j503m48J194J949J461P36L75k88j613k421j521L81J542
52336B81105J510J313J730K425K713K232J108Q7J43J228K022J626Q33Q33J496
52321C02404J993K288K787L246L322L481L951L650J724m95r78J22R81J065J468
52306C31009K495L032K633K236K456K875L243L671L591K357J067J621L679M728
$$ y = [249021, 248585, 248511, 248746, 248712, 249131, 251343, 255075, 258651, 261502, 264658, 268322, 270696, 270263, 268000, 266160, 265622, 265619, 265586, 265942, 266950, 267888, 267936, 267458, 267809, 269887, 273199, 276465, 278787, 279956, 279969, 279029, 278131, 278752, 281276, 284253, 285904, 286080, 286025, 286498, 286932, 286451, 284931, 282997, 281430, 280645, 280340, 279780, 278867, 278655, 280215, 283179, 286088, 287905, 288444, 287651, 285641, 283461, 282569, 283141, 283764, 283273, 282077, 281229, 280944, 280742, 280523, 280728, 281543, 282403, 282414, 281261, 279758, 279310, 280504, 282453, 283914, 284650, 285025, 284737, 283124, 280703, 279182, 279563, 281105, 282615, 283928, 285658, 288083, 290796, 293028, 294136, 294223, 294366, 295594, 297616, 299242, 300075, 300908, 302404, 304397, 306685, 309472, 312718, 316040, 319521, 323472, 327122, 328846, 328351, 327373, 327495, 328476, 329541, 331009, 333504, 336536, 339169, 341405, 343861, 346736, 349979, 353650, 357241, 359598, 360665, 362286, 365965, 370693]
52292C70693L716K319J820J292J18q0K151N578P982Q871Q807P600N181L082K900
52277D32030M024M675M548M602M934M798M407M799N911O496O116N740O112O800
52263E05992P179P326P581Q026Q656R417J0000J0204J0478J1465J3119J4799J6175
$$ y = [370693, 374409, 376728, 378548, 379840, 379958, 379878, 382029, 387607, 395589, 404460, 413267, 420867, 426048, 429130, 432030, 436054, 440729, 445277, 449879, 454813, 459611, 464018, 468817, 474728, 481224, 487340, 493080, 499192, 505992, 513171, 520497, 528078, 536104, 544760, 554177, 564177, 574381, 584859, 596324, 609443, 624242, 640417]
$$ [...]
##END NTUPLES=NMR SPECTRUM
##END=
