
##TITLE=AC1185_Huila-guadalupe-HGUAH12020_5898926_BD3wntBXHu
##JCAMPDX= 6.0         $$ Bruker NMR JCAMP-DX V2.0
##DATA TYPE= NMR SPECTRUM
##DATA CLASS= NTUPLES
##ORIGIN= BRUKER
##OWNER= Administrator
$$ 1.72 TOPSPIN		Version 2.1
$$ 2012-04-10 10:23:29.953 -0500  Administrator@TOPSPIN
$$ Compression mode = diff/dup
##.OBSERVE FREQUENCY= 400.13188235
##.OBSERVE NUCLEUS= ^1H
##.ACQUISITION MODE= SIMULTANEOUS (DQD)
##.ACQUISITION SCHEME= undefined
##.AVERAGES= 8
##.DIGITISER RES= 22
##SPECTROMETER/DATA SYSTEM= spect
##.PULSE SEQUENCE= zg30
##.SOLVENT NAME= COFFEE_meoh
##.SHIFT REFERENCE= INTERNAL, COFFEE_meoh, 1, 14.98061
##AUDIT TRAIL= $$ (NUMBER, WHEN, WHO, WHERE, PROCESS, VERSION, WHAT)
$$ ##TITLE= Audit trail, TOPSPIN		Version 2.1
$$ ##JCAMPDX= 5.01
$$ ##ORIGIN= Bruker BioSpin GmbH
$$ ##OWNER= Administrator
$$ $$ C:\Bruker\TOPSPIN/data/COFFEE/nmr/AC1185_Huila-guadalupe-HGUAH12020_5898926_BD3wntBXHu/20/pdata/1/auditp.txt
$$ ##AUDIT TRAIL=  $$ (NUMBER, WHEN, WHO, WHERE, PROCESS, VERSION, WHAT)
(   1,<2012-04-04 19:41:45.500 -0500>,<Administrator>,<TOPSPIN>,<go>,<TOPSPIN 2.1>,
      <created by zg
	started at 2012-04-04 19:40:38.296 -0500,
	POWCHK enabled, PULCHK disabled,
       configuration hash MD5:
       1A 1E CE 29 27 FD 77 03 67 4E F0 E3 C4 B2 CB 90
       data hash MD5: 64K
       22 C8 83 07 DA 88 5D 59 E6 98 B1 03 01 86 55 D0>)
(   2,<2012-04-04 19:41:48.156 -0500>,<Administrator>,<TOPSPIN>,<proc1d>,<TOPSPIN 2.1>,
      <Start of raw data processing
       efp LB = 0 FT_mod = 6 PKNL = 1 PHC0 = 0 PHC1 = 0 SI = 32K 
       data hash MD5: 32K
       91 7F 70 EA 5F 8E 41 D0 89 1D A7 A6 09 7E E2 4D>)
(   3,<2012-04-04 19:41:48.593 -0500>,<Administrator>,<TOPSPIN>,<proc1d>,<TOPSPIN 2.1>,
      <pk PHC0 = 213.8654 PHC1 = 0 
       data hash MD5: 32K
       F4 51 75 21 25 F5 74 AF 8C DE 71 9D F3 18 02 C7>)
(   4,<2012-04-04 19:41:48.671 -0500>,<Administrator>,<TOPSPIN>,<proc1d>,<TOPSPIN 2.1>,
      <abs ABSG = 1 
       data hash MD5: 32K
       E8 A7 CD 79 AB 72 39 B1 D1 90 5F 70 0D 0E 9B EE>)
(   5,<2012-04-04 19:41:48.703 -0500>,<Administrator>,<TOPSPIN>,<proc1d>,<TOPSPIN 2.1>,
      <abs ABSG = 2 
       data hash MD5: 32K
       6C 66 10 64 FD EF 54 4F E9 ED 2D F6 61 47 6C E6>)
(   6,<2012-04-04 19:41:48.718 -0500>,<Administrator>,<TOPSPIN>,<proc1d>,<TOPSPIN 2.1>,
      <abs ABSG = 3 
       data hash MD5: 32K
       58 EC AC 26 DF 2B E4 32 EA AD D3 E8 30 B4 92 28>)
(   7,<2012-04-04 19:41:48.750 -0500>,<Administrator>,<TOPSPIN>,<proc1d>,<TOPSPIN 2.1>,
      <abs ABSG = 4 
       data hash MD5: 32K
       52 D2 16 AA 51 AD F8 D5 E0 89 D7 5E DA 96 57 F9>)
(   8,<2012-04-04 19:41:48.781 -0500>,<Administrator>,<TOPSPIN>,<proc1d>,<TOPSPIN 2.1>,
      <abs ABSG = 5 
       data hash MD5: 32K
       CA 8C F0 10 EE A9 6B 7C 1B E8 4E D4 F8 A9 5E F2>)
(   9,<2012-04-04 19:41:52.390 -0500>,<Administrator>,<TOPSPIN>,<audit>,<TOPSPIN 2.1>,
      <user comment:
       ICON-NMR User ID: COFFEE
       data hash MD5: 32K
$$ [...]
##$TP= (0..7)
150 150 150 150 150 150 150 150
##$TP07= 0
##$TPNAME0= <>
##$TPNAME1= <>
##$TPNAME2= <>
##$TPNAME3= <>
##$TPNAME4= <>
##$TPNAME5= <>
##$TPNAME6= <>
##$TPNAME7= <>
##$TPOAL= (0..7)
0.5 0.5 0.5 0.5 0.5 0.5 0.5 0.5
##$TPOFFS= (0..7)
0 0 0 0 0 0 0 0
##$TUNHIN= 0
##$TUNHOUT= 0
##$TUNXOUT= 0
##$USERA1= <user>
##$USERA2= <user>
##$USERA3= <user>
##$USERA4= <user>
##$USERA5= <user>
##$V9= 5
##$VALIST= <valist>
##$VCLIST= <CCCCCCCCCCCCCCC>
##$VD= 0
##$VDLIST= <DDDDDDDDDDDDDDD>
##$VPLIST= <PPPPPPPPPPPPPPP>
##$VTLIST= <TTTTTTTTTTTTTTT>
##$WBST= 2048
##$WBSW= 25
##$XGAIN= (0..3)
0 0 0 0
##$XL= 0
##$YL= 0
##$YMAX_a= 531190
##$YMIN_a= -641314
##$ZGOPTNS= <>
##$ZL1= 120
##$ZL2= 120
##$ZL3= 120
##$ZL4= 120
##$ABSF1= 14.98061
##$ABSF2= -5.57192
##$ABSG= 5
##$ABSL= 3
##$ALPHA= 0
##$AQORDER= 0
##$ASSFAC= 0
##$ASSFACI= 0
##$ASSFACX= 0
##$ASSWID= 0
##$AUNMP= <proc_prof1d_extract_pilot.lims>
##$AXLEFT= 0
##$AXNAME= <>
##$AXNUC= <1H>
##$AXRIGHT= 0
##$AXTYPE= 0
##$AXUNIT= <>
##$AZFE= 0.1
##$AZFW= 0.1
##$BCFW= 0
##$BC_mod= 0
##$BYTORDP= 0
##$COROFFS= 0
##$CY= 15
##$DATMOD= 1
##$DC= 0
##$DFILT= <>
##$DTYPP= 0
##$F1P= 0
##$F2P= 0
##$FCOR= 0.5
##$FTSIZE= 32768
##$FT_mod= 6
##$GAMMA= 0
##$GB= 0
##$INTBC= 1
##$INTSCL= 1
##$ISEN= 128
##$LB= 0
##$LEV0= 0
##$LPBIN= 0
##$MAXI= 10000
##$MC2= 0
##$MEAN= 0
##$ME_mod= 0
##$MI= 0
##$NCOEF= 0
##$NC_proc= -8
##$NLEV= 6
##$NOISF1= 0
##$NOISF2= 0
##$NSP= 0
##$NTH_PI= 0
##$NZP= 0
##$OFFSET= 14.98061
##$PC= 1
##$PHC0= 213.8654
##$PHC1= 0
##$PH_mod= 1
##$PKNL= yes
##$PPARMOD= 0
##$PPDIAG= 0
##$PPIPTYP= 0
##$PPMPNUM= 2147483647
##$PPRESOL= 1
##$PSCAL= 4
##$PSIGN= 0
##$PYNMP= <proc.py>
##$REVERSE= no
##$SF= 400.13
##$SI= 32768
##$SIGF1= 0
##$SIGF2= 0
##$SINO= 400
##$SIOLD= 32768
##$SPECTYP= <>
##$SREGLST= <1H.CDCl3>
##$SSB= 0
##$STSI= 32768
##$STSR= 0
##$SW_p= 8223.68421052632
##$SYMM= 0
##$S_DEV= 0
##$TDeff= 65536
##$TDoff= 0
##$TI= <>
##$TILT= no
##$TM1= 0
##$TM2= 0
##$TOPLEV= 0
##$USERP1= <user>
##$USERP2= <user>
##$USERP3= <user>
##$USERP4= <user>
##$USERP5= <user>
##$WDW= 1
##$XDIM= 32768
##$YMAX_p= 466750082
##$YMIN_p= -641318
##$CURPLOT= <Network HP LaserJet P1505>
##$CURPRIN= <$Network HP LaserJet P1505>
##$DFORMAT= <normdp>
##$LAYOUT= <+/1D_H.xwp>
##$LFORMAT= <normlp>
##$PFORMAT= <normpl>
##$SURQMSG= 1
$$ End of Bruker specific parameters
$$ ---------------------------------
##NTUPLES= NMR SPECTRUM
##VAR_NAME=  FREQUENCY,     SPECTRUM/REAL,   SPECTRUM/IMAG
##SYMBOL=    X,             R,               I
##VAR_TYPE=  INDEPENDENT,   DEPENDENT,       DEPENDENT
##VAR_FORM=  AFFN,          ASDF,            ASDF
##VAR_DIM=   32768,         32768,           32768
##UNITS=     HZ,            ARBITRARY UNITS, ARBITRARY UNITS
##FACTOR=    0.250966925370066, 1,           1
##FIRST=     8223.43324360095, -82758,       41903
##LAST=      0,             -73983,          -154577
##MIN=       0,             -641318,         0
##MAX=       8223.43324360095, 466750082,    0
$$ Real data points
##PAGE= N=1
##DATA TABLE= (X++(R..R)), XYDATA
$$ [...]
19487c78790D44137B11589m9594G8708b01622K5280A16844a55799K6783A5871
19476b55728L9408j03273A95127I7129i5277j26582r8408a756k72785A40555E3427
19464A38208a58497G3K23301b74953e1407j45023e5829k4967A85159p9074f8935
19452a80738p056f8469j52678L9277B42780c13340j7769a53691O8260F3971d6624
19440A25711d682j50342A17496b80306J04617M2811K7096A27618O6929d20312
19429g7967A08585a87938A2212O2456a81391P6990q3252o9454J18159H7983b28220
19417e4349l0623p2546Q190A89950b2391j14376j8524A05593a82667Q9598D76833
19405a46242C26950F8247f0532D7111k3555f0079p5131C4820Q563d16734A02747
$$ y = [-378790, 444137, 211589, 161995, 78708, -201622, -176342, 116844, -155799, -129016, 15871, -255728, -216320, -319593, 195127, 97129, -95277, -221859, -320267, -1756, -274541, 140555, 53427, 138208, -158497, 73, 223374, -274953, -51407, -196430, -55829, -80796, 185159, 106085, -68935, -180738, -187794, -68469, -221147, -181870, 242780, -313340, -331109, -153691, -85431, 63971, -46624, 125711, -4682, -155024, 117496, -280306, -175689, -132878, -105782, 127618, 194547, -420312, -77967, 108585, -187938, 12212, 74668, -181391, -104401, -187653, -257107, -138948, 87983, -228220, -54349, -84972, -157518, -149328, 189950, -22391, -136767, -155291, 105593, -182667, -93069, 476833, -146242, 326950, 68247, -60532, 47111, 23556, -60079, -135210, 34820, 43383, -416734, 102747]
19393A72448l0400Q5843A08418d3609G8356C1786a53526D4075a11068k34502a26830
19381C06111c2331j09378B66818q1520b32744E9749b70831F1914J35456B5319
19370b2253m45683a94354n263k5900a3640F104J47703a1277A0751a59667B6739
19358g3607q4085j17197h4542c6135A54156f1466i578k7909B60196a94633A8783
19346a26572J7246B35477a71768k8703B25294R8100a55036P2232L7554E9597b15766
19334a71413B63920b49784r6905m6149O4287l0651a56464j02626k37774B00961
19323d0359C7317b25413a5970A47700M5263a27212J9785A30515p722b57260C5833
19311F4810Q0071g5991O255A62760C1121b71695A10870b71920a06028L5904L4890
$$ y = [172448, 142048, 227891, 108418, -43609, 78356, 31786, -153526, 44075, -111068, -345570, -126830, 306111, -32331, -141709, 266818, 185298, -232744, 59749, -270831, 61914, 197370, 25319, -22253, -467936, -194354, -199617, -225517, -13640, 6104, 153807, -11277, 10751, -159667, 26739, -73607, -157692, -274889, -84542, -36135, 154156, -61466, -9578, -37487, 260196, -194633, 18783, -126572, -109326, 235477, -171768, -200471, 225294, 323394, -155036, -82804, -45250, 59597, -215766, -171413, 263920, -249784, -346689, -392838, -328551, -359202, -156464, -259090, -496864, 200961, -40359, 37317, -225413, -15970, 147700, 192963, -127212, -107427, 130515, 122793, -257260, 35833, 64810, 144881, -75991, -69736, 162760, 31121, -271695, 110870, -271920, -106028, -70124, -35234]
19300c5234B0656b6588l13287a34826F7832b06227g4386a7392j20583e1649K4211
19289b7438j33923e7330j77965G7354a50219C62692b51654J05229P313O8068k09056
19278b80100c7304I6929b54979F5909r467g8880F3591d2221j20992c1736C4792
19266b3820C221a3106A13503A7318a38283m8336E5146K46176E7178d12821n7008
19255d69829a55638M1171A84979a29147j29711a09581M867P998B53226l6871m6448
19244A69907c63617A34940M8890A1168a48630b6951l44075O2200C7989C089b92018
19232a95072F9969a88252A5927b02512k28071C43039c1735G6225c15306F1877
19221B88144j29144b27705A76863p3903J230b09398i7973m27935c5537r3761k0590
$$ y = [-35234, 20656, -26588, -339875, -134826, 67832, -206227, -74386, -17392, -137975, -51649, -27438, -161361, -57330, -235295, 77354, -150219, 362692, -251654, -146425, -139112, -71044, -280100, -37304, 96929, -254979, 65909, 56442, -78880, 63591, -42221, -163213, -31736, 34792, -23820, 3221, -13106, 113503, 17318, -138283, -186619, 55146, 301322, 57178, -412821, -469829, -155638, -114467, 184979, -129147, -258858, -109581, -104714, -96716, 253226, 216355, 169907, -363617, 134940, 183830, 11168, -148630, -26951, -371026, -308826, 37989, 3089, -292018, -195072, 69969, -188252, 15927, -202512, -430583, 343039, -31735, 76225, -315306, 61877, 288144, 159000, -227705, 176863, 102960, 104190, -209398, -97973, -525908, -35537, -129298, -149888]
19210a49888A5702J46681e9735j88040N9457O3984l5651l0493k54787a58376P8980
19199g9396A13470a11451I5203a30214i371H9819N9128C9214a97232a41A11740
19187I1357L2292a88972E7316a07017A15105a41542K6212j0784B63790a39989
19176C89436a17665g543k18370P2736p6262R3064C29193h519G9473a78686o5436
19165b44122G3061d87234a42018a0881j27997N6930b4293B15940a14163e2831
19154b04829B25540c12140a26514D1447J44113g0860p3125J8444d5633D4117K406
19143D6523c06575K9433c4480A01296M935c89225Q5122F0576K53195n4182h9310
19131A2152J39145g2475k13804n7636Q4965K2773B3061a32159A52961m7323m3737
$$ y = [-149888, 15702, 162383, -59735, -247775, -188318, -124334, -159985, -190478, -445265, -158376, -79396, 113470, -111451, 95203, -130214, -9371, 89819, 148947, 39214, -197232, -141, 111740, 91357, 123649, -188972, 57316, -107017, 115105, -141542, -115330, -126114, 263790, -139989, 389436, -117665, -7543, -225913, -153177, -229439, -136375, 329193, -8519, 79473, -178686, -244122, 73061, -487234, -142018, -10881, -138878, -81948, -24293, 215940, -114163, -52831, -204829, 225540, -312140, -126514, 41447, 185560, -70860, -143985, -125541, -45633, 44117, 46523, -306575, -277142, -34480, 101296, 106231, -389225, -304103, 60576, 313771, 259589, -89310, 12152, 151297, -72475, -286279, -343915, -258950, -236177, 23061, -132159, 152961, 105638, 61901]
19120F1901b49621Q0815H5610C157b97493E188b32771a07709A23818j1421a80524
19108A67103K48598a44785n5114D8119B1018f32513b63427A16839B7628a24620
19097c9699A31410b50867I0449a36010j30324Q7178P2271G2005a69321b7528l4652
19086f2180k48081b9634J1650a724j75749j42534I7921C652J10250H67O5634a64395
19073f2799I9629c98817a43386k84858A04140J44237o9849b48146E2470N007c26965
19061b77513a29914k1939K112A45169F9697J67595I8970b11515N3452M3654e3412
19049c13156O9554N7114i1175D12686A12150d7996A60443B1003b3911j95214B71965
19037a06756k3260p1234f7185A7180L6723h5493j47901C3080L17014A61564a28444
$$ y = [61901, -249621, -168806, 85610, 3157, -297493, 5188, -232771, -107709, 123818, 112397, -180524, 167103, 415701, -144785, -199899, 48119, 21018, -632513, -263427, 116839, 27628, -124620, -39699, 131410, -250867, 90449, -136010, -266334, -179156, -106885, 72005, -169321, -27528, -62180, -310261, -29634, -17984, -1724, -177473, -320007, 97921, 3652, 113902, 867, 66501, -164395, -62799, 99629, -398817, -143386, -428244, 104140, 248377, 178528, -248146, 52470, 57477, -326965, -277513, -129914, -151853, -149741, 145169, 69697, 237292, 98970, -211515, -158063, -114409, -53412, -313156, -243602, -186488, -91175, 412686, 112150, -47996, 160443, 21003, -23911, -219125, 271965, -106756, -130016, -201250, -67185, 17180, 53903, -85493, -233394, 33080, 350094, 161564, -128444]
19025A70769c5859m06300J71187B6777N8002b00361b8922j30672O590P4024j02154
19014a81134B6776J3993K23403A21562l1104G768J46693f6735G6143R850J45691
19003B31684A15561j1495J10141a11637H8658J7307J03003A718Q0988b3176E5072
18991A16643a13786N6461g390B6656b65817c0288C7941b00444A40992a61372A51405
18979c9263A56971f0285B10338h1359J8838c862A3781K53050J01668e6927j43092
18968b00019M9510l42655h5591i401m43636J28037a01043A19943c2020j28205
18958a60225G71244j63649M5854D2727J8170J92141H681b1468j5655B8371d3049
18946d12364A75891i9886j62424d9720h779j91082b3351B37102J03032i3939B213
$$ y = [170769, -35859, -442159, -270972, 26777, 84779, -200361, -28922, -159594, -153004, -78980, -181134, 26776, 40769, 264172, 121562, 90458, 7768, 154461, -66735, 76143, 85993, 231684, 115561, 104066, 214207, -111637, 88658, 105965, 208968, 1718, 82706, -23176, 55072, 116643, -113786, -57325, -7390, 26656, -265817, -30288, 37941, -200444, 140992, -161372, 151405, -39263, 156971, -60285, 210338, -81359, -62521, -3862, 13781, 266831, 368499, -56927, -200019, -150509, -493164, -85591, -9401, -453037, -325000, -101043, 119943, -32020, -160225, 771244, 607595, 653449, 42727, 60897, 253038, 8681, -21468, -37123, 28371, -43049, -412364, 175891, -99886, -262310, -49720, -8779, -199861, -23351, 237102, 340134, -93939, 2213]
18934b61694D4862g3343j86129O6831A0499J66858a48082r9559a04222k29551
18924c33773d4143K798a7281j77719A53651a52179k5489N4110C2612d6337A01559
18912F905a2482A79074G488b43517R1428J7370j35291E8537c8837N645G7029d4834
18899b94806G9825f9977A52995J3281m7823K78365j7608A87470J62057j06648
18889B42879q2558B3805e5007B40359I0638b9001G0030b97547d1163l19450C10237
18877C56488A28373A9196P6013b59965A0070g9937r8938n7609G6899g9449j40935
18866b20384f2148r0884o3061a2102k82523B55902a40773b7666p8377I8509D0693
18854g9439B10024a86191i59l5750k06479H2851A6773h5503j82953B8099M9440
$$ y = [-261694, 44862, -73343, -259472, -192641, 10499, 177357, -148082, -247641, -104222, -333773, -44143, -41345, -17281, -195000, 153651, -152179, -177668, -123558, 32612, -46337, 101559, 6905, -12482, 179074, 7488, -243517, -152089, -134719, -270010, 58537, -38837, -33192, 77029, -44834, -294806, 79825, -69977, 152995, 166276, 118453, 396818, 379210, 187470, 349527, 242879, 160321, 23805, -55007, 240359, 90638, -29001, 70030, -297547, -41163, -360613, 310237, 356488, 128373, 19196, 95209, -259965, 10070, -79937, -178875, -236484, 76899, -79449, -220384, -62148, -153032, -216093, -12102, -294625, 255902, -140773, -27666, -106043, 98509, 40693, -79439, 210024, -186191, -959, -36709, -243188, 82851, 16773, -85503, -268456, 28099, 77539]
18843G7539Q4156a57857j20372i533H1098A2064J6138a95254H0808h4896C5286
18831c532k42873H1136D31a90112p8684a04380e0740j75541R0966C56823e6788
18819a70043O6459I669J21859c5964k23264A54995p2419a84685A56837C4018P846
18808D1864K4334a9987A19431K7558a3217j43580F5708i1413d3645k9492j73309
18797b46446j0194c7860F8120P5272b62721a21443a7273A47916b2037j42274I4187
18785h0238E5486O5902a54591j87839a39737B54855a43577E0839a31497A475a41605
18773f7649B3468c02656F0705L7315h9437A46755J87652C8495A15a99722g3659
18761d2142n18000h2478B24938b41808A55728b8225j18903A56931g3865j87977
$$ y = [77539, 161695, -157857, -278229, -9533, 81098, 12064, 28202, -195254, 80808, -84896, 35286, -3532, -246405, 81136, 431, -190112, -268796, -104380, -50740, -226281, -135315, 356823, -56788, -170043, -103584, 9669, 131528, -35964, -259228, 154995, 82576, -184685, 156837, 34018, 41864, 66198, -19987, 119431, 146989, -13217, -156797, 65708, -91413, -43645, -73137, -246446, -256640, -37860, 68120, 143392, -262721, -121443, -17273, 147916, -22037, -164311, 94187, -80238, 55486, 121388, -154591, -342430, -139737, 254855, -143577, 50839, -131497, 1475, -141605, -67649, 23468, -302656, 60705, 98020, -89437, 146755, 334407, 38495, 115, -199722, -73659, -42142, -560142, -82478, 224938, -241808, 155728, -28225, -147128, 156931, -73865, -261842]
18751b61842P3301B8K42371a30867m1330F1955k9119c9864j06656d4338k48557
18740b92895Q7792P0778A19659a10484q2241l26120a00898k45937f4025m3556
18730a07581M5057A58985J06451a86734B04300b03208g3995c2712C71890a9479
18719A74573e0283j78401a2890j42602N3935j04433J4955M2101B9952L2967a22875
18707A69068c8948p2624A38574g126m2957l11762A42846A152c24498a0090H2945
18695D04J5350L1576e26190b28117C11264a14073A4212a89912g6341D7885f8408
18683d04087a06325C49710D4807c39773I270g6372E6768b1487j11731j97779a51876
18671A4365c4689C3933L8980h3225B50148H0992b72907m11j75591G560b1652A62828
$$ y = [-261842, -188541, 28, 242399, -130867, -172197, 61955, 32836, -39864, -146520, -44338, -292895, -205103, -134325, 119659, -110484, -192725, -518845, -100898, -346835, -64025, -107581, -62524, 158985, 265436, -186734, 204300, -203208, -73995, -32712, 371890, -19479, 174573, -50283, -228684, -12890, -155492, -101557, -205990, -191035, -148934, 29952, 62919, -122875, 169068, -38948, -111572, 138574, -7126, -50083, -361845, 142846, 1152, -324498, -10090, 82945, 404, 15754, 47330, -526190, -228117, 311264, -114073, 14212, -189912, -76341, 47885, -68408, -404087, -106325, 349710, 44807, -339773, 9270, -76372, 56768, -21487, -133218, -330997, -151876, 14365, -34689, 33933, 72913, -83225, 250148, 80992, -272907, -273318, -448909, 7560, -21652, 162828]
18658a88200c2570A9504J79444i0858k33595J22656C3688b4559k72762K2483A75711
18646H7093b59411g3010j56907J3911A748a82140l725b9070k6597j83529R1344
18635a47852E6357e3885j52026Q2749C38099a41358H4021q237a1466l32289n7737
18624d01492P764c3730r1789A12527F935R9907a53131h271k60716A1227L2857
18613D4084b49495B35205J261a21810F1999c44171e6169b007q325k42281I2298
18601c66735A25183J20040b12410p6271j3886j81427a70591l8335A07895b01286
18590b84189a339p2707I7367J35168F1225a83382e1523k11464A4148a29090A71902
18578C44646A56926C0160A1825a24170L5375A79234F7735M4844b34268p2844h6570
$$ y = [-188200, -32570, 19504, 198948, -90858, -324453, -201797, 33688, -24559, -297321, -274838, 175711, 87093, -259411, -73010, -229917, -216006, 1748, -182140, -185865, -29070, -55667, -239196, -147852, 56357, -53885, -205911, -123162, 338099, -141358, 84021, 75784, -11466, -343755, -401492, -393728, -33730, -125519, 112527, 6935, 106842, -153131, -8271, -268987, 11227, 44084, -249495, 235205, 236466, -121810, 61999, -344171, -56169, -2007, -10332, -252613, 92298, -366735, 125183, 245223, -212410, -288681, -302567, -483994, -170591, -208926, 107895, -201286, -284189, -1339, -74046, 97367, 232535, 61225, -183382, -51523, -262987, 14148, -129090, 171902, 344646, 156926, 30160, 11825, -124170, -88795, 179234, 67735, 112579, -234268, -307112, -86570]
18566A13017e429j49497A18419R4172c82968J32809D75469b18735C35139A05125
18555i0063M743A57009J08762c11431A06085c90314J70859F4100M3699M6797f192
18543e9488p343j2559k62817b9410k89461j33678A8510c515B65828p3980b36229
18531a16997r1231p9323L9134h7693A26776m9274k7287d52879b0239E0483f0644
18519E7026J38087h3193B94476d3039l38885B38308G3724O2768c46197A30666
18508h1792E0062b2616p8876L7219h592m64508A11784a67400K8569F5290J47812
18497B13102g4269r2482A99190C6150J75915g8857a6711k54549a30950B26023
18486d19722A53791D4825a52136j60734c9737r1461A54912J59128e60634h7295
$$ y = [113017, -5429, -154926, 118419, 212591, -382968, -250159, 475469, -218735, 335139, 105125, -90063, -85320, 157009, 265771, -311431, 106085, -390314, -219455, 64100, 107799, 154596, -6192, -59488, -66831, -79390, -342207, -29410, -318871, -452549, 18510, -3515, 265828, 191848, -236229, -116997, -208228, -287551, -248417, -87693, 126776, 77502, 50215, -452879, -20239, 50483, -60644, 57026, 195113, -83193, 294476, -43039, -381924, 238308, 73724, 136492, -346197, 130666, -81792, 50062, -22616, -101492, -64273, -8592, -473100, 111784, -167400, -138831, 65290, 213102, -74269, -166751, 199190, 36150, 212065, -78857, -16711, -271260, -130950, 226023, -419722, 153791, 44825, -152136, -312870, -39737, -131198, 154912, 314040, -560634, -87295]
18475a96908I3389H269b1759F9845a40988n4088Q0600e4822A1007c42929a49777
18463h1596B18458b79599L0552A55948n2170c37652J05896b2740B44663E5806
18452C2644e5108C17596f0443A73215J8641n6155b9524j47181A21856f0832a3961
18440B67056g7313a2793p7783j44827B37472e7186B0755a85765q056d0831G2515
18428a01341l30047A97588d48010B46504j07044a5841D3910i8745m6192j97010
18418c41947J18998Q7994k81076M4609A0278b94320n5603b5468I1522k9771b00110
18406c89509J35169l5191J03598i150j94923k26070A72210C371b49735B7800d1510
18394d8701k7178j35037C4743a31934q2660G4398J6071O2041o2484L43562j17454
$$ y = [-196908, 93389, 8269, -21759, 69845, -140988, -195076, -114476, -54822, 11007, -342929, -149777, -81596, 218458, -279599, -249047, 155948, 103778, -337652, -231756, -22740, 244663, 55806, 32644, -55108, 317596, -60443, 173215, 191856, 135701, -29524, -176705, 121856, -60832, -13961, 267056, -77313, -12793, -90576, -235403, 237472, -57186, 20755, -185765, -193821, -40831, 72515, -101341, -431388, 197588, -448010, 246504, 139460, -15841, 43910, -98745, -144937, -341947, -222949, -134955, -416031, -371422, 10278, -294320, -349923, -25468, 91522, 61751, -200110, -389509, -254340, -289531, -185933, -9150, -204073, -430143, 172210, 3371, -249735, 27800, -41510, -48701, -75879, -210916, 34743, -131934, -214594, 74398, 90469, 152510, 90026, 433588, 316134]
18383C16134i6635D489L05980g3552B44421b0833k21204g3647j6498j23845e8150
18371A49646f3824a2800A32050A4821a69206H1853J31362d9588k37062A05811
18360F7942J3279B4323a78843N1016C4876J46196h4255K7750A38227a16140B37072
18348c010A6461a4839B53354e4074I2885A046a52372a056j85211D33955A63881
18336h2234k1125J5039j20070i2389d4450A13351a73720b4952k38345f8149j79106
18325b47255A8679f392C8538L6624J33718e7472H4020a85013d068j08161D429
18313I0087J3168a00596B56318a83908A56081c47462Q0621D3911a29918A22827
18302F9735F789a59526l12933f3651j42822i8633A39863d68460a34735j02981
$$ y = [316134, -96635, 4489, 310469, -73552, 244421, -20833, -242037, -73647, -90145, -213990, -58150, 149646, -63824, -12800, 132050, 14821, -169206, 81853, 213215, -49588, -286650, 105811, 67942, 81221, 24323, -178843, -127827, 34876, 181072, -84255, -56505, 138227, -116140, 237072, -3010, 16461, -14839, 253354, -54074, 92885, 1046, -152372, -1056, -186267, 433955, 163881, -82234, -103359, -88320, -208390, -92389, -44450, 113351, -173720, -24952, -263297, -68149, -247255, 18679, -6392, 38538, 75162, 208880, -57472, 84020, -185013, -4068, -112229, 4429, 90087, 103255, -100596, 256318, -183908, 156081, -347462, -266841, 43911, -129918, 122827, 69735, 6789, -159526, -472459, -63651, -206473, -98633, 139863, -468460, -134735, -237716]
18292b37716l5953F4146a27197j80118g2772k31181I8618m0977a10248J9054j54429
18281b45623A09827c5860c177j72093k4051h9651j61639n4777A00437M26990a53553
18269d41122e7186A29377C9954J39493c87774a26682o515G6459P8901E0690J99220
18258B49910o3942q9395a71334b0529E7700M0448O1156G1411E271J95291B9669
18246B22919q716r3112E1465a34542M4159j17412R7257A75324g9661c9586A66721
18234H6602b23343O9792B61850a83749B68059A33883a76674A15567J4025b15128
18223f819A483K11266L88146a9465n6935L3033l3781l83361J07145a31112A30376
18211a92073R5178C535K1672a9790I6238O1580a48554A64061h4293B18318a22897
$$ y = [-237716, -273669, 64146, -127197, -307315, -72772, -303953, 98618, 57641, -110248, -91194, -245623, 109827, -35860, -3177, -175270, -199321, -89651, -251290, -306067, 100437, 527427, -153553, -441122, -57186, 129377, 39954, 179447, -387774, -126682, -133197, 76459, 155360, 50690, 249910, 185968, 96573, -171334, -20529, 57700, 98148, 159304, 71411, 5271, 200562, 29669, 222919, 214203, 121091, 51465, -134542, -90383, -207795, -110538, 175324, -79661, -39586, 166721, 86602, -223343, -153551, 261850, -183749, 268059, 133883, -176674, 115567, 129592, -215128, -6819, 1483, 212749, 600895, -19465, -76400, -43367, -77148, -460509, -353364, -131112, 130376, -192073, -96895, 3535, 25207, -19790, 96238, 157818, -148554, 164061, -84293, 218318, -122897]
18199b64737a25372G6964b09938A25001b33412a4341l1812m61763e2261A4868
18188a87507a2593r4891A01058c62837P2578A52521i7660k5147l14170a18423
18177a00451o3067O2777I2506a05004A84805a94731B8793J90945D6472a38753
18166C5804h8016j54955C90254b25411B07728H5063b34212A9344Q7720b09889
18155a12195B96997D1830Q9526M8832a41065C73048A57589g7529D6438a54071
18144e3010m737A54657c8375g137J823l85318J44283i2367D112P8605L8688M8785
18132A70190d6943A1561d1383C5012f038k16812B5636L5689b20742E1776e5599
18120E3098J87200E0668e5890n6377R530l15736A53108f4208k5693j18858R4964
$$ y = [-264737, -125372, 76964, -209938, 125001, -233412, -14341, -46153, -507916, -52261, 14868, -187507, -12593, -107484, 101058, -362837, -290259, 152521, -97660, -122807, -436977, -118423, -100451, -163518, -100741, 92506, -105004, 184805, -194731, 28793, 219738, 46472, -138753, 35804, -88016, -242971, 390254, -225411, 207728, 85063, -234212, 19344, 107064, -209889, -112195, 296997, 41830, 131356, 180188, -141065, 373048, 157589, -77529, 46438, -154071, -53010, -57747, 154657, -38375, -7137, -5314, -390632, -246349, -92367, 4112, 82717, 121405, 170190, -46943, 11561, -41383, 35012, -6038, -222850, 25636, 61325, -220742, 51776, -55599, 53098, 240298, 50668, -55890, -112267, -102737, -418473, 153108, -64208, -89901, -208759, -113795]
18109a13795M5857B4790M3123O9983d0310k2314j44454E1094i0175c9264q3912
18098a23176a9226j05967l5492B18294A0348J96960l3116b67347B2680a08950
18087B2966K0668a13285r2430C1630a52470r7230i7386A43766a98595B10475h7311
18075A65256B9263B245b4533n4706p4895A22586a34126A93270E1643b02231d3382
18063B7157O7806K6454a22418B27228d4722j67571A98805A4462M30815c48843
18052A35307a60560I371c4467F6856A887a39932C45502d363j42111e2487D8928
18040h6227A86161M5951a9692k05998a2446o2786I6716c13785A36540O6123b60317
18028A54635j4823c51814C5344J03873a21267B35326b13363c6450D03414j48174
$$ y = [-113795, -67938, 24790, 67913, 137896, -40310, -62624, -207078, 51094, -90175, -39264, -123176, -19226, -125193, -160685, 218294, 10348, 207308, 174192, -267347, 22680, -108950, 22966, 43634, -113285, -205715, 31630, -152470, -249700, -97386, 143766, -198595, 210475, -87311, 165256, 29263, 2245, -24533, -79239, -154134, 122586, -134126, 193270, 51643, -202231, -43382, 27157, 94963, 121417, -122418, 227228, -44722, -212293, 198805, 14462, 445277, -348843, 135307, -160560, 9371, -34467, 66856, 1887, -139932, 345502, -4363, -146474, -52487, 48928, -86227, 186161, 232112, -19692, -225690, -12446, -75232, 96716, -313785, 136540, 202663, -260317, 154635, 139812, -351814, 35344, 139217, -121267, 235326, -213363, -36450, 403414, 255240]
18018B55240A24938m9042c42051e7357k9172G2650k9932a98675H5452b18696A55660
18006A26686O918k1355C9757c2491k85034h9473J4j23249a06177j76746O0186
17995b22737f3091b1145j31675D62756B7231K71986a19421E651d4726I0573k5665
17984F4908K97740b56805R9412M6634D73R7712N3426b77985C6902K02781a5705
17972e1279l8683B08046a4899C11191a37248H6902a2126C4067J49544a53310K1259
17961a32051L5807n105j29826E8501J11873D7726h6381A23996A5015K18096h137
17949i3757F6541e1399C7367K51986A20333l7159c8031F1494b22652a8892G6936
17937b08577h7094F907J50050c37175C4792a00381K5534B8866b00049g9590b7007
$$ y = [255240, 124938, 75896, -342051, -57357, -86529, 72650, 42718, -198675, 85452, -218696, 155660, 126686, 133604, 112249, 39757, -32491, -317525, -89473, -89459, -212708, -106177, -282923, -222737, -63091, -21145, -152820, 462756, 27231, 299217, -119421, 5651, -44726, 90573, 64908, 362648, -256805, -157393, -110759, 473, 98185, 151611, -277985, 36902, 239683, -15705, -51279, -89962, 208046, -14899, 311191, -137248, 86902, -12126, 34067, 183611, -153310, -132051, -96244, -101349, -231175, 58501, 170374, 47726, -86381, 123996, 15015, 233111, -8137, -93757, 66541, -51399, 37367, 289353, 120333, 83174, -38031, 61494, -222652, -18892, 76936, -208577, -87094, 6907, 156957, -337175, 34792, -100381, -74847, 28866, -200049, -79590, -27007]
17925g1043A84001b12989m8759L4092A8723a18022e7743C03661M2109a10690I4297
17913b32687a3829H0516i8557K6905C97468a03343d4446A62912J51996G5095b7883
17901E3070K6275a08209I93K06161G448b05715O0886j08444B97203a15129E7426
17889A43299A938J31309b10958b650D21649k00085D507J40410e6018F5454J0270
17878G5724J59130a79836e6736j40342A78630A3604a95027B51724a07493r3833
17868b01326B4017c5141m2798C85492b60145i2841A49248C6035A2276b23999e1521
17856c61957A54667G4613k635J31644I8582B4065M1237J1474b32983R4889c5649
17844C4736b98076A05308c140A29238A113c37C03327c4753B08000c4579F8687
$$ y = [-71043, 184001, -212989, -261748, -227656, 18723, -118022, -57743, 303661, 345770, -110690, 94297, -232687, -13829, 80516, -98557, -71652, 397468, -103343, -44446, 162912, 314908, 75095, -27883, 53070, 79345, -108209, 993, 207154, 7448, -205715, -144829, -253273, 297203, -115129, 57426, 143299, 1938, 133247, -210958, -2650, 421649, 221564, 4507, 144917, -56018, 65454, 75724, 234854, -179836, -56736, -197078, 178630, 13604, -195027, 251724, -107493, -201326, 24017, -35141, -77939, 385492, -260145, -92841, 149248, 36035, 12276, -223999, -51521, -361957, 154667, 74613, 71978, 203622, 98582, 24065, 65302, 76776, -232983, -138094, -35649, 34736, -298076, 105308, -3140, 129238, 1113, -337, 303327, -34753, 208000, -34579, 68687]
17832C66921a10584j95941H2365K17543a51074f2135B51252A03552J1844h5770
17821C07466a1016B87995a42717B95131H1072c2012l9721C27537c34819a47707
17810D9091o912M7400i5911D6099a47003C5314J49978D5923f8614A29738a85167
17798C46587e2957H6359h1119d0354n1582A32273m1839i7340B12230d2187o5862
17787a08049F2304e3146I2510a98436e1647k60974j03698A14338L4750o0375R0419
17776A79132K5863D9188M4444B2947J54487Q173E3249N2759Q9063c8019A3894
17764I7274a12454B31662I3240l1585d966l757k13789C03330c14490b8952B46870
17752B10012L76578B83804a10275G0646c9914n3805d6321A35796C6511i3169a6674
$$ y = [366921, -110584, -306525, 82365, 299908, -151074, -62135, 251252, 103552, 115396, -85770, 307466, -11016, 287995, -142717, 295131, 81072, -32012, -71733, 327537, -334819, -147707, 49091, 42179, 89579, -95911, 46099, -147003, 35314, 185292, 45923, -68614, 129738, -185167, 346587, -52957, 86359, -81119, -40354, -91936, 132273, 90434, -97340, 212230, -42187, -108049, 62304, -53146, 92510, -198436, -51647, -312621, -416319, 114338, 149088, 88713, 179132, 204995, 49188, 93632, 22947, 177434, 185607, 53249, 106008, 195071, -38019, 13894, 97274, -112454, 231662, 93240, 61655, -4966, -8723, -222512, 303330, -314490, -28952, 246870, 210012, 586590, 283804, -110275, 70646, -39914, -93719, -46321, 135796, 36511, -93169, -16674]
17740A50894c1864k69659A51798b63982c6794B99038d79026A06119N005D6351
17729B47746j21260n9333a76634B32157h7420E420d9558j36768C0867J49264d0874
17717A02105d203k32893C98995j58628a523A31875E8758i0176A51611P5226c5505
17705B96815a468j34523c5519A28810d5500j4787A81435N10145G952M6792J30628
17694A85372K7809a62307A06328B0742L84186j00656a44585M4730H2938K19454
17684C02392j18073L9674a4222A18020R0310E0585A4588a7536o7401B673a15019
17672C50399e2380A76160a9383k89736i2711H6848f8784C36502f2759B06966H7373
17660B84523f1502B80369j25450M5277C1185J114l443N1451M7461K72975b15525
$$ y = [150894, -31864, -301523, 151798, -263982, -36794, 299038, -479026, 106119, 111124, 46351, 247746, 126486, 67153, -176634, 232157, -87420, 5420, -49558, -186326, 30867, 180131, -40874, 102105, -4203, -237096, 398995, 240367, -1523, 131875, 58758, -90176, 151611, 226837, -35505, 296815, -1468, -135991, -35519, 128810, -45500, -60287, 181435, 691580, 7952, 54744, 185372, 213181, -162307, 106328, 20742, 404928, 304272, -144585, -99855, 82938, 302392, 184319, 223993, -14222, 118020, 208330, 50585, 14588, -17536, -84937, 2673, -115019, 350399, -52380, 176160, -19383, -309119, -92711, 86848, -68784, 336502, -62759, 206966, 87373, 284523, -61502, 280369, 154919, 200196, 31185, 32299, 28856, 80307, 127768, 400743, -215525]
17648C04258f2608B23289G000O8591h1856A04168K2017K8633o0602k423J38468
17637B30261F0629K20167j08202M2672B4559K07325M8193J26374j54490A18782
17626B549g3829A86827D9809L75717b37572Q7825A59255b3878A13870a3281A61820
17614E1955O3497c02914A52340j0406K3781m1884E7978K19901I173P7090j6212
17603G0051K7138O63L1024J29943B1541b8972B42419L376P9522f842I0390B6710
17590h436C97403j73458L1285C7465a8486P119k75375C26039G7686a07861D06461
17578a74682A15276K7906B4368J51927a11664A48957g513B6346O9000J50756p2999
17567A73103J17789K42932C5892J10401L1626J58276a55659C41373I7709a91510
$$ y = [304258, -62608, 223289, 7000, 75591, -81856, 104168, 126185, 154818, 94216, 91793, 230261, 60629, 280796, 172594, 215266, 24559, 231884, 280077, 406451, 251961, 118782, 2549, -73829, 186827, 49809, 425526, -237572, -149747, 159255, -23878, 113870, -13281, 161820, 51955, 115452, -302914, 152340, 141934, 165715, 123831, 57978, 277879, 9173, 86263, 70051, 97189, 97852, 128876, 258819, 21541, -28972, 242419, 245795, 325317, -6842, 90390, 26710, -8436, 397403, 223945, 255230, 37465, -18486, -11367, -286742, 326039, 77686, -107861, 406461, -174682, 115276, 143182, 24368, 176295, -111664, 148957, -7513, 26346, 95346, 246102, 173103, 290892, 533824, 35892, 146293, 177919, 336195, -155659, 341373, 97709, -191510]
17556A32569j3129J23339M1885A0532J53614n7955d8818b490B79810G0931K09148
17545B80079r2426L1554L1327K414j3537C5522J15263J91608A00510K51764A56847
17533a35257A92901J16057K30460A27615M5422l2900L80543G7657K98527q8478
17523B87706g5673A44428J64145j40186O0958R4135Q2121B0331K47957m1838d5130
17511D94513p2098L95535j22998n3870K82399C75924K67253J88916a01760E16080
17500B63574M9551K30121j98573O5657A10219M19939O6045K56674j94946K09976
17490H67907l4411C47922A54062r327L78456r7254q8164o6892K95785A68800J28086
17479B96886J52351f9487A88448i5626j41360C00413r0610L71432B18453C6030
$$ y = [132569, 119440, 242779, 284664, 10532, 164146, 106191, -48818, -2490, 279810, 70931, 280079, 187653, 219207, 250534, 252948, 239411, 35522, 150785, 342393, 100510, 352274, 156847, -135257, 192901, 308958, 539418, 127615, 173037, 140137, 520680, 77657, 376184, 287706, -75673, 144428, 308573, 168387, 229345, 323480, 405601, 20331, 268288, 226450, -45130, 494513, 422415, 817950, 694952, 641082, 923481, 375924, 643177, 832093, -101760, 516080, 263574, 313125, 543246, 344673, 410330, 110219, 530158, 596203, 852877, 657931, 867907, 833496, 347922, 154062, 144735, 523191, 425937, 337773, 270881, 566666, 168800, 296886, 449237, -69487, 188448, -95626, -236986, 300413, 209803, 581235, 218453, 36030]
17468G8833J88451K02512k20468M7151r8698J03836l7079D6048K17050J1326j06698
17457A67726J82801l4113C0377E613J16122Q1627b8381D51763B02663c2852B25138
17445F01057m6801A95134L17483j12918A76565J80684K19957a3396C78904A04618
17434B74080L56417C01340J89925k04352J7209Q8697J30818k20200Q3410A86760
17423E07514A55765j6769K93015j04957r727j8804K2764j46770K48525P90L0816
17412D54648J31664B01981K2031N8015K41705B19404n1265R564N9293D0767L02667
17401C43434j29300K14156j54009n5103J74139J9298J39481B3017N47568j03876
17391D66709G1088N10152G0501L0382Q0584K25857N3150j61592d6301A05647j0026
$$ y = [78833, 267284, 469796, 249328, 296479, 197781, 301617, 264538, 46048, 263098, 274424, 167726, 350527, 316414, 30377, 5613, 121735, 203362, -28381, 451763, 202663, -32852, 225138, 601057, 554256, 195134, 512617, 399699, 176565, 357249, 577206, -13396, 378904, 104618, 274080, 630497, 301340, 491265, 286913, 304122, 392819, 523637, 303437, 386847, 186760, 507514, 155765, 138996, 432011, 327054, 317327, 298523, 321287, 174517, 423042, 423832, 454648, 586312, 201981, 224012, 282027, 523732, 219404, 168139, 177703, 236996, 40767, 343434, 214134, 428290, 274281, 219178, 393317, 412615, 552096, 23017, 570585, 466709, 71088, 581240, 70501, 100883, 181467, 407324, 460474, 298882, -46301, 105647, 95621]
17380I5621J16047J15839j07046n8005J19475l1020J99797k04564m5291K20762
17370D21615L1355A91230K3895r9858Q5305F6385P6530L3027R2549K8550M4155
17359C41196K6786j10073Q7396h2601E717N32888B02793r466N383e5155A19009
17347A85269L11029A35123J0240K21536D1545K27150A12417C9710R5038J47680
17337B82428K5670A26375K92984b4980B56683J70937l7079j30930E7698K69896
17327C27594n91J19357A1615J75017J9645J45188B9949K46720p9539J78903N5437
17316D31470j87287N23515I0441M31824h0941B11417J69972e1552B22020G5018
17305B91477N2030H3398M5607M06768p3058A74422J26295m8091E3176M3920L52723
$$ y = [95621, 211668, 327507, 220461, 162456, 281931, 250911, 450708, 246144, 200853, 421615, 452970, 191230, 215125, 115267, 200572, 66385, 142915, 175942, 268491, 297041, 341196, 367982, 257909, 345305, -82601, 5717, 538605, 202793, 193327, 198710, -55155, 119009, 185269, 496298, 135123, 145363, 366899, 41545, 268695, 112417, 39710, 134748, 282428, 308098, 126375, 419359, -24980, 256683, 427620, 390541, 259611, 57698, 327594, 327003, 446360, 11615, 186632, 206277, 351465, 29949, 276669, 197130, 376033, 431470, 244183, 767698, 90441, 522265, -80941, 211417, 381389, -51552, 222020, 75018, 291477, 343507, 83398, 129005, 535773, 462715, 174422, 300717, 252626, 53176, 97096, 449819]
17294D49819A34941P3860o3943J4714O8068O0233K68605j76394p9496L0569P6355
17283D07512b74788C45261p2777j15206J46582l0409E4725J96779K06710k6124
17273D32090r0640J13658c9767B15442j01910L2916N49807k12099A68988K20301
17263C89289j9011J45018B26086p6454K41826K8378P0235B0652J26442H290e2866
17251b9531C05043p59j46264J57863j16612Q0217J15366j73158L12792j82178
17241C52310A63427L38875j70234J55799j17440J28868a1671C22570A09727O2010
17231A71737J03739L8517A11843C9132J59919M3507J31129j51938J23266R4414
17221D39429L6940l1860J72091B51153l5447J72226n2703j31863J42811K04708
$$ y = [449819, 134941, 208801, 144858, 159572, 227640, 287873, 556478, 380084, 300588, 331157, 407512, -274788, 345261, 272484, 157278, 303860, 273451, 54725, 251504, 458214, 432090, 341450, 455108, -39767, 215442, 113532, 146448, 696255, 484156, 168988, 389289, 370278, 515296, 226086, 149632, 391458, 419836, 490071, 20652, 147094, 8290, -52866, -29531, 305043, 304284, 158020, 315883, 199271, 279488, 394854, 221696, 534488, 352310, 163427, 502302, 332068, 487867, 370427, 499295, -11671, 322570, 109727, 171737, 275476, 313993, 111843, 39132, 199051, 242558, 373687, 221749, 345015, 439429, 476369, 444509, 616600, 251153, 215706, 387932, 335229, 203366, 346177, 550885]
17211E50885B61023K10974l7742j70591K57220p7251r8521a04434F91574A50159
17200D81999J00967j01664j1693m2612j46218j23398K71491k337P0379k40680
17190B56234K37950K35670C24344m5444L80962j93090j46546j00828J86865j69829
17180B36434J83948K39600C06216O9403q7853C0171L60632j83578J87192j93163
17170B01254L04384A9411N14375B43862o3361L5162O0326K55352B62190K10112
17160D72302j0554j13052m7895m3842J6261R2428J55122k17043j42783J93307
17150C54251O1546m6929M9564j64620J92957P2618l9789A26476L16090a33537
17139G46456l00271J35971O1704j68826J83358k805k29024J00000P105j03657
$$ y = [550885, 261023, 471997, 434255, 263664, 520884, 443633, 345112, -104434, 691574, 150159, 481999, 582966, 481302, 469609, 426997, 280779, 157381, 428872, 426535, 496914, 256234, 494184, 729854, 324344, 278900, 659862, 466772, 320226, 219398, 406263, 236434, 420382, 659982, 306216, 375619, 287766, 30171, 390803, 207225, 394417, 201254, 505638, 19411, 533786, 243862, 180501, 215663, 275989, 531341, 262190, 472302, 461748, 348696, 300801, 256959, 273220, 365648, 520770, 303727, 160944, 354251, 415797, 368868, 418432, 253812, 446769, 519387, 479598, 126476, 442566, -133537, 746456, 446185, 582156, 643860, 475034, 658392, 655587, 426563, 526563, 533668, 430011]
17129D30011l7409J38647A06401M6874J32088M13450j47428K7403A80306R7562
17119B77868J88824Q5664J99430k00377k35421A55806N27556k88749k5389j55814
17109B13410M06496j73293K2066L8999M2495A34121J57995L01460q3649K05246
17099G15173j42746j61732n8707M09370k49579k9840J07341P7079m9205o3412
17089E53742J33678l02939p6970J79460J13284k1477K82031m01257P4772l8649
17079D95675J14387R989J81003q7602Q3348q3371J40708l42695J35378Q3701j75631
17068E54890N5095M88320m70651j1071J2737M1546j63954P5795n3696j46196J1625
17057C94440M76948k51026m4995K91619j19475C69392j0675N11562J03239k41268
$$ y = [430011, 392602, 531249, 106401, 153275, 285363, 698813, 551385, 578788, 180306, 277868, 466692, 552356, 751786, 551409, 315988, 155806, 683362, 394613, 369224, 213410, 619906, 446613, 468679, 507678, 550173, 134121, 292116, 593576, 509927, 715173, 572427, 410695, 351988, 761358, 511779, 481939, 589280, 666359, 617154, 553742, 687420, 384481, 307511, 486971, 600255, 578778, 860809, 459552, 534324, 495675, 610062, 620051, 801054, 713452, 796800, 713429, 854137, 511442, 646820, 730521, 554890, 609985, 1098305, 627654, 616583, 629320, 670866, 506912, 582707, 529011, 382815, 394440, 871388, 620362, 575367, 866986, 747511, 369392, 358717, 870279, 973518, 732250]
17047G32250P6117K45676m15412j32701k2665K14107N1902K4138l40569L15227
17037G48070l4014L37099k41234l2355k69371K58619J81367k7533l3301j53577
17027G33770L24430k96025M6258k88221j2561M12243j55055J73172D44430O19404
17017A063834m08780J14904j87181K16288k4369Q4665l65939N03649J2014k17418
17007G91667L1473J62548j64491N1314L33658k90388j41815J52198o6951l0372
16997H28841K58132j91415P1524K38337J12349l00031M54923l88621K51792m09666
16987I26165M11755l68717L1802R9544j67920J39768K04372l33769J02219Q6962
16977A132181k4465J46092o0305J46602l07273J88154j81323K37451J19680o15690
$$ y = [732250, 808367, 1054043, 638631, 505930, 483265, 697372, 749274, 773412, 432843, 748070, 714056, 1051155, 809921, 777566, 508195, 766814, 948181, 920648, 887347, 733770, 1058200, 762175, 808433, 520212, 507651, 919894, 764839, 938011, 444430, 1063834, 655054, 769958, 582777, 799065, 774696, 859361, 493422, 997071, 1009085, 791667, 823140, 985688, 821197, 872511, 1206169, 915781, 773966, 926164, 859213, 828841, 1086973, 895558, 967082, 1205419, 1317768, 1017737, 1472660, 1084039, 1335831, 926165, 1337920, 969203, 1001005, 1100549, 932629, 1072397, 1276769, 943000, 1045219, 1132181, 1107716, 1253808, 1193503, 1340105, 1032832, 1220986, 1039663, 1277114, 1396794, 781104]
16967G81104L57439J29277p5827K1617k2939j60099J09763J60164K94626k63147
16957A331978K3016j32367N36359o35652L41241j17150J22092k04168L08081j25889
16947A447541J75294k23611P8900J76723k61760k29992K63112L27275q1110n04449
16937A167923O07791k43490K31179l63711J9322l6532L94769l39217l8457J63829
16927A563406K9248j54906N64384j58468q6284n4930K01398l48588L1833K50618
16917A837711K66918l75171K36512q2060k27488N5871K43602J64189j56339p7824
16907A885921K095L27224j94529K50832l74831j30192L28605k8626L96501k56619
16897B206381r3546K84567j0152m69281N75978k50627K48853j5705p5495L01483
$$ y = [781104, 1138543, 1267820, 1191993, 1213610, 1190671, 1030572, 1140335, 1300499, 1595125, 1331978, 1354994, 1222627, 1758986, 1123334, 1464575, 1347425, 1469517, 1265349, 1573430, 1447541, 1622835, 1399224, 1478124, 1654847, 1393087, 1163095, 1426207, 1753482, 1672372, 1167923, 1775714, 1532224, 1763403, 1399692, 1419014, 1382482, 1777251, 1438034, 1399577, 1563406, 1592654, 1437748, 2002132, 1843664, 1757380, 1702450, 1903848, 1555260, 1587093, 1837711, 2104629, 1729458, 1965970, 1883910, 1656422, 1712293, 1955895, 2120084, 1963745, 1885921, 1888016, 2215240, 2020711, 2271543, 1896712, 1766520, 2095125, 2066499, 2463000, 2206381, 2112835, 2397402, 2387250, 1917969, 2493947, 2243320, 2492173, 2476468, 2400973, 2702456]
16887B702456n94354J80161K31570K00983j679O4298k19402L3837K20426o5920
16877B752376J74180k75389o4201M9489L58891l10607M63298l74287R3000L39021
16867C205771k54210L35464J5194l04745R2141L78439o58602J31479O49421m05613
16857C184739O7080L84195k36229J72727n2293J87584K66046m6345j02519J19399
16847C944384K70890j63121N108J70751j04086m41330P45300l43800L98514N1403
16837D534013n2920K08397J34499O0722n1185M5310O6025L36806L92712m96691
16827E177688J86199p4770L00654J74879Q3396j08528J39972R070j2386K16898
16817F093072O55471O6065n19410j16462Q43603Q1934o5473K04623L95529l02045
$$ y = [2702456, 2108102, 2288263, 2519833, 2720816, 2719137, 2783435, 2564033, 2597870, 2818296, 2752376, 2926556, 2651167, 2586966, 2636455, 2995346, 2684739, 3148037, 2773750, 2866750, 3205771, 2951561, 3287025, 3302219, 2997474, 3089615, 3468054, 2809452, 2940931, 3590352, 3184739, 3251819, 3636014, 3399785, 3572512, 3520219, 3707803, 3973849, 3927504, 3824985, 3944384, 4215274, 4052153, 4057261, 4228012, 4123926, 3682596, 4427896, 4084096, 4482610, 4534013, 4481093, 4689490, 4823989, 4884711, 4833526, 4878836, 4944861, 5281667, 5674379, 5177688, 5363887, 5289117, 5589771, 5764650, 5848046, 5739518, 5879490, 5888560, 5876174, 6093072, 6748543, 6814608, 6295198, 6178736, 7022339, 7104273, 7038800, 7243423, 7638952, 7336907]
16807G336907L32458N5458J91551J20274J80193J45691J63198J93375K00853q9381
16797H830577K95227L77691J51973J11061M79534l31222O87613K707M78228K19910
16787A1303299k0873L26943M50873N4771O86092J55141K39822M98489M57095k53361
16777A3898291Q29591J89603M58656K72844N78307M07822M01969N26497J20151
16768A7683731J347712l2802O64675M40634L69785J028343M08349M72482J042430
16759B3425339N61956Q18109J004154P48485P88280Q63276J015052J115595J018878
16750C1359124J325386J163767J268523J159609R98685J623231J359964J357654
16742D1615943J721567J852208J933977J808206J904815K209855K265295J869641
$$ y = [7336907, 7669365, 7724823, 7916374, 8036648, 8216841, 8362532, 8525730, 8719105, 8919958, 8830577, 9125804, 9503495, 9655468, 9766529, 10246063, 9914841, 10602454, 10605161, 11083389, 11303299, 11282426, 11609369, 12060242, 12115013, 12801105, 12956246, 13196068, 13694557, 14151652, 13898291, 14727882, 14917485, 15376141, 15648985, 16227292, 16635114, 17037083, 17563580, 17683731, 19031443, 18998641, 19663316, 20103950, 20473735, 21502078, 21910427, 22382909, 23425339, 23987295, 24805404, 25809558, 26558043, 27346323, 28209599, 29224651, 30340246, 31359124, 32684510, 33848277, 35116800, 36276409, 37275094, 38898325, 40258289, 41615943, 43337510, 45189718, 47123695, 48931901, 50836716, 53046571, 55311866, 57181507]
16734E7181507K593943K417983K750683K843158K819859L026472K925026K793603
16726G9352234L758162L401046L718173L684326L666068L393060M112148L735788
16718A08821005L499634L933956L648412L417470L044385K985661L149674K563709
16710A35063906K133565J708024J496821P74893O48800J73695q28539o55314j704379
16701A38811472j715118j709555k866624k969379l143559l075530l693832l825212
16693A15812663l562191l803786l884844m165661l588817l672019l718868l855277
16685H5561200l448899l437056l071755l099251k979024l049325k881015k086330
16677F1508545l129541k003601k454075k552003k143567j569074j939801j782531
$$ y = [57181507, 59775450, 62193433, 64944116, 67787274, 70607133, 73633605, 76558631, 79352234, 83110396, 86511442, 90229615, 93913941, 97580009, 100973069, 105085217, 108821005, 112320639, 116254595, 119903007, 123320477, 126364862, 129350523, 132500197, 135063906, 137197471, 138905495, 140402316, 141177209, 141826009, 141999704, 141171165, 140515851, 138811472, 137096354, 135386799, 132520175, 129550796, 126407237, 123331707, 119637875, 115812663, 112250472, 108446686, 104561842, 100396181, 96807364, 93135345, 89416477, 85561200, 82112301, 78675245, 75603490, 72504239, 69525215, 66475890, 63594875, 61508545, 58379004, 56375403, 53921328, 51369325, 49225758, 47656684, 45716883, 43934352]
16669D3934352j889204j559818j502272j463377j605566q53551j562276j023765
16661C2474523j126400j204333r66729j112176r98147p58908r41851p44746n83479
16652B4037754p77128n61245j137625l22319p77636o28661r15863k19747p07540
16643A7989990o39389l56543n35583l39029m13402l94216q63945M5325m86864
16634A4006344r3292m41003m76264k91670k83477k30756n73915K38234m23166
16625A1431035n91655N2552l54725m44896l1200J99972p86849j48980Q9573n11609
16615H903218J14002m78798k2118k55180l38062J54767l74650j21738J40839j71367
16605G550913n41531J00115j36917o4424o3948p8518k2029l30614L4267m27237
$$ y = [43934352, 42045148, 40485330, 38983058, 37519681, 35914115, 35060564, 33498288, 32474523, 31348123, 30143790, 29177061, 28064885, 27066738, 26307830, 25365979, 24621233, 24037754, 23260626, 22699381, 21561756, 21239437, 20461801, 19833140, 18917277, 18697530, 17989990, 17350601, 16994058, 16458475, 16119446, 15706044, 15311828, 14447883, 14493208, 14006344, 13913052, 13472049, 12995785, 12704115, 12420638, 12189882, 11615967, 11854201, 11431035, 10839380, 10891932, 10537207, 10092311, 10061111, 10261083, 9474234, 9325254, 9414827, 8903218, 9017220, 8538422, 8516304, 8261124, 7923062, 8077829, 7703179, 7581441, 7722280, 7550913, 7009382, 7109497, 6972580, 6908156, 6844208, 6765690, 6743661, 6413047, 6447314, 6020077]
16595F020077J48224j54686m2403l84074L7782o5939j45883R7491l81531K60053
16585E389111k05276j10308l01571K86727k64510j37360R9424q3074k08850K60149
16575D724462n45337K84509n62853J32120J71230k40850O9947l1530k59724J78184
16565C920158j37994m03384J53532J58398P61k58193q9100j5235L24895n61212
16555C092626L27991j13646J09328n7197j39086l6272j69278L23676q0813l83807
16545B873522J04880j25467J21128Q9661l76256o17K9946k18097P3647J51211
16535B723558k43069L5886K81781r9835M8791j4558l5457p2160k06225l11606
16525B107106M71788k85316j44365j08341M18784n83356L38246J03190n99700
$$ y = [6020077, 6168301, 6013615, 5971212, 5587138, 5624920, 5558981, 5413098, 5510589, 5129058, 5389111, 5183835, 5073527, 4771956, 5058683, 4794173, 4656813, 4756237, 4673163, 4464313, 4724462, 4179125, 4463634, 3900781, 4032901, 4204131, 3963281, 4033228, 4001698, 3741974, 3920158, 3782164, 3378780, 3532312, 3690710, 3691471, 3433278, 3344178, 3328943, 3653838, 3092626, 3420617, 3306971, 3416299, 3359102, 3220016, 3183744, 3014466, 3338142, 3257329, 2873522, 2978402, 2852935, 2974063, 3063724, 2687468, 2686851, 2716797, 2498700, 2572347, 2723558, 2480489, 2516375, 2798156, 2698321, 2747112, 2732554, 2697097, 2624937, 2418712, 2107106, 2578894, 2293578, 2149213, 2040872, 2459656, 1876300, 2214546, 2317736, 1718036]
16516A718036M32579j23064m3701K29843q2028L67599l28397j99335K67448K7138
16506B266118o4661k69743J11150m05275L45157k58301J25314M9780P3662k85967
16496A687234k3384P5252n3986N4382n33345L13562K38284l15115R7370M88578
16486B028832o51415L9450N4347J67924j2603l21851J80892J0582N6757P2292
16476A625207l45190J74632P073L71247k53409l63511J82377l36725K86750O5122
16466A413573J12598J57810n20893L70084K21435m28371k67878q624J35498N3381
16456A238613J38383p2121j85071P9470J6380L3984J13716k54235Q4323O9821
16446A263263R6365r3295k86710P0025J42740O9632k09940m9530J36071k32460
$$ y = [1718036, 2150615, 2027551, 1983850, 2213693, 2131665, 2499264, 2170867, 1971532, 2238980, 2266118, 2201457, 1931714, 2042864, 1637589, 1982746, 1724445, 1849759, 1899539, 1973201, 1687234, 1663850, 1739102, 1685116, 1739498, 1206153, 1519715, 1757999, 1442884, 1540254, 2028832, 1377417, 1416867, 1471214, 1639138, 1626535, 1304684, 1485576, 1496158, 1552915, 1625207, 1280017, 1454649, 1461722, 1832969, 1579560, 1216049, 1398426, 1061701, 1348451, 1413573, 1526171, 1683981, 1163088, 1533172, 1754607, 1326236, 1058358, 1049734, 1185232, 1238613, 1376996, 1304875, 1119804, 1199274, 1215654, 1249638, 1363354, 1109119, 1193442, 1263263, 1359628, 1266333, 979623, 1049648, 1192388, 1262020, 1052080, 1002550, 1138621, 906161]
16436I06161k8132K04240k21211L66976j4792k12960j55034O34388n45866O6507
16426A000277k12039L36548k52186J94680K51497m35163K32082K5779l53102k62586
16416E25787K71834J11088j25358O4995J70699L91331n59934P7566K62396k34743
16406I55661K53135l68406j40287L71960l23837R7352k12369J97403K29772k62025
16396G98359N4538j14734J48915q632k84184J48396J51597j47129r6784L83209
16386A033551k18428K27001j78154k50903J22071Q2682k14022K50393k14479J82202
16376H21914k2025K44145D22377K69913k08847N52100j31092k76377K91671k97188
16366F22557j205N1812j5489R3696O7923J4393J3414n8274R7348l90036J25718
$$ y = [906161, 878029, 1082269, 861058, 1228034, 1213242, 1000282, 845248, 1479636, 933770, 1000277, 788238, 1124786, 872600, 1067280, 1318777, 883614, 1115696, 1141475, 788373, 525787, 797621, 908709, 783351, 848346, 1019045, 1410376, 850442, 928008, 1190404, 955661, 1208796, 840390, 700103, 1072063, 748226, 845578, 633209, 830612, 1060384, 798359, 852897, 738163, 887078, 878446, 594262, 742658, 894255, 747126, 650342, 1033551, 815123, 1042124, 863970, 613067, 735138, 817820, 603798, 854191, 639712, 821914, 799889, 1044034, 422377, 692290, 483443, 1035543, 904451, 628074, 919745, 622557, 621352, 673164, 657675, 751371, 819294, 833687, 847101, 788827, 886175, 496139, 621857]
16355F21857J8465k40373K20537q3496L4425L26035p2677r6977j96483J0654Q9532
16344F31499m4243j6990J88570j66737m6682J04592j48217l8251J5078P6887p0516
16333D84990j73174Q7890J70311q659L20186k66288K78356k01935n1837R5313
16323G35153q8166j39672J31415M6980n0148k16042J48150J3719J24156j56134
16313E49411A49297N66847k23782L34486q3211J5661C05316J05387q7347J01894
16303D25250O1622Q2755M7560j51662O1006K2630j28588O7197n885L16586k95097
16292E03374J82141B31811O45954l51490R6491j30731J53077j87641o2138R6362
16282D91695j90351J01106L70258l49416L6513J19864r6791k4722j5246j57550
$$ y = [621857, 640322, 399949, 620486, 536990, 571415, 897450, 824773, 727796, 531313, 541967, 631499, 587256, 570266, 758836, 592099, 545417, 650009, 501792, 463541, 478619, 555506, 484990, 311816, 399706, 570017, 561358, 881544, 615256, 893612, 691677, 639840, 735153, 646987, 507315, 638730, 685710, 635562, 419520, 567670, 581389, 705545, 549411, 149297, 716144, 492362, 826848, 743637, 759298, 305316, 410703, 323356, 425250, 486872, 569627, 617187, 465525, 526531, 549161, 420573, 487770, 481885, 798471, 503374, 685515, 231811, 877765, 526275, 622766, 492035, 645112, 457471, 395333, 491695, 301344, 402450, 772708, 423292, 459805, 579669, 482878, 458156, 442910, 285360]
16272B85360L83892B89973K66667j32161J17110P8266l04395J09535p4903L08074
16262F58166j18307J20970j51491r1335L29612B64130J53739J74020B06295L29477
16252E35772J06736j14648Q4414j10954J53926k48977L48641C74174l5722P5045
16242D13497q8383J53457J47999B14058J31522K30698k0431p5696R1255j15750
16232D55656J85771A33959K42332A07632O3044M2087K78646Q4118k50595J36844
16222D61776D2160L22813L18573B75982P2984M1805M6657j18627d4897B10182
16211A26576M36597A17508M93173m6878k9193j03924Q6419l2168L20451B37369
16200B58737A06291L50472q5118j41553J06795L00873j40850J26170B33455K23908
$$ y = [285360, 669252, 289973, 556640, 424479, 541589, 619855, 315460, 424995, 350092, 658166, 539859, 660829, 509338, 418003, 747615, 264130, 417869, 591889, 206295, 535772, 642508, 527860, 612274, 501320, 655246, 406269, 754910, 374174, 338452, 413497, 325114, 478571, 626570, 214058, 345580, 576278, 555847, 480151, 571406, 455656, 641427, 133959, 376291, 107632, 170676, 212763, 491409, 575527, 324932, 461776, 42160, 364973, 683546, 275982, 348966, 390771, 437428, 318801, -44897, 210182, 126576, 563173, 117508, 610681, 563803, 534610, 430686, 517105, 484937, 805388, 237369, 258737, 106291, 456763, 371645, 230092, 336887, 637760, 496910, 623080, 233455, 457363]
16190D57363n4201e0893C59480I3136K00776K46434B47927J39628A79769K5982
16180B05751J7998G748K62070j2956q5350J8752K25823l9538j72881l0673L20593
16169D93588j84913F1643J44339J01423K05810A91725P0392r6286J03748M9684
16159C19263K83893A12188a1487C40107J52429A12196c0263A553Q8441L25368
16149D15362J9050j15378A55945h3302D22077A17591E448R4290A2289J31840a44158
16137A47947R5371L69570B7933g6959A00527K23788g6938B15144i3877A19383
16126A81558J64449A48146b75388A77610K18193q7527a27341K785D47559F672
16115B3007J98956r0771f5483o2570R036A99136e6297E13587A09964B7291K57718
$$ y = [457363, 403162, -50893, 359480, 93136, 293912, 540346, 247927, 387555, 179769, 205751, 223749, 7748, 269818, 256862, 171512, 190264, 416087, 376549, 203668, 172995, 493588, 308675, 61643, 205982, 307405, 513215, 191725, 262117, 165831, 269579, 319263, 603156, 112188, -11487, 340107, 492536, 112196, -30263, 1553, 89994, 415362, 434412, 319034, 155945, -83302, 422077, 117591, 5448, 99738, 12289, 144129, -144158, 147947, 243318, 612888, 27933, -76959, 100527, 324315, -76938, 215144, -93877, 119383, 181558, 346007, 148146, -275388, 177610, 395803, 308276, -127341, -124556, 447559, 6672, 23007, 221963, 131192, -65483, -128053, -119017, 199136, -56297, 513587, 109964, 27291, 285009]
16104B85009L1637A14238a41760j06869C60880A34495K19060j67837q8302K55233
16094C52649d04A82041M93368B56700A16437K4570Q5360O2431c8360C44609a41320
16082A38224D937J22670A2888K16220L4847a71559B53596k4025b2826c739o7907
16071g1646B87009m490G6735j2794O0421h609C08321C6826J21735K78799i37j41188
16059a42125l9951A44135f6566l4072j64828A25161n6642J69919P2486d37A1016
16047h5928A27153g0163m8799N7379A2135L06368J55973A76060a74618B91535
16036i4701G8150j193L22411A24782E8803A7988L26284d2242j07053j49275B10954
16024a16367C7304J48195f2734A12233A4672L26637D6263a93928F7852K3783K68137
$$ y = [285009, 316646, 114238, -141760, -248629, 360880, 134495, 353555, 185718, 97416, 352649, -404, 182041, 675409, 256700, 116437, 141007, 226367, 288798, -38360, 344609, -141320, 138224, 4937, 127607, 12888, 229108, 263955, -171559, 253596, 229571, -22826, -3739, -71646, 287009, 282519, 76735, 63941, 124362, -8609, 308321, 36826, 158561, 437360, -937, -142125, -182076, 144135, -66566, -100638, -265466, 125161, 68519, 238438, 310924, -437, 11016, -85928, 127153, -70163, -118962, -61583, 12135, 318503, 474476, 176060, -174618, 291535, -94701, 78150, 76957, 399368, 124782, 58803, 17988, 344272, -42242, -149295, -298570, 210954, -116367, 37304, 185499, -62734, 112233, 14672, 341309, 46263, -193928, 67852, 91635, 359772]
16013C59772e0391B86429O3486g101C2922a0059A82735O2399n540G9633a12979
16001G7949j8034a42078f6826A03000b13986D22619a43146p7221A30805J42085
15991B72890a1766A7551h2560A83775q2793K76339f2050B04013c13165B17759
15980H3826K2661K06579A16822g634C23562G3638K18871J16508L62277p3052J80828
15969H79070O7547D24369L08749r7188k42952h9668F7965P8638b04649B48293
15958g5621D1481K65462b63321A6011a0462A43315O2264j4559F4901L2233a27731
15946A03405m1081f6013k13231H3202J98008a19825a9284A98289M5915a32448
15935D9705c6070B25025j08164L6318a79041b5084D3320j9641K37429b47608J09841
$$ y = [359772, -50391, 286429, 349915, -7101, 32922, -10059, 182735, 245134, 239594, 79633, -112979, 77949, 59915, -142078, -66826, 103000, -213986, 422619, -143146, -220367, 130805, 272890, -11766, 17551, -82560, 183775, 100982, 377321, -62050, 204013, -313165, 217759, 83826, 106487, 313066, 116822, -7634, 323562, 73638, 292509, 409017, 771294, 698242, 879070, 946617, 424369, 733118, 635930, 392978, -89668, 67965, 146603, -204649, 248293, -75621, 41481, 306943, -263321, 16011, -10462, 143315, 205579, 191020, 64901, 97134, -127731, 103405, 62324, -66013, -279244, 83202, 281210, -119825, -19284, 198289, 244204, -132448, 49705, -36070, 225025, 116861, 153179, -179041, -25084, 43320, 23679, 261108, -247608, -137767]
15924a37767b5384A34919N2626e1046I5549a51451M5419n4365A60286e9458l55216
15913d14674a23925L3089D6133h4880C8911K56293b23561j96577g7723r4082H254
15901h3119j78146A10543B3752a8505d089H2241A7195b56072A32716C4236J7616
15890E1852J7821G68c61475a25238L0518b7413j55865j1200A34612a84829L0748
15879a54081n7768b9688j13851C22219D5317b93893d7078j90360h3931J8885G5756
15867b9379j00974A16582a88496i1250j21931i9219A46166E56b33889K6052M4174
15856a63663N7849k49832J55423C0697L3434i0207j41681q5934A29692E2028P5607
15845A27635h9416j36538f9450J1278D8387K93737a063p2364C05523a83123A29988
$$ y = [-137767, -25384, 134919, 187545, -51046, 95549, -151451, -106032, -160397, 160286, -59458, -414674, -123925, -90836, 46133, -84880, 38911, 295204, -223561, -420138, -77723, -171805, 8254, -83119, -261265, 110543, 23752, -18505, -4089, 82241, 17195, -256072, 132716, 34236, 51852, 69673, 768, -361475, -125238, -94720, -27413, -183278, -194478, 134612, -184829, -154081, -211849, -29688, -143539, 322219, 45317, -293893, -47078, -237438, -83931, -65046, 75756, -29379, -130353, 116582, -188496, -91250, -213181, -99219, 146166, 556, -233889, -207837, -163663, -105814, -355646, -200223, 30697, 64131, -90207, -231888, -317822, 129692, 52028, 127635, -89416, -225954, -69450, -58172, 48387, 342124, -1063, -73427, 305523, -183123, 129988]
15833c34684a14694E2485f3713B6839J28068a20174a269j0944k75219A62897b3902
15821b39015D6899c61654F0910R0485H717a15906c3140F0143b4189k11556e8222
15809a64276j17247A15309c1135A31722a85220P7858L5757h684F4059b29290A03271
15797a50942A00977J9102d27774a11308A54317h0701C17329j26919a92740Q5699
15787a07041A79577c3802A49581a96462A8601O8033B3152c57135C1512g3657c778
15775B08399m7463F3927a42473d2270c920j79496O9374F3336h7334G6880c33884
15763d391A25210p593h0471C06161a04938B75050c36340J36722k95833A14696
15752i6686I4974f2777A82914b28756A89284o9339c42070B6447b38706H0247c10799
$$ y = [-334684, -114694, 52485, -63713, 26839, 154907, -120174, -1269, -12213, -287432, 162897, -23902, -239015, 46899, -361654, 60910, 151395, 8717, -115906, -33140, 60143, -24189, -235745, -58222, -164276, -281523, 115309, -31135, 131722, -185220, -107362, -71605, -8684, 64059, -229290, 103271, -150942, 100977, 120079, -427774, -111308, 154317, -80701, 317329, 190410, -192740, -107041, 179577, -33802, 149581, -196462, 18601, 86634, 23152, -357135, 31512, -73657, -3778, 208399, 160936, 63927, -142473, -42270, -3920, -183416, -114042, 63336, -87334, 76880, -333884, -4391, 125210, 117617, -80471, 306161, -104938, 275050, -336340, -199618, -495451, 114696, -96686, 94974, -62777, 182914, -228756, 189284, 119945, -342070, 26447, -238706, 80247, -310799]
15740f1590k9861L2363l1295l9009C77344a19440B7921i4866A84207a8094j58701
15729a76795H4645h378k2699H3124c9324A67645J49328A09659a10560p5564H3857
15717b76438a37743L7842q052I9249J8886m2148a99558h2779b0534C62440r7879
15706B64561a49937P4867A3608c20305C17680a72720E6317d4037r0708B7315a08547
15694a44982B07972B1798J13685b89488j30935A37015a30108j311e8250d262m6857
15683e1119j45187a5527A59254I969J65752G4422b01324K7022A19665e9782Q912
15672e0870B05434i8318d3355j85142D8897K26068g4420E9491e6052j39831g5954
15660a15545B51897c59132A24520e2396F1754J95158b8202G8290f7004p6853A97236
$$ y = [-61590, -91451, -59088, -90383, -129392, 377344, -119440, 27921, -94866, 184207, -18094, -176795, 84645, -8378, -31077, 83124, -39324, 167645, 316973, 109659, -110560, -186124, 83857, -276438, -137743, -99901, -107953, 99249, 118135, 75987, -199558, -82779, -20534, 362440, 264561, -149937, -75070, 13608, -320305, 317680, -172720, 56317, -44037, -134745, 27315, -108547, -144982, 207972, 21798, 135483, -289488, -420423, 137015, -130108, -131419, -58250, -4262, -51119, -196306, -15527, 159254, 9969, 175721, 74422, -201324, -174302, 119665, -59782, -50870, 205434, -98318, -43355, -228497, 48897, 274965, -74420, 59491, -56052, -195883, -75954, -115545, 251897, -359132, 124520, -52396, 61754, 256912, -28202, 78290, -67004, -143857, 197236]
15648F8135J75323G0411j1402O113c21148m6787H0897g5399L5455j68879i0667
15636d1336A08710M2105J9581o3861a78073A75189c45110D5999a8141j4525A76801
15624a11041B32061r1518g5999f327l8913l4123j82344e0554j67791c204k34502
15613b37706A77347a9333n7583m3781B31064A8387M1792e6751j34363h5569G6422
15601a26490l45268K04527c8502C2014a35024E7630f9632k18128I1902c34148
15590B35484J03229c2219E4022J3424a60682c3274k04951B8613L8410J42763A4436
15578A56984A5970f9760a9413C36653i2719G5401J07959b34598P9451L744K1006
15567a30397A51098a42713B36206k8947M661A0078J93487i6570d2371l90695A56389
$$ y = [68135, 243458, 70411, 59009, 65122, -321148, -367935, 80897, -75399, -39944, -208823, -90667, -41336, 108710, 150815, 170396, 106535, -178073, 175189, -345110, 45999, -18141, -32666, 176801, -111041, 232061, 140543, -75999, -6327, -45240, -79363, -261707, -50554, -218345, -3204, -237706, 177347, -19333, -76916, -120697, 231064, 18387, 60179, -56751, -191114, -85569, 76422, -126490, -471758, -267231, -38502, 32014, -135024, 57630, -69632, -287760, 91902, -334148, 235484, 338713, -32219, 54022, 67446, -160682, -33274, -238225, 28613, 67023, 209786, 14436, 156984, 15970, -69760, -19413, 336653, -92719, 75401, 183360, -234598, -155147, -151403, -130397, 151098, -142713, 236206, 207259, 211920, 10078, 203565, -96570, -42371, -433066, 156389]
15555d9277b2057j05141H983L39532b35842j02470d6826B97922g3965o2203A06920
15543a45376p6880a9603k14358A58445F5485J2890P6740B9631N2703c67539i4083
15531A25987h5708I0617g2349l23231a08257p4993d024B02905e8481A64137K1076
15520A85213B8335a22843B6393J54953h9476C94263N776a1169j37105F319g0930
15508B56338A02146l2919J66924a93930G5621L6468M817b97179c931E6969i9697
15496B0340R499e0045b4872H0574K13235g5106G2163d6721B11355F8203K10134
15485B78337A15044J02854N3688a23609c5016C75676d1249J0940B61784C3741
15474C98408A04806K2949b2180D05381D1332P9988J53708J91421n2516g8956B28438
$$ y = [-49277, -22057, -127198, 8983, 348515, -235842, -338312, -46826, 297922, -73965, -136168, 106920, -145376, -222256, -19603, -233961, 158445, 65485, 78375, 155115, 29631, 82334, -367539, -94083, 125987, -85708, 90617, -72349, -395580, -108257, -183250, -4024, 202905, -58481, 164137, 185213, 28335, -122843, 26393, 181346, -89476, 394263, 400039, -11169, -148274, 6319, -70930, 256338, 102146, 69227, 236151, -193930, 75621, 112089, 116906, -297179, -3931, 56969, -99697, 20340, 29839, -50045, -24872, 80574, 293809, -75106, 72163, -46721, 211355, 68203, 278337, 115044, 217898, 271586, -123609, -35016, 375676, -41249, -30309, 261784, 33741, 398408, 104806, 127755, -22180, 405381, 41332, 121320, 275028, 466449, 413933, -78956, 228438]
15462C37619n6760j05951D250K31687J65513K26954j42958M0502B34434G8724
15451A02552j9295c467k0737r5142H5515C7585Q1018c77919a03311b7479k95245
15440c22724f5750A41548J81370c9170B58912N6745a58083B56996O9808c19145
15429A94471J24215K47949G9774M99798J76677Q1799l41700N4480j44607k1089
15419C85132O560d1954C96991A83866b4480A58168j2111F7021J31330R2741N666
15408B96758a53438J9339D4121O9358m2809d12221B25580b8091r7589M5308A13970
15396b70358B62900a12985N5731o4397j05078F0578A9505J82379a12101b656j25992
15385a28648H4217J2827e5049j15431j99409E445a75474A95331A4749a07424p444
$$ y = [337619, 280859, 174908, 4250, 235937, 401450, 628404, 485446, 525948, 234434, 78724, 102552, 83257, -3467, -24204, -119346, 85515, 37585, 118603, -377919, -103311, -27479, -322724, -65750, 141548, 322918, -39170, 258912, 315657, -158083, 256996, 326804, -319145, 194471, 318686, 566635, 79774, 579572, 756249, 838048, 496348, 550828, 406221, 385132, 391692, -41954, 396991, 183866, -24480, 158168, 146057, 67021, 198351, 291092, 296758, -153438, -134099, 44121, 113479, 70670, -412221, 225580, -28091, -125680, -80372, 113970, -270358, 262900, -112985, -57254, -121651, -226729, 60578, 19505, 201884, -112101, -2656, -128648, 84217, 97044, -55049, -170480, -369889, 5445, -175474, 195331, 14749, -107424, -114868]
15374a14868B50257g8915C1244a42439F589a26883d6008A18233F833K1547i5657
15362a70090H427d5574C46724n0770J06944E7838J17548j8679d805k06615a9047
15350B43292D667K5964L53124A78478C0637a8366G6908J22631a58451C89865b16527
15338C28430F2864j2080J66615a0133A11823C1227c6376B35120p3066p7081J58696
15327B43669B1148K12243G7857M22581d3738B51526a03508K4816C48032j35355
15317B12677j04999I841d0914B71840q9422Q3630k6488k4562E9695J50202a03421
15305C96538I2054P0450d3756E1826a53918o4995K7159H6141g7906a2010r1586
15294a03596B02292r7737m6449A1098K14132h9265k9254B46957F8544A8087d24132
$$ y = [-114868, 250257, -78915, 31244, -142439, 6589, -126883, -46008, 118233, 6833, 28380, -95657, -170090, 8427, -45574, 346724, 295954, 402898, 57838, 175386, 156707, -4805, -211420, -19047, 243292, 4667, 30631, 383755, 178478, 30637, -18366, 76908, 199539, -158451, 389865, -216527, 328430, 62864, 50784, 217399, -10133, 111823, 31227, -36376, 235120, 162054, 84973, 243669, 21148, 233391, 77857, 500438, -43738, 251526, -103508, -78692, 348032, 212677, 107678, 9841, -40914, 271840, 182418, 266048, 239560, 214998, 59695, 209897, -103421, 396538, 92054, 162504, -43756, 51826, -153918, -218913, -191754, 86141, -77906, -12010, -103596, 202292, 104555, 58106, 11098, 225230, -89265, -118519, 246957, 68544, 18087, -424132]
15282A66203B8182K22845O8986j36054b35827H2724f0479A61694M2823f2526p3355
15271a35881B38784e2541D8608d2296l6744C7123b4359C22541H3713L76868A90697
15259I9801K818a60633D7683A1865a61035A22645L43440b0274B9895j3648A683
15247A77072b36583B8668M3313K01940E4729H004N92J4853P244d9618A05258C0472
15234a89057d4687O676A36444N65109k08381R55429J79433j56565m6803l08132
15224A116534n47192B69445F9936J85438C3735J38158F3617J34044o1694J36199
15214B72166a24141B00783o6437J68426a96989G2257i7756A89367l2960b01602
15203D17056d6993A39953A4107L4334J39115l7711p3303a11887b3900A81914r246
$$ y = [166203, 28182, 251027, 320013, 183959, -235827, 82724, -60479, 161694, 204517, -62526, -135881, 238784, -52541, 48608, -42296, -79040, 37123, -24359, 322541, 83713, 460581, 190697, 99801, 102619, -160633, 47683, 11865, -161035, 122645, 466085, -20274, 29895, 16247, 1683, 177072, -236583, 28668, 71981, 273921, 54729, 8004, 8596, 23449, 30693, -49618, 105258, 30472, -189057, -44687, -38011, 136444, 701553, 493172, 1448601, 1628034, 1471469, 1424666, 1116534, 569342, 269445, 69936, 255374, 33735, 171893, 63617, 197661, 135967, 272166, -124141, 200783, 134346, 302772, -196989, 72257, -97756, 189367, 156407, -201602, 417056, -46993, 139953, 14107, 48441, 187556, 149845, 76542, -111887, -23900, 181914, 172668]
15192A72668E0013h3648B76830i5121j2981H3748K44170P3013j27414o7173a36490
15180B56438a06385A40753a1833j52400f5189C30369a2381D59109b42322C09238
15169c3612k42235A30716e1453p7963j00256m6422B69710J21944B491b7115j04703
15158a31818N1934H4800P1654c0097B73577g1342L3883A64040B6272K97896b6578
15146b8216A54549b1804i036j2108o1215n0025B77353Q9703a43110A04634B2129
15134f9774j20960c7033p3541A97885r7801a21859H0218i0300B6007K99480A37143
15122h229D64868e2507o0592B54937C044M72470j34797C1672J03379d5984A97876
15110A92056a62262A3543a15184A90433K6672K20460j40956L1524A57701J62963
$$ y = [172668, 50013, -83648, 276830, -95121, -108102, 83748, 327918, 400931, 273517, 206344, -136490, 256438, -106385, 140753, -11833, -164233, -65189, 330369, -12381, 459109, -242322, 309238, -33612, -275847, 130716, -51453, -129416, -229672, -276094, 269710, 391654, 2491, -27115, -131818, -79884, 84800, 156454, -30097, 273577, -71342, -37459, 164040, 26272, 324168, -26578, -28216, 154549, -21804, -9036, -21144, -82359, -132384, 277353, 367056, -143110, 104634, 22129, -69774, -190734, -37033, -110574, 197885, 100084, -121859, 80218, -90300, 26007, 325487, 137143, -8229, 464868, -52507, -113099, 254937, 3044, 475514, 340717, 31672, 135051, -45984, 197876, 192056, -162262, 13543, -115184, 190433, 217105, 437565, 296609, 328133, 157701, 320664]
15100C20664n9514J4283K6512j27224H4215a08258e1924B60526a12216A08990
15089e9685b2607B54324J16134A23366a24114A18169A593L04818J00204D9015
15078A75227A5298J58167M8622j3976G995J55150l9772L29454I964N8876K78230
15067C47070G3505f6821j03878A28881A9440b10422A8065a04231C08375j34954
15057A73421c8276D47138A29445e411j6594E44604c4624C49358J81598a6834B78212
15045A62250p5210K88895J54389B02537L02694A86705K2468P4743a06846B51316
15034C6315K88945j1517k6481J19502m2140j18484M15399k06844B02070K34021
15024D36091k15797R0911J18960K39492R386l10467j00618p7692O36325k26125
$$ y = [320664, 261150, 275433, 301945, 174721, 84215, -108258, -51924, 260526, -112216, 108990, -59685, -22607, 254324, 370458, 123366, -124114, 118169, 1593, 306411, 406615, 49015, 175227, 15298, 173465, 222087, 208111, 7995, 163145, 123373, 452827, 9964, 68840, 347070, 73505, -66821, -170699, 128881, 19440, -210422, 18065, -104231, 308375, 173421, -38276, 447138, 129445, -5411, -22005, 544604, -34624, 349358, 530956, -16834, 278212, 162250, 87040, 375935, 530324, 202537, 505231, 186705, 209173, 283916, -106846, 251316, 36315, 325260, 313743, 287262, 406764, 364624, 246140, 661539, 454695, 202070, 436091, 220294, 311205, 430165, 669657, 679043, 368576, 267958, 190266, 826591, 600466]
15014F00466B32000N97597B70877O00136D27520J73148j30687A86863p74K30327
15004D16416P497n8525j9568N5272p7047o3908k6835J21807M8749R5277j82733
14993C16402N782M7880P0098l8644A47257L48209j93978j36455J84034P7578N6807
14982D83452L8301j76782J93168r4508j77503J47362l8581J6186K14255j09995
14972D95355A03823M18721K08562C29795p7432K67711K8670L04621C92279O27663
14962A019942m28157B28165Q8255L85722A29110M27836J27053j88270l5576m0717
14952D19436B00103M89581l4754k26705r8633N7428j2393m8913A39658K38491
14942C78149A51681M23494A94397J66086R2489o2495J77740j72414P4017j7307
$$ y = [600466, 232000, 829597, 270877, 871013, 427520, 600668, 469981, 186863, 186089, 416416, 423913, 365388, 345820, 401092, 324045, 260137, 233302, 355109, 403858, 499135, 316402, 322184, 370064, 440162, 401518, 147257, 495466, 301488, 165033, 349067, 426645, 483452, 521753, 344971, 538139, 443631, 266128, 413490, 374909, 391095, 605350, 495355, 103823, 522544, 731106, 329795, 252363, 520074, 548744, 853365, 392279, 1019942, 591785, 228165, 316420, 702142, 129110, 556946, 683999, 495729, 460153, 419436, 200103, 689684, 654930, 428225, 329592, 387020, 374627, 325714, 139658, 378149, 151681, 575175, 194397, 360483, 452972, 390477, 568217, 395803, 469820, 452513]
14932D52513J6866A61524K87198k23682K42997K54406l08373L25934j45246B03020
14921D21462n5607K76094j79510F4563M28608K47653J91775J12132j46390k07256
14911F91085L39400R1823P8924M76164j24419j86294j63825k21871M61114r4666
14901A347435J12926L98301p4687k26461m87592P8566j91811q2706N058l58907
14891E20122r1426n274J03062k05552K62571j16693O8040j65184A35183R7209
14881B32392m215J49302K04815j06723j5303j44006m6698N16852j86099l8179
14871E62138J74181k73895L43260j24972k8278J0156j33502K18023L8862j88299
14861E97674O4849j80735J03203J32909j76410l1452r2536q631J31104A05422
$$ y = [452513, 469379, 161524, 448722, 225040, 468037, 722443, 414070, 740004, 594758, 203020, 421462, 365855, 641949, 462439, 64563, 493171, 740824, 932599, 1044731, 898341, 691085, 1030485, 1122308, 1201232, 1677396, 1552977, 1366683, 1202858, 980987, 1442101, 1347435, 1460361, 1858662, 1783975, 1557514, 1069922, 1148488, 956677, 873971, 879029, 520122, 428696, 423422, 526484, 320932, 583503, 466810, 534850, 369666, 135183, 232392, 228177, 377479, 582294, 475571, 460268, 316262, 269564, 786416, 600317, 562138, 736319, 462424, 805684, 680712, 652434, 662590, 529088, 747111, 785973, 597674, 662523, 481788, 584991, 717900, 541490, 510038, 417502, 408871, 539975, 105422]
14850E05479K90714l08551J70092K22942m20534p9724K90861j8779k22978J75437
14840F04959j74451J67948J40680B72399K90873l4347Q3352k80231L58630k09476
14830D81200p2904K62863k18421K01081K81986J9242K87043k12458J25505K14968
14820A370105k71790n8378j25618k08784j92018J7198P6455J20534p6476L13706
14810I64934k63859q5877k68973L34215P6986j21913O9473K15118K5532k04842
14800G40794K18714k09774j41846N7974L2336q4865L42734j91359j07389J2497
14790F69816J57653l89048L96314L7432q9864C74700P81362q6466j53326m45648
14780D70622R7386J36218l29710K44508L6787k57155L21704J1226n369j693K9625
$$ y = [505479, 796193, 487642, 657734, 880676, 460142, 380418, 671279, 652500, 429522, 604959, 430508, 598456, 739136, 272399, 563272, 528925, 612277, 332046, 690676, 481200, 408296, 671159, 452738, 653819, 935805, 955047, 1242090, 1029632, 1155137, 1370105, 1098315, 1039937, 914319, 705535, 513517, 530715, 607170, 727704, 651228, 964934, 701075, 615198, 346225, 680440, 757426, 635513, 704986, 920104, 945636, 740794, 959508, 749734, 607888, 665862, 698198, 613333, 956067, 764708, 657319, 669816, 827469, 438421, 834735, 872167, 782303, 374700, 1156062, 1069596, 916270, 470622, 568008, 704226, 374516, 619024, 655811, 398656, 720360, 731586, 726217, 724524, 754149]
14769G54149K6365K24459j46605k91908j0304j3191K80882J42282j22025K2737
14759H66841J84908k03390Q589O9520k52938r5898M16753k25220m301k78465K19141
14748G05540C35001M17680j97203J45249j03205P296K5718P1858l47446K59425
14738F14373J54752A51264O35434C60678L86413l04532P3281K06622j16572J07828
14728G13718n9170L26618k43552J88474l72087L67646m18853M56549q3094M5180
14718I21429j88614Q505L74097l16744J73390J18966l3715K9850K87795j40997
14708A233962J71376J31477k94847m07933K90194n3132Q591j93468P7637J58944
14698A122801j06598p6181j21390k13026M14302m1249m3086M83190F80895L44677
$$ y = [754149, 780514, 1004973, 858368, 566460, 556156, 542965, 823847, 966129, 844104, 866841, 1051749, 848359, 856948, 926468, 673530, 577632, 994385, 769165, 764864, 486399, 705540, 335001, 752681, 555478, 700727, 597522, 604818, 630536, 702394, 354948, 614373, 769125, 151264, 786698, 360678, 747091, 442559, 515840, 722462, 605890, 713718, 654548, 981166, 737614, 926088, 554001, 921647, 502794, 959343, 876249, 921429, 732815, 741320, 1115417, 798673, 972063, 1091029, 1057314, 1087164, 1374959, 1233962, 1405338, 1536815, 1241968, 834035, 1124229, 1071097, 1079688, 886220, 963857, 1122801, 1016203, 940022, 818632, 605606, 1019908, 978659, 935573, 1418763, 680895, 1025572]
14688A025572J50309o7355J43309M71516R4008l0716l43855o0879K45071l42213
14678A284767D84429N93418j5203k17990L83669k33434j83652n5129J75561M2136
14668I73805J13907M6451k11200l34806L13706j50535J47015k13325J14477K28718
14658A028213J70212j65315l28876L14883P0619m7963j6124M8699J819j96666
14648H79501K54053J95841o55249K68916J01632j29626K78101l8955k37999M08748
14638A324963J33526j78204k50890K1330J13404L13905r2002m3882j35075J36205
14628A343280k56950j30889M20240q5848m08036M03832j58993K38630O9098l98913
14618A035451K43481J17108K23366j99488r2522O0698k39677K15663J22474m86875
$$ y = [1025572, 1175881, 1108526, 1251835, 1723351, 1817359, 1786643, 1442788, 1381909, 1626980, 1284767, 484429, 1077847, 1062644, 844654, 1228323, 994889, 811237, 756108, 931669, 973805, 1087712, 1134163, 922963, 588157, 901863, 751328, 898343, 685018, 799495, 1028213, 1198425, 1033110, 704234, 1019117, 1089736, 1041773, 1025649, 1074348, 1076167, 879501, 1133554, 1329395, 674146, 943062, 1044694, 915068, 1193169, 1154214, 916215, 1324963, 1458489, 1280285, 1029395, 1050725, 1164129, 1478034, 1386032, 1342150, 1207075, 1343280, 1086330, 955441, 1375681, 1289833, 881797, 1285629, 1126636, 1365266, 1434364, 1035451, 1278932, 1396040, 1619406, 1419918, 1327396, 1388094, 1148417, 1364080, 1486554, 999679]
14608I99679N49765J35314l19408J71873j11359j99608P3398M51091j65820j68885
14598A416040m9139k42437O10578O4259j5836j31639k5694m22799N29340l38008
14588A394665J16172k98175K71314j52322J78295J67334J33281j33894k07660
14579A469010q203L73449l27183L41582j0650r4600k29669N48567l53074j5829
14569A693400K94069J18898l35406M74173j36519j88445R8229n0576K29099j89157
14559B007765o2634R4311K38221j05886J94236n4335J3198L36930K1732m64503
14549B219035K38322j92510L98265J70645J55293j224K47029N11462n8492J50763
14539C838588J55517N45256N83400Q45472J426347K199358M382051N550197R007512
$$ y = [999679, 1549444, 1684758, 1365350, 1537223, 1425864, 1226256, 1299654, 1750745, 1584925, 1416040, 1366901, 1124464, 1735042, 1799301, 1783465, 1651826, 1626132, 1203333, 1732673, 1394665, 1510837, 1212662, 1483976, 1331654, 1509949, 1677283, 1810564, 1676670, 1469010, 1460807, 1834256, 1507073, 1848655, 1838005, 1743405, 1513736, 2062303, 1709229, 1693400, 1987469, 2106367, 1770961, 2245134, 2108615, 1920170, 2018399, 1967823, 2196922, 2007765, 1945131, 2039442, 2277663, 2171777, 2366013, 2311678, 2324876, 2661806, 2683538, 2219035, 2457357, 2264847, 2663112, 2833757, 2989050, 2987826, 3234855, 3746317, 3687825, 3838588, 3994105, 4539361, 5122761, 5968233, 7394580, 9593938, 13975989, 19526186, 28533698]
14530B8533698N151321j3114585q752290m326897j930735j41316J57699j262942
14522D313953j022092o74038j43072O1342J87745o3560l75959k4464l2224K55896
14512B483527k43357L5457J37853m774K30657j26236l8900p8977J34495j2017
14502B517728M31380k25652j39093M32791l40842m812J54338l9698Q1156M1218
14492B908514n5065n3755J7532L85785m4962J55780k70164J04959J27023j0806
14482C264841J06895J95232k98418K36720m31680K89886M33679Q7950m40933M53078
14472C897250j22156M9579J4143j38219m6781K01809m19L26728m1916J76695j88894
14461D127819K83603l65436K96526q8105j938L8343J20240k30806K75027l404
$$ y = [28533698, 33685019, 20570434, 11818144, 7491247, 5560512, 5419196, 5576895, 4313953, 3291861, 2617823, 2474751, 2536093, 2723838, 2660278, 2284319, 2259855, 2227631, 2483527, 2240170, 2275627, 2413480, 2408706, 2639363, 2513127, 2474227, 2395250, 2529745, 2517728, 2949108, 2723456, 2584363, 3017154, 2676312, 2671500, 2825838, 2786140, 2867296, 2908514, 2853449, 2799694, 2817226, 3203011, 3158049, 3313829, 3043665, 3148624, 3275647, 3264841, 3371736, 3566968, 3268550, 3505270, 3073590, 3363476, 3797155, 3885105, 3444172, 3897250, 3775094, 3824673, 3838816, 3700597, 3653816, 3855625, 3855206, 4181934, 4140018, 4316713, 4127819, 4411422, 4045986, 4342512, 4254407, 4252469, 4290812, 4411052, 4180246, 4455273, 4451869]
14451D451869j2489K60157N0214j53839N7147L17271j77706o8201J40941M00603
14441E265967l26400K22683r5659K68326k11561L73077K5631K6473K39846L63219
14431F151602k08792j2960L8579L29359k92165J6076J20066L40594n1164L9080
14421F470275R2437j00633J77649o1019J36313M02858O7710q1425M35676K67424
14411G807265j742k43293L46585k5840M17757k37138L23001J53570M15734q3334
14401H872565J87872J7631J35671j26731K71134J2013R4695K25039j44606O08885
14391A0154168K0540K69853q1271K7174M07768L50853J85024l9718K11078j38646
14381A1366823M85828L2K74368m6683L30536L40392L08931o3700L51097L90595
$$ y = [4451869, 4439380, 4699537, 4749751, 4595912, 4653059, 4970330, 4792624, 4724423, 4865364, 5265967, 4939567, 5162250, 5066591, 5334917, 5123356, 5496433, 5522064, 5548537, 5788383, 6151602, 5942810, 5929850, 5968429, 6297788, 6005623, 6021699, 6141765, 6482359, 6431195, 6470275, 6562712, 6462079, 6639728, 6578709, 6715022, 7117880, 7185590, 7104165, 7539841, 7807265, 7805523, 7562230, 7908815, 7882975, 8300732, 8063594, 8386595, 8540165, 8955899, 8872565, 9060437, 9078068, 9213739, 9087008, 9358142, 9370155, 9464850, 9689889, 9545283, 10154168, 10174708, 10444561, 10363290, 10390464, 10798232, 11149085, 11334109, 11294391, 11505469, 11366823, 11852651, 11852683, 12127051, 12080368, 12410904, 12751296, 13060227, 12996527, 13347624, 13738219]
14371A3738219L14453J89404p7570M81696P4380L87365L16994L59374N47040K45563
14361A6576918O30455K36901k19090M31137P64768k08358L90306N54981L17206
14352A9475224M85630M50590K67406N73589N15812M82159K73934M05510P23376
14343B3653230N41373K00047O17897M79855Q14637O99987N98665R48921K27900
14334B8782512R34906Q36491O90780P34654Q35440N86994J340003P95524Q91878
14325C6429182J280570R89798J099845R80254R49962J107816J524152J516445
14317D5878024J412311J111011K204546J115063J777163J920262K034336J601387
14309E9054103K025756K354289J774489K724483K265162K414367K975302K924856
$$ y = [13738219, 14052672, 14242076, 14164506, 14646202, 14720582, 15107947, 15424941, 15784315, 16331355, 16576918, 17207373, 17444274, 17225184, 17656321, 18421089, 18212731, 18603037, 19158018, 19475224, 19960854, 20411444, 20678850, 21252439, 21768251, 22250410, 22524344, 22929854, 23653230, 24194603, 24394650, 25012547, 25492402, 26307039, 27007026, 27605691, 28554612, 28782512, 29717418, 30553909, 31244689, 31979343, 32814783, 33401777, 34741780, 35537304, 36429182, 37709752, 38699550, 39799395, 40779649, 41729611, 42837427, 44361579, 45878024, 47290335, 48401346, 50605892, 51720955, 53498118, 55418380, 57452716, 59054103, 61079859, 63434148, 65208637, 67933120, 70198282, 72612649, 75587951, 78512807]
14301G8512807L271254K912094L403425L375740L538264L965908M241891M232407
14293A07453790M377345N304240M675875N862963N587340N944241O757979O772520
14285A52736293P254410P444758Q554237Q379377R003683R908084J0087601J0490674
14277B23859117J1593113J1647258J2505774J3067425J3637946J4036336J3891178
14270C14238147J4584927J4206726J4272479J4047058J3656231J2536368J2140458
14263D09682394J1508790J0915163R673976Q898853O997450M262428J567217J075389
14255D64581660J775078L93344o337840m792825q273824r665733j1070148j1905767
14247D14703945j4122308j2823647j3854288j4710222j4671354j4462772j4067774
$$ y = [78512807, 81784061, 84696155, 88099580, 91475320, 95013584, 98979492, 103221383, 107453790, 111831135, 117135375, 121811250, 127674213, 133261553, 139205794, 145963773, 152736293, 159990703, 167435461, 175989698, 184369075, 193372758, 203280842, 213368443, 223859117, 235452230, 247099488, 259605262, 272672687, 286310633, 300346969, 314238147, 328823074, 343029800, 357302279, 371349337, 385005568, 397541936, 409682394, 421191184, 432106347, 441780323, 450679176, 457676626, 461939054, 463506271, 464581660, 466356738, 466750082, 460412242, 455619417, 447345593, 437679860, 426609712, 414703945, 400581637, 387757990, 373903702, 359193480, 344522126, 330059354, 315991580]
14240C15991580j4379898j3925495j3385466j3114727j3063303j2022651j2220190
14233B23879850j1705459j0963839j0188828r283170r040887p999436p935059
14226A56763172p663245o896948o554813n978013n729568n351099n075494m997597
14218A08516395m464828l948712l726753l927953l787537l558408l188520l437646
14210G8476038k666776k776341k780804k279857k473838k121144k077059k146467
14202E9153752j781891j893164j697627k137272r24074j639030j472508j536111
14194D6072075j404289q89441j018821r33419j815957q94771j225008j024146
14186C6866223r26900m43880j221730q49772r73999j033479n92132j003047k30768
$$ y = [315991580, 301611682, 287686187, 274300721, 261185994, 248122691, 236100040, 223879850, 212174391, 201210552, 191021724, 181738554, 172697667, 164698231, 156763172, 149099927, 142202979, 135648166, 129670153, 123940585, 118589486, 113513992, 108516395, 104051567, 100102855, 96376102, 92448149, 88660612, 85102204, 81913684, 78476038, 75809262, 73032921, 70252117, 67972260, 65498422, 63377278, 61300219, 59153752, 57371861, 55478697, 53781070, 51643798, 50719724, 49080694, 47608186, 46072075, 44667786, 43778345, 42759524, 41826105, 40010148, 39115377, 37890369, 36866223, 35939323, 35495443, 34273713, 33423941, 32449942, 31416463, 30824331, 29821284, 29590516]
14177B9590516j087931q60838q01116k58094n90254n92037n98390o15933p48474
14168B3437449l46752n08112o44024k21358r69384k09933m21698l94987p0627
14159A9650574l65158o68365j80520o32642j96170p8919p80133l49375n6955n58140
14149A5784197J30278l35695m16397j94856k89926k88651m23337o0778j14531
14140A3790304k58906J4862p70483l46694J01253l458l47518l61894j69689k03606
14130A1444171k54277l56165L14491n72299L59649l60714l73626j00370N8743
14121A0159603l44898Q7456l20975K01509m93886o9512j71954j31437Q6106r1694
14111H910318m32463J46236j78389J22912l21486l3089l34441j02275M9981J49776
$$ y = [29590516, 28502585, 27641747, 26840631, 26582537, 25992283, 25400246, 24801856, 24185923, 23437449, 23090697, 22582585, 21938561, 21717203, 20747819, 20537886, 20116188, 19721201, 19650574, 19285416, 18617051, 18436531, 17803889, 17607719, 17528800, 16748667, 16399292, 16342337, 15784197, 15914475, 15578780, 15162383, 14967527, 14677601, 14388950, 13965613, 13904835, 13790304, 13531398, 13546260, 12775777, 12429083, 12530336, 12526878, 12179360, 11817466, 11647777, 11444171, 11189894, 10833729, 11148220, 10575921, 10935570, 10574856, 10201230, 10100860, 10159603, 9814705, 9902161, 9581186, 9782695, 9288809, 9219297, 9047343, 8915906, 9002012, 8910318, 8477855, 8624091, 8445702, 8568614, 8247128, 8214039, 7879598, 7777323, 7827304, 7977080]
14101G977080k77938l3015k79538M06806n10272l00844J31771J47146l42984j22053
14091F796159j63148O8004k02350N9634k54348N4036K42116m61301Q1950l14430
14081E906322p3944K34667k73560k06744n3562M7567k57941L61973l68055m1226
14071E275497l4509p1178o445O1686m0139k07657j30641k28361L49553q6735j47913
14060D733158k40745L66383l63496J84395J874k16741j43266p2631k0238L84546
14050D613239k15463k43395J11952J19338m40531K78428K05166K1434m39619M5705
14040D056254M6354l3983l93201J75398j38351J02678k00480k945j19654Q4172
14030C576242k19019L12362J30994n03313j14290n0904K58810o3090K5821k90130
$$ y = [7977080, 7699142, 7666127, 7386589, 7793395, 7283123, 6982279, 7114050, 7261196, 6918212, 6796159, 6633011, 6701015, 6498665, 6558299, 6303951, 6357987, 6600103, 6138802, 6220752, 5906322, 5832378, 6067045, 5793485, 5586741, 5533179, 5580746, 5322805, 5684778, 5316723, 5275497, 5240988, 5169810, 5163365, 5225051, 5184912, 4977255, 4846614, 4618253, 4967806, 4881071, 4733158, 4492413, 4858796, 4495300, 4679695, 4681569, 4464828, 4321562, 4248931, 4228693, 4613239, 4397776, 4154381, 4266333, 4385671, 3945140, 4223568, 4428734, 4450168, 4010549, 4056254, 4102608, 4068625, 3675424, 3850822, 3712471, 3815149, 3614669, 3611724, 3492070, 3576242, 3357223, 3669585, 3800579, 3297266, 3182976, 3132072, 3390882, 3327792, 3353613, 3063483]
14020C063483L26275j68302n1570r2339p546j74862L14218N6588o9125k05620
14010B991200J1499Q4563k65978J31458k88793K98875k57777K91324k24442l54579
14000B417350l5947L31026k03180L03699m53245J08569j30673L94231r0952p5342
13990B565536L7281j2254k85474J42069l0676Q4106N6521j09000J84031j59457
13980B472683Q8180J32224J19399M11413O14097R87879J497014K958103N436824
13971A4717816Q863646J0374384r435957q866545n251529k692815j799277r51030
13963D958693m15276m59722m47462j92338l02458m1155J7956k74169J39196k85886
13953B697379k09928J87197R6497N8943l35085k53331l07921J76401J66928j26365
$$ y = [3063483, 3389758, 3221456, 3169886, 3077547, 3070001, 2895139, 3209357, 3265945, 3196820, 2991200, 3002699, 3087262, 2821284, 2952742, 2663949, 2962824, 2705047, 2996371, 2771929, 2417350, 2381403, 2712429, 2509249, 2812948, 2359703, 2468272, 2337599, 2731830, 2640878, 2565536, 2602817, 2590563, 2305089, 2447158, 2416482, 2500588, 2557109, 2448109, 2632140, 2472683, 2560863, 2693087, 2812486, 3223899, 3837996, 4825875, 6322889, 9280992, 14717816, 23581462, 33955846, 24519889, 15653344, 10401815, 7709000, 5909723, 4958693, 4543417, 4083695, 3636233, 3443895, 3141437, 3100282, 3118238, 2844069, 2983265, 2697379, 2487451, 2674648, 2771145, 2830088, 2495003, 2241672, 1933751, 2110152, 2277080, 2150715]
13943B150715J78069j29008k38195J45797j99877q9760O7839K57571L0272k57153
13933A916270j18330j48727R7243J02280k02507J05823l32844M82185q2971k2530
13923A795892L7631j55857q1325K11716j53680J81062j39836j08777N44908l15437
13913A816297o79J17131o24103N31290m35627P6549K88813j20758M8172j69358
13903A527727N024j68069J06930L7103L9304J38202k50809J59484k35125J01918
13893A461689P8670J90500j77645j00960O2594m0398l0879q8347M9842P6729m43219
13882A038576L18937L2258K3271p9857J13590J24630n77602L69890K14451j82824
13872A395320o5389l53200K32894L9559j00562J15935J6038j62039J07573q924
$$ y = [2150715, 2328784, 2199776, 1961581, 2107378, 1907501, 1817741, 1885580, 2143151, 2173423, 1916270, 1797940, 1649213, 1746456, 1848736, 1646229, 1752052, 1419208, 1901393, 1818422, 1795892, 1833523, 1677666, 1596341, 1808057, 1654377, 1835439, 1695603, 1586826, 2131734, 1816297, 1815618, 1932749, 1308646, 1839936, 1404309, 1480858, 1769671, 1648913, 1697085, 1527727, 1532751, 1364682, 1471612, 1508715, 1548019, 1686221, 1435412, 1594896, 1359771, 1461689, 1540359, 1730859, 1553214, 1452254, 1514848, 1474450, 1443571, 1355224, 1405066, 1481795, 1038576, 1357513, 1389771, 1413042, 1333185, 1446775, 1571405, 993803, 1363693, 1578144, 1395320, 1329931, 976731, 1209625, 1249184, 1148622, 1264557, 1280595, 1118556, 1226129, 1217205]
13862A217205J68826l50223K58145o1494L99958F77461M05361q9682K031m5451
13852I49720K96691k17327L52790m54799J91042Q5564j66860J88828k41604L55286
13842A339331k11264M7162l26354J08811J54056j52120l42552N04444K1629n60147
13832E82996K40186Q1004J01750k16360K98395j52580k7628N4047Q5696j96898
13822H50608K16287Q4212k10352j32243j8877L25816k56764j27036L07400J219
13812A040270o4981p6117M7623k31360J7172J45496j17192K91294o5560K79159
13802A265804j36324l18732M8407K74240k13978l6751r5942P879J32520L0575
13792I57698l00829J49536J14998k03811J29971J64428l02090M75955k59627k29905
$$ y = [1217205, 1386031, 1035808, 1293953, 1232459, 1632417, 677461, 1082822, 993140, 995171, 949720, 1246411, 1029084, 1381874, 927075, 1118117, 1203681, 1036821, 1225649, 984045, 1339331, 1128067, 1175229, 848875, 957686, 1111742, 959622, 617070, 1121514, 1143143, 582996, 823182, 904186, 1005936, 789576, 1087971, 935391, 907763, 961810, 1047506, 850608, 1066895, 1151107, 940755, 808512, 789635, 1115451, 858687, 731651, 1039051, 1040270, 975289, 899172, 946795, 715435, 732607, 878103, 760911, 1052205, 986645, 1265804, 1129480, 810748, 859155, 1133395, 919417, 882666, 786724, 794603, 927123, 957698, 656869, 806405, 921403, 717592, 847563, 1011991, 709901, 1185856, 926229, 696324]
13782F96324J88545j74200J48287M34761l86700j37159j0255j60038K97147J07433
13772A004145l25243K14184k87929P1889J60519K05019j57716j38798J90751J22507
13762A059328l78153J87839K19391D99435J03928m6613m9439l3315J82879j38613
13752E18262M59060l18870K66047l11909M5779o6408B39069L94832l11441N06171
13742H28631j93242Q9643j64800L30581j51123k62046L22984j12309p9253L9520
13732F48586K2313j0753J89979p3275k77372J99990k10237J90806q3675J14986
13722G11348n8574j609J32671C56968N9872j33332N96393k35820k17606L34119
13712G60594K5736k91747J74492L6722j19517k5580J05149j46449j43797K02203
$$ y = [696324, 884869, 710669, 858956, 1293717, 907017, 769858, 759603, 599565, 896712, 1004145, 678902, 893086, 605157, 677046, 837565, 1042584, 884868, 746070, 936821, 1059328, 681175, 869014, 1088405, 499435, 603363, 556750, 507311, 473996, 656875, 518262, 977322, 658452, 924499, 612590, 658369, 591961, 239069, 633901, 322460, 828631, 635389, 725032, 560232, 890813, 739690, 477644, 800628, 688319, 609066, 648586, 670899, 660146, 850125, 776850, 499478, 699468, 489231, 680037, 596362, 711348, 652774, 651165, 783836, 356968, 416840, 283508, 879901, 644081, 426475, 760594, 786330, 494583, 669075, 705797, 586280, 560700, 665849, 519400, 375603, 577806]
13702E77806m3710J12676K72652k48211J60321n0848k39601j50910L87688n0685
13692G27178k75422K85553j49368P1277M229L86549m92423J72149C05237M88815
13682G94052k53127L7328j55345J67725r9593n8864J25477K39798j29145B93051
13671D10669K44411K6398n1332k95484j08747K40045k03918M81136j43914k08882
13661C90382Q1490R2683R6566l8143N3208o1571j70120P6969j82728J50723A42231
13649A70025O0024K83993o1519k05986L19029q7790R9167O9288j13117K0690B14479
13637D89872J08068m2038r603p6065k8829n6016J60956k32324J34367j88670J38546
13626C98264Q8726n0967A23256K57510M80071B52373M77229B34278K15025M7161
$$ y = [577806, 534096, 646772, 919424, 671213, 831534, 780686, 541085, 390175, 777863, 727178, 451756, 737309, 587941, 659218, 663447, 1049996, 557573, 729722, 305237, 794052, 540925, 578253, 422908, 590633, 491040, 432176, 557653, 797451, 668306, 293051, 410669, 655080, 681478, 630146, 334662, 225915, 465960, 262042, 743178, 599264, 390382, 471872, 564555, 661121, 622978, 676186, 614615, 444495, 521464, 338736, 489459, 142231, 170025, 230049, 514042, 452523, 246537, 565566, 477776, 576943, 646231, 533114, 553804, 214479, 489872, 597940, 555902, 546299, 470234, 441405, 385389, 546345, 314021, 448388, 259718, 398264, 486990, 436023, 123256, 380766, 860837, 252373, 729602, 234278, 449303, 496464]
13616D96464L1676A20685K42673Q3725j67926N24415H0074L53902J30486j77817
13606C86645j50147J28123I1344M35575j50778J29299n2673J16709N2876k74952
13596C47400J55915J99185r0231A04818L9306J15717L68062B33055G1302N03090
13586E74392j27800j7200q3503A57953Q2283J04155Q359J12951K24332l34981
13576C55052A01493M19029k1279k37091Q8290J24356q5837m8178A46585L18514
13566D65099A22625L75389j04586j66545K46849A13171M52365A84806K17215K39261
13556F41282l20501J03138B02179L05110j75225R6848A70086K83799k20520L07899
13546E41264g525D49066j83252b8724C77238n5673C0886L67661A96691M13709
$$ y = [496464, 528140, 120685, 363358, 447083, 279157, 803572, 80074, 433976, 564462, 386645, 236498, 364621, 91344, 526919, 376141, 505440, 452767, 569476, 622352, 347400, 503315, 702500, 612269, 104818, 144124, 259841, 627903, 233055, 71302, 574392, 446592, 429392, 345889, 157953, 240236, 344391, 352750, 465701, 690033, 355052, 101493, 520522, 499243, 262152, 350442, 474798, 388961, 340783, 146585, 465099, 122625, 498014, 393428, 226883, 473732, 113171, 565536, 184806, 402021, 641282, 320781, 423919, 202179, 507289, 332064, 428912, 170086, 453885, 233365, 541264, -7525, 449066, 265814, -28724, 377238, 321565, 30886, 398547, 196691, 610400]
13536F10400B87316M0943J226K48899j36625n2798q7384J3663j19701K55046A78609
13524a00196B87330R4308m4106A24672M40371A92488J20664n9450A1247M37103
13514D48350p7657A30607K39772r3855K08304k8730B00403r7246L57632j49862
13504C10927p6533j09884J59658A02511K37866j20603N4961d8640B303J02621
13494A04924J68285r5299a52707D20828A72278K31766j81054J13471G2264J30778
13484B03042K98161R2181k69421M9387j65996J08533j31014K90400A54137a9250
13473f7003B37030J54048E3484J89673h2501A87133J49895P0689I4899K80632
13463C75531j9848q9089O3965G9954L34574j33955l9592J05597j11126Q4411M3257
$$ y = [610400, 287316, 328259, 329485, 578384, 441759, 388961, 301577, 315240, 195539, 450585, 178609, -100196, 287330, 381638, 337532, 124672, 565043, 192488, 313152, 253702, 11247, 448350, 370693, 130607, 370379, 276524, 484828, 456098, 200403, 103157, 460789, 310927, 234394, 124510, 284168, 102511, 340377, 219774, 274735, -48640, 2303, 104924, 273209, 177910, -152707, 420828, 172278, 404044, 222990, 336461, 72264, 203042, 501203, 593384, 323963, 373350, 207354, 315887, 184873, 475273, 154137, -19250, -67003, 237030, 391078, 53484, 243157, -82501, 187133, 337028, 407717, 94899, 375531, 355683, 266594, 330559, 79954, 414528, 280573, 240981, 346578, 235452, 319863, 363120]
13452C63120j31288n1902l9565e8806B33828p3309K26702A87829k9651J75274
13442C33452M3561G8965J71075j08921J41851P4586A64162J97484j6835j22095
13432B22716A0089k789J75551P3258J3721j21137D6125p225Q9079J5881L6760
13421A80620J86975A73441D023M71441A14269Q5505i1322A31271R460a5324q8576
13410a03900H7516K58961j35550J91618j11708q7207b5866B24596m4549K45425
13400D25472j92797K09976A32719J04459b03586D56530A91617D4702J09954o5329
13390H9327K6456f0502D64765j48132G1477J89276K97226H4138J43796n2412F7133
13378A30510J93471K97031D9629a84561A90138J55061j12613O2323F6707L66744
$$ y = [363120, 231832, 179930, 140365, -58806, 233828, 160519, 387221, 187829, 158178, 333452, 377013, 78965, 250040, 141119, 282970, 357556, 164162, 361646, 344811, 222716, 10089, 7300, 182851, 256109, 269830, 148693, 46125, 38900, 127979, 143860, 180620, 367595, 173441, 4023, 475464, 114269, 199774, -91322, 131271, 140731, -15324, -103900, 87516, 346477, 210927, 402545, 290837, 203630, -25866, 224596, 180047, 425472, 232675, 442651, 132719, 237178, -203586, 456530, 191617, 44702, 154656, 89327, 115783, -60502, 464765, 316633, 71477, 260753, 557979, 84138, 227934, 175522, 67133, 130510, 323981, 621012, 49629, -184561, 190138, 345199, 232586, 294909, 66707, 433451]
13368D33451D8154J36505l9991M28887b89295A37284K07691j1030q2929j1281
13358B39735L32777q6617j69895A33950K00172A59215P2876E4321K67732A40548
13347A79711M7462n7921L00997J87141G5568K79287A999M09667j41156f1276A401
13335e8752A74911J64739j61124K63284d27H1441J56219G7617L26882j60344j18345
13324A25810M91075B96108J78810A53310F9351K97567r1137O9584m0625i6856
13313B38102A10305L3279F1357K45915J67382m1549A91788D4160K08747f1537
13302B42905A20107K05981p6382a29846A99251c0975A45315L56722m8165a4426
13291B32372c0165C86283j76382a06577A11719O0373B7984J73520r2044L96880
$$ y = [433451, 48154, 184659, 144668, 573555, -289295, 137284, 344975, 333945, 251016, 239735, 572512, 485895, 316000, 133950, 334122, 159215, 232091, 54321, 322053, 140548, 179711, 227173, 169252, 470249, 657390, 75568, 354855, 1999, 411666, 270510, -61276, 1401, -58752, 174911, 339650, 178526, 441810, -427, 81441, 237660, 77617, 404499, 244155, 125810, 616885, 296108, 474918, 153310, 69351, 366918, 275781, 345365, 304740, -96856, 238102, 110305, 143584, 61357, 307272, 474654, 433105, 191788, 44160, 252907, -61537, 242905, 120107, 326088, 249706, -129846, 199251, -30975, 145315, 502037, 453872, -14426, 232372, -30165, 386283, 209901, -106577, 111719, 172092, 27984, 201504, 109460, 506340]
13281E06340n7916N400a37972D63132j91505C9334d2203G312J89356I3308A880
13269a13213B10552e6097O065B72521o8263l3741M709Q6792J4570j15071J41364
13258C02881a19346L9928k3241B14071j2186D5772L13403D4106a99574C68025
13247A2191L00464G1234b1106O327A49049o1544j8134A1530J47343c101q3306
13236h6407l7630B26276e5173D12065h1854A2335L03924j53692n1728m0046A5464
13224a05280C68940C8557b22757A08809n0779d4137A11567b44397A97323m9526
13214A47797o3667i163B95143g1358C54607j34227i8466b3179F3079b33839B88672
13202h824p1237C74791B0723P6988Q5621F9987K69306a88047e9533B98642J96835
$$ y = [506340, 448424, 453824, -137972, 463132, 271627, 39334, -42203, 7312, 196668, 93308, 1880, -113213, 210552, -56097, -50032, 272521, 204258, 170517, 175226, 262018, 276588, 161517, 302881, -119346, -79418, -102659, 214071, 201885, 45772, 359175, 44106, -199574, 368025, 12191, 312655, 71234, -21106, -14779, 149049, 87505, 69371, 11530, 158873, -3101, -86407, -124037, 226276, -55173, 412065, -81854, 12335, 316259, 162567, 110839, 70793, 15464, -105280, 368940, 38557, -222757, 108809, 58030, -44137, 111567, -244397, 197323, 147797, 84130, -9163, 295143, -71358, 354607, 220380, -98466, -23179, 63079, -233839, 288672, -8824, -80061, 374791, 20723, 97711, 183332, 69987, 339293, -188047, -59533, 298642, 495477]
13191D95477B04577Q564j241i2595A20876Q5492K00064A97453A1276J68737O2112
13180B42125l6208B6926M34602A6849P1741e6155C43144A41152P9162b41873A49758
13168F0727N7979b17547a6916B10123i0520A24047M2279J15954A08172K1183l7319
13157I2036d3272o2556E4647c82563B55006P6583B7403d1669B68003a23063I5053
13145b8620p0541D05688a27308A35827K36312A55166i8930F5955L06913j24413
13135B48455j20958M6888d48858a18936c5928F1398d68955e6845B66537B8638
13124C90383C6511L86935A42091D9675Q8244M22251B01322c12765J03518B29194
13113A5277R5575a16973F9427I477L32836C4271d19966F7358J47361C9296J04617
$$ y = [495477, 204577, 213141, 211900, -92595, 120876, 206368, 406432, 197453, 11276, 180013, 242125, 205917, 26926, 461528, 16849, 88590, -56155, 343144, 141152, 220314, -241873, 149758, 60727, 118706, -217547, -16916, 210123, -90520, 124047, 166326, 282280, 108172, 129355, 92036, -43272, -105828, 54647, -382563, 255006, 331589, 27403, -41669, 268003, -123063, 95053, -28620, -99161, 405688, -127308, 135827, 372139, 155166, -98930, 65955, 372868, 248455, 127497, 174385, -448858, -118936, -35928, 61398, -468955, -56845, 266537, 28638, 390383, 36511, 423446, 142091, 49675, 137919, 560170, 201322, -312765, -209247, 229194, 15277, 110852, -116973, 69427, 9477, 342313, 34271, -419966, 67358, 214719, 39296, 143913]
13102A43913B1319a38717j58067A28435B0807h9779A77301B0821I366g4035B38719
13090a8378I4189f1381b0196Q653A99213j4405M0502a49382K389A08956J08951
13079B17907A05472d9514k3027C38660a2808E7505b3722I3447m2046L53473c7346
13067B26920a96904B22166f6711A57384F3045L51900a94876H0051A6262L313J86861
13056B06436P2068p1277q7543N22166D8545A8566b9847H8089J27796E6605d8408
13044D5045J93458e5172C29875a37273A34818J94939J44844k19284p2200d0211
13033b03980B59068k478r8474h765A30588j6662B2438h4650n9309f06j27604D9659
13020H9655J02906d9676b1941j7827D07339c8933B34027a87512C15489j21131
$$ y = [143913, 21319, -138717, -296784, 128435, 20807, -89779, 177301, 20821, 9366, -74035, 238719, -18378, 94189, -61381, -20196, -11543, 199213, 184808, 225310, -149382, -146993, 108956, 217907, 105472, -49514, -72541, 338660, -12808, 57505, -23722, 93447, 51401, 404874, -37346, 226920, -196904, 222166, -66711, 157384, 63045, 414945, -194876, 80051, 16262, 19575, 206436, 278504, 207227, 119684, 641850, 48545, 18566, -29847, 88089, 215885, 56605, -48408, 45045, 238503, -55172, 329875, -137273, 134818, 329757, 474601, 255317, 183117, -40211, -203980, 259068, 256590, 158116, -8765, 130588, 113926, 22438, -84650, -143959, -606, -128210, 49659, 89655, 192561, -49676, -21941, -39768, 407339, -38933, 234027, -187512, 315489, 194358]
13010A94358J45665c49503b7601k12061C0027R048K0545K67339d5044A63730c2186
12998B94353b5488o1396a178n6454b2277M268j57511A22507i2987A22328J01286
12987B23614I4277J55350n5605I492a89061B21351E3512a47009B6984b12527J9411
12976a93116B24091J16395i2603G8396O4550K5135l549K9075B0365O6409M2573
12965A29347Q1314C0311f3162B52425b85927A23264a39419A17303J50479F8789
12954A95371C0424J57226e7532m766o6225A41433b4212j12390B75738C4187P3107
12943A07294j4775B6601a58661A67319D1135M8104J36405R7217j01199A963d8578
12931g5700B61916q7996o5944K8693K76084h3096E9620J17174b2291B41032e2505
$$ y = [194358, 340023, -349503, -27601, -239662, 30027, 39075, 59620, 326959, -45044, 163730, -32186, 294353, -25488, -86884, -1178, -57632, -22277, -18009, -175520, 122507, -92987, 122328, 223614, 94277, 249627, 194022, 9492, -189061, 221351, 53512, -147009, 26984, -212527, -193116, 224091, 340486, -92603, 78396, 142946, 168081, 164532, 193607, 20365, 86774, 129347, 210661, 30311, -63162, 252425, -285927, 123264, -139419, 117303, 267782, 68789, 195371, 30424, 187650, -57532, -62298, -128523, 141433, -24212, -136602, 275738, 34187, 107294, 92519, 26601, -158661, 167319, 41135, 89239, 225644, 322861, 221662, 1963, -48578, -75700, 261916, 173920, 107976, 136669, 412753, -83096, 59620, 176794, -22291, 241032, -52505]
12919A4682R8592J16371h1159m9965A4354a14624B60413h6097B04550p4878f9256
12907c0451H7114K27255c13822B54128n9206c04886e4306m0948H0285J30330a17954
12895d3658J6045A64206a55695k22619a2777C3742L5520N6252R764b48209k80379
12884e28588B00129l1699a70352O3003C27506A55493p0838J7949B4918N8155L12260
12873C95333j68042D5382J92266G5052a92658M6182j62873J54208f7431J1130
12863e6301C43680A58078k4061J60631g5540j19345A79384k2468a11824B47257
12852A03840L6765i1459k3720C26053A37315n7081a66987N5888A79541h7273l19884
12841d07157B82933a68337p8028g7572L3784A44219i0441A4818O846J49348J3876
$$ y = [14682, 113274, 229645, -81159, -131124, 14354, -114624, 260413, -86097, 204550, 129672, -69256, -30451, 87114, 314369, -313822, 254128, 194922, -304886, -54306, -95254, 80285, 210615, -117954, -43658, -27613, 164206, -155695, -378314, -12777, 33742, 69262, 125514, 135278, -248209, -528588, 200129, 168430, -170352, -107349, 327506, 155493, 84655, 102604, 24918, 83073, 395333, 227291, 45382, 237648, 75052, -192658, -146476, -309349, -155141, -67431, -56301, 343680, 158078, 134017, 294648, -75540, -194885, 179384, 156916, -111824, 247257, 103840, 140605, -91459, -115179, 326053, 137315, 80234, -166987, -111099, 179541, -87273, -407157, 282933, -168337, -246365, -77572, -43788, 144219, -90441, 14818, 21664, 171012, 184888]
12830A84888k4294c384D49401A50109m8338a583j75962A49850f374m3232j55266
12819b04872d839C0127J5643M5647K6462c3534p0709M0818A65696b2653A69350
12807A13373B3583a45929j70402A05902k6541J16346a61385j49715a33175L0399
12797a02776E6397J84470A2284b2260A26374a07596k18496J17705a0071k14446
12787b24517R2389A63009o8357D1344A5500a86820g4712A96522a13388j2544d9484
12775g7518B0614c75416D8787a8135m54609a90403A71417C9062J9876a98289h3121
12763a96148B44741a54077e4126F4337J53076J12848B4489a58749C7969b86025
12752a32203E3257c16654a09454j10970A55526b19069A59242G0736a39658B17571
$$ y = [184888, 160594, -3384, 449401, 150109, 101771, -1583, -177545, 149850, -6374, -49606, -204872, -4839, 30127, 45770, 91417, 117879, -33534, -104243, -63425, 165696, -22653, 169350, 113373, 23583, -145929, -316331, 105902, 79361, 195707, -161385, -311100, -133175, -102776, 56397, 240867, 12284, -22260, 126374, -107596, -326092, -208387, -10071, -224517, -132128, 163009, 94652, 41344, 15500, -186820, -74712, 196522, -113388, -125932, -49484, -77518, 20614, -375416, 48787, -18135, -472744, -190403, 171417, 39062, 58938, -198289, -83121, -196148, 244741, -154077, -54126, 64337, 217413, 330261, 24489, -158749, 37969, -286025, -132203, 53257, -316654, -109454, -220424, 155526, -219069, 159242, 70736, -139658, 217571]
12741H4499Q7418J55264o7646E437J32335K3845f9929o5625G2597J44242A8188
12729A47502b21540A45738b5350D8865r785R1697B7520B359O4056N5941K43270
12718C65626M9178a23067A82854H3489K14106A9025K35303j03060N7095a33019
12707D9119e8668K9009B1420K9635I78O0668K8799m1230a63453c9488C7726a35459
12694H9025J5802L19789g5263B11262L37798C272a25383n3954Q3307l9861M3912
12683i1979j19796e8332B67182b37780N6559A53188J00164g8109q6724A14991
12672b26158g8753j95421i1725B3622b87682d5518J4603A79767M7661N9609C2093
12660C1758J84181l9732E1617b97266F7496b97436A11666A6277K2412f5856k11117
$$ y = [84499, 171917, 327181, 259535, 5437, 137772, 161617, -69929, -135554, 72597, 216839, 18188, 147502, -221540, 145738, -25350, 48865, 39080, 130777, 27520, 2359, 66415, 122356, 365626, 414804, -123067, 182854, 83489, 297595, 19025, 254328, 151268, 208363, -133019, 49119, -58668, -29659, 21420, 51055, 978, 61646, 90445, 49215, -163453, -39488, 37726, -135459, 89025, 104827, 424616, -75263, 211262, 549060, 3272, -125383, -179337, -96030, -135891, -91979, -211775, -58332, 267182, -237780, -181221, 153188, 253352, -78109, -164833, 114991, -226158, -78753, -274174, -91725, 23622, -287682, -45518, -30915, 179767, 227428, 287037, 32093, 31758, 215939, 176207, 51617, -297266, 67496, -297436, 111666, 16277, 38689, -65856, -276973]
12649b76973J12917B27681J52809a62614G098a3214C20397c9489B92527c5636
12638A73406m0351E6225J0650f4169b4612B12699p3919a13761o2899A8089L7140
12627E5229g2926r9570f4543E4646b22610A38913e4373q1191B5731r789N1265
12616F7207K30075o2024j10039C2236f2641F7770M72907A45533b5328J1731p2465
12605h6062C65929l2393H8619A5241a8822r148A36307l2019c38836a43665k07082
12594c50747B39990C6787K02806d0909B6650O0784A705f0032A12662c5647A39304
12582A07076a08099H1384L9245b11431B33414E3676b02449e5549D1947O704a12919
12570B80960e2914b3162l23282A59082e4815G4432J09748a98607D2779L57873
$$ y = [-276973, -164056, 227681, 380490, -162614, 7098, -13214, 320397, -39489, 292527, -35636, 173406, 133055, 56225, 66875, -64169, -24612, 212699, 138780, -113761, -176660, 18089, 55229, -72926, -172496, -64543, 54646, -222610, 138913, -54373, -135564, 25731, 15942, 67207, 297282, 235258, 125219, 32236, -62641, 67770, 540677, 145533, -25328, -13597, -86062, 365929, 333536, 88619, 15241, -18822, -27970, 136307, 104288, -338836, -143665, -350747, 239990, 36787, 239593, -40909, 26650, 87434, 1705, -60032, 112662, -35647, 139304, 107076, -108099, 81384, 120629, -211431, 233414, 53676, -202449, -55549, 41947, 48651, -112919, 280960, -52914, -23162, -346444, 159082, -54815, 74432, 184180, -198607, 42779, 400652]
12560D00652r05a74398C2989Q5599j4601b12347G1831b20716L1206P0031A96546
12548G0457j6199L2620d8307o1724j04119i6824B76958a38240B18331a45721b5816
12536e09393a90782a4747j91123a7670p1898d4432j12677c0639J64H5958h7002
12524e7122b5886k9220B5714a36986j52708d3942p9535A51423M88385h6967A00726
12512B93890g2335C48884G2977l1708J0025b65338K5224A79957a10479n6857h3293
12500a65256I3426c33613D4741J70122b49838A82242D7853b3581k49598E1203
12489B61088a5756o5237H0238c31175J13646A79591a53843A56882E8932K35102
12479B94034G8897a3715B84327M461i1332L185l927B0201Q4592C5061O399e3645
$$ y = [400652, 399747, -174398, 32989, 118588, 103987, -212347, 71831, -220716, -189510, -119479, 196546, 70457, 54258, 86878, -48307, -110031, -214150, -96824, 276958, -138240, 218331, -145721, -25816, -509393, -190782, -14747, -205870, -17670, -89568, -44432, -157109, -30639, -30475, 85958, -87002, -57122, -25886, -55106, 25714, -136986, -289694, -43942, -123477, 151423, 639808, -86967, 100726, 293890, -72335, 348884, 72977, 41269, 51294, -265338, -240114, 179957, -110479, -167336, -83293, -165256, 93426, -333613, 44741, 214863, -249838, 182242, 47853, -23581, -273179, 51203, 261088, -15756, -80993, 80238, -331175, -217529, 179591, -153843, 156882, 58932, 294034, 78897, -13715, 284327, 288788, -91332, -88147, -92074, 20201, 104793, 35061, 41460, -53645]
12466a7774j52801C9680c07903I333J20176K37818C7819L87230a18643C68528
12455g3018C3306P3805e44374b6282m667E4200a04234A93070a83600M8182j89222
12444c24640A88684J27708A2502J53076f6372m15054K38844j07259a60294j72528
12434c32822J01777a9984A28235c4099C18225c6685j29725F8673c03834f0378
12423h8261A26020a09887D0464J01348b19265B20646b33582a4653F2125P6947
12413A39072C2787f1057a2009j80658B69181J54164b29344E8119L9264b0864k74694
12402b95558D35403b72782O5960A96548a70905d4065A47495g6623k99871H1836
12391D9713K598a20224A65598C4509L25941j57501L3790d19757D16639E8492a21936
$$ y = [-17774, -170575, 39680, -307903, 9333, 129509, 367327, 37819, 425049, -118643, 368528, -73018, 33306, 107111, -544374, -26282, -30949, 54200, -104234, 193070, -183600, -135418, -324640, 188684, 316392, 12502, 165578, -66372, -481426, -242582, -349841, -160294, -332822, -231045, -19984, 128235, -34099, 318225, -36685, -166410, 68673, -303834, -60378, -88261, 126020, -109887, 40464, 141812, -219265, 220646, -233582, -14653, 62125, 139072, 32787, -61057, -12009, -192667, 269181, 423345, -229344, 58119, 97383, -20864, -295558, 435403, -272782, -206822, 196548, -170905, -44065, 147495, -76623, -376494, 81836, 49713, 52311, -120224, 165598, 34509, 360450, 202949, 236739, -419757, 416639, 58492, -121936]
12379G6923b03692B14229b36253P6024f8426j52029L8679N6965A08871A1487P6524
12368H8011J19839f0048E0374K34562g2303J1875A98834b48256H1405h6789B59601
12356C00976G9401b81556e2303b0056C16686a22461D3424a76827A67869a96349
12345d35051A9887K15980j01782N5927K5461q1465a73516K1690a1536B91202r3218
12334A97984G4155M0901Q6484m0940a96293Q0894c2675j10813A57161b28698D6689
12322B471N4511D828J66436Q760b0691n4759p4169r4810C07006m9785l5294l899
12310B18028r6058C4196J60595H6822C9711j248K26759J9065A5453N9655b04460
12298C44120J57077E3736j7264b37727A51388e1992C83644a42653C93162q0131
$$ y = [76923, -203692, 214229, -236253, -160229, -68426, -220455, -181776, -124811, 108871, 11487, 88011, 207850, -60048, 50374, 284936, -72303, -60428, 198834, -248256, 81405, -86789, 259601, 300976, 79401, -281556, -52303, -20056, 316686, -122461, 43424, -176827, 167869, -196349, -435051, 19887, 235867, 134085, 190012, 215473, 134008, -173516, -151826, -11536, 291202, 197984, 74155, 115056, 201540, 160600, -196293, -115399, -32675, -143488, 157161, -228698, 46689, 2471, 56982, 4828, 171264, 180024, -20691, -75450, -149619, -244429, 307006, 257221, 221927, 218028, 121970, 34196, 194791, 86822, 39711, 38463, 265222, 284287, 15453, 75108, -204460, 344120, 501197, 53736, 36472, -237727, 151388, -51992, 383644, -142653, 393162, 313031]
12288C13031f2102H1995a50595o5381A5630c4325C73300j2118A69795o1863K71117
12277C79049e2406D7819K446N0820D8308a18010B62027H5326K28761h4672D7747
12265B87913g3024n223n5267A19102K23945j36238J02455a66807A80900a24586
12254e6441E20642j47872j26787M3564A37951F6943K2190L6918a28557A9558e0550
12242g4552C74991j73803o6781n201k5817b61405F0410P7784e8746H0149h7850
12230a64302G9327l060d3037p0027G2657l3996N5804a41613A13707l0458a38274
12218e0717k2A96233N3214I7909O7591q1254a72355f5148l8589C44691j52882
12207A91809H8308N4852o2883K63650P9605o7816H1613h9441A50140B5236L30309
$$ y = [313031, -62102, 81995, -150595, -215976, 15630, -34325, 373300, 361182, 169795, 107932, 379049, -52406, 47819, 50265, 101085, 48308, -118010, 262027, 85326, 314087, -84672, 47747, 287913, -73024, -78247, -133514, 119102, 343047, 206809, 309264, -166807, 180900, -124586, -56441, 520642, 372770, 245983, 289547, 137951, 66943, 89133, 126051, -128557, 19558, -50550, -74552, 374991, 201188, 134407, 129206, 103389, -261405, 60410, 138194, -58746, 80149, -87850, -164302, 79327, 76267, -43037, -113064, 72657, 38661, 94465, -141613, 113707, 83249, -138274, -50717, -50739, 196233, 249447, 97909, 165500, 84246, -172355, -65148, -103737, 344691, 191809, 88308, 143160, 80277, 343927, 423532, 355716, 81613, -89441, 150140, 25236, 355545]
12196C55545A62641N5325k7092l3922a36605G4565a48381A30976k4626M95964
12186F02314j20860A06409M9564a667G4774K9694l3782L71269c9568l2672F5031
12174f5589G3205J39872C2638a31057D29823H2853h4309c9A99912n7970c6591
12162C9961J0087K18162o1454K41107A52418L15907A42853N5811J33893A44599
12151a2715A55775N3320p9574J04446G2201K06238m6046J49745b3817q63C88762
12139A16983a5037A11648J44122I8419M8532K58869d0300q828K349l4421A74880
12127B7960c7299I6117N3539J3739n5416C6439J46364k7569J82200b00801r598
12116b10399A88915J0363C9075a31431A45115e8419j36363G1394c2605E9756L82853
$$ y = [355545, 162641, 217966, 190874, 156952, -136605, 74565, -148381, 130976, 106350, 602314, 481454, 106409, 155973, -1667, 74774, 104468, 70686, 441955, -39568, -72240, 65031, -65589, 73205, 213077, 32638, -131057, 429823, 82853, -84309, -39, 199912, 141942, -36591, 39961, 50048, 268210, 206756, 447863, 152418, 468325, 142853, 198664, 332557, 144599, -12715, 155775, 209095, 129521, 233967, 72201, 278439, 232393, 382138, -23817, -24680, 388762, 116983, -15037, 111648, 255770, 98419, 146951, 405820, -40300, -49128, -46779, -81200, 174880, 27960, -37299, 96117, 149656, 163395, 107979, 36439, 182803, 155234, 337434, -200801, -210399, 188915, 199278, 39075, -131431, 145115, -58419, -194782, 71394, -32605, 59756, 442609]
12105D42609A09625m8350a2032p025j83379D48152g8153A60430h3885C27130a8219
12093H8312J06976d27517e112F2415d5328A11296k7634L05142b76954B90042j6216
12082B73826a92849B2128b00344B60258e0606D943i8880E7021B522a8414n1681
12071g0095B70394N357a44848F7727a24330L9031A31107F0710L4973b34816G7387
12059C16975A6527J84587M116r9090i5628B27484Q6396a20820c7123C30996D9173
12047b1439C50553A20407R7006P4979b69124C48415j71984K80148A6246a25406
12036d1079m9434B221d3512D9326L4284a44016L3217C47282H6986j8732b06008
12024f1336B34674i7542L0529k36282A57464g4533r6116A69236p9654a39242A34975
$$ y = [442609, 109625, 61275, -12032, -19057, -202436, 448152, -78153, 160430, -83885, 327130, -18219, 88312, 195288, -427517, -5112, 62415, -45328, 111296, 83662, 388804, -276954, 290042, 273826, -192849, 22128, -200344, 260258, -50606, 4943, -98880, 57021, 2522, -18414, -70095, 270394, 275751, -144848, 67727, -124330, -85299, 131107, 60710, 95683, -234816, 77387, 316975, 16527, 201114, 205230, 106140, -95628, 227484, 313880, -120820, -37123, 330996, 49173, -21439, 350553, 120407, 217413, 292392, -269124, 348415, 176431, 456579, 16246, -125406, -41079, -90513, 2221, -43512, 49326, 83610, -144016, -110799, 347282, 86986, 68254, -206008, -61336, 234674, -97542, -67013, -303295, 157464, -74533, -170649, 169236, 89582, -139242, 134975]
12012a71810C05261d0582A17486Q8873a35918B85010A04325J95292A40019M13398
12002E53417a40012P922F0647R3822a15808B04234J35115D5389N2648K8707l3810
11991I2934e84887a0501A04479M6481a62852G6363a64434g5308k99803a23581
11980c2316A74976b99688A15360a87306I5030C0173J09843C4660J53955b22693
11969a37620A63672o0319g4409b1769k06053O2539B6219N81a36205D8525h8481
11957a51016A70011B882a56352e4883j65256d8233k48165d7231B52863a31777
11946b60442M3035A93240b66691K2102l0870P3112B15686G6808J40874d48400
11935D3511a54637d5789C57463a30851a7096m0201D6157g1638j72117b1609j25377
$$ y = [-171810, 305261, -40582, 117486, 206359, -135918, 285010, 104325, 299617, 140019, 553417, -140012, -132090, 60647, 154469, -115808, 204234, 339349, 45389, 98037, 126744, 92934, -584887, -10501, 104479, 150960, -162852, 76363, -164434, -75308, -375111, -123581, -32316, 174976, -299688, 115360, -187306, 95030, 30173, 140016, 34660, 188615, -222693, -137620, 163672, 103353, -74409, -21769, -227822, -165283, 26219, 26800, -136205, 48525, -88481, -151016, 170011, 2882, -156352, -54883, -220139, -48233, -296398, -47231, 252863, -131777, -260442, -217407, 193240, -266691, -244589, -275459, -202347, 215686, 76808, 217682, -448400, 43511, -154637, -45789, 357463, -130851, -17096, -57297, 46157, -71638, -243755, -21609, -146986]
11924a46986A02371b02194F6867c3930A0318a38297B97786b61022A47162F1677
11913A48071g4624a0557q9809A05329D2398L7027c5411l63650i2678F7253a95093
11901C37175a82852B46772b31099A96122q0262a87370B35308d5952C20411c33214
11890A60379d10001J93991A00300C9446K68725i4000A14060M9678a10479n5395
11880a65874e4679l38035A8075a42880j1433f4664E8446A1970e0393H2676d1821
11868b43401B31956C2398L22351c87344K8919g6348k90064D0306c63402a21743
11857a66982P4911c259I0781J45147b73517l221P1151B87972a68416A88165M7863
11846B36028c3703p6039A93614b30109A46179F6609J17737a77382B7026J34695
$$ y = [-146986, 102371, -202194, 66867, -33930, 10318, -138297, 297786, -261022, 147162, 61677, 148071, -74624, -10557, -100366, 105329, 42398, 79425, -35411, -399061, -92678, 67253, -195093, 337175, -182852, 246772, -231099, 196122, 115860, -187370, 235308, -45952, 320411, -333214, 160379, -410001, -216010, 100300, 39446, 308171, -94000, 114060, 163738, -110479, -165874, -54679, -392714, 18075, -142880, -154313, -64664, 58446, 11970, -50393, 82676, -41821, -243401, 231956, 32398, 354749, -387344, -358425, -76348, -366412, 40306, -363402, -121743, -166982, -92071, -3259, 90781, 235928, -273517, -276738, -205587, 287972, -168416, 188165, 236028, -33703, -109742, 193614, -230109, 146179, 66609, 184346, -177382, 27026, 161721]
11836A61721c90386i2546c8236j35269o1882A96951a76634m0880n749E8121P3280
11825A31401g1653k3284n1415l3721A37955E3750N0999m4497J15746c8216H2147
11813a79237A00516i4127A54206a54341a2213j13887A15974f7688B79711b72045
11802a92327M3304B71982F0873h16p8612a0222A5904a0627A80517J12606a40370
11790a38100m4406b6767B17307f6306j28148A50910p3605O2470L1553n2028n0241
11779F9059c2531M539A08433b18277K7625K6984a8673q2979A151P5808l7479a17052
11766A33352f6893m3583k10269A3141a39162d9980m0540R301l4507k05694A25833
11754I7669q776h6243d2893o2363F5190g6345D7498J12715a49646B50269I388
$$ y = [161721, -390386, -92546, -38236, -173505, -235387, 196951, -176634, -217514, -223263, 58121, 131401, -71653, -94937, -146352, -180073, 137955, 53750, 104749, 60252, 175998, -38216, 82147, -179237, 100516, -94127, 154206, -154341, -12213, -126100, 115974, -67688, 279711, -272045, -192327, -149023, 271982, 60873, -816, -79428, -10222, 15904, -10627, 180517, 293123, -140370, -138100, -182506, -26767, 217307, -66306, -194454, 150910, 77305, 139775, 171328, 119300, 69059, -32531, -27992, 108433, -218277, -190652, -163668, -18673, -101652, 1151, 76959, 39480, -117052, 133352, -66893, -110476, -320745, 13141, -139162, -49980, -90520, -81219, -115726, -321420, 125833, 97669, 88893, -86243, -42893, -105256, 65190, -76345, 47498, 160213, -149646, 250269, 9388]
11742a09272C8268a87502H0147M8810b0788C29959a01689M3410A17813M4348a52476
11730a30617j52123A08092a61017N8003i589A32828E4320d60834G7969l1170M1766
11719H8565e3473A77707a55531C1722b66637b5994A76661b56724J14233k26950
11709c69441d0117k09939G2603b48313B4735N824a11466J4981m6966M7902j09560
11698b05109A08039i0566k05943A01678b5925j16290A5329b05342A42488F6743
11687a88240B53839a1071B58357C8015e2359F0728a1067k23358C26575A52694
11676B6061O3812M0705J59929E4852Q8463J49952b36325C34246d1396A33037h9265
11664G8327h0464A07007J05056a51418C280L50576C8567j3088b43591C27247j01883
$$ y = [-109272, 38268, -187502, 80147, 128957, -20788, 329959, -101689, -58279, 117813, 162161, -152476, -130617, -282740, 108092, -161017, -103014, -9589, 132828, 54320, -460834, 77969, 46799, 88565, -53473, 177707, -155531, 31722, -266637, -25994, 176661, -256724, -142491, -369441, -40117, -250056, 72603, -248313, 24735, 30559, -111466, -96485, -143451, -95549, -205109, 108039, -90566, -296509, 101678, -25925, -142215, 15329, -205342, 142488, 66743, -188240, 253839, -11071, 258357, 38015, -52359, 60728, -11067, -234425, 326575, 152694, 26061, 89873, 130578, 290507, 54852, 143315, 293267, -236325, 334246, -41396, 133037, -89265, 78327, -80464, 107007, 212063, -151418, 3280, 353856, 38567, 25479, -243591, 327247, 225364]
11653B25364j05774a12614A48786A1610i0850a3457A14977L63325E2616b07725
11642A55673h6684E5461f5729B5150b73352P3053g5906A82454b9729B34212a48987
11630g2650j69362C67331a2735j78172A76636A5360d9328b2677A25847k5385L1550
11619A32012d77767A149c7054A98861F4393M3571c27594g1987H5050a70308D91037
11607g6518I8618b0831k02340a01768b5366j22597g399n6639A42613E4913e4437
11595H5153c40518J02875g6244C42667A6155J59946B0240J7667K30631G0695B4109
11583b596A67904B1367K76832L8j31840d4441A35080J83720E0882K28863l4727
11572B45018p7777k7398b51072C16288d1381H6700j0283O6938k8626b067G4786
$$ y = [225364, 119590, -112614, 148786, 11610, -90850, -13457, 114977, 478302, 52616, -207725, 155673, -86684, 55461, -65729, 25150, -273352, -200299, -75906, 182454, -29729, 234212, -148987, -72650, -242012, 367331, -12735, -190907, 176636, 15360, -49328, -22677, 125847, 100462, 132012, -477767, 1149, -37054, 198861, 64393, 107964, -327594, -71987, 85050, -170308, 491037, -76518, 98618, -20831, -223171, -101768, -25366, -147963, -7399, -64038, 142613, 54913, -54437, 85153, -340518, -237643, -76244, 342667, 16155, 176101, 20240, 37907, 268538, 70695, 24109, -2596, 167904, 21367, 298199, 298237, 166397, -44441, 135080, 318800, 50882, 279745, 245018, 167241, 139843, -251072, 316288, -41381, 86700, 76417, 143355, 114729, -2067, 74786]
11560F0801h7418k4496D11359j57798k2043j02673m6468O7332k2460L2250a54953
11548b34401A09917J80958A3495J53924c21679a2015F335J30634J36658a32164
11537a19244F367J1617K37477C485a07615k99807A87182a59085O2178c6153J6871
11526a9282B777J18404A2652J36563J2221A2713J62837p2590b82697j2930C1421
11514a5187C44630B964K54464b37495d6060D5915J59900q0261c3407B94543d06229
11502f418j57841j84243f4858A10680a42657J693H5476A8899a10063a8443A5591
11490C01719G8648B1162a07075H9083m1402K16719a7360l5234A74013b7626k44154
11479b71780A23577k0914e3017j39723H1261f7096I4986a90526q0189A00449l5253
$$ y = [60801, -87418, -111914, 411359, 253561, 231518, 128845, 82377, 149709, 127249, 159499, -154953, -234401, 109917, 290875, 13495, 167419, -321679, -12015, 6335, 136969, 273627, -132164, -119244, 6367, 17984, 255461, 3485, -107615, -407422, 187182, -159085, -96907, -36153, -19282, 2777, 121181, 12652, 149215, 161436, 12713, 175550, 102960, -282697, -295627, 31421, -15187, 344630, 2964, 257428, -237495, -46060, 45915, 205815, 125554, -33407, 294543, -406229, -6418, -164259, -348502, -64858, 110680, -142657, -140964, 85476, 18899, -110063, -18443, 15591, 301719, 78648, 21162, -107075, 89083, 47681, 264400, -17360, -52594, 174013, -27626, -271780, 123577, 102663, -53017, -192740, 81261, -67096, 94986, -190526, -270715, 100449, 65196]
11468F5196L2894J80418F4374a11768p2777D3276R0644J8190b1380j41796A71015
11456D6004e122n4643F2645J28610K9920A07266B1145b44107J06522A6280O15487
11445F31767a67676D92857A25351a78924A21844e3622A43714P3014r4894J98755
11435C20589b24731B706a90432R0322A85173A4240O2774B3816a71953B26663h0171
11423a51923H3762K05572n1785b14908A42349A6763R0219b56581f4176b45A55466
11411A3711a14731A23791B6588a18578N862a1906p791l45641A15093i944k4189
11400c4133j0323j59212O902i7116I0945F328M19237C851M4375a318j62389I3936
11387B02965n6302G0350K98370a07152p5612C40706c62377D26031j79934M0003
$$ y = [65196, 98090, 278508, 64374, -111768, -184545, 43276, 133920, 152110, -21380, -163176, 171015, 46004, -5122, -59765, 62645, 191255, 221175, 107266, 21145, -244107, -137585, 16280, 631767, -167676, 492857, 125351, -178924, 121844, -53622, 143714, 216728, 121834, 320589, -224731, 2706, -190432, -100110, 185173, 14240, 77014, 23816, -171953, 226663, -80171, -151923, 83762, 289334, 237549, -214908, 142349, 16763, 106982, -256581, -64176, -245, 155466, 13711, -114731, 123791, 26588, -118578, -112716, -11906, -19697, -365338, 115093, -9944, -34133, -44456, -203668, -196766, -97116, 90945, 6328, 425565, 3851, 48226, -1318, -163707, 93936, 202965, 146663, 70350, 368720, -107152, -182764, 340706, -362377, 426031, 246097, 286100]
11377B86100a45103B0524K0917h5582k79557a81576E360M6141b76288h1023I3763
11365g2551j25531A92751G9009J08417h3332B57110D0763a66969A2135e2099j47850
11354a99949A37064c14694j03913a8558A81794a46065B08403q8590a23167d7323
11343a95104m9698L0539d1614j5435k68253I3132c48082a27356k05513D2299b53956
11331d470A60970j5155n4306b64590r5752A98902b8480f565B39857F5204A827
11319b6375j05119j56636a11347C4194a68811o9802A25568a62112j17407O2206
11309b17313R3707j24631A96971a71768g8805G3974b88035R263J9594A433a34519
11297i694A81692d5176k87624h9203q1120k3309G7164a66648B97606a97375A60983
$$ y = [286100, -145103, 20524, 41441, -85582, -365139, -181576, 5360, 51501, -276288, -81023, 93763, -72551, -198082, 192751, 79009, 187426, -83332, 257110, 40763, -166969, 12135, -52099, -199949, 137064, -314694, -418607, -18558, 181794, -146065, 208403, 119813, -123167, -47323, -195104, -244802, -214263, -41614, -57049, -325302, 93132, -348082, -127356, -332869, 42299, -253956, -4470, 160970, 145815, 91509, -264590, -360342, 198902, -28480, -6565, 239857, 65204, 1827, -26375, -131494, -288130, -111347, 34194, -168811, -238613, 125568, -162112, -279519, -217313, -123606, -248237, 196971, -171768, -78805, 73974, -288035, -278772, -259178, 1433, -134519, -9694, 181692, -45176, -332800, -89203, -170323, -193632, 77164, -166648, 297606, -197375, 160983]
11285h3211o6245j7572k02470a61091a4533j74037N3319E1347e0466A38776g2553
11273a83141b8551B38254d47454D5834j6432P727K0243k704a52477j8026A0614
11261H681M2428c4770E4832b6210o1689H4115b01114J8560D9177c3283j5229B4769
11248a43898D1840a34605B83704a6826C7929C365i4876o7285G4534P966K0675
11237A03175m1218g2056l742I205c6607B64564A08212C7908O2785h6268k35174
11226c21442a0655A83006G5044a07710B3350h8584j53966B54334q4344a20419
11215B70612b47960N493n5501Q4024K6471o8571R9583M1404F814J77255A641a83324
11202A17762b02977C2910h7963k52073f2590j25478B32208K3861n9202g3543d432
$$ y = [-83211, -149456, -167028, -369498, -161091, -14533, -188570, -135251, 51347, -50466, 138776, -72553, -183141, -28551, 238254, -447454, 45834, 29402, 37129, 57372, 54668, -152477, -170503, 10614, 8681, 51109, -34770, 54832, -26210, -87899, 84115, -201114, -182554, 49177, -33283, -48512, 24769, -143898, 41840, -134605, 283704, -16826, 37929, 3365, -94876, -162161, 74534, 82500, 103175, 61957, -72056, -75798, 9205, -36607, 264564, 108212, 37908, 100693, -86268, -321442, -10655, 183006, 75044, -107710, 23350, -88584, -242550, 254334, 169990, -120419, 270612, -247960, -242467, -297968, -213944, -187473, -256044, -156461, -115057, 6814, 184069, 1641, -183324, 117762, -202977, 32910, -87963, -340036, -62590, -188068, 232208, 256069, 196867, -73543, -4432]
11190E9452b88266a364k10279C39868G1999c03571a51727O9334m8287F1066a23847
11178d0628j31998n9201A15677l4463g4926r1042k86098J97498d3970o1276k1922
11167a27168j25548A29602J29862e3377k49346b8978q9846J7675B81851a59186
11156g6550F1652b26105B72680c9355o418B14627b80859f5025J6720C0281c31680
11144b26065b6619j88618f6147B34662c57132e4788j55504l2091a537k97285B06646
11132a31367I8632J67058A7533c20050A00628N3439k3969c7351j93424d9100k99564
11121c48664i804j04601B44501b58338H1953i7072d8426B47028b59185L1346b1833
11109A60098N9827m2566n7289c7855E8172j6823J8855J88282B7254K60031a56824
$$ y = [59452, -288266, -1364, -211643, 339868, 71999, -303571, -151727, -82393, -130680, 61066, -123847, -40628, -172626, -231827, 115677, 81214, -74926, -165968, -452066, -254568, -43970, -105246, -127168, -252716, 129602, 259464, -53377, -302723, -28978, -118824, -101149, 281851, -159186, -76550, 61652, -226105, 272680, -39355, -45773, 214627, -280859, -65025, -48305, 30281, -331680, -226065, -26619, -215237, -66147, 234662, -357132, -54788, -210292, -242383, -1537, -298822, 206646, -131367, 98632, 265690, 17533, -320050, 100628, 154067, 130098, -37351, -230775, -49100, -348664, -9804, -114405, 244501, -258338, 81953, -97072, -48426, 247028, -259185, -227839, -21833, 160098, 219925, 177359, 120070, -37855, 58172, 41349, 60204, 248486, 27254, 287285, -156824]
11097b6067j35358c8064j10245C01379c83992J29056I8459A9132J39066K07814
11087C66012A52878a2999C10207H1513O8890i4658B12060Q5652j43989i08B77825
11075B66243n300p0616L4204h2507C14197j27717F4758g529B40692H5302K63063
11064C48365A52330a71053B13031I3573K38588q2491M7382K39158H8885K51305
11054C40190j1060d757j10546B35529A12863K41435O0358j20081J68036j83036
11044B79575F5331K89505O0059p9067J46701I9752L44941K80347j90253j57243
11034C77544K52347J09964A33320M32533J16621B46402L19894j78067L3626J3457
11024D35312j73858R7955G2263N11512B80462K17233J82049M925l34749N7107
$$ y = [-26067, -161425, -38064, -148309, 301379, -383992, -254936, 98459, 19132, 158198, 366012, 152878, -12999, 310207, 81513, 150403, -94658, 212060, 297712, 153723, -908, 277825, 266243, 260943, 190327, 224531, -82507, 314197, 186480, 64758, -7529, 240692, 85302, 348365, 152330, -171053, 213031, 93573, 332161, 249670, 297052, 536210, 88885, 340190, 329130, -4757, -115303, 235529, 112863, 354298, 414656, 294575, 462611, 279575, 65331, 354836, 414895, 335828, 482529, 99752, 444693, 725040, 534787, 377544, 629891, 739855, 133320, 565853, 682474, 246402, 566296, 388229, 421855, 435312, 261454, 359409, 72263, 583775, 280462, 497695, 679744, 684669, 349920, 407027]
11014D07027K46276j52438q7515K95312J08828A37208N06785K5489j86588K9449
11004E12343M592j72190M05235j05358J86126A23723L43492k4249m6723K38721
10994F34964k13969P8388J18546k55781M79606D04680J94883j26953A12096N22544
10984F34640C08010L49981B94013P7132j46683K02372j19970L66272o4944R0827
10974F99019l19115j1223L13455k23607L58073j68942j18284K15433J30021k02890
10964F71940r8762K48717m6832N72291m72629N49180J27555m81360M31878L52257
10954A854235k37055M2568N6541p8320p9953J01602l27802L90930k84132j03253
10944A335361j11697K59321k18093q9780j21053J96194J38751Q5012r980l25495
$$ y = [407027, 653303, 500865, 413350, 708662, 817490, 137208, 643993, 669482, 482894, 512343, 516935, 344745, 749980, 644622, 830748, 123723, 467215, 442966, 396243, 634964, 420995, 499383, 617929, 362148, 841754, 404680, 599563, 472610, 112096, 634640, 308010, 657991, 294013, 371145, 224462, 426834, 306864, 673136, 608192, 699019, 379904, 368681, 682136, 458529, 816602, 647660, 529376, 744809, 874830, 671940, 573178, 821895, 775063, 1347354, 874725, 1423905, 1551460, 1070100, 1501978, 1854235, 1617180, 1659748, 1716289, 1637969, 1558016, 1659618, 1331816, 1722746, 1438614, 1335361, 1223664, 1482985, 1264892, 1175112, 1054059, 1250253, 1389004, 1474016, 1464036, 1138541]
10934A138541p3415k59732p6995k5158J8531j11342B55166o8565J07390N9218
10924C53209a2393D42446C2968h4394B18088o8252l4144b1055k09725f5802E19988
10912C41340b71722A30952a19603B22726I3688J45549A04113m2680c3640F601
10901A24790e461G1609e00171G4592b40375I473a90993B8621b97772d0328r9004
10890a39332B55418b08181n6026J28300A67614d3945o8392L138P951B21970a65099
10878a96734A94694J27124A21802M6246a38877c3144k17820C137P8485a93129
10867B03577n430a64602J0035b2958k95489C0028R4413b6312F0033a74208j31660
10856c05868b8129k43608L3673j35330E1628a51590k6395c6097C02903I2148J0555
$$ y = [1138541, 1065126, 805394, 728399, 703241, 721772, 610430, 255166, 186601, 293991, 353209, -12393, 442446, 32968, -84394, 218088, 149836, 115692, -21055, -230780, -65802, 519988, 341340, -271722, 130952, -119603, 222726, 93688, 239237, 104113, 61433, -33640, 6601, 124790, -5461, 71609, -500171, 74592, -240375, 9473, -190993, 28621, -297772, -40328, -139332, 255418, -208181, -264207, -135907, 167614, -43945, -112337, -109199, -101248, 221970, -165099, -196734, 194694, 321818, 121802, 168048, -138877, -33144, -250964, 3137, 81622, -193129, 203577, 198147, -164602, -154567, -22958, -318447, 30028, 124441, -26312, 60033, -174208, -305868, -28129, -271737, -238064, -373394, 51628, -151590, -177985, -36097, 302903, 92148, 102703]
10845A02703J40177D1163a33765e1995a4460A6486j264J5527h9825A37648a38344
10833I7523E823L3712F573N7171Q6991a02636C6218f0187F1285e8689j51660a4157
10820a54730B2340L88046c9727j0589B12435a7217p3701A94823a71069j55044
10810c26113a36843k9480G8859B6819O1843E223a9070j20478A93170d26928E1181
10798H0675a3436B06124R5643n1984b18185B2257J14001m0655b879A65048a6458
10786D7269c33866C28186F9505f765j63821j11465h0622c1797B08623F0125a83932
10774i8502j85858F208f1499A46333e3856b1849l3634m15062b18945c9952j88976
10763b28928A83738G2074a00719n3900D1149d11260J63826B37311A11754P9118
$$ y = [102703, 242880, 41163, -133765, -51995, -14460, 16486, 15222, 30749, -89825, 137648, -138344, 97523, 5823, 39535, 6573, 63744, 150735, -102636, 36218, -60187, 61285, -58689, -210349, -14157, -154730, 22340, 410386, -39727, -50316, 212435, -17217, -90918, 194823, -171069, -326113, -136843, -166323, 78859, 26819, 88662, 5223, -19070, -139548, 193170, -426928, 51181, 80675, -13436, 206124, 301767, 249783, -218185, 22257, 136258, 95603, -2879, 165048, -16458, 47269, -333866, 328186, 69505, -6765, -170586, -282051, -80622, -31797, 208623, 60125, -183932, -98502, -284360, 6208, -61499, 146333, -53856, -21849, -55483, -470545, -218945, -39952, -228928, 183738, 72074, -100719, -154619, 41149, -411260, -247434, 237311, 111754, 190872]
10753A90872H2789P3488g2838F6951b48226A10761J29193J20076j77660b8041
10742d2183a4019A86736a1844j23373d5458j86732i2304E6430B5860a05060J3924
10731i1136j89869C42368a82676K6263A54220c8838q1879A3978d67780C40449
10720E0636N0863a3163k64293D1071a92682B7377e3530A89124L1617p2493a38232
10708A15217a26048N7481A5737a7547D6936L2751a80852A08046B3886b43351H2970
10696C5299Q1256b17438Q9922j30850g8548k08227J29429B25826a29139L1621
10686i7518H3019f7058C41814a27015j61130G452b67939a01626J7248j11225I2818
10674a64498A31526b79567A11908c23937c8368k58622G7270c3364q9647J1229
$$ y = [190872, 82789, 156277, -72838, 66951, -248226, 110761, 239954, 360030, 182370, -28041, -42183, -14019, 186736, -11844, -135217, -45458, -232190, -92304, 56430, 25860, -105060, -91136, -281005, 342368, -182676, -156413, 154220, -38838, -120717, 13978, -467780, 340449, 50636, 101499, -13163, -277456, 41071, -192682, 27377, -53530, 189124, 220741, 148248, -138232, 115217, -126048, -68567, 15737, -17547, 46936, 79687, -180852, 108046, 23886, -243351, 82970, 35299, 116555, -217438, -127516, -258366, -78548, -286775, -157346, 225826, -129139, -97518, 83019, -67058, 341814, -127015, -288145, 7452, -267939, -101626, -84378, -195603, 92818, -164498, 131526, -279567, 111908, -323937, -38368, -296990, 77270, -33364, -123011, -111782]
10664a11782m8676c0465A63316p7373g708j88263A5676J70655d3462Q102l55039
10653c90399a49600N357j64456A51656B6757a07186E3450l747L644a20211A0418
10641A12825l3345N7261M3998a21030K7601A25727c35191A91792i4326C9701b959
10629a58894d8758a6812k7470D5848c25107C356O8371a62444H6274h1817D4170
10617C22755d9676n4659D647b17967A59075a47096B02635a74037e6617j82938
10607b39555c6384q5957B14001a59188j1545A35695a48706m7950r31l9514i7560
10595b82253i4771M1172F4051d1756j91647h7122A30495n401g9636a8631A77604
10583a54035c8982k36889a21522M5989F1924b14866K5225G7876b35320A63514
$$ y = [-111782, -160458, -30465, 163316, 85943, -7708, -195971, 15676, 186331, -43462, -35360, -390399, -149600, -144243, -308699, 151656, 26757, -107186, 53450, 49703, 53347, -120211, 10418, 112825, 79480, 136741, 180739, -121030, -93429, 125727, -335191, 191792, -94326, 39701, -2959, -158894, -48758, -16812, -44282, 45848, -325107, 3356, 71727, -162444, 86274, -81817, 44170, 322755, -49676, -104335, 4647, -217967, 159075, -147096, 202635, -174037, -56617, -239555, -36384, -122341, 214001, -159188, -170733, 135695, -148706, -196656, -197587, -237101, -97560, -282253, -94771, -53599, 64051, -41756, -233403, -87122, 130495, 125094, -79636, -18631, 177604, -154035, -38982, -275871, -121522, -75533, 61924, -214866, -189641, 77876, -235320, 163514]
10572a13284A23685a43307F7002g4213J9230A97417b4611F8871e0906j22895M2540
10561a31261A3952i8081B8737b57580D7714J60670K7049c54678c2369G7262h6001
10549A8647K09013q3095E2044g7200c1853A78064J61468a34388o0351h7258o1637
10538a48895D8793K41793e6872A93111a23009c7759A55757a29651b1836O732m76907
10527d92011C1997J22245a25961a5129B69039d2150n4412B92259J36610D6052
10516C18397b36513h9608B81309b88522B12106a84406n4076j7982c0511B90616
10505c70049J27024j9884a16373n2328P458k62694a07260l64530g8693m0285I9010
10493A57147J67336a53505C73676d7108A11206e8880o5373m7279k5574a2617j24987
$$ y = [-113284, 123685, -143307, 67002, -74213, -54983, 197417, -24611, 68871, -50906, -173801, -131261, 13952, -98081, 28737, -257580, 47714, 208384, 235433, -354678, -32369, 77262, -86001, 18647, 227660, 144565, 52044, -77200, -31853, 178064, 339532, -134388, -194739, -87258, -148895, 48793, 290586, -56872, 193111, -123009, -37759, 155757, -129651, -21836, -15104, -492011, 31997, 154242, -125961, -15129, 269039, -42150, -96562, 292259, 428869, 46052, 318397, -236513, -89608, 281309, -288522, 212106, -184406, -238482, -256464, -30511, 290616, -370049, -243025, -262909, -116373, -168701, -161243, -423937, -107260, -471790, -78693, -118978, 99010, 157147, 324483, -153505, 373676, -47108, 111206, -58880, -124253, -171532, -197106, -12617, -137604]
10482a37604B1570J60164g94j35996B1355J19161a66365j53061A91431c0522F0762
10470A80212b04193B842N1655h9787A89686a23528m8536A1329L11138m4226g6391
10458E26963k38622K03895B38173j10045A6160J5080J68051c83266a17239b9496
10447a67267B64224j20664b20507j74368a08129J3576I0534a51806f4762C3358
10436F9684b16091g301l11835a29921K3283K174o8186K9808a0562k19753a03212
10424H1269a96341M0122A2417d44806O541c9259j8401l19920J46215I109b40346
10412c11573J0863A00516b27100A53916F8400b62915A7721a29961E6009i3730
10401C82484D0399K4654h3210k45646E9346k7987i5018G8729l4417a7681B87126
$$ y = [-137604, 21570, 181734, -794, -136790, 21355, 140516, -166365, -319426, 191431, -30522, 60762, 180212, -204193, 2842, 54497, -89787, 189686, -123528, -172064, 11329, 322467, 278241, -76391, 526963, 288341, 492236, 238173, 128128, 16160, 31240, 199291, -383266, -117239, -29496, -167267, 264224, 143560, -220507, -394875, -108129, -94553, 90534, -151806, -64762, 33358, 69684, -216091, -7301, -319136, -129921, -106638, -104464, -172650, -142842, -10562, -230315, -103212, 81269, -196341, -156219, 12417, -444806, -438265, -39259, -57660, -377580, -231365, 9109, -240346, -311573, -300710, 100516, -227100, 153916, 68400, -262915, 17721, -129961, 56009, -93730, 382484, 40399, 65053, -83210, -328856, 59346, 31359, -95018, 78729, 44312, -17681, 287126]
10389A21393m986G088L7434b89499A16788K6465D8192b02410j8551O9458I3546
10377d732B83957A18746b48355A64189e7618C1789a96456B8580J18405g5386E7078
10365C8377c578j97401g3444B54050b68441J07225D7154N631K16846F6360L27036
10354C93396d6048A64586j3494C6753J18134N4630K81196j33454B2875J83090
10344B05965L59896A50772N3821n5981K60620A25889N1846P2792J004K9384J7676
10333B98591p2974p7248M43027r9321l1035B29645M778k1287d100C1290J04846
10322A36136l033J60089E8565J63235q3600M112O9127I630O8287O078h7377j46975
10310b34352B81441g3757I1640O3493J81595a97005A91091i934A24859K2294J88455
$$ y = [121393, 116407, 7088, 44522, -289499, 116788, 143253, 48192, -202410, -220961, -151503, 93546, -4732, 283957, 118746, -248355, 164189, -57618, 31789, -196456, 28580, 146985, -75386, 57078, 38377, -3578, -200979, -73444, 254050, -268441, -161216, 47154, 52785, 269631, 66360, 393396, -46048, 164586, 151092, 36753, 154887, 209517, 490713, 357259, 22875, 205965, 565861, 150772, 204593, 148612, 409232, 125889, 177735, 250527, 251531, 280915, 298591, 225617, 148369, 591396, 492075, 461040, 229645, 234423, 213136, -4100, 31290, 136136, 133103, 293192, 58565, 221800, 138200, 142312, 211439, 9630, 77917, 83995, -87377, -234352, 281441, -73757, 91640, 155133, 336728, -197005, 191091, -9934, 124859, 147153, 335608]
10299C35608D9136J35865D9024a68535B52657k4966d7573A64499B3591b73537
10288C5193h0099A16149E0152c15233j45719J62058B22603a88418A46129b13565
10277a18681K9150j44562k04133h7383K4649H2637J14564a33304O832A45458c05167
10265h6292G3166J29408b52199C35922a43260n000e9760A19042c9071A6692J45882
10254A62574c04554a04907G2100P8737A0942e3921A05173C8985L1612a61316B07139
10242b7062l6044A49339J9778a09978A83154K98895j29074J80289e8541C5680
10231a2841j87673F9697k8022a42016B83701q5918J20500e8444A92606g6565j42432
10220b18997C1818b06023C47P9444b2022d382k18945O6597B15231G1779L30992
$$ y = [335608, 49136, 185001, 49024, -168535, 252657, 227691, -47573, 164499, 23591, -273537, 35193, -80099, 116149, 50152, -315233, -460952, -298894, 222603, -188418, 146129, -213565, -118681, -89531, -234093, -438226, -87383, -62734, 82637, 197201, -133304, -126472, 145458, -305167, -86292, 73166, 202574, -252199, 335922, -143260, -148260, -59760, 119042, -39071, 16692, 162574, -304554, -104907, 72100, 150837, 10942, -53921, 105173, 38985, 70597, -161316, 207139, -27062, -63106, 149339, 169117, -109978, 183154, 482049, 352975, 533264, -58541, 35680, -12841, -200514, 69697, 41675, -142016, 283701, 197783, 318283, -58444, 192606, -76565, -218997, 31818, -206023, 347, 79791, -22022, -4382, -223327, -156730, 215231, 71779, 402771]
10209D02771b0086k295C08883a53548c024l29517A88406c30065G6363a48978F5731
10197a45434l34044a89576i1230G6156d87472K28713a19232g081A92070b3007
10186a73646D3020L0660J2081f9797k38124J34870L5790o0292K8062D310J91824
10175A96134d1216A7373J69712a06124M1741k05161j55385i6542k48611J48058
10165a97095F8392i1261j27330n1868B62613k546a27567A68786A6276Q0535g6497
10153b95136d7295m27160b19863C1713r458f7242p7322B62135a93735k1591B09584
10141G235L2903a61905P6374k04471b4846A29141h8523j87061J31856j75585a11799
10129a91512c7703L055j02526j22987P0037l8316A2645K87065a98865c2430H8205
$$ y = [402771, -20086, -22381, 308883, -153548, -3024, -332541, 188406, -330065, 76363, -148978, 65731, -145434, -479478, -189576, -91230, 76156, -487472, -258759, -119232, -7081, 192070, -23007, -173646, 43020, 73680, 85761, -69797, -307921, -173051, -137261, -197553, -169491, 4310, 196134, -41216, 17373, 187085, -106124, -64383, -269544, -424929, -96542, -345153, -197095, 68392, -91261, -218591, -270459, 262613, 260067, -127567, 168786, 16276, 96811, -76497, -295136, -47295, -474455, -219863, 31713, 22255, -67242, -144564, 262135, -193735, -215326, 209584, 7235, 40138, -161905, -85531, -290002, -24846, 129141, -88523, -275584, -143728, -319313, -111799, -191512, -37703, -34648, -137174, -260161, -190124, -228440, 12645, 299710, -198865, -32430, 88205]
10117d4222k44323a35057k31666D5111b0907A39993R9880G0734f4470J3677j44405
10106a95198R1252r6091f4114j01043E1312N3658c381q9389D5899a63392l081
10095a66473B15513f3239B2383O7387B7643d12997C7105c6702n9011o4776c3265
10083A31095l5759b0318A47771f0816B29553c33539A40174M477i2858B77489f2297
10071F6727a57980e4379j47555J8015j13793A18812h9804j48598a00457j33395
10061b33852c1478j55059H7089d7414j18325A24429J22458g6744j52440D4436
10050A09214b5074m9861C54189b73007a13616A07165C2276a90071E3384f8256
10039a39518J9866k53464A94925o373c6393k15721E7648L3005a91232c8234m36575
$$ y = [-44222, -288545, -135057, -366723, 45111, -20907, 139993, 239873, 70734, -64470, -50793, -195198, -103946, -200037, -64114, -165157, 51312, 104970, -3381, -92770, 45899, -163392, -166473, 215513, -63239, 22383, 89770, 27643, -412997, 37105, -36702, -95713, -160489, -33265, 131095, 95336, -20318, 147771, -60816, 229553, -333539, 140174, 144651, -92858, 277489, -62297, 66727, -157980, -54379, -201934, -183919, -297712, 118812, -89804, -238402, -100457, -233852, -31478, -186537, 87089, -47414, -165739, 124429, 246887, -76744, -229184, 44436, 109214, -25074, -74935, 354189, -273007, -113616, 107165, 32276, -190071, 53384, -68256, -139518, -119652, -373116, 194925, 188552, -36393, -252114, 57648, 90653, -191232, -38234, -474809]
10028d74809K14710O1667k89772K24836a411j25590A71521d2758l0871k21334
10018b94963P3932F2973b79172A19355B637h6746D2241b38150C5666K7723n822
10007E7567J21199d30777E1195K23561i3770C11951j29254a32078E1316J79289
9997B30605a54355c6140A15278b4588l90798c0765l2115B37915i9300j28008n5171
9986b82479a7776k14095E8656c49018J09811M3518o3367a13453j16045O2637J0428
9975a56433r6395m638M1857f7031j42285E231c35805I9736P3950b37834c3813
9963d22310d0107q2652M3478A39592L8652g8795F8413a13066b7578l07713a27270
9951C3178J87477a22376L9069j38950C27323A43146a15164c1886k396C9774G019
$$ y = [-474809, -260099, -198432, -488204, -263368, -1411, -127001, 171521, -42758, -73629, -294963, -221031, 62973, -279172, 119355, 2637, -86746, 42241, -238150, 35666, 63389, 57567, 178766, -430777, 51195, 274756, -93770, 311951, 182697, -132078, 51316, 230605, -154355, -36140, 115278, -24588, -415386, -30765, -62880, 237915, -99300, -227308, -282479, -17776, -231871, 58656, -349018, -239207, -195689, -259056, -113453, -229498, -166861, -156433, -252828, -257466, -215609, -67031, -209316, 5231, -335805, 99736, 173686, -237834, -33813, -422310, -40107, -122759, -79281, 139592, 178244, -78795, 68413, -113066, -27578, -335291, -127270, 33178, 220655, -122376, -83307, -222257, 327323, 143146, -115164, -31886, -34282, 39774, 7019]
9939a07446H0534a34623N1076E7691d02315a50055n5747h3490B0432d59571a13953
9927b05356k46972F9792c15698M2101J22534j65877a29330F49a31193A69647a51540
9915E1604a91458G5980J68733b67140G6843a14042l15949h1103F6983K76395c45163
9903D3824c19109A86751f0297H9108b70603d2050A79278e5980l68947a03247j09145
9892b12392i8323D6488c4103l49380g7964q7871A2743K9956J90357b07149C409
9880b62578p4135h9819B64000m7115j03679m3495a61586g0854K3772C45413b9099
9868B3430b7862j85572M3651l6926B46938B5959d6859l1729h754l3233j22838
9857a64825N5558m557A36011h956B82335i8064j24199a10211c9437A2327a43007
$$ y = [-107446, 80534, -134623, -83547, 57691, -402315, -150055, -205802, -83490, 20432, -459571, -113953, -205356, -452328, 69792, -315698, -273597, -151063, -316940, -129330, 649, -131193, 169647, -151540, 51604, -191458, 75980, 244713, -267140, 76843, -114042, -429991, -81103, 66983, 343378, -345163, 43824, -319109, 186751, -60297, 89108, -270603, -42050, 179278, -55980, -424927, -103247, -212392, -98323, 46488, -34103, -383483, -77964, -165835, 12743, 42699, 233056, -207149, 3409, -262578, -336713, -89819, 264000, 216885, 113206, 69711, -161586, -70854, -47082, 345413, -29099, 23430, -27862, -213434, -169783, -206709, 246938, 25959, -46859, -78588, -8754, -41987, -164825, -109267, -113824, 136011, -8956, 282335, -98064, -222263, -110211, -39437, 12327, -143007]
9845d40312c8381B07484G1350k0019a42550n4405f1678j09688A15512l5627B7247
9833a0402G586J05885a43100D3553b03235A81798c18094E4610b77564C1327J41501
9822A72828a65301E666K16696c9172n25995J57183a41469E4374b10308E7270B1088
9810G5552b6643j75582H0359i1696A12936c23759P2365N1810k1306C7285P1979
9799A09264d8475j52128i0914a410A7909M7228h5680B02067b14946f1486k18307
9788b79793J30013K011B53436b07457A71225b30914p7323C9280a65469C20878
9777a00111b3693l66118R8435A44559C6596b12836H3999c93279i3996A50087k8083
9766A22004f6085G4062A4223h4012k6907F120e6680A51889F724K35469b74677
$$ y = [-440312, -38381, 207484, 71350, 51331, -142550, -196955, -61678, -171366, 115512, 79885, 27247, -10402, 7586, 113471, -143100, 43553, -203235, 181798, -318094, 54610, -277564, 31327, 172828, -165301, 5666, 222362, -39172, -565167, -407984, -141469, 54374, -210308, 57270, 21088, 75552, -26643, -202225, 80359, -91696, 112936, -323759, -251394, -199584, -220890, 37285, 109264, -48475, -200603, -90914, -1410, 17909, 65137, -85680, 202067, -214946, -61486, -279793, -149780, -147769, 253436, -207457, 171225, -230914, -308237, 39280, -165469, 320878, -100111, -23693, -389811, -291376, 144559, 36596, -212836, 83999, -393279, -93996, 150087, 122004, -66085, 74062, 14223, -84012, -110919, 6120, -56680, 151889, 6724, 242193, -274677]
9754h6002L6847A632J50311c52983J75921A2146b6254A67017b85439D8481i6924
9742g7096J1316B46564p1257e2515j05236e2656p5039e697D5894k0642a75667
9730c1255j08371a9299j39171A01924d9807A79894P2284F6533n594J07893g0578
9718b17492J03441F2251a2623l22525d5798A09701b93562Q2888A18622L5582l6090
9707A18114K0621a62530B51355I8787c51424B08909e7881A21535J0594D8556h4846
9695B27240c97423I553N9484j7822a24475j22393e9855B2295b27657E9394F341
9683a16103a2627q7818A02412i6030b785A47857i4840f19o3560B07171J11022
9672C18193a6457D4844K7130i09j91991M5525i195o4726A16420c10833A14183
$$ y = [-86002, -49155, 1632, 151943, -352983, -177062, 12146, -26254, 167017, -285439, 48481, -96924, -77096, -65780, 246564, 175307, -52515, -157751, -52656, -127695, -5697, 45894, 25252, -175667, -31255, -139626, -19299, -158470, 101924, -49807, 179894, 252178, 66533, 60939, 168832, -70578, -217492, -114051, 62251, -12623, -335148, -45798, 109701, -293562, -210674, 118622, 154204, 118114, 138735, -162530, 251355, 98787, -351424, 208909, -57881, 121535, 132129, 48556, -84846, 227240, -397423, 9553, 69037, 51215, -124475, -246868, -59855, 22295, -227657, 59394, 6341, -116103, -12627, -100445, 102412, -96030, -2785, 147857, -94840, -619, -64179, 207171, 318193, -16457, 44844, 71974, -909, -192900, -147375, -9195, -73921, 116420, -310833, 114183]
9660g172j44419j264c1594l42984a78957E1503K22122h8034A91896c2744A04648
9648h8437H558J16143g8414D8532b63077d7614l63759A04160a11352j79189O5158
9637b25383g7B82447d29359H8746d59416F0828D606a41439A73936C2151M5864
9626G8015g5099q3409m5975M5255B42345b88994A06431k1374a14582A06137P873
9615A14010b70855f5186l81076A91043B0187b83706a0595o8157C504N8391J03543
9604A65438l7381J69864n1703E3655J25543b48484J21729k3780M4399B03656g360
9592c68990a0058A11719i4444n2263r2569e1993l22909A7097d04823b0556k1216
9581d1772k338k5818l66753a79030K0541j14315A11040b48211b6243r9491M1841
$$ y = [-7172, -151591, -152855, -31594, -374578, -178957, 51503, 273625, -88034, 191896, -32744, 104648, -88437, 8558, 124701, -78414, 48532, -263077, -47614, -411373, 104160, -111352, -290541, -225383, -77, 282447, -429359, 88746, -459416, 60828, 4606, -141439, 173936, 32151, 78015, -75099, -158508, -204483, -159228, 242345, -288994, 106431, 85057, -114582, 106137, 114010, -270855, -65186, -446262, 191043, 20187, -283706, -10595, -78752, 3504, 61895, 165438, 128057, 297921, 246218, 53655, 179198, -248484, -126755, -150535, -106136, 203656, -7360, -368990, -10058, 111719, -94444, -146707, -239276, -51993, -374902, 17097, -404823, -20556, -41772, -44110, -69928, -436681, -179030, -158489, -272804, 111040, -248211, -26243, -125734, -83893]
9570h3893H7976c3260k28452i4669j37993L1615c6350A85037b8523j63747E5361
9558b39433G7506J7221e4998r1760j88235B35085A5279c67480A52899n1653c0209
9546i7512j46342n3168b4489A25905d9840J6887k28173N8579A6163N27e6997m3058
9534a00055L2988E2169b96717b5107A50517b43255E7613f1523G13f4691A94342
9522c6628j50723b2962A37154j9415f315A27828E2884P8331b80026K0718A99245
9510a36945c5474B50041d47413b11043j43022A39517b88686E6237a89230H2384
9499c79461K2997f6851D764h9637j6736a7784C5201a3292l89903i1385j34286
9488b25671B88194g6835i65o0680f469C30296a69046a847B57287b02373j06202
$$ y = [-83893, 87976, -33260, -261712, -94669, -232662, -201047, -36350, 185037, -28523, -192270, 55361, -239433, 77506, 94727, -54998, -146758, -334993, 235085, 15279, -367480, 152899, 101246, -30209, -97512, -243854, -297022, -24489, 125905, -49840, -32953, -261126, -202547, 16163, 16690, -56997, -100055, -67067, 52169, -296717, -25107, 150517, -243255, 57613, -61523, 713, -64691, 194342, -36628, -187351, -22962, 137154, 117739, -6315, 127828, 52884, 131215, -280026, -259308, 199245, -136945, -35474, 250041, -447413, -211043, -354065, 139517, -288686, 56237, -189230, 82384, -379461, -356464, -66851, 4764, -89637, -106373, -17784, 35201, -13292, -403195, -91385, -225671, 288194, -76835, -965, -61645, -6469, 330296, -169046, -1847, 257287, -202373, -308575]
9477c08575e0291p4913j51370D2524b85281B24788N943E497a35055j2102f8813
9465e0291I271a48667j89276i323k18090C17134a62204A60963d24798C8690O1696
9454A00386a92627j4749C2361a3686j33811H4823d1225k25632a31020A82504k0629
9443A61875b1380l30036d6681A06602a18833j53942j08899B97149a1347k66878
9433b78225J33482c1188j3324k24470Q6778r9577p0545k1518H0567a45023H6310
9421c12022d287k4895J785I6356a16055B00146b0277k223B53065b49471f9118
9409d7491q8835A84297P5917b0539j52733C0843a36692N4330D3128a11228A538
9397b9309F5662K8707D6625c71446a10017N0726A67547C3534K5975J28051i8848
$$ y = [-308575, -50291, -125204, -276574, 42524, -285281, 224788, 230731, 5497, -135055, -147157, -68813, -50291, 9271, -148667, -337943, -9323, -227413, 317134, -162204, 160963, -424798, 38690, 100386, -192627, -207376, 32361, -13686, -147497, 84823, -41225, -266857, -131020, 182504, 161875, -21380, -351416, -46681, 106602, -118833, -272775, -381674, 297149, -11347, -278225, -144743, -31188, -44512, -268982, -182204, -281781, -352326, -373844, 80567, -145023, 86310, -312022, -4287, -29182, -27397, 96356, -116055, 200146, -20277, -22500, 253065, -249471, -69118, -47491, -136326, 184297, 260214, -20539, -173272, 30843, -136692, -82362, 43128, -111228, 1538, -29309, 65662, 94369, 46625, -371446, -110017, -59291, 167547, 33534, 59509, 187560, -98848]
9385C015e1561r85A99669a77565d6039l88027B31812A13633O2377b16137I0687
9373C0351f1897J6731A4775c04939C7170H686L11661c51686a36096k40590J68378
9362b08308l9245a03228C0603J26183h4210j60689m1863b6984k1191b3747F5726
9350a1632G2969d4021A52566b58211r6422Q4459L5828G3626i8833E3838b30761
9338A6365P3676m170d26724a64338G7566k8697a42088k61784a69184M7104e5086
9326a28825A29960j3944a59971E559P0886b43437C0578i9401C4583b13670a06707
9314c35343B41813e5416n7788k67068a75775A8457a03506A74646n423a5511j88202
9303b03713h588G4280r459f3758B01555b55723K6205R2200r1641B01447b00981
$$ y = [3015, -51561, -52546, 199669, -177565, -46039, -434066, 231812, 113633, 176010, -216137, 90687, 30351, -61897, -45166, 14775, -304939, 37170, 8686, 320347, -351686, -136096, -376686, -208308, -247553, -103228, 30603, 156786, -84210, -244899, -286762, -26984, -48175, -23747, 65726, -11632, 72969, -44021, 152566, -258211, -354633, -270174, -234346, 73626, -98833, 53838, -230761, 16365, 90041, 85871, -426724, -164338, 77566, 48869, -142088, -403872, -169184, -122080, -55086, -128825, 129960, 116016, -159971, 5559, 76445, -243437, 30578, -99401, 34583, -213670, -106707, -335343, 241813, -55416, -113204, -380272, -175775, 18457, -103506, 174646, 169223, -15511, -203713, -8588, 74280, 64821, -63758, 201555, -255723, -229518, -137318, -228959, 201447, -200981]
9291b02823f9500G978f5678j38090c3721p6932j9433m913k9752b2832B2034i4089
9278a53214I965i9439L5659H7649J43042j10809C4839E357J20154d0041C6387
9266a48194k12310f4726H993C383a50030G860a04118K1506m4084F6068P5437N7207
9254A98712c5030l2703B70710d5822J705A9203e7212A1069b69851b5736l14000
9243c39736a09339k4537B1766K3955j6799a1133H75c01717a49297I434L5640K51310
9231B96384b15387I470b38106A97520a08222L7690A1665a23918k26721A7068J97837
9220B14905F6937j2058a20810r7242a7391l52063a74859c9790k83221J29092G0136
9208c68480I7016J72654a35373g614C26394j62135C5190a18930k15201J7159J07808
$$ y = [-202823, -69500, 7978, -65678, -203768, -33721, -110653, -130086, -134999, -164751, -22832, 22034, -94089, -153214, 9965, -99439, -63780, 87649, 230691, 119882, 34839, 5357, 125511, -40041, 36387, -148194, -360504, -64726, 8993, 3383, -150030, 7860, -104118, -82612, -126696, 66068, 141505, 198712, -35030, -67733, 270710, -45822, -44117, 19203, -57212, 11069, -269851, -25736, -339736, -109339, -133876, 21766, 45721, 28922, -11133, 875, -301717, -149297, 9434, 45074, 296384, -215387, 9470, -238106, 197520, -108222, -70532, 11665, -123918, -350639, 17068, 214905, 66937, 54879, -120810, -218052, -17391, -369454, -174859, -39790, -323011, -193919, 70136, -368480, 97016, 269670, -135373, -7614, 326394, 164259, 35190, -118930, -334131, -316972, -209164]
9197b09164j55443a46816D6391b92573B07784a68891F5675b33810A16505a05901
9186B22283q6129a65209D37602a51128b3632G3159c2414k1470k74322O2492F9604
9174a51922j02366R8231l3761R4599r8984A8228a9003A05352a71271O1711n2526
9163a62086D3167a90209J6801f9800k49704d5108j30072j49636e3826r9175A85521
9151a31030c2346k58548J40708m8990c5969j70264c3345m41604c142A24466c85936
9139F2981d6395A16648i993j12335D4656b74292J25315j42247E560L7100A2486
9127B31934g4016K0686j55236k14606b11218h44j39498k7991N1825B49372H1304
9115d0014l56962B03298I7031a25294A15337c2737J4877j92173B04481b14336
$$ y = [-209164, -364607, -146816, 46391, -292573, 207784, -168891, 65675, -233810, 116505, -105901, 222283, 136154, -165209, 437602, -151128, -23632, 73159, -32414, -53884, -328206, -265714, 69604, -151922, -254288, -156057, -189818, -95219, -194203, 18228, -19003, 105352, -171271, -109560, -162086, 43167, -190209, -173408, -69800, -319504, -45108, -175180, -324816, -53826, -153001, 185521, -131030, -32346, -290894, -150186, -199176, -35969, -206233, -33345, -474949, -3142, 124466, -385936, 62981, -46395, 116648, -9993, -122328, 44656, -274292, -148977, -291224, 5560, 42660, 12486, 231934, -74016, -53330, -208566, -423172, -211218, -844, -140342, -168333, -116508, 249372, 81304, -40014, -396976, 203298, 97031, -125294, 115337, -32737, -17860, -210033, 204481, -214336]
9104F3325h4801L6609a2821B04820a61826A42092K30895a25567F2285a50106l43259
9093d93365B6676a37120b4845B2223L4315a33393a8818m00578A49209b49504Q0516
9082a68988A8255b14490A54225o4739L09101i0225j21493b7974k20020R9921k30099
9071c78172A9369M0143h6763c6793C719c9631A19101J93044m4331A15637J13764
9060B29401n496r3281E7818B8510L4635k3832c5329k90942I9807d563j35457l05672
9048d45692a2529p4182G3096a62043G7403f923A10234a66441k2318E6610i8502
9036a67387B8913L6173j870a07634A060K04831n0583f4117j79845a7450A2325
9024b04232j24082A28807a21816l4931B05506C8671b1957D1631b78398J21233
$$ y = [63325, -84801, -48192, -12821, 204820, -161826, 142092, 372987, -125567, 62285, -150106, -493365, 26676, -137120, -24845, 22223, 56538, -133393, -18818, -419396, 149209, -249504, -168988, 18255, -214490, 154225, 89486, 398587, -90225, -211718, -27974, -247994, -148073, -378172, 19369, 59512, -86763, -36793, 3719, -39631, 119101, 312145, 267814, 115637, 229401, 223905, 130624, 57818, 28510, 63145, 39313, -35329, -326271, 99807, -4563, -140020, -445692, -12529, -86711, 73096, -162043, 77403, -6923, 110234, -166441, -188759, 56610, -98502, -167387, 28913, 65086, 63216, -107634, 1060, 205891, 155308, -64117, -243962, -17450, 12325, -204232, -328314, 128807, -121816, -156747, 205506, 38671, -21957, 41631, -278398, -157165]
9014a57165l7807F947c92290A57595F1833d5217l10981J05937A4105Q3259c76440
9002a20683C2048a20990O0107j94953j56104B549a70434G1095B7976Q0193b41820
8990c5387j12370o2909f1946I6297a68669M5182K3106j56962j02386a7704p4126
8979i1830c8245q3078k15747a64133g0275o8885D5604e4590k52973A23282N4142
8968A77424G8164a89268d9237A60972b27087l3167J23358a5680A98458J45438
8958C43896h5990k96559P3988E9957a18026l10182N7761J41474j37948a49377
8947A54482C6942L1520e2974A61670b98504A46324D8071a115l92155A26173g6297
8935g878B45195B783J44303m4227K30274a25129D85997H3336a02935A75510i41
$$ y = [-157165, -194972, 6947, -392290, 157595, 61833, -45217, -356198, -250261, 14105, 97364, -376440, -120683, 32048, -120990, -60883, -255836, -411940, 2549, -170434, 71095, 27976, 108169, -241820, -35387, -147757, -210666, -61946, 96297, -168669, -123487, -100381, -257343, -359729, -17704, -91830, -38245, -121323, -337070, -164133, -70275, -139160, 45604, -54590, -307563, 123282, 177424, 78164, -189268, -49237, 160972, -227087, -260254, -136896, -15680, 198458, 343896, -85990, -382549, -308561, 59957, -118026, -428208, -370447, -228973, -366921, -149377, 154482, 36942, 68462, -52974, 161670, -298504, 146324, 48071, -1115, -393270, 126173, -76297, -7878, 245195, 2783, 147086, 102859, 333133, -125129, 485997, 83336, -102935, 175510, -941]
8923c04092B32658e40566a10041D22308g2754A31850J44025e175j39860f9032
8912a45308M572E7823K34939j8672C8457Q79065O03229N59924J793471L649944
8902G524090C516758j678209q67206m71416j04754A22916o938B1001M1156b36722
8891B74809F9939P0833m0941C6312a66076c3635j44388N3877j51056B01472f0947
8879A9275j587e2004E6736R67b11077e2793e030A56486L0052E2674a66133j35343
8867c01476Q8240Q3312A7813a90586b137k89724g8927q6516j64114a25182A26484
$$ y = [-304092, 232658, -540566, -110041, 422308, -72754, 131850, 275875, -5175, -145035, -69032, -145308, -140736, 57823, 292762, 274090, 38457, 917522, 1520751, 2080675, 3874146, 7524090, 3516758, 1838549, 971343, 499927, 395173, 122916, 115978, 21001, 62157, -236722, 274809, 69939, 140772, 99831, 36312, -166076, -33635, -178023, -124146, -275202, 201472, -60947, 19275, 17688, -52004, 56736, 57703, -211077, -52793, -5030, 156486, 186538, 52674, -166133, -301476, -213236, -129924, 17813, -190586, -2137, -291861, -78927, -165443, -329557, -125182, 126484]
$$ [...]
##END NTUPLES=NMR SPECTRUM
##END=
