
##TITLE=AC1185_Huila-guadalupe-HGUAH12020_5898926_BD3wntBXHu
##JCAMPDX= 6.0         $$ Bruker NMR JCAMP-DX V2.0
##DATA TYPE= NMR SPECTRUM
##DATA CLASS= NTUPLES
##ORIGIN= BRUKER
##OWNER= Administrator
$$ 1.72 TOPSPIN		Version 2.1
$$ 2012-04-10 10:23:37.843 -0500  Administrator@TOPSPIN
$$ Compression mode = diff/dup
##.OBSERVE FREQUENCY= 400.13188235
##.OBSERVE NUCLEUS= ^1H
##.ACQUISITION MODE= SIMULTANEOUS (DQD)
##.ACQUISITION SCHEME= undefined
##.AVERAGES= 64
##.DIGITISER RES= 22
##SPECTROMETER/DATA SYSTEM= spect
##.PULSE SEQUENCE= noesygpps1d.comp
##.SOLVENT NAME= COFFEE_meoh
##.SHIFT REFERENCE= INTERNAL, COFFEE_meoh, 1, 14.96828
##AUDIT TRAIL= $$ (NUMBER, WHEN, WHO, WHERE, PROCESS, VERSION, WHAT)
$$ ##TITLE= Audit trail, TOPSPIN		Version 2.1
$$ ##JCAMPDX= 5.01
$$ ##ORIGIN= Bruker BioSpin GmbH
$$ ##OWNER= Administrator
$$ $$ C:\Bruker\TOPSPIN/data/COFFEE/nmr/AC1185_Huila-guadalupe-HGUAH12020_5898926_BD3wntBXHu/22/pdata/1/auditp.txt
$$ ##AUDIT TRAIL=  $$ (NUMBER, WHEN, WHO, WHERE, PROCESS, VERSION, WHAT)
(   1,<2012-04-04 19:55:23.453 -0500>,<Administrator>,<TOPSPIN>,<go>,<TOPSPIN 2.1>,
      <created by zg
	started at 2012-04-04 19:43:51.796 -0500,
	POWCHK enabled, PULCHK disabled,
       configuration hash MD5:
       1A 1E CE 29 27 FD 77 03 67 4E F0 E3 C4 B2 CB 90
       data hash MD5: 64K
       9A 43 6B 7A 01 A7 AC 3E E2 7D A3 08 23 4C 79 F4>)
(   2,<2012-04-04 19:55:26.156 -0500>,<Administrator>,<TOPSPIN>,<proc1d>,<TOPSPIN 2.1>,
      <Start of raw data processing
       efp LB = 0.3 FT_mod = 6 PKNL = 1 PHC0 = 0 PHC1 = 0 SI = 128K 
       data hash MD5: 128K
       72 E3 89 12 AC AA DD 14 83 71 6E 41 FD 75 6B 1A>)
(   3,<2012-04-04 19:55:27.421 -0500>,<Administrator>,<TOPSPIN>,<proc1d>,<TOPSPIN 2.1>,
      <pk PHC0 = 35.55725 PHC1 = 0 
       data hash MD5: 128K
       45 6A 35 10 67 E1 1A F6 99 51 4C 64 22 8E AB 0C>)
(   4,<2012-04-04 19:55:27.718 -0500>,<Administrator>,<TOPSPIN>,<proc1d>,<TOPSPIN 2.1>,
      <abs ABSG = 1 
       data hash MD5: 128K
       4C 9A 0F 69 88 BD F6 C4 2B E3 FA 32 02 C6 FB 2B>)
(   5,<2012-04-04 19:55:28.015 -0500>,<Administrator>,<TOPSPIN>,<proc1d>,<TOPSPIN 2.1>,
      <abs ABSG = 2 
       data hash MD5: 128K
       D5 F7 1F 5E 90 D6 3F 74 F9 D4 98 15 25 BB 6A D8>)
(   6,<2012-04-04 19:55:28.140 -0500>,<Administrator>,<TOPSPIN>,<proc1d>,<TOPSPIN 2.1>,
      <abs ABSG = 3 
       data hash MD5: 128K
       95 C0 00 E8 BB 90 B3 39 85 90 55 B3 53 D0 4E 7F>)
(   7,<2012-04-04 19:55:28.296 -0500>,<Administrator>,<TOPSPIN>,<proc1d>,<TOPSPIN 2.1>,
      <abs ABSG = 4 
       data hash MD5: 128K
       0D 3E 6A 5F 30 EE F0 1E 91 89 46 07 A3 2C FF B9>)
(   8,<2012-04-04 19:55:28.359 -0500>,<Administrator>,<TOPSPIN>,<proc1d>,<TOPSPIN 2.1>,
      <abs ABSG = 5 
       data hash MD5: 128K
       BE E5 11 6E CA 84 47 B2 50 89 4D 6E 06 53 C0 2F>)
(   9,<2012-04-04 19:55:28.593 -0500>,<Administrator>,<TOPSPIN>,<audit>,<TOPSPIN 2.1>,
      <user comment:
       ICON-NMR User ID: COFFEE
       data hash MD5: 128K
$$ [...]
##$TP07= 0
##$TPNAME0= <>
##$TPNAME1= <>
##$TPNAME2= <>
##$TPNAME3= <>
##$TPNAME4= <>
##$TPNAME5= <>
##$TPNAME6= <>
##$TPNAME7= <>
##$TPOAL= (0..7)
0.5 0.5 0.5 0.5 0.5 0.5 0.5 0.5
##$TPOFFS= (0..7)
0 0 0 0 0 0 0 0
##$TUNHIN= 0
##$TUNHOUT= 0
##$TUNXOUT= 0
##$USERA1= <user>
##$USERA2= <user>
##$USERA3= <user>
##$USERA4= <user>
##$USERA5= <user>
##$V9= 5
##$VALIST= <valist>
##$VCLIST= <CCCCCCCCCCCCCCC>
##$VD= 0
##$VDLIST= <DDDDDDDDDDDDDDD>
##$VPLIST= <PPPPPPPPPPPPPPP>
##$VTLIST= <TTTTTTTTTTTTTTT>
##$WBST= 2048
##$WBSW= 25
##$XGAIN= (0..3)
0 0 0 0
##$XL= 0
##$YL= 0
##$YMAX_a= 12387403
##$YMIN_a= -5619247
##$ZGOPTNS= <>
##$ZL1= 120
##$ZL2= 120
##$ZL3= 120
##$ZL4= 120
##$ABSF1= 14.96828
##$ABSF2= -5.58425
##$ABSG= 5
##$ABSL= 3
##$ALPHA= 0
##$AQORDER= 0
##$ASSFAC= 0
##$ASSFACI= 0
##$ASSFACX= 0
##$ASSWID= 0
##$AUNMP= <proc_prof1d_extract.lims>
##$AXLEFT= 0
##$AXNAME= <>
##$AXNUC= <1H>
##$AXRIGHT= 0
##$AXTYPE= 0
##$AXUNIT= <>
##$AZFE= 0.1
##$AZFW= 0.1
##$BCFW= 0
##$BC_mod= 0
##$BYTORDP= 0
##$COROFFS= 0
##$CY= 15
##$DATMOD= 1
##$DC= 0
##$DFILT= <>
##$DTYPP= 0
##$F1P= 0
##$F2P= 0
##$FCOR= 0.5
##$FTSIZE= 131072
##$FT_mod= 6
##$GAMMA= 0
##$GB= 0
##$INTBC= 1
##$INTSCL= 1
##$ISEN= 128
##$LB= 0.3
##$LEV0= 0
##$LPBIN= 0
##$MAXI= 10000
##$MC2= 0
##$MEAN= 0
##$ME_mod= 0
##$MI= 0
##$NCOEF= 0
##$NC_proc= -3
##$NLEV= 6
##$NOISF1= 0
##$NOISF2= 0
##$NSP= 0
##$NTH_PI= 0
##$NZP= 0
##$OFFSET= 14.96828
##$PC= 1
##$PHC0= 35.55725
##$PHC1= 0
##$PH_mod= 1
##$PKNL= yes
##$PPARMOD= 0
##$PPDIAG= 0
##$PPIPTYP= 0
##$PPMPNUM= 2147483647
##$PPRESOL= 1
##$PSCAL= 4
##$PSIGN= 0
##$PYNMP= <proc.py>
##$REVERSE= no
##$SF= 400.13000493466
##$SI= 131072
##$SIGF1= 0
##$SIGF2= 0
##$SINO= 400
##$SIOLD= 131072
##$SPECTYP= <>
##$SREGLST= <1H.CDCl3>
##$SSB= 0
##$STSI= 131072
##$STSR= 0
##$SW_p= 8223.68421052632
##$SYMM= 0
##$S_DEV= 0
##$TDeff= 65536
##$TDoff= 0
##$TI= <>
##$TILT= no
##$TM1= 0
##$TM2= 0
##$TOPLEV= 0
##$USERP1= <user>
##$USERP2= <user>
##$USERP3= <user>
##$USERP4= <user>
##$USERP5= <user>
##$WDW= 1
##$XDIM= 131072
##$YMAX_p= 498130043
##$YMIN_p= -379795805
##$CURPLOT= <Network HP LaserJet P1505>
##$CURPRIN= <$Network HP LaserJet P1505>
##$DFORMAT= <normdp>
##$LAYOUT= <+/1D_H.xwp>
##$LFORMAT= <normlp>
##$PFORMAT= <normpl>
##$SURQMSG= 1
$$ End of Bruker specific parameters
$$ ---------------------------------
##NTUPLES= NMR SPECTRUM
##VAR_NAME=  FREQUENCY,     SPECTRUM/REAL,   SPECTRUM/IMAG
##SYMBOL=    X,             R,               I
##VAR_TYPE=  INDEPENDENT,   DEPENDENT,       DEPENDENT
##VAR_FORM=  AFFN,          ASDF,            ASDF
##VAR_DIM=   131072,        131072,          131072
##UNITS=     HZ,            ARBITRARY UNITS, ARBITRARY UNITS
##FACTOR=    0.0627417313425165, 1,          1
##FIRST=     8223.62146879498, 415,          -94491
##LAST=      0,             2883,            -94882
##MIN=       0,             -379795805,      0
##MAX=       8223.62146879498, 498130043,    0
$$ Real data points
##PAGE= N=1
##DATA TABLE= (X++(R..R)), XYDATA
$$ [...]
66890 2283310 2311636 2340409 2370562 2401907 2433098 2463242 2492913 2523128 2554068 2585465 2617579
66879 2617579 2650716 2683987 2715663 2745097 2773646 2803428 2835644 2870223 2906374 2942952 2978719
66868 2978719 3012954 3045933 3078594 3111758 3145800 3180861 3217013 3254087 3291547 3328664 3364867
66857 3364867 3399985 3434198 3467881 3501622 3536276 3572511 3609913 3646737 3681087 3712482 3742005
66846 3742005 3770951 3799739 3828122 3855894 3883095 3909961 3936897 3964083 3990799 4015634 4037824
66835 4037824 4058021 4077253 4095622 4112720 4128956 4145433 4162394 4178573 4192402 4203295 4211681
66824 4211681 4218451 4224633 4230885 4236773 4240954 4242493 4241606 4238863 4234332 4228124 4221164 4214476 4207791 4199641
66810 4199641 4188844 4175259 4159235 4141138 4121553 4101142 4079891 4057067 4032330 4006411 3980270
66799 3980270 3954069 3927513 3900778 3874275 3847529 3819094 3787957 3754626 3720420 3685926 3650663
66788 3650663 3614277 3577532 3541618 3506693 3471689 3435764 3399386 3363476 3327877 3291401 3253429
66777 3253429 3214779 3176845 3140409 3105398 3071079 3036185 2999565 2961404 2923294 2886466 2850386
66766 2850386 2813859 2777054 2741406 2707665 2675173 2643236 2611984 2581272 2549776 2516309 2481698
66755 2481698 2448316 2417607 2388647 2359300 2328368 2296429 2264894 2234508 2204738 2174418 2142964
66744 2142964 2110944 2079604 2050006 2022566 1997068 1972914 1949385 1925760 1901253 1875219 1847881
66733 1847881 1820675 1795137 1771258 1747618 1723464 1699858 1678004 1657089 1635109 1611846 1589778
66722 1589778 1571318 1555869 1540367 1522464 1502362 1481626 1461167 1441003 1421460 1403589 1388026
66711 1388026 1373872 1359255 1342941 1325168 1307062 1289666 1273503 1258553 1244402 1230650 1217286
66700 1217286 1204435 1191737 1178406 1164092 1149333 1134985 1121501 1108855 1096787 1085059 1073867
66689 1073867 1063939 1055440 1046757 1035517 1021396 1006907 994614 984451 974725 964664 954551 944156
66677 944156 933015 922129 913372 906713 899639 889980 878099 865716 853904 843090 833778 826072 819173
66664 819173 812263 805266 798044 789761 780154 770706 763296 757944 752978 747222 741036 735308 730373 725936
66650 725936 721274 715450 708060 699826 691964 684965 678441 671882 665020 657688 650061 642902 636869 631681
66636 631681 626528 621069 615357 609141 602231 595404 589820 585415 580858 575353 569511 564152 559222 554427
66622 554427 550012 546166 542278 537600 532336 527368 523061 518869 514050 508436 502493 496852 491761 487027
66608 487027 482654 479318 477683 477152 475910 472447 466691 459664 452711 447241 444206 443103 442031 439559
66594 439559 436299 433880 432646 431202 428261 424118 419956 416239 412353 407692 402641 398283 395284 393391
66580 393391 392064 391233 390942 390455 388476 384593 379992 376265 373818 371893 369776 367379 364757 361793 358658
66565 358658 356136 355071 355524 356645 357313 356894 355394 353024 349722 345262 339804 334195 329588 326773 325808
66550 325808 326037 326355 325681 323490 320033 316031 312117 308477 304937 301403 298235 295987 294634 293335 291430
66535 291430 289433 288425 288472 288447 287677 286936 287098 287448 286431 283973 281966 282001 283386 284090 283185 281573 280369
66518 280369 279490 278240 276690 275757 276077 277455 279394 281331 282163 280470 276116 271126 268030 267252 266866 264953
66502 264953 261528 258072 256001 255931 257711 260522 263154 264648 264675 263357 261095 258594 256505 254837 253140
66487 253140 251307 249588 247696 244759 240591 236304 233137 231343 230677 231118 232261 232812 231869 230234 229314
66472 229314 229019 228050 226058 224024 222288 219710 215519 210759 206906 203912 200726 197220 194456 193163 192962
66457 192962 193191 193692 194534 195588 196727 197996 199292 200117 200049 199322 198716 198823 199523 200120 199944 198904 197539
66440 197539 196517 196054 195815 195287 194025 191617 187903 183559 180181 179113 180057 181282 181404 180597 179852 179570
66424 179570 179428 179337 179808 181234 183296 185183 186089 185527 183639 181306 179503 178327 177040 175243 173527 172682
66408 172682 172708 173020 173333 173871 174839 176001 176702 176122 173802 170201 166560 163935 162527 162115 162770 164682 167511
66391 167511 170351 172374 173289 173347 173145 173192 173297 172631 170792 168629 167512 167799 168431 168043 166131 163150 159961
66374 159961 157407 156115 156335 157826 159919 161839 163146 163827 163826 162683 160164 157154 155204 154941 155571 156211
66358 156211 156924 157884 158423 157829 156498 155169 153425 150198 145763 142056 140746 141839 144283 146888 148375
66343 148375 147651 144866 141559 139097 137379 135624 133875 132936 133073 133516 133335 132271 130543 128266 125463
66328 125463 122635 120919 121288 123549 126435 128762 130040 129861 127595 123604 120216 120142 123703 128463 131759
66313 131759 132694 131526 128409 123665 118563 114722 112826 112446 112879 113639 114450 115434 117215 120231 123821 126437
66297 126437 126998 125976 125077 125837 128310 130963 131895 130217 126418 121835 118115 116700 117950 120661 123093
66282 123093 124550 125386 125621 124662 122677 121034 120606 120545 119668 118372 118044 119017 120186 120569 120248 119799 119628
66265 119628 120016 121032 122110 122245 120864 118224 115023 112059 110169 109871 110853 112163 113012 113194 112973 112927
66249 112927 113609 114708 114852 113165 111002 111001 113993 117840 119964 120205 120201 120583 120226 118401 116343 115788 116663
66232 116663 117325 116972 116658 117431 118411 117826 115622 113708 113389 113706 113095 111716 110981 111271 111468 110787 109913 109935
66214 109935 110995 112392 113327 113134 111519 109211 107874 108641 110877 112864 113501 112955 111992 111264 111199 111950 113258
66197 113258 114585 115418 115375 114283 112459 110725 109719 109296 108979 108825 109257 110062 110250 109241 107714 106815 106820
66180 106820 106998 106611 105602 104322 103119 102367 102554 103818 105377 105863 104616 102622 101694 102480 103635 103318
66164 103318 101315 99094 97925 97800 98401 100131 103320 106973 109464 110406 110868 111576 111924 111140 109539 107944
66148 107944 106573 105336 104711 105288 106608 107401 107066 106241 105795 105993 106747 107946 109266 110324 111362 113072
66132 113072 115339 116919 117073 116936 118267 121062 123438 123958 123143 122266 121441 119723 116769 113590 111413 110318
66116 110318 109362 107871 106211 105303 105656 106996 108573 109598 109665 109137 109037 110090 111750 112521 111456 109067
66100 109067 106623 104891 103883 103449 103488 103580 102992 101447 99668 98777 99021 99310 98283 95884 93626 92963 93520
66083 93520 93353 91089 87455 84474 83527 84554 86811 89599 92175 93676 93850 93647 94448 96575 98978 100599
66067 100599 101578 102685 103959 104667 104555 104259 104112 103297 100922 97566 94946 94148 94801 95905 96756 96992 96515
66050 96515 95707 95214 95175 95032 94391 93770 94166 96032 98731 100856 101247 100100 98932 98905 99365 98866 97520 97179
66032 97179 98821 100884 101015 98728 95514 92937 91552 91248 91674 92445 93564 95325 97154 97174 94021 88905
66016 88905 84728 83141 83448 84421 85984 88639 92196 95719 98235 99048 97953 95617 93401 92266 92016
66001 92016 91807 91178 90363 89837 89755 89713 89146 88198 87950 89253 91459 93010 93273 93034 93149 93725 94939 97466
65983 97466 101170 104216 104721 103046 101368 101029 101264 100734 99396 98401 98787 100870 104541 109429 114605 118568
65967 118568 119957 118500 115334 112281 110559 109991 109408 107857 105516 103503 102825 103429 104239 104132 102904 101287
65951 101287 100073 99386 98830 98123 97359 96740 96364 96442 97488 99904 103276 106301 107702 107146 105218 102715
65935 102715 100336 98826 98727 99759 100946 101727 102523 103734 104576 103675 100867 97831 96678 98107 101013 103577
65919 103577 104601 104026 102499 100704 99174 98460 98814 99549 99320 97531 95079 93247 92337 91988 92233 93257
65903 93257 94380 94525 93824 93668 94794 96335 97251 97757 98608 99750 100570 101024 101646 102703 104124 106032 108519
65886 108519 110867 111786 110742 108702 107307 107484 108856 110181 110325 109014 106836 104621 102991 102464 103486
65871 103486 105923 108759 110775 111475 111089 109903 108079 106109 104875 104969 106149 107679 109097 110515 112147
65856 112147 113601 113943 112782 111194 110972 112634 114692 115377 114622 113629 112803 111173 108091 104588 102343 101701
65840 101701 101403 100251 98586 97916 99281 102099 104620 105465 104682 103273 101955 100654 99143 97667 96700
65825 96700 96389 96479 96628 96532 95903 94644 93022 91435 90074 89078 88963 90488 93808 97914 101175 102466 101766
65808 101766 99805 97378 95074 93401 92799 93277 94143 94479 94135 94100 95545 98487 101681 103869 104855 105266
65792 105266 105613 105861 105642 104605 102789 100980 100431 101687 103748 104888 104347 102883 101681 101277 101605 102501
65776 102501 103774 105094 106096 106485 106054 105021 104326 104948 106704 108312 108970 109207 109685 109870 108768 106640
65760 106640 105060 105278 107158 109753 112294 114452 116152 117475 118721 120490 123524 127955 132599 135590
65746 135590 136072 134761 132537 129356 125290 121631 119628 118666 117187 115247 114576 115903 117732 118279 117323
65731 117323 115518 113191 110762 109368 109869 111718 113621 114897 115476 115196 114037 112690 111981 111900 111907 112047 112965
65714 112965 114854 116975 118205 117607 114719 110080 105511 103082 103376 105102 106617 107500 108304 109144 109166 107642
65698 107642 105161 103165 102284 101704 100483 98859 97639 96824 95782 94546 93812 93615 93199 92510 92651 94179
65682 94179 96008 96894 97174 97981 99221 99469 97751 94562 91185 88622 87196 86688 86897 88216 91201 95234
65666 95234 98312 98943 97763 96570 96220 96311 96422 96488 96161 95037 93717 93564 95007 96799 97301 95946 93321
65649 93321 90529 88757 88712 89853 90587 89813 88227 87737 89523 92786 95426 95987 94919 93849 93707 93971
65633 93971 93743 92855 91479 89463 86938 85161 85605 88185 91325 93946 96483 99536 102398 103716 103284
65618 103284 102382 102225 102511 101872 99620 96643 94368 93292 93114 94036 96821 101148 104925 106143 104966 103185
65602 103185 102024 101254 100157 98439 96267 94192 93034 93242 94417 95879 97371 98662 98986 97803 95785
65587 95785 94108 93062 92303 92084 92936 94304 94936 94762 95035 96426 98309 100249 102641 105220 106434 105387
65571 105387 103399 102483 103041 104014 104575 104479 103262 100387 96226 92093 89194 87921 87930 88467 88872 89252 90374
65554 90374 92495 94626 95438 94630 92973 91416 90562 90518 90540 89159 85514 80643 76949 76235 78450 82136
65538 82136 85637 87976 88980 88877 87942 86698 86088 86635 87357 86419 83381 80059 78483 78729 79569 80624
65522 80624 82590 85462 87842 88527 87940 87347 87088 86341 84604 82716 81911 82162 82197 81383 80809 81833 84124
65505 84124 86200 87575 89062 90795 91454 90176 88090 86992 87293 88162 88907 89229 88795 87717 87056 87756
65489 87756 89400 90960 92309 93770 94569 93289 90016 86613 84429 82900 80987 78936 77792 77841 78456
65474 78456 79183 80265 82101 84616 87199 89091 89825 89369 87931 85860 83888 83067 83960 85985 88008 89502
65458 89502 90693 91735 92349 92231 91339 89792 87998 86789 86822 87822 88965 90004 91323 92899 94015 94259
65442 94259 94135 94348 95063 96217 97926 100154 102422 104282 105721 106745 106971 106075 104384 102691 101738 102073
65426 102073 103975 106928 109423 109927 108276 105892 104537 104925 106470 108199 109707 111151 112511 113291 113196
65411 113196 112695 112488 112650 112767 112643 112301 111565 110373 109239 108520 107351 104497 100401 97155 95963 95853
65395 95853 95538 95285 95888 96833 96975 96494 96725 98128 99641 100092 99252 97441 95111 93058 92126 92372 93134
65378 93134 94081 95526 97553 99524 100611 100224 97973 94059 89864 87207 86689 87510 89025 91366 94145
65363 94145 95969 96243 96421 98179 101053 103131 103545 102936 101904 100581 99679 100235 101768 102090 99769 95906
65347 95906 92793 91655 92301 94077 96183 97693 98229 98357 98644 98815 98565 98624 99916 101956 103300 103579 103951
65330 103951 105273 106897 107872 108459 109708 111985 114697 117372 120377 124348 129089 133296 135605 136092 136379
65315 136379 137893 140326 142501 144482 147693 152743 158274 162757 166471 170660 175354 179448 182878 187283
65301 187283 193913 201932 209681 216966 224917 233699 241548 246621 249020 250119 250285 248384 243703 237330
65287 237330 230941 224896 218412 211210 203967 197231 190877 184805 179228 173875 167795 160608 153357 147402
65273 147402 142841 138615 133871 128693 123689 119398 115999 113228 110673 108348 106641 105569 104578 103383
65259 103383 102347 101618 100685 99521 99332 101024 103496 104801 104671 104419 104360 103020 99466 94940 91226 88475
65243 88475 85739 82946 81189 81278 82820 84529 84990 83577 81314 80298 81394 82847 82218 79555 77522
65228 77522 78202 80836 83149 83986 83929 83913 84177 84388 84082 82890 80873 78842 77945 78675 80346 81692 81892
65211 81892 81017 79743 78858 78911 79985 81640 83234 84425 85261 85664 85149 83472 81479 80727 81929 84248
65195 84248 86466 88365 90244 91456 90663 87890 85327 85191 87328 89733 91093 91793 92590 93454 94142 94966
65179 94966 96316 97925 99208 99972 100307 100160 99486 98500 97290 95569 93348 91353 90051 88726 86530 84153
65163 84153 83253 84196 85578 86287 86848 88050 89319 89449 88330 86907 85705 84326 82416 80369 78889 78217
65147 78217 78015 77868 77807 78176 78804 78554 76380 72939 70443 70687 73731 78598 84173 88937 91032 89832
65131 89832 86954 84676 83746 83581 83948 85040 86191 86090 84576 83037 82570 82656 82050 80211 77508 74802
65115 74802 73209 73493 75130 76549 76768 76302 76109 76303 76457 76616 77200 78165 78919 79061 78782 78537 78651 79230
65097 79230 80132 80970 81221 80519 79033 77662 77610 79396 82356 85409 88101 90508 92406 93337 93459 93608 94295
65080 94295 95225 95927 96183 95622 93705 90628 87788 86838 88458 92104 96434 99852 101423 101710 102133 103051
65064 103051 103120 101104 97671 94673 93069 92348 91659 90755 89953 89890 91174 93623 95918 96719 96187 95823 96744
65047 96744 98666 100668 102414 104358 107053 110498 113956 116424 117482 117785 118588 120833 124708 129716 134879
65032 134879 139291 143117 147914 155254 164786 174227 181440 186221 189936 193870 198260 202547 206086 208600
65018 208600 210158 210806 210275 208251 204910 200971 197152 193773 190892 188416 185906 182576 177834 171721 164649
65003 164649 156966 149124 142033 136636 132948 129945 126643 123034 119732 116992 114464 111763 108923 106317
64989 106317 104386 103291 102467 100694 97257 93097 90193 89583 90585 92134 93960 95861 96763 95756 93698
64974 93698 92505 92703 92771 91225 88456 86001 84815 84836 85611 86586 87076 86637 85475 84171 83108 82424 82335
64957 82335 83204 85327 88688 92646 95890 97220 96566 94863 92819 90494 88338 87740 89603 92872 95433
64942 95433 96394 96752 97864 99959 102127 103043 101677 98203 94509 92930 93849 95100 94384 91804 89264 87765
64926 87765 86502 84733 83263 83176 83880 83633 81894 80033 79464 79968 80275 79576 77921 75884 74556 75253 78234
64909 78234 81855 83827 83271 81011 78248 75877 74799 75564 77408 78665 78612 78139 78246 78703 78779 78591 78999
64892 78999 80489 82636 84474 85150 84527 83339 82430 81857 81217 80696 80931 81757 82142 81720 81446 82184 83502
64875 83502 84365 84203 82864 80523 78339 78131 80364 83233 84686 84652 84424 84747 85662 87376 89777 91638
64859 91638 91867 91366 92274 95340 99226 102237 103473 102495 99428 95710 93341 92846 92960 92603 92105 92135 92518
64842 92518 92657 92258 91104 89013 86597 85326 86207 88834 92024 94696 95826 94496 90810 86323 82876
64827 82876 81197 80950 81600 82737 83914 84766 85188 85121 84400 83105 81892 81619 82643 84494 86182 86979 87054
64810 87054 87070 86946 85647 82897 80454 80455 82615 84432 84379 83556 83683 84755 85594 85720 85537 85226 84548 83583
64792 83583 82853 82779 83432 84570 85560 85769 85631 86792 90357 95211 98835 99713 98346 96030 93540 91254
64776 91254 89809 89871 91233 92604 92713 91565 90235 89269 87926 85641 83688 84144 87117 90267 91572 91371
64760 91371 90911 90107 88200 85910 85094 86123 87159 86724 85851 86703 89652 92794 94251 93988 93051 91749
64744 91749 89419 85879 82290 80168 79924 80820 82114 83664 85484 87273 88576 89157 89236 89551 90927 93261
64728 93261 95227 95686 95190 95202 95917 96037 94832 93099 91470 89174 85632 82283 81290 82812 84873 85930
64712 85930 86398 87553 89915 93025 95978 97786 97784 96197 94117 92673 92257 92466 92560 92067 91189 90501 90110
64695 90110 89425 88106 86801 86372 86610 86423 85283 83889 83277 83685 84396 84414 83361 81991 81709 83217 85744
64678 85744 87954 89350 90378 91477 92723 94201 95921 97363 97900 97886 98565 100546 102973 104511 104606 103361
64662 103361 100837 97204 93363 90679 89833 90262 90877 91153 91377 91956 92774 93343 93415 93172 92926 93010 93896 95792
64644 95792 97860 98576 97485 96089 96096 97087 96941 94604 91453 89579 89551 90375 91032 91378 91872 92983 94724
64627 94724 96442 97146 96360 94580 92798 91786 91944 93370 95726 98241 100194 101328 101715 101541 101261 101544
64611 101544 102637 103989 104945 105566 106274 106891 106733 105738 104867 104982 105682 105675 104211 101869 99991 99493 100069 100385
64593 100385 99200 96669 94495 94449 96654 99615 101949 103573 104978 105921 105583 103834 101510 99251 96871
64578 96871 94309 92548 92769 94771 96992 98157 98269 97817 96736 94763 92464 91143 91467 92566 92937 92215
64562 92215 91700 92924 95869 98854 100151 99446 97769 96456 96436 98130 101425 105566 109323 111512 111477 109315
64546 109315 105793 101983 98728 96442 95316 95473 96701 98290 99476 100049 100361 100826 101603 102601 103542 104158
64530 104158 104580 105324 106510 107317 106834 105442 104687 105529 107307 108880 110241 112288 115125 117364 117391 114942
64514 114942 111224 107825 105787 105368 106084 106858 106586 104926 102517 100342 98969 98442 98650 99593 101414 104229
64498 104229 107701 110748 112241 112360 112680 114212 115875 115882 114283 112747 111834 110236 107432 105355 105852 107650
64482 107650 107858 106032 104600 105095 106087 105758 104766 105028 106688 107984 107814 106934 106448 106292 105714 104457 102899
64465 102899 101414 100119 99190 99011 99867 101504 103078 103757 103553 103388 103965 104640 103846 100855 96862 94041
64449 94041 93601 94859 96134 96338 95747 95391 95874 96875 97842 98919 100766 103395 105631 106219 105217 103749
64433 103749 102447 100890 98889 97563 98272 100731 103041 103786 103499 103788 105509 108156 110662 112314 112982
64418 112982 112859 112110 110753 109007 107703 107880 109621 111552 111999 110591 108413 106603 105276 103928 102473
64403 102473 101440 101247 101645 102042 102199 102385 102907 103742 104700 105638 106319 106377 105850 105579 106462 108269 109669 109645
64385 109645 108474 107140 106209 105608 105188 105037 105375 106378 108010 109808 111002 111069 110170 108990 108264 108355 109039
64368 109039 109724 110139 110690 111652 112347 112029 111588 113224 117760 123246 127007 128359 128405 127897 126688 125044 124095
64351 124095 124513 125675 126630 127405 128814 131201 133708 134858 133976 131964 130354 129512 128393 126301 124038
64336 124038 122557 121259 118844 115532 113106 112642 113242 113353 112466 111239 110699 111583 113703 115560 115317 112680
64320 112680 109464 107959 109067 112065 115587 118505 120415 121692 122924 124112 124696 124403 123684 123321 123935
64305 123935 125676 127805 128762 127554 125130 123540 123549 123993 123698 122967 122670 122935 123631 125284 128376 132047 134574
64288 134574 135229 135021 135555 137475 140007 141702 141745 140724 139926 139825 139768 139279 138947 139452 140333 140629 140481 141186
64270 141186 143514 146610 148853 149460 148996 148495 148419 148646 149311 151055 154005 156873 157892 156749 154842 153536
64254 153536 152956 152818 153477 155382 158126 160836 163129 165088 166742 168309 170453 173433 176258 177654 177661 177304
64238 177304 176796 175250 172492 169953 169068 169642 170727 172546 176339 182289 188618 193215 195567 196688 197657
64223 197657 198979 201077 204443 209002 213908 218382 222329 225834 228632 230595 232235 233913 234911 234151 231746
64208 231746 228958 226589 224274 221478 218392 215592 213543 212650 212992 213647 213061 210568 206972 203349 199987
64193 199987 196904 194582 193580 193935 195373 197466 199271 199751 199220 199524 201910 205419 208236 209928 211397
64178 211397 213272 215533 218275 221586 224862 227348 229295 231576 234316 236959 239614 243106 247477 251579
64164 251579 254560 256793 258835 260304 260534 259751 258886 258349 257554 255768 253161 250814 249514 248633 246665 243095
64148 243095 239234 236754 235829 235389 234842 234733 235810 238196 241407 244487 246193 245886 244375 243272 243373 244229
64132 244229 245252 246465 248045 249854 251761 253893 256321 258920 261756 265190 269408 274133 278782 282590
64118 282590 284749 285030 284184 283121 281703 279112 275457 272263 271050 271961 274021 276255 278439 281176 285372
64103 285372 291172 297511 303316 309069 316357 325811 336390 346888 357206 367762 378536 389343 400357
64090 400357 411757 423432 435631 449367 465461 483433 501786 519145 534845 548876 561644
64079 561644 573319 582967 588773 589799 587279 583654 580367 576888 571585 563168 551493 537457 522204
64066 522204 506458 490784 476291 464274 454920 447027 439473 432497 427053 423380 420763 418364 415843
64053 415843 413425 411730 411132 410938 409853 407844 406880 408851 413053 416800 418530 419365 421447 425655 431506
64038 431506 438545 446944 456830 467737 479134 491256 504923 520327 536320 551309 564779 577417
64026 577417 589738 601151 610594 617563 622112 624355 624525 623200 620870 617246 611452 603004 592528 581615
64012 581615 571930 564044 556971 549333 541070 533402 526893 520546 513555 507072 503087 502068 502963 505285
63998 505285 509704 516359 523929 531097 538009 545586 554123 563266 572774 582552 592483 603047 615765 631954
63984 631954 650997 670631 689149 706734 724556 743353 763234 784121 805638 826851 846806
63973 846806 865204 882060 896927 909260 919587 929492 940019 950747 960917 970884 981767 994048
63961 994048 1007329 1021282 1036036 1051631 1067860 1084762 1102552 1120728 1137854 1152620 1164770
63950 1164770 1174800 1183199 1190347 1196797 1203342 1210942 1220577 1232739 1246987 1262470 1279032 1297371
63938 1297371 1318083 1341200 1366815 1395327 1426823 1461063 1498570 1540922 1589271 1643265 1701985
63927 1701985 1765121 1832392 1902770 1975672 2052530 2135808 2226522 2323770 2426638 2535418 2650965
63916 2650965 2774081 2905858 3047607 3199968 3362959 3537347 3725287 3929266 4151070
63907 4151070 4392178 4654622 4941114 5254996 5600446 5982260 6405281 6874602 7396349
63898 7396349 7977045 8621474 9332007 10110749 10961410 11887606 12889138 13960468 15092445
63889 15092445 16274589 17495877 18744282 20005911 21263875 22497329 23681583 24789407
63881 24789407 25793090 26667051 27390648 27949660 28335189 28541245 28563503 28399843 28051123
63872 28051123 27521491 26819301 25958940 24961564 23853014 22660164 21408526 20121939 18822588
63863 18822588 17530051 16260336 15026665 13841562 12717712 11666106 10693233 9800324
63855 9800324 8985280 8244990 7576013 6974117 6434248 5951065 5519080 5132432 4785249
63846 4785249 4472609 4190912 3937089 3707804 3499685 3310039 3136840 2978100 2831738
63837 2831738 2696183 2570589 2454029 2344740 2240675 2140790 2045303 1954511 1867785 1784023
63827 1784023 1702764 1624512 1550122 1480215 1414924 1353667 1295248 1238719 1184228 1132590 1084094
63816 1084094 1038302 995069 954988 918460 885018 854067 825748 800407 777585 756218 735602
63805 735602 715515 695763 676472 658738 643966 632276 622236 612519 603227 595395 589866 587014
63793 587014 586772 588243 589738 590035 589542 589670 591158 593453 595569 596904 597065 595383 591064 583901 574742
63778 574742 565002 555319 544724 531616 515759 498759 482273 466484 450968 436285 423504 412404
63766 412404 401419 389609 377613 366359 355868 345914 336857 328974 321643 314203 307277 302183 299041
63753 299041 296373 292845 288700 285011 281920 278227 272845 266284 260294 256007 252886 249773 246486 243621
63739 243621 241116 238171 234839 232466 231764 231362 229407 226209 224089 224638 226930 228522 227581 224133 219918
63724 219918 217072 216308 216355 215559 213753 211906 210347 208416 205778 202825 199660 195907 192044 189672 189613 190602
63708 190602 190797 189913 188908 188165 187259 186341 186454 188048 190057 191042 190874 190734 191579 193091 194246 194588 194534
63691 194534 194488 194228 193524 192901 193072 193741 193726 192432 190614 189487 189688 191266 193944 196991 199567 201805 204970
63674 204970 209849 215364 219548 221724 223067 225138 228449 232370 235895 238389 240047 241721 244078 246923
63660 246923 249490 251156 251707 251268 250449 250256 251220 252632 253161 252395 251463 252007 254658 258479 261837 263943
63644 263943 265554 267795 270218 270655 267548 262064 257282 255389 256083 257386 257383 255270 251514 247352 243874
63629 243874 241378 239555 238046 236627 235165 233785 232911 232859 233548 234828 236770 239326 242155 245192 248901
63614 248901 253482 258315 262821 267342 272419 277647 282185 285934 289145 291130 290787 288504 286251 285337 285037
63599 285037 283837 281187 277655 274281 272136 271588 271472 269954 266873 264353 264349 266425 268826 270932 273415
63584 273415 276483 279385 281726 284104 287232 291242 296084 301838 308344 315276 322973 332461 343987 356040
63570 356040 366732 376209 386962 401431 419662 439622 459432 478749 498166 518181 539293 562573
63558 562573 589243 619574 652642 687275 722860 759195 796015 832807 868590 901608 929689
63547 929689 951458 967021 977200 982408 982784 979241 973636 967640 961756 955544 948392 939778 929265
63534 929265 916912 903607 890283 876541 860677 841589 820171 798143 775874 752430 727848
63523 727848 704241 684066 667990 655005 643857 633621 623538 613369 603739 595383 588189 581621
63511 581621 575787 571312 568516 567610 569401 574636 582682 592010 602173 614309 629456 647384 667358
63498 667358 689053 712315 736943 763079 790991 820172 849703 879815 911773 945438 978188
63487 978188 1007205 1031763 1052144 1067561 1076902 1080960 1082113 1081799 1079730 1075686 1070589 1065340 1059690
63474 1059690 1052782 1043941 1032351 1016687 995811 969679 939342 906362 872313 838280 804364 769851
63462 769851 734232 698143 663334 631628 603652 578402 554393 531436 510846 493502 478282
63451 478282 463139 447404 432228 419026 408420 400530 395120 391076 386672 380889 374008 366795 359917
63438 359917 354378 351438 351292 352480 353404 354009 355272 357503 360152 363129 367283 373213 380210 386751 391730
63423 391730 395059 397499 400214 404199 409614 415519 420390 423002 423022 421000 417960 414810 411816 408525 404294
63408 404294 399058 393665 389423 387304 387506 389573 392812 396592 400491 404377 408369 412677 417427 422510
63394 422510 427559 432183 436424 440930 446434 452988 459908 466537 472917 479665 487466 496758 507656 519996
63380 519996 533644 548888 566267 585786 606605 627916 650115 674853 703765 737099 773442
63369 773442 810840 848379 886776 927339 970596 1016230 1063941 1113369 1163152 1211190 1256402
63358 1256402 1299172 1339207 1373911 1400234 1417640 1427921 1432395 1430882 1423670 1412805 1400635 1388092
63346 1388092 1375213 1362262 1349068 1333751 1313391 1286308 1253202 1216061 1176471 1135044 1092120
63335 1092120 1048726 1006735 967855 932501 900012 870006 842986 819371 798550 779422 761487
63324 761487 745011 730633 719379 712543 710562 712177 715651 720850 729181 741270 755678 770602 786129
63311 786129 803987 825335 849675 875972 904105 934832 968709 1005410 1043946 1083247 1122657
63300 1122657 1162204 1202249 1242280 1279839 1311291 1334448 1350366 1361840 1370031 1373328 1369935 1360747
63288 1360747 1348768 1336087 1322503 1307075 1289750 1270859 1249910 1225912 1198658 1168912 1137439
63277 1137439 1104556 1070604 1036155 1001485 966452 931261 896913 864477 834171 805513 778131
63266 778131 751971 726983 703180 681086 661608 645249 631700 620301 610546 602009 594231 587012
63254 587012 580582 575103 570164 565154 560050 555462 551890 549275 547269 545578 543983 542381 540981 540108
63240 540108 539563 538565 536651 534382 532689 531651 530428 528367 525650 522786 520077 517812 516366 515592 514589
63225 514589 512817 511187 511155 512691 514051 513954 513253 513744 515829 518157 519502 520290 522077 526000 531895 538601
63209 538601 544973 550813 556898 563937 571582 578753 584887 590525 596644 603804 611986 620799 629641 638129
63195 638129 646599 655814 665834 675573 683994 691595 700292 711863 726753 744184 762870 781563 799444
63182 799444 816478 833393 851203 870700 892325 916293 942665 971287 1001747 1033538 1066416
63171 1066416 1100601 1136426 1173628 1211193 1248200 1284773 1321807 1359615 1397108 1432693 1465879
63160 1465879 1497665 1529349 1561370 1593438 1625217 1656186 1685112 1710475 1731601 1748712 1761620
63149 1761620 1769121 1770123 1764563 1752505 1733087 1705632 1671521 1633685 1594131 1553201 1511523 1471388
63137 1471388 1435284 1403879 1376279 1351693 1330007 1311227 1295360 1282828 1274379 1270601 1271900 1278614
63125 1278614 1290453 1305945 1323151 1341153 1360483 1382104 1406240 1432130 1458533 1484478 1509840
63114 1509840 1535217 1561089 1587181 1612802 1637487 1660981 1682813 1702312 1718970 1732484 1742545
63103 1742545 1748792 1750758 1747641 1738399 1722424 1700009 1672069 1639742 1604345 1566979 1527817 1486509
63091 1486509 1443880 1402386 1363921 1327874 1292497 1257680 1224974 1195148 1167471 1141714 1119205
63080 1119205 1101057 1086520 1074026 1062852 1052772 1042929 1032507 1022214 1013716 1007354 1001450 994359
63068 994359 986530 979930 975803 973690 972619 972630 974657 979095 984982 990763 995495 999063 1001659 1003670 1006058
63053 1006058 1010209 1016901 1025415 1033884 1040666 1045567 1049723 1054121 1058432 1061816 1064845 1069576 1077035 1085479
63039 1085479 1092418 1097982 1104933 1115059 1126824 1137205 1144934 1151191 1157715 1165102 1172738 1179661 1185419
63026 1185419 1190482 1195871 1202237 1209325 1216401 1223097 1229844 1237676 1247580 1259771 1273616 1288553 1304921
63013 1304921 1323458 1344083 1365810 1387961 1410923 1435505 1462027 1490227 1519750 1550695 1584101
63002 1584101 1621663 1664095 1709702 1755510 1800276 1845750 1894680 1948296 2006005 2066431 2128050
62991 2128050 2189872 2252643 2318865 2390395 2466144 2543014 2618937 2694152 2769670 2845477 2920387
62980 2920387 2992860 3061745 3126937 3189628 3251620 3314158 3377457 3440888 3502914 3561111 3613168
62969 3613168 3658087 3695736 3725124 3743922 3750054 3743052 3723406 3691273 3646499 3589604 3522116 3446222
62957 3446222 3364672 3280781 3197659 3117147 3039928 2966858 2899773 2840696 2790427 2748219 2712856
62946 2712856 2684039 2662865 2650865 2648451 2654361 2666928 2685728 2711431 2743910 2781240 2820959 2861680
62934 2861680 2902861 2943873 2984531 3026110 3070066 3115302 3158112 3195700 3228577 3258501 3285066
62923 3285066 3305685 3318219 3321993 3316341 3299782 3271158 3230656 3179362 3118550 3049525 2973232 2889751
62911 2889751 2799062 2702615 2603328 2503707 2404792 2307346 2213039 2123673 2039802 1960862 1886329
62900 1886329 1816230 1750943 1690943 1636411 1586738 1540850 1498325 1459630 1424843 1392823 1362273
62889 1362273 1333156 1306389 1282527 1261344 1242361 1225151 1209398 1195261 1183419 1174104 1166179 1157681
62877 1157681 1147240 1134790 1121319 1108284 1096768 1086529 1076155 1064657 1052573 1040971 1029963
62866 1029963 1019044 1008480 999170 991090 982936 973755 964190 955696 949040 943855 939171 934008 927887
62853 927887 921297 915552 911786 910058 909508 909141 908222 906221 903014 899340 896571 895476 895309 894604 892953
62838 892953 891483 891392 892605 894283 896028 897890 899616 900809 901618 902414 902951 902682 901748 900520 898328 894074
62822 894074 888366 883505 880530 877652 872652 865816 859273 854282 850542 847709 846121 845894 846372 846690 846293
62807 846293 844873 842305 838698 834188 828795 822651 816061 809172 802055 795200 789209 783847 778430 773484
62793 773484 770672 770238 769852 767295 763238 759889 757750 755498 752613 750231 749409 750011 751501 753438 755075
62778 755075 755736 755857 756576 758100 759602 760843 762765 766161 770739 775782 780787 785297 789098 792859 797559
62763 797559 802892 807204 809560 811201 814401 820295 828045 835708 841791 846331 850616 855751 861859 868865
62749 868865 877128 886527 895842 904265 912833 922997 934534 946518 959687 975679 994171 1013187
62737 1013187 1032471 1054068 1078940 1105429 1132224 1160533 1191814 1225403 1260497 1298944 1343721
62726 1343721 1395248 1451094 1509040 1568936 1631985 1699770 1773848 1854910 1942134 2034232 2130987
62715 2130987 2233010 2340266 2451675 2565803 2680954 2794756 2904681 3009039 3106683 3195648
62705 3195648 3272722 3334460 3378321 3403037 3408492 3395298 3364223 3316050 3251938 3173538 3082652
62694 3082652 2981305 2872179 2758241 2641660 2523754 2406149 2290959 2179479 2071752
62685 2071752 1968068 1869907 1778691 1694527 1616891 1545531 1479919 1418887 1361915 1309875 1263481
62674 1263481 1221928 1184286 1151128 1123247 1099572 1078148 1058638 1042037 1028138 1015144 1002010
62663 1002010 989698 979820 973287 970390 970835 973393 976716 980857 987012 995674 1006250 1018675 1034017
62650 1034017 1052938 1074812 1099076 1126451 1157925 1193270 1231466 1272232 1316479 1365371 1419345
62639 1419345 1477929 1540373 1606640 1677651 1754242 1836088 1922201 2012081 2105452 2200888 2295746
62628 2295746 2387600 2474892 2555969 2628506 2690384 2740312 2777066 2798834 2803906 2791594 2762211
62617 2762211 2716845 2657636 2587529 2508948 2423004 2330501 2233233 2133710 2033914 1934998 1837973
62606 1837973 1744014 1654050 1568621 1488260 1413606 1344891 1281624 1223121 1169240 1120182 1075422
62595 1075422 1033334 992508 953347 917636 886334 858540 832968 809582 788946 770581 753064
62584 753064 735563 718368 702077 687125 673997 662925 653188 643491 633177 622458 611603 600812
62572 600812 590851 582782 576806 572284 569046 567669 568177 569465 570457 570902 570677 569416 567511 566501 567576
62557 567576 570363 573941 578292 583900 590700 598506 607944 619760 633422 647432 660936 674149 687420
62544 687420 701066 716239 734785 757600 783749 811716 841067 872482 906654 943774 983875
62533 983875 1027042 1073187 1122085 1173857 1229018 1287529 1347880 1407707 1465534 1521264 1574400
62522 1574400 1622319 1661396 1689826 1708440 1718514 1719843 1711574 1693986 1668309 1635220 1594711 1547564
62510 1547564 1496080 1442948 1389865 1337433 1285967 1236041 1188443 1143720 1101663 1061265 1021595
62499 1021595 982920 946820 915003 887968 864735 843624 823376 803858 785910 770306 756647
62488 756647 743380 729171 714267 700256 688395 678365 668847 659127 649772 641813 635768 631670 629514
62475 629514 629066 629406 629319 628414 627626 628560 632464 639654 649355 659962 670025 679521 690032 703334 719839
62460 719839 738624 758883 781025 806285 835460 868202 903453 940345 978633 1018558 1060600
62449 1060600 1105305 1152968 1203271 1255298 1307760 1358946 1406739 1449473 1486933 1519698 1547032
62438 1547032 1566160 1574413 1571721 1560335 1542554 1519360 1490724 1456204 1415544 1369839 1322030 1275166
62426 1275166 1230010 1185323 1140552 1097123 1056779 1019815 985572 953827 925049 899856 878649
62415 878649 861183 846164 831965 818044 804887 792435 779839 767418 757593 752616 752039 753424
62403 753424 754891 755865 756068 755388 754766 755955 760052 766922 775862 785880 795420 803081 809065 815130 822704
62388 822704 831669 841339 851832 863761 876907 889881 901225 910467 917919 923524 926308 925236 920405
62375 920405 912714 902270 887962 869207 847547 825749 805621 787339 770412 754318 738373 722079
62363 722079 705859 690739 677158 664821 653802 644963 638928 635359 633559 633105 633511 633958 634009 634311
62349 634311 636165 640583 647901 657747 668976 680036 689961 698937 707769 717128 727408 738706 750543
62336 750543 762118 773372 785317 798613 812218 824268 834052 842258 849325 854606 857562 858962 860195
62323 860195 861784 863168 863786 863967 864868 867913 874102 883385 894653 906757 919623 934237 951677 972578
62309 972578 997480 1027025 1061369 1099800 1141464 1186496 1236102 1291562 1353306 1420822 1492952
62298 1492952 1568183 1644979 1722212 1799193 1875058 1947965 2014971 2072900 2119658 2154919 2179638
62287 2179638 2194932 2201395 2199083 2187602 2166181 2134283 2092664 2043477 1988970 1930348 1868261 1803844
62275 1803844 1738573 1673432 1609155 1547215 1489577 1437157 1389191 1344310 1301525 1260062 1219279
62264 1219279 1179437 1141787 1107175 1075031 1044347 1015152 988384 964814 944852 928926 917019
62253 917019 907958 900071 892689 886421 882032 879684 879126 879750 880360 879816 878323 877323 877661 878376 877888 875871
62237 875871 873362 871318 869833 868717 868048 867713 866870 864535 860874 857521 856296 857644 860590 864194 868719
62222 868719 875195 884151 895155 907543 921177 936307 952897 970423 988476 1007404 1028149 1051347
62210 1051347 1076851 1104302 1133908 1166239 1201500 1239549 1280707 1325891 1375712 1429905 1487925
62199 1487925 1549549 1614444 1681610 1749838 1818459 1887002 1954225 2018009 2076107 2126452 2166746
62188 2166746 2194571 2208615 2209797 2200758 2183916 2159833 2127540 2086353 2036990 1980782 1918520 1851032
62176 1851032 1780560 1710371 1642648 1577790 1516160 1459279 1408381 1362766 1320853 1282302 1247925
62165 1247925 1217905 1191469 1168240 1148616 1132655 1119678 1109321 1101915 1097368 1094450 1091804 1089189
62153 1089189 1087368 1087160 1088867 1092182 1096353 1100743 1105319 1110297 1115344 1119705 1123179 1126393 1130002 1134215
62139 1134215 1139218 1145381 1152666 1160403 1168049 1175810 1184193 1193351 1203193 1213915 1226073 1240245 1256625
62126 1256625 1274767 1293833 1313474 1334353 1357288 1381928 1406883 1431341 1455981 1482222 1511021
62115 1511021 1542552 1576493 1612410 1650292 1690868 1735023 1782892 1834006 1888154 1945404 2005290
62104 2005290 2066618 2128015 2187787 2243242 2291347 2330519 2361037 2383510 2398003 2405026 2406139 2402690
62092 2402690 2394685 2381663 2363974 2342547 2318071 2291149 2262620 2233064 2202668 2172232 2143560
62081 2143560 2118026 2095464 2075248 2057632 2042994 2030558 2019067 2008169 1997987 1987999 1977768
62070 1977768 1968284 1961017 1955904 1951912 1949425 1950196 1954553 1960420 1965980 1971980 1980535 1992745 2008349 2026649
62056 2026649 2046580 2066553 2085589 2104631 2125962 2151154 2179895 2210658 2242144 2274239 2307929
62045 2307929 2344343 2383926 2426687 2472973 2523303 2577285 2633373 2689948 2746139 2801407 2855089
62034 2855089 2906816 2956884 3005843 3054266 3103284 3154567 3208875 3264910 3320263 3373356 3424117
62023 3424117 3473196 3521320 3569291 3617922 3667851 3719694 3774265 3832173 3893295 3956948 4022481
62012 4022481 4089534 4158058 4228542 4301885 4378518 4457799 4538695 4620668 4703281 4785313 4865195
62001 4865195 4942223 5016323 5086479 5150448 5206582 5255335 5298483 5337392 5372405 5403287 5429596
61990 5429596 5450951 5467561 5480367 5490317 5497845 5503508 5508754 5515388 5524344 5535434 5548103 5561940
61978 5561940 5576697 5592470 5609815 5629075 5649601 5670244 5690508 5710552 5730100 5748306 5764874
61967 5764874 5780352 5794965 5808126 5819692 5830675 5841708 5851513 5858044 5860715 5860410 5857716 5852655 5846236
61954 5846236 5840688 5837383 5835394 5832769 5828539 5822917 5816340 5809124 5801690 5794440 5787683 5782169 5779159 5779188
61940 5779188 5781029 5782649 5783200 5783499 5784679 5786929 5789526 5791432 5791806 5790483 5788105 5785348 5781961 5777025 5770283
61925 5770283 5762526 5754257 5744498 5731644 5715463 5697673 5680256 5663482 5645905 5626153 5604252 5581069
61913 5581069 5556965 5531558 5504657 5476795 5448593 5420073 5390844 5360723 5329946 5298971 5268160
61902 5268160 5237302 5205358 5171212 5134943 5097910 5061379 5025592 4990497 4956603 4924448 4893787
61891 4893787 4864071 4835308 4807799 4781584 4756952 4734793 4715283 4696826 4677958 4660053 4646316
61880 4646316 4637772 4632123 4627284 4624254 4625094 4629515 4635419 4642194 4651582 4665294 4683432 4705688 4732786
61867 4732786 4765825 4804839 4848863 4897278 4950647 5010211 5076859 5150843 5232506 5322992 5423837
61856 5423837 5535967 5659790 5796560 5949048 6120321 6312372 6526533 6764730 7029530
61847 7029530 7323256 7647960 8006206 8400958 8834500 9307952 9821787 10376051 10969970
61838 10969970 11601868 12269080 12966452 13683949 14405780 15111290 15775161 16366535 16850630
61829 16850630 17194939 17376255 17383405 17216014 16883478 16405180 15808773 15125151 14383434 13609221
61819 13609221 12825006 12049832 11298008 10578922 9898433 9260260 8666361 8117037 7611456
61810 7611456 7148142 6724930 6338794 5986187 5663752 5368875 5099742 4854864 4632348
61801 4632348 4429613 4244062 4073980 3918386 3776003 3644967 3523905 3412729 3311786
61792 3311786 3220542 3137682 3062219 2993688 2931382 2874351 2822416 2776267 2736083 2700649 2668387
61781 2668387 2638666 2611511 2586631 2563573 2542517 2524091 2508593 2496133 2487299 2482672 2481549 2482094
61769 2482094 2483030 2484412 2486595 2489586 2494067 2501901 2514215 2529341 2543989 2556690 2569214 2584417 2603634
61756 2603634 2626627 2653095 2683160 2716663 2752994 2791970 2834357 2881313 2933628 2991617 3055207
61745 3055207 3123795 3196481 3273096 3354941 3443951 3541113 3646218 3759182 3880907 4012370
61735 4012370 4153363 4302876 4460832 4629104 4810772 5008405 5222801 5453129 5698599
61726 5698599 5960401 6241917 6546893 6877805 7236420 7625330 8048181 8508802 9011249
61717 9011249 9560608 10162454 10821007 11538709 12318098 13163158 14078129 15065609 16126198
61708 16126198 17258623 18458484 19716714 21019520 22348402 23677675 24970785 26179754
61700 26179754 27249196 28122210 28746063 29078629 29095837 28796742 28202736 27351727 26291330
61691 26291330 25073653 23751121 22372268 20978204 19601242 18265725 16989335 15783657
61683 15783657 14654744 13604912 12634864 11744025 10929245 10184703 9504228 8883275 8318075
61674 8318075 7803739 7334578 6906067 6515205 6158987 5833826 5536703 5265625 5018394
61665 5018394 4791908 4583324 4391080 4214163 4051191 3900886 3762737 3636351 3520611
61656 3520611 3414095 3315782 3224668 3139267 3058359 2981897 2910491 2844182 2782234 2723622 2667175
61645 2667175 2611939 2558349 2508520 2464194 2424548 2386896 2349309 2311631 2274308 2237584 2201882
61634 2201882 2167671 2134584 2101640 2068646 2036402 2005294 1974735 1944412 1914972 1886853 1859519
61623 1859519 1832741 1807740 1785971 1767305 1750444 1734768 1720652 1708149 1696487 1685111 1674320
61612 1674320 1664477 1655163 1645633 1635764 1626078 1616970 1608258 1599536 1590653 1581604 1572128 1561838 1550900
61599 1550900 1540196 1530373 1520987 1511194 1501243 1492549 1485992 1480721 1475093 1468435 1461466 1455258 1450275 1446353
61585 1446353 1443207 1440874 1439664 1439656 1440286 1440790 1441112 1441932 1443620 1445582 1446981 1447763 1448606 1450112 1452456 1455660
61569 1455660 1459773 1464713 1470093 1475207 1479295 1482108 1484236 1486539 1489228 1491902 1494415 1496986 1499329 1500456
61555 1500456 1499781 1497718 1494735 1490652 1485483 1480126 1475160 1469568 1461827 1451900 1441007 1429693 1417559
61542 1417559 1405000 1393737 1384986 1378065 1371478 1364651 1358008 1352036 1347025 1343313 1341040 1339759 1338774 1337907
61528 1337907 1337796 1339569 1344116 1351270 1359588 1367488 1374822 1382894 1392844 1404731 1418423 1434480 1453421
61515 1453421 1474823 1498028 1523378 1551764 1583151 1616454 1650994 1687238 1725862 1766770 1809396
61504 1809396 1853413 1898741 1945108 1991788 2037487 2080445 2119371 2154795 2189004 2223880 2258885
61493 2258885 2291769 2321253 2348328 2374707 2400650 2424815 2445891 2463638 2478273 2489443 2496280
61482 2496280 2498443 2496858 2493174 2488340 2481715 2471865 2458378 2442657 2426688 2411484 2397276 2384839
61470 2384839 2375532 2369796 2366631 2365217 2366405 2371883 2382435 2397947 2418713 2445565 2478630 2516996
61458 2516996 2560005 2608163 2662533 2723947 2793239 2871537 2959712 3058005 3166761 3287179 3420759
61447 3420759 3568247 3729632 3904969 4094611 4298865 4517978 4752351 5002029 5265771
61438 5265771 5541014 5824627 6112966 6400836 6680820 6943977 7180995 7382797 7541114
61429 7541114 7649783 7706158 7711326 7669082 7584716 7464104 7313020 7136857 6941259 6733089
61419 6733089 6520246 6309920 6106856 5913389 5731019 5561710 5407731 5270704 5151117
61410 5151117 5048619 4962449 4891511 4834461 4790326 4759218 4742075 4739324 4750041 4772801 4806995
61399 4806995 4852389 4907295 4968390 5033197 5102017 5176248 5255235 5336027 5416086 5494723 5571607
61388 5571607 5645650 5716454 5785506 5854366 5922367 5987697 6050202 6111336 6171387 6228784 6282760
61377 6282760 6334890 6386628 6436475 6481008 6518140 6548149 6572081 6590682 6604793 6615158 6621233
61366 6621233 6621204 6613849 6599737 6580142 6555668 6526792 6495095 6462801 6431168 6400207 6369857 6340441
61354 6340441 6311822 6283315 6255193 6229394 6207709 6189727 6173600 6158599 6145574 6134649 6123746
61343 6123746 6110237 6093261 6073494 6051229 6026079 5998842 5972571 5950932 5935639 5926043 5921334 5922882
61331 5922882 5934258 5959073 5999187 6055199 6128128 6219771 6331377 6462858 6613838 6784927
61321 6784927 6977281 7191304 7426433 7681865 7956553 8248268 8553047 8865484 9179074
61312 9179074 9486331 9779118 10048948 10286783 10483220 10630214 10723202 10761304 10745677 10678565
61302 10678565 10563907 10407462 10215114 9991193 9738928 9462311 9167061 8859921 8547178
61293 8547178 8233550 7922058 7615031 7315222 7025606 6748205 6483913 6233896 6000413
61284 6000413 5785576 5589779 5412153 5252240 5110264 4985857 4877535 4783917 4704804 4640589
61274 4640589 4591088 4555469 4532976 4523000 4524534 4536356 4557927 4589386 4630119 4677969 4730656 4787531
61262 4787531 4848841 4913410 4978505 5042420 5105782 5169179 5230591 5286687 5336206 5380587 5421372
61251 5421372 5458389 5490563 5517079 5537259 5550472 5556869 5557449 5552977 5543433 5528603 5508171 5481045
61239 5481045 5445958 5403431 5355985 5305589 5251939 5194057 5132356 5067914 5000875 4931297 4860986
61228 4860986 4792582 4726855 4662530 4599176 4538857 4484250 4436030 4392711 4352447 4314392 4278749
61217 4278749 4246062 4216389 4189005 4162842 4137032 4110883 4083794 4055740 4027585 4000328 3974261
61206 3974261 3949455 3926738 3907355 3891862 3880228 3873019 3871458 3876147 3886637 3902723 3925454 3956429
61194 3956429 3996727 4046985 4107878 4179867 4262721 4355846 4458930 4571857 4693927 4823203
61184 4823203 4956465 5089804 5219520 5342378 5454501 5549900 5620867 5660481 5664825 5633003
61174 5633003 5566053 5466687 5339658 5191084 5026776 4851372 4669128 4484862 4303468 4128545
61164 4128545 3961893 3804322 3656435 3518519 3390231 3271139 3161523 3062166 2973245 2893802
61154 2893802 2822366 2757799 2699550 2647607 2602430 2564480 2533509 2508491 2488311 2472188 2459499
61143 2459499 2449878 2443682 2441713 2444130 2450275 2459836 2473271 2490372 2509112 2526790 2541873 2554052
61131 2554052 2563118 2568753 2570934 2569530 2563778 2553202 2538745 2521935 2503061 2481371 2457007 2431497
61119 2431497 2406088 2380715 2354981 2329160 2303708 2278651 2254027 2230269 2207561 2185123 2161470
61108 2161470 2135141 2105247 2071998 2036853 2001494 1966310 1930390 1893100 1855043 1817277 1780329
61097 1780329 1744329 1709529 1676207 1644447 1614290 1585786 1558728 1532678 1507228 1481843 1455589
61086 1455589 1427677 1398255 1368074 1337557 1307017 1277506 1250235 1225113 1201206 1178989 1160696
61075 1160696 1147656 1138402 1130367 1122626 1116092 1111771 1109833 1109944 1111620 1114432 1118445 1124105 1131405 1139773
61061 1139773 1149189 1160588 1174414 1189384 1203480 1215765 1226672 1237171 1248355 1261167 1275629
61050 1275629 1290672 1305452 1320280 1335504 1350057 1362157 1371109 1377506 1381995 1384796 1386188 1386406 1385102
61037 1385102 1381786 1376858 1371425 1366070 1360523 1354543 1348379 1342181 1335587 1328191 1320181 1312387 1305762 1300628
61023 1300628 1296311 1291880 1287384 1283721 1281084 1278429 1275249 1272967 1273374 1276034 1278460 1278812 1277401 1275445
61009 1275445 1273366 1270788 1267603 1264441 1262066 1260336 1257957 1253826 1248735 1245007 1243998 1244727 1245548 1246360 1248274
60994 1248274 1251943 1257433 1265124 1275223 1286531 1297086 1306382 1316069 1328251 1343713 1361753 1381035
60982 1381035 1400680 1421199 1444210 1470641 1499610 1529771 1561129 1594444 1629495 1665420 1702639
60971 1702639 1742967 1787659 1836419 1888368 1942925 1999910 2059964 2124742 2195377 2270861 2349396
60960 2349396 2431246 2518687 2613022 2713369 2818763 2929800 3047653 3173022 3306692 3449688
60950 3449688 3602116 3763019 3931997 4109830 4297224 4494518 4703309 4926990 5169157
60941 5169157 5432949 5722450 6042867 6398339 6791197 7224589 7704715 8240134 8840835
60932 8840835 9518630 10286324 11155505 12137318 13245961 14498420 15910341 17497125 19281340
60923 19281340 21293868 23565400 26124477 29004176 32219874 35690504 39159416 42226170
60915 42226170 44520395 45895296 46477265 46547026 46386996 46219008 46207061 46419992 46743389
60906 46743389 46858022 46373383 45040248 42870267 40081254 36949745 33703232 30498683
60898 30498683 27442473 24603712 22018310 19697698 17639810 15833353 14258205 12889221
60890 12889221 11701565 10671943 9777290 8995637 8308371 7700570 7160165 6678098 6248034
60881 6248034 5864145 5519666 5208519 4927083 4672844 4442244 4231291 4037321 3858359
60872 3858359 3691282 3532363 3379438 3232175 3090453 2953940 2823139 2699346 2583160
60863 2583160 2473943 2370911 2273947 2183191 2098491 2019316 1944681 1873297 1804376 1738139 1675126
60852 1675126 1615434 1559277 1507568 1460873 1418104 1377347 1337870 1300309 1265022 1231417 1199057
60841 1199057 1168412 1140274 1115151 1093296 1074400 1057120 1039908 1022721 1007216 994900 985714
60830 985714 978601 972674 967507 962939 959126 956408 954933 954756 956212 959558 964281 969686 976150 984706
60816 984706 995096 1005445 1014447 1022723 1031197 1039265 1045814 1051178 1056580 1062063 1066406 1069034 1070692 1072140
60802 1072140 1073407 1074568 1075991 1077351 1077568 1076479 1075623 1076343 1077744 1077644 1075366 1072706 1072117 1074622 1079653
60787 1079653 1086302 1094340 1104114 1115507 1127073 1136724 1143727 1149656 1156751 1165537 1174721 1183113 1190642
60774 1190642 1197477 1203413 1208660 1214141 1220226 1226025 1230895 1235921 1242700 1251078 1259421 1266920 1274290 1282150
60760 1282150 1290174 1298301 1307421 1317988 1328922 1338803 1347391 1355079 1361605 1366465 1370108 1373513 1376741
60747 1376741 1379017 1380134 1380652 1380534 1378718 1374441 1368029 1359894 1349633 1336941 1322800 1308823 1295513
60734 1295513 1281882 1266803 1250173 1232755 1215567 1199791 1186712 1176988 1169849 1163560 1157031 1150743
60722 1150743 1145841 1142723 1141127 1141352 1144323 1150118 1157384 1164950 1173384 1184065 1197135 1211382 1225941
60709 1225941 1241012 1256817 1272941 1289162 1306112 1324525 1344286 1364663 1385031 1405003 1424207
60698 1424207 1442383 1459472 1475367 1489714 1502057 1511992 1519379 1524977 1530755 1538636 1548470 1557949 1564987
60685 1564987 1569765 1574103 1579357 1585397 1591021 1594873 1596372 1596160 1595212 1593278 1589040 1582247 1574650 1567863
60671 1567863 1561271 1553400 1544636 1536804 1530189 1522712 1512579 1500403 1488171 1477251 1468035 1460341 1453171
60658 1453171 1444906 1434878 1424448 1415769 1409745 1405870 1403557 1402614 1402546 1402463 1401939 1401258 1400437 1398613 1394930
60643 1394930 1389723 1384381 1380121 1377269 1375521 1374351 1372960 1370338 1366004 1360682 1355804 1352168 1349413 1346904
60629 1346904 1344723 1343455 1343295 1343738 1343904 1342731 1339198 1333069 1325509 1318287 1312055 1305708 1297598 1287030
60615 1287030 1274401 1260281 1244837 1228157 1210905 1194372 1179641 1166571 1153921 1140732 1127372
60604 1127372 1115009 1104562 1096648 1091881 1090147 1089810 1088938 1087527 1087348 1089212 1091624 1092858 1093179 1093941 1095457
60589 1095457 1097153 1099246 1102719 1107690 1113157 1118473 1123741 1128427 1131016 1130927 1129814 1129858 1131211 1132237 1132150
60574 1132150 1132391 1135093 1140859 1148536 1156780 1165234 1174225 1183816 1193502 1202699 1211314 1219947 1229828 1242467
60560 1242467 1258931 1279155 1301973 1325932 1350026 1373889 1397728 1422159 1447636 1473822 1499928
60549 1499928 1525887 1552560 1580197 1606991 1629826 1646349 1655963 1659264 1657302 1651252 1641829 1628762
60537 1628762 1611391 1590038 1566290 1541792 1517303 1493109 1469711 1447671 1427265 1408592 1391723
60526 1391723 1376481 1362573 1350215 1340073 1332181 1325570 1319656 1315415 1314163 1315442 1317204 1318092 1318437
60513 1318437 1318635 1317794 1314973 1310966 1307562 1305248 1302947 1300321 1299126 1301486 1307585 1315946 1325481 1336116
60499 1336116 1347629 1359281 1371140 1384627 1400728 1418230 1434762 1449502 1464026 1480422 1499319
60488 1499319 1519948 1541533 1564165 1588630 1615648 1645175 1676412 1708698 1742370 1778385 1817106
60477 1817106 1857761 1899035 1939524 1977306 2009617 2033585 2047332 2050327 2043039 2026660 2003027 1974411
60465 1974411 1943179 1911580 1881604 1854911 1832866 1816563 1806563 1802740 1804670 1812059 1824331 1839880
60453 1839880 1856676 1874002 1893105 1915694 1942293 1972485 2006237 2044386 2088235 2139355 2199405
60442 2199405 2269366 2349122 2438519 2538726 2651831 2779292 2921762 3080520 3257951 3455901
60432 3455901 3674057 3910458 4163284 4431993 4717491 5021874 5347612 5696015 6065759
60423 6065759 6451825 6843989 7225010 7571034 7856011 8057605 8160292 8155037 8039147 7818190
60413 7818190 7507357 7129031 6707718 6266061 5823164 5393472 4985604 4603012 4247139
60404 4247139 3920139 3624279 3359484 3122823 2910611 2720173 2549535 2396723 2260244
60395 2260244 2139421 2033258 1939356 1854782 1777715 1707431 1643184 1584197 1530515 1482434 1438909
60384 1438909 1397783 1358095 1320941 1287510 1257465 1230146 1206091 1185877 1168215 1150915 1133643
60373 1133643 1118289 1106456 1097826 1091133 1085343 1079316 1071618 1061713 1050727 1040206 1030595 1021484 1012739
60360 1012739 1004540 996751 989202 982447 977465 974589 973314 973048 973455 974241 975417 977902 983005 990889 1000078
60345 1000078 1008850 1016718 1024124 1031166 1037375 1042693 1047976 1054178 1061309 1068620 1075762 1083341 1092059 1101592
60331 1101592 1110820 1119115 1126825 1134301 1141040 1146357 1150453 1154132 1157695 1160964 1164280 1168462 1173332 1177183
60317 1177183 1178475 1177543 1175838 1173797 1170468 1165419 1160178 1157088 1157006 1158687 1160445 1161951 1164144 1167711 1172125
60302 1172125 1176191 1179033 1180504 1181193 1182513 1186251 1193172 1202052 1210862 1219072 1228169 1239688 1253372 1267733
60288 1267733 1281858 1295982 1310568 1325476 1340119 1354055 1367264 1379871 1391530 1401228 1408088 1412324
60276 1412324 1414884 1416240 1416478 1416791 1419574 1425981 1434347 1442328 1449956 1459061 1470032 1480926 1489838 1496256
60262 1496256 1499531 1497965 1490767 1479643 1466992 1453463 1438723 1423784 1410600 1399440 1388492 1376501
60250 1376501 1364340 1353415 1343853 1335197 1327878 1322801 1319880 1317990 1316227 1314521 1313143 1312365 1312645 1314427
60236 1314427 1317440 1320503 1322280 1322219 1320888 1319571 1319319 1319949 1319968 1317913 1313849 1309375 1306247 1305353 1306901 1310875
60220 1310875 1317050 1324966 1334265 1344686 1355594 1366066 1375920 1386308 1398664 1413263 1429303 1446165
60208 1446165 1463776 1481713 1498769 1513956 1527621 1541272 1556529 1574357 1594881 1617533 1641553
60197 1641553 1666645 1693119 1721379 1751708 1784737 1821755 1863997 1911711 1964271 2021203 2082942
60186 2082942 2150693 2225713 2308465 2398170 2493401 2593560 2699756 2813949 2937261 3069370
60176 3069370 3209300 3356173 3509100 3666753 3827366 3989009 4149720 4307524 4460354
60167 4460354 4605879 4741394 4864207 4972281 5064509 5140445 5199966 5243098 5269896 5280430
60157 5280430 5275147 5255457 5223939 5184063 5139697 5094543 5051487 5012401 4978835 4952904 4937204
60146 4937204 4933878 4944173 4968878 5008601 5063242 5131712 5212865 5306735 5414423 5536632 5672379
60135 5672379 5818999 5972893 6130119 6286647 6438683 6582974 6716637 6836593 6939333
60126 6939333 7021590 7081298 7117824 7131306 7121960 7090142 7036996 6965086 6878339 6781076 6676728
60115 6676728 6567628 6456417 6347390 6245693 6155098 6077194 6012862 5963641 5931248 5916681
60105 5916681 5920626 5943985 5986946 6047768 6123327 6210551 6306519 6407741 6510655 6612804 6712286
60094 6712286 6805910 6889298 6959442 7016390 7061968 7097666 7124177 7142141 7152586 7157249 7159130 7162397
60082 7162397 7171238 7189101 7219195 7264922 7329160 7413500 7518622 7645056 7793321 7963885 8157570
60071 8157570 8375724 8619750 8890870 9190297 9518687 9874989 10256720 10661941 11090038
60062 11090038 11539815 12007492 12487166 12972080 13454450 13925235 14375814 14799560 15190450
60053 15190450 15540762 15841908 16087461 16273794 16397759 16455544 16444377 16364002 16216151 16004183
60043 16004183 15734015 15414036 15053126 14659802 14244049 13818399 13395506 12985078 12594207
60034 12594207 12229610 11897665 11602428 11345349 11127299 10949668 10813224 10717125 10659506 10637913
60024 10637913 10648421 10685374 10743025 10816970 10903029 10995173 11085636 11167151 11234302 11282883 11309268
60013 11309268 11311127 11288023 11240325 11167734 11069683 10947143 10803174 10641206 10463076 10269070
60003 10269070 10059707 9837261 9605840 9370434 9135791 8905835 8683725 8472258 8274038
59994 8274038 8091350 7926154 7780336 7655728 7553727 7475041 7419922 7388445 7380417 7395328
59984 7395328 7432712 7492400 7574092 7676710 7798250 7935811 8085254 8241066 8397374 8549375
59974 8549375 8693381 8825357 8940030 9032047 9097877 9136230 9146768 9128860 9081649 9004922 8899794
59963 8899794 8768875 8616085 8446146 8263885 8073989 7881513 7692383 7512704 7347127
59954 7347127 7197923 7065762 6951359 6856414 6783348 6734367 6710527 6711508 6736541 6785687 6859770
59943 6859770 6958803 7081105 7224609 7388582 7573182 7777500 7998741 8232882 8474907 8718299
59933 8718299 8955590 9179964 9385715 9567135 9718415 9835520 9917375 9964318 9975943 9951026
59923 9951026 9888933 9790549 9658770 9499203 9319983 9129824 8936126 8745068 8562543 8393825
59913 8393825 8242661 8111590 8002982 7919123 7861642 7831462 7828722 7851890 7897736 7963447 8048426
59902 8048426 8152792 8274441 8408884 8551750 8700035 8850992 9001486 9148908 9291546
59893 9291546 9427691 9555522 9674170 9783595 9883004 9970763 10046633 10112948 10172764 10227932
59883 10227932 10280074 10332635 10390836 10459910 10544225 10647690 10774258 10928140 11113866 11335460
59873 11335460 11594793 11891170 12223243 12590889 12994393 13431852 13897862 14384346 14881768
59864 14881768 15379343 15864539 16322663 16737141 17090989 17369027 17559485 17654428 17649892 17546331
59854 17546331 17348750 17066278 16711765 16301208 15851607 15377861 14891644 14403435 13924613
59845 13924613 13466526 13037929 12644069 12287815 11970922 11694771 11461165 11272334 11129363
59836 11129363 11030737 10973370 10954998 10974604 11030619 11119837 11238306 11381951 11545439 11721153
59826 11721153 11900092 12073517 12233156 12370219 12475078 12538180 12551343 12508854 12408292 12250652
59816 12250652 12039413 11779335 11476223 11137527 10772332 10390126 9999434 9607559 9221001
59807 9221001 8845284 8484314 8140534 7816152 7513850 7235964 6983244 6754931 6549911
59798 6549911 6367321 6206165 6065018 5942334 5836610 5746048 5668389 5601290 5542551 5489725
59788 5489725 5439825 5389883 5338124 5284805 5231994 5182281 5137193 5096677 5059973 5026631 4996300
59777 4996300 4967841 4939164 4907875 4871870 4829875 4782230 4731065 4678932 4627258 4576488 4527099
59766 4527099 4479313 4432223 4384890 4338680 4297099 4262802 4236044 4216567 4205225 4202357 4205842 4212588
59754 4212588 4221623 4234442 4252783 4277422 4308876 4347805 4394549 4449300 4512710 4585087 4664815
59743 4664815 4748763 4834755 4922629 5012201 5101035 5185164 5261701 5330061 5390804 5444224 5490520
59732 5490520 5530959 5568218 5605409 5645032 5688973 5739026 5796924 5864252 5943165 6037099 6149741
59721 6149741 6282952 6436471 6610042 6805159 7024348 7269665 7542611 7844734 8177387
59712 8177387 8541221 8936328 9361919 9814558 10286611 10766379 11238195 11680876 12067376
59703 12067376 12369420 12565396 12645646 12612582 12478240 12261778 11986389 11675339 11348862 11023150
59693 11023150 10710469 10419407 10155587 9922759 9723236 9557539 9424645 9323252 9252802
59684 9252802 9213310 9204629 9225990 9276082 9353726 9458789 9592129 9754139 9943807 10160016
59674 10160016 10403452 10676254 10979945 11314939 11682272 12084659 12525322 13006691 13530755
59665 13530755 14099765 14715688 15379367 16090737 16849541 17655429 18507696 19405112 20345187
59656 20345187 21322736 22329235 23353892 24385027 25410269 26416651 27392379 28329567
59648 28329567 29225377 30080943 30899978 31688435 32454207 33205413 33948067 34685115 35416889
59639 35416889 36140948 36850542 37533950 38176618 38764171 39283134 39720118 40063165 40305420
59630 40305420 40446894 40492408 40449503 40329543 40149317 39929260 39689867 39450449 39229898 39046207
59620 39046207 38914767 38848289 38858153 38954321 39143941 39431564 39820813 40314280 40911522 41608597
59610 41608597 42399603 43276490 44226144 45228759 46259565 47290411 48288463 49214738 50025717
59601 50025717 50676650 51124195 51329798 51265463 50919155 50295949 49415676 48310333 47021665
59592 47021665 45597045 44084140 42526982 40964224 39428134 37943695 36528345 35192096
59584 35192096 33937296 32758421 31642560 30570235 29516616 28455044 27363723 26232349
59576 26232349 25064063 23872051 22674341 21489845 20335990 19227178 18174067 17183709
59568 17183709 16260135 15404869 14617227 13894494 13232572 12627211 12074891 11572310 11115462
59559 11115462 10700102 10323094 9982204 9674328 9395232 9141803 8913476 8710160 8529323
59550 8529323 8366182 8216383 8077355 7947250 7823858 7704873 7588392 7472625 7355416
59541 7355416 7234432 7107943 6975733 6839344 6701103 6562682 6424927 6289051 6157097
59532 6157097 6030809 5911016 5798812 5696409 5605612 5526046 5456139 5395567 5345498 5306599
59522 5306599 5278138 5259253 5249848 5249639 5257265 5271106 5290579 5316107 5348016 5385788 5428355 5474937
59510 5474937 5525608 5580810 5640310 5703049 5768316 5836650 5909288 5987338 6072182 6165899 6270075
59499 6270075 6384318 6507129 6638458 6780591 6936451 7107804 7295196 7498746 7718746
59490 7718746 7956171 8212728 8489558 8785658 9098400 9425890 9767956 10124368 10492837
59481 10492837 10869222 11248925 11627446 12000305 12363259 12712077 13041132 13342535 13608005
59472 13608005 13832505 14016183 14162867 14276887 14361123 14417352 14447723 14455541 14444719 14419050
59462 14419050 14382629 14340901 14300602 14268365 14249830 14250321 14275529 14330457 14417561 14536498 14685579
59451 14685579 14862465 15062759 15278336 15497817 15708587 15897768 16051468 16154732 16193981
59442 16193981 16160043 16048632 15858486 15590503 15249330 14844781 14390404 13900285 13387162
59433 13387162 12862697 12338178 11824342 11330725 10865031 10432609 10036249 9676711 9353728
59424 9353728 9066739 8815221 8598769 8416921 8268740 8152778 8067573 8011951 7984779 7984936
59414 7984936 8011800 8065216 8144687 8249269 8378697 8533611 8713609 8915737 9136019 9371970
59404 9371970 9622168 9883620 10150919 10417818 10677851 10923101 11144165 11332275 11480541
59395 11480541 11582794 11632967 11626820 11563242 11442956 11267375 11040266 10769516 10465216 10135945
59385 10135945 9788012 9427697 9062275 8698405 8340702 7992286 7655849 7333897 7028796
59376 7028796 6742747 6476981 6230925 6003134 5793244 5602134 5429982 5275158 5135531
59367 5135531 5010055 4898712 4801645 4718747 4649202 4591019 4541939 4501431 4470927 4451488 4442223
59356 4442223 4441711 4449734 4466347 4490340 4520288 4556301 4598515 4643912 4686842 4723316 4753314 4778630
59344 4778630 4800649 4821426 4844941 4875249 4914289 4963100 5023924 5098358 5183293 5271136 5355584
59333 5355584 5436445 5518418 5606559 5704045 5813345 5937492 6079431 6240618 6420979 6620449
59323 6620449 6840580 7084585 7355799 7656244 7986757 8348264 8742593 9172213 9639569
59314 9639569 10146608 10694619 11284411 11916564 12590994 13305793 14056665 14837642 15641485
59305 15641485 16458471 17275257 18076599 18849039 19582868 20271049 20907660 21488092 22010068
59296 22010068 22473648 22880257 23231745 23529826 23775773 23970099 24111645 24196278 24217055 24166832
59286 24166832 24040760 23835681 23548078 23174832 22716637 22179297 21571285 20901624 20180847
59277 20180847 19422016 18638774 17842773 17043697 16250516 15471298 14712674 13980965 13283087
59268 13283087 12624710 12007982 11432589 10898637 10406901 9956607 9545025 9169675 8829395
59259 8829395 8522943 8248069 8002673 7785627 7595703 7430607 7287669 7164662 7059475
59250 7059475 6969935 6894769 6834035 6787906 6755447 6735108 6725905 6727654 6740626 6765587 6803735 6855844
59238 6855844 6921490 6999319 7087833 7185758 7292139 7406505 7528633 7657793 7792492 7931029
59228 7931029 8071964 8213832 8354976 8494070 8630495 8763984 8894350 9021942 9147875
59219 9147875 9273196 9397894 9520894 9640649 9755304 9862801 9961690 10052097 10135599 10213994
59209 10213994 10288102 10357293 10419513 10471527 10509439 10529335 10527780 10502201 10451320 10375528 10276956
59198 10276956 10159134 10026241 9882172 9730054 9572798 9414076 9258415 9110061 8971987
59189 8971987 8846217 8734913 8640615 8565131 8508275 8467939 8441648 8428276 8428292 8442287 8469221
59178 8469221 8506146 8549747 8598116 8650971 8708220 8768590 8829960 8890990 8952170 9015320 9082631
59167 9082631 9156441 9239292 9333478 9440883 9563992 9706779 9873557 10066921 10287754 10537241
59157 10537241 10817541 11129861 11472826 11843198 12236855 12647764 13066557 13481187 13878563
59148 13878563 14244785 14564475 14821514 15001167 15091910 15086460 14982291 14781002 14486770 14106290
59138 14106290 13650910 13137290 12583684 12005397 11414694 10823906 10245838 9690458 9162913
59129 9162913 8665493 8200137 7768419 7370541 7005591 6672136 6367938 6089892 5835102
59120 5835102 5601761 5388825 5195431 5020789 4863710 4721904 4592691 4474881 4369154
59111 4369154 4276084 4194554 4122659 4059423 4004991 3959631 3922962 3893655 3869665 3849529 3833750
59100 3833750 3824214 3821925 3826210 3836439 3853332 3877816 3909570 3947676 3991960 4042732 4099726 4162265
59088 4162265 4230201 4304004 4384185 4471109 4564802 4664338 4768043 4875135 4986612 5103559
59078 5103559 5224910 5347898 5470614 5593176 5716273 5839377 5960642 6078014 6189996
59069 6189996 6295453 6392922 6480423 6556332 6620467 6673960 6718101 6754001 6783460 6809079 6832696
59058 6832696 6854339 6873667 6892220 6913455 6940701 6975705 7019037 7071080 7132239 7202654 7282288
59047 7282288 7371694 7472821 7588622 7721074 7869338 8030471 8202329 8385350 8581112 8789607
59037 8789607 9008229 9232770 9458561 9680670 9893435 10089817 10261310 10399303 10497434 10552840
59027 10552840 10565124 10534666 10462401 10350829 10204589 10029950 9833816 9622547 9400891 9171749
59017 9171749 8937089 8698955 8459392 8219705 7980238 7740961 7502206 7264924 7030225
59008 7030225 6798509 6569163 6341620 6116828 5897239 5685087 5480982 5284402 5095212
58999 5095212 4914318 4742900 4581155 4427928 4281851 4142998 4013003 3893262 3783543
58990 3783543 3682747 3590222 3505311 3426266 3351119 3279644 3213299 3153161 3098867 3049297 3002833
58979 3002833 2956923 2909094 2858883 2807535 2755546 2702094 2647337 2593441 2542312 2493805 2447272
58968 2447272 2403519 2363925 2328671 2297142 2269165 2244632 2222649 2202225 2183348 2166525 2151972
58957 2151972 2139949 2130900 2124414 2118993 2113859 2109882 2107687 2106016 2103389 2100390 2098776 2099055 2100411 2102350
58943 2102350 2104958 2108156 2112172 2118084 2126354 2135365 2142994 2149166 2155259 2161503 2166903 2171614 2177523 2186225
58929 2186225 2197836 2211902 2227934 2244816 2261170 2276928 2293592 2312694 2334678 2359022 2384344
58918 2384344 2408655 2430951 2452687 2476410 2502818 2530306 2557421 2584347 2611834 2640246 2670273
58907 2670273 2703237 2739705 2778586 2818340 2858564 2899818 2942474 2986324 3031171 3077360 3125598
58896 3125598 3176253 3229018 3283707 3341222 3402794 3468008 3534756 3601870 3670619 3742690 3817995
58885 3817995 3895823 3976938 4062571 4152180 4244311 4339344 4439484 4546332 4660390 4782663
58875 4782663 4914459 5055522 5204588 5362288 5531356 5713384 5907535 6113526 6333921
58866 6333921 6572021 6828858 7103736 7396841 7709975 8045259 8404233 8788099 9198277
58857 9198277 9636830 10106466 10609647 11147737 11721534 12332431 12982191 13671677 14400628
58848 14400628 15168209 15972453 16809255 17673191 18559047 19460809 20368982 21270279 22149706
58839 22149706 22990793 23773421 24473881 25068817 25538712 25868008 26044687 26061848 25919248
58830 25919248 25622772 25183528 24617706 23945290 23187208 22363897 21496096 20604377 19706220
58821 19706220 18814729 17941027 17095966 16287902 15520396 14794215 14110713 13471497 12875584
58812 12875584 12319172 11798469 11311528 10857324 10434111 10038810 9667413 9316188 8983162
58803 8983162 8668250 8371659 8092725 7830617 7585224 7356585 7144193 6947651 6767288
58794 6767288 6603338 6455062 6321333 6201399 6094414 5999057 5914513 5841302 5780402 5732074
58784 5732074 5695936 5671305 5656868 5651083 5653864 5667085 5692587 5730422 5779714 5840087 5911216 5992080
58772 5992080 6082180 6182869 6296195 6422770 6561816 6712761 6875773 7051421 7241060 7447083
58762 7447083 7671527 7914709 8176353 8457625 8760864 9087712 9439057 9816823 10224347
58753 10224347 10664486 11138333 11646365 12190140 12772169 13394292 14056613 14757963 15496944
58744 15496944 16271799 17078999 17912500 18764863 19628098 20491762 21340324 22153956 22912198
58735 22912198 23595555 24183901 24656247 24994074 25184193 25218253 25092264 24808962 24379534
58726 24379534 23820994 23152267 22393440 21566379 20692673 19790605 18875429 17961728 17063284
58717 17063284 16190584 15350100 14545834 13780151 13053444 12364937 11714195 11100891 10523519
58708 10523519 9979923 9469026 8990700 8544189 8128072 7741416 7383133 7050271 6738920
58699 6738920 6447246 6175980 5925396 5693331 5476736 5273829 5084051 4907148 4743044
58690 4743044 4591646 4452014 4322457 4201883 4090283 3987504 3892388 3803581 3720470 3642948
58680 3642948 3570913 3504199 3442254 3383685 3326962 3271858 3219346 3169881 3122709 3077228 3033963
58669 3033963 2993537 2955554 2919205 2884315 2851014 2818805 2786625 2753504 2718641 2681302 2641378
58658 2641378 2599767 2557391 2513792 2467360 2417283 2364834 2312354 2261274 2211603 2163163 2116432
58647 2116432 2071747 2028522 1986237 1945874 1909162 1876305 1845557 1815331 1785610 1756857 1728911
58636 1728911 1701911 1677186 1655820 1636834 1618010 1598134 1577325 1555473 1531804 1506346 1480894
58625 1480894 1457922 1438666 1422303 1406893 1391300 1376306 1363514 1353361 1344978 1337966 1333002 1330195
58613 1330195 1328279 1326394 1325549 1327153 1331115 1336595 1343604 1352363 1361936 1371074 1379826 1388664 1396509 1401306
58599 1401306 1402345 1400537 1396660 1390909 1383944 1376756 1369535 1362131 1355525 1351303 1349664 1349554 1350802 1354574
58585 1354574 1361608 1371568 1384278 1399897 1417607 1435902 1454760 1476000 1500901 1528898 1559100 1591508
58573 1591508 1625979 1661654 1698466 1737915 1781218 1827832 1876948 1929385 1986661 2048994 2115680
58562 2115680 2187121 2265173 2351374 2445675 2547141 2655510 2772083 2899340 3039503 3193177
58552 3193177 3359382 3536911 3725433 3925426 4137518 4361880 4597648 4842705 5094212
58543 5094212 5349055 5603131 5850303 6082922 6293434 6474882 6620140 6721979 6774759 6775912
58533 6775912 6726051 6628556 6489221 6315361 6114505 5893890 5660662 5421419 5181240 4943774
58523 4943774 4712448 4490868 4281859 4086863 3906488 3741010 3590206 3453456 3330332
58514 3330332 3220468 3122666 3034891 2955511 2883928 2819534 2760573 2704701 2650630 2598806 2550160
58503 2550160 2504188 2458667 2411859 2364881 2320881 2281527 2245301 2209734 2174057 2138671 2103399
58492 2103399 2067982 2033386 2000569 1968189 1933636 1896506 1859273 1824033 1790147 1755818 1720705
58481 1720705 1686083 1653199 1622241 1592651 1564177 1537751 1514870 1495521 1477320 1457806 1437214
58470 1437214 1417803 1400832 1385565 1370977 1356825 1342993 1329357 1316554 1305452 1295652 1285845 1275818
58458 1275818 1266580 1258227 1249376 1239428 1229927 1222765 1218120 1214924 1212428 1210559 1209520 1209650 1211078 1213128
58444 1213128 1214729 1215536 1215951 1216006 1215218 1213529 1211257 1207944 1202540 1195050 1186825 1178846 1170855 1162607 1154771
58429 1154771 1147865 1141163 1133368 1124024 1114024 1105054 1098281 1093017 1087160 1079847 1073063 1069286 1068060 1066514
58415 1066514 1062986 1058411 1054193 1050646 1047771 1045777 1044317 1042627 1040668 1038774 1036197 1031734 1025950 1020968
58401 1020968 1017766 1015423 1013242 1011675 1010807 1010011 1009630 1010928 1013705 1016162 1017998 1021365 1027497 1034503 1040049
58386 1040049 1044560 1050171 1057939 1067582 1078716 1090637 1101764 1110806 1118208 1125615 1134341 1144615 1155297
58373 1155297 1163944 1168360 1168614 1166460 1162678 1156580 1148436 1140348 1133770 1127824 1121097 1113622 1106197 1099199
58359 1099199 1093086 1088719 1086289 1085103 1085076 1086971 1090519 1093957 1096345 1098761 1102436 1107252 1112937 1120047
58345 1120047 1128671 1137718 1146486 1155600 1165490 1175346 1184354 1192601 1200201 1207154 1214529 1223913 1235136 1246512
58331 1246512 1257795 1270552 1284997 1299071 1311687 1324196 1337424 1350069 1361551 1373619 1387175
58320 1387175 1400123 1410525 1419548 1428988 1438215 1445940 1452876 1460019 1466264 1470565 1474768 1481392 1489758
58307 1489758 1497016 1502105 1506298 1510753 1515960 1522811 1531881 1542049 1551757 1561161 1571409 1582471 1593242
58294 1593242 1603126 1612198 1620565 1628851 1638413 1649905 1662461 1675025 1687296 1698724 1708330 1716455 1724897
58281 1724897 1734279 1743244 1751169 1759514 1769395 1780276 1792304 1807229 1825308 1843916 1861089 1877968
58269 1877968 1895977 1914463 1933171 1954052 1977980 2002341 2024622 2045953 2068585 2092482 2117157
58258 2117157 2144095 2174086 2204644 2233342 2261402 2290584 2318908 2343333 2364976 2387986 2414433
58247 2414433 2443456 2474093 2505958 2538450 2572046 2608838 2649314 2690513 2729862 2768563 2808574
58236 2808574 2848985 2888697 2930028 2976016 3026348 3079461 3136142 3197218 3259954 3320836 3380134
58225 3380134 3440126 3501008 3562270 3625717 3692966 3762005 3830242 3898915 3970723 4045613 4123047
58214 4123047 4205780 4296752 4394435 4495715 4601094 4712611 4829271 4949400 5075041 5209028
58204 5209028 5350005 5495342 5646469 5806161 5973122 6144639 6322133 6508515 6702645
58195 6702645 6902171 7109387 7328395 7558968 7799208 8051551 8319828 8603122 8899162
58186 8899162 9211137 9544169 9897637 10268129 10657460 11070347 11506610 11963275 12442017
58177 12442017 12946893 13477432 14032294 14617527 15242918 15912260 16625035 17384430 18194621
58168 18194621 19053097 19955538 20906068 21913538 22980757 24107461 25300712 26571541
58160 26571541 27924284 29360274 30888783 32522668 34267030 36125242 38113079 40253810
58152 40253810 42563163 45053626 47750201 50686970 53892302 57394565 61240038 65489589
58144 65489589 70203108 75446544 81310333 87901707 95324568 103688552 113131649 123810943
58136 123810943 135879832 149498614 164848325 182090152 201316160 222583755 246009967
58129 246009967 271835605 300458148 332390717 367852339 405791370 442919329 473932410
58122 473932410 493390463 498130043 488422100 467210889 438393516 405488461 371168065
58115 371168065 337302479 305113256 275328537 248330996 224256863 203050879 184533101
58108 184533101 168483588 154699354 143008368 133260950 125310303 118993296 114125007
58101 114125007 110476765 107694527 105224536 102402748 98723674 94063531 88642855 82796206
58093 82796206 76793159 70818612 65016973 59503309 54356272 49626551 45342492 41500416
58085 41500416 38067123 35003560 32278213 29857799 27702518 25777370 24056339 22511639
58077 22511639 21111281 19831553 18661121 17589191 16599535 15678697 14820164 14017841 13264502
58068 13264502 12558278 11901313 11290293 10716917 10178303 9677449 9212684 8776580 8366476
58059 8366476 7985732 7632428 7296523 6970892 6656185 6352471 6055554 5765059 5487592
58050 5487592 5227798 4983444 4752502 4537776 4340925 4158553 3987887 3830393 3686599
58041 3686599 3552933 3426718 3309104 3200526 3098430 3001801 2912748 2831302 2753570 2677113
58031 2677113 2603289 2532573 2462793 2393750 2328263 2266625 2205387 2143750 2085787 2033721 1984213
58020 1984213 1934127 1885179 1839926 1797595 1756902 1719007 1684678 1652004 1619631 1589034 1561312
58009 1561312 1535015 1509230 1485526 1464681 1444598 1423526 1402510 1382966 1364655 1347337 1331319
57998 1331319 1315174 1296339 1275311 1255854 1239712 1224627 1208888 1194031 1181313 1169224 1156501
57987 1156501 1144251 1133189 1122072 1110718 1101382 1095209 1090278 1084846 1079429 1074175 1067576 1059597 1052752
57974 1052752 1048235 1044348 1040505 1039071 1040911 1042697 1041395 1038221 1035359 1031856 1025831 1018036 1009996 1000920
57960 1000920 989636 977675 967386 958503 949288 939673 930737 922425 914083 906011 898351 889761 879302
57947 879302 868284 858249 848460 837445 825794 815241 805903 796482 786478 776529 767206 758872 752073
57934 752073 746879 742642 739277 737602 737380 736383 732811 727716 723864 723035 725190 729091 732839 734941 735863
57919 735863 737559 740869 744434 746613 747085 746123 744039 741997 741702 743253 744663 744105 741259 736202 728957
57904 728957 720795 713943 709045 704612 699632 694745 690190 684907 678800 673691 670672 668446 665586 662681
57890 662681 660965 660488 660805 661782 662818 663096 663476 666016 670577 674217 675273 675756 678203 682422 686945 691321
57874 691321 694946 695844 693086 688882 686044 684529 682258 677980 671595 663074 652925 642527 632515 622192
57860 622192 611864 603777 598934 595017 589788 584868 583545 586043 589554 592097 593956 595982 598820 603433
57846 603433 610343 618603 627023 635841 645570 655023 662270 667013 670356 672777 674057 674669 675438 676063 675469
57831 675469 673425 670531 666945 662428 657338 652409 647679 642512 636386 629091 620737 612144 604429 597745
57817 597745 591445 585794 581969 579849 577778 575552 575560 579395 585258 590588 595481 601388 607989 613872 619229
57802 619229 625382 632203 638247 643038 647278 651217 654501 657128 658828 658158 654031 647742 641749 636844
57788 636844 632046 626745 621237 615578 609470 602977 596099 588244 579437 571106 564210 557532 549533 540847
57774 540847 533028 525852 518176 510661 505033 500985 496346 490345 484293 478823 472830 465773 458894 453278
57760 453278 448214 442298 435028 426707 417810 408913 400471 392479 385028 378934 374858 372091 369363 366696
57746 366696 365323 365948 368200 371622 376076 381294 387000 393239 399702 405214 408978 411736 414486 416671
57732 416671 417054 415870 414632 414205 414563 416032 419134 423436 428066 433085 438761 443814 446165 445440 443113
57717 443113 440232 436686 432696 429152 426059 422205 416885 410693 404310 397840 391650 386506 382318 377908
57703 377908 372641 367387 363401 360947 359497 358733 358969 360769 364200 368525 373085 378458 385710 394185 401455
57688 401455 406301 410324 415531 421887 428721 436754 446488 455978 463039 468873 476618 486503 495250 500526
57674 500526 503528 506711 511250 517249 524288 531034 536171 540459 546318 554932 565385 576815 589434
57661 589434 602870 615598 626988 638301 650765 664120 677796 692061 707144 722467 737550
57650 737550 752594 767717 782874 798975 817637 839265 862698 887277 913890 943423 975655
57639 975655 1010242 1047299 1086383 1126479 1167809 1212064 1259960 1310179 1361807 1416335 1475972
57628 1475972 1541400 1612644 1690958 1778126 1874552 1979625 2093680 2218362 2355304 2505466
57618 2505466 2669620 2848636 3043350 3254638 3483283 3729191 3990981 4266728 4554690
57609 4554690 4852726 5156863 5459863 5749922 6010084 6220081 6360903 6419991 6394497 6291555
57599 6291555 6125475 5912888 5668634 5404829 5131989 4859280 4593573 4339371 4099829
57590 4099829 3876937 3670954 3481054 3306965 3149090 3007038 2879274 2764466 2662153
57581 2662153 2571893 2492940 2424902 2367511 2319547 2279363 2246803 2223155 2208622 2201173 2198601 2200593
57569 2200593 2208092 2221783 2242081 2269699 2305308 2349075 2401009 2461242 2529714 2606280 2691347
57558 2691347 2785762 2890079 3004718 3130580 3268145 3415819 3570491 3729971 3893615 4060156
57548 4060156 4226068 4386318 4535430 4667406 4775731 4854066 4896551 4898395 4858187 4779803
57538 4779803 4670256 4535310 4378597 4204489 4018969 3826987 3631496 3436181 3246599
57529 3246599 3066907 2897340 2736582 2585020 2444063 2313996 2194411 2085453 1986869 1896834
57519 1896834 1813414 1736289 1665651 1600583 1540150 1484878 1435204 1389393 1345052 1302285 1263455
57508 1263455 1230028 1201181 1175404 1151913 1130461 1111032 1093913 1079231 1066423 1054802 1044378
57497 1044378 1035591 1028755 1024336 1022996 1024490 1027175 1029640 1032390 1037177 1045130 1056121 1069256 1083218
57484 1083218 1096961 1111048 1127774 1149018 1174379 1201926 1230225 1259245 1290235 1325307 1366067
57473 1366067 1411898 1460447 1510427 1562918 1619527 1680762 1747004 1819352 1898290 1982884 2072572
57462 2072572 2168301 2270639 2378323 2490216 2607145 2729964 2857224 2986584 3116946 3246707
57452 3246707 3371015 3483341 3579094 3655329 3707768 3731271 3723594 3686489 3623001 3535951 3429269
57441 3429269 3308448 3178699 3043998 2907992 2774088 2644318 2519815 2402664 2295533
57432 2295533 2199000 2111024 2029790 1955639 1889539 1831119 1779215 1733352 1693762 1660578 1633637
57421 1633637 1612667 1597434 1588032 1584794 1587282 1593838 1603236 1616497 1635761 1661471 1692045 1726401
57409 1726401 1765300 1809826 1859869 1914748 1974505 2040087 2112809 2193599 2281941 2375659 2472836
57398 2472836 2573969 2681130 2794883 2913134 3033017 3152356 3268685 3377944 3475053 3555231
57388 3555231 3614404 3649080 3656513 3634966 3584017 3505266 3402710 3281650 3147051 3003258 2854697
57377 2854697 2705626 2559043 2416594 2279643 2149732 2028133 1915642 1812650 1718637 1631995
57367 1631995 1551482 1477762 1412446 1355666 1305556 1259981 1217681 1177922 1140407 1105761 1074943
57356 1074943 1047846 1023275 1000441 979617 961361 945940 933361 922989 913296 903108 892975
57345 892975 884206 876857 870055 864026 860099 858528 858060 858027 859172 861743 864327 865561 865816 866261 867216 868270
57329 868270 869206 869977 870433 870809 872034 874994 879772 885810 892430 899141 906024 913754 922702 932291 942007
57314 942007 952589 964968 978367 990948 1002308 1013737 1025889 1037893 1049180 1060431 1072087
57303 1072087 1083578 1094881 1107247 1121244 1135455 1148367 1160503 1173459 1187805 1203202 1219768
57292 1219768 1237890 1257012 1275766 1293246 1309550 1325423 1341868 1359486 1377562 1394462 1409724
57281 1409724 1425178 1443257 1464719 1488698 1514139 1540022 1564794 1587167 1607726 1628714 1651700
57270 1651700 1676063 1700049 1722815 1744993 1767513 1790483 1813526 1836856 1861345 1887270 1913609
57259 1913609 1939140 1963862 1988664 2013918 2039273 2064687 2090718 2117582 2144651 2171053 2196384
57248 2196384 2220990 2246147 2273692 2304537 2337573 2370820 2403486 2436011 2468487 2500542 2532878
57237 2532878 2567296 2604511 2643054 2681099 2718474 2756258 2795170 2835080 2875535 2916236 2957398
57226 2957398 2999908 3044656 3091536 3139641 3188447 3238132 3288833 3340556 3393839 3449458 3507122
57215 3507122 3565313 3622625 3678487 3732629 3784912 3835706 3885130 3931461 3971320 4001799 4021598
57204 4021598 4030265 4027889 4016208 3998768 3979244 3960223 3943626 3931019 3923245 3921004 3926146 3940997
57192 3940997 3965957 3999114 4038601 4083772 4133591 4185790 4238690 4292353 4346883 4401089 4454026
57181 4454026 4506259 4558066 4607656 4652816 4693378 4730439 4763968 4792863 4816800 4836419 4851911
57170 4851911 4862873 4869436 4872570 4873555 4874181 4876971 4883893 4894843 4908393 4923844 4941587 4961713 4983680
57157 4983680 5007798 5036040 5070606 5111814 5157752 5205941 5255129 5305477 5357251 5409863 5462392
57146 5462392 5514454 5566087 5617345 5668790 5721769 5777108 5833870 5890520 5946988 6004235 6062155
57135 6062155 6119542 6176085 6232542 6288665 6342679 6393377 6441330 6487636 6532970 6578112 6623706
57124 6623706 6668948 6712164 6753092 6792771 6830624 6863767 6890024 6909504 6922056 6925369 6917428 6899376
57112 6899376 6874367 6844893 6812764 6780443 6750603 6724809 6703474 6686124 6670942 6655205 6637122
57101 6637122 6616237 6591665 6561614 6525406 6484351 6439880 6392762 6344949 6299738 6258383 6218230
57090 6218230 6175613 6128725 6076510 6017134 5949692 5875608 5796248 5710702 5617761 5518366 5413887
57079 5413887 5303186 5183272 5051635 4906237 4744605 4564739 4365971 4147800 3909463
57070 3909463 3651706 3376935 3086081 2777324 2448964 2100720 1730176 1330571 894204
57061 894204 415472 -111444 -694634 -1341054 -2053698 -2835138 -3691890 -4632994 -5667322
57052 -5667322 -6805371 -8060983 -9448146 -10978783 -12666650 -14530552 -16591084 -18868486
57044 -18868486 -21388158 -24185463 -27302301 -30784435 -34688416 -39089106 -44077797 -49758771
57036 -49758771 -56251938 -63689519 -72196255 -81867600 -92763583 -104913680 -118324283 -132992289
57028 -132992289 -148908744 -166015762 -184141225 -203026199 -222499738 -242640886 -263679474
57021 -263679474 -285618867 -307879941 -329276822 -348329582 -363665536 -374292403 -379695290
57014 -379695290 -379795805 -374822066 -365167816 -351329856 -333932740 -313752495 -291664037
57007 -291664037 -268534636 -245133545 -222088104 -199872533 -178817135 -159135253 -140955508
57000 -140955508 -124343650 -109314270 -95841016 -83864911 -73297456 -64024596 -55917992
56993 -55917992 -48847812 -42688943 -37323401 -32644678 -28560805 -24991572 -21864807 -19117907
56985 -19117907 -16700678 -14572855 -12698823 -11045962 -9585792 -8293393 -7146074 -6124533
56977 -6124533 -5214483 -4405160 -3686521 -3048832 -2483586 -1982968 -1539167 -1145573 -797838
56968 -797838 -492351 -224273 12012 221419 407958 574836 723492 853539 965070 1060556
56958 1060556 1143764 1217637 1283794 1342763 1393583 1434312 1464354 1485752 1501316 1512640 1521771
56947 1521771 1534640 1560845 1607671 1671885 1735615 1771342 1755142 1679462 1555208 1402240 1237910
56936 1237910 1072586 911738 759067 617945 491453 381381 286856 204752 132251 68623
56926 68623 14162 -31699 -70441 -103246 -130693 -153224 -171393 -186182 -199527 -213834 -230136 -247060
56914 -247060 -262186 -274223 -283582 -291378 -298351 -304306 -308081 -308202 -303735 -294234 -279085 -257750 -230956
56901 -230956 -200793 -169153 -136530 -102579 -67269 -31240 4233 37246 65763 88662 105954 117973
56889 117973 124936 127505 127131 125491 123847 122953 123128 124479 127490 133110 141602 151697 161876 172252
56875 172252 184104 197800 212609 228562 246903 268121 290641 311787 328814 338867 339704 331550
56863 331550 317138 299072 278140 254915 231567 210647 192766 176664 161214 146402 132696
56852 132696 120287 108945 98227 88145 79705 74085 71037 68957 66898 65544 65710 66965 68516
56839 68516 70481 73396 77275 82002 87802 94415 100726 106347 112813 121839 132885 143798 153612 163523
56825 163523 175166 189031 204438 219848 233079 242413 248112 252314 257166 263382 270536 278094 286040
56812 286040 295063 306334 320650 337628 356145 375674 396899 420933 448294 478769 512003 548004
56800 548004 587112 629438 674068 718488 758704 790253 809855 816753 812515 799395 779232 754194
56788 754194 727823 704037 684980 670761 661333 657472 659550 666560 677349 692229 712755 740372
56776 740372 775809 818991 868682 922543 978148 1033375 1085097 1128042 1156077 1164998 1154234 1126716
56764 1126716 1087724 1043030 996797 950915 906490 865325 829377 799537 775995 759294 749822
56753 749822 746643 748214 754371 766376 784737 808175 835276 865912 899796 933899 962265 978771
56741 978771 980187 967122 942730 910618 873563 833613 792831 753527 717722 686572 660337 638754
56729 638754 621477 608359 599423 594528 593141 594472 597864 603146 610869 622070 637174 654508 669960
56716 669960 678641 677451 666542 648687 627182 603770 578239 550082 520545 492574 468502 448120
56704 448120 429338 410482 391713 374536 360321 349161 339922 331451 323766 317717 313507 310232 307201
56691 307201 304999 304448 304941 304711 302797 299959 297470 295581 293610 291218 289084 288166 288521 289197 289310 288824
56675 288824 287977 286470 283971 281189 279355 278462 277100 274528 271845 270318 269578 268685 268232 269775 273300
56660 273300 276753 278454 278743 278723 278501 277576 276329 276040 277442 279775 281398 281183 279455 277726 277296 278042
56644 278042 278836 279127 279500 280384 280834 279351 275674 271221 267894 266895 268354 271196 273276 272649 269276 264981
56628 264981 261348 258312 255323 252982 252309 252821 252809 251713 250879 251428 252532 252666 251662 250520 249889 249846 250672
56611 250672 252537 254589 255563 255380 255137 255453 255908 256299 257296 259290 261460 262656 262671 262192 261994 262493 263518
56594 263518 264098 262999 259918 255784 251644 247750 243941 240274 236923 234043 231985 230957 230267 228902 227372
56579 227372 227864 231580 236792 240835 243425 246576 251410 256548 259994 261412 261978 262798 264200 266004 267737
56564 267737 268681 268301 266759 264787 262992 261369 259542 257381 255226 253470 252138 251172 250917 251756 253124
56549 253124 253549 252240 250262 249457 250196 250913 250116 248420 247962 249881 252899 254781 254873 254562 255254 256742 258087
56532 258087 259350 261433 264432 267236 268971 269944 270828 271613 271866 271527 271010 270827 271315 272364 273237 273231 272750
56515 272750 273199 275435 278829 282211 285244 288434 292223 296664 301717 307343 313281 319003 323907 327645
56501 327645 330510 333446 337277 341944 346889 352050 357853 364335 371031 377808 384924 392084 398285 402956
56487 402956 406490 409368 411608 413400 415320 417353 418484 417789 415280 411310 406124 400502 395797 392460
56473 392460 389334 385182 380198 375376 371274 368176 366369 365239 363010 358704 353543 349177 345389 341057
56459 341057 336695 334075 333481 333179 331893 330210 329008 327872 325896 323109 320392 318555 317980 318602 319747
56444 319747 320451 320385 320136 320216 320083 318572 315294 311385 308705 308180 308971 309461 309047 308580 309104 310673 312502
56427 312502 313631 313283 311420 309410 309328 311929 315842 319295 321878 324103 326157 328167 331038 335813 342347
56412 342347 349351 355530 360122 362883 364383 365939 368484 371778 375213 378739 382436 386062 389871 394944
56398 394944 401605 408382 413883 418921 425298 433044 440480 446536 451246 454144 454104 451193 447274 444199 442309
56383 442309 440783 438553 434943 430481 427016 425852 425767 424026 419355 412857 406159 400016 394724 390495 387097
56368 387097 384299 382806 383601 386275 389227 391581 393641 395416 396278 396414 397113 399018 401290 402994 404173
56353 404173 405070 405454 405152 404265 402519 399599 396397 394629 394710 395261 395115 394510 393861 392906 391759 391241 391251 390320
56335 390320 387950 385973 386119 387364 387408 386038 385233 386162 387734 388375 388022 387858 388801 390758 393089 395441
56319 395441 398018 401003 404029 406599 408821 411140 413444 415230 416675 418622 421303 424004 426321 428903
56305 428903 432431 436654 440914 444971 448766 451939 454174 455711 457217 459390 462695 466954 471259 474975
56291 474975 478781 483898 490311 496694 502161 506953 511203 514258 515793 516651 517991 520301 523509 527195
56277 527195 530384 532123 532631 533093 534055 535111 536419 539248 544403 551170 558457 566023 574024 582392 591229
56262 591229 600825 610663 619484 626993 634533 643360 653281 663769 675283 688473 702813 716980 730108
56249 730108 742237 754239 767641 783434 800525 816485 830464 844076 858762 873737 887622
56238 887622 900599 913413 925396 935270 943344 951349 960334 970017 979960 990224 1000965 1012239 1024102
56225 1024102 1036381 1048801 1061895 1077158 1095655 1117135 1141143 1168109 1198482 1231735 1267266
56214 1267266 1305619 1347759 1393880 1443986 1498908 1559435 1624991 1694482 1768229 1847967 1935091
56203 1935091 2029864 2132181 2242281 2360907 2489446 2629605 2782307 2947166 3123408 3310586
56193 3310586 3507800 3713122 3924579 4140893 4360237 4579120 4793554 5000506 5196908
56184 5196908 5377897 5537551 5671285 5776649 5852421 5898398 5915868 5907006 5873674 5817699 5742070
56173 5742070 5650627 5546443 5431312 5306816 5174930 5037443 4895586 4750577 4604091 4457912
56163 4457912 4313133 4169576 4025942 3880952 3734527 3587623 3441152 3295796 3152761
56154 3152761 3013502 2878448 2747170 2620167 2499165 2385129 2277329 2175088 2079101 1990099
56144 1990099 1907538 1830674 1759705 1694764 1635085 1580371 1531672 1489390 1451616 1416173 1383321
56133 1383321 1354587 1329632 1306162 1282706 1259797 1238512 1219251 1202048 1187079 1174778 1165820
56122 1165820 1160372 1156939 1153028 1147888 1143527 1142109 1143551 1146779 1151867 1159243 1168052 1177162 1187043 1198886
56108 1198886 1212666 1227665 1244021 1262031 1280861 1299882 1320465 1344351 1370892 1397993 1425232
56097 1425232 1453814 1483800 1513769 1543225 1573190 1604077 1634899 1664943 1694731 1725109 1756762
56086 1756762 1790683 1827798 1868249 1912361 1961948 2019112 2084031 2155692 2234630 2323236 2423191
56075 2423191 2534064 2654372 2782440 2916047 3052449 3188684 3320864 3443835 3553414
56066 3553414 3649119 3733661 3810122 3880475 3945314 4002509 4046584 4071954 4077305 4065568 4040257
56055 4040257 4003870 3959130 3908624 3852216 3786710 3708925 3617921 3514332 3399624 3276742 3149928
56044 3149928 3023112 2899256 2781213 2671878 2573235 2486235 2411409 2348420 2295286 2249621
56034 2249621 2210734 2179456 2156126 2139845 2129342 2123354 2120538 2120190 2122515 2127139 2132142 2135725 2137830
56021 2137830 2138812 2137967 2135175 2132658 2132882 2135705 2139591 2144363 2150433 2156667 2161875 2167457 2175706 2186318
56007 2186318 2197480 2209732 2225640 2246008 2269367 2294890 2322877 2352622 2382842 2414175 2448496
55996 2448496 2485862 2524821 2565405 2608860 2654580 2700389 2745970 2793248 2843241 2895044 2947792
55985 2947792 3001159 3054317 3106933 3160572 3216577 3273617 3330336 3389197 3454131 3525255 3599578
55974 3599578 3675986 3755662 3838536 3923697 4012807 4108802 4211473 4318430 4429782 4547492
55964 4547492 4670922 4797938 4929892 5070261 5218564 5371050 5527437 5691523 5864904
55955 5864904 6045697 6233915 6432359 6641546 6859368 7086529 7326617 7580164 7844589
55946 7844589 8120813 8413626 8724438 9050070 9390079 9748721 10127946 10524932 10938551
55937 10938551 11372153 11828249 12306929 12811473 13349090 13924056 14536149 15186885 15880189
55928 15880189 16615579 17388718 18200901 19060393 19972472 20936333 21954025 23033860 24182514
55919 24182514 25402629 26700903 28089425 29576297 31164562 32863507 34691456 36665028
55911 36665028 38796642 41105638 43620405 46366754 49367379 52657311 56288158 60315544
55903 60315544 64798618 69816481 75469371 81860050 89091514 97284961 106577434 117098383
55895 117098383 128976661 142380411 157526160 174646710 193982834 215800615 240355506
55888 240355506 267816133 298238562 331468166 366650581 401439848 431734432 452736259
55881 452736259 460949945 455663847 438838222 413765345 383716269 351319852 318524544
55874 318524544 286710622 256786157 229289651 204481682 182396098 162892150 145739410
55867 145739410 130689740 117497106 105919209 95736555 86766788 78852944 71852312
55860 71852312 65646225 60145177 55270771 50940466 47075823 43613041 40496523 37672448
55852 37672448 35096993 32741879 30584298 28598939 26765288 25073607 23516658 22082388
55844 22082388 20759784 19544018 18429614 17404715 16456877 15578392 14761856 13997294 13278117
55835 13278117 12603646 11971658 11374720 10807792 10272919 9772040 9301254 8856516 8438969
55826 8438969 8049803 7684975 7339470 7012067 6701974 6405578 6120553 5848705 5590975
55817 5590975 5344059 5105437 4877229 4661597 4456973 4262398 4080944 3914809 3761304
55808 3761304 3617576 3485154 3365791 3256817 3154945 3061171 2977487 2901636 2829122 2757834
55798 2757834 2687157 2615257 2541082 2466806 2394913 2324759 2254752 2185683 2119265 2055730 1995263
55787 1995263 1939164 1887000 1835434 1782657 1731426 1684911 1642165 1600614 1560513 1524013 1492006
55776 1492006 1464685 1443034 1426950 1413916 1402058 1392436 1385973 1380569 1374057 1367761 1364100 1362466 1360140
55763 1360140 1355580 1348414 1338081 1324917 1310694 1295678 1277124 1253011 1225186 1196336 1166224 1133792
55751 1133792 1100865 1070490 1043027 1016813 991328 967012 943388 920229 899440 883143 870909
55740 870909 861128 853733 849157 846002 842394 838625 836073 834663 833650 833623 835254 837102 836996 834670 830990
55725 830990 825881 819164 812079 805655 798925 791014 783516 778221 773926 768251 761343 754785 747938 738401
55711 738401 725484 710418 693756 675426 656854 640231 625854 612589 600501 590540 582013 572953
55699 572953 562737 551989 540341 526879 512538 499434 487840 476193 463991 452274 441401
55688 441401 430840 421065 413094 406026 397660 387857 378793 371415 364135 355660 346727 338280 330238 323027
55674 323027 318234 316439 315986 314984 313204 311195 309029 306893 305535 305034 304156 301896 298774 295761 292725
55659 292725 288844 283993 278912 274266 270050 265814 261281 256837 253348 251385 250901 251713 253553 255332 255543
55644 255543 254209 253428 254921 257954 260793 262962 264555 264584 262260 259161 257755 258060 258036 257089 256640 257077
55628 257077 256939 256056 257005 261831 269080 275765 281115 286834 294505 304139 314841 325638 335671 344375
55614 344375 351502 356746 359734 360622 360275 359485 358346 356593 354134 351047 347569 344333 342209 341527 341672
55599 341672 341673 341218 341115 342764 346869 352571 358285 363380 368343 373111 376409 377516 377593 378175 379144 379368 378632
55582 378632 377522 375887 372934 368644 363658 357893 350640 342070 333359 325281 317880 311449 306349 301678
55568 301678 295581 287389 278295 269502 260853 251804 242595 233660 224701 215180 205325 196074 188357 182713
55554 182713 179185 177128 175345 172786 169234 165376 162173 159877 157640 154596 151313 149282 148725 148102 146504
55539 146504 145185 145448 146160 145111 142158 139195 137317 135848 134151 132602 131442 130111 128133 125592 122567
55524 122567 119230 116499 115307 115033 113963 111452 108480 105886 103382 100654 98211 96692 96268 96943 98473
55509 98473 99964 100739 101659 104313 108787 113508 117399 120680 123322 124424 123771 122520 121567 120447 118553
55494 118553 116228 113976 111733 109586 108047 106964 105308 102733 100226 98525 97100 95389 93806 92735
55480 92735 91772 90898 91106 92826 94935 96541 98469 101571 104699 106064 105841 105704 106340 107198 108423 111039
55464 111039 114980 118612 120880 122724 125564 129237 132346 134329 136334 139808 144583 148757 150664 150645 150493
55449 150493 151275 152360 152596 151574 149396 145975 141335 136109 131019 126016 120422 113803 106437 99159 92948
55434 92948 88302 84767 81313 77301 72789 68085 63673 60463 59083 58712 57742 55950 54842 55226 55734
55419 55734 54693 52409 50394 49259 48678 48619 49001 48587 45997 41873 38468 36880 36088 35093 34439 34786 35252
55402 35252 34462 32590 31137 30871 30998 30424 29020 27356 25827 24437 23146 22102 21642 22182 23794 25676
55386 25676 26454 25570 24176 23999 25276 26555 26767 26672 27614 29480 30836 30788 29772 28451 26839 24892 23273
55369 23273 22972 24343 26791 29181 30477 30288 29050 27548 26252 25219 24631 25085 27137 30525 33865
55354 33865 35404 34563 32779 32204 33386 34885 35361 35050 34708 34306 33874 34517 36998 39916 41033 40238 39540
55337 39540 40144 41216 41771 42076 42540 42670 41967 40874 40133 40040 40721 42205 43747 44063 42744 40682 38739
55320 38739 36945 35242 34003 33509 33965 36049 39974 43783 44486 41769 38872 38728 40822 43072 45025
55305 45025 47271 49032 48681 46285 43665 41910 40347 38087 35320 32894 31465 31192 31568 31694 31277 31083
55289 31083 31821 33037 33769 33704 32958 31405 29238 27577 27319 27653 26839 24378 21531 19770 19488 20112 20774
55272 20774 20961 20976 21506 22402 22582 21670 20824 21128 22001 22271 21977 21834 21598 20522 19038 18441 18930 19355 18968
55253 18968 18163 17359 16349 15059 14063 13970 14824 16083 16704 15669 13136 10745 9882 10048 9890 9382 9794
55236 9794 11767 14605 17311 19149 19383 17821 15633 14523 14937 15981 16904 17597 17913 17796 17973 19151
55220 19151 20551 20645 19358 18206 18178 18918 20103 22034 24544 26816 28677 30680 32615 33516 33583 34272 35743
55203 35743 36095 34276 32160 32130 33697 34092 31676 27570 24364 24120 27039 31109 33519 33218 31720 30947
55187 30947 31055 30982 30117 28528 26355 24046 22505 22070 21916 21349 20920 21289 21829 21569 20804 20427 20244 19357
55169 19357 17808 16422 15329 14172 13546 14557 16832 18650 19370 20107 21501 22468 22165 21762 22912 25382
55153 25382 27589 28942 30276 32246 34552 36739 38620 39767 39675 38790 38399 38882 38843 36783 33131 29798
55137 29798 27984 27338 27209 27678 28911 30199 30392 29102 27025 25204 24259 24129 24228 23961 23404 23369 24538
55120 24538 26658 28810 30256 30775 30491 29785 29177 28865 28578 28215 28329 29449 31236 32990 34763 37108
55104 37108 39762 41474 41462 40416 39747 40300 41932 43783 44780 44428 43350 42568 42125 41140 39415 38085 38008
55087 38008 38176 36732 33398 30011 28415 28400 28138 26431 24038 22642 22832 23610 23847 23544 23341 23494 24046
55070 24046 25515 28365 31876 34480 35346 34921 33941 32830 32143 32559 33933 35133 35364 35106 35436 36958
55054 36958 39670 43099 46273 48401 50102 53177 58464 64565 69316 71915 72999 73344 73482 74075 75533
55039 75533 77193 77657 76149 73176 70005 67781 66911 66831 66484 65364 63993 63218 63417 64651 67010 70209
55023 70209 73129 74406 73470 70868 67794 65494 64737 65510 67380 70168 73797 77544 80280 81681 82308
55008 82308 82282 81046 79046 78266 79828 82011 82204 80343 78907 79555 81142 81328 79138 75615 72650 71397
54992 71397 71413 71261 70202 68889 68046 67230 65741 64042 63172 63220 63619 64525 66421 68500 69048 67700 65852
54975 65852 64552 63405 62053 61245 61549 62175 62167 61986 62886 65182 67958 70112 71068 70847 70080 69679 70038 70774
54957 70774 71496 72291 73141 73555 73319 73071 73490 74363 75095 75770 77061 79248 81842 84139 85847 87356 89475
54940 89475 92479 95189 95743 93769 91272 90687 92454 94997 96564 96335 94332 91406 89258 89351 91370 93402
54924 93402 93990 93493 93140 93191 92584 90379 87262 85430 86788 91155 96271 99654 100440 99508 98237 97284 96237
54907 96237 94224 91092 88104 87053 88419 90854 92737 93692 94227 94672 95272 96725 99587 103374 107252
54892 107252 111471 117083 124225 131773 138938 146241 154521 163884 174016 184618 195057 204558 213526
54879 213526 223854 237012 252387 268263 283568 297473 307998 312864 311874 306978 299668 289742 277224
54866 277224 263903 251651 240097 227463 213313 199162 186572 175943 167332 161083 157048 154165
54854 154165 151548 149275 147399 144932 140868 136000 132661 132528 135261 139371 143742 148149 152907 158427
54840 158427 164858 171989 179799 189168 201431 216796 233468 248735 260951 270301 277824 283844 287280
54827 287280 286474 280916 272052 261963 251347 239481 226276 213277 201924 191657 180855 169173
54815 169173 157733 147259 137520 128853 122664 119530 117804 115279 111663 108428 106611 105818 105302 104958
54801 104958 105041 105641 106686 107912 108641 108106 106304 104146 102593 101884 101621 101170 99972 97933 95697 94035
54785 94035 92799 90901 87581 83316 79313 76496 75091 74659 74344 73569 72691 72366 72196 70949 68557 66850
54769 66850 67352 69211 70484 70843 71592 73282 74874 75459 75450 75693 76543 78254 81051 84192 86077 86227 86242
54752 86242 87762 90179 91487 90956 89800 89423 90179 91898 94579 98156 102209 106290 110238 114139 118237
54737 118237 122804 127698 132323 136541 141435 148294 156892 165653 173705 181948 191742 203387 216502 231232
54723 231232 248115 266881 285993 303446 317683 328014 334639 338303 339502 337975 333195 325348 315535
54710 315535 304979 294308 283646 273125 263160 254246 246569 239743 233064 226230 219868 215178 212951
54697 212951 212921 214007 215170 216232 218121 222207 229043 237647 246323 254408 263001 273785 287329 302814
54683 302814 319141 335771 352539 369352 386479 404601 423944 443449 461225 475742 486197
54672 486197 492002 492738 488703 480748 469129 453122 432321 407903 382076 356667 332820 311548
54660 311548 293507 278147 264110 250863 239298 230305 223368 217057 210425 203374 196121 189050 182863
54647 182863 178070 174240 170385 166231 162519 159905 158163 156849 156108 156184 156452 155822 154173 152723 152616 153572
54631 153572 154298 154037 153273 152922 153161 153272 152564 151245 150156 149574 148598 146250 143087 141126 141789 144396 147094
54614 147094 148882 150172 151744 153983 157067 161017 165262 168834 171464 174018 177439 181635 185857 189823
54600 189823 193893 198271 202541 206070 208580 210251 211502 212698 213999 215447 217039 218518 219337 219437 220106
54585 220106 223257 229420 237023 244209 250766 257564 264739 271637 278404 286434 296936 309921 324860
54572 324860 341408 359006 376684 394161 412686 433952 458279 484261 509681 532019 548512
54561 548512 557091 557779 552428 542626 528465 509814 487984 465071 441909 417927 393322 370276
54549 370276 351097 335787 322441 309785 298228 288310 279305 270019 260280 250831 242118 233961 226320
54536 226320 219652 214303 209931 205775 201388 197091 193647 191282 189013 185359 179956 174011 168837 164460
54522 164460 160167 155904 152204 149041 145704 141867 137915 134104 130218 126322 123066 120844 119233 117730
54508 117730 116531 116088 116324 116735 116974 116925 116416 115300 113687 111929 110522 110085 110980 112675 113864 113625 112232
54491 112232 110648 109634 109560 110494 111901 112700 112398 111928 112602 114281 115406 115068 114360 115236 118474 123232 128305
54474 128305 133124 137495 141055 143620 145855 148910 153069 157288 160564 163490 167800 174542 183405 193838
54460 193838 205787 218852 231576 242545 251863 260704 269498 277220 282404 284165 282187 276568 268051
54447 268051 257937 247241 236046 223856 210452 196366 182842 171354 162681 156194 150426 144716
54435 144716 140027 137733 137847 138886 139298 138438 136228 132770 128722 125400 123665 122825 121369 118853 116436
54420 116436 115328 115325 115250 114339 112823 111584 111765 114200 118450 122660 125244 126640 128531 131381 133818 134775
54404 134775 135161 136580 139186 141754 143478 144751 146256 148055 149685 150675 150972 151162 152093 153786 155014
54389 155014 154512 152434 149971 147794 145716 143807 142738 142647 142584 141683 140183 138679 136939 134328 131048 128110
54373 128110 126125 124799 123626 122406 120940 118950 116606 114663 113659 113220 112491 111041 109084 107086 105572
54358 105572 105032 105506 106291 106580 106558 107363 109699 112860 115549 117401 119228 121807 124917 127697 129597 130833
54342 130833 132123 134129 136979 140205 143312 146456 150217 154593 158654 161643 164033 166914 170498 173987
54328 173987 176978 180028 183288 185423 184947 182254 179135 176280 172545 167220 161710 157776 154891 150836
54314 150836 144774 138349 133556 130836 129670 129747 130605 131181 130809 130171 130301 131140 132001 132841 133847 134199 132768
54297 132768 130019 127798 126978 126716 126481 127223 129514 131746 131643 129057 126027 124306 123999 124591 126184 129241
54281 129241 133729 138905 143744 147517 150238 152593 155114 157431 158580 158119 156729 155727 155989 157108 157412
54266 157412 155152 150172 144323 139817 137127 134840 131568 127608 124453 122923 122163 120672 118166 115972
54252 115972 115451 116375 117256 116892 114991 111586 106861 101657 97133 93463 89680 85286 81167 78336 76674
54237 76674 75864 76585 79424 83001 84771 83800 81568 79794 78680 77771 77396 78242 79944 81059 80557 79013
54221 79013 78205 79563 82926 86706 89253 89888 88826 86776 85029 85122 87424 90342 91864 91885 92183 94144
54205 94144 97364 100502 102432 102408 100226 96871 94206 93408 94156 95606 97364 99010 99623 98748 97323 96813
54189 96813 97590 98764 99304 98859 97829 97240 98093 100144 101649 101126 99089 97280 96427 95815 95057 95117 97022
54172 97022 100316 103431 105226 105699 105454 105004 104515 103940 103332 102993 103102 103255 102839 102015 101831 103009 105012
54155 105012 106775 107939 108722 108935 108195 107259 108012 111313 115400 117429 116438 114063 112400 111986 112027 111639 110381
54138 110381 108245 105872 104412 104492 105488 106284 106465 106212 105412 103729 101515 99733 98736 97867 96617 95503
54122 95503 95268 95638 95459 93890 91087 87853 85029 83116 82170 81977 82478 83949 86574 89853 92586 93560
54106 93560 92408 89916 87430 85769 84694 83507 81965 80391 79054 77879 76706 75425 73895 72221
54092 72221 71150 71545 73187 74618 74647 73729 73399 74435 75902 75975 73631 69608 65818 63742 63364 63771 64532
54075 64532 65984 68218 70449 71741 72017 72043 72674 74282 76580 78740 80009 80380 80437 80417 79943 78928 78190
54058 78190 78637 80127 81538 81797 80591 78493 76687 76163 76643 76671 75301 73410 72710 73654 74989 75382 74885
54041 74885 74680 75832 78370 81191 82791 82414 80688 78964 78180 78553 80078 82641 85533 87474 87666 86669
54025 86669 85913 86239 87074 87228 86566 86530 88626 92442 95852 97340 97531 97986 99160 100261 100672 100596 100380 100059
54007 100059 99681 99388 99106 98814 99213 101300 104934 108526 110690 111715 112832 114477 115978 116892 117860 119819
53991 119819 122647 124978 125490 124360 123327 124154 126934 130086 132028 132702 133358 135172 138405 142826 148439
53976 148439 155391 163297 171169 178341 185278 193055 202023 211381 220233 228643 237248 246123 254591 262128
53962 262128 268888 275102 280412 284342 287375 290912 295701 300509 303007 302205 299518 297043 295332 293563
53948 293563 291430 289653 288484 286893 283751 278940 272749 265094 256138 246925 238399 230482 223119 217425
53934 217425 214396 212895 210601 206981 203824 202540 202443 202138 201182 199643 197415 195016 193912 194777 196190
53919 196190 196283 195062 193852 193019 191790 190187 189513 190486 192177 193449 194446 195773 196986 196991 195791 194862 195518
53902 195518 197458 199227 199771 199112 197733 195856 193525 191014 188792 187189 186461 187040 189200 192388 195425
53887 195425 197629 199364 201163 202776 203622 203952 204866 207146 210583 214611 219100 224190 229613 234650 238855
53872 238855 242485 246093 249896 253854 258245 263621 269945 276180 281243 285143 288708 292378 295951 299517
53858 299517 303809 309286 315415 321301 326601 331531 336453 341759 347621 353456 358298 362236 366851 373421
53844 373421 381147 388095 393556 398458 403582 408436 412031 413828 413681 411698 408521 405011 401323 396946
53830 396946 391792 386436 380968 374692 367557 360874 355623 350830 344818 337534 330353 323778 316749 308390
53816 308390 299183 289955 280826 271810 263576 256706 250737 244788 238774 233276 228522 224292 220577 217413
53802 217413 214161 210003 205375 201923 200451 199572 197068 192089 185477 178514 172233 167604 165254 164772 165002
53787 165002 165200 165371 165439 164979 164048 163414 163313 162661 160298 156553 152775 149623 146763 144108 142291 141606 141298
53770 141298 140404 138873 137365 136322 135660 135253 135406 136779 139689 143297 145817 146252 145901 147211 150853 154861
53754 154861 157321 159010 162207 167365 172342 175151 176244 177485 179633 181784 183060 184009 186082 190040
53740 190040 195285 200839 206700 213737 222101 230367 236845 241446 245444 249547 253232 256210 259447 263845
53726 263845 268653 272366 274975 278100 282568 286846 288596 287305 284648 282474 281185 280124 278675 276451
53712 276451 273013 268353 263622 260481 259374 259049 258196 256900 255862 254863 253141 251002 249787 250021 250636
53697 250636 250407 249107 246819 243314 239101 236071 235692 236914 237222 235621 233388 231883 230921 229759 228535
53682 228535 227851 227517 226456 223796 219733 215454 212243 210362 208798 206501 203687 201260 199143 196301 192776
53667 192776 190405 190595 192171 192644 191242 189493 188819 188743 188059 186939 186885 188623 190811 191417 190187 189099
53651 189099 190019 192525 194824 196549 199429 204841 211755 218012 222962 227649 232549 236422 237929 237675 237868
53636 237868 240006 243495 246683 248926 251100 254052 257226 259417 260542 261862 264435 268166 272541 277345
53622 277345 282186 286115 288447 289480 289794 289362 287968 286016 284087 282123 279781 277303 275292 273948 273295
53607 273295 273730 275288 276603 275784 272452 268026 264015 261067 259690 260512 263151 265820 266934 266597 265941
53592 265941 265523 265026 264173 263243 262698 262717 263168 263914 265069 266731 268328 268677 267308 265437 264800 265531 266142
53575 266142 265835 265916 268330 273380 279344 283916 285732 285086 283779 283952 286544 290870 295614 299846 303148
53560 303148 305499 307334 309280 311632 314549 318573 324051 329919 334283 336741 339180 343541 349578 355578
53546 355578 360448 364294 367652 371154 375444 380499 385478 390082 395429 402516 410360 416896 421505 425371
53532 425371 429438 433356 436617 439473 442252 444736 446808 448984 451713 454640 456998 458373 458873 458971 459362
53517 459362 460484 461877 462507 462035 461424 461978 464034 466850 469590 472184 475299 479503 484336 488321 490181
53502 490181 490072 489480 490038 492624 497169 502654 507421 510194 511045 511128 511554 512912 515553 519481 523849 527369
53486 527369 529593 531260 533206 535521 538122 541513 546357 552610 559583 566680 573644 580237 586286 592324
53472 592324 599847 610295 623326 636362 646630 653979 661045 670186 680957 691417 701204 711963
53460 711963 724960 739831 755914 773279 791743 810304 828679 848406 871022 895667 919867
53449 919867 942541 965054 989216 1015281 1042163 1068810 1095163 1122453 1152777 1187538 1225774
53438 1225774 1264543 1301491 1336724 1371832 1407595 1443338 1478260 1512507 1546716 1581157 1615763
53427 1615763 1650570 1685558 1720230 1753986 1786909 1819616 1852202 1883965 1914577 1944906 1975968
53416 1975968 2007426 2037985 2067173 2095878 2125016 2154470 2183620 2212104 2239512 2265039 2288123
53405 2288123 2309017 2328001 2344367 2356976 2365668 2371340 2374590 2375091 2372571 2367663 2361238 2353276 2342962
53392 2342962 2329750 2313916 2296177 2277227 2257645 2237767 2217350 2195618 2171913 2146172 2118682
53381 2118682 2089761 2060113 2031160 2004147 1978693 1952910 1925467 1897157 1869977 1845090 1822288
53370 1822288 1801162 1781896 1764800 1749672 1736001 1723548 1712682 1704299 1699216 1697183 1696641 1696006 1695168
53357 1695168 1695231 1696992 1700458 1705800 1713721 1724528 1737681 1752691 1769622 1788171 1807118 1825621 1844688
53344 1844688 1866576 1892953 1923999 1958745 1995641 2033398 2072148 2113479 2158554 2206528 2255667
53333 2255667 2305562 2357242 2411399 2467743 2526055 2586564 2648998 2712454 2776627 2842120 2908933
53322 2908933 2975715 3041334 3106403 3172362 3239524 3306794 3372783 3436449 3497157 3555027 3610854
53311 3610854 3664719 3714912 3759265 3797477 3831056 3860884 3886027 3905330 3918992 3927658 3930769 3926915
53299 3926915 3915551 3897390 3873150 3842877 3806719 3765721 3721307 3674285 3624650 3572231 3517264
53288 3517264 3460411 3402385 3343564 3283963 3223637 3163035 3102814 3043397 2984952 2927806 2872527
53277 2872527 2819491 2768596 2719465 2671624 2624339 2576807 2528937 2481837 2437045 2395137 2355267
53266 2355267 2316085 2277032 2238835 2202923 2170381 2141315 2115166 2091466 2070078 2050738 2032786
53255 2032786 2015507 1998363 1980719 1961848 1941743 1921576 1902734 1885583 1869781 1855626 1844234
53244 1844234 1836181 1830696 1826546 1823173 1820628 1818964 1818331 1819416 1823135 1829780 1838780 1849324 1860984 1873798
53230 1873798 1888030 1903999 1921996 1942251 1964871 1989701 2016175 2043560 2071572 2100783 2132046
53219 2132046 2165208 2198433 2229150 2255937 2279361 2300901 2321312 2340342 2357561 2372657 2384957
53208 2384957 2393657 2398927 2402082 2404130 2404741 2403053 2398652 2391107 2379472 2363408 2344191 2323440 2301304
53195 2301304 2277181 2251657 2226012 2199938 2171654 2140751 2109116 2078202 2046927 2013384 1977422
53184 1977422 1940446 1903720 1868168 1834955 1804877 1777441 1751539 1726573 1702001 1676538 1649165
53173 1649165 1620810 1593808 1569617 1547829 1527241 1506980 1486648 1466288 1446356 1427193 1408586
53162 1408586 1390410 1373497 1359156 1347908 1339196 1332109 1325703 1318876 1310733 1301120 1290388 1278872
53150 1278872 1267014 1255545 1244790 1234073 1222434 1209624 1195849 1181171 1165928 1151155 1137575
53139 1137575 1124684 1111759 1099132 1087312 1075554 1062784 1049422 1036561 1023681 1009187 993208
53128 993208 977833 964191 951198 937842 924700 912159 898872 883371 866093 848562 831598
53117 831598 815446 800668 787600 775555 763565 751319 738614 724812 709943 695510 683003
53106 683003 672154 661713 651263 641085 630923 620370 610173 601667 594892 588528 581757 574998
53094 574998 568540 561564 552944 542306 529966 516491 502724 489799 478724 469989 463465 458373 453512
53081 453512 447997 441858 435666 429814 424441 419799 416119 413145 410252 407043 403616 400330 397474 394917
53067 394917 391950 387909 383111 378620 374809 370842 366018 360858 356233 352220 348630 345899 344262 342588
53053 342588 339373 334744 330271 326796 323569 319658 315179 310792 306844 303370 300333 297644 295354 293852
53039 293852 293242 292703 291129 288457 285682 283612 282246 281216 280034 278011 274842 271281 268397 266280 264469
53024 264469 263551 264949 268785 273174 276286 278221 280230 282933 285889 288234 289203 288684 287758 288058 290115
53009 290115 292933 295497 297812 300022 301450 301357 299929 297650 294326 289547 283707 277743 272155 266995 262432
52994 262432 258661 255537 252860 250655 248682 246201 242919 239615 237021 234547 231074 226654 222432 219144
52980 219144 216673 214897 213818 212912 211516 210069 209820 210924 211834 211194 209445 207840 206637 205236 203650
52965 203650 202712 202712 202623 201112 198010 194546 192299 191999 193168 194688 195640 195745 195211 194337 193194 191524 188876
52948 188876 185088 180771 177135 175128 174634 174685 174440 173830 173211 172686 172051 171393 171329 172513 175076 178743 183179
52931 183179 187892 192017 194728 195934 196209 196047 195555 194901 194495 194450 194261 193382 191886 190266 188782 187369
52915 187369 186087 185289 185222 185581 185713 185373 185235 186296 188654 191267 193311 195316 198306 202076 205221 206788
52899 206788 207014 206397 205126 203796 203523 204558 205571 205273 204372 205025 208510 213968 219282 222801 224569 226261
52883 226261 229569 234369 238923 242114 244616 247453 250485 253236 256167 259786 263209 265152 265991 267327
52869 267327 269679 272135 274342 277241 281431 286196 290695 294954 299119 302799 305755 308172 309670 309136
52855 309136 306451 303468 302261 302929 303913 303902 302690 300715 298692 297330 296570 295367 292938 289945 287789
52840 287789 287014 287117 287586 288239 288627 288019 286265 284123 282533 281833 281690 281478 280785 279898 279704 280890 283398
52823 283398 286893 291218 295842 299305 300229 299030 297828 298274 299931 301041 300492 298689 296846 295866 295860 296390
52807 296390 297034 297766 298811 300139 301161 301107 299827 298226 297689 298878 301194 303444 304848 305248 304742 303550
52791 303550 302020 300261 298105 296046 295735 298348 302417 304691 303792 301896 302055 304821 308432 311336 313225
52776 313225 314150 314129 313570 312960 312013 310118 307697 306153 306096 306268 304545 299716 292532 285567 281767 282206 285167
52759 285167 288047 289995 291866 293884 294776 293609 291339 289808 289858 290991 292306 293236 293797 294552 296018 297846
52743 297846 299018 298987 298125 296926 295500 294056 293031 292202 290448 287081 282924 279355 276657 273902 270303
52728 270303 266055 262013 258852 256459 254018 250905 247431 244156 240666 236057 230824 226863 224721 222100
52714 222100 216525 208871 202644 199907 199297 198223 195713 192546 189615 186980 184164 180826 177216 174136
52700 174136 172250 171391 170754 169797 168703 168003 167988 168369 168224 166542 163331 160015 158229 158237 158830 158524 156439
52683 156439 152498 147654 143676 141755 141225 140494 139200 138404 138470 138030 135766 132219 128922 126314 123595 120371
52667 120371 117470 116023 116323 117631 118655 118308 116498 114367 113391 114145 115990 117818 118803 118594 117359 115828
52651 115828 114937 115084 115737 115844 114688 112434 109973 108219 107504 107637 108388 109571 110556 110255 108175 105344
52635 105344 103542 103449 104143 104606 105080 106206 107466 107616 106702 106379 107612 109223 109757 109910 111503 114390 116342
52618 116342 116416 116624 119121 123135 126161 127296 127793 128878 130703 133304 136849 140589 142945 143215 142241 141113
52602 141113 140322 140439 142202 145136 147282 147320 146240 146056 147644 150629 154555 158954 162811 165148 165936 165567
52586 165567 163854 160688 157293 155462 155471 155922 155925 156237 157764 159906 161105 160483 158320 155403 152503 150192
52570 150192 148577 147324 146306 146031 146932 148341 148706 147078 144049 140942 138311 135700 132931 130988 131002
52555 131002 132544 133672 132907 130616 128196 126467 125364 124753 124834 125773 127430 129492 131606 133404 134552
52540 134552 134690 133456 131205 129724 131150 135340 139118 139319 136228 132956 131772 132359 133542 135047 136909
52525 136909 138570 139619 140742 142919 146034 149006 151047 152317 153591 155714 158920 162218 163936 163553
52511 163553 162641 163257 165658 168367 170270 171561 172459 172196 170172 167519 166389 167548 169492 170254 169529 168508
52495 168508 168074 167968 167705 167559 168348 170713 174802 180117 185463 189702 192957 196442 200555 203899 205040
52480 205040 204601 204493 205414 206387 206712 207056 208287 210335 212690 215182 217885 220934 224652 228969 232586 233825
52464 233825 232802 231660 232098 233769 235766 238281 241484 243831 243356 240437 237841 237808 240068 242678 243854
52449 243854 242932 240536 238196 237166 237346 237688 237595 237428 237698 238232 238195 236630 233337 229617 227759 229045 232454
52432 232454 235862 238046 238946 238688 237591 236749 237148 238166 238241 237197 236538 237168 238261 239055 240316 242869
52416 242869 245743 247150 246828 246101 245910 246004 246160 246945 248732 250699 251564 251036 250045 249569 249746 250255 251171 252969
52398 252969 255717 258724 261175 262830 263887 264483 264598 264186 263244 262087 261712 263194 266227 269006 270309
52383 270309 271008 272539 274480 275089 273883 272159 270893 269782 268667 268253 268741 269205 269193 269609 270951 271974
52367 271974 271417 270059 269572 270057 270283 269875 269616 269693 269184 267578 265634 264356 263969 264091 264157 263566 262180 260820
52349 260820 260491 261033 261315 260866 260490 260951 261794 261881 260604 258305 255935 254518 254578 255914 258113 261095 264747
52332 264747 268398 271451 274408 278244 282699 286096 287197 286480 285421 285333 287150 291168 296354 300693 303072
52317 303072 304307 305796 307827 309876 311820 313887 315792 317011 317816 319227 321952 325894 330517 334900
52303 334900 337752 338421 338122 339226 342882 347910 352393 355692 358347 360626 362156 363036 364448 367651 372591
52288 372591 377907 382262 385356 387597 389313 390749 392723 396447 402299 409116 415270 420318 425071 430134
52274 430134 435171 439912 445125 451653 458783 464668 468785 473080 479829 488827 497624 504389 509519 514341
52260 514341 519560 525728 534073 545529 559307 573641 587827 602365 617270 631736 645960 661869
52248 661869 680942 702077 722637 741226 758590 776237 795184 815927 838630 862980 888334
52237 888334 914257 940710 967792 995556 1023958 1052707 1081355 1109791 1138332 1166984 1195057
52226 1195057 1221980 1247992 1273335 1297258 1318753 1337917 1355597 1371945 1386560 1399917 1413119
52215 1413119 1425870 1436316 1443625 1449398 1455361 1460909 1464441 1466219 1468005 1470016 1470184 1466977 1461675 1457125
52201 1457125 1455202 1456135 1459355 1463959 1468801 1473058 1476737 1480125 1483079 1485540 1488689 1494699 1504928 1518651
52187 1518651 1533832 1548970 1563960 1579418 1595660 1612559 1630133 1648764 1668624 1689155 1709466
52176 1709466 1729144 1748239 1766534 1783387 1798579 1812806 1826821 1840283 1851929 1860863 1867299 1872007
52164 1872007 1875336 1876822 1875492 1870592 1862409 1852442 1842426 1832870 1822761 1810876 1797162 1782548 1767672
52151 1767672 1752353 1736432 1720528 1705372 1690572 1674751 1657187 1638866 1621496 1605882 1591832
52140 1591832 1579251 1568344 1558728 1549432 1540224 1531958 1524983 1518194 1510696 1503648 1499078 1497194 1496305 1495210
52126 1495210 1494189 1493469 1492328 1490323 1488024 1485852 1483496 1481190 1480043 1479939 1478556 1474153 1468180 1463183
52112 1463183 1459017 1453516 1446598 1441011 1438365 1436699 1433109 1427047 1419777 1412022 1403774 1395457 1387762 1380677
52098 1380677 1373820 1367344 1361502 1355782 1349610 1343561 1338779 1335303 1331971 1327946 1323422 1318847 1314423 1310494
52084 1310494 1307540 1305428 1303252 1300216 1296262 1291755 1287082 1282716 1279191 1276773 1275292 1274278 1272950 1270397
52070 1270397 1266355 1261850 1258516 1257189 1257478 1258499 1259401 1259355 1257927 1255783 1254372 1254615 1256276 1258763 1262028
52055 1262028 1266483 1272599 1280830 1291477 1304247 1318314 1333024 1348262 1364124 1380730 1398463 1417802
52043 1417802 1438796 1461372 1486257 1514664 1546561 1580139 1613671 1647174 1681378 1715855 1749484
52032 1749484 1782393 1815983 1850706 1884947 1916545 1944630 1969459 1991343 2010597 2028066 2044724
52021 2044724 2060626 2074810 2086356 2095038 2100721 2102696 2100259 2094008 2085929 2077736 2069292 2059150 2046624
52008 2046624 2032776 2019125 2005990 1992601 1978433 1963691 1948738 1934070 1921029 1911558 1906372 1903797
51996 1903797 1901160 1897285 1893184 1890615 1890642 1893396 1898315 1904272 1910322 1916777 1924908 1935007 1945483 1954683
51982 1954683 1963073 1972423 1983067 1993314 2001772 2008911 2015648 2021599 2025740 2027951 2028749 2028096 2025756 2022432
51968 2022432 2019105 2015227 2008897 1999221 1987287 1974426 1960604 1945201 1928346 1910569 1891836 1871840
51956 1871840 1850832 1829291 1807055 1783543 1758632 1732612 1705413 1676592 1646177 1615090 1584671
51945 1584671 1555911 1528718 1501574 1472313 1439962 1405645 1371193 1337238 1303323 1269468 1236486
51934 1236486 1204716 1173396 1141603 1109079 1075929 1042366 1009122 977351 947469 918638 889950
51923 889950 861688 834797 809458 784882 760433 736300 713047 691052 670510 651560 634103
51912 634103 617694 601767 585914 570040 554493 540173 528091 518442 510130 501445 491353 480019
51900 480019 468278 456942 446745 438376 431970 426609 420967 414667 408673 404100 400938 398143 394663
51887 394663 390165 385186 380951 378646 378249 378267 377176 375055 373243 372514 372288 371673 370488 368873 366606 363482
51871 363482 360067 357341 355573 354030 351967 349504 347180 344859 341609 336930 331724 327458 324424 321408
51857 321408 317223 311934 306264 300546 295059 290831 288933 288906 288866 287468 285117 282976 281525 280418 279104
51842 279104 277084 274010 270131 266371 263607 261966 260963 259977 258358 255618 252001 248625 246664 246386 247059
51827 247059 247541 247011 245577 244268 243962 244238 243951 243013 242578 243064 243107 241435 238914 237477 237494 237520 236549 235202
51809 235202 234458 234298 234147 233896 233922 234441 235240 235866 236044 236159 237120 239269 241646 243046 243758 245422 249016
51792 249016 253816 258591 262882 266605 269297 270731 271834 273968 277167 279756 280111 278567 277290 278122 280626
51777 280626 282484 281985 279867 278294 278319 278975 278827 277610 276144 275356 275787 277394 279328 280290 279653 277995
51761 277995 276286 275024 274446 274863 276117 277218 277355 277029 277452 278981 280818 282160 282962 283522 283920 283977 283355
51744 283355 281772 279524 277674 277140 277627 277975 277504 276521 275596 274976 274707 274618 274133 272764 270937 269631 269064
51727 269064 268532 267784 267705 269185 272048 275560 279211 282317 283736 283029 281512 281032 281868 282745 282937 283406 285588
51710 285588 289710 294499 298071 299043 297466 294958 293516 293984 295956 298978 303086 308017 312717 316139 318101
51695 318101 319144 320121 322251 326650 333010 339191 343093 344814 346325 349284 353986 360227 367911 376368
51681 376368 384040 389820 394486 400160 408331 418706 429885 440678 450606 459429 466694 472152 476504
51668 476504 481174 486791 492145 495337 495951 495473 495400 495692 495498 494665 493786 493176 492577 491735 490489 488396 485098
51651 485098 481213 478151 476731 476490 476607 476870 477338 477573 476896 475201 473018 470868 469044 467942 468082 469583
51635 469583 471830 473792 474629 474023 472179 469704 467591 467220 469911 475818 483154 489146 492318 493705 495570
51620 495570 499255 504536 510512 516327 521221 524648 526571 527248 526828 525716 525146 526550 530180 535020 540201
51605 540201 545796 551938 557999 563129 566975 569361 569917 568690 566569 564412 562147 559325 555865 551449
51591 551449 544892 535395 524156 513352 503529 493251 481615 469784 459529 451299 444391 438049 431596
51578 431596 424318 416239 408596 402767 398902 396130 393660 391133 388436 385867 384036 382841 380975 377309
51564 377309 372472 368190 365344 363604 362707 362890 363981 365048 365262 364350 362149 358631 354506 350835 347832
51549 347832 345023 342806 342622 344845 347609 348698 347937 346805 346368 346627 347483 349107 351303 353343 354629
51534 354629 355124 355265 355889 357914 361480 365583 369253 372869 377654 384097 391592 399463 407370 414721 420623
51519 420623 424783 427870 430843 434291 438259 441966 443862 442988 440421 438343 437416 436089 432860 428121 423087
51504 423087 418090 412913 408029 404376 402292 401558 402027 403363 404684 405458 406318 407914 409550 410359 411456
51489 411456 415031 421103 426977 430689 433381 437207 442287 447285 451887 456682 460912 462463 460700 457737
51475 457737 455940 455185 453725 451070 448584 447241 446067 443466 439436 435747 434131 434851 437023 439688 442404
51460 442404 445228 448510 452455 456612 460085 462546 464673 467100 469312 470361 470491 470984 472148 472542 470852
51445 470852 467695 464608 461781 457928 452253 445468 438708 432425 426783 422304 419437 417903 416998 416294 415556
51430 415556 414270 411893 408597 405310 402827 401215 400261 400213 401613 404387 407527 410088 412296 415105 418609
51415 418609 421617 423329 424822 428038 433562 440282 447174 454315 461859 469041 474980 479917 484981 491077
51401 491077 498448 506819 515409 523314 530532 538105 546501 554376 559900 562919 564603 565253 563992 560907
51387 560907 557899 556496 555939 554603 552534 551280 551536 552330 552683 552957 554085 556223 558846 561748 565328
51372 565328 569963 575513 581404 586871 591072 593336 593612 592537 590784 588365 584823 580067 574615 568810
51358 568810 562344 555073 547962 542351 538231 534047 528570 522355 516861 512670 509172 505579 501477 496615
51344 496615 491078 485856 482454 481443 481845 482441 483236 484982 487427 488977 488591 487354 487379 489266 491580 493068
51328 493068 494429 497051 500661 503384 504030 503172 501701 499413 495657 490515 484527 477769 470084 461844 453751
51313 453751 446103 438994 432777 427337 421052 411787 399401 386470 375946 368568 362900 357303 351279
51300 351279 345193 339396 333828 328277 322811 317774 313246 308846 304448 300820 298925 298632 298762 298371 297284
51285 297284 295292 291961 287760 284440 283256 283232 282204 279469 276553 275194 275291 275181 273588 270997 269166
51270 269166 269385 271195 272900 273336 272780 272136 271828 271988 273073 275436 278463 281052 283032 285336 288661 292726
51254 292726 297105 301985 307573 313444 319093 324719 330739 336819 342005 345606 347513 348013 348031 349116 352023
51239 352023 355159 355516 351690 345224 338490 332093 325095 317076 308778 300968 293791 287331 281829 277084
51225 277084 272607 268746 266725 266809 267144 265337 260890 255333 250290 246330 243521 241906 240946 239380 236407
51210 236407 232725 229861 228573 228230 227619 226071 223881 221938 220887 220562 220241 219495 218605 218079 218060 218367 218835
51193 218835 219279 219393 219126 219038 219791 221226 222453 223052 223720 225289 227460 229141 229894 230281 230587 230022 227882
51176 227882 224932 222767 221952 221765 221716 222203 223287 223972 223531 222654 222281 221918 220404 217940 216015 215323 215131
51159 215131 214947 215425 217026 218928 220062 220324 220058 219332 218727 219818 223410 227808 230400 230875 231367 233140
51143 233140 234663 233800 230862 228370 228204 229892 231583 231948 231012 229745 229099 229300 229845 230152 230110 229983 229950
51126 229950 229890 229554 228775 227528 225886 223989 222072 220555 219970 220570 221984 223427 224327 224614 224324 223224
51110 223224 221018 217820 214176 210730 208095 206924 207561 209402 211030 211491 211335 211895 213544 215098 215085 213063
51094 213063 209579 205520 202039 200457 201210 203020 204005 203698 203142 202883 201870 198969 194835 191400 189833
51079 189833 189663 189798 189784 190007 191125 193407 196485 199661 202430 204445 205071 203697 200832 198296 197609 198521
51063 198521 199804 201181 203600 207543 211956 215311 217273 218738 220347 221448 220878 218676 216505 215959 216697
51048 216697 216968 215968 214757 214534 215002 215239 215328 215911 216580 216076 214151 212040 210775 209984 208882 207679 207313
51031 207313 208132 209390 210036 209821 209640 210667 213010 215541 217361 218906 220916 222841 223497 223202 223898 226700
51015 226700 230466 233419 235208 236535 237685 238510 239345 240680 241976 242015 240773 240073 241749 245613 249814
51000 249814 252980 255220 256929 257606 256804 255780 256721 259940 263052 263927 263473 264220 266883 270003 272696 275804
50984 275804 279906 283901 286534 288110 289805 292226 295415 299266 303046 305454 306170 306503 307563 308633 308580
50969 308580 307993 308375 309687 310382 309824 309156 309362 309797 309194 307313 305122 303882 304339 306264 308590 310399
50953 310399 311843 313715 316312 319343 322773 326935 331808 337000 342519 348760 355664 362659 369631 377103
50939 377103 385204 393240 400657 407746 415066 422861 431495 441756 454100 467994 482487 497218 512543
50926 512543 529024 547070 566711 587417 608442 629616 651531 674856 699940 727249 757581
50915 757581 791403 828351 867794 909626 954241 1002089 1053553 1108982 1168596 1232617 1301537
50904 1301537 1375762 1454891 1537867 1624032 1713339 1805342 1898894 1993269 2088455 2183348 2274596
50893 2274596 2358672 2434732 2504089 2567053 2621890 2667114 2703239 2731376 2751426 2762933 2766958
50882 2766958 2765564 2759587 2748419 2732454 2714488 2697679 2682649 2667625 2651177 2633628 2615483 2595615
50870 2595615 2571978 2543575 2510650 2473053 2429604 2379521 2323630 2263346 2198794 2128778 2052717
50859 2052717 1972075 1889709 1808012 1727916 1649420 1572752 1498839 1428765 1363093 1301906 1245387
50848 1245387 1193962 1147684 1105630 1066182 1028178 992022 959590 932604 910846 892204 874740
50837 874740 858340 844068 832617 824170 819160 817783 818754 819932 820692 822606 827200 834032 841625 849253
50823 849253 856844 864158 871378 879952 891338 904984 918797 931788 945299 961413 980941 1003109
50811 1003109 1026517 1050293 1074851 1101567 1131262 1163345 1197173 1233744 1274865 1320877 1370685
50800 1370685 1424164 1482875 1547775 1617744 1691569 1770428 1857250 1954100 2061127 2177588 2302990
50789 2302990 2437566 2582309 2738273 2905308 3082080 3267744 3462556 3665784 3873955
50780 3873955 4082661 4289503 4493539 4692041 4879765 5051924 5206231 5341225 5454309
50771 5454309 5543059 5607734 5650943 5674920 5680376 5668188 5641196 5603700 5559780 5512695 5465594
50760 5465594 5421659 5382798 5348449 5316461 5285181 5253747 5219921 5178846 5125344 5057241 4975267
50749 4975267 4879903 4769715 4643024 4499924 4342162 4172273 3993492 3809367 3622439 3434138
50739 3434138 3246703 3064151 2890081 2725317 2569078 2421836 2285592 2161634 2049562
50730 2049562 1948411 1857304 1774939 1699990 1632375 1572835 1520957 1474925 1433676 1397802 1367636
50719 1367636 1341786 1318553 1297500 1278491 1260396 1242268 1225038 1210391 1198437 1188068 1179200
50708 1179200 1172748 1168244 1163419 1157077 1150973 1147723 1147716 1149129 1150307 1150990 1151688 1153126 1156403 1162536 1171360
50693 1171360 1181614 1192643 1205481 1221639 1241214 1263091 1286979 1314297 1346536 1383521 1424089
50682 1424089 1468073 1516565 1570240 1628434 1690309 1756161 1826979 1903280 1984960 2072018 2164954
50671 2164954 2264698 2372284 2487915 2609848 2734792 2860098 2985086 3109543 3231602 3348109
50661 3348109 3456732 3556452 3646154 3723941 3788102 3837725 3872073 3890239 3891825 3877290 3847533
50650 3847533 3804122 3750326 3690954 3630524 3572001 3517431 3468611 3426357 3389872 3357781 3329318
50639 3329318 3303791 3279403 3253535 3224013 3189330 3147797 3097288 3036073 2963653 2880869 2789407
50628 2789407 2690969 2586703 2477768 2366598 2256918 2151931 2052859 1959643 1872450 1791828
50618 1791828 1717941 1650573 1589625 1534924 1485878 1442141 1404299 1372981 1347557 1326760 1310419
50607 1310419 1299419 1293741 1291736 1291827 1294041 1299295 1307866 1319176 1332594 1347917 1365307 1385120 1407596
50594 1407596 1432614 1460103 1490700 1525351 1564136 1606190 1651076 1699452 1751984 1808511 1869039
50583 1869039 1934688 2006435 2083314 2163150 2245104 2330181 2418794 2509073 2598676 2687634 2777969
50572 2777969 2870234 2961348 3046518 3122967 3191287 3253429 3309998 3359481 3399510 3428622 3447180
50561 3447180 3456935 3459483 3455141 3443716 3426508 3406803 3387877 3370960 3355756 3342359 3331704 3324373
50549 3324373 3320048 3318267 3318764 3320811 3323021 3324151 3323344 3319115 3308924 3290460 3263074 3227369 3183770
50536 3183770 3131926 3071261 3001659 2923905 2839811 2751609 2660810 2567946 2473701 2379825 2288357
50525 2288357 2200259 2115453 2034046 1957045 1885918 1821688 1764265 1712375 1664557 1620602 1581605
50514 1581605 1548153 1519109 1493012 1470184 1452342 1440185 1432414 1427310 1424372 1424183 1427610 1435485 1448236
50501 1448236 1465066 1484015 1503472 1523491 1545327 1570002 1597616 1627612 1659248 1692133 1726667
50490 1726667 1763756 1803704 1845706 1888744 1932597 1977406 2022619 2067306 2111588 2156979 2204807
50479 2204807 2254753 2305632 2357589 2412981 2474708 2543821 2619160 2699433 2785296 2879011 2982331
50468 2982331 3095259 3216911 3346924 3485567 3632876 3788170 3950343 4118158 4290149
50459 4290149 4464424 4638563 4809662 4974545 5130101 5273347 5401242 5510871 5600073 5667613
50449 5667613 5712349 5732599 5726901 5695368 5639880 5563151 5468212 5358643 5238403 5110989 4979381
50438 4979381 4847137 4718826 4598793 4489948 4394424 4314751 4253157 4209712 4182331 4169083
50428 4169083 4169548 4183146 4206724 4234659 4261043 4280965 4289976 4283602 4258118 4211379 4142572 4051766
50416 4051766 3940349 3811710 3670757 3522458 3370849 3219099 3069925 2925590 2787557
50407 2787557 2656268 2531426 2412842 2301248 2198191 2105006 2022048 1948927 1885032 1829492
50397 1829492 1781080 1738784 1702262 1671271 1645040 1623064 1606332 1596600 1594182 1597399 1604587 1615583
50385 1615583 1630533 1648272 1667109 1686776 1708466 1733084 1760470 1790249 1822395 1856685 1892411
50374 1892411 1928909 1965846 2002818 2039345 2075395 2111216 2146428 2179984 2211274 2240590 2268229
50363 2268229 2293924 2317635 2340090 2361826 2382338 2400956 2418258 2435925 2455527 2478101 2504469
50352 2504469 2535129 2569978 2608886 2652410 2701230 2754995 2812438 2872548 2934835 2998524 3062407
50341 3062407 3125643 3187719 3247283 3301755 3348575 3386265 3413959 3430616 3435238 3427297 3406301 3371490
50329 3371490 3322664 3261034 3188614 3107023 3017641 2922864 2826440 2732155 2642457 2558422 2480746
50318 2480746 2410613 2349655 2299150 2259272 2229213 2208122 2195722 2191903 2195879 2205783 2218773 2231471
50306 2231471 2240905 2245488 2244798 2238035 2223175 2198273 2163257 2119767 2069482 2013456 1953049 1890424
50294 1890424 1827546 1765239 1703709 1643640 1586397 1533401 1485631 1443538 1406948 1375028 1346529
50283 1346529 1320302 1295863 1273636 1254487 1238595 1224846 1211585 1197964 1184339 1171743 1161669
50272 1161669 1156079 1156393 1161968 1170338 1179495 1189324 1200432 1212608 1225404 1239467 1255944 1274743 1294580
50259 1294580 1314790 1335902 1358196 1380750 1402555 1423765 1445178 1467043 1489004 1510779 1532197
50248 1532197 1552773 1571895 1589397 1605562 1620571 1634179 1645837 1655040 1661778 1666729 1670512 1672593
50236 1672593 1671665 1667569 1662051 1656680 1650669 1642031 1630661 1618742 1607795 1596766 1583808 1568759 1552704
50223 1552704 1535865 1517436 1497478 1477699 1459874 1444129 1429130 1413576 1397190 1380602 1364674
50212 1364674 1349950 1336582 1324515 1313419 1302440 1290642 1278174 1266664 1257800 1251597 1246505 1241103
50200 1241103 1235156 1229202 1223758 1218987 1214632 1210244 1205990 1203031 1202295 1202841 1202384 1199744 1195880 1192115 1188277
50185 1188277 1183262 1176685 1169082 1160987 1152705 1144643 1137034 1129499 1121713 1114288 1108144 1102997 1097398 1090622
50171 1090622 1083818 1078801 1076014 1074135 1071681 1068667 1066429 1065757 1065735 1065068 1064287 1065459 1069331 1074001 1077293
50156 1077293 1079439 1082167 1085899 1089470 1092229 1094588 1096399 1096465 1094207 1090420 1085761 1079864 1072689 1065509
50142 1065509 1059419 1053679 1046530 1037074 1025578 1012598 998695 984542 970516 956574 943039 930756
50130 930756 919886 909474 899094 889868 882638 876077 868314 859841 852974 848422 844172 838158 830615
50117 830615 823370 818019 815167 814163 812978 809510 803683 797435 792214 787571 782752 778327 775160 772717
50103 772717 769568 764966 758930 751401 742486 733211 724826 717442 710139 702243 693617 684053 673565 663283
50089 663283 654884 648774 643728 638652 633859 630156 627468 625083 622838 621311 620943 621394 621818 621569 620739
50074 620739 620061 620145 620782 621290 621700 623157 626856 632674 639187 645011 650034 655353 662116 670409 679344 688243
50058 688243 697514 708049 719971 732448 744783 757170 770198 784172 799140 815013 831178 846522
50046 846522 860568 874333 889224 905057 919995 932739 944057 955619 967820 979520 989684
50035 989684 998359 1005813 1011633 1015437 1018080 1021248 1025636 1030179 1033416 1035045 1035785 1036294 1037051 1039024 1043306
50020 1043306 1049695 1056403 1061913 1066825 1073288 1082712 1094498 1107039 1119470 1132371 1147086 1164546
50008 1164546 1184591 1206210 1228334 1250364 1272053 1293322 1314499 1336450 1359883 1384430 1408683
49997 1408683 1431254 1451717 1470614 1488888 1507282 1525816 1543558 1558979 1570734 1578239 1581858 1582818
49985 1582818 1582540 1581393 1578068 1570909 1560025 1547457 1534854 1521703 1506490 1489113 1471202 1454194
49973 1454194 1438017 1421946 1406000 1390953 1377325 1364946 1353542 1343384 1335148 1329154 1324818 1320923
49961 1320923 1316545 1311736 1307333 1304241 1302953 1303554 1305805 1309162 1312904 1316311 1318761 1319838 1319638 1318927 1318633
49946 1318633 1318969 1319147 1318145 1315780 1312924 1310637 1309073 1307376 1304750 1301383 1297965 1294421 1289764 1283438
49932 1283438 1276170 1269014 1262081 1254861 1247329 1239868 1232397 1224594 1216972 1210483 1204733 1197779 1188486 1178236
49918 1178236 1169289 1161971 1154432 1144816 1132658 1118275 1101927 1083774 1063785 1041354 1015911 988490
49906 988490 962001 939049 919667 901739 883424 864540 845788 827632 810299 794109 779000
49895 779000 764029 748124 731443 715454 701394 689028 677219 665455 654528 645807 639998 636360
49883 636360 632973 628069 621466 614486 608334 602960 597859 593304 589901 587278 584339 580900 577977 576158
49869 576158 574691 572699 570393 568436 566898 565720 565461 566519 568047 568881 569435 571478 575835 581344 586451
49854 586451 590897 595221 599385 602838 605687 608863 612914 617165 620503 622837 625348 629183 634166 639085
49840 639085 643102 646526 650171 654443 659252 664424 669910 675926 683171 692478 703841 716084 727951
49827 727951 739184 750265 761675 774124 788895 806865 827282 848533 870159 893086 917650
49816 917650 942425 965445 985812 1003667 1019471 1033969 1048271 1063054 1077952 1092257 1105932
49805 1105932 1119387 1132539 1144677 1155042 1162935 1167419 1167656 1163771 1156906 1148078 1137157 1123192 1105685
49792 1105685 1085413 1063904 1042184 1020143 997154 973007 948129 923245 899225 876891 856264
49781 856264 836112 815003 792910 771199 751101 733095 717820 706251 698148 691249 683046 673104
49769 673104 662900 653768 645685 637777 629371 620844 613828 609918 608442 606316 601281 594759 590098 588254
49755 588254 586862 583714 579399 575799 573440 571569 569817 568461 567493 566652 566257 567009 568940 571290 573481
49740 573481 575556 577688 579933 582555 585844 589349 591862 592716 592798 593838 596666 600353 603065 603669 602621
49725 602621 601352 600766 600403 599214 596993 594666 593080 591962 590428 588281 586448 586166 588016 591755 596765
49710 596765 602661 609671 618447 629227 641070 652214 661414 668953 676368 685473 697607 713239 731762
49697 731762 751764 771873 791391 810010 827326 843145 858069 873036 888095 902116 914096
49686 914096 924354 934153 944400 955089 965795 976200 986011 994601 1000977 1004141 1003518 999142 991540
49673 991540 981557 970180 958198 945830 932865 919296 905525 891731 877619 863393 850538 840651
49661 840651 833440 826787 819070 810644 802752 795744 788938 781695 774161 767344 762760 761382 762484 764038
49647 764038 764680 764715 764894 765098 764880 764490 764418 764559 764666 765022 765731 766055 765611 765467 766688 768406 769117 769441 771384
49628 771384 774759 776693 775604 773664 773958 776817 780494 784127 788180 792706 797131 801496 806280 810976
49614 810976 814375 816573 819292 823633 828535 832168 834180 835816 838217 841226 843833 845258 845464 844800 843488
49599 843488 841768 840443 840659 842635 844960 845806 844893 843785 844185 846241 848538 849367 848037 845333 842875
49584 842875 841748 841592 841097 839349 836616 834047 832860 833596 835681 837742 838739 838854 839057 839883 840961 841663
49568 841663 841775 841555 841474 841912 842680 842898 841872 840194 839493 840863 843948 847753 851815 856268 861252 866871
49552 866871 873503 881486 890442 899466 908125 916900 926402 936444 946272 955645 965387 976734 990192
49539 990192 1005020 1019706 1033097 1045428 1058451 1074175 1093016 1113299 1132956 1151703 1171016
49528 1171016 1191999 1214019 1235868 1257667 1280805 1306213 1333474 1361770 1391102 1422248 1455907
49517 1455907 1492206 1530815 1571260 1613194 1656567 1701640 1748886 1798853 1851916 1907852 1965684
49506 1965684 2024270 2083220 2143174 2205163 2269781 2336814 2405384 2474428 2543353 2612461 2682567
49495 2682567 2754087 2826444 2898365 2968684 3036933 3103328 3168224 3231430 3291994 3348700 3400766
49484 3400766 3448089 3490948 3529402 3562702 3589180 3607239 3616857 3619925 3618687 3613977 3605238 3591882
49472 3591882 3574032 3552260 3527485 3501265 3475427 3451124 3428702 3408590 3391700 3378747 3369754
49461 3369754 3364518 3362985 3364898 3369770 3377703 3389648 3406238 3426758 3449826 3474765 3501853 3531652
49449 3531652 3564600 3600692 3638722 3676200 3711086 3743586 3775456 3807503 3838573 3866976 3891904
49438 3891904 3913061 3929742 3940865 3945334 3941947 3929496 3907644 3877464 3840599 3797997 3749758 3695810
49426 3695810 3636200 3570986 3500471 3425575 3347528 3267117 3184578 3100246 3014997 2929991 2846260
49415 2846260 2764564 2685279 2608293 2533276 2460242 2389744 2322433 2258584 2198050 2140469 2085401
49404 2085401 2032487 1981607 1932814 1886141 1841706 1800023 1761755 1726907 1694679 1664535 1636969
49393 1636969 1612479 1589975 1567250 1543414 1520005 1499055 1480818 1464320 1449543 1437566 1428453
49382 1428453 1420435 1411962 1403493 1396286 1390205 1384068 1377785 1372739 1369795 1368167 1366890 1366494 1368397 1373172
49368 1373172 1380245 1389058 1399622 1411891 1425376 1439771 1455643 1474229 1496695 1523619 1554695 1588243
49356 1588243 1620820 1647833 1665493 1672987 1672949 1669520 1665701 1662455 1659969 1658996 1660527 1664627 1670361 1677049
49342 1677049 1685284 1696550 1711865 1730744 1751324 1771590 1790698 1809170 1827857 1847052 1866742
49331 1866742 1887178 1908503 1929981 1950294 1968833 1986204 2003388 2020905 2038909 2057414 2076000
49320 2076000 2093861 2110755 2127627 2145690 2165073 2184914 2204585 2224251 2244275 2264872 2286529
49309 2286529 2310050 2335631 2362275 2388652 2414525 2440985 2469337 2500049 2532729 2566776 2601894
49298 2601894 2638154 2675757 2714847 2755535 2798025 2842583 2889365 2938356 2989497 3042756 3098181
49287 3098181 3156093 3217144 3281672 3348830 3416868 3484899 3554184 3627122 3704992 3787099 3872093
49276 3872093 3959349 4048911 4140800 4235066 4332043 4431747 4533069 4634364 4735172 4837029
49266 4837029 4942198 5051612 5164003 5276805 5387972 5497245 5605826 5714667 5823037
49257 5823037 5928955 6030897 6128657 6222564 6312476 6397748 6477502 6550406 6614741 6669452 6714881
49246 6714881 6751739 6779592 6797262 6804815 6804192 6797490 6785406 6767881 6745435 6718936 6688523 6654016
49234 6654016 6616626 6579307 6544876 6514195 6486623 6461864 6440732 6424215 6412356 6404306 6399226 6396904
49222 6396904 6397758 6402648 6412825 6429551 6453172 6482383 6514787 6548567 6583552 6620463 6659328 6699040
49210 6699040 6738338 6776460 6812415 6844146 6869267 6886778 6897534 6902743 6902342 6895078 6879750 6855798
49198 6855798 6822823 6780339 6728329 6667632 6599349 6524070 6442112 6354354 6262388 6167757 6071358
49187 6071358 5973632 5874927 5775477 5675352 5574808 5474707 5376375 5281007 5189256 5101384 5017664
49176 5017664 4938502 4864080 4793983 4727368 4663552 4602238 4543214 4486379 4432407 4382761 4338158
49165 4338158 4297176 4257353 4217922 4180640 4147539 4118586 4092079 4066650 4042158 4019129 3998151
49154 3998151 3979567 3962955 3946981 3930512 3913802 3897953 3883217 3868533 3852809 3836037 3819036
49143 3819036 3802712 3787683 3773993 3760982 3747973 3735323 3724237 3715402 3708428 3702877 3699076 3697420
49131 3697420 3697589 3699101 3702073 3706599 3711795 3716513 3721122 3727710 3738101 3752034 3767551 3782916 3797982
49118 3797982 3813989 3832295 3853197 3875776 3898828 3921982 3945957 3971841 4000200 4030805 4063097
49107 4063097 4096850 4132324 4169677 4208509 4248300 4289246 4332077 4376869 4422631 4468548 4515271
49096 4515271 4564396 4616876 4672467 4730594 4790971 4853251 4916710 4980773 5045497 5111115 5177216
49085 5177216 5242651 5306164 5366908 5424498 5478915 5530452 5579531 5626351 5670797 5712696 5752078
49074 5752078 5789112 5824038 5857501 5890756 5924840 5959236 5991885 6021142 6047557 6073209 6099493
49063 6099493 6126227 6152692 6178447 6202788 6224499 6243125 6260064 6277617 6297081 6318255 6340354
49052 6340354 6362584 6384015 6403875 6422334 6440490 6459359 6479185 6499676 6520392 6540811 6560553
49041 6560553 6579782 6598967 6618056 6636331 6653348 6669577 6685633 6701121 6714783 6725992 6735788
49030 6735788 6746146 6758086 6770600 6781616 6790053 6796741 6803296 6810525 6818288 6826533 6835696 6846052 6857268
49017 6857268 6868908 6881011 6893904 6907760 6922549 6938144 6954098 6969449 6983107 6994603 7004435
49006 7004435 7013584 7022616 7031124 7038045 7042476 7043998 7042266 7036686 7026893 7013308 6996877 6978359 6958062
48993 6958062 6935892 6911178 6882841 6850495 6815409 6779712 6744545 6709430 6673362 6635897 6597295
48982 6597295 6558409 6520610 6484985 6451283 6418191 6384789 6351219 6318038 6286057 6256950 6232563
48971 6232563 6212835 6195541 6179018 6164020 6151753 6141284 6130724 6120362 6112516 6108193 6105816 6103837
48959 6103837 6102911 6104460 6108246 6112550 6116076 6118673 6120635 6122172 6123355 6123953 6123504 6122038 6120341 6118921 6117080
48944 6117080 6113665 6108478 6102286 6095592 6088027 6078813 6067229 6052746 6035395 6015931 5994999 5972213
48932 5972213 5946876 5919575 5892058 5865174 5837825 5808473 5776847 5743345 5707552 5668503 5626203
48921 5626203 5581813 5536297 5489831 5442709 5395699 5348901 5301015 5250645 5198064 5144989 5092612
48910 5092612 5040468 4987410 4933427 4880255 4830151 4783963 4740464 4697853 4655965 4616554 4581242
48899 4581242 4549770 4520771 4493816 4469944 4450328 4435146 4423835 4415876 4411162 4410078 4413261 4420874
48887 4420874 4432063 4445682 4461604 4480696 4503298 4528375 4554535 4581368 4609376 4639018 4670327
48876 4670327 4703159 4737377 4772922 4809869 4847993 4886240 4923379 4959781 4997894 5040054 5086073
48865 5086073 5133732 5181321 5228788 5276607 5324848 5373901 5425199 5480275 5539283 5600964 5664015
48854 5664015 5728204 5794229 5862825 5934100 6007597 6082789 6159337 6237013 6315843 6396465 6479804
48843 6479804 6565764 6652530 6737823 6820771 6901940 6981631 7059002 7133131 7204213 7273139 7340311
48832 7340311 7405302 7467375 7525739 7579342 7626875 7667330 7700694 7728067 7750768 7769018 7781685
48821 7781685 7787763 7787929 7784068 7777366 7767620 7754342 7737452 7716393 7689682 7656376 7617593 7575634
48809 7575634 7531696 7485192 7435119 7381287 7324109 7263967 7201187 7136228 7069490 7001109 6931083
$$ [...]
##END NTUPLES=NMR SPECTRUM
##END=
