
##TITLE=AC1185_Huila-guadalupe-HGUAH12020_5898926_BD3wntBXHu
##JCAMPDX= 6.0         $$ Bruker NMR JCAMP-DX V2.0
##DATA TYPE= NMR SPECTRUM
##DATA CLASS= NTUPLES
##ORIGIN= BRUKER
##OWNER= Administrator
$$ 1.72 TOPSPIN		Version 2.1
$$ 2012-04-10 10:23:25.984 -0500  Administrator@TOPSPIN
$$ Compression mode = diff/dup
##.OBSERVE FREQUENCY= 400.13188235
##.OBSERVE NUCLEUS= ^1H
##.ACQUISITION MODE= SIMULTANEOUS (DQD)
##.ACQUISITION SCHEME= undefined
##.AVERAGES= 64
##.DIGITISER RES= 22
##SPECTROMETER/DATA SYSTEM= spect
##.PULSE SEQUENCE= noesygpps1d.comp
##.SOLVENT NAME= COFFEE_meoh
##.SHIFT REFERENCE= INTERNAL, COFFEE_meoh, 1, 14.96832
##AUDIT TRAIL= $$ (NUMBER, WHEN, WHO, WHERE, PROCESS, VERSION, WHAT)
$$ ##TITLE= Audit trail, TOPSPIN		Version 2.1
$$ ##JCAMPDX= 5.01
$$ ##ORIGIN= Bruker BioSpin GmbH
$$ ##OWNER= Administrator
$$ $$ C:\Bruker\TOPSPIN/data/COFFEE/nmr/AC1185_Huila-guadalupe-HGUAH12020_5898926_BD3wntBXHu/12/pdata/1/auditp.txt
$$ ##AUDIT TRAIL=  $$ (NUMBER, WHEN, WHO, WHERE, PROCESS, VERSION, WHAT)
(   1,<2012-04-04 10:18:35.265 -0500>,<Administrator>,<TOPSPIN>,<go>,<TOPSPIN 2.1>,
      <created by zg
	started at 2012-04-04 10:07:03.656 -0500,
	POWCHK enabled, PULCHK disabled,
       configuration hash MD5:
       1A 1E CE 29 27 FD 77 03 67 4E F0 E3 C4 B2 CB 90
       data hash MD5: 64K
       27 63 75 77 C2 FB 0E 6E 29 E0 4C 43 84 47 80 42>)
(   2,<2012-04-04 10:18:38.078 -0500>,<Administrator>,<TOPSPIN>,<proc1d>,<TOPSPIN 2.1>,
      <Start of raw data processing
       efp LB = 0.3 FT_mod = 6 PKNL = 1 PHC0 = 0 PHC1 = 0 SI = 128K 
       data hash MD5: 128K
       E4 45 D4 26 C6 A4 8C C3 97 BC 95 04 5F 3B 39 67>)
(   3,<2012-04-04 10:18:39.265 -0500>,<Administrator>,<TOPSPIN>,<proc1d>,<TOPSPIN 2.1>,
      <pk PHC0 = 35.4364 PHC1 = 0 
       data hash MD5: 128K
       F3 7F 96 C1 D2 F5 A0 7C EE DC DF AF 9E 35 B2 A9>)
(   4,<2012-04-04 10:18:39.703 -0500>,<Administrator>,<TOPSPIN>,<proc1d>,<TOPSPIN 2.1>,
      <abs ABSG = 1 
       data hash MD5: 128K
       D2 EA 15 31 11 69 94 3F F9 E2 7E 46 05 6D 0D 4C>)
(   5,<2012-04-04 10:18:39.765 -0500>,<Administrator>,<TOPSPIN>,<proc1d>,<TOPSPIN 2.1>,
      <abs ABSG = 2 
       data hash MD5: 128K
       5E 1F 66 D0 FC B0 4A 11 B2 4C 46 F8 0E 23 A7 04>)
(   6,<2012-04-04 10:18:39.828 -0500>,<Administrator>,<TOPSPIN>,<proc1d>,<TOPSPIN 2.1>,
      <abs ABSG = 3 
       data hash MD5: 128K
       FB 61 37 54 25 6C 4A AC 99 A3 CB 97 3B 7A C6 60>)
(   7,<2012-04-04 10:18:39.875 -0500>,<Administrator>,<TOPSPIN>,<proc1d>,<TOPSPIN 2.1>,
      <abs ABSG = 4 
       data hash MD5: 128K
       BD 48 D1 C8 EA C1 96 57 56 5E BB 16 0B 13 CF 59>)
(   8,<2012-04-04 10:18:39.921 -0500>,<Administrator>,<TOPSPIN>,<proc1d>,<TOPSPIN 2.1>,
      <abs ABSG = 5 
       data hash MD5: 128K
       99 9E 53 41 FD 88 72 F7 00 C6 C4 3F 3B 44 25 B3>)
(   9,<2012-04-04 10:18:40.156 -0500>,<Administrator>,<TOPSPIN>,<audit>,<TOPSPIN 2.1>,
      <user comment:
       ICON-NMR User ID: COFFEE
       data hash MD5: 128K
$$ [...]
##$TP07= 0
##$TPNAME0= <>
##$TPNAME1= <>
##$TPNAME2= <>
##$TPNAME3= <>
##$TPNAME4= <>
##$TPNAME5= <>
##$TPNAME6= <>
##$TPNAME7= <>
##$TPOAL= (0..7)
0.5 0.5 0.5 0.5 0.5 0.5 0.5 0.5
##$TPOFFS= (0..7)
0 0 0 0 0 0 0 0
##$TUNHIN= 0
##$TUNHOUT= 0
##$TUNXOUT= 0
##$USERA1= <user>
##$USERA2= <user>
##$USERA3= <user>
##$USERA4= <user>
##$USERA5= <user>
##$V9= 5
##$VALIST= <valist>
##$VCLIST= <CCCCCCCCCCCCCCC>
##$VD= 0
##$VDLIST= <DDDDDDDDDDDDDDD>
##$VPLIST= <PPPPPPPPPPPPPPP>
##$VTLIST= <TTTTTTTTTTTTTTT>
##$WBST= 2048
##$WBSW= 25
##$XGAIN= (0..3)
0 0 0 0
##$XL= 0
##$YL= 0
##$YMAX_a= 12285100
##$YMIN_a= -5880333
##$ZGOPTNS= <>
##$ZL1= 120
##$ZL2= 120
##$ZL3= 120
##$ZL4= 120
##$ABSF1= 14.96832
##$ABSF2= -5.58421
##$ABSG= 5
##$ABSL= 3
##$ALPHA= 0
##$AQORDER= 0
##$ASSFAC= 0
##$ASSFACI= 0
##$ASSFACX= 0
##$ASSWID= 0
##$AUNMP= <proc_prof1d_extract.lims>
##$AXLEFT= 0
##$AXNAME= <>
##$AXNUC= <1H>
##$AXRIGHT= 0
##$AXTYPE= 0
##$AXUNIT= <>
##$AZFE= 0.1
##$AZFW= 0.1
##$BCFW= 0
##$BC_mod= 0
##$BYTORDP= 0
##$COROFFS= 0
##$CY= 15
##$DATMOD= 1
##$DC= 0
##$DFILT= <>
##$DTYPP= 0
##$F1P= 0
##$F2P= 0
##$FCOR= 0.5
##$FTSIZE= 131072
##$FT_mod= 6
##$GAMMA= 0
##$GB= 0
##$INTBC= 1
##$INTSCL= 1
##$ISEN= 128
##$LB= 0.3
##$LEV0= 0
##$LPBIN= 0
##$MAXI= 10000
##$MC2= 0
##$MEAN= 0
##$ME_mod= 0
##$MI= 0
##$NCOEF= 0
##$NC_proc= -3
##$NLEV= 6
##$NOISF1= 0
##$NOISF2= 0
##$NSP= 0
##$NTH_PI= 0
##$NZP= 0
##$OFFSET= 14.96832
##$PC= 1
##$PHC0= 35.4364
##$PHC1= 0
##$PH_mod= 1
##$PKNL= yes
##$PPARMOD= 0
##$PPDIAG= 0
##$PPIPTYP= 0
##$PPMPNUM= 2147483647
##$PPRESOL= 1
##$PSCAL= 4
##$PSIGN= 0
##$PYNMP= <proc.py>
##$REVERSE= no
##$SF= 400.130004917994
##$SI= 131072
##$SIGF1= 0
##$SIGF2= 0
##$SINO= 400
##$SIOLD= 131072
##$SPECTYP= <>
##$SREGLST= <1H.CDCl3>
##$SSB= 0
##$STSI= 131072
##$STSR= 0
##$SW_p= 8223.68421052632
##$SYMM= 0
##$S_DEV= 0
##$TDeff= 65536
##$TDoff= 0
##$TI= <>
##$TILT= no
##$TM1= 0
##$TM2= 0
##$TOPLEV= 0
##$USERP1= <user>
##$USERP2= <user>
##$USERP3= <user>
##$USERP4= <user>
##$USERP5= <user>
##$WDW= 1
##$XDIM= 131072
##$YMAX_p= 502000939
##$YMIN_p= -434255284
##$CURPLOT= <Network HP LaserJet P1505>
##$CURPRIN= <$Network HP LaserJet P1505>
##$DFORMAT= <normdp>
##$LAYOUT= <+/1D_H.xwp>
##$LFORMAT= <normlp>
##$PFORMAT= <normpl>
##$SURQMSG= 1
$$ End of Bruker specific parameters
$$ ---------------------------------
##NTUPLES= NMR SPECTRUM
##VAR_NAME=  FREQUENCY,     SPECTRUM/REAL,   SPECTRUM/IMAG
##SYMBOL=    X,             R,               I
##VAR_TYPE=  INDEPENDENT,   DEPENDENT,       DEPENDENT
##VAR_FORM=  AFFN,          ASDF,            ASDF
##VAR_DIM=   131072,        131072,          131072
##UNITS=     HZ,            ARBITRARY UNITS, ARBITRARY UNITS
##FACTOR=    0.0627417313425165, 1,          1
##FIRST=     8223.62146879498, -3879,        -81980
##LAST=      0,             -1792,           -82788
##MIN=       0,             -434255284,      0
##MAX=       8223.62146879498, 502000939,    0
$$ Real data points
##PAGE= N=1
##DATA TABLE= (X++(R..R)), XYDATA
$$ [...]
60728A194365j1590r994q208o766n454l283K9L199M752M892N106O037O807O690
60714A186582O527P765J0666J4016J6452J7591J8109J8978K0500K1836K1844K0399
60702A381265J8452J6744J5209J3897J3473J4077J4539J3750J2212J1159J0630
60691A535407R650Q033O691O162N994N781N638N426M637L363K349J567q5k980
60677A597633n719o775o409n976o006o079o212p038q503r530r420q932r364j0930
60663A490740j2551j3075j2313j0869r401q229p373o564n360l636k014j356j742
60650A396257k371k626k624k549k131j360r89j552k436k857l149l930m442l340
60636A359901j145k29j695l647l570j494M25Q27M46N83J272J306k74l032n464
$$ plain form
60728 1194365 1182775 1172781 1164573 1157807 1152353 1149070 1149099 1152298 1157050 1161942 1167048 1173085 1179892 1186582
60714 1186582 1193109 1200874 1211540 1225556 1242008 1259599 1277708 1296686 1317186 1339022 1360866 1381265
60702 1381265 1399717 1416461 1431670 1445567 1459040 1473117 1487656 1501406 1513618 1524777 1535407
60691 1535407 1545057 1553090 1559781 1565943 1571937 1577718 1583356 1588782 1593419 1596782 1599131 1600698 1600613 1597633
60677 1597633 1591914 1585139 1578730 1572754 1566748 1560669 1554457 1547419 1538916 1529386 1519966 1511034 1501670 1490740
60663 1490740 1478189 1465114 1452801 1441932 1432531 1424302 1416929 1410365 1405005 1401369 1399355 1397999 1396257
60650 1396257 1393886 1391260 1388636 1386087 1383956 1382596 1381607 1380055 1377619 1374762 1371613 1367683 1363241 1359901
60636 1359901 1358756 1358527 1356832 1353185 1349615 1348121 1348546 1349373 1349819 1350402 1351674 1352980 1352706 1349674 1344210
60621A344210o553o872p853j0028j2546j4499j6015j7603j9027j9485j8707j7352
60609A177670j6203j5337j4231j2560j0738r459q763p919o352m212j809Q27L278
60596A074192M429L849K804K779L459L572L313M032N597O183N260M641N459O020
60582A135589M323J187j031j717j903j734l73J667K539K021K395N210Q687R817
60568A166677Q234O418O441P989R865J1938J4586J6988J7623J6666J6616J9467
60556A319508K4003K7102K7495K6903K7332K8592K9114K8093K5940K3220K0141
60545A607443J6668J2576P643K294k576o846j1448j6590k0669k2253k2468k3750
60533A520024k6378k7990k6881k4055k1282j8633j5354j2103j0387j0045r124
$$ plain form
60621 1344210 1337657 1330785 1322932 1312904 1300358 1285859 1269844 1252241 1233214 1213729 1195022 1177670
60609 1177670 1161467 1146130 1131899 1119339 1108601 1099142 1090379 1082460 1076108 1071896 1070087 1070914 1074192
60596 1074192 1078621 1082470 1085274 1088053 1091512 1095084 1098397 1102429 1108026 1114209 1119469 1124110 1129569 1135589
60582 1135589 1139912 1141099 1140068 1138351 1136448 1134714 1134341 1136008 1138547 1140568 1142963 1148173 1156860 1166677
60568 1166677 1174911 1181329 1187770 1195759 1205624 1217562 1232148 1249136 1266759 1283425 1300041 1319508
60556 1319508 1343511 1370613 1398108 1425011 1452343 1480935 1510049 1538142 1564082 1587302 1607443
60545 1607443 1624111 1636687 1644330 1646624 1644048 1637202 1625754 1609164 1588495 1566242 1543774 1520024
60533 1520024 1493646 1465656 1438775 1414720 1393438 1374805 1359451 1347348 1336961 1326916 1317792
60522A317792o652m009k740k278j137M98J042J12q88j071j359k573l646k946n60
60507A289585J949L463L902L603L348M397P061R718J0777J1146J2939J6009J7858
60494A395755J7197J5448J4221J3515J3285J4583J7612K0429K1338K1293K2246
60483A586922K4287K6222K8037L0807L4557L8067M0511M1863M1752L9458L4964
60472A967447K8762K0723J0496r68j1550j9799k5622k9147l0052k8309k4682k0123
60460A837176j5258j0384n379K94O651J2431J6233J8357K0605K4099K8082L1118
60448A964025L2791L4041L6403M0940M7501N5048O3093P2437Q3948R6945J09791
60437B636963J21959J34685J49434J66323J84111K01286K17239K32818K49530
$$ plain form
60522 1317792 1311140 1307131 1304391 1302113 1300976 1301474 1302516 1302628 1301740 1300669 1299310 1296737 1293091 1290145 1289585
60507 1289585 1291534 1294997 1298899 1302502 1305850 1310247 1317308 1327026 1337803 1348949 1361888 1377897 1395755
60494 1395755 1412952 1428400 1442621 1456136 1469421 1484004 1501616 1522045 1543383 1564676 1586922
60483 1586922 1611209 1637431 1665468 1696275 1730832 1768899 1809410 1851273 1893025 1932483 1967447
60472 1967447 1996209 2016932 2027428 2026460 2014910 1995111 1969489 1940342 1910290 1881981 1857299 1837176
60460 1837176 1821918 1811534 1806155 1806449 1813100 1825531 1841764 1860121 1880726 1904825 1932907 1964025
60448 1964025 1996816 2030857 2067260 2108200 2155701 2210749 2273842 2346279 2430227 2527172 2636963
60437 2636963 2758922 2893607 3043041 3209364 3393475 3594761 3812000 4044818 4294348
60428D294348K67868K86964L06314L26858L49011L69785L82724L80532L57361
60419G321765L09884K38370J47104M2795o7395j75584k72144l47842l98319m25600
60409F373034m34836m30549m15897l93648l66349l36179l05228k75379k47508
60400C167461k21558j97737j76717j58320j41227j24749j09929r7957q8294p9459
60390A771514p1063o3957n8514n3909m9213m4405l9953l5933l2039k8282k5298
60379A268948k3731k3369k3141k2105k0242j8157j6257j4533j2906j1351r794
60368A073362q227o939o410o945q419r990j0230q306n392l916m689n624m324j246
60354I82705R78J034K96P26K606M628N359M420K904K615M262O594P908Q019P827
$$ plain form
60428 4294348 4562216 4849180 5155494 5482352 5831363 6201148 6583872 6964404 7321765
60419 7321765 7631649 7870019 8017123 8059918 7992523 7816939 7544795 7196953 6798634 6373034
60409 6373034 5938198 5507649 5091752 4698104 4331755 3995576 3690348 3414969 3167461
60400 3167461 2945903 2748166 2571449 2413129 2271902 2147153 2037224 1939267 1850973 1771514
60390 1771514 1700451 1636494 1577980 1524071 1474858 1430453 1390500 1354567 1322528 1294246 1268948
60379 1268948 1245217 1221848 1198707 1176602 1156360 1138203 1121946 1107413 1094507 1083156 1073362
60368 1073362 1065135 1058196 1051786 1044841 1036422 1026432 1016202 1007896 1002504 998588 993899 988275 983951 982705
60354 982705 983683 984717 985013 985739 988345 992973 998332 1002752 1005656 1008271 1012533 1019127 1027035 1035054 1042881
60339A042881P559O795N975O209P511Q629Q892Q913R093Q840P766O479N613M965
60325A146120M137L208K496K357L216M756N270L324J42j413n47N92L87k6P87J809
60309A176615J167q03k005j460l4J194J871K003J960K624M312N867O044N515O198
60294A211068Q595J1033J1845J1301J1000J1911J3504J4512J4444J4231J5114
60283A348558J6816J7581J6414J4432J3265J2819J1688R378O999N887O455Q363
60271A488655J0825J2746J3439J3435J3849J4781J5017J3499J0366O231J160m989
60259A609014j1558j7117k0530k1742k1589k1085k0901k1096k1149k0351j8410
60248A393486j5651j2584r465o572m593m085m526m599l684k400j382m44N04O93
$$ plain form
60339 1042881 1050440 1057235 1063210 1069419 1076930 1085559 1094451 1103364 1112457 1121297 1129063 1135542 1141155 1146120
60325 1146120 1150257 1153465 1155961 1158318 1161534 1166290 1171560 1174884 1175026 1173613 1173066 1173658 1174045 1174019 1174806 1176615
60309 1176615 1177782 1176979 1174974 1173514 1173480 1174674 1176545 1178548 1180508 1183132 1187444 1193311 1199355 1204870 1211068
60294 1211068 1219663 1230696 1242541 1253842 1264842 1276753 1290257 1304769 1319213 1333444 1348558
60283 1348558 1365374 1382955 1399369 1413801 1427066 1439885 1451573 1460951 1467950 1473837 1480292 1488655
60271 1488655 1499480 1512226 1525665 1539100 1552949 1567730 1582747 1596246 1606612 1612843 1614003 1609014
60259 1609014 1597456 1580339 1559809 1538067 1516478 1495393 1474492 1453396 1432247 1411896 1393486
60248 1393486 1377835 1365251 1355786 1349214 1344621 1340536 1336010 1331411 1327727 1325327 1323945 1323501 1324005 1324698
60234A324698k76j242q95J64K33q79j691j516j372j964k346j372O86K843M751
60219A319822O517P925Q665Q980R478J0608J2453J4632J6418J7510J8401J9261
60207A470670J9014J6978J4834J5012J7184J8621J8397J8673K0953K3662K5054
60196A679052K6182K8836L2478L5688L9146M4504N1083N6439N9878O3129O7613
60185B184028P3181P9557Q6953R5040J03020J10969J19478J27904J34733J39926
60175C254789J45137J51098J56347J59239J59832J59081J57218J53627J47457
60166D643825J37974J25104J09864R3501P6143N7367L7979J9869L950j0198k2380
60155E272998l1293l6645m0033m2519m2818l9272l2371k3717j3533j078J2972
$$ plain form
60234 1324698 1324422 1323180 1322285 1322449 1322682 1321803 1320112 1318596 1317224 1315260 1312914 1311542 1312228 1315071 1319822
60219 1319822 1326339 1334264 1342929 1351909 1361387 1371995 1384448 1399080 1415498 1433008 1451409 1470670
60207 1470670 1489684 1506662 1521496 1536508 1553692 1572313 1590710 1609383 1630336 1653998 1679052
60196 1679052 1705234 1734070 1766548 1802236 1841382 1885886 1936969 1993408 2053286 2116415 2184028
60185 2184028 2257209 2336766 2423719 2518759 2621779 2732748 2852226 2980130 3114863 3254789
60175 3254789 3399926 3551024 3707371 3866610 4026442 4185523 4342741 4496368 4643825
60166 4643825 4781799 4906903 5016767 5110268 5186411 5243778 5281757 5301626 5305576 5295378 5272998
60155 5272998 5241705 5205060 5165027 5122508 5079690 5040418 5008047 4984330 4970797 4969719 4982691
60144D982691K6656L9336N2472O7272Q3011R8313J12767J26298J37955J46617
60134E873388J52385J56005J56995J53606J44884J31773J15771R7439P6931N5014
60124G114191L2610R866j3148l5277n5053p2411q8184j01730j10657j13499j11395
60113F455313j06267r8556q7844p4722o0603m6086l0583j3389N676K6198M6836
60102F015973O5442Q0521R2378J01956J08853J11476J09087J02780R4414Q5255
60092F968135P5566O4907N2887M0076K7871J7223Q271J908M32N209J4472K5250
60080G302207L7132N2235P1379R2360J12652J32168J52475J74659J98934K25154
60070H551355K52579K79972L06977L34701L63874L92987M19398M41870M60866
$$ plain form
60144 4982691 5009347 5048683 5101155 5168427 5251438 5349751 5462518 5588816 5726771 5873388
60134 5873388 6025773 6181778 6338773 6492379 6637263 6769036 6884807 6982246 7059177 7114191
60124 7114191 7146801 7156667 7143519 7108242 7053189 6980778 6892594 6790864 6680207 6566708 6455313
60113 6455313 6349046 6250490 6162646 6087924 6027321 5981235 5950652 5937263 5942939 5969137 6015973
60102 6015973 6081415 6161936 6254314 6356270 6465123 6576599 6685686 6788466 6882880 6968135
60092 6968135 7043701 7108608 7161495 7201571 7229442 7246665 7254936 7256844 7257276 7262485 7276957 7302207
60080 7302207 7339339 7391574 7462953 7555313 7667965 7800133 7952608 8127267 8326201 8551355
60070 8551355 8803934 9083906 9390883 9725584 10089458 10482445 10901843 11343713 11804579
60061A1804579M76426M86966M90477M86024M73521M52721M23130L84851L38926
60052A5817621K86756K29339J67250J01113L1970l8629j08709j76140k39047k95929
60042A5775595l45158l84723m12965m29496m34858m29492m13849l89576l59474
60033A2176004l25671k88559k48076k05370j62536j21236q2200m5642j1686J9085
60023A0704113M5066O4424P6941Q4079Q6446Q2439P0734N3176L3363J2863r350
60012A1304294l3777n8624q1782j03165j24171j45587j66698j85916k01879k14167
60002I988528k23136k28917k30986k29066k23904k16383k06331j93174j77259
59993H059372j59471j39965j18507r5774p2933n0048k6322j886K2075M5023O7307
$$ plain form
60061 11804579 12281005 12767971 13258448 13744472 14217993 14670714 15093844 15478695 15817621
60052 15817621 16104377 16333716 16500966 16602079 16634049 16595420 16486711 16310571 16071524 15775595
60042 15775595 15430437 15045714 14632749 14203253 13768395 13338903 12925054 12535478 12176004
60033 12176004 11850333 11561774 11313698 11108328 10945792 10824556 10742356 10696714 10685028 10704113
60023 10704113 10749179 10813603 10890544 10974623 11061069 11143508 11214242 11267418 11300781 11313644 11304294
60012 11304294 11270517 11211893 11130111 11026946 10902775 10757188 10590490 10404574 10202695 9988528
60002 9988528 9765392 9536475 9305489 9076423 8852519 8636136 8429805 8236631 8059372
59993 8059372 7899901 7759936 7641429 7545655 7472722 7422674 7396352 7394466 7416541 7461564 7528871
59982G528871Q8631J07917J24985J40598J54148J63005J65095J60634J50444J34266
59972H918594J12259Q6692O0213L3165M422k5709n5322q3491j10824j36873j58793
59961H644333j73881j82534j87257j89149j86670j78197j64564j48252j30659
59952G103170j11406r0189o7958m5611k2620J876K7195N1689P5029R8529J22883
59941G142587J46832J68808J88843K07752K24745K37015K41974K39320K30598
59932I028474K17109J98755J74941J45942J13045P7715M1253M979l0052o3596
59922I908565r5632j25120j50192j69653j83290j90415j89611j80696j65733j47124
59912H311099j25729j01832p6624n1335k5873J24K5705M9521P1429R1568J08836
$$ plain form
59982 7528871 7617502 7725419 7850404 7991002 8145150 8308155 8473250 8633884 8784328 8918594
59972 8918594 9030853 9117545 9177758 9210923 9215345 9189636 9134314 9050823 8939999 8803126 8644333
59961 8644333 8470452 8287918 8100661 7911512 7724842 7546645 7382081 7233829 7103170
59952 7103170 6991764 6901575 6833617 6788006 6765386 6767262 6794457 6846146 6921175 7019704 7142587
59941 7142587 7289419 7458227 7647070 7854822 8079567 8316582 8558556 8797876 9028474
59932 9028474 9245583 9444338 9619279 9765221 9878266 9955981 9997234 10002213 9972161 9908565
59922 9908565 9812933 9687813 9537621 9367968 9184678 8994263 8804652 8623956 8458223 8311099
59912 8311099 8185370 8083538 8006914 7955579 7929706 7929830 7955535 8005056 8076485 8168053 8276889
59901H276889J22250J33041J43124J51870J56748J57082J54783J51157J45311
59892I592255J36412J25480J14140J03119R2617Q2890P4005O6330O1387O0778
59882A0509413O4339P0996Q1303R7051J18279J43073J70583K01821K36744K73147
59872A1966749L09510L46495L84282M20491M52102M77461M94947N01711M95330
59863A5849078M74928M39357L86372L15651K30950J37425L8466o2932j61616k51642
59853A7396037l29334l93072m41445m73852m91929m98040m92928m76733m51403
59844A3347301m19955l83969l43808l00716k56587k12091j67026j22167p8846
59835A1062136l7189L320M1842P6657J07252J33970J55899J71069J78552J78416
$$ plain form
59901 8276889 8399139 8532180 8675304 8827174 8983922 9141004 9295787 9446944 9592255
59892 9592255 9728667 9854147 9968287 10071406 10164023 10246913 10320918 10387248 10448635 10509413
59882 10509413 10573752 10644748 10726051 10823102 10941381 11084454 11255037 11456858 11693602 11966749
59872 11966749 12276259 12622754 13007036 13427527 13879629 14357090 14852037 15353748 15849078
59863 15849078 16324006 16763363 17149735 17465386 17696336 17833761 17872227 17809295 17647679 17396037
59853 17396037 17066703 16673631 16232186 15758334 15266405 14768365 14275437 13798704 13347301
59844 13347301 12927346 12543377 12199569 11898853 11642266 11430175 11263149 11140982 11062136
59835 11062136 11024947 11028267 11070109 11146766 11254018 11387988 11543887 11714956 11893508 12071924
59825A2071924J69786J51067J22059Q3974L7542j6625p5605j34591j90353k42347
59815A1976831k89804l29973l60381l81088l93481l98317l96131l88217l75812
59806H663627l59079l38180l14743k91050k68019k44853k20701j96015j72223
59797F258764j50415j30589j12247r5564q1475p0561o2507n6967n4019n3058n2282
59786E339080n0357m7853m5848m3895m0870l7151l4215l2449l1160l0665l2365
59775D912252l6459m1284m5439m8954n1914n3421n2809n0735m8358m6237m4438
59764D392204m2722m0161l5625k9098k1697j4174o425J255P711J2363J6100K0165
59752D259896K4934L0305L6415M3465N1368N9792O7955P4568P8939Q2011Q5075
$$ plain form
59825 12071924 12241710 12392777 12514836 12598810 12636352 12619727 12544122 12409531 12219178 11976831
59815 11976831 11687027 11357054 10996673 10615585 10222104 9823787 9427656 9039439 8663627
59806 8663627 8304548 7966368 7651625 7360575 7092556 6847703 6627002 6430987 6258764
59797 6258764 6108349 5977760 5865513 5769949 5688474 5617913 5555406 5498439 5444420 5391362 5339080
59786 5339080 5288723 5240870 5195022 5151127 5110257 5073106 5038891 5006442 4975282 4944617 4912252
59775 4912252 4875793 4834509 4789070 4740116 4688202 4634781 4581972 4531237 4482879 4436642 4392204
59764 4392204 4349482 4309321 4273696 4244598 4222901 4208727 4202302 4203557 4211268 4223631 4239731 4259896
59752 4259896 4284830 4315135 4351550 4395015 4446383 4506175 4574130 4648698 4727637 4809648 4894723
59741D894723Q7503Q7297Q3857P8503P1939O3511N3794M5693M1362L9738L8915
59730E586835L9386M2777M8580N4776O1357P0657Q3942R9805J16623J34719J54992
59719F494449J76917J99356K22554K47889K75880L05575L36007L67220L99329
59710I025176M30958M58859M78591M85046M72646M36045L71933K81288J70826
59701A2611368N2320o0718j57470k32374k84267l14156l24510l19648l04577k82572
59691A0383396k54757k22444j88390j54790j21473q7507n3740k2073P233L5736
59681I321191O4436R2814J20406J47872J76106K05336K35326K65614K95561L25294
59671A1249956L56560L91306M29228M68089N06721N46491N89254O35129O82896
$$ plain form
59741 4894723 4982226 5069523 5153380 5231883 5303822 5367333 5421127 5466820 5508182 5547920 5586835
59730 5586835 5626221 5668998 5717578 5772354 5833711 5904368 5988310 6088115 6204738 6339457 6494449
59719 6494449 6671366 6870722 7093276 7341165 7617045 7922620 8258627 8625847 9025176
59710 9025176 9456134 9914993 10393584 10878630 11351276 11787321 12159254 12440542 12611368
59701 12611368 12663688 12602970 12445500 12213126 11928859 11614703 11290193 10970545 10665968 10383396
59691 10383396 10128639 9906195 9717805 9563015 9441542 9354035 9300295 9278222 9285455 9321191
59681 9321191 9385627 9478441 9598847 9746719 9922825 10128161 10363487 10629101 10924662 11249956
59671 11249956 11606516 11997822 12427050 12895139 13401860 13948351 14537605 15172734 15855630
59662A5855630P31486P80349Q29096Q77245R23483R65042R98799J023263J038169
59653B4022562J041996J031939J007483R72510R32526Q91033Q50257Q13931P86601
59644C2350838P69876P61081P56018P51664P45677P34761P14955O83202O37799
59635C8905871N77506N01352M10219L08482K03252J01303O771p7959j49811k04481
59625D0582505k38468k50933k43383k18128j77156j21891n3597K5827J13605K07176
59615C9625557L05296M07309N11356O14322P13520Q07151Q92523R64688J017273
59606D5858995J043846J037993R93327R04689P69505N88203L64581J06906j72001
59597E1496044m56602p30983r80253j192088j358973j478940j553513j585404
$$ plain form
59662 15855630 16587116 17367465 18196561 19073806 19997289 20962331 21961130 22984393 24022562
59653 24022562 25064558 26096497 27103980 28076490 29009016 29900049 30750306 31564237 32350838
59644 32350838 33120714 33881795 34637813 35389477 36135154 36869915 37584870 38268072 38905871
59635 38905871 39483377 39984729 40394948 40703430 40906682 41007985 41014756 40936797 40786986 40582505
59625 40582505 40344037 40093104 39849721 39631593 39454437 39332546 39278949 39304776 39418381 39625557
59615 39625557 39930853 40338162 40849518 41463840 42177360 42984511 43877034 44841722 45858995
59606 45858995 46902841 47940834 48934161 49838850 50608355 51196558 51561139 51668045 51496044
59597 51496044 51039442 50308459 49328206 48136118 46777145 45298205 43744692 42159288
59589D2159288j578779j540564j479617j404287j321597j238589j163290j103778
59581C1328787j066493j054899j068107j099729j138545j171889j190150j189312
59573B2349663j170120j135284j087623j030296r67278r02247q37043p72087p08216
59564A3739469o47139n90028n36871m87493m42166m00677l62004l25761k93104
59555I654226k65160k41107k18788j96923j76078j57744j43176j32697j25598
59546G996955j20827j18171j18220j20876j24644j28042j30988j34044j36985
59537F864158j39020j39775j39092j36351j31094j24051j16369j08024r8045q6371
59527E645966p4472o3950n5207m7457l9329k9629j8385p203K252J0141J7959K6152
$$ plain form
59589 42159288 40580509 39039945 37560328 36156041 34834444 33595855 32432565 31328787
59581 31328787 30262294 29207395 28139288 27039559 25901014 24729125 23538975 22349663
59573 22349663 21179543 20044259 18956636 17926340 16959062 16056815 15219772 14447685 13739469
59564 13739469 13092330 12502302 11965431 11477938 11035772 10635095 10273091 9947330 9654226
59555 9654226 9389066 9147959 8929171 8732248 8556170 8398426 8255250 8122553 7996955
59546 7996955 7876128 7757957 7639737 7518861 7394217 7266175 7135187 7001143 6864158
59537 6864158 6725138 6585363 6446271 6309920 6178826 6054775 5938406 5830382 5732337 5645966
59527 5645966 5571494 5507544 5452337 5404880 5365551 5335922 5317537 5310334 5312586 5322727 5340686 5366838
59515E366838L3376L8488M2168M5835M9810N3471N6653N9898O3507O7374P1791
59504E949209P7464Q4382R1503R8220J05606J15196J26854J38933J50778J63885
59494G102030J79795J97770K15616K32381K48956K66167K83591L00608L17453
59485I344367L34515L51226L66127L77552L83869L83864L77640L66802L53057
59476A2639019L36530L15527K87883K52928K12917J72526J35903J03814P4335
59467A4531382M6328K1059J44j6500k9465l7864m0034l5653k5663j0450J0466
59456A4413750L6882O7289R9905J33233J65163J92424K11537K19840K15470J96985
59446A5952478J63615J15801N5347j4839r1188j70069k48165l22315l89203m45538
$$ plain form
59515 5366838 5400214 5438702 5480870 5526705 5576515 5629986 5686639 5746537 5810044 5877418 5949209
59504 5949209 6026673 6111055 6202558 6300778 6406384 6521580 6648434 6787367 6938145 7102030
59494 7102030 7281825 7479595 7695211 7927592 8176548 8442715 8726306 9026914 9344367
59485 9344367 9678882 10030108 10396235 10773787 11157656 11541520 11919160 12285962 12639019
59476 12639019 12975549 13291076 13578959 13831887 14044804 14217330 14353233 14457047 14531382
59467 14531382 14577710 14598769 14598913 14582413 14552948 14515084 14475050 14439397 14413734 14403284 14413750
59456 14413750 14450632 14517921 14617826 14751059 14916222 15108646 15320183 15540023 15755493 15952478
59446 15952478 16116093 16231894 16287241 16272402 16181214 16011145 15762980 15440665 15051462 14605924
59436A4605924m88613n16818n30072n30011n19309n00287m74356m42982m08540
59427A0194936l73337l38070l02121k65379k29022j94287j61173j28864r6984
59418H105699o6009l6512q509J8459M4841P0885R6667J22026J46418J69231J90426
59407H853622K10570K29800K47028K60575K69346K72836K70101K59559K40007
59398A1113444K11371J74408J30278Q0421K6262l1088r0275j48817k03520k51980
59388A1010504k92961l25489l48714l63095l70498l72430l69013l60324l47650
59379G860330l32522l15348k96155k76019k56502k37954k19484k00604j82005
59370E543737j64686j49069j34989j21843j08765r5184q1457o8463n6494m4936
$$ plain form
59436 14605924 14117311 13600493 13070421 12540410 12021101 11520814 11046458 10603476 10194936
59427 10194936 9821599 9483529 9181408 8916029 8687007 8492720 8331547 8202683 8105699
59418 8105699 8039690 8003178 7994669 8013128 8057969 8128854 8225521 8347547 8493965 8663196 8853622
59407 8853622 9064192 9293992 9541020 9801595 10070941 10343777 10613878 10873437 11113444
59398 11113444 11324815 11499223 11629501 11709922 11736184 11705096 11614821 11466004 11262484 11010504
59388 11010504 10717543 10392054 10043340 9680245 9309747 8937317 8568304 8207980 7860330
59379 7860330 7527808 7212460 6916305 6640286 6383784 6145830 5926346 5725742 5543737
59370 5543737 5379051 5229982 5094993 4973150 4864385 4769201 4687744 4619281 4562787 4517851
59360D517851l3296k2228j3091o233n7P576J6899K6021L3623M0602M7725N2682
59348D668074N1795M4832L6085L0109K8189K9608L4111M1670N1436O2605P4993
59337E153507Q7212R5721R7845R5186R2334R2809R7718J07289J21408J38744J57437
59326F337210J76916J97756K19930K42793K66645K92598L20836L50585L81907
59317H787176M15859M52714M91628N32279N75167O19646O63280P03946P41142
59308A3982837P74189Q00270Q15416Q17031Q04871P80164P44583O99779O47452
59299B0866592N89895N30088M70591M12470L56032L02177K51634K02799J51937
59290B4134215R6092L4695l2097j04983j84233k67813l52121m34123n11822n83220
$$ plain form
59360 4517851 4484555 4462327 4449236 4443003 4442946 4450522 4467421 4493442 4527065 4567667 4615392 4668074
59348 4668074 4719869 4764701 4800786 4830895 4859084 4888692 4922803 4964473 5015909 5078514 5153507
59337 5153507 5240719 5336440 5434285 5529471 5621805 5714614 5812332 5919621 6041029 6179773 6337210
59326 6337210 6514126 6711882 6931812 7174605 7441250 7733848 8054684 8405269 8787176
59317 8787176 9203035 9655749 10147377 10679656 11254823 11874469 12537749 13241695 13982837
59308 13982837 14757026 15557296 16372712 17189743 17994614 18774778 19519361 20219140 20866592
59299 20866592 21456487 21986575 22457166 22869636 23225668 23527845 23779479 23982278 24134215
59290 24134215 24230307 24265002 24232905 24127922 23943689 23675876 23323755 22889632 22377810 21794590
59280B1794590o46041o98574p40033p70122p88829p96681p94745p84124p65633
59271A5009808p39901p07761o70652o30617n89553n48362n07166m66322m26702
59262I722772l88756l51972l15829k81030k49136k20931j95591j71720j48987
59253G398820j28283j10221r3998p8256o2703m8096l4640k1468q049M985J7134
59242F835225K9141M1707N3870O4170P3025Q2376R2834J02639J09983J15215J19974
59231G720159J24908J29094J31404J31739J30783J28970J25967J21443J16203
59222H860670J11913J09511J08544J08520J09916J12800J15186J14325J09652
59213I861037J03208R6930R0727Q3694P5951O8315O0548N0795L6836J7734n631
$$ plain form
59280 21794590 21148549 20449975 19709942 18939820 18150991 17354310 16559565 15775441 15009808
59271 15009808 14269907 13562146 12891494 12260877 11671324 11122962 10615796 10149474 9722772
59262 9722772 9334016 8982044 8666215 8385185 8136049 7915118 7719527 7547807 7398820
59253 7398820 7270537 7160316 7066318 6988062 6925359 6877263 6842623 6821155 6813106 6818091 6835225
59242 6835225 6864366 6906073 6959943 7024113 7097138 7179514 7272348 7374987 7484970 7600185 7720159
59231 7720159 7845067 7974161 8105565 8237304 8368087 8497057 8623024 8744467 8860670
59222 8860670 8972583 9082094 9190638 9299158 9409074 9521874 9637060 9751385 9861037
59213 9861037 9964245 10061175 10151902 10235596 10311547 10379862 10440410 10491205 10528041 10545775 10540144
59202A0540144l1303n7352q2168j04180j22163j36038j46539j53594j55897j52760
59192I398150j45530j36268j25708j13444r9398q3935o7163m9441l2175j6797
59182H528291l414Q528J8859K7428L5207M2835M8642N0540M9620M9377N1190N3220
59170H960323N4426N6997O3333P2927Q4064R6931J13040J32697J54926J79378
59160I969042K06642K36980K69832L04138L38059L68857L94157M12889M24000
59151A2924596M24674M11063L80777L34030K72533J98272J13310K0137p8089j77427
59141A4823876k73435l61798m38732n01084n46879n76130n90601n92424n83207
59132A0359586n64486n38345n07247m73669m39791m06798l74479l42405l11526
$$ plain form
59202 10540144 10508841 10451489 10369321 10265141 10142978 10006940 9860401 9706807 9550910 9398150
59192 9398150 9252620 9116352 8990644 8877200 8777802 8693867 8626704 8577263 8545088 8528291
59182 8528291 8524877 8533405 8552264 8579692 8614899 8657734 8706376 8756916 8806536 8855913 8907103 8960323
59170 8960323 9014749 9071746 9135079 9208006 9292070 9389001 9502041 9634738 9789664 9969042
59160 9969042 10175684 10412664 10682496 10986634 11324693 11693550 12087707 12500596 12924596
59151 12924596 13349270 13760333 14141110 14475140 14747673 14945945 15059255 15079392 15001303 14823876
59141 14823876 14550441 14188643 13749911 13248827 12701948 12125818 11535217 10942793 10359586
59132 10359586 9795100 9256755 8749508 8275839 7836048 7429250 7054771 6712366 6400840
59123F400840k83587k58918k36102k14116j93465j74716j57408j41264j27069
59114D614195j15227j04557r3727q3030p3510o5142n7043m8898m0912l3024k5321
59103C873804j8611j3173p402P17J0754J9887K6066L0012L3822L8621M4180M9986
59091D088663N5995O2461O9390P6206Q2065Q6715R0942R5835J01635J07539J12534
59080E029980J16299J19314J22209J24811J25983J24675J21079J16272J10822
59071F111444J04521R7368Q9831Q1827P2540O1869N1123M1631L3498K6464K1061
59060F793177J7896J6529J6295J7746K1872K8141L4717M0899M8104N7940P0096
59049G163412Q2838R5028J07023J19762J33625J48235J62959J77256J90681K02918
$$ plain form
59123 6400840 6117253 5858335 5622233 5408117 5214652 5039936 4882528 4741264 4614195
59114 4614195 4498968 4394411 4300684 4217654 4144144 4079002 4021959 3973061 3932149 3899125 3873804
59103 3873804 3855193 3842020 3834618 3835335 3846089 3865976 3892042 3922054 3955876 3994497 4038677 4088663
59091 4088663 4144658 4207119 4276509 4352715 4434780 4521495 4612437 4708272 4809907 4917446 5029980
59080 5029980 5146279 5265593 5387802 5512613 5638596 5763271 5884350 6000622 6111444
59071 6111444 6215965 6313333 6403164 6484991 6557531 6619400 6670523 6712154 6745652 6772116 6793177
59060 6793177 6811073 6827602 6843897 6861643 6883515 6911656 6946373 6987272 7035376 7093316 7163412
59049 7163412 7246250 7341278 7448301 7568063 7701688 7849923 8012882 8190138 8380819 8583737
59039H583737K13760K22733K28566K29563K24837K14541J98342J74497J41648
59030A0432224J01281N6993J1345l4976q0581j21866j55456j81136k00981k16315
59020I610532k27058k33780k38592k43334k47700k49971k49253k46592k43881
59011G430371k42114k40821k38992k36079k32032k26843k20524k13197k04830
59002E374939j95293j85164j75859j68023j60360j51208j40950j31465j23332
58993C943285j15265j06536r8173r1045q4368p7287p0619o5642o1926n7868n3022
58982C061534m8686m6301m6105m7361m9163n0951n2604n4099n4935n4243n1633
58971B505453m7701m3566m0157l7782l5875l3242k9113k4052j9340j5782j3651
$$ plain form
59039 8583737 8797497 9020230 9248796 9478359 9703196 9917737 10116079 10290576 10432224
59030 10432224 10533505 10590498 10601843 10566867 10486286 10364420 10208964 10027828 9826847 9610532
59020 9610532 9383474 9149694 8911102 8667768 8420068 8170097 7920844 7674252 7430371
59011 7430371 7188257 6947436 6708444 6472365 6240333 6013490 5792966 5579769 5374939
59002 5374939 5179646 4994482 4818623 4650600 4490240 4339032 4198082 4066617 3943285
58993 3943285 3828020 3721484 3623311 3532266 3447898 3370611 3299992 3234350 3172424 3114556 3061534
58982 3061534 3012848 2966547 2920442 2873081 2823918 2772967 2720363 2666264 2611329 2557086 2505453
58971 2505453 2457752 2414186 2374029 2336247 2300372 2267130 2238017 2213965 2194625 2178843 2165192
58960B165192j3158j3829j3896j1911q854p117p382q072p893o924n059j684K264
58947B061677M167L019J051P09J750K746L751N422O906O805N544M908N618O960
58933B121033Q361R849J1170J1872J2188J2843J4069J5602J7309J9160K0993K2847
58921B297296K4850K6435K6606K5542K4784K5161K5910K6572K8051L0665L2794
58910B594666L3144L2999L4382L7191L9922M2188M4535M6630M7741M8420M9704
58899C051522N1146N1551N1376N2397N5109N8236O0850O3330O6111O8949P1614
58888C702191P4225P6859P9681Q3251Q7808R2754R7680J03195J09794J16785J23526
58877D747749J30646J38758J47124J55232J64465J76123J88847K00340K11112
$$ plain form
58960 2165192 2152034 2138205 2124309 2112398 2103544 2096427 2089045 2080973 2073080 2066156 2061097 2059413 2061677
58947 2061677 2065844 2068863 2069914 2070623 2072373 2075119 2078870 2084292 2091198 2098003 2103547 2108455 2114073 2121033
58933 2121033 2129394 2139243 2150413 2162285 2174473 2187316 2201385 2216987 2234296 2253456 2274449 2297296
58921 2297296 2322146 2348581 2375187 2400729 2425513 2450674 2476584 2503156 2531207 2561872 2594666
58910 2594666 2627810 2660809 2695191 2732382 2772304 2814492 2859027 2905657 2953398 3001818 3051522
58899 3051522 3102668 3154219 3205595 3257992 3313101 3371337 3432187 3495517 3561628 3630577 3702191
58888 3702191 3776416 3853275 3932956 4016207 4104015 4196769 4294449 4397644 4507438 4624223 4747749
58877 4747749 4878395 5017153 5164277 5319509 5483974 5660097 5848944 6049284 6260396
58868F260396K24059K40638K59663K79660L00188L20940L41790L63891L88729
58859H979954M16001M44316M73797N05875N40471N75742O10906O47162O85311
58850A3879535P24451P63363Q01219Q36402Q66555Q90308R07115R14832R09433
58841B1493213Q87714Q48310P89516P08463O03835M78016L35412J80277J7305
58832B6342061j47054l05459m51466n80093o87876p73477q37553q81383r06133
58823B0771567r13532r06208q86907q58108q22472p82549p39765o94731o48685
58814A3518610o03736n61645n23264m88826m57641m28038l99190l72646l50301
58805I333323l31232l12604k93514k75491k59059k42456k24500k06356j89400
$$ plain form
58868 6260396 6484455 6725093 6984756 7264416 7564604 7885544 8227334 8591225 8979954
58859 8979954 9395955 9840271 10314068 10819943 11360414 11936156 12547062 13194224 13879535
58850 13879535 14603986 15367349 16168568 17004970 17871525 18761833 19668948 20583780 21493213
58841 21493213 22380927 23229237 24018753 24727216 25331051 25809067 26144479 26324756 26342061
58832 26342061 26195007 25889548 25438082 24857989 24170113 23396636 22559083 21677700 20771567
58823 20771567 19858035 18951827 18064920 17206812 16384340 15601791 14862026 14167295 13518610
58814 13518610 12914874 12353229 11829965 11341139 10883498 10455460 10056270 9683624 9333323
58805 9333323 9002091 8689487 8395973 8120482 7861423 7618967 7394467 7188111 6998711
58796F998711j73368j57722j42987j29453j16292j03147r1047q0502p0150n8499
58786E875544m5844l3444k1923j1356j729P682J8084K9595M1024N1896O3225P5456
58774F048210Q7175R7017J05716J15279J26966J40712J55422J69413J81853J94263
58764G422026K09148K26803K45227K63605K83565L06149L29941L53690L78695
58755A0018849M06787M37736M70328N04435N40100N76162O11751O47943O85995
58746A4900086P24896P62368P97052Q27715Q51371Q64327Q64508Q50816Q20825
58737B2263964P71013O99134O04964M89436L54904K05995M8639j11618k69276
58728B5057155m17807n50902o64845p58401q30862q81859r12814r26680r25945
$$ plain form
58796 6998711 6825343 6667621 6524634 6395181 6278889 6175742 6084695 6004193 5934043 5875544
58786 5875544 5829700 5796256 5774333 5762977 5761248 5768930 5787014 5816609 5857633 5909529 5972754 6048210
58774 6048210 6135385 6232402 6338118 6453397 6580363 6721075 6876497 7045910 7227763 7422026
58764 7422026 7631174 7857977 8103204 8366809 8650374 8956523 9286464 9640154 10018849
58755 10018849 10425636 10863372 11333700 11838135 12378235 12954397 13566148 14214091 14900086
58746 14900086 15624982 16387350 17184402 18012117 18863488 19727815 20592323 21443139 22263964
58737 22263964 23034977 23734111 24339075 24828511 25183415 25389410 25438049 25326431 25057155
58728 25057155 24639348 24088446 23423601 22665200 21834338 20952479 20039665 19112985 18187040
58719A8187040r12100q87280q55024q18806p80624p41272p01409o62039o24187
58710A1204299n88089n52775n17114m81542m48022m17781l90083l63713l38502
58701G106678l14604k91568k69362k49268k32211k17081k02179j87577j74384
58692D968444j62301j49891j37121j25792j17045j09929j02874r5451q8207q1615
58682C798218p5725p0362o5413o1201n8304n6619n4982n2408m9314m6782m5006
58671C162102m3407m1939m1137m0849m0104l8529l7078l6861l7840l9007l9557
58660B725794l9504l9374l9680m0741m2685m5252m7531m8376m7550m6219m5830
58649B243052m6625m7632m7794m6490m3464l9153l4894l1832k9770k7899k6286
$$ plain form
58719 18187040 17274940 16387660 15532636 14713830 13933206 13191934 12490525 11828486 11204299
58710 11204299 10616210 10063435 9546321 9064779 8616757 8198976 7808893 7445180 7106678
58701 7106678 6792074 6500506 6231144 5981876 5749665 5532584 5330405 5142828 4968444
58692 4968444 4806143 4656252 4519131 4393339 4276294 4166365 4063491 3968040 3879833 3798218
58682 3798218 3722493 3652131 3586718 3525517 3467213 3410594 3355612 3303204 3253890 3207108 3162102
58671 3162102 3118695 3076756 3035619 2994770 2954666 2916137 2879059 2842198 2804358 2765351 2725794
58660 2725794 2686290 2646916 2607236 2566495 2523810 2478558 2431027 2382651 2335101 2288882 2243052
58649 2243052 2196427 2148795 2101001 2054511 2011047 1971894 1937000 1905168 1875398 1847499 1821213
58638A821213k5502k5212k4646k4123k4591k5677k5973k5259k4657k4414k3573
58627A547586k2165k1611k2192k2200k0466j7975j6051j4733j3729j3117j2167
58616A351180r640o211m347m487l671J68M834O906O366N823O674Q238R524R693
58602A381050P809M226J170M7p01l088o252p823p482o663n626l428l62K118L751
58587A358746N483P346Q368Q630R499J1681J4690J8100K1723K4814K6838K8825
58575A544743L2381L7316M1805M4742M6577M8012M9371N1118N3698N7010O1029
58564B067802O6409P3338Q0534Q6746R2599R9517J07640J16247J25425J35678
58554C051935J46638J57831J69841J83034J96110K07901K19488K32210K44430
$$ plain form
58638 1821213 1795711 1770499 1745853 1721730 1697139 1671462 1645489 1620230 1595573 1571159 1547586
58627 1547586 1525421 1503810 1481618 1459418 1438952 1420977 1404926 1390193 1376464 1363347 1351180
58616 1351180 1341540 1335329 1330982 1326495 1322824 1322992 1327826 1334732 1341098 1346921 1353595 1361833 1371357 1381050
58602 1381050 1388859 1393085 1394255 1394302 1393601 1390513 1384261 1376438 1368956 1362293 1356667 1353239 1352877 1354995 1358746
58587 1358746 1364229 1371575 1379943 1388573 1398072 1409753 1424443 1442543 1464266 1489080 1515918 1544743
58575 1544743 1577124 1614440 1656245 1700987 1747564 1795576 1844947 1896065 1949763 2006773 2067802
58564 2067802 2134211 2207549 2288083 2374829 2467428 2566945 2674585 2790832 2916257 3051935
58554 3051935 3198573 3356404 3526245 3709279 3905389 4113290 4332778 4564988 4809418
58545D809418K52835K56336K56035K51536K40152K19862J90840J53886J09685
58536F740585N9990P552m5185r5698j40204j75370k01309k20564k34250k41528
58526E454019k42749k40112k34696k25662k13209j99633j86361j72340j56696
58517C582561j40809j26458j13722j01990r1374q1879p2790o4180n7478n3331
58507B678550n0287m6877m3787m2478m2734m2938m2200m0997m0093l9708l9544
58496B206907l9098l8046l6491l4635l2551l0862l0952l3310l6087l6859l5610
58485A822406l4377l4097l3689l2471l1441l1300l0909k8826k5364k2204k0583
58474A497145k0435k0642j9893j7952j6026j5221j4970j4139j3008j2632j2547
$$ plain form
58545 4809418 5062253 5318589 5574624 5826160 6066312 6286174 6477014 6630900 6740585
58536 6740585 6800575 6808127 6762942 6667244 6527040 6351670 6150361 5929797 5695547 5454019
58526 5454019 5211270 4971158 4736462 4510800 4297591 4097958 3911597 3739257 3582561
58517 3582561 3441752 3315294 3201572 3099582 3008208 2926329 2853539 2789359 2731881 2678550
58507 2678550 2628263 2581386 2537599 2495121 2452387 2409449 2367249 2326252 2286159 2246451 2206907
58496 2206907 2167809 2129763 2093272 2058637 2026086 1995224 1964272 1930962 1894875 1858016 1822406
58485 1822406 1788029 1753932 1720243 1687772 1656331 1625031 1594122 1565296 1539932 1517728 1497145
58474 1497145 1476710 1456068 1436175 1418223 1402197 1386976 1372006 1357867 1344859 1332227 1319680
58463A319680j1178q562o715o866q114r231j0000j0198r118p024n449n142n067
58450A217016m309l538l669m190l910k471m61J166J350m11l100m925n362n454
58436A177732n790n756n283n651p434r054q866p726p924r996j1965j1775r521
58423A070991o963n455m749l731k074p83j029k736m694n809n829n056l852k474
58409A015757j254q39j769l412l944k571j186k099m437n117l480k161k589k833
58395I78066j410RR6R28M287P584P296M676L970O150Q504R647J0697J1756J1266
58380A063522R245P703P256O452M750L113J529r95l746m894m942o244q647r200
58366A064902o908m383l713m020m195m761n570m748j753J075J745J202J246J925
$$ plain form
58463 1319680 1308502 1299940 1293225 1286359 1278245 1269014 1259014 1248816 1239698 1232674 1227225 1222083 1217016
58450 1217016 1212707 1209169 1205500 1201310 1197400 1194929 1194468 1195634 1196984 1196573 1193473 1188548 1183186 1177732
58436 1177732 1171942 1166186 1160903 1155252 1147818 1138764 1129898 1122172 1114248 1104252 1092287 1080512 1070991
58423 1070991 1064028 1058573 1053824 1050093 1048019 1047236 1046207 1043471 1038777 1032968 1027139 1022083 1018231 1015757
58409 1015757 1014503 1013664 1011895 1008483 1004539 1001968 1000782 998683 994246 989129 985649 983488 980899 978066
58395 978066 976656 976665 976761 977689 981976 989560 996856 1001532 1005502 1011652 1020156 1029803 1040500 1052256 1063522
58380 1063522 1072767 1080470 1087726 1094178 1098928 1102041 1103570 1102575 1098829 1093935 1088993 1082749 1074102 1064902
58366 1064902 1057994 1053611 1049898 1045878 1041683 1036922 1031352 1026604 1024851 1025926 1027671 1028873 1030119 1032044
58352A032044K382K387J876O82l61K08K339M455N860P258Q738R544R984J1031
58338A098427J1903J0773Q235P193Q765J1159J2893J4266J5113J4379J2721J2449
58326A238276J4039J5456J5521J5012J4197J2691J1923J3841J6508J5368J0030
58315A392862N418M641N103L724J616Q66N89n97j344M9K513M087M736N123M943
58300A434329M397N003P140R143J0222J1611J3457J3766J2032J0643J0948J1189
58288A553880J0136R279R448Q855O704N190N508N440L541K235L811O520P722Q084
58274A646353R630J2156J4197J5308J5271J3597J1682J2439J6039J9146K0007
58263A805825K0735K2743K4206K4165K4846K7218K8665K7882K7702K9886L1601
$$ plain form
58352 1032044 1034426 1036813 1038689 1039371 1039010 1039218 1041557 1046012 1051872 1059130 1067868 1077412 1087396 1098427
58338 1098427 1110330 1121103 1129338 1136531 1145296 1156455 1169348 1183614 1198727 1213106 1225827 1238276
58326 1238276 1252315 1267771 1283292 1298304 1312501 1325192 1337115 1350956 1367464 1382832 1392862
58315 1392862 1398280 1402921 1408024 1411748 1413364 1414230 1414819 1414222 1412878 1412927 1415440 1419527 1424263 1429386 1434329
58300 1434329 1438726 1443729 1450869 1460012 1470234 1481845 1495302 1509068 1521100 1531743 1542691 1553880
58288 1553880 1564016 1573295 1582743 1591598 1598302 1603492 1609000 1614440 1617981 1620216 1624027 1630547 1638269 1646353
58274 1646353 1655983 1668139 1682336 1697644 1712915 1726512 1738194 1750633 1766672 1785818 1805825
58263 1805825 1826560 1849303 1873509 1897674 1922520 1949738 1978403 2006285 2033987 2063873 2095474
58252B095474L0487K8900K9406L0369K9807K9444L0834L1690L0209K8972L0187
58241B425779L1224K9522K7902K9935L3647L4970L4242L4310L5226L5816L7512
58230B790085M1826M6634M9495N1815N5462N8555N9033N9166O1803O5310O6851
58219C406035O7466O9350P1469P2424P4111P8012Q1528Q2729Q4833R1028R8891
58208D277876J04889J10245J17136J23514J27239J30988J37435J44097J48718
58199E422137J54847J65883J78588J89025J99862K14690K30151K41455K51084
58190G247722K64263K80195K95478L11729L31848L53132L72087L91757M16411
58181A0264622M43800M70654N00540N37561N77659O15211O52878O95603P40633
$$ plain form
58252 2095474 2125961 2154861 2184267 2214636 2244443 2273887 2304721 2336411 2366620 2395592 2425779
58241 2425779 2457003 2486525 2514427 2544362 2578009 2612979 2647221 2681531 2716757 2752573 2790085
58230 2790085 2831911 2878545 2928040 2979855 3035317 3093872 3152905 3212071 3273874 3339184 3406035
58219 3406035 3473501 3542851 3614320 3686744 3760855 3838867 3920395 4003124 4087957 4178985 4277876
58208 4277876 4382765 4493010 4610146 4733660 4860899 4991887 5129322 5273419 5422137
58199 5422137 5576984 5742867 5921455 6110480 6310342 6525032 6755183 6996638 7247722
58190 7247722 7511985 7792180 8087658 8399387 8731235 9084367 9456454 9848211 10264622
58181 10264622 10708422 11179076 11679616 12217177 12794836 13410047 14062925 14758528 15499161
58172A5499161P83340Q27056Q76679R28486R77047J026301J082651J143431J203814
58163B4347966J268276J342937J423516J503975J589694J688277J795206J903493
58155C6863340K019551K153873K304464K466357K648647K864201L111977L388748
58147E7821158L708227M087965M528758N029282N607577O281420P040435P867015
58139A01971837Q773202R789595J0937160J2243524J3760579J5517224J7476043
58132A90469164J9590308K1884201K4431565K7306959L0603280L4294023L7708681
58125C86288181L9071184L6013050K7156575J3471949j990270j5829830k5947345
58118D58233494l1942696l4489144l4589062l3176245l0966545k8413066k5757703
$$ plain form
58172 15499161 16282501 17109557 17986236 18914722 19891769 20918070 22000721 23144152 24347966
58163 24347966 25616242 26959179 28382695 29886670 31476364 33164641 34959847 36863340
58155 36863340 38882891 41036764 43341228 45807585 48456232 51320433 54432410 57821158
58147 57821158 61529385 65617350 70146108 75175390 80782967 87064387 94104822 101971837
58139 101971837 110745039 120534634 131471794 143715318 157475897 172993121 190469164
58132 190469164 210059472 231943673 256375238 283682197 314285477 348579500 386288181
58125 386288181 425359365 461372415 488528990 502000939 500010669 484180839 458233494
58118 458233494 426290798 391801654 357212592 324036347 293069802 264656736 238899033
58111B38899033k3130643k0601810j8187199j5875954j3667967j1571979r587857
58104A26275624p721422o005433m486895l219282k295938j856963j998357k655097
58096I6036237l594639m532324n253847n663892n774197n662178n414158n084606
58088E5056396m701480m293231l890255l506253l139704k793948k479879k200764
58080B8050882j950932j729653j541820j385275j250823j134478j037424r55277
58072A7065200q80180q12495p58057p14430o72035o28415n89512n56851n25068
58063A0928157m92624m63845m39091m13157l85030l60141l41544l26956l15171
58054G390598l07337l01165k91644k78271k64913k52618k39379k26228k16180
$$ plain form
58111 238899033 215768390 195166580 176979381 161103427 147435460 135863481 126275624
58104 126275624 118554202 112548769 108061874 104842592 102546654 100689691 98691334 96036237
58096 96036237 92441598 87909274 82655427 76991535 71217338 65555160 60141002 55056396
58088 55056396 50354916 46061685 42171430 38665177 35525473 32731525 30251646 28050882
58080 28050882 26099950 24370297 22828477 21443202 20192379 19057901 18020477 17065200
58072 17065200 16185020 15372525 14614468 13900038 13228003 12599588 12010076 11453225 10928157
58063 10928157 10435533 9971688 9532597 9119440 8734410 8374269 8032725 7705769 7390598
58054 7390598 7083261 6782096 6490452 6212181 5947268 5694650 5455271 5229043 5012863
58045E012863k07663j96284j82645j71241j62353j52442j42028j35441j32851
58036C529915j30014j26065j24050j23543j20123j13001j06234j01451r5875q8418
58026B401141q1488p5903o9816o3321n8502n4753m9731m4886m3875m5499m4630
58015A768737m0637l8328l9708m1202m0329l8958l8374l6862l4029l2278l2183
58004A355849l1085k7772k4161k1304j8072j4667j2927j2359j0428p402o307p520
57992A161845q135p295p246q421q568p540p843r435r161o674n706p844j0001r869
57978A048107r078r006q077n381k848j733q76q4j216m063n462m441m142o379q435
57963I76886p749o075o215p775q830r074q960q199p074o890p624p596o725p165
$$ plain form
58045 5012863 4805200 4608916 4426271 4255030 4092677 3940235 3798207 3662766 3529915
58036 3529915 3399901 3273836 3149786 3026243 2906120 2793119 2686885 2585434 2489559 2401141
58026 2401141 2319653 2243750 2173934 2110613 2052111 1997358 1947627 1902741 1858866 1813367 1768737
58015 1768737 1728100 1689772 1650064 1608862 1568533 1529575 1491201 1454339 1420310 1388032 1355849
58004 1355849 1324764 1296992 1272831 1251527 1233455 1218788 1205861 1193502 1183074 1175672 1169365 1161845
57992 1161845 1153710 1146415 1139169 1130748 1122180 1114640 1106797 1097362 1088201 1081527 1075821 1067977 1057976 1048107
57978 1048107 1039029 1030023 1021946 1016565 1013717 1011984 1011108 1011024 1009808 1005745 1000283 995842 991700 985321 976886
57963 976886 969137 963062 956847 949072 940242 931168 922208 914009 906935 900045 892421 884825 878100 870935
57949H70935r443j1067j0459r182q718q251p343p532r222j0077q612o632o006
57936G58391n715m308k741k483k890k598j623l69J576L994N310M764L421K062
57922G56791K05j709j803K74K329K971L428M569M818K900K72j054j239j541k393
57907G68818l788n618o587n259l092l696p639j1020j0858q917q114q213p609o775
57893F71633o897p135o024m097k682j531J38J700K269K449K931K857J511J96N00
57878F57818K060L760N607P520P957N899K771M28j454l984o592q145r151j0561
57864F53933j1470j0376p877n975n357n260n305n539n292l845j770p6J360L058
57850E90209M376M304L200K422K669L812N519O990P025N602M305M050L626J901
$$ plain form
57949 870935 861492 850425 839966 830784 822066 813815 806472 798940 789718 779641 771029 764397 758391
57936 758391 752676 748368 745627 743144 740254 737656 736033 735664 737240 741234 746544 751308 754729 756791
57922 756791 756996 755287 753484 753758 756087 759058 762486 767055 771873 774773 775045 773991 772752 771211 768818
57907 768818 765030 759412 752825 747566 744474 740778 733139 722119 711261 702344 694230 686017 678408 671633
57893 671633 664736 657601 651577 647480 644798 643267 643405 645105 647374 649823 652754 655611 657122 657318 657818
57878 657818 659878 663638 669245 676765 684722 690621 693392 693820 692366 688382 681790 673645 664494 653933
57864 653933 642463 632087 624210 618235 612878 607618 602313 596774 591482 587637 585867 585791 587151 590209
57850 590209 594585 598889 602089 604511 607180 610992 616511 623501 630526 636128 640433 644483 648109 650010
57836F50010Q6m0R61R80n59k297l122l156k927k916l608m831n551n344n349o639
57820F05698q482r434r316q860q132o726m925l342j897k55J245K111K591L164
57806E53440L862M855O620Q593Q896O821M512M514O354P201N492K505M17N6N64
57791F24702M73q66k773m300n630p408q948q886p836q243j0727j2728j2099j0002
57777E24729q598p831o653n707o304p693p821o391n075n041n899o822p172o480
57763D31242n149m709o031p958q873q802q547p876o280m660m287m674m331l225
57749C45840k624k752k445j094O51K101L055L288K819K564L428M873N538N071
57735C70313M163L136J780L75m40p39j137j664j701j002J04J262K145K387K158
$$ plain form
57836 650010 650096 650056 651017 651997 651438 649141 646019 642863 639936 637020 633412 628581 623030 617686 612337 605698
57820 605698 597216 587782 578466 569606 561474 554748 549823 546481 544584 544329 545574 547685 550276 553440
57806 553440 557302 562157 568777 577370 586266 593087 597599 602113 608467 615668 621160 623665 624082 624138 624702
57791 624702 625175 624309 621536 617236 611606 604198 595250 586364 578528 570285 559558 546830 534731 524729
57777 524729 516131 508300 501647 495940 489636 481943 474122 467731 462656 457615 451716 444894 437722 431242
57763 431242 426093 421384 415353 407395 398522 389720 381173 373297 367017 362357 358070 353396 349065 345840
57749 345840 343216 340464 338019 336925 337576 339677 342732 346020 348839 351403 354831 359704 365242 370313
57735 370313 374476 377612 379392 379767 379327 378588 377451 375787 374086 373084 373188 374450 376595 378982 381140
57720C81140K272L071L838L955L671K979Q96k874o649q409q006o653n154l798
57706C60279l022k825k406j533j277k183k958k356j060j29J038L267N440N899
57692C56174N075M638M850M900M970N704O337N700M504M378N123N188M434M039
57678D26014M115L892L925N486P869Q916Q367Q121Q882R218Q473Q069Q880R624
57664E29851R021P890P854R282J1451J3634J5366J6482J7337J8238J8758J8440
57652F93604J7860J7850J8254J8818K0490K4018K7917L0019L0620L1826L4081
57641I65357L5873L6805L8234M0500M2188M2849M4002M6598M9539N1762N3821
57630A447528N6648O0405O5269P1641P9114Q6958R5839J07006J19536J30917J40973
$$ plain form
57720 381140 383412 386483 390321 394276 397947 400926 401822 398948 392299 383890 375884 369231 364077 360279
57706 360279 357257 354432 352026 350493 349216 347033 344075 341719 340659 340530 341568 344835 350275 356174
57692 356174 361249 365887 370737 375637 380607 386311 392648 398348 402852 407230 412353 417541 421975 426014
57678 426014 430129 434021 437946 443432 451301 460217 468584 476705 485587 494805 503278 511347 520227 529851
57664 529851 538872 546762 554616 563898 575349 588983 604349 620831 638168 656406 675164 693604
57652 693604 711464 729314 747568 766386 786876 810894 838811 868830 899450 931276 965357
57641 965357 1001230 1038035 1076269 1116769 1158957 1201806 1245808 1292406 1341945 1393707 1447528
57630 1447528 1504176 1564581 1629850 1701491 1780605 1867563 1963402 2070408 2189944 2320861 2461834
57619B461834J52672J68035J85612K03056K19798K35905K50720K64246K77701
57610D419579K90847L00338L02200K94111K73625K36377J78977J03534J8100o6755
57600F350933j41433j99675k40027k64967k77876k81316k77840k70095k58970
57591D138734k43517k23975k03146j83594j65366j47899j32018j18303j05276
57582B615640r1433p7647o5579n5177m5663l7493l1014k4638j6819q854k928J632
57570B160027P352J4420K0521K4955L0015L7560M6641N5605O4457P3897Q3449
57559B618899R2148J00324J09501J20545J32590J43891J53369J61064J66997J70143
57549C969471J69102J63495J53413J37577J13752Q1712M4347M937l5061p4448
$$ plain form
57619 2461834 2614506 2782541 2968153 3171209 3391007 3626912 3877632 4141878 4419579
57610 4419579 4710426 5010764 5312964 5607075 5880700 6117077 6296054 6399588 6417688 6350933
57600 6350933 6209500 6009825 5769798 5504831 5226955 4945639 4667799 4397704 4138734
57591 4138734 3895217 3671242 3468096 3284502 3119136 2971237 2839219 2720916 2615640
57582 2615640 2524207 2446560 2380981 2325804 2280141 2242648 2211634 2186996 2170177 2161323 2158395 2160027
57570 2160027 2167379 2181799 2202320 2227275 2257290 2294850 2341491 2397096 2461553 2535450 2618899
57559 2618899 2711047 2811371 2920872 3041417 3174007 3317898 3471267 3632331 3799328 3969471
57549 3969471 4138573 4302068 4455481 4593058 4706810 4788522 4832869 4837806 4802745 4728297
57539D728297j10318j39731j62294j79272j90967j97002j98362j96875j92838
57530C160638j85271j74660j63482j53556j44462j35053j25095j14961j04992
57521A859106r5750q7902q1354p5248o9078o3105n7459n1815m6288m1803l8921
57510A150383l6743l3573k8630k2958j8574j6618j6329j6046j5067j3798j2223
57499I19824r491n620k325j021q24K21K493M513N066M552M344N679Q841J2721
57485I48973J5497J6575J7410J9725K3449K7198L0161L2497L4467L6327L8667
57474A240946M1765M4885M7268M9516N2930N7830O3448O9159P4819Q0388Q6191
57463A909145R3034J00997J08672J14880J20454J26829J33322J37556J38236J35708
$$ plain form
57539 4728297 4617979 4478248 4315954 4136682 3945715 3748713 3550351 3353476 3160638
57530 3160638 2975367 2800707 2637225 2483669 2339207 2204154 2079059 1964098 1859106
57521 1859106 1763356 1675454 1594100 1518852 1449774 1386669 1329210 1277395 1231107 1189304 1150383
57510 1150383 1113640 1080067 1051437 1028479 1009905 993287 976958 960912 945845 932047 919824
57499 919824 910333 904713 902388 901367 900543 900764 903257 907770 912836 917388 921732 927411 936252 948973
57485 948973 964470 981045 998455 1018180 1041629 1068827 1098988 1131485 1165952 1202279 1240946
57474 1240946 1282711 1327596 1374864 1424380 1477310 1535140 1598588 1667747 1742566 1822954 1909145
57463 1909145 2002179 2103176 2211848 2326728 2447182 2574011 2707333 2844889 2983125 3118833
57453C118833J29738J18696J01526P8941N2172K1967j0284m1675o9175r1525j09280
57442C299934j23454j34408j41582j44076j41849j36329j29377j21783j13382
57433B113694j04339r5389q6900p8624p0333o2025n3688m5689l9102l4518l0718
57422A412369k5769j9463j3352q267l219K698Q616J3033J5852J8399K1909K6618
57410A449424L2122L7980M3915M9778N5474O0990O6510P2290P8313Q4374R0605
57399B121775R7411J04651J11396J16769J20360J21505J19009J12066J00561Q3918
57389C209421O0948L1918k52l2060o1782q8697j11259j28039j39763j48390j54361
57378B437684j56537j54681j50173j44194j36899j28551j19949j11454j02862
$$ plain form
57453 3118833 3248571 3367267 3468793 3547734 3599906 3621873 3611589 3569914 3500739 3409214 3299934
57442 3299934 3176480 3042072 2900490 2756414 2614565 2478236 2348859 2227076 2113694
57433 2113694 2009355 1913966 1827066 1748442 1678109 1616084 1562396 1516707 1477605 1443087 1412369
57422 1412369 1386600 1367137 1353785 1345518 1342299 1344997 1353613 1366646 1382498 1400897 1422806 1449424
57410 1449424 1481546 1519526 1563441 1613219 1668693 1729683 1796193 1868483 1946796 2031170 2121775
57399 2121775 2219186 2323837 2435233 2552002 2672362 2793867 2912876 3024942 3125503 3209421
57389 3209421 3270369 3302287 3302035 3269975 3208193 3119496 3008237 2880198 2740435 2592045 2437684
57378 2437684 2281147 2126466 1976293 1832099 1695200 1566649 1446700 1335246 1232384
57369A232384r4424q6749p9781p3085o7014o2128n7677n2402m6819m2886m1110
57358E28309l9753l7377l4404l1650k8945k6094k3732k2292k1092j9288j6934
57347B26748j4684j3152j2792j3426j3848j2874j0945r562r238r178q949q860
57335H9240q731p868o495n665n461m947l998l479l321k449j057q76k407l874l820
57320B4792k941k371k054j906k657m094m315B170K66J045J0j444f90l884m263
57305h837l420k440k790m369n923o744o793n916m288l037l131m081m716m706m405
57290g5596l860l045k434k336k290j915j678j853j554R2K353L656L542L026L222
57275h0670M200M910M072J730o0P67L435M931L755J502J85j19m2N88J633J775
$$ plain form
57369 1232384 1137960 1051211 971430 898345 831331 769203 711526 659124 612305 569419 528309
57358 528309 488556 451179 416775 385125 356180 330086 306354 284062 262970 243682 226748
57347 226748 212064 198912 186120 172694 158846 145972 135027 125465 116227 107049 98100 89240
57335 89240 80509 72641 66146 60481 55020 50073 46075 42596 39275 36826 35769 34893 32486 28612 24792
57320 24792 21851 19480 17426 15520 12863 8769 4454 2170 2436 3481 3491 2047 -690 -4574 -8837
57305 -8837 -12257 -14697 -17487 -21856 -27779 -34523 -41316 -47232 -51520 -54557 -57688 -61769 -66485 -71191 -75596
57290 -75596 -79456 -82501 -84935 -87271 -89561 -91476 -93154 -95007 -96561 -96469 -94116 -90460 -86918 -83892 -80670
57275 -80670 -76470 -71560 -67488 -65758 -65818 -65051 -61616 -56685 -52930 -51428 -51243 -51362 -51404 -50816 -49183 -47408
57259d7408M61p35l25Q40J150P51O58O02k96j603k235k142j693l28K277M697N434
57242c9895N264N909P194P733f086B533J0563J2267J3700J6146J9523K1925K2366
57229A19023K2056K2324K3011K3602K4464K6181K8716L1600L4065L4916L3426
57218D23384L0530K8050K6643K5503K3978K2202K0114J7232J3626R972O336K051
57206F49621k997p930j2072j5586j8747k1390k3331k4703k5607k5966k5735k4883
57194D20674k3275k0968j8358j5711j2971j0226p604m520j58M830Q466J0122J1501
57181C41802J3907J6132J6581J5924J5706J5567J4063J1412R293Q432Q369R030
57169D96218J0631J2582J4490J7683K3563L0827L6511L9599M1506M3154M3841
$$ plain form
57259 -47408 -46947 -47682 -48007 -47167 -46017 -45266 -44608 -44006 -44302 -45905 -48140 -50282 -51975 -52303 -50026 -45329 -39895
57242 -39895 -34631 -28722 -21528 -13795 -6086 2533 13096 25363 39063 55209 74732 96657 119023
57229 119023 141079 163403 186414 210016 234480 260661 289377 320977 355042 389958 423384
57218 423384 453914 481964 508607 534110 558088 580290 600404 617636 631262 641234 647570 649621
57206 649621 646624 638694 626622 611036 592289 570899 547568 522865 497258 471292 445557 420674
57194 420674 397399 376431 358073 342362 329391 319165 311561 307041 306883 311713 320179 330301 341802
57181 341802 355709 371841 388422 404346 420052 435619 449682 461094 470387 478819 487188 496218
57169 496218 506849 519431 533921 551604 575167 605994 642505 682104 723610 766764 810605
57158H10605M3154M2083M1765M2512M4100M5679M5734M3540M0311L7578L5203
57147A272264L2623L0873L1227L2674L3326L3628L5572L9079M2020M3693M5572
57136A672551M8495N1723N4926N8501O1641O2582O1234N9211N7023N3589M8816
57125B290292M4133M0062L5653L0751K6604K3783K1689K0344K0420K1407K1954
57114B597092K2025K2331K1900J9083J4863J2051J1000R286N891K389m49l754
57102B733708p497r742r915r539q761n511O38P177J2595J8435K5823L2830L6914
57089B817155L7578L5450L1269K6633K3020J9292J2901L959n033j3663k4131l6962
57077B927468n0373o4448q1309j00400j18453j35370j55009j78808k04170k31212
$$ plain form
57158 810605 853759 895842 937607 980119 1024219 1069898 1115632 1159172 1199483 1237061 1272264
57147 1272264 1304887 1335760 1366987 1399661 1432987 1466615 1502187 1541266 1583286 1626979 1672551
57136 1672551 1721046 1772769 1827695 1886196 1947837 2010419 2071653 2130864 2187887 2241476 2290292
57125 2290292 2334425 2374487 2410140 2440891 2467495 2491278 2512967 2533311 2553731 2575138 2597092
57114 2597092 2619117 2641448 2663348 2682431 2697294 2709345 2720345 2729631 2735522 2737911 2737462 2733708
57102 2733708 2726211 2716469 2706554 2697015 2688254 2682743 2683381 2690558 2703153 2721588 2747411 2780241 2817155
57089 2817155 2854733 2890183 2921452 2948085 2971105 2990397 3003298 3007257 3002224 2988561 2964430 2927468
57077 2927468 2877095 2812647 2731338 2630938 2512485 2377115 2222106 2043298 1839128 1607916
57067A607916k65198l09311l60344B58452b14423n36156o01981o68925p40140
57058b761625q18812r04761r98794j105346j226952j361204j506928j668166j848432
57049a4201020k046862k264160k506330k778253l080145l415142l793668m225475
57041c8311055m714957n270305n909560o651344p507073q486791r600649j0845543
57033i7297277j2201334j3649852j5184251j6783833j8386896j9901205k1240015
57026b14644663k2358670k3293855k4170958k5085126k5862043k5926361k4514193
57019c85855869k1130574j5858491r275013k135337M869770J1195598J6472455
57012d01717461K0531048K3369926K5070440K5752109K5595549K4848588K3762190
$$ plain form
57067 1607916 1342718 1033407 673063 258452 -214423 -750579 -1352560 -2021485 -2761625
57058 -2761625 -3580437 -4485198 -5483992 -6589338 -7816290 -9177494 -10684422 -12352588 -14201020
57049 -14201020 -16247882 -18512042 -21018372 -23796625 -26876770 -30291912 -34085580 -38311055
57041 -38311055 -43026012 -48296317 -54205877 -60857221 -68364294 -76851085 -86451734 -97297277
57033 -97297277 -109498611 -123148463 -138332714 -155116547 -173503443 -193404648 -214644663
57026 -214644663 -237003333 -260297188 -284468146 -309553272 -335415315 -361341676 -385855869
57019 -385855869 -406986443 -422844934 -432119947 -434255284 -429385514 -418189916 -401717461
57012 -401717461 -381186413 -357816487 -332746047 -306993938 -281398389 -256549801 -232787611
57005b32787611K2515928K1203539J9863040J8501733J7111200J5688344J4250391
56998a03653436J2826972J1445050J0128102Q900711P782585O780631N893112
56991c9896273N117160M446817L869413L371222K943915K580934K272043K006841
56983a3287928J779792J586640J419613J271305J140265J027680R31261Q46600
56975c284772P71723P05855O46229e70728c2385D58726M46232M02401L63451L33755
56965B004565L11624K91582K71317K52019K33648K14650J95379J77226J58875
56956D110885J37644J14456R3695P7882O5788N5767M7663M1305L6588L5782M2373
56945D859828N5618O7846O8519N0658J4094l5022q7111j33479j69685j95270k11249
$$ plain form
57005 -232787611 -210271683 -189068144 -169205104 -150703371 -133592171 -117903827 -103653436
56998 -103653436 -90826464 -79381414 -69253312 -60352601 -52570016 -45789385 -39896273
56991 -39896273 -34779113 -30332296 -26462883 -23091661 -20147746 -17566812 -15294769 -13287928
56983 -13287928 -11508136 -9921496 -8501883 -7230578 -6090313 -5062633 -4131372 -3284772
56975 -3284772 -2513049 -1807194 -1160965 -570728 -32385 458726 904958 1307359 1670810 2004565
56965 2004565 2316189 2607771 2879088 3131107 3364755 3579405 3774784 3952010 4110885
56956 4110885 4248529 4362985 4456680 4534562 4600350 4656117 4703780 4745085 4781673 4817455 4859828
56945 4859828 4915446 4983292 5051811 5102469 5116563 5081541 4994430 4860951 4691266 4495996 4284747
56934D284747k19153k21961k23823k27633k33202k37956k39044k35106k26819
56925B220050k15831k03137j88977j74231j60656j49110j38734j28673j19367
56916G41334j11143j02866r3334q3106p3473o4544n5760m7416m0116l3381I808
56904i727j3749q653l138K636P485J1289A353J9612K3082K3976K1837J7265J1361
56891A18486N458N21l417o652q789r045p499n282l559k746k527k029l82K358N113
56876H0009P120Q735J0512J2363J4324J7048K0295K1927J9894J4671Q310J745
56864B36953n162j1540j5604j7035j7369j7595j7062j5310j3347j2290j1834j0966
56852G1839r336p406n943n753o886p791o425k808O15J851J587J740K845M042M828
$$ plain form
56934 4284747 4065594 3843633 3619810 3392177 3158975 2921019 2681975 2446869 2220050
56925 2220050 2004219 1801082 1612105 1437874 1277218 1128108 989374 860701 741334
56916 741334 630191 527325 433991 350885 277412 212868 157108 109692 69576 36195 9808
56904 -9727 -23476 -32129 -35267 -32631 -25146 -13857 1353 20965 44047 68023 89860 107125 118486
56891 118486 123944 124465 121048 114396 105607 96562 89063 83781 80222 77476 74949 72920 72538 74896 80009
56876 80009 87129 95864 106376 118739 133063 150111 170406 192333 212227 226898 235208 236953
56864 236953 231791 220251 204647 187612 170243 152648 135586 120276 106929 94639 82805 71839
56852 71839 62503 55097 49154 43401 36515 28724 22299 19491 20106 21957 23544 25284 28129 32171 36999
56837C6999N595O666P981R510J1073J1902J1286R683Q379Q072Q513R433J0818
56824A55910J2087J2045J0332Q139O714N664L731R88p37M4K707N288O474O418
56810B35804O099O530Q275J1089J4120J6957K0285K4893L0229L4723L7500L8842
56798D85346L8771L6299L0638K2388J2911L235n710j2547j6251j7243j6735j5152
56786E45950j2163q133m294j049K937R096J6867K4082K9393L3584L8201M3388
56774G17859M7677M9701M9292M6559M0658L0446J6245J90j5129k7740l6280m0311
56762H79167m0935m0037l8279l4751k9117k2930j7942j4032r915m991P00P422
56750F34360J5084K2183K7198L0709L4168L6619L4644K6330J3589j20j2756k3308
$$ plain form
56837 36999 42594 49260 57241 66751 77824 89726 101012 110695 119074 127146 135659 145092 155910
56824 155910 167997 180042 190374 198513 205227 210891 214622 215610 214873 214917 217624 222912 229386 235804
56810 235804 241903 248433 256708 267797 281917 298874 319159 344052 374281 409004 446504 485346
56798 485346 524117 560416 591054 613442 626353 629588 623878 611331 595080 577837 561102 545950
56786 545950 533787 525654 521360 520311 523248 532344 549211 573293 602686 636270 674471 717859
56774 717859 765536 815237 864529 911088 951746 982192 998437 998627 983498 955758 919478 879167
56762 879167 838232 798195 759916 725165 696048 673118 655176 641144 631229 626238 626938 634360
56750 634360 649444 671627 698825 729534 763702 800321 834965 861295 874884 874764 862008 838700
56738H38700l0360l2925l2101l0242k8609k6922k4809k2398j9557j5792j1201
56727E63784o652k760O13L677O311Q644J1306J4453J6854J6555J2498N294l378
56714F47199j1839j8930k4009k6842k7607k6825k5142k3118k1155j9361j7428
56703D04943j4953j2251j0512j0605j1724j1959j0389q020o371n791n606n282
56691B91480m730l887k812j998j796j639o81Q58J867J980K045K553K517P71k216
56676B84312m690n545n171m486l915l337k551j602r99j450k911m137l895k576
56662B37047j888k693m008m461l846k740j432m7Q23O55j75q98j463k280l191l544
56646B05859l226k605j637j72Q83J32k222m130m145l058k353k193j836j008K46
$$ plain form
56738 838700 808340 775415 743314 713072 684463 657541 632732 610334 590777 574985 563784
56727 563784 557132 554372 554985 558662 564973 573617 584923 599376 616230 632785 645283 650577 647199
56714 647199 635360 616430 592421 565579 537972 511147 486005 462887 441732 422371 404943
56703 404943 389990 377739 367227 356622 344898 332939 322550 314530 308159 302368 296762 291480
56691 291480 286750 282863 280051 278053 276257 274618 273937 274795 276662 278642 280687 283240 285757 286528 284312
56676 284312 279622 274077 268906 264420 260505 257168 254617 253015 252016 250566 247655 243518 239623 237047
56662 237047 235159 232466 228458 223997 220151 217411 215979 215932 216755 217410 217235 216337 214874 212594 209403 205859
56646 205859 202633 200028 198391 198219 199102 199234 197012 192882 188737 185679 183326 181133 179297 178289 178535
56631A78535K188M600O017N137K681P10L32J217K819M601N372M145J807M60P46
56616B21367J255Q81K36K15O03R56J469K040J751L41q88q96n50j148k168k091
56600B23373q12L81R14J343J756J422K84o08n39J07R72K328M000M814M028K547
56584B46310J796J876J747R11J24L14J351K101J614J75q82o17L76O18n06k140
56568B55168l185l602m098m848n085m004j838J55R43P93P30Q86J56j941l812l347
56552B23071p15J623J819M36r25j571j577r07K68R35M3k135m170m939m343k862
56536B04051r86R25K691M260N332N317M021K196J016J072K035L056L383K931K409
56521B43709K503K824K450J581J660L192M552M030K209J001R63J133J195J981
$$ plain form
56631 178535 180723 185323 191340 196477 199158 199868 200200 201417 204236 208837 214209 218354 220161 220621 221367
56616 221367 222622 223503 223739 223954 224557 225513 226982 229022 230773 231114 230226 229330 228780 227632 225464 223373
56600 223373 222561 222942 223856 225199 226955 228377 228661 228053 227514 227621 228593 230921 234921 239735 243763 246310
56584 246310 248106 249982 251729 252640 252764 253078 254429 256530 258144 258319 257437 256820 257196 257814 257308 255168
56568 255168 251983 248381 244283 239435 234350 230346 228508 228663 229606 230399 231129 232015 232171 230230 226418 223071
56552 223071 222356 223979 225798 226234 225309 223738 222161 221254 221522 222457 222500 220365 216195 211256 206913 204051
56536 204051 203065 203990 206681 210941 216273 221590 225611 227807 228823 229895 231930 234986 238369 241300 243709
56521 243709 246212 249036 251486 253067 254727 257919 262471 266501 268710 269711 270674 271807 273002 274983
56507B74983L536M425L766K657K624L536M176M190M316M925N419N188M487M068
56493C32296M486N887Q019J0101J0954R810P105M194K046L86j556l689n031n176
56479C79832n001n388n811n059l126j496j417k569l759m288m308m169l969l639
56465C25833l214k921k904k943k624j960j520j715k210k453k437k487k568k310
56451B91567j630q12r3L56L38n1k87j72m06j576k917l033j665Q2J217J549J107
56434B83574O4o48O1J836K977K635J817J688K020K066J996K435L151L239K264
56419C11175O06r81j618o75J443L299L832L378K795K231J432P63Q98J775K707
56404C33060L484M513N855O807O731N840N016N054O111P616Q680Q674P492N308
$$ plain form
56507 274983 278519 282944 286710 289367 291991 295527 299703 303893 308209 313134 318553 323741 328228 332296
56493 332296 336782 342669 350688 360789 371743 381553 388658 392852 394898 395284 393728 390039 385008 379832
56479 379832 374831 369443 363632 358573 355447 353951 352534 349965 346206 341918 337610 333441 329472 325833
56465 325833 322619 319698 316794 313851 311227 309267 307747 306032 303822 301369 298932 296445 293877 291567
56451 291567 289937 289125 289032 289388 289726 289675 289388 289216 288810 287234 284317 281284 279619 279701 280918 282467 283574
56434 283574 283638 282990 283051 284887 287864 290499 292316 294004 296024 298090 300086 302521 305672 308911 311175
56419 311175 311781 310800 309182 308507 309950 313249 317081 320459 323254 325485 326917 327680 328578 330353 333060
56404 333060 336544 341057 346912 353719 360450 366290 371306 376360 382471 390087 398767 407441 414933 420241
56390D20241K415o66l255m860n283m523k952j540j277k243l673m921n725n659
56376C76079m345k536j873k972m495m806l931l174l295l787l686k639j305q00
56362C32435j358j680l18K185L639K914J226J98r7m04p34o60l84l81n16n24p46
56345C34795j496k165j950j015j26M79J082J774K495L348M182M411L833L041K450
56330C55138J667N85J5L43M83n47j825j664k2J490J611M10j221k000r35J322K573
56313C57423J745O69J679M224N623M751L097K472L257M858O291O448N124L648
56299D11309L196L088K177J112J260K096K082J670K746N028O017N023M338N302
56285D56444O003M507J963M99l5r74j976j643j99P10P11J215L134N559P090P389
$$ plain form
56390 420241 422656 421990 418735 413875 408592 404069 401117 399577 398300 396057 392384 387463 381738 376079
56376 376079 371734 369198 367325 364353 359858 355052 351121 347947 344652 340865 337179 334540 333235 332435
56362 332435 331077 329397 329079 331264 334903 337817 339043 339241 339144 338740 338006 337346 336962 336581 336065 335541 334795
56345 334795 333299 331134 329184 328169 328043 328522 329604 331378 333873 337221 341403 345814 349647 352688 355138
56330 355138 356805 357390 357405 357748 358231 357684 355859 354195 354173 355663 357274 357684 356463 354463 353528 354850 357423
56313 357423 359168 359837 361516 365740 371363 376114 379211 381683 384940 389798 396089 402537 407661 411309
56299 411309 414505 417593 419770 420882 422142 424238 426320 427990 430736 435764 441781 446804 451142 456444
56285 456444 462447 466954 468917 469416 469381 468407 466431 464788 464589 465299 466010 467225 470359 475918 483008 490397
56269D90397P070O771O792P232Q101R182R906R626Q435P330P156P648Q243R319
56255F03208J1558J4226J5490J4620J2799J1514J1212J1775J3064J4484J5091
56244G49041J4673J3908J3265J2731J2656J3503J4412J3709J1529J0312J1486
56233H91225J3143J2521R901Q203R037J0888J1525J0903J0869J2650J5554J8290
56221A034709K0789K3960K7896L1400L3653L5346L7448L9929M2664M6417N1395
56210A425606N5868N8237N9929O3967P0825P8078Q4309R0889R9195J08418J17434
56199B312755J26840J37642J49278J60405J70719J80782J90719J99953K07619
56190C836712K12797K15087K15227K14075K10724K02886J89456J71356J49655
$$ plain form
56269 490397 497467 504238 511030 518262 526363 535545 545451 555077 563512 570842 577998 585646 593889 603208
56255 603208 614766 628992 644482 659102 671901 683415 694627 706402 719466 733950 749041
56244 749041 763714 777622 790887 803618 816274 829777 844189 857898 869427 879739 891225
56233 891225 904368 916889 926790 934993 944030 954918 966443 977346 988215 1000865 1016419 1034709
56221 1034709 1055498 1079458 1107354 1138754 1172407 1207753 1245201 1285130 1327794 1374211 1425606
56210 1425606 1481474 1539711 1599640 1663607 1734432 1812510 1896819 1987708 2086903 2195321 2312755
56199 2312755 2439595 2577237 2726515 2886920 3057639 3238421 3429140 3629093 3836712
56190 3836712 4049509 4264596 4479823 4693898 4904622 5107508 5296964 5468320 5617975
56181E617975J24463R6179O6145L5434M637k4691n0207p1255q9344j05312j17978
56170E486046j26534j32249j36484j39070j40061j41029j42835j44045j43634
56161D240105j43369j45185j47782j48546j47669j47493j48267j47476j43534
56152B920784j37653j31528j25174j17935j10250j03361r7841r2998q7552q0943
56142A835549p4002o7955o2782n7523n2249m8362m6222m4028m0199l5547l1698
56131A274982k8496k4710k0583j7797j7115j7390j6963j4978j1526p409l769j305
56119A092941Q6P59J026J519K997N310P440Q868R872J0333R729Q700Q966J0951
56105A179497J3172J4787J6944K0449K3947K5894K6691K7420K7830K7348K6606
$$ plain form
56181 5617975 5742438 5838617 5904762 5940196 5944833 5920142 5869935 5798680 5709336 5604024 5486046
56170 5486046 5359512 5227263 5090779 4951709 4811648 4670619 4527784 4383739 4240105
56161 4240105 4096736 3951551 3803769 3655223 3507554 3360061 3211794 3064318 2920784
56152 2920784 2783131 2651603 2526429 2408494 2298244 2194883 2097042 2004044 1916492 1835549
56142 1835549 1761547 1693592 1630810 1573287 1521038 1472676 1426454 1382426 1342227 1306680 1274982
56131 1274982 1246486 1221776 1201193 1183396 1166281 1148891 1131928 1116950 1105424 1098015 1094246 1092941
56119 1092941 1093027 1093786 1094812 1096331 1099328 1104638 1112078 1120946 1130818 1141151 1150880 1159580 1168546 1179497
56105 1179497 1192669 1207456 1224400 1244849 1268796 1294690 1321381 1348801 1376631 1403979 1430585
56094A430585K6338K5930K4774K3904K4551K6105K7214K7976K9437L1771L4501
56083A733086L7773M1981M6925N2576N9785O8962P9062Q8982R8937J09382J19819
56072B537270J29672J38706J45313J46371J40657J30927J20913J11713J02837
56063C704379R4783Q8007Q0544O9240N2892L2647J0406j1401k9827m3387n3386
56052C994897o1866o9482p6893q6329r9262j13598j25413j32702j35734j34931
56042B958687j30482j23270j14380j04343r3939q4317p5194o4788n2928m2160
56032B072886l4301k8144k2338j7711j4684j1235o274k218j295j822j374q81k074
56019A928535l417k656j118j217j605P82N349Q913J0805J2649J4225J4009J3194
$$ plain form
56094 1430585 1456923 1482853 1507627 1531531 1556082 1582187 1609401 1637377 1666814 1698585 1733086
56083 1733086 1770859 1812840 1859765 1912341 1972126 2041088 2120150 2209132 2308069 2417451 2537270
56072 2537270 2666942 2805648 2950961 3097332 3237989 3368916 3489829 3601542 3704379
56063 3704379 3799162 3887169 3967713 4036953 4089845 4122492 4132898 4121497 4091670 4048283 3994897
56052 3994897 3933031 3863549 3786656 3700327 3601065 3487467 3362054 3229352 3093618 2958687
56042 2958687 2828205 2704935 2590555 2486212 2392273 2307956 2232762 2167974 2115046 2072886
56032 2072886 2038585 2010441 1988103 1970392 1955708 1944473 1938199 1935981 1934686 1932864 1931490 1930609 1928535
56019 1928535 1925118 1922462 1921344 1920127 1918522 1919304 1924653 1933566 1944371 1957020 1971245 1985254 1998448
56006A998448J4794J9044K3284K5911K7100K6545K4109K1892K2136K3979K5428
55995B252670K6988K9842L2366L2554L2261L4576L8571M1091M2232M4310M6925
55984B654386M8102M9023N2394N7060N9429N9452O0186O2213O3639O4748O7501
55973C298133P1128P3391P5475Q0380Q7456R3591R8738J04786J10447J13291J15554
55962D322370J21559J30441J37864J43841J52047J62322J71157J78966J89506
55953E710073K02412K13728K23570K35801K50357K63606K76065K91729L09862
55944G977203L25785L39951L57863L80819M05326M31687M63898N00557N35543
55935A1718632N68607O05628O47233O87098P23131P60548Q02165Q45263Q89399
$$ plain form
56006 1998448 2013242 2032286 2055570 2081481 2108581 2135126 2159235 2181127 2203263 2227242 2252670
55995 2252670 2279658 2309500 2341866 2374420 2406681 2441257 2479828 2520919 2563151 2607461 2654386
55984 2654386 2702488 2751511 2803905 2860965 2920394 2979846 3040032 3102245 3165884 3230632 3298133
55973 3298133 3369261 3442652 3518127 3598507 3685963 3779554 3878292 3983078 4093525 4206816 4322370
55962 4322370 4443929 4574370 4712234 4856075 5008122 5170444 5341601 5520567 5710073
55953 5710073 5912485 6126213 6349783 6585584 6835941 7099547 7375612 7667341 7977203
55944 7977203 8302988 8642939 9000802 9381621 9786947 10218634 10682532 11183089 11718632
55935 11718632 12287239 12892867 13540100 14227198 14950329 15710877 16513042 17358305 18247704
55926A8247704R37606R88685J038581J090167J150965J220562J291856J364978
55918B7331104J447536J540640J638403J741931J859429J991737K133386K288894
55910D1973060K471373K684276K922765L194058L516345L896560M331720M833369
55902F9823526N424302O107135O863843P692076Q614487R650864J0817600J2159919
55894A37153752J3743507J5607372J7770287K0282452K3197280K6471032K9953424
55887B84179106L3432856L6441378L7840407L5837066K8942769J7286953K993177
55880D76953712j0886822k1954349k9277284l3130940l4318716l3695532l1974200
55873B81715869k9662068k7075666k4415265k1819817j9367793j7084173j4982773
$$ plain form
55926 18247704 19185310 20173995 21212576 22302743 23453708 24674270 25966126 27331104
55918 27331104 28778640 30319280 31957683 33699614 35559043 37550780 39684166 41973060
55910 41973060 44444433 47128709 50051474 53245532 56761877 60658437 64990157 69823526
55902 69823526 75247828 81354963 88218806 95910882 104525369 114176233 124993833 137153752
55894 137153752 150897259 166504631 184274918 204557370 227754650 254225682 284179106
55887 284179106 317611962 354053340 391893747 427730813 456673582 473960535 476953712
55880 476953712 466066890 444112541 414835257 381704317 347385601 313690069 281715869
55873 281715869 252053801 224978135 200562870 178743053 159375260 142291087 127308314
55866A27308314j3088948j1417068r955003q684369p595008o670250n879891n199596
55858E8818181m620933m134079l717086l350336l027002k742331k486809k256509
55850C2483096k056497j886794j736313j596205j467765j352222j244351j141732
55842B0001217j049500r70246q98786q31900p73851p27204o86851o47787o10844
55833A2804248n76684n42078n06225m73295m45234m19061l94048l73950l59218
55824H714455l44822l28773l15063l05095k94109k79595k65548k54606k43526
55815F083318k30361k18705k10416k01135j87883j74671j65619j58383j49507
55806D386638j40883j35557j31599j25262j16753j08632j01850r7090r6594j00833
$$ plain form
55866 127308314 114219366 102802298 92847295 84162926 76567918 69897668 64017777 58818181
55858 58818181 54197248 50063169 46346083 42995747 39968745 37226414 34739605 32483096
55850 32483096 30426599 28539805 26803492 25207287 23739522 22387300 21142949 20001217
55842 20001217 18951717 17981471 17082685 16250785 15476934 14749730 14062879 13415092 12804248
55833 12804248 12227564 11685486 11179261 10705966 10260732 9841671 9447623 9073673 8714455
55824 8714455 8369633 8040860 7725797 7420702 7126593 6846998 6581450 6326844 6083318
55815 6083318 5852957 5634252 5423836 5222701 5034818 4860147 4694528 4536145 4386638
55806 4386638 4245755 4110198 3978599 3853337 3736584 3627952 3526102 3429012 3332418 3231585
55796C231585j06356j09931j11975j13379j12545j08372j02780r7474r1251q3183
55786B194339p5200o9016o3464n7330n1904m8285m5001m0536l5767l2018k9136
55775A646682k6943k5834k4803k1896j7706j5170j4900j4320j2412j1360j2062
55764A449276j2336j1369j1773j4994j8487j9885k0350k1477k2342k2102k2233
55753A251928k3736k4938k4340k2861k1571k0125j8987j9717k1489k1047j7898
55742A015219j5563j5566j4584j0337n910m737n144l884j876k052l973m802m077
55729I22714l759m630n771o607p056o714n862n840o702o422m189k288k741m505
55715H49628o089q293j1928j5255j6464j6387j6129j4451j0551p048o688p928
$$ plain form
55796 3231585 3125229 3015298 2903323 2789944 2677399 2569027 2466247 2368773 2277522 2194339
55786 2194339 2119139 2050123 1986659 1929329 1877425 1829140 1784139 1743603 1707836 1675818 1646682
55775 1646682 1619739 1593905 1569102 1547206 1529500 1514330 1499430 1485110 1472698 1461338 1449276
55764 1449276 1436940 1425571 1413798 1398804 1380317 1360432 1340082 1318605 1296263 1274161 1251928
55753 1251928 1228192 1203254 1178914 1156053 1134482 1114357 1095370 1075653 1054164 1033117 1015219
55742 1015219 999656 984090 969506 959169 953259 948522 943378 939494 937618 935566 931593 926791 922714
55729 922714 918955 914325 908554 901947 894891 888177 882315 876475 869773 863351 859162 856874 854133 849628
55715 849628 843539 835246 823318 808063 791599 775212 759083 744632 734081 727033 720345 712417
55703G12417p413n401n093p567j0800j3206j5026j6344j6627j6173j5840j5392
55691E67535j3958j1751r613p547n454m496n780q190r379q566o919n735n583o527
55677D58037p797p916o385m530l704l608l350k850k112o33J195J525n95l696n962
55662D07619p418q671r202q567p777p705p432n942m121l374l448l224k452j327
55648C26959L50K207L084L124M148O469P494N477K470J211J171M66m06R8J003
55633C65325Q4k206l444l271l520m476m203j797J361L916N827P097P519P945R692
55618C85849J2212J3237J1607Q389M981J879m73j397j243j586l486o296q444q648
55604D06581o582l248n67K11l06o99m34K13J168K440L525L958L999L945L406K235
$$ plain form
55703 712417 705004 699603 694510 686943 676143 662937 647911 631567 614940 598767 582927 567535
55691 567535 553577 541826 532213 524666 519212 514716 508936 500746 491367 482801 475882 470147 464564 458037
55677 458037 450240 442324 435939 431409 427705 424097 420747 417897 415785 415152 416347 417872 417277 413581 407619
55662 407619 400201 391530 382328 373761 365984 358279 350847 344905 340784 337410 333962 330738 328286 326959
55648 326959 327309 329516 332600 335724 339872 346341 353835 359312 361782 362993 364164 364630 364224 364322 365325
55633 365325 365409 363203 359759 356488 352968 348492 344289 342492 343853 347769 353596 360693 368212 376157 385849
55618 385849 398061 411298 422905 431294 436275 438154 437681 436284 435041 433455 429969 423673 415229 406581
55604 406581 399999 396751 396184 396395 396089 395390 394956 395169 396337 398777 402302 406260 410259 414204 417610 419845
55588D19845J375J654K302J787l54l262n707o655n879m659m796o159o672n594
55574C77226m978o520q825r699r403r520r975r635q834q810r270q908p846p346
55560B57657p439o992n859m969m523m035l965n246p264q081o853m532k323p92
55546A84784k76o64r83m95R2k52j189j743j918k024j407L10J613Q56q99j096O62
55529A75371K328K561J944J209L78j57L36J572K456K634K457J844P81L33J256
55514A97303K269J893J397L300P246J0155J0692J0766J2049J3637J3904J2470
55502B97081R519N349J327q33j579l316o855j0180j1591j1958j2673j3364j3070
55489B27857j2074j1094j0023q754p999q000p583n857l816k919k847j985K47K648
$$ plain form
55588 419845 421220 422874 425176 426963 426609 423347 417640 410985 405106 400447 395651 389492 382820 377226
55574 377226 372248 365728 356903 347204 337801 328281 318306 308671 299837 291027 281757 272849 265003 257657
55560 257657 250218 243226 237367 232398 227875 223840 219875 214629 207365 199284 192431 187899 185576 184784
55546 184784 184508 183844 182861 182366 182458 182206 181017 179274 177356 175332 173925 174235 175848 176704 175805 174709 175371
55529 175371 177699 180260 182204 183413 183791 183634 183970 185542 187998 190632 193089 194933 195714 196047 197303
55514 197303 199572 201465 202862 206162 213408 223563 234255 245021 257070 270707 284611 297081
55502 297081 306600 311949 313276 312443 310864 307548 300693 290513 278922 266964 254291 240927 227857
55489 227857 215783 204689 194666 185912 177913 169913 162330 156473 152657 149738 146891 144906 145153 147801
55475A47801L616K632N74j068j419p97J80J492L100L978L144J352L75O84J216
55460A66860J383J709K476L385M598O355P328N491J179k632l821l275k830l061
55446A85145l956n764p902q621p212n202m176l794l252l137m176n414n410m398
55432A12731l589l108k268j243q72j194j701k526l897m739l662j292oq70k303
55417G9461k364j238n30q78j315q40K61R46Q07M07L24M29L49J47%l36r96j226
55399G3408j54J544J862j24k741l341j184J754K799J130j669l495l833l642l373
55384E8941k338l46J295J592J546K469L488K661J63j725j826j192p84j40R01J192
55368F5897J43r77p46O25K150L386L939L106J170k12k40l30j814l553l566k040
$$ plain form
55475 147801 151417 154049 154623 153555 152136 151339 151519 153011 156111 160089 163233 164585 164960 165644 166860
55460 166860 168243 169952 172428 175813 180411 186766 194094 199585 200764 198132 194311 191036 188206 185145
55446 185145 181189 175425 167523 158902 151690 146488 142312 138518 135266 132129 127953 122539 117129 112731
55432 112731 109142 106034 103766 102523 101651 100457 98756 96230 92333 87594 83932 82640 82634 81764 79461
55417 79461 77097 75859 75329 74451 73136 72296 72557 73503 74310 74717 75041 75470 75819 75966 75966 75630 74634 73408
55399 73408 73254 74798 76660 76536 73795 70454 69270 71024 73823 74953 73284 69789 65956 62314 58941
55384 58941 56603 56257 57552 59144 60690 63159 66647 69308 69471 67746 65920 64728 63944 63804 64705 65897
55368 65897 66040 65063 64317 64942 67092 70478 74417 77523 78693 78481 78241 77911 76097 72544 68978 66938
55352F6938q33n19lJ129J911J900J943K518K767J980Q59L07r3j275k817l135j617
55335G1960L55J074N98L96J139J797J249p5r77j288j846k916l767l938l788l464
55319E6509k351j60K191L396L056J756L43m21j97N01N74m53j800k298j519O1J531
55302F0719J942R95l67o76K62R38kk088l698l926l103j939q34P9P03Q56L57m92
55284D9726o94M20J803J353j395m115m176j772M48N71p02j390m57J521L159L297
55268D7597J723n50j896j432J51J331J321O31k9p91k103l485l748k540r07J08
55252C5381N95J117J615J726J548J320Q39J7m91lJ233K530L604M112L142N27j929
55235E6883k152n63M53k35j416j812j689j702j592r07N7P91J285J624J554Q27
$$ plain form
55352 66938 66105 65586 65583 66712 68623 70523 72466 74984 77751 79731 80590 80897 80804 79529 76712 73577 71960
55335 71960 72315 73389 73987 74383 75522 77319 78568 78493 77516 76228 74382 71466 67699 63761 59973 56509
55319 56509 54158 53998 56189 59585 62641 64397 64740 64319 64122 64623 65197 64744 62944 60646 59127 59188 60719
55302 60719 62661 63656 63289 62613 62875 63813 63811 61723 58025 54099 50996 49057 48223 48302 49005 49861 50218 49726
55284 49726 49032 49452 51255 52608 51213 47098 42922 41150 41598 42169 41467 40077 39620 41141 44300 47597
55268 47597 49320 48770 46874 45442 45593 46924 48245 48876 48847 48056 45953 42468 38720 36180 35273 35381
55252 35381 35976 37093 38708 40434 41982 43302 44141 44158 43667 43664 44897 47427 51031 55143 58285 58812 56883
55235 56883 54731 54168 54621 54386 52970 51158 49469 47767 46175 45268 45325 46116 47401 49025 50579 51406
55219E1406m87k122l414l216j176J116J569L01m30P28K665L544K703M44k533m784
55203D6314m719k438P9J264J405J302R37K34j81k6j1n60j046j078j359k247k718
55186C5152j871l65P92J822L216M263L927K549J248K70q00j723j898j678k137
55171D2767l508m686m341k101R87K948K495N98m71m2K04r40k120j511K93J186
55155C1758O16K8O03J973L120L270K096J14j239r14M52J347J187N75J73J71N99
55138D5929J294J810K046K559L518L990L084J301q2n82o67q38j412k520l689l939
55122E1802l117k271j928j169N40J804J257KJ57J564K055P61q20j233p34k28J0
55105D8452O4N3L56J212J993J886J203Q61O95k25j694k364j913j564j924j909
$$ plain form
55219 51406 50919 48797 45383 42167 40991 42107 43676 43977 43547 44275 46940 50484 53187 53631 51098 46314
55203 46314 41595 39157 39236 40500 41905 43207 44144 44378 44197 44171 44160 43600 42554 41476 40117 37870 35152
55186 35152 33281 32916 33708 35530 38746 43009 46936 49485 50733 51003 50203 48480 46582 44904 42767
55171 42767 39259 34573 30232 28131 29118 32066 34561 35159 34688 34646 34850 33910 31790 30279 30572 31758
55155 31758 32374 32402 33005 34978 38098 41368 43464 43578 42339 41425 41877 43224 44411 44986 45159 45330 45929
55138 45929 47223 49033 51079 53638 57156 61146 64230 65531 65449 64867 64200 63362 61950 59430 55741 51802
55122 51802 48685 46414 44486 43317 43857 45661 46918 46920 47077 48641 50696 51457 50637 49404 48670 48442 48452
55105 48452 48516 48569 48925 50137 52130 54016 55219 56080 56775 56550 54856 52492 50579 49015 47091 45182
55089D5182o42R27J367P66K72K99K27m15j383k173k394j740k10J555K465J933
55073D6036N80j70M69J690J973Q86m81r73n38L44J456K526K946K619K345K570
55057F4278K520J586O70Q65J520J196J13j4J367K834L080K360J443L82r26j895
55041H1379j752m86J051J746J061k65o51N18J840J582Lj081q38j56J93O17J522
55024H6283K253K007R41j39o50l91N00J472J900J719J263N52n84j777k336k154
55008I0859j631p71O90K226K732J982R17L16J81N03J426K243J530r86l599m466
54992I4152l598k370j675j280p01L6M57K10l70n29j86l50j733l378l724k748j717
54975G0496r76M03K508L884L610K543J589K82j641k802j985l39Q5o34o06P90K197
$$ plain form
55089 45182 44540 45467 46834 47600 47872 48171 48398 47983 46600 44427 42033 40293 40083 41638 44103 46036
55073 46036 46616 46446 46915 48605 50578 51464 50983 50010 49472 49816 51272 53798 56744 59363 61708 64278
55057 64278 66798 68384 69054 69919 71439 72635 72748 72734 74101 76935 80015 82375 83818 84200 83274 81379
55041 81379 79627 79141 80192 81938 82999 82734 82083 82601 84441 86023 86026 84945 84107 83951 84144 84761 86283
55024 86283 88536 90543 91484 91345 90695 90304 90804 92276 94176 95895 97158 97710 97126 95349 93013 90859
55008 90859 89228 88457 89147 91373 94105 96087 97004 97320 97501 98004 99430 101673 103203 102217 98618 94152
54992 94152 90554 88184 86509 85229 84528 84564 85021 85231 84861 84332 84146 83796 82063 78685 74961 72213 70496
54975 70496 69520 69923 72431 76315 79925 82468 84057 84339 82698 79896 77911 77572 77657 77023 76417 77207 79404
54958G9404K778L390M540M937L384R25l77j55K05r3l59m1K29k4J05J621L670M144
54940A08283K286k92j482q27N36J399J469J173R54P21p4j586k957l118k212j424
54924A02849j283j023o7P69L54j003j794j132L51J327J142L01k02p3Q2pO34K807
54906A04032N211N502L444J381R80J180L42j170j835j162K98K037L457L742L164
54891A30603L397N121O723O830O731Q274J0680J1864J1854J2308J3413J3914J3879
54878B55591J4501J5237J4031J0766P738O032L958M5m732q738j1652j3615j4300
54865B74862j3886j3323j2704j1049q577p301q271r805r699p797n308l018j330
54852A62794p31j073j383j202j051j006l45Q53J444J450K634N740Q964J0539J1007
$$ plain form
54958 79404 82182 85572 90112 95049 98433 99358 98981 98826 99031 98938 98579 98538 98767 98743 98848 100469 104139 108283
54940 108283 110569 110277 108795 107968 108504 109903 111372 112545 113499 114220 114146 112560 109603 106485 104273 102849
54924 102849 101566 100543 100476 101245 101599 100596 98802 97670 98021 99348 100490 100791 100589 100516 100598 100591 101225 104032
54906 104032 109243 114745 118189 119570 120550 121730 122072 120902 119067 117905 118203 120240 123697 127439 130603
54891 130603 134000 139121 145844 152674 159405 167679 178359 190223 202077 214385 227798 241712 255591
54878 255591 270092 285329 299360 310126 317864 323896 327854 327899 323167 314429 302777 289162 274862
54865 274862 260976 247653 234949 223900 215323 208022 199751 189946 180247 172450 167142 164124 162794
54852 162794 162063 160990 159607 158405 157354 156348 156003 156856 158300 159750 162384 168124 177088 187627 198634
54837A98634J1437J1350J0327R946J1675J3940J3691J0362O103K539o58m085p433
54824B87828j0200j2285j3599j4079j4009j3549j2327j0263q344p583p712p796
54812A56082p517p060o383n571n074m743l591j606n97j725l240k615j37J611J465
54797A09299Q02J007J779K214K002J168o8r63j026j146k527m463m754k768n38
54782A00018r5j039j683j536j501k143k866k818j974j143j031j468j664j279q40
54767G6938q26p59K06K044L687M041K861R25l70J1J641K880K663J596Q91P80O55
54750I9864K62%L46J585L579N309N304L280P93m28j70R03K535M489N787N856N752
54733A45046O696Q036Q354Q146R268J1745J3339J2938J2329J3506J5749J6880
$$ plain form
54837 198634 210071 221421 231748 241694 253369 267309 281000 291362 297465 300004 299346 295261 287828
54824 287828 277628 265343 251744 237665 223656 210107 197780 187517 179173 171590 163878 156082
54812 156082 148565 141505 135122 129551 124477 119734 116143 114537 113940 112215 108975 106360 106223 107834 109299
54797 109299 110101 111108 112887 115101 117103 118271 118203 117240 116214 115068 112541 108078 103324 100556 100018
54782 100018 99923 98884 97201 95665 94164 92021 89155 86337 84363 83220 82189 80721 79057 77778 76938
54767 76938 76112 75353 75559 77603 81290 85331 88192 89117 88747 88758 90399 93279 95942 97538 98429 99209 99864
54750 99864 100126 100126 100472 102057 105636 110945 116249 119529 120322 119894 119724 120627 123162 127651 133438 139294 145046
54733 145046 151742 159778 168132 176278 185546 197291 210630 223568 235897 249403 265152 282032
54721B82032J6316J5220J4095J1773P222J362l594o285p247p799q495r055r425
54708B96120r994j0626j0488r217p506n885l974j712l25o94j501o09J973M081
54694B39643M307L350K408J860K055L825P202J0652J2638J3328J3985J5215J6597
54681C47065J7675J8521J9404K0467K1570K1993K0468J6063R309K108l814q306
54669E02523j2509j7076k1059k2848k2103k0207j8869j8714j9184j9285j8303
54658B92366j6459j4913j4472j4311j2905j0330q264p448o624m843l253l204l854
54645A71486l388j823p82q77j047m67K77J32j253l174m101k736K11K124J417l84
54629A55615q10K56J166J393J647J726P37o10n21Q29J162k73j307j28K130L288
$$ plain form
54721 282032 298348 313568 327663 339436 346658 348020 344426 338141 330894 323095 314600 305545 296120
54708 296120 286126 275500 265012 255795 248289 242404 238430 236718 236393 235699 234198 233589 235562 239643
54694 239643 243950 247300 249708 251568 253623 257448 264650 275302 287940 301268 315253 330468 347065
54681 347065 364740 383261 402665 423132 444702 466695 487163 503226 512535 514643 510829 502523
54669 502523 490014 472938 451879 429031 406928 386721 367852 349138 329954 310669 292366
54658 292366 275907 260994 246522 232211 219306 208976 200712 193264 186640 181797 178544 175340 171486
54645 171486 168098 166275 165493 164616 163569 163102 163379 163511 162258 159084 154983 152247 152458 154582 155999 155615
54629 155615 154805 155061 156227 157620 159267 160993 161730 161120 160599 161428 162590 162317 161010 160882 163012 166300
54613A66300K893J878R07L30N57J288J527J128J203K179K900K556K055K353K931
54598A92985L181L720M882N367M239K968L498N235O010N312M374L665K577J510
54584B49523J850L559M916N191N742P584R678J0696J1067J2052J3672J4926J5503
54571C65959J6196J7811K0305K2756K3867K2901K0435J7649J4525R730K867m096
54559E50905q834j1505j4272j8209k2017k3898k3554k1914j9994j8546j7895j7421
54547C32846j5895j3102j0437r164q791q139p265p032p210o629n249m485m984
54534B24464n562n058l971l387l450l880m960o692p819p134n384m453m863n376
54520A52475m954l866k805k092j944k408k811k289j092n07j076j853j863j305
$$ plain form
54613 166300 169193 171071 171978 172308 172865 174153 175680 176808 178011 180190 183090 185646 187701 190054 192985
54598 192985 196166 199886 204768 210135 214374 217342 220840 226075 232085 237397 241771 245436 248013 249523
54584 249523 251373 254932 259848 265039 270781 278365 288043 298739 309806 321858 335530 350456 365959
54571 365959 382155 399966 420271 443027 466894 489795 510230 527879 542404 552134 555001 550905
54559 550905 542071 530566 516294 498085 476068 452170 428616 406702 386708 368162 350267 332846
54547 332846 316951 303849 293412 284248 275457 267318 260053 253021 245811 239182 233933 229448 224464
54534 224464 218902 213844 209873 206486 203036 199156 194196 187504 179685 172551 167167 162714 157851 152475
54520 152475 147521 143655 140850 138758 136814 134406 131595 129306 128214 127707 126631 124778 122915 121610
54506A21610p97k19Q46J976K058O17j458k679k434j627j659k651l081j656R76
54491A09822K970L366K585J286k31j377j321J4J721K980L656L700K923J711J085
54476A34890J480K097K056J606J731K910M753O568P828Q288P958O927N371L994
54462A98457M083O336R563J1476J1120R865R505J0025R811P768M534J540o79k873
54448B90531n728q610j0231j0573j1142j2811j4260j3589j0866q034o577o367
54436A71743o558o433n459l640j946j356j528j383r53j316k623l531k964j338
54422A30715L26J471J953J857J659J529O26j651l842l618j134P77M69l80L33J964
54406A33054K477J618R20J295K312L368M143M158L192J965J346J146N55m36r79
$$ plain form
54506 121610 120813 120594 121440 123416 125474 126091 124633 121954 119520 117893 116234 113583 110502 108846 109822
54491 109822 112792 116158 118743 120029 119798 118421 117100 117114 118835 121815 125471 129171 132094 133805 134890
54476 134890 136370 138467 140523 142129 143860 146770 151523 158091 165919 174207 182165 189092 194463 198457
54462 198457 202540 208876 218439 229915 241035 250900 260405 270430 280241 288009 292543 294083 293404 290531
54448 290531 284803 276193 265962 255389 244247 231436 217176 203587 192721 184687 178110 171743
54436 171743 165185 158752 153293 149653 147707 146351 144823 143440 142487 141171 138548 135017 132053 130715
54422 130715 131041 132512 134465 136322 137981 139510 140136 138485 134643 131025 129891 130668 131137 130757 131090 133054
54406 133054 135531 137149 138069 139364 141676 145044 149187 153345 156537 158502 159848 160994 161549 161113 160134
54391A60134o18K19P97O00l85j411j449n77k55j523l528m607m373l773l520l357
54375A32374k759j595k04O73M16o29j268r21l78n90j326j724j534j082n97l31
54359A18525p50j721k214j601o45k37J03J307K959L720L222K272J472Q99R80K223
54343A30514M000M840M244L311L263M214N462O221N861M382K774K187K548K706
54329A86527K055J188P38M21l27j323j759j143N7N61o89l233n092m722k869j798
54313A68592k620m197m772l990k906k579l060l471k818j000Q58J386M47p35j043
54298A38092o80o66j352k011j838r98l57l19l43K47J294K060K198J981J731J507
54282A40546J418J661K195K792L424M072M215L185J225n30j247r89j45Q48J134
$$ plain form
54391 160134 159516 159735 160532 161132 160747 159336 157887 157310 157055 155532 152004 147397 143024 139251 135731 132374
54375 132374 129615 128020 127816 128489 128905 128276 127008 126087 125709 125119 123793 122069 120535 119453 118856 118525
54359 118525 117775 116054 113840 112239 111594 111357 111460 112767 115726 119446 122668 124940 126412 127311 128291 130514
54343 130514 134514 139354 143598 146909 150172 154386 159848 166069 171930 176312 179086 181273 183821 186527
54329 186527 188582 189770 190508 190929 190602 189279 187520 186377 186434 186995 186306 183073 177981 173259 170390 168592
54313 168592 165972 161775 157003 153013 150107 147528 144468 140997 138179 137179 138037 139423 139870 139135 138092
54298 138092 137412 136746 135394 133383 131545 130547 130190 129871 129528 129775 131069 133129 135327 137308 139039 140546
54282 140546 141964 143625 145820 148612 152036 156108 160323 163508 164733 164203 162956 161967 161822 162670 163804
54267A63804j21k510m481n101m865m372l362j751n10n34j352j815j484o17M42
54252A31371J097M99j346l059l384k671k060j894j769j598j583j567j317j051
54238A09668j045j114j096j163j185o08L26L70p97j648j000qm00j744k244j660
54222I4652j481k296k804j707O55K763L156J519o50r92J026L061K748Q60o1N16
54206A00965P86j45q95j28J540K634K645K066J514J160N80o73j865j245J554M200
54190A14693M232K141J74r54j965k485j388M44P07o39j048N42K085J931J140Q59
54174A20469R4j941l474k567k02J292J564J692J498J9j920k198n03J183J478J095
54158A17579J026J024O63M86J133K122K503K191J802J459O30p59j819j798j243
$$ plain form
54267 163804 163683 161173 156692 151591 146726 142354 138992 137241 136731 136197 134845 133030 131546 130929 131371
54252 131371 132468 132967 131621 128562 125178 122507 120447 118553 116784 115186 113603 112036 110719 109668
54238 109668 108623 107509 106413 105250 104065 103457 103783 104153 103356 101708 100708 100700 100300 98556 96312 94652
54222 94652 93171 90875 88071 86364 87019 89782 92938 94457 93807 92815 93841 96902 99650 100510 100449 100965
54206 100965 101751 101606 100711 100583 102123 104757 107402 109468 110982 112142 112722 112049 110184 108939 110493 114693
54190 114693 118925 121066 121240 120286 118321 115836 114448 114892 115599 114960 113912 114454 116539 118470 119610 120469
54174 120469 120563 118622 115148 112581 112379 113671 115235 116927 118425 118444 116524 114326 113823 115006 116484 117579
54158 117579 118605 119629 120292 120778 121911 124033 126536 128727 130529 131988 132618 131859 130040 128242 126999
54143A26999j333k117k261q85J114K196J925Q88n23k054k861k159o38N5n99j492
54127A16255j594j105p27q09j404k228k431j394J30P75M75L83Q59R63K11p18j391
54110A06250k248l178l147j947q62o73m85M08J001K41r77j044L0Q51O45k40j240
54093I3385j863j648q01l84r24j526j232m88k22k66N9M66K12l60k31N52R17N43
54075H6189M16J205K187K177J008m65j507k210k922l251k213K02K305K396Q88
54060H6405m79j134j874k616j965L03K274K485J820J616J527P37j06n5J99n01
54044H8636j581j617p12p7L04J413K840K824R66r52j385q43o85j295k069k282
54028H3485j487K83K277L478L498K668J466L94J17R53K295L196L350L055K571
$$ plain form
54143 126999 125666 123549 121288 120403 121517 123713 125638 126526 126003 123949 121088 118929 118291 118346 117747 116255
54127 116255 114661 113556 112829 112020 110616 108388 105957 104563 104693 105468 105943 106326 107185 108148 108359 107641 106250
54110 106250 104002 100824 97677 95730 94868 94195 93710 94118 95119 95360 94383 93339 93369 94220 94865 94625 93385
54093 93385 91522 89874 89073 88689 87765 86239 85007 84519 84297 84031 84090 84556 84768 84408 84177 84729 85646 86189
54075 86189 86605 87810 89997 92174 93182 92717 91210 89000 86078 82827 80614 80816 83121 85517 86405
54060 86405 85926 84792 82918 80302 78337 78640 80914 83399 85219 86835 88362 89099 88993 88938 89137 88636
54044 88636 87055 85438 84726 84649 84953 86366 89206 92030 92996 92044 90659 89816 89131 87836 85767 83485
54028 83485 81998 82281 84558 88036 91534 94202 95668 96062 96179 97132 99427 102623 105973 109028 111599
54013A11599K032J596J096P6j153j413l85M35l23j833k234j196R1Q74J228J022
53997A11512J90l26M30J761K319K373L205M401M076K036M29N86J293J221J042
53982A36548J828K880K918K289K519M176O446Q340R310R134Q198P640Q307R644
53968B20177J0244R486Q127P370P566P883P235N626M280M092M424M103L116K351
53954C06080J965J345M70p4n21j776l499m020k912k088l271n576o854o483n523
53939B67263m881m605m604m861n029m706m047l538l429l743m331m514l422j300
53925B10253K95M03j08j70l87j808l487l227p10J817K466J778J184Q43J85l72
53909B08955J44J407J785N69p99m53J454K852K199J86j320j442r38q09r68o25
$$ plain form
54013 111599 113631 115227 116323 116399 115246 113833 113448 113883 113560 111727 109493 108297 108388 109262 110490 111512
53997 111512 111702 111376 111806 113567 115886 118259 121464 125865 129941 131977 132406 132992 134285 135506 136548
53982 136548 138376 141256 144174 146463 148982 153158 159604 167944 177254 186388 194586 202226 210533 220177
53968 220177 230421 239907 248034 255404 262970 270853 278088 283714 287994 292086 296510 300613 303729 306080
53954 306080 308045 309390 309860 309786 309265 307489 303990 299970 297058 294970 291699 286123 279269 272786 267263
53939 267263 262382 257777 253173 248312 243283 238577 234530 230992 227563 223820 219489 214975 211553 210253
53925 210253 210548 210951 210843 210673 210286 208478 204991 201764 201054 202871 205337 207115 208299 209142 209327 208955
53909 208955 209099 210506 212291 212860 212061 211608 213062 215914 218113 218299 216979 215537 214599 213790 212822 212197
53893B12197L63J094P57j83m24N61J855K438K685L661N094N303L525J177Qm8M
53876B40067K96J731L875N128N129N298O426P326O785N488M831M843M645M160
53862C06028L939L691K562Q67J96J416L548N058N514N560N803O330O843O918O328
53847C70601N452N094N571O195O009N004M119L960L894K745K83k331l667l356
53833D09573k182j153p67j084k058l605n505p342q634r124r066r129r815j0889
53819C29220j1479j0814q893o551m869m389m860n757o756p474p181n579l754l298
53805B37566m229m786l894k721k930m305n281n194m622m031l484l520m751o452
53791A77366o982n877m256k909j349O33J877J248p92k814l880l694k128M03K601
$$ plain form
53893 212197 212560 213654 214411 214228 213804 214365 216220 218658 221343 225004 230098 235401 238926 240103 240111 240063 240067
53876 240067 240363 242094 245969 251097 256226 261524 267950 275276 282061 287549 292380 297223 301868 306028
53862 306028 309967 313658 316220 317087 317283 318699 322247 327305 332819 338379 344182 350512 357355 364273 370601
53847 370601 376053 381147 386718 392913 398922 403926 408045 412005 415899 418644 418927 416596 412929 409573
53833 409573 407391 406238 405471 404387 402329 398724 393219 385877 377243 368119 359053 349924 340109 329220
53819 329220 317741 306927 298034 291483 286614 282225 277365 271608 264852 257378 250197 244618 240864 237566
53805 237566 233337 228551 224657 221936 219006 214701 209420 204226 199604 195573 192089 188569 183818 177366
53791 177366 170384 164507 160251 157342 155993 156626 158503 159751 158959 156145 152265 148571 146443 146846 149447
53776A49447L223K298R11J28K95R40J051N7j196j217J44J346J259O21O96J431
53760A61434J867J581P44n58k003k532j298J094L157M006L577K112M42J66K078
53745A75867M661N580M660M001M972O504O849N803M447L638L627M456N829O799
53731B47693O433M763K804J664J798K896M184M925M828L983K624J174L32N50J357
53716B92008J610O69r77k286k565j850q36n57j601l370m465m124l066k530k795
53701B63265k939k121o68K09l21j829l063l144k250j179n14l58o30j204j674j381
53685B40199M2J959K720Q18l350p031p304m132o49K40j120k182j643o28n46j254
53669B16139j837k017j972j597r15o83j551k794k938j709m45l32r96j337j072
$$ plain form
53776 149447 152670 154968 155879 156007 156302 157242 158293 158350 157154 155937 156081 157427 158686 159307 160003 161434
53760 161434 163301 164882 165626 165068 163065 160533 159235 160329 163486 167492 171069 173181 173623 173789 175867
53745 175867 180528 186108 190768 194769 199741 206245 213094 218897 223344 226982 230609 235065 240894 247693
53731 247693 254126 258889 261693 263357 265155 268051 272235 277160 281988 285971 288595 289769 290101 290651 292008
53716 292008 293618 294287 293310 291024 288459 286609 285773 285216 283615 280245 275780 271656 268590 266060 263265
53701 263265 260326 258205 257537 257746 257425 255596 252533 249389 247139 245960 245446 245088 244458 243254 241580 240199
53685 240199 240241 242200 244920 245738 242388 235357 228053 223921 223272 223512 222392 220210 218567 217939 217393 216139
53669 216139 214302 212285 210313 208716 207801 207118 205567 202773 199835 198126 197681 197349 196353 195016 193944
53654A93944p62o17j29J003K190K651K470K498L185L975M079L554L180L375L653
53639B28249L450K959K768K894K768K213J846K278L287L994L718K475J070Q72
53625B64841K844O179Q354P306L675J73j238q59j26L9o28k090l655l907k102N39
53609B79345J826R33q63j804j410m20L39O61P96R20R07N87J96K03N71N45l62j560
53591B81410k020j605j183j431j970j779k46K033L433K626J74j632j139P71J757
53576B79199P55j015j599j22K765N424O270N022K978J524P00r5m93M03K164L095
53560C06975K531J711J964L155M515N795O826O980O005M745M136M078L960L699
53546C67075L546L347K758J915J366J563K607M066N066N302N843P797J0136J0464
$$ plain form
53654 193944 193182 192565 192436 193439 195629 198280 200750 203248 206433 210408 214487 218041 221221 224596 228249
53639 228249 231699 234658 237426 240320 243088 245301 247147 249425 252712 256706 260424 262899 263969 264841
53625 264841 267685 273864 282218 289524 293199 293372 292134 291275 291149 291188 290560 288470 284815 280908 278806 279345
53609 279345 281171 282104 281241 279437 278027 277607 277946 278607 279403 280323 281230 281817 282013 282216 282787 283332 282970 281410
53591 281410 279390 277785 276602 275171 273201 271422 271176 273209 276642 279268 279442 277810 276671 277442 279199
53576 279199 279954 278939 277340 277218 279983 285407 291677 296699 299677 301201 301901 301806 301313 301716 303880 306975
53560 306975 309506 311217 313181 316336 320851 326646 333472 340452 346457 351202 355338 359416 363376 367075
53546 367075 370621 373968 376726 378641 380007 381570 384177 388243 393309 398611 404454 412251 422387 432851
53532D32851Q355O155N524N131L314J185R71K389L176K527J679J342R53N58J122
53517D77232K446K805J432k40o87n6P82J491J679O60j152j787o0K599L834L146
53501D94124J821Q18J61L5R52K632L855L823L049K572K741K998K696J955J675
53486E25907K585M336N837O527O822P155P283O825N978N212M743M750N531O801
53472F06292P489P052O542P382R240J0334R931R373J0210J2277J4316J5738J6804
53459G42980J7481J7288J6330J5620J5982J7229J8707K0190K1730K3120K4100
53448I50757K4856K5714K6474K6685K6642K7348K9236L1548L3275L4204L4648
53437A271387L4756L4640L4769L5632L7085L8492L9281L9030L7495L5067L2832
$$ plain form
53532 432851 441206 447361 452885 458016 461330 462515 463486 465875 469051 471578 473257 474599 475552 476110 477232
53517 477232 479678 482483 483915 483675 482988 482932 483714 485205 486884 487544 486392 484605 484545 487144 490978 494124
53501 494124 495945 496763 496924 496959 497911 500543 504398 508221 511270 513842 516583 519581 522277 524232 525907
53486 525907 528492 532828 538665 545192 552014 559169 566452 573277 579255 584467 589210 593960 599491 606292
53472 606292 613781 620833 627375 634757 643997 654331 664262 673635 683845 696122 710438 726176 742980
53459 742980 760461 777749 794079 809699 825681 842910 861617 881807 903537 926657 950757
53448 950757 975613 1001327 1027801 1054486 1081128 1108476 1137712 1169260 1202535 1236739 1271387
53437 1271387 1306143 1340783 1375552 1411184 1448269 1486761 1526042 1565072 1602567 1637634 1670466
53426A670466L1478L0586K9689K9524L1075L3624L5064L4389L2764L1747L1488
53415B021894L1231L0625K9826K9040K8582K8763K9139K8471K6167K3077K0187
53404B327002J7268J3795J0458Q432P485O131L658O33k593o416j0508j3344j4198
53391B347803j4611j6702k0540k4206k5999k5694k4129k2647k2677k4555k6699
53380B099344k7089k5748k4681k5171k6289k6659k6379k6283k6259k5459k3609
53369A815718k0980j7569j3483r815p908p717q017q077p977p301n082j488J839
53356A702143L863N380P403R425J0448J0895J2166J4684J7540J9934K1924K3805
53344A859610K5665K7683L0114L2823L5276L7133L8511L9728M1157M3182M5892
$$ plain form
53426 1670466 1701944 1732530 1762219 1791743 1822818 1856442 1891506 1925895 1958659 1990406 2021894
53415 2021894 2053125 2083750 2113576 2142616 2171198 2199961 2229100 2257571 2283738 2306815 2327002
53404 2327002 2344270 2358065 2368523 2376955 2384440 2390571 2394229 2394862 2392269 2385853 2375345 2362001 2347803
53391 2347803 2333192 2316490 2295950 2271744 2245745 2220051 2195922 2173275 2150598 2126043 2099344
53380 2099344 2072255 2046507 2021826 1996655 1970366 1943707 1917328 1891045 1864786 1839327 1815718
53369 1815718 1794738 1777169 1763686 1753871 1745963 1738246 1730229 1722152 1714175 1706874 1701792 1700304 1702143
53356 1702143 1706006 1711386 1718789 1728214 1738662 1749557 1761723 1776407 1793947 1813881 1835805 1859610
53344 1859610 1885275 1912958 1943072 1975895 2011171 2048304 2086815 2126543 2167700 2210882 2256774
53333B256774M8900N1758N4353N6572N8068N8923O0209O3042O7028P0295P1211
53322B917133O9827O7630O6199O5953O5965O5143O3576O2250O1351N9757N6753
53311C621537N3257N0351M7394M2922L6966L1045K5903K0683J4585Q176K534k116
53299C953237o430j1265j7129k3858l0588l6492m1479m5783m9237n1748n4077
53288C585151n7081o0337o2582o3470o3789o3877o3133o1312n9119n7222n5686
53277B917543n4658n4386n4256n3085n0881m9046m8285m7628m6152m4328m2710
53266B372128m0671l7611l4346l1972l0220k8238k6152k4473k2710k0177j7696
53255B057862j6891j7900j9253j9947k0165j9914j8493j5854j3240j1683j0762
$$ plain form
53333 2256774 2305674 2357432 2411785 2468357 2526425 2585348 2645557 2708599 2775627 2845922 2917133
53322 2917133 2986960 3054590 3120789 3186742 3252707 3317850 3381426 3443676 3505027 3564784 3621537
53311 3621537 3674794 3725145 3772539 3815461 3852427 3883472 3909375 3930058 3944643 3952819 3955353 3953237
53299 3953237 3946807 3935542 3918413 3894555 3863967 3827475 3785996 3740213 3690976 3639228 3585151
53288 3585151 3528070 3467733 3405151 3341681 3277892 3214015 3150882 3089570 3030451 2973229 2917543
53277 2917543 2862885 2808499 2754243 2701158 2650277 2601231 2552946 2505318 2459166 2414838 2372128
53266 2372128 2331457 2293846 2259500 2227528 2197308 2169070 2142918 2118445 2095735 2075558 2057862
53255 2057862 2040971 2023071 2003818 1983871 1963706 1943792 1925299 1909445 1896205 1884522 1873760
53244A873760r547q120p338p431p402n942k635J608N293P626R044J0506J2415
53231A871837J4461J6271J7815J9347K1192K3447K5643K6968K7232K7260K8024
53220B119497K9486L0743L1037L0269K8807K7216K5928K4776K3141K0849J8359
53209B410108J5791J2463Q140L929J006j049l504o557r362j1640j3940j6395j8570
53196B370420k0532k2773k4944k6108k6587k7996l0866l3677l5079l5649l6389
53185B049820l6731l5576l3457l2100l2117l2481l2105l0802k8816k6620k5143
53174A703872k5070k5697k5550k4261k2999k2752k3121k3128k2423k1220j9749
53163A447902j8257j6980j5733j4022j1910j0157r137q367p548p308q130r257
$$ plain form
53244 1873760 1864213 1856093 1848755 1841324 1833922 1827980 1825345 1826953 1832246 1839872 1848916 1859422 1871837
53231 1871837 1886298 1902569 1920384 1939731 1960923 1984370 2010013 2036981 2064213 2091473 2119497
53220 2119497 2148983 2179726 2210763 2241032 2269839 2297055 2322983 2347759 2370900 2391749 2410108
53209 2410108 2425899 2438362 2446502 2450431 2451437 2450388 2446884 2440327 2430965 2419325 2405385 2388990 2370420
53196 2370420 2349888 2327115 2302171 2276063 2249476 2221480 2190614 2156937 2121858 2086209 2049820
53185 2049820 2013089 1977513 1944056 1911956 1879839 1847358 1815253 1784451 1755635 1729015 1703872
53174 1703872 1678802 1653105 1627555 1603294 1580295 1557543 1534422 1511294 1488871 1467651 1447902
53163 1447902 1429645 1412665 1396932 1382910 1371000 1360843 1351706 1343339 1335791 1328483 1320353 1311096
53151A311096r642r540j0053j1309j2311j2617j3007j4011j4850j4523j3353j2545
53139A163335j2637j3055j3103j2795j2617j2874j3393j3744j3728j3701j4195
53128A017493j5169j5880j5685j4778j4036j4184j5171j6117j6022j4792j3576
53117H52083j3531j4391j4813j4192j3359j3221j3594j3841j3790j3495j2766
53106G01090j1765j1347j1898j2456j1914j0583r581r115q571q033q274r275r983
53093E68295r821r397r457j0002j0594j0686r604p316n251n174o902q293p885
53080D57913o355n016m083l210k564k468k834l683n245o831o786m691k592k598
53066C98957m067m645l601k447k413k951l099k970l208l773l980l345k066q95
$$ plain form
53151 1311096 1301454 1291914 1281861 1270552 1258241 1245624 1232617 1218606 1203756 1189233 1175880 1163335
53139 1163335 1150698 1137643 1124540 1111745 1099128 1086254 1072861 1059117 1045389 1031688 1017493
53128 1017493 1002324 986444 970759 955981 941945 927761 912590 896473 880451 865659 852083
53117 852083 838552 824161 809348 795156 781797 768576 754982 741141 727351 713856 701090
53106 701090 689325 677978 666080 653624 641710 631127 621546 612431 603860 595827 587553 578278 568295
53093 568295 558474 549077 539620 529618 519024 508338 498734 491418 486167 480993 474091 465798 457913
53080 457913 451558 446542 442459 439249 436685 434217 431383 427700 422455 415624 408838 404147 401555 398957
53066 398957 394890 390245 386644 384197 381784 378833 375734 372764 369556 365783 361803 358458 356392 355497
53052C55497o16j395k611l623m457n353n882n288l730k496k632l712m355l839
53038C05508k875k647l234l461k546j326j124j750j728n70N28O36M59R21J566
53023B88357J518J127J339J938J870J063O52J373K752L916M379M037L111K137
53009C19569J329J74j676l478m313m535n213o270o350m797k720j712k183l243
52995B74582l754l369k809l027l872m188l599l309m225n175m392k172n25n03j406
52980B28257k352l007k970k125j562k350l507l182j817j703l038l299j525l46
52966A95474j775l539k229J540L923K942K36j794k262j394K3P10J14m29O35K506
52950A94681K919J472J04P8N34M71J68j44j145k840l712k721r64k7K16Q81J954
$$ plain form
53052 355497 354881 353486 350875 347252 342795 337442 331560 326272 322542 320046 317414 313702 309347 305508
53038 305508 302633 299986 296752 293291 290745 289419 288295 286545 284817 284247 284775 285411 285870 286791 288357
53023 288357 289875 291002 292341 294279 296149 297212 297864 299237 301989 305905 310284 314321 317432 319569
53009 319569 320898 321072 319396 315918 311605 307070 301857 295587 289237 284440 281720 280008 277825 274582
52995 274582 270828 267459 264650 261623 257751 253563 249964 246655 242430 237255 232863 230691 230166 229663 228257
52980 228257 225905 222898 219928 217803 216241 213891 210384 207202 205385 203682 200644 197345 195820 195474
52966 195474 193699 190160 187931 189471 193394 196336 196572 194778 192516 191122 191145 191855 191969 191540 192175 194681
52950 194681 197600 199072 199176 199254 199788 200259 200427 200283 199138 196298 192586 189865 188901 188874 189090 189971 191925
52933A91925K347J602L37p14j133p47m8k07j544k485j346J147K520J719J48o43
52917A92878p32p59m76N91J933K599K381J666O72l04m84N40J843K137J440Q88
52901B06813J054J518K006K744L450L234J982Q50P27J064R66O64R91J977K970
52886B33010L774M670N395N081L476J596Q01J491K829L620L442K913K809L017
52872B77924K870K519K987M529N882N854M981M452M109K792N33r90m20J750L825
52857C23597M353K831j12k953m380m339l589k453q93L83J52j657l620m489m350
52842B98481l740k726j424n44o16j214j567j365o06P77K490L692L789K960J606
52827B99993k5j282j119N48K187K263J050Kk14j36k66l79j43K51L00k41r72j003
$$ plain form
52933 191925 194272 195874 196211 195497 194364 193617 193569 193362 191818 189333 187987 189134 191654 193373 193521 192878
52917 192878 192146 191387 190911 191502 193435 196034 198415 200081 200753 200449 199965 200505 202348 204485 205925 206813
52901 206813 207867 209385 211391 214135 217585 220819 222801 223651 224378 225442 226408 227072 228063 230040 233010
52886 233010 236784 241454 246849 251930 255406 257002 257803 259294 262123 265743 269185 272098 274907 277924
52872 277924 280794 283313 286300 290829 296711 302565 307546 311998 316107 318899 319432 318442 318022 319772 323597
52857 323597 327950 330781 330669 327716 323336 318997 315408 312955 312062 312445 312597 310940 307320 302831 298481
52842 298481 294741 292015 290591 290047 289431 288217 286650 285285 284679 285456 287946 291638 295427 298387 299993
52827 299993 299968 298686 297567 298115 300302 302565 303615 303617 303403 303267 303001 302622 302479 302730 303030 302789 301817 300814
52809C00814Q2J367J395N2j086q05K45P68O84P08Q19L99l98p32m80m68j099j699
52791C00566j496o16K10M02kl42J57J380K198J871J147J167J713J702J156J278
52775C12491K315K719J233j158k297j472j21m7j501l085l319k138q26m08n06o0
52759C01820J119K220K550K101J074k27r85l33J280K124J213l98j059p15o77j518
52743C09589k241j844q02l57p75j056m65L34J60j066k204k429k156k175k516k798
52727B87199l212m320n911o890o484n070l652k890k809l102l447l686l731l376
52713B28619k494j581j535k402k845j785j87p9j736l090k432o23J87p83k532m006
52697B00696n048n696n636m831m005l812l894l281j810n87p49k059l142k993j845
$$ plain form
52809 300814 300896 302263 303658 303710 302624 301819 302064 302832 303516 304224 305043 305442 305044 304312 303832 303364 302265 300566
52791 300566 299070 298454 298664 299066 299064 298722 298879 300259 302457 304328 305475 306642 308355 310057 311213 312491
52775 312491 314806 317525 318758 317600 315303 313831 313710 313663 312162 309077 305758 303620 302794 302386 301880 301820
52759 301820 302939 305159 307709 309810 310884 310657 309672 309339 310619 312743 313956 313558 312499 311784 311107 309589
52743 309589 307348 305504 304702 304345 303570 302514 302049 302383 302543 301477 299273 296844 294688 292513 289997 287199
52727 287199 283987 279667 273756 266866 260382 255312 251660 248770 245961 242859 239412 235726 231995 228619
52713 228619 226125 224544 223009 220607 217762 215977 215790 215711 213975 210885 208453 207830 208017 207234 204702 200696
52697 200696 195648 189952 184316 179485 175480 171668 167774 164493 162683 162096 161347 159288 156146 153153 151308
52682A51308n73J52l3j127k361k403q31R42J043o54k473l089k816k521k229j418
52666A30917k55L46j01q93q35L76J645J621L08r88j434j718k654l441k514k1J830
52649A22189J348o47j963j563k96M60K75k39l59j04j5k10j87J90K32m13p77Q1
52631A18002J306J229j7m89P37K362K972K847K790K631K006J459J589J962K005
52616A43391K060K448K454J561Q15J360K270J619n25j975j392K41J344J644J780
52601A59095K209K963L757L891K817J062j15j16N20J015Q96k41k465m748n417
52586A65123l854j104J306K500K231P35j100k296k734k924k810j932p57n06j251
52571A50627j433K0K228L626L684K680R22q97j652j182q35j601k602k588j987
$$ plain form
52682 151308 150735 150887 150854 149727 147366 144963 144132 145074 146117 145463 142990 139901 137085 134564 132335 130917
52666 130917 130662 131008 130907 130014 129179 129555 131200 132821 133129 132141 130707 128989 126335 122894 120380 120359 122189
52649 122189 123537 122890 120927 119364 119068 119528 119803 119564 119205 119101 119086 118876 118689 118879 119111 118698 117921 118002
52631 118002 119308 120537 120520 120031 120768 123130 126102 128949 131739 134370 136376 137835 139424 141386 143391
52616 143391 145451 147899 150353 151914 152729 154089 156359 157978 157453 155478 154086 154327 155671 157315 159095
52601 159095 161304 164267 168024 171915 174732 175794 175679 175563 176083 177098 177994 177753 175288 170540 165123
52586 165123 161269 160165 161471 163971 166202 166937 165837 163541 160807 157883 155073 153141 152384 151878 150627
52571 150627 149194 149214 151442 155068 158752 161432 162354 161457 159805 158623 157788 156187 153585 150997 149010
52556A49010k001k416k043r45m87j138j870j944j806j746j048P03K566L245K540
52541A40620J197j15j159j921k534l013k883j543P15K704L672M066M542M929M688
52526A53965L843K755J417j67j207o28J496L745M777M476L494K320J231O63Q63
52511A83043J267R33k29j197j131m47j22l69n76k67N36J659K736K959J853L21
52495A90969k09K90M61j86n32M3M34j94p91k52N64O42J262L901O596N685J423
52478B10106j483j32K790L326J759J247K645L766L169J918J316J048L01o82r94
52463B30100k03J311K672L036K335J482J354J758J896J469P73N1n09m53M47J639
52447B49158K340K391J883N52j543l275l500k567j715j288p28qK59Q1J7j55j277
$$ plain form
52556 149010 147009 144593 142550 141605 141118 139980 138110 136166 134360 132614 131566 132269 134835 138080 140620
52541 140620 141817 141702 140543 138622 136088 133075 130192 128649 129364 132068 135740 139806 144348 149277 153965
52526 153965 157808 160563 161980 161813 160606 159978 161474 165219 169996 174472 177966 180286 181517 182180 183043
52511 183043 184310 185243 185014 183817 182686 182239 182117 181748 181172 180905 181441 183100 185836 188795 190648 190969
52495 190969 190760 191050 191511 191325 190793 190836 191270 191076 190285 190033 190597 191239 192501 196402 202998 208683 210106
52478 210106 208623 208491 211281 214607 216366 217613 220258 224024 227193 229111 230427 231475 231776 231094 230100
52463 230100 229897 231208 233880 236916 239251 240733 242087 243845 245741 247210 247983 248034 247525 247072 247519 249158
52447 249158 251498 253889 255772 256324 254781 251506 248006 245439 243724 242436 241708 241700 241959 242040 242057 241902 240625
52430B40625l051l843k728o22J104J967J939R46m31r07QJ268J839K107K901L945
52414B47067M277L781L117K489J369l70j786j676Q8K144K783J645N2o65o65p28
52398B62922n64O45K309K673J370R0J36Q33J184J487K143K248R80o24r41p4N88
52381B77405O05P16J165J433J392J399J264M47p07j216r07m70j31M56R67N59n21
52364B83856r06j63M85K0j013j714k134k466k054l88J562K258J511N15J72L42
52348B79883O24R17J054O77j54p75o77j62J08k4j53J2K85M02M55N92N82J27l72
52329B83401P3J758L553L940K725J343J352K872M573N053M120K780J968J586J024
52314C22121L45J60M02J53q40j369l46J495K431K018J558K233L592M187L261J609
$$ plain form
52430 240625 237574 233731 231003 230381 231485 233452 235391 236337 235906 234999 235007 236275 238114 240221 243122 247067
52414 247067 251344 255125 258242 260731 262100 261730 259944 258268 258356 260500 263283 264928 264980 264315 263650 262922
52398 262922 262358 263003 265312 267985 269355 269445 269581 270414 271598 273085 275228 277476 278456 277832 276891 276817 277405
52381 277405 278010 278726 279891 281324 282716 284115 285379 285826 285119 283903 282996 282526 282395 282851 283818 284377 283856
52364 283856 282950 282787 283272 283292 282279 280565 278431 275965 273911 273523 275085 277343 278854 279369 279541 279883
52348 279883 280507 281424 282478 283155 283001 282226 281549 281387 281495 281471 281318 281330 281615 282017 282472 283064 283646 283773 283401
52329 283401 283474 285232 288785 292725 295450 296793 298145 301017 305590 310643 314763 317543 319511 321097 322121
52314 322121 322466 322626 323028 323181 322341 320972 320626 322121 324552 326570 328128 330361 333953 338140 341401 343010
52298C43010Q90J973L874M722L931K824K768L485L954M121M605N279N382M890
52284C95708M562M715M907M824M515L984L477L927N813P777P738N552L288K737
52270D63524L844N684P460Q293P586O124N458N719N655N203O082Q829J1228J1350
52256E62039J0442J0917J2688J3677J3273J2980J3746J4643J4587J3976J4117
52245G07085J5937J9239K2560K4037K3423K2782K4055K6467K7717K7283K6680
52234I67265K6625K6114K4770K4058K5098K6863K7743K7597K7010K5725K3395
52223A252263K1055K0209K0719K1022K0272J8924J7243J4692J1271Q259O884O833
52211A439646O738N739M130K836K526K996L180K123J86j200j244o99o96j326k006
$$ plain form
52298 343010 343900 345873 349747 354469 358400 361224 363992 367477 371431 375552 380157 385436 390818 395708
52284 395708 400270 404985 409892 414716 419231 423215 426692 430619 436432 444209 451947 457499 460787 463524
52270 463524 467368 473052 480512 488805 496391 502515 507973 513692 519347 524550 530632 539461 550689 562039
52256 562039 572481 583398 596086 609763 623036 636016 649762 664405 678992 692968 707085
52245 707085 723022 742261 764821 788858 812281 835063 859118 885585 913302 940585 967265
52234 967265 993890 1020004 1044774 1068832 1093930 1120793 1148536 1176133 1203143 1228868 1252263
52223 1252263 1273318 1293527 1314246 1335268 1355540 1374464 1391707 1406399 1417670 1425929 1432813 1439646
52211 1439646 1446384 1452123 1456253 1459089 1461615 1464611 1467791 1469914 1470100 1468900 1467656 1466957 1466261 1464935 1462929
52196A462929k590l019k384K68M082O793P539Q016J0051J3099J5240J5808J5704
52183A551536J5623J5474J5457J6252J7879J9398K0105K0177J9951J9444J8770
52172A750066J8132J7146J5167J2520J0413R252Q150O466M630K851M22k720n115
52159A847380n830o255q264j1372j3478j4004j4348j5325j6154j6368j6986j8845
52147A690151k1049k2031k1339j9597j7375j4980j2879j1470j0572r565q092o410
52135A514792n219n145o026o764o283m751l302k623k478k626l206l835l333j272
52121A457929Q38Q66j553m536n840m846k859j864k811m750n833n353m463m574
52107A410351n557o265o318o430o991p418p208o866p128p790p831o563m234j808
$$ plain form
52196 1462929 1460339 1457320 1454936 1455204 1459286 1466079 1473618 1481634 1491685 1504784 1520024 1535832 1551536
52183 1551536 1567159 1582633 1598090 1614342 1632221 1651619 1671724 1691901 1711852 1731296 1750066
52172 1750066 1768198 1785344 1800511 1813031 1823444 1832696 1840846 1847312 1851942 1854793 1855215 1852495 1847380
52159 1847380 1841550 1835295 1827031 1815659 1802181 1788177 1773829 1758504 1742350 1725982 1708996 1690151
52147 1690151 1669102 1647071 1625732 1606135 1588760 1573780 1560901 1549431 1538859 1529294 1521202 1514792
52135 1514792 1509573 1504428 1498402 1491638 1485355 1480604 1477302 1474679 1472201 1469575 1466369 1462534 1459201 1457929
52121 1457929 1458767 1459633 1458080 1453544 1447704 1442858 1439999 1438135 1435324 1430574 1424741 1419388 1414925 1410351
52107 1410351 1404794 1398529 1392211 1385781 1378790 1371372 1364164 1357298 1350170 1342380 1334549 1327986 1323752 1321944
52093A321944m78j051l150n161n587m638l892m332n239n334m351k995j883j202
52079A272651j076j458j757j395q46j267k893m532n024m489l694k906k059j450
52065A237805j423j592j207j84Q68J590K261L269M692O351P772Q302P795P116
52051A283415P359Q666J0424J2401J4862J7575J9641K0595K0979K1564K2691K4616
52039A484788K7577L0978L3254L3341L1906L0512K9958L0009L0226L0272K9596
52028A822417K7792K5422K3735K3250K3037K1783J9346J6826J5085J3521J0710
52017B042924O309J831r60k156l528o228r437j1620j2362j2381j2345j2416j2591
52004A955040j2703j2263j1055r783r355r582r292p853n941m476l492k307m44
$$ plain form
52093 1321944 1321466 1320415 1317265 1312104 1306517 1301879 1297987 1293655 1288416 1283082 1278731 1275736 1273853 1272651
52079 1272651 1271575 1270117 1268360 1266965 1266119 1264852 1261959 1257427 1252403 1247914 1244220 1241314 1239255 1237805
52065 1237805 1236382 1234790 1233583 1233399 1234267 1235857 1238118 1241387 1246079 1252430 1260202 1268504 1276299 1283415
52051 1283415 1290774 1299440 1309864 1322265 1337127 1354702 1374343 1394938 1415917 1437481 1460172 1484788
52039 1484788 1512365 1543343 1576597 1609938 1641844 1672356 1702314 1732323 1762549 1792821 1822417
52028 1822417 1850209 1875631 1899366 1922616 1945653 1967436 1986782 2003608 2018693 2032214 2042924
52017 2042924 2049233 2051064 2050104 2047948 2044420 2038192 2028755 2017135 2004773 1992392 1980047 1967631 1955040
52004 1955040 1942337 1930074 1919019 1909236 1899881 1890299 1881007 1873154 1867213 1862737 1859245 1856938 1856494
51991A856494J870L796M519M207M310O057Q653R856Q777P110O967Q297R364R109
51977A949386P931O558N365M674M546M161K447m25l068m660n769p183q827j0395
51963A944741j2093j4030j5710j6732j7413j7985j7927j7051j6453j7460k0020
51952A761867k3114k6177k8936l0436k9864k8273k7853k9164l0551l0681l0163
51941A446655l0102l0452l0797l1484l2751l3715l3540l2815l2495l2177l1004
51930A095323k9751l0126l1903l2623l0858k8177k6930k7271k7658k7361k6885
51919G75780k6211k4353k1196j8457j7824j8809j9463j8793j7479j6302j5088
51908E61805j3610j2393j1817j1179r713q036p417p839p995p315o738p075p710
$$ plain form
51991 1856494 1858364 1862160 1866679 1870886 1875196 1881253 1889906 1899762 1908539 1915649 1922616 1930913 1940277 1949386
51977 1949386 1957317 1963875 1969240 1973914 1978460 1982621 1985068 1984643 1981575 1976915 1971146 1963963 1955136 1944741
51963 1944741 1932648 1918618 1902908 1886176 1868763 1850778 1832851 1815800 1799347 1781887 1761867
51952 1761867 1738753 1712576 1683640 1653204 1623340 1595067 1567214 1538050 1507499 1476818 1446655
51941 1446655 1416553 1386101 1355304 1323820 1291069 1257354 1223814 1190999 1158504 1126327 1095323
51930 1095323 1065572 1035446 1003543 970920 940062 911885 884955 857684 830026 802665 775780
51919 775780 749569 725216 704020 685563 667739 648930 629467 610674 593195 576893 561805
51908 561805 548195 535802 523985 512806 503093 495057 487640 479801 471806 464491 457753 450678 442968
51895D42968p568o528n203m053l388l518m166m362l600k643k367k416j921j042
51881C90193p88j590k973m399n415n202l222m46J163P68n42j401j712k139k877
51866C59418l569m039m368m473m165l616l350l636m061l913k996j988j821k667
51852C10756l710l947l075j661p51j248l055m750m764l159j651j493k157k544
51838B72791k541k534k224j189j15j33j101j679j163k09L70M67K36l66j260k118
51822B57232k684k788k161q68K48L72k66q88j407k194k872k531j089O11K018L057
51806B43790L270K133L20o55m18OO3M44J552K651L102L136K845J859O40O00J990
51789B67328L166L001K493K726K683R78j351j829Q4K434L429L051K013P01n49
$$ plain form
51895 442968 435400 428872 423669 419616 416228 412710 408544 404182 400582 397939 395572 393156 391235 390193
51881 390193 389405 387815 384842 380443 375028 369826 366604 366158 367321 368089 367547 366146 364434 362295 359418
51866 359418 355849 351810 347442 342969 338804 335188 331838 328202 324141 320228 317232 315244 313423 310756
51852 310756 307046 303099 300024 298363 297612 296364 293309 288559 283795 280636 278985 277492 275335 272791
51838 272791 270250 267716 265492 264303 264188 264055 262954 261275 260112 259903 260273 260740 260976 260610 259350 257232
51822 257232 254548 251760 249599 248731 248979 249351 249085 248197 246790 244596 241724 239193 238104 238715 240733 243790
51806 243790 247060 249193 249513 248858 248440 248446 248509 248953 250505 253156 256258 259394 262239 264098 264738 265338 267328
51789 267328 270494 273495 275988 278714 281397 282375 281024 279195 279279 281713 285142 288193 290206 290907 290358
51774B90358j270j436j490j598j456r25k85J83M14M22L56M44N66L16j45O9J198
51757B85721K048J470J7q19m96M06J367K060J748Q4j652j469Q28L253L859K458
51741C00883O9k051k744j656j04k3j535k634j998r04j304k937l735k704r59J63
51725B75827Q14J901L438M375L810J852o06k416k542o60K231M274M409L261J933
51710C01901N02j309k469j295J825M071L513J564R16K008L069K969K391K299K763
51695C24718L495M270M584L967K933K708L679M956N605N538N059M456M335N367
51681C85670P311Q990R637R668R837J0273J0685J0821J0479R658Q838Q461P984
51668E08312O367L747J586P39M08m24j482j973j940j757j092M63K024K085N27
$$ plain form
51774 290358 289088 287652 286162 284564 283108 282183 281898 282081 282495 282917 283273 283717 284283 284599 284454 284523 285721
51757 285721 287769 289239 289256 288437 287941 288347 289714 291774 293522 293606 291954 290485 291313 294566 298425 300883
51741 300883 300952 298901 296157 294501 294397 294374 292839 290205 288207 287303 285999 283062 279327 276623 275664 275827
51725 275827 276641 278542 281980 286355 290165 292017 291411 288995 286453 285793 288024 292298 296707 299968 301901
51710 301901 302403 301094 298625 297330 299155 303226 306739 308303 309219 311227 314296 317265 319656 321955 324718
51695 324718 328213 332483 337067 341034 343967 346675 350354 355310 360915 366453 371512 375968 380303 385670
51681 385670 392981 401971 411608 421276 431113 441386 452071 462892 473371 483029 491867 500328 508312
51668 508312 514679 518426 520012 520751 521159 520735 519253 517280 515340 513583 512491 512954 514978 517063 517590
51653E17590j151j811j884k321l201l914m079l642k531r33L33M86j27k91L59N74
51637D93457q91l278m343k940k99J558J945J547J121J035J669L266N287O686O955
51622E12775O508N980N581N080M032K119k17j802j974j526j609j921j051J295
51608E33270L608M453M124L832L964L863K924J433M18Q13K364L368K213o48l054
51593E66945l795m016n410p811r561r790r359r518j0404j1069j0626r127p498
51580D58961o660o664o674n823m045k216j509k332l664l988l215l052m577o296
51566C98246n924l690k187k774m022m244l736l495l327k678k009j756r45J270
51552C58729L411L048K83k038j915m44R1r26k241k529j582k32M63J30n85p55q6
$$ plain form
51653 517590 516439 514628 512744 510423 507222 503308 499229 495587 493056 492123 492456 492942 492815 492524 492883 493457
51637 493457 492566 489288 484945 482005 481706 483264 485209 486756 487877 488912 490581 493847 499134 505820 512775
51622 512775 519283 525263 530844 535924 539956 542075 541858 540056 538082 536556 534947 533026 531975 533270
51608 533270 536878 541331 545455 549287 553251 557114 560038 561471 561889 562702 565066 568434 570647 569999 566945
51593 566945 563150 559134 553724 545913 536352 526562 517203 507685 497281 486212 475586 466459 458961
51580 458961 452301 445637 438963 433140 429095 426879 425370 423038 419374 415386 412171 409119 404542 398246
51566 398246 392322 388632 386445 383671 379649 375405 371669 368174 364847 362169 360160 358404 357459 358729
51552 358729 362140 365188 365471 363433 361518 361074 361165 360239 357998 355469 353887 353655 354118 354248 353663 352908 352822
51535C52822J120K485L443L168J712P38J855M224N355M514L738M753O424O549
51521D02900N044L779L806M340M447M260M214M113L526K359P58j005k210k046
51507D38285p26L51J36r02j697k097k658l287l246k391j376n08N57J664J939J353
51491D25397J325K628L750K873Q80N06K612N115O051N841N689N318L757J353n36
51476D72559j313j388j064m28p5p22k012k742k275r80N08J595J545K18j066o55
51460D61705J121K144J435O55J757M287O176O558O326O086M976K156j461l811
51446E00110l910k899k692l900n400n833n052l821k599j383n83j053k894m858
51432D53233n750n936o725q295r116p726m494j118J150K265K619K380J810J527
$$ plain form
51535 352822 353942 356427 359870 363038 364750 365488 367343 371567 376922 381436 385174 389927 396351 402900
51521 402900 407944 411723 415529 419869 424316 428576 432790 436903 440429 442788 443546 442541 440331 438285
51507 438285 437559 437910 438046 437144 435447 433350 430692 427405 424159 421768 420392 419884 420441 422105 424044 425397
51491 425397 426722 429350 433100 435973 436853 437359 439971 445086 451137 456978 462667 467985 471742 473095 472559
51476 472559 471246 469858 468794 468366 468291 467569 465557 462815 460540 459560 460068 461663 463208 463426 462360 461705
51460 461705 462826 464970 466405 467060 468817 473104 479280 485838 492164 498250 503226 505382 503921 500110
51446 500110 496200 493301 490609 486709 481309 475476 470424 466603 464004 462621 462038 460985 458091 453233
51432 453233 447483 441547 434822 426527 417411 409685 405191 404073 405223 407488 410107 412487 414297 415824
51418D15824J927K710L457M324N498O343O012M922M600N661O954P236O887P094
51404D89449Q100R113R568R469Q906Q173P989Q511Q489O743M216L090L599L533
51390E88948J468j118k131j854k013k784k660j083N03Q02L61M38J090J440J232
51375E82639J190J797K536K650K200K026K721L892M420L344O01k742n075n460
51361E96739m557m004m650n756o267o270o485o831o576n775n324n440n304m632
51347E18868m345m901n144l906j897o16j95K03L78o32k243k260J07K747L298K202
51331E01664J830L176M737M669K987J325J039J719J570p00m249o846p415p214
51317D98292p894r111r147p643o366o993r122j1109j1970j1726j0527q555o704
$$ plain form
51418 415824 417751 420461 423918 428242 433740 440083 446095 451017 455617 461278 468232 475468 482355 489449
51404 489449 497549 506662 516230 525699 534605 542778 550767 559278 567767 574510 578726 581816 585415 588948
51390 588948 590416 589298 587167 585313 583300 580516 577856 576773 577276 578078 578439 578877 579967 581407 582639
51375 582639 583829 585626 588162 590812 593012 595038 597759 601651 606071 609415 610016 607274 602199 596739
51361 596739 592182 588178 583528 577772 571505 565235 558750 551919 545343 539568 534244 528804 523500 518868
51347 518868 514523 509622 504478 500572 498675 498059 497864 498067 498445 497813 495570 493310 493417 496164 499462 501664
51331 501664 503494 506670 511407 516076 519063 520388 521427 523146 524716 524016 519767 512921 505506 498292
51317 498292 490398 481287 472140 464497 458131 451138 442016 430907 418937 407211 396684 388129 381425
51304C81425o213p256q516q602p415n827m575m064m701o402p803p152m437j809
51290B96653j179k019k401j708j175j823l083l736l274j906j84Q08r1k530m240
51275B68112l338o42J358J592J281J757K684K909K073P85m8L62K221M505N451
51260B91062M364K462J316J003N89N8N28K440M524N021L645J884J585L302N839
51245C29622P246O485M235K168J432J870K398J959K13k396n158p564r203r485
51231C23822q206o371n553n993o240n393m693n699p538p707n505k957j916j883
51217B48168j518q78q18j192j141p53r48j822k365k107j833k201k617k106p04
51202B25165O88J431J492R32k59j737k795l022k707k407k339k320k120j604o63
$$ plain form
51304 381425 375212 367956 359440 350838 343423 337596 333021 328957 324256 317854 310051 302899 298462 296653
51290 296653 295474 293455 291054 289346 288171 286348 283265 279529 276255 274349 274165 274973 274882 272352 268112
51275 268112 264774 264132 265490 267082 268363 270120 272804 275713 277786 278571 278523 278885 281106 285611 291062
51260 291062 295426 297888 299204 300207 300796 300854 301382 303822 308346 313367 317012 318896 320481 323783 329622
51245 329622 336868 343353 347588 349756 351188 353058 355456 357415 357628 355232 350074 342510 333307 323822
51231 323822 315616 309245 303692 297699 291459 286066 281373 275674 268136 260429 254924 251967 250051 248168
51217 248168 246650 245772 244954 243762 242621 241868 240920 239098 236733 234626 232793 230592 227975 225869 225165
51202 225165 225853 227284 228776 229708 229449 227712 224917 221895 219188 216781 214442 212122 210002 208398 207735
51187B07735O09J745K209K022J730J630J475J114R41J128R70j69j399r01J688
51172B22527M340M705K565k97k153k528j727j51J662K961L201K412J099r2n92
51157B37932j20J099K258K300O53k032m103m235k695q98K01P96J284J408Q68O7
51141B34783l46l22j38L21J242K081J923O97p17j615k028k113j728q68R4R41J772
51124B33979K357J937K24j838k865k412j175q2L31j59j497l196m439m599l553
51109B13013j666L25J515J353K08p76n93P94K434L117K265L55j423k091j640q70
51093B16320m75m82o16q92j483k130k240j711j243j463k074k343k184k158k314
51078A92512j807o8K096L159K524J116K55L85R36J246J331J700K553L309L185
$$ plain form
51187 207735 208344 210089 212298 214320 216050 217680 219155 220269 221210 222338 223308 223139 221740 220839 222527
51172 222527 226867 231572 234137 233840 231687 229159 227432 227281 228943 231904 235105 237517 238616 238524 237932
51157 237932 237812 238911 241169 243469 244122 242090 237987 233752 231057 230159 230360 231156 232440 233848 234716 234783
51141 234783 234437 234115 233977 234298 235540 237621 239544 240241 239524 237909 235881 233768 232040 231172 231266 232207 233979
51124 233979 236336 238273 238497 236659 233794 231382 230207 230125 230456 230297 228800 225604 221165 216566 213013
51109 213013 211347 211672 213187 214540 214748 213972 213379 214173 216607 219724 221989 222344 220921 218830 217190 216320
51093 216320 215845 215363 214747 213855 212372 210242 208002 206291 205048 203585 201511 199168 196984 194826 192512
51078 192512 190705 190637 192733 195892 198416 199532 199787 200172 201108 202354 203685 205385 207938 211247 214432
51063B14432K180J248J334K371L319L157J898O31N05J380J732L23k129l646l350
51048B25385k251j430n13J065K254J251j826m489m473j971J094L213M138M284
51034B25731L990L274J932N4j481j515nJ605J925J221Q49J343J932J931J728J934
51018B46448K176J591K16r47j338j531k043k174q38J574L214K931J705J359K349
51003B54692L491L589K560J016m56j320j093P7J205J398R52R59J814K621K331
50988B73836J111Q9j20nj34j77N11J641K224K164K740M827P199P532N240K376
50972C11054J288K013K690K214J393J309J584J137K5o64p19j215k588l491k591
50957C13439p04J70m49j063l85J214K761L934M785N134M997M998N648O574O895
$$ plain form
51063 214432 216612 217860 219194 221565 224884 228041 229939 230570 231075 232455 234187 234510 232381 228735 225385
51048 225385 223134 221704 221191 222256 224510 225761 223935 219446 214973 213002 214096 217309 221447 225731
51034 225731 229721 232995 234927 234981 233500 231985 231980 233585 235510 236731 237580 238923 240855 242786 244514 246448
51018 246448 248624 250215 250431 249484 248146 246615 244572 242398 241560 243134 246348 249279 250984 252343 254692
51003 254692 258183 261772 264332 265348 264892 263572 262479 262556 263761 265159 266111 267070 268884 271505 273836
50988 273836 274947 275036 274916 274911 274777 274600 275111 276752 278976 281140 283880 288707 295906 303438 308678 311054
50972 311054 312342 314355 317045 319259 320652 321961 323545 324682 324707 324043 323324 322109 319521 316030 313439
50957 313439 312735 312905 312456 311393 311008 312222 314983 318917 323702 328836 333833 338831 344479 351053 357948
50942C57948O104M394K606K010L477O509R673J2109J3940J5148J5217J4385J3984
50929D77504J4652J5309J4936J4475J5624J8364K1106K2860K3988K4922K5541
50918F89281K5934K6710K8280L0498L3156L6239L9695M3422M7442N1625N5657
50907A107939N9591O3913O8589P2813P6342Q0041Q4208Q7467Q8638Q8647Q8991
50896A967179Q9239Q8019Q5585Q3012P9299P2024O1274N0343M1830L5149K8671
50885B681624K2030J5222P638m76p264j1531j4362j6994j8564j7679j5213j3725
50873B610706j4624j7391k1074k5215k9547l4005l8785m3700m7986n1410n4890
50862B232079n9244o4072o8598p2606p5763p7147p6680p5868p5694p4786p1190
$$ plain form
50942 357948 364052 368446 371052 373062 376539 383048 392721 404830 418770 433918 449135 463520 477504
50929 477504 492156 507465 522401 536876 552500 570864 591970 614830 638818 663740 689281
50918 689281 715215 741925 770205 800703 833859 870098 909793 953215 1000657 1052282 1107939
50907 1107939 1167530 1231443 1300032 1372845 1449187 1529228 1613436 1700903 1789541 1878188 1967179
50896 1967179 2056418 2144437 2230022 2313034 2392333 2464357 2525631 2575974 2617804 2652953 2681624
50885 2681624 2703654 2718876 2726514 2726038 2718774 2707243 2692881 2675887 2657323 2639644 2624431 2610706
50873 2610706 2596082 2578691 2557617 2532402 2502855 2468850 2430065 2386365 2338379 2286969 2232079
50862 2232079 2172835 2108763 2040165 1967559 1891796 1814649 1737969 1662101 1586407 1511621 1440431
50851A440431o5235n8984n3613m9001m5283m2732m0315l6433l1328k6957k4113
50840I66437k1374j7450j3133j0033q458p367n740l448j099N94J642K875M763
50827H88209O463O885O437O689Q371J0736J2856J4478J5465J5576J5118J4952
50815A022235J5486J6341J7224J8330J9753K1268K2915K5015K7525L0049L2655
50804A268796L5776L9301M2650M5950N0119N5513O1404O7172P3046P9355Q5977
50793A905059R2945J00768J09533J18530J27356J36710J47267J58339J68372J76536
50783C241415J83279J89424J95162J99773K02042K00892J95735J86243J72294
50774D966259J54511J34411J13328R1405O8419M5285K3729M596j2411k7275l9099
$$ plain form
50851 1440431 1375196 1316212 1262599 1213598 1168315 1125583 1085268 1048835 1017507 990550 966437
50840 966437 945063 927613 914480 904447 895989 888622 882882 879434 878335 878929 880571 883446 888209
50827 888209 894672 901557 907994 914683 923054 933790 946646 961124 976589 992165 1007283 1022235
50815 1022235 1037721 1054062 1071286 1089616 1109369 1130637 1153552 1178567 1206092 1236141 1268796
50804 1268796 1304572 1343873 1386523 1432473 1482592 1538105 1599509 1666681 1739727 1819082 1905059
50793 1905059 1998004 2098772 2208305 2326835 2454191 2590901 2738168 2896507 3064879 3241415
50783 3241415 3424694 3614118 3809280 4009053 4211095 4411987 4607722 4793965 4966259
50774 4966259 5120770 5255181 5368509 5459914 5528333 5573618 5597347 5601943 5589532 5562257 5523158
50763E523158m7183n1545n2113m8699m2398l5934l1650k9930l0196l2698l8462
50752E082350m7970o0677p5460r1069j06482j21280j35420j48610j60370j70579
50742C964433j78951j84044j84144j79666j73288j66899j59649j50002j38497
50733B449293j27094j16603j06361r6047q6340p7722o9728o1585n3016m4493l7235
50722A573069l2487l0167k8597k6231k3138k0137j7335j4527j2315j1327j0725
50711A346083r069o569m942m838m886l809k151j155q88l73R26K538L606L660K953
50696A321086K310K365K979L682M693O751R969J3537J6857K0283K4297K8518L2052
50683A489379L4640L7047M0401M5299N1322N7412O2837O7762P2669P7535Q2149
$$ plain form
50763 5523158 5475975 5424430 5372317 5323618 5281220 5245286 5213636 5183706 5153510 5120812 5082350
50752 5082350 5034380 4973703 4898243 4807174 4700692 4579412 4443992 4295382 4135012 3964433
50742 3964433 3785482 3601438 3417294 3237628 3064340 2897441 2737792 2587790 2449293
50733 2449293 2322199 2205596 2099235 2003188 1916848 1839126 1769398 1707813 1654797 1610304 1573069
50722 1573069 1540582 1510415 1481818 1455587 1432449 1412312 1394977 1380450 1368135 1356808 1346083
50711 1346083 1337014 1330445 1325503 1320665 1315779 1311970 1309819 1308664 1307776 1307403 1308329 1310867 1314473 1318133 1321086
50696 1321086 1323396 1325761 1328740 1332422 1337115 1343866 1353835 1367372 1384229 1404512 1428809 1457327 1489379
50683 1489379 1524019 1561066 1601467 1646766 1698088 1755500 1818337 1886099 1958768 2036303 2118452
50672B118452Q6973R2796R9420J05545J10273J13982J17231J19530J19707J17078
50662C200987J11720J04027R4673Q4621P4497O3899N1756L7459K1356M442j2117
50651C837320k7155l9608m8637n3835n5540n4954n3465n1565m8712m4476l9458
50640C319915l4800l1216k8971k8365k9712l3061l8550m6675n7398o9078p9306
50629B842783q7091r3459r9463j04306j06182j04558j00741r6207r1173q5059
50619A874544p7785p0150o3094n6900n1072m4799l7791l0813k5179k1316j7978
50608A377667j3403p339j418K705N143P311J0000J2625J4430J5777J7821K1128
50596A462447K4953K8002K9734L0893L2698L5496L8325M0094M1124M3118M7393
$$ plain form
50672 2118452 2205425 2298221 2397641 2503186 2613459 2727441 2844672 2964202 3083909 3200987
50662 3200987 3312707 3416734 3511407 3596028 3670525 3734424 3786180 3823639 3844995 3849437 3837320
50651 3837320 3810165 3770557 3721920 3668085 3612545 3557591 3504126 3452561 3403849 3359373 3319915
50640 3319915 3285115 3253899 3224928 3196563 3166851 3133790 3095240 3048565 2991167 2922089 2842783
50629 2842783 2755692 2662233 2562770 2458464 2352282 2247724 2146983 2050776 1959603 1874544
50619 1874544 1796759 1726609 1663515 1606615 1555543 1510744 1472953 1442140 1416961 1395645 1377667
50608 1377667 1364264 1356925 1355507 1358212 1363355 1370666 1380666 1393291 1407721 1423498 1441319 1462447
50596 1462447 1487400 1515402 1545136 1576029 1608727 1644223 1682548 1722642 1763766 1806884 1854277
50585A854277N3422N9379O3977O7377P0462P3799P7379Q0920Q3943Q5898Q6659
50574B657492Q6886Q7361Q7808Q6841Q3325P7483P0382O2719N4691M6634L8990
50563C440612L1483K3216J3961M748l317j0180j6192k0828k3028k2606k0484j7572
50551C379813j4224j0847p985n589l046m71Q79R0k270n179q675j3468j9620k6681
50537C262727l4859m4787n6118o7320p7112q5132r1125r4508r5220r4159r2254
50526B430133q9785q6973q4276q1533p7633p1940o5444n9626n4755n0180m5746
50515A662242m1719l7675l2691k6785k1077j6394j2550r080n700j976K511P252
50503A466358J1039J3507J5574J7989K0313K1940K3241K4973K7212K9644L2245
$$ plain form
50585 1854277 1907699 1967078 2031055 2098432 2168894 2242693 2320072 2400992 2484935 2570833 2657492
50574 2657492 2744378 2831739 2919547 3006388 3089713 3167196 3237578 3300297 3354988 3401622 3440612
50563 3440612 3472095 3495311 3509272 3514020 3510703 3500523 3484331 3463503 3440475 3417869 3397385 3379813
50551 3379813 3365589 3354742 3346757 3341168 3338122 3337651 3338530 3338620 3336350 3331171 3322496 3309028 3289408 3262727
50537 3262727 3227868 3183081 3126963 3059643 2982531 2897399 2806274 2711766 2616546 2522387 2430133
50526 2430133 2340348 2253375 2169099 2087566 2009933 1937993 1872549 1812923 1758168 1707988 1662242
50515 1662242 1620523 1582848 1550157 1523372 1502295 1485901 1473351 1464271 1458571 1456595 1459106 1466358
50503 1466358 1477397 1490904 1506478 1524467 1544780 1566720 1589961 1614934 1642146 1671790 1704035
50492A704035L4907L6954L7983L8822M0585M2984M4480M4276M3383M3490M5248
50481B157147M7835M9867N0719N1163N2698N6143O1103O6810P2877P9030Q4816
50470B830208R0374R6925J05593J15944J26370J35679J43678J50589J56722J62503
50460D114585J67788J71227J71239J67701J61836J54370J44712J31960J15794
50451E501212R6105P2938M7315K1347l200k6033m7658o8166q7087j03829j17580
50440E285364j27161j31654j31225j26914j19753j10185r8214q3942o7915n1014
50430D237387l3919j7079j442J1207J9301K2785K2558J8742J0359l131k0860m1302
50418D224606o3133q4893j04667j20924j33324j42242j47900j50411j50161j47517
$$ plain form
50492 1704035 1738942 1775896 1813879 1852701 1893286 1936270 1980750 2025026 2068409 2111899 2157147
50481 2157147 2204982 2254849 2305568 2356731 2409429 2465572 2526675 2593485 2666362 2745392 2830208
50470 2830208 2920582 3017507 3123100 3239044 3365414 3501093 3644771 3795360 3952082 4114585
50460 4114585 4282373 4453600 4624839 4792540 4954376 5108746 5253458 5385418 5501212
50451 5501212 5597317 5670255 5717570 5738917 5735717 5709684 5662026 5593860 5506773 5402944 5285364
50440 5285364 5158203 5026549 4895324 4768410 4648657 4538472 4440258 4356316 4288401 4237387
50430 4237387 4203468 4186389 4184947 4196154 4215455 4238240 4260798 4279540 4289899 4286768 4265908 4224606
50418 4224606 4161473 4076580 3971913 3850989 3717665 3575423 3427523 3277112 3126951 2979434
50408B979434j42402j34834j25837j17280j10425j04589r7543q7652p5787o4697
50398A918388n6213m9638m3260l6625l0324k4395j8410j2854q724n683k173K329
50386A632418O715J0278J3836J8147K2651K6517K9610L1688L2172L1579L1789
50375A887400L3662L5745L6523L6480L6652L6628L5642L4381L3746L2915L0695
50364B270469K7845K5978K4877K3254K1494K1094K1626K1024J9137J8407K0307
50353B515512K3580K6794L0377L5000M0018M4918N0465N6829O2111O4462O4522
50342C014588O4068O3261O0923N6844N1871M6115L8698K9416J9143Q370l450j6669
50330C433178l0495m3896n6761o9437q1290r0354r4852r4969r2722q9871q6302
$$ plain form
50408 2979434 2837032 2702198 2576361 2459081 2348656 2244067 2146524 2058872 1983085 1918388
50398 1918388 1862175 1812537 1769277 1732652 1702328 1677933 1659523 1646669 1637945 1632262 1630089 1632418
50386 1632418 1639133 1649411 1663247 1681394 1704045 1730562 1760172 1791860 1824032 1855611 1887400
50375 1887400 1921062 1956807 1993330 2029810 2066462 2103090 2138732 2173113 2206859 2239774 2270469
50364 2270469 2298314 2324292 2349169 2372423 2393917 2415011 2436637 2457661 2476798 2495205 2515512
50353 2515512 2539092 2565886 2596263 2631263 2671281 2716199 2766664 2823493 2885604 2950066 3014588
50342 3014588 3078656 3141917 3202840 3259684 3311555 3357670 3396368 3425784 3444927 3453297 3449847 3433178
50330 3433178 3402683 3358787 3302026 3232589 3151299 3060945 2966093 2871124 2778402 2688531 2602229
50319B602229q0920p3538o5049n5956m5910l4934k4106j4469o037J587Q152J2705
50307B223754J4264J2395P629J206o214j5290k6283l6979m4291m8158n1755n6816
50295A973462o0896o0964n7934n5217n3884n1890m7942m3594m0921l9850l8598
50284A421772l5700l1103k6169k2801k1626k0984j8676j4667j0950q720p114n000
50272A198262k534l34J642L498M904N919P488J0155J3083J5232J6785J8508K0300
50259A312908K1385K1532K1184K0721K0414K0736K1750K2479K1961K0741K0202
50248A546013K0358J9530J6622J2739R896Q816Q713Q631Q135O906M676J717j116
50235A671636l213m753o175p474q381r005r831j1061j2422j3724j5149j6680j7733
$$ plain form
50319 2602229 2521309 2447771 2382722 2326766 2280856 2245922 2221816 2207347 2201310 2202897 2211049 2223754
50307 2223754 2238018 2250413 2258042 2259248 2253034 2237744 2211461 2174482 2130191 2082033 2030278 1973462
50295 1973462 1912566 1851602 1793668 1738451 1684567 1632677 1584735 1541141 1500220 1460370 1421772
50284 1421772 1386072 1354969 1328800 1305999 1284373 1263389 1244713 1230046 1219096 1210376 1203262 1198262
50272 1198262 1195728 1195394 1197036 1200534 1205438 1211357 1218845 1229000 1242083 1257315 1274100 1292608 1312908
50259 1312908 1334293 1355825 1377009 1397730 1418144 1438880 1460630 1483109 1505070 1525811 1546013
50248 1546013 1566371 1585901 1602523 1615262 1625158 1633974 1642687 1651318 1659453 1666359 1671035 1672752 1671636
50235 1671636 1668423 1663670 1657495 1650021 1641640 1632635 1622804 1611743 1599321 1585597 1570448 1553768 1536035
50222A536035j7858j7528j7550j7899j7806j7053j6327j6110j6044j5807j5844
50211A350209j6488j7042j6521j5023j3474j2302j1143r756q332o941n502m303
50199A213382l730l363k346q00L9m25j296j595j622k124k894l205l168l572m622
50184A178659n721o450o894p157p316p768q804r804r671q164o161m514l383k725
50170A084127k640k955l075k642j844j042m53k53l58j91O48J564J717J492J989
50155A076084L012L006J482J8q3L49j9q17r90r32j787l190l822l971n439q430
50139A054471j0601j0246q910r447j2399j5594j6890j6110j4274j2139r915p891
50127I10055o640o494p112p806q270q568q377o944m343k150j977l475m790m958
$$ plain form
50222 1536035 1518177 1500649 1483099 1465200 1447394 1430341 1414014 1397904 1381860 1366053 1350209
50211 1350209 1333721 1316679 1300158 1285135 1271661 1259359 1248216 1238460 1230128 1223187 1217685 1213382
50199 1213382 1209652 1206289 1203943 1203143 1203182 1202757 1201461 1199866 1198244 1196120 1193226 1190021 1186853 1183281 1178659
50184 1178659 1172938 1166488 1159594 1152437 1145121 1137353 1128549 1118745 1109074 1100910 1094749 1090235 1086852 1084127
50170 1084127 1081487 1078532 1075457 1072815 1070971 1069929 1069476 1069223 1068865 1068674 1069322 1070886 1072603 1074095 1076084
50155 1076084 1079096 1082102 1083584 1083602 1083519 1083868 1083849 1083032 1082042 1081110 1079323 1076133 1072311 1068340 1062901 1054471
50139 1054471 1043870 1033624 1024714 1015267 1002868 987274 970384 954274 940000 927861 917946 910055
50127 910055 903415 896921 889809 882003 873733 865165 856788 849844 845501 843351 841374 837899 833109 828151
50113H28151m766n064n281m405k738j770k512m438o098o458n774n251n708o682
50099G61206p135o915o891p642q785r785j0557j0853r935p664n283m202m327m500
50085F56732m297m395n049n307m238k245o04mj14l26k80K06J115J958K108J690
50069F36950J714K863M501N564O109P106Q679R588Q913P484O850P421Q379R103
50055G31224R791J0822J2204J3754J5124J5707J5098J3703J2421J1712J1424J1378
50043H84362J1556J1773J1735J1400J0888J0119R105Q353Q318Q631Q589Q104P387
50030A010320O109M002K094J925L342M453M186L565L814M464M394L717L470L965
50016A063820M572N053O124Q576J2190J5619J7348J7044J5952J5626J6436J7901
$$ plain form
50113 828151 823385 818321 813040 808635 805897 804127 801615 797177 791079 784621 778847 773596 767888 761206
50099 761206 754071 747156 740265 732623 723838 714053 703496 692643 682708 675044 669761 665559 661232 656732
50085 656732 652435 648040 642991 637684 633446 631201 630597 630593 630479 630153 629873 630079 631194 633152 635260 636950
50069 636950 638664 641527 646028 651592 657701 664807 673486 683074 691987 699471 706321 713742 722121 731224
50055 731224 741015 751837 764041 777795 792919 808626 823724 837427 849848 861560 872984 884362
50043 884362 895918 907691 919426 930826 941714 951833 960938 969291 977609 986240 994829 1002933 1010320
50030 1010320 1016429 1020431 1022525 1024450 1027792 1032245 1036431 1039996 1043810 1048274 1052668 1056385 1059855 1063820
50016 1063820 1068392 1073445 1079569 1088145 1100335 1115954 1133302 1150346 1166298 1181924 1198360 1216261
50004A216261K0053K3116K5927K6365K4117K1573K0919K1451K0930J8738J6349
49993A455799J5255J5568J6303J6072J3925J0386P289N666M297J358l068p170
49981A551680r706j1004j1965j3265j5350j7981j9836j9599j7622j5478j3909
49970A385965j2256j0038p930o833o814p385q121q556q144o839n267l914k430
49957A291438j73K671M890N355M198K780K192K126J572M08n48r88j404j747j199
49942A311571l3j96k686n587o376n349m780n303n296l967k741k946l966m710n417
49927A252218o803q476r434r523r305q900p866o130m350l373l702n408q178j1461
49913A149309j4772j7817k0375k2166k2956k2767k2048k1543k1649k1825k1232
$$ plain form
50004 1216261 1236314 1259430 1285357 1311722 1335839 1357412 1378331 1399782 1420712 1439450 1455799
49993 1455799 1471054 1486622 1502925 1518997 1532922 1543308 1550597 1556263 1560560 1561918 1558850 1551680
49981 1551680 1541974 1530970 1519005 1505740 1490390 1472409 1452573 1432974 1415352 1399874 1385965
49970 1385965 1373709 1363671 1355741 1348908 1342094 1334709 1326588 1318032 1309888 1303049 1297782 1293868 1291438
49957 1291438 1291265 1293936 1298826 1304181 1308379 1311159 1313351 1315477 1317049 1317457 1316909 1315921 1314517 1312770 1311571
49942 1311571 1311538 1311342 1308656 1303069 1296693 1291344 1286564 1281261 1275965 1271998 1269257 1266311 1262345 1257635 1252218
49927 1252218 1245415 1236939 1227505 1217982 1208677 1199777 1191911 1185781 1181431 1178058 1174356 1168948 1160770 1149309
49913 1149309 1134537 1116720 1096345 1074179 1051223 1028456 1006408 984865 963216 941391 920159
49902I20159k0096j9582j9992k0060j8795j6951j5689j4735j3270j1840j1627
49891G37522j2291j2269j1095r700q561p312o293o486p620q010o930n456m557
49878F30942m031l856m606n711n370l429k366l708n206l705L01L199K912R20k64
49863E96022N8Q50J079P34N74J014J360O96m61m50J165K829L317L469M490N871
49847F22617O505O676P140P174N636L401K584L508M451M420M124L976L297K228
49833F87737K463M884P904R434R482R599J0593J1997J3347J4832J6723J8873K0820
$$ plain form
49902 920159 900063 880481 860489 840429 821634 804683 788994 774259 760989 749149 737522
49891 737522 725231 712962 701867 692167 683606 676294 670001 663515 655895 647885 640955 635499 630942
49878 630942 626911 623055 618449 612738 607368 603939 601573 597865 592659 588954 589255 592454 595366 596286 596022
49863 596022 596080 596930 598009 598743 599317 600331 601691 602387 601926 601476 602641 605470 608787 612256 616746 622617
49847 622617 629122 635798 642938 650112 655748 659149 661733 665241 669692 674112 678236 682212 685509 687737
49833 687737 690200 695084 702988 712422 721904 731503 742096 754093 767440 782272 798995 817868 838688
$$ [...]
##END NTUPLES=NMR SPECTRUM
##END=
