
##TITLE=AC1185_Huila-guadalupe-HGUAH12020_5898926_BD3wntBXHu
##JCAMPDX= 6.0         $$ Bruker NMR JCAMP-DX V2.0
##DATA TYPE= NMR SPECTRUM
##DATA CLASS= NTUPLES
##ORIGIN= BRUKER
##OWNER= Administrator
$$ 1.72 TOPSPIN		Version 2.1
$$ 2012-04-10 10:23:18.125 -0500  Administrator@TOPSPIN
$$ Compression mode = diff/dup
##.OBSERVE FREQUENCY= 400.13188235
##.OBSERVE NUCLEUS= ^1H
##.ACQUISITION MODE= SIMULTANEOUS (DQD)
##.ACQUISITION SCHEME= undefined
##.AVERAGES= 8
##.DIGITISER RES= 22
##SPECTROMETER/DATA SYSTEM= spect
##.PULSE SEQUENCE= zg30
##.SOLVENT NAME= COFFEE_meoh
##.SHIFT REFERENCE= INTERNAL, COFFEE_meoh, 1, 14.98061
##AUDIT TRAIL= $$ (NUMBER, WHEN, WHO, WHERE, PROCESS, VERSION, WHAT)
$$ ##TITLE= Audit trail, TOPSPIN		Version 2.1
$$ ##JCAMPDX= 5.01
$$ ##ORIGIN= Bruker BioSpin GmbH
$$ ##OWNER= Administrator
$$ $$ C:\Bruker\TOPSPIN/data/COFFEE/nmr/AC1185_Huila-guadalupe-HGUAH12020_5898926_BD3wntBXHu/10/pdata/1/auditp.txt
$$ ##AUDIT TRAIL=  $$ (NUMBER, WHEN, WHO, WHERE, PROCESS, VERSION, WHAT)
(   1,<2012-04-04 10:04:57.328 -0500>,<Administrator>,<TOPSPIN>,<go>,<TOPSPIN 2.1>,
      <created by zg
	started at 2012-04-04 10:03:50.734 -0500,
	POWCHK enabled, PULCHK disabled,
       configuration hash MD5:
       1A 1E CE 29 27 FD 77 03 67 4E F0 E3 C4 B2 CB 90
       data hash MD5: 64K
       52 E4 E5 5D 9F 94 E3 BC DB 9E 43 0D BD 44 BE DD>)
(   2,<2012-04-04 10:05:00.640 -0500>,<Administrator>,<TOPSPIN>,<proc1d>,<TOPSPIN 2.1>,
      <Start of raw data processing
       efp LB = 0 FT_mod = 6 PKNL = 1 PHC0 = 0 PHC1 = 0 SI = 32K 
       data hash MD5: 32K
       7E 90 37 3B 2D AD A5 06 72 9A 10 92 36 7A 45 A0>)
(   3,<2012-04-04 10:05:01.015 -0500>,<Administrator>,<TOPSPIN>,<proc1d>,<TOPSPIN 2.1>,
      <pk PHC0 = 213.2941 PHC1 = 0 
       data hash MD5: 32K
       DF B4 22 51 81 2E E7 47 60 53 EB 24 C4 EE 68 4A>)
(   4,<2012-04-04 10:05:01.062 -0500>,<Administrator>,<TOPSPIN>,<proc1d>,<TOPSPIN 2.1>,
      <abs ABSG = 1 
       data hash MD5: 32K
       47 2F C8 C3 64 D4 C0 9A 20 0F D6 0A CD F8 AA E1>)
(   5,<2012-04-04 10:05:01.093 -0500>,<Administrator>,<TOPSPIN>,<proc1d>,<TOPSPIN 2.1>,
      <abs ABSG = 2 
       data hash MD5: 32K
       95 3E EA BA A4 9F F5 AC 2D 92 C8 4B 81 E2 F0 5A>)
(   6,<2012-04-04 10:05:01.125 -0500>,<Administrator>,<TOPSPIN>,<proc1d>,<TOPSPIN 2.1>,
      <abs ABSG = 3 
       data hash MD5: 32K
       EE C1 FA D5 DC 3F 14 DD E9 51 E2 91 FF E2 8B 07>)
(   7,<2012-04-04 10:05:01.156 -0500>,<Administrator>,<TOPSPIN>,<proc1d>,<TOPSPIN 2.1>,
      <abs ABSG = 4 
       data hash MD5: 32K
       51 2B 80 0D BC 4E 34 08 90 44 CE 84 5F 6D B4 EA>)
(   8,<2012-04-04 10:05:01.187 -0500>,<Administrator>,<TOPSPIN>,<proc1d>,<TOPSPIN 2.1>,
      <abs ABSG = 5 
       data hash MD5: 32K
       0F 47 19 02 74 86 AA A7 E4 12 37 A4 CE AB 21 65>)
(   9,<2012-04-04 10:05:05.578 -0500>,<Administrator>,<TOPSPIN>,<audit>,<TOPSPIN 2.1>,
      <user comment:
       ICON-NMR User ID: COFFEE
       data hash MD5: 32K
$$ [...]
##$TP= (0..7)
150 150 150 150 150 150 150 150
##$TP07= 0
##$TPNAME0= <>
##$TPNAME1= <>
##$TPNAME2= <>
##$TPNAME3= <>
##$TPNAME4= <>
##$TPNAME5= <>
##$TPNAME6= <>
##$TPNAME7= <>
##$TPOAL= (0..7)
0.5 0.5 0.5 0.5 0.5 0.5 0.5 0.5
##$TPOFFS= (0..7)
0 0 0 0 0 0 0 0
##$TUNHIN= 0
##$TUNHOUT= 0
##$TUNXOUT= 0
##$USERA1= <user>
##$USERA2= <user>
##$USERA3= <user>
##$USERA4= <user>
##$USERA5= <user>
##$V9= 5
##$VALIST= <valist>
##$VCLIST= <CCCCCCCCCCCCCCC>
##$VD= 0
##$VDLIST= <DDDDDDDDDDDDDDD>
##$VPLIST= <PPPPPPPPPPPPPPP>
##$VTLIST= <TTTTTTTTTTTTTTT>
##$WBST= 2048
##$WBSW= 25
##$XGAIN= (0..3)
0 0 0 0
##$XL= 0
##$YL= 0
##$YMAX_a= 532218
##$YMIN_a= -646672
##$ZGOPTNS= <>
##$ZL1= 120
##$ZL2= 120
##$ZL3= 120
##$ZL4= 120
##$ABSF1= 14.98061
##$ABSF2= -5.57192
##$ABSG= 5
##$ABSL= 3
##$ALPHA= 0
##$AQORDER= 0
##$ASSFAC= 0
##$ASSFACI= 0
##$ASSFACX= 0
##$ASSWID= 0
##$AUNMP= <proc_prof1d_extract_pilot.lims>
##$AXLEFT= 0
##$AXNAME= <>
##$AXNUC= <1H>
##$AXRIGHT= 0
##$AXTYPE= 0
##$AXUNIT= <>
##$AZFE= 0.1
##$AZFW= 0.1
##$BCFW= 0
##$BC_mod= 0
##$BYTORDP= 0
##$COROFFS= 0
##$CY= 15
##$DATMOD= 1
##$DC= 0
##$DFILT= <>
##$DTYPP= 0
##$F1P= 0
##$F2P= 0
##$FCOR= 0.5
##$FTSIZE= 32768
##$FT_mod= 6
##$GAMMA= 0
##$GB= 0
##$INTBC= 1
##$INTSCL= 1
##$ISEN= 128
##$LB= 0
##$LEV0= 0
##$LPBIN= 0
##$MAXI= 10000
##$MC2= 0
##$MEAN= 0
##$ME_mod= 0
##$MI= 0
##$NCOEF= 0
##$NC_proc= -8
##$NLEV= 6
##$NOISF1= 0
##$NOISF2= 0
##$NSP= 0
##$NTH_PI= 0
##$NZP= 0
##$OFFSET= 14.98061
##$PC= 1
##$PHC0= 213.2941
##$PHC1= 0
##$PH_mod= 1
##$PKNL= yes
##$PPARMOD= 0
##$PPDIAG= 0
##$PPIPTYP= 0
##$PPMPNUM= 2147483647
##$PPRESOL= 1
##$PSCAL= 4
##$PSIGN= 0
##$PYNMP= <proc.py>
##$REVERSE= no
##$SF= 400.13
##$SI= 32768
##$SIGF1= 0
##$SIGF2= 0
##$SINO= 400
##$SIOLD= 32768
##$SPECTYP= <>
##$SREGLST= <1H.CDCl3>
##$SSB= 0
##$STSI= 32768
##$STSR= 0
##$SW_p= 8223.68421052632
##$SYMM= 0
##$S_DEV= 0
##$TDeff= 65536
##$TDoff= 0
##$TI= <>
##$TILT= no
##$TM1= 0
##$TM2= 0
##$TOPLEV= 0
##$USERP1= <user>
##$USERP2= <user>
##$USERP3= <user>
##$USERP4= <user>
##$USERP5= <user>
##$WDW= 1
##$XDIM= 32768
##$YMAX_p= 464866590
##$YMIN_p= -699917
##$CURPLOT= <Network HP LaserJet P1505>
##$CURPRIN= <$Network HP LaserJet P1505>
##$DFORMAT= <normdp>
##$LAYOUT= <+/1D_H.xwp>
##$LFORMAT= <normlp>
##$PFORMAT= <normpl>
##$SURQMSG= 1
$$ End of Bruker specific parameters
$$ ---------------------------------
##NTUPLES= NMR SPECTRUM
##VAR_NAME=  FREQUENCY,     SPECTRUM/REAL,   SPECTRUM/IMAG
##SYMBOL=    X,             R,               I
##VAR_TYPE=  INDEPENDENT,   DEPENDENT,       DEPENDENT
##VAR_FORM=  AFFN,          ASDF,            ASDF
##VAR_DIM=   32768,         32768,           32768
##UNITS=     HZ,            ARBITRARY UNITS, ARBITRARY UNITS
##FACTOR=    0.250966925370066, 1,           1
##FIRST=     8223.43324360095, 13474,        -37310
##LAST=      0,             85424,           -50744
##MIN=       0,             -699917,         0
##MAX=       8223.43324360095, 464866590,    0
$$ Real data points
##PAGE= N=1
##DATA TABLE= (X++(R..R)), XYDATA
$$ [...]
19454a54771l8536A4000c9332k23776f1505j61589A07714b83329N6260A57021
19443a70187G1379b05336A99500f9421A3362b93526d0610k10418C1862M4504a45704
19431D2422e7644K3850n6783K4695k27248A57350a75173n2871g4929K917k13028
19420b85040P0727j84193c9988n9722A64664N8363c58817a1012o9261A59796N6299
19409B16095A02785f1594E9195b3560k12832h2524j8447E0218C867c37416H229
19397b20463g2688I2763f7059l77495a78228B34060B1710P0749m438b40918o6477
19386c07395b3134j19001B4279b10263G7647a92696e0587J9509k21541A02089
19375b55875a0036o1001n7250A28752a22293B5619c69160i0197n8707F302C056
$$ plain form
19454 -154771 -193307 14000 -39332 -263108 -61505 -223094 107714 -283329 -227069 157021
19443 -170187 71379 -205336 199500 -69421 13362 -293526 -40610 -251028 31862 76366 -145704
19431 42422 -57644 -33794 -90577 -65882 -293130 157350 -175173 -228044 -74929 -72012 -285040
19420 -285040 -214313 -398506 -39988 -99710 164664 223027 -358817 -11012 -80273 159796 216095
19409 216095 102785 -61594 59195 -23560 -236392 -82524 -100971 50218 3867 -337416 8229
19397 -220463 -72688 92763 -67059 -444554 -178228 234060 21710 92459 88021 -240918 -307395
19386 -307395 -23134 -142135 24279 -210263 77647 -192696 -50587 -31078 -252619 102089
19375 -255875 -10036 -71037 -128287 128752 -122293 25619 -369160 -90197 -148904 6302 3056
19363c60124h5020O884A0901c0892B825e6061p6569j13759A24863R9661a95267
19351G9510R6302b01705A40084g5816r068m5640L5097A38762J6438a64224G2437
19339a18761H8135K93269g1889D6138a33856B22985B3218g6256j63402A89069
19328H7123i3700F2569b27663Q3420B5246b3526k72934i7688A20112b4508C6264
19316a56263e5243k24949f8234H0539a07202I9420f2562l77420a10397d0604n8818
19305i9422L8641G2224b63107P2262Q0366I9057e4031o480m5507l66426J17155
19294c55289i4193k47705a21380C7476j3142N6719a52123c0995k81582a28645
19283a79185r9166Q4390L7325A29532j4226d7449D1840r589c5782o377j13324
$$ plain form
19363 -360124 -85020 -78136 10901 -30892 2825 -56061 -132630 -246389 124863 224524 -195267
19351 79510 175812 -201705 140084 -75816 -84884 -130524 -95427 138762 155200 -164224 72437
19339 -118761 88135 381404 -71889 46138 -133856 222985 23218 -76256 -239658 189069
19328 87123 -93700 62569 -227663 -144243 25246 -23526 -296460 -97688 120112 -24508 36264
19316 -156263 -55243 -280192 -68234 80539 -107202 99420 -62562 -439982 -110397 -40604 -99422
19305 -99422 -60781 72224 -263107 -190845 -110479 99057 -54031 -60511 -106018 -472444 -355289
19294 -355289 -94193 -341898 -121380 37476 24334 81053 -152123 -30995 -312577 -128645
19283 -179185 -278351 -193961 -156636 129532 115306 -47449 41840 32251 -35782 -42159 -155483
19272a55483A31761h9150j46001a2872B50009c76203A85601M7499b53124d5227
19261b13178P9546j9802B1974R6863a12892E620a53011B16180H4201b6189A25154
19249B29535d3583j40443G5591a71070K6211L6845B3557f7860j3556R837j8388
19238h9967n17K523j19648Q5596b440A2950b08597l3787J8619a09293d8957j24553
19226a73510B20517D3562a54613r413p3295R7249A28026a97050r6373j11452A44749
19214b06673j77190J42944J14696b8228k10811a3186D4149i1954A41600d5076
19203a65931e8699q941q6680A23382b1602G7655J35478c26858b9454j66109B86173
19191H3884a03301j70519E5655J57911b71456A6775L3041f7732m2946L1146j3966
$$ plain form
19272 -155483 131761 -89150 -235151 -12872 250009 -376203 185601 233100 -253124 -45227
19261 -213178 -133632 -153434 21974 118837 -112892 5620 -153011 216180 84201 -26189 125154
19249 229535 -43583 -184026 75591 -171070 -144859 -108014 23557 -67860 -81416 -71579 -89967
19238 -89967 -90484 -87961 -207609 -122013 -2440 12950 -208597 -242384 -223765 -109293 -48957 -173510
19226 -173510 220517 43562 -154613 -164026 -237321 -140072 128026 -197050 -293423 -404875 144749
19214 -206673 -383863 -240919 -126223 -28228 -239039 -13186 44149 -91954 141600 -45076
19203 -165931 -58699 -67640 -154320 123382 -21602 77655 213133 -326858 -29454 -195563 286173
19191 83884 -103301 -273820 55655 213566 -271456 16775 49816 -67732 -110678 -79532 -93498
19180i3498c6523A0657R6324c09563A17763e9915k86488I5314b66769E1347a22269
19168b17769f0831A09388a82503f1564k9608n7866e2242k71510e9214l69110a96576
19156d46921A93280d93672A96056H806b33589A35287A5103R5872n2634O6087a12007
19144a71912F9664c171C8941K061a34707A77985a86485i1879A60874o8832a96479
19132c31468J46873d6548D9305b73783a8846n1502j53690A15834R5252a04041
19121g1310J6210j84966e0085D3515O2479b17677O1494A59548C2425a17182C74303
19109d6544G9911r505Q7785O318g7410A56911g7840l86349K32036m2779A40191
19097g8018A57012b37360A16064i4651j64236i009B34561a29224h204G1464K07482
$$ plain form
19180 -93498 -36523 10657 106981 -309563 117763 -59915 -346403 95314 -266769 51347 -122269
19168 -217769 -60831 109388 -182503 -61564 -91172 -149038 -52242 -323752 -59214 -428324 -196576
19156 -446921 193280 -493672 196056 8806 -233589 135287 15103 110975 58341 124428 -112007
19144 -171912 69664 -3171 38941 41002 -134707 177985 -186485 -91879 160874 92042 -196479
19132 -331468 -184595 -46548 49305 -273783 -18846 -70348 -224038 115834 211086 -104041
19121 -71310 -55100 -240066 -50085 43515 105994 -217677 -156183 159548 32425 -117182 374303
19109 -46544 79911 70406 158191 164509 -77410 156911 -77840 -464189 -232153 -274932 140191
19097 -78018 157012 -237360 116064 -94651 -258887 -9009 234561 -129224 -8204 71464 278946
19086B78946b48246a13513k39704A16435N6285b86971a21510A27569a83992h9089
19075G0298b43281j77606K04907m797j02609a19417j02643g7491j03762n9259
19065b40512a09108p3037k57591E5719d76649H5565Q9802l7182b51323G887J35820
19054A43707a1523j39623k4653A9971M822a14665D8625b70529J34627m4751f6778
19042a969j91166j03386a43382N2085K5190J485j87034A13266b11324A38023a42418
19030A77170f6835K5891o3587G3300a72013J5896K9699b2498F0544a30828E2185
19018a1590k7394l1025F823b8697C5224J14660d8148B4363M3569a81308E10335
19006I7658B1084J5509M2489R3565a33882k37263a20513H6773a18824k8854O0444
$$ plain form
19086 278946 -248246 -113513 -353217 116435 172720 -286971 -121510 127569 -183992 -89089
19075 70298 -243281 -420887 -215980 -220777 -323386 -119417 -222060 -77491 -181253 -240512
19065 -240512 -109108 -182145 -439736 55719 -476649 85565 175367 138185 -251323 7887 143707
19054 143707 -11523 -151146 -175799 19971 24793 -114665 48625 -270529 -135902 -180653 -66778
19042 -1969 -193135 -296521 -143382 -91297 -66107 -64622 -251656 113266 -211324 138023 -142418
19030 177170 -66835 -40944 -104531 73300 -172013 -156117 -126418 -22498 60544 -130828 52185
19018 -11590 -38984 -70009 6823 -28697 35224 149884 -48148 24363 67932 -181308 510335
19006 97658 21084 36593 79082 172647 -133882 -371145 -120513 86773 -118824 -147678 -87234
18995h7234q2682O456A80855m7614a26421C0707d02370a0813k878q536I8161b48423
18982I8727m8016B0429g9694A35760a63164c4639A51006a02758A9676b48872B956
18970b50309B07654a74772B22044a62524m4019g9818B18351c04331A031J79603
18960A80634E3250Q8843K51728K98203B96481A2832J15585F0054p621a4915n8665
18949g3580A7602K4443a44959e8917A40724b33744f8427j14107g2383m7790L7638
18938h2535n6174d461k62969m6537J26091J0643o9277A44158a48337I1020a0028
18926a7680k27397f4876J2365r1507j1036o166A48168c35071A62512q450b23011
18914a81663J0286A03625b12558g5248F9268g5845A81680c03191A83184h1406
$$ plain form
18995 -87234 -169916 -163460 180855 133241 -126421 30707 -402370 -10813 -13691 -22227 98161 -248423
18982 98727 50711 20429 -79694 135760 -163164 -34639 151006 -102758 19676 -248872 2956
18970 -250309 207654 -174772 222044 -162524 -206543 -79818 218351 -304331 1031 180634
18960 180634 53250 142093 393821 692024 296481 12832 128417 60054 52433 -14915 -73580
18949 -73580 17602 42045 -144959 -58917 140724 -233744 -68427 -182534 -72383 -120173 -82535
18938 -82535 -138709 -4461 -267430 -313967 -187876 -177233 -246510 144158 -148337 91020 -10028
18926 -17680 -245077 -64876 -52511 -144018 -155054 -161220 148168 -335071 162512 154062 -223011
18914 -181663 -171377 103625 -212558 -75248 69268 -75845 181680 -303191 183184 -81406
18903a33266C85116B2078M38642d7684J5505K963D27835D0248J8107M61273j74471
18892C45157j23409j07563a27560c3062l56928a75965H1360e8812j06116C5234
18881E3515a13999r4954C821i7138p0449N2231p0293B0578a82760M9879G843P3555
18869H1398g0139j39773M0092g4054G3708h6434A76278B8434b26493h1906I6333
18857H1114d29970B07560a36504L6323p0978A67223c28927c4892A48820J43527
18847B92347q9422h2456J6091G7132J14149d6477A31591a43303d6883B7699a99580
18835G297a90227A31773E8204a93234m3226f0582I461K57258i8552I960i9577
18823F7567f8311K2813q3879C0953J34432c06467J13210D936O5153a24700A80643
$$ plain form
18903 -133266 385116 22078 460720 -47684 -32179 -29216 427835 40248 58355 519628 345157
18892 345157 221748 114185 -127560 -33062 -389990 -175965 81360 -58812 -164928 35234
18881 53515 -113999 -208953 3821 -97138 -167587 -115356 -185649 20578 -182760 -132881 7843 81398
18869 81398 -70139 -209912 -169820 -74054 73708 -86434 176278 28434 -226493 -81906 96333
18857 81114 -429970 207560 -136504 -100181 -171159 167223 -328927 -34892 148820 292347
18847 292347 202925 -82456 -66365 77132 191281 -46477 131591 -143303 -46883 27699 -199580
18835 7297 -190227 131773 58204 -193234 -236460 -60582 9461 266719 -98552 9960 -99577
18823 67567 -68311 -45498 -129377 30953 165385 -306467 -193257 4936 70089 -124700 180643
18811A98835i5464P53A8406J30022j2512d3019K1193A49159a257q9165j8767R512
18799i9677N168j36351h0020B31933g2256A3205i2538G8194k6799H710J28905
18788A37615o7740b95255J42645E4736J02527a52529b7618K201A24634e541m02968
18777d08509C7986a21799K6648m7724f2733A56259a4199j89015h1682E1208J75851
18766B27059C4155a6389a126j10371C84909b00269A75970b25652p60O9107O8625
18755h8680l35688b203A88601b28303i3296L7945k96077Q7668A51980c4201B44056
18743B36304g7816A43663n4337A0267b6721j38268k3363l7744g6080l36911f5949
18731B90720H1626e3285B29851b45081C5988J97650H5140a08773K6687a100o8554
$$ plain form
18811 198835 -95464 -94711 18406 148428 135916 -43019 -21826 149159 -1257 -90422 -109189 -99677
18799 -99677 -94509 -230860 -80020 231933 -72256 13205 -92538 78194 51395 8710 137615
18788 137615 69875 -295255 -152610 54736 157263 -152529 -27618 -25417 124634 -5541 -408509
18777 -408509 37986 -121799 -95151 -142875 -62733 156259 -14199 -203214 -81682 51208 227059
18766 227059 34155 -16389 -1126 -111497 384909 -200269 175970 -225652 -226412 -157305 -88680
18755 -88680 -424368 -2203 188601 -228303 -93296 -55351 -351428 -263760 151980 -34201 244056
18743 236304 -77816 143663 89326 10267 -26721 -164989 -188352 -226096 -76080 -412991 -65949
18731 290720 81626 -53285 229851 -245081 35988 233638 85140 -108773 -82086 -1100 -69654
18720f9654l46992a95949a9299B70911I4214e168A55736D3820b91656A50958f519
18708C9097b43914J16718E2839E862c12097i3709A29320a99076N7151L8424A06812
18696f395B0747K91565a5184j67289K3844a9959j24048l5234K6091m1653n9139
18685b53942J16897D8123b53386A31259a47909q195o65b4191l49932I1094a0350
18673F0286a54210H4130k1266i1104I8048h3206m5904j75312a2666C5578g9699
18661D3639a13912a8858k39805j12073D7139J1748a38086a5787j75108C63806
18650a37654B0790a27437m2316B08616C5030a23317k50038b1648A31268b95272
18639b14133h2878k96640a35655e5242k04041E3852c2697D4337b44602A90289
$$ plain form
18720 -69654 -416646 -195949 -19299 270911 94214 -5168 155736 43820 -291656 150958 -6519
18708 39097 -243914 -127196 52839 5862 -312097 -93709 129320 -199076 -141925 -103501 106812
18696 -6395 20747 312312 -15184 -182473 -158629 -19959 -144007 -179241 -153150 -194803 -253942
18685 -253942 -137045 48123 -253386 131259 -147909 -156104 -156769 -24191 -374123 91094 -10350
18673 60286 -154210 84130 62864 -91104 98048 -83206 -129110 -304422 -12666 35578 -79699
18661 43639 -113912 -18858 -258663 -370736 47139 58887 -138086 -15787 -190895 363806
18650 -137654 20790 -127437 -169753 208616 35030 -123317 -373355 -21648 131268 -295272
18639 -214133 -82878 -379518 -135655 -55242 -259283 53852 -32697 44337 -244602 190289
18628A7117a36185O3975K7841o655k42710K7101B89838j26541a11101j93858C2024
18616a91245J4589f099j87682B2968a07599M7250B35606i2905A47393b22393a741
18604b0496l26118i627A60033d27721i7958j07393k79084b05085C2679J89717
18594B22396i4174B26J6127J33003a15953j06324e3916D7939h4613c417j70163
18583a73580B01699c31681A12542a05525B2669a2631j1495j39623A3078c35660
18572a02561C91f2107E8999M00339b5163j62837A35949a09693A4425f6440a5707
18560c5489j95315Q5374A04467b88718B4163J57035a91129H433K3189N3489J06457
18549A91568F3611P264a24920D4104c1230H3930a83362A37547D2030g1075b3860
$$ plain form
18628 17117 -136185 -72210 -44369 -51024 -293734 -266633 289838 163297 -111101 -304959 32024
18616 -191245 -176656 -6099 -193781 22968 -107599 -60349 235606 -92905 147393 -222393 -1741
18604 -20496 -346614 -9627 160033 -427721 -97958 -205351 -484435 -205085 32679 222396
18594 222396 -94174 226 16353 149356 -115953 -222277 -53916 47939 -84613 -3417 -173580
18583 -173580 201699 -331681 112542 -105525 22669 -12631 -24126 -163749 13078 -335660
18572 -102561 391 -62107 58999 459338 -25163 -188000 135949 -109693 14425 -66440 -15707
18560 -35489 -230804 -145430 104467 -288718 24163 181198 -191129 8433 31622 85111 191568
18549 191568 63611 70875 -124920 44104 -31230 83930 -183362 137547 42030 -71075 -23860
18537g8106b6217E1107a45833M9420K0359A20285e638G4039P1881h8613C6444
18525a3036k94565A6157c54526I4264a682p5811j21317R1438A75921d4127I0114
18513A80671G6551J48193a88724I0085b53418a4986I884N6484O7798b58277g543
18501H0606k9138J13404R8213a01190J0450k15165G0301a08400j80537L2211G8446
18489B1340B771c30361o5117A32854c74515j40821B38480f4273k82708B24967
18478A59100o097a58099A85918A2836K4988a64802H0627B8970b8736j91155Q8695
18467a31196B21684a06332m4938O0237I6970K91176I5517b53140D6163d6058r6460
18456a42518B43421n1301h4595A56179c17295g7283M200l35625J89100C05b37164
$$ plain form
18537 -78106 -26217 51107 -145833 -96413 -76054 120285 -5638 74039 145920 -88613 36444
18525 -13036 -307601 16157 -354526 94264 -1682 -77493 -198810 -107372 175921 -44127 90114
18513 180671 76551 224744 -188724 90085 -253418 -14986 9884 66368 134166 -258277 -7543
18501 80606 51468 164872 263085 -101190 -90740 -305905 70301 -108400 -288937 -256726 78446
18489 21340 2771 -330361 -395478 132854 -374515 -515336 238480 -64273 -346981 224967
18478 159100 153003 -158099 185918 12836 37824 -164802 80627 28970 -28736 -219891 -131196
18467 -131196 221684 -106332 -151270 -91033 96970 388146 95517 -253140 46163 -46058 -142518
18456 -142518 243421 192120 -84595 156179 -317295 -77283 -73083 -408708 -219608 305 -237164
18444a8207j67718g7957D6851d5550q0540q524M2677A09582c15051F5073P0630
18433A35703B9924r810c163B69209j11401c301k35807C3070M9308c00660I8064
18421a5832j68996N154A27057e2209D39485i8826F4517O5090G271b17745A59823
18409i7847m0407D3022a18025D2004e11728K42845h5769M2318j08432A39669A7484
18397b56870R6206H254h5393C3694R181a13472N0690j32615D53758I709J16696
18386A26405a80541B63602a42665A89126n3246D095a30335O2366D8898k0116L21865
18375C50647c38070a49839e1438A42774c8484A16870m8698e7972j26096m8004
18365b32072k6799f5668C3255M25033j90810H9581d104j46341A37946a81843n2859
$$ plain form
18444 -18207 -185925 -77957 46851 -45550 -126090 -134614 -91937 109582 -315051 65073 135703
18433 135703 29924 20114 -3163 269209 157808 -3301 -239108 33070 82378 -300660 98064
18421 -15832 -184828 -179674 127057 -52209 439485 -98826 64517 129607 7271 -217745 159823
18409 -97847 -138254 43022 -118025 42004 -511728 -268883 -85769 -43451 -151883 139669 17484
18397 -256870 -160664 8254 -85393 33694 42875 -113472 -62782 -195397 453758 9709 126405
18386 126405 -180541 263602 -142665 189126 135880 4095 -130335 -67969 48898 28782 350647
18375 350647 -338070 -149839 -51438 142774 -38484 116870 68172 -57972 -184068 -232072
18365 -232072 -258871 -65668 33255 458288 267478 89581 -4104 -150445 137946 -181843 -234702
18354b34702G3960b98891a16231k4041O9399A33185a47667B654g2501L0581j65428
18343b07348A07553J5485d14393g5918H8028b59886M5869b7457k7016H969d8013
18331h9061A04611D0359Q1506b12968A02713h9323E7724a97130c1112F0914e8125
18319e5269k0603A80852c7760j45588g6900j01049N3480l7739a0420j49811M6905
18308a13326B56314A14406L6133a12509G4223a33959C27130A49891a72899c3576
18297a86136A23384i5042G2376a3892j69785K5696b9008l1341j36228M0534r172
18286a65215L6608a4611D6203J35834g379j93214C80966E7154c02392A67709c22828
18274C45210c51542B7896a25304c5224n4366J3659b5158F7619N4984R1323a69854
$$ plain form
18354 -234702 73960 -298891 -116231 -140272 -70873 133185 -147667 2654 -72501 -41920 -207348
18343 -207348 107553 123038 -414393 -75918 88028 -259886 -214017 -27457 -54473 8969 -48013
18331 -89061 104611 40359 121865 -212968 102713 -89323 57724 -197130 -31112 60914 -58125
18319 -55269 -75872 180852 -37760 -183348 -76900 -177949 -124469 -162208 -10420 -160231 -113326
18308 -113326 256314 114406 150539 -112509 74223 -133959 327130 149891 -172899 -33576
18297 -186136 123384 -95042 72376 -13892 -183677 -157981 -29008 -60349 -196577 -156043 -165215
18286 -165215 -128607 -14611 46203 182037 -7379 -200593 380966 57154 -302392 167709 -322828
18274 345210 -351542 27896 -125304 -35224 -89590 -75931 -25158 67619 122603 213926 -169854
18262a46684O3967b136l55017A65692g8793l55694A16043B7455M2716k8364a25790
18250E3692a82217A21380k7804a10787J8515j13123I7324J89740j36452a04610
18239a65449B31432f181A67164K1929d8208q1756f3230g839C12254a8139E827
18227a39643H0008h988B8808R5588d3392C9820J39132l1665m8873C7328a04015
18215B99316A42835b33051B16418h097l06199C19087d1039l8414r3811d4199j13242
18204a57441l7039I6293c02018A82966j4063a80797e3326B5976f8140K4756B16388
18192g5142j34485A58073N5085c4540l9488B34124H632b9723k2934p704J6931
18181d3430B5992Q6581m5347h7725K1637D20403d22857A40879M8819F5933b8791
$$ plain form
18262 -146684 -82717 -2136 -357153 165692 -78793 -434487 116043 27455 70171 41807 -125790
18250 53692 -182217 121380 93576 -110787 -92272 -205395 97324 287064 150612 -104610
18239 -165449 231432 -6181 167164 189093 -48208 -129964 -63230 -7839 312254 -18139 5827
18227 -139643 80008 -8988 28808 124396 -43392 39820 178952 147287 98414 37328 -104015
18215 299316 142835 -233051 216418 -8097 -314296 319087 -41039 -79453 -173264 -44199 -157441
18204 -157441 -194480 96293 -302018 182966 168903 -180797 -53326 25976 -68140 -43384 216388
18192 -75142 -209627 158073 213158 -34540 -74028 234124 8632 -29723 -52657 -60361 -43430
18181 -43430 25992 112573 67226 -87725 -66088 420403 -422857 140879 189698 65933 -28791
18169a45716L6405B07638c02105J12361B6311f6770k39198B3590O0978a97131
18158H5424J04014a14795A64686l3452J494e3063F6738a24424j02431G712b27548
18146a03574A60611c16185r5392A60876a48362b7396Q0m1452H0913K50827a0328
18134b1333C280a00410A85285q2847R512R5541a15560j61951a6659j27821M0757
18123a03723D35621A58641F5946A3035J37586e8296H046J19723b91451h7504A77260
18111F8487l068e9729B55465b10745M5192b21C8962j2807c54098H7350a62861
18099D4902b64313J14268A18863c51140a13683C16346A27409a14750K2694D2658
18088b64045f0451A36065P978g32l0567k56038N856I8899D7506K18285p7014C2753
$$ plain form
18169 -145716 -109311 207638 -302105 -189744 26311 -66770 -305968 23590 84568 -197131
18158 85424 189438 -114795 164686 131234 132728 -53063 66738 -124424 -226855 7712 -227548
18146 -103574 160611 -316185 -411577 160876 -148362 -27396 -27316 -68768 80913 331740 -10328
18134 -21333 3280 -100410 185285 102438 111950 207491 -115560 -277511 -16659 -144480 -103723
18123 -103723 435621 158641 65946 13035 150621 -58296 8046 127769 -291451 -87504 177260
18111 68487 65419 -59729 255465 -210745 -165553 -221 38962 26155 -354098 87350 -162861
18099 44902 -264313 -150045 118863 -351140 -113683 316346 127409 -114750 -92056 42658
18088 -264045 -60451 136065 144043 -732 -31299 -287337 -281481 98899 47506 265791 188777 32753
18075a52252m1402M8069B49682p5977B2260a41239A44690g988k7244F5993d882
18063i3547I2823a14184k5922A67808a22514K0837j69930I8581N9195J0814b85538
18051b37552j23849D6826J71451b00061C23599j10555h6644J1169B115e73232
18040A76079F7574N2558N0663M8766M9185F4240J43114a24331F6274d7924j79776
18029b27700o0288A09602j2183N1394A6820J24955J33740E0080J32894n1079a62071
18017a78994j77533G3823K54302f99917A93477J64927b22693C9179a92894q1771
18007b74665a30202q5458B8250K13750b8216k02666B46802A01185d5031o5204
17997a10235o3203E3898N5046a18667A45337h1498A71523G8773J38400r396K7727
$$ plain form
18075 -152252 -193654 -145585 249682 173705 22260 -141239 144690 -7988 -35232 65993 -4882
18063 -93547 92823 -114184 -140106 167808 -122514 -101677 -271607 98581 157776 168590 -285538
18051 -237552 -361401 46826 218277 -200061 323599 213044 -86644 -75475 2115 -573232
18040 176079 67574 120132 170795 219561 268746 64240 207354 -124331 66274 -47924 -227700
18029 -227700 -287988 109602 97419 148813 16820 141775 275515 50080 182974 131895 -162071
18017 -178994 -356527 73823 328125 -699917 193477 358404 -222693 39179 -192894 -274665
18007 -274665 -130202 -215660 28250 242000 -28216 -230882 246802 101185 -45031 -110235
17997 -110235 -173438 53898 108944 -118667 145337 -81498 171523 78773 217173 207777 235504
17986B35504I1548C5200N1682a86575B05971h6600A10420f7005j27148i2978B17517
17974G4875k0307c3429A05041b19813I3594R7268a0463B4380r011b73177D4533
17962f4289q4887I9128J1587B6035b350B04294B4753a28041b8037A99045A8273
17950b4266r1843A89342n4980d1879C49501a1165A52776J7800b24747A99504a93943
17938b83611J37954m878A48418a2357H7050K7675E5336K21230g5252b6958j49576
17927a76534I8592a61821d1453j93789B24952l9018c7514D2655J53690k0248C512
17915b05235A48719c2500C08263h1360f145k7945D5898J77360c10488A65321a67404
17903e915k02752i1303A38290f5806G9718P7031i9153D2335J52751F9586c37913
$$ plain form
17986 235504 91548 35200 86882 -186575 205971 -86600 110420 -67005 -194153 -92978 217517
17974 74875 54568 -33429 105041 -219813 93594 190862 -10463 24380 15369 -273177 44533
17962 -64289 -149176 99128 110715 26035 -2350 204294 24753 -128041 -28037 199045 18273
17950 -24266 -116109 189342 134362 -41879 349501 -11165 152776 170576 -224747 199504 -193943
17938 -283611 -145657 -150535 148418 -12357 87050 114725 55336 276566 -75252 -26958 -176534
17927 -176534 98592 -161821 -41453 -235242 224952 185934 -37514 42655 196345 176097 3512
17915 -205235 148719 -32500 308263 -81360 -6145 -34090 45898 223258 -310488 165321 -167404
17903 -5915 -208667 -91303 138290 -65806 79718 156749 -99153 42335 195086 69586 -337913
17891a28005B35043d1410D45429B07189H7167a37804e4221G8525R4669o2334M8790
17880A59650J02036a11148A26113n7554L9431J91899a00049J6699C2440b1724
17869g3082B3122h7653j49319A45783O8643J13731H6601d9921I2860F555h0299
17857i1112q938A47632H164P2538L5812b05105G0299b16217A42589b97423A58681
17845a25544A16013c02061D3579J53819b63726A76213P3688p6796h1078o4857
17835a45935j67533C87703j86278F5525J21060a11356A0980K9490A2047L29965
17825C42012a50411p5920e0000A78166d8865C8019L3452J18068r1150a68538J2143
17814a56395O8256b7030I7019i161C13707e6635A5507K24520b26678G762A266
$$ plain form
17891 -128005 235043 -41410 445429 207189 87167 -137804 -54221 78525 173194 110860 159650
17880 159650 261686 -111148 126113 68559 107990 299889 -100049 -83350 32440 -21724
17869 -73082 23122 -87653 -236972 145783 214426 328157 86601 -49921 92860 6555 -80299
17857 -91112 -100050 147632 8164 80702 116514 -205105 70299 -216217 142589 -297423 158681
17845 -125544 116013 -302061 43579 197398 -263726 176213 249901 173105 -81078 -145935
17835 -145935 -313468 387703 201425 65525 186585 -111356 10980 40470 12047 342012
17825 342012 -150411 -226331 -50000 178166 -48865 38019 71471 189539 98389 -168538 -156395
17814 -156395 -88139 -27030 97019 -9161 313707 -56635 15507 240027 -226678 7762 1266
17802c0939A51978o3229b48896B2139i824k28685A03275a08082B5992b14433C6379
17790C32017H9228K58394j13922r5066l6277J02400N5547a02368A9548d76174
17779A41513L385a39733A27790N6857f7503l937n4760B68798e0106j67480F1227
17767C08052b01817A8689d8767B79K5856J17836a43228A73103a5980A65824Q2113
17756B47937L8704j03461a3368H802a11246N4226B43324J16777B3635M6023c01439
17744b23299A14130K3275c49574a63565q9442B65096C8867J82917b0030A55722
17733A72873a43725j75729h0989P404K7634j60856j16069B19138E3826P4223a37484
17721a69759A14780B3320a04644C48239j33231J29339j45293o8775m5581J24036
$$ plain form
17802 -30939 151978 88749 -248896 22139 -9824 -238509 103275 -108082 25992 -214433 36379
17790 332017 89228 347622 233700 138634 102357 204757 260304 -102368 19548 -476174
17779 141513 144898 -139733 127790 184647 -67503 -71440 -126200 268798 -50106 -217586 61227
17767 308052 -201817 18689 -48767 279 26135 143971 -143228 173103 -15980 165824 247937
17756 247937 286641 183180 -13368 8802 -111246 -57020 243324 360101 23635 69658 -301439
17744 -223299 114130 137405 -349574 -163565 -253007 265096 38867 221784 -20030 155722
17733 172873 -143725 -319454 -80989 -73585 -45951 -206807 -322876 219138 53826 128049 -137484
17721 -169759 114780 23320 -104644 348239 215008 344347 199054 130279 84698 208734
17711B08734J09454E7436J38443H9226a9734G9958K80504I7401I942R8110J97715
17700C05767e3415B70799j13957o2068a58074d248F888J11891E7673J66678B6257
17688d8007B43005c5500j36868I5156N70289e7086A18723b11445l8456K5740C6655
17676C52146A06223H959L4335K06851m4289J15223a08787B35956f7179A6533K23470
17665B40003b69738B01496d4732q9738A30884N8440I804P9284J07972m1104J46879
17654C02835G229i1869A72443K36889b3510B42822f7089A09547B5710J90057r2007
17643A23760l6404K44078J72131A38520a0004C16728M3294D6491k317O0244J17374
17632B21792c2211j26614B51247B9844J78901F7579J88590e8150A6922L09063
$$ plain form
17711 208734 318188 57436 195879 89226 -19734 79958 360462 97401 9942 108052 305767
17700 305767 -53415 270799 156842 94774 -158074 -4248 6888 118779 57673 224351 26257
17688 -48007 243005 -35500 -172368 95156 665445 -57086 118723 -211445 -249901 -224161 36655
17676 352146 106223 8959 43294 250145 205856 321079 -108787 235956 -67179 16533 240003
17665 240003 -269738 201496 -44732 -134470 130884 189324 9804 89088 197060 155956 302835
17654 302835 7229 -91869 172443 409332 -23510 242822 -67089 109547 25710 215767 123760
17643 123760 87356 331434 503565 138520 -10004 316728 360022 46491 44174 104418 221792
17632 221792 -32211 -158825 251247 29844 208745 67579 256169 -58150 16922 325985
17622C25985j04147A4673J37449R3619H8736j3788A5080O9964h4924I5563k3937
17611G1626N6239b08228c6476B04674R2367A7542a76571G2074a62125D03769P4838
17600D78607j84695E8958M2949l7511b62917C45058m2186Q4855A25425f3816H8488
17588G0238a08124B78016A0062D390b7199A95290e0046b1503A66778J71775F7717
17576A36166b7152A20529e8283B33994Q3377E1346g868B60547E1200c0501C80235
17564a33130A19644a04765F1474K28381a75132O6166F7656e3154D11123M1491
17554D52614A92211a22767C17927F0962a25071B29875a13210F8038K56822C8530
17543B42439I9319k4265L2935K92320j13303F2939L57806I5600K38529M1183A00741
$$ plain form
17622 325985 221838 14673 152122 245741 88736 74948 15080 85044 -84924 95563 71626
17611 71626 127865 -208228 -36476 204674 297041 17542 -176571 72074 -162125 403769 478607
17600 478607 293912 58958 101907 64396 -262917 345058 302872 387727 125425 -63816 88488
17588 70238 -108124 278016 10062 4390 -27199 195290 -50046 -21503 166778 338553 67717
17576 136166 -27152 120529 -58283 233994 317371 51346 -7868 260547 51200 -30501 380235
17564 -133130 119644 -104765 61474 289855 -175132 -108966 67656 -53154 411123 452614
17554 452614 192211 -122767 317927 60962 -125071 229875 -113210 68038 324860 38530
17543 242439 99319 75054 107989 400309 287006 62939 420745 95600 334129 375312 100741
17531c9492E5128O47464B08800M9002o9429J36839A05870e575F1879a29294A23645
17519C48828J03G8363L23699A74623J4961m4505M88553B54820N02591o9339l7030
17508F51042J25992N6159l4990j91650j73308J39530k24272j59474M65672C18525
17497C23552P4354Q5661M7638L89747j08185P3135o0390J05290r8373l41701A21988
17485C96900N5327A46098J46424n6504M23113k79662n6186j12809O1317J61826
17475D33617j75613K3709K0065N9973j28731R6564M58627A51519P3792J30963
17465C56274J15329j80979R039j7749J48336J341A20822N2606J53657j12142O0826
17454B75769A01534M5447J32436J45254H4426J13845J99739A82436K06619A37996
$$ plain form
17531 -39492 55128 702592 208800 257802 188373 325212 105870 -5575 61879 -129294 123645
17519 348828 348931 78363 402062 174623 189584 145079 633632 254820 757411 688072 651042
17508 651042 777034 833193 798203 606553 433245 572775 348503 189029 654701 318525
17497 323552 397906 483567 531205 920952 812767 885902 825512 930802 832429 490728 121988
17485 396900 452227 146098 292522 236018 659131 379469 323283 210474 271791 433617
17475 433617 258004 281713 301778 361751 233020 329584 788211 151519 225311 356274
17465 356274 471603 290624 299663 281914 430250 431591 120822 173428 327085 214943 275769
17454 275769 101534 146981 279417 424671 84426 198271 398010 182436 389055 137996
17443C64922J69581A91875M7362j09067M98778k39480j1379j2918j5960A73461
17432D54918J73420k15688k4111A67428J17432J05068N2854O473B04266o405r3413
17421A04448M27654B56434R3858M7546A28637K7187J61744A16261O261P8685K41251
17410D42458j43900j3507j34378K28874R5500B18021L1008L56330j27406j58195
17400C19758K67772j99541L7221A98014c0587F4247L59249A59228J07438J486
17390B68152m6163J81532j3312K12190d3425B28842L33058D2229K64669q478A44747
17378C07364r6146p7525L18255p544A37034J15626Q3198a9339F9383J49488J08923
17367C27794K17542r8166j62673A12011j9443J69603j10325C8924K45530j26054
$$ plain form
17443 364922 534503 191875 239237 130170 628948 389468 378089 365171 349211 173461
17432 454918 628338 412650 388539 167428 284860 389928 442782 449255 204266 197861 104448
17421 104448 532102 256434 350292 397838 128637 155824 317568 116261 122522 201207 442458
17410 442458 298558 285051 150673 379547 475047 218021 249029 605359 477953 319758
17400 319758 587530 387989 425210 198014 -30587 64247 423496 159228 266666 268152
17390 268152 221989 403521 390209 602399 -43425 228842 561900 42229 306898 298420 144747
17378 307364 211218 133693 451948 444404 137034 252660 335858 -19339 69383 218871 327794
17367 327794 545336 447170 284497 112011 92568 262171 151846 38924 284454 158400
17357A58400P7503E1221L43450j92103A3719K20116K1538c91758D61449A29319
17346C84016C0473O4351b7888G4716M6679P5036m6960J21396K0190a87557B85376
17334E13071A73473K59339j84879J4765A03348i6546B41611j6657F8847K29910
17324B98757b21354d4573F1747K66001K48147j92599I7543J8114a7931A9077J20136
17313A39213k1985P7928F7979K81404I1620Q6826K0711K66826K4907n7890k05438
17302B27562L8j1124E313K4548K60071o9896j7500N3666L4896N3330R4445j85154
17290B53719r5483p1213J42935K12137j26446K21546j27954g7436B3120K34229
17280B57349i2594D76498J23297b3158B10662R3863O3827j43208F5287K28781
$$ plain form
17357 158400 235903 51221 394671 202568 13719 233835 255373 -391758 461449 129319
17346 384016 30473 94824 -27888 74716 121395 196431 149471 270867 291057 -187557 285376
17334 513071 173473 432812 247933 262698 103348 -96546 241611 224954 68847 298757
17324 298757 -221354 -44573 61747 327748 575895 383296 97543 115657 -17931 19077 139213
17313 139213 117228 195156 67979 349383 91620 178446 199157 465983 490890 433000 227562
17302 227562 227600 216476 5313 29861 289932 220036 202536 256202 291098 344428 438873 253719
17290 253719 158236 87023 229958 442095 315649 537195 409241 -77436 23120 257349
17280 257349 -92594 476498 599795 -23158 210662 304525 368352 225144 65287 294068
17270B94068A28015J13144K2230A23123J94773n7489H9117L92434j63183j35537
17260A82831C4132O92387E1700L83342J9326l9194j82908J11168A33252K68720
17250D01972o680I9629K95195j85098N3428K7584J45891j0275j94075R0641E2959
17238E98574B03352J32083r0258K71854j52524R6724j24457M8113j82020d255
17227C78216A67932J31073K6537q6960m7296N00651A73519K35850j18616N5394
17217C46147j14408A13358M44630k65600K25620j73311q4957M2747N8145j68861
17207A91771J02964L86655C25858l6908J45393p9097L27509B90731K11003B36875
17196D43404j35893J87854j3456B33428Q3367j22310q2990K98742O4448k27089
$$ plain form
17270 294068 128015 241159 263389 123123 317896 260407 89117 481551 318368 182831
17260 182831 34132 726519 51700 435042 454368 415174 232266 343434 133252 401972
17250 401972 395292 99629 394824 209726 263154 290738 436629 426354 232279 322920 52959
17238 598574 203352 335435 245177 517031 364507 461231 336774 384887 202867 -4255
17227 378216 167932 299005 325542 238582 191286 691937 173519 409369 290753 346147
17217 346147 231739 113358 557988 292388 518008 344697 259740 302487 360632 191771
17207 191771 294735 681390 325858 288950 434343 355246 682755 290731 501734 236875
17196 443404 307511 495365 481909 233428 316795 194485 111495 410237 474685 247596
17186B47596J07087J8549k2438m1543J62232l6808b5475C70422J83103A33035
17175C16927K05457P7739A26379K15015j02471K3255K36534O5039J43497j27295
17165E79953N9686l13657L6622N255K3109L45720k42718J54694A50541J61275
17155C11816A26398M66048J0606k83564M9199M24210C62521J77750j9828J00775
17145F21218J25964j47564M3870k42463L10811l16138L18499k74104K28223A79886
17134C85605j3087M2236K83327j05734L3344k69708K5325M50572l46300q6965
17124C98615L17496j09974L27707l93799J46539k75221j37711M36033C40035K27781
17114E67816L3669j25724J09288J08913q1710q0101J0845N9584o9779n3481j2847
$$ plain form
17186 247596 354683 373232 350794 309251 471483 434675 -25475 370422 553525 133035
17175 316927 522384 600123 126379 341394 238923 262178 498712 563751 707248 579953
17165 579953 639639 325982 362604 367859 390968 736688 493970 648664 150541 311816
17155 311816 126398 592446 603052 319488 368687 792897 362521 540271 520443 621218
17145 621218 747182 599618 643488 401025 711836 395698 714197 440093 668316 179886
17134 385605 372518 414754 698081 592347 625691 355983 381308 831880 485580 398615
17124 398615 716111 606137 933844 540045 686584 411363 273652 709685 340035 567816
17114 567816 601485 475761 585049 693962 612252 532151 542996 602580 532801 479320 466473
17103D66473K4042O1053J1121L8657j46705m6949K50521k25884J10672J88280
17093G31281j09351R7148R0486j91093L13927l79142J62460m1228l32955M10055
17083G51588l39872R412L60347l51913M96117l15247k45132r3273L51141J0318
17073F33486R7216j0700j08948q1941O6721J25107n610R7819l08174L21135l9114
17062G86997l3046K54028k95165L00398C35310J92831K33360k67412J30370K6923
17052F51382l6991k6507L6727J43704m4678J57124l01148J50471K20269D55753
17041A006594l99113J90233K0750J04511J23415n5428m10323M37856l73164Q1832
17031G27163J23708l7658l6217j62101J64750K19181M61062o27786J32100p1888
$$ plain form
17103 466473 490515 551568 562689 601346 454641 407692 658213 432329 543001 731281
17093 731281 621930 719078 809564 618471 932398 553256 715716 674488 341533 751588
17083 751588 411716 421128 781475 429562 925679 610432 365300 272027 623168 633486
17073 633486 730702 720002 611054 529113 595834 720941 715331 813150 504976 826111 786997
17062 786997 753951 1007979 712814 1013212 335310 528141 761501 494089 624459 651382
17052 651382 614391 587884 624611 768315 723637 880761 579613 730084 950353 455753
17041 1006594 607481 797714 818464 922975 1046390 990962 580639 1018495 645331 727163
17031 727163 850871 813213 776996 614895 779645 998826 1459888 832102 964202 892314
17021H92314J26479N2928j30247j67582j1409J71331q2205j10646l5017M55234
17011A161180k72633m4083j5134J79820P5869k26814R4237L2068k52881J78269
17001I09898J2228K44790n3729j65649K72001l48680J4187r7210J30136R6003
16991A013975j73306Q2534k32063M93666J25924k54458j55762K64174j71951K58950
16981A251683N4991j68593j04488K65166j07660k48088K31192J59612n369K78933
16971A607379j16446j75372J71776k84279M2390k65967J46828K75554k01038K2234
16961A223059M6748n7421Q4787k44703L48713j62911m5432J34704J58299k57014
16951A228829K29054j03247R3481k84033K56593J31390k05918J19826j6203j69789
$$ plain form
17021 892314 1018793 1071721 941474 773892 762483 933814 851609 740963 705946 1161180
17011 1161180 888547 844464 829330 1009150 1085019 858205 952442 984510 731629 909898
17001 909898 922126 1166916 1113187 947538 1219539 870859 885046 787836 917972 1013975
16991 1013975 840669 923203 691140 1184806 1310730 1056272 900510 1164684 992733 1251683
16981 1251683 1306674 1138081 1033593 1298759 1191099 943011 1174203 1333815 1328446 1607379
16971 1607379 1490933 1315561 1487337 1203058 1245448 979481 1126309 1401863 1200825 1223059
16961 1223059 1269807 1212386 1297173 1052470 1401183 1238272 1192840 1327544 1485843 1228829
16951 1228829 1457883 1354636 1448117 1164084 1420677 1552067 1346149 1465975 1449772 1279983
16941A279983N0596K70482o675J56001l05494Q5589k00924L72633l18761L04011
16931A687441j63122J27485J68309K68512n09038Q6024J73744R335K85534l34414
16921A799810j96160N5702J79437J33650N3179k89715K8482J81599J772m11870
16911A535886L63231L00359k25758L96609j73112j10978j51681R8174J47915k06269
16901A974376L28854l8056L2520N2946q753J38057j30012k26526K64114l20751
16891B066769J72311J45385L63108K3789m05420K27474m8510J91244j84119L83858
16881B935889j36018j10014j3629j63443L47283k58460k4682L93718o484K16082
16871C180242j96904q0162m2272M43390N5941k50493J63823K08664j80062P4123
$$ plain form
16941 1279983 1330579 1601061 1594386 1750387 1444893 1530482 1329558 1702191 1383430 1687441
16931 1687441 1524319 1651804 1820113 2088625 1579587 1665611 1839355 1848690 2134224 1799810
16921 1799810 1603650 1659352 1838789 1972439 2025618 1735903 1764385 1945984 1947756 1535886
16911 1535886 1899117 2199476 1973718 2370327 2197215 2086237 1934556 2032730 2180645 1974376
16901 1974376 2303230 2265174 2297694 2350640 2341887 2479944 2349932 2123406 2387520 2066769
16891 2066769 2239080 2384465 2747573 2771362 2365942 2593416 2544906 2736150 2552031 2935889
16881 2935889 2799871 2689857 2676228 2512785 2860068 2601608 2576926 2970644 2964160 3180242
16871 3180242 2983338 2903176 2860904 3304294 3360235 3109742 3273565 3482229 3302167 3376290
16861C376290k6044O11183n56304j94772M11950j76629M65331j19750p7832L47921
16851D061344l03432J05233K94469k55346K12345j94287J57151J60658j46647
16842D091488K46008j35383O03255j52795R4376j19360N13462M9403k66998L3048
16832D956504n4765R6116J57746J51154J27151K77361k9906r7079K18321K77225
16822F079828j62131M7158L3112P5416L38511J29016k06190M89426j16654N5417
16812F762909J82051j32155L44603K15999j5973P7691J037351k97677K35218J05430
16802H515447q1469J72248J41224N99102j42169k2299N33014Q3523M78367L37985
16792A0614973p4857J87336J62006N45818j90407N90891k1068N93329k22315N24035
$$ plain form
16861 3376290 3350246 3961429 3405125 3210353 3622303 3445674 3911005 3791255 3713423 4061344
16851 4061344 3757912 3863145 4157614 3902268 4114613 3920326 4077477 4238135 4091488
16842 4091488 4337496 4202113 4805368 4652573 4746949 4627589 5141051 5190454 4923456 4956504
16832 4956504 4901739 4997855 5155601 5306755 5433906 5711267 5681361 5584282 5802603 6079828
16822 6079828 5917697 5964855 5997967 6073383 6411894 6540910 6334720 6824146 6707492 6762909
16812 6762909 6944960 6812805 7157408 7373407 7357434 7435125 8472476 8174799 8410017 8515447
16802 8515447 8433978 8606226 8747450 9346552 9204383 9182084 9715098 9798621 10276988 10614973
16792 10614973 10540116 10727452 10889458 11435276 11244869 11835760 11814692 12408021 12185706 12709741
16782A2709741L71875J68155O55211j45140P96066L8057P57872L92171K66210
16773A6010218L06765L35375P82483N56700J51122O18269M50138O26619M79516
16764B0317205J016340K98814O75489O95752P79162R25470O67095M85827J280541
16755B7141695P54184J023699R38133J184695R94850J065976J410617J227104
16747C5740953J125560J542372J619721J116158J515636J536898J814393K009450
16739D8021141J788410K130832K168926K229247K215847K346679K883316K846559
16731F6630957K643444K988558L169036K818104L293653L456208L514646L581424
16723I2096030L706604L487482L641269L675710M051235L800514L617849L503941
$$ plain form
16782 12709741 13081616 13249771 13904982 13759842 14555908 14593965 15351837 15744008 16010218
16773 16010218 16316983 16652358 17434841 17991541 18142663 18760932 19211070 19837689 20317205
16764 20317205 21333545 21632359 22307848 23003600 23782762 24708232 25375327 25861154 27141695
16755 27141695 27895879 28919578 29857711 31042406 32037256 33103232 34513849 35740953
16747 35740953 36866513 38408885 40028606 41144764 42660400 44197298 46011691 48021141
16739 48021141 49809551 51940383 54109309 56338556 58554403 60901082 63784398 66630957
16731 66630957 69274401 72262959 75431995 78250099 81543752 84999960 88514606 92096030
16723 92096030 95802634 99290116 102931385 106607095 110658330 114458844 118076693 121580634
16715A21580634L258426L309142K473648K870885K009405K148666J436329J327785
16707A40414920P56446M85047m31888q44230j106479j153123k308495k154229
16699A33657969k876665k745888l257979l509531l121374l989107l785360l639768
16691A06732297l700613l715061l987061l351628l718426l445111l628165k926320
16683G8259912l551792k585168l647018k350198k819759k590484k755169k239698
16675E5720626k371741j983317k438164j716308j861118j802958j697575j468949
16667D0380496j903936j252300j337458j720377p90517j407857r76985j350431
16659B9640635o97173r66624j045908q76384q16999q88469p07007q91447o99202
$$ plain form
16715 121580634 124839060 128148202 130621850 133492735 135502140 137650806 139087135 140414920
16707 140414920 141171366 141656413 141224525 140380295 139273816 138120693 135812198 133657969
16699 133657969 130781304 128035416 124777437 121267906 118146532 114157425 110372065 106732297
16691 106732297 103031684 99316623 95329562 91977934 88259508 84814397 81186232 78259912
16683 78259912 74708120 72122952 68475934 66125736 63305977 60715493 57960324 55720626
16675 55720626 53348885 51365568 48927404 47211096 45349978 43547020 41849445 40380496
16667 40380496 38476560 37224260 35886802 34166425 33375908 31968051 30991066 29640635
16659 29640635 28943462 27976838 26930930 26054546 25237547 24349078 23642071 22750624 22051422
16650B2051422l78240r21156l55119p93589n27403o45540l16758m48607o41071
16641A7023939l98563n01433p00418J73o00217l54039n19578l76193k05139n76893
16631A2791639L02941o97799m72860m2018l45238l90441j53786k1796m61645O8424
16621A0577421l40892l48336l32248k22927l36918M42122p93105J12643l2983
16612H724777k17978l42636m8477k30418l48420K42428m31932O0720m25565k00577
16602F781922k44607J40481Q872r8043k5288J84077n93079Q3869j40230k03169
16592E894805k42372j58438q0002J3293k78274J84272j01739j10153l12254L90855
16582E199993j79565k07617J48966j45372n90317O82661m98280J2876K88300o64249
$$ plain form
16650 22051422 21673182 20752026 20396907 19603318 19075915 18430375 18113617 17665010 17023939
16641 17023939 16625376 16123943 15423525 15423698 14823481 14469442 13949864 13573671 13368532 12791639
16631 12791639 13094580 12396781 11923921 11881903 11536665 11146224 10992438 10970642 10508997 10577421
16621 10577421 10236529 9888193 9555945 9333018 8996100 9438222 8645117 8757760 8724777
16612 8724777 8506799 8164163 8115686 7885268 7536848 7779276 7347344 7408064 6982499 6781922
16602 6781922 6537315 6677796 6686668 6588625 6563337 6747414 6154335 6238204 6097974 5894805
16592 5894805 5652433 5493995 5413993 5427286 5149012 5333284 5231545 5121392 4809138 5199993
16582 5199993 5020428 4812811 4961777 4816405 4226088 4908749 4410469 4423345 4711645 4047396
16572D047396j90027L8998K46616k00862J91709R743j85850P8189m94263L32847
16562C874496k58439N8757q2544k30526K26918k55753M5109K96322k31791r3620
16552C348929j53760j21448K20680l9214k86690p7245J46075p3482k44912k9040
16542B689893K95349n7187k61749j09266J22397K06174l85647R9343j59735J00756
16532B540328k45581M8376M16200m21589J27072K02163J4538k31387J14970k92854
16522B272236j80755k8356J45907K44808j66579m0134k87306N31387m73192J49218
16512B167234k08449j34225K7027J75198j57745k88133M17929k81295J53604p0778
16502A800367L6495j83417K78120M8952l45879J45554P0597k12576l04727K53123
$$ plain form
16572 4047396 3857369 3896367 4142983 3942121 4133830 4143573 3957723 4035912 3541649 3874496
16562 3874496 3616057 3674814 3592270 3361744 3588662 3332909 3378018 3674340 3442549 3348929
16552 3348929 3195169 3073721 3294401 3255187 2968497 2891252 3037327 2963845 2718933 2689893
16542 2689893 2985242 2928055 2666306 2557040 2679437 2885611 2499964 2599307 2439572 2540328
16532 2540328 2294747 2343123 2759323 2337734 2464806 2666969 2681507 2450120 2565090 2272236
16522 2272236 2091481 2063125 2209032 2453840 2287261 2247127 1959821 2491208 2018016 2167234
16512 2167234 1958785 1824560 1851587 2026785 1869040 1580907 1998836 1717541 1871145 1800367
16502 1800367 1836862 1653445 1931565 1980517 1634638 1780192 1850789 1638213 1333486 1586609
16492A586609J61816k6807r8376j34846K59731l92276N92814m64575J18383n5855
16482A546618J20221K6364k6356J15111l78863k05528J62295O3997p9217j52133
16472A192509K49904P5535j5871l50576J74408K0741j74011K43013l2292N0784
16462A434144l17157J56072j21232N1417Q7244j97267k8847L03899j10498k81253
16452I76522M64726k26761m8274J32710o9029j04651p1235Q0081J66511k20996
16442A079604J52637J99998k35265r8408Q7958l66265K28407j49789L90230q3639
16432A205468K0850n72196L54353P0154l15431Q0251L03224l64280M42860j03359
16422A121894j83725M51932F84694L35995K28451l11692J76604j05438k76257
$$ plain form
16492 1586609 1748425 1721618 1623242 1488396 1748127 1355851 1948665 1484090 1602473 1546618
16482 1546618 1666839 1693203 1666847 1781958 1403095 1197567 1359862 1423859 1344642 1192509
16472 1192509 1442413 1517948 1502077 1151501 1325909 1346650 1172639 1415652 1383360 1434144
16462 1434144 1116987 1273059 1151827 1203244 1290488 1093221 1064374 1368273 1257775 976522
16452 976522 1441248 1214487 1166213 1298923 1229894 1125243 1054008 1134089 1300600 1079604
16442 1079604 1232241 1432239 1196974 1098566 1186524 820259 1048666 898877 1289107 1205468
16432 1205468 1226318 654122 1008475 1078629 763198 843449 1146673 782393 1225253 1121894
16422 1121894 938169 1390101 684694 1020689 1249140 937448 1114052 1008614 732357
16413G32357M52740j66537L82139l85802j54755J53091o5103M0509j55406K35098
16403A068331j64579N2817Q7732j91935C21936Q15738m72262l454C11053O33956
16393I45009K19448m10102j09646K47448P8748n9181l8384q1866k92731M86772
16383I85515k11857k63930K82793L08936l63240j20996K67904l0098C55623J23396
16373D79019J63169l2530P6211J15890M0753k77j47831k98978N13462j74201Q5525
16362H20212k55702j4478j11050J64229N04596k03307j12161l4521K65456k50814
16352G72460K32268n4736D61226R8431K69650k68823j11935p84K79555J57642
16342H84962j38861j8428k20562n9093q785L4721K08632k7416j65981K215L6266
$$ plain form
16413 732357 1185097 1018560 1400699 1014897 860142 1013233 948130 988639 833233 1068331
16403 1068331 903752 956569 1044301 852366 321936 1137674 665412 661958 311053 945009
16393 945009 1164457 754355 644709 892157 970905 911724 873340 791474 498743 985515
16383 985515 773658 509728 792521 1101457 738217 617221 885125 855027 355623 479019
16373 479019 642188 609658 685869 801759 842512 842235 694404 395426 908888 734687 820212
16362 820212 564510 550032 438982 603211 1107807 904500 792339 757818 1023274 772460
16352 772460 1004728 949992 461226 559657 829307 560484 448549 447765 727320 884962
16342 884962 746101 727673 507111 448018 439233 473954 682586 655170 489189 491404 527670
16331E27670j70441K19017j40339p9958O2633J53936r3030q100J72547j34397
16321E09538J64494l21250J45809J10713j4841k81901N5380K49111k71723K60864
16311F06194j59085q7416J08447j93206N44321l03239J14816j42063B13705M61271
16301F74976k47485Q771q9781K29408L00515j14494l54592O2486K58984p2004
16291F56784R1847j64864j89746p4470l9603M22414A26420N54580k39201M03901
16281H45700k67805K4209r0913B01104K55043M7728o1569Q5730p0846m788M3750
16270D96152M6299m7857Q2721B87717J69984J67190k1537k26625p5540L98430
16260F99619n8871B37038N02765H37L95090J07525j82827J28703J38427j69573
$$ plain form
16331 527670 357229 576246 435907 355949 418582 572518 479488 471388 643935 509538
16321 509538 674032 352782 498591 609304 594463 312562 367942 617053 345330 606194
16311 606194 447109 359693 468140 274934 819255 516016 630832 488769 213705 674976
16301 674976 427491 436262 346481 575889 876404 761910 407318 469804 728788 656784
16291 656784 748631 583767 394021 319551 279948 702362 126420 681000 441799 845700
16281 845700 577895 602104 511191 201104 456147 503875 442306 528036 457190 452402 496152
16270 496152 542451 494594 577315 287717 457701 624891 603354 376729 301189 699619
16260 699619 640748 237038 739803 837 395927 503452 320625 449328 587755 418182
16250D18182D5328L92573q2644K56653k01202J61446k07144K47285k79713J57119
16240D89701A91801H5902L12277K32651B76142O6154P0798O78K31072k43884q009
16229C92951J63152A95215D3980L96950m2723A94668K25009p2594J351J17047
16219D65481A24494k9206J57709K84637j43097l1353M1061K59004j82807j8140
16209D62302l6870K0460A23180O40661B75368J19964j11280L3875J06804j68943
16199B55788A21553J79845I2634K63062Q3266j26039n7086J17941j55948K47286
16189D65116N223A78187K24914q8987k9837p94o9829J75020m8881I6116J6077
16178A12193Q2612K72455j60794l5035j5239K04757A25744M9501L15568O6666
$$ plain form
16250 418182 45328 437901 355257 611910 410708 572154 365010 612295 332582 489701
16240 489701 191801 85902 398179 630830 276142 342296 413094 413772 644844 400960 392951
16229 392951 556103 195215 43980 440930 398207 194668 419677 347083 348434 465481
16219 465481 124494 95288 252997 537634 394537 363184 404245 663249 480442 462302
16209 462302 425432 445892 123180 763841 275368 395332 284052 317927 424731 255788
16199 255788 121553 301398 92634 355696 438962 312923 255837 373778 217830 465116
16189 465116 470339 178187 403101 314114 284277 283483 213654 388674 339793 96116 112193
16178 112193 194805 467260 306466 271431 256192 460949 125744 175245 490813 557479
16168E57479H1522K68925A57758K11150A36299L16051j63632j2052q5484Q1801
16158B72983B9281Q3542a05201B4405L14451A45353l1267R656m319k2101K32428
16147C29750B5451N6656C4818J25161m1612L1904J01289K85869j69723j42881
16137B24825H1265K63167J79123a25583b0720A07046J78493a77273C90410I3464
16126C62256a7326A8382M86256H3357J42094o6178G8494c5680C07200C8045L54377
16115C92422j73026Q475e4648C4688L33134A07787K63097a819B60824r6298q0487
16104H4039J46144h8537A80597K0184c5322D89054m5107a79702C00956a68655
16093A60729L63064F4148J68917D9550J25927A1913b37259A9593a41453A57719
$$ plain form
16168 557479 81522 350447 157758 368908 136299 452350 288718 276666 191182 272983
16158 272983 29281 112823 -105201 24405 338856 145353 114086 123742 119423 97322 329750
16147 329750 25451 82107 34818 159979 118367 150271 251560 537429 367706 224825
16137 224825 81265 344432 523555 -125583 -20720 107046 285539 -177273 390410 93464
16126 362256 -17326 18382 504638 83357 225451 159273 78494 -35680 307200 38045 392422
16115 392422 219396 227871 -54648 34688 367822 107787 370884 -1819 260824 164526 84039
16104 84039 230183 -88537 180597 200781 -35322 489054 443947 -179702 300956 -168655
16093 160729 523793 64148 233065 49550 175477 11913 -237259 19593 -141453 157719
16082f3980B07120L529b8904A08173J97364n1888I7052K05957D7411f0111B68620
16070H1731K57698A3897L35846A68999f1018K2415D35712C3715j1316J4745Q936
16059D6080J21761d0419B08415N4611A21360n9432a66283A13037P1264c80782
16048a67408P3760q0671a9757E8139a05404A78666l8679O9399J59140A82748J22122
16037C04870i2461B11394A1796a49739j69239G515K71662A06241J13747H3106
16026C9796d7029C91837b9833N663B20350R658L2453D4411J44344K798a52949
16014f1604I1976K14980a7737A67365b90180J06192l5688B52198M9307A37200
16003f4092A2606L3932i5369K3731j73728B07617F7815L2298a84049B13962j4246
$$ plain form
16082 -63980 207120 210649 -28904 108173 305537 253649 97052 303009 47411 -60111 268620
16070 81731 339429 13897 349743 168999 -61018 -38603 435712 33715 22399 37144 46080
16059 46080 167841 -40419 208415 263026 121360 61928 -166283 113037 184301 -380782
16048 -167408 -93648 -174319 -19757 58139 -105404 178666 139987 209386 368526 182748 304870
16037 304870 -92461 211394 11796 -149739 -318978 7515 279177 106241 219988 83106
16026 39796 -47029 391837 -29833 -24170 220350 230008 262461 44411 188755 191553 -152949
16014 -61604 91976 306956 -17737 167365 -290180 -183988 -219676 252198 301505 137200
16003 -64092 12606 46538 -95369 -71638 -245366 207617 67815 100113 -184049 213962 199716
15992A99716J00493f589A73924j2539J42657d119l35950D51364C4565L75900A2964
15980C66905G4525M12843b53822f4704n6177A83575J86161K8922j3955L27697
15970G12400O4867q4286J05774p2006k49415K42674h414D32818j78811o1907G4654
15958A74854h3587k6674F7735Q8747J51086l4458a19145A25646J8622a56833H9884
15946a05404N0081k32243A17337K01291E0550d43093b20671F2852b61839J18127
15936a43712B53485h8044Q932B05241H3692a58747n8056R5890C2342b12369R8176
15925a14193D22749d8305K961q7901e2555o3766k09000g6331f437H9040J71956
15914B60996d8216j34698A23484B7986j2114a17710A90250g4327l4492E768M6855
$$ plain form
15992 199716 300209 -6589 173924 161385 304042 -4119 -340069 451364 34565 410465 12964
15980 366905 74525 487368 -253822 -64704 -120881 183575 369736 398658 384703 712400
15970 712400 777267 692981 798755 726749 477334 720008 -8414 432818 254007 192100 74654
15958 174854 -83587 -110261 67735 156482 307568 273110 -119145 125646 144268 -156833 89884
15946 -105404 -55323 -287566 117337 318628 50550 -443093 -220671 62852 -261839 -143712
15936 -143712 253485 -88044 -79112 205241 83692 -158747 -216803 -120913 32342 -212369 -114193
15925 -114193 422749 -48305 -45344 -133245 -52555 -116321 -325321 -76331 -6437 89040 260996
15914 260996 -48216 -182914 123484 27986 15872 -117710 190250 -74327 -108819 5768 52623
15903E2623K6325a99782A09128J3867i5905b8659k05994B01319q7848Q071N0092
15892A71634k1202b39072G5473M0376C6051J7290c68989a17442l0027d2161A25633
15880C5269h3854B7554M0790a73375k11791a57062C0148L6247L53264A88666F1244
15868A76494J69656i3173a2873D6678c0637p7383Q421b2302k3582o9392j21766
15857b37042J00230A48531r380b73517J33578b747j39703f3106A59938m9832g8573
15845h2455A15646e4262A38849K3181K17374b00979B08305b02991B96907E7214
15834A85426b1543A69651j8094m4063F701a16869P832g446k04083Q1773B50617
15822A19741m2408N2777k1580b5633r7662F7131b71482J28100n7065a6927k76579
$$ plain form
15903 52623 78948 -199782 109128 122995 -95905 -28659 -234653 201319 113471 121542 171634
15892 171634 150432 -239072 75473 115849 36051 53341 -368989 -117442 -147469 -42161 125633
15880 35269 -83854 27554 68344 -173375 -385166 -157062 30148 66395 419659 188666 61244
15868 176494 346150 -93173 -12873 46678 -30637 -108020 -99599 -22302 -45884 -115276 -237042
15857 -237042 -136812 148531 139151 -273517 -139939 -2747 -142450 -63106 159938 110106 -78573
15845 -82455 115646 -54262 138849 162030 379404 -200979 208305 -202991 296907 57214
15834 185426 -21543 169651 151557 107494 6701 -116869 -109037 -7446 -211529 -129756 250617
15822 119741 77333 130110 108530 -25633 -123295 67131 -271482 -143382 -200447 -16927 -293506
15811b93506J40757B20031r2346j3092a33224j55340d5993j18226C393L71682
15801C75075d09183B01819a75150A18037a6467A06469N2940O072J18480E8811
15790a59982C2046J02305L4543a83160R0402A11311J47358b61717G8673g2212
15779a00009I9041b07270L9749C947K04912a07718j28463A23483f6184A3512J06912
15768A20424c59472A37421D8384f8666A12622c3492k07567J0284H8142J31981
15758B20123c06068C8105f3534j58496j61528J81977N4095B46976a04780p5356
15748a80136a2203p6020j45612A97365l9621N9632H7014c47435A84529m3146b17660
15736h5950q464A29472F3772b05130A93578a00964P357I8334Q9046K74823b7250
$$ plain form
15811 -293506 -152749 220031 127685 114593 -133224 -288564 -45993 -164219 3393 375075
15801 375075 -409183 201819 -175150 118037 -16467 106469 159409 165481 283961 58811
15790 -159982 32046 134351 168894 -183160 -92758 111311 258669 -261717 78673 -72212
15779 -100009 99041 -207270 -167521 3947 208859 -107718 -236181 123483 -66184 13512 120424
15768 120424 -359472 137421 48384 -68666 112622 -33492 -241059 -230775 88142 220123
15758 220123 -306068 38105 -63534 -222030 -383558 -201581 -147486 246976 -104780 -180136
15748 -180136 -12203 -88223 -233835 197365 157744 217376 87014 -347435 184529 141383 -217660
15736 -85950 -94414 129472 63772 -205130 193578 -100964 -93607 98334 187380 462203 -27250
15724a08044c2170j87927H4567J41391j10271b17454P3631e7654B65202e5359
15713C4402h8514A63535m9515b44464k6107g2409A32503b17791B26858D4527c34424
15701I1000a06196j74276M7267e7913m2340C1299A0222K0680n054b67662G9483
15689B9878M9728b35891I1351M8928a13601N0651j66771C03463F2583c5209C7536
15677A08857i1304A13733a19351E3109A1074J52601h0122D703L0269g3902l9620
15666a13522E7828e7813A03838a41051k77272J99018F7039j3384k0557K90509
15656C23607j34484d02339C02438a57422g589k16163A78326C0959b78815J37199
15646a41616l1320m9685a1214n2955A77051a40308A72745E5473b11100G0531e15
$$ plain form
15724 -108044 -32170 -220097 84567 225958 115687 -217454 -143823 -57654 265202 -55359
15713 34402 -88514 163535 114020 -244464 -270571 -72409 132503 -217791 226858 44527 -334424
15701 91000 -106196 -280472 -233205 -57913 -100253 31299 10222 30902 25848 -267662 79483
15689 29878 79606 -235891 91351 140279 -113601 -62950 -229721 303463 62583 -35209 37536
15677 108857 -91304 113733 -119351 53109 11074 163675 -80122 4703 34972 -73902 -113522
15666 -113522 57828 -57813 103838 -141051 -418323 -219305 67039 53655 33098 323607
15656 323607 189123 -402339 302438 -157422 -7589 -223752 178326 30959 -278815 -141616
15646 -141616 -172936 -222621 -11214 -64169 177051 -140308 172745 55473 -211100 70531 -515
15634a46305A06797K844b27131j6560h6230n05316B6029M8715a44505G2049Q1307
15623A53356f28596b68746B2749L28769b7104o7670m5877A27945B2885d0435C3617
15611E9147a92725A31542L3869A1883b73269E1868a87932j2706r9258i2373k4261
15600a16634e5312j25261o276g0233C22590D058M176J6706L1296L6266R4463H4245
15587a6100r9215k84281B2283a61742A43395D2661a11045k50807B07509P6465
15577B83974A24196K32082a10788A5002K62674b38963I3233J38336c2827j09167
15567a41994E0244a56812C03764b38906i7772C00755A41291m2049m4473a5184
15556G6590a09561j4015j00921B4730i6103A92733b12493f3839e358o2449H5013
$$ plain form
15634 -146305 106797 109641 -227131 -243691 -86230 -591546 26029 74744 -144505 72049 153356
15623 153356 -628596 -268746 22749 351518 -27104 -94774 -140651 127945 22885 -40435 33617
15611 59147 -192725 131542 165411 11883 -273269 51868 -187932 -200638 -299896 -92373 -116634
15600 -116634 -55312 -180573 -186849 -70233 322590 4058 8234 24940 56236 92502 186965 84245
15587 -16100 -115315 -399596 22283 -161742 143395 42661 -111045 -361852 207509 283974
15577 283974 124196 356278 -110788 15002 277676 -238963 93233 231569 -32827 -141994
15567 -141994 50244 -156812 303764 -238906 -97772 300755 141291 99242 54769 -15184
15556 76590 -109561 -123576 -224497 24730 -96103 192733 -212493 -63839 -5358 -67807 85013
15544B43358a13589k04609f4843k25802J31717k23933P3825B97777E1052h3620
15533A0483e9118o3104C2780a03106A31099J13212p1817h7140E8012m624J80912
15522B34300b25242k03589A93126l5655J9544g0828A75155a45022H0736C780K4670
15511B8450i812l7269A01042b54605A89597o0769L8327p7146M1330P1689Q1661
15500B84689A42205J11063h7538C50794F0554b70021G7938J89442a32618A81645
15489E1455J57965f3746B23489J13623b3444A07558e6967E24223H2877B6495N0517
15478G7012K38823A15918b62235I9117p571a64569B46051i6422j72312I8944M6077
15467A45021b08702B6178J44749Q8193H3282c70581D98654A87130a53424D29065
$$ plain form
15544 243358 -113589 -318198 -64843 -290645 -158928 -382861 -309036 297777 51052 -83620
15533 10483 -59118 -122222 32780 -103106 131099 244311 172494 -87140 58012 53388 234300
15522 234300 -225242 -428831 193126 157471 177015 -70828 175155 -145022 80736 3780 28450
15511 28450 -9812 -47081 101042 -254605 189597 128828 167155 90009 131339 203028 284689
15500 284689 142205 253268 -87538 350794 60554 -270021 77938 267380 -132618 181645
15489 51455 209420 -63746 223489 337112 -23444 107558 -56967 524223 82877 26495 77012
15478 77012 315835 115918 -262235 99117 91546 -164569 246051 -96422 -268734 98944 145021
15467 145021 -208702 26178 170927 259120 83282 -370581 498654 187130 -153424 429065
15456C29711d3880B79118k8854A17855L61823a429E1754a67660A05596m1099J4874
15445G9371b23562B20700j04514C5359A2180P786K3683b42848Q8996N9345B70740
15433C0860a22198B9947K8758L32123A70162L21461r3377N49687l98709j4295
15423E34929K06031k49655j39004j8464P1614A54975e1091j47443A6343a65634
15412D1177J6432N1125a55974f3749p8325I800L1308a14516C6344j1251J08233
15401A33326J56961a28638A38703a3021r7279C33123a64352r0530A17028a79213
15390E9186h0901D2685L5085e5851C7476Q0200l7964C305K54140H4495C7795A1821
15377A75752J36491b76801A05622J18026I1620D0974b1239E260J824f5840q4427
$$ plain form
15456 329711 -43880 279118 250264 117855 479678 -1429 51754 -167660 105596 64497 79371
15445 79371 -223562 220700 116186 35359 12180 19966 43649 -242848 -153852 -94507 270740
15433 30860 -122198 29947 58705 390828 170162 491623 398246 947933 549224 534929
15423 534929 740960 491305 352301 333837 405451 154975 -51091 -198534 16343 -165634
15412 41177 57609 108734 -155974 -63749 -142074 9800 41108 -114516 36344 25093 133326
15401 133326 290287 -128638 138703 -13021 -110300 333123 -164352 -254882 117028 -179213
15390 59186 -80901 42685 77770 -55851 37476 117676 79712 3305 257445 84495 37795 11821
15377 175752 312243 -276801 105622 223648 91620 40974 -21239 5260 7084 -65840 -150267
15366a50267d3621j60107B70579j8664J0153j28219K10909i638B95639k9109m1273
15355B25257h3817B69373A19834J24649m621k2569E0192b0479C32426n6977H9375
15343A39165J0327E5192B2279b68190A52523K33955K3915j19534J40126j24458
15333C06527i7297A86771J45832e8092B46901D2491M17405G5528J38048K3201
15323B36777J99387A31654L96142f837C09255j19680i48B78094h8406C3635L42520
15312C76155f9923b6720m4674l4713K7551B25998K61459A39850K28026b38165
15301B54161M400b9825C27206K9476C0397J00348M9944L41151b4789B3166Q7259
15290A10425a19942G9527J91245G4776N4405f1335A31756K72220A5143K06026
$$ plain form
15366 -150267 -43621 -203728 270579 251915 262068 133849 344758 -9638 295639 266530 225257
15355 225257 -83817 269373 119834 244483 239862 217293 50192 -20479 332426 275449 89375
15343 139165 149492 55192 22279 -268190 152523 386478 410393 290859 430985 306527
15333 306527 -97297 186771 332603 -58092 246901 42491 459896 75528 213576 236777
15323 236777 436164 131654 527796 -6837 309255 189575 -948 278094 -88406 33635 376155
15312 376155 -69923 -26720 -71394 -106107 -78556 225998 487457 139850 367876 -238165
15301 254161 258561 -29825 327206 356682 30397 130745 180689 521840 -24789 23166 110425
15290 110425 -119942 79527 270772 74776 129181 -61335 131756 403976 15143 221169
15280B21169N4800c0723C04508F2210a92136A2152P2620a8947A71005m4936J56931
15269B83000i9597A73015m5579a01190C7606R3966L8656p5070a21424A09241f9034
15257A42464J70854P6215b11784e3420E3013f1166d809A93825g1068B00J79938
15246A80138A6471J97090E257J79081G3648J90049o6915c04730A19883g6029B23012
15234b0481B72711O1167r7982n1233J59094O44065R19543n57679J13863n62392
15224I01157B21834M3913h0212C05414j26060F3928m513b01464o637B80198a83848
15212A8187a27983A7613P2698L7862d04477h1103Q474C34030h0973n6497A09160
15200a3701j49997A09674L1954E9415b4572o7460I7202d551j60417E1668P8329
$$ plain form
15280 221169 275969 -30723 304508 62210 -192136 12152 84772 -18947 171005 126069 283000
15269 283000 -99597 173015 127436 -101190 37606 131572 170228 95158 -121424 109241 -69034
15257 142464 313318 389533 -211784 -53420 53013 -61166 -4809 193825 -71068 200 180138
15246 180138 16471 213561 5257 184338 73648 263697 196782 -304730 119883 -76029 223012
15234 -20481 272711 333878 235896 184663 343757 987822 1907365 1349686 1463549 901157
15224 901157 221834 265747 -80212 305414 179354 63928 59415 -201464 -208101 280198 -183848
15212 18187 -127983 17613 90311 128173 -404477 -81103 -72629 334030 -80973 -137470 109160
15200 -13701 -163698 109674 141628 59415 -24572 -92032 97202 -4551 -164968 51668 129997
15189A29997k2970R7205i200q0252E15495B5731R4833A9433J91265b48671A4579
15177f1780j13141e1795B38067i6365A47484a13874b6061A85622o1148k666J56432
15166B78240i3388A85036K2187b11260h2800K5182D22319G8523J69612a67841
15155H5461R7510b70006B33558L51938e6395C681J80086l1113A5517a06162C92976
15143B11252f8554l1295c8047A79704H2218J12339g093n587D0637J57230e6503
15131A33257P6076J36026C9657L49704j49118a03544A26554J01195m4519H1539
15120b6893B43958G8450f6207A51848K3680K89129A39074Q9613O1765f2283A45891
15108a17724F6671Q6425m1583C1409J10813K21540A61741L230G0491J28210p3678
$$ plain form
15189 129997 107027 204232 -9200 -89452 515495 25731 120564 19433 210698 -248671 14579
15177 -61780 -174921 -51795 238067 -96365 147484 -113874 -26061 185622 124474 121808 278240
15166 278240 -93388 185036 207223 -211260 -82800 -57618 422319 78523 248135 -167841
15155 85461 182971 -270006 233558 585496 -56395 3681 183767 152654 15517 -106162 392976
15143 211252 -68554 -99849 -38047 179704 82218 194557 -7093 -12680 40637 197867 -56503
15131 133257 209333 345359 39657 389361 240243 -103544 126554 227749 183230 81539
15120 -26893 243958 78450 -66207 151848 175528 464657 139074 228687 290452 -62283 145891
15108 -117724 66671 153096 111513 31409 142222 363762 161741 164971 70491 198701 125023
15097A25023k1647i2221C8593a90701f431C14347b78938b0621E0170K89202l4234
15086C05138A3057K89900J53859A24574O8694O1008I1520P269J24700f6171A21514
15074A70687M0402C5232N71711j78000I8275j3969K0365A8153M52872e1760B60826
15062B98321I5403l116b26836A32547J33144F3997J62951b6852A57795a50260
15051B34604q5014C1997K85197m457l9856J72110B580c001E84756A92252J75692
15040C67944J32051K26219l14616A55191K24303q9635j39192J41617J03756j80817
15030B15223O51280l16258j28256C4316J71864K8359J36653A2059M34873J06116
15020E53048j40329q2668K6526K10059B23897K1208L82979j12406L22498k40018
$$ plain form
15097 125023 103376 -92221 38593 -190701 -6431 314347 -278938 -20621 50170 339372 305138
15086 305138 13057 302957 456816 124574 193268 254276 91520 98789 223489 -66171 121514
15074 170687 211089 35232 606943 428943 98275 84306 104671 18153 471025 -51760 260826
15062 298321 95403 92287 -226836 132547 265691 63997 226948 -26852 157795 -150260
15051 234604 149590 31997 317194 312737 272881 444991 2580 -3001 584756 192252 367944
15040 367944 499995 726214 411598 155191 379494 289859 150667 292284 396040 215223
15030 215223 866503 550245 421989 34316 206180 234539 371192 12059 446932 553048
15020 553048 412719 330051 356577 566636 223897 245105 628084 515678 838176 598158
15010E98158j61109L13382k96548q2373Q8840J17022B55191J96673j40053I3966
14999D21238k3847c2745A57138K02161j20339L69064B08480R6122L25063e2230
14988D01831M490o4802j65880J13567k0164K34104M2712k5371B35979J94932j55464
14977B75447J33538J00902B21390K9626j13947K78192J23216L28171C57799K18260
14967E76059n2335L61086j11917M1354J24236k46778k86776J88449L25565k92139
14957F26804Q8517k50582j45708K20692J33193A38370L30100B29572K58430o5592
14947D22410A27416K88873j70762O0440I5975K69516n0955J83152o9238H7367
14936D28037A16228K58189J22521j33151J57554j18785I3339M27514J04595K2040
$$ plain form
15010 598158 437049 750431 453883 371510 460350 577372 255191 451864 311811 93966
14999 421238 397391 -32745 157138 359299 238960 608024 208480 304602 629665 -52230
14988 401831 406321 341519 175639 289206 269042 503146 545858 520487 235979 430911 275447
14977 275447 408985 509887 221390 251016 137069 415261 538477 866648 357799 576059
14967 576059 523724 884810 772893 814247 938483 691705 404929 593378 918943 626804
14957 626804 715321 464739 319031 539723 672916 138370 468470 229572 488002 422410
14947 422410 127416 416289 245527 305967 95975 365491 314536 497688 428450 87367
14936 428037 116228 374417 496938 363787 521341 402556 93339 520853 625448 647488
14926F47488k16078r6450K17025M1440k29447J64774N919N4031o364O2119K07408
14915H51865K2398M8964L506J45761k41093M07253M68838k68471q7882Q4548r9126
14904A336561k9744J27272J22017Q1052J60007J68021n33855k56723n4664J59793
14894A279737n16566J1699j6165l6087p2573j10464j82320J84217k2632j71969
14884C46877J78927B32595L56598A71300L75634J3177B60128J40252K40876Q9218
14874G30474l47528A89176L41218j71600L06537P3223J92396l40033J08932J8925
14864G18774J7979j68178J17790k7277J9287j31998K63992p5272k37870M34549
14854I31776l68029J3740J46078l46750K69351j88242L4779B25740K92333p6557
$$ plain form
14926 647488 431410 334960 551985 593425 363978 528752 534671 588702 582338 644457 851865
14915 851865 874263 923227 926733 1072494 831401 1238654 1707492 1439021 1351139 1435687 1336561
14904 1336561 1306817 1434089 1556106 1637158 1797165 1965186 1431331 1174608 1119944 1279737
14894 1279737 763171 774870 758705 722618 650045 539581 357261 541478 518846 346877
14884 346877 525804 232595 589193 171300 546934 560111 260128 400380 641256 730474
14874 730474 382946 189176 530394 358794 665331 738554 930950 590917 699849 718774
14864 718774 736753 568575 686365 659088 678375 546377 810369 735097 497227 931776
14854 931776 563747 577487 723565 376815 646166 457924 492703 225740 518073 441516
14844D41516K24577B57869k6543L78594o7150A91883L19028J12049q5668L27372
14834H64664B85203M32316K06397j32485k62556n9589J11016K61439J43740k26270
14824G59211J46283j41555J8939j16335L18973J66065l98568k24133k28606K79773
14814E80047Q5442m0563j24781o5978J49482j06453n8779J61874m2875M8917M20772
14803A007105j08117l03966J51291J0521P0146j88398L25514m49796M52319l00304
14793F66315j31257r3796M07426C99380L16943J55527j26072P9807n7172L40178
14783A108591D23001M24856l73097O16117k48353J69331m95597P1157R397J6828
14773F13640J88652J75510m36885L77664M1603j21975n9348K4825K91885n34721
$$ plain form
14844 441516 666093 257869 231326 609920 542770 191883 510911 622960 537292 864664
14834 864664 285203 717519 923916 791431 528875 469286 580302 841741 985481 759211
14824 759211 905494 763939 782878 666543 985516 1151581 753013 528880 300274 580047
14814 580047 665489 624926 500145 434167 583649 477196 418417 580291 537416 586333 1007105
14803 1007105 898988 595022 746313 756834 826980 638582 964096 514300 966619 666315
14793 666315 535058 441262 848688 399380 716323 871850 745778 825585 768413 1108591
14783 1108591 423001 847857 474760 1090877 842524 1011855 516258 587415 596812 613640
14773 613640 802292 977802 540917 918581 960184 838209 778861 803686 1095571 560850
14763E60850m672L23624k66851P7508K48231N2039m36931J39783L61872j28670
14753I26783l50457J72909L18553m26449n3637R7790K09800k76915o3673M4169
14743E98873J81885k49693n0434J97479p74l06140L83348R0390D10830J68520
14733E79350L51786k49513j5341m8280J77302j8749j64669J79732l6602P2133
14723H27149N7163o0794k9142j52211L88093n03892J50634K97109j10899r0635
14713G72575L52596J01289L53823Q0968n9492R7370j01189j15377r0587j08593
14703A283383j04432m38006L14124j51070o6264K13898L6390J30572k79126K19189
14693A158658k87884l1936n4214n6584K96284K28012J23076j86265M49200q3962
$$ plain form
14763 560850 556178 879802 612951 690459 938690 990729 553798 693581 1055453 926783
14753 926783 576326 749235 1067788 641339 587702 685492 895292 618377 554704 598873
14743 598873 780758 531065 480631 678110 677336 371196 754544 844934 410830 579350
14733 579350 931136 681623 666282 618002 795304 776555 611886 791618 755016 827149
14723 827149 884312 823518 794376 642165 1030258 526366 677000 974109 863210 772575
14713 772575 1125171 1226460 1580283 1661251 1601759 1699129 1597940 1482563 1391976 1283383
14703 1283383 1178951 740945 1055069 903999 837735 1051633 1088023 1218595 939469 1158658
14693 1158658 870774 838838 784624 728040 1024324 1252336 1375412 1189147 1638347 1554385
14683A554385N7815Q643k5405k07393l0300l46821L01720j96232k40360K43277
14673A119329K83831o5522l30737n9102j2938J40950p9292j35521K96935J70249
14663A328182j01768k77079K72647r822k8961k09420J79275J84084n1135J10364
14653A396367k12148k91015L26418Q343k52165K71492J30999l64904j82692K27687
14643A058382N6409K24584N1319k64139k68126J81043L39977o1676Q7716L6262
14633A441751p0393L6659j21527K13578J65451k74317q0083K2902k1126k2081
14623A290814j974j76322N38409j89598j70930N70095n21390l60949L67175J17340
14613A462670Q56k4035l37210M18877O0539k74192L65432k18615l7828J20540
$$ plain form
14683 1554385 1612200 1620843 1595438 1388045 1357745 1010924 1312644 1116412 876052 1119329
14673 1119329 1403160 1337638 1006901 947799 934861 1075811 996519 860998 1157933 1328182
14663 1328182 1226414 949335 1221982 1212160 1183199 973779 1153054 1337138 1286003 1396367
14653 1396367 1184219 893204 1219622 1227965 975800 1247292 1378291 1013387 830695 1058382
14643 1058382 1114791 1339375 1390694 1126555 858429 1039472 1379449 1317773 1405489 1441751
14633 1441751 1371358 1408017 1286490 1500068 1665519 1391202 1311119 1334021 1312895 1290814
14623 1290814 1288840 1112518 1650927 1461329 1290399 1860494 1339104 978155 1345330 1462670
14613 1462670 1463526 1439491 1102281 1521158 1581697 1307505 1672937 1454322 1416494 1537034
14603A537034L35149o10715J89736k78721N57973k67204q9233j41387j35667M68976
14593A565941L42233j67541K50689n76565K37914K7485L86586k95908l73340K32979
14583A630473L5728O7811k03119Q5873K79233j02721Q2559L50919l89882K42811
14573B079685k77479m259J29413j24670J82527J08501j80358J48131q4771q9083
14563A887637J48268j84691j53990M62907j85452J76526j0169J51672K80153J2714
14553B585575k53776J46831J14013m4760J12399j59854j80220M52004M50897j9573
14543C203536p6804L54516L31365N32738M83736k8189L97590Q94034J714767K326817
14533A0134106M026652O053769J0420816J862891j3383311p904901l856338j668000
$$ plain form
14603 1537034 1872183 1261468 1451204 1172483 1730456 1463252 1374019 1232632 1096965 1565941
14593 1565941 1908174 1740633 1991322 1414757 1652671 1680156 2066742 1770834 1397494 1630473
14583 1630473 1666201 1734012 1530893 1616766 1895999 1793278 1875837 2226756 1836874 2079685
14573 2079685 1802206 1797947 1927360 1802690 1985217 2093718 1913360 2061491 1976720 1887637
14563 1887637 2035905 1851214 1697224 2160131 1974679 2151205 2141036 2292708 2572861 2585575
14553 2585575 2331799 2478630 2592643 2547883 2660282 2500428 2320208 2772212 3223109 3203536
14543 3203536 3126732 3481248 3812613 4345351 4829087 4800898 5198488 6092522 7807289 10134106
14533 10134106 14160758 20214527 30635343 32498234 19114923 11210022 7353684 5685684
14525E685684m20300K62798j260907j148512m44229j66720j88398K72638l26157
14516B265897J07889M1109J29717l1135r2011L23015p0853J00552m56499k9267
14506B288414M22708R3799k45997J97540j09286J55204j7331m6293N46367m29810
14496B855315j41678K69345J69360j22882k39525M39995L85j19273K45205m57867
14486B898380L22943j21311J39008P7937J78195j2442P7552l39891M92956l00243
14476C413084L19364J01080O9489K7217J53934m24635R1123L81147J04041j94237
14466D041607J11465k86040k0464L74583L71134l05055K5028P0440O106R8188
14456D486992K279M39807m01328j12784K40799J34369j75014O7455K61590J16597
$$ plain form
14525 5685684 5265384 5528182 4267275 3118763 2674534 2507814 2319416 2592054 2265897
14516 2265897 2373786 2414895 2544612 2513477 2421466 2744481 2673628 2774180 2317681 2288414
14506 2288414 2711122 2804921 2558924 2756464 2647178 2802382 2785051 2738758 3285125 2855315
14496 2855315 2713637 2982982 3152342 3029460 2789935 3229930 3230315 3111042 3356247 2898380
14486 2898380 3221323 3100012 3239020 3316957 3495152 3482710 3560262 3220371 3713327 3413084
14476 3413084 3732448 3833528 3903017 3930234 4084168 3659533 3750656 4131803 4235844 4041607
14466 4041607 4153072 3867032 3846568 4221151 4592285 4287230 4312258 4382698 4388804 4486992
14456 4486992 4489271 4929078 4527750 4414966 4655765 4790134 4615120 4682575 4944165 5060762
14446E060762L7077o942r5262j70116O38232l01726L34750l00852L01672j18701
14436E378894M76321J46416n76014K96602K46607j15748J48423L39785l41017
14427F000269N70391n76395M37416J23121Q13K7340k52886Q25019k99025J60404
14417G016467j6266J87313j23002N47481j32565k60291K70475L79518J41372K02419
14407H212921Q4989Q3028J83365K59279K06102k32643O02218k29896N5264M1240
14397I265867r2530n3361O94314K5417j8944J03406J97544L71092J25558J86075
14387A0804438l6639M42094p7923Q1838M53916J8053k79927M87999N11020j39465
14377A2265404L31816K68408L79529J61152j62389L28973K14247L30978L38138
$$ plain form
14446 5060762 5097839 5090897 4995635 4825519 5463751 5162025 5496775 5195923 5497595 5378894
14436 5378894 5855215 6001631 5425617 5722219 5968826 5853078 6001501 6341286 6000269
14427 6000269 6570660 5994265 6431681 6554802 6555615 6582955 6330069 7155088 6856063 7016467
14417 7016467 7000201 7187514 7064512 7611993 7479428 7219137 7489612 7869130 8010502 8212921
14407 8212921 8297910 8380938 8564303 8823582 9029684 8797041 9399259 9169363 9224627 9265867
14397 9265867 9173337 9119976 9814290 9839707 9820763 9924169 10121713 10492805 10618363 10804438
14387 10804438 10767799 11209893 11131970 11213808 11667724 11685777 11405850 11893849 12404869 12265404
14377 12265404 12597220 12865628 13245157 13406309 13243920 13572893 13787140 14118118 14456256
14368A4456256L91030Q5453N30073L75796M2903M04239N5339N33490K33823L51828
14358A7460230J85481J76483N25754L342J012567l4500M05380P95787L27805P89837
14348B1648166K03387L43066O82697N82788M02834L64106L15798R43351M16455
14339B5902648N50071M89809J008813N95414L83202J186743M27516P09485Q26253
14330C2079954J114010N00025J061988Q81051J137011R50540J047827J111150
14322C9883556R99235J098208J519784J321094J211823J450082J534933J512764
14314E0531479J329428K007296J742954J471442K328958J968188K262369K065098
14306F5707212K129579K994479K485335K784015K670588L505602K530733L244321
$$ plain form
14368 14456256 14847286 14932739 15462812 15838608 15881511 16285750 16341089 16874579 17108402 17460230
14358 17460230 17645711 17822194 18347948 18351290 19363857 19329357 19734737 20530524 20858329 21648166
14348 21648166 21851553 22194619 22877316 23460104 23862938 24227044 24542842 25486193 25902648
14339 25902648 26452719 26942528 27951341 28546755 28929957 30116700 30544216 31253701 32079954
14330 32079954 33193964 33693989 34755977 35637028 36774039 37724579 38772406 39883556
14322 39883556 40882791 41980999 43500783 44821877 46033700 47483782 49018715 50531479
14314 50531479 51860907 53868203 55611157 57082599 59411557 61379745 63642114 65707212
14306 65707212 67836791 70831270 73316605 76100620 78771208 82276810 84807543 88051864
14298H8051864L558463M045457L941987L991568M084161N041013M886318N306032
14290A22906863N677796N863074O317016O535018P224089P316870P763768Q756397
14282A78360891Q826623R294263J0066167J0435862J1163085J1489852J2230698
14275B51867441J3295730J3195620J4357658J4383753J4514786J4702870J4371315
14268C50689173J4028269J3693905J2479393J1173700J1079658J0108649R630233
14261D32882980Q818418Q015431O436704L442882J903158J953027J413990j688469
14253D63178121n793909m959223p007237r984461j2085178j2507644j3158489
14246C97681980j4374132j4068364j4619354j4909111j3924502j3798435j4140550
$$ plain form
14298 88051864 91610327 95655784 99597771 103589339 107673500 112714513 117600831 122906863
14290 122906863 128584659 134447733 140764749 147299767 154523856 161840726 169604494 178360891
14282 178360891 187187514 196481777 206547944 216983806 228146891 239636743 251867441
14275 251867441 265163171 278358791 292716449 307100202 321614988 336317858 350689173
14268 350689173 364717442 378411347 390890740 402064440 413144098 423252747 432882980
14261 432882980 441701398 449716829 456153533 459596415 461499573 463452600 464866590 463178121
14253 463178121 457384212 452424989 445417752 435433291 423348113 410840469 397681980
14246 397681980 383307848 369239484 354620130 339711019 325786517 311988082 297847532
14239B97847532j2707555j3089437j2599237j1692598j1060150j0819546j0752745
14232B15126264j0591811j0258073r805304r089628q878002p995313p882054o930601
14224A43695478o711084o246025n693492n426910m888972n225783m565566m358078
14216A00579568l444131m440715l342711l949497l084365l390756k586075k821451
14208G3519867k758824k692382j956222k323899k273742k302713j666488j981356
14200E5564241j796701j711253j185029j521037k021853j162485j307166j040166
14192D3818551j342448r08003j595023r04096j257975o19964j071853r68529q05519
14183C4345141j132212o64348r35262r41328n61468n91926q64739q64263o49189
$$ plain form
14239 297847532 285139977 272050540 259451303 247758705 236698555 225879009 215126264
14232 215126264 204534453 194276380 184471076 175381448 166503446 158508133 150626079 143695478
14224 143695478 136984394 130738369 125044877 119617967 114728995 109503212 104937646 100579568
14216 100579568 97135437 92694722 89352011 85402514 82318149 78927393 76341318 73519867
14208 73519867 70761043 68068661 66112439 63788540 61514798 59212085 57545597 55564241
14200 55564241 53767540 52056287 50871258 49350221 47328368 46165883 44858717 43818551
14192 43818551 42476103 41568100 39973077 39068981 37811006 37191042 36119189 35150660 34345141
14183 34345141 33212929 32548581 31613319 30671991 30110523 29518597 28653858 27789595 27140406
14174B7140406l69867r01535j14498n71738q92551n07935l77932o19987n67509
14165B2216854m00134o71724m07029m14858m12316k75793n70013l44940k36391
14156A8483656m30523k42560k63206k50487n75700l55170Q9511n75351j98809
14147A5681361l12080l97155j09430o27503J87066k67282l57195n20107j20873
14138A3156802o8127l21449k32926l710k94982k33929j18899k07977l77258J17606
14128A1415151n6475m59979k7315k61599k99420k52673L03245n31650k1096j61594
14118I646595q468l33288L9057k41439N0207k28466l22364K72488m44485k25530
14108H204307J75789k64126j6656k12968j02680K38044l55591l17627O40836r45326
$$ plain form
14174 27140406 26770539 25869004 25754506 25182768 24290217 23782282 23404350 22784363 22216854
14165 22216854 21816720 21144996 20737967 20323109 19910793 19635000 19064987 18720047 18483656
14156 18483656 18053133 17810573 17547367 17296880 16721180 16366010 16455521 15880170 15681361
14147 15681361 15369281 14972126 14862696 14235193 14422259 14154977 13797782 13277675 13156802
14138 13156802 13088675 12767226 12534300 12530590 12235608 12001679 11882780 11674803 11297545 11415151
14128 11415151 11358676 10898697 10871382 10609783 10310363 10057690 10360935 9829285 9808189 9646595
14118 9646595 9638127 9304839 9343896 9102457 9152664 8924198 8601834 8874322 8429837 8204307
14108 8204307 8380096 8115970 8099314 7886346 7783666 8021710 7666119 7348492 7989328 7044002
14098G044002K88139j02654m10353K57270l05428k74414P6167N2111J31115k86984
14088F468971N1666l21037M8439N6015j12079L36161p46175P8063j43829o7708
14078E648487Q8241Q0514k13705k6655j9527k55142j03370o3633L15180j47138
14068E303252k18853J28310j13087o8513j63073M5812j60579J56878j87489j14844
14058D607814k34455L82743m24264J94824k42106L01040l23009l2025l93207L09405
14048D146760k70074N71871k17756m39210P20797k03023l38801k26347M97395
14039D241612l07542j9549l07455L3166o6954j69095J47295k40934j7719K07182
14029C500007k29532J70606m17728K85259K52124j98954m7109j88094K04415l52419
$$ plain form
14098 7044002 7332141 7229487 6819134 7076404 6770976 6496562 6572729 6624840 6755955 6468971
14088 6468971 6520637 6199600 6248039 6304054 6191975 6528136 5781961 5860024 5716195 5648487
14078 5648487 5736728 5817242 5603537 5576882 5557355 5302213 5198843 5135210 5450390 5303252
14068 5303252 5084399 5212709 5099622 5031109 4868036 4913848 4753269 4910147 4722658 4607814
14058 4607814 4373359 4756102 4331838 4526662 4284556 4585596 4262587 4230562 3837355 4146760
14048 4146760 3876686 4448557 4230801 3791591 4512388 4309365 3970564 3744217 4241612
14039 4241612 3934070 3914521 3607066 3640232 3573278 3404183 3551478 3310544 3292825 3500007
14029 3500007 3270475 3441081 3023353 3308612 3560736 3361782 3314673 3126579 3330994 2978575
14019B978575N1297J10669k3386M7472j4584j88774J24622L96236n40558n5576
14009B885993j01327j21162o355L42270j64236p7856R2411k47864j38030J72733
13999B636577J12830l75858K57899j25476j0539L37474q9914l67991j49583M26357
13989B651776l52240P1922l64236J21517M64041j20934k64522J75959K78040j25040
13979B536283N03503K0494M13027L30060Q23856K159125L132636N494904R985496
13970B5399384Q129302j0175065q325378m749430k739670j443455j075580r06625
13962D113483j9016n70196l90992k84831J46041j84835k44805L18873l81685J52204
13952B654241o8481l60561K74063N0062l79597J80348l75358M78272n1454l33631
$$ plain form
14019 2978575 3029872 3140541 3117155 3164627 3150043 2961269 3085891 3482127 2941569 2885993
14009 2885993 2784666 2663504 2657149 2999419 2835183 2757327 2849738 2601874 2463844 2636577
13999 2636577 2749407 2373549 2631448 2505972 2495433 2832907 2742993 2375002 2225419 2651776
13989 2651776 2299536 2371458 2007222 2128739 2592780 2471846 2207324 2383283 2661323 2536283
13979 2536283 3039786 3060280 3473307 3803367 4627223 6786348 9918984 15413888 25399384
13970 25399384 33528686 23353621 15028243 10278813 7539143 6095688 5020108 4113483
13962 4113483 4094467 3524271 3133279 2848448 2994489 2809654 2564849 2883722 2502037 2654241
13952 2654241 2585760 2225199 2499262 2549324 2169727 2350075 1974717 2452989 2401535 2067904
13942B067904J84208n59036M18746q715Q7984j33598j84282j64507M9684K63027
13932B021415L1974k69648J67479p7814M7459j35409k53382M84411p2286k92227
13922A651972J43997k85000J31559r2408N13104l99424K31791k51534r7922O4100
13912A610235M1001m14953J54367p0046L6736L22560j25780Q0063j55001J24490
13902A603672o3316R3414m4418J6037J2662n4867L4003k32591M5520j81417J46078
13891A374777k27347p448o089M41363m41982K35919J58159l35434N580K94543
13881A492041l7788j80564L48947k971n9825m49270M1397O6941K98712m39707
13871A077913K99060n0737k6766k54377L24780O8216r6324k33669J68566k76401
$$ plain form
13942 2067904 2252112 1693076 2111822 2103107 2191091 2057493 1873211 1708704 1758388 2021415
13932 2021415 2053389 1783741 1951220 1873406 1920865 1785456 1532074 2016485 1944199 1651972
13922 1651972 1795969 1510969 1642528 1550120 2063224 1663800 1895591 1644057 1546135 1610235
13912 1610235 1651236 1236283 1390650 1320604 1357340 1679900 1554120 1634183 1479182 1603672
13902 1603672 1540356 1633770 1589352 1605389 1618051 1563184 1597187 1364596 1410116 1228699 1374777
13891 1374777 1147430 1139982 1133893 1575256 1133274 1369193 1527352 1191918 1197498 1492041
13881 1492041 1454253 1273689 1622636 1619665 1559840 1110570 1151967 1218908 1517620 1077913
13871 1077913 1376973 1326236 1299470 1045093 1369873 1438089 1341765 1108096 1276662 1000261
13861A000261O3368J55148p6334R9020J0872p7832R726Q3424j86622J3108J28332
13850A222471K39979o44507K95638j76836J36489L6378k84864L36019l0044R6717
13840A227440k67653r228l8200L5197l2012J3063L70717k12379M3150n8819j72123
13829H99153M33057k46039n3706k02863J47695J87603k14819j1761r4881J03990
13819I47429j71131M99902m21669J36904D64447N56161Q0193j27250K10654m83431
13809G00774J06483L33013k29605M2954K14396l75030J75160j55911O1418j73906
13799F99746O7898J87277l3379l32716L71033K7904l31712M38383j42308M8148
13789A000274j59498J80765E03354M51863j52695q0008k76745P0617J18225j4859
$$ plain form
13861 1000261 1063629 1218777 1142443 1241463 1252335 1174503 1184229 1267653 1081031 1094139 1222471
13850 1222471 1462450 817943 1113581 936745 1073234 1109612 824748 1160767 1130723 1227440
13840 1227440 959787 950559 912359 947556 915544 928607 1299324 1086945 1130095 1071276 899153
13829 899153 1332210 1086171 1032465 829602 977297 1164900 950081 938320 843439 947429
13819 947429 776298 1276200 854531 991435 464447 1020608 1100801 973551 1184205 700774
13809 700774 807257 1140270 910665 953619 1168015 792985 968145 812234 873652 699746
13799 699746 767644 954921 921542 588826 959859 987763 656051 1094434 952126 1000274
13789 1000274 840776 1021541 503354 955217 802522 722514 445769 516386 634611 619752
13779F19752J20147L58661l31280j5438K35441j5071m11784J91676j1030M72109
13769A213183E69497m4771K23854M2868J69016K07414l13369C37988O04923j6606
13759I26305q1318q498j17219J5879k55347K099L45910j6871p4324k53585p9389
13748D03642J00095L18369l11790j84687L03941o8403K27131k33797J80756J31956
13738H67213n5590B78282L20177j08447K5391J35080M2035K514j09237Q2396m7288
13727F20903k5633m8721K68452k09414L12638l63886k33818K3236k0383N08706
13717H32080B86129K88475J23118k81775l5439N4065J67081r0677J46131J31544
13707G88652C28166J25970J3688L00180A12817L90241J06119J4124o7119J27758
$$ plain form
13779 619752 739899 1098560 767280 751842 987283 972212 560428 752104 741074 1213183
13769 1213183 569497 524726 748580 791448 960464 1167878 854509 337988 942911 926305
13759 926305 844987 836489 719270 735149 479802 481901 827811 810940 736616 483031 403642
13748 403642 503737 822106 510316 325629 629570 561167 788298 554501 735257 867213
13738 867213 811623 278282 598459 490012 515403 650483 692518 695032 585795 668191 620903
13727 620903 595270 546549 815001 605587 918225 554339 320521 343757 323374 832080
13717 832080 286129 574604 697722 415947 380508 434573 601654 510977 657108 788652
13707 788652 328166 454136 467824 768004 112817 503058 609177 623301 556182 683940
13697F83940p8243L750j21389A20770L23884J33324j75223J48916L05717B57555
13686E51362A72310L89512M1264J64316A00566P15823B86329R4284K06949L2244
13676F19806L4878Q496Q3849A55350N5777L18876j96378K40735J73139k5690j26096
13665E95713j86922L24548k97613M3007k25250N4669L02184J50119k88942J69950
13655F41463k9710j19393J87732l7627L2728B80606K77869j68504K32830B29761
13644A48779E5001L66367A46942J3611N48479j09922j47142j96542J20929L14590
13634F90945k29746K10438j33707j83983P3256K19784B37856M6356j1597J26713
13624C99328J25790n0807l8790A28518K14533K7395J90424K69857B04460J75432
$$ plain form
13697 683940 605697 609447 488058 120770 444654 577978 402755 551671 857388 257555
13686 551362 172310 561822 603086 767402 100566 816389 286329 380613 587562 619806
13676 619806 654684 663180 747029 155350 211127 530003 333625 574360 747499 721809 595713
13665 595713 408791 733339 435726 478733 253483 308152 610336 760455 471513 641463
13655 641463 611753 492360 680092 642465 675193 280606 558475 389971 622801 229761
13644 148779 55001 421368 146942 160553 709032 599110 451968 255426 376355 690945
13634 690945 461199 671637 537930 353947 427203 646987 237856 284212 272615 399328
13624 399328 525118 474311 435521 128518 343051 370446 560870 830727 204460 379892
13614C79892J98898B08557q3061R9487L6666O676J85669j54487J57675m1477L99352
13603H15057B47644E2742Q2535K62571Q2443M4317j29019o0054J8506L00482A00813
13591C78704o9715m3867J91047k12570r0661K44211K6258P7266A84359M08111
13581E92470A58060l392J00491a1604D21549J30351B67284c0735A43777K92414
13571D36191k07616K5928K64737J73706k51592l225M3714p7709j65657r5731c2151
13559D12875E4983N67441B73380K54545F3686J90205n891P3895J92777j14531
13549D00141o344j70230G4337L3398J37890K04818A41067J53688I5921J6896Q6120
13538A98937K2157K31799A3364L60022n6580c7926G0723K00291o8689M21245B40869
$$ plain form
13614 379892 578790 208557 125496 224983 261649 268325 453994 299507 457182 415705 815057
13603 815057 247644 52742 135277 397848 480291 524608 395589 335535 354041 654523 100813
13591 378704 308989 265122 456169 243599 152938 397149 423407 500673 184359 592470
13581 592470 158060 154668 255159 -11604 421549 551900 267284 -30735 143777 436191
13571 436191 228575 254503 519240 692946 441354 438129 481843 404134 238477 142746 -32151
13559 412875 54983 622424 273380 527925 63686 253891 248000 321895 514672 400141
13549 400141 393797 223567 74337 107735 245625 450443 141067 294755 95921 112817 198937
13538 198937 221094 452893 13364 373386 316806 -37926 70723 271014 202325 623570 240869
13526C88914K23897k05823F4707J83850k7309M8214k3180J48300A49210M5746
13516A94956L15168l4107A48341J47589K61667j57950A37898J32878P481M8356
13506C26613A52018J89403A28281k0858a12562C24744N7039A29022K89814j50489
13496B68347Q1126j05587Q9423j4964E3499J73335J96178G6290L73855p8760A34738
13484E14986k51432E3976K4064K42683O1740R6337j68881j3944A09801K12296
13474C22097p0564c8310E6024J59516c7874B11942l5153p6176L5182B6281J34225
13463A60506K52736A36206a28826J5147B00493J01905K38563A26473o0872J4122
13453G9723L16908j58054B1196K19920J89305I4200K55527p9464l9974p4874L80703
$$ plain form
13526 388914 612811 406988 64707 248557 221248 269462 246282 394582 149210 194956
13516 194956 510124 476017 148341 295930 557597 399647 137898 270776 278257 326613
13506 326613 152018 341421 128281 107423 -112562 324744 381783 129022 418836 268347
13496 268347 349473 243886 333309 318345 53499 226834 423012 76290 450145 371385 134738
13484 514986 263554 53976 78040 320723 382463 478800 309919 295975 109801 322097
13474 322097 251533 -38310 56024 215540 -37874 211942 176789 100613 135795 26281 160506
13463 160506 413242 136206 -128826 -113679 200493 302398 540961 126473 65601 79723
13453 79723 396631 238577 21196 241116 430421 94200 349727 270263 230289 155415 536118
13442E36118B67436o4739l8380M6433r3139j1244b94665D233J44916c5744F4371
13430C66110p9641A37881R3092G3823B3363K94540a33948A87508E9814J97966
13420B57780R1665A40243c7669D74107J49400A77431K77704c6829C03061L9051
13410C42112A53449J90552R5476A87814B6578P0256c6061B88557J52248A42516
13399A00850K20295j45049K49172B07335I0589M3254K02475j61985a44611A3877
13388a68331B46677f0543H1216J25580k1534G4322k0498e6152J0568B61961H0586
13376f4227C10347j30642c5356A66909l2917b18468A66537N5501M9428J3762D0978
13364A0109R0339K14822F0133J5896f669A77467d6046B70340j14540L38790F1942
$$ plain form
13442 536118 267436 202697 164317 210750 117611 106367 -294665 4233 149149 -35744 64371
13430 366110 286469 137881 230973 73823 23363 317903 -133948 187508 59814 257780
13420 257780 349445 140243 -37669 474107 623507 177431 455135 -36829 303061 342112
13410 342112 153449 344001 439477 187814 26578 96834 -36061 288557 440805 142516
13399 100850 321145 176096 425268 207335 90589 133843 336318 174333 -144611 13877
13388 -168331 246677 -60543 81216 206796 185262 74322 53824 -56152 -45584 261961 80586
13376 -64227 310347 179705 -35356 166909 133992 -218468 166537 222038 271466 285228 40978
13364 10109 100448 315270 60133 76029 -6669 177467 -46046 270340 155800 494590 61942
13352h198C9396P8813a7468D82556A17692J23049L5656G2550J39069K64893B16951
13340B37049j15608J99181H6287K8695B2842L86146O5851A11437J67283q0111
13330A98609a2029B31961Q979C799L29494m3278a1433C64191H0633P3893M4838
13319A99364j5905c7771A38828J38404e1279E26116d4747C08445A16395K05675
13309C22070h5024I243L17613N4397j10049a52578C67782q6327r8810o8267O985
13298A21363M9443C8932f2686D19711j87838K01L2139L3779j14238J46343o9208
13287B60889R5063a27743k8384D26985A63210a14938A25924J99587q8568c9322
13276B48145K6901G9159J39742K39668A58373f6289E4758K07893A0263L06014
$$ plain form
13352 -8198 39396 118209 -17468 482556 117692 240741 276397 72550 211619 476512 216951
13340 237049 121441 320622 86287 114982 22842 408988 474839 111437 278720 198609
13330 198609 -12029 231961 240940 3799 333293 290015 -11433 364191 80633 154526 199364
13319 199364 183459 -37771 138828 277232 -51279 526116 -44747 308445 116395 322070
13309 322070 -85024 9243 326856 381253 271204 -152578 367782 281455 182645 114378 121363
13298 121363 170806 38932 -62686 419711 231873 232074 264213 297992 183754 330097 260889
13287 260889 355952 -127743 -156127 426985 163210 -114938 125924 325511 236943 -39322
13276 248145 275046 79159 218901 458569 158373 -66289 54758 262651 10263 316277
13266C16277A0641b0422j47226C49853j54243K39060N258F9778g1364A00302a8574
13254A73835B9674K19971P737B2168J13336b47009A71303k8701R1093p2779B6714
13242a03750B65801p7442M5599j04517i3271G2118b00477A5941J7922i0374C16219
13230G7628P2884e04q4292a1944B48094r3837B5491K25087C1362a9813A45691
13218B7962n72c46176A82097p1649d6583F886J25442F2638f1945K6060D53300
13206I1356b35054B42061F6129d5071J2369H3757Q6216N6307j6232E3238B0889
13194B27137J19006A33839l9605a7164j02032a504E1281K4352L99817b628A65714
13182b69188i2095B28963a7570H0346K95512c6900B50946f3964A72493J93966
$$ plain form
13266 316277 10641 -20422 -167648 349853 195610 434670 439928 69778 -71364 100302 -18574
13254 173835 29674 249645 257382 22168 135504 -247009 171303 142602 233695 160916 26714
13242 -103750 265801 188359 233958 129441 -93271 72118 -200477 15941 33863 -90374 316219
13230 77628 150512 -504 -84796 -11944 248094 154257 25491 250578 31362 -19813 145691
13218 27962 27390 -346176 182097 110448 -46583 6886 132328 62638 -61945 -35885 453300
13206 91356 -235054 242061 66129 -45071 -32702 83757 169973 226280 210048 53238 20889
13194 227137 346143 133839 94234 -17164 -119196 -1504 51281 75633 475450 -2628 165714
13182 -269188 -92095 228963 -17570 80346 375858 -36900 250946 -63964 172493 366459
13172C66459B2812d3715C01139b15168k5436Q1274h471m64845D03180H3204K15854
13161B99058e9027j49004E3130k6556N0844k0487J256a15303a2676j78884g1194
13149H59b6142m9614j69046A1421a18029A64194K10374F714J57278C8723d1418
13137f8369E4125j2550L44183o1620d56491b2537A22078C6577h4397B20369i3393
13125B2872J07088A4451J54233l1634E9170J94540o2008F2978b82828C60628d253
13113c9280C83233a50577A67330m5159E021f6578m2742G9769e226k13888d4758
13101B76160a83953A51650J94841j3912A7972J73833L235F2221a53486H481f1752
13089A7027i4823A18268J08756k5854B0144J30862A6128L1302a08941G6705J41184
$$ plain form
13172 366459 22812 -43715 301139 -215168 -240604 -159330 -8471 -473316 403180 83204 299058
13161 299058 -59027 -208031 53130 26574 77418 56931 58187 -115303 -12676 -191560 -71194
13149 859 -26142 -75756 -244802 11421 -118029 164194 374568 6714 163992 38723 -41418
13137 -68369 54125 41575 385758 324138 -456491 -22537 122078 36577 -84397 220369 -93393
13125 22872 129960 14451 168684 137050 59170 253710 191702 62978 -282828 360628 -4253
13113 -39280 383233 -150577 167330 122171 5021 -66578 -109320 79769 -5226 -219114 -44758
13101 276160 -183953 151650 346491 332579 17972 191805 195040 62221 -153486 8481 -61752
13089 17027 -94823 118268 227024 201170 20144 151006 16128 47430 -108941 76705 217889
13078B17889m7620C0468K06785P4985a1461q7409K4803C8108b51626G3782N817
13067G9599K6418l566a3049A09914N3677k2242a89251G1086B5790b08946B541
13055a50748C90262h0585B96401a6265j14332A42035J24064e7133J2009F9609
13044E1163d8888C99827A12184l6277b23515C51299h3572A05383a02436B84662
13033C3044l266J13523b732G6066l2679K58378a41791A54758J12757A07968b13282
13021I4385L47196C5434R0057K9052J61483h3680I4351K0793c95513a28255f403
13009C55680j4466h0093q2431C41770E1829a16865P097C54224b1240C4249K74783
12998C09032J8435H919M0616c53357C11259A46426F8686K07539d0459C4004N035
$$ plain form
13078 217889 170269 30468 237253 312238 -11461 -98870 -74067 38108 -251626 73782 79599
13067 79599 106017 102451 -13049 109914 163591 141349 -189251 71086 25790 -208946 2541
13055 -150748 390262 -80585 296401 -16265 -130597 142035 266099 -57133 -45124 69609
13044 51163 -48888 399827 112184 75907 -223515 351299 -83572 105383 -102436 284662
13033 33044 29778 143301 -2732 76066 43387 301765 -141791 154758 267515 107968 -213282
13021 94385 441581 35434 125491 154543 316026 -83680 94351 115144 -395513 -128255 -6403
13009 355680 341214 -80093 -162524 341770 51829 -116865 -109768 354224 -21240 34249 309032
12998 309032 327467 8919 49535 -353357 311259 146426 68686 276225 -40459 34004 39039
12987C9039a13832B13581A06316D2977K11562j18635M1813a37672A56746a43641
12976f1771A00322K06417I8801L71281a45997k5774j90798E4309a076A39394a66869
12964g2328B35476b61814A71846e5309F9875L79904H6777J02814A0177a1016p9298
12953i0314A73359J00014a58999e8803B94993F5728J94478M5003b23702D3363
12942c13178F1616M7059g3852B95086B1951K49035C4834K40386C7181Q8572a56570
12930D007b58512f5780E2541K07828e7495m3478m7800f8408f002l06240d8562
12918C0886M5662K5002A6284e3230j12272B4755g2343A24145L0761C5159P6796
12907A11955O1414M9804f9555J4412k21705C9726N48210A67563L3783Q6581F6084
$$ plain form
12987 39039 -113832 213581 106316 42977 254539 135904 177717 -137672 156746 -143641
12976 -61771 100322 306739 98801 470082 -145997 -171771 -362569 54309 -1076 139394 -166869
12964 -72328 235476 -261814 171846 -55309 69875 449779 86777 189591 10177 -11016 -90314
12953 -90314 173359 273373 -158999 -58803 294993 65728 260206 305209 -223702 43363
12942 -313178 61616 108675 -73852 295086 21951 270986 34834 275220 37181 125753 -156570
12930 4007 -258512 -65780 52541 260369 -57495 -100973 -148773 -68408 -6002 -312242 -48562
12918 30886 76548 101550 16284 -53230 -165502 24755 -72343 124145 154906 35159 111955
12907 111955 173369 223173 -69555 -55143 -276848 39726 587936 167563 201346 287927 66084
12895e8120I0586K01515d3561G3302J43886c7352A61601R5078b75951L5880i1999
12883a27775j49668C3015J93075A3107M26442c00097H1137K60476B7489b82422
12872b66016E5403J89602i5388B42190b65512a19270d8626A61168D8048a78748
12861A59677e800j80330F0800J18441d5542b0602D38644c56978A18236L14437
12851D32673j15309a96928A11926J13295B6254L8532d3823n7603A50869d5022
12840A06439i6376k0261d9134A88868b57364C5915a12429j04206A19415a9452
12829b1249A34360J57205a81663C65631a65763p7128b5502k82467A94733K2473
12819B17206I9677b99639A01806Q0646F6090c2364A66958d1880E530J08104K0875
$$ plain form
12895 -58120 90586 292101 -43561 73302 217188 -37352 161601 256679 -275951 -240071 -91999
12883 -127775 -277443 33015 226090 13107 439549 -300097 81137 341613 27489 -282422
12872 -266016 55403 245005 -95388 242190 -265512 -119270 -48626 161168 48048 -178748
12861 159677 -5800 -186130 60800 179241 -45542 -20602 438644 -356978 118236 432673
12851 432673 317364 -196928 111926 225221 26254 64786 -43823 -101426 150869 -45022
12840 106439 -96376 -116637 -49134 188868 -257364 35915 -112429 -216635 119415 -19452
12829 -21249 134360 291565 -181663 365631 -165763 -242891 -25502 -307969 194733 217206
12819 217206 99677 -299639 101806 182452 66090 -32364 166958 -41880 5530 113634 134509
12808A34509D3260f4305J9651p6428A62311c2369A00596A4433J3736Q8350a3306
12796a93597b7902F4131e5265F1417a55095B24448c2037B29894C4034Q6496a1845
12784c092k69208A75a01105d8447Q126k44032B7443J58363J98098a41021A84119
12772a27266a7383k18521e2366E5158L7014J63072i6206E1323J30516i2054A39677
12760D9412L4666K54584b67887C49764d2476o4023B62865D5885o651d6719j54725
12749b01444a8227B477i5396p4280j9306f4078G4591B9228L52472i4828J5952
12738g8876j06516D1326G870L98303a73477c8758A4218f9658j4682A00964c2492
12726A31376P8597H2599a17275A18313N7884J33438c17730J09000f2658K9817
$$ plain form
12808 134509 43260 -64305 -44654 -121082 162311 -32369 100596 14433 28169 116519 -13306
12796 -193597 -27902 64131 -55265 61417 -155095 224448 -32037 229894 34034 120530 -11845
12784 -3092 -272300 175 -101105 -48447 -40321 -284353 27443 185806 383904 -141021 184119
12772 -127266 -17383 -235904 -52366 55158 92172 255244 -96206 51323 181839 -92054 139677
12760 49412 84078 338662 -267887 349764 -42476 -106499 262865 45885 39234 -46719 -201444
12749 -201444 -18227 2477 -95396 -169676 -188982 -64078 74591 29228 381700 -94828 -78876
12738 -78876 -185392 41326 7870 406173 -173477 -38758 14218 -69658 -84340 100964 -32492
12726 131376 209973 82599 -117275 118313 176197 309635 -317730 -208730 -62658 -32841
12716c2841C02273R3159B0345M6124b66993A3492J67905G7562K7773b23330l05570
12705e28900A0297O8274N7972a80333F4699b18496H8643a19352A07254l435B3321
12693A53625L52759E5509m337J74339J15316A04989K42870j24794m9261c37700
12682b5361j3409C2107a04526B3597K556J60620b11576I0600L3784c4199k33227
12671b67426B76357p4880b10931g0207m9510A88930C6916a04545A31976E6403
12660A91934b2266A72109M5167c5984D6718R558k3437a29197H2759b07255C1517
12648a00799k2638A78299C9099e6012j8659j56756A96704M7975B0446K36516r3038
12637A63924a12572C02091f6185j88601B28165e0525e594E4327e5297B18353j4423
$$ plain form
12716 -32841 302273 395432 20345 66469 -266993 13492 181397 77562 105335 -223330 -528900
12705 -528900 10297 78571 136543 -180333 64699 -218496 88643 -119352 107254 103819 23321
12693 153625 506384 55509 51172 225511 340827 104989 347859 223065 173804 -337700
12682 -25361 -38770 32107 -104526 23597 26153 186773 -211576 90600 124384 -34199 -267426
12671 -267426 276357 201477 -210931 -70207 -119717 188930 36916 -104545 131976 56403
12660 191934 -22266 172109 217276 -35984 46718 56276 32839 -129197 82759 -207255 31517
12648 -100799 -123437 178299 39099 -56012 -74671 -231427 196704 244679 20446 256962 163924
12637 163924 -112572 302091 -66185 -254786 228165 -50525 -5594 54327 -55297 218353 203930
12626B03930I3593b0470k3669m6544B16723I3769f0454A0756f3784k29893f0069
12614A69382J56142a2888k6450G9653d185A26333P7852J0923c2572m2193p007
12603h1772f392A5699a73103B49353a74905d2023A8814d16331h0433j05695j63027
12592c49155A08121l5467a4558A96203J95752A80295q99K7557O2682K8956c0693
12580E1237K87239j27063g2670Q892C12151a25458d610A47811j6414f468G3024
12568c7619j57595a0122A07851j7838A779b98j15358m6165j02642j5279i555I3868
12555a07200A56432j1559B9329L894i0473n0301B29879a80232K6356b1632C5610
12543A85337c5619f883j20441e40D11J29372a91484N8047H2838D1301a40268b7490
$$ plain form
12626 203930 93593 -20470 -44139 -90683 216723 93769 -60454 10756 -63784 -293677 -60069
12614 169382 325524 -12888 -39338 79653 -4185 126333 204185 215108 -32572 -74765 -81772
12603 -81772 -6392 15699 -173103 249353 -174905 -42023 18814 -416331 -80433 -186128 -349155
12592 -349155 108121 72654 -14558 196203 391955 180295 179396 206953 269635 298591 -30693
12580 51237 338476 211413 -72670 -63778 312151 -125458 -4610 147811 131397 -6468 73024
12568 -37619 -195214 -10122 107851 90013 1779 -298 -115656 -161821 -264463 -279742 -9555 93868
12555 -107200 156432 144873 29329 33223 -90473 -140774 229879 -180232 -153876 -21632 35610
12543 185337 -35619 -6883 -127324 -540 411 129783 -191484 -133437 82838 41301 -140268 -27490
12530b13104h4111o2612A0138Q0569b04417f3689q1648B8046K223L13418a5644
12518a38596F9271K2900a03466c3858A74384b32185O6769e5600A85622H0252d43126
12506b2738A83873H2404K7711h5715j0896K0583D9119O7938m2819N0868c92369
12494e0024k35498a07871d7157B7239a39148m3685j32471B05474i8851A89203
12483b9813C79471f0125A80495G1688a89105B97912i3398K2198a5595F7345J06504
12472A73849J09688b77519J32391l3331C4915a57811g8793J3063B03218c21941
12461b42173d9922A13178g7064A53953E8822P0271i4662a6332D03047E6260K51243
12450C07503A24731J34529D5904Q2472h6960j63605K9687A40381b34683k8213
$$ plain form
12530 -213104 -84111 -146723 10138 90707 -204417 -63689 -145337 28046 30269 343687 -15644
12518 -138596 69271 92171 -103466 -33858 174384 -232185 -165416 -55600 185622 80252 -443126
12506 -22738 183873 82404 110115 -85715 -96611 -76028 49119 117057 74238 125106 -392369
12494 -50024 -285522 -107871 -47157 27239 -139148 -182833 -315304 205474 -98851 189203
12483 -29813 379471 -60125 180495 71688 -189105 297912 -93398 -71200 -15595 67345 173849
12472 173849 283537 -277519 -145128 -178459 34915 -157811 -78793 -65730 203218 -321941
12461 -242173 -49922 113178 -77064 153953 58822 129093 -94662 -16332 403047 56260 307503
12450 307503 124731 259260 45904 128376 -86960 -250565 -220878 140381 -234683 -262896
12440b62896f4256j90745A98035i3964B18817a10009j39653a22768m3314c6936
12429E9421a01571A60066a2377j04584D2104F920h061n703q1643B0617i5373A14095
12416D2866b12098B11240b18448o2081A14628b26940b7729A57754e0669a6179
12405B43458I6492b7802j58316k60748a72957B64101f0267B31644j05557d5419
12394a23061j1159B0705e7822A5518D693M8882K3532a4093l9994A26437f8065
12382f6639A04739a9764o6186D5128K238a71797h440o348b167o9146j48460f6260
12369i578n0870K2685F49327A37711a00749q9488L2887H7117K28888f8580A31624
12357e3661B84431b07347G1499L7180g4942B59414b14228n1774F979c19600C5354
$$ plain form
12440 -262896 -64256 -255001 198035 -93964 218817 -110009 -249662 -122768 -166082 -36936
12429 59421 -101571 160066 -12377 -116961 42104 6920 -8061 -13764 -95407 20617 -95373 114095
12416 42866 -212098 211240 -218448 -280529 114628 -226940 -27729 157754 -50669 -16179
12405 243458 96492 -27802 -186118 -446866 -172957 264101 -60267 231644 126087 -45419
12394 -123061 -134220 20705 -57822 15518 4693 53575 77107 -14093 -54087 126437 -68065
12382 -66639 104739 -19764 -85950 45128 47366 -171797 -8440 -14788 -2167 -71313 -219773 -66260
12369 -9578 -60448 -37763 649327 137711 -100749 -190237 -157350 87117 316005 -68580 131624
12357 -53661 284431 -207347 71499 108679 -74942 259414 -214228 -266002 6979 -319600 35354
12345c01928C266K26517a65442O3680r3138k95191B97881C6406a58179q7050C520
12333B33237B7608K12072b67257b7537F4929f4182E588f3437j57426A75111d2611
12321A21684a54326D485L14746H6800J90537a20287A96126j8422O0905a0506A64445
12309A40614k7331D6171c9627I3030f800C145J16073J06572K21805B11795P7190
12298B88985P0848B521O8600g219A83754a48936F6276J25634b1710i370B09455
12286A97279E0305a72548B30501H3421f3834k50377B053J60808a39756O0630k01303
12275b80429A67914J11569E6545b75362A07139m7368M3666L3085A9288J91948
12265B11236K1770H4757N1363P6381o3495b55396h7551A16160m5267J15896F980
$$ plain form
12345 -301928 3266 229783 -165442 -101762 -194900 -490091 297881 36406 -158179 -245229 3520
12333 233237 27608 239680 -267257 -27537 64929 -64182 5588 -63437 -220863 175111 -42611
12321 121684 -154326 4485 319231 86800 277337 -120287 196126 177704 238609 -10506 164445
12309 140614 113283 46171 -39627 93030 -6800 3145 119218 225790 447595 211795 288985
12298 288985 359833 2521 71121 -7219 183754 -148936 66276 191910 -21710 -9370 209455
12286 197279 50305 -172548 230501 83421 -63834 -314211 2053 162861 -139756 -79126 -280429
12275 -280429 167914 279483 56545 -275362 107139 59771 103437 136522 19288 211236
12265 211236 233006 84757 136120 212501 149006 -255396 -87551 116160 70893 186789 6980
12253A09992K6374l8178A049L3181K7976J13238K42991A23358J54993A23303J19033
12242B42336B5983K42092O852a50057A77636E878d1164A56521a49258C35008G3918
12230F3503B3550K9028M6303m5717O9682a4374A86643G815a85835C34773j58197
12219A76576c4332A24349a45750B89743A20627j461d2039B40051h989A24990C2634
12207B52492Q9954G2211a07722d7019A9442L91675O1655B22240a50341b0975A71551
12195C0801J73660R8848p2433j13518K836J90656R043j05729F4981h4949D2053
12183G5475Q196a98302C54606l6570k8578d5543E20634a00882C21211Q665j64726
12172A65150b31603A6168K0582A3440N36213j54306b43850A34624K74233A20628
$$ plain form
12253 109992 136366 98188 1049 34230 62206 175444 418435 123358 278351 123303 242336
12242 242336 25983 268075 274927 -150057 177636 5878 -41164 156521 -149258 335008 73918
12230 63503 23550 52578 98881 53164 122846 -14374 186643 7815 -185835 334773 176576
12219 176576 -34332 124349 -145750 289743 120627 119166 -42039 240051 -8989 124990 32634
12207 252492 342446 72211 -107722 -47019 19442 411117 472772 222240 -150341 -20975 171551
12195 30801 204461 303309 230876 117358 120194 310850 319893 214164 64981 -84949 42053
12183 75475 83671 -198302 354606 318036 289458 -45543 520634 -100882 321211 329876 165150
12172 165150 -231603 16168 36750 13440 549653 395347 -243850 134624 408857 120628
12161B43007a41860B75655a96189D1194a11307A02266D500N11134j40599J02757
12151D77792k290j67285l2945p1827l6027p3759J44029L034a25086F0674K96846
12140C57520A77810H7630J94443j6501K2302C3638e6087A53343c73628A39236
12129A87065e3137j52752L8356D21407I2194K8843A690J47158e0139L856A62886
12117d8083a6980n1556A20560C2673a09388p2041q5475B9066L34001B5799N1984
12106G7783c15496D09360H5164O5875B461M71200A26281D0465M52972a9351k05401
12095b24752C58517f7147A29742o1184J52812K01982b5410C2400n7l731J5238
12084D3850J45717K9972h9681E6225e4625I8044A333f830j1694A20032J6473m8690
$$ plain form
12161 243007 -141860 275655 -196189 41194 -111307 102266 4500 515634 375035 477792
12151 477792 475502 308217 275272 203445 167418 93659 237688 240722 -125086 60674 357520
12140 357520 177810 87630 282073 265572 287874 33638 -56087 153343 -373628 139236
12129 187065 -53137 -205889 -167533 421407 92194 121037 1690 148848 -50139 -46283 162886
12117 -48083 -16980 -68536 120560 32673 -109388 -181429 -266904 29066 363067 25799 77783
12106 77783 -315496 409360 85164 151039 2461 473661 126281 40465 493437 -19351 -224752
12095 -224752 358517 -67147 129742 68558 221370 423352 -25410 32400 32343 28612 43850
12084 43850 189567 219539 -89681 56225 -54625 98044 1333 -6830 -18524 120032 136505 87815
12072H7815J38833E7751b51678B91662E9977h8612j43691I2293K07808D0060K90288
12061C30348C6727N047M7512J19692D5233i0175M1442b0413k7587A71878l6757
12050A35121Q1670a0370A86993j9383j3871L3386b03868d0382C3404J05960d6309
12038A65752K70923B9794a92563m0729J04314G2061J98069f8552A44644i3216
12027A5613P8981f4747j33456A93999p5966h6452k41731d0587A92777C3670L7537
12016G1207N0701D2102d885l48147O8264J12815q7181B73444n3491g92p5810J1668
12004f4934B99222b46301I8031a0388j01441K2260A45954A8184a13566B38703
11993B25384b00402A31123Q8972b94899A74963a6749k28124A29550b08795h7077
$$ plain form
12072 87815 226648 57751 -251678 291662 59977 -88612 -232303 92293 300101 40060 330348
12061 330348 36727 41774 89286 208978 45233 -90175 -48733 -20413 -48000 171878 135121
12050 135121 216791 -10370 186993 167610 153739 187125 -203868 -40382 33404 139364 -46309
12038 165752 436675 29794 -192563 -233292 -128978 72061 270130 -68552 144644 -93216
12027 15613 94594 -64747 -198203 193999 118033 -86452 -328183 -40587 192777 33670 71207
12016 71207 121908 42102 -4885 -353032 -284768 -171953 -259134 273444 219953 -792 -76602 -64934
12004 -64934 299222 -246301 98031 -10388 -111829 -89569 145954 18184 -113566 238703
11993 225384 -200402 131123 220095 -294899 174963 -16749 -244873 129550 -208795 -87077
11982a66539C33962G6227f9001l0863B2505a4978p4617C364b37805C14187A47125
11970a00440F287L85538b17004I7246N3555b58160d8014j91329A34737E9759b88456
11958b59214B61242a1137D2945f7684A90631G2683J08167d0975A51300d8178o0911
11947a09089F941Q2846b61370a06185g24r4150A25031e2921G07a79106B38692
11935d5430j24679D3190a16757E9694Q2347b84599g0354a4760j91594d6752p7968
11924a24720A7611a97471d8573j26080f0841r5187A72956P727a3763o3354b8592
11912A86170P4671A30156D640g8481l4881j07319A4726b43066A7760P9905a47879
11900a68124a5472j60904C4414J91033A06691f4442j0982b1145B70211a11449
$$ plain form
11982 -166539 333962 76227 -69001 -99864 22505 -14978 -89595 3364 -237805 314187 147125
11970 -100440 6287 391825 -217004 97246 150801 -258160 -48014 -239343 134737 59759 -288456
11958 -259214 261242 -11137 42945 -67684 190631 72683 180850 -40975 151300 -48178 -109089
11947 -109089 6941 89787 -261370 -106185 -724 -94874 125031 -52921 707 -179106 238692
11935 -45430 -170109 43190 -116757 59694 142041 -284599 -70354 -14760 -206354 -46752 -124720
11924 -124720 17611 -197471 -48573 -174653 -60841 -156028 172956 180683 -13763 -77117 -28592
11912 186170 260841 130156 4640 -78481 -113362 -220681 14726 -243066 17760 97665 -147879
11900 -168124 -15472 -176376 34414 225447 106691 -64442 -75424 -21145 270211 -111449
11889D27043E3916a74629a9023A62413n2742J51234b30429L4960g5111b8356I7297
11877b60065a16668j05698A23982b7726j98534A43932a60296d7093I1737b32594
11866a21207G2478a33534p0479F216L0709a58047k66758g9983n0167f1411j99588
11855b60999h8737d4076C13857G6523k7343L5551h523D7459A0104b58582a10803
11843I6998a50733e4696A30522J778d00452C1532d22987a17854J7808j58060C57700
11831a64283d0553l38755R4680F9123c43065A90609G1295i0232C2328J76842Q2175
11820B91345c18091f874I7125a80757B41086b64740P7638O1341e9906C13053a86845
11808E6303a59601b2374o0033j25287d9923P035J0296B4640i8651r3693C9967
$$ plain form
11889 427043 53916 -174629 -19023 162413 109671 260905 -230429 -195469 -75111 -28356 97297
11877 -260065 -116668 -222366 123982 -27726 -226260 143932 -160296 -47093 91737 -232594
11866 -121207 72478 -133534 -204013 6216 36925 -158047 -424805 -79983 -130150 -61411 -260999
11855 -260999 -88737 -44076 313857 76523 49180 84731 -8523 47459 10104 -258582 -110803
11843 96998 -150733 -54696 130522 132300 -400452 31532 -422987 -117854 -100046 -258106 357700
11831 -164283 -40553 -379308 -284628 69123 -343065 190609 71295 -90232 32328 209170 291345
11820 291345 -318091 -6874 97125 -180757 241086 -264740 -187102 -125761 -59906 313053 -186845
11808 56303 -159601 -22374 -82407 -207694 -49923 -42888 -32592 24640 -98651 -192344 39967
11796i7270a2115j16533k92173G640K68947c22841A43661a62288j99794a78992
11785H9779b10613b5697F0034K38406a12403A49062d7479I3776a4602o8564j07377
11774a90543F1371d3016m9548B25571h7157E6729j0512a20335l3899C20035a64390
11762B4420J18806J60234d26435d865k23756H6330c4638N897Q123k18905G38a39225
11749a98484j50868M4517J52403j37600a3511m05215h6997D1276j9608b11912
11738b66552J29732r1838D2136a04403A50458d1586A50271h7181I2656c82857
11727a43435B71522j18198a69531d5321k43144A72953e5695C2295e20558I2061
11716d5597j41499f6906C32840A11389d819B83491f0666C16855b2353l05203A8848
$$ plain form
11796 -97270 -12115 -128648 -420821 7640 276587 -322841 143661 -162288 -362082 -178992
11785 89779 -210613 -25697 60034 298440 -112403 149062 -47479 93776 -14602 -83166 -190543
11774 -190543 61371 -43016 -92564 225571 -87157 56729 46217 -120335 -154234 320035 -164390
11762 24420 143226 303460 -426435 -4865 -228621 86330 -34638 -28741 -20618 -239523 738 -139225
11749 -198484 -349352 -304835 -152432 -290032 -13511 -418726 -86997 41276 21668 -211912
11738 -266552 -136820 -228658 42136 -104403 150458 -41586 150271 -87181 92656 -382857
11727 -143435 271522 153324 -169531 -45321 -288465 172953 -55695 32295 -520558 92061
11716 -45597 -187096 -66906 332840 111389 -4819 283491 -60666 316855 -22353 -327556 18848
11704a80058B31762a25775E3606L062O2305C4332a82825B13233b16164G1899b17372
11692B05927K68755J11299b5173B23384e0483j43274B45956a86574P3707a9157
11681f3987L495j14358g9592n1685C9056J56565a0325l9056j24827E19685c26366
11669B43558Q8199j60155J40785H8588a27594D72765A92354a15873M7089b8353
11658b74326B26084D6964b79497f0469A6177c1288k11934b1095j59933B25753
11647E0040b396B6850g3274j5490A50140J51607d7561K2609E1667R5315k3932
11636A23050d4019G0035J43419b19057A53810i9207H1697J9954f572E4198N2620
11625A06818b61366H644J78636F1102i5697o8637n7799k5244J7177D0598e1063
$$ plain form
11704 -180058 231762 -125775 53606 56668 118973 34332 -182825 213233 -216164 71899 -217372
11692 205927 474682 585981 -25173 223384 -50483 -193757 245956 -186574 -112867 -19157
11681 -63987 -60492 -174850 -79592 -131277 39056 195621 -10325 -49381 -174208 519685 -326366
11669 243558 331757 171602 312387 88588 -127594 472765 192354 -115873 -68784 -28353
11658 -274326 226084 46964 -279497 -60469 16177 -31288 -243222 -21095 -181028 225753
11647 50040 -2396 26850 -73274 -88764 150140 301747 -47561 -24952 51667 146982 123050
11636 123050 -44019 70035 213454 -219057 153810 -99207 81697 101651 -6572 54198 106818
11625 106818 -261366 8644 187280 61102 -95697 -164334 -222133 -247377 -230200 40598 -51063
11613D0930c0893F9428b26537B05939h0108F346J53095c29110l4863I9375f7930
11601A35679b22178i6622C29465a1442j2297k9037l20360d0067A7402L5965c04536
11589a01578A52380a0645F9665P770K3283a05017D6523L50387b00865A40016i8275
11577A75210C0702L03202i6374j99990b5232r5794A54945E059i8782K4313j88377
11566b62846d3209B05110h8800A5300a33354K5313o1812k45510J82988E658d9920
11554A87463k4278C0939J06050J07042b40640c5380A5386a61412A6431f7148l7272
11543a04420K7713q269A9102b64273J23187H1583l9681C865a33070d7722k7990
11532g5712B91597j0504d7487D15923b68363A9879h4329I1796D713M40666k20708
$$ plain form
11613 40930 -30893 69428 -226537 205939 -80108 6346 159441 -329110 -363973 99375 -67930
11601 135679 -222178 -96622 329465 -11442 -23739 -52776 -373136 -40067 17402 53367 -304536
11589 -101578 152380 -10645 69665 77435 100718 -105017 46523 396910 -200865 140016 -98275
11577 175210 30702 333904 -96374 -296364 -25232 -121026 154945 5059 -98782 -74469 -262846
11566 -262846 -43209 205110 -88800 15300 -133354 -108041 -169853 -415363 -232375 5658 -49920
11554 187463 163185 30939 136989 244031 -240640 -35380 15386 -161412 16431 -67148 -104420
11543 -104420 -76707 -84976 19102 -264273 -141086 81583 41902 3865 -133070 -47722 -75712
11532 -75712 291597 281093 -47487 415923 -268363 19879 -84329 91796 4713 445379 224671
11521B24671G3838K57135b58128i0840D6695R9765R2045A00752a3774o8674k82142
11510c64590B07234a94418h1713a8979B26545G3370Q7341J33258a22472B95142
11499a87356B45006g4744I9036m7484J15249J46425i1024k84171a13182J9462
11489i3720C75849L3717L066a32718A11454A2838K42531g4888C88604j01726h2921
11477A13822m218n3662J22031b11123G3776J19988h1985j70629A01401J55437
11467B56838d4827j61247I9305L6496a0819j55095I8148L67475j44099a18029
11456A68937b91012c3435j40990J7303A81054J07580a47703B04640J22951H9662
11445a0351k4187A49315f654A27084B6984K05925a47710D02429A6146J34782g6809
$$ plain form
11521 224671 73838 330973 -258128 -90840 46695 146460 238505 100752 -13774 -82448 -364590
11510 -364590 207234 -194418 -81713 -18979 226545 73370 160711 293969 -122472 295142
11499 -187356 245006 -74744 99036 51552 166801 313226 -91024 -375195 -113182 -93720
11489 -93720 375849 409566 412632 -132718 111454 12838 255369 -74888 388604 286878 -82921
11477 113822 109604 55942 177973 -211123 73776 193764 -81985 -252614 101401 256838
11467 256838 -44827 -206074 99305 135801 -10819 -165914 98148 465623 321524 -118029
11456 168937 -291012 -33435 -174425 -157122 181054 288634 -147703 204640 327591 89662
11445 -10351 -34538 149315 -6654 127084 26984 232909 -147710 402429 16146 150928 -76809
11433B51383c441B5404J08661J9117B9591J16987C8495a23642M2086C79851j54162
11422B25689G1613b1614E351L6611a57116A51289c6858H1190c80642B66276C6434
11410c89960b2971k20281E4959i7224G0167k4975J53881G1241j8310E519i3422
11398A19829a04719h977D9914c9948h91C55590c7266j40580A89475E7268k4591
11387C2677a57198q8178A57622d7854A96946C4242P2282K44954b47249p7149H6665
11375A51072b95951J08097N9094H0256a7113k20650m2738D2216R72j7373a6316
11363b40372N6057B9102b6156B95638I0663d32572J43439a31681D5936b24042
11352a47470l0813j36333g8686G7115J7516a78414h2470l1124Q902j0992A79019
$$ plain form
11433 251383 -3441 25404 134065 153182 29591 146578 38495 -123642 -81556 379851 225689
11422 225689 71613 -21614 5351 41962 -157116 151289 -36858 81190 -380642 266276 36434
11410 -389960 -22971 -243252 54959 -97224 70167 45192 199073 71241 52931 5519 -93422
11398 119829 -104719 -8977 49914 -39948 -891 355590 -37266 -177846 189475 57268 32677
11387 32677 -157198 -245376 157622 -47854 196946 34242 106524 351478 -247249 -324398 86665
11375 151072 -295951 -187854 -128760 80256 -17113 -237763 -280501 42216 43188 25815 -16316
11363 -240372 -184315 29102 -26156 295638 90663 -432572 -289133 -131681 45936 -224042
11352 -147470 -178283 -314616 -78686 77115 94631 -178414 -82470 -113594 -104692 -115684 179019
11340A47493a7006o462E38059a78575A58018Q3775b5420p7691M4064b8930l18065
11329c46995A96488i1754A7145L20978A35022g9159a7493E4794e0299A38791c39395
11317b996j87669C5522R5239d9686k22697d7484a1183k57678A37405E0865J37941
11306A88806m7025c6444j73668J3050A86922D3924J22998a69264G4735Q1899a15401
11294b46165R8032A26100b241k97281R2241A41554d91466g8454A39425o2093a08006
11282a87362b3682o7866K1422E365N3241a12872D34468j96862j07778a38504e5977
11270b82348P0776Q3233O1597A49498O815a34361k99484I9316j4063d2824j755
11259d4579j99150G0778a80269B3529K01110a5364l0785A07613J68766b19163
$$ plain form
11340 147493 -17006 -23468 538059 -178575 158018 241793 -25420 -103111 -59047 -28930 -346995
11329 -346995 196488 -91754 17145 338123 135022 -79159 -17493 54794 -50299 138791 -339395
11317 -2996 -190665 35522 130761 -49686 -272383 -47484 -11183 -268861 137405 50865 188806
11306 188806 141781 -36444 -210112 -197062 186922 43924 166922 -169264 74735 156634 -115401
11294 -246165 -148133 126100 -2241 -299522 -207281 141554 -491466 -78454 139425 77332 -108006
11282 -187362 -23682 -91548 -70126 5365 58606 -112872 434468 237606 129828 -138504 -55977
11270 -282348 -211572 -128339 -66742 149498 156313 -134361 -433845 99316 85253 -42824 -44579
11259 -44579 -243729 70778 -180269 23529 224639 -15364 -46149 107613 276379 -219163
11248I4810g4729j94459b4961o2213j00585j6280j97856a39834A68462e0041k23925
11237b73966F7960a63119l49435a15963q9431J00878j69577F2022f1992B0508
11226A6038L5842R264a76424M0669C5305a67848k357n6410B4221J53264O8177
11215B45662d3739j4516j09105L3299p1312B04986F2373K8385l2614O8709b92795
11203B26069b01851N6190B24208d1221j12732M9824j09484C84533i7749E7749
11192c49083C3515h1745F8689a24910A77755b09623H0085a62385j17870I2249
11181f4743j82415H8953a09343F0949b0839k1667j80492H8419b11537A40674e9547
11169b21762B0222Q0718a14472B23113g0800E7300c90142Q0023j0113D0545b22137
$$ plain form
11248 94810 -74729 -269188 -24961 -87174 -187759 -204039 -401895 -139834 168462 -50041 -273966
11237 -273966 67960 -163119 -512554 -115963 -205394 -104516 -274093 62022 -61992 20508
11226 16038 51880 61144 -176424 -135755 35305 -167848 -170205 -226615 24221 177485 245662
11215 245662 -43739 -58255 -167360 -134061 -205373 204986 62373 90758 58144 126853 -292795
11203 226069 -201851 -145661 224208 -41221 -153953 -104129 -213613 384533 -97749 57749
11192 -349083 33515 -81745 68689 -124910 177755 -209623 80085 -162385 -280255 92249
11181 -64743 -247158 88953 -109343 60949 -20839 -42506 -222998 88419 -211537 140674 -59547
11169 -221762 20222 100940 -114472 223113 -70800 57300 -390142 -310119 -320232 40545 -222137
11157g7896c2151A21446a01095j48340A06752a66795D7311j0688J02523b83934
11146H6044b27449c4815j40649E6002J2712a22558N7183B28674b40453A34314
11135d2156j13062j60029H5668c67138A25372O0808c03033a01131A34817a77291
11124b02344a1637j11283A37195a99686l478a1458l04099Q9987A5910a32168A01475
11112B18894J30401a24724G0991q493b8143A99245J33290C9639K7413D120h8664
11100A15385a70093A65330E510K71184c707A66076m0985C9708A8062B118J15803
11089A17921i6063D50735F0307R3667R7920a22472A34583k2536J10448K5075J47716
11078C95286A23205L0863b20260P582c9772k3086C99215j57712L24299B9711O556
$$ plain form
11157 -77896 -32151 121446 -101095 -249435 106752 -166795 47311 36623 139146 -283934
11146 86044 -227449 -34815 -175464 56002 68714 -122558 -65375 228674 -240453 134314
11135 -42156 -155218 -315247 85668 -367138 125372 186180 -303033 -101131 134817 -177291
11124 -202344 -11637 -122920 137195 -199686 -203164 -11458 -315557 -225570 15910 -132168 101475
11112 218894 349295 -124724 70991 62498 -28143 199245 332535 39639 67052 4120 -88664
11100 115385 -170093 165330 5510 276694 -3707 166076 125091 39708 18062 2118 117921
11089 117921 -96063 450735 60307 153974 251894 -122472 134583 112047 222495 247570 395286
11078 395286 123205 154068 -220260 -212678 -39772 -62858 399215 241503 565802 29711 36267
11067C6267J65737r9975e3557C37998A23010a27665D44226K680f398D52167G8941
11055B12892j01324h266A00265j0172M6007B5935O33320i2154B93701J94003j68553
11044C19151j23547C277K56447R0243q0446K63143A36867K15887J38372r0105
11034D01021L88699C22556J44538j77536K25241J77581k49314J58390M72473E20196
11023F92685B63433M16189q0643k23030J63771j06895J48862m6558l4191c4721
11012B80379K63817J80271j21578l078H3664N72166k28743l9132K97524k13155
11002D72324j20455L23814C17804p6535J54399N2284J54714j13398K22306j94968
10992E16606n5625R9003n1055L23488l69559p241L21400k12623j76025J44462
$$ plain form
11067 36267 202004 102029 -53557 337998 123010 -127665 444226 446906 -6398 452167 78941
11055 212892 111568 -8266 100265 90093 136100 25935 659255 -92154 293701 487704 319151
11044 319151 195604 3277 259724 349967 269521 532664 136867 352754 491126 401021
11034 401021 789720 322556 467094 289558 514799 692380 443066 601456 1073929 520196
11023 692685 263433 679622 598979 375949 539720 432825 581687 535129 500938 -34721
11012 280379 544196 724467 602889 599811 83664 655830 427087 387955 685479 472324
11002 472324 351869 675683 317804 241269 395668 447952 602666 489268 711574 516606
10992 516606 460981 559984 508929 832417 462858 455617 777017 564394 388369 532831
10982E32831Q992j97585l3339M12457k93240O9112k14019J15323k3369P5004J44113
10971E96280j28960L48200j17443k3302l7423L25477k25519l3552L59981r7059
10961I66680O8142J3927o4971K87928O7731K60628N22875j5191K3753l36130M6660
10950A842032k25378r975j95512M45251n32073L5043k32071k14479M13711l15207
10940A011342K19077L8767o1493p6395K40634J63704n90533k92421M38774E24012
10929E37375R5830j10818k17798q4709b0418C28989p8358A08957m5910H064a22718
10917f362A74044c28534J25796C01159a41778b1882D09224B8697a20573C23691
10906c7796B72426A8259b01005g0808p4818d4622q1619F7426K08923A8323L77830
$$ plain form
10982 532831 541823 344238 310899 723356 430116 499228 285209 400532 377163 452167 596280
10971 596280 467320 815520 698077 674775 637352 962829 737310 703758 1063739 966680
10961 966680 1034822 1048749 983778 1271706 1339437 1600065 2122940 2107749 2131502 1795372 1842032
10950 1842032 1616654 1606679 1411167 1856418 1324345 1359388 1127317 912838 1326549 1011342
10940 1011342 1230419 1269186 1207693 1131298 1371932 1535636 945103 652682 1091456 524012
10929 537375 633205 522387 304589 219880 -20418 328989 250631 108957 63047 8064 -122718
10917 -6362 174044 -328534 -202738 301159 -141778 -21882 409224 28697 -120573 323691
10906 -37796 272426 18259 -201005 -70808 -145626 -44622 -126241 67426 276349 18323 396153
10895C96153j83706J8988A8537B69K84886e554A30043d158m90513d7707B11215
10883g8882E9824b06046P299H1636g8509n9805A3408J30739o8818h6747A25441
10871b18596A6342b44481k3410j289D1255a57460j22455a35116j2574J4749A3921
10859A51523a6541r4759B34682j01248a17308E856c8622A11720a36649A622L18657
10848C20279f1419K7334j31444q8103d7493E4315b3250j17033E5767a22875D3130
10836f9838j2317B74831A29861a84785m5873C26964c5758C28896c76266L9979
10826c36287i0679k7724A17032d9267j10361r9192F5908b0318D1643b45355I4709
10814D3568h1109C13386a07537A77992b54443E0104a02601M1861B55279a30938
$$ plain form
10895 396153 212447 231435 18537 269 285155 -5554 130043 -4158 -494671 -47707 211215
10883 -78882 59824 -206046 -198747 81636 -78509 -138314 13408 144147 75329 -86747 125441
10871 -218596 16342 -244481 -267891 -269180 41255 -157460 -279915 -135116 -147690 -132941 13921
10859 151523 -16541 -111300 234682 133434 -117308 5856 -38622 111720 -136649 1622 320279
10848 320279 -61419 -34085 -165529 -253632 -47493 54315 -23250 -140283 55767 -122875 43130
10836 -69838 -82155 274831 129861 -184785 -230658 326964 -35758 328896 -376266 -336287
10826 -336287 -90679 -118403 117032 -49267 -159628 -258820 65908 -20318 41643 -245355 94709
10814 43568 -81109 313386 -107537 177992 -254443 50104 -102601 -60740 255279 -130938
10803A63252a21790A52823c2941A52537j9769a47078r4630C6399b93597a29205
10792D6518K0390a91984N7286Q660k46030a15095B66621e5290O234r8630Q544
10781a39142e5762m5199J4935j78658a09006M2279p0118N5767i89E5543c33618
10769c1290A85034i4140C14739f3076K2642A67329p6351b89332A03648O149C7815
10757A59172e535j47769N9399Q997k9159A7152a44234A48466b63284E1421A9210
10745A57015b99197g8540B01121A7207f7209j6993k23987B35420I7930b2187m8078
10734g0265p0935N4644j76445i0821C62268g4686b6050j16629k26132D50513a34798
10722e301j60177A70831D0389j4915a39285A29213n5720b37463Q1604j8124j12414
$$ plain form
10803 163252 -121790 152823 -32941 152537 132768 -147078 -241708 36399 -293597 -129205
10792 46518 66908 -191984 -134698 -126038 -372068 -115095 266621 -55290 -49056 -147686 -139142
10781 -139142 -55762 -100961 -86026 -264684 -109006 -66727 -136845 -81078 -989 55543 -333618
10769 -31290 185034 -94140 314739 -63076 -40434 167329 90978 -289332 103648 109797 37815
10757 159172 -5535 -153304 -93905 -84908 -114067 17152 -144234 148466 -263284 51421 19210
10745 157015 -299197 -78540 201121 17207 -67209 -84202 -308189 235420 97930 -22187 -70265
10734 -70265 -141200 -86556 -263001 -90821 362268 -74686 -26050 -142679 -368811 450513 -134798
10722 -5301 -165478 170831 40389 25474 -139285 129213 73493 -237463 -155859 -173983 -286397
10711b86397e1103o4967e0793m0781j78705k10462A68645i5714l4488B2785L92299
10700D15084B7823J6399K75321a58941k52208A16328a19349b1631B827a42568
10689a26999A13247a4163l71243D081K5976A0232c9471k9368p1522j61607R5454
10678b06514k5659a0639j02436A37689h5110C64919B7847b28559I7885I679b49899
10666G1943a97746c032E9899b48564E6871d22624E3333d4383D5254J9898K43126
10655C08278H1005b33107C3871d5866j588A52211a30697I0401b9955j74222i1861
10643c15573r9353B24856k4882a06177B9967c35783B5610a28711l3572p742a2361
10631A5110J7349d1364k92099a46645A13517b77523A19246c08668a19485J3425
$$ plain form
10711 -286397 -51103 -116070 -50793 -91574 -270279 -480741 168645 -95714 -130202 22785 415084
10700 415084 27823 44222 319543 -158941 -411149 116328 -119349 -21631 2827 -142568
10689 -126999 113247 -14163 -385406 4081 30057 10232 -39471 -68839 -140361 -301968 -206514
10678 -206514 -232173 -10639 -113075 137689 -85110 364919 27847 -228559 97885 9679 -249899
10666 71943 -197746 -3032 59899 -248564 56871 -422624 53333 -44383 45254 65152 308278
10655 308278 81005 -233107 33871 -45866 -47454 152211 -130697 90401 -29955 -204177 -91861
10643 -315573 -414926 224856 199974 -106177 29967 -335783 25610 -128711 -162283 -170025 -12361
10631 15110 32459 -41364 -333463 -146645 113517 -277523 119246 -308668 -119485 -106060
10621a06060F4305d7503D0313P5964a19807k8033C01671a35810H6865B9160b10
10609d9813D071a16325j4349Q393c7658E5628a38973a3835I105a32701J0256P187
10597a15258N6916j238E7507c89962g8726l7158j9868j53462o737J07470P8202
10586a10279j21044g9555B9591a64727j00190B27960F4198d346k29099R840H6048
10574g8527j9564A7272c350l08545a44966C6219a50133p9161F696a5758B18092
10562A66736c27034d7377A00979a47253n2409C3401a4743k91341i5998A05303
10551i4551L3207A61288b16558H775K65614A8515a52287j34406L409n8456A24427
10539B87430f5726K6896m8684C6302J00682B469i6437F1081g6793C63772j03450
$$ plain form
10621 -106060 64305 -47503 40313 116277 -119807 -147840 301671 -135810 86865 29160 -210
10609 -49813 4071 -116325 -130674 -122281 -37658 55628 -138973 -13835 9105 -132701 -122445 -115258
10597 -115258 -58342 -59580 57507 -389962 -78726 -115884 -135752 -289214 -295951 -188481 -110279
10586 -110279 -231323 -79555 29591 -164727 -264917 227960 64198 -4346 -233445 -223605 86048
10574 -78527 -98091 17272 -3350 -311895 -144966 36219 -150133 -229294 6696 -15758 218092
10562 166736 -327034 -47377 100979 -147253 -199662 33401 -14743 -306084 -95998 105303
10551 -94551 -61344 161288 -216558 8775 274389 18515 -152287 -286693 -283284 -341740 124427
10539 287430 -65726 -38830 -87514 36302 136984 2469 -96437 61081 -76793 363772 260322
10528B60322n9239b40398K8941o6833D4608O6707M8066b56860a22829l93140A37669
10516a77634B06286H878b19496b8184k6775a4981l0653o6318A50273J18052A02703
10504a40147A11040g3970J395n4186k7992J7374G0804a94047O0063A7733a58708
10492B48389j04249c51808Q5895J23a0151C1837a54184M7187B09488a13348j91274
10481c04622J9330M1121I9613q003a57730e7212A19663C2157b19937c6010j80160
10470b16170B4072c08604C49833B9423K11673p9865f1593J484m4325C69787j53560
10459B16227k1825J08613o0329f3191A32481n1620J17256N04r0858A4696a4333
10447E4470f4084j36256e4339D0327d49150B8441Q234J0427g8325C4614f5878
$$ plain form
10528 260322 201083 -240398 -211457 -278290 44608 111315 159381 -256860 -122829 -515969 137669
10516 -177634 206286 8878 -219496 -28184 -54959 -14981 -45634 -111952 150273 268325 102703
10504 -140147 111040 -73970 -72575 -126761 -154753 -137379 70804 -194047 -133984 17733 -158708
10492 248389 144140 -351808 -265913 -265790 -10151 31837 -154184 -106997 209488 -113348 -304622
10481 -304622 -285292 -244171 99613 91610 -157730 -57212 119663 32157 -219937 -36010 -216170
10470 -216170 24072 -308604 349833 29423 241096 161231 -61593 -60109 -104434 369787 216227
10459 216227 194402 303015 242686 -63191 132481 80861 198117 198621 107763 14696 -14333
10447 54470 -64084 -200340 -54339 40327 -449150 28441 36675 47102 -78325 34614 -65878
10435f4339j16807N4190M1280D9715R874k1954a9418B434e46952A16490e07853
10423D0243g4405C00272I3667a34440F302M25870a18589p7897b6387j53382H0130
10411A516J11841a9451r1021A08509b67443E1007H604c90475a11573k3455p911
10400a42939m9823A33049d54738C31433b22150c5612k31293Q5968a8832B40886
10389A09968l3159b68753Q2247e2462a1245B50414b03650A628J58912a84281Q2344
10378a01937G0802h7834B3875i5652I1754b4319B55849q973c26978E07012A86834
10366A44771j5773E1385a42995e0239j88557C59032j01952e7480j55996H8496
10355a09547M1596G4261J45920B0780M56606h4795B88334K30232k38054K43986
$$ plain form
10435 -64339 -181146 -126956 -85676 49715 59589 37635 -19418 2434 -546952 116490 -507853
10423 40243 -74405 300272 93667 -134440 6302 432172 -118589 -196486 -26387 -179769 80130
10411 1516 113357 -19451 -110472 108509 -267443 51007 8604 -390475 -111573 -135028 -142939
10400 -142939 -192762 133049 -454738 331433 -222150 -35612 -266905 -180937 -18832 240886
10389 109968 76809 -268753 -186506 -52462 -11245 250414 -203650 1628 160540 -184281 -101937
10378 -101937 70802 -87834 23875 -95652 91754 -24319 255849 246876 -326978 507012 186834
10366 144771 128998 51385 -142995 -50239 -238796 359032 257080 -57480 -213476 88496
10355 -109547 -67951 74261 220181 20780 477386 -84795 288334 518566 280512 524498
10345E24498j56949A23429J64078A12036K7888a18515a5992A0996J07101l1865
10335H6232K12193k5738a43936D78936A41233h6654D22430A4870J91740m5014
10325A61596K28392a12615D47783j36379F8921O0117D7818b3972k0503A74762
10314A82240M6783A3560K08323E6633J49922b8075I6477A6094K03605J0939A11492
10302G7342K6264K38004l1060F4777R7758a93675K43c2914B6604a53927B02935
10290e4137A43789a28410A73281B4532O4620K9708a24532A4553J81893a55401
10279G9299J14805b02631R9533l13509C4536M493b0653r1952q1488l2855M9798
10268a77150e9905l3717A75323b63911I0626b37213e6948B06636r118E6357a02057
$$ plain form
10345 524498 367549 123429 287507 112036 139924 -118515 -15992 10996 118097 86232
10335 86232 298425 272687 -143936 478936 141233 -86654 422430 14870 206610 161596
10325 161596 389988 -112615 447783 311404 68921 129038 47818 -23972 -44475 174762
10314 182240 229023 13560 221883 56633 206555 -28075 96477 16094 219699 230638 111492
10302 77342 103606 341610 310550 64777 162535 -193675 -193432 -32914 26604 -153927 202935
10290 -54137 143789 -128410 173281 24532 89152 118860 -124532 14553 196446 -155401
10279 79299 194104 -202631 -103098 -416607 34536 39029 -20653 -112605 -194093 -226948 -177150
10268 -177150 -59905 -93622 175323 -263911 90626 -237213 -56948 206636 197518 56357 -102057
10256c0129j55368o0852R0813D4912h8754k16227A42709D5350O7498D751a04222
10244i1538k81067C14630A25813H89a53830C75930l4770A38671a42286A91658
10233G8660J8103a17500d0134G5577h5172d0492j12575d8817D0785L8230a01761
10221b16280C88548a29541e7340j93051j03920C71470E3052e1734A04679C2763
10210d22111B52770b5299k65885a02724N0029A02701n0824b58289k32618J94627
10200b96280i9722k81514B7147G83c70136F7225K516a47876E7646a51782g552
10188A89062G1643k0220a20038a5928B34369a21649q6214A12790m7159J80836
10178B46467H8095J14955F0536h7085j7776d8115B42533j17000a40204k33473
$$ plain form
10256 -30129 -185497 -246349 -155536 44912 -88754 -304981 142709 45350 112848 4751 -104222
10244 -91538 -372605 314630 125813 889 -153830 375930 341160 138671 -142286 191658
10233 78660 96763 -117500 -40134 75577 -85172 -40492 -153067 -48817 40785 79015 -101761
10221 -216280 388548 -129541 -57340 -250391 -354311 371470 53052 -51734 104679 32763
10210 -422111 252770 -25299 -291184 -102724 -52695 102701 51877 -258289 -490907 -296280
10200 -296280 -99722 -381236 27147 783 -370136 67225 69741 -147876 57646 -151782 -7552
10188 189062 71643 51423 -120038 -15928 234369 -121649 -207863 112790 65631 246467
10178 246467 88095 203050 60536 -87085 -104861 -48115 242533 125533 -140204 -373677
10168c73677a2107k7771j74656r620B269a20161l50997A94972b15602k07430g291
10156A22504E3024K4404a29857k32156J25949e3098j44322a3964j02843p4043
10146a90850A56641o9239b22979C27682a84321a6555D7883a15995A65714c7033
10135A14125h4232L4426j091n9430m0484k8019A91520c1263L08a4098j58554j08032
10123b80684a00891A47377c16248E2433a32261m8847b6593A79652C0016i3904
10112a54884a7739q9217E9217d5195j87107j2638C3251b48392L4678K1936A27287
10100h9803F1267M571d3315j6726j37260f6681K652F9692b67449D8742a50998
10088a73744l4982A28345a4035l31542P8527Q7558B05926a25311j60500h523q4154
$$ plain form
10168 -373677 -12107 -39878 -214534 -224154 2269 -120161 -471158 194972 -215602 -423032 -7291
10156 122504 53024 77428 -129857 -362013 -236064 -53098 -197420 -13964 -116807 -190850
10146 -190850 156641 87402 -222979 327682 -184321 -16555 47883 -115995 165714 -37033
10135 114125 -84232 -49806 -50897 -110327 -150811 -178830 191520 -31263 -30955 -14098 -172652 -280684
10123 -280684 -100891 147377 -316248 52433 -132261 -181108 -26593 179652 30016 -93904
10112 -154884 -17739 -106956 59217 -45195 -232302 -244940 33251 -248392 -213714 -191778 127287
10100 -89803 61267 65838 -43315 -60041 -197301 -66681 -64029 69692 -267449 48742 -150998
10088 -173744 -208726 128345 -14035 -345577 -267050 -179492 205926 -125311 -285811 -8523 -92677
10077i2677p8519o4777i5784B5783a66358A81652a00147G1415c3071k51388Q8400
10066a96059A93485B2596Q5196b05697g2040B2915a53505j6752c5982A09131b55132
10054c81155D5607J51708m8141o7693R2867a7572j11805a1496K551I5089a2977
10042d2535k76082I9326a47580j47470a02419J3359k18755G2068c42757J49092
10032a93665P812q2008F7254O9474B0871R8659n7341d698A13100b39658L2643
10021b07015g1072j53827C32802a2881G54f2683B15288b38958H710J57314D266
10009B81361f5673j6084m060A63844d6896D9678b48380j06929C9080j4012d6759
9997H5259J21960a51560B49391j4850G4508h8417C11902k1833a51979B200a41151
$$ plain form
10077 -92677 -171196 -235973 -95784 25783 -166358 181652 -100147 71415 -33071 -284459 -196059
10066 -196059 193485 22596 107792 -205697 -72040 22915 -153505 -170257 -35982 109131 -255132
10054 -381155 45607 197315 149174 81481 174348 -17572 -129377 -11496 -8945 95089 -12977
10042 -42535 -318617 99326 -147580 -295050 -102419 -89060 -307815 72068 -342757 -193665
10032 -193665 -185853 -267861 67254 136728 20871 119530 62189 -4698 113100 -239658 -207015
10021 -207015 -71072 -224899 332802 -12881 754 -62683 215288 -238958 8710 166024 4266
10009 281361 -65673 -81757 -85817 163844 -46896 49678 -248380 -355309 39080 25068 -46759
9997 85259 207219 -151560 249391 234541 74508 -88417 311902 290069 -151979 2200 -141151
9985F8157a05756j37405A89490c8912j24113m9634k9073L9742I0356b15626A64943
9973h5985j06841G8090a02682r3976l1918d9835k21034a0086B39285h405j01444
9962a09849J3206G0903e9349B49082b63856O9496C0881c70858G7652h182H6866
9950b92623h5070D7991K7169a00245J8384j22220f0304j78016C52562A70826D37
9938b00283P762L3898b1988n3647j7021c642A00343c8314j43783j1390k12667
9927d06154a64863j18815m3824a14339D141Q7819A35b89727I4312e82841F4239
9915d0014D0563f5343b8988A34850a65623N3673b8068B26347b2874n209E4502
9903D1513a45924p214k14458M6288L4394O1514F6905a05543p2094k0076G9647
$$ plain form
9985 68157 -105756 -243161 189490 -38912 -163025 -212659 -241732 -201990 90356 -215626 164943
9973 -85985 -192826 78090 -102682 -196658 -228576 -49835 -270869 -10086 239285 -8405 -109849
9962 -109849 -96643 70903 -59349 249082 -263856 -194360 30881 -370858 77652 -8182 86866
9950 -292623 -85070 47991 75160 -100245 -81861 -204081 -60304 -238320 352562 170826 437
9938 -200283 -192521 -158623 -21988 -75635 -92656 -3642 100343 -38314 -182097 -193487 -406154
9927 -406154 -164863 -283678 -327502 -114339 4141 91960 135 -289727 94312 -582841 64239
9915 -40014 40563 -65343 -28988 134850 -165623 -111950 -28068 226347 -22874 -28083 54502
9903 41513 -145924 -153138 -367596 -321308 -286914 -225400 66905 -105543 -177637 -197713 79647
9891A51702e1701j02002c4158k88043M7828D7098a89684B61432C9359c69530N6307
9880c13223M2827J6239i2695j80333A03569K55595c27726g7576I602K6499l867
9869C2234P0067b06616a821r956j37536A93759g378k12479D6853c8372B6738b65550
9856a98865N8609H2901b13038p5419e7153B13229b05687M8219k7455A59563a60044
9844b1101j67124K1683j57739j09681a33692B0314f7304C99a1464q0357j05618
9833a97439A22671c4022k91097J24210A86918c6682f932j91013h6562k19837A46959
9821c97833J76728A8681i2155K5921j03470G4334a50568d1329j7807n4283C2602
9809d2629F7391e46722K44405K5331e1097j75692M5728H1278a439F8611j4133
$$ plain form
9891 151702 -51701 -153703 -34158 -322201 -274373 47098 -189684 261432 39359 -369530 -313223
9880 -313223 -270396 -254157 -92695 -273028 103569 359164 -327726 -77576 9602 36101 32234
9869 32234 102301 -206616 -1821 -11777 -149313 193759 -7378 -219857 46853 -38372 26738 -265550
9856 -198865 -140256 82901 -213038 -288457 -57153 213229 -205687 -157468 -184923 159563 -160044
9844 -21101 -188225 -166542 -324281 -433962 -133692 20314 -67304 399 -11464 -91821 -197439
9833 -197439 122671 -34022 -325119 -200909 186918 -36682 -6932 -197945 -86562 -306399 146959
9821 -397833 -221105 18681 -92155 -66234 -169704 74334 -150568 -41329 -59136 -113419 32602
9809 -42629 67391 -546722 -302317 -276986 -51097 -226789 -181061 81278 -1439 68611 54478
9798E4478a32622N4748k2326k19031c3926A3179b50876E6423R1709B2665a17648
9786f6495m2662A42769a48441N0552A03779k802b71755B88168G0954K47020h7341
9774d8677k4675b3557A95516h3194A89b54767J05675M8434B44684c2712m8770
9763h1482A26565K2459A8997a34686G4429b13212B72531a52937A8932J25408L02783
9752D47123b91474R2429f5293l37801a44420J7685K8361A58695l3463i2500k02750
9741b95250f8775H8270c8765h648j32039B89371I758a52316f6695C46135f5020
9729a71357c1030A381c18725A99228b65329A09565c2697C31666j17926d669n0373
9718e5042k00462d5534B70489C4046c0993c129A0315J4108c23357K2348g0638
$$ plain form
9798 54478 -132622 -77874 -100200 -319231 -33926 13179 -250876 56423 148132 22665 -117648
9786 -66495 -109157 142769 -148441 -97889 103779 100977 -271755 288168 70954 317974 -87341
9774 -48677 -73352 -23557 195516 -83194 189 -254767 -149092 -100658 244684 -32712 -81482
9763 -81482 126565 149024 18997 -134686 74429 -213212 272531 -152937 18932 144340 447123
9752 447123 -291474 -199045 -65293 -403094 -144420 -126735 -98374 158695 125232 -92500 -295250
9741 -295250 -68775 88270 -38765 -8648 -140687 289371 9758 -152316 -66695 346135 -65020
9729 -171357 -31030 1381 -318725 199228 -265329 109565 -32697 331666 213740 -4669 -55042
9718 -55042 -255504 -45534 270489 34046 -30993 -3129 10315 24423 -323357 -301009 -70638
9706B04416d8479E9939b59366F2096a11683B18285a06826M1477j33605R1992A08770
9694c11357A93371c79517c8033q793j60494A5688R526c30606f7177k59409A58145
9682G6047c41172J25398q5242f5189j67415N3172P4072j98128a8613j06714L2930
9671i2397n36I364b37498e4019A09769O8458B3473a17899m0553k17226C0844O0084
9659I0928J431J74228h974j77144h7852k55362D2328Q3829a6859A83759a04540
9647A32959K2712d0879H0346b29887A81534h2576n9440A13214C6808a11471F361
9635a18727A76513e743j45161j09152M2949A0228a87381j26875N5455c7471A69902
9623D8112b31860P070c5865L315H3724a9552o723A4472P5552g4273L2433q5182
$$ plain form
9706 204416 -48479 59939 -259366 62096 -111683 218285 -106826 -65349 -198954 -106962 108770
9694 -311357 193371 -379517 -38033 -46826 -207320 15688 25214 -330606 -67177 -326586 158145
9682 76047 -341172 -215774 -301016 -65189 -232604 -179432 -105360 -303488 -18613 -125327 -92397
9671 -92397 -92933 9364 -237498 -54019 109769 178227 23473 -117899 -158452 -375678 30844 90928
9659 90928 92359 266587 -8974 -186118 -87852 -343214 42328 126157 -16859 183759 -104540
9647 132959 155671 -40879 80346 -229887 181534 -82576 -142016 113214 36808 -111471 6361
9635 -118727 176513 -5743 -150904 -260056 -217107 10228 -187381 -314256 -258801 -37471 169902
9623 48112 -231860 -224790 -35865 -32550 83724 -19552 -26275 14472 90024 -74273 -41840 -127022
9611a27022M5739B52006a91913Q8385A72727C9310a89055H6226H956c36054g4244
9599C01775a90970n8240A51500a8978A05413a81710L6933G8011b1664k05218d8893
9587A72006a55225c7828j46200j50743l2775g3328m29754a65254m23042H1556
9576c280j18186j47225J11103j18626n6686a08541n2741C8994N9894c31470H2147
9564h2798A54858b58907C56653H7073f7356B89439d8044H0307K11975c01229N4017
9553b47212e8257k81544F7481a43419A91467g3402j35579E5315d46213d4009F5861
9541d3042A09747a70128l3228C6121d2294k59512J24823A7815a76990A3803L97
9530A4200b8427q2492n9838B16834b17600j54438k3978A6211R0491k5190a20459
$$ plain form
9611 -127022 -81283 252006 -191913 -103528 172727 39310 -189055 86226 8956 -336054 -74244
9599 301775 -190970 -249210 151500 -18978 105413 -181710 -144777 78011 -21664 -226882 -48893
9587 172006 -155225 -37828 -184028 -334771 -367546 -73328 -503082 -165254 -588296 81556
9576 -3280 -121466 -268691 -157588 -276214 -332900 -108541 -161282 38994 98888 -331470 82147
9564 -82798 154858 -258907 356653 87073 -67356 289439 -48044 80307 292282 -301229 -247212
9553 -247212 -58257 -339801 67481 -143419 191467 -73402 -208981 55315 -446213 -44009 65861
9541 -43042 109747 -170128 -203356 36121 -42294 -301806 -176983 17815 -176990 13803 14200
9530 14200 -28427 -110919 -170757 216834 -217600 -372038 -396016 16211 106702 81512 -120459
9518c11633H8913d07584a00401b9907A33012c53864A73311G3974d98905f1661
9507a83661j49709a62165A31039d2984j30464B1216f3969G5541A8055E858b87533
9495a00993G487C140a06673k9237N0381j63068a4725k08894o1769A63793p4542
9484H9251A439P6238Q1883N7586i6870E9709J4951e3957b6797p0294C30310a44776
9471B01542f0714j14502d4038l93873E8716f9911j87667A4916P5236N2214a07309
9459f6385B28310d9621A1621O8729B9319a20374r6246A15731d95728E6973a0935
9447d48891a74168A33674a23095c5793A39331c65499A94734a30307c1800A24664
9436A09776a3699j74835K5368k00658Q4315Q4984a9856j72343f7188J886A16121
$$ plain form
9518 -311633 88913 -407584 -100401 -29907 133012 -353864 173311 73974 -498905 -61661
9507 -183661 -333370 -162165 131039 -42984 -173448 21216 -63969 75541 18055 5858 -287533
9495 -100993 7487 3140 -106673 -135910 -85529 -248597 -14725 -223619 -285388 163793 89251
9484 89251 1439 77677 159560 217146 -96870 59709 74660 -53957 -26797 -97091 330310 -144776
9471 201542 -60714 -175216 -44038 -437911 58716 -69911 -257578 14916 90152 142366 -107309
9459 -66385 228310 -49621 11621 80350 29319 -120374 -216620 115731 -495728 56973 -10935
9447 -448891 -174168 133674 -123095 -35793 139331 -365499 194734 -130307 -31800 124664
9436 109776 -13699 -188534 -163166 -363824 -279509 -194525 -19856 -192199 -67188 -65302 116121
9424B2698b4897l7385p8065D4724g4618j09859A06773a22928H5144b57431I6818
9412e2324B8548j0572a50610f0746q0877o4191d0917C4223Q4225b27112g2889
9400a26699D257g3202c651j78321e3824k6028K2482j90797d2063E9509i5250o615
9388a01865j86203a43531B4504K1962M0232m2988K59170d0202j72638Q2842F0635
9376a95265K6933E7728b07361g3181A45069g9962C8287K60062b30128C6999J88975
9365B25974b55371Q9870M2482a7663A36348a77559B28915a61320N033A25853i9588
9353c9449A46770i012B42006A3370J52383n2418D579b56553A19585E5248c6474
9341a36893D68122a42855d0135m2480b050j44308f8398J7581m719B31321G1534
$$ plain form
9424 22698 -24897 -62282 -140347 44724 -74618 -184477 106773 -122928 85144 -257431 96818
9412 -52324 28548 17976 -150610 -60746 -141623 -205814 -40917 34223 118448 -227112 -72889
9400 -126699 4257 -73202 -3651 -181972 -53824 -79852 -57370 -248167 -42063 59509 -95250 -101865
9388 -101865 -288068 -143531 24504 46466 86698 43710 302880 -40202 -212840 -129998 60635
9376 -195265 -168332 57728 -207361 -73181 145069 -79962 38287 298349 -230128 36999 225974
9365 225974 -255371 -165501 -123019 -17663 136348 -177559 228915 -161320 -156287 125853 -99588
9353 -39449 146770 -9012 242006 13370 165753 113335 4579 -256553 119585 55248 -36474
9341 -136893 468122 -142855 -40135 -82615 -2050 -146358 -68398 -50817 -55536 231321 71534
9329d49264A02894a92441N299e3940B2575L70d47172g3491b6706l9256n6137K0682
9317a01417B7731A2102c62574b2400q5059q6246A9982G283i1003o4456j85729
9306c41188N1599A94588j792g1483l48186G486a90811A00515a94075D261e8672
9294c14934C6900a32148j35696a02063E8118a56951O5852I4407a28520G8741h0326
9282a45884n1901A36601B0041L5798a00905P722D5301j500b8229o3908l2283j05346
9270b29766N6413f9170j16295g7881C3644J04624a7302k44533d1471F7098a80987
9258e644A88868a54673i732n5379c0430k01796C5587i0879B18251b22413L653
9247b18760A58748M3954g0263l7429J2873H5622m1752g3398A96843c25830B8984
$$ plain form
9329 -449264 102894 -192441 -187142 -53940 22575 22945 -447172 -73491 -26706 -65962 -122099 -101417
9317 -101417 27731 12102 -362574 -22400 -107459 -193705 19982 7283 -91003 -155459 -341188
9306 -341188 -289589 194588 192796 -71483 -419669 7486 -190811 100515 -194075 4261 -58672
9294 -314934 36900 -132148 -267844 -102063 58118 -156951 -91099 94407 -128520 78741 -80326
9282 -145884 -197785 136601 20041 55839 -100905 -93183 45301 43801 -28229 -92137 -124420 -229766
9270 -229766 -173353 -69170 -185465 -77881 33644 138268 -17302 -261835 -41471 67098 -180987
9258 -5644 188868 -154673 -9732 -65111 -30430 -232226 35587 -90879 218251 -222413 -218760
9247 -218760 158748 202702 -70263 -107692 -94819 85622 43870 -73398 196843 -325830 28984
9235c4267H987K1082c05904E7783c57730A31065b14535a3581k67208G1374a28397
9223B09793e44730g1319j80837J4123R3674A5865a93411N6341A03201D7707f7751
9211A21340m7498a9158l64085i2477j23380A42222b19682D2082J0347a45349D4686
9199A88641b60954A14243b50602d497k02958A20042b58479I7929K8282l580a81184
9187B93401B6784K63788b96027a47801L6038l0553A88936p2377j0267C6599p716
9176B8883g1699b9665k05980F2598A5892J58333d0368k62738k1148A23954c833
9164B3893b71448q181A9347a87679m41751i312k350j16412A94983F5377J6655
9153H2032e3719C7235a78624h4201a2620j71671A49063h3317A49288C1444a1403
$$ plain form
9235 -34267 8987 30069 -305904 57783 -357730 131065 -214535 -13581 -280789 71374 -128397
9223 209793 -544730 -71319 -252156 -238033 -144359 15865 -193411 -137070 103201 47707 -67751
9211 121340 73842 -19158 -383243 -92477 -215857 142222 -219682 42082 52429 -145349 44686
9199 188641 -260954 114243 -250602 -4497 -207455 120042 -258479 97929 126211 122631 -181184
9187 293401 26784 290572 -296027 -147801 -111763 -142316 188936 116559 106292 36599 28883
9176 28883 -71699 -29665 -235645 62598 15892 174225 -40368 -303106 -324254 123954 -3833
9164 23893 -271448 -279629 19347 -187679 -629430 -9312 -11662 -128074 194983 65377 82032
9153 82032 -53719 37235 -178624 -84201 -12620 -184291 149063 -83317 149288 31444 -11403
9141A39481f4529C3143J8179J85535a46272C7558J3557a60346A13202M6589a1230
9129d1278m50558a78876K5277N4976m8841r805A42832K10133a98745a2027d07
9117b02045o2212D4334c21824c4882A67635h8925l4877M4556A77551i8946H1819
9105a4494k32751a4979p88o55650b24149A37182c2037B37792F7675J8116d1619
9093c6808J0662l45677I6951F30J67085A8991b85206A8411J58542a82763B4112
9081a93640d6480A0723J31896j5149b90083e9407A41925E0919L2894b51794l4847
9070b86641J17442l4003i2304l4783C6617b47302R1119O2853j54577A79410G0702
9058B26558b85427I5761i0014b6886C8036f4555k17735B33404a16825B01548a01330
$$ plain form
9141 139481 -64529 33143 51322 236857 -146272 37558 51115 -160346 113202 159791 -11230
9129 -41278 -491836 -178876 -153599 -98623 -147464 -157269 142832 352965 -198745 -12027 -407
9117 -202045 -264257 44334 -321824 -34882 167635 -88925 -123802 -79246 177551 -98946 81819
9105 -14494 -247245 -14979 -15767 -671417 -224149 137182 -32037 237792 67675 85791 -41619
9093 -36808 -26146 -371823 96951 630 167715 18991 -285206 18411 176953 -182763 24112
9081 -193640 -46480 10723 142619 127470 -290083 -59407 141925 50919 83813 -251794 -286641
9070 -286641 -169199 -203202 -92304 -127087 36617 -247302 -156183 -93330 -247907 179410 70702
9058 226558 -285427 95761 -90014 -26886 38036 -64555 -282290 233404 -116825 201548 -101330
9046c75774a60290E1710K66262F2140a88481c9878A61497n4371a32354d4265l2494
9035g6759k6171C27437a19686j99268a9881k166A68778a31999j40475C4795a08094
9023a59320A29881G785J66275d0533k02188D7876J17284a42414A71550c83155
9012c28680a32326A32754a72529f1878q9098f3890j34817A23596b39441N8801
9002a80640k70324A10986J4480b1900A35874a79743O537A83087d1516j12642B5722
8990a41895r4807A5655a38839L142O2240r9620I6984a98108A52273O7890a57140
8978b26052e7218K8206j4586D5054a97116h1007j75227J06956A29568b34389C8551
8966A37356n1150g0105k6048c9195j33278A01047c38247i507k22826C15157h5598
$$ plain form
9046 -375774 -160290 51710 317972 62140 -188481 -39878 161497 107126 -132354 -44265 -76759
9035 -76759 -102930 327437 -119686 -318954 -19881 -22047 168778 -131999 -272474 34795 -108094
9023 -159320 129881 7785 174060 -40533 -242721 47876 165160 -142414 171550 -383155
9012 -328680 -132326 132754 -172529 -61878 -150976 -63890 -198707 123596 -239441 -180640
9002 -180640 -450964 110986 125466 -21900 135874 -179743 -173206 183087 -41516 -154158 25722
8990 -141895 -236702 15655 -138839 -135697 -73457 -173077 96984 -198108 152273 220163 -157140
8978 -226052 -57218 -29012 -43598 45054 -197116 -81007 -256234 -149278 129568 -234389 38551
8966 137356 86206 -70105 -96153 -39195 -172473 101047 -338247 -9507 -232333 315157 -85598
8954a81271B47711g8655l64989g6725B2618c47A25424b2663A91914M3160F2002
8942a32760A79880c11179a19713A20408a39220p4578C316J63791b43122b9124
8931a99681G3904a64047A03867d24044F4949a56461B05095i0677m0525D2194b52504
8919E0702a42664A63502N2622N06219a56001A46157a53933B55045a04951B4183
8908B92167J25414N15572N02929Q09027J944206L550520C531702j498777H70655
8898E73738j63300a2211C29040c1505B11754F5786a82371I7662K79506A66166
8887d3580B93045C6819i2116J9913N515B5817e2973G4153a32197N1409A5682K4516
8875D0198j5262O4181b11368B55019G3414b02324A8637d1216j52711J680A19768
$$ plain form
8954 -181271 247711 -78655 -443644 -76725 22618 -347 125424 -22663 191914 235074 62002
8942 -132760 179880 -311179 -119713 120408 -139220 -213798 3316 167107 -243122 -29124
8931 -199681 73904 -164047 103867 -424044 64949 -156461 205095 -90677 -131202 42194 -252504
8919 50702 -142664 163502 216124 722343 -156001 146157 -153933 255045 -104951 24183
8908 292167 417581 933153 1436082 2245109 4189315 7739835 3531702 2032925 870655
8898 573738 410438 -12211 329040 -31505 211754 65786 -182371 97662 377168 166166
8887 -43580 293045 36819 -92116 -72203 -66688 25817 -52973 74153 -132197 -80788 15682 40198
8875 40198 24936 89117 -211368 255019 73414 -202324 18637 -41216 -193927 -192247 119768
8863b855q4908M1562A5415O43b18396Q4689K691g737F6321b70468B93563c9548
8850D7445J51381j1431a90068I3121J8591i4673a2239I7562Q0660p1249a79674
8838a16455B1853J02422a2334j61215j3724A3202a24938f959r957l896k93572
8827c14384a47971A85011C2601a11892p6233B1650b01160a7533D5551a82006L5433
8816a46573O1227l2897A28789i6395A17896m6252B0921c20400A88882E852d43489
8804B7266J05438d35819A5722b04393Q5538i089j22628q313B6091R1490b88438
$$ plain form
8863 -2855 -87763 -46201 15415 16058 -218396 -133707 -131016 -7737 66321 -270468 293563 -39548
8850 47445 198826 187395 -190068 93121 111712 -94673 -12239 97562 178222 106973 -179674
8838 -116455 21853 124275 -12334 -173549 -187273 13202 -124938 -6959 -16916 -20812 -314384
8827 -314384 -147971 185011 32601 -111892 -188125 21650 -201160 -17533 45551 -182006 -146573
8816 -146573 -85346 -118243 128789 -96395 117896 71644 20921 -320400 188882 5852 -443489
8804 27266 132704 -435819 15722 -204393 -118855 -9089 -131717 -140030 26091 117581 -288438
$$ [...]
##END NTUPLES=NMR SPECTRUM
##END=
