
##TITLE=AC1186_Casanare-tamara1_5898636_CUwkp1tA16
##JCAMPDX= 6.0         $$ Bruker NMR JCAMP-DX V2.0
##DATA TYPE= NMR SPECTRUM
##DATA CLASS= NTUPLES
##ORIGIN= BRUKER
##OWNER= Administrator
$$ 1.72 TOPSPIN		Version 2.1
$$ 2012-04-10 10:36:01.296 -0500  Administrator@TOPSPIN
$$ Compression mode = diff/dup
##.OBSERVE FREQUENCY= 400.13188235
##.OBSERVE NUCLEUS= ^1H
##.ACQUISITION MODE= SIMULTANEOUS (DQD)
##.ACQUISITION SCHEME= undefined
##.AVERAGES= 64
##.DIGITISER RES= 22
##SPECTROMETER/DATA SYSTEM= spect
##.PULSE SEQUENCE= noesygpps1d.comp
##.SOLVENT NAME= COFFEE_meoh
##.SHIFT REFERENCE= INTERNAL, COFFEE_meoh, 1, 14.96835
##AUDIT TRAIL= $$ (NUMBER, WHEN, WHO, WHERE, PROCESS, VERSION, WHAT)
$$ ##TITLE= Audit trail, TOPSPIN		Version 2.1
$$ ##JCAMPDX= 5.01
$$ ##ORIGIN= Bruker BioSpin GmbH
$$ ##OWNER= Administrator
$$ $$ C:\Bruker\TOPSPIN/data/COFFEE/nmr/AC1186_Casanare-tamara1_5898636_CUwkp1tA16/12/pdata/1/auditp.txt
$$ ##AUDIT TRAIL=  $$ (NUMBER, WHEN, WHO, WHERE, PROCESS, VERSION, WHAT)
(   1,<2012-04-03 18:53:32.234 -0500>,<Administrator>,<TOPSPIN>,<go>,<TOPSPIN 2.1>,
      <created by zg
	started at 2012-04-03 18:42:00.437 -0500,
	POWCHK enabled, PULCHK disabled,
       configuration hash MD5:
       1A 1E CE 29 27 FD 77 03 67 4E F0 E3 C4 B2 CB 90
       data hash MD5: 64K
       FD 4A 05 B6 01 2E ED C6 E2 87 58 BF 6B EB B0 47>)
(   2,<2012-04-03 18:53:35.078 -0500>,<Administrator>,<TOPSPIN>,<proc1d>,<TOPSPIN 2.1>,
      <Start of raw data processing
       efp LB = 0.3 FT_mod = 6 PKNL = 1 PHC0 = 0 PHC1 = 0 SI = 128K 
       data hash MD5: 128K
       B7 A8 A1 CC 89 B1 54 43 2A 1F 13 F5 0E E2 04 42>)
(   3,<2012-04-03 18:53:36.265 -0500>,<Administrator>,<TOPSPIN>,<proc1d>,<TOPSPIN 2.1>,
      <pk PHC0 = 33.57422 PHC1 = 0 
       data hash MD5: 128K
       E3 C6 FC 9F E7 EF 41 34 AB 87 B3 1F F0 0A 97 B0>)
(   4,<2012-04-03 18:53:36.500 -0500>,<Administrator>,<TOPSPIN>,<proc1d>,<TOPSPIN 2.1>,
      <abs ABSG = 1 
       data hash MD5: 128K
       E0 96 0D 6D 7C 9D 02 6F 4B 97 C2 92 58 A7 E9 3B>)
(   5,<2012-04-03 18:53:36.609 -0500>,<Administrator>,<TOPSPIN>,<proc1d>,<TOPSPIN 2.1>,
      <abs ABSG = 2 
       data hash MD5: 128K
       F8 66 1C 77 69 06 B5 DE B2 24 F4 90 EB 16 6B 26>)
(   6,<2012-04-03 18:53:36.828 -0500>,<Administrator>,<TOPSPIN>,<proc1d>,<TOPSPIN 2.1>,
      <abs ABSG = 3 
       data hash MD5: 128K
       2E 21 D7 77 11 0F 2B E5 25 ED CC B6 7A 71 98 5F>)
(   7,<2012-04-03 18:53:36.906 -0500>,<Administrator>,<TOPSPIN>,<proc1d>,<TOPSPIN 2.1>,
      <abs ABSG = 4 
       data hash MD5: 128K
       C5 6A A5 25 6D 51 1B 85 A2 CE 25 01 30 E0 B4 43>)
(   8,<2012-04-03 18:53:36.953 -0500>,<Administrator>,<TOPSPIN>,<proc1d>,<TOPSPIN 2.1>,
      <abs ABSG = 5 
       data hash MD5: 128K
       9B 31 4C 7A E6 22 37 E7 22 80 DB E7 9F 99 1A CA>)
(   9,<2012-04-03 18:53:38.890 -0500>,<Administrator>,<TOPSPIN>,<audit>,<TOPSPIN 2.1>,
      <user comment:
       ICON-NMR User ID: COFFEE
       data hash MD5: 128K
$$ [...]
##$TP07= 0
##$TPNAME0= <>
##$TPNAME1= <>
##$TPNAME2= <>
##$TPNAME3= <>
##$TPNAME4= <>
##$TPNAME5= <>
##$TPNAME6= <>
##$TPNAME7= <>
##$TPOAL= (0..7)
0.5 0.5 0.5 0.5 0.5 0.5 0.5 0.5
##$TPOFFS= (0..7)
0 0 0 0 0 0 0 0
##$TUNHIN= 0
##$TUNHOUT= 0
##$TUNXOUT= 0
##$USERA1= <user>
##$USERA2= <user>
##$USERA3= <user>
##$USERA4= <user>
##$USERA5= <user>
##$V9= 5
##$VALIST= <valist>
##$VCLIST= <CCCCCCCCCCCCCCC>
##$VD= 0
##$VDLIST= <DDDDDDDDDDDDDDD>
##$VPLIST= <PPPPPPPPPPPPPPP>
##$VTLIST= <TTTTTTTTTTTTTTT>
##$WBST= 2048
##$WBSW= 25
##$XGAIN= (0..3)
0 0 0 0
##$XL= 0
##$YL= 0
##$YMAX_a= 13690620
##$YMIN_a= -6097284
##$ZGOPTNS= <>
##$ZL1= 120
##$ZL2= 120
##$ZL3= 120
##$ZL4= 120
##$ABSF1= 14.96835
##$ABSF2= -5.58418
##$ABSG= 5
##$ABSL= 3
##$ALPHA= 0
##$AQORDER= 0
##$ASSFAC= 0
##$ASSFACI= 0
##$ASSFACX= 0
##$ASSWID= 0
##$AUNMP= <proc_prof1d_extract.lims>
##$AXLEFT= 0
##$AXNAME= <>
##$AXNUC= <1H>
##$AXRIGHT= 0
##$AXTYPE= 0
##$AXUNIT= <>
##$AZFE= 0.1
##$AZFW= 0.1
##$BCFW= 0
##$BC_mod= 0
##$BYTORDP= 0
##$COROFFS= 0
##$CY= 15
##$DATMOD= 1
##$DC= 0
##$DFILT= <>
##$DTYPP= 0
##$F1P= 0
##$F2P= 0
##$FCOR= 0.5
##$FTSIZE= 131072
##$FT_mod= 6
##$GAMMA= 0
##$GB= 0
##$INTBC= 1
##$INTSCL= 1
##$ISEN= 128
##$LB= 0.3
##$LEV0= 0
##$LPBIN= 0
##$MAXI= 10000
##$MC2= 0
##$MEAN= 0
##$ME_mod= 0
##$MI= 0
##$NCOEF= 0
##$NC_proc= -3
##$NLEV= 6
##$NOISF1= 0
##$NOISF2= 0
##$NSP= 0
##$NTH_PI= 0
##$NZP= 0
##$OFFSET= 14.96835
##$PC= 1
##$PHC0= 33.57422
##$PHC1= 0
##$PH_mod= 1
##$PKNL= yes
##$PPARMOD= 0
##$PPDIAG= 0
##$PPIPTYP= 0
##$PPMPNUM= 2147483647
##$PPRESOL= 1
##$PSCAL= 4
##$PSIGN= 0
##$PYNMP= <proc.py>
##$REVERSE= no
##$SF= 400.13000490721
##$SI= 131072
##$SIGF1= 0
##$SIGF2= 0
##$SINO= 400
##$SIOLD= 131072
##$SPECTYP= <>
##$SREGLST= <1H.CDCl3>
##$SSB= 0
##$STSI= 131072
##$STSR= 0
##$SW_p= 8223.68421052632
##$SYMM= 0
##$S_DEV= 0
##$TDeff= 65536
##$TDoff= 0
##$TI= <>
##$TILT= no
##$TM1= 0
##$TM2= 0
##$TOPLEV= 0
##$USERP1= <user>
##$USERP2= <user>
##$USERP3= <user>
##$USERP4= <user>
##$USERP5= <user>
##$WDW= 1
##$XDIM= 131072
##$YMAX_p= 474839639
##$YMIN_p= -324399733
##$CURPLOT= <Network HP LaserJet P1505>
##$CURPRIN= <$Network HP LaserJet P1505>
##$DFORMAT= <normdp>
##$LAYOUT= <+/1D_H.xwp>
##$LFORMAT= <normlp>
##$PFORMAT= <normpl>
##$SURQMSG= 1
$$ End of Bruker specific parameters
$$ ---------------------------------
##NTUPLES= NMR SPECTRUM
##VAR_NAME=  FREQUENCY,     SPECTRUM/REAL,   SPECTRUM/IMAG
##SYMBOL=    X,             R,               I
##VAR_TYPE=  INDEPENDENT,   DEPENDENT,       DEPENDENT
##VAR_FORM=  AFFN,          ASDF,            ASDF
##VAR_DIM=   131072,        131072,          131072
##UNITS=     HZ,            ARBITRARY UNITS, ARBITRARY UNITS
##FACTOR=    0.0627417313425165, 1,          1
##FIRST=     8223.62146879498, -1616,        -98485
##LAST=      0,             3129,            -98751
##MIN=       0,             -324399733,      0
##MAX=       8223.62146879498, 474839639,    0
$$ Real data points
##PAGE= N=1
##DATA TABLE= (X++(R..R)), XYDATA
$$ [...]
62924C425457K2823K0235J5999R377J298p142j6219k6712l8166m8980n7978o5087
62912C234905p0589p4671p7872q1088q4526q7146q7767q6456q4379q2416q0432
62901B337563p7811p4205o9728o4895o0380n6494n2855m9049m5472m2863m0996
62890A702815l8785l5904l3306l1558k9744k6829k3318k0399j8305j6768j6417
62879A411482j7963k0340k1420k0712j9712j9337j8839j7707j6877j7052j7378
62868A204145j6889j5907j4913j3428j1326r977j0435j1502j1239r608p999o828
62856A064094n486m198l975m791n528n703n738n529m490l058k567l249l890l718
62842A002174l136k454j496p70j204k236k008k51Q97j1j651k198k018k426l184
$$ y = [3425457, 3448280, 3468515, 3484514, 3493891, 3495189, 3488047, 3471828, 3445116, 3406950, 3357970, 3299992, 3234905, 3164316, 3089645, 3011773, 2930685, 2846159, 2759013, 2671246, 2584790, 2500411, 2417995, 2337563, 2259752, 2185547, 2115819, 2050924, 1990544, 1934050, 1881195, 1832146, 1786674, 1743811, 1702815, 1664030, 1628126, 1594820, 1563262, 1533518, 1506689, 1483371, 1462972, 1444667, 1427899, 1411482, 1393519, 1373179, 1351759, 1331047, 1311335, 1291998, 1273159, 1255452, 1238575, 1221523, 1204145, 1187256, 1171349, 1156436, 1143008, 1131682, 1121705, 1111270, 1099768, 1088529, 1078921, 1070922, 1064094, 1058608, 1054410, 1050435, 1045644, 1040116, 1034413, 1028675, 1023146, 1018656, 1015598, 1013031, 1009782, 1005892, 1002174, 999038, 996584, 995088, 994318, 993114, 990878, 988870, 988619, 989516, 989505, 987854, 985656, 983638, 981212, 978028]
62827I78028l228k938l536m708m788l351j912j750k341k434j672p07m24j233k728
62812I40278l879m030l550l153k927k669k701l508m744n492n462n147m871m463
62798H83682l933l641l560l154k292j703k160l456m545m598l707k606j844j383
62784H41100j065j083j570k035j950j715k068k586j996l29P76N76N72K130M151
62769H32908M692L973L854M936O020O173N612M572L069J796J664K217K145J558
62755H85189K063M166O253O859O418O056O072O460P552R093R945R723R745J1268
62741I86862J3768J5995J7751J9531K1255K2601K3944K5753K7665K9297L1454
62730A235876L5214M0155M4714M8230N1594N5949O1519O7632P3201P7538Q1373
$$ y = [978028, 974800, 971862, 968326, 963618, 958830, 955479, 953567, 951817, 949476, 947042, 945370, 944663, 944239, 943006, 940278, 936399, 932369, 928819, 925666, 922739, 920070, 917369, 913861, 909117, 903625, 898163, 893016, 888145, 883682, 879749, 876108, 872548, 869394, 867102, 865399, 863239, 859783, 855238, 850640, 846933, 844327, 842483, 841100, 840035, 838952, 837382, 835347, 833397, 831682, 829614, 827028, 825032, 824703, 825479, 826055, 826627, 828757, 832908, 837600, 841573, 845427, 850363, 856383, 862556, 868168, 872740, 875809, 877605, 879269, 881486, 883631, 885189, 887252, 891418, 897671, 904530, 910948, 917004, 923076, 929536, 937088, 946181, 956126, 965849, 975594, 986862, 1000630, 1016625, 1034376, 1053907, 1075162, 1097763, 1121707, 1147460, 1175125, 1204422, 1235876, 1271090, 1311245, 1355959, 1404189, 1455783, 1511732, 1573251, 1640883, 1714084, 1791622, 1872995]
62719A872995Q6684R4678J04264J13325J21010J27922J34581J40897J46772J51875
62709C095003J54912J54286J49573J41350J29752J14435R5956P5849N4992L3054
62699D199162R932j3319l5444n6002p4867r1529j05446j16612j25278j31480j35044
62688C324073j35898j34439j32008j30412j30081j29050j25007j18247j11333
62679B177598j05793j00680r4630q7657q0246p2331o4311n7772n3775n1258m8343
62668A360802m4541m0511l6458l2062k7636k3981k1244j8899j6717j4842j3128
62657A070783j1248r266p217m426l35M148P252Q369Q698R729J1944J5103J8889
62644A122423K2944K6844L0432L3949L7773M2233M7421N2838N7560O1320O5089
$$ y = [1872995, 1959679, 2054357, 2158621, 2271946, 2392956, 2520878, 2655459, 2796356, 2943128, 3095003, 3249915, 3404201, 3553774, 3695124, 3824876, 3939311, 4035267, 4111116, 4166108, 4199162, 4209094, 4195775, 4160331, 4104329, 4029462, 3937933, 3832487, 3715875, 3590597, 3459117, 3324073, 3188175, 3053736, 2921728, 2791316, 2661235, 2532185, 2407178, 2288931, 2177598, 2071805, 1971125, 1876495, 1788838, 1708592, 1636261, 1571950, 1514178, 1460403, 1409145, 1360802, 1316261, 1275750, 1239292, 1207230, 1179594, 1155613, 1134369, 1115470, 1098753, 1083911, 1070783, 1059535, 1050269, 1043052, 1038626, 1038291, 1042439, 1049691, 1058060, 1066758, 1076487, 1088431, 1103534, 1122423, 1145367, 1172211, 1202643, 1236592, 1274365, 1316598, 1364019, 1416857, 1474417, 1535737, 1600826]
62633A600826O9896P5329P9878Q2428Q2824Q1394P8835P6070P3174O8763O1551
62622B430968N2173M2089L1120J7813K336j2881k6002l7488m8211n7530o4511
62611B329876o9703p4193p7814p9745q0224q0219p9753p7977p4769p1069o7555
62600A496855o4010o0236n6658n3688n0988m7735m3484l8734l4743l2492l1640
62589I82447l0808k9121k6964k4990k3057k0822j8765j7777j7888j8109j7442
62578G36704j5594j3015j0636r157q154o477m081k688l609n570n976m042j364
62565F46341M67J348J625J054l45j446j028P41K574L654M370N444O769P537P629
62550F86734Q347J1057J5117J8240J9185J8988J8987J9067J9140K0869K5684L1781
$$ y = [1600826, 1670722, 1746051, 1825929, 1908357, 1991181, 2072575, 2151410, 2227480, 2300654, 2369417, 2430968, 2483141, 2525230, 2556350, 2574163, 2576499, 2563618, 2537616, 2500128, 2451917, 2394387, 2329876, 2260173, 2185980, 2108166, 2028421, 1948197, 1867978, 1788225, 1710248, 1635479, 1564410, 1496855, 1432845, 1372609, 1315951, 1262263, 1211275, 1163540, 1120056, 1081322, 1046579, 1014087, 982447, 951639, 922518, 895554, 870564, 847507, 826685, 807920, 790143, 772255, 754146, 736704, 721110, 708095, 697459, 688302, 680148, 673671, 669590, 666902, 663293, 657723, 651747, 647705, 646341, 646808, 648156, 649781, 650835, 650490, 649044, 648016, 648757, 651331, 654985, 659355, 664799, 671568, 679105, 686734, 695081, 706138, 721255, 739495, 758680, 777668, 796655, 815722, 834862, 855731, 881415, 913196]
62538I13196L5517L6024L6282L9115M4129M9265N3512N7068O0368O4111O8901
62527A457488P3835P6746P6752P5158P2797O8300O0578N1358M3056L5250K5665
62516B116983J3908J807r683k1236l2614m1880m7935n1907n5071n7183n7960n8527
62504A698702n9877o1095o0605n8466n6064n4035n1849m9133m6128m2897l9202
62493A119351l5392l2398l0613k9468k8394k7494k6801k5551k2951j9438j6490
62482H24361j5022j4525j3942j2853j1357r406p133n630o082p754q065n543j831
62469G05218M83J274K554N163P648Q781R299J0272J1306J1704J2225J4109J6971
62456H17007J9358K1081K3434K6984L0581L3075L4734L6377L8068L9515M1022
$$ y = [913196, 948713, 984737, 1021019, 1060134, 1104263, 1153528, 1207040, 1264108, 1324476, 1388587, 1457488, 1531323, 1608069, 1684821, 1759979, 1832776, 1901076, 1961654, 2013012, 2056068, 2091318, 2116983, 2130891, 2132698, 2123015, 2101779, 2069165, 2027285, 1979350, 1927443, 1872372, 1815189, 1757229, 1698702, 1638825, 1577730, 1517125, 1458659, 1402595, 1348560, 1296711, 1247578, 1201450, 1158553, 1119351, 1083959, 1051561, 1020948, 991480, 963086, 935592, 908791, 883240, 860289, 840851, 824361, 809339, 794814, 780872, 768019, 756662, 747256, 740123, 734493, 728411, 720657, 712592, 707049, 705218, 705701, 706975, 709529, 714692, 722340, 731121, 740420, 750692, 761998, 773702, 785927, 800036, 817007, 836365, 857446, 880880, 907864, 938445, 971520, 1006254, 1042631, 1080699, 1120214, 1161236]
62445A161236M3038M5044M5739M4373M1345L7491L3159K8125K2041J4883P165
62434A523639l03o953j2842j8429k4047k9551l4344l7579l8708l8086l6880l6023
62422A209894l5367l4145l2177l0142k8606k7239k5321k2761k0271j8549j7563
62411I17753j6690j5404j3661j1647r326o558l740j919j783k598k778j598K10
62398H30261J792L346N372P377Q415Q638R180J0307J0828R916Q570Q362R361J0263
62384I41988J0265R650Q636O820M196J749K71q90l173p006j1234j4271j5564j5916
62370I15521j6570j7828j8544j7302j4266j1345j0115j0209j0377j0477j1278
62359G67210j2454j2357j0235p494n791m822l155o75J209J747J929L034N029O940
$$ y = [1161236, 1204274, 1249318, 1295057, 1339430, 1380775, 1418266, 1451425, 1479550, 1501591, 1516474, 1523639, 1523336, 1516383, 1503541, 1485112, 1461065, 1431514, 1397170, 1359591, 1320883, 1282797, 1245917, 1209894, 1174527, 1140382, 1108205, 1078063, 1049457, 1022218, 996897, 974136, 953865, 935316, 917753, 901063, 885659, 871998, 860351, 851025, 844467, 840727, 838808, 837025, 834427, 831649, 830051, 830261, 832053, 835399, 840771, 848148, 856563, 865201, 874381, 884688, 895516, 905432, 914002, 922364, 931725, 941988, 952253, 961903, 970539, 977359, 981555, 983304, 983575, 982685, 979512, 972506, 961272, 947001, 931437, 915521, 898951, 881123, 862579, 845277, 831011, 819666, 809551, 799342, 788965, 778488, 767210, 754756, 742399, 732164, 724670, 718879, 714057, 710902, 710227, 711436, 713183, 715112, 718146, 723175, 730115]
62345G30115Q118Q591Q609Q357P894P214O575O709Q028R505R374P340N190M547
62331H36166M798M316K935J927J845J791J010mk76O03K417M485N644N152L986
62316H76795M361P311J1563J5246J7930K0260K2491K4479K6647K9828L4112L8712
62304A129735M3049M7322N1917N6730O1240O4962O7860P0404P2990P5110P5457
62293A816776P3260O8884O2810N4720M4537L3738K4347J6671R171O93q306j6975
62281B180326k5218l3015l9607m4320m7593n0302n2539n3905n4560n4958n4792
62270A669517n3340n0938m8937m7731m5917m2320l8165l5986l6429l7202l5619
62259A196933l1438k6726k3477k1956k1027j9410j6636j3358j0790r434q412o485
$$ y = [730115, 738233, 746824, 755433, 763790, 771684, 778898, 785473, 792182, 800210, 809715, 819089, 826429, 831619, 836166, 840964, 845280, 848215, 850142, 851987, 853778, 854788, 854784, 854508, 855111, 857528, 862013, 867657, 872809, 876795, 881156, 888467, 900030, 915276, 933206, 953466, 975957, 1000436, 1027083, 1056911, 1091023, 1129735, 1172784, 1220106, 1272023, 1328753, 1389993, 1454955, 1522815, 1593219, 1666209, 1741319, 1816776, 1890036, 1958920, 2021730, 2076450, 2120987, 2154725, 2179072, 2195743, 2204914, 2205607, 2197301, 2180326, 2155108, 2122093, 2082486, 2038166, 1990573, 1940271, 1887732, 1833827, 1779267, 1724309, 1669517, 1616177, 1565239, 1516302, 1468571, 1422654, 1380334, 1342169, 1306183, 1269754, 1232552, 1196933, 1165495, 1138769, 1115292, 1093336, 1072309, 1052899, 1036263, 1022905, 1012115, 1002681, 994269, 987784]
62247I87784l747j643j253k095k988l417l574l590l461l456l902m392l958k222
62233I44086q0J215J393J319J765K477K717K501K726L940N566O771P692R079J1027
62218A004194J2906J4461J6070J7723J8700J8636J8173J8180J9014K0840K3779
62207A202676K7264L0232L2573L5479L9626M4046M7780N1512N6175O0838O3735
62196A691936O4954O6140O7683O7966O5795O1820N6884N0463M1654L0831J9439
62185B285565Q850j19p369j3810k0888k9236l8172m6517n3153n6914n7241n5351
62173A915645n3520n2638n1635m9785m8074m7242m5998m2732l8012l3757l0565
62162A421687k7540k4316k1506j9172j6569j3601j1190r778q642p099n264l265
$$ y = [987784, 984037, 982394, 981141, 979046, 976058, 972641, 969067, 965477, 962016, 958560, 954658, 950266, 946308, 944086, 944006, 945221, 946614, 947933, 949698, 952175, 954892, 957393, 960119, 964059, 969625, 976396, 984088, 993167, 1004194, 1017100, 1031561, 1047631, 1065354, 1084054, 1102690, 1120863, 1139043, 1158057, 1178897, 1202676, 1229940, 1260172, 1292745, 1328224, 1367850, 1411896, 1459676, 1511188, 1567363, 1628201, 1691936, 1756890, 1823030, 1890713, 1958679, 2024474, 2086294, 2143178, 2193641, 2235295, 2266126, 2285565, 2294415, 2294296, 2286927, 2273117, 2252229, 2222993, 2184821, 2138304, 2085151, 2028237, 1970996, 1915645, 1862125, 1809487, 1757852, 1708067, 1659993, 1612751, 1566753, 1524021, 1486009, 1452252, 1421687, 1394147, 1369831, 1348325, 1329153, 1312584, 1298983, 1287793, 1278015, 1269373, 1262274, 1257010, 1253745]
62150A253745p89J880L488L319K417K376L404M417M711M722N214O432Q182J0131
62136A313649J1917J3247J4118J4677J4966J5020J5263J6352J8434K0891K3062
62125A491596K4874K6442K7366K7157K6370K6406K7782K9245K9394K8685K8852
62114A794169L0559L2778L4712L7089M0910M5783N0441N4298N7556O0168O1760
62103B300223O2374O2266O0848N6822M9871M1564L4046K8150K3109J7779J1820
62092B748872N858P51l339p242j1844j6862k0955k3175k3868k3775k2894k0903
62080B580624j8409j6748j6283j5775j3967j1292r173q008o802m890k939j709
62068B454629o44J271L771N566O513Q265J2156J7101K0541K1319K0903K1677K4523
$$ y = [1253745, 1252956, 1254836, 1258324, 1261643, 1264060, 1266436, 1269840, 1274257, 1278968, 1283690, 1288904, 1295336, 1303518, 1313649, 1325566, 1338813, 1352931, 1367608, 1382574, 1397594, 1412857, 1429209, 1447643, 1468534, 1491596, 1516470, 1542912, 1570278, 1597435, 1623805, 1650211, 1677993, 1707238, 1736632, 1765317, 1794169, 1824728, 1857506, 1892218, 1929307, 1970217, 2016000, 2066441, 2120739, 2178295, 2238463, 2300223, 2362597, 2424863, 2485711, 2542533, 2592404, 2633968, 2668014, 2696164, 2719273, 2737052, 2748872, 2754730, 2755481, 2752142, 2744900, 2733056, 2716194, 2695239, 2672064, 2648196, 2624421, 2601527, 2580624, 2562215, 2545467, 2529184, 2513409, 2499442, 2488150, 2478977, 2470969, 2464167, 2459277, 2456338, 2454629, 2453985, 2455256, 2459027, 2464593, 2471106, 2479371, 2491527, 2508628, 2529169, 2550488, 2571391, 2593068, 2617591]
62055B617591K8263L1136L2359L2397L2242L2677L3992L5914L7828L9497M1445
62044B995341M4204M7156M8992M9552N0372N2705N5917N8739O1212O4061O6682
62033C594933O7519O6356O4565O2912O0933N8949N8698O0750O2978O3128O1741
62022D283462O0820O0672N9980N8455N7277N6913N6533N6087N7204O0966O5910
62011D934279O9407P0569P0963P2675P6255Q0426Q3445Q4661Q4841Q4946Q4910
62000E797377Q3835Q1130P6867P1262O4454N7099N0420M5252M1053L6201K9380
61989F434330K0954J2960P362M036R65l237p607j0272j1026j1401j2409j3458
61977F411197j3738j3596j3923j4866j5759j5985j5543j4919j4731j5248j6094
$$ y = [2617591, 2645854, 2676990, 2709349, 2741746, 2773988, 2806665, 2840657, 2876571, 2914399, 2953896, 2995341, 3039545, 3086701, 3135693, 3185245, 3235617, 3288322, 3344239, 3402978, 3464190, 3528251, 3594933, 3662452, 3728808, 3793373, 3856285, 3917218, 3976167, 4034865, 4095615, 4158593, 4221721, 4283462, 4344282, 4404954, 4464934, 4523389, 4580666, 4637579, 4694112, 4750199, 4807403, 4868369, 4934279, 5003686, 5074255, 5145218, 5217893, 5294148, 5374574, 5458019, 5542680, 5627521, 5712467, 5797377, 5881212, 5962342, 6039209, 6110471, 6174925, 6232024, 6282444, 6327696, 6368749, 6404950, 6434330, 6455284, 6468244, 6475606, 6479642, 6480607, 6477370, 6469763, 6459491, 6448465, 6437064, 6424655, 6411197, 6397459, 6383863, 6369940, 6355074, 6339315, 6323330, 6307787, 6292868, 6278137, 6262889, 6246795]
61966F246795j6605j6591j6407j6253j5806j4771j3533j2825j2842j2917j2209
61955F086036j0628q991q152q180q523q770q844q649q111p566p449p532p276o955
61941E970410p439q561q961q141p451q093r476j0704j2546j6205k1013k5091k7787
61928E798942k9838l1608l3058l4991l8180m1378m2402m1497m1334m3158m5113
61917E376385m5356m4629m4411m4419m3670m2629m2450m2954m2993m2318m1631
61906D898925m1202m0653l9783l8620l6975l4800l2668l1174l0270k9648k9191
61895D513941k8466k6696k4014k1720k0437j8984j6294j3440j2170j2211j1709
61884D307800r966p984o453m862k819o72J580M636Q637J2743J6523K0740K5975
$$ y = [6246795, 6230190, 6213599, 6197192, 6180939, 6165133, 6150362, 6136829, 6124004, 6111162, 6098245, 6086036, 6075408, 6066417, 6058265, 6050085, 6041562, 6032792, 6023948, 6015299, 6007188, 5999622, 5992173, 5984641, 5977365, 5970410, 5962971, 5954410, 5945449, 5937308, 5929857, 5921764, 5912288, 5901584, 5889038, 5872833, 5851820, 5826729, 5798942, 5769104, 5737496, 5704438, 5669447, 5631267, 5589889, 5547487, 5505990, 5464656, 5421498, 5376385, 5331029, 5286400, 5241989, 5197570, 5153900, 5111271, 5068821, 5025867, 4982874, 4940556, 4898925, 4857723, 4817070, 4777287, 4738667, 4701692, 4666892, 4634224, 4603050, 4572780, 4543132, 4513941, 4485475, 4458779, 4434765, 4413045, 4392608, 4373624, 4357330, 4343890, 4331720, 4319509, 4307800, 4297834, 4289850, 4283397, 4278535, 4275716, 4275044, 4276624, 4281260, 4289897, 4302640, 4319163, 4339903, 4365878]
61871D365878L1414L5916L9788M4507N0724N7373O3110O8152P4175Q2269R1569
61860E004875J00536J09250J19509J32432J47072J62099J78085J97003K19774
61851F370635K45438K72888L02564L35992L74037M16026M60731N08035N59188
61842I845534O15006O74031P33103P89181Q39332Q78850R00991Q99100Q67793
61833A7042921Q02044O97887N56563L87090K02965J6534j62575l25664m64984
61824A8752781n76112o58698p14774p47740p62451p63923p55228p37914p14432
61815A2321509o88147o60529o30408n96912n61689n27213m94154m61603m28950
61806G271904l96542l65067l35127l07083k80897k56482k34138k13983j95218
$$ y = [4365878, 4397292, 4433208, 4472996, 4517503, 4568227, 4625600, 4688710, 4756862, 4831037, 4913306, 5004875, 5105411, 5214661, 5334170, 5466602, 5613674, 5775773, 5953858, 6150861, 6370635, 6616073, 6888961, 7191525, 7527517, 7901554, 8317580, 8778311, 9286346, 9845534, 10460540, 11134571, 11867674, 12656855, 13496187, 14375037, 15276028, 16175128, 17042921, 17844965, 18542852, 19099415, 19486505, 19689470, 19706004, 19543429, 19217765, 18752781, 18176669, 17517971, 16803197, 16055457, 15293006, 14529083, 13773855, 13035941, 12321509, 11633362, 10972833, 10342425, 9745513, 9183824, 8656611, 8162457, 7700854, 7271904, 6875362, 6510295, 6175168, 5868085, 5587188, 5330706, 5096568, 4882585, 4687367]
61797D687367j77044j60158j45826j33476j20987j07801r5922q7032q0256p3757
61787C505108o6936n9895n2418m5055l9799l7686l6684l3861k9178k5197k3332
61776C055067k2230k0037j6599j2970r891p380n034k411M15K588L386L401M144
61763B972449O365R311J1773J3342J4581J6339J9029K2369K5788K9142L2779L6963
61751C210230M1577M6454N1445N6225O0763O6070P3237Q1542Q8880R4871J01925
61740C973219J11996J23661J34176J43377J53398J65204J77712J90304K03917
61731E376964K19038K34649K50193K67009K86704L09181L33424L59455L88511
61722H025128M21812M60036N03556N52386O06221O65169P30292Q02815Q83040
$$ y = [4687367, 4510323, 4350165, 4204339, 4070863, 3949876, 3842075, 3746153, 3659121, 3578865, 3505108, 3438172, 3378277, 3325859, 3280804, 3241005, 3203319, 3166635, 3132774, 3103596, 3078399, 3055067, 3032837, 3012800, 2996201, 2983231, 2973340, 2965960, 2960926, 2958515, 2958930, 2961518, 2964904, 2968305, 2972449, 2978814, 2988125, 2999898, 3013240, 3027821, 3044160, 3063189, 3085558, 3111346, 3140488, 3173267, 3210230, 3251807, 3298261, 3349706, 3405931, 3466694, 3532764, 3606001, 3687543, 3776423, 3871294, 3973219, 4085215, 4208876, 4343052, 4486429, 4639827, 4805031, 4982743, 5173047, 5376964, 5596002, 5830651, 6080844, 6347853, 6634557, 6943738, 7277162, 7636617, 8025128, 8446940, 8906976, 9410532, 9962918, 10569139, 11234308, 11964600, 12767415, 13650455]
61713A3650455R70343J063872J162443J263759J364016J458190J540029J601416
61705B4074523J631960J619896J554328J427659J237186R86134O85001L52279
61697C3568966J2002l12110o02256q47999j044415j190604j289763j348594j374989
61688B5570238j375882j357092j324085j281897j234060j181963j125681j065734
61680A5623844j004037r42800q82700q22940p63353p05403o50489n98379n48464
61671H705279n01591m59072m20529l84465l50821l21085k95643k72705k50481
61662E448887k28988k09232j91820j76923j64414j53474j43142j33591j25633
61653C921670j18779j11386j03188r5807q9979q4300p7930p2439o9185o6587o2439
$$ y = [13650455, 14620798, 15684670, 16847113, 18110872, 19474888, 20933078, 22473107, 24074523, 25706483, 27326379, 28880707, 30308366, 31545552, 32531686, 33216687, 33568966, 33580968, 33268858, 32666602, 31818603, 30774188, 29583584, 28293821, 26945227, 25570238, 24194356, 22837264, 21513179, 20231282, 18997222, 17815259, 16689578, 15623844, 14619807, 13677007, 12794307, 11971367, 11208014, 10502611, 9852122, 9253743, 8705279, 8203688, 7744616, 7324087, 6939622, 6588801, 6267716, 5972073, 5699368, 5448887, 5219899, 5010667, 4818847, 4641924, 4477510, 4324036, 4180894, 4047303, 3921670, 3802891, 3691505, 3588317, 3492510, 3402531, 3318231, 3240301, 3167862, 3098677, 3032090, 2969651]
61642B969651n7552n4544n3637n2377m9431m6188m4263m3525m3150m2742m1703
61631B440539l9233l5844l3437l2935l3031l2188l0792l0223l0551l0383k8637
61620B083285k5665k2751k1084k1016k1844k2363k1878k0555j8934j7502j6650
61609A853043j6458j6441j6043j5407j4991j4601j3621j2258j1539j1751j1901
61598A698032j1179j0051r296q813q061p050o149n399m735m408m599m901m728
61585A608663l914k609j124j78m99j654k090j104R5K67J70J319L287M001K721
61570A607351R62N0o29j981l184k741q96M36J41r33j472j386j398j713j959k235
61554A588413l308n475p795q933q612p824p689q400r325r716r277q255p139o272
$$ y = [2969651, 2912099, 2857555, 2803918, 2751541, 2702110, 2655922, 2611659, 2568134, 2524984, 2482242, 2440539, 2401306, 2365462, 2332025, 2299090, 2266059, 2233871, 2203079, 2172856, 2142305, 2111922, 2083285, 2057620, 2034869, 2013785, 1992769, 1970925, 1948562, 1926684, 1906129, 1887195, 1869693, 1853043, 1836585, 1820144, 1804101, 1788694, 1773703, 1759102, 1745481, 1733223, 1721684, 1709933, 1698032, 1686853, 1676802, 1667506, 1658693, 1650632, 1643582, 1637433, 1632034, 1627299, 1622891, 1618292, 1613391, 1608663, 1604749, 1602140, 1601016, 1600838, 1600339, 1598685, 1596595, 1595491, 1595586, 1595853, 1596023, 1597342, 1600629, 1604630, 1607351, 1608313, 1608363, 1607734, 1605753, 1602569, 1599828, 1598932, 1599368, 1599509, 1598576, 1597104, 1595718, 1594320, 1592607, 1590648, 1588413, 1585105, 1579630, 1571835, 1562902, 1554290, 1546466, 1538777, 1530377, 1521052, 1511336, 1502059, 1493804, 1486665, 1480393]
61540A480393n807n865o397o722n820l642j646j242j979k194j160N41K714N985
61526A447159J0038J2980J3576J3037J3323J4615J5821J6834J8573K1048K3101
61515A620105K4344K5882K8646L2094L5113L7390L9322M1269M3326M5383M7082
61504B019956M8106M8502M8320M7242M5453M4424M5414M7174M6916M4022M0969
61493B526498L9596L8351L4908L0041K6504K4801K2601J8472J3766J0088O879
61482B792505K862j665n401q020j0053j1389j1396j0315r244q564p552n736l676
61469B702356k036o27J202L963Q195J4272K1560K8472L4277M0135M7372N5249
61457B954390O1835O7020P3238Q2701R5077J08574J22285J36532J51510J66855
$$ y = [1480393, 1474586, 1468721, 1462324, 1455602, 1449782, 1446140, 1444494, 1443252, 1441273, 1439079, 1437919, 1438460, 1441174, 1447159, 1457197, 1470177, 1483753, 1496790, 1510113, 1524728, 1540549, 1557383, 1575956, 1597004, 1620105, 1644449, 1670331, 1698977, 1731071, 1766184, 1803574, 1842896, 1884165, 1927491, 1972874, 2019956, 2068062, 2116564, 2164884, 2212126, 2257579, 2302003, 2347417, 2394591, 2441507, 2485529, 2526498, 2566094, 2604445, 2639353, 2669394, 2695898, 2720699, 2743300, 2761772, 2775538, 2785626, 2792505, 2795367, 2793702, 2788301, 2780281, 2770228, 2758839, 2747443, 2737128, 2727884, 2719320, 2711768, 2706032, 2702356, 2700320, 2699693, 2700895, 2704858, 2713053, 2727325, 2748885, 2777357, 2811634, 2851769, 2899141, 2954390, 3016225, 3083245, 3156483, 3239184, 3334261, 3442835, 3565120, 3701652, 3853162, 4020017]
61447D020017J82402J98624K16132K35231K55672K76422K95909L13095L27914
61438F321418L39783L45908L42252L26555K99799K64628K23133J76536J26080
61429H766092P3641K1766k6525o8672j03953j33508j58467j78296j91557j98052
61419G802469j99534j98229j95055j89428j80536j68626j55069j41215j27384
61410F247393j13083r7983q2196o5771m8677l1501j5509j547J0631K1740L2103
61399E855600M1823N1102N9786O7013P2121P5636P8614Q1183Q2484Q2119Q0877
61388F628358P9768P8980P8017P6566P4860P3349P2218P1169O9613O7152O3889
61377G433939O0241N6631N3249M9752M5166L8718L1006K3727J7598J1339L557
$$ y = [4020017, 4202419, 4401043, 4617175, 4852406, 5108078, 5384500, 5680409, 5993504, 6321418, 6661201, 7007109, 7349361, 7675916, 7975715, 8240343, 8463476, 8640012, 8766092, 8839733, 8861499, 8834974, 8766302, 8662349, 8528841, 8370374, 8192078, 8000521, 7802469, 7602935, 7404706, 7209651, 7020223, 6839687, 6671061, 6515992, 6374777, 6247393, 6134310, 6036327, 5954131, 5888360, 5839683, 5808182, 5792673, 5791126, 5801757, 5823497, 5855600, 5897423, 5948525, 6008311, 6075324, 6147445, 6223081, 6301695, 6382878, 6465362, 6547481, 6628358, 6708126, 6787106, 6865123, 6941689, 7016549, 7089898, 7162116, 7233285, 7302898, 7370050, 7433939, 7494180, 7550811, 7604060, 7653812, 7698978, 7737696, 7768702, 7792429, 7810027, 7821366, 7824923]
61366G824923m944j2008j7003k1420k6375l1010l3956l5186l5463l5025l3864
61355G538669l2539l1363k9373k5529k0750j7240j5714j4749j3385j2852j4639
61344G310536j8059k1073k2848k4019k4819k4575k3187k1540j9646j5659p855
61333G087256L107J5003K6845L9862N5723P4669R5612J17443J39908J63484J88597
61322H007509K14858K41152K66519K90596L12907L32258L47343L57257L60510
61313A0730909L54100L35186L03915K63434K16870J65583J10803N5361K331m7208
61303A2491284r3814j37606j77802k13937k46253k74643k98250l16339l28911
61294A0403729l36278l38700l36659l31072l22963l13223l02520k90982k77933
$$ y = [7824923, 7819979, 7807971, 7790968, 7769548, 7743173, 7712163, 7678207, 7643021, 7607558, 7572533, 7538669, 7506130, 7474767, 7445394, 7419865, 7399115, 7381875, 7366161, 7351412, 7338027, 7325175, 7310536, 7292477, 7271404, 7248556, 7224537, 7199718, 7175143, 7151956, 7130416, 7110770, 7095111, 7087256, 7090363, 7105366, 7132211, 7172073, 7227796, 7302465, 7398077, 7515520, 7655428, 7818912, 8007509, 8222367, 8463519, 8730038, 9020634, 9333541, 9665799, 10013142, 10370399, 10730909, 11085009, 11420195, 11724110, 11987544, 12204414, 12369997, 12480800, 12536161, 12538492, 12491284, 12397470, 12259864, 12082062, 11868125, 11621872, 11347229, 11048979, 10732640, 10403729, 10067451, 9728751, 9392092, 9061020, 8738057, 8424834, 8122314, 7831332, 7553399]
61285G553399k62480k44546k25034k05098j85512j66529j47859j28988j10051
61276E877302r2264p6776o3044m9109l3742j7815l193R241K0083L0226L9734M7941
61264E688584N4340N9084O2522O4515O4612O2863O0001N6769N3468N0245M7180
61253F324183M3928L9926L5298L0759K6315K1044J4773Q762L711j856r755j9413
61241F517675k8501l5832m2071m7919n3350n8516o3754o8458p1515p3006p4092
61230E900661p5111p5307p4516p3374p1615o8136o3217n8688n5139n1004m5406
61219E189148l9919l6237l3996l2316l1641l2214l2459l1053k9258k9005k9713
61208D831337k9235k7078k4340k1180j6721j1139n536J04O619J3603J9944K6420
$$ y = [7553399, 7290919, 7046373, 6821339, 6616241, 6430729, 6264200, 6116341, 5987353, 5877302, 5785038, 5708262, 5645218, 5596109, 5562367, 5544552, 5541359, 5550600, 5570683, 5600909, 5640643, 5688584, 5742924, 5802008, 5864530, 5929045, 5993657, 6056520, 6116521, 6173290, 6226758, 6277003, 6324183, 6368111, 6408037, 6443335, 6474094, 6500409, 6521453, 6536226, 6544988, 6548699, 6546843, 6537088, 6517675, 6489174, 6453342, 6411271, 6363352, 6310002, 6251486, 6187732, 6119274, 6047759, 5974753, 5900661, 5825550, 5750243, 5675727, 5602353, 5530738, 5462602, 5399385, 5340697, 5285558, 5234554, 5189148, 5149229, 5112992, 5078996, 5046680, 5015039, 4982825, 4950366, 4919313, 4890055, 4861050, 4831337, 4802102, 4775024, 4750684, 4729504, 4712783, 4701644, 4696108, 4696212, 4702831, 4716434, 4736378, 4762798]
61196D762798L5246M6604N8085O8226P8308Q9829J02405J15203J28245J40788
61186E625737J50214J54264J53054J47450J36756J19710R6634O8847L6840R23
61176F690429l6673p2239j03274j29523j51288j68082j79304j85322j87314j86336
61166E291074j82958j77728j71801j66537j61982j56215j47351j36166j25418
61157C864918j16423j07891r8681q9808q2446p5569o7504n8796n1508m6206m1469
61146C028617l6001k9561k2075j3741o033o90K627O032J0443J4493J6789J7591
61134B988491J7507J6232J3684J0995R038O946L502o44l604m842n858q127j1386
61121C031934j4328j6444j8659k2151k6757l0745l2474l2141l1398l1420l2025
$$ y = [4762798, 4798044, 4844648, 4902733, 4970959, 5049267, 5139096, 5241501, 5356704, 5484949, 5625737, 5775951, 5930215, 6083269, 6230719, 6367475, 6487185, 6583819, 6652666, 6689506, 6690429, 6653756, 6581517, 6478243, 6348720, 6197432, 6029350, 5850046, 5664724, 5477410, 5291074, 5108116, 4930388, 4758587, 4592050, 4430068, 4273853, 4126502, 3990336, 3864918, 3748495, 3640604, 3541923, 3452115, 3369669, 3294100, 3226596, 3167800, 3116292, 3070086, 3028617, 2992616, 2963055, 2940980, 2927239, 2921206, 2920516, 2923143, 2929175, 2939618, 2954111, 2970900, 2988491, 3005998, 3022230, 3035914, 3046909, 3055947, 3062893, 3066395, 3065751, 3062147, 3057305, 3051447, 3043320, 3031934, 3017606, 3001162, 2982503, 2960352, 2933595, 2902850, 2870376, 2838235, 2806837, 2775417, 2743392]
61110B743392l2756l3806l5420l7205l8734m0250m2012m3463m3891m3669m3923
61099B308263m4966m5743m4974m2470l9122l5943l3303l1135k9778l0205l2854
61088A897770l6349l8265l7517l5342l3641l3003l2802l2416l1612l0282k8563
61077A527978k6766k4602k1186j6559j2492j0561r993q683o062l505j990q91O23
61064A385311K372L925N402O950Q340R727J1819J4589J6621J6605J4993J3408
61052A510062J2930J3585J4998J6640J7719J7603J6449J4932J3505J2167J0747
61041A671337R025O798M249K063R16R02J474J722Q08j179k858k948k136k515m777
61026A682881p161p903p522p602q380q987r292r891j0710j1208j1744j3118j4757
$$ y = [2743392, 2710636, 2676830, 2641410, 2604205, 2565471, 2525221, 2483209, 2439746, 2395855, 2352186, 2308263, 2263297, 2217554, 2172580, 2130110, 2090988, 2055045, 2021742, 1990607, 1960829, 1930624, 1897770, 1861421, 1823156, 1785639, 1750297, 1716656, 1683653, 1650851, 1618435, 1586823, 1556541, 1527978, 1501212, 1476610, 1455424, 1438865, 1426373, 1415812, 1405819, 1397136, 1391074, 1387569, 1385579, 1384688, 1385311, 1387683, 1391608, 1397010, 1403960, 1412300, 1422027, 1433846, 1448435, 1465056, 1481661, 1496654, 1510062, 1522992, 1536577, 1551575, 1568215, 1585934, 1603537, 1619986, 1634918, 1648423, 1660590, 1671337, 1680362, 1687160, 1691409, 1693472, 1694388, 1695290, 1696764, 1698486, 1699294, 1698115, 1695257, 1692309, 1690173, 1687658, 1682881, 1675720, 1667817, 1660295, 1652693, 1644313, 1635326, 1626034, 1616143, 1605433, 1594225, 1582481, 1569363, 1554606]
61013A554606j5108j4020j3037j2874j2371j0736r169q986r447q979p774p432
61001A424673q323q905p835n560l393j894p42L91J451K312K988L468L648L628
60987A405907L918N034O804Q419R404J0215J1488J3048J4278J5168J6223J7401
60975A537307J8104J8397J9353K1711K4875K7733K9932L1942L4282L7149M0306
60964A841091M3117M5173M7018M9625N2929N5798N7778N9856O2820O6082O9102
60953B450389P2957P8976Q6456R3311R8911J04764J12330J21366J30823J40151
60943C490434J49306J58396J67917J78696J91199K05451K21904K41553K64659
60934E269515K90037L16431L44199L75008M10200M50584M98283N57868O34502
$$ y = [1554606, 1539498, 1525478, 1512441, 1499567, 1487196, 1476460, 1467291, 1458305, 1448858, 1439879, 1432105, 1424673, 1416350, 1407445, 1399610, 1394050, 1390657, 1388763, 1388021, 1388412, 1389863, 1392175, 1395163, 1398631, 1402279, 1405907, 1409825, 1414859, 1421663, 1430082, 1439486, 1449701, 1461189, 1474237, 1488515, 1503683, 1519906, 1537307, 1555411, 1573808, 1593161, 1614872, 1639747, 1667480, 1697412, 1729354, 1763636, 1800785, 1841091, 1884208, 1929381, 1976399, 2026024, 2078953, 2134751, 2192529, 2252385, 2315205, 2381287, 2450389, 2523346, 2602322, 2688778, 2782089, 2881000, 2985764, 3098094, 3219460, 3350283, 3490434, 3639740, 3798136, 3966053, 4144749, 4335948, 4541399, 4763303, 5004856, 5269515, 5559552, 5875983, 6220182, 6595190, 7005390, 7455974, 7954257, 8512125, 9146627]
60925I146627P30801Q46333R80244J133087J305742J499506J720432J980298K283101
60916B1626171K602343K872502L009950K949129K667931K195610J613619J047005
60908D0584260O28012M34989M48630N64997O52821O05370L60575r3003p05731
60899D3480920j368212j948671k352369k556999k598868k532346k401517k236999
60891B5484939k062322j894733j742062j603702j476201j357471j246588j142110
60883A2959750j042336r47139q58398p77870p04930o37107n72941n13427m60173
60874F445429m12979l70242l31320k97107k68127k43312k21467k02926j88706
60865C909243j78362j69794j61243j52726j45161j38597j31807j23563j14052
$$ y = [9146627, 9877428, 10723761, 11704005, 12837092, 14142834, 15642340, 17362772, 19343070, 21626171, 24228514, 27101016, 30110966, 33060095, 35728026, 37923636, 39537255, 40584260, 41212272, 41647261, 42095891, 42660888, 43313709, 43919079, 44279654, 44186651, 43480920, 42112708, 40164037, 37811668, 35254669, 32655801, 30123455, 27721938, 25484939, 23422617, 21527884, 19785822, 18182120, 16705919, 15348448, 14101860, 12959750, 11917414, 10970275, 10111877, 9334007, 8629077, 7991970, 7419029, 6905602, 6445429, 6032450, 5662208, 5330888, 5033781, 4765654, 4522342, 4300875, 4097949, 3909243, 3730881, 3561087, 3399844, 3247118, 3101957, 2963360, 2831553, 2707990, 2593938]
60856B593938j04834r7345r1540q6239q0655p4995o9612o4373n9340n5313n2792
60845A756900n0864m8081m4320m0729l7914l5263l2336k9760k8076k6585k4328
60834A358644k1675j9812j8887j7706j5478j2943j1288j0668j0324r682q650p178
60822A194353n375l908l491l778l632k738k108k387k646j863q57j315l119m247
60808A152889l620k530k588l509m000l815l676l783l631l016k111q03J004K548
60794A119359K843K277K476M278O628P936P961P980R365J2184J5051J6426J6201
60781A230965J5675J5720J5683J4693J3303J2652J2487J1543R782Q731R186R889
60769A380309R172O946M389K480J506J351J612J901K317L113L757L199J454j6
$$ y = [2593938, 2489104, 2391759, 2300219, 2213980, 2133325, 2058330, 1988718, 1924345, 1865005, 1809692, 1756900, 1706036, 1657955, 1613635, 1572906, 1534992, 1499729, 1467393, 1437633, 1409557, 1382972, 1358644, 1336969, 1317157, 1298270, 1280564, 1265086, 1252143, 1240855, 1230187, 1219863, 1210181, 1201531, 1194353, 1188978, 1185070, 1181579, 1177801, 1174169, 1171431, 1169323, 1166936, 1164290, 1162427, 1161570, 1160255, 1157136, 1152889, 1149269, 1146739, 1144151, 1140642, 1136642, 1132827, 1129151, 1125368, 1121737, 1118721, 1116610, 1115807, 1116811, 1119359, 1122202, 1124479, 1126955, 1131233, 1137861, 1145797, 1153758, 1161738, 1171103, 1183287, 1198338, 1214764, 1230965, 1246640, 1262360, 1278043, 1292736, 1306039, 1318691, 1331178, 1342721, 1352503, 1361234, 1370420, 1380309, 1389481, 1396427, 1400816, 1403296, 1404802, 1406153, 1407765, 1409666, 1411983, 1415096, 1418853, 1422052, 1423506, 1423490]
60755A423490j58L08J06p55j306j316j693l240n580p414p713o826o449p921j0588
60740A362945j2510j2843j2533j2472j2259j1442j0695j0685j0728r794q221p143
60728A231620o653n721l845j709j98M55O24J013K234M088N531N956O021O550P341
60713A253307P966R087J1529J4439J5867J5326J4415J4644J5773J6702J6916J6598
60701A422569J6021J5421J4863J3914J1982R247O782N573N733O759P896Q299P442
60688A552501N657L784K207P21p46j937k846l786m780n430n559n482n619o309
60674A522376p886j0260j2447j3337j2956j2314j2001j1647j0933j0274j0270
60663A398051j0983j1833j1760r826o462l766l415m417m228k037M54J611J558
$$ y = [1423490, 1423332, 1423640, 1423746, 1422991, 1421685, 1420369, 1418676, 1415436, 1409856, 1402442, 1394729, 1387903, 1381454, 1373533, 1362945, 1350435, 1337592, 1325059, 1312587, 1300328, 1288886, 1278191, 1267506, 1256778, 1246984, 1238763, 1231620, 1224967, 1219246, 1215401, 1213692, 1213494, 1213949, 1214573, 1215586, 1217820, 1221908, 1227439, 1233395, 1239416, 1245966, 1253307, 1261273, 1270360, 1281889, 1296328, 1312195, 1327521, 1341936, 1356580, 1372353, 1389055, 1405971, 1422569, 1438590, 1454011, 1468874, 1482788, 1494770, 1504017, 1510799, 1516372, 1522105, 1528864, 1536760, 1545059, 1552501, 1558158, 1561942, 1564149, 1564870, 1564124, 1562187, 1559341, 1555555, 1550775, 1545345, 1539786, 1534304, 1528685, 1522376, 1514490, 1504230, 1491783, 1478446, 1465490, 1453176, 1441175, 1429528, 1418595, 1408321, 1398051, 1387068, 1375235, 1363475, 1353649, 1347187, 1343421, 1340006, 1335589, 1331361, 1329324, 1329778, 1331389, 1332947]
60650A332947R38j61j244j029O94K072J418n38j846j862j384j123j330k170l144
60635A322238k915j101M58j78k290l624l816m689p094r472j0093r142p958p510
60621A252814q172r757j1125j0936r495q761r793j1265j1363j0150r067q766q631
60608A125533q002o922n827n122m886m499l107r47M09o6j252j164N20K266K919
60593A089853L011L576M613N282N068M363M026M588N666O143N188L197J414P19
60579A146707R87J518J742J569J491K169L559M668M784M660N623P606R088R232
60565A205403R032R738J1111J2125J2722J3772J5489J6970J7310J6520J5224J4086
60553A369502J3633J4047J4861J5268J4808J3630J2087J0537R392Q793Q126O382
$$ y = [1332947, 1333885, 1333724, 1332480, 1331451, 1332145, 1334217, 1335635, 1335097, 1333251, 1331389, 1330005, 1328882, 1327552, 1325382, 1322238, 1319323, 1318222, 1318680, 1318502, 1316212, 1312588, 1308772, 1304083, 1296989, 1287517, 1277424, 1268282, 1260324, 1252814, 1244642, 1234885, 1223760, 1212824, 1203329, 1194568, 1184775, 1173510, 1162147, 1151997, 1142930, 1134164, 1125533, 1117531, 1110609, 1104782, 1099660, 1094774, 1090275, 1087168, 1086221, 1086630, 1086564, 1085312, 1084148, 1084668, 1086934, 1089853, 1092864, 1096440, 1101053, 1106335, 1111403, 1115766, 1119792, 1124380, 1130046, 1136189, 1141377, 1144574, 1145988, 1146707, 1147694, 1149212, 1150954, 1152523, 1154014, 1156183, 1159742, 1164410, 1169194, 1173854, 1179477, 1187083, 1196171, 1205403, 1214435, 1224173, 1235284, 1247409, 1260131, 1273903, 1289392, 1306362, 1323672, 1340192, 1355416, 1369502, 1383135, 1397182, 1412043, 1427311, 1442119, 1455749, 1467836, 1478373, 1487765, 1496558, 1504684, 1511066]
60541A511066L148j066n387r005j1105j1243j0134r461j0330j2138j3252j2529
60529A408564j0070o902m295l016k893l183l375l399l163k501j631r65k41J162
60515A364092K770K894Q71j557k194j092p2kP4J141K877M302M840M473L804M048
60499A391269N927Q415R682R506R643J1349J3790J5649J7071J8920K1045K2651
60487A554917K3877K5634K8139L0751L3304L6606M1372M7479N4237O0766O5950
60476B003032O8924O9728O8797O5630N8786M7603L3283J7922L121j0070k0645
60465B406111k8041l2729l5639l6970l6195l3243k8969k4317j9497j4234q525
60454B107752k863K027N555P712R459J2249J6766K2272K7633L2779L8626M5698
$$ y = [1511066, 1514214, 1513148, 1507761, 1498756, 1487651, 1476408, 1466274, 1456813, 1446483, 1434345, 1421093, 1408564, 1398494, 1391592, 1387297, 1384281, 1381388, 1378205, 1374830, 1371431, 1368268, 1365767, 1364136, 1363171, 1362930, 1364092, 1366862, 1369756, 1370627, 1369070, 1366876, 1365784, 1365712, 1365710, 1365784, 1366925, 1369802, 1374104, 1378944, 1383417, 1387221, 1391269, 1397196, 1405611, 1415293, 1424799, 1434442, 1445791, 1459581, 1475230, 1492301, 1511221, 1532266, 1554917, 1578794, 1604428, 1632567, 1663318, 1696622, 1733228, 1774600, 1822079, 1876316, 1937082, 2003032, 2071956, 2141684, 2210481, 2276111, 2334897, 2382500, 2415783, 2433705, 2436826, 2426756, 2406111, 2378070, 2345341, 2309702, 2272732, 2236537, 2203294, 2174325, 2150008, 2130511, 2116277, 2107752, 2104889, 2106916, 2112471, 2120183, 2129642, 2141891, 2158657, 2180929, 2208562, 2241341, 2279967, 2325665]
60442B325665N3523O1559P0046P9608R0512J02748J16331J31007J46032J60698
60432C337729J74782J87980J99580K09602K19880K32939K49746K69580K91919
60423E373737L16719L41995L62343L71091L63485L37258K91314K25856J44026
60414H127824N2193m2005j31548k10451k73863l19023l46194l58306l59499l53524
60404E785604l42743l28200l10807k92242k74258k57357k40921k24787k09737
60395C304552j96010j82339j67388j51734j37380j25310j14548j03796r3212q3968
60385A948867p6630p0580o4892n9178n3616m8541m4112m0120l6123l2047k8603
60374A394425k6665k6102k5687k4411k2483k0756j9486j8285j6895j5375j3644
$$ y = [2325665, 2379188, 2440747, 2510793, 2590401, 2680913, 2783661, 2899992, 3030999, 3177031, 3337729, 3512511, 3700491, 3900071, 4109673, 4329553, 4562492, 4812238, 5081818, 5373737, 5690456, 6032451, 6394794, 6765885, 7129370, 7466628, 7757942, 7983798, 8127824, 8180017, 8138012, 8006464, 7796013, 7522150, 7203127, 6856933, 6498627, 6139128, 5785604, 5442861, 5114661, 4803854, 4511612, 4237354, 3979997, 3739076, 3514289, 3304552, 3108542, 2926203, 2758815, 2607081, 2469701, 2344391, 2229843, 2126047, 2032835, 1948867, 1872237, 1801657, 1736765, 1677587, 1623971, 1575430, 1531318, 1491198, 1455075, 1423028, 1394425, 1367760, 1341658, 1315971, 1291560, 1269077, 1248321, 1228835, 1210550, 1193655, 1178280, 1164636]
60363A164636j1545r499q314q045p737o671n360m681m539m048k782j136M41J869
60349A092589L104L925M319M522M616M503M420M964O270P571P904P132O004N375
60335A167218N539O099O307N677M520L709L750M261M566M493M323M188L978L818
60321A232446M005M364M086K570K64j695k511k158r20Q94K693L525K856J225k49
60306A251395r20p66K94K342M626N669M990M077M725O724Q233Q399Q353R298J0783
60291A328222J1705J2057J2582J3218J3196J2512J2111J2441J2875J2909J2911
60280A466739J3095J2810J1696J0804J1324J2518J2331J0223Q230Q544J0919J3314
60268A602547J4512J4929J4948J3818J0914P297M848L829K275j667p365j2353
$$ y = [1164636, 1153091, 1143592, 1135278, 1127233, 1119496, 1112825, 1107465, 1102784, 1098245, 1094197, 1091415, 1090279, 1090720, 1092589, 1095693, 1099618, 1103937, 1108459, 1113075, 1117578, 1121998, 1126962, 1133232, 1140803, 1148707, 1155839, 1161843, 1167218, 1172757, 1178856, 1185163, 1190840, 1195360, 1199069, 1202819, 1207080, 1211646, 1216139, 1220462, 1224650, 1228628, 1232446, 1236451, 1240815, 1244901, 1247471, 1247735, 1246040, 1243529, 1241371, 1240451, 1241345, 1244038, 1247563, 1250419, 1251644, 1251395, 1250475, 1249709, 1250003, 1252345, 1256971, 1262640, 1267630, 1271707, 1276432, 1283156, 1291389, 1299788, 1308141, 1317439, 1328222, 1339927, 1351984, 1364566, 1377784, 1390980, 1403492, 1415603, 1428044, 1440919, 1453828, 1466739, 1479834, 1492644, 1504340, 1515144, 1526468, 1538986, 1551317, 1561540, 1569770, 1578314, 1589233, 1602547, 1617059, 1631988, 1646936, 1660754, 1671668, 1678965, 1683813, 1687642, 1689917, 1688250, 1680885, 1668532]
60256A668532j4954j5528j5209j4539j3732j3342j3693j3987j3119j1322j0099
60245A519008j0190j0509r657p810o259n469m635l136j496m44K70J375K682L067
60231A466797J911j15j875k857k968j892N04L337N131N364N044N481O991Q929
60217A499782J0438J0873J0218R478J0112J2411J4921J6115J6131J6285J7366
60206A644130J9282K1758K4397K6448K7658K9084L1852L5380L8224M0371M3236
60195A981820M7316N1686N5985O0946O6359P0652P3526P7109Q3105R0581R8142
60184B757227J06342J15966J25530J33209J40153J49010J59562J68637J74392
60175D030028J78014J80761J81891J80329J76194J69654J60244J48408J35939
$$ y = [1668532, 1653578, 1638050, 1622841, 1608302, 1594570, 1581228, 1567535, 1553548, 1540429, 1529107, 1519008, 1508818, 1498309, 1488652, 1480842, 1474583, 1469114, 1464479, 1461343, 1459847, 1459403, 1459673, 1461048, 1463730, 1466797, 1468708, 1468593, 1466718, 1463861, 1460893, 1459001, 1459505, 1462842, 1467973, 1473337, 1478381, 1483862, 1490853, 1499782, 1510220, 1521093, 1531311, 1540789, 1550901, 1563312, 1578233, 1594348, 1610479, 1626764, 1644130, 1663412, 1685170, 1709567, 1736015, 1763673, 1792757, 1824609, 1859989, 1898213, 1938584, 1981820, 2029136, 2080822, 2136807, 2197753, 2264112, 2334764, 2408290, 2485399, 2568504, 2659085, 2757227, 2863569, 2979535, 3105065, 3238274, 3378427, 3527437, 3686999, 3855636, 4030028, 4208042, 4388803, 4570694, 4751023, 4927217, 5096871, 5257115, 5405523, 5541462]
60166E541462J23584J09763R2906P3802N4462L5965J8760L824q047j7259k4394
60155F004828k8956l0346k9214k6381k1210j2647j389J0552K2155L3927M6434
60144E967753N9860P4825R1940J10187J27082J40935J51902J60513J66382J68892
60134G220271J68066J63904J55712J43019J26715J08308Q8184O5577M0460J4656
60124H294872r544l1531n2262p1973q8853j00688j07149j09544j08712j04346
60114G510270r6452q6062p4060o0352m4890k8498j1909N083K2677M0009N6058
60103G231874P0722Q3910R4277J00206J01604R9493R4208Q5461P3961O1439M8911
60092H146066L6372K4323J4233O940J919j164j272K805J0900K2002L5734N2461
$$ y = [5541462, 5665046, 5774809, 5867715, 5941517, 5995979, 6031944, 6050704, 6054528, 6046481, 6029222, 6004828, 5975872, 5945526, 5916312, 5889931, 5868721, 5856074, 5854685, 5865237, 5887392, 5921319, 5967753, 6027613, 6102438, 6194378, 6304565, 6431647, 6572582, 6724484, 6884997, 7051379, 7220271, 7388337, 7552241, 7707953, 7850972, 7977687, 8085995, 8174179, 8239756, 8280216, 8294872, 8285328, 8253797, 8201535, 8129562, 8040709, 7940021, 7832872, 7723328, 7614616, 7510270, 7413818, 7327756, 7253696, 7193344, 7148454, 7119956, 7108047, 7113130, 7135807, 7175816, 7231874, 7302596, 7386506, 7480783, 7580989, 7682593, 7782086, 7876294, 7961755, 8035716, 8097155, 8146066, 8182438, 8206761, 8220994, 8227934, 8229853, 8228689, 8227417, 8230222, 8241122, 8263124, 8298858, 8351319]
60080H351319P2273R4663J19013J44792J71487J98936K27694K58577K91776L26695
60070A0257225L62626L99059M35221M69682N00832N27724N50027N67003N76992
60061A4646391N78318N70583N54413N30168M97574M56688M08244L52677K89819
60052A8884875K20309J46531P1142m757q0957j55905k26175k88211l39928l80794
60042A7846130m11104m31199m40946m40225m30160m13025l90064l60585l24490
60033A4204332k84870k45785k07723j67628j24082q0406m1520r305J7501M0031
60023A3100545N7525O8305P1245O6581N6083M2169K6117P474j4243l7972o1971
60012A3381858q5480j08487j30519j50963j70217j89080k07017k22286k33971
$$ y = [8351319, 8423592, 8518255, 8637268, 8782060, 8953547, 9152483, 9380177, 9638754, 9930530, 10257225, 10619851, 11018910, 11454131, 11923813, 12424645, 12952369, 13502396, 14069399, 14646391, 15224709, 15795292, 16349705, 16879873, 17377447, 17834135, 18242379, 18595056, 18884875, 19105184, 19251715, 19322857, 19318100, 19237143, 19081238, 18855063, 18566852, 18226924, 17846130, 17435026, 17003827, 16562881, 16122656, 15692496, 15279471, 14889407, 14528822, 14204332, 13919462, 13673677, 13465954, 13298326, 13174244, 13093838, 13052318, 13043013, 13060514, 13100545, 13158070, 13226375, 13297620, 13364201, 13420284, 13462453, 13488570, 13496044, 13481801, 13443829, 13381858, 13296378, 13187891, 13057372, 12906409, 12736192, 12547112, 12340095, 12117809, 11883838]
60003A1883838k42623k48527k50700k48408k42594k34515k23659k08473j89017
59994I795322j67431j45349j22099r6374o8721m1123j4593J1399L7116O1648Q4339
59983I334134J05848J26675J45350J59208J66605J67520J62342J51298J35020
59974A0654000J14678R1126O4576L5314M366k6748n6597q4300j09732j33036j53546
59963A0400101j69626j80297j86426j89425j89127j84179j74351j61173j46121
59954H819376j29454j11022r0958o9114m5037j9122P252L3442O0352Q8831J18079
59943H662625J46371J72489J95705K15269K30828K42576K49905K50669K42973
59934A0609410K27356K06211J81411J53493J22780Q9964N5485J9519j7093n2655
$$ y = [11883838, 11641215, 11392688, 11141988, 10893580, 10650986, 10416471, 10192812, 9984339, 9795322, 9627891, 9482542, 9360443, 9264069, 9195348, 9154225, 9139632, 9151031, 9188147, 9249795, 9334134, 9439982, 9566657, 9712007, 9871215, 10037820, 10205340, 10367682, 10518980, 10654000, 10768678, 10859804, 10924380, 10959694, 10964060, 10937312, 10880715, 10796415, 10686683, 10553647, 10400101, 10230475, 10050178, 9863752, 9674327, 9485200, 9301021, 9126670, 8965497, 8819376, 8689922, 8578900, 8487942, 8418828, 8373791, 8354669, 8361921, 8395363, 8455715, 8544546, 8662625, 8808996, 8981485, 9177190, 9392459, 9623287, 9865863, 10115768, 10366437, 10609410, 10836766, 11042977, 11224388, 11377881, 11500661, 11590625, 11646110, 11665629, 11648536, 11595881]
59924A1595881q5621j15243j41052j62176j77456j85894j87082j81622j71162
59915A0188573j57549j41819j24087j04164q1847n7038l0410l813K0913M3755
59905I552514O6304Q9239J10787J28336J41112J50444J57659J62667J64750J63805
59895A0887617J60151J53755J44607J33691J22700J12511J02778R3426Q5914Q2413
59885A2079563Q4013R0271J00330J14071J32289J55911J84733K16968K50808K86644
59875A3695601L26548L70882M16544M59584M98224N31547N56483N68574N65568
59866A7989555N47860N15199M65668L98724L17067K24298J23029J6929q7486j83549
59856B0327294k68054l40455l99611m43766m73129m90141m96875m93955m82193
$$ y = [11595881, 11510260, 11395017, 11253965, 11091789, 10914333, 10728439, 10541357, 10359735, 10188573, 10031024, 9889205, 9765118, 9660954, 9579107, 9522069, 9491659, 9487846, 9508759, 9552514, 9618818, 9708057, 9818844, 9947180, 10088292, 10238736, 10396395, 10559062, 10723812, 10887617, 11047768, 11201523, 11346130, 11479821, 11602521, 11715032, 11817810, 11911236, 11997150, 12079563, 12163576, 12253847, 12354177, 12468248, 12600537, 12756448, 12941181, 13158149, 13408957, 13695601, 14022149, 14393031, 14809575, 15269159, 15767383, 16298930, 16855413, 17423987, 17989555, 18537415, 19052614, 19518282, 19917006, 20234073, 20458371, 20581400, 20598329, 20510843, 20327294, 20059240, 19718785, 19319174, 18875408, 18402279, 17912138, 17415263, 16921308, 16439115]
59847A6439115m63485m39482m10704l77553l41001l01678k59378k14341j68218
59838A3463275j22844p8484l4189J0138N2688R0936J23212J48775J66708J75550
59828A3995765J74203J62441J40045J06274O1316P936m9494j07625j64688k18737
59818A4107436k67234l08953l44520l73966l95255m06698m09784m07949m03232
59809A0789845l95463l84122l69309l51290l30600l08619k86805k65269k43180
59800G855188k20449j98090j77056j57708j40210j24541j10385r7916q8265q1990
59790F458578p7486p2333o6083o0399n6419n3327m9653m4773l9099l3969l1358
59779E873679l2288l5428l8584m1609m6325n3177n9820o3871o5512o6280o6375
$$ y = [16439115, 15975630, 15536148, 15125444, 14747891, 14406890, 14105212, 13845834, 13631493, 13463275, 13340431, 13261947, 13227758, 13237896, 13290584, 13381520, 13504732, 13653507, 13820215, 13995765, 14169968, 14332409, 14472454, 14578728, 14640044, 14647980, 14598486, 14490861, 14326173, 14107436, 13840202, 13531249, 13186729, 12812763, 12417508, 12010810, 11601026, 11193077, 10789845, 10394382, 10010260, 9640951, 9289661, 8959061, 8650442, 8363637, 8098368, 7855188, 7634739, 7436649, 7259593, 7101885, 6961675, 6837134, 6726749, 6628833, 6540568, 6458578, 6381092, 6308759, 6242676, 6182277, 6125858, 6072531, 6022878, 5978105, 5939006, 5905037, 5873679, 5841391, 5805963, 5767379, 5725770, 5679445, 5626268, 5566448, 5502577, 5437065, 5370785, 5304410]
59768E304410o4611o0376n4357m7578m0627l3861k7675k2395j8006j3902q987
59757D912035k430N667J4646K4071L3596M2418M9770N5832O1274O6127P0245P4595
59745E407846Q0422Q6784R0542Q9544Q4649P7992P0701O3311N7001N2778N0021
59734F211591M7226M4002M1460M0953M3355M9144N8170O9432Q1914R5638J11309
59723F894194J29132J48777J70452J95262K24270K57423K93539L31121L69401
59714I013571M08543M48444M86892N19074N38925N40742N19810M72956L99983
59705A3348940L04867J95395Q1575k6157j19007j91830k43572k75744k90849k92347
59695A2491271k84696k71651k54425k32525k06480j78795j51822j25624r8677
$$ y = [5304410, 5239799, 5179423, 5125066, 5077488, 5036861, 5003000, 4975325, 4952930, 4934924, 4921022, 4912035, 4909605, 4915272, 4929918, 4953989, 4987585, 5030003, 5079773, 5135605, 5196879, 5263006, 5333251, 5407846, 5488268, 5575052, 5665594, 5755138, 5839787, 5917779, 5988480, 6051791, 6108792, 6161570, 6211591, 6258817, 6302819, 6344279, 6385232, 6428587, 6477731, 6535901, 6605333, 6687247, 6782885, 6894194, 7023326, 7172103, 7342555, 7537817, 7762087, 8019510, 8313049, 8644170, 9013571, 9422114, 9870558, 10357450, 10876524, 11415449, 11956191, 12476001, 12948957, 13348940, 13653807, 13849202, 13930777, 13904620, 13785613, 13593783, 13350211, 13074467, 12783618, 12491271, 12206575, 11934924, 11680499, 11447974, 11241494, 11062699, 10910877, 10785253, 10686576]
59686A0686576p0222m1097j2131J7337M8701Q2068J15878J48791J81297K14745
59676A1371943K49422K84615L20436L58286L99135M42283M86600N32262N80428
59667A5025410O31444O84329P38064P92796Q49355R07599R65459J019640J067165
59658B2681261J105932J133943J149040J150276J139189J118917J092357J062136
59650C1633051J031852J005717R86538R75055R71277R74803R83185R91538R94953
59641D0547969R90361R75212R45717Q98091Q31101P46138O45476N32001M10587
59632D7522653K88093J71454O6202k3560r5117j47493j80961j95681j91256j67794
59622D7046540j26815p0751j766P8936J70896K73609L85686N04783O28149P52700
$$ y = [10686576, 10616354, 10575257, 10563126, 10580463, 10629164, 10711232, 10827110, 10975901, 11157198, 11371943, 11621365, 11905980, 12226416, 12584702, 12983837, 13426120, 13912720, 14444982, 15025410, 15656854, 16341183, 17079247, 17872043, 18721398, 19628997, 20594456, 21614096, 22681261, 23787193, 24921136, 26070176, 27220452, 28359641, 29478558, 30570915, 31633051, 32664903, 33670620, 34657158, 35632213, 36603490, 37578293, 38561478, 39553016, 40547969, 41538330, 42513542, 43459259, 44357350, 45188451, 45934589, 46580065, 47112066, 47522653, 47810746, 47982200, 48048402, 48024842, 47929725, 47782232, 47601271, 47405590, 47214334, 47046540, 46919725, 46848974, 46847208, 46926144, 47097040, 47370649, 47756335, 48261118, 48889267, 49641967]
59612D9641967Q74360R87936J087844J168117J221089J237197J207619J127260
59604E8553389R94832Q11397N80848L12063J9059k81628n73579q41624j073359
59595E8501398j261453j404246j503545j562335j584787j577134j547206j503133
59587D6557559j452947j404649j365582j341341j335247j347946j376463j413752
59579C5519632j450162j476393j485913j475959j447271j402899j346531j281629
59571B4152875j211769j140703j071138j003631r37609q73446q12648p55998p02545
59562A5643388o50902o00695n52168n05221m59922m17442l79297l45510l14543
59553A1417688k85311k58531k35714k17476k03292j92366j84096j78091j74322
$$ y = [49641967, 50516327, 51504263, 52592107, 53760224, 54981313, 56218510, 57426129, 58553389, 59548221, 60359618, 60940466, 61252529, 61271588, 60989960, 60416381, 59574757, 58501398, 57239945, 55835699, 54332154, 52769819, 51185032, 49607898, 48060692, 46557559, 45104612, 43699963, 42334381, 40993040, 39657793, 38309847, 36933384, 35519632, 34069470, 32593077, 31107164, 29631205, 28183934, 26781035, 25434504, 24152875, 22941106, 21800403, 20729265, 19725634, 18788025, 17914579, 17101931, 16345933, 15643388, 14992486, 14391791, 13839623, 13334402, 12874480, 12457038, 12077741, 11732231, 11417688, 11132377, 10873846, 10638132, 10420656, 10217364, 10024998, 9840902, 9662811, 9488489]
59544I488489j73086j74273j76852j79474j81421j82394j81688j78283j71954
59535G889064j63847j55709j48662j42460j35533j26075j13786j00526q8708p9026
59525F634732p0205o0792n0390l9152k7243j5342m717M037J1856J9937K7904L4154
59513F464779L7977M0660M4262M9783N6701O3738O9897P5235Q1131Q9452J00803
59502G174418J13641J25868J37340J50022J65206J81654J97578K13669K32392
59493H691788K54227K76614K97333L17228L38302L60537L82268M02598M21300
59484A1742195M36865M46859M50467M48913M43226M33282M19365M02479L82320
59475A5605971L56742L24635K88192K50994K14909J80102J47176J17539R2049
$$ y = [9488489, 9315403, 9141130, 8964278, 8784804, 8603383, 8420989, 8239301, 8061018, 7889064, 7725217, 7569508, 7420846, 7278386, 7142853, 7016778, 6902992, 6802466, 6713758, 6634732, 6564527, 6503735, 6453345, 6414193, 6386950, 6371608, 6366891, 6370928, 6382784, 6402721, 6430625, 6464779, 6502756, 6543416, 6587678, 6637461, 6694162, 6757900, 6827797, 6903032, 6984163, 7073615, 7174418, 7288059, 7413927, 7551267, 7701289, 7866495, 8048149, 8245727, 8459396, 8691788, 8946015, 9222629, 9519962, 9837190, 10175492, 10536029, 10918297, 11320895, 11742195, 12179060, 12625919, 13076386, 13525299, 13968525, 14401807, 14821172, 15223651, 15605971, 15962713, 16287348, 16575540, 16826534, 17041443, 17221545, 17368721, 17486260, 17578309]
59466A7578309P0759N4170M3622M0135M3560N3109O8191Q8288J12012J36564J58497
59455A8447216J75256J85629J88235J80337J59202J24481P8056K1746m3308j14844
59445A9402006j88963k62190l32573l97858m54184m98213n29580n49876n60029
59436A5628540n60116n51104n35204n14548m90618m64532m36830m07127l75113
59427A1293348l41694l08392k75773k43421k10992j78501j45869j13124q0777
59418I394805m9116j7539J4550M6593P7692J08106J38795J69721J99749K28131
59408A0311487K54854K79508L00738L16967L26795L28779L21720L05234K79410
59399A3025492K44054J99154J46100Q7615K6361l5819r7427j56721k11605k59802
$$ y = [17578309, 17649068, 17703238, 17746860, 17786995, 17830555, 17883664, 17951855, 18040143, 18152155, 18288719, 18447216, 18622472, 18808101, 18996336, 19176673, 19335875, 19460356, 19538412, 19560158, 19516850, 19402006, 19213043, 18950853, 18618280, 18220422, 17766238, 17268025, 16738445, 16188569, 15628540, 15068424, 14517320, 13982116, 13467568, 12976950, 12512418, 12075588, 11668461, 11293348, 10951654, 10643262, 10367489, 10124068, 9913076, 9734575, 9588706, 9475582, 9394805, 9345689, 9328150, 9342700, 9389293, 9466985, 9575091, 9713886, 9883607, 10083356, 10311487, 10566341, 10845849, 11146587, 11463554, 11790349, 12119128, 12440848, 12746082, 13025492, 13269546, 13468700, 13614800, 13702415, 13728776, 13692957, 13595530, 13438809, 13227204, 12967402]
59389A2967402k99524l30594l54436l72330l84265l90069l90802l87847l81393
59380I676142l71104l57804l43051l27477l10872k93571k76176k58255k39019
59371F898813k19330k01249j85306j69832j53479j36885j21250j06549r2022p7470
59361E435441o3304m9956l7718k6734j6873p938K07Q249J7540K8401L8807M6026
59349E372148M9320M9765M8062M4654M1789M2859M8863N7488O6541P6409Q8141
59338E986039J00991J13244J24032J33060J40016J45772J52943J63622J77384
59329G237103J92913K10676K32417K58682K88501L21054L56110L93198M31927
59320I922581M73063N17772N65628O14537O62897P10575P57207Q00442Q36735
$$ y = [12967402, 12667878, 12337284, 11982848, 11610518, 11226253, 10836184, 10445382, 10057535, 9676142, 9305038, 8947234, 8604183, 8276706, 7965834, 7672263, 7396087, 7137832, 6898813, 6679483, 6478234, 6292928, 6123096, 5969617, 5832732, 5711482, 5604933, 5512911, 5435441, 5372137, 5322181, 5284463, 5257729, 5240856, 5232918, 5233125, 5241374, 5258914, 5287315, 5326122, 5372148, 5421468, 5471233, 5519295, 5563949, 5605738, 5648597, 5697460, 5754948, 5821489, 5897898, 5986039, 6087030, 6200274, 6324306, 6457366, 6597382, 6743154, 6896097, 7059719, 7237103, 7430016, 7640692, 7873109, 8131791, 8420292, 8741346, 9097456, 9490654, 9922581, 10395644, 10913416, 11479044, 12093581, 12756478, 13467053, 14224260, 15024702, 15861437]
59311A5861437Q63554Q80147Q86101Q79925Q59926Q26774P84347P37126O87133
59302B3266470O34368N79773N25914M74306M23625L71585L17249K60448K00095
59293B7053833J34610O3540j2345r1980j73839k55231l33013m05062m70542n29272
59283B4980699n81657o28607o70311p05371p32150p50713p62529p68529p68545
59274A8612287p62454p50690p33586p11202o84015o53064o19423n84249n48976
59265A2564628n14422m79789m43807m07079l72135l40657l11645k83009k54233
59256I157852k26642k01444j78316j55994j33829j12428r2767p4888n7854m1142
59246G882548k5437j1525J127J3796K6665L8506M8320N6466O3783P0292P5224
$$ y = [15861437, 16724991, 17605138, 18491239, 19371164, 20231090, 21057864, 21842211, 22579337, 23266470, 23900838, 24480611, 25006525, 25480831, 25904456, 26276041, 26593290, 26853738, 27053833, 27188443, 27251983, 27239638, 27147658, 26973819, 26718588, 26385575, 25980513, 25509971, 24980699, 24399042, 23770435, 23100124, 22394753, 21662603, 20911890, 20149361, 19380832, 18612287, 17849833, 17099143, 16365557, 15654355, 14970340, 14317276, 13697853, 13113604, 12564628, 12050206, 11570417, 11126610, 10719531, 10347396, 10006739, 9695094, 9412085, 9157852, 8931210, 8729766, 8551450, 8395456, 8261627, 8149199, 8056432, 7981544, 7923690, 7882548, 7857111, 7845586, 7846713, 7860509, 7887174, 7925680, 7974000, 8030466, 8094249, 8164541, 8239765]
59235H239765P7968P8543P7492P5625P3718P2100P0612O8993O7167O5306O4104
59224I031393O5031O9682P8316Q9353J00738J11675J22784J34759J47286J59109
59214A0110126J68653J74461J75514J71475J62513J48743J30079J06817Q0156
59205A1428537N1740K2838n751l3039n7714p8859r6469j11009j22686j31205j35897
59194A0730486j36016j31431j23361j13900j04401r4765q4623p4450o4880n5658
59184I747001m6355l7660l0725k5402k0300j4565q458k070N207J3588K2559L2345
59172I635165M4604O0854Q0829J03171J27157J53091J81603K13230K48149K85587
59162A1133440L23831L61337L97432M31372M61066M83342M95189M94397M79457
$$ y = [8239765, 8317733, 8396276, 8473768, 8549393, 8623111, 8695211, 8765823, 8834816, 8901983, 8967289, 9031393, 9096424, 9166106, 9244422, 9333775, 9434513, 9546188, 9668972, 9803731, 9951017, 10110126, 10278779, 10453240, 10628754, 10800229, 10962742, 11111485, 11241564, 11348381, 11428537, 11480277, 11503115, 11497364, 11464325, 11406611, 11327752, 11231283, 11120274, 10997588, 10866383, 10730486, 10594470, 10463039, 10339678, 10225778, 10121377, 10026612, 9941989, 9867539, 9802659, 9747001, 9700646, 9662986, 9632261, 9606859, 9586559, 9571994, 9563536, 9561466, 9566673, 9580261, 9602820, 9635165, 9679769, 9740623, 9821452, 9924623, 10051780, 10204871, 10386474, 10599704, 10847853, 11133440, 11457271, 11818608, 12216040, 12647412, 13108478, 13591820, 14087009, 14581406, 15060863]
59153A5060863M49445M03898L42692K66650J78541Q2774j6402j15860k12486l02135
59143A6137980l80748m46037m97439n35055n59584n72772n76733n72800n61787
59134A1435025n45040n24403n01239m76332m50481m24350l97853l70774l44009
59125G400544l19172k96648k74974k52650k29952k08429j89094j71728j55524
59116E302373j39914j24821j10664r8177q7788p8938p0239o0645n0423m0733l2203
59105D407828k4314j6340q505j720L658Q381J3769K0840K9608L8764M6452N1969
59093D570390N6481O1388O6566P1186P5647Q1088Q7148R2066R5398R8697J02635
59082E458690J05339J05026J02859J01224J00114R7157R0999Q2801P4316O5971
$$ y = [15060863, 15510308, 15914206, 16256898, 16523548, 16702089, 16784863, 16768461, 16652601, 16440115, 16137980, 15757232, 15311195, 14813756, 14278701, 13719117, 13146345, 12569612, 11996812, 11435025, 10889985, 10365582, 9864343, 9388011, 8937530, 8513180, 8115327, 7744553, 7400544, 7081372, 6784724, 6509750, 6257100, 6027148, 5818719, 5629625, 5457897, 5302373, 5162459, 5037638, 4926974, 4828797, 4741009, 4662071, 4591832, 4531187, 4480764, 4440031, 4407828, 4383514, 4367174, 4358669, 4356949, 4360607, 4368988, 4382757, 4403597, 4433205, 4471969, 4518421, 4570390, 4626871, 4688259, 4754825, 4826011, 4901658, 4982746, 5069894, 5161960, 5257358, 5356055, 5458690, 5564029, 5669055, 5771914, 5873138, 5973252, 6070409, 6161408, 6244209, 6318525, 6384496]
59072F384496N7429M8990M1590L5873L1633K8182K5261K3610K4232K7042L0815
59061F759153L4859L9950M7148N6375O6889P8537R1589J05898J20996J36668J52748
59050G690810J68922J85437K03280K22614K41692K58483K72810K85578K96231
59041I825857L02419L01948K93709K76801K50460K15330J73610J27380P7663K5554
59031A1870731k6655p6076j20426j58433j89894k15752k37590k56377k71918k83625
59021A0033985k91547k96483k99433l00999l01143k99534k96225k91642k85874
59012G371105k78577k70066k61582k53665k44970k33976k21494k10147k01296
59003E195332j93594j84852j74322j62980j52331j43258j35373j27382j18582
$$ y = [6384496, 6441925, 6490915, 6532505, 6568378, 6600011, 6628193, 6653454, 6677064, 6701296, 6728338, 6759153, 6794012, 6833962, 6881110, 6937485, 7004374, 7082911, 7174500, 7280398, 7401394, 7538062, 7690810, 7859732, 8045169, 8248449, 8471063, 8712755, 8971238, 9244048, 9529626, 9825857, 10128276, 10430224, 10723933, 11000734, 11251194, 11466524, 11640134, 11767514, 11845177, 11870731, 11844076, 11768000, 11647574, 11489141, 11299247, 11083495, 10845905, 10589528, 10317610, 10033985, 9742438, 9445955, 9146522, 8845523, 8544380, 8244846, 7948621, 7656979, 7371105, 7092528, 6822462, 6560880, 6307215, 6062245, 5828269, 5606775, 5396628, 5195332, 5001738, 4816886, 4642564, 4479584, 4327253, 4183995, 4048622, 3921240, 3802658]
58994C802658j09867j02586r6734r1205q5542q0252p5488p0740o6031o2035n8745
58983B903433n5372n2030n0098n0009m9934m7898m4231m0634l7578l4186l0402
58972B411061k7497k6076k4842k2286j8703j5541j3218j0666p256m090k718k921
58960B235247k676l36L547O704P148M822J659K8O78K264L154L279L563M079M097
58945B277257L753M082N092N445M774M679O359Q624R647R582R824J0662J1253
58932B371033J1393J1590J1879J2000J2516J4176J6468J8203J9273K0482K1961
58921B540974K3298K4881K7407L0069L1116L0393K9744L0515L2271L4263L6528
58910B871459L8924M0707M1773M3080M5052M6796M7636M8322M9832N1931N3774
$$ y = [3802658, 3692791, 3590205, 3493471, 3402266, 3316724, 3236472, 3160984, 3090244, 3024213, 2962178, 2903433, 2848061, 2796031, 2745933, 2695924, 2645990, 2598092, 2553861, 2513227, 2475649, 2441463, 2411061, 2383564, 2357488, 2332646, 2310360, 2291657, 2276116, 2262898, 2252232, 2244976, 2240886, 2238168, 2235247, 2232571, 2232235, 2235782, 2242486, 2249634, 2254456, 2256115, 2256143, 2256821, 2259085, 2262239, 2265518, 2269081, 2273160, 2277257, 2281010, 2285092, 2290184, 2295629, 2300403, 2305082, 2311441, 2320065, 2329712, 2339294, 2349118, 2359780, 2371033, 2382426, 2394016, 2405895, 2417895, 2430411, 2444587, 2461055, 2479258, 2498531, 2519013, 2540974, 2564272, 2589153, 2616560, 2646629, 2677745, 2708138, 2737882, 2768397, 2800668, 2834931, 2871459, 2910383, 2951090, 2992863, 3035943, 3080995, 3127791, 3175427, 3223749, 3273581, 3325512, 3379286]
58899C379286N5230N6844N8940O1482O4412O7672P1238P5234P9734Q4471Q9280
58888D143823R4624J00863J07306J12977J18286J24787J33232J42874J52813J62967
58878E394552J73586J84838J96981K10026K23326K36506K50621K67152K86026
58869G423614L05967L26592L48532L71852L96208M22572M52549M85733N20082
58860A1053701N55450N94304O37922O84305P31328P79650Q30610Q82975R33900
58851A7684145R81710J025638J063659J092580J109430J111098J093293J051829
58843B6213382R84890Q92839P76602O37913M80813L11317J35692l9978k09179
58834C0184291l65892n06300o28624p31389q13211q74232r16475r42451r54203
$$ y = [3379286, 3434516, 3491360, 3550300, 3611782, 3676194, 3743866, 3815104, 3890338, 3970072, 4054543, 4143823, 4238447, 4339310, 4446616, 4559593, 4677879, 4802666, 4935898, 5078772, 5231585, 5394552, 5568138, 5752976, 5949957, 6159983, 6383309, 6619815, 6870436, 7137588, 7423614, 7729581, 8056173, 8404705, 8776557, 9172765, 9595337, 10047886, 10533619, 11053701, 11609151, 12203455, 12841377, 13525682, 14257010, 15036660, 15867270, 16750245, 17684145, 18665855, 19691493, 20755152, 21847732, 22957162, 24068260, 25161553, 26213382, 27198272, 28091111, 28867713, 29505626, 29986439, 30297756, 30433448, 30393470, 30184291, 29818399, 29312099, 28683475, 27952086, 27138875, 26264643, 25348168, 24405717, 23451514]
58825B3451514r53784r43642r26015r02386q73694q40724q04375p65841p26502
58816A5714551o87478o49441o12984n78568n45855n13845m82076m51241m22167
58807A0770896l94853l68865l43996l20084k96910k74684k53940k34556k15738
58798H067270j97385j80432j65334j51295j37598j24469j11893r8948q5347p2299
58788F742270o0599m9114l6553k3530j1218R55J4296K8351M1442N3314O5238P7758
58776F842610R0404J03585J18678J35670J52561J67910J82644J98620K16486K35693
58766H444861K55644K76060K96917L18802L42860L69803L99182M30013M61992
58757A1596134M95943N33122N74032O17847O63297P10280P59939Q12609Q66282
$$ y = [23451514, 22497730, 21554088, 20628073, 19725687, 18851993, 18011269, 17206894, 16441053, 15714551, 15027073, 14377632, 13764648, 13186080, 12640225, 12126380, 11644304, 11193063, 10770896, 10376043, 10007178, 9663182, 9343098, 9046188, 8771504, 8517564, 8283008, 8067270, 7869885, 7689453, 7524119, 7372824, 7235226, 7110757, 6998864, 6899916, 6814569, 6742270, 6681671, 6632557, 6596004, 6572474, 6561256, 6562211, 6576507, 6604858, 6646300, 6699614, 6764852, 6842610, 6933014, 7036599, 7155277, 7290947, 7443508, 7611418, 7794062, 7992682, 8209168, 8444861, 8700505, 8976565, 9273482, 9592284, 9935144, 10304947, 10704129, 11134142, 11596134, 12092077, 12625199, 13199231, 13817078, 14480375, 15190655, 15950594, 16763203, 17629485]
58748A7629485R17827R65063J006522J039456J059567J062928J047215J010588
58740B5738651R50393Q63973P50880O14108M59224K92406J19256n4819k23783
58731B9510289l81444n22977o45622p48088q30134q92788r37873r66773r80448
58722B2604142r80984r71863r56016r34625r08378q78581q46021q10220p71338
58713A4546116p31811o94391o59254o24538n89086n53172n17321m82317m49872
58704I244354m21238l95224l69573l44236l21306l01566k83330k65209k47857
58695F294815k32019k16770k01232j86452j73940j63209j52454j41084j30155
58686D697500j20511j11908j04012r7073r1128q5366p8839p1568o4548n8838n4819
$$ y = [17629485, 18547312, 19512375, 20518897, 21558353, 22617920, 23680848, 24728063, 25738651, 26689044, 27553017, 28303897, 28918005, 29377229, 29669635, 29788891, 29734072, 29510289, 29128845, 28605868, 27960246, 27212158, 26382024, 25489236, 24551363, 23584590, 22604142, 21623158, 20651295, 19695279, 18760654, 17852276, 16973695, 16127674, 15317454, 14546116, 13814305, 13119914, 12460660, 11836122, 11247036, 10693864, 10176543, 9694226, 9244354, 8823116, 8427892, 8058319, 7714083, 7392777, 7091211, 6807881, 6542672, 6294815, 6062796, 5846026, 5644794, 5458342, 5284402, 5121193, 4968739, 4827655, 4697500, 4576989, 4465081, 4361069, 4263996, 4172868, 4087502, 4008663, 3937095, 3872547, 3813709, 3758890]
58675C758890n2175n0263m8403m6093m3222m0220l7821l6555l6484l7316l8670
58664C291668m0227m1877m3650m5358m6537m7072m7778m9660n2587n5271n6618
58653B765033n6682n6184n5710n5318n4444n2275m8966m6165m5299m5454m4365
58642B204171m1481l8570l6921l5655l3661l1638l1002l1847l3027l3390l2259
58631A824720k9737k7273k6545k6977k5858k2079j8090j6563j6644j5468j2291
58620A587195q863o410m469k403l50J326K224J825M58l77N2L14j063l136m024
58605A562299l976m594n720n710m575m187n094n657m925m097m181m236l083j131
58591A501133O16K195M276O955R772J2288J4302J6079J8440K1826K5377K7941
$$ y = [3758890, 3706715, 3656452, 3608049, 3561956, 3518734, 3478514, 3440693, 3404138, 3367654, 3330338, 3291668, 3251441, 3209564, 3165914, 3120556, 3074019, 3026947, 2979169, 2929509, 2876922, 2821651, 2765033, 2708351, 2652167, 2596457, 2541139, 2486695, 2434420, 2385454, 2339289, 2293990, 2248536, 2204171, 2162690, 2124120, 2087199, 2051544, 2017883, 1986245, 1955243, 1923396, 1890369, 1856979, 1824720, 1794983, 1767710, 1741165, 1714188, 1688330, 1666251, 1648161, 1631598, 1614954, 1599486, 1587195, 1578332, 1571922, 1567453, 1565050, 1564700, 1566026, 1568250, 1570075, 1570533, 1570156, 1570208, 1570522, 1569459, 1566323, 1562299, 1558323, 1553729, 1548009, 1542299, 1537724, 1533537, 1528443, 1522786, 1517861, 1513764, 1509583, 1505347, 1502264, 1501133, 1501749, 1503944, 1508220, 1515175, 1524947, 1537235, 1551537, 1567616, 1586056, 1607882, 1633259, 1661200]
58579A661200K9756L1974L4729L7230L9695M3495M8945N4403N8203O0471O2656
58568B162757O6204P1803P8939Q6127R2529R9244J07881J18220J28699J39012
58558C151415J50640J64747J81125J99142K18084K36528K53210K68664K84226
58549E107781K99143L10521L16312L16265L09422K93070K65445K27645J81877
58540G627481J29580P2663J4895l9731q9229j33030j70165j99360k20392k34249
58530F758463k42303k45862k45987k43182k37684k30125k21156k10519j97673
58521D683972j83523j70123j58352j47238j35948j24952j14815j05363r6714q9644
58511C357300q4137p9027p3832o9537o6594o3762n9988n6077n3160n0781m7994
$$ y = [1661200, 1690956, 1722930, 1757659, 1794889, 1834584, 1878079, 1927024, 1981427, 2039630, 2100101, 2162757, 2228961, 2300764, 2379703, 2465830, 2558359, 2657603, 2765484, 2883704, 3012403, 3151415, 3302055, 3466802, 3647927, 3847069, 4065153, 4301681, 4554891, 4823555, 5107781, 5406924, 5717445, 6033757, 6350022, 6659444, 6952514, 7217959, 7445604, 7627481, 7757061, 7829724, 7844619, 7804888, 7715659, 7582629, 7412464, 7213104, 6992712, 6758463, 6516160, 6270298, 6024311, 5781129, 5543445, 5313320, 5092164, 4881645, 4683972, 4500449, 4330326, 4171974, 4024736, 3888788, 3763836, 3649021, 3543658, 3446944, 3357300, 3273163, 3194136, 3120304, 3050767, 2984173, 2920411, 2860423, 2804346, 2751186, 2700405, 2652411]
58500B652411m5365m4302m5023m6426m7654m8597m9217m9308m8817m7846m6642
58489B133214m5741m5518m5227m3459l9995l6417l4295l3561l3122l2155l0324
58478A713400k7751k5408k4583k5232k5754k4993k3454k1979k0386j8361j6637
58467A458862j6068j6204j5925j5135j4723j5067j5407j4782j3067j1124j0096
58456A301264j0430j1576j2725j3545j3850j3168j1456r711q819q217o935n530
58444A175302n410o396o697n426l486j802l45P50Q26k5q01j169j773k662k969
58429A137917k563k374k684k807k793l544m754m880l885l768n261o286n171l413
58415A083734l359m701n326m472l209k463k221k282k524k628k421k108j806j469
$$ y = [2652411, 2607046, 2562744, 2517721, 2471295, 2423641, 2375044, 2325827, 2276519, 2227702, 2179856, 2133214, 2087473, 2041955, 1996728, 1953269, 1913274, 1876857, 1842562, 1809001, 1775879, 1743724, 1713400, 1685649, 1660241, 1635658, 1610426, 1584672, 1559679, 1536225, 1514246, 1493860, 1475499, 1458862, 1442794, 1426590, 1410665, 1395530, 1380807, 1365740, 1350333, 1335551, 1322484, 1311360, 1301264, 1290834, 1279258, 1266533, 1252988, 1239138, 1225970, 1214514, 1204803, 1195984, 1187767, 1180832, 1175302, 1169892, 1163496, 1156799, 1151373, 1147887, 1146085, 1145740, 1146490, 1147316, 1147291, 1146490, 1145321, 1143548, 1140886, 1137917, 1135354, 1132980, 1130296, 1127489, 1124696, 1121152, 1116398, 1111518, 1107633, 1103865, 1098604, 1092318, 1087147, 1083734, 1080375, 1075674, 1070348, 1065876, 1062667, 1060204, 1057983, 1055701, 1053177, 1050549, 1048128, 1046020, 1044214, 1042745]
58401A042745j548k648m212m642l275j088Q68K505L741M021L358K564J975J247
58387A045611O95J161K250K407J288J44n38j774l859n453n751n505n142l977k141
58372A019416j107j335j634j665k547l990l749j397J98q96k609k275o58q9o46
58357I95017p91k30M01J368L183N174O545P673Q831R068P957O729O245N719N083
58342A067972O218R677J2457J1646Q529O440O186O264O072O037N676M265K749
58329A160188K629L597M183L928L240K183J053Q66J772K394K237K826M760N949
58315A201805M895L523M246O400Q123R587J1414J2028R964P292P264R723J1878
58302A308142J2439J1975J0438P563M872M218N037N628O111P493Q974R066Q328
$$ y = [1042745, 1041197, 1038549, 1034337, 1029695, 1026420, 1025332, 1026200, 1028705, 1032446, 1036467, 1039825, 1042389, 1044364, 1045611, 1046306, 1047467, 1049717, 1052124, 1053412, 1053556, 1053018, 1051244, 1047385, 1041932, 1036181, 1030676, 1025534, 1021557, 1019416, 1018309, 1016974, 1015340, 1013675, 1011128, 1007138, 1003389, 1001992, 1002190, 1001294, 998685, 996410, 995752, 995663, 995017, 994226, 993996, 994397, 995765, 998948, 1004122, 1010667, 1018340, 1027171, 1036239, 1044196, 1050925, 1057170, 1062889, 1067972, 1074190, 1083867, 1096324, 1107970, 1116499, 1122939, 1129125, 1135389, 1141461, 1147498, 1153174, 1157439, 1160188, 1162817, 1166414, 1170597, 1174525, 1177765, 1179948, 1181001, 1181867, 1183639, 1186033, 1188270, 1191096, 1195856, 1201805, 1206700, 1210223, 1214469, 1220869, 1228992, 1238579, 1249993, 1262021, 1271985, 1279277, 1286541, 1296264, 1308142, 1320581, 1332556, 1342994, 1350557, 1355429, 1359647, 1364684, 1370312, 1376423, 1383916, 1392890, 1401956, 1410284]
58289A410284Q176Q160P065N545M901M622L990M504P509J0903J1750J0866J1236
58276A509511J3000J3803J3372J3825J5667J6982J6720J5812J5150J4944J5645
58265A674431J7105J7689J6620J6054J8181K1652K3644K3985K4219K4270K3389
58254A901239K2850K4157K5896K5854K4836K4942K5688K5605K5912K8487L1700
58243B187166L2594L1791L1984L2973L2874L2750L5118L8827M0481M0143M0740
58232B577441M2500M3108M2929M4632M7740M8762M7138M6307M8294N1528N4424
58221C094803N7099N9354O0766O2625O6224O9865P1388P2350P5541P9721Q1680
58210C851416Q2193Q4712Q9177R2547R4582R7765J02143J05756J09437J15719
$$ y = [1410284, 1418460, 1426620, 1433685, 1439230, 1444131, 1448753, 1452743, 1457247, 1464756, 1475659, 1487409, 1498275, 1509511, 1522511, 1536314, 1549686, 1563511, 1579178, 1596160, 1612880, 1628692, 1643842, 1658786, 1674431, 1691536, 1709225, 1725845, 1741899, 1760080, 1781732, 1805376, 1829361, 1853580, 1877850, 1901239, 1924089, 1948246, 1974142, 1999996, 2024832, 2049774, 2075462, 2101067, 2126979, 2155466, 2187166, 2219760, 2251551, 2283535, 2316508, 2349382, 2382132, 2417250, 2456077, 2496558, 2536701, 2577441, 2619941, 2663049, 2705978, 2750610, 2798350, 2847112, 2894250, 2940557, 2988851, 3040379, 3094803, 3151902, 3211256, 3272022, 3334647, 3400871, 3470736, 3542124, 3614474, 3690015, 3769736, 3851416, 3933609, 4018321, 4107498, 4200045, 4294627, 4392392, 4494535, 4600291, 4709728, 4825447]
58200D825447J23687J30364J36390J44807J55148J64432J73031J83683J95968
58191F232957K07753K20574K37107K54784K68901K80577K94424L09875L22698
58182H629650L33816L48383L66974L85823M05119M28728M56352M84254N12901
58173A2352000N45672N81336O16644O54705P01366P54969Q09605Q66275R29945
58164A8812517R97803J062695J126703J198975J281673J371015J470191J586639
58156B8908211J717334J851370J986158K126554K271082K416747K575616K767444
58148D6620516K996932L257794L556895L911677M325868M793766N328755N961025
58140H0753228O709148P586143Q633854R915135J1469589J3314068J5480693J7995792
$$ y = [4825447, 4949134, 5079498, 5215888, 5360695, 5515843, 5680275, 5853306, 6036989, 6232957, 6440710, 6661284, 6898391, 7153175, 7422076, 7702653, 7997077, 8306952, 8629650, 8963466, 9311849, 9678823, 10064646, 10469765, 10898493, 11354845, 11839099, 12352000, 12897672, 13479008, 14095652, 14750357, 15451723, 16206692, 17016297, 17882572, 18812517, 19810320, 20873015, 21999718, 23198693, 24480366, 25851381, 27321572, 28908211, 30625545, 32476915, 34463073, 36589627, 38860709, 41277456, 43853072, 46620516, 49617448, 52875242, 56432137, 60343814, 64669682, 69463448, 74792203, 80753228, 87462376, 95048519, 103682373, 113597508, 125067097, 138381165, 153861858, 171857650]
58132A71857650K0815759K3856087K7097798L0544009L3945009L6568385L7311847
58125C81996544L5098178K9292708K0032246Q419963l637858j4113591k1707520
58118D35380670k6208088k8153880k8265383k7160424k5357216k3287877k1244559
58111B55703243j9373778j7735353j6333253j5112269j3989528j2906862j1833791
58104A48418409j0735884r575985q340379p040781n712404m444673l390417k691188
58096I6486698k387776k427801k738217l240027l804217m265976m518855m568870
58088F8534959m482717m314113m093737l851405l611560l378405l146913k920432
58080C8735677k704722k496722k293012k100259j926097j768315j622494j491297
$$ y = [171857650, 192673409, 216529496, 243627294, 274171303, 308116312, 344684697, 381996544, 417094722, 446387430, 466419676, 474839639, 471201781, 457088190, 435380670, 409172582, 381018702, 352753319, 325592895, 300235679, 276947802, 255703243, 236329465, 218594112, 202260859, 187148590, 173159062, 160252200, 148418409, 137682525, 128106540, 119766161, 112725380, 107012976, 102568303, 99177886, 96486698, 94098922, 91671121, 88932904, 85692877, 81888660, 77622684, 73103829, 68534959, 64052242, 59738129, 55644392, 51792987, 48181427, 44803022, 41656109, 38735677, 36030955, 33534233, 31241221, 29140962, 27214865, 25446550, 23824056, 22332759]
58072B2332759j377359j275295j179258j090905j012471r39462q67332p98498
58064A3792179p36288o78459o22516n70965n25856m84407m45157m12113l87813
58055H928605l68452l50525l36126l26959l19080l08591k97104k86957k76227
58046F058584k62995k49659k38711k28622k17667k07449j99369j91761j83516
58037D078835j76039j69148j59867j47807j36670j27930j18475j07141r7818r2820
58027B745120q8805q2981p7820p5773p4403p1071o7664o6359o4994o1035n6374
58016A957841n3883n2602n0237m7257m4864m2005l7890l4533l3461l2691l0010
58005A498408k6455k3822k1744j9775j9142j9712j8655j4953j1991j2702j5410
$$ y = [22332759, 20955400, 19680105, 18500847, 17409942, 16397471, 15458009, 14590677, 13792179, 13055891, 12377432, 11754916, 11183951, 10658095, 10173688, 9728531, 9316418, 8928605, 8560153, 8209628, 7873502, 7546543, 7227463, 6918872, 6621768, 6334811, 6058584, 5795589, 5545930, 5307219, 5078597, 4860930, 4653481, 4454112, 4262351, 4078835, 3902796, 3733648, 3573781, 3425974, 3289304, 3161374, 3042899, 2935758, 2837940, 2745120, 2656315, 2573334, 2495514, 2419741, 2345338, 2274267, 2206603, 2140244, 2075250, 2014215, 1957841, 1903958, 1851356, 1801119, 1753862, 1708998, 1666993, 1629103, 1594570, 1561109, 1528418, 1498408, 1471953, 1448131, 1426387, 1406612, 1387470, 1367758, 1349103, 1334150, 1322159, 1309457, 1294047]
57994A294047j7259j8374j9509j9017j5733j2009j0476j0321r715r189r600r588
57982A133257q124o988p617q183o886n330n493o035n042l751l992m350k630j05
57968A058731L53j357l349n113o846p320n830m557n549o937n764l088k602n088
57954I95684p802q722q225p165o286p054j0095j3224j3569j1298q916p531o258
57941H79539m793l870l397k468j124k66J9L80Q96J254J728K482K755K098J401
57926H76634J287P67q59k174j790r74j884m072n056l908k031q26m14m67p61j049
57910H52423j466k470l670l863l132l276m912o034n120l762m081n286n346m547
57896G95458m575n229m951l999m181n669o715o526o079n901n209l528j395P08
$$ y = [1294047, 1276788, 1258414, 1238905, 1219888, 1204155, 1192146, 1181670, 1171349, 1161634, 1152445, 1142845, 1133257, 1125133, 1118145, 1110528, 1102345, 1095459, 1090129, 1084636, 1078601, 1073559, 1069808, 1065816, 1061466, 1058836, 1058731, 1059084, 1057727, 1054378, 1049265, 1042419, 1035099, 1029269, 1024712, 1019163, 1012226, 1006462, 1003374, 1000772, 995684, 987882, 979160, 970935, 963770, 957484, 950430, 940335, 927111, 913542, 902244, 893328, 885797, 879539, 874746, 870876, 867479, 865011, 863887, 863621, 863640, 864020, 864916, 866170, 867898, 870380, 873135, 875233, 876634, 877921, 878688, 877829, 875655, 873865, 872891, 871007, 866935, 861879, 857971, 855940, 855114, 854700, 854233, 853472, 852423, 850957, 848487, 844817, 840954, 837822, 834546, 829634, 823600, 818480, 814718, 810637, 805351, 800005, 795458, 790883, 785654, 780703, 776704, 772523, 766854, 760139, 753613, 747534, 741633, 736424, 732896, 731501, 732209]
57882G32209K645L863L878L417L683M528M620L329J254p23j925j995j665k660
57868G54458n535q406r200q418q118q901r614r455q714p690o324m696k924j026
57854F55437M08M73k83K18K636M961N637N940P251Q004O389M173M347O040N621
57839G17252K468k33o16k66m66j4J725K682J055j907m002n127o417p772q126p260
57823F82976n847m404l325l224m111m914m792m308m395m708m031k016K66J566
57809F34733J682J455J755K515K907K635K681M108O417P856P446N981M852M562
57795F91585M610M287L275J715l4j737l301m585n537o528p988r514j0143r781
57781F46324r563j0217j0996j0858r895q737p398n760m446m107m381m574m783
$$ y = [732209, 734854, 738717, 742595, 746012, 749695, 754223, 758843, 762172, 763426, 762703, 760778, 758783, 757118, 754458, 748923, 740517, 731317, 722899, 714781, 705880, 696266, 686811, 678097, 670407, 664083, 659387, 656463, 655437, 655845, 656318, 656035, 656253, 658889, 663850, 669487, 675427, 682678, 690682, 697071, 701244, 705591, 711631, 717252, 719720, 719487, 718871, 718605, 718139, 718125, 719850, 722532, 723587, 721680, 717678, 712551, 706134, 698362, 690236, 682976, 677129, 672725, 669400, 666176, 662065, 657151, 652359, 648051, 643656, 638948, 634917, 632901, 633167, 634733, 636415, 637870, 639625, 642140, 645047, 647682, 650363, 654471, 660888, 668744, 676190, 682171, 687023, 691585, 696195, 700482, 703757, 705472, 705438, 703701, 700400, 695815, 690278, 683750, 675762, 666248, 656105, 646324, 636761, 626544, 615548, 604690, 594795, 586058, 578660, 572900, 568454, 564347, 559966, 555392, 550609]
57768E50609n386n975o037o167p297q993r705q759p032n728n292n529o044o555
57754D56110p150p978q511p762n721l721k848k895l282l831l896k289P95L122
57740D00143L098J837J174J057O17L07R23J562J024K78J100K950L792L577M211
57725D27650O103P463P334O786O604O126N081M377M274L662K052N11j62o15j500
57710D85746k462l251m366n849o829o913o629n972m134j420L02O2q29q91m63m10
57694D35692k75P02J762J559M70N74L115O967R695R822Q104O725P061Q293Q676
57679E08942P810O745O149N562M699M183M605N771P251Q714R570R326Q696R192
57665F07215J1187J3344J4280J3870J2760J1758J2026J4444J8154K0947K1697
$$ y = [550609, 545223, 539248, 533211, 527044, 519747, 510754, 501049, 492290, 485258, 479530, 474238, 468709, 462665, 456110, 448960, 440982, 432471, 424709, 418988, 415267, 412419, 409524, 406242, 402411, 398515, 396226, 397021, 400143, 403241, 405078, 406252, 407309, 407926, 408233, 409156, 410718, 411742, 412020, 413120, 416070, 419862, 423439, 427650, 433753, 441216, 448550, 455336, 461940, 468066, 473147, 477524, 481798, 485460, 487512, 488023, 487861, 487246, 485746, 483284, 480033, 475667, 469818, 462989, 456076, 449447, 443475, 439341, 437921, 438223, 438285, 437456, 436565, 436102, 435692, 435417, 436119, 437881, 439440, 439910, 440484, 443599, 450566, 460261, 470083, 478187, 484912, 491973, 500266, 508942, 516752, 523497, 529646, 535208, 539907, 544090, 548695, 554466, 561717, 570431, 580001, 589327, 598023, 607215, 618402, 631746, 646026, 659896, 672656, 684414, 696440, 710884, 729038, 749985, 771682]
57654G71682K1355K1113K0954K0753K1356K3433K6129K8048K8892K9451L0626
57643A043792L3031L6796M1021M4288M6389M8709N2294N6443O0028O3206O6962
57632A592959P1711P7356Q4054R1974J00822J10319J20752J32422J45102J58570
57622B686041J72989J88318K04085K20215K37054K54075K69592K82269K91647
57613D806285K96343K93509K81486K61620K35627K02360J59515J07923N1698n764
57603F690602o3335j19075j68049k05020k28327k39997k43004k39777k32595k23743
57593D727680k14712k05794j96532j86227j74293j60863j47049j33990j21531
57584C186689j08615r5227q3051p3407o5198n6003m5022l3764k3750j4821o179
$$ y = [771682, 793037, 814150, 835104, 855857, 877213, 900646, 926775, 954823, 983715, 1013166, 1043792, 1076823, 1113619, 1154640, 1198928, 1245317, 1294026, 1346320, 1402763, 1462791, 1525997, 1592959, 1664670, 1742026, 1826080, 1918054, 2018876, 2129195, 2249947, 2382369, 2527471, 2686041, 2859030, 3047348, 3251433, 3471648, 3708702, 3962777, 4232369, 4514638, 4806285, 5102628, 5396137, 5677623, 5939243, 6174870, 6377230, 6536745, 6644668, 6696366, 6690602, 6627267, 6508192, 6340143, 6135123, 5906796, 5666799, 5423795, 5184018, 4951423, 4727680, 4512968, 4307174, 4110642, 3924415, 3750122, 3589259, 3442210, 3308220, 3186689, 3078074, 2982847, 2899796, 2826389, 2761191, 2705188, 2660166, 2626402, 2602652, 2587831, 2581652]
57573B581652K243J0413J9137K9048L9325M8765N7721O7605P8754R0240J01719
57562C126622J14042J27687J41868J55620J68675J80896J91703K00320K05716
57553D613149K06149J99873J86523J66736J40373J06640O6435K3189j9367n9030
57543E630670r4336j23765j47055j65929j81946j94356k01460k03299k01619j97693
57533C919212j91767j84399j76831j69844j63241j56613j49784j42420j34147
57524B450166j25198j16263j07565r8685q9503q0751p3459o8152o4565o1720n8280
57513A506025n3371m7289m1240l6327l2901l0695k9214k7890k6178k3737k0585
57502A136598j7039j3525j0435q153p012o843o561m699q67L689P323R595J1205
$$ y = [2581652, 2583895, 2594308, 2613445, 2642493, 2681818, 2730583, 2788304, 2855909, 2934663, 3024903, 3126622, 3240664, 3368351, 3510219, 3665839, 3834514, 4015410, 4207113, 4407433, 4613149, 4819298, 5019171, 5205694, 5372430, 5512803, 5619443, 5685878, 5709067, 5689700, 5630670, 5536334, 5412569, 5265514, 5099585, 4917639, 4723283, 4521823, 4318524, 4116905, 3919212, 3727445, 3543046, 3366215, 3196371, 3033130, 2876517, 2726733, 2584313, 2450166, 2324968, 2208705, 2101140, 2002455, 1912952, 1832201, 1758742, 1690590, 1626025, 1564305, 1506025, 1452654, 1405365, 1364125, 1327798, 1294897, 1264202, 1234988, 1207098, 1180920, 1157183, 1136598, 1119559, 1106034, 1095599, 1087446, 1080434, 1073591, 1067030, 1062331, 1061464, 1065153, 1072476, 1082071, 1093276]
57489A093276J2905J5039J7782K1024K4207K6946K9537L2219L4475L6003L7921
57478A381334M1697M7105N2479N6930O1003O5329P0086P5796Q3120R1541R9848
57467B126268J08142J17705J28405J38131J45666J52374J59688J66224J68835
57458C411438J65643J56923J43629J26163J04197P7188M5660J2272j9482m7903
57448D175728p3240r5102j11677j22401j29360j34648j37934j38173j36044j32823
57438B964326j28203j21444j13720j07086j01684r5965q9244q2045p4332o5537
57428A985066n6359m8573m2701l7400l1430k4825j7991j1050m342J578O777J1875
57416A730625J7112K2510K8698L6376M4951N3003O0152O7281P4952Q2901R1182
$$ y = [1093276, 1106181, 1121220, 1139002, 1160026, 1184233, 1211179, 1240716, 1272935, 1307410, 1343413, 1381334, 1423031, 1470136, 1522615, 1579545, 1640548, 1705877, 1775963, 1851759, 1934879, 2026420, 2126268, 2234410, 2352115, 2480520, 2618651, 2764317, 2916691, 3076379, 3242603, 3411438, 3577081, 3734004, 3877633, 4003796, 4107993, 4185181, 4230841, 4243113, 4223631, 4175728, 4102488, 4007386, 3895709, 3773308, 3643948, 3509300, 3371366, 3233193, 3097149, 2964326, 2836123, 2714679, 2600959, 2493873, 2392189, 2296224, 2206980, 2124935, 2050603, 1985066, 1928707, 1880134, 1837433, 1800033, 1768603, 1743778, 1725787, 1714737, 1710395, 1711973, 1718750, 1730625, 1747737, 1770247, 1798945, 1835321, 1880272, 1933275, 1993427, 2060708, 2135660, 2218561, 2309743]
57405B309743J00425J10568J20581J29843J38564J46385J51585J52291J47727
57396C507712J37855J22587J01983P6649M7532J5786j6868m8210p6311j00184
57386C768531j19752j35486j47843j56558j60784j60549j57678j54379j51096
57377B424406j46600j40112j32364j24643j17717j11735j06360j00846r4706q8318
57367A261005q2292p6484p0379o4174n8563n3645m9073m5041m2014l9579l6862
57356F42899l4013l2018l0860k9229k6453k3409k1055j9240j7651j6883j7695
57345C74393j9722k1620k1996k0011j5906j1349q589q534r999j1082j0758r101
57333B05726o819m974m386m749m857m113l190k854k920l007l549n098o976p666
$$ y = [2309743, 2410168, 2520736, 2641317, 2771160, 2909724, 3056109, 3207694, 3359985, 3507712, 3645567, 3768154, 3870137, 3946786, 3994318, 4010104, 3993236, 3945026, 3868715, 3768531, 3648779, 3513293, 3365450, 3208892, 3048108, 2887559, 2729881, 2575502, 2424406, 2277806, 2137694, 2005330, 1880687, 1762970, 1651235, 1544875, 1444029, 1349323, 1261005, 1178713, 1102229, 1031850, 967676, 909113, 855468, 806395, 761354, 719340, 679761, 642899, 608886, 576868, 546008, 516779, 490326, 466917, 445862, 426622, 408971, 392088, 374393, 354671, 333051, 311055, 291044, 275138, 263789, 255200, 246666, 236667, 225585, 214827, 205726, 198907, 193933, 189547, 184798, 179941, 175828, 172638, 169784, 166864, 163857, 160308, 155210, 148234, 140568]
57319A40568o620m982m267m710n355n426n132m933m651l912l211l577n038o293
57305G2461o380n753n072l921j766N24J464R03M0k82j66K04P40Q30j34j539j961
57288E0192j059O2M77L28r8q90j688j493N5K058L500M160M109L283K156J977L576
57271G0705O406R207J1122J1913J1719J1102J0761J0901J1210J1518J1825J1682
57259B00071J0421Q208O028M412L078K161K605M741P292Q625Q560Q303Q923J0286
57245B93714J1332J1249J0608J1112J3647J6788J8236J7636J6799J7132J8130
57234D56383J8776J9044J9345J9718K0358K1931K4355K6218K6362K5365K4506
57223G02361K4011K3369K2719K2620K2671K1695J9445J7185J6244J6575J7127
$$ y = [140568, 133948, 128966, 124699, 119989, 114634, 109208, 104076, 99143, 94492, 90580, 87369, 83792, 78754, 72461, 66081, 60328, 55256, 51335, 49569, 50093, 51557, 52460, 52500, 52218, 52052, 52256, 52996, 53826, 53692, 52153, 50192, 49133, 49195, 49672, 50000, 49902, 49012, 47324, 45831, 45886, 47944, 51444, 55604, 59713, 62996, 65152, 67129, 70705, 77111, 86318, 97440, 109353, 121072, 132174, 142935, 153836, 165046, 176564, 188389, 200071, 210492, 218700, 224728, 229140, 232218, 234379, 236984, 241725, 249017, 257642, 266202, 274505, 283428, 293714, 305046, 316295, 326903, 338015, 351662, 368450, 386686, 404322, 421121, 438253, 456383, 475159, 494203, 513548, 533266, 553624, 575555, 599910, 626128, 652490, 677855, 702361, 726372, 749741, 772460, 795080, 817751, 839446, 858891, 876076, 892320, 908895, 926022]
57212I26022J7146J6690J6010J4798J2435Q887M912J125k698o881j0774j3232
57200I84440j4032j4097j4286j4723j5255j5847j6478j7279j8723k0812k2166
57189H00742k1058j7530j3497j0464q154n767l489k064j573j325n72R39K760M007
57175G22955M333M620N991Q259J0142J0964J1282J1916J3291J5563J8266K0018
57163H57600J9859J8787J8573J9251J9408J8903J9268K1047K2835K3578K3982
57152A083091K4820K5757K6760K8736L1614L3734L4567L6238M0589M6220N0191
57141A462317N1627N1918N2388N3328N4600N5660N5614N4383N3000N1933N0300
57130B047068M7803M5904M5596M5583M4368M2692M1909M1291L9189L5749L2181
$$ y = [926022, 943168, 959858, 975868, 990666, 1003101, 1011988, 1016900, 1018025, 1015327, 1008446, 997672, 984440, 970408, 956311, 942025, 927302, 912047, 896200, 879722, 862443, 843720, 822908, 800742, 779684, 762154, 748657, 738193, 730039, 724272, 720783, 718719, 717146, 715821, 715249, 716188, 718948, 722955, 727288, 731908, 737899, 746158, 756300, 767264, 778546, 790462, 803753, 819316, 837582, 857600, 877459, 896246, 914819, 934070, 953478, 972381, 991649, 1012696, 1035531, 1059109, 1083091, 1107911, 1133668, 1160428, 1189164, 1220778, 1254512, 1289079, 1325317, 1365906, 1412126, 1462317, 1513944, 1565862, 1618250, 1671578, 1726178, 1781838, 1837452, 1891835, 1944835, 1996768, 2047068, 2094871, 2140775, 2186371, 2231954, 2276322, 2319014, 2360923, 2402214, 2441403, 2477152, 2509333]
57119B509333K8315K3493J9241J8014J9298J9659J7278J4178J3270J5116J8295
57108B715490K1354K3599K5171K6860K8987L0364K9555K7111K5088K4247K3216
57097C001042K0828J7702J4842J2034Q731N678M530N929Q466R729Q293M705L31
57084C122840m534j0793j8912k8295l8652n0640o4364p8476r1807j04760j17985
57073B513622j30949j43239j56227j71763j89883k09334k29619k51235k74561
57064G56812l00030A28132b33030l97702m39368m88950n48176o15455o88102p65727
57054d176510q49851r41727j042614j154989j281268j422444j580043j758160
57046a4207606j961768k194729k461707k770152l128223l543146m024441m586268
$$ y = [2509333, 2537648, 2561141, 2580382, 2598396, 2617694, 2637353, 2654631, 2668809, 2682079, 2697195, 2715490, 2736844, 2760443, 2785614, 2812474, 2841461, 2871825, 2901380, 2928491, 2953579, 2977826, 3001042, 3021870, 3039572, 3054414, 3066448, 3075179, 3080857, 3085387, 3091316, 3099782, 3109511, 3117804, 3122509, 3122840, 3118306, 3107513, 3088601, 3060306, 3021654, 2971014, 2906650, 2828174, 2736367, 2631607, 2513622, 2382673, 2239434, 2083207, 1911444, 1721561, 1512227, 1282608, 1031373, 756812, 456782, 128132, -233030, -630732, -1070100, -1559050, -2107226, -2722681, -3410783, -4176510, -5026361, -5968088, -7010702, -8165691, -9446959, -10869403, -12449446, -14207606, -16169374, -18364103, -20825810, -23595962, -26724185, -30267331, -34291772, -38878040]
57038c8878040n243647o008934o894574p915491r085380j0413330j1900776j3523950
57030a09864122j5208589j6841483j8334470j9666669k0817338k1631041k1776081
57023b44139793k0886959j8789318j5625312j1805202p847649m200691j104809
57016c24399733J451713L659291N744312P856792J0038928J2241902J4349363
57009b69057432J6211810J7698902J8736250J9296009J9366765J8949866J8082778
57002a40715052J6850564J5369063J3761287J2143993J0616412R245014Q055916
56995e4672803P043459O185512N453883M820821M265243L774953L342230K959092
56987a6827610K617988K314290K045226J807227J596201J409312J244598J099261
$$ y = [-38878040, -44121687, -50130621, -57025195, -64940686, -74026066, -84439396, -96340172, -109864122, -125072711, -141914194, -160248664, -179915333, -200732671, -222363712, -244139793, -265026752, -283816070, -299441382, -311246584, -319094233, -323294924, -324399733, -322948020, -319288729, -313544417, -305687625, -295648697, -283406795, -269057432, -252845622, -235146720, -216410470, -197114461, -177747696, -158797830, -140715052, -123864488, -108495425, -94734138, -82590145, -71973733, -62728719, -54672803, -47629344, -41443832, -35989949, -31169128, -26903885, -23128932, -19786702, -16827610, -14209622, -11895332, -9850106, -8042879, -6446678, -5037366, -3792768, -2693507]
56979b693507R69861Q54157a17677E45868N90059N30991M83938M44696M09527
56970C005079L77167L48116L22244K97864K73028K46963K20011J92816J66019
56961E449307J40483J17359R7801Q2458P1083O2518N5480M9748M6396M6303M8303
56950F267239M9389M7154M1681L4772K7698K0298J2029L184n401j4082k6326m8480
56938F409155q5720j36374j90675k36772k68535k86976k95245k94756k86561k73695
56928D053846k59772k46129k32162k17957k04941j94060j84735j75955j67408
56919B170727j59233j51412j43738j35857j27270j17709j07537r7363q7449p7827
56909I65332o8762o0436n2392m4055l5778k8599k2943j8228j3812r579n452j205
$$ y = [-2693507, -1723646, -869489, -117677, 545868, 1135927, 1666918, 2150856, 2595552, 3005079, 3382246, 3730362, 4052606, 4350470, 4623498, 4870461, 5090472, 5283288, 5449307, 5589790, 5707149, 5804950, 5887408, 5958491, 6021009, 6076489, 6126237, 6172633, 6218936, 6267239, 6316628, 6363782, 6405463, 6440235, 6467933, 6488231, 6500260, 6503444, 6498043, 6483961, 6457635, 6409155, 6323435, 6187061, 5996386, 5759614, 5491079, 5204103, 4908858, 4614102, 4327541, 4053846, 3794074, 3547945, 3315783, 3097826, 2892885, 2698825, 2514090, 2338135, 2170727, 2011494, 1860082, 1716344, 1580487, 1453217, 1335508, 1227971, 1130608, 1043159, 965332, 896570, 836134, 783742, 739687, 703909, 675310, 652367, 634139, 620327, 610748, 605296, 604091]
56897F04091K834N523N862L940N54l688q528j3535j7838k0348k0432j8543j6151
56884E03741j4458j3230j1438q950o719n105l081K80M355P799J0141J1710J2568
56871D87613J2518J1804J0658Q336L730k986j0157j6193k0465k2743k2929k1676
56859D17510k0237j9231j8250j7003j5910j5122j3999j2276j0858j0569j0862
56848B53193j0594r574q416p432o635o312o517o451n437m204m013m631m470k794
56834A65713o59O81J270K004L650O526J0366J4106J6669J8268K0078K2268K3297
56821C04237K1768J8345J5151J3739J4098J5184J5900J5814J5320J5054J5141
56810D79751J5473J6383J8252K0495K2045K3025K4714K7485L0095L1677L3054
$$ y = [604091, 606925, 612448, 618310, 622250, 622804, 619116, 610588, 597053, 579215, 558867, 538435, 519892, 503741, 489283, 476053, 464615, 455665, 448946, 443841, 440760, 441040, 445395, 453194, 463335, 475045, 487613, 500131, 511935, 522593, 530929, 534659, 531673, 521516, 505323, 484858, 462115, 439186, 417510, 397273, 378042, 359792, 342789, 326879, 311757, 297758, 285482, 274624, 264055, 253193, 242599, 233025, 224609, 217177, 210542, 204230, 197713, 191262, 185825, 181621, 177608, 172977, 168507, 165713, 165054, 165735, 167005, 169009, 172659, 179185, 189551, 203657, 220326, 238594, 258672, 280940, 304237, 326005, 344350, 359501, 373240, 387338, 402522, 418422, 434236, 449556, 464610, 479751, 495224, 511607, 529859, 550354, 572399, 595424, 620138, 647623, 677718, 709395, 742449]
56799G42449L4879L5618L2892K6256J7305P567k119j0446j5670j7368j6949j5858
56787H18556j4119j1237p571m098j085K203O602J2211J8410K4452L0073L5644
56775I10041M1660M7805N2518N3654M9661M0232K6106Q764r205k4129l3010l5990
56763A128107l6275l6743l7147l5563l1735k7389k3507j9248j3951q409l171K813
56751H57782J0577J9142K6399L1227L3675L3693L0886K5070J6162M165r732k2643
56739A056403l1796l6521l7841l6856l4626l2658l1818l1070k8706k4645k0133
56728G09733j5677j0911o282k931o39K335O846J1605J4790J5435J2866O614k014
56715G41770r739j4179j6174j8076k0439k1842k1378j9766j7944j5924j3666j2020
$$ y = [742449, 777328, 812946, 845838, 872094, 889399, 896966, 894847, 884401, 868731, 851363, 834414, 818556, 804437, 793200, 785629, 781531, 780446, 782649, 789251, 801462, 819872, 844324, 874397, 910041, 951701, 999506, 1052024, 1105678, 1155339, 1195571, 1221677, 1230441, 1221236, 1197107, 1164097, 1128107, 1091832, 1055089, 1017942, 982379, 950644, 923255, 899748, 880500, 866549, 858140, 854969, 857782, 868359, 887501, 913900, 945127, 978802, 1012495, 1043381, 1068451, 1084613, 1088778, 1079046, 1056403, 1024607, 988086, 950245, 913389, 878763, 846105, 814287, 783217, 754511, 729866, 709733, 694056, 683145, 676863, 673932, 673293, 675628, 682474, 694079, 708869, 724304, 737170, 743784, 741770, 732031, 717852, 701678, 683602, 663163, 641321, 619943, 600177, 582233, 566309, 552643, 540623]
56703E40623j1883j2775j3219j2611j1915j2055j2264j1062q582o754o747p378
56691D13378o781m818k884k004k190l119m187m186k356L34K051K317K138J936
56677C89629Q65j280k959k624p80P21Q97L38m6j19k11l11j2P05R63j18k037l085
56659C80536k400j220j356k924m458m717l484j098J565K977K209L39n86n1O56
56644C65988O05K91L64P36J417K884M919O299O270N476M756L994K806J450L71
56629D08626m23r68j015o64n05o19k11J186K805L498K948J604J02q79q85k26L36
56612D14710N34N64K00q87j911j541j80%j959m269m851m009l507m125n339o446
56596C76984o737n516l128j232q25r14l30J72p95k720l805l560l080k929k580
$$ y = [540623, 528740, 515965, 502746, 490135, 478220, 466165, 453901, 442839, 434257, 427503, 420756, 413378, 406597, 401779, 398895, 396891, 394701, 391582, 387395, 383209, 380853, 381187, 383238, 385555, 387693, 389629, 390494, 389214, 386255, 383631, 382851, 383572, 384469, 384807, 384761, 384642, 384431, 384120, 384108, 384813, 385776, 385658, 383621, 380536, 378136, 376916, 375560, 372636, 368178, 363461, 359977, 358879, 360444, 363421, 365630, 365969, 365383, 365332, 365988, 366593, 366884, 367248, 367984, 369401, 372285, 377204, 383503, 389773, 395249, 400005, 403999, 406805, 408255, 408626, 408203, 407235, 406220, 405556, 405051, 404432, 404221, 405407, 408212, 411710, 414658, 416262, 416364, 415485, 414600, 414374, 414710, 415244, 415808, 416008, 415121, 413210, 411669, 411489, 411489, 409530, 405261, 400410, 396401, 392894, 388769, 383430, 376984, 370247, 364731, 361603, 360371, 359546, 358632, 358302, 358474, 357679, 354959, 351154, 347594, 344514, 341585, 339005]
56581C39005j944j763k142k144j363o62q83j698k244k085j189K75J683K179J547
56566C26572N03j47k93l54o94j223j386o51O20J169K15j414k063j053Q36K454
56550C23091L245L204K513J281n33k762m426m231k206k81l02j828k838k325j224
56535C10378q24j209j529j061K25J699K534K502K255K395K475J587k01j585j495
56520C18146k65P51O08k74n64M48J924K523K326K722M129M966L847J829J216K666
56504C46998M715N971O466O849P395Q094Q814R210R032Q615Q395Q029O845N104
56490D50532L993M092M689M768M039K779J334J25m80o51r69j563j816j377j061
56475D68434k090m458o525o620m791k723j945k637m144n806o733n830l198r04
$$ y = [339005, 337061, 335298, 333156, 331012, 329649, 328987, 328104, 326406, 324162, 322077, 320888, 321163, 322846, 325025, 326572, 327075, 326928, 326635, 326281, 325587, 324364, 322978, 322327, 322947, 324116, 324331, 322917, 320854, 319801, 320637, 323091, 326336, 329540, 332053, 333334, 332801, 330039, 325613, 321382, 319176, 318895, 318593, 316765, 313927, 311602, 310378, 309554, 308345, 306816, 305755, 305980, 307679, 310213, 312715, 314970, 317365, 319840, 321427, 321226, 319641, 318146, 317881, 318632, 319240, 318966, 318402, 318850, 320774, 323297, 325623, 328345, 332474, 337440, 341287, 343116, 344332, 346998, 351713, 357684, 364150, 370999, 378394, 386488, 395302, 404512, 413544, 422159, 430554, 438583, 445428, 450532, 454525, 458617, 463306, 468074, 472113, 474892, 476226, 476351, 475871, 475220, 474251, 472688, 470872, 469495, 468434, 466344, 461886, 455361, 448741, 443950, 441227, 439282, 436645, 432501, 426695, 419962, 414132, 410934, 410030]
56461D10030q23k009j958m32J24j509l224k775j120q31k480m478n552n566m640
56446C72757l177k237k288k132o71R72Q91o02j347m78P99J497K020K668K744J676
56430C73092j10j765k566k078q07k35r38j247M95L037L758K746K679M481N909
56415C86451N377M466N093O378O247M658L322L100L419L709M030M539N282O252
56401D52323P034O940O075N579O202P251P587P042O260N695N291M808L988K830
56387E34905J809J253O93m15j477j497q54r92k166l106l254l616m752n681n739
56372E05111n833o598o845n393l256k391l046l917m224m146l650k510j261q22
56358D51219j120j204p88o84j506k768l485l278k723k715l388l722k674p24M22
$$ y = [410030, 409207, 407198, 405240, 404808, 404932, 403423, 400199, 397424, 396304, 395473, 392993, 388515, 382963, 377397, 372757, 369580, 367343, 365055, 362923, 362252, 363224, 364115, 363513, 362166, 361688, 362487, 363984, 366004, 368672, 371416, 373092, 372982, 371217, 368651, 366573, 365766, 365531, 364593, 363346, 363841, 366878, 370636, 373382, 376061, 380542, 386451, 391828, 396294, 401387, 407765, 414012, 418670, 421992, 425092, 428511, 432220, 436250, 440789, 446071, 452323, 459357, 466297, 472372, 477951, 484153, 491404, 498991, 506033, 512293, 517988, 523279, 528087, 532075, 534905, 536714, 537967, 538660, 538245, 536768, 535271, 534417, 533425, 531259, 528153, 524899, 521283, 516531, 510850, 505111, 499278, 492680, 485835, 480442, 477186, 474795, 471749, 467832, 463608, 459462, 455812, 453302, 452041, 451219, 450099, 448895, 448107, 447423, 445917, 443149, 439664, 436386, 433663, 430948, 427560, 423838, 421164, 420440, 420862]
56343D20862p2j188j645j539j752k409k740k158q19O21J431J373J053J233J665
56328D13916J318n1j394j735j189l18N90J256J426J587K616M246N097M708M145
56313D36218L906K856M05j704j442O46K293K566K466K859L361L276K565J833K015
56298D64119L655N854O637N198L171K594L388M035M018M031M200L738K570J808
56284E19016K224L302M124M448M524M460M084L177J808O00L54J143K155K786L302
56269E61507M004M396L961L169K987L753N205P088R019J0190J0127R378Q834Q630
56255F52248Q389Q092Q106Q720J0124J2249J4124J4216J2309J0244R892J0899
56243G79612J1459J0644R039P573O875P372Q839J0030R767Q336P162P273Q604
$$ y = [420862, 420790, 419602, 417957, 416418, 414666, 412257, 409517, 407359, 406540, 407161, 408592, 409965, 411018, 412251, 413916, 415234, 415183, 413789, 412054, 410865, 410547, 411137, 412393, 413819, 415406, 418022, 422268, 427365, 432073, 436218, 440124, 442980, 443385, 441681, 440239, 440885, 443178, 445744, 448210, 451069, 454430, 457706, 460271, 462104, 464119, 467774, 473628, 480265, 485463, 488634, 491228, 494616, 498651, 502669, 506700, 510900, 514638, 517208, 519016, 521240, 524542, 528666, 533114, 537638, 542098, 546182, 549359, 551167, 551767, 552121, 553264, 555419, 558205, 561507, 565511, 569907, 573868, 577037, 580024, 583777, 588982, 596070, 605089, 615279, 625406, 634784, 643618, 652248, 660637, 668729, 676835, 685555, 695679, 707928, 722052, 736268, 748577, 758821, 768713, 779612, 791071, 801715, 810754, 818327, 825202, 832574, 841413, 851443, 861210, 869546, 876708, 883981, 892585]
56230H92585J0363J1483J1329J0719J1552J4539J7924J9418J8924J8285J8883
56219A056004K0557K2571K4630K7043L0473L5175M0115M3661M5765M8400N2984
56208A447378N8467O3148O7160P1803P7399Q3470R0265R8460J07868J17916J28690
56197B412024J40016J50434J59014J67421J78005J90189K00956K08740K14529
56188D021328K18856K20028K16132K07164J94410J78937J61187J40939J17501
56179E676482R0994O3447L7293J3012j0299l2240n0991o6039p8992r1058j01568
56168E450041j09746j16239j21874j26384j29471j31992j34934j38070j40567
56159D300764j42262j43530j44415j44572j43693j41684j38740j35347j31746
$$ y = [892585, 902948, 914431, 925760, 936479, 948031, 962570, 980494, 999912, 1018836, 1037121, 1056004, 1076561, 1099132, 1123762, 1150805, 1181278, 1216453, 1256568, 1300229, 1345994, 1394394, 1447378, 1505845, 1568993, 1636153, 1707956, 1785355, 1868825, 1959090, 2057550, 2165418, 2283334, 2412024, 2552040, 2702474, 2861488, 3028909, 3206914, 3397103, 3598059, 3806799, 4021328, 4240184, 4460212, 4676344, 4883508, 5077918, 5256855, 5418042, 5558981, 5676482, 5767476, 5830923, 5868216, 5881228, 5870929, 5838689, 5787698, 5721659, 5642667, 5551609, 5450041, 5340295, 5224056, 5102182, 4975798, 4846327, 4714335, 4579401, 4441331, 4300764, 4158502, 4014972, 3870557, 3725985, 3582292, 3440608, 3301868, 3166521, 3034775]
56150C034775j27491j22279j16900j12324j08083j02772r6174q9563q3788p8420
56140A996981p3124o8473o4849o1674n8297n4687n0822m6393m1564l7132l3582
56129A406384l0700k8303k6295k3979k0565j6603j3708j2418j1492r837p920o630
56117A197934n827m707k817j32L037N761O933O544N889O181P678J0153J3176J5702
56103A265505J6638J6265J6059J6547J6560J5283J3926J4361J6730J9309K0346
56092A447529J9555J8169J7912J9491K1910K3744K5066K7306L1168L5851M0636
56081A728337M6146N3298O1880P0960Q0275R0373J01676J13834J25953J37017
56071B609749J46080J52196J54400J52188J46255J38354J30182J22644J16094
$$ y = [3034775, 2907284, 2785005, 2668105, 2555781, 2447698, 2344926, 2248752, 2159189, 2075401, 1996981, 1923857, 1855384, 1790535, 1728861, 1670564, 1615877, 1565055, 1518662, 1477098, 1439966, 1406384, 1375684, 1347381, 1321086, 1297107, 1276542, 1259939, 1246231, 1233813, 1222321, 1212484, 1204564, 1197934, 1192107, 1187400, 1184583, 1184451, 1187488, 1193249, 1200182, 1206726, 1212615, 1218796, 1226474, 1236627, 1249803, 1265505, 1282143, 1298408, 1314467, 1331014, 1347574, 1362857, 1376783, 1391144, 1407874, 1427183, 1447529, 1467084, 1485253, 1503165, 1522656, 1544566, 1568310, 1593376, 1620682, 1651850, 1687701, 1728337, 1774483, 1827781, 1889661, 1960621, 2040896, 2131269, 2232945, 2346779, 2472732, 2609749, 2755829, 2908025, 3062425, 3214613, 3360868, 3499222, 3629404, 3752048, 3868142]
56062C868142J10209J03267R2861P8437O2093M5868K9465J2010n207j9980l2455
56051D344710m4944n8532p1987q4262r6132j08665j21334j32126j38672j39489
56041C348567j35183j28368j21306j13965j05388r6131q7720q0369p3066o5539
56031B341532n8336n1418m4580l8853l5338l3009k9789k5584k2063j9690j7373
56020A965499j4909j3141j1623q827m957k023o14P89K835M275M657N357P044Q591
56006A942953R505J1032J3683J5997J7053J8159K0613K3618K5739K6914K7832
55995B153098K8676K9447L0331L1188L1720L2344L3599L4812L5078L5233L6851
55984B512377L9566M1604M2762M4320M6345M7860M9451N2528N6033N7315N6629
$$ y = [3868142, 3978351, 4081618, 4174479, 4252916, 4315009, 4360877, 4390342, 4402352, 4397145, 4377165, 4344710, 4299766, 4241234, 4169247, 4084985, 3988853, 3880188, 3758854, 3626728, 3488056, 3348567, 3213384, 3085016, 2963710, 2849745, 2744357, 2648226, 2560506, 2480137, 2407071, 2341532, 2283196, 2231778, 2187198, 2148345, 2113007, 2079998, 2050209, 2024625, 2002562, 1982872, 1965499, 1950590, 1937449, 1925826, 1916999, 1912042, 1910019, 1909405, 1910194, 1913029, 1917304, 1921961, 1927318, 1934362, 1942953, 1952458, 1963490, 1977173, 1993170, 2010223, 2028382, 2048995, 2072613, 2098352, 2125266, 2153098, 2181774, 2211221, 2241552, 2272740, 2304460, 2336804, 2370403, 2405215, 2440293, 2475526, 2512377, 2551943, 2593547, 2636309, 2680629, 2726974, 2774834, 2824285, 2876813, 2932846, 2990161, 3046790]
55973C046790N7363O1120O5857O9494P2136P4178P5605P7859Q2886Q9642R4981
55962C867911R8583J03143J09278J14727J19497J27029J38489J50422J60079J68911
55952E158069J78721J88583J97845K08194K20367K32311K42723K52871K63421
55943G143105K73306K83178K95685L10858L25948L41202L60576L84848M09743
55934A0128449M33109M58187M87274N18401N51271N89871O35432O83102P29719
55925A5214815P78632Q32567Q88220R42972J000999J067585J143043J226918J321888
55916B4417639J428115J539651J651582J765181J882268K002394K130585K279546
55908C9096961K458138K665702K903100L179612L502716L872279M293079M782250
$$ y = [3046790, 3104153, 3165273, 3231130, 3300624, 3372760, 3446938, 3522543, 3600402, 3683288, 3772930, 3867911, 3966494, 4069637, 4178915, 4293642, 4413139, 4540168, 4678657, 4829079, 4989158, 5158069, 5336790, 5525373, 5723218, 5931412, 6151779, 6384090, 6626813, 6879684, 7143105, 7416411, 7699589, 7995274, 8306132, 8632080, 8973282, 9333858, 9718706, 10128449, 10561558, 11019745, 11507019, 12025420, 12576691, 13166562, 13801994, 14485096, 15214815, 15993447, 16826014, 17714234, 18657206, 19658205, 20725790, 21868833, 23095751, 24417639, 25845754, 27385405, 29036987, 30802168, 32684436, 34686830, 36817415, 39096961, 41555099, 44220801, 47123901, 50303513, 53806229, 57678508, 61971587, 66753837]
55900F6753837N356831O027804O817226P767716Q923431J0316644J1985660J3987613
55892A37936762J6376370J9182036K2409156K5978562K9568882L2484897L3734890
55885C17671555L2325744K7624441J9669186R361290j624987j1367168j8464810
55878C75195251k2529748k4051999k3864097k2705159k1104607j9425483j7884826
55871B23629332j6560719j5444214j4499545j3680907j2931628j2204059j1478603
55864A26829657j0753262j0025580r294287q565502p844786p131327o428656n752679
55856F1033578n121044m541970m019101l557814l159067k814710k516274k262281
55848C3041317k051454j875782j726358j599568j491867j394781j301270j211749
$$ y = [66753837, 72110668, 78138472, 84955698, 92723414, 101646845, 111963489, 123949149, 137936762, 154313132, 173495168, 195904324, 221882886, 251451768, 283936665, 317671555, 349997299, 377621740, 397290926, 406652216, 405027229, 393660061, 375195251, 352665503, 328613504, 304749407, 282044248, 260939641, 241514158, 223629332, 207068613, 191624399, 177124854, 163443947, 150512319, 138308260, 126829657, 116076395, 106050815, 96756528, 88191026, 80346240, 73214913, 66786257, 61033578, 55912534, 51370564, 47351463, 43793649, 40634582, 37819872, 35303598, 33041317, 30989863, 29114081, 27387723, 25788155, 24296288, 22901507, 21600237, 20388488]
55840B0388488j128365j048688r70305q96402q30937p72332p17207o66413o22546
55831A2735293n85053n52179n24280n00996m78599m54213m29475m06482l83619
55822H420397l59218l35622l15494k97318k78698k61124k47216k35898k24523
55813E865286k13591k05237j98863j92187j85163j79186j73697j67064j59877
55804D190421j54133j49725j44489j37445j29757j22844j17246j13083j10199
55795C011500j08150j06731j05702j03830r9578r3172q6428q0240p4022o7836
55785B085811o2792n8904n4909n0600m7074m4254m0791l6794l3793l1488k7667
55774A596745k2081j7235j4496j2653j1249j1687j3803j5069j4858j5819j9164
$$ y = [20388488, 19260123, 18211435, 17241130, 16344728, 15513791, 14741459, 14024252, 13357839, 12735293, 12150240, 11598061, 11073781, 10572785, 10094186, 9639973, 9210498, 8804016, 8420397, 8061179, 7725557, 7410063, 7112745, 6834047, 6572923, 6325707, 6089809, 5865286, 5651695, 5446458, 5247595, 5055408, 4870245, 4691059, 4517362, 4350298, 4190421, 4036288, 3886563, 3742074, 3604629, 3474872, 3352028, 3234782, 3121699, 3011500, 2903350, 2796619, 2690917, 2587087, 2487509, 2394337, 2307909, 2227669, 2153647, 2085811, 2023019, 1964115, 1909206, 1858606, 1811532, 1767278, 1726487, 1689693, 1655900, 1624412, 1596745, 1574664, 1557429, 1542933, 1530280, 1519031, 1507344, 1493541, 1478472, 1463614, 1447795, 1428631]
55763A428631k2212k2889k3056k4822k6774k6927k6493k7568k9315k9533k8210
55752A140832k6793k5515k3765k1706j9662j7419j5503j5049j5230j3476r699
55741I37015p251p820q644p079m677l812l566k265j307k643m801n236m830o218
55727H66866r135j1054j1322j1152j0522q462n758m308m250m347m468n233o162
55714G70693o647p692j0208j2726j3445j3259j4007j5024j4477j2905j2184j1906
55702F26213j0171p383n833n841n646n012n668p888r515q994o999m785l174l098
55688E36206n002p618r345j0544j2448j4374j4542j3186j2215j2022j1256r647
55676D04007q285p146n098k483r83p84m86j7p42k383k891k107k519n293q274r214
$$ y = [1428631, 1406419, 1383530, 1360474, 1335652, 1308878, 1281951, 1255458, 1227890, 1198575, 1169042, 1140832, 1114039, 1088524, 1064759, 1043053, 1023391, 1005972, 990469, 975420, 960190, 946714, 937015, 929764, 921944, 913300, 906221, 901544, 897732, 894166, 891901, 890594, 887951, 883150, 877914, 873084, 866866, 857731, 846677, 835355, 824203, 813681, 805219, 799461, 795153, 790903, 786556, 782088, 776855, 770693, 764046, 756354, 746146, 733420, 719975, 706716, 692709, 677685, 663208, 650303, 638119, 626213, 616042, 608659, 602826, 596985, 591339, 586327, 580659, 572771, 563256, 554262, 547263, 542478, 539304, 536206, 531204, 523586, 514241, 503697, 491249, 476875, 462333, 449147, 436932, 424910, 413654, 404007, 395722, 388576, 383478, 380995, 380012, 379228, 378742, 378725, 377983, 375600, 372709, 370602, 368083, 362790, 354516, 345302]
55660C45302q521p544o447n278m917n322m734k282K68R88N09O21J474J960J895
55645C07972K056K627L151L592M188M454L468J178j265k535k171p98M97J188J673
55630C29275K420L125L403L882N412P375Q074O987N588N533O952Q649R126P413
55616D13214L947O67q06j134k224m359n804n508m472l847l313k249j230j024j061
55601C80797j78J454K332J429n85j970j474O13K693L363K621J475O14N6k95m72
55585C92473q07j588k459k897l168l952n214o327p279q582j0057j0788j0429r546
55571C09380q635p911q058r665j1630j1664r138o122m860n305o018o307o244n564
55557B02259m035k488k126k902l507l012j664k44N41J1k034m432n120l242m85
$$ y = [345302, 336781, 329237, 322790, 317512, 312595, 307273, 302539, 300257, 300525, 301513, 302022, 302643, 304117, 306077, 307972, 310028, 312655, 315806, 319398, 323586, 328040, 331508, 332686, 331421, 328886, 326715, 325917, 326414, 327602, 329275, 331695, 334820, 338223, 342105, 347517, 354892, 362966, 369953, 375541, 381074, 388026, 396675, 405801, 413214, 417161, 417828, 417022, 415888, 413664, 409305, 403501, 397993, 393521, 389674, 386361, 384112, 382882, 381858, 380797, 380619, 382073, 384405, 385834, 385249, 383279, 381805, 382418, 385111, 388474, 391095, 392570, 393184, 393240, 392945, 392473, 391666, 390078, 387619, 384722, 381554, 377602, 372388, 366061, 358782, 350200, 340143, 329355, 318926, 309380, 300745, 292834, 284776, 275111, 263481, 251817, 242679, 236557, 231697, 226392, 220374, 214067, 207823, 202259, 198224, 195736, 193610, 190708, 187201, 184189, 182525, 182281, 182822, 182833, 180799, 176367, 171247, 168005, 167520]
55542A67520M83j117l359l833k123K39J680J811J026k10j410k041j848r90J96
55527A56024J192J235O2j277j174N94K421K725J566Q9q54j104r06p18o84r5J730
55510A60826L892M512L266K028K283L358M013M196M052K786K19j928k178j660
55496A89665k460m431n686n539m882m228l448l072l702m320l324j278n37j877
55482A40881l543l939l458l075k801k210j187K99K118L571M120M372N007N154
55468A45309L517Q36o82l50N97J478K811M344M941M871N694P068O355K625j372
55453A88042k841k397k127k230j760j175j815l577n103n750n823n453m797m697
55439A38497n604o237m940k249p03j891m652o446n803l449j446j206k163k645
$$ y = [167520, 168003, 166886, 163527, 159694, 157571, 157810, 159490, 161301, 162327, 162117, 160707, 158666, 156818, 155828, 156024, 157216, 158451, 158513, 157236, 156062, 156656, 159077, 161802, 163368, 163457, 162603, 161499, 160593, 159875, 159191, 159096, 160826, 164718, 169230, 172496, 174524, 176807, 180165, 184178, 188374, 192426, 195212, 195431, 193503, 191325, 189665, 187205, 182774, 177088, 171549, 166667, 162439, 158991, 155919, 152217, 147897, 144573, 143295, 142758, 140881, 137338, 133399, 129941, 126866, 124065, 121855, 120668, 120967, 123085, 126656, 130776, 135148, 140155, 145309, 148826, 149662, 148980, 148630, 149227, 150705, 153516, 157860, 162801, 167672, 173366, 180434, 186789, 189414, 188042, 185201, 182804, 180677, 178447, 176687, 175512, 173697, 170120, 165017, 159267, 153444, 147991, 143194, 138497, 132893, 126656, 121716, 119467, 118764, 116873, 112221, 105775, 99972, 96523, 95077, 93871, 91708, 89063]
55425H9063k028j344j573k347k780k640k174j475o63R6J171L067M931M695J590
55410H7589k409m670m708l971l634l644l463k787j678n97r7j43k49l81q92j393
55394E2873q79N30J169jj894k807k356j185J60J019N08j139k117j196N31J305
55378D4521J037O16j56j898l590l195n42K201L189K696J889J158L49l01k09Q30
55362D8595K297L205K837J461J61l95n79q56q78j59Q22J115O17R3O3L37N42N10
55344E9788K91J48L86Q18Q53M15J81M60N31k44j250j392n25N93J340J529J147
55327F5069M04k80p89j265j226J40K282L095J556o50j378q52o11p63k42P63R15
55310F6168J13l45j65o03k055l002k277q47l29q93j697k320k646k211q27N18N95
$$ y = [89063, 87035, 85691, 84118, 81771, 78991, 76351, 74177, 72702, 72039, 72135, 73306, 76373, 81304, 85999, 87589, 85180, 80510, 75802, 71831, 68197, 64553, 61090, 58303, 56625, 56028, 55931, 55788, 55539, 55158, 54266, 52873, 51994, 52524, 53693, 53692, 51798, 48991, 46635, 45450, 45610, 46629, 47137, 45998, 43881, 42685, 43216, 44521, 45558, 46174, 46018, 44120, 40530, 37335, 36793, 38994, 42183, 44879, 46768, 47926, 48275, 47974, 47765, 48595, 50892, 54097, 56934, 58395, 58556, 58161, 57582, 56726, 55848, 55689, 56511, 57626, 58243, 58336, 58399, 58736, 59278, 59788, 60079, 60227, 60613, 61431, 62284, 62699, 62880, 63340, 63871, 63627, 62377, 60985, 60460, 61053, 62393, 63922, 65069, 65473, 65193, 64404, 63139, 61913, 62053, 64335, 67430, 68986, 68336, 66958, 66106, 65495, 64732, 64490, 65253, 66168, 66281, 65936, 65771, 65168, 63113, 60111, 57834, 56987, 56658, 55765, 54068, 51748, 49102, 46891, 46064, 46582, 47177]
55293D7177l50q21r0Q65P62k23p73k77L44m4j165j758j404j042j475k165k118
55276C5443j226j79M63N04j11j046j487r52J71J302K345L114K857J297m82j236
55260D0777j200j380j673j052N10J650J392J92j019j788j827p98J011K472K658
55245C9925J723N51j89m22m64n24l96J44N67o7j525k033m25K090L435L339L045
55228D8774K876J890N6j180j005l90l02k36M96J191P68l95r11l35L94L57l28r82
55210E0738j203j032o50j62L08L90l28j594k278j456L63J720J843J173L19n57
55194D7594j102o00Q96K015J486k39j520j452o19k0J17K72Q12J460J609J011M7
55177E1767o82q50l78P07J997K556J751J64q03m74M40Q13K28r09j893k071j244
$$ y = [47177, 46827, 46006, 45916, 46781, 47543, 47320, 46547, 46270, 46614, 46570, 45405, 43647, 42243, 41201, 39726, 37561, 35443, 34217, 34038, 34501, 35005, 34894, 33848, 32361, 31409, 31580, 32882, 35227, 38341, 41198, 42495, 42013, 40777, 39577, 38197, 36524, 35472, 35982, 37632, 39024, 39216, 38197, 36409, 34582, 33784, 34795, 37267, 39925, 41648, 42199, 42010, 41588, 41124, 40600, 40204, 40348, 40915, 40848, 39323, 37290, 36865, 38955, 42390, 45729, 48774, 51650, 53540, 53596, 52416, 51411, 51021, 50719, 50483, 50979, 52170, 52938, 52543, 51632, 51297, 51691, 52048, 51720, 50738, 49535, 48503, 47853, 47691, 47999, 48389, 48061, 46467, 44189, 42733, 43096, 44816, 46659, 47832, 48151, 47594, 46492, 45892, 46788, 48803, 50289, 50050, 48530, 47078, 46459, 46439, 46556, 46828, 47640, 49100, 50709, 51720, 51767, 51085, 50235, 49857, 50564, 52561, 55117, 56868, 57032, 56229, 55755, 56195, 57008, 57236, 56327, 54434, 52363, 51119]
55160E1119o9L02o02j911k274j259K70J079P21j11l21M76J556J942J485Q40M90
55143E3733K76r4n05o72o06n43m52k1P53J189N12j040k144j807n31M06N60M39
55125D9453J45q20k129k263m66J878K836K262J432R64L62o30j469j758j703j435
55109D6659o83O42K086L031L015J853N5j178j033p2N77O41O00N04P4k74K01J165
55091E7863J332K85r98j684k015k274j970p14Q52J777J800J212K49p71j286j045
55075E2613n28m13q11j308j462j103m69j7J22L91J061J572J343Q95J177J919J914
55058E6896J050P65J969L633M178L422K463K274K884L438K733M18j955k111J98
55043H2255K453K189j92k231k377j186K9P27J249K068L026L263K079j6j541j572
$$ y = [51119, 51050, 51352, 50750, 48839, 46565, 45306, 45576, 46655, 47376, 47265, 46944, 47420, 48976, 50918, 52403, 53243, 53733, 54009, 53915, 53410, 52738, 52132, 51589, 51137, 51116, 51869, 53058, 53570, 52530, 50386, 48579, 48048, 48454, 49014, 49453, 49598, 48778, 46649, 44386, 43920, 45798, 48634, 50896, 52328, 53292, 53654, 53024, 51555, 49797, 48094, 46659, 45976, 46618, 48704, 51735, 54750, 56603, 56658, 55480, 54447, 54375, 54952, 55593, 56193, 56697, 56771, 56497, 56698, 57863, 59195, 59480, 58482, 56798, 54783, 52509, 50539, 49825, 50677, 52454, 54254, 55466, 55715, 54944, 53658, 52613, 52085, 51672, 50861, 49553, 48091, 46988, 46519, 46502, 46624, 47015, 48076, 49648, 50991, 51886, 53063, 54982, 56896, 57946, 58711, 60680, 64313, 68491, 71913, 74376, 76650, 79534, 82972, 85705, 86123, 84168, 82057, 82255, 84708, 86897, 86705, 84474, 82097, 80911, 80940, 81667, 82916, 84984, 88010, 91273, 93352, 93336, 91795, 90223]
55027I0223n61N16J239J604J505Q90J03m40o80p77q41r93j206r30M41K484L764
55010I6341L333J704Q2p60o30K21R91Q34o9n96k25L09L06L2j84o96j501j539k07
54991I7746J295J433N11j4L7n60k204l637l759k942k090j318l30O11Q68L65j49
54974H5863J52J358K625K874J844M24l06j44L36P30J026J048L13j127k218j755
54958I3043K84K584L711L305K035O70m39j123j239r23o69p42q77p58m28mM64N18
54940I9412n04k099k401m65J971K568J559J175K146K823K008N44m87j289k200
54925A04761k687k450k066j572LK574M147L376J502K04q87k742m334l755j190
54910I4884J360K803L498L617K972K219K278K639K114J106J177K410L091K333
$$ y = [90223, 89662, 90178, 91417, 93021, 94526, 95416, 95519, 95079, 94399, 93622, 92781, 91788, 90582, 89652, 90093, 92577, 96341, 99674, 101378, 101460, 100700, 100070, 100291, 101282, 102116, 102047, 101451, 101226, 101535, 101841, 101873, 101689, 100993, 99492, 97953, 97746, 99041, 100474, 100985, 100971, 101008, 100448, 98244, 94607, 90848, 87906, 85816, 84498, 84168, 84779, 85647, 86012, 85863, 86015, 87373, 89998, 92872, 94716, 95140, 94834, 94690, 95026, 95756, 96782, 97830, 98143, 97016, 94798, 93043, 93327, 95911, 99622, 102927, 104962, 105632, 105193, 104070, 102831, 101908, 101239, 100497, 99620, 98862, 98434, 98430, 98894, 99412, 98908, 96809, 94408, 93943, 95914, 98482, 100041, 101216, 103362, 106185, 108193, 108737, 108250, 106961, 104761, 102074, 99624, 97558, 95986, 95989, 98563, 102710, 106086, 107588, 107792, 106905, 104163, 99829, 96074, 94884, 96244, 99047, 102545, 106162, 109134, 111353, 113631, 116270, 118384, 119490, 120667, 123077, 126168, 128501]
54896A28501J112M62K85L78R11J480J412J388L087O507R511J0679J1013J1832
54882A88558J2680J2595J2013J1955J2324J2244J1319R459O323K009k396n908
54870B83175q553j0439j1001j0301r887j0825j1759j0623p754n542n137n309m766
54857A71279l883l515l466l096k581k560k917k755j560J07J263J666K097L396
54843A53475N339O860P381P410P613P981Q329Q950R927J0379R290O894M350K214
54829B56392J83j790l191m005m951o329p495q000q338q875q912p739o107n583
54815A75260o544p732p870o997n973n384n267n457n682n433m273k367n33M37N42
54800A06727M66O12N03l94j425j185N23K017J814O79M71J376J713O33n44m23L20
$$ y = [128501, 129613, 130075, 130360, 130738, 131649, 133129, 134541, 135929, 139016, 145523, 155034, 165713, 176726, 188558, 201238, 213833, 225846, 237801, 250125, 262369, 273688, 283147, 289470, 291479, 289083, 283175, 274622, 264183, 253182, 242881, 232994, 222169, 210410, 199787, 192033, 186491, 181354, 176045, 171279, 167396, 163881, 160415, 157319, 154738, 152178, 149261, 146506, 144946, 145053, 146316, 147982, 150079, 153475, 158814, 165674, 173055, 180465, 188078, 196059, 204388, 213338, 223265, 233644, 242934, 249828, 254178, 256392, 256575, 254785, 251594, 247589, 242638, 236309, 228814, 220814, 212476, 203601, 194689, 186950, 180843, 175260, 168716, 160984, 153114, 146117, 140144, 134760, 129493, 124036, 118354, 112921, 108648, 106281, 105748, 106185, 106727, 107193, 107805, 108308, 107914, 106489, 105304, 105827, 107844, 109658, 110337, 110808, 112184, 113897, 114530, 113986, 113563, 113883]
54783A13883l7j923m159n479n286l520r67O33J59j234j270N39K324K435J322L64
54767I7784Q0K91J023K142K832K406J320N13J12m03r60p80N35K362L687L882K980
54750A19806J611O55N94J158J777K175K256J837J006N52J317L104M655M964M386
54735A51853M291N649P980R731R811Q729Q081Q985J1260J3786J5051J3821J0317
54722B79345O831N802O809O697L468j081l757m013m015n289o992p677p198o333
54708B62597n478m484l325k318j785j695j630j159l98J69M93J085K092K885L149
54693B50198L584M810O207O803O820P357Q852J0901J3142J5354J7010J7872J8686
54680C87596K0031K0842J9536J6359J3003R935O049J113l367o588r715j3518j6428
$$ y = [113883, 113846, 111923, 107764, 102285, 96999, 93479, 92512, 93145, 93304, 92070, 90800, 91339, 93663, 96098, 97420, 97784, 97864, 98155, 99178, 101320, 104152, 106558, 107878, 108391, 108503, 108100, 107140, 106360, 106895, 109257, 112944, 116826, 119806, 121417, 122072, 122666, 123824, 125601, 127776, 130032, 131869, 132875, 133427, 134744, 137848, 142503, 147467, 151853, 156144, 161793, 169773, 179504, 189315, 198044, 206125, 215110, 226370, 240156, 255207, 269028, 279345, 286176, 291978, 298787, 305484, 308952, 307871, 304114, 300101, 296086, 290797, 283805, 276128, 268930, 262597, 257119, 252635, 249310, 246992, 245207, 243512, 241882, 240723, 240325, 240494, 240987, 242072, 244164, 247049, 250198, 253782, 258592, 264799, 271602, 278422, 285779, 294631, 305532, 318674, 334028, 351038, 368910, 387596, 407627, 428469, 448005, 464364, 477367, 487302, 493351, 494464, 491097, 484509, 474794, 461276, 444848]
54667D44848j6654j5152j4530j5544j6428j5668j3833j2318j1465j0646r546q648
54655B84416q476q801q740p787o548o141o779p322o496m312k049r94j293j913
54641B06765j675n43K84k16j547k308j943j242j098j506j855j540k68J571K739
54626A95618K186M75o31k08J002J971K589L034L094K756K657L067L172K232R03
54611B23917N44J605L382M963N778N639M902M251L785K893J594J221K728M990
54597B72192O036N556M868M575L828K190Q01R09K204L564M610N673O604O826O543
54582C36979O809Q039R282R614R705J1039J3732J6229J7456J8215J9705K1594
54570D98398K2560K2162K0917J8827J5333J0799O543K971j007n978j0688j3612
$$ y = [444848, 428194, 413042, 398512, 382968, 366540, 350872, 337039, 324721, 313256, 302610, 293064, 284416, 275940, 267139, 258399, 250612, 244064, 237923, 231144, 223822, 217326, 213014, 210965, 209971, 208678, 206765, 205090, 204547, 204831, 204615, 203068, 200760, 198817, 197575, 196477, 194971, 193116, 191576, 191308, 192879, 195618, 197804, 198279, 197648, 197440, 198442, 200413, 203002, 206036, 209130, 211886, 214543, 217610, 220782, 223014, 223917, 224461, 226066, 229448, 234411, 240189, 245828, 250730, 254981, 258766, 261659, 263253, 264474, 267202, 272192, 278228, 283784, 288652, 293227, 297055, 299245, 300046, 300955, 303159, 306723, 311333, 317006, 323610, 330436, 336979, 343788, 351827, 361109, 370723, 380428, 391467, 405199, 421428, 438884, 457099, 476804, 498398, 520958, 543120, 564037, 582864, 598197, 608996, 615539, 618510, 617503, 611525, 600837, 587225]
54558E87225j4879j5619j6315j6867j7524j8409j8608j7072j4391j2492j2492
54547D12557j3664j4587j4447j3271j1578r993q647p023m958l464l806n782p746
54534B93591q399p876p052o456n966n105l599j989j431k346l654m177m326n239
54520B25976o570o663n038l258k729k996l023k831k871k791k180j881k981m815
54506A75349n404m079k345j738j903j538m25M62N46M38R54J957K522K099J075
54491A67970J53n10j201j722j235N69K540L140K341J577J624J527L47r20m13J966
54475A77753M319N215N071M803M426L866L930N300P217Q450R061R940J0939J0949
54461B71239R912R283R916J0558R275N793J849m87o28k3r08l994p554r431r630
$$ y = [587225, 572346, 556727, 540412, 523545, 506021, 487612, 469004, 451932, 437541, 425049, 412557, 398893, 384306, 369859, 356588, 345010, 335017, 326370, 319347, 314389, 310925, 307119, 301337, 293591, 285192, 277316, 270264, 263808, 257842, 252737, 249138, 247149, 245718, 243372, 239718, 235541, 231215, 225976, 219406, 212743, 207705, 204447, 201718, 198722, 195699, 192868, 189997, 187206, 185026, 183145, 180164, 175349, 169945, 165866, 163521, 161783, 159880, 158342, 157917, 158379, 158925, 159363, 160317, 162274, 164796, 166895, 167970, 168123, 167613, 166412, 164690, 163455, 164024, 166564, 169704, 172045, 173622, 175246, 176773, 177120, 176200, 175787, 177753, 182072, 187287, 192358, 197161, 201587, 205453, 209383, 214683, 221900, 230350, 239411, 249351, 260290, 271239, 281151, 290434, 300350, 310908, 320183, 325976, 327825, 327338, 326710, 326687, 325779, 321785, 314231, 304800, 295170]
54446B95170r749j0199r739q155p323q410r662q685n945m107m386n321n227m258
54432A94004l630l812m194l981l082k200j949j888j020N29J344Q57N40J655K873
54417A76046J880j090l299l129j784r29m32N80J800K139J283j62j586k579k673
54402A66065j653NJ514K421K605K037R54j05p33r72r86q42o98p18o43qQ90R77
54384A70110j38j329j330m60j73j062k138k196j302n70p85j556j883j301k09R05
54368A54583K084L299L698K374k1j485r13N52J107N86K56P49J248R04J40R8J139
54351A70398K432K887K206J066L68M21Q45J207J588K272L094L433L044K536K750
54336B00547L740M736N129N119N166N125M501L485L054L733M688M592L104J114
$$ y = [295170, 285421, 275222, 265483, 257328, 250005, 241595, 231933, 223248, 217303, 213196, 208810, 203489, 198262, 194004, 190374, 186562, 182368, 178387, 175305, 173105, 171156, 169268, 168248, 168777, 170121, 170978, 171518, 173173, 176046, 177926, 176836, 173537, 170408, 168624, 167695, 167263, 167843, 169643, 171782, 173065, 172903, 171317, 168738, 166065, 164412, 164417, 165931, 168352, 170957, 172994, 173948, 173843, 173110, 172138, 171152, 170310, 169612, 168894, 168251, 168243, 169133, 170110, 169972, 168643, 167313, 166853, 166680, 165618, 163480, 161284, 159982, 159412, 158627, 157071, 155188, 153887, 153678, 154583, 156667, 159966, 163664, 166038, 166017, 164532, 163619, 164171, 165278, 165864, 166120, 166869, 168117, 169021, 169161, 169259, 170398, 172830, 175717, 177923, 178989, 179357, 179778, 180623, 181830, 183418, 185690, 188784, 192217, 195261, 197797, 200547, 204287, 209023, 214152, 219271, 224437, 229562, 234063, 237548, 240602, 244335, 249023, 253615, 256719, 257833]
54322B57833l94j207j679k094k423k471k127j597j381j866k939m130n027n397
54308B23101n086m143l014k327k353k794l099k950k487k166k286k724l244l880
54294A80548m484m154k036J005K653J831K60L68K275M027M379M016L983M342M657
54279B03670M688M209L031J657J053J431J961J950J520Q56j88j323j659j002m62
54264B21392r89k099k836l167l431l215k145j268k148m527o310o221n255m886
54250A72895m976m473l454l151l943m537l630j667k12J3l91q79j718k987l753
54235A33137l147j797j225k028l455m549m794l767j493O70Q66r34k524k183o94
54220A02083K17M19R28J718J673O00k88k51n9o56j791k547k432j386N72K926M440
$$ y = [257833, 257439, 256232, 254553, 252459, 250036, 247565, 245438, 243841, 242460, 240594, 237655, 233525, 228498, 223101, 218015, 213872, 210858, 208531, 206178, 203384, 200285, 197335, 194848, 192682, 190396, 187672, 184428, 180548, 176064, 171910, 169874, 170879, 173532, 175363, 175623, 175991, 178266, 182293, 186672, 190688, 194671, 199013, 203670, 208358, 212567, 215598, 217255, 218308, 219739, 221700, 223650, 225170, 226026, 225838, 224515, 222856, 221854, 221392, 220403, 218304, 215468, 212301, 208870, 205655, 203510, 202242, 200094, 195567, 189257, 183036, 177781, 172895, 167919, 163446, 159992, 156841, 152898, 148361, 144731, 143064, 142852, 142865, 142474, 141595, 139877, 136890, 133137, 129990, 128193, 126968, 124940, 121485, 116936, 112142, 108375, 106882, 107552, 108418, 107484, 104960, 102777, 102083, 102300, 102719, 103647, 105365, 107038, 107638, 107350, 107099, 107040, 106384, 104593, 102046, 99614, 98228, 98800, 101726, 106166]
54203A06166M158K517Q71J29L38J254K570L560L388K097P75L18L42k28j719l339
54187A23197m110l717k514j147l11k83n50k55P27J616J888J989K336K362J377
54172A22605O5p8J192K475K625K050J613J211K56j031j746j482o23L30J147J590
54156A32199J372N21n63j426j792j547q49j43K60N36J012J557J575O64q33j928
54140A30615j702k21J257J376J92q58p17R6L67k75j312k258k801k355n71J643
54124A22476K585J661R7n85k96k2k45m33OQ38J295Q96q2q80r18l42O6k93j101
54105A24723j400p44J36J86o06j098m36Q81J646J342L81o57j452j700j235n12
54089A19455m03j198k243k804k821k542j933r05K08Q42Q02L78l0k96o79j518k555
$$ y = [106166, 110324, 112841, 113712, 113841, 114179, 115433, 118003, 121563, 124951, 127048, 127823, 128141, 128483, 128255, 126536, 123197, 119087, 115370, 112856, 111709, 111398, 111115, 110565, 110310, 111037, 112653, 114541, 116530, 118866, 121228, 122605, 122670, 122592, 123784, 126259, 128884, 130934, 132547, 133758, 134014, 132983, 131237, 129755, 129132, 129462, 130609, 132199, 133571, 134092, 133529, 132103, 130311, 128764, 127915, 127772, 128032, 128568, 129580, 131137, 132712, 133376, 132543, 130615, 128913, 128692, 129949, 131325, 131517, 130659, 129942, 130038, 130405, 130130, 128818, 126560, 123759, 121404, 120833, 122476, 125061, 126722, 126819, 126234, 125938, 125916, 125671, 125238, 125244, 126082, 127377, 128273, 128191, 127311, 126393, 126051, 126117, 125824, 124723, 123323, 122579, 122715, 122901, 122295, 121197, 120761, 121642, 123288, 124630, 125011, 124354, 122902, 121202, 119967, 119455, 119052, 117854, 115611, 112807, 109986, 107444, 105511, 104606, 104814, 105656, 106458, 106836, 106806, 106510, 105831, 104313, 101758]
54072A01758k763j463N54J737J674J391J646J967J905J917K241J966L85j534k306
54057A11075j946j536j345q68m22r25k001j933J1K456L649L133J366j004k908
54042A06802l157j973j174j742k154l12L428O482P047N709M004K580J197k00j101
54027A25436j092n02j73m15m03P74K554L179J838k77j626k122k475k542j704l77
54011A20073K74J41K74R33J007J8p21l7J094R20k60l24J541L416L128J031n96
53994A31912l30J181K593L289L214K307Q82J16J124L491N382N592M913M965O005
53979A76636O622N691L875K835L326M583N498N837O136O755P474P974Q348Q865
53965B60455R341R126P941O504N901O274O580N803M155K719K163K309K795L447
$$ y = [101758, 98995, 97532, 98086, 99823, 101497, 102888, 104534, 106501, 108406, 110323, 112564, 114530, 114915, 113381, 111075, 109129, 107593, 106248, 105380, 104958, 104033, 102032, 100099, 100110, 102566, 106215, 109348, 110714, 109710, 106802, 103645, 101672, 100498, 98756, 96602, 96290, 99718, 106200, 113247, 118956, 122960, 125540, 126737, 126537, 125436, 124344, 123842, 123669, 123254, 122851, 123625, 126179, 129358, 131196, 130919, 129293, 127171, 124696, 122154, 120450, 120073, 120347, 120488, 120762, 121695, 122702, 122720, 121999, 121962, 123056, 123976, 123716, 123392, 124933, 128349, 131477, 132508, 131912, 131582, 132763, 135356, 138645, 141859, 144166, 145048, 145164, 146288, 149779, 155161, 160753, 165666, 170631, 176636, 183258, 188949, 192824, 195659, 198985, 203568, 209066, 214903, 221039, 227794, 235268, 243242, 251590, 260455, 269796, 278922, 286863, 293367, 299268, 305542, 312122, 317925, 322080, 324799, 326962, 329271, 332066, 335513]
53951C35513L874L403J983O32L30P17N76m73j591k152k677l854n353o286o445
53936C18197o328o125n609m966m890n482n743m757k951j659j633k467l350l858
53922B58379l935l573k840k007j468j522k178l142l877l862k871j091R20K414
53908B29347K788K079J084O86R84J246Q84K18j2K86L34m22j335j140M28K000K001
53891B41456M96q52p61L99J572K588L925N284N587M533L256K893L304L788M281
53876B81749M962N247M443L201L119M591O077O064M980M569N770P643Q314O692
53862C57421L611J303J331L001M283M279L952M368N384O489P679Q721Q716P584
53848D28122O941Q014R456R043P009N707N885N562L298N12p24p06j179k495l386
$$ y = [335513, 339387, 342790, 344773, 345405, 345735, 346452, 347028, 346555, 344964, 342812, 340135, 336281, 330928, 324642, 318197, 311869, 305744, 300135, 295169, 290279, 284797, 279054, 274297, 271346, 269687, 268054, 265587, 262237, 258379, 254444, 250871, 248031, 246024, 244556, 243034, 240856, 237714, 233837, 229975, 227104, 226013, 226933, 229347, 232135, 234214, 235298, 235984, 236968, 238214, 239098, 239316, 239304, 239590, 239924, 239502, 238167, 237027, 237455, 239455, 241456, 241952, 241100, 240339, 240738, 242310, 244898, 248823, 254107, 259694, 264227, 267483, 270376, 273680, 277468, 281749, 286711, 291958, 296401, 299602, 302721, 307312, 313389, 319453, 324433, 329002, 334772, 342415, 350729, 357421, 361032, 362335, 363666, 366667, 370950, 375229, 379181, 383549, 388933, 395422, 403101, 411822, 420538, 428122, 435063, 443077, 452533, 461576, 468585, 474292, 480177, 485739, 489037, 489549, 488825, 488119, 486940, 484445, 481059]
53833D81059l205k724k698l007l473m394n772o916p333p422p800q366q546q233
53819D01170q004q368r109r506r101q126p240o867o963p343p917q463q517p819
53805B87827o773o070n855n623n038m421m247m442m569m524m601m769m492l562
53791B18841k656k530k946l069k760k661k928k797j815n96J78P33J313J164m39
53776A97032k595l526k801j695j272j331j377j487j667j427o17K2k09r73j277
53761A74800n07J119K631K740R60j446k414j314M59J402J550J786K369K863K967
53746A89965K846L010M009N682O765O230N106N534P658R026P944N818M978N611
53732B70182O349O655O858O630N451L973L210K788J823J072K141M546N745M530
$$ y = [481059, 477854, 475130, 472432, 469425, 465952, 461558, 455786, 448870, 441537, 434115, 426315, 417949, 409403, 401170, 393166, 384798, 375689, 366183, 357082, 348956, 341716, 334849, 327886, 320543, 312626, 304163, 295646, 287827, 281054, 274984, 269129, 263506, 258468, 254047, 249800, 245358, 240789, 236265, 231664, 226895, 222403, 218841, 216185, 213655, 210709, 207640, 204880, 202219, 199291, 196494, 194679, 194083, 194261, 194994, 196307, 197471, 197032, 194437, 190911, 188110, 186415, 185143, 183812, 182435, 180948, 179281, 177854, 177237, 177259, 177050, 176077, 174800, 174293, 175412, 178043, 180783, 181743, 180297, 177883, 176569, 177028, 178430, 179980, 181766, 184135, 186998, 189965, 192811, 195821, 199830, 205512, 212277, 218507, 223613, 229147, 236805, 245831, 253775, 259593, 264571, 270182, 276531, 283186, 290044, 296674, 302125, 306098, 309308, 312096, 313919, 314991, 317132, 321678, 327423, 331953]
53718C31953K508J514J278N64q45k248l154l407l054k697l097l903l808k579j840
53703C07185k828m471m813l705k741k919l645m062m183m268l889k400j61J357
53689B64457J036n98j974k333k292k360j862j94J571J701K41r10n56M30O69O0
53673B57086o78j239j656j705j177m54j26k78n70p49p74p49r10j332j605j300
53657B41784p28n29n05J08J011Q25p39j851q29J504K916K604J755J566K039K652
53641B53583L139L354L236L214L929N178N735M675K602J122J111J821J852R19
53627B95470K27R12K502L487L172K219J469J074J034J553K408K793K450K191K636
53612C25597L116K687J541M44n79j872k889k749j904j866k963l619k535n67L88
$$ y = [331953, 334461, 335975, 337253, 337817, 336972, 334724, 331570, 328163, 325109, 322412, 319315, 315412, 311604, 309025, 307185, 304357, 299886, 295073, 291368, 288627, 285708, 282063, 278001, 273818, 269550, 265661, 263261, 263100, 264457, 265493, 264895, 262921, 260588, 258296, 255936, 254074, 253880, 255451, 257152, 257393, 256483, 255927, 256357, 257026, 257086, 256408, 255169, 253513, 251808, 250631, 250177, 250051, 249773, 249203, 248454, 247680, 246931, 246021, 244689, 243084, 241784, 241056, 240527, 240022, 240130, 241141, 241966, 241227, 239376, 238547, 240051, 242967, 245571, 247326, 248892, 250931, 253583, 256722, 260076, 263312, 266526, 270455, 275633, 281368, 286043, 288645, 289767, 290878, 292699, 294551, 295470, 295697, 296609, 299111, 302598, 305770, 307989, 309458, 310532, 311566, 313119, 315527, 318320, 320770, 322961, 325597, 328713, 331400, 332941, 333385, 332806, 330934, 328045, 325296, 323392, 321526, 318563, 314944, 312409, 311842, 312230]
53597C12230k21j194j152J51J919L083K986J766L44k64J85J020J346Q51o2o92
53581C22296n73J94R08O79p57k427k730j117J044J792Q51l7P41K703L958L478
53565C31003K179J772L031N141O393N538K899L69k4K133N194O898O372M771M006
53550C87675M823O268O904O389N547N036M506L329J903J599L191N594O702N664
53536D55130M000L871N544P173P182N933M665L712K709J837J698K106K236J984
53522E09780K116K822L144K297P92l38p72r17j105j263j025k2J604K878K812J688
53506E24491P88P03P27K76j01K38O77J08j389k511k256q35R63K725M538O345P442
53489E42929O956N070L277K812L162L015K360K339L045L182K367K095L398N136
$$ y = [312230, 312009, 310815, 309663, 309814, 311733, 314816, 317802, 319568, 319912, 319648, 319833, 320853, 322199, 323050, 322988, 322296, 321723, 321917, 322825, 323504, 322747, 320320, 317590, 316473, 317517, 319309, 320160, 320123, 320864, 323567, 327525, 331003, 333182, 334954, 337985, 343126, 349519, 355057, 357956, 358325, 358301, 360434, 365628, 372526, 378898, 383669, 387675, 392498, 398766, 405670, 412059, 417606, 422642, 427148, 430477, 432380, 433979, 437170, 442764, 449466, 455130, 459130, 463001, 468545, 475718, 482900, 488833, 493498, 497210, 499919, 501756, 503454, 505560, 507796, 509780, 511896, 514718, 517862, 520159, 520951, 520613, 519841, 518924, 517819, 516556, 515531, 515509, 517113, 519991, 522803, 524491, 525279, 525982, 526709, 526985, 526884, 527122, 527799, 527907, 526518, 524007, 521751, 520916, 521879, 524604, 529142, 535487, 542929, 549885, 554955, 558232, 561044, 564206, 567221, 569581, 571920, 574965, 578147, 580514, 582609, 586007, 591143]
53475E91143N893O202P212Q259P912O824P246R544J1384J1002R519R036R876J0934
53461G11986J1776J2945J4574J5943J6665J7344J8729K0597K1910K1989K1224
53450I05682K0618K0751K1459K2346K3255K4084K4511K4289K3792K4056K6059
53439A160902K9754L3665L5834L5671L4722L4954L6385L7208L6330L4720L3813
53428A543958L3631L3262L2441L1735L1570L1840L2219L2233L1386K9924K9094
53417A893293K9845L1473L2235L1210K9088K7304K6776K7242K7414K6091K3401
53406B205372K0612J8576J6982J5399J3998J2696J0672P640M648K487K60l136
53394B326206o813q937r462j0233j2330j4914j6843j8036j8788j9043j8885j8927
$$ y = [591143, 597036, 603238, 610450, 618709, 626621, 633445, 640691, 650235, 661619, 672621, 682140, 691176, 701052, 711986, 723762, 736707, 751281, 767224, 783889, 801233, 819962, 840559, 862469, 884458, 905682, 926300, 947051, 968510, 990856, 1014111, 1038195, 1062706, 1086995, 1110787, 1134843, 1160902, 1190656, 1224321, 1260155, 1295826, 1330548, 1365502, 1401887, 1439095, 1475425, 1510145, 1543958, 1577589, 1610851, 1643292, 1675027, 1706597, 1738437, 1770656, 1802889, 1834275, 1864199, 1893293, 1923138, 1954611, 1986846, 2018056, 2047144, 2074448, 2101224, 2128466, 2155880, 2181971, 2205372, 2225984, 2244560, 2261542, 2276941, 2290939, 2303635, 2314307, 2321947, 2326595, 2329082, 2329342, 2326206, 2319393, 2310456, 2300994, 2290761, 2278431, 2263517, 2246674, 2228638, 2209850, 2190807, 2171922, 2152995]
53382B152995j9646k0925k2397k3749k4633k4916k4973k5114k4998k4239k3265
53371A894140k2538k1442j9146j6315j4394j3268j1232p652m117k321k069k143
53359A757503k036j802j190J10J739L043M015N379P826J1273J4690J6846J7668
53346A835064J8635K1058K4320K6819K8357L0170L2622L4481L5042L5420L6850
53335B158838L9053M1282M3932M7704N1894N4863N6070N6629N7869O0036O2459
53324B730629O4449O5963O7556O9493P1017P0946O9241O7368O6782O7449O8056
53313C478949O7224O4344N9861N5044N0975M7570M4056M0306L6815L3270K8389
53302D006803K1788J4953R473N018j6o377j3412k0210k6403l1892l6603m0654
$$ y = [2152995, 2133349, 2112424, 2090027, 2066278, 2041645, 2016729, 1991756, 1966642, 1941644, 1917405, 1894140, 1871602, 1850160, 1831014, 1814699, 1800305, 1787037, 1775805, 1768153, 1764036, 1761715, 1759646, 1757503, 1755467, 1753665, 1752475, 1752585, 1754324, 1757367, 1761382, 1766761, 1774587, 1785860, 1800550, 1817396, 1835064, 1853699, 1874757, 1899077, 1925896, 1954253, 1984423, 2017045, 2051526, 2086568, 2121988, 2158838, 2197891, 2239173, 2283105, 2330809, 2382703, 2437566, 2493636, 2550265, 2608134, 2668170, 2730629, 2795078, 2861041, 2928597, 2998090, 3069107, 3140053, 3209294, 3276662, 3343444, 3410893, 3478949, 3546173, 3610517, 3670378, 3725422, 3776397, 3823967, 3868023, 3908329, 3945144, 3978414, 4006803, 4028591, 4043544, 4053017, 4058035, 4058019, 4051642, 4038230, 4018020, 3991617, 3959725, 3923122, 3882468]
53290C882468m4313m7596n0178n1795n2711n3754n5640n8102n9922o0198n9197
53279C289062n7582n5425n2895n1306n1970n3990n4718n2857m9842m7659m6506
53268B714312m5250m3175m0401l7423l4930l3404l2389l0814k8468k6209k4479
53257B337370k2782k1186k0859k2142k3383k3002k1633k0837k0573j9536j7482
53246B103955j5583j4506j3589j2072j0180q709q214q584r001q446o593l963j036
53233A983479K078M863O412O980Q334J1455J4911J6854J7727J9316K1775K3483
53221B137667K3780K3915K4992K6551K7721K8440K8824K8376K6608K3855K0890
53210B421619J8102J5454J2844J0309Q084O442N147L267M2m093p868j0414j1882
$$ y = [3882468, 3838155, 3790559, 3740381, 3688586, 3635875, 3582121, 3526481, 3468379, 3408457, 3348259, 3289062, 3231480, 3176055, 3123160, 3071854, 3019884, 2965894, 2911176, 2858319, 2808477, 2760818, 2714312, 2669062, 2625887, 2585486, 2548063, 2513133, 2479729, 2447340, 2416526, 2388058, 2361849, 2337370, 2314588, 2293402, 2272543, 2250401, 2227018, 2204016, 2182383, 2161546, 2140973, 2121437, 2103955, 2088372, 2073866, 2060277, 2048205, 2038025, 2029316, 2021102, 2012518, 2003517, 1995071, 1988478, 1984515, 1983479, 1985557, 1990420, 1996832, 2003812, 2012146, 2023601, 2038512, 2055366, 2073093, 2092409, 2114184, 2137667, 2161447, 2185362, 2210354, 2236905, 2264626, 2293066, 2321890, 2350266, 2376874, 2400729, 2421619, 2439721, 2455175, 2468019, 2478328, 2486412, 2492854, 2498001, 2501268, 2501310, 2497217, 2489349, 2478935, 2467053]
53197B467053j3053j4853j7738k0985k3044k3386k3529k5318k8599l1568l3118
53186B211862l3580l3427l2723l1945l1902l2413l2302l1195l0166k9951k9718
53175A862540k8484k6866k6288k7001k7838k7811k7009k5940k4856k3868k3251
53164A573328k3193k3406k3166k1742j8990j5638j3025j2143j2730j3472j3453
53153A382370j3262j4095j5779j6536j5392j3903j4293j6423j8136j8449j8535
53142A207567j9178j9333j8278j7349j7830j8546j7587j5488j4621j5815j7586
53131A015956j8531j8532j7643j5820j4152j4390j6561j8591j8969j8372j7984
53120H26411j7723j7120j6576j6449j5954j4173j1579r518q691r054j0529j2693
$$ y = [2467053, 2454000, 2439147, 2421409, 2400424, 2377380, 2353994, 2330465, 2305147, 2276548, 2244980, 2211862, 2178282, 2144855, 2112132, 2080187, 2048285, 2015872, 1983570, 1952375, 1922209, 1892258, 1862540, 1834056, 1807190, 1780902, 1753901, 1726063, 1698252, 1671243, 1645303, 1620447, 1596579, 1573328, 1550135, 1526729, 1503563, 1481821, 1462831, 1447193, 1434168, 1422025, 1409295, 1395823, 1382370, 1369108, 1355013, 1339234, 1322698, 1307306, 1293403, 1279110, 1262687, 1244551, 1226102, 1207567, 1188389, 1169056, 1150778, 1133429, 1115599, 1097053, 1079466, 1063978, 1049357, 1033542, 1015956, 997425, 978893, 961250, 945430, 931278, 916888, 900327, 881736, 862767, 844395, 826411, 808688, 791568, 774992, 758543, 742589, 728416, 716837, 707319, 698628, 689574, 679045, 666352]
53108F66352j4183j3658j1415r231q508r105r933j0114r428q123o631n369m793
53095E45861n361o936q226p695n479l744m397o756q338p791o083m639l394j468
53081D65554P23J253j038m772p291p410o207n174m467l447k148j438j886l095
53067D19157m143m301l471k236j357r98p52n79j074k398l619l801l263k878k664
53052C81623j982q96k19k57m36k53K07O40P40K49n48o17N66J932K092J464J715
53035C86020L166M275M003L125K547J787J15j894l037k962k072o35R84J828J180
53020C98430k50r18l25L65k99k432m685n591n001m109m047m524m326k992j526
53005C57770j314k733m885o408o569n888n538n944o308n938n252m851m305l022
$$ y = [666352, 652169, 638511, 627096, 617865, 609357, 600252, 590319, 580205, 570777, 562654, 556023, 550654, 545861, 540500, 533564, 525338, 517643, 512164, 508420, 504023, 497267, 488929, 481138, 475055, 470416, 467022, 465554, 466277, 467530, 466492, 461720, 454429, 447019, 440812, 435638, 431171, 427724, 425576, 424138, 422252, 419157, 415014, 410713, 407242, 405006, 403649, 402651, 401899, 401320, 400246, 397848, 394229, 390428, 387165, 384287, 381623, 379641, 378745, 378526, 378269, 377833, 377580, 377787, 378427, 379167, 379416, 378868, 378251, 378817, 380749, 382841, 384305, 386020, 389186, 393461, 397464, 400589, 403136, 404923, 405038, 403144, 400107, 397145, 395073, 394438, 395422, 397250, 398430, 398180, 397262, 396937, 397302, 397003, 394571, 389886, 384295, 379294, 375185, 371138, 366614, 362288, 359296, 357770, 356456, 353723, 348838, 342430, 335861, 329973, 324435, 318491, 312183, 306245, 300993, 296142, 291837, 288815]
52991B88815j723j675k721l512l436k909j929j91J364J113p69k239k417k666l872
52976B61233m671l682j677j08R56J811J622k15k374l199l115l559m252l656j759
52961B33355l55m65j180j287o14L89J247J356L63j164k193k285j624m12Q80J266
52945B27277M44k68M75J816J646l98k420k864k146j356p90l00R6N36J356K239
52929B25343K196Q74q12j764j740j131l67J32J93K89J031K153K684K227J382P33
52913B33423L74M54J132J823J543M82J46J332K888L221K290J329J227K002L331
52898B56997M825N904O022N058L340J572O89J259K760M063M821N725P164Q429
52884C18628Q776Q415P825O900N533M413M235M477M004K670J420Q34N22Rm95n39
$$ y = [288815, 287092, 285417, 282696, 279184, 275748, 272839, 270910, 270719, 272083, 273196, 272427, 270188, 267771, 265105, 261233, 256562, 252880, 251203, 251095, 252051, 253862, 255484, 255269, 252895, 249696, 246581, 243022, 238770, 235114, 233355, 233000, 232535, 231355, 230068, 229454, 229843, 231090, 232446, 232809, 231645, 229452, 227167, 225543, 225131, 226011, 227277, 227721, 227453, 227928, 229744, 231390, 230992, 228572, 225708, 223562, 222206, 221416, 221116, 221212, 221748, 223104, 225343, 227539, 228413, 227601, 225837, 224097, 222966, 222599, 222731, 222924, 223213, 224244, 226397, 229081, 231308, 232690, 233423, 233797, 234251, 235383, 237206, 238749, 239231, 239377, 240709, 243597, 246818, 249108, 250437, 251664, 253666, 256997, 261822, 267726, 273748, 278806, 282146, 283718, 284407, 285666, 288426, 292489, 297310, 303035, 310199, 318628, 327404, 335819, 343644, 350544, 356077, 360490, 364725, 369202, 373206, 375876, 377296, 378130, 378652, 378661, 378166, 377627]
52868C77627j55J49j24j016k034k559k612k872l692m405m230l399k685k084j067
52853C44842l3k49j902l409l474k868k967l249j874J185L277K164r75k804j677
52838C25987Q35K265J997J256J102J336J315R88O19M1j056k110j741N73L385M511
52822C41303L338J288R2J90R16J400J104J73l28O52K548L402K370J047J187K072
52806C62754J698K2q97o3J030P65m62j365j600j414n92R72K430K843K431J889
52790C70441J155Ko42M64K797M201L440J559L21K13N31P91J220J999K594K222
52774C93308R53J1N81K346L716L613K446J167J88k88K31J725K988K758J306Km35
52757D16616l93l02j73j71o06j289j756k267l562n374o229n327l790l322m064
$$ y = [377627, 377472, 377621, 377497, 376481, 374447, 371888, 369276, 366404, 362712, 358307, 354077, 350678, 347993, 345909, 344842, 344809, 344560, 342658, 339249, 335775, 332907, 329940, 326691, 324817, 326002, 329279, 331443, 330468, 327664, 325987, 326822, 329087, 331084, 332340, 333442, 334778, 336093, 337081, 337700, 337741, 336685, 334575, 332834, 333407, 336792, 341303, 344641, 345929, 346021, 346211, 347127, 348527, 349631, 349804, 349476, 350128, 352676, 356078, 358448, 359495, 360682, 362754, 364452, 364474, 363577, 363514, 364544, 365309, 364847, 363482, 361882, 360468, 359876, 360848, 363278, 366121, 368552, 370441, 371596, 371598, 370956, 371420, 374217, 378418, 381858, 383417, 383738, 383951, 384482, 385273, 386493, 388492, 391086, 393308, 394261, 394272, 394853, 397199, 400915, 404528, 406974, 408141, 408329, 408041, 408272, 409997, 412985, 415743, 417049, 417051, 416616, 416223, 415921, 415748, 415577, 414971, 413682, 411926, 409659, 406097, 400723, 394494, 389167, 385377, 382055, 377991]
52742C77991m609l910k531j880k677m375n838o271n506l795j687j4N38m2j174
52727C34220k339l230l422k668j661j695l134m863n699n559m843l643k313j855
52713B87296k677l616l352k179j388j404j804k540l779m812m661l600k711k097
52699B46676j030J84J72j370l048l692l491k882j788o99q98k573l940l396j764
52684B16461j149k100l123k812j532p73j330k450k808k266k063k943l821l274
52670A84017j740q95j145j369j093j094j428p67J359L271L328K132J315J094M23
52655A87408j041k435k795j913m07M79k38k050l247k968k129j802j691j031K1
52640A64161Q50J355J645J567J332J596K121J588k88j852j903j525j908j935q2
$$ y = [377991, 373382, 369472, 366941, 365061, 362384, 358009, 352171, 345900, 340394, 336599, 334912, 334898, 335436, 335394, 334220, 331881, 328651, 325229, 322561, 320900, 319205, 316071, 311208, 305509, 299950, 295107, 291464, 289151, 287296, 284619, 281003, 277651, 275472, 274084, 272680, 270876, 268336, 264557, 259745, 255084, 251484, 248773, 246676, 245646, 245830, 246002, 244632, 241584, 237892, 234401, 231519, 229731, 229032, 228134, 225561, 221621, 218225, 216461, 215312, 213212, 210089, 207277, 205745, 204972, 203642, 201192, 198384, 196118, 194055, 191112, 187291, 184017, 182277, 181382, 180237, 178868, 177775, 176681, 175253, 174486, 175845, 179116, 182444, 184576, 185891, 186985, 187408, 186367, 183932, 181137, 179224, 178817, 179296, 179058, 177008, 173761, 170793, 168664, 166862, 165171, 164140, 164161, 165011, 166366, 168011, 169578, 170910, 172506, 174627, 176215, 175927, 174075, 172172, 170647, 168739, 166804, 166722]
52625A66722K511L375K400J620J755J701J326K027L937N243N034M532M636M515
52611B11334L668L197L590L359J522l13l69M23N2j218j477n08j55j389l116m090
52595B14510m393m513m398l878l089k206j516j776l252m517l564n39J913J691
52581A80473m41k245k690k295j672q69P1P64P52j52j466j815n4K878M179K349
52565A77767o64j710l50J087J020L50L76Q40R16O81M14m27k231m055m681m253
52549A65080l624k677q09J337K213J576Q51J095J885K524K908K785J502o85k176
52534A73785j853m88M82P89J122J778K464K860K619J424j57o40N88K052J975P02
52518A89502J29R57J987K141J822J873K285K528K435K201J998J899J835J611J296
$$ y = [166722, 169233, 172608, 175008, 176628, 178383, 180084, 181410, 183437, 187374, 192617, 197651, 202183, 206819, 211334, 215002, 218199, 221789, 225148, 226670, 226357, 225988, 226411, 226463, 225245, 223768, 223260, 223105, 221716, 218600, 214510, 210117, 205604, 201206, 197328, 194239, 192033, 190517, 188741, 185489, 180972, 177408, 176869, 178782, 180473, 180032, 177787, 175097, 172802, 171130, 170261, 170332, 171096, 171848, 171696, 170230, 168415, 168361, 171239, 175418, 177767, 177103, 175393, 175043, 176130, 177150, 177500, 177876, 178716, 179632, 180313, 180727, 180300, 178069, 174014, 169333, 165080, 161456, 158779, 157970, 159307, 161520, 163096, 163947, 165042, 166927, 169451, 172359, 175144, 176646, 175961, 173785, 171932, 171444, 171926, 172715, 173837, 175615, 178079, 180939, 183558, 184982, 184825, 184185, 184773, 186825, 188800, 189502, 189631, 190588, 192575, 194716, 196538, 198411, 200696, 203224, 205659, 207860, 209858, 211757, 213592, 215203, 216499]
52503B16499J512K616L675L235J338k21j27Q08R73J97k22N41J799K343J846R72
52487B37784M77M69N27L58K30O98J975L683N173N926N661M417K640R37l71j296
52471B69288j742j348o6J350J880J313M53J37L75O06M95J07n17j309j731j077
52455B68214L90J304P62l70n05O01J675J717J072O88J119K397L936M361K472j023
52439B88810l560l254q75J254J726Q79k07p04m85k02o72j772k353j697m14O10
52423B77084J376K151K459J755P18Q08K608N152O688N748K327j382k384j45K320
52408C07283J890r14l005k783j327RJ040J658J343L17k92q4K18L00P62J558J534
52391C09507M44j64Q91K514K892J974J115R13P77M01M70J604L261M030L085J311
$$ y = [216499, 218011, 220627, 224302, 227537, 228875, 228654, 228527, 229335, 230308, 230505, 230283, 230824, 232623, 234966, 236812, 237784, 238261, 238730, 239257, 239615, 239845, 240543, 242518, 246201, 251374, 257300, 262961, 267378, 270018, 270955, 270584, 269288, 267546, 266198, 266132, 267482, 269362, 270675, 271128, 271265, 271640, 272246, 272741, 272848, 272331, 271022, 269291, 268214, 268604, 269908, 270670, 270300, 269795, 270396, 272071, 273788, 274860, 275548, 276667, 279064, 283000, 287361, 289833, 288810, 285250, 281996, 281121, 282375, 284101, 284980, 284773, 284069, 283584, 283382, 282710, 280938, 278585, 276888, 276474, 277084, 278460, 280611, 283070, 284825, 285543, 286351, 288959, 294111, 300799, 306547, 308874, 307492, 305108, 304963, 307283, 309173, 308259, 305254, 302471, 301144, 301153, 302193, 303851, 305194, 305511, 305219, 305135, 305353, 305653, 306415, 307973, 309507, 309951, 309787, 310678, 313192, 316084, 318058, 319173, 320086, 320863, 321264, 321734, 323338, 326599, 330629, 333714, 335025]
52375C35025N87J494K302J209r61j833j022o01j621k311r38J393K394J682N15
52360C37314l87r21m42J392L015K217q09l349l355j418N91J549J458R36R08J848
52344C40547K993K974J562J34J27J503K914K990J483m80j389r92n33r16j297m83
52328C51137R28J265L84q5P51J802J766Q89J83LJ52N80J210J688J944K341K772
52311C69710K430J169K78R07K389L118K662J942J594J330R02N10O1r34k220k413
52295C83435m98K706N229N855M912L481K405K009K143K340K310K383L216M926
$$ y = [335025, 335612, 337106, 339408, 340617, 339656, 337823, 336801, 336200, 334579, 332268, 331330, 332723, 335117, 336799, 337314, 336927, 336006, 335564, 336956, 339971, 342188, 341379, 338030, 334675, 333257, 333848, 335397, 336855, 337791, 338699, 340547, 343540, 346514, 348076, 348210, 348337, 349840, 352754, 355744, 357227, 356747, 355358, 354366, 353833, 352917, 351620, 351137, 352065, 353330, 353714, 353629, 354380, 356182, 357948, 358837, 359020, 359023, 359175, 359755, 360965, 362653, 364597, 366938, 369710, 372140, 373309, 373587, 374494, 376883, 380001, 382663, 384605, 386199, 387529, 388431, 388941, 389002, 388068, 385848, 383435, 382937, 385643, 390872, 396727, 401639, 405120, 407525, 409534, 411677, 414017, 416327, 418710, 421926, 426852]
$$ [...]
##END NTUPLES=NMR SPECTRUM
##END=
