
##TITLE=AC1186_Casanare-tamara1_5898636_CUwkp1tA16
##JCAMPDX= 6.0         $$ Bruker NMR JCAMP-DX V2.0
##DATA TYPE= NMR SPECTRUM
##DATA CLASS= NTUPLES
##ORIGIN= BRUKER
##OWNER= Administrator
$$ 1.72 TOPSPIN		Version 2.1
$$ 2012-04-10 10:35:54.250 -0500  Administrator@TOPSPIN
$$ Compression mode = diff/dup
##.OBSERVE FREQUENCY= 400.13188235
##.OBSERVE NUCLEUS= ^1H
##.ACQUISITION MODE= SIMULTANEOUS (DQD)
##.ACQUISITION SCHEME= undefined
##.AVERAGES= 8
##.DIGITISER RES= 22
##SPECTROMETER/DATA SYSTEM= spect
##.PULSE SEQUENCE= zg30
##.SOLVENT NAME= COFFEE_meoh
##.SHIFT REFERENCE= INTERNAL, COFFEE_meoh, 1, 14.98061
##AUDIT TRAIL= $$ (NUMBER, WHEN, WHO, WHERE, PROCESS, VERSION, WHAT)
$$ ##TITLE= Audit trail, TOPSPIN		Version 2.1
$$ ##JCAMPDX= 5.01
$$ ##ORIGIN= Bruker BioSpin GmbH
$$ ##OWNER= Administrator
$$ $$ C:\Bruker\TOPSPIN/data/COFFEE/nmr/AC1186_Casanare-tamara1_5898636_CUwkp1tA16/10/pdata/1/auditp.txt
$$ ##AUDIT TRAIL=  $$ (NUMBER, WHEN, WHO, WHERE, PROCESS, VERSION, WHAT)
(   1,<2012-04-03 18:39:54.640 -0500>,<Administrator>,<TOPSPIN>,<go>,<TOPSPIN 2.1>,
      <created by zg
	started at 2012-04-03 18:38:48.093 -0500,
	POWCHK enabled, PULCHK disabled,
       configuration hash MD5:
       1A 1E CE 29 27 FD 77 03 67 4E F0 E3 C4 B2 CB 90
       data hash MD5: 64K
       2A 83 90 40 38 4C 85 CD 37 51 FB 96 15 23 AC BC>)
(   2,<2012-04-03 18:39:57.296 -0500>,<Administrator>,<TOPSPIN>,<proc1d>,<TOPSPIN 2.1>,
      <Start of raw data processing
       efp LB = 0 FT_mod = 6 PKNL = 1 PHC0 = 0 PHC1 = 0 SI = 32K 
       data hash MD5: 32K
       6F 9A 79 EC 15 F6 60 81 4B 72 F1 6C 42 BE 04 C5>)
(   3,<2012-04-03 18:39:57.734 -0500>,<Administrator>,<TOPSPIN>,<proc1d>,<TOPSPIN 2.1>,
      <pk PHC0 = 211.8878 PHC1 = 0 
       data hash MD5: 32K
       36 C2 BD F3 74 0F 71 1C 3B 26 FC BC ED CA CE 10>)
(   4,<2012-04-03 18:39:57.843 -0500>,<Administrator>,<TOPSPIN>,<proc1d>,<TOPSPIN 2.1>,
      <abs ABSG = 1 
       data hash MD5: 32K
       BB 95 65 02 14 70 4B 07 3D AC 02 2D 20 28 5A A0>)
(   5,<2012-04-03 18:39:57.875 -0500>,<Administrator>,<TOPSPIN>,<proc1d>,<TOPSPIN 2.1>,
      <abs ABSG = 2 
       data hash MD5: 32K
       0F 69 30 D0 30 34 CF CE 04 B9 D5 8E 78 F5 B7 91>)
(   6,<2012-04-03 18:39:57.906 -0500>,<Administrator>,<TOPSPIN>,<proc1d>,<TOPSPIN 2.1>,
      <abs ABSG = 3 
       data hash MD5: 32K
       49 B3 C8 96 AF F6 1B 2A E1 5B 59 24 18 9B 42 37>)
(   7,<2012-04-03 18:39:57.937 -0500>,<Administrator>,<TOPSPIN>,<proc1d>,<TOPSPIN 2.1>,
      <abs ABSG = 4 
       data hash MD5: 32K
       3C FC D3 3B 3B 50 66 EC 34 33 3B A8 3E 9D BC 7F>)
(   8,<2012-04-03 18:39:57.968 -0500>,<Administrator>,<TOPSPIN>,<proc1d>,<TOPSPIN 2.1>,
      <abs ABSG = 5 
       data hash MD5: 32K
       FB 28 63 D6 71 CE 37 77 75 A7 FF 3E DE DE 90 C8>)
(   9,<2012-04-03 18:40:02.421 -0500>,<Administrator>,<TOPSPIN>,<audit>,<TOPSPIN 2.1>,
      <user comment:
       ICON-NMR User ID: COFFEE
       data hash MD5: 32K
$$ [...]
##$TP= (0..7)
150 150 150 150 150 150 150 150
##$TP07= 0
##$TPNAME0= <>
##$TPNAME1= <>
##$TPNAME2= <>
##$TPNAME3= <>
##$TPNAME4= <>
##$TPNAME5= <>
##$TPNAME6= <>
##$TPNAME7= <>
##$TPOAL= (0..7)
0.5 0.5 0.5 0.5 0.5 0.5 0.5 0.5
##$TPOFFS= (0..7)
0 0 0 0 0 0 0 0
##$TUNHIN= 0
##$TUNHOUT= 0
##$TUNXOUT= 0
##$USERA1= <user>
##$USERA2= <user>
##$USERA3= <user>
##$USERA4= <user>
##$USERA5= <user>
##$V9= 5
##$VALIST= <valist>
##$VCLIST= <CCCCCCCCCCCCCCC>
##$VD= 0
##$VDLIST= <DDDDDDDDDDDDDDD>
##$VPLIST= <PPPPPPPPPPPPPPP>
##$VTLIST= <TTTTTTTTTTTTTTT>
##$WBST= 2048
##$WBSW= 25
##$XGAIN= (0..3)
0 0 0 0
##$XL= 0
##$YL= 0
##$YMAX_a= 534381
##$YMIN_a= -656550
##$ZGOPTNS= <>
##$ZL1= 120
##$ZL2= 120
##$ZL3= 120
##$ZL4= 120
##$ABSF1= 14.98061
##$ABSF2= -5.57192
##$ABSG= 5
##$ABSL= 3
##$ALPHA= 0
##$AQORDER= 0
##$ASSFAC= 0
##$ASSFACI= 0
##$ASSFACX= 0
##$ASSWID= 0
##$AUNMP= <proc_prof1d_extract_pilot.lims>
##$AXLEFT= 0
##$AXNAME= <>
##$AXNUC= <1H>
##$AXRIGHT= 0
##$AXTYPE= 0
##$AXUNIT= <>
##$AZFE= 0.1
##$AZFW= 0.1
##$BCFW= 0
##$BC_mod= 0
##$BYTORDP= 0
##$COROFFS= 0
##$CY= 15
##$DATMOD= 1
##$DC= 0
##$DFILT= <>
##$DTYPP= 0
##$F1P= 0
##$F2P= 0
##$FCOR= 0.5
##$FTSIZE= 32768
##$FT_mod= 6
##$GAMMA= 0
##$GB= 0
##$INTBC= 1
##$INTSCL= 1
##$ISEN= 128
##$LB= 0
##$LEV0= 0
##$LPBIN= 0
##$MAXI= 10000
##$MC2= 0
##$MEAN= 0
##$ME_mod= 0
##$MI= 0
##$NCOEF= 0
##$NC_proc= -8
##$NLEV= 6
##$NOISF1= 0
##$NOISF2= 0
##$NSP= 0
##$NTH_PI= 0
##$NZP= 0
##$OFFSET= 14.98061
##$PC= 1
##$PHC0= 211.8878
##$PHC1= 0
##$PH_mod= 1
##$PKNL= yes
##$PPARMOD= 0
##$PPDIAG= 0
##$PPIPTYP= 0
##$PPMPNUM= 2147483647
##$PPRESOL= 1
##$PSCAL= 4
##$PSIGN= 0
##$PYNMP= <proc.py>
##$REVERSE= no
##$SF= 400.13
##$SI= 32768
##$SIGF1= 0
##$SIGF2= 0
##$SINO= 400
##$SIOLD= 32768
##$SPECTYP= <>
##$SREGLST= <1H.CDCl3>
##$SSB= 0
##$STSI= 32768
##$STSR= 0
##$SW_p= 8223.68421052632
##$SYMM= 0
##$S_DEV= 0
##$TDeff= 65536
##$TDoff= 0
##$TI= <>
##$TILT= no
##$TM1= 0
##$TM2= 0
##$TOPLEV= 0
##$USERP1= <user>
##$USERP2= <user>
##$USERP3= <user>
##$USERP4= <user>
##$USERP5= <user>
##$WDW= 1
##$XDIM= 32768
##$YMAX_p= 471004221
##$YMIN_p= -690717
##$CURPLOT= <Network HP LaserJet P1505>
##$CURPRIN= <$Network HP LaserJet P1505>
##$DFORMAT= <normdp>
##$LAYOUT= <+/1D_H.xwp>
##$LFORMAT= <normlp>
##$PFORMAT= <normpl>
##$SURQMSG= 1
$$ End of Bruker specific parameters
$$ ---------------------------------
##NTUPLES= NMR SPECTRUM
##VAR_NAME=  FREQUENCY,     SPECTRUM/REAL,   SPECTRUM/IMAG
##SYMBOL=    X,             R,               I
##VAR_TYPE=  INDEPENDENT,   DEPENDENT,       DEPENDENT
##VAR_FORM=  AFFN,          ASDF,            ASDF
##VAR_DIM=   32768,         32768,           32768
##UNITS=     HZ,            ARBITRARY UNITS, ARBITRARY UNITS
##FACTOR=    0.250966925370066, 1,           1
##FIRST=     8223.43324360095, -56419,       1306
##LAST=      0,             -3302,           -59889
##MIN=       0,             -690717,         0
##MAX=       8223.43324360095, 471004221,    0
$$ Real data points
##PAGE= N=1
##DATA TABLE= (X++(R..R)), XYDATA
$$ [...]
19478b95367I5682a33572j52304F2041K55990b36690j18275C3548N1244c3288
19467a79977Q6751A4130a71942k0945o320A79669a15786j8224A97980q9191a25676
19455F7241j8035c44107a43801j68832a18956l6799p5388D8748c68865C7283f5356
19443C0875K361b54068h7439C1618J95897e3293j13125A01343c25332K9629J39065
19432a56638B85727C4705b76953R9919C3226a10530M9373g923A28356b97936c9126
19420b95089P9174A4721d7737A22915n5499a95643H548a57708L0802C70187c356
19408a0380p749k27948I0611g9257K1711p1401l12095g7348A60122d9973j41779
19397a91752h4726o959k33302I5404b26883c3503A40128c9064n3361l7983d7337
$$ y = [-295367, 95682, -133572, -285876, 62041, 318031, -236690, -354965, 33548, 84792, -33288, -179977, -93226, 14130, -171942, -192887, -199207, 179669, -115786, -134010, 197980, 108789, -125676, 67241, 49206, -344107, -143801, -312633, -118956, -155755, -231143, 48748, -368865, 37283, -65356, 30875, 33236, -254068, -87439, 31618, 227515, -53293, -166418, 101343, -325332, -295703, -156638, 285727, 34705, -276953, -177034, 33226, -110530, -61157, -7923, 128356, -297936, -39126, -295089, -215915, 14721, -47737, 122915, 67416, -195643, 8548, -157708, -126906, 370187, -3356, -10380, -18129, -246077, 90611, -79257, -57546, -128947, -441042, -77348, 160122, -49973, -191752, -84726, -91685, -324987, 95404, -226883, -33503, 140128, -39064, -92425, -130408, -47337]
19385g1755A12653J444a20779e3645o7652b1403n9834B61823A13971i737l04190
19374c13927F9274a2837k8293H9341A2105P733a11870I6551b02921N2198o1767
19363b12490f8286A59922b9216p4760k3386O2641q3803E4095g5861I4847c19021
19351A58630c04427J03270d9211G0365k4047e2384L161D1822c8130E4494a01563
19339a86608I1264i1848K7152B2348b5715j53249A4875b9863j11125l0698A12603
19327G2025a70411M2964j16002n9004I1108J3056K5264D5898K4163c79651a50296
19315B29548b18560b9534k09799D0223c7872k14801r1275a6916j70830C4702P936
19304D2638K00154a78955g3051L5397q7199B64049J04408j03013H4525j9288a8252
$$ y = [-71755, 112653, 114097, -120779, -53645, -121297, -21403, -81237, 261823, 113971, -9737, -313927, 69274, -12837, -41130, 89341, 12105, 19838, -111870, 96551, -202921, -150723, -212490, -68286, 159922, -29216, -103976, -127362, -64721, -148524, 54095, -75861, 94847, -319021, 158630, -304427, -201157, -49211, 70365, 46318, -52384, -49223, 41822, -38130, 54494, -101563, -186608, 91264, -91848, -64696, 22348, -25715, -178964, 14875, -29863, -140988, -171686, 112603, 72025, -170411, -127447, -243449, -302453, 91108, 104164, 129428, 45898, 70061, -379651, -150296, 229548, -218560, -29534, -239333, 40223, -37872, -252673, -343948, -16916, -187746, 34702, 42638, 242792, -178955, -73051, -37654, -124853, 264049, 368457, 265444, 84525, 65237, -18252]
19292c88216J49324F1443L3701C1155b01551p4145B13630C7336f7463a8134p1143
19281h9277A12974C9230a096A63692b9067A91512G0669c19683O136i6446m9778
19270a46224C5842c27176J00596B3510L606J11752d3340l74137B63375A17982
19259a44157q6967J14231m5013k7333j19243J05134q3504J08124f6359n3245Q212
19248a11392j58501f1348q1915O5562H0069e3218m4116j00439B56983a6254E8361
19236a36911H4595c6732l45957J48513J02358M7295c5072B203a39223l47951P0297
19225d16877g1887D6171a92614K9472L020D863f7486F970a28148e9996A03312
19213b35319A4799a22315j36869H9025c8082j67353d9194c70F9813j1143P1129
$$ y = [-388216, -238892, 61443, 95144, 31155, -201551, -275696, 213630, 37336, -67463, -18134, -89277, 112974, 39230, -1096, 163692, -29067, 191512, 70669, -319683, -313547, -96446, -146224, 35842, -327176, -226580, 23510, 27116, 138868, -43340, -417477, 263375, 117982, -144157, -231124, -116893, -161906, -189239, -308482, -203348, -286852, -178728, -66359, -119604, -111392, -269893, -61348, -143263, -77701, 80069, -53218, -97334, -197773, 256983, -16254, 58361, -136911, 84595, -36732, -382689, -234176, -131818, -84523, -35072, 2203, -139223, -487174, -416877, -71887, 46171, -192614, -163142, -160122, 4863, -67486, 6970, -128148, -59996, 103312, -235319, 14799, -122315, -259184, 89025, -38082, -205435, -49194, -370, 69813, 58670, 129799]
19202A29799J71168a51151B4226b12589j68827a58801L2281B54679D2250d975
19191d3009o0369B21427K4249e36371d600A31167c9215k01510A73440G4563e0653
19179i2653A32712d278C2600b60418L3771i9642m4546p0952O4406P0770k41438
19168c21402O5012g1706K8097j79983H0905d4456p8140A39047b21871d0249A55451
19156D1948c29124A98674d69109a64040j04664h7018j24544A75732c43559g6445
19145G0630a26453j0147A37184A1920M69287e39757b54575A19404a20339G2403
19134a2550G8526b09088A05323K5107a6179A62438n348b55410p447c2400e49G1348
19121g4250k51314M1474k2552N446A6847b38319A08121b44951A73323c38707a47457
$$ y = [129799, 300967, -151151, 24226, -212589, -381416, -158801, -126520, 254679, 42250, -4975, -43009, -103378, 221427, 245676, -536371, -4600, 131167, -39215, -240725, 173440, 74563, -50653, -92653, 132712, -4278, 32600, -260418, -226647, -99642, -144188, -215140, -150734, -79964, -321402, -256390, -71706, -43609, -223592, 80905, -44456, -122596, 139047, -221871, -40249, 155451, 41948, -329124, 198674, -469109, -164040, -268704, -87018, -211562, 175732, -343559, -76445, 70630, -126453, -136600, 137184, 11920, 481207, -539757, -254575, 119404, -120339, 72403, -12550, 78526, -209088, 105323, 130430, -16179, 162438, 157090, -255410, -262857, -32400, -549, 71348, -74250, -325564, -284090, -306642, -301196, 16847, -238319, 108121, -244951, 173323, -338707, -147457]
19109c09637c5664A39512a59248E168c93117a03335E7197a69854p519A8929A189
19097A17820M1914R3012A07548c14580c6189J4379m5099q6989d4741r0890N6672
19086g8959A9558i8842k26082Q8416a06683j93612E4163b81577a17123e570o143
19075a1713l48370a891A54307e1778k55383J8678I5430C1753d8645A91371f8743
19063C27057a27839K5974j2855A1591J560K06595J29258a21132C28742D0102d8346
19051a12706I1316c43233B97347j35259g9728a6551H9947L3459j544C9119K9836
19040F8955a61537A2259O5421a50505j8424B80221F2551J65199f0915j13006H3076
19028a11785n6705B9148Q7618f1900A40779L2338K3245j3971M4871a28899k70817
$$ y = [-309637, -35664, 139512, -159248, 5168, -393117, -103335, 57197, -169854, -177373, 18929, 1189, 117820, 159734, 252746, 107548, -314580, -36189, -21810, -66909, -153898, -44741, -135631, -78959, 19558, -98842, -324924, -236508, -106683, -300295, 54163, -281577, -117123, -5570, -11713, -360083, -1891, 154307, -51778, -307161, -288483, 95430, 31753, -48645, 191371, -68743, 327057, -127839, -101865, -114720, 11591, 13151, 219746, 349004, -121132, 328742, 40102, -48346, -112706, 91316, -343233, 297347, 162088, -79728, -16551, 89947, 123406, 121862, 39119, 68955, -161537, 12259, 77680, -150505, -168929, 280221, 62551, 227750, -60915, -173921, 83076, -111785, -168490, 29148, 116766, -61900, 140779, 173117, 196362, 182391, 227262, -128899, -399716]
19017c99716a02180D5293N4298h3686C24787j49159g0953k01930G6461a04492
19006A85915l3991a74762g3373K7858N089j92238L6390N4274G739c81558h0874
18994B90026e2729l6134j47601b2473j26572J3702A90946G29a81432A43604a12224
18982a30346k9818C37452a49543B42351b92694A22245a30346I6120h0992N203
18972g5789k1394A21435d6653l11932a49938A90635F1226d10316i4748k1298e6594
18960A57281b0638B59965L8019Q6772O5449H9614I974K51564E6434b3685k0534
18949d4219p3946H7595h4020l22195J28796C9752a99602i1930j19333A7282d18540
18937A04835a49389k77074B09620i9365F4597A160N060K03440b00319a00071K3357
$$ y = [-399716, -102180, 45293, 99591, -83686, 324787, 175628, -70953, -272883, 76461, -104492, 185915, 151924, -174762, -73373, -45515, -40426, -232664, -196274, -142000, 7739, -381558, -80874, 290026, -52729, -88863, -236464, -22473, -149045, -135343, 190946, 729, -181432, 143604, -112224, -130346, -160164, 337452, -149543, 242351, -292694, 122245, -130346, 96120, -80992, -75789, -97183, 121435, -46653, -358585, -149938, 190635, 61226, -410316, -94748, -116046, -56594, 157281, -20638, 259965, 297984, 384756, 450205, 89614, 9974, 261538, 56434, -23685, -44219, -118165, 87595, -84020, -406215, -277419, 39752, -199602, -91930, -211263, 17282, -418540, 104835, -149389, -426463, 209620, -99365, 64597, 1160, 6220, 209660, -200319, -100071, -76714]
18926g6714j73319A44914k4302B510b44904B1287b17439o5021B00508p6940R861
18915A33429K1512H981Q5892m0871N0491C8121J49522l9191o2565l2265J51140
18904B04762G0569a04251I4970O9762B0500c26968G2355J28030E9578J30196N9384
18893B49158K06645a44797n570A34394C2929J07869J8241b42553a8852j95002
18883b13854p536d1435j24084D9828c8009k08997P3629A11593B9390Q2591g8052
18871h6654B2866L9541a23752a9036k34450j54223D5187e8640i092p963A17507
18859c5550j1504B3569a40821e5161b0090l44484D1494e5287K0647j18921e0019
18847b53684a22694A28905o1b66644A40512c60656e4967C17751i2076j60373G4905
$$ y = [-76714, -250033, 144914, 120612, 2510, -244904, 21287, -217439, -282460, 200508, 123568, 133429, 154941, 8981, 94873, 54002, 104493, 38121, 187643, 148452, 85887, 53622, 204762, 70569, -104251, 94970, 164732, 20500, -326968, 72355, 200385, 59578, 189774, 249158, 455803, -144797, -150367, 134394, 32929, 140798, 159039, -242553, -18852, -213854, -221390, -41435, -165519, 49828, -38009, -247006, -173377, 111593, 29390, 111981, -78052, -86654, 22866, 62407, -123752, -19036, -253486, -407709, 45187, -58640, -9092, -17055, 117507, -35550, -47054, 23569, -140821, -55161, -20090, -364574, 41494, -55287, -34640, -153561, -50019, -253684, -122694, 128905, 128844, -266644, 140512, -360656, -54967, 317751, -92076, -252449, 74905]
18835A93984B9147b08666H140a1957k09425n3592N1915g4225A81633b16841A84623
18823B21229F9426J33309F5636b57987D89163C3650c05297A8967c32045a30072
18812a66342j3353K7658K5439A16868e851j3836o0764j44588e3650n23B85498
18800a14316p3720A05810h4603k7656A61643b24424B52115m8618I2276f2489H3663
18788a9960A28225K06242n3391g8353B7146J37288g9123k72466C62348b15075
18777a87736A02875J51385D2520b37527A90866N1427c27006a50507A25625m2910
18767H2715d1028n36475c7942B23517d5143m9234D4971b56768b8295k4684j66149
18756b19128O690A05323b07417l561B12658C8282b5987l31125l1219I8044h3276
$$ y = [193984, 29147, -208666, 8140, -11957, -221382, -274974, -223059, -74225, 181633, -216841, 184623, 221229, 69426, 202735, 65636, -257987, 489163, 33650, -305297, 18967, -332045, -130072, -166342, -179695, -152037, -126598, 116868, -5851, -19687, -80451, -225039, -53650, -54173, 285498, -114316, -188036, 105810, -84603, -112259, 161643, -224424, 252115, 203497, 92276, -62489, 83663, -19960, 128225, 334467, 281076, -78353, 27146, 164434, -79123, -351589, 362348, -215075, -187736, 102875, 254260, 42520, -237527, 190866, 242293, -327006, -150507, 125625, 82715, -41028, -577503, -37942, 223517, -45143, -94377, 44971, -256768, -28295, -52979, -219128, -212438, 105323, -207417, -210978, 212658, 38282, -25987, -357112, -388331, 98044, -83276]
18744A27060m039N800b88255E2134J8205a79679A27196k3881l5703d20366K00820
18733b19546F8685g8523B69263F1646c20141J48872g0118l8777I3901g3400j40355
18722b13755A31374k5986J5309b91959A75200f5661I8565b31434O234O8805f223
18710A48053a66125A0379c46107f7468j39208O5574j34776P1356A15192K1490
18700A36682e6740o7663e9900A42666O2144b62100f6289r5228g0986C6553K9286
18689F5839c36790c8756k90739B3830c52562A6566j240b8111F9688O2052C484
18677a1120C2880O4203a87071f2226H7997b87632a11647r4441H3845a38656L1158
18666a07498l831b4719j86229H0662b21100e7616j57002A29467P0646n4616E2010
$$ y = [127060, 123021, 128821, -288255, 52134, 70339, -179679, 127196, 103315, 67612, -420366, -219546, 68685, -78523, 269263, 61646, -320141, -171269, -70118, -108895, 93901, -73400, -213755, 131374, 105388, 120697, -291959, 175200, -65661, 98565, -231434, -225200, -156395, -6223, 148053, -166125, 10379, -346107, -67468, -206676, -141102, -275878, -204522, 115192, 136682, -56740, -124403, -59900, 142666, 204810, -262100, -66289, -161517, -70986, 36553, 65839, -336790, -38756, -329495, 23830, -352562, 16566, 15326, -28111, 69688, 131740, 3484, -11120, 32880, 97083, -187071, -62226, 87997, -287632, -111647, -206088, 83845, -138656, -107498, -111329, -24719, -210948, 80662, -221100, -57616, -214618, 129467, 200113, 145497, 52010]
18654a16466j74748j69825d5574j91004B53480G3426c9823j27079B09877o7933
18644A41944f5835o7602r982j619A59276c19541b5966j18815L1524C6114f08761
18632b50678i7775n9099B5505J09421c39505a60725C75240a04999k39341c055
18621A15809b16702O5787A33914l1870O263a10749j4860j8584j55685B00855a17113
18609b3422j07480A88217c35200g7499A46707A3943N5531J1828a08643m067A07472
18597b31745h7065p3962E9355K89507F4681M4853j3060b12359e2697j44266D1019
18585b21943A91194a86561E5868d6340A32114i3139j11764A89476c8077A97724
18574b62238A30478a59033A16958b08544r0717A615R069e3693q3830m2621Q279
$$ y = [-116466, -291214, -461039, -45574, -236578, 253480, 73426, -39823, -166902, 209877, 141944, -65835, -133437, -143419, -145038, 159276, -319541, -25966, -144781, -113257, 36114, -608761, -250678, -97775, -156874, 25505, 134926, -339505, -160725, 375240, -104999, -344340, -3055, 115809, -216702, -150915, 133914, 102044, 108307, -110749, -125609, -144193, -299878, 200855, -117113, -23422, -130902, 188217, -335200, -77499, 146707, 13943, 69474, 81302, -108643, -112710, 107472, -231745, -87065, -161027, 59355, 348862, 64681, 109534, 96474, -212359, -52697, -196963, 41019, -221943, 191194, -186561, 55868, -46340, 132114, -93139, -204903, 189476, -38077, 197724, -262238, 130478, -159033, 116958, -208544, -299261, 1615, 10684, -53693, -137523, -180144, -171865]
18563a71865A28826J6031a37534l8881e9662l15616A7724N5886a07119B58885
18552A7201f6751B4563J40449f1972j24030h0277k25597C74609a97460A81548
18541a3438k28243G1291a96879B90484c80632g2736A2723a36008r6435B02427
18530a64363B66811j25066b90758M8581i9000l5139C7528a87711R1334N599k43100
18519c33878L2172e0069C26093d12616k12962C6886h0333H1751P0216i0937A36446
18507A43873b1886j01001G8428J11443a03669c3004l23147i1828p1113q483O5586
18496a05838A21567I488K33528a04735J3219a5620A03730h4148E7455L0396k8204
18485E9647a65706j07297i5624m331B03214K2597a60740D4995e03649J55580b1812
$$ y = [-171865, 128826, 144857, -137534, -176415, -59662, -375278, 17724, 73610, -107119, 258885, 17201, -66751, 24563, 165012, -61972, -186002, -80277, -305874, 374609, -197460, 181548, -13438, -241681, 71291, -196879, 290484, -380632, -72736, 12723, -136008, -232443, 202427, -164363, 266811, 141745, -290758, -242177, -99000, -134139, 37528, -187711, -96377, -90778, -333878, -301706, -50069, 326093, -412616, -625578, 36886, -80333, 81751, 151967, -90937, 136446, 143873, -21886, -122887, 78428, 189871, -103669, -33004, -356151, -91828, -162941, -171424, -105838, 121567, 9488, 243016, -104735, -91516, -15620, 103730, -84148, 57455, 87851, 59647, -165706, -273003, -95624, -99955, 203214, 225811, -160740, 44995, -503649, -348069, -21812]
18473h4914B87910a00477k16118i4820i229A68058C16J72346C9611M0749m710
18462G5650k9239a4919B28637b22054D812O9905d31729f1796b5311A01497O8738
18451A70235F9301c18475l1519J37378k0632B35205a92017P4533H9023c7321G8199
18439a11253K7952j13332C1026c15020Q3197H2484P2028a42501O7498A39986d1973
18427a53479j32860a42000o0757C3512b36529i2386E3487c0622k42213H330L101
18416A1431g4920n1356L076A65781Q7489a6056j7659B34071c03606e7596r4211
18405a51807N1266D9497a42083l4538Q6407l6251j98439A14785m0520j6751e8096
18393G7237a93930a4993l78099a48722A06856k965b23548J08406C11236R528i573
$$ y = [-84914, 287910, -100477, -316595, -94820, -9229, 168058, 316, 172662, 39611, 80360, 75650, 46411, -14919, 228637, -222054, 4812, 74717, -431729, -61796, -25311, 101497, 170235, 69301, -318475, -349994, -212616, -233248, 235205, -192017, -117484, 89023, -37321, 78199, -111253, -83301, -196633, 31026, -315020, -231823, 82484, 154512, -142501, -75003, 139986, -41973, -153479, -286339, -142000, -202757, 33512, -236529, -92386, 53487, -30622, -272835, 8330, 11431, -74920, -126276, -123200, 165781, 253270, -16056, -33715, 234071, -303606, -57596, -151807, -100541, 49497, -142083, -176621, -90214, -126465, -324904, 114785, 74265, 57514, -58096, 77237, -193930, -14993, -393092, -148722, 106856, 103891, -223548, -115142, 311236, 320764, -9573]
18381A29080c0453G9706l5568K29016C915b6669l6974a774l67984B11420i4572
18369b9455k05806j56483B03951E3182J11616N790a39538K8803k77873A55763
18358b78031F951P5416M1735D0180a71986b185B63691C291a71070E72364c30654
18346i8396C8534J03404j3926N4172a5007C1745a01038D78972a55781A54611b22462
18334B5650J15168E722b6865j79827B75264r7835a83676B47063A3811L88430h4915
18322b72448a23741j59269c5126k19695M5094L4762B29318c23191C4360J56143
18312A90503f5155j15854c3953A53075f5729K9741H672K150a28390A3273a22984
18300A629b93819A20581R4714a13903k3632c7394j71710Q3874N4954a933C9804
$$ y = [129080, -30453, 79706, 44138, 273154, 3915, -26669, -63643, -1774, -369758, 211420, -94572, -29455, -235261, -391744, 203951, 53182, 164798, 170588, -139538, -110735, -388608, 155763, -278031, 6951, 82367, 124102, 40180, -171986, -2185, 263691, 3291, -171070, 572364, -330654, -98396, 38534, 141938, 128012, 182184, -15007, 31745, -101038, 478972, -155781, 154611, -222462, 25650, 140818, 5722, -26865, -206692, 275264, 177429, -183676, 247063, 13811, 402241, -84915, -272448, -123741, -283010, -35126, -254821, -209727, -174965, 229318, -323191, 34360, 190503, -65155, -181009, -33953, 153075, -65729, -35988, 8672, 10822, -128390, 13273, -122984, 1629, -293819, 120581, 215295, -113903, -137535, -37394, -209104, -125230, -70276, -1933, 39804]
18288A42227b74063d8191k44130P4255J3243f1375B08838a58021B12540j02827
18278A09713L2525o4213a46935j39885b5895H3011E44a38053d739m19830b2542
18266g1967l5821l6760b6798B2780e048b85n3467A52982k2156n5933g1109F4205
18253H4328J222b6514l01803k23985c4917j41386E8944b84894G7433b75272A6365
18241A5058K28122g3232I223c87446i9046J5759A29455d2619j28502g0495C73848
18229i8888d5398A06276J6174D0809J20932j6439i594A53089a0804H465Q5398
18218I3863D2380e5941F0094b17040A37056h6204a5624A2210M4272a97022c2353
18206b32628d6247q7510A50776a09911A96846g0535j26713D6546b05527j18839
$$ y = [142227, -274063, -48191, -292321, -218066, -204823, -61375, 208838, -158021, 212540, 109713, 142238, 78025, -146935, -286820, -25895, 83011, 544, -138053, -4739, -424569, -22542, -71967, -107788, -144548, -26798, 22780, -5048, -285, -53752, 152982, 130826, 74893, -71109, 64205, 84328, 85550, -26514, -328317, -552302, -34917, -176303, 58944, -284894, 77433, -275272, 16365, 15058, 243180, -73232, 9223, -387446, -99046, -83287, 129455, -42619, -171121, -70495, 373848, -98888, -45398, 106276, 122450, 40809, 161741, 145302, -9594, 153089, -10804, 8465, 93863, 42380, -55941, 60094, -217040, 137056, -86204, -15624, 12210, 56482, -197022, -32353, -232628, -46247, -133757, 150776, -109911, 196846, -70535, -197248, 46546, -205527, -324366]
18196c24366a33609N5789B05203d1286B0116b25084a7581A49613i1939j36231
18186b28170O9151K7578l49861a83328h1978c2873m591A8958a13345j1924N3507
18175g1762D4271K44787g6483C4183J45283a71168A58109g2717B13520m9586b29524
18163a97287A9247b5248l73761A80496J3522f6297b5241j18188A046a98975l3564
18152b32539B85721a70035K9702j06090A40198n8065J5481b41523A6917b42353
18141a19069A69413b46216A93844b25211O7694j1448g8199B2832d28065A15942
18130g9006F2160L8811a29227j5097G6156J67327j04760r463m5594b87179i482
18118b4249A20206N8513i7257m9988A84746L5035c11830A32894f5409J9719k64439
$$ y = [-324366, -133609, -77820, 205203, -41286, 20116, -225084, -17581, 149613, -91939, -228170, -159019, -131441, -481302, -183328, -81978, -32873, -37464, 18958, -113345, -125269, -71762, 44271, 289058, -76483, 34183, 179466, -171168, 158109, -72717, 213520, 163934, -229524, -197287, 19247, -25248, -399009, 180496, 194018, -66297, -25241, -143429, 1046, -198975, -232539, 285721, -170035, -140333, -246423, 140198, 82133, 97614, -241523, 16917, -242353, -119069, 169413, -246216, 193844, -225211, -157517, -168965, -78199, 22832, -428065, 115942, -79006, 62160, 100971, -129227, -144324, 76156, 243483, 138723, 129260, 83666, -287179, -9482, -24249, 120206, 178719, -97257, -147245, 184746, 219781, -311830, 132894, -65409, -45690, -310129]
18107c10129B00663e7896A20150D0780a27341b4935r8569k7709j09586B25346
18096a00775H089K8730c88007F6396b35637A09033K47434a47193A7782J68330
18086A86112C5011J95659f98E9615a58536E380K4218r758O2910b94955g5014J702
18074g3312D6558K27040h8159q4163H2106J83487F5710a09241r8554F8054d7203
18062e2064p4117N7779J0154j72342C52626G6014c3881n2378D1075K47488b76082
18050a28278j22917f5076c1447C3972a41605A79148F3101P6643B3864j891J27149
18039A49122a33474L1519a7681F1761h809B21118a15889E3587L0714r926a4620
18027c71605a46925j1263D1793J59639e5232H1147l2836L7342h1018b2780j25777
$$ y = [-310129, 200663, -57896, 120150, 40780, -127341, -24935, -123504, -151213, -260799, 225346, -100775, 8089, 36819, -388007, 66396, -235637, 109033, 356467, -147193, 17782, 186112, 35011, 230670, -698, 59615, -158536, 5380, 29598, 19840, 82750, -294955, -75014, -73312, 46558, 273598, -88159, -172322, 82106, 265593, 65710, -109241, -207795, 68054, -47203, -52064, -126181, -68402, -58248, -230590, 352626, 76014, -33881, -86259, 41075, 288563, -276082, -128278, -251195, -65076, -31447, 33972, -141605, 179148, 63101, 139744, 23864, 21973, 149122, -133474, -101955, -17681, 61761, -8809, 221118, -115889, 53587, 84301, 74375, -14620, -371605, -146925, -158188, 41793, 201432, -55232, 81147, 48311, 85653, -81018, -22780, -148557]
18016a48557A12211m4378b58524A80866a09493H5741k5841e8336A15206m4885
18006G0321b59493N1602i4709A51785D2195N4250Q1571G6600J15588e6562j04597
17995a61159P7890L4631k15625n3335a0386A6579a03764A31784i5682m7815c9676
17983B48338c0216B0233J93416f728k47644h6134o4665o1167e3460a3336G784
17971e7331K3636k9342A77b738j60954A95669b54068R1753O9171k3300e3286A57401
17958a7826E1710J88990k3916a85896M3738C3908J65221n8213h0004E0176m875
17947D5301a5483E8218J95517q2271G807e4881o1066B10086b80831q6921D161
17935f9171A4725J9819L04138a10642I9911R3986G3865B8594K05114P6088A31986
$$ y = [-148557, 112211, 67833, -258524, 180866, -109493, 85741, 59900, -58336, 115206, 70321, -259493, -207891, -94709, 151785, 42195, 96445, 178016, 76600, 192188, -56562, -161159, -83269, -48638, -264263, -317598, -10386, 16579, -103764, 131784, -95682, -143497, -39676, 248338, -30216, 20233, 213649, -6728, -254372, -86134, -150799, -211966, -53460, -13336, 7784, -57331, -33695, -63037, 177, -2738, -163692, 195669, -254068, -162315, -93144, -116444, -53286, 157401, -17826, 51710, 240700, 216784, -185896, -142158, 33908, 199129, 140916, -80004, 50176, 45301, -15483, 58218, 253735, 171464, 7807, -54881, -115947, 210086, -280831, -367752, 4161, -69171, 14725, 34544, 338682, -110642, 99911, 193897, 73865, 28594, 233708, 309796, 131986]
17923a09888H5200h1114j09895B76856L2797H323L2720J54547p7666a54419b9380
17911G4307K28765H1891A4681a44259B33845a52738B35118J51827k7356h1765
17900C315J68788J14670a16877j2624C8285A4940Q3705b86913a4676C16813a19952
17888F2489a97979F7305b82026g7242j636C72180r8170e2080k36572A27211J4310
17877A41521C4331a42193f7677A57453b57476a23895M9514A95421a65927F0908
17866A89384b0162B44938a62171p9407e8139b2757k12761A75585q6298K5194g985
17854B25078b12879R0567A77078b61534D328c71704a41776A27344c0244A82679
17843b96717C65911A71439c9969A87466a11017I4970J095D7175L25276A12300
$$ y = [-109888, 85200, -81114, -191009, 276856, 309653, 8323, 41043, 195590, 117924, -154419, -29380, 74307, 303072, 81891, 14681, -144259, 233845, -152738, 235118, 386945, 359589, -81765, 3315, 172103, 286773, -116877, -129501, 38285, 14940, 98645, -286913, -14676, 316813, -119952, 62489, -197979, 67305, -282026, -77242, -78878, 372180, 274010, -52080, -288652, 127211, 141521, 34331, -142193, -67677, 157453, -257476, -123895, -74381, 195421, -165927, 60908, 189384, -20162, 244938, -162171, -241578, -58139, -22757, -235518, 175585, 89287, 114481, -7985, 225078, -212879, -122312, 177078, -261534, 4328, -371704, -141776, 127344, -30244, 182679, -296717, 365911, 171439, -39969, 187466, -111017, 94970, 96065, 47175, 372451, 112300]
17832D682i4792A62197a0808A22457D6135K822j3311J31826j0791g9564B76992
17820b0871m4606p4966d1914A06473J18518C2269a00329B55904p6693a42848E2250
17808b08338h2119J7375B11975l5052a3299j70124C28215j45346c6897I6364Q853
17797A05217C3372O5438J80964a32170B93683I1794m0390K8649J19881a30845
17786g3045p2814A76761M4226h5827C5236Q1655a86737B48737f566A0417f3184
17774a54884f2739j1702H2338J1077J74176b15072M2834A36557a69095H7098b4409
17762B25565O3132i566E1509Q9745m5284N9464o6220J46282a32207E0625L0694
17751H1319O1536Q7220j10328D3613P0941a06591q1376B98968k2728r6352E0170
$$ y = [4682, -94792, 162197, -10808, 122457, 46135, 48957, 35646, 167472, 156681, -79564, 276992, -20871, -65477, -140443, -41914, 106473, 224991, 32269, -100329, 255904, 179211, -142848, 52250, -208338, -82119, -64744, 211975, 176923, -13299, -183423, 328215, 182869, -36897, 96364, 105217, 33372, 98810, 279774, -132170, 293683, 91794, 51404, 80053, 199934, -130845, -73045, -145859, 176761, 220987, -85827, 35236, 116891, -186737, 248737, -6566, 10417, -63184, -154884, -62739, -74441, 82338, 93415, 267591, -215072, -172238, 136557, -169095, 87098, -24409, 225565, 288697, -9566, 51509, 141254, 95970, 155434, 89214, 235496, -132207, 50625, 81319, 142855, 230075, 119747, 43613, 114554, -106591, -187967, 298968, 276240, 179888, 50170]
17739C83196H9902b29999Q3461c8542j5527D14714g5117E55558G2074J82174G5096
17727C8820f7974J804J1251C62355A08423C9866a02773C13792a24773l38A1835
17715a2303I9965k9991b73486B6136h6903F418b933r6771B06481G7951k7471K61238
17703C11718G4004J47954r1648J79244j03559j8793k4833k5980a34982B35401
17692A50263n5877d7092B50889G5572K2008a46389E7752a72571a2086A68806a19842
17680G2021a29350B10381p0356b97345C70596j11136C0198a17092r4636B2465
17669B27915c35972A25319J19449E1022h5245A47484a34405B71911A10073h4696
17658B51468k5697b5591F9502a29497j53154R3483b1903B1113R5977K2099J43795
$$ y = [383196, 89902, -229999, -146538, -38542, -54069, 414714, -75117, 555558, 72074, 254248, 75096, 38820, -67974, -66170, -54919, 362355, 108423, 39866, -102773, 313792, -124773, -125111, 11835, -12303, 99965, 69974, -273486, 26136, -86903, 6418, -2933, -99704, 206481, 77951, 50480, 311718, 74004, 221958, 130310, 309554, 205995, 187202, 162369, 136389, -134982, 235401, 150263, 94386, -47092, 250889, 75572, 97580, -146389, 57752, -172571, -12086, 168806, -119842, 72021, -129350, 210381, 140025, -297345, 370596, 259460, 30198, -117092, -211728, 22465, 227915, -335972, 125319, 244768, 51022, -85245, 147484, -134405, 271911, 110073, -84696, 251468, 225771, -25591, 69502, -129497, -282651, -189168, -21903, 21113, 117090, 139189, 282984]
17647B82984A11758A5745R4770O8786K1056c54017A02532K34583N969j29573o6997
17636A46514G844K25393e5455A76731B2220h5023C5738R9316J35662F5802A7302
17624C41448o3192E7004Q7522m394o6715G521J47320b40780P2645L3571B82135
17612g3531I7897m2345a90320B88164c558A80290J32912C9367h1167B2488L86958
17601D09446M986j88458d69j08374D69620n4284A70093J31031p8207j03147h5295
17589A49238C5107L437A8127M20463b84123B7318J66200a41541B46672i3362H7888
17577B99115F9543J00794a42815B92836N6662F7381J01607a31780B1493J46313
17567A67806M1597N019I4496a5390B62118a72836B56908A15182F76K56278a71801
$$ y = [282984, 111758, 15745, 110515, 179301, 200357, -354017, 102532, 337115, 343084, 213511, 146514, 7844, 233237, -55455, 176731, 22220, -85023, 35738, 135054, 270716, 65802, 17302, 341448, 278256, 57004, 144526, 140132, 73417, 7521, 154841, -240780, -168135, -134564, 282135, -73531, 97897, 55552, -190320, 288164, -3558, 180290, 313202, 39367, -81167, 22488, 409446, 414432, 225974, -469, -108843, 469620, 415336, 170093, 301124, 222917, 119770, -85295, 149238, 35107, 38544, 18127, 438590, -284123, 27318, 193518, -141541, 246672, -93362, 87888, 299115, 69543, 170337, -142815, 292836, 349498, 67381, 168988, -131780, 21493, 167806, 209403, 214422, 94496, -15390, 262118, -172836, 256908, 115182, 676, 256954, -171801]
17555A41729b5282A0976K85057L6634B9104J17983m5366b23019A45173b6575B65536
17543B59740j02607N7072B9118b75473A39318J86761n6388F8337J97J42692o9512
17532A41714P8785k7166O1828J51240A04159K96631I0975M29512A48348K61080
17522D09428a98114C26612F3052K37029H1594J47302L5779P8326F8556O05810
17512F74366j82452O9369J79053J13175q8086K22481m05904o7159j05N1387B70670
17500C24726L9517j47524K87083k36281N36700M6607j18918J76143m23550K23300
17490G07803k49995L27875F1463L26318j46560R1417J43561A68516F1964O18909
17480F80873A21629K25516J62930j36254K13757j41943e4386C50049R1314j26314
$$ y = [141729, -25282, 10976, 296033, 332667, 29104, 147087, 101721, -223019, 145173, -26575, 265536, 259740, 157133, 214205, 29118, -275473, 139318, 326079, 269691, 68337, 68534, 211226, 141714, 220499, 193333, 255161, 406401, 104159, 400790, 90975, 520487, 148348, 409428, -198114, 326612, 63052, 300081, 81594, 228896, 264675, 343001, 68556, 674366, 491914, 561283, 740336, 853511, 765425, 987906, 582002, 514843, 514738, 566125, 270670, 324726, 364243, 216719, 503802, 267521, 804221, 850828, 731910, 908053, 484503, 707803, 457808, 785683, 61463, 387781, 241221, 332638, 476199, 168516, 61964, 680873, 121629, 347145, 510075, 373821, 587578, 445635, -54386, 350049, 441363, 315049]
17470C15049P9209C8200M38840j67658G6359N04162r1396j25918G912M87578B37126
17458C53422q9668O7084C7332N5602J61548l0265m7563k7479b21152C3604J72506
17447B06110J16222M8963j48339J00011A02598j1381j388L97162k34902j06252
17437A45837O3483K20041j72190K44703A23784J21603K17181l0215k06077o4033
17427A62243N3901a3421C81272J23523j23940E9438J80103J70776J5210A16653
17416I222Q3478N72819a19680D51947j27033A58547K41640n2583j55949a12548
17405D67045k29706K14862r2696j17975p0964K18078C6166J70045K46156q9149
17395C63218R3367j21412k7629K20205A57945a917D39668j06356q6303C5113J20034
$$ y = [315049, 394258, 38200, 477040, 309382, 76359, 580521, 489125, 363207, 7912, 495490, 237126, 353422, 263754, 330838, 37332, 92934, 254482, 224217, 176654, 149175, -221152, 33604, 206110, 322332, 371295, 222956, 322967, 102598, 91217, 89829, 486991, 252089, 145837, 209320, 429361, 257171, 501874, 123784, 245387, 462568, 432353, 226276, 162243, 216144, -13421, 381272, 504795, 380855, 59438, 239541, 410317, 425527, 116653, 9222, 92700, 665519, -119680, 451947, 324914, 158547, 400187, 347604, 191655, -112548, 467045, 237339, 452201, 359505, 241530, 170566, 388644, 36166, 206211, 452367, 363218, 456585, 335173, 307544, 527749, 157945, -1917, 439668, 333312, 247009, 35113, 155147]
17384A55147O9930j07406E3096J85328J38253A79645L9023q3131k7733J83885
17374B91689J76710A62276C9234J85049k6451Q757j9155r803n482B3113L03384
17363C26497K51706G6017L67999i4534H7712M6889L685g236A03753K76280b3685
17351b9923C56189r1339c0706D43808A74432L93939o7522j75539O9623j81914
17341B13019q2128K23865A57473L09628k25849C5865L75590E0867L49253A86844
17330B19121A08586O2787R4441r3956P3549J73635A46482J62912C1777J01660
17320A33437L62767j34850j34032R335O0132A22277m565K81437N7183Q4940A77832
17308A13293K67999A80183Q7164K11109n4566j53904M34240B79281J49805A19157
$$ y = [155147, 225077, 117671, 53096, 238424, 376677, 179645, 218668, 135537, 107804, 291689, 468399, 162276, 39234, 224283, 197832, 206589, 187434, 177631, 172149, 23113, 326497, 578203, 76017, 444016, -94534, 87712, 134601, 138286, -7236, 103753, 380033, -23685, -29923, 356189, 264850, -30706, 443808, 174432, 568371, 500849, 325310, 394933, 213019, 130891, 354756, 157473, 467101, 241252, 35865, 411455, 50867, 400120, 186844, 219121, 108586, 171373, 265814, 171858, 245407, 419042, 146482, 309394, 31777, 133437, 496204, 361354, 227322, 236657, 296789, 122277, 117712, 399149, 456332, 541272, 177832, 113293, 381292, 180183, 267347, 478456, 423890, 269986, 704226, 279281, 429086, 119157]
17297F09804G5236M0666j1530K69504j04779L63451B92802b1381D9977K58112
17287C08089J3192j28453J46620J51806A64417k481M23322B01151K68671J43895
17277F13717B26313j7925N494D1778L87971A60754a06056A92197K57870j72839
17267B77228r9477k3096f8727C55985A66009N518J13594r4972j6944J13600p1739
17256B15066J69671J04094A80407L82615r2555q479I2553M21007k25155E1449
17245C6558J27449J59361K06144A7196K72905n8659l3097K3760L59552n0834B32449
17233B66945m0418L62629m2201A43651k366N20999l25553J84328j51700m3667
17223C25692J00139j88121L23382k29253l3413K10003n6894K21948A58006J10637
$$ y = [609804, 75236, 115902, 104372, 373876, 269097, 632548, 292802, -21381, 49977, 308089, 321281, 192828, 339448, 491254, 164417, 161936, 585258, 201151, 469822, 613717, 226313, 208388, 213882, 41778, 429749, 160754, -106056, 192197, 450067, 277228, 177751, 154655, -68727, 355985, 166009, 171527, 285121, 190149, 173205, 286805, 215066, 384737, 488831, 180407, 563022, 470467, 461988, 92553, 513560, 288405, 51449, 36558, 164007, 323368, 529512, 17196, 290101, 231442, 198345, 222105, 581657, 530823, 232449, 266945, 226527, 589156, 546955, 143651, 141285, 662284, 336731, 521059, 369359, 325692, 425831, 237710, 561092, 331839, 298426, 508429, 451535, 673483, 158006, 268643]
17213B68643K00384p3823P618O1879j37758G0728L18618l4054C7694L52156c8831
17201B94135K05293n4988J85203B64614M9969m6274J07170N5068k3822p8450n2316
17190B75959K6855N901J94462B22318J72224R4581p4882N7382k6836K28683o9941
17179F03529B4454L70551M2574K22188B55119K77976M3687k08942K00727B75505
17168A26762J15408R635J56705J90061o8431j72761J83046r6949N2626O6419k40814
17157C21707J34528o862J6556j64044J78087q9300A1969Q52621l43943n0003L2013
17146E02657A73863J81715J47898B10500J38722J35254K65451j7834j88347B28181
17135B00300L34475J26943l00683L42183j9913k37712j784N59343C04159M02561
$$ y = [268643, 469027, 395204, 402822, 464701, 326943, 70728, 389346, 355292, 37694, 389850, -38831, 294135, 499428, 444440, 629643, 264614, 314583, 268309, 375479, 430547, 406725, 328275, 275959, 302814, 308715, 503177, 222318, 394542, 489123, 414241, 471623, 444787, 673470, 603529, 24454, 395005, 437579, 659767, 255119, 533095, 576782, 367840, 568567, 275505, 126762, 242170, 251805, 408510, 598571, 530140, 357379, 540425, 443476, 496102, 562521, 321707, 456235, 449373, 465929, 301885, 479972, 390672, 11969, 864590, 520647, 470644, 502657, 173863, 355578, 503476, 210500, 349222, 484476, 749927, 732093, 543746, 228181, 200300, 534775, 661718, 361035, 703218, 683305, 445593, 443809, 1003152, 304159, 706720]
17125G06720l51927L25887l08408K61359j3518j66357J12852J07059B99561J09511
17115D09072j10424Q7549L34017l1195k67390J85845L16345n5413j61703k89692
17105D17011J02798j66269M9987K98445l15298J24110J64009j47069J19902L5845
17095F83471j77117j64141J19280j3294J12823J66424J06271j90503j64978K65766
17085G44002j69553m488J27583J83246k27909o4834r823K76328B77899J64884
17075D42783L30801C46694K09310J81202l35981L24279j21846K46635j56807M8296
17065G41782r9880J06008k29241R3589K07333k72819L40559m39538K60631p8870
17055F29554O7797K75157j40537L6117k15665l23060L48832j41322K8847L35754
$$ y = [706720, 354793, 680680, 372272, 633631, 620113, 453756, 566608, 673667, 299561, 409072, 298648, 386197, 720214, 689019, 421629, 607474, 923819, 868406, 706703, 417011, 519809, 353540, 403527, 701972, 386674, 510784, 674793, 527724, 647626, 683471, 506354, 342213, 461493, 448199, 561022, 727446, 833717, 643214, 478236, 744002, 574449, 569961, 697544, 880790, 652881, 588047, 578224, 854552, 277899, 442783, 773584, 346694, 556004, 737206, 401225, 725504, 603658, 850293, 693486, 741782, 641902, 747910, 518669, 612258, 819591, 546772, 887331, 447793, 708424, 629554, 697351, 972508, 831971, 868088, 652423, 329363, 678195, 536873, 565720, 901474]
17045I01474p567j10702m7868K0375J8136j92498O53322l90837j34117K72219
17035I81937K3660l0241k47639j8049L70249l15239P9683n2940L20656j77620
17025I34457J99668j9003m44708M79357m89966J22086L50399j63188P7719j34826
17015I11995k26145J04544J41791K9420J96469q3387O1948n67418L84576j44690
17005H09103J66976O5012k6407j7136k46157O20230m30082L952Q6193K12183l73202
16994H70665K15784j81707M54223j61526o2715J91199j07723l69421N59843p255
16984A401367n62893J36696J30848m492j91058L71104Q3309J53503l30454L65959
16974A553889l02453j08187K42733j72895K63903M1669k01755j10177j06228K53083
$$ y = [901474, 893907, 783205, 735337, 755712, 773848, 581350, 1234672, 843835, 709718, 981937, 1005597, 975356, 727717, 709668, 1079917, 764678, 844361, 791421, 1112077, 934457, 1134125, 1115122, 670414, 1149771, 659805, 781891, 1132290, 969102, 1046821, 911995, 685850, 790394, 932185, 961605, 1158074, 1074687, 1136635, 569217, 953793, 809103, 976079, 1041091, 1014684, 997548, 751391, 1371621, 941539, 945491, 1031684, 1243867, 870665, 1086449, 904742, 1358965, 1197439, 1134724, 1325923, 1218200, 848779, 1408622, 1401367, 838474, 975170, 1106018, 1101526, 910468, 1281572, 1364881, 1518384, 1187930, 1553889, 1251436, 1143249, 1385982, 1213087, 1476990, 1518659, 1316904, 1206727, 1100499, 1353582]
16964A353582k5786m263J40842k04735J18361j00983J20578R1237k50777P8333
16954A316389J25363j96988K5421J75793k27199J12865p0737L74047J11572p1192
16944A675334p03937N32884J85100j09062j988J90048n6745k83938j02813L99775
16934A724658j77300J4703J29010J71294k77707K22934l1735l426O308L23943
16924B102682n19194J43151K57568L8318j86378j37410j70957N82020k10935O8870
16914A967735K79140j19431j65996N46259p23706L35230l9570p9160j16085O13388
16904B497804l32045K40281o6064K0375J65329L7871l54372J67524Q6751o6440
16894B397014k35932L23419K52194k67498Q1608O7812R350M2991J7674j34382
$$ y = [1353582, 1327796, 1323533, 1464375, 1259640, 1378001, 1277018, 1397596, 1488833, 1238056, 1316389, 1441752, 1244764, 1270185, 1445978, 1218779, 1331644, 1260907, 1634954, 1746526, 1675334, 971397, 1504281, 1689381, 1580319, 1578331, 1768379, 1711634, 1427696, 1324883, 1724658, 1547358, 1562061, 1691071, 1862365, 1584658, 1807592, 1775857, 1772431, 1778739, 2102682, 1583488, 1726639, 1984207, 2022525, 1836147, 1698737, 1527780, 2109800, 1898865, 1967735, 2246875, 2127444, 1961448, 2507707, 1784001, 2119231, 2079661, 2000501, 1884416, 2497804, 2165759, 2406040, 2339976, 2360351, 2525680, 2563551, 2209179, 2376703, 2463454, 2397014, 2161082, 2484501, 2736695, 2469197, 2550805, 2618617, 2627967, 2670958, 2688632, 2554250]
16884B554250L57583j46414Q5868r3344K3751P0316K4540J84556k36053O1844
16874B886897K26157M7814J44027K08109l25211m5718K23887n25474N19260k42708
16864C117040L51005j03084K60383j29318L8432J22164J57898k49642L10064P0728
16854C945670j60515j8903j0971L94386k52209K19207k38438K29699J07916j05203
16844D110639L97746K41337k21850j71275L55842r867J44816m5388J96651P9674
16834E078325L814M55188j05458j22549K11104j71394L09226k27953J45394J97964
16824E773661K10859k80490L91273O5586J98361M02613N7679P4261J6882k7177
16814F883508J1204J29099L03309j27756L07118K75386R2942O6818J40337K49642
$$ y = [2554250, 2911833, 2765419, 2851287, 2757943, 2781694, 2852010, 2876550, 3061106, 2825053, 2886897, 3113054, 3160868, 3304895, 3513004, 3187793, 3142075, 3365962, 2840488, 3359748, 3117040, 3468045, 3364961, 3625344, 3496026, 3534458, 3656622, 3814520, 3564878, 3874942, 3945670, 3785155, 3766252, 3755281, 4149667, 3897458, 4116665, 3878227, 4107926, 4215842, 4110639, 4508385, 4749722, 4527872, 4356597, 4712439, 4702572, 4847388, 4802000, 4998651, 5078325, 5082139, 5537327, 5431869, 5309320, 5520424, 5349030, 5658256, 5430303, 5575697, 5773661, 5984520, 5704030, 6095303, 6160889, 6359250, 6761863, 6819542, 6893803, 6910685, 6883508, 6894712, 7023811, 7327120, 7199364, 7506482, 7781868, 7874810, 7941628, 8081965, 8331607]
16804H331607p440L7639M11488J63048P5490M62558j56544M59615j27865M02435
16794A0052031J84529J04473N36353K73886j0983M14987M45055j96985L10834
16785A2114180M38629P9916N66055R7567M29077L71734M94530L14374j62390N97914
16775A5341586M62569M10613O50722J66868R61811k6350P29360M73201M36790
16766A9607170N23232P18279O41727N31158M25393O84032Q86715P97426P82147
16757B5597279R72412Q81043P55916R42664J133791J398044L24049J408605J065395
16748C4479198J486736R99828J508410J224998J466709J899292J409036K014424
16740D6488631J460661K049462J923550K093821K385929K188509K204285K257021
$$ y = [8331607, 8324167, 8361806, 8773294, 8936342, 9011832, 9474390, 9317846, 9777461, 9649596, 10052031, 10236560, 10341033, 10877386, 11151272, 11140289, 11555276, 12000331, 11803346, 12114180, 12552809, 12632725, 13198780, 13296347, 13725424, 14097158, 14591688, 14906062, 14743672, 15341586, 15804155, 16214768, 16865490, 17032358, 17994169, 17967819, 18697179, 19170380, 19607170, 20130402, 20848681, 21490408, 22021566, 22446959, 23130991, 24017706, 24815132, 25597279, 26569691, 27450734, 28206650, 29149314, 30283105, 31681149, 32005198, 33413803, 34479198, 35965934, 36965762, 38474172, 39699170, 41165879, 43065171, 44474207, 46488631, 47949292, 49998754, 51922304, 54016125, 56402054, 58590563, 60794848, 63051869]
16732F3051869L110764K305074L160244K552452L104442K898319L593573L304341
16724H7081078L021559L794341L268143L880006L477176K992756M206556L164735
16716A14886350L201713L064404L105565K692930K750503K252273J748692K051395
16708A35753825O95457P15140O95180j82582p30009o11388j424904j442080j939074
16699A31529565k550570k393560k758087l047823l537857l270166l262369l816662
16691A06892471l402249l229668l834045l757421l371364l231562l336514l384664
16683G9344984l200387l002483l133576k390167k820623k961605k132206k092663
16675E7611274k753294k095742j846635j931499j952554j820898j508142k030516
$$ y = [63051869, 66162633, 68467707, 71627951, 74180403, 77284845, 80183164, 83776737, 87081078, 90102637, 93896978, 97165121, 101045127, 104522303, 107515059, 111721615, 114886350, 118088063, 121152467, 124258032, 126950962, 129701465, 131953738, 133702430, 135753825, 136449282, 137164422, 137859602, 137677020, 136947011, 136335623, 134910719, 133468639, 131529565, 128978995, 126585435, 123827348, 120779525, 117241668, 113971502, 110709133, 106892471, 103490222, 100260554, 96426509, 92669088, 89297724, 86066162, 82729648, 79344984, 76144597, 73142114, 70008538, 67618371, 64797748, 61836143, 59703937, 57611274, 54857980, 52762238, 50915603, 48984104, 47031550, 45210652, 43702510, 41671994]
16667D1671994j542984j232438j615619j442045j152722j137922j317089r00731
16659C1330444r44848j085679j060672j002682q00378q39833j094365k89709r31691
16650B3280587o78121p63832p20916k58957r34947m75816p50584j48053p50232
16641A7799129m81870q26974k0836p34333p2628p81158l41929p0340l75697n81413
16631A3511951k83547n16229P1130J76081q18781j90400n24750j72037j96305
16622A1057113j35067n20220k06427j03939l59408j21259m9344l37245J3158m28152
16612H809210k84449P1459j29561l49312k16604q8507l39521O0851o824r6127
16602G430615m91377M25747n67441j8590J55376n50453j21880J54321m48820J8580
$$ y = [41671994, 40129010, 38896572, 37280953, 35838908, 34686186, 33548264, 32231175, 31330444, 30385596, 29299917, 28239245, 27236563, 26436185, 25596352, 24501987, 24212278, 23280587, 22602466, 21838634, 21117718, 20858761, 19923814, 19447998, 18697414, 18549361, 17799129, 17317259, 16490285, 16469449, 15735116, 15662488, 14881330, 14539401, 14469061, 14093364, 13511951, 13228404, 12712175, 12783305, 12959386, 12140605, 11950205, 11425455, 11253418, 11057113, 10922046, 10401826, 10195399, 10091460, 9732052, 9610793, 9561449, 9224204, 9237362, 8809210, 8524761, 8596220, 8466659, 8117347, 7900743, 7812236, 7472715, 7533566, 7526742, 7430615, 6939238, 7364985, 6797544, 6778954, 6934330, 6383877, 6261997, 6416318, 5967498, 5986078]
16592E986078j6636j11766l13859K43990m44286J8880k15046J55991l88470L38308
16582E253184k48380J20704j92084J00840l67982M9003o6327m83176L79659k00062
16572D345379N9010l33220L2307j05363j60711K31424j13230j49626n2013J27660
16562C881617K1168j38458j78478m7057l131K62536k26612l04752O0212M7956
16552C375001j84379j82674J68725J5911L744j8461m8505j49750K52576l77122
16542B855066j76221N41815k05809j53363m64588M66859k71928L3884J02520j47567
16532B580668N5106R1141k01545j33170n4532J05505n0682P7202j94798j21903
16522B152992q6834K58887l55269j22658L75538K55722m85201K05305J9310j65972
$$ y = [5986078, 5969442, 5857676, 5543817, 5787807, 5343521, 5362401, 5147355, 5303346, 4914876, 5253184, 5004804, 5125508, 4933424, 5034264, 4666282, 4715285, 4648958, 4165782, 4545441, 4345379, 4404389, 4071169, 4103476, 3998113, 3837402, 4068826, 3955596, 3805970, 3753957, 3881617, 3902785, 3764327, 3585849, 3538792, 3535661, 3798197, 3571585, 3266833, 3327045, 3375001, 3190622, 3007948, 3176673, 3192584, 3196328, 3177867, 3129362, 2979612, 3232188, 2855066, 2678845, 3220660, 3014851, 2861488, 2396900, 2863759, 2591831, 2625715, 2728235, 2580668, 2635774, 2726915, 2525370, 2392200, 2337668, 2443173, 2392491, 2469693, 2274895, 2152992, 2066158, 2325045, 1969776, 1847118, 2222656, 2478378, 1993177, 2198482, 2217792, 2051820]
16512B051820j52126j37863L08055q3989P4365q5220q2770L36272l74514P6493
16502A930523k15785J91436N6128l79258K98837n9645k77051K19475J48986K3486
16492A937132j88369l18853O16376j79451n83810O50692j50950j8020k97639k44913
16482A222195N89869j21174N7801m66307K56584K5418j56694J58726o8015j20298
16472A378105l0998K05306j47464O5836k65186P8553K27978J05643j65777r6794
16462A355202R8548j49655l5263M51911n97139J16333r3405L55164l18733r3785
16452A089178j78215M84126m26623L6006M12348k60043J85266m25009J07525j76676
16442H47883K34574K26585l31346j36281J68430K16718j7025j35084p9576l5094
$$ y = [2051820, 1899694, 1761831, 2069886, 1985897, 2060262, 1975042, 1892272, 2228544, 1854030, 1930523, 1714738, 1906174, 1962302, 1583044, 1881881, 1822236, 1545185, 1764660, 1913646, 1937132, 1748763, 1429910, 2046286, 1866835, 1283025, 1933717, 1782767, 1764747, 1467108, 1222195, 1812064, 1690890, 1748691, 1282384, 1538968, 1564386, 1407692, 1566418, 1498403, 1378105, 1347107, 1552413, 1404949, 1470785, 1205599, 1284152, 1512130, 1617773, 1451996, 1355202, 1453750, 1304095, 1268832, 1720743, 1123604, 1239937, 1146532, 1501696, 1182963, 1089178, 910963, 1395089, 968466, 1004472, 1416820, 1156777, 1342043, 917034, 1024559, 847883, 1082457, 1309042, 977696, 841415, 1009845, 1226563, 1209538, 1074454, 994878, 959784]
16432I59784N448j31316J58038m275J04732j65407J58313l06474L23719k76227
16422H26335J27038j99799J63811J61604m4150K33996j85850L2020j91689j31441
16412G91875K00059j385j95652j45700K53274J16541j75649J35005k42727N3631
16402G89272j60153M15869k18709J01937r6308k90929K63187j05674J22824K5810
16392H47126j19533K36988l7904p3526p361O3143k50143K02992J39307k93702
16382G07387J37034j9699l13288J29625L33145k82870m7133J64788L0264k25489
16372F13764m6155L3812j69615J52375P5720m0527L09945m5128r7385n3972r923
16361G22911q9509K7712K59859l20607O478L05335C41494L9129N83082j53734
$$ y = [959784, 965232, 833916, 991954, 987679, 1092411, 927004, 1085317, 778843, 1102562, 826335, 953373, 753574, 917385, 1078989, 1034839, 1268835, 1082985, 1115005, 923316, 791875, 991934, 990549, 794897, 649197, 902471, 1019012, 843363, 978368, 735641, 789272, 629119, 1044988, 826279, 928216, 831908, 540979, 804166, 698492, 821316, 847126, 727593, 964581, 926677, 853151, 845790, 908933, 658790, 861782, 1001089, 707387, 844421, 824722, 511434, 641059, 974204, 691334, 644201, 808989, 839253, 613764, 567609, 601421, 431806, 584181, 659901, 619374, 929319, 884191, 786806, 732834, 722911, 633402, 661114, 920973, 600366, 606844, 912179, 341494, 380623, 963705, 809971]
16351H09971Q4818j76881j10432k5037J22857K66157l61535B43585M54970r7596
16341F00959M5113J03687j19192r4240B16506O53420j91535j78001K79643M3084
16331H23117m4571A58671N68857J43824C36054J36829K29785C17319J37473K97611
16321G52403j29418l5914M6057O2451j94454K8787J41174m2666B36181L70249
16311F06430k43438J30344J00851B37394K13608J7046L71348l24874J07301A92710
16300D37472K58175k38483J10545k39842O4549l5380M59658C02289K12700K15858
16290G30847B94469f9247B98071J88612J15929n3456j92426L29704C14638L78824
16280F93462j83841R9905k69750K2869A52420Q8499K10454j3105G3102K12661
$$ y = [809971, 894789, 717908, 607476, 582439, 705296, 971453, 609918, 243585, 698555, 600959, 646072, 749759, 630567, 536327, 216506, 869926, 678391, 500390, 780033, 823117, 778546, 158671, 727528, 871352, 336054, 472883, 702668, 317319, 454792, 752403, 622985, 587071, 633128, 695579, 501125, 529912, 671086, 628420, 236181, 606430, 362992, 493336, 594187, 237394, 451002, 468048, 839396, 514522, 621823, 192710, 437472, 695647, 457164, 567709, 327867, 392416, 357036, 816694, 302289, 514989, 730847, 294469, -69247, 298071, 486683, 602612, 549156, 356730, 686434, 314638, 693462, 509621, 609526, 339776, 362645, 152420, 240919, 451373, 438268, 73102, 285763]
16270B85763O4875j59227o3965j6579J64149N6858O0622k823p416J73225B14288
16258A5979L91188o4422M3191K49172l11610K14302j83825a90950B02065J80258
16248C82323L1992o6031o6421A9062N36919c07748a149A40190K60677j14808K17991
16237E04050j2468j43377J34315j00202p7816n9366M54746C33050a01594E10703
16226B79064J11836a8722B23730N1615K23276G3850K46201E9545J88935R4374
16216C42854d2642D92402q5968A27801K53252A48320L81542a5012n4368C18936
16205A73925L01097j46872j39156c3927A37345P5525d8073C14052O6276K17016
16195E97344B07229J59147o8557m0887I0894d9357B8077J50817a9467D90115A82392
$$ y = [285763, 350638, 191411, 127446, 110867, 275016, 331874, 392496, 389673, 382257, 555482, 214288, 15979, 407167, 342745, 385936, 635108, 323498, 537800, 353975, -190950, 202065, 382323, 414315, 348284, 281863, 19062, 555981, -307748, -1149, 140190, 400867, 286059, 504050, 491582, 348205, 482520, 382318, 304502, 245136, 699882, 333050, -101594, 510703, 279064, 390900, -18722, 223730, 275345, 498621, 73850, 320051, 59545, 248480, 342854, -42642, 492402, 406434, 127801, 381053, 148320, 529862, -15012, -69380, 318936, 173925, 475022, 328150, 188994, -33927, 137345, 212870, -48073, 314052, 380328, 597344, 207229, 366376, 297819, 256932, 90894, -49357, 28077, 178894, -19467, 490115, 182392]
16183G83877B98147M1413A14794K56525q3983L8852L1422o9268j4304N5934A08359
16171A65732J38367M1464A68730e2300D03223j02844m1523j19073j3734C0507
16160a55727B40689j12033Q3627j6984r2419K85928Q4919j99762b42440B31961
16149G5965L05140j47014e1588C39076o299j01529J02971o7383F3584f0237B43685
16137A00472h8309H1768K96094j44000L34482j98703A31130F4975L3108k0859
16127G7224F782O5706A7778J52585J19988D7030K52820m2326j23996n5333L8184
16116A16379M121k8741J61231m9272C4206c7465A03546l7540K25208e5181j77461
16105b32642R4105A72616J83104j9934j15502o3109M6814D391K22762q620I5127
$$ y = [783877, 298147, 339560, 114794, 371319, 287336, 326188, 357610, 288342, 274038, 329972, 108359, 165732, 304099, 345563, 168730, -52300, 403223, 300379, 258856, 139783, 126049, 30507, -155727, 240689, 128656, 212283, 195299, 102880, 388808, 473727, 273965, -242440, 231961, 75965, 381105, 234091, -51588, 339076, 332777, 231248, 334219, 266836, 63584, -60237, 243685, 100472, -88309, 81768, 377862, 233862, 568344, 369641, 131130, 64975, 98083, 77224, 6782, 72488, 17778, 170363, 290351, 47030, 299850, 257524, 133528, 78195, 116379, 120500, 91759, 252990, 203718, 34206, -37465, 103546, 66006, 291214, -55181, -232642, -138537, 172616, 355720, 335786, 220284, 157175, 203989, 4391, 227153, 218533, 95127]
16093D9450J44789G4490L48716a36724B48180A23007c78097I2592K6307i545C38501
16081G1252J67326o4816a75613j33694C03171A45422J89626A64736c857H1003
16070A24108M371l8212J66711P9455A35096A9141a08561k12898A2692R6036e1101
16058A35498q583N2240a79321E2198j7891a28199B12771H9545a49552A34056d24002
16046B08379d3152B94809G0459c911k27931E41175A99477H9705L6916n4892f1491
16034B99803J24776n8177H4814j5812b55708E6322f3504j85486a08276B10083
16023A41008R9702j7727M5426B8349b39786A4665K22577M0786A34509i4096k02116
16012b96212b6080A01906C5387K1584K38h0267A74904L7977M6902a99753A26732
$$ y = [49450, 194239, 74490, 423206, -136724, 248180, 123007, -378097, 92592, 118899, -9545, 338501, 71252, 238578, 173762, -175613, -309307, 303171, 145422, 335048, 164736, -3857, 81003, 124108, 128479, 90267, 256978, 336433, 135096, 19141, -108561, -321459, 12692, 108728, -51101, 135498, 126915, 179155, -179321, 52198, 34307, -128199, 212771, 89545, -149552, 134056, -424002, 208379, -43152, 294809, 70459, -3911, -231842, 541175, 199477, 89705, 126621, 71729, -61491, 299803, 424579, 366402, 84814, 69002, -255708, 56322, -63504, -248990, -108276, 210083, 141008, 240710, 222983, 268409, 28349, -239786, 14665, 237242, 278028, 134509, -94096, -296212, -26080, 101906, 35387, 56971, 57209, -80267, 174904, 212881, 259783, -199753, 126732]
16000a35286A39286R5378f0430G4349b04837A37416L320n3997b41924D0293b91073
15988B94335c8064F4277b6506B44718f7426a9339p7494A47927B4115a00564B6978
15976a54077B24144K57219n3227r8k939j18362M53189K08724l07999J1856J31530
15965H04037C87304j18224j0807o5186n8629b15151C3897h9304D0871h1993A89655
15953b16141B26066a50889j96472h0377j3214B632e5064n2375q4036L1051K8432
15942a31992K5052I3343J86853E3600H964f7687b1582G0872K6610d11184G6872
15930b73067e8274q646L2865B44155a50472q3490I6567H875i5828B10171o8954
15919A41217F5211K04275G3175f3953j95777A33795h6825a9573A78389a37393
$$ y = [-135286, 139286, 234664, -60430, 74349, -204837, 137416, 140736, 86739, -241924, 40293, -291073, 294335, -38064, 64277, -26506, 244718, -67426, -19339, -96833, 147927, 24115, -100564, 26978, -154077, 224144, 481363, 428136, 428038, 425099, 306737, 759926, 968650, 660651, 672507, 804037, 387304, 269080, 258273, 193087, 134458, -215151, 33897, -89304, 40871, -81993, 189655, -216141, 226066, -150889, -347361, -80377, -93591, 2632, -55064, -107439, -191475, -160424, -131992, -106940, 93343, 280196, 53600, 8964, -67687, -21582, 70872, 97482, -411184, 76872, -273067, -58274, -66920, -34055, 244155, -150472, -233962, 96567, 8875, -95828, 210171, 141217, 65211, 269486, 73175, -63953, -259730, 133795, -86825, -19573, 178389, -137393]
15908b27108L1936F9486J59246a19704A07965h2825j4979k57566e7307k80262
15898c37569a24966d8053j00021O4717C7591a80262A3572e7393a9754A67538C0890
15886A53797a3950A7284d43891K00923B47830d7659j96909b5158r2893j49455
15876b67506g5333A7500M1766j2495f1305j54163C43054A69456b7744A96334D9562
15864f1332m3720r284B191O7650M1895a3357k22481q1419P657B25743a0010j65956
15852a75966f9254j02558o8407G8661b52814e703B66467B509M5411E211K41332
15841B46543e1321j41272k24934I0639b4779A15516B9524P7996c35311b5495I392
15829d2083l6920C9204b86558A40962c25604D561J4101b66512H5078M795b02119
$$ y = [-227108, -195172, 69486, 228732, -119704, 107965, -82825, -97804, -355370, -57307, -337569, -124966, -48053, -148074, -83357, 37591, -180262, 13572, -57393, -19754, 167538, 30890, 153797, -13950, 17284, -443891, -242968, 247830, -47659, -244568, -25158, -118051, -267506, -75333, 17500, 59266, 46771, -61305, -215468, 343054, 169456, -27744, 196334, 49562, -61332, -105052, -114336, 2191, 69841, 111736, -13357, -235838, -317257, -309600, 225743, -10010, -175966, -69254, -171812, -240219, 78661, -252814, -5703, 266467, 2509, 47920, 5211, 246543, -51321, -192593, -417527, 90639, -24779, 115516, 29524, 107520, -335311, -25495, 9392, -42083, -79003, 39204, -286558, 140962, -325604, 4561, 18662, -266512, 85078, 89873, -202119]
15817H8494j131O4707a53930C6840a08172L6266B47701c46652b9724b900j07469
15806a10369B6786e9148l47878a97046B76771c9397E0209f3286D9229a1237D2978
15794C7527N1742b7006k17836C33747I849M1212c02124c9867B84500D6186b2981
15782a88288i2138B5662g0896D5095J19566c68713a38605I2677c77639C944K91689
15771B95633J9505F0393b33783A18551f5706A25848b19616A62113j1493O9969
15761B20589E542b5121A68364a64226a7505j65805B1197b254j53351L4407n1378
15750a72576j38375N4772N6061A60386J40377l7241m0106G5296R8757i5631j24939
15739b20570A12888a39974N3612k6021c7909E7973K42686a03506a0129C72092
$$ y = [88494, 87363, 152070, -153930, 36840, -108172, -71906, 247701, -346652, -29724, -2900, -110369, 26786, -59148, -407026, -197046, 276771, -39397, 50209, -63286, 49229, -11237, 42978, 37527, 89269, -27006, -244842, 333747, 9849, 51061, -302124, -39867, 284500, 46186, -22981, -188288, -92138, 25662, -70896, 45095, 164661, -368713, -138605, 92677, -377639, 3944, 295633, 315138, 60393, -233783, 118551, -65706, 125848, -219616, 162113, 150620, 220589, 5542, -25121, 168364, -164226, -17505, -183310, 21197, -2254, -155605, -121198, -172576, -310951, -256179, -200118, 160386, 300763, 263522, 223416, 75296, 174053, -95631, -220570, 112888, -139974, -86362, -112383, -37909, 57973, 300659, -103506, -10129, 372092]
15728a01146p8081o3502A57618B8613a39225B8768P6319i290j6677B9590b31894
15716b78909Q3732E9556b27106B6255e6542k62638h447k22749n2408A41648B2798
15704b46736P5998o8632Q8023B87116j4163a83300Q8397D3423Q676J6109K84870
15693C53078c09621d0649A15360C8150a41273m1288c8710j1511k61A99965d6584
15681A87796o3274R2200q8536E9750g144n68B07105n3649K06647b33486B06524
15669B64800f2538p778B2436J98603b05668A29564m7157R880c37622I1126b51299
15657A89622M1962a79419a4031I7891O3067C1456d32346a50373j63468A6111a99907
15645a55791B89847c41686F7373a89848A81378G6627f8450b619l10771D361L92404
$$ y = [-101146, -179227, -242729, 157618, 28613, -139225, 28768, 105087, -9290, -25967, 29590, -231894, -278909, -195177, 59556, -227106, 26255, -56542, -319180, -8447, -231196, -283604, 141648, 22798, -246736, -170738, -239370, -151347, 287116, 272953, -183300, -94903, 43423, 52099, 68208, 353078, -309621, -40649, 115360, 38150, -141273, -182561, -38710, -50221, -50482, 199965, -46584, 187796, 124522, 216722, 128186, 59750, -7144, -7712, 207105, 153456, 360103, -233486, 206524, 264800, -62538, -70316, 22436, 221039, -205668, 129564, 82407, 92287, -337622, 91126, -251299, 189622, 231584, -179419, -14031, 97891, 160958, 31456, -432346, -150373, -313841, 16111, -199907, -155791, 289847, -341686, 67373, -189848, 181378, 76627, -68450, -2619, -313390, 4361, 396765]
15634C96765G4649a84516B8265b36995e6226B18539G1672J82526a20720e5303
15623B93302C4669a7699I8357d1072j34504M2623k56315B06452C2278c57931G201
15611A24891A5276a31215A08952c10130J43942A63352c2734B6846L8736p892c7880
15599i3193K5440k66084B73581A6242b53558A59144a0032A48578d7397j70106
15589b17503a02757B39574a05843A32002a19190B18137i9740A79723d10647d7635
15578A01338J15388b38964J8937f1833C0909a3852k00772h3741B44368b05125
15567H7905a01217A41957C6510c9783C2024h8566o6233A71944D034a92658D86503
15555B83964g770j3130j44552A35189a66k54170c9359j29064j7920E172a59959
$$ y = [396765, 74649, -184516, 28265, -236995, -56226, 218539, 71672, 254198, -120720, -55303, 293302, 34669, -17699, 98357, -41072, -175576, -132953, -389268, 206452, 32278, -357931, 7201, 124891, 15276, -131215, 108952, -310130, -166188, 163352, -32734, 26846, 65582, 57690, -37880, -93193, -67753, -333837, 273581, 16242, -253558, 159144, -10032, 148578, -47397, -217503, -102757, 239574, -105843, 132002, -119190, 218137, -99740, 179723, -410647, -47635, 101338, 216726, -238964, -220027, -61833, 30909, -13852, -214624, -83741, 244368, -205125, 87905, -101217, 141957, 36510, -39783, 32024, -88566, -154799, 171944, 4034, -192658, 486503, 283964, -7770, -20900, -165452, 135189, -166, -254336, -39359, -168423, -186343, 5172, -159959]
15543A60598a59633C7260J7906a41475L36j15969a6608k06582l3576A94388H2234
15531A07032M5269A2541J25642d4953k25821d4710A38852c9946A69643b8063m5473
15520g3536a5015B50262j21453K4102L32825a5211A39088a17452r1398l35881
15510e44731d3520C46899g3557A26765b88797k0294C26061A04056i6491F1326
15499D6193j6542a96938C96087a36644B1191J73575m2187o9909A7648K53464c6192
15487A8600f5551A35408a63407A39675k1552J23842C1263P1126O4460i2459C5926
15475B58804J29871I5653b1176j17190C9622c73694B23634E8093c9448l987p139
15464e0574e12I7824r891L3165h5837D81169J17636j61395K0132j19337j17485
$$ y = [160598, -159633, 37260, 55166, -141475, -141139, -257108, -16608, -223190, -256766, 194388, 82234, 107032, 152301, 12541, 138183, -44953, -270774, -44710, 138852, -39946, 169643, -28063, -73536, -15015, 250262, 128809, 152911, 485736, -15211, 139088, -117452, -208850, -544731, -43520, 346899, -73557, 126765, -288797, -309091, 326061, 104056, -96491, 61326, 46193, 29651, -196938, 396087, -136644, 21191, 194766, 152579, 82670, 17648, 271112, -36192, 18600, -65551, 135408, -163407, 139675, 118123, 241965, 31263, 102389, 166849, -92459, 35926, 258804, 388675, 95653, -21176, -138366, 39622, -373694, 223634, 58093, -39448, -43435, -50574, -512, 97824, 87933, 121098, -85837, 481169, 598805, 437410, 457542, 338205, 220720]
15453B20720o4734K68758F6951M20615h1537C76561A54800a0009A49850J18910
15443B68760h8626j24730e0194H9003J32322d4804o451A18206D9743b7739j83939
15432b11678A39168c8198I2108J3902K77042J9810L82765q5724P1024k39962L46858
15421H77823C80463k3081M2663p9079a59416A55330J31560a10409I45c73899J03022
15410b70877a14205A76303J29523a6229l59023N5286C40673A66916f9481o9152
15400a38633h044m3674A05619d2888A48014b86428j92715b9419A76762b43958
15389H59c0084A87734K9962n8055b54835C2359c15867a36471A00351K3637b74433
15377a14349K6140B3549L2351J10993b77533C2557J17000M44a35146d071D2340
$$ y = [220720, 155986, 424744, 66951, 487566, -81537, 376561, 154800, -10009, 149850, 268760, -88626, -213356, -50194, 89003, 221325, -44804, -51255, 118206, 49743, -27739, -211678, 139168, -38198, 92108, 106010, 383052, 402862, 785627, 699903, 770927, 530965, 877823, 380463, 357382, 400045, 320966, -159416, 155330, 286890, -110409, 945, -373899, -270877, -114205, 176303, 305826, -16229, -375252, -319966, 340673, 166916, -69481, -138633, -8044, -51718, 105619, -42888, 148014, -286428, -479143, -29419, 176762, -243958, 859, -30084, 187734, 217696, 159641, -254835, 32359, -315867, -136471, 100351, 123988, -274433, -114349, -88209, 23549, 55900, 166893, -277533, 32557, 149557, 150001, -135146, -4071, 42340]
15365B07727n7626c07926c4554C54680m2668J25634B13345J74060A24865J38763
15355B63628j27158a99668b1045A33707F3809L8005L7671j8576e210B10438a325
15343E6013a22807A02571J10991M5866l2322J60792j92793N2256j7358H4155J09177
15332A93332a04411D27834q5429j08192M69182k27714C9507L85547A65188O6638
15322B31826j11252D9234M1578Q7356G4453J00419J46943A1018J4105L88248a7756
15310A07374K52722J91884A25437c6827A43141M4107J66495d0085n3832A98915
15299a8722c914I1314J3917J05888a26880f1001B08056d0028I2376J9846N1502
15288A63724J46166e5595B7161i7463C2066L68107i2157m5119A97735d1960G8095
$$ y = [207727, 150101, -307926, -34554, 354680, 312012, 437646, 213345, 387405, 124865, 263628, 136470, -199668, -21045, 133707, 63809, 101814, 139485, 120909, -5210, 210438, -1325, 56013, -122807, 102571, 213562, 259428, 227106, 387898, 195105, 247361, 230003, 84155, 193332, -104411, 427834, 342405, 234213, 703395, 475681, 39507, 425054, 165188, 231826, 120574, 49234, 90812, 178168, 74453, 174872, 321815, 11018, 25123, 413371, -17756, 107374, 360096, 551980, 125437, -36827, 143141, 187248, 353743, -40085, -93917, 198915, -18722, -3914, 91314, 105231, 211119, -126880, -61001, 208056, -40028, 92376, 112222, 163724, 309890, -55595, 27161, -97463, 32066, 400173, -92157, -137276, 197735, -41960, 78095]
15276A327K6710J15180n549c1194n119p839p0610n3157N6058c1501A92617q1648
15264A10969C7840J85301h7969F4331J8850J45393F1450a69964h0874A27440b12007
15252A78160D3465J2268J8184a42647G3683a36575j91619A80155f8051A22423
15241C42123q2992q1099c30480a45809C54126M3859A78589D4614a35343I2572
15230A85920K72047K08148M20392M06257k06892J81955o51568j47337B32140l1079
15220B01061n0337J46397p4999j9093H2590J15625F4580B6716a0784k08303C76897
15208E9594a06201j75A71113J96425a31877A19576J87662Q8939d46428a34529
15197g9675D95937a1769D3158K61150c04818A9390Q906i4219D7244a69421A25742
$$ y = [1327, 28037, 143217, 137668, -31194, -36313, -44152, -114762, -167919, -111861, -31501, 192617, 110969, 37840, 223141, -87969, 64331, 83181, 228574, 61450, -169964, -80874, 127440, -212007, 178160, 43465, 55733, 73917, -142647, 73683, -136575, -328194, 180155, -68051, 122423, 342123, 259131, 178032, -330480, -145809, 354126, 397985, 178589, 44614, -135343, 92572, 185920, 457967, 666115, 1086507, 1492764, 1285872, 1467827, 816259, 668922, 232140, 201061, 150724, 297121, 222122, 203029, 82590, 198215, 64580, 26716, -10784, -219087, 376897, 59594, -106201, -106376, 171113, 367538, -131877, 119576, 307238, 396177, -446428, -134529, -79675, 495937, -11769, 43158, 304308, -304818, 19390, 28296, -94219, 47244, -169421, 125742]
15185C45735A02173K8579J01737P3553a53940A85722b30926C81190A01231O4195
15175A65426a25626D8735q233a38177D3809K01713j01514J41344b19536R8500
15165a21036A10481M8403F7258R7728p7914m3244a51831a7267A3478K64279A343
15153A34697i2276H4083l2352K37634G6769Q1851o0932l5187f2740B22043J17928
15142C39971e0142B70022a933C27320i0481p3012C47757b3591D08287A42205n2711
15131H9494J51597I192R8612J18448D975M06166i9683A42045d1554P686A52231
15119A22519c1673D63684C1397h503l78067I2576d5120G2524c45592B68456o4097
15108B04359J31817j09263O2076J50218B09283H5574Q5821H4024J72577I9020
$$ y = [345735, 102173, 130752, 232489, 306042, -153940, 185722, -230926, 381190, 101231, 165426, -125626, 48735, 40502, -138177, 43809, 245522, 144008, 285352, -219536, -121036, 110481, 158884, 67258, 164986, 87072, 43828, -151831, -17267, 13478, 277757, 1343, 134697, -92276, 84083, 51731, 289365, 76769, 158620, 97688, 62501, -62740, 222043, 339971, -50142, 270022, -1933, 327320, -90481, -163493, 347757, -23591, 408287, 142205, 89494, 241091, 9192, 107804, 226252, 4975, 411141, -99683, 142045, -41554, -33868, 152231, 122519, -31673, 463684, 31397, -8503, -386570, 92576, -45120, 72524, -345592, 268456, 204359, 336176, 226913, 288989, 439207, 209283, 85574, 171395, 84024, 256601, 99020]
15097b49545B12870q2841b65260B28575f3044C87016p3551A05655a4467l1346
15087d5813B08064n8432R6882q3316Q4071B5135O2242K6346J84967m4687J10268
15076C64271b22133C56877g8743B81862A09998d5735A04949J05673b52844A27300
15065C7410J2496M0768J11034J52109o5975j02462a24767F9374A0489J12936n1437
15054G1988N8744M0790k8707a4013A17390h5110C9090J32022c2916j56722C33909
15042B76912C2239L17210A72897E9393J89198J59345I5976L26343n5384j17107
15032B49828J54205J9731j25315O4680m1774C1165L11522C7714J59625J58573
15022C55912G3463K98878A49119J0356K56935n487o6902J20935N22006k00176
$$ y = [-249545, 212870, 130029, -265260, 228575, -63044, 387016, 313465, 105655, -14467, -45813, 208064, 149632, 246514, 163198, 247269, 25135, 87377, 113723, 298690, 254003, 364271, -222133, 356877, -78743, 281862, 109998, -45735, 104949, 210622, -252844, 127300, 37410, 49906, 90674, 201708, 353817, 287842, 185380, -124767, 69374, 10489, 123425, 71988, 130732, 171522, 142815, -14013, 117390, -85110, 39090, 171112, -32916, -189638, 333909, 276912, 32239, 349449, 172897, 59393, 248591, 407936, 95976, 422319, 366935, 249828, 404033, 423764, 298449, 363129, 321355, 31165, 342687, 37714, 197339, 355912, 73463, 372341, 149119, 159475, 416410, 410923, 344021, 464956, 986962, 786786]
15012G86786l60543j35989K82802j95647l6511L84124k18089j01138p8714J69343
15002D96424j25899P5638J39235A55527M45600A02463M13259l4742B11802j0671
14992B01131K05527J54993k1419j21436j64791L89308B98314J90691j98421O0930
14982C51514Q7309K03609C03389L37491B31339L43267A07377M42327k4354j57601
14972C67749A06542L28716J70139o5777K99081p1735K0572k0180o7670J56651
14962H56339j65546m5870J91560r1100j26757j16826K88906A99521R9063Q6195
14952C84779A17221L13796A71238K02060L2367J56195j80887F1853J58608J87305
14942D07766L633p7918A47005K29888j73781K33236j0389j46734r7200K68433
$$ y = [786786, 426243, 290254, 573056, 377409, 340898, 725022, 506933, 405795, 327081, 496424, 370525, 446163, 585398, 155527, 601127, 102463, 515722, 480980, 211802, 201131, 406658, 561651, 540232, 418796, 254005, 643313, 298314, 489005, 290584, 351514, 438823, 642432, 303389, 640880, 231339, 574606, 107377, 549704, 525350, 367749, 106542, 435258, 605397, 539620, 838701, 766966, 787538, 767358, 699688, 856339, 690793, 644923, 836483, 745383, 618626, 501800, 790706, 199521, 298584, 384779, 117221, 431017, 171238, 373298, 405665, 561860, 380973, 61853, 220461, 407766, 411399, 333481, 147005, 376893, 203112, 436348, 425959, 279225, 182025, 450458]
14932D50458K60292B32424L30259k00577L2592P6582J77371K23155l05405K46373
14922H12774p8184A56468L60662n6426K54138R0671j71551R5758J99908Q6307
14912A015935L8246M85961O6214q3837j58450K72263l3170j98270J61290J79721
14902A745903J28380L43971q3812l65367R9008j97161k92179R2647n06345r0700
14892H74345l91855K81483r2730j42865J5081R1788o775n7493J03970k69299K47730
14881F53380J58531l91400A65506R6637L8826j23778J92526K11152Q818K65691
14871H55378m0205l02268K60166J68726n4001D16879L08321k4525L01898l51990
14861F50583J3282p2603N5241O0207k36617j3121k14592J37228J56506K73589
$$ y = [450458, 710750, 232424, 562683, 362106, 394698, 471280, 648651, 871806, 566401, 812774, 734590, 156468, 517130, 460704, 714842, 805513, 633962, 729720, 929628, 1015935, 1054181, 1540142, 1606356, 1522519, 1364069, 1636332, 1603162, 1404892, 1566182, 1745903, 1874283, 2218254, 2134442, 1769075, 1868083, 1670922, 1378743, 1471390, 965045, 874345, 482490, 763973, 671243, 528378, 543459, 635247, 628472, 570979, 674949, 405650, 653380, 811911, 420511, 165506, 262143, 300969, 177191, 369717, 580869, 589687, 855378, 815173, 512905, 773071, 941797, 887796, 416879, 725200, 700675, 1002573, 650583, 663865, 591262, 646503, 706710, 470093, 456972, 242380, 379608, 536114, 809703]
14851H09703l75049K59068J31652k5170l41271j68589L14693K18339l57350j52648
14841C13378J216K73616o67j23076J8716J89690l24306K9570L43891j93519L88568
14830I17077k59656K3082j61899J85550N26870m40929K86553k49069J12997l7768
14820I02808K0575j58733j46773j39795J44913J02213j38615J29467j02102j19460
14810D94498J29226j95679L75268C71806L65833l19920p6873N02731k39183L4871
14800F39265n7220R1724J24979J84744k42992j47407K20511k02340j27502L55469
14790H39231j34710L20355n243l67547K34418j93909J74656A69707O85357k31587
14780F23477K01492j96485j42927j2687L92086l62869n0876P2318J86343J81745
$$ y = [809703, 434654, 693722, 825374, 800204, 458933, 290344, 605037, 823376, 466026, 313378, 314594, 588210, 587543, 464467, 483183, 672873, 348567, 378137, 722028, 528509, 917077, 657421, 680503, 518604, 704154, 1231024, 790095, 1076648, 827579, 940576, 902808, 923383, 764650, 617877, 478082, 622995, 725208, 586593, 716060, 613958, 494498, 623724, 428045, 803313, 371806, 737639, 417719, 340846, 843577, 604394, 639265, 582045, 673769, 798748, 983492, 740500, 593093, 813604, 611264, 483762, 839231, 704521, 1024876, 1019633, 652086, 886504, 692595, 867251, 169707, 855064, 623477, 824969, 628484, 485557, 472870, 864956, 502087, 451211, 523529, 709872, 891617]
14770H91617B91016N09922k09626O1906K5628C38810O01230j48493k50807K32574
14760G73314q6288R5728J19062o9351O507O8970l21064j44979K22033J30861k53557
14749E41236N01997k80033r0414K9527k51458M48755k97309K02763k09717K15954
14739H11301B56854J53817J24378L72723n1154l91754J15149J03605J784j35284
14729E50118q9254L83001o1650C44944K10966N34233k85999k22786M16896J03051
14719A101305l05622J32794M1927J17228j10162J49679l61358N71421K3399O43858
14709B004469o22214J99250l7006o11126L60068j47553j4232r113j82035K14114
14699A154622j01091J83416k32332j71554K466K82858Q3137q0797j11422m1244
$$ y = [891617, 291016, 800938, 591312, 653218, 678846, 338810, 940040, 791547, 540740, 773314, 687026, 782754, 901816, 832465, 838972, 907942, 586878, 441899, 663932, 794793, 541236, 1043233, 763200, 672786, 702313, 450855, 899610, 602301, 805064, 595347, 811301, 256854, 410671, 535049, 907772, 856618, 464864, 580013, 683618, 685402, 550118, 460864, 843865, 782215, 344944, 555910, 1090143, 804144, 581358, 998254, 1101305, 795683, 928477, 970404, 1087632, 977470, 1127149, 765791, 1337212, 1360611, 2004469, 1382255, 1581505, 1544499, 933373, 1293441, 1145888, 1131656, 1122543, 940508, 1154622, 1053531, 1236947, 1004615, 833061, 835527, 1118385, 1201522, 1120725, 1009303, 968059]
14689I68059J73727j57478L81625P0650l2160L9028L37028l52m60451j09501k55126
14678I55049m8299n4973K20835K42490k93430J70374D69478P02687j54114k87048
14668G31003j22880J15095M09860o9264Q793J8598j52202J172J47024K176K5576
14657A114951j18440j62352l5989K9657K37701Q2280j33619j5660j45815J11051
14647I63765J85979k18678j31687K69536l18291J53379L44696q4387J46635J3894
14637A324841k15034R0346J18608J28180l08012K81039k70087k09699K99161J67558
14627A406901j04938j32099J77644m25788N24395p231l51623O04762l76200M6296
14617A362119r2517j17622J89859j9847O0409Q5074L896q6612J3862J52125K18058
$$ y = [968059, 1141786, 984308, 1365933, 1436583, 1404423, 1443451, 1780479, 1780127, 1319676, 1210175, 955049, 906750, 851777, 1072612, 1315102, 1021672, 1192046, 469478, 1172165, 1018051, 731003, 608123, 723218, 1133078, 1063814, 1072607, 1091205, 939003, 940175, 1087199, 1089375, 1114951, 996511, 834159, 798170, 827827, 1065528, 1147808, 1014189, 998529, 852714, 963765, 1149744, 931066, 799379, 1068915, 750624, 904003, 1248699, 1164312, 1310947, 1324841, 1109807, 1200153, 1318761, 1446941, 1138929, 1419968, 1149881, 940182, 1239343, 1406901, 1301963, 1169864, 1347508, 921720, 1446115, 1438884, 1087261, 1692023, 1315823, 1362119, 1269602, 1151980, 1341839, 1321992, 1382401, 1467475, 1471371, 1384759, 1398621, 1550746, 1768804]
14606A768804o55691K65187j57637M47640l69146K21730j96695R4382j69660O70605
14596A919519m35638R0607J48593k98610K61119l39226R3589K26145q9450j39501
14586A437147J99474l53031K80221J74461R1559J24673k64099k56580K16053k0536
14576A629342J56478l3135k90801M09553J47944r3279l18617M1266J89851L11010
14566B149612J10763j14146p79725P06174n9516o9852L03266r6155j55862M4072
14556B038631J62771J15108M498j06226j1524J98249J15004n61K32367m16999
14546B331318L66511L14928M5429Q0866q0436N02488Q6483L89251J13667J045791
14536E196296P96884R92293K571362L721789P060795J0403847o15019j0950238
$$ y = [1768804, 1113113, 1378300, 1220663, 1668303, 1299157, 1520887, 1324192, 1418574, 1248914, 1919519, 1483881, 1574488, 1723081, 1424471, 1685590, 1346364, 1439953, 1666098, 1576648, 1437147, 1636621, 1283590, 1563811, 1738272, 1829831, 1954504, 1690405, 1433825, 1649878, 1629342, 1785820, 1752685, 1461884, 1871437, 2019381, 1926102, 1607485, 1648751, 1838602, 2149612, 2260375, 2146229, 1366504, 2072678, 2013162, 1943310, 2246576, 2150421, 1994559, 2038631, 2201402, 2316510, 2321008, 2214782, 2203258, 2401507, 2516511, 2515950, 2748317, 2331318, 2697829, 3012757, 3058186, 3139052, 3058616, 3561104, 3647587, 4036838, 4150505, 5196296, 5993180, 6985473, 9556835, 13278624, 20339419, 30743266, 30128247, 19178009]
14528A9178009o168720l768830k832607j294918O8386j86491j135529n14375m94606
14519B850319j07860l57428K1039J42668k93658J40019J50170j30559j19754O4080
14509B359036L7579K17233j66646k26803K09844k04574N09273q8404n7897o8702
14499B519939M04666l69712K07313J52363k54362L11467k70348J23435J12852
14490B937613L25188k91939k02093M39506R2144q9670q3375L70523k98037J1099
14480C210959P4176Q4337J96261Q6579l75557K34266K80158M90603p80891P4650
14470C575541L1239M43263k83570k79517O52389j81694n2474K73735k80881K92890
14460D190921j96298K29200J41014k85884K17997j12090K71852j89322K48379
$$ y = [19178009, 13009289, 9240459, 6407852, 5112934, 5181320, 4994829, 3859300, 3344925, 2850319, 2742459, 2385031, 2406070, 2548738, 2255080, 2395099, 2545269, 2414710, 2294956, 2359036, 2396615, 2613848, 2447202, 2220399, 2430243, 2225669, 2734942, 2646538, 2588641, 2519939, 2924605, 2554893, 2762206, 2914569, 2660207, 2971674, 2701326, 2824761, 2937613, 3262801, 2970862, 2768769, 3208275, 3300419, 3210749, 3127374, 3497897, 3199860, 3210959, 3285135, 3369472, 3565733, 3652312, 3276755, 3511021, 3791179, 4281782, 3500891, 3575541, 3606780, 4050043, 3766473, 3486956, 4139345, 3957651, 3905177, 4178912, 3898031, 4190921, 3994623, 4223823, 4364837, 4078953, 4296950, 4184860, 4456712, 4267390, 4515769]
14451D515769j74291M10938j20098L77930k77201K65883k36305P4403k50503M42676
14441E029201J15959K108j66254M40127r3016K31997k13632L82576j31633m647
14431E592786J36881J12242Q4753J05196K68439j5022j84804J16098J17941K0951
14421F355461K79581J75690l15430L22249O9068Q6150j9524M82355l56059J93808
14411G273349N9489N27117j80249J91229M79152k67296J28847m3235M42549K98568
14401H909520K68345p4669R277k89621Q6592M24037P1464K58029j8849K8276L11106
14390I983507M30976J89838m1850N56974j8621L4096L14826m83872M12915L27955
14380A1706744j63359M80958L06925l26277Q17836q2075M35118O6735J22925M33849
$$ y = [4515769, 4341478, 4752416, 4632318, 5010248, 4733047, 4998930, 4762625, 4837028, 4586525, 5029201, 5145160, 5147268, 4981014, 5421141, 5328125, 5560122, 5346490, 5729066, 5597433, 5592786, 5729667, 5841909, 5926662, 6031858, 6300297, 6285275, 6100471, 6216569, 6334510, 6355461, 6635042, 6810732, 6495302, 6817551, 6886619, 6972769, 6953245, 7435600, 7079541, 7273349, 7332838, 7859955, 7679706, 7870935, 8350087, 8082791, 8211638, 8168403, 8610952, 8909520, 9177865, 9103196, 9112473, 8822852, 8909444, 9333481, 9404945, 9662974, 9644125, 9672401, 9983507, 10414483, 10604321, 10562471, 11119445, 11100824, 11134920, 11449746, 10965874, 11378789, 11706744, 11543385, 12024343, 12331268, 12004991, 12822827, 12740752, 13175870, 13242605, 13365530, 13799379]
14370A3799379R2984N80834K61897L3937O72896J44067L81705J6885N45526M59479
14360A6989589K17691j06699O94115k4687P47356P2090K99040M96229L06910L01705
14350A9993339O59551M05698O23277M20833M46637M19317M03193L62823P14313
14341B4448981J59165R18914N74678M76192P89383P11577N75508P49197R46922
14332C0350517M83175Q43332M54675J231884J106539P82526Q31203J212656J083864
14323C8380371R37975J065494R69234J408544J256188J184083J573691J504385
14315D8279965J649376J596239J594563J696423J711894J939426K035202K146933
14307F2650021K055188K443722K678323K592770K717550K722041L104166K850703
$$ y = [13799379, 13892363, 14473197, 14735094, 14769031, 15441927, 15585994, 15967699, 15984584, 16530110, 16989589, 17207280, 17100581, 17794696, 17770009, 18517365, 18589455, 18888495, 19384724, 19691634, 19993339, 20652890, 21058588, 21681865, 22102698, 22549335, 22968652, 23371845, 23734668, 24448981, 24608146, 25527060, 26101738, 26577930, 27367313, 28078890, 28654398, 29403595, 30350517, 30833692, 31677024, 32131699, 33363583, 34470122, 35252648, 36083851, 37296507, 38380371, 39318346, 40383840, 41353074, 42761618, 44017806, 45201889, 46775580, 48279965, 49929341, 51525580, 53120143, 54816566, 56528460, 58467886, 60503088, 62650021, 64705209, 67148931, 69827254, 72420024, 75137574, 77859615, 80963781, 83814484]
14299H3814484L539240L230255L742630L893482M472594M334361M517034M973725
14291A16517805M947780O032286N894360O439246O531616P027411P504829P854189
14283A68749522R140907Q515588R313350R843810J0833991J0845961J1776448
14276B39019577J2627130J2868895J3938501J3963631J4504399J4958387J4739281
14269C36619801J4927622J4519150J4582872J4078821J3278492J2034885J1253852
14262D31295495R804897Q837823Q162238P059263M704911J139594n19754k873178
14254D67611289n978103p866645o670926n176664m969950r832282j1792523j3185520
14246D02138676j4471063j4103647j3382163j4600859j4692993j4356089j3503906
$$ y = [83814484, 87353724, 90583979, 94326609, 98220091, 102692685, 107027046, 111544080, 116517805, 121465585, 127497871, 133392231, 139831477, 146363093, 153390504, 160895333, 168749522, 177890429, 186406017, 195719367, 205563177, 216397168, 227243129, 239019577, 251646707, 264515602, 278454103, 292417734, 306922133, 321880520, 336619801, 351547423, 366066573, 380649445, 394728266, 408006758, 420041643, 431295495, 441100392, 449938215, 458100453, 465159716, 469864627, 471004221, 470484467, 467611289, 461633186, 453766541, 447095615, 441918951, 436949001, 427116719, 415324196, 402138676, 387667613, 373563966, 360181803, 345580944, 330887951, 316531862, 303027956]
14239C03027956j3506431j3445433j2798601j1789635j1311766j0779762j1181951
14232B18214377j0873978j0462677r930748r214627q437312q702669p597871p296193
14224A45698302o653923o027032n986003n420756n109759n118755m762028m452975
14216A02167071l554380m515114l478512l738519l225917k936517l224869k697576
14208G4795667l044357k445569k423786j887304k090590k364299j952936k009387
14200E6577439j545862j492650j917599j386948j701054j685142j127809r99012
14192D4721363j092507j256661j221838j591586j046754r73088q21537q31992
14184C5885400r88429q32178r80811j151432n09306o95697r62450p83788o22467
$$ y = [303027956, 289521525, 276076092, 263277491, 251487856, 240176090, 229396328, 218214377, 207340399, 196877722, 186946974, 177732347, 169295035, 160592366, 152994495, 145698302, 139044379, 133017347, 127031344, 121610588, 116500829, 111382074, 106620046, 102167071, 98612691, 94097577, 90619065, 86880546, 83654629, 80718112, 77493243, 74795667, 71751310, 69305741, 66881955, 64994651, 62904061, 60539762, 58586826, 56577439, 55031577, 53538927, 51621328, 50234380, 48533326, 46848184, 45720375, 44721363, 43628856, 42372195, 41150357, 39558771, 38512017, 37538929, 36717392, 35885400, 34896971, 34064793, 33083982, 31932550, 31423244, 30727547, 29765097, 28981309, 28358842]
14175B8358842o86082p21181o63879m35756o16412n20615n18813n62817m45399
14166B3187888m18493n68703l99297p99255m97787l04649k69240p59289k94160
14157A8877015j89364n28991j69409m98809O964k78858k00051o52432m86626j41633
14147A5737806m95724K4797k65721m36376l45025J21158l12310m71490r1537J01964
14137A3567542n99166k0971j70268m48628R9669o08313J17742q7503n80226j94244
14127A1075634L81113l37696j25938k94090l01048J25020k80188k4565m14253
14118I803989J49039o8909n47986q2333q7467o2115o054l59677J96395j70415
14108H764467j69850k17650J20733j83468j21299j97432j67847J8967O8708l46315
$$ y = [28358842, 27672760, 26951579, 26287700, 25851944, 25235532, 24714917, 24196104, 23633287, 23187888, 22769395, 22200692, 21801395, 21002140, 20504353, 20199704, 19930464, 19171175, 18877015, 18687651, 18158660, 17989251, 17490442, 17497406, 17218548, 17018497, 16366065, 15879439, 15737806, 15242082, 15266879, 15001158, 14564782, 14219757, 14340915, 14028605, 13557115, 13465578, 13567542, 12968376, 12947405, 12777137, 12328509, 12428178, 11819865, 11937607, 11850104, 11269878, 11075634, 11456747, 11119051, 10993113, 10699023, 10397975, 10522995, 10242807, 10218242, 9803989, 9953028, 9884119, 9336133, 9253800, 9166333, 9104218, 9098164, 8738487, 8934882, 8764467, 8594617, 8376967, 8497700, 8314232, 8192933, 7995501, 7827654, 7846621, 7915329, 7569014]
14098G569014N4244n5109k62123R9849o15797L50546m01114J20000J55397j98315
14088F816592k69923J19044J0731l47572J00279m4336m43893J39758M3230K84280
14078F408190n34961j37478q0684n6070J00024j65469K22615k12906m14970J39957
14068E268248o2793j00193k68208L01254o2951N8816m52042K62198l97371K14405
14058D761363J07122J95997q5282j26029j91700j24678l16723k05270O38230m99420
14048D153610M29369Q7012o27341J82770M3412K5325l16951J59331J66349O6794
14038D369680m43022j80444K0457R7236m1975q3582P4682M1915k89480l9840l13869
14027C211758M20889l41608Q6098K67573p27067N67094l99404J04846J87232k97683
$$ y = [7569014, 7623258, 7568149, 7306026, 7405875, 6790078, 7140624, 6739510, 6859510, 7014907, 6816592, 6546669, 6665713, 6676444, 6328872, 6429151, 6384815, 5940922, 6080680, 6123910, 6408190, 5873229, 5735751, 5655067, 5598997, 5699021, 5533552, 5756167, 5543261, 5128291, 5268248, 5205455, 5105262, 4837054, 5138308, 5075357, 5134173, 4682131, 4944329, 4546958, 4761363, 4868485, 5064482, 4979200, 4853171, 4661471, 4536793, 4220070, 4014800, 4653030, 4153610, 4582979, 4669991, 4042650, 4225420, 4268832, 4294157, 3977206, 4136537, 4302886, 4369680, 3926658, 3746214, 3766671, 3863907, 3821932, 3738350, 3813032, 3854947, 3565467, 3525627, 3211758, 3632647, 3291039, 3377137, 3644710, 2917643, 3484737, 3085333, 3190179, 3377411, 3079728]
14017C079728M10009l02696J59307n9822m62556K97686O941j64204L6896j97361
14007B803928K84829j07978j76170J98487q5588j11695j88025O7557j48497O00469
13997C137317p21354L64431J48949l69209Q7972k18937k0496j79405K57451n78506
13987A908213O22564p0184j09446K8661Q140k53018N37504m11066N66582j34695
13977B693255N64414K77144J000894J360855K818661O037566J1630362M877591
13969C1260742q219120o661353m140581l238019j974343j076098j042065p38645
13961D170518k71786J35720n24466l4680m46166r0009k93813L17388j28545k48959
13951B585202R0915J17706l17759L60423o10006j43039J30745L5066j5745k78069
$$ y = [3079728, 3489737, 3187041, 3346348, 3286526, 2823970, 3121656, 3128597, 2964393, 3001289, 2803928, 3088757, 2980779, 2804609, 3003096, 2917508, 2805813, 2617788, 2685345, 2536848, 3137317, 2415963, 2780394, 2929343, 2560134, 2648106, 2429169, 2408673, 2229268, 2486719, 1908213, 2530777, 2460593, 2351147, 2379808, 2387948, 2134930, 2672434, 2261368, 2827950, 2693255, 3257669, 3534813, 4535707, 5896562, 8715223, 14752789, 26383151, 31260742, 23041622, 16380269, 12239688, 9001669, 7027326, 5951228, 4909163, 4170518, 3898732, 4034452, 3509986, 3475306, 3029140, 2939131, 2645318, 2962706, 2834161, 2585202, 2676117, 2793823, 2476064, 2836487, 2226481, 2083442, 2214187, 2249253, 2233508, 1955439]
13941A955439P8547J30970j60664q372J72283j80798K66569l32994K6779R0916
13931B038675j479J34841k87085j10715J86607N4430l17273N24252k88977O5616
13921A998892N8195k20033J20850l00832J64521k63057K91488j98842l2029j86007
13911A433146K83350j2069k0955k0334j41112J44109k02573K17113l77621M49023
13901A752077L07213m15245k42251L53327j39203k13567O080J30837L63489n54313
13891A348444R2018J44549m0756k68830J29449L29000m99418K07584j46755K07962
13881A503247l68629L06529Q2867l90523J22208J7355p7285N37297m61549J8831
13871A290348J73763O4187j41111J33283j66120j07749l31630L46184Q7892R3699
$$ y = [1955439, 2033986, 2164956, 2004292, 1995920, 2168203, 1987405, 2253974, 1920980, 1947759, 2038675, 2037196, 2172037, 1884952, 1774237, 1960844, 2015274, 1698001, 2222253, 1933276, 1998892, 2057087, 1837054, 1957904, 1657072, 1821593, 1558536, 1850024, 1651182, 1619153, 1433146, 1716496, 1704427, 1683472, 1663138, 1522026, 1666135, 1463562, 1680675, 1303054, 1752077, 2059290, 1644045, 1401794, 1755121, 1615918, 1402351, 1408431, 1539268, 1902757, 1348444, 1440462, 1585011, 1544255, 1275425, 1404874, 1733874, 1234456, 1442040, 1295285, 1503247, 1134618, 1441147, 1524014, 1133491, 1255699, 1273054, 1195769, 1733066, 1271517, 1290348, 1464111, 1528298, 1387187, 1520470, 1354350, 1246601, 914971, 1261155, 1349047, 1442746]
13861A442746j56233k56623L46328l33206J84182O8841j70040k8400K13242N0423
13851A361260k77162J4621L11598m85369K77555k56841K39437j40528J6817j24210
13841I37178J04383l07976J81037L65470m05881M57829p3794j20520J64507j90431
13831A111802j75013n6283K56905j19866l07035L45553K64378m84195N65942j78182
13821A224006j79594K02317j0527R172l58703J04513M7993q189j24414K48423
13811A154997K23131m25953j32655J60594n4784j71661M06278k60887L47824n03511
13801G43373L29857j87906K66031j53318j81366K60493k92195J94188j75320j33662
13791F70175K8941J35622j22059m2296P9182K68869k86455L62100m69704K55834
$$ y = [1442746, 1286513, 1029890, 1376218, 1043012, 1227194, 1296035, 1125995, 1097595, 1310837, 1361260, 1084098, 1098719, 1410317, 924948, 1202503, 945662, 1185099, 1044571, 1061388, 937178, 1041561, 733585, 914622, 1280092, 874211, 1332040, 1258246, 1137726, 1302233, 1111802, 936789, 880506, 1137411, 1017545, 710510, 1056063, 1320441, 836246, 1402188, 1224006, 1044412, 1246729, 1236202, 1245374, 886671, 991184, 1039177, 1030988, 906574, 1154997, 1378128, 952175, 819520, 980114, 925330, 753669, 1159947, 899060, 1246884, 743373, 1073230, 885324, 1151355, 998037, 816671, 1077164, 784969, 979157, 803837, 670175, 699116, 834738, 712679, 670383, 749565, 1018434, 731979, 1094079, 624375, 880209]
13781H80209m7822M41108m26737j56673K64492n2015Q727k48793K10965k46906
13771F26555J59512J90338k04020j78272J32174J4537L75582n22817J42425L04570
13761A040584n7355m30244K65021J90538m57913N8284L57113k19601m3545R0807
13751G93689J08389j28978k76350L21537r8786j31142K90109k32056J78015k40894
13741E83533K03314K878j04318j66424M10172k38023K18877l11451O3311N4408
13731G16277k83389L55188O2950j89993J52258l35621N26101l40954r0669J32303
13721G04451q2256m5442J82995Q2915p5836r687k02579o9337J83089J18121l52381
13710D34053K34276j27918o8358P9154N1337B31345M50158k22938M1222J68756
$$ y = [880209, 832387, 1273495, 846758, 690085, 954577, 902562, 911289, 662496, 873461, 626555, 786067, 976405, 772385, 594113, 726287, 740824, 1116406, 593589, 736014, 1040584, 983229, 552985, 818006, 1008544, 550631, 608915, 966028, 746427, 702882, 793689, 902078, 773100, 496750, 818287, 719501, 588359, 878468, 646412, 824427, 583533, 786847, 789725, 685407, 518983, 929155, 691132, 910009, 598558, 661869, 716277, 432888, 788076, 851026, 661033, 813291, 477670, 1003771, 662817, 572148, 704451, 622195, 576753, 759748, 842663, 766827, 757140, 554561, 485224, 668313, 786434, 434053, 668329, 540411, 472053, 551207, 602544, 231345, 681503, 458565, 499787, 668543]
13700F68543k43754K37686k68278J98633j46017p881N022K01351J1177O1125j00233
13689F17374j52619J65194j46204L10889C80913K02348K0857k04574k0692r9407
13679B79445j25903L83161K32038l18960J8283Q2708j57889J40147M3448J20501
13669F96979j92156J53369k03306K52614k75615r294G0194M69131j02209j20087
13659C17029J18976r4039J1310J13276P1935j74735j33231O32260q5511q9593
13649F87677A93006K94127q3116j48426J22820M0906J2015Q2517J46963o0919
13639E99893k28744K61197O2498C35974J28527J95216A82672D6108M02622N1835
13629E00565p7120j37294M20K04615J3211r2485o5696q5854r9295J81904K13754
$$ y = [668543, 424789, 662475, 394197, 592830, 446813, 438932, 443954, 645305, 656482, 717607, 617374, 464755, 629949, 483745, 794634, 380913, 583261, 604118, 399544, 378852, 279445, 153542, 536703, 768741, 449781, 468064, 550772, 392883, 533030, 576478, 696979, 504823, 658192, 454886, 707500, 431885, 422591, 70194, 539325, 437116, 317029, 436005, 341966, 353276, 466552, 538487, 363752, 230521, 862781, 777270, 687677, 193006, 487133, 404017, 255591, 378411, 419317, 431332, 513849, 660812, 599893, 371149, 632346, 694844, 335974, 464501, 659717, 182672, 46108, 448730, 500565, 423445, 286151, 286571, 491186, 504397, 411912, 346216, 260362, 161067, 342971, 556725]
13618E56725k6989J13594p0836j05578l7535J70270C3850M01106A79075L39181
13608E18256r3360Q1626j13677Q8562o520A52941C751M24395j71623K28671N1225
13597E36419o4348R4736j64056R844Q2120n8146J49673k2139p9830L9748p8524
13586D45497k22116L60440j35910j30596J76700n2872B04271K05377L38142C00832
13575C84858j42635J80167A53371P9369K91959A85820P2340l4061n1747K19600
13565C91952K91187l32852Q1579J33853o9294q2110P9009E4738K69841N6799k4880
13554C56498j61197K82341k00993j35302K94226I8400M26659j04013J63253A25687
13543D37085k9212A25742L06870j89217J99687j01862L9416J10850B38932d264
$$ y = [556725, 529736, 643330, 572494, 466916, 429381, 599651, 33850, 434956, 179075, 518256, 424896, 506522, 392845, 481407, 474887, 152941, 3751, 428146, 256523, 485194, 536419, 472071, 566807, 402751, 412595, 494715, 436569, 586242, 564103, 484273, 524021, 445497, 223381, 583821, 447911, 317315, 494015, 441143, 204271, 409648, 747790, 300832, 384858, 242223, 422390, 153371, 232740, 524699, 185820, 258160, 224099, 172352, 391952, 683139, 350287, 431866, 565719, 496425, 414315, 493324, 54738, 324579, 381378, 356498, 195301, 477642, 276649, 141347, 435573, 98400, 525059, 421046, 584299, 125687, 437085, 407873, 125742, 432612, 243395, 443082, 341220, 380636, 491486, 238932, -4264]
13532A47693J47588j01317n0797J72456a58123B83437J46601q9413A1416K48510
13522B59926L3134K45981A58299K84605B05243O2919j32743K52455A10906M38831
13512E49737B42305K6625N746J00306R0430r4660D1107L28227J8814R0273A53956
13500A69214J73813r2415J69716H6744K62008E3796J07001M17117q5781H3317
13489F19650A86623J32879A01209K43850p6604A21800J48918J2193L89561k7285
13479F45187A01390K34631K08864A11355P7462q0882L25928A36547K7375O0334
13469B24256Q8319j05039J99446D5441K41585L36374F6635M30937d3966D5303
13458I6952J75559h4779D08602j81166m6079K21957A31528r783h362C61140I3296
$$ y = [147693, 295281, 193964, 143167, 315623, -158123, 283437, 430038, 340625, 11416, 259926, 293060, 539041, 158299, 442904, 205243, 268162, 135419, 387874, 110906, 549737, 242305, 268930, 274676, 374982, 465412, 370752, 41107, 369334, 388148, 478421, 153956, 169214, 343027, 250612, 420328, 86744, 348752, 53796, 160797, 577914, 492133, 83317, 619650, 186623, 319502, 101209, 345059, 268455, 121800, 270718, 282911, 672472, 645187, 101390, 336021, 544885, 111355, 188817, 107935, 433863, 136547, 163922, 224256, 312575, 207536, 406982, 45441, 287026, 623400, 66635, 497572, -43966, 45303, 96952, 272511, -84779, 408602, 227436, 181357, 403314, 131528, 121745, -8362, 361140, 93296]
13446A80853J79476j46483K02590L502j11094B1285K38380D3688J43801Q9298
13436B76787D5334K34427a7041D01957j68510J5282J02363G5540d3535A60982
13425C24592j04357B9061L81625I7424J45232Q0518J08263K19094k19527q2050
13415C48954n3778b857B1128K86260K0823j29292q4249Q1997B916L97711j98320
13404B02307k7700O6132H477M12660B02031r1540a57011B94953H1645J0407N67486
13393F59538k29273j40741D5886K1993J32833k3646J2995K4305a34653C97049
13382A60592J95079g6833C05317H9313k9827K49990E7447a31440B98943i835B20630
13370A69451K68686G0773M5573e071B13317D7363e0622B27224R7423A18590M9561
$$ y = [180853, 360329, 213846, 416436, 419938, 308844, 21285, 259665, 43688, 187489, 276787, 45334, 279761, -17041, 401957, 233447, 248729, 351092, 75540, -43535, 160982, 324592, 220235, 29061, 410686, 97424, 242656, 323174, 431437, 650531, 431004, 348954, 295176, -2857, 21128, 307388, 328211, 198919, 114670, 196667, 2916, 400627, 202307, 174607, 240739, 8477, 421137, 202031, 110491, -157011, 294953, 81645, 92052, 659538, 430265, 289524, 45886, 67879, 200712, 177066, 190061, 214366, -134653, 397049, 160592, 355671, -76833, 305317, 89313, 59486, 309476, 57447, -131440, 298943, -9835, 220630, 169451, 438137, 70773, 116346, -5071, 213317, 47363, -50622, 227224, 324647, 118590, 168151]
13359A68151R9129j11306p0562L22761j63676K11672A26074R4991A07527h6694
13348B84828o8560E6476K82323J21772j23833n2419J37354A30123J43085J89622
13338D62830i5257A18841N08864F2052K44735I6419J43634o7289L63322G0495
13327B20079J012J60111j52626F5023L8434N3825F9655L53714K5198A17559N00996
13316F18555B38007A10978A9915a02699D98417k41720J36104l6971n8448a23261
13305E44739A65462K98883j88190m8452K27424o5917c6131C92944N7069E5751
13294A25452K80612j79112L8366j16784M62097B7703K32749e8846B56444c03033
13283A66538L39174A6113M56590A04480J76083P1008f0201j232E8965a06687B31088
$$ y = [168151, 267280, 155974, 85412, 408173, 244497, 456169, 126074, 221065, 107527, -86694, 284828, 216268, 56476, 338799, 460571, 336738, 284319, 421673, 130123, 273208, 462830, -95257, 118841, 627705, 62052, 306787, 96419, 240053, 172764, 536086, 70495, 220079, 221091, 381202, 228576, 65023, 103457, 157282, 69655, 423369, 448567, 117559, 618555, 238007, 110978, 19915, -102699, 498417, 256697, 392801, 355830, 297382, -123261, 544739, 165462, 464345, 276155, 227703, 455127, 389210, -36131, 392944, 450013, 55751, 125452, 406064, 226952, 265318, 148534, 610631, 27703, 260452, -58846, 256444, -303033, 166538, 505712, 16113, 472703, 104480, 280563, 351571, -60201, -61433, 58965, -106687, 231088]
13271D1867A6772K35502o5830p2499J04350m5257q5432c3565A19627E5705Q1600
13260A37305O8886b2560l4928A18640b72238D9436a0913k18224A57313J10078
13250B67391e1143B6817K00721K076a14419F20971b1492j0710C02288A29035C0756
13238c5539A38094M387K11284k1092C2924K35638Q1588i147D5103L45442A17316
13226C14104q6240p8745L7390n8790d1316A96853r0441d2237B42988R8165C6820
13214C53014j30994E9764J1494K16445A15892Q9335F1659a9470A38873f9095n1181
13203a20276E9132d5914B38387m6094a98340A33809P3751i9177A54581J49953
13193C04534a50008A05104k9093a89705A86017p8803b7731A49230R0603b16673
$$ y = [41867, 16772, 252274, 186444, 113945, 218295, 173038, 87606, -33565, 119627, 55705, 137305, 206191, -22560, -57488, 118640, -272238, 49436, -10913, -229137, 157313, 267391, -51143, 26817, 227538, 229614, -114419, 620971, -21492, -32202, 302288, 129035, 30756, -35539, 138094, 142481, 353765, 332673, 32924, 268562, 350150, -9147, 45103, 390545, 117316, 314104, 227864, 149119, 186509, 127719, -41316, 196853, 106412, -42237, 242988, 341153, 36820, 353014, 222020, 59764, 71258, 287703, 115892, 205227, 61659, -19470, 138873, -69095, -120276, 59132, -45914, 238387, 192293, -198340, 133809, 207560, -99177, 154581, 304534, -150008, 105104, 76011, -189705, 186017, 107214, -27731, 149230, 239833, -216673]
13182b03107e992A25539L70337F2415H563f6681H3999l978a76886b048B88280
13170A7629J08691J72683a7157C5640i5113m2286H3499L72534k25263j05129J82254
13159C07895n5569D9264K16205I7362M95056B53622a8707j49159A61268K2700
13149A83968L09682A23983a89217h7857D31345A54321C934d8780A45696a05968
13138E2549M64419D0868J96927j13131k1085C0447a88874d5540A45343g4269C29944
13126a88904C73596A70611J44404c2302B16785a26508n8793b9109B76911j32236
13116A44675K10038A2063J78841J25374A10491a05H0153b67470F1671b4235j47224
13105a71459c1949k7424D1017K18916m9707b028l0618j65631D19947g7883a748
$$ y = [-203107, -5992, 125539, 495876, 62415, 8563, -66681, 83999, 80021, -176886, -2048, 288280, 17629, 126320, 299003, -17157, 35640, -95113, -137399, 83499, 456033, 230770, 125641, 307895, 252326, 49264, 265469, 97362, 592418, 253622, -18707, -167866, 161268, 183968, 493650, 123983, -189217, -87857, 431345, 154321, 3934, -48780, 145696, -105968, 52549, 516968, 40868, 237795, 124664, 103579, 30447, -188874, -45540, 145343, -74269, 329944, -188904, 373596, 170611, 315015, -32302, 216785, -126508, -185301, -29109, 276911, 144675, 354713, 12063, 190904, 316278, 110491, -105, 80153, -267470, 61671, -24235, -171459, -31949, -59373, 41017, 259933, 210226, -2028, -32646, -198277, 419947, -77883, -1748]
13093a30730n069c4241I0535K4416a89957l9016A37845O9436C995a87053A6567
13081A15839J24199r0210K5742N2468j7814k8559C4301c3045A2186K23954o4412
13070A71728a04347c9560D7972n101c7963B42500P355a05894J2368C39357f4147
13058B31283J26418p8780A18448m5032N3553Q2978M5683b31546p0642b8763B36174
13046C91180r7763j19582P5958J40736a71698A33086Q5615B6834K45779o3362
13036B09251l9029k0939i5848A66683J02062h4999A89980b65884a11531l1399
13026a42930j18883Q5576A29204a91813P8206D62567k10576H8994h1099L7489
13016d3610o1175n1987d1361k58B47009d96154B89093q9948F0898a75396J5144
$$ y = [-130730, -135799, -34241, 90535, 114951, -189957, -228973, 137845, 207281, 3995, -187053, 16567, 115839, 240038, 149828, 175570, 228038, 210224, 181665, 34301, -33045, 12186, 236140, 171728, -104347, -39560, 47972, 42871, -37963, 242500, 249855, -105894, -93526, 339357, -64147, 231283, 357701, 278921, 118448, 73416, 126969, 209947, 255630, -231546, -302188, -28763, 236174, 391180, 293417, 173835, 249793, 390529, -171698, 133086, 218701, 26834, 272613, 209251, 170222, 149283, -95848, 166683, 268745, -84999, 189980, -265884, -111531, -142930, -261813, -176237, 129204, -191813, -113607, 462567, 251991, 88994, -81099, -43610, -104785, -156772, -41361, -41619, 247009, -496154, 289093, 199145, 60898, -175396, -160252]
13005a60252H611J94041l4830Q0050a61909L8339c1738B95662a110B17537E990
12993C91192A44128J88091A12008R5112i2848A64129n4235b6856A25197J52604
12983B77801b4866J1447M514B90427a55312C78191b86419i3916A40386n2339a5477
12971D27787a27328j42944D26083C6578a18432B38859A3695K8724J18483F8887
12960b01183A7157J77931E5441a30417d6001k0429A80841h5800E5282a79158A9768
12948a65239d1197l308A01545J55062i4885B59159a38501C51a33978B61348j26542
12937A34806l4412J8234a34352k8633A7537a96233D2364a09006D1034J62784r6422
12926A07396l4777b82877d6632k0812q4525B46805c36846b4135A34215a60076
$$ y = [-160252, 8611, 202652, 167822, 247872, -161909, -123570, -31738, 295662, -1110, 217537, 5990, 391192, 144128, 332219, 112008, 207120, -92848, 164129, 109894, -26856, 125197, 277801, -24866, -13419, -8905, 290427, -155312, 378191, -286419, -93916, 140386, 88047, -15477, 427787, -127328, -270272, 426083, 36578, -118432, 238859, 13695, 42419, 160902, 68887, -201183, 17157, 195088, 55441, -130417, -46001, -66430, 180841, -85800, 55282, -179158, 19768, -165239, -41197, -44505, 101545, 256607, -94885, 259159, -138501, 351, -133978, 261348, 134806, 100394, 118628, -134352, -162985, 17537, -196233, 42364, -109006, 41034, 203818, 107396, 72619, -282877, -46632, -67444, -151969, 246805, -336846, -24135, 134215, -160076]
12915D03101a51669C56950a43334C23284f1603B1086a79957O3531j95361a14436
12904a30203r4814b5383n1238A2832M6270J50591a83255k9387E8123c6270A50124
12892a76645D3541J35763c54621h2221A10379i989A39346b12733O0275M8207I8873
12880A21441C5756a26773K8976g700B34624D8345K39775h4847D6846A9840O7410
12869H7250M3636b31611j79788B86234I4776M8644c1492B50373a05619j949A29721
12857B3132J74163o6257a50166O9951C01801j17730o7077B4573J85499a53496
12846B51397a32398B88796d1367K0656j52781A00530J98545A26639C2410J33187
12836A65597J29647A08716d8748P065l19819G2442j0061b3351A18441Q1104b36601
$$ y = [403101, -151669, 356950, -143334, 323284, -61603, 21086, -179957, -116426, -311787, -114436, -130203, -225017, -25383, -76621, 12832, 59102, 209693, -183255, -212642, 58123, -36270, 150124, -176645, 43541, 179304, -354621, -82221, 110379, -9989, 139346, -212733, -152458, -104251, 98873, 121441, 35756, -126773, -97797, -7700, 234624, 48345, 288120, -84847, 46846, 19840, 87250, 130886, -231611, -411399, 286234, 94776, 143420, -31492, 250373, -105619, -107568, 129721, 23132, 197295, 131038, -150166, -80215, 301801, 184071, 116994, 24573, 210072, -153496, 251397, -132398, 288796, -41367, -20711, -173492, 100530, 299075, 126639, 32410, 165597, 295244, 108716, -48748, -41683, -361502, 72442, 62381, -23351, 118441, 199545, -236601]
12824A44756P5837a00525A67816D4150J23267b72696A71986k5449m130K4139k7059
12813A39487b15538g1438B23146c30866A58705o4296Q2841F0362b28779G2531
12802a06668A10685A8889L2037a26657A18544C8763a78046Q8230I8957a19608
12791a04054A7923K05613o3422k2368N4466J09631A28041J31968a03290A83624
12780i4435D24141I8531c29365D7727c50229a63077L5716A10205a18017G4828
12769D8866I103K84523l4971b3945B80580a08414m6913F9622b42644c5430j46066
12758a81496c2756B39908b10750A9935K2605R3555K77293A07275e299A04991l4483
12747G0508D372d5639A61999a55037f4711j22587A33042d5800A49854Q8985b72347
$$ y = [144756, 220593, -100525, 167816, 44150, 167417, -272696, 171986, 146537, 142407, 166546, 139487, -215538, -71438, 223146, -330866, 158705, 94409, 177250, 60362, -228779, 72531, -106668, 110685, 18889, 50926, -126657, 118544, 38763, -178046, -89816, 98957, -119608, -104054, 17923, 223536, 160114, 137746, 192212, 301843, 128041, 260009, -103290, 183624, -94435, 424141, 98531, -329365, 47727, -350229, -163077, -127361, 110205, -118017, 74828, 48866, 9103, 293626, 258655, -23945, 280580, -108414, -155327, 69622, -242644, -35430, -181496, -32756, 239908, -210750, 19935, 42540, 136095, 413388, 107275, -5299, 104991, 70508, 4372, -45639, 161999, -155037, -64711, -187298, 133042, -45800, 149854, 238839, -272347]
12735C37J96170I3248J23463J2876N1385b54258A03278R751m9759L51906A65623
12723a68733A9102P1251a29287A8978g3287n4209A20137c5558A54338A0441K05208
12712B15649G8433f0676B98123A33564a52829I0330g8605D004e6684k626A50400
12700b45202h7346n1419k8831K7752A16544R6099N5105D6698P3815J62876A20810
12688D30939b2609A70559E4650c33978P6995j02281D19002A46305O8183m5449
12678A69039e2432k59612J25883A35829a95838B37870l7501a84695A42407a18487
12667A19198J67309F5911J0685K11016H6965a01792H0459B3318L64800b5740A44918
12655f1911B621M61438b1171B26094D6796b66946J10949b6129E2385a34487L1026
$$ y = [337, 196507, 93248, 216711, 229587, 280972, -254258, 103278, 113029, 63270, 415176, 165623, -168733, 19102, 90353, -129287, 18978, -73287, -127496, 120137, -35558, 154338, 10441, 215649, 78433, -60676, 298123, 133564, -152829, 90330, -78605, 4004, -56684, -59310, 150400, -245202, -87346, -138765, -167596, -139844, 116544, 212643, 267748, 46698, 120513, 283389, 120810, 430939, -22609, 170559, 54650, -333978, -256983, -359264, 419002, 146305, 214488, 169039, -52432, -312044, -186161, 135829, -195838, 237870, 200369, -184695, 142407, -118487, 119198, 286507, 65911, 76596, 287612, 86965, -101792, 80459, 23318, 388118, -25740, 144918, -61911, 2621, 464059, -21171, 226094, 46796, -266946, -155997, -26129, 52385, -134487, -103461]
12644a03461B74943F7403J87333h7223A07348L03996j44653A25290B8425K05893
12634B34318P7666r3356p410F3761J46574L2305a49508n5764N3819A28451i8276
12622I8566C811b3441j76923H246a14504B1109K6930J60033B1829K04167I5766
12610B46130A00269J5408d9409j5827A28304n1515g4411A27921n525e0453A07195
12598F396O1426K1066j7732J6865b4820q3844a1715I2953b3738C86900A11787
12586B0007d9200k6740B6385b4929A60704c0923E8499N0372K3677f8991p4496
12575a43487D4572a89242e9009a9708B55064N7258F9835a78557G6691Q2969M5212
12564B04872D3370K1698l1683d3555j44508R2223k8945B58845M0550e7864l8720
$$ y = [-103461, 274943, 67403, 254736, -87223, 107348, 411344, 266691, 125290, 28425, 234318, 311984, 218628, 211218, 63761, 210335, 242640, -149508, -205272, -151453, 128451, -98276, 98566, 3811, -23441, -200364, 8246, -114504, 21109, 48039, 208072, 21829, 225996, 95766, 246130, 100269, 115677, -49409, -65236, 128304, 76789, -74411, 127921, 122396, -50453, 107195, 6396, 67822, 88888, 71156, 88021, -24820, -108664, -11715, 92953, -23738, 386900, 111787, 20007, -49200, -75940, 26385, -24929, 160704, -30923, 58499, 108871, 132548, -68991, -143487, 44572, -189242, -59009, -19708, 255064, 312322, 69835, -178557, 76691, 159660, 204872, 43370, 65068, 33385, -43555, -188063, -95840, -124785, 258845, 299395, -57864, -96584]
12553i6584L1448A67681g8235A9013L06349a32868A52128k6637a79311B06434
12542f8577r3069B5355i0971J066j83340A31780a27878r8912M6822B5192f2719
12530a19962d0740o193p7790C30531a8837A51427a80900g9928c8193H8588e9754
12518a0848d449l18960B69116b1324j4551j75852B75851A13765K52938b5343A12821
12506c69911B3107f066l32003B13399a20909b5962j05511J0956E932R6981a42974
12494I889L27978B9412a57460f1071A51512R7926a58081J108L241c131B82528
12482a18279E1242K5751b6097j75875A40704B9048J76459A00345R9174g2616l3023
12471a05639K4037B83571a65202B61400A2152a44973n1202A49484d46554a64099
$$ y = [-96584, -65136, 167681, -78235, 19013, 325362, -132868, 152128, 125491, -179311, 206434, -68577, -161646, 25355, -90971, -89905, -273245, 131780, -127878, -226790, -179968, 25192, -62719, -119962, -40740, -46933, -124723, 330531, -18837, 151427, -180900, -79928, -38193, 88588, -59754, -10848, -4449, -323409, 269116, -21324, -35875, -211727, 275851, 113765, 366703, -25343, 112821, -369911, 23107, -6066, -338069, 213399, -120909, -25962, -131473, -120517, 5932, 102913, -142974, 9889, 337867, 29412, -157460, -61071, 151512, 249438, -158081, -156973, -153732, -3131, 282528, -118279, 51242, 76993, -26097, -201972, 140704, 29048, 205507, 100345, 199519, -72616, -105639, -81602, 283571, -165202, 261400, 12152, -144973, -196175, 149484, -446554, -164099]
12460g6108b422j64763j84539h4025q9350A35755o1389g4311B4049a39819G2504
12448b01144D4935L9971c54332b7010a512k67716A45243l7108a76059j43183A09131
12436A68046p7597a62015p1494a2489e05B09252A7427a5271A20715J15629M4457
12425B80801F2024c1122F3079a51074A8815a24479B9796b28621h4995A08731b387
12413B19290c46321J62873P1855j16529R8557C8138b1191r4507j03871q7513f8336
12401B6272a79277C17829a71698A35054F6092Q986P4062a04267G007N474g6594
12389h6793A82343r456c15435D5220J8664a59221D724J06893P8873J34567c9902
12377a48846A3812P3812a77145B52560J47446A87110D9384a48702a6442o210A45804
$$ y = [-76108, -2422, -167185, -351724, -84025, -173375, 135755, 74366, -74311, 24049, -139819, 72504, -201144, 44935, 84906, -354332, -27010, -1512, -269228, 145243, 108135, -176059, -319242, 109131, 168046, 90449, -162015, -233509, -12489, -505, 209252, 17427, -15271, 120715, 236344, 280801, 62024, -31122, 63079, -151074, 18815, -124479, 29796, -228621, -84995, 108731, -2387, 219290, -346321, -183448, -111593, -228122, -129565, 38138, -21191, -115698, -219569, -307082, -68336, 26272, -179277, 317829, -171698, 135054, 66092, 75078, 149140, -104267, 7007, 12481, -76594, -86793, 182343, 172887, -315435, 45220, 63884, -159221, 4724, 111617, 190490, 325057, -39902, -148846, 13812, 87624, -177145, 252560, 400006, 187110, 49384, -148702, -16442, -22652, 145804]
12365A16234l7820K79170j43951Q1709a07645H4726b40810e6273n0968D12603
12354A08932a12232C50457a19745A5073d755j98612n854A18013a8441B88299J33830
12343D22129A39822K20792c62407D9908b58601g0490B77149a82925g4779a9419
12332a47197G5531c56060b3628j14730C03618a62341H7506N6378D6606g1134A70978
12320B92551j19143B5357R3459o683d1677A83880p9265c5469F06097B26771r6405
12309A30366J24700M2614A4783K58141L1109I4737B7206J1070L17339k4092O3594
12298C95117m2751A56598f9662C24276j31491O0002m9884f3084B05127O9703E1426
12286g7173B51053I9389j9708A0605c9266j34029r5849A69746J22035a71925C39169
$$ y = [116234, 78414, 357584, 213633, 295342, -107645, 84726, -240810, -56273, -107241, 412603, 108932, -112232, 350457, -119745, 15073, -4755, -203367, -209221, 118013, -18441, 288299, 422129, 139822, 360614, -362407, 49908, -258601, -70490, 277149, -182925, -74779, -19419, -147197, 75531, -356060, -23628, -138358, 303618, -162341, 87506, 143884, 46606, -71134, 170978, 292551, 173408, 25357, 118816, 112133, -41677, 183880, 104615, -35469, 606097, 226771, 130366, 255066, 297680, 14783, 272924, 304033, 94737, 27206, 38276, 355615, 331523, 395117, 352366, 156598, -69662, 324276, 192785, 252787, 202903, -63084, 205127, 274830, 51426, -77173, 251053, 99389, 79681, 10605, -39266, -173295, -269144, 169746, 291781, -171925, 339169]
12274b5431E5048B5178J61911b96892B26066d4147j2076B11183J13710P9618D4084
12262H9112m3027b858j16058K4426M6990j41432f4004B24647G9918K39252r9319
12251B19851o6478N8867L03016j14772I9519P4349A8302J54028O094N407a22924
12239A57782R5169D7282R966k0457L05642j67566c833B64613o3484K02097a41436
12227I1036K44656H0982e757F5801a35744b6295A26870P4440J104F4424J6683
12216H1107L35016A95310M6267K4639P982k2631Q6178L2419p3732E8789J14545
12205A73334G9676K96190h3009A46174O2480a12823C4210J31420A2742K57487
12195B70229J18573A57242J12025N5302o4550D4447L6815D582N4757M1130A3535
$$ y = [-25431, 55048, 25178, 187089, -296892, 226066, -44147, -56223, 211183, 324893, 404511, 44084, 89112, 46085, -2858, -118916, -94490, -47500, -188932, -64004, 224647, 79918, 319170, 219851, 153373, 212240, 515256, 400484, 99519, 173868, 18302, 172330, 178424, 183831, -122924, 157782, 252951, 47282, 57248, 36791, 342433, 174867, -3833, 264613, 201129, 403226, -141436, 91036, 335692, 80982, -5757, 65801, -135744, -26295, 126870, 201310, 202414, 64424, 81107, 416123, 195310, 241577, 266216, 274198, 251567, 337745, 370164, 296432, 58789, 173334, 79676, 375866, -83009, 146174, 208654, -112823, 34210, 165630, 12742, 270229, 388802, 157242, 269267, 324569, 260019, 44447, 81262, 4582, 59339, 100469, 13535]
12183A91128K03713n0812j39668K3282I2597J69403c37857E5120f5658A36216
12172A78756A6606K6013d2057E86117H6441J20298J4352a3168A13240J20474C9820
12160a3681A18455R8023a7979M417A98287J29097P7725j12527O4171I9857P1940
12149A71797n2206f0512B12353k8312K4754h8395r3490C11803G8939a07805j3084
12138a20889j47934P7474D5685L51411q3767q217n7232b81412A48571J36312o1661
12127B23222j1184a7754B39345m2758f0540q5255B78810M7815j01683A1638M65436
12116D77074A00512e5051K0181B18516e628B01877R4052A25260E9482I852M96577
12105E06429b60154G4717L6332K9463L7533q1787M4093l2600P2488K8826J1391
$$ y = [191128, 394841, 344029, 204361, 227643, 92597, 262000, -337857, 55120, -65658, 136216, 178756, 16606, 42619, -42057, 586117, 86441, 206739, 221091, -13168, 113240, 233714, 39820, -13681, 118455, 216478, -17979, -13562, 198287, 327384, 405109, 292582, 356753, 99857, 171797, 119591, -60512, 212353, 184041, 208795, -88395, -181885, 311803, 78939, -107805, -120889, -268823, -191349, 45685, 397096, 313329, 305112, 247880, -281412, 148571, 284883, 223222, 212038, -17754, 239345, 196587, -60540, -145795, 278810, 326625, 224942, 11638, 477074, 100512, -55051, -34870, 218516, -5628, 201877, 295929, 125260, 59482, 9852, 506429, -260154, 74717, 111049, 140512, 178045, 96258, 140351, 107751, 180239, 209065, 220456]
12094B20456a51995K9136A17624K39943d1810A7121J02681j7866a92382P0259
12084a22123I0065P0975b3661A02950N6001a4387p8083I7176K46635N183p7276
12073B71718p1904H9955D3624K8842O0236K32769c8801B54229E5201J06732q916
12062A53017l461G794g9695l5262C4813L64358j98129a00541j12778a02407M6508
12051e5899B11130D2274a39988A36172M2697b4815B37393h6111l0582A53681L01424
12040D55105I2152c34733A91609n6601L352J48865F4534J49198Q3387j29078a09002
12028a01277Q102B51698e2980j42362j06526B16634D36J0907J95227j01213b34647
12016E7019N3202b3324C50819F2476J90607c1536B23952i1623A07357J1646K61460
$$ y = [220456, -151995, -122859, 117624, 357567, -41810, 17121, 119802, 101936, -192382, -122123, 90065, 161040, -23661, 102950, 158951, -14387, -92470, 97176, 343811, 348994, 271718, 199814, 89955, 43624, 72466, 132702, 365471, -38801, 254229, 55201, 161933, 153017, 149556, 7794, -79695, -114957, 34813, 399171, 201042, -100541, -213319, -102407, -55899, 211130, 42274, -139988, 136172, 178869, -24815, 237393, -86111, -116693, 153681, 455105, 92152, -334733, 191609, 135008, 138360, 287225, 64534, 213732, 297119, 168041, -109002, -101277, -93175, 251698, -52980, -195342, -301868, 216634, 436, 11343, 206570, 105357, -234647, 57019, 110221, -23324, 350819, 62476, 253083, -31536, 223952, -91623, 107357, 119003, 380463]
12005C80463I7703P7465f4166o3143C221O8249b15407A23323b00053B39530A5592
11993E9957L25618j08181q4418O3513b21902L3713A21439a54353N7093D8407f5300
11981a46097M5159A01596a5890B52506f759k43805G1214K11622A20455J74230
11971B94685d40416D0481Q6499F692g0221q4854I603a17681j03073c8160r0034
11960a28194o3970A6699h290q2415k0820a8758C5151i5960r1297j37061D20449
11948b8564m33106A25004A1468i0556K3481A00343B4980O1113d61180G8450a63481
11936a76396g1970A0393c38105J34455F051J01035A5320F939f3571o1482B03384
11924B36421o2020q0223a83361i65H9202a19779A36528F445P5410J40859g9592
$$ y = [380463, 97703, 175168, -64166, -127309, 3221, 71470, -215407, 123323, -200053, 239530, 15592, 59957, 385575, 277394, 192976, 256489, -221902, -188189, 121439, -154353, -97260, 48407, -65300, -146097, -100938, 101596, -15890, 252506, -6759, -250564, 71214, 282836, 120455, 294685, -440416, 40481, 126980, 6692, -70221, -155075, 9603, -117681, -220754, -38160, -128194, -192164, 16699, -8290, -90705, -111525, -18758, 35151, -95960, -187257, -324318, 420449, -28564, -461670, 125004, 11468, -90556, -67075, 100343, 24980, 86093, -461180, 78450, -163481, -176396, -71970, 10393, -338105, -203650, 6051, 107086, 15320, 6939, -63571, -125053, 203384, 236421, 174401, 94178, -183361, -965, 89202, -119779, 136528, 6445, 81855, 222714, -79592]
11912b5713p2725C975K6103A1916P1770N5137c25970A57829a08581B77880a31561
11900A82030g8895B6767i2160D9971c59856e0157k05862b4741E1765J4060a90166
11888B69714g05C73832f2911k04715N0133C17920A06383C4205d259B67082a8954
11876a85593g8546C9426a276p3595k11581G5596L62627d6912j63636D9930a70204
11864B46920f4750F8069O7374f0068B33692a62586E0013a90083q7502A38286h7453
11852D4503L00507a90371G1901J62637b28046k73203A41009c37230d2440j5284
11842e7724C69744B2703c342q8752k37101Q8062g8351r6592A53608a25913L5072
11831i0841k31721A9032b07485k8762B70948f318j97470A50804d97621C2213k994
$$ y = [-25713, -98438, 3975, 30078, 11916, 83686, 138823, -325970, 157829, -108581, 277880, -131561, 182030, -78895, 26767, -92160, 49971, -359856, -50157, -256019, -24741, 51765, 65825, -190166, 269714, -705, 373832, -62911, -267626, -217493, 317920, 106383, 34205, -4259, 267082, -18954, -185593, -78546, 39426, -1276, -74871, -286452, 75596, 438223, -46912, -210548, 49930, -170204, 246920, -64750, 68069, 135443, -60068, 233692, -162586, 50013, -190083, -277585, 138286, -87453, 44503, 345010, -190371, 71901, 234538, -228046, -501249, 141009, -337230, -42440, -57724, 369744, 22703, -3342, -92094, -329195, -241133, -78351, -174943, 153608, -125913, -90841, -322562, 19032, -207485, -236247, 270948, -6318, -203788, 150804, -497621, 32213, 29219]
11820B9219a79059F9548b47663B7034c89360a46014A65504f8382A23909b16580
11809g9664b2903A2594a93060Q6222M4205j59112b9465q8761c2322F1039I664
11797g0642G4050R2333c0697E0594J868O5436c45249a12534a9576A50769a99025
11785c19667h577j76187L9910p0555C2240J18796f5575G7629k2425b42298J11413
11774a30885e102k77382D5095Q7055N1993g8455b588l00522j89708B3297K45202
11763B68499c9225m1884G8715L9020d6106a0072m8872H3205b10465l815j1238
11752b25518b8326C6048J94369r7542o894J10795E5400g5192A97302g9810j83193
11741b63003B5693a5115A00190J0518m0851N0742L05257D2377i1838c4157A96620
$$ y = [29219, -179059, 69548, -247663, 27034, -389360, -146014, 165504, -68382, 123909, -216580, -79664, -22903, 12594, -193060, -106838, -62633, -221745, -29465, -118226, -32322, 61039, 9664, -70642, 74050, 166383, -30697, 50594, 52462, 117898, -345249, -112534, -19576, 150769, -199025, -319667, -8577, -184764, -144854, -215409, 32240, 151036, -65575, 77629, 55204, -242298, -130885, -5102, -282484, 45095, 132150, 184143, -78455, -2588, -303110, -492818, 23297, 268499, -39225, -81109, 78715, 117735, -46106, -10072, -58944, 83205, -210465, -214280, -225518, -28326, 36048, 230417, 132875, 125981, 236776, 55400, -75192, 197302, -79810, -263003, 25693, -15115, 100190, 110708, 69857, 120599, 425856, 42377, -91838, -34157, 196620]
11729A91350c54686a03702A00028i7662d6684A44230c3337A97447m5635A3232
11718A01164b24743I8604R620b56665C82813F2448J69093f2051a7127H4712a1398
11706A58907A5222Q1878N1620J36493C0670a65352D0483a04478C41312A69418
11695A36397o0752a10676C5631g4547G0783K9283K75741b26147B38592e8318H1189
11683A57550F3761R7044O1840C6698b45063A30378e8310R161j05090A77019E6940
11671a31325g117o5392A1957K32437b3166B43775c49172a01914k0161k5019K4503
11660a22591L0286a5636j880j79602B45763d9932A46818b19852F8965a65034B16365
11648F3887J40115i2281B93912D6362B0161b34167B35654E1950B0655a71344d3178
$$ y = [191350, -354686, -103702, 100028, -97662, -46684, 144230, -33337, 197447, 151812, 13232, 101164, -224743, 98604, 108224, -256665, 382813, 62448, 231541, -62051, -17127, 84712, -11398, 158907, 15222, 97100, 148720, 285213, 30670, -165352, 40483, -104478, 341312, 169418, 136397, 75645, -110676, 35631, -74547, 70783, 100066, 375807, -226147, 238592, -58318, 81189, 157550, 63761, 160805, 222645, 36698, -245063, 130378, -58310, -49149, -154239, 177019, 56940, -131325, -7117, -72509, 11957, 244394, -23166, 243775, -349172, -101914, -122075, -147094, -122591, -92305, -15636, -17516, -197118, 245763, -49932, 146818, -219852, 68965, -165034, 216365, 63887, 204002, -92281, 293912, 46362, 20161, -234167, 235654, 51950, 20655, -171344, -43178]
11636h7026k7808m6861b6144n76201C9650J21843h6725I5681d9043j41352A15875
11624D0570K37027D0834O9890b05131B48565a63430G8538R6003b25842i8855B8432
11612a33001B44773m8118a79173A37628F8544e0997A56158J8154b33564A97479
11601A97845C1990J75412A689f2113A61233K99011A00313a09939a6273j58731
11591a75004C82182A8994d4148A35267b3906B91579M9029j53749J86639b07435
11580e3626A20421D1054a5492o0275C03408n2057k941d80533b1316l5624A19596
11568C4367M8138J24181a5458A99729a40773F8643M12671H6344q389a77375I8393
11556H7635A281J8999b55254A18204J88452i2060c8924I9126n56c815k69551A8990
$$ y = [-87026, -114834, -161695, -26144, -602345, 39650, 161493, -86725, 95681, -49043, -190395, 115875, 40570, 277597, 40834, 110724, -205131, 248565, -163430, 78538, 174541, -225842, -98855, 28432, -133001, 244773, 196655, -179173, 137628, 68544, -50997, 156158, 174312, -233564, 197479, 197845, 31990, 207402, 1689, -62113, 161233, 460244, 100313, -109939, -16273, -175004, 382182, 18994, -44148, 135267, -23906, 291579, 340608, 186859, 373498, -207435, -53626, 120421, 41054, -15492, -75767, 303408, 251351, 248410, -480533, -21316, -56940, 119596, 34367, 82505, 206686, -15458, 199729, -140773, 68643, 481314, 86344, 77955, -177375, 98393, 87635, 1281, 20280, -255254, 118204, 306656, -92060, -38924, 99126, 98570, -3815, -273366, 18990]
11543c45488a3749A86573O3001a1430C77328E6241J04852M6356A01881L06181
11533D08062c35778A75045D4489J0101J55582b4581B23894B6800a16673A7699
11522B19238b49222g9601J3418D4761b53804B14225J76673e7348j63086C29880
11511A43148f6028F9988P7166b3276j1330A44175K8547c0008A52432a6539A16901
11499C26796g935k4566j08929B2772J2507i1655A63149l5641a70883E2641N1085
11488A03726L27845h7015B52189A8292K51544J46494A4797J2175J0338P3490N5582
11477A66382P7000F2708Q2272F7788M74614K82896A76507O839a00409o7163f2164
11465B50050a02941A51809b37362d5962A67640G6410a1215G5826M17806A93109
$$ y = [-345488, -13749, 186573, 249574, -11430, 377328, 56241, 161093, 207449, 101881, 408062, -335778, 175045, 44489, 54590, 210172, -24581, 223894, 26800, -116673, 17699, 219238, -249222, -79601, -66183, 44761, -253804, 214225, 390898, -57348, -220434, 329880, 143148, -66028, 69988, 147154, -23276, -34606, 144175, 172722, -30008, 152432, -16539, 116901, 326796, -7935, -32501, -141430, 22772, 35279, -91655, 163149, 127508, -170883, 52641, 103726, 431571, -87015, 252189, 18292, 269836, 416330, 14797, 26972, 37310, 110800, 166382, 243382, 62708, 144980, 67788, 542402, 825298, 176507, 183346, -100409, -167572, -62164, 250050, -102941, 151809, -237362, -45962, 167640, 76410, -11215, 75826, 493632, 193109]
11454b29028A36032J48165o0862a03818I7540f3257C31103a58613b5938D39623
11443A93282O9048a38040A23260N4421d7587E5479Q3792E9272J38960j6382J78293
11432C60143c941m1178A62360b49603E7352M7273e2997j20525A78657b3136k30786
11421b53922B19720c0192j0525p7495p3217J2064A58135b6774j3675j71693c1194
11409a6343D1271M18385G8601a91659r3105J19110k79468a68771g6964C9696L9461
11398G9157b20569B66249a25475B15883b25515b8260r6980J4417j7623r430A34232
11386E14K31347I1760N1332J690b05473b2388d370k21895B0205c61434B47563
11374B08662d9983j52854P1904L5272k3639A05067J50305a45799g1249B44420
$$ y = [-229028, 136032, 284197, 223335, -103818, 97540, -63257, 331103, -158613, -25938, 439623, 193282, 262330, -138040, 123260, 177681, -47587, 55479, 139271, 59272, 198232, 181850, 360143, -3941, -45119, 162360, -249603, 57352, 104625, -52997, -173522, 178657, -23136, -253922, 219720, -30192, -40717, -118212, -191429, -179365, 158135, -26774, -40449, -212142, -31194, -16343, 41271, 459656, 78601, -191659, -284764, -165654, -445122, -168771, -76964, 39696, 79157, -220569, 266249, -125475, 215883, -225515, -28260, -125240, -110823, -128446, -137876, 134232, 514, 231861, 91760, 143092, 144782, -205473, -22388, -4370, -226265, 20205, -361434, 247563, 208662, -49983, -202837, -130933, -95661, -119300, 105067, 255372, -145799, -71249, 244420]
11363h9881C730R6852C8083J48371J05294I1913l5745b15425C30312a29866b7826
11351I834J75127n7913g8027j11279j45495J7133I9217b02095A19252J98868a66547
11339A79646a93906A90395i7052K4877A57444d6952C1820a35325A7841K35878
11329B53719a80252n2742H1573M4848D5140b75617h1243A42274d708j86900H4990
11317D4154h9378C23604d8106o8493j6448j25604f6372A64585e0985j06307b3718
11305d78475B435a39394C10057r8478a70689k9233R2452b8790G4969J64616c8858
11293d70591a16551l4852j51668J50406A01862K51606b26118a1697j90962H5888
11282c143A32530a35301e3137B30479l2888b29570a4813k02946P8109K771j52008
$$ y = [-89881, 3730, 100582, 38083, 186454, 291748, 91913, 56168, -215425, 330312, -129866, -27826, 9834, 184961, 127048, -78027, -189306, -334801, -317668, 99217, -202095, 119252, 318120, -166547, 179646, -193906, 190395, -97052, -72175, 157444, -46952, 31820, -135325, 17841, 253719, -180252, -232994, 81573, 126421, 45140, -275617, -81243, 142274, -4708, -191608, 84990, 44154, -89378, 323604, -48106, -116599, -133047, -258651, -66372, 164585, -50985, -157292, -23718, -478475, 2435, -139394, 310057, 211579, -170689, -199922, -107470, -28790, 74969, 239585, -38858, -470591, -116551, -151403, -303071, -152665, 101862, 353468, -226118, -11697, -202659, 85888, -3143, 132530, -135301, -53137, 230479, 197591, -229570, -14813, -217759, -139650, -136879, -288887]
11271b88887M1793C8651a18934k25923R8922A49225n8783c50260b597m1765H6312
11259b3183k68529J2185D22224D196K839n29f0807J2012A33862J9204a25205K9383
11247i5822m9810F249g048k91656b6865r5795d8640A60868b46915G2977b00721
11235A5886c2313A16113n1065i3898B62772a77635j0455g8109B5628N721K1133
11224E2482J56003f1879D6855J76313R6934A08713a98567B8072c54721H0841L8208
11213A19049e6233q2529J9699k8317N4296A0191R7046f0708k29647P6803B46955
11201c27190J41792d2654l25428b4103H2538d18497J57701B15366H2317b35140
11190b02786e8571B85110J2522a64104C36431E4081a28002A81761h7958A44047
$$ y = [-288887, -247094, 38651, -118934, -344857, -245935, 149225, 90442, -350260, -2597, -44362, 86312, -23183, -291712, -279527, 422224, 4196, 7035, 6506, -60807, -48795, 133862, 153066, -125205, -95822, -145632, 6249, -7048, -298704, -26865, -122660, -48640, 160868, -246915, 72977, -200721, 15886, -32313, 116113, 65048, -93898, 262772, -177635, -188090, -78109, 25628, 31349, 52482, 208485, -61879, 46855, 223168, 320102, 108713, -198567, 28072, -354721, 80841, 119049, -56233, -138762, -119063, -147380, -93084, 10191, 107237, -60708, -290355, -213552, 246955, -327190, -185398, -42654, -368082, -24103, 82538, -418497, -260796, 215366, 82317, -235140, -202786, -58571, 285110, 297632, -164104, 336431, 54081, -128002, 181761, -87958, 144047]
11179a01710n6341j470B11560e6847E9857a12712A18733f1960j3919B47027b18349
11167D3387d7377i386k47511h6299j31451i0883k76290a77832A84753B7490J28465
11156A55955g5037j46068A73619J00218a00061j02086N6459H2245B2016f2865
11145c95481A22745g5014B7099b04271e6027q6612M5326B12882e6846B80234a02649
11133b74518B06607b53385B2294c37100f8791k83076Q0371f6967o5498A88159
11122A51472h4574p8291p4838L7890h000j77843m3313h5061E5605N0378b1404
11110G2349i625F6903k9066L2933a00730r2851H6474B0468i4935A91913c9949
11098a08902K4986M481r3788g5775K9355j45396c1498q3098F4190d9155A4099
$$ y = [-101710, -158051, -159521, 211560, -56847, 59857, -112712, 118733, -61960, -75879, 247027, -218349, 43387, -47377, -9386, -256897, -86299, -217750, -90883, -367173, -177832, 184753, 27490, 155955, -75037, -221105, 173619, 273837, -100061, -202147, -145688, 82245, 22016, -62865, -395481, 122745, -75014, 27099, -204271, -56027, -142639, -97313, 212882, -56846, 280234, -102649, -274518, 206607, -253385, 22294, -337100, -68791, -351867, -271496, -66967, -132465, 188159, 151472, -84574, -162865, -237703, -199813, -8000, -185843, -229156, -85061, 55605, 105983, -21404, 72349, -9625, 66903, 37837, 70770, -100730, -193581, 86474, 20468, -94935, 191913, -39949, -108902, -83916, -79435, -173223, -75775, -46420, -191816, -31498, -114596, 64190, -49155, 14099]
11086a38380a4930B57025K2774J04822K69986c76319A15848l3024L25758j34869
11076B73713M5905H439h2245A45175f2128A44208p1225K6833J39211I1913a86694
11064B02426k1097j9793N0067K7444O8128C0781D603K56458r3733J13110N0837
11053C31275P7485q0055D7206K35842D0110J63327J21876R5609j64087N7465o6399
11042B47901K89906j5275k38986K76178J60423n1472j26979k29081M3288L30962
11032F86865n6701k65748j15780M58936q0729j76351j74242N04762k75782p4014
11022D31216K08690k72198M07867C33628M4774N6249J15393l8492J66222J6978
11012F94752j60167m7567J18207J92049B32705M86390J84422m17392j30335P983
$$ y = [-138380, -14930, 257025, 279799, 384621, 654607, -376319, 115848, 82824, 408582, 273713, 319618, 8439, -82245, 145175, -62128, 144208, 72983, 99816, 239027, 91913, -186694, 202426, 181329, 161536, 211603, 239047, 307175, 30781, 4603, 261061, 167328, 280438, 331275, 408760, 328705, 47206, 283048, 40110, 203437, 325313, 420922, 256835, 314300, 247901, 537807, 522532, 283546, 559724, 720147, 668675, 541696, 312615, 355903, 686865, 630164, 364416, 248636, 707572, 626843, 450492, 276250, 781012, 505230, 431216, 639906, 367708, 775575, 333628, 378402, 434651, 550044, 511552, 677774, 694752, 534585, 487018, 605225, 797274, 232705, 719095, 903517, 486125, 355790, 363773]
11002C63773K24571O7975K7522B44268L10927A57606N39954A74048L25881B13725
10991D52999j34830L67334K9626l03987Q3089n7483J47346q1915Q884q8506K67896
10980F90453k48092J68120j08381j88899L40099J0023o2554K1383j76757M39646
10970H85041K7190j14568J3994R4925j77891P7447m5271M1654J84699J7611J92322
10959A197153j72905L65591L82623j52525K59269R6425K140J22848J53791k31970
10949B022440k74456R5478j33704j66431j30779j65917M61950l48082J07247j84587
10939A283159O9313N80549k6986l68293p5242j63973k66571k06795k9094R7503
10929H93570l83942K17137A07215K28676L12609A33920K64240r1815J62883B16314
$$ y = [363773, 588344, 656319, 683841, 244268, 555195, 157606, 697560, 174048, 499929, 213725, 452999, 318169, 685503, 715129, 411142, 494231, 436748, 584094, 502179, 511063, 422557, 690453, 442361, 610481, 502100, 313201, 653300, 663323, 600769, 622152, 445395, 885041, 912231, 797663, 811657, 906582, 728691, 806138, 760867, 802521, 987220, 1004831, 1197153, 1024248, 1389839, 1772462, 1619937, 1879206, 1975631, 1977771, 2100619, 2254410, 2022440, 1747984, 1843462, 1709758, 1543327, 1412548, 1246631, 1708581, 1360499, 1467746, 1283159, 1352472, 1933021, 1906035, 1537742, 1462500, 1298527, 1031956, 825161, 796067, 893570, 509628, 726765, 107215, 335891, 648500, 133920, 398160, 306345, 469228, 216314]
10918B95832j09598m5343b51580A47768n1788m7793N7914M06881g2578k79664
10908c52242a59125I7388i5924j396l5757J5425b2530j18022K6201B90938F6615
10896B26213r59a17018A58806j7279C7782a07804c8635B9402J1110d772A67270
10884b51298m0587c3832B56182I6844c52662a16257D1730a25146c8464B5769J73944
10873A99713L5667a74788e3985q7862L6806k43092A6281J68260c84134B05280
10862a99475B058a5732n2473E9525b39480Q6634j98282j9578J09180i8499A7778
10850B26830A00494J2981H013J0958c31383B18959H1285A3614a32042B66053a18576
10838A21768e8975A96341p1737b75170C15882A08488a52666B2140a51610k7776
$$ y = [295832, 186234, 140891, -251580, 147768, 95980, 48187, 106101, 512982, -72578, -352242, -159125, 97388, -95924, -97320, -133077, -117652, -22530, -140552, -114351, 290938, 66615, 226213, 225254, -117018, 158806, 141527, 37782, -107804, -38635, 29402, 40512, -4772, 167270, -251298, -291885, -33832, 256182, 96844, -352662, -116257, 41730, -125146, -38464, 25769, 199713, 235380, -174788, -53985, -141847, -105041, -348133, 16281, 184541, -384134, 205280, -199475, 2058, -15732, -68205, 59525, -239480, -152846, -351128, -370706, -261526, -98499, 17778, 226830, 100494, 113475, 8013, 18971, -331383, 218959, 81285, 13614, -132042, 266053, -118576, 121768, -58975, 196341, 124604, -275170, 315882, 108488, -152666, 22140, -151610, -179386]
10828a79386B88102g7573j40738F3903a056m2951G3055K51012h7253r7896i1077
10816d22953G7809A5981a6580E3764R5954Q0898f0128j60878A65600a64426d3808
10804A87757D795J69845c9305A23382e5033D3164a71319j51637b2058A42769b79803
10792b07491I633J27333F1526a67700d4796A60953b31774A38196a64750A60208
10781i4016C0323a45399j88589A3567b56483D1953a37151j93976d7178c89j61432
10770a61821L2280e082j66142B2001n763M5274g9818A99492d2239j23276B53945
10758f7565F670K7972a77918N1571q9058P2423K1164q5328J01149l3424B38186
10746F2337a29461d2403a8156B45240A03188J16963m932E8879d6217C3049a89458
$$ y = [-179386, 288102, -77573, -218311, 63903, -1056, -44007, 73055, 324067, -87253, -185149, -91077, -422953, 77809, 15981, -16580, 53764, 149718, 230616, -60128, -221006, 165600, -164426, -43808, 187757, 4795, 174640, -39305, 123382, -55033, 43164, -171319, -322956, -22058, 142769, -279803, -207491, 9633, 136966, 61526, -167700, -44796, 160953, -231774, 138196, -164750, 160208, -94016, 30323, -145399, -333988, 13567, -256483, 41953, -137151, -331127, -47178, -389, -161821, -129541, -5082, -171224, 22001, 16238, 61512, -79818, 199492, -42239, -165515, 253945, -67565, 6670, 34642, -177918, -126347, -215405, -142982, -121818, -207146, -105997, -139421, 238186, 62337, -129461, -42403, -18156, 245240, 103188, 220151, 215219, 58879, -46217, 33049, -189458]
10734F508b5081j69891m6651D0737N35h0991F2260J70666E100d55048f3280n8872
10722a22152N0050C5422b91592a29330A20664a34145A22064K06218b6240j28544
10712a54784E7359d47998f6513j71999b1280j27403B07227c10852A07903l4472
10702G3431a03652j2516L4779B72076o3147c96448F2459b49765l0159m9831H9845
10690d1840J3066k35208B04055c52131J38487H5801a52583f3326B9168a21418
10679c16957E3506c8356B2821K41383A20882a83A5737J985b42558M6601K7112
10668a68845g2542G108d86020D9524d19614A62545F2780b80169Q9604A4733K80994
10657B95727a88251A3536b26159b8430k81168A06799a02640r8152D1638h4477
$$ y = [6508, -25081, -194972, -241623, 40737, 41272, -80991, 62260, 232926, 5100, -455048, -63280, -122152, -72102, 35422, -291592, -129330, 120664, -134145, 122064, 328282, -26240, -154784, 57359, -447998, -66513, -238512, -21280, -148683, 207227, -310852, 107903, 73431, -103652, -116168, -81389, 272076, 208929, -396448, 62459, -249765, -279924, -329755, 89845, -41840, -28774, -263982, 204055, -352131, -213644, 85801, -152583, -63326, 29168, -121418, -316957, 53506, -38356, 22821, 264204, 120882, -183, 15737, 17722, -242558, -195957, -168845, -72542, 7108, -486020, 49524, -419614, 162545, 62780, -280169, -190565, 14733, 295727, -188251, 13536, -226159, -28430, -309598, 106799, -102640, -200792, 41638, -84477]
10646c2284F988c20235a43332f8217n73K3716o3361R319n5645I996h6907j42910
10634b29817o6118j44891A04825C5422i2661a9518A20466a82477h2795G0269a85645
10622A5530c15232k511a4702D544b19351F3069h0525I99K36054a14702K6487f098
10609A19144f9879I5181b70986i9894l02520A776c11245a19993e8909e990j10691
10598a16681A89159g3378q4407C174c7035o2206A5193o804a01615B0354b53908
10586a89383p007A75976D381g1483G955a30776d0801I5951h3562a1747k96915
10575c08662h3398k78105i6335J447B81955A40731n5471l2870L05196I0524m0380
10564E0144q528a00156o5716P0967o3230g7637j02255L5866L47B36085I0470f0304
$$ y = [-32284, 6988, -320235, -143332, -68217, -68790, -45074, -108435, -99116, -154761, 9996, -86907, -229817, -295935, -440826, 104825, 35422, -92661, -19518, 120466, -182477, -82795, 70269, -185645, 15530, -315232, -317743, -14702, 4544, -219351, 63069, -80525, 999, 237053, -114702, -88215, -6098, 119144, -69879, 95181, -270986, -99894, -402414, 1776, -311245, -119993, -58909, -5990, -116681, 189159, -73378, -157785, 3174, -37035, -99241, 15193, 8389, -101615, 20354, -253908, -189383, -196390, 175976, 4381, -71483, 7955, -130776, -40801, 95951, -83562, -11747, -308662, -83398, -361503, -96335, -94888, 281955, 140731, 85260, 52390, 357586, 90524, 50144, 41616, -100156, -165872, -94905, -158135, -77637, -179892, -144026, -143679, 236085, 90470, -60304]
10551c647B7566H153M6511J32627b7681k00381Q0522b3068I2713a41234c8668
10539b5088j79324D9625K65353f5029l7593i411q191j73363L1404b8202o9854
10528i8056r3139e5704A03680h0105B47337I0856K14358b51229B3795e180A67222
10516a39516B46023b16706d0324o6312C6192L14639A59509f1916B40435f7345
10505a84785P6409B31408D63b5540A16173J2530d1069j57835G5676g6432A89171
10493H1463A536a90470A57344j7492b38839A13985a60848d3014j84797A93004
10482a2229G4364h1722g124k53331A35995a08699p9932g6996A0444N9153i9192
10470a14087I8742k4826L3169h6428p578c3835E9896K48837k0819K18573l2124
$$ y = [-3647, 27566, 8153, 54664, 187291, -27681, -228062, -147540, -23068, 92713, -141234, -38668, -25088, -204412, 49625, 314978, -65029, -102622, -9411, -17602, -190965, -159561, -28202, -98056, -191195, -55704, 103680, -80105, 247337, 90856, 305214, -251229, 23795, -5180, 167222, -139516, 246023, -216706, -40324, -106636, 36192, 350831, 159509, -61916, 240435, -67345, -184785, -108376, 231408, 463, -25540, 116173, 128703, -41069, -198904, 75676, -76432, 189171, 81463, 1536, -190470, 157344, 139852, -238839, 113985, -160848, -43014, -227811, 193004, -12229, 74364, -81722, -7124, -260455, 135995, -108699, -188631, -76996, 10444, 69597, -99192, -114087, 98742, 73916, 107085, -86428, -94006, -33835, 59896, 308733, 287914, 506487, 474363]
10459D74363j31050P9855O3998A31355k3372j1931L1394j3797J28499K7588M5588
10448C15324G6699c95271B01263g7298A72666p5918L38325b26836A8599M168a34916
10436A40062b09773A30168c01744A23060j1845a10890k43866a10499A64575c47427
10425d5184l987B59545j0993a50805m834e6439A31031b53990B22478J1040c92475
10413h491j66268l0547b6110o3653l85701A7170e6134j89124d1354A68297d89221
10401b02185R7873L4645B1130c24367R2546h2520A7539a43034H3378C110K59031
10390B62141d0684A18571c5269J0036c198G599a81053O370A6167N0561a24974
10378G8177C8570K345Q6422a1979B34129L0819A18148J1931i8939a6858G6916
$$ y = [474363, 343313, 423168, 487166, 131355, 107983, 96052, 127446, 113649, 242148, 269736, 315324, 76699, -395271, 201263, -77298, 172666, 96748, 435073, -226836, 18599, 22767, -134916, 140062, -209773, 130168, -301744, 123060, 111215, -110890, -354756, -110499, 164575, -347427, -45184, -49171, 259545, 248552, -150805, -155639, -56439, 131031, -253990, 222478, 233518, -392475, -8491, -174759, -205306, -26110, -89763, -475464, 17170, -56134, -245258, -41354, 168297, -489221, -202185, -104312, -69667, 21130, -324367, -231821, -82520, 17539, -143034, 83378, 3110, 262141, -40684, 118571, -35269, -25233, -3198, 7599, -181053, -174683, 16167, 66728, -124974, 78177, 38570, 40915, 127337, -11979, 234129, 264948, 118148, 130079, -98939, -16858, 76916]
10366h7774c3145B51162a60485a1126B3883G157J65077H1164l7620O882L7581
10355H8007K74912B7057K85288J05558j90110l4539K06022b3576A97741i371B11603
10343D4515k1618L21243a67583A59763a65303J5493B82300i6549C78200O3019
10333D41219I5310J24789N798J85334e165C70777j57485Q0388H1736N61866A54643
10321A22402P0227J28080F2844Q2138b00033C14225j47921C5858a36597B29071
10310a35517A72805A3260a64067f2253a3515B27527A06645J36791J67360A05958
10299B65291o0468k7221a6735F5829P1634L27955H8240c6715m1326j26930d6751
10287A28456g5643D9900f1795I3555g7599H9897h8669E85524B30307c15828A37763
$$ y = [-87774, -33145, 251162, -160485, -11126, 23883, 7157, 172234, 81164, 43544, 50426, 88007, 362919, 27057, 312345, 417903, 227793, 193254, 399276, -23576, 197741, -9371, 211603, 44515, 22897, 344140, -167583, 159763, -165303, -149810, 282300, -96549, 378200, 441219, 95310, 220099, 225897, 411231, -5165, 370777, 213292, 293680, 81736, 643602, 154643, 122402, 192629, 320709, 62844, 144982, -200033, 314225, 166304, 35858, -136597, 229071, -135517, 172805, 13260, -164067, -62253, -13515, 227527, 106645, 243436, 410796, 105958, 265291, 204823, 177602, -16735, 65829, 137463, 465418, 88240, -36715, -78041, -204971, -46751, 128456, -75643, 49900, -61795, 93555, -77599, 89897, -88669, 585524, 230307, -315828, 137763]
10275f803l06193C05068h6408j60435e9654q1022E5878J32201a71990g7037p7919
10264a54956q3300A36920l6197a10947A04716a27915k64864C0665N6540P0289
10254A57494d0196a3115f076q799k7958j45515A03537D1328i665j01282A64862
10242B2931K57381G8963K15536J04185A45670K17485L02031A80847A0320L03754
10232C14074a91106M2908C22698d8902I9946b40796A90193b8722k18388A3691
10221A2046a22380L1753B22995B6252K5755J6664G506i7539b4772m5103F5076
10209d36656C6866a48245J1042n6677j6519r1956O726e2680o1871j28534J07437
10198a35648o6844A77361L0962h507k10827a8788p9241C47332d18904A04001N4465
$$ y = [-6803, -312996, 305068, -86408, -246843, -59654, -140676, 55878, 188079, -171990, -77037, -154956, -238256, 136920, 100723, -110947, 104716, -127915, -392779, 30665, 87205, 157494, -40196, -13115, -6076, -14875, -42833, -188348, 103537, 41328, -9665, -110947, 164862, 22931, 280312, 78963, 294499, 398684, 145670, 363155, 665186, 180847, 10320, 314074, -191106, -148198, 322698, -48902, 99946, -240796, 190193, -28722, -247110, 13691, 12046, -122380, -90627, 222995, 26252, 52007, 68671, 7506, -97539, -24772, -69875, 65076, -436656, 36866, -148245, -137203, -193880, -210399, -302355, -295629, -52680, -114551, -243085, -135648, -202492, 177361, 208323, -8507, -219334, -18788, -98029, 347332, -418904, 104001, 158466]
10187A58466a56322K3615j60457C7494J19428d58322J29980a12530l33822F2770
10176A93822M2906g2541A18179B512a62419B08832a37929L3052j20273P4331A01190
10164c1348j3162j57799F1920J92638m8616A264a00277L6429B61428e5600a0152
10152c7670l01950P0571h6385C0750a475A5506a42521J3792g102j08347e4127
10140b6860a2879l7432n8135j17204L5473j86190J20420b529G2605a46234K1167
10129a25067D6090b46196F6311b93096O2512m1442e753k74760k5726j0846C1257
10117f5671J3232k15157h6517A70083F9586a46781d5533A4054h7220q2535C3900
10105A6390a61550o8478G2515Q9586p7822a86847J1926A03328B1005L8795P0260
$$ y = [158466, -156322, -132707, -293164, 37494, 156922, -458322, -328342, -112530, -446352, 62770, 193822, 236728, -72541, 118179, 2512, -162419, 208832, -137929, -104877, -225150, -150819, 101190, -31348, -44510, -202309, 61920, 254558, 205942, 1264, -100277, -63848, 261428, -55600, -10152, -37670, -339620, -269049, -86385, 30750, -1475, 15506, -142521, -128729, -7102, -115449, -54127, -26860, -12879, -50311, -108446, -225650, -190177, -376367, -255947, -2529, 72605, -146234, -125067, 46090, -246196, 66311, -293096, -230584, -272026, -5753, -280513, -306239, -317085, 31257, -65671, -52439, -267596, -86517, 170083, 69586, -146781, -45533, 14054, -87220, -169755, 33900, 16390, -161550, -230028, 72515, 162101, 84279, -186847, -174921, 103328, 21005, 59800, 130060]
10094A30060a98935c8454E63i8336q0264e3893j56572B00063c5983I9351a85937
10082a33206D7854L8999K4212o562c783G510d7035j13969l4155K5292A01796J35455
10070B37251J17845i1231j94712A12306k2072b7492q7023M1506j93774K4314A58266
10058F0476a73218c9302A66456A2675O6649b36724P7244n2919P3032O7775k09145
10047b80737B71250a02103j4270j12637a8561j42470k03659a02135I3262a19433
10036H8798b74913F647i0747j44692b2257k88810l4189a05119A57648b41241J14838
10025a26403l18069J69725J18984a3175A32308a81946j41633i9773B0157b89395
10014G3326c30218J26550H473a22365a2186o0106j99890f3466K5430D83845a05758
$$ y = [130060, -198935, -38454, 563, -98336, -178600, -53893, -210465, 200063, -35983, 99351, -185937, -133206, 47854, 86853, 111065, 104503, -3783, 7510, -47035, -161004, -195159, -169867, 101796, 237251, 355096, -91231, -285943, 112306, 90234, -27492, -114515, -73009, -266783, -242469, 158266, 60476, -173218, -39302, 166456, 12675, 79324, -236724, -159480, -212399, -139367, -71592, -280737, 271250, -102103, -116373, -229010, -18561, -161031, -364690, -102135, 93262, -119433, 88798, -274913, 6647, -90747, -235439, -22257, -311067, -345256, -105119, 157648, -241241, -126403, -444472, -274747, -155763, -13175, 132308, -181946, -323579, -99773, 20157, -289395, 73326, -330218, -203668, 8473, -122365, -12186, -72292, -272182, -63466, -38036, 483845, -105758]
10002c8153E8420L3502J46638e2604H0684i3258k58385B56127c49145C9154a44390
9990H1207c45493A0982a78541e7912a5658E9850c1500j36308A20372j3998b09452
9978a23458k97988b6984A5209b28431l205Q8559o7543A34547e2621l57890e0135
9966D7645i0929F4699b1024h21A35866a17594o3483b1629E5610J90262d18348
9954f327o2473i718k55136n2103J26181B1633c12411A1557b25370A66866D6962
9942d082k05302c9634l48727k3597J2602B39212a67707A6441c62834A88850g5228
9930C3310c7182I988c92625c0556j73087A19897M658f1806j32190j81200B82803
9918A76367E0065k0885J88716L2898a54991o0447c2057p3815j4793C4210O5836
$$ y = [-38153, 58420, 91922, 238560, -52604, 80684, -93258, -351643, 256127, -349145, 39154, -144390, 81207, -345493, 10982, -178541, -57912, -15658, 59850, -31500, -167808, 120372, 106374, -209452, -123458, -421446, -26984, 15209, -228431, -231636, -143077, -210620, 134547, -52621, -410511, -50135, 47645, -90929, 64699, -21024, -821, 135866, -117594, -181077, -21629, 55610, 245872, -418348, -6327, -68800, -9718, -264854, -316957, -190776, 21633, -312411, 11557, -225370, 166866, 46962, -4082, -209384, -39634, -388361, -411958, -399356, 239212, -167707, 16441, -362834, 188850, -75228, 33310, -37182, 9988, -392625, -30556, -203643, 119897, 124555, -61806, -193996, -375196, 282803, 176367, 50065, 29180, 217896, 250794, -154991, -215438, -32057, -105872, -120665, 34210, 100046]
9907A00046h8907l20737A36207a57262C950d2522B6710B505a85192j69484o7519
9896d22195D6724L549a7691n4912k69529a10641A04225h647m2037l97392A6534
9884b94590b1542k26476l5650c2950A43516Q3868a27295k0826j47322m1300a15377
9872i2288H9542a217o5242H3046h7134E2314Q4866c4667k83325B1103a72876o4286
9860b37162M9911A69794D7654A5664J95884G3959e9323k03411a4443I3040A8307
9848a51743j13223a13763c5271j17306L2960n6382C337c7003B9021K72812f976
9836c08772J09245E8173J58000a59281A8116b25303A09622b36579a5618j78039
9826a93657B06880B428c9755m6887C78290a90154N1480j10578I4918M0034a40513
$$ y = [100046, -88907, -409644, 136207, -157262, 3950, -42522, 26710, 2505, -185192, -354676, -422195, 46724, 50273, -17691, -72603, -342132, -110641, 104225, -8647, -50684, -448076, 16534, -294590, -21542, -248018, -283668, -32950, 143516, 227384, -127295, -148121, -295443, -336743, -115377, -92288, 89542, -1217, -66459, 83046, -87134, 52314, 137180, -34667, -317992, 21103, -172876, -237162, -187251, 169794, 47654, 15664, 211548, 73959, -59323, -262734, -14443, 93040, 18307, -151743, -264966, -113763, -35271, -152577, -119617, -175999, 3337, -37003, 29021, 301833, -6976, -308772, -199527, 58173, 216173, -159281, 18116, -225303, 109622, -236579, -15618, -193657, 206880, 2428, -39755, -86642, 378290, -190154, -138674, -249252, 94918, 134952, -140513]
9814C06228i8928k75767A7426J43085b70503f1472k39324a7891I0442b87987f2290
9802d48126i1219d0375p4771J4332j08694O7067M8044b6561j19639B42978H5790
9790B0513O0673a85641A87024J4130a85473C9264b43910L7764d2068j38473E0445
9778b3367j15320F064c47944a19276l99546i1061j9445n1297j02272B07896N2853
9767B60749I2913a10846B0925M5549a64483H3047J050a60420L6555j96563A1225
9755g0978o2913A61935e8057r701j57322D7455L7850a37059N0111l48398a16723
9743C0048K24689a66992G0071M9016J56767D5724b68429A06128b34872H0188b8442
9731a08667j07482A92473h6839b49p7598l91971h7757l73632b27265H262J09927
$$ y = [306228, -98928, -374695, 17426, 160511, -270503, -61472, -300796, -17891, 90442, -287987, -62290, -448126, -91219, -40375, -115146, -100814, -209508, -142441, -94397, -26561, -146200, 242978, 85790, 20513, 81186, -185641, 187024, 201154, -185473, 39264, -243910, -206146, -42068, -180541, 50445, -23367, -138687, 6064, -347944, -119276, -518822, -91061, -110506, -161803, -264075, 207896, 260749, 92913, -110846, 20925, 66474, -164483, 83047, 84097, -160420, -123865, -320428, 11225, -70978, -133891, 161935, -58057, -67758, -225080, 47455, 85305, -137059, -86948, -435346, -116723, 30048, 254737, -166992, 70071, 119087, 275854, 45724, -268429, 106128, -234872, 80188, -28442, -108667, -216149, 192473, -86839, -249, -77847, -469818, -87757, -461389, -227265, 8262, 118189]
9720A18189g9958L2599A85272G4050a64082N9761j98428J33895p7600B18577B1198
9708b09447A82773J25001e3814j13008A70085b43283j42552J64769C16766A1464
9697a56553o761A60621e8501b5534k29872I4714a24259C0918c76020J75082N4264
9686a46674M7970G4519a03616L1293B46135a451j72121j2636O7951F0318e7369
9674A45634R9663F5193C472b86236B8878L50321b49870I033L0218M446c2651r7026
9662a29677k2336g5443p1336j30169J20079H052e5575k71375a57700K5721J1870
9651a20109a9505o6456B03026g5789q7211C8815a92084j24267J16810H6055b29398
9639c98321B03970c8062j61110j15626j37990J09195J21224G509L0389J8469c7771
$$ y = [118189, -79958, -47359, 185272, 74050, -164082, -104321, -302749, -168854, -246454, 218577, 21198, -209447, 182773, 307774, -53814, -166822, 170085, -243283, -385835, -221066, 316766, 11464, -156553, -163314, 160621, -58501, -25534, -255406, 94714, -124259, 30918, -376020, -200938, -146674, -98704, 74519, -103616, -72323, 246135, -1451, -173572, -186208, -118257, 60318, -57369, 145634, 245297, 65193, 3472, -286236, 28878, 379199, -249870, 9033, 39251, 43697, -32651, -129677, -152013, -75443, -146779, -276948, -156869, 8052, -55575, -326950, -157700, -131979, -120109, -19505, -85961, 203026, -75789, -163000, 38815, -192084, -316351, -199541, 86055, -229398, -398321, 203970, -38062, -199172, -314798, -452788, -343593, -222369, 7509, 37898, 56367, -37771]
9627A77678A7279P296b49546b2335I49M8018a26036E6847B1550J91113C3483O9815
9615A03298a1572j8446j77911K3775g9572A1703a17110B34390a68913q8233E5809
9603a58730B2924M20683a82146A50593d80787F2702M054d5646j92948B955L1951
9592C4906N2057c01663B7548J87981b128j09437l0342k5245k82743a70987a5523
9580h9686p8647g8677A96887A9307g8961j59430a4091B8035b38002k6936c6961
9568A04723b64302c3286o6692B03824a05258j28842O0849B73224j24731b95650
9557I4184l9189c9160B62017a5191j96733d5105k49819A6328a8450m7065j0476
9546g5991A6301M866b38219a1490A25340c53299O9940C0936h4340j3528C4499
$$ y = [177678, 17279, 24575, -249546, -22335, 949, 48967, -126036, 56847, 21550, 212663, 33483, 103298, -11572, -30018, -207929, -184154, -79572, 11703, -117110, 234390, -168913, -257146, 55809, -158730, 22924, 443607, -182146, 150593, -480787, 62702, 66756, -45646, -238594, 2955, 34906, 86963, -301663, 27548, 215529, -2128, -111565, -141907, -167152, -449895, -170987, -15523, -89686, -168333, -78677, 196887, 19307, -78961, -238391, -14091, 28035, -238002, -264938, -36961, 104723, -264302, -33286, -99978, 203824, -105258, -234100, -173251, 273224, 148493, -295650, 94184, 54995, -39160, 262017, -15191, -211924, -45105, -294924, 16328, -18450, -65515, -75991, 16301, 21167, -238219, -11490, 125340, -353299, -283359, 30936, -84340, -97868, 34499]
9534A68704j9463e7644K3841o022G5261J7919a37149L8677r6668n3125h1852C33766
9521c39324B07576a3279A99472d36732D54b21696H0027f6484k06180a34645m1419
9510a76064B26860a13581a0652j89450I6886l780g3933E4421a675o8408l29754
9499c99837B4721d27328J69755A57215a74912B07108m9032C6048K7000c44206
9488b14350j06876a03963d1925Q775c698n6888A7269L2927a30028L4018d6145
9476B64299c53485J62210e2479n6864K3616B2591L456K7538a90869g0055L4496
9465c5559B74638j28121f5790b8868B16936D9706L213G828a05183l1944B65369
9453b04973L4238H0290J3048e6244k15440i0442r8939N8750k32580k36900F9762
$$ y = [168704, 149241, -57644, -33803, -39825, 75261, 93180, -137149, -98472, -195140, -248265, -81852, 333766, -339324, 207576, -13279, 199472, -436732, 454, -221696, 80027, -66484, -272664, -134645, -176064, 226860, -113581, -10652, -200102, 96886, 93106, -73933, 54421, -1675, -70083, -399837, 24721, -427328, -257573, 157215, -174912, 207108, 158076, 36048, 63048, -344206, -214350, -321226, -103963, -41925, -33150, -3698, -60586, 17269, 50196, -130028, -96010, -46145, 264299, -353485, -191275, -52479, -109343, -85727, 22591, 26047, 53585, -190869, -70055, -35559, 274638, 146517, -65790, -28868, 216936, 49706, 52919, 7828, -105183, -137127, 265369, -204973, -170735, 80290, 93338, -56244, -271684, -90442, -189381, -130631, -363211, -600111, 69762]
9441i6834c1709m7539k2999K3865j24006M8873m0536J7489A7235N7609a70956
9429D9035b33501b9570A17487b0074A7425c26842i5323n3703A81541c2498L886
9418b8612j03277B4037a22559A73829a36506B14363a50794f429j05216N3110p5174
9407a33709j82969k8942I9946j1659a34831j98453A4220J59357b0229q7100G980
9395G7210J5456b08484C1362a19850D3917A4357J24427A4791h6193E2431c69589
9383a99602h8691E129J44476a93173D0881i3374o8005k51850B1552f4739q7880
9372a52619B47068c0089E5275J27892d09596E5227C865J32073c236B42949a48845
9360i845A2714a56691k25350i7143k65676A30295b55493M0172H4297b10836q629
$$ y = [-96834, -31709, -79248, -102247, -78382, -202388, -153515, -194051, -176562, 17235, 74844, -170956, 49035, -233501, -29570, 117487, -20074, 17425, -326842, -95323, -149026, 181541, -32498, -28612, -131889, 24037, -122559, 173829, -136506, 214363, -150794, -6429, -111645, -58535, -133709, -316678, -345620, 99946, 88287, -134831, -333284, 14220, 173577, -20229, -107329, 7980, 77210, 92666, -208484, 31362, -119850, 43917, 14357, 138784, 14791, -86193, 52431, -369589, -199602, -88691, 5129, 149605, -193173, 40881, -93374, -161379, -413229, 21552, -64739, -152619, 247068, -30089, 55275, 183167, -409596, 55227, 3865, 135938, -3236, 242949, -148845, -9845, 12714, -156691, -382041, -97143, -362819, 130295, -255493, -215321, 84297, -210836, -219465]
9349b19465A25475a44224b6763C43968G6016f2147J0195J5151j74835h1707n8409
9338a40116b3317A7236K42638a21A70863d0536B81996B0239i6480a6619l23145
9327c39764c5788k9590I986a95235o8414M867c2838B3178c01224A20439e2522
9315a32821I3596a06603m58A15190b18677c1381j80882J02683i074n6791p982
9304g3847F4070Q8196c13635e2969i782k17352A52342d8036J836k46570f7293
9292F4716f6361A81803b05564K6002h2033C0471B279e12351a53404A71502b41514
9280b10709i1087K6013g339I6613a71240c5580F3438j6042a74039B105K15835
9269B17940b20745A12524A508a78972A5644J13596a52348j53856F1861c67539
$$ y = [-219465, 125475, -144224, -26763, 343968, 76016, -62147, -51952, -36801, -211636, -81707, -140116, -23317, 17236, 259874, -121, 170863, -40536, 281996, 20239, -96480, -16619, -339764, -35788, -65378, 9986, -195235, -263649, -258782, -32838, 23178, -301224, 120439, -52522, -132821, 93596, -106603, -107061, 115190, -218677, -31381, -212263, -109580, -9074, -65865, -73847, 64070, 152266, -313635, -52969, -9782, -227134, 152342, -48036, -46200, -292770, -67293, 64716, -66361, 181803, -205564, -179562, -82033, 30471, 2279, -512351, -153404, 171502, -241514, -210709, -91087, -65074, -7339, 96613, -171240, -35580, 63438, 47396, -174039, 2105, 217940, -220745, 112524, 1508, -178972, 15644, 129240, -152348, -306204, 61861, -367539]
9258a84782J8967A57296J24887b82787A53745a5667j06986A28103c91995B82556
9247b81538L6334K2695e9771K784l9854B06772a84795l9304A56147b08177O0992
9236a47185L4015F5534A5946b31725a03830A64666a18284D0924b44118H1718c56538
9224C89854a44480M5836k06346G8058L35783c55370J47021j1770B94362a23563
9213a37543A9252e9356b0298G4355b71295h1116C1234a42545L8722n0101B3818
9201a04093B34068L9465c66055a37800k8671a2915n8885K2303E38917A7324c82241
9189a25715I3800b27052M4535o7179D6888b05163H392e9120k35809J26186I2572
9177b87857B75289A34730a90166F5415a79123b9672j14683H9291a40599e5957
$$ y = [-184782, -165815, 157296, 282183, -282787, 153745, -15667, -122653, 128103, -391995, 282556, -281538, -245204, -222509, -59771, -56987, -96841, 206772, -184795, -224099, 156147, -208177, -147185, -113170, 65534, 15946, -231725, -103830, 164666, -118284, 40924, -244118, 81718, -356538, 389854, -144480, -98644, -304990, 78058, 413841, -355370, -208349, -220119, 294362, -123563, -137543, 19252, -59356, -20298, 74355, -271295, -81116, 31234, -142545, -103823, -153924, 23818, -104093, 234068, 273533, -366055, -137800, -166471, -12915, -71800, -49497, 538917, 17324, -382241, -125715, 93800, -227052, -182517, -249696, 46888, -205163, 8392, -59120, -294929, -168743, 92572, -287857, 275289, 134730, -190166, 65415, -179123, -29672, -144355, 89291, -140599, -55957]
9166c31133b8360j7697C3432c0965k93083B58262b4417j41841A69621h8797m3551
9155a32348g965k44819B73098f4796m8665H3403k3905k8866R0373a02836G3709
9143d00828A12029f9713J8292A14102D8470K12544i0827B3607a15210O420E8198
9131A256g2866B0409c79969h1442J9317n3467A03888J61867d0090B23865b11968
9119b11736I7004e6909A2426b12037O9364G6768M161a03591k08252B73332b31992
9107B9263b06925l03252D5457Q7092a85051f0071A2109N1628b23710d4446B5334
9095b2537q9705p2913b2807A7902a08330k03482A571a83228E1633b97607P5892
9084b21715A46669a65211m7920A2869a48601f4928j09310f9485h86o0747F38b9836
$$ y = [-331133, -28360, -46057, 33432, -30965, -324048, 258262, -24417, -166258, 169621, -88797, -132348, -7965, -252784, 273098, -64796, -113461, 83403, 59498, 30632, 121005, -102836, 73709, -400828, 112029, -69713, -51421, 114102, 48470, 261014, -90827, 23607, -115210, -108790, 58198, 1256, -72866, 20409, -379969, -81442, -62125, -115592, 103888, 265755, -40090, 223865, -211968, -211736, 97004, -56909, 12426, -212037, -142673, 76768, 80929, -103591, -311843, 273332, -231992, 29263, -206925, -510177, 45457, 132549, -185051, -60071, 12109, 63737, -223710, -44446, 25334, -22537, -112242, -185155, -22807, 17902, -108330, -311812, 1571, -183228, 51633, -297607, -221715, 146669, -165211, -213131, 12869, -148601, -64928, -174238, -69485, -886, -61633, 638, -29836]
9071a51750E4633b83106B03775c196j15672j04373B17449H6016d2756B18013A3298
9059c05282J12185O552j33450R149D7663d1126A37800a00691k10307J6040a8813
9047F1933h0591b5476j00178G0229a65639j08462C7300c01121J22964B14922b08461
9035a33990p1731O766H6172B8114a97417G1045k51A9157g0266n4719J3994r736
9023a20727j6007L6595i063r5901E1794A1207K0129a14952B82221a63580B5575
9011b85778L7426J11539G3318B0993N4711a76286c1685m0077B03062b49911I01
8999I6484b98892c2611D8885L06087D9768f3067J5035l0058k38573F0341M2662
8988A03003E1351b47777l9423I8162m3678b52273i0902B78681j04266B3449E174
$$ y = [-151750, 54633, -283106, 203775, -3196, -118868, -223241, 217449, 86016, -42756, 218013, 13298, -305282, -193097, -186545, -319995, -310846, 47663, -41126, 137800, -100691, -310998, -294958, -18813, 61933, -80591, -25476, -125654, 70229, -165639, -274101, 37300, -301121, -178157, 214922, -208461, -133990, -205721, -198955, 86172, 28114, -197417, 71045, 70794, 19157, -70266, -124985, -110991, -120727, -136734, -100139, -9063, -104964, 51794, 11207, 31336, -114952, 282221, -163580, 25575, -285778, -248352, -136813, 73318, 20993, 75704, -176286, -31685, -71762, 203062, -249911, 901, 96484, -298892, -32611, 48885, 354972, 49768, -63067, -48032, -78090, -316663, 60341, 103003, 51351, -247777, -287200, 98162, 54484, -252273, -90902, 278681, 174415, 23449, 5174]
8976A60438d79750g3765k02822M4756R8801j01452Q4615A92194a1450k5535A52980
8964C73222b90017R3008O9767e5789A36092a05263j88016P7375F6916b15194i5531
8952A13954C1661a73807B0680c4226j76883A48629b69392n2903B98514c5752j14207
8941a49959G3416b75080J15486B49694a29276C1292a35759E3605h85A72034a39597
8929d904l2652I9529Q7424i1633j5702o8560A15873c86713d5600m524b2009D1210
8916A84211k777A9882c01460C01703g1218B62629Q1840J8010r0915K45626N47554
8905A064744Q17961K438946K276896k999720j141024j028316n76290M2244C78696
8895C80849j85232N06233B3715J40872D1971O2317k3866b6496B66925a93706b2002
$$ y = [160438, -479750, -73765, -276587, -231831, -133030, -234482, -149867, 192194, -11450, -36985, 152980, 373222, -290017, -197009, -127242, -55789, 136092, -105263, -293279, -215904, 66916, -215194, -95531, 113954, 31661, -173807, 20680, -34226, -211109, 148629, -269392, -322295, 298514, -35752, -149959, 73416, -275080, -159594, 249694, -129276, 31292, -135759, 53605, -885, 172034, -139597, -4904, -37556, 99529, 186953, -91633, -107335, -175895, 115873, -386713, -45600, -50124, -22009, 41210, 184211, 181434, 19882, -301460, 301703, -71218, 262629, 344469, 362479, 271564, 517190, 1064744, 1882705, 4321651, 6598547, 3598827, 2457803, 1429487, 853197, 895441, 378696, 380849, 195617, 701850, 23715, 164587, 41971, 104288, 80422, -26496, 266925, -193706, -22002]
8883B45481j08386j1155a60613B24350a18002A88340a42543O5380G6733a54433
8872b55413A04413K5202b12514A21109B7479O9120i9416A57748E0405K037a28757
8860a84475h7862D9848a21196G5201J70314K8513j20327h3246q435H5274b2642
8848c413j20625A19190e9680E3370H539b65944e5632j32972H3923K1270A8018
8836b53783j70957E275a01272B98958A3965d32231A53809C2147P7279m966D9788
8824a35273E7958M7340a05997j65760I9770h8241M59A72239e6623j41661P0626
$$ y = [245481, 137095, 125940, -160613, 224350, -118002, 188340, -142543, -77163, 76733, -154433, -255413, 104413, 129615, -212514, 121109, 27479, 96599, -99416, 157748, 50405, 52442, -128757, -184475, -87862, 49848, -121196, 75201, 245515, 274028, 153701, -83246, -91681, 85274, -22642, -3413, -124038, 119190, -59680, 53370, 8539, -265944, -55632, -188604, 83923, 105193, 18018, -253783, -424740, 5275, -101272, 298958, 13965, -432231, 153809, 32147, 109426, 104460, 49788, -135273, 57958, 105298, -105997, -271757, 99770, -88241, -87782, 172239, -56623, -198284, -127658]
$$ [...]
##END NTUPLES=NMR SPECTRUM
##END=
