
##TITLE=AC1189_Casanare-tamara-CTAAH12021_5891238_RKiArXmvme
##JCAMPDX= 6.0         $$ Bruker NMR JCAMP-DX V2.0
##DATA TYPE= NMR SPECTRUM
##DATA CLASS= NTUPLES
##ORIGIN= BRUKER
##OWNER= Administrator
$$ 1.72 TOPSPIN		Version 2.1
$$ 2012-04-02 22:48:08.125 -0500  Administrator@TOPSPIN
$$ Compression mode = diff/dup
##.OBSERVE FREQUENCY= 400.13188235
##.OBSERVE NUCLEUS= ^1H
##.ACQUISITION MODE= SIMULTANEOUS (DQD)
##.ACQUISITION SCHEME= undefined
##.AVERAGES= 8
##.DIGITISER RES= 22
##SPECTROMETER/DATA SYSTEM= spect
##.PULSE SEQUENCE= zg30
##.SOLVENT NAME= COFFEE_meoh
##.SHIFT REFERENCE= INTERNAL, COFFEE_meoh, 1, 14.98061
##AUDIT TRAIL= $$ (NUMBER, WHEN, WHO, WHERE, PROCESS, VERSION, WHAT)
$$ ##TITLE= Audit trail, TOPSPIN		Version 2.1
$$ ##JCAMPDX= 5.01
$$ ##ORIGIN= Bruker BioSpin GmbH
$$ ##OWNER= Administrator
$$ $$ C:\Bruker\TOPSPIN/data/COFFEE/nmr/AC1189_Casanare-tamara-CTAAH12021_5891238_RKiArXmvme/10/pdata/1/auditp.txt
$$ ##AUDIT TRAIL=  $$ (NUMBER, WHEN, WHO, WHERE, PROCESS, VERSION, WHAT)
(   1,<2012-04-02 22:47:59.625 -0500>,<Administrator>,<TOPSPIN>,<go>,<TOPSPIN 2.1>,
      <created by zg
	started at 2012-04-02 22:46:52.718 -0500,
	POWCHK enabled, PULCHK disabled,
       configuration hash MD5:
       1A 1E CE 29 27 FD 77 03 67 4E F0 E3 C4 B2 CB 90
       data hash MD5: 64K
       EE 9A 17 FC 8D B7 DB 27 80 4E 55 FE B6 43 93 54>)
(   2,<2012-04-02 22:48:02.750 -0500>,<Administrator>,<TOPSPIN>,<proc1d>,<TOPSPIN 2.1>,
      <Start of raw data processing
       efp LB = 0 FT_mod = 6 PKNL = 1 PHC0 = 0 PHC1 = 0 SI = 32K 
       data hash MD5: 32K
       16 5E D3 99 92 AF E2 80 36 A2 CF C4 57 7E D5 EF>)
(   3,<2012-04-02 22:48:03.187 -0500>,<Administrator>,<TOPSPIN>,<proc1d>,<TOPSPIN 2.1>,
      <pk PHC0 = 211.5472 PHC1 = 0 
       data hash MD5: 32K
       1A BD 27 57 91 40 BB 2F 5B AB B6 F0 B2 3D F7 BA>)
(   4,<2012-04-02 22:48:03.281 -0500>,<Administrator>,<TOPSPIN>,<proc1d>,<TOPSPIN 2.1>,
      <abs ABSG = 1 
       data hash MD5: 32K
       73 11 59 6F 33 2F 7D 56 30 BC 32 0C FF EC 9E 0C>)
(   5,<2012-04-02 22:48:03.359 -0500>,<Administrator>,<TOPSPIN>,<proc1d>,<TOPSPIN 2.1>,
      <abs ABSG = 2 
       data hash MD5: 32K
       E3 0B 0D 80 F0 13 EA 40 65 95 E2 3D 49 F9 84 C5>)
(   6,<2012-04-02 22:48:03.406 -0500>,<Administrator>,<TOPSPIN>,<proc1d>,<TOPSPIN 2.1>,
      <abs ABSG = 3 
       data hash MD5: 32K
       F1 7C 8F 6B B0 FA A6 3B 75 FA EB A2 A6 71 3B FB>)
(   7,<2012-04-02 22:48:03.468 -0500>,<Administrator>,<TOPSPIN>,<proc1d>,<TOPSPIN 2.1>,
      <abs ABSG = 4 
       data hash MD5: 32K
       A3 F7 2A 5F 1E A4 78 38 1C D7 01 77 90 FA C0 FE>)
(   8,<2012-04-02 22:48:03.515 -0500>,<Administrator>,<TOPSPIN>,<proc1d>,<TOPSPIN 2.1>,
      <abs ABSG = 5 
       data hash MD5: 32K
       D2 16 57 00 5D 5E 1F 67 4E C4 0F 7D 23 C7 64 F9>)
$$ ##END=
$$ 
$$ $$ hash MD5
$$ $$ 8C F1 75 77 0F 84 91 88 FF 57 FC C6 CE 79 93 98
##$RELAX= 
##$RELAX= 
##$RELAX= 
##$RELAX= 
##$RELAX= 
##$RELAX= 
##$RELAX= 
$$ Bruker specific parameters
$$ [...]
##$TP= (0..7)
150 150 150 150 150 150 150 150
##$TP07= 0
##$TPNAME0= <>
##$TPNAME1= <>
##$TPNAME2= <>
##$TPNAME3= <>
##$TPNAME4= <>
##$TPNAME5= <>
##$TPNAME6= <>
##$TPNAME7= <>
##$TPOAL= (0..7)
0.5 0.5 0.5 0.5 0.5 0.5 0.5 0.5
##$TPOFFS= (0..7)
0 0 0 0 0 0 0 0
##$TUNHIN= 0
##$TUNHOUT= 0
##$TUNXOUT= 0
##$USERA1= <user>
##$USERA2= <user>
##$USERA3= <user>
##$USERA4= <user>
##$USERA5= <user>
##$V9= 5
##$VALIST= <valist>
##$VCLIST= <CCCCCCCCCCCCCCC>
##$VD= 0
##$VDLIST= <DDDDDDDDDDDDDDD>
##$VPLIST= <PPPPPPPPPPPPPPP>
##$VTLIST= <TTTTTTTTTTTTTTT>
##$WBST= 2048
##$WBSW= 25
##$XGAIN= (0..3)
0 0 0 0
##$XL= 0
##$YL= 0
##$YMAX_a= 522314
##$YMIN_a= -642459
##$ZGOPTNS= <>
##$ZL1= 120
##$ZL2= 120
##$ZL3= 120
##$ZL4= 120
##$ABSF1= 14.98061
##$ABSF2= -5.57192
##$ABSG= 5
##$ABSL= 3
##$ALPHA= 0
##$AQORDER= 0
##$ASSFAC= 0
##$ASSFACI= 0
##$ASSFACX= 0
##$ASSWID= 0
##$AUNMP= <proc_prof1d_extract_pilot.lims>
##$AXLEFT= 0
##$AXNAME= <>
##$AXNUC= <1H>
##$AXRIGHT= 0
##$AXTYPE= 0
##$AXUNIT= <>
##$AZFE= 0.1
##$AZFW= 0.1
##$BCFW= 0
##$BC_mod= 0
##$BYTORDP= 0
##$COROFFS= 0
##$CY= 15
##$DATMOD= 1
##$DC= 0
##$DFILT= <>
##$DTYPP= 0
##$F1P= 0
##$F2P= 0
##$FCOR= 0.5
##$FTSIZE= 32768
##$FT_mod= 6
##$GAMMA= 0
##$GB= 0
##$INTBC= 1
##$INTSCL= 1
##$ISEN= 128
##$LB= 0
##$LEV0= 0
##$LPBIN= 0
##$MAXI= 10000
##$MC2= 0
##$MEAN= 0
##$ME_mod= 0
##$MI= 0
##$NCOEF= 0
##$NC_proc= -8
##$NLEV= 6
##$NOISF1= 0
##$NOISF2= 0
##$NSP= 0
##$NTH_PI= 0
##$NZP= 0
##$OFFSET= 14.98061
##$PC= 1
##$PHC0= 211.5472
##$PHC1= 0
##$PH_mod= 1
##$PKNL= yes
##$PPARMOD= 0
##$PPDIAG= 0
##$PPIPTYP= 0
##$PPMPNUM= 2147483647
##$PPRESOL= 1
##$PSCAL= 4
##$PSIGN= 0
##$PYNMP= <proc.py>
##$REVERSE= no
##$SF= 400.13
##$SI= 32768
##$SIGF1= 0
##$SIGF2= 0
##$SINO= 400
##$SIOLD= 32768
##$SPECTYP= <>
##$SREGLST= <1H.CDCl3>
##$SSB= 0
##$STSI= 32768
##$STSR= 0
##$SW_p= 8223.68421052632
##$SYMM= 0
##$S_DEV= 0
##$TDeff= 65536
##$TDoff= 0
##$TI= <>
##$TILT= no
##$TM1= 0
##$TM2= 0
##$TOPLEV= 0
##$USERP1= <user>
##$USERP2= <user>
##$USERP3= <user>
##$USERP4= <user>
##$USERP5= <user>
##$WDW= 1
##$XDIM= 32768
##$YMAX_p= 459715094
##$YMIN_p= -794967
##$CURPLOT= <Network HP LaserJet P1505>
##$CURPRIN= <$Network HP LaserJet P1505>
##$DFORMAT= <normdp>
##$LAYOUT= <+/1D_H.xwp>
##$LFORMAT= <normlp>
##$PFORMAT= <normpl>
##$SURQMSG= 1
$$ End of Bruker specific parameters
$$ ---------------------------------
##NTUPLES= NMR SPECTRUM
##VAR_NAME=  FREQUENCY,     SPECTRUM/REAL,   SPECTRUM/IMAG
##SYMBOL=    X,             R,               I
##VAR_TYPE=  INDEPENDENT,   DEPENDENT,       DEPENDENT
##VAR_FORM=  AFFN,          ASDF,            ASDF
##VAR_DIM=   32768,         32768,           32768
##UNITS=     HZ,            ARBITRARY UNITS, ARBITRARY UNITS
##FACTOR=    0.250966925370066, 1,           1
##FIRST=     8223.43324360095, -17628,       -83731
##LAST=      0,             -57399,          -77730
##MIN=       0,             -794967,         0
##MAX=       8223.43324360095, 459715094,    0
$$ Real data points
##PAGE= N=1
##DATA TABLE= (X++(R..R)), XYDATA
$$ [...]
19491b29248C2270H833a17951A59299m1752a27694j40465A70594d0156B16669
19480C01552a95462q6208a9757B01037b06430j49074a66296k68425K00067J7502
19470b17152g8394k38046e4636k16862A67890P0931b2869p4048f7k80753N6060
19459b24760C5167c78126A71695b48421C3661J7272c72882A45167b82867D9991
19448c62863H6257O280D5220J99173p6872e005A14075b16214f1908l19886f5480
19436a68583N4827j6430B36644m0053a91769L6821d39j90480G481a09855A4046
19424a37580B11747a74441A567J22166i8846C80906i2507j59948B40065b13615
19413g6673o4603A69802p6338g4595j67537g3139j19564d9018p4600o1929G5905
$$ plain form
19491 -229248 32270 8833 -117951 159299 117547 -127694 -268159 170594 -40156 216669
19480 301552 -195462 -281670 -19757 201037 -206430 -355504 -166296 -434721 -234654 -217152
19470 -217152 -78394 -316440 -54636 -271498 167890 238821 -22869 -96917 -67 -280820 -224760
19459 -224760 35167 -378126 171695 -248421 33661 50933 -372882 145167 -282867 49991
19448 -362863 86257 92537 45220 244393 167521 -5005 114075 -216214 -61908 -381794 -65480
19436 -168583 -113756 -130186 236644 196591 -191769 -154948 -439 -190919 7481 -109855 14046
19424 -137580 211747 -174441 1567 123733 -98846 380906 -92507 -252455 240065 -213615
19413 -76673 -141276 169802 93464 -74595 -242132 -73139 -192703 -49018 -123618 -185547 75905
19401b32153B3358j0323J40104b76921A06513c58067J45439r5763d4172j28797
19391a72969A69586m461L8831b64429N846d6367j38444Q5973A38745b01326j02980
19380c04306B59231f6268r0951B68046a16056n9732D8849k4162b55027B16368
19369A31500i4093q990p4693A71918l1442n4687a51907A21053c86341N203J71949
19358b09189R8966j02609J7715f9538j49598f0411G4761b17459G6983d2562j59803
19347b02365a5895q9427B38386F3245a08824B7773J3371K65971a77860A78736
19336a23232e9560D4463a28554A04351c41j83482a2366j79671Q0540j26856F73
19324B08103a39354j20915J9449B71707a33332o8042h8606J0000J7799G0316a11820
$$ plain form
19401 -232153 23358 13035 153139 -276921 106513 -358067 -212628 -308391 -44172 -172969
19391 -172969 169586 165125 203956 -264429 -258583 -46367 -184811 -98838 138745 -201326 -304306
19380 -304306 259231 -66268 -157219 268046 -116056 -175788 48849 24687 -255027 216368
19369 131500 -94093 -103083 -177776 171918 140476 85789 -151907 121053 -386341 -381138 -209189
19358 -209189 -110223 -212832 -195117 -69538 -219136 -60411 74761 -217459 76983 -42562 -202365
19347 -202365 -15895 -105322 238386 63245 -108824 27773 41144 307115 -177860 178736
19336 -123232 -59560 44463 -128554 104351 -341 -183823 -12366 -192037 -111497 -238353 673
19324 208103 -139354 -260269 -240820 271707 -133332 -201374 -88606 -78606 -60807 70316 -111820
19312F8033c6762p8440B3397c04526c8274j18842r1006d5859j46994H8550C9140
19300g4028D752a1732j70548l7638A00274a84824q7039d8748H9842b00060d6904
19288a11546L5366K0929n316k38766J20403m2598G1816B6788c04767a52306B05713
19276b4351j54465g2753b7817j39150A07766d1311l7359I8950a13634c9249k45323
19265b84572O3825C3053d34202A70689g0659I8034b23980J11431H4906a36130
19254B62527i7017C67780C943f3012B24071c28792i2790A18403i7222m7215F7103
19242a50566K9782p0089K0844m9409P0118e9004j93459J24037c9211j97103p1469
19231c07783g6231A9447g0079I2328c04531e3769j50740H5032f4958J3940C5934
$$ plain form
19312 68033 -36762 -115202 23397 -304526 -38274 -157116 -248122 -45859 -192853 88550 39140
19300 -74028 4752 -11732 -182280 -219918 100274 -184824 -271863 -48748 89842 -200060 -46904
19288 -111546 -76180 -55251 -60567 -299333 -178930 -221528 71816 26788 -304767 -152306 205713
19276 -24351 -178816 -72753 -27817 -166967 107766 -41311 -78670 98950 -113634 -39249 -284572
19265 -284572 -220747 33053 -434202 170689 -70659 98034 -223980 -112549 84906 -136130
19254 262527 -97017 367780 3943 -63012 224071 -328792 -92790 118403 -97222 -144437 67103
19242 -150566 -120784 -190873 -170029 -219438 -149320 -59004 -252463 -128426 -39211 -236314 -307783
19231 -307783 -76231 19447 -70079 92328 -304531 -53769 -204509 85032 -64958 -51018 35934
19219e1503J6424E2430b05130m7251A44286a3801H4925O7172A3542K5616a92759
19207D8497f95746C30198G7185J7897a54974D5390Q875a15319K287C93310a60290
19195A31979d79536a23616J4825M4499j27679A61870f0180K2623r8094A2790b38346
19183b69066c1994j11646B63397C3036j0800h3857n8291b711o7799l8379G7882
19171A01772a03997l48509J54973J42802j4765N8220j82220J45598p1251C7530
19160d20054Q4248a2987H1030O7942E4948D956A547a5800k14816O9723g7311K17
19148g7094D48813b39188F4383K30052d75377i025p8955A03441B593K0816a41751
19136a40178k335l2820B42387b55118D44441b67399A21660g866o2407C7570a6629
$$ plain form
19219 -51503 -35079 52430 -205130 -252381 144286 -13801 84925 152097 13542 39158 -192759
19207 48497 -695746 330198 77185 95082 -154974 45390 54265 -115319 -113032 393310 -160290
19195 131979 -479536 -123616 -108791 -64292 -191971 161870 -60180 -37557 -135651 12790 -238346
19183 -269066 -31994 -143640 263397 33036 22236 -83857 -142148 -2711 -70510 -108889 77882
19171 101772 -103997 -452506 -297533 -154731 -169496 -111276 -293496 -147898 -219149 37530
19160 -420054 -335806 -12987 81030 148972 54948 4956 1547 -15800 -230616 -160893 -77311 -77094
19148 -77094 448813 -239188 64383 294435 -475377 -9025 -87980 103441 2593 23409 -141751
19136 -140178 -142513 -175333 242387 -255118 444441 -267399 121660 -7866 -70273 37570 -16629
19124A24930a07791o1509G1728i0939a2315k31733i2445B06877a64662f2796k67861
19113c30657e1428j82940A25764J49110j10019E2071f2345A23359J41114I09c86094
19101e3697B29217c90160B7348a98729N9959P492N0410A08651J74230a36057k15445
19090c51502J67068j19745B211b64383a328D2884a72199F6219N9764n0759M8620
19079A23844B4310a33980J6910A75962b8443l17145A33650g7585m5714k8989f7121
19067D737i4191k61420D5644M1104a07326A6140h6477H3760l9683a33708A57595
19055c49450A15002m2134J40928b13177j57330a11528K8716E2819K76920p6443
19045B53296c49389I6501M8085a74361A30872a77982N1886A00265a23758f110
$$ plain form
19124 124930 -107791 -169300 71728 -90939 -12315 -244048 -92445 206877 -164662 -62796 -330657
19113 -330657 -51428 -234368 125764 274874 164855 52071 -62345 123359 264473 909 -386094
19101 -53697 229217 -390160 27348 -198729 -138770 -131278 -80868 108651 282881 -136057 -351502
19090 -351502 -184434 -304179 2211 -264383 -1328 42884 -172199 66219 125983 75224 123844
19079 123844 24310 -133980 -117070 175962 -28443 -345588 133650 -77585 -123299 -152288 -67121
19067 4737 -94191 -355611 45644 86748 -107326 16140 -86477 83760 44077 -133708 157595
19055 -349450 115002 72868 213796 -213177 -370507 -111528 -82812 52819 329739 253296
19045 253296 -349389 96501 144586 -174361 130872 -177982 -126096 100265 -123758 -6110
19034G0602i3286A40917d4952A53882G0505L0621K47849A15483a92308A97805
19023h7014C32083A1585P5048L1464B0132b74090A29164m689r481a0725r0940
19012a01665a9826k57603G7958i7101K7861F4003d0248J8291A68439J13812A28013
19000B03332a07839M0688K1669j04514g1844B7042c64254A75522J20c43662B87913
18988C9978J91027c63404A02505b56463O2838l8481G6756a42817i086j46558q7038
18977b42682G2563a33570A65682d2382D9629A4920J3473b60005Q2164h2104j80478
18966b62582J16187c7488B40612i4724B0589K6626J17677L87290k38668J28949
18956D42463a02054A52734d47643H6834b34710d1147A10963b76428e5652D7698
$$ plain form
19034 70602 -93286 140917 -44952 153882 70505 101126 348975 115483 -192308 197805
19023 -87014 332083 11585 86633 118097 20132 -274090 129164 124475 114994 -10725 -101665
19012 -101665 -19826 -277429 77958 -97101 -69240 64003 -40248 -21957 168439 282251 128013
19000 203332 -107839 -67151 -45482 -149996 -71844 27042 -364254 175522 175642 -343662 287913
18988 39978 231005 -363404 102505 -256463 -193625 -232106 76756 -142817 -9086 -155644 -242682
18977 -242682 72563 -133570 165682 -42382 49629 14920 28393 -260005 -177841 -82104 -262582
18966 -262582 -146395 -37488 240612 -94724 20589 47215 164892 552182 313514 442463
18956 442463 -102054 152734 -447643 86834 -234710 -41147 110963 -276428 -55652 47698
18945E5429a25679G4098J315b35515F6323K2075L9968m1310k0568c4694p1251
18934a05945c5169q8378b3008j52704A3248b36636a1580M440k85446O0984m2650
18923b74252d6937j80215d840k42907f5626o1731H5245a94175b3325m1454j6256
18912h1035F1559c7188J2659B1238J8643d2616l0452D0217b75746B7286a29174
18900F5085b76033G9150b71334A30071K98705j26098j40991L53897C7994j2013
18890B5981a45841m122A43662G368L03893A13230J62424c37347b2688n712k25376
18879b53776A15047B2726c9707A7186b2109m55744a64271O6431o9903A78002b52786
18867A1070d4750j78443J09888e6117K2531A5706c12981H4093a63721P9622A82356
$$ plain form
18945 55429 -125679 74098 75413 -235515 66323 88398 128366 87056 66488 -34694 -105945
18934 -105945 -35169 -123547 -23008 -175712 13248 -236636 -11580 -7140 -292586 -231602 -274252
18923 -274252 -46937 -227152 -4840 -247747 -65626 -127357 85245 -194175 -23325 -64779 -81035
18912 -81035 61559 -37188 -24529 21238 39881 -42616 -73068 40217 -275746 27286 -129174
18900 65085 -276033 79150 -271334 130071 428776 302678 161687 515584 37994 25981
18890 25981 -145841 -149963 143662 7368 311261 113230 275654 -337347 -22688 -28400 -253776
18879 -253776 115047 22726 -39707 17186 -22109 -477853 -164271 -97840 -167743 178002 -252786
18867 11070 -44750 -223193 -113305 -56117 -33586 15706 -312981 84093 -163721 -84099 182356
18855a47916k38683o1435b1I155R017J20083k2391e7394k44657a11200k01291
18844c12491O8220n8807J29560M3688G045f0098j22021A17846K07021h3964j25714
18833b09678B53400b44319i3607A74078A6133A156e6337j0249l35396J83976a06843
18821I351L93582C6400f1862q926o0700K1511F8166b30248E3919b41585A96498
18809a2938q7199A85173b6051I9047F600c7877A59201o9912B5817R2266a35237
18797G9439R2450b42778A99289b9736F8212b7852G5873G0a65147A12864b6878
18785I5989a35559E7237a25653B40732n9703H6146a25705l712k11450a62089A05756
18773B17018b23034B2609b42493e5043j3232A56579d9293k08679H5412Q9708b23422
$$ plain form
18855 -147916 -386599 -448034 -21 9155 18172 138255 115864 -57394 -302051 -111200 -312491
18844 -312491 -244271 -303078 -173518 -129830 7045 -60098 -182119 117846 324867 -83964 -209678
18833 -209678 253400 -244319 -93607 174078 16133 1156 -56337 -66586 -401982 -218006 -106843
18821 9351 402933 36400 -61862 -70788 -131488 -109977 68166 -230248 53919 -241585 196498
18809 -12938 -100137 185173 -26051 99047 6600 -37877 159201 89289 25817 118083 -135237
18797 79439 171889 -242778 199289 -29736 68212 -27852 75873 70 -165147 112864 -26878
18785 95989 -135559 57237 -125653 240732 181029 86146 -125705 -129417 -340867 -162089 105756
18773 217018 -223034 22609 -242493 -55043 -68275 156579 -49293 -257972 85412 175120 -223422
18761C2103K8043B2309K63066b853l29043A2775a95066B52082c9044H0430J49163
18750B29593i8061I7191a92123g8969k619k11878A50007e3759k07472c0598A38891
18738d36756a75127j02312i6930I3047b54270h9404a5045A43223h9976b4442o831
18727c1273C1639J29920c3167I9889h8248j1861A34077h2686p8636E5798a29502
18715D66693A11350K05480A25261a47695A26086a52074d5798B97852g7844k72810
18705c50654B89617D3433q061j0298K8168i8919k5480m317c7464l16290a01787
18693B49393a66932A05733c85489d1981F0472a53264k44839g644j42919m1255
18683a91818e3317H5195a97642A59687a85529p2274h6090C5165a0780B7516f4086
$$ plain form
18761 32103 60146 22309 285375 -2853 -331896 12775 -195066 252082 -39044 80430 229593
18750 229593 -98061 97191 -192123 -78969 -81588 -293466 150007 -53759 -261231 -30598 138891
18738 -436756 -175127 -277439 -96930 93047 -254270 -89404 -15045 143223 -89976 -24442 -31273
18727 -31273 31639 161559 -33167 99889 -88248 -100109 134077 -82686 -161322 55798 -129502
18715 466693 111350 316830 125261 -147695 126086 -152074 -45798 297852 -77844 -350654
18705 -350654 289617 43433 35372 25074 53242 -98919 -124399 -128716 -37464 -353754 -101787
18693 249393 -166932 105733 -385489 -41981 60472 -153264 -398103 -7644 -150563 -191818
18683 -191818 -53317 85195 -197642 159687 -185529 -257803 -86090 35165 -10780 27516 -64086
18671a34588D1943a38999l1790N1004C9367a32713I8824b3426A49045p1102b0781
18659b6157k60935k733F2150N6883c88240J82229n4071a14442j6862J3984j56685
18648b74005f9614o3452B64276a29815d4257q7582F0079b5572o8276a9689o8558
18637h8247K4650j48048C64629b91175G9984J37520A3553a98963A3384h3640l72428
18626d56068K04179b7691j88460m6739j1820B0537K64345f7182q7923C9067a00494
18614A53735n4579C9134K17711g2983B617f7658D3412c7012i896j74575j97030
18603c81501D38151j25008b98907B03091b50546B401a42983d2181G728b32515
18592B0046J9524j5498i1782l8050K9184C4344b1994l21639D9819a59230G3625
$$ plain form
18671 -134588 41943 -138999 -170789 -119785 39367 -132713 98824 -23426 149045 77943 -20781
18659 -26157 -287092 -289825 62150 119033 -388240 -206011 -260082 -114442 -131304 -117320 -274005
18648 -274005 -69614 -133066 264276 -129815 -44257 -131839 60079 -25572 -93848 -19689 -88247
18637 -88247 -63597 -211645 364629 -291175 79984 217504 13553 -198963 13384 -83640 -456068
18626 -456068 -251889 -27691 -216151 -262890 -274710 20537 284882 -67182 -155105 39067 -100494
18614 153735 99156 39134 256845 -72983 2617 -67658 43412 -37012 -9896 -184471 -381501
18603 -381501 438151 313143 -298907 203091 -250546 2401 -142983 -42181 7728 -232515
18592 20046 39570 24072 -91782 -129832 -100648 34344 -21994 -343633 49819 -159230 73625
18580a8663B45521b8518l90959J70303j0568P461N1753P0977o6436e7002p2830
18569a29832j82420F7532c18202A9456b05332A95547G2976b036o8485j88586N1621
18558b07486H2645b40876l142B06283l5080b1008p7336k99894A49647a38256l51636
18547d89892a38005O8614j12959h2025F5151J01337F9207c6876E0894K80209A08305
18535h9754j38158p1222N5909G4644f3682r5582G4898k475M83b12040a8825E6580
18522F2304a19697E4891B6716a69739l1680C1727J99918a5743p9302B62989F0252
18510a81134D6943c7866J4908A13843J8822B1948c1716l5353n5190G8702J7929
18499I6631h008o7393B12115G3355K48053I9057a13141A28580a98891D00715D5861
$$ plain form
18580 -18663 245521 -28518 -419477 -249174 -259742 -252281 -200528 -129551 -195987 -57002 -129832
18569 -129832 -312252 67532 -318202 19456 -205332 195547 72976 -2036 -70521 -259107 -207486
18558 -207486 82645 -240876 -244018 206283 171203 -21008 -98344 -398238 149647 -138256 -489892
18547 -489892 -138005 -69391 -182350 -82025 65151 166488 69207 -36876 50894 331103 108305
18535 -89754 -227912 -299134 -243225 74644 -63682 -159264 74898 72423 72906 -212040 -18825 56580
18522 62304 -119697 54891 26716 -169739 -201419 31727 231645 -15743 -95045 262989 60252
18510 -181134 46943 -37866 -22958 113843 132665 21948 -31716 -67069 -122259 78702 96631
18499 96631 -8008 -75401 212115 73355 321408 99057 -113141 128580 -198891 400715 45861
18487B39409c1880C34876b1534k63693I8998C4510a1753k12932B56747b20657
18476d18102B75731a65858I3055g9186j89682O9419K9318M580p3971N3398B5832
18464a85990i454J839E25545i1235a0345B2572K77150a21183J8881k19445A8990
18452b30053G254R069a3369A08736b74585J14787l3823k7821P5037m5649e22A00578
18439A08552d1439l13341f1463O782K3177H5480c75645I2409P1756K7969d73808
18427a53352k8090j64519A53801o0679a62372a1162l3002E4099e4986B77359D1711
18415G5361K64341c6280F0639a60414j00909a06494G8238K03506a50783C8008
18404a09184D0299J73428b34180d7459j25522d7082C83457a65784m9332e4113
$$ plain form
18487 239409 -31880 334876 -21534 -285227 98998 34510 -11753 -224685 256747 -220657
18476 -418102 275731 -165858 93055 -79186 -268868 -199449 -170131 -165551 -239522 -186124 25832
18464 -185990 -9454 -7615 525545 -91235 -10345 22572 299722 -121183 -102302 -321747 18990
18452 -230053 7254 16323 -13369 108736 -274585 -159798 -193621 -221442 -146405 -192054 -522 100578
18439 108552 -41439 -354780 -61463 -54681 -31504 85480 -375645 92409 164165 192134 -473808
18427 -153352 -181442 -345961 153801 93122 -162372 -11162 -44164 54099 -54986 277359 41711
18415 75361 339702 -36280 60639 -160414 -261323 -106494 78238 281744 -150783 38008
18404 -109184 40299 213727 -234180 -47459 -172981 -47082 383457 -165784 -215116 -54113
18393A76567F0530K71236a75523q0198E4900k6299a66657C3231K14817a56020
18382i1873A37342a9225j30q1361k0208n4513j1072Q3661j69125A07684j54Q5443
18370A92973p863b21359E380f9008n6336k35544a48596J9832a2652B393N95c0557
18357b4054A53299b71791J27442a4889j8291A79807a26836n3568f0640p7091B7568
18345b71841I7326b4797p4008j48246h586k07949j65306B26512G555O1871j417
18334F8009P6978o2241a45263B9946a12380C61074b14428A49803b85489A5772
18323F8454A2792K06127I3830p354a65925J8873j09718d2679l19333f1389j0622
18312g2011A90455a56812k35453G4493b40738A09958a50458j9541A0690b20814
$$ plain form
18393 176567 60530 331766 -175523 -255721 54900 28601 -166657 33231 248048 -156020
18382 -91873 137342 -19225 -19355 -100716 -120924 -175437 -186509 -102848 -271973 107684 107530 192973
18370 192973 185110 -221359 5380 -69008 -125344 -360888 -148596 -128764 -12652 2393 2988 -30557
18357 -24054 153299 -271791 -144349 -14889 -33180 179807 -126836 -180404 -60640 -137731 27568
18345 -271841 97326 -24797 -98805 -247051 -8586 -216535 -381841 226512 7555 69426 68009
18334 68009 144987 82746 -145263 29946 -112380 361074 -214428 149803 -285489 15772
18323 68454 12792 218919 93830 86476 -165925 -147052 -256770 -42679 -362012 -61389 -72011
18312 -72011 190455 -156812 -392265 74493 -240738 109958 -150458 -169999 10690 -220814
18301F423J24866J90606A16052E1203J8139a49771E8006J20636e5575C8923M831
18290D3754f5792C02778a41771n0949H3681J27398g782B62341c0280p9594k55712
18279c65586i1239A1111i0011j1009o1989j009G2163O8579J31017j05035a56044
18267B61789j29236B1041e380C1246b18966O6686l8332L4280O5766j96036B54732
18255b29177d3638j14355k19619E4333h7056A66193g1315k01766a7016A20945
18244I6753d2068A3058L24011h4034A05995b53700R8864A21087A9922J14131E3617
18232A99797D0111H836a45117G0449c02061B67575a85083N5414H8519b08633j06383
18221c15016C03225B1770P8709a47936c3522A9337b21870H8733a22667C69435
$$ plain form
18301 6423 131289 321895 116052 51203 69342 -149771 58006 178642 -55575 38923 43754
18290 43754 -65792 302778 -141771 -192720 83681 211079 -7782 262341 -30280 -109874 -365586
18279 -365586 -91239 11111 -90011 -101020 -163009 -164018 72163 140742 271759 166724 -156044
18267 261789 132553 21041 -5380 31246 -218966 -152280 -190612 -156332 -90566 -286602 254732
18255 -229177 -43638 -157993 -377612 54333 -87056 166193 -71315 -273081 -17016 120945
18244 96753 -42068 13058 337069 -84034 105995 -253700 -154836 121087 19922 134053 53617
18232 199797 40111 8836 -145117 70449 -302061 267575 -185083 -129669 88519 -208633 -315016
18221 -315016 303225 21770 100479 -147936 -33522 19337 -221870 88733 -122667 369435
18210a73979B35205F7504a82486d4977q8917D3637J06285a97351j3611A62020
18199G8710Q1131n9343b25211d8145J5656n0145I7676f9418A68328f6340A60218
18187d2702A6526a48001G4440h3501j04781A72129p9387b3182j6655l12595J60179
18176a92253m985o5075j9405e8683A36940a88489D6467J06880b7530o668A36059
18164e9524B3290e210C9381I04a1817n8447O691j27091j9377R4380a7644j45364
18152a63008j45701B50804G9611b73652B4598d42077D1203g3027j98241H7467
18141E6942d34066D81565d89185F9198A3467g9124A745e2701G7351b4305k48984
18130b73289I1558a54714j2938H0374e1788C8122h8584h848r5389C31097b60447
$$ plain form
18210 -173979 235205 67504 -182486 -44977 -133894 43637 149922 -197351 -210962 162020
18199 78710 159841 100498 -225211 -48145 -32489 -82634 97676 -69418 168328 -66340 160218
18187 -42702 16526 -148001 74440 -83501 -188282 172129 92742 -23182 -39837 -352432 -192253
18176 -192253 -197238 -262313 -281718 -58683 136940 -188489 46467 153347 -27530 -34198 136059
18164 -59524 23290 -5210 39381 904 -11817 -70264 -63573 -190664 -210041 -115661 -17644 -163008
18152 -163008 -308709 250804 79611 -273652 24598 -442077 41203 -73027 -271268 87467
18141 56942 -434066 481565 -489185 69198 13467 -79124 1745 -52701 77351 -24305 -273289
18130 -273289 91558 -154714 -167652 80374 -51788 38122 -88584 -8848 -104237 331097 -260447
18118c8821e970B37908I3981b9853k77686a13190c090j05392A24090b56298a19186
18106b01956C86074h4233K241C67959A19041J58207b07481d6415a0535m1575b0598
18094A61657g1712C49735b49156a9471j16118q1851A89139A6352a36455C626N3370
18083E6996d27058d7727A74719J42788j19351o3234a29571A51948h5638F5630
18072B3239a67336C3423J31073l8980h3459a0863A06457b06183B29659E2449a35811
18060b83045A58298a72296C2928j2596Q5981J86435a19139B04085D5012a70786
18049g6687k6295A16053j1609a1199j40346B74153G8628K35544F7197i2316E3047
18037D1680Q1614b23636A32753J31662h0573k03880D1265a04593E51733a89991
$$ plain form
18118 -38821 -5970 237908 93981 -29853 -307539 -113190 -3090 -108482 124090 -256298 -119186
18106 -201956 386074 -84233 -81992 367959 119041 277248 -207481 -46415 -10535 -52110 -20598
18094 161657 -71712 349735 -249156 -19471 -135589 -217440 189139 16352 -136455 3626 56996
18083 56996 -427058 -47727 174719 317507 198156 134922 -129571 151948 -85638 65630
18072 23239 -167336 33423 164496 125516 -83459 -10863 106457 -206183 229659 52449 -135811
18060 -283045 158298 -172296 32928 20332 106313 292748 -119139 204085 45012 -170786
18049 -76687 -102982 116053 104444 -11199 -151545 274153 78628 314172 67197 -92316 53047
18037 41680 123294 -223636 132753 264415 -80573 -284453 41265 -104593 551733 -189991
18026A91588A6469K31400a25159e3526a5240p2338B90286k3234b28847P4445d2754
18014C07357k2587r7180c52924F0230P4671a05574m8083g6560j49848c5301r6484
18003a31785D3418c1879r9185I3650g5832r5360A73433a14364A36816c5461A93274
17991B71427B3172J49943d9348D1793J22943m5748P5133c7604G3943a17015G8073
17979d9721l2441A02628m591b22894g3270O334j68016J10004D3892a19671p4874
17968a94545g6248J5861h235E7900J81142r0621c35342A3363L967J01472P3260
17957A92062F0737L5130b32756B5992d5901A92959a23162D2954J65271f7053F7985
17945A21219N4178a36937B2467a16967K1509n8538F538O4874l3212J87367f4254
$$ plain form
18026 191588 16469 247869 -125159 -53526 -15240 -87578 290286 267052 -228847 -154402 -42754
18014 307357 284770 187590 -352924 60230 134901 -105574 -153657 -76560 -226408 -35301 -131785
18003 -131785 43418 -31879 -131064 93650 -75832 -171192 173433 -114364 136816 -35461 193274
17991 271427 23172 173115 -49348 41793 164736 118988 194121 -37604 73943 -117015 78073
17979 -49721 -82162 102628 98037 -222894 -73270 -66936 -234952 -124948 43892 -119671 -194545
17968 -194545 -76248 -60387 -8235 57900 239042 148421 -335342 13363 17330 118802 192062
17957 192062 60737 95867 -232756 25992 -45901 192959 -123162 42954 208225 -67053 67985
17945 121219 175397 -136937 22467 -116967 -95458 -153996 6538 71412 38200 225567 -64254
17933a06391j43147H9006k1087h07B54352I3297J61611b17663h5222K3577j62856
17922b24501g0394q3306C06305A51427g2639B65682g139j00631M1738r1167G4690
17910a80381C3208a60550O2853m9465j37493a2115m12255J96461A56995b02302
17899c753J086p5712F5207j7204K45867A11602h6983A21261d3628q5017k54704
17888c83349A1119R4147K01222j31912q390E8000h4678B14093J43892g7944k16419
17877b94363f9364K4562o6492I189K99350a23254B19532c9179p9215j8554c0552
17865A75685L11602a22019o5672j27602a44635D084M35308k2564C8860R785M196
17854E2841K11406c5740A0312e6976A46460J4874n4544B2484a03425o0514j02653
$$ plain form
17933 -106391 -249538 89006 67919 -807 254352 93297 254908 -217663 -85222 -61645 -224501
17922 -224501 -70394 -153700 306305 151427 -72639 265682 -7139 -107770 -66032 -157199 74690
17910 -180381 33208 -160550 -97697 -147162 -284655 -12115 -424370 -227909 156995 -202302
17899 -3753 -2667 -78379 65207 48003 293870 111602 -86983 121261 -43628 -128645 -383349
17888 -383349 11119 105266 306488 174576 166186 58000 -84678 214093 357985 -77944 -294363
17877 -294363 -69364 -44802 -111294 9189 308539 -123254 219532 -39179 -118394 -136948 -30552
17865 175685 487287 -122019 -187691 -315293 -144635 4084 439392 416828 38860 48645 52841
17854 52841 264247 -35740 10312 -56976 146460 161334 106790 22484 -103425 -163939 -266592
17843b66592I2573L8938J73723A34652c846q7069j46318h5770A54627F7041b14687
17831I3389l8752g4576B60018a52114c6273m2044B61853Q0081D6208A4332b34166
17819a27565I3159K90053b30539H1893a20342A04562B6760Q5712n4358h5893B24441
17807B00988e5714B32230D3068g8395C51959c2314r1464b9939j028A30077l4934
17796I5143d12409A01109h0928A56077b4331B63690A07380K51653A06428K2667
17786A29095J39213J3789H4582a83286E3787p962Q1004E7562L86130I3446Q6738
17775A80184b37118B28401q4416M1640r1862f8591A91494m7126e8579A49064b0895
17763D040a8969A48476F7064c4695a5920c554l2549C32806r7833G1085M8957C5542
$$ plain form
17843 -266592 92573 131511 305234 134652 -3846 -90915 -237233 -85770 154627 67041 -214687
17831 93389 54637 -74576 260018 -152114 -36273 -78317 261853 341934 46208 14332 -234166
17819 -127565 93159 383212 -230539 81893 -120342 104562 26760 112472 58114 -85893 224441
17807 200988 -55714 232230 43068 -78395 351959 -32314 -123778 -29939 -30967 130077 95143
17796 95143 -412409 101109 -80928 156077 -24331 263690 107380 359033 106428 129095
17786 129095 268308 282097 84582 -183286 53787 45825 126829 57562 443692 93446 180184
17775 180184 -237118 228401 143985 185625 93763 -68591 191494 144368 -58579 149064 -20895
17763 4040 -18969 148476 67064 -34695 -15920 -3554 -36103 332806 234973 71085 120042 35542
17750f3087A02392D6373O4224e1963D17591C1183J11110n4012c40032J33901C3268
17738b7847E3391b9750G0192K05907b09479R9338A9761b87956A37696C2041a41416
17726f5284p435j01901A52615L5296e4801B69779J01965H8920a64592C92157A15005
17714c9824B51648A15319b10667c0960o1035l2591F9520L6942d6203J1871j67398
17703b01730B6519K62505D849N7434K09168a44427A32957a71892O6701l6717A10158
17691c10k0265K00C6380J78073b48716C2747i189j53547I3955a52109A50708h6939
17678C3422R4541c6091B2346P3770a37241b3657C00396a85024E6094J52627o525
17667B02196O351h9655c7268C08060I4527J10416J37853b3008A26974e4768C7593
$$ plain form
17750 -63087 102392 46373 110597 -51963 417591 31183 142293 88281 -340032 -206131 33268
17738 -27847 53391 -29750 70192 276099 -209479 -110141 19761 -287956 137696 32041 -141416
17726 -65284 -72719 -174620 152615 187911 -54801 269779 371744 88920 -164592 392157 115005
17714 -39824 251648 115319 -210667 -30960 -91995 -124586 69520 106462 -46203 -34332 -201730
17703 -201730 26519 289024 4849 62283 271451 -144427 132957 -171892 -105191 -141908 110158
17691 -310 -20575 -20375 36380 214453 -248716 32747 -9189 -162736 93955 -152109 150708 -86939
17678 33422 127963 -36091 22346 96116 -137241 -23657 300396 -185024 56094 208721 202196
17667 202196 208547 -89655 -37268 308060 94527 204943 342796 -23008 126974 -54768 37593
17655A67923b2595o2152J5478E6686J03666F8716O9493J37856N2036c15951D8703
17643B02347F1380b850A45262b55385A06047k7081M1847n8177b26688A13578e5873
17631a97432a6688j5686k00771F08094B17798m7561B8024j512J53607m668K8005
17620B03456N0682D8613L24126a05236B70038a41687k88904a90597f7312F1930
17609B89932L42802f5589A84120h5670D2824L18788H4041a2041C57016b05901
17598b0521k59312G1853L6979j3131a1517A70529a03252G0373J52231A03838B3135
17586B32187b3605B27193G397K85894Q2258A66811g4104A11065K45189D0013Q1523
17575A21536L11098o2694A42493B3840Q9026M774g5230A15131b79073B65535J06716
$$ plain form
17655 167923 -22595 -84747 -69269 56686 160352 68716 138209 276065 328101 -315951 48703
17643 202347 61380 -2850 145262 -255385 106047 78966 120813 62636 -226688 113578 -55873
17631 -197432 -16688 -32374 -233145 608094 217798 170237 28024 26512 180119 175451 203456
17620 203456 254138 48613 372739 -105236 270038 -141687 -430591 -190597 -67312 61930
17609 289932 632734 -65589 184120 -85670 42824 361612 84041 -12041 357016 -205901
17598 -20521 -279833 71853 108832 95701 -11517 170529 -103252 70373 222604 103838 23135
17586 232187 -23605 227193 7397 293291 375549 166811 -74104 111065 356254 40013 121536
17575 121536 432634 369940 142493 23840 112866 117640 -75230 115131 -279073 265535 372251
17564C72251A72463a21599H5441O405a00483j20191C46910G0093L31977B5383
17553A64972P3412J53191i7943Q917A2983K47029l8905N6061j37907P1507A2793
17541H3425E838K73846k0525m4712M9812j30172j144F5968c7474H0371K27961
17530C08332J33931j84935j15178E0430L44169A70404B5631r729a13044I5261
17519F2041K50313K3543A25372K65130J39620p8332J71822j81564M44536m3503
17509H43081j83121P6374j73924L81500j58588H6042M75828g750D59541N0936
17499E10477p1417A78356L77685J25505J20292L39842o3632k69777n9993j70703
17489E77575q3512j68972J80752j45214A51107O8600l6686L82038B63413k9111
$$ plain form
17564 372251 172463 -121599 85441 91846 -100483 -220674 346910 70093 402070 25383
17553 164972 238384 391575 -97943 -89026 12983 260012 221107 277168 139261 210768 12793
17541 83425 5838 279684 259159 214447 264259 134087 132943 65968 -37474 80371 308332
17530 308332 442263 257328 142150 50430 394599 170404 25631 15902 -113044 95261
17519 62041 312354 335897 125372 390502 530122 451790 623612 442048 886584 843081
17509 843081 659960 736334 562410 943910 785322 86042 561870 -7750 459541 510477
17499 510477 439060 178356 556041 681546 801838 1141680 1078048 808271 748278 577575
17489 577575 494063 325091 505843 360629 151107 219707 183021 565059 263413 234302
17479B34302L6194P9693L7125j0067A43726J64901R1037j67840R8437J7046D1202
17467A76003a27672I9522c2336B47837d8298D62276a4288A49822K2813P2718O0762
17456C06115a12093A78951K86193o0438J06213k39584J02336K87532k79059A7944
17445B41825F6387J60275K76821C4280A3899J18201J65089K0944J86447L7074
17435E41654k52362A04708M97625j34239A01927N49690B82830p7373B4813R0462
17425A15275j6836J49765c5378B95583C8158K20526P1284B8208K82562j03204
17415B07566G7609L53260k05636K96646n7102P1444j11411L923H9911M1320M633
17404A35864K72805G9440l0043L66104C7959K82512j41248K6654q607I6160M7259
$$ plain form
17479 234302 270496 350189 387314 377247 143726 308627 399664 231824 330261 347307 41202
17467 176003 -127672 99522 -32336 247837 -48298 462276 -14288 149822 172635 245353 306115
17456 306115 -112093 178951 465144 404706 510919 271335 373671 661203 382144 17944
17445 241825 66387 226662 503483 34280 13899 132100 297189 318133 504580 541654
17435 541654 289292 104708 602333 468094 101927 651617 282830 205457 24813 115275
17425 115275 98439 248204 -35378 295583 38158 258684 329968 28208 310770 207566
17415 207566 77609 430869 225233 521879 464777 536221 424810 428733 89911 131231 135864
17404 135864 408669 79440 49397 415501 37959 320471 179223 205877 197270 96160 143419
17393A43419J52718A04673J00983Q9834P6171j83951E775K45345M9533p0025J70845
17382D01473H2993J34731J16360K85455A93219J010E4811L56411a23658C21720
17371H4607J14729l0607R3863A5702L09353o8674J13844J00918j75834l3820A18924
17359C06663j39381J24066m5682M0745K1208o9272l9787k0673M6961n3947Q1225
17348B52126p4933K52187j07304k2177o6682F1344J79610r4178K15784A70465
17337C04582A5635L88884j49792j19724R3229A6173J43167F8720J10115K1367
17327B00202F9338P10379A88561J70624j07260J3575J88656o6724j74767N2405
17317B65070J67427j37739Q0116j75226P6057j23107L31398L8934f8000C70382
$$ plain form
17393 143419 296137 104673 205656 295490 371661 187710 5775 251120 300653 230628 401473
17382 401473 82993 217724 334084 619539 193219 194229 54811 411222 -123658 321720
17371 84607 199336 168729 262592 15702 325055 256381 370225 471143 295309 261489 118924
17359 306663 167282 291348 245666 286411 307619 238347 198560 177887 224848 170901 252126
17348 252126 177193 429380 322076 299899 233217 61344 240954 146776 362560 170465
17337 304582 15635 404519 254727 135003 228232 16173 159340 68720 178835 200202
17327 200202 69338 779717 188561 359185 251925 265500 454156 387432 212665 265070
17317 265070 432497 294758 374874 199648 275705 152598 483996 522930 -68000 370382
17306B23012K00553j4768A79351k9787L78567G0366J02782m3379J37364A26307
17295I0756J43973M04r9542D3613K17383I0473K46172h5070C49601a18333C74316
17283C84037a2227E57099k15120f0854A87415a05920D51731l4753l9264F7885
17272C13052q6647M02685A24195M72608A84832k2850k0837J81728J86498B15318
17261B5642J18178M406b53C42231J20178A79413m5374m6946K20495k9346p2407
17250B05835G7409K52445K36716A25958J70084b7834C10600L59256F1261L62471
17240D23732B00359l4685J16406f3275D05201A23723M01537B40331b5360C04736
17229A26379K77126r073j12522K15715A67193G0312M19412P4920l4696j28564
$$ plain form
17306 223012 423565 408797 179351 149564 528131 70366 173148 129769 267133 126307
17295 90756 234729 235133 135591 43613 260996 90473 336645 -85070 349601 -118333 374316
17283 384037 -12227 557099 341979 -60854 187415 -105920 451731 416978 377714 67885
17272 313052 226405 629090 124195 596803 184832 161982 141145 322873 509371 215318
17261 25642 143820 148226 -253 342231 462409 179413 134039 87093 307588 278242 205835
17250 205835 77409 329854 566570 125958 296042 -27834 310600 669856 61261 423732
17240 423732 200359 165674 282080 -63275 405201 123723 525260 240331 -25360 304736
17229 126379 403505 394432 281910 497625 167193 70312 489724 564644 529948 401384
17219D01384j48015q2726L79511B70016J29566q062n0110E0800K46099j5517L7668
17208C19050j54900J92848p3320K00604K95510l59903O9496f1859C03746J51285
17198D55031m0318J73176B03817Q1406L23691k86806A10593C3769J02431J16461
17188B52661L65731j80478N1356J86634j06719Q4450B44376K57866A03230K42450
17178C45680J12135j04750J78284K7839k52501A10759L76490P3530j24727J222
17168D37274K01981I3670N47334k51661A91444K63511j84672K4339K88171A90540
17157D00689j22887O4078K37219J94200B52020L04763L11307q1907B86374K61876
17147E48250J55958l12649Q6558K22227B33658O16486j26841l32968N35468C08268
$$ plain form
17219 401384 253369 170643 550154 270016 399582 391520 341410 50800 296899 281382 319050
17208 319050 164150 356998 283678 484282 779792 419889 489385 -61859 303746 455031
17198 455031 414713 587889 203817 285223 608914 322108 110593 33769 136200 252661
17188 252661 618392 437914 489270 675904 569185 653635 244376 502242 103230 345680
17178 345680 457815 353065 531349 559188 306687 110759 487249 560779 436052 437274
17168 437274 639255 93670 641004 389343 191444 454955 270283 294622 582793 190540
17157 400689 277802 341880 579099 773299 252020 556783 868090 786183 286374 548250
17147 548250 704208 391559 478117 700344 233658 850144 723303 390335 925803 308268
17136F39868B47061M00703j40794k7434J76322q2075L80K4312K16950k78361B23556
17124A86885M24161j12001N1475j5611q2069r9334M27185A42668O30868l2604
17114G40932B11648l6947L45099L31649B63195L59596l03477L82098C02283K09573
17104E11856j30261J61844j3310j42788N25768j72642j45541R1885B82681J17572
17094D00253K81517J40209j97497k14418K92142k74156J28017K2272M86212k99765
17084G64786J29434j52784j36042B70551K02494L25285k38374j74208L60878B24314
17073E05174j01413J80076L74831k02357l42741p9873N05489k46944N1467j00601
17063E43108K39754J31225k79735J03095J95985l3581m41616K30950k43732N58606
$$ plain form
17136 639868 247061 647764 506970 479536 655858 573783 574163 598475 815425 537064 223556
17124 186885 611046 499045 550520 534909 452840 353506 780691 142668 773536 740932
17114 740932 211648 174701 519800 851449 263195 622791 319314 701412 302283 511856
17104 511856 381595 543439 530129 387341 913109 740467 594926 686811 282681 400253
17094 400253 681770 821979 624482 410064 702206 428050 556067 578339 1064551 764786
17084 764786 894220 741436 605394 270551 473045 798330 559956 385748 746626 224314
17073 505174 403761 583837 958668 756311 413570 333697 839186 592242 643709 543108
17063 543108 782862 914087 634352 737447 933432 899851 458235 689185 445453 1004059
17053A004059D98995K33270J70197k10201K54667o9485l56295K71032J14295N7901
17043I64376j82138N9624l28022L12294J13246j20867l89628J93564J31481K63054
17033A016984m04773K66020o1116J52415l29502M87214n7669K7489l73757L21507
17023A044812k82972j50003L73061q0305J47384j01037R9074k92457J71316m1708
17013H87165n4250J92428k0469j322r5215K5916p2550Q5509K87596j63553l82308
17002F88947L76159J26437J93964k18174P3762k54616J9771J11067m1567J18424
16992A194174k00141J99017O2057j69517L7112k84984K79872j62324K75056k11015
16982A019307J62833j3044j97901L41306l94557N00434r6600k71237J74589J51523
$$ plain form
17053 1004059 498995 732265 902462 692261 946928 877443 521148 792180 906475 964376
17043 964376 782238 841862 513840 826134 939380 818513 428885 622449 753930 1016984
17033 1016984 612211 878231 817115 969530 640028 1127242 1069573 1097062 723305 1044812
17023 1044812 761840 611837 984898 904593 1051977 950940 1050014 757557 928873 887165
17013 887165 832915 1025343 1004874 1003552 908337 934253 861703 947212 1234808 1071255 688947
17002 688947 1065106 1191543 1385507 1167333 1241095 986479 1006250 1117317 1075750 1194174
16992 1194174 994033 1193050 1255107 1085590 1122702 837718 1117590 955266 1230322 1019307
16982 1019307 1182140 1169096 971195 1312501 917944 1418378 1321778 1050541 1225130 1376653
16972A376653l49084J35688J5956K4420O2540n6911k0167J0847L5129n042L60122
16961A590151k50228J25172k17614K00295J60459J79007j4908n53212L06101p4441
16951A450782k18001K82713J58360m36207L09935j15448J23816J19852k99203
16942A376599K19072K28154l92986K81825j6296m19935N00237l36626K10167L27665
16932A977876l28536o4714L09987O1378k60261L30417k3200l67268K75900j74384
16922A737195L33967j01416q9366J59101l26071J34956j36492L40140o1636L47130
16912B337508m95961K41319J02697K38549k5924k97086m6611J26893N5293k3818
16902B212859J34579N1291J33743j39760Q1720m12143L44666M9947j24468K91360
$$ plain form
16972 1376653 1027569 1163257 1179213 1203633 1266173 1209262 1189095 1199942 1235071 1230029 1590151
16961 1590151 1339923 1465095 1247481 1447776 1608235 1787242 1772334 1219122 1525223 1450782
16951 1450782 1232781 1515494 1673854 1237647 1547582 1432134 1555950 1675802 1376599
16942 1376599 1595671 1823825 1430839 1712664 1696368 1276433 1776670 1440044 1650211 1977876
16932 1977876 1649340 1584626 1894613 1955991 1695730 2026147 2002947 1635679 1911579 1737195
16922 1737195 2071162 1969746 1880380 2039481 1713410 1848366 1711874 2052014 1990378 2337508
16912 2337508 1841547 2082866 2185563 2424112 2398188 2101102 2054491 2181384 2236677 2212859
16902 2212859 2347438 2398729 2532472 2392712 2474432 2062289 2406955 2456902 2332434 2623794
16892B623794J20254n50564L78760j07k57692R3580N62611m31407N620N03252
16882C048101k66078k47635J43930q0808L17363J09642K1527j133k22800R4192
16872B916301K15381J05165j37502P425J56003J87493l74237M08883k02316J68170
16862C450766O0410J23394K0345O2958q1047J20570j03876J03039K08065J27093
16852D091717j0958L7663k54325K3902J83092J25540M4256L68172o1026j09045
16842D438988J30143Q0699K64907J7383O6248n7775J29579k08651J03877N24876
16832E490274J36185k04052K72811l42142J94387l1386L13250N7805N34496k29438
16822F192190K66644M4577j2385L27421j16301L15887N442L627K83797Q7868L03090
$$ plain form
16892 2623794 2744048 2193484 2572244 2572137 2314445 2408025 2970636 2539229 2544849 3048101
16882 3048101 2782023 2534388 2678318 2597510 2914873 3024515 3046042 3044909 2822109 2916301
16872 2916301 3131682 3236847 3099345 3106770 3262773 3450266 3076029 3484912 3282596 3450766
16862 3450766 3511176 3634570 3654915 3717873 3636826 3757396 3653520 3756559 3964624 4091717
16852 4091717 4080759 4118422 3864097 3887999 4071091 4196631 4240887 4609059 4548033 4438988
16842 4438988 4569131 4649830 4914737 4932120 4998368 4940593 5070172 4861521 4965398 5490274
16832 5490274 5626459 5422407 5695218 5353076 5547463 5516077 5829327 5887132 6421628 6192190
16822 6192190 6458834 6503411 6491026 6818447 6702146 7018033 7023475 7027102 7310899 7398767 7701857
16811G701857r3508q8092O4751L86126L19189n3257K70081J09200Q8535N08329
16801I213211m6043P0270J62944N30423M1843Q0944M65542R2255K70032K44420
16791A1125841Q085M09940O4241P58741M1995K57006J92506N73622j87393O81944
16781A3926528N01310k3877M57778L09051K02398L58027Q19063J80418N80102
16772A7310798O04772M48438M15109M88390N89708P03206O65935N16896L51721
16763B2094973Q25655M15166J060512O24596P87620R10514J193404N55406P91728
16754B9259574J286752R93818J072191R75481J409450J005673J421242J479972
16746C8904153R85933J555239J694645J537708J605080K170320J781036J619331
$$ plain form
16811 7701857 7608349 7520257 7585008 7971134 8290323 8237066 8507147 8616347 8704882 9213211
16801 9213211 9167168 9237438 9400382 9930805 9972648 10053592 10519134 10611389 10881421 11125841
16791 11125841 11133926 11543866 11608107 12366848 12408843 12665849 12858355 13431977 13244584 13926528
16781 13926528 14427838 14403961 14861739 15170790 15373188 15731215 16550278 16730696 17310798
16772 17310798 17915570 18364008 18779117 19267507 19857215 20560421 21226356 21743252 22094973
16763 22094973 22920628 23335794 24396306 25020902 25808522 26719036 27912440 28467846 29259574
16754 29259574 30546326 31540144 32612335 33587816 34997266 36002939 37424181 38904153
16746 38904153 39890086 41445325 43139970 44677678 46282758 48453078 50234114 51853445
16738E1853445K517638J984501K464237K267298J932934K930773K461832K667620
16730G1080278L208900K334522L412697K825646K957392L538694L588192K946836
16722I5893157L616108L048507L234018L356917L044925L170120K878787K665994
16714A20908533K355113K463029K074875R49861J575927J112563N98034j04095
16706A31933840M6505o36677j047703j300959j718695j930381k414889k596328
16698A20334713k575533l002258k929698l186689l362378l330654l158598l612604
16690I5176301l219404l226389l303334l372881l156731k569176l225662k791115
16682G0311609k450717k875603k610164k277612k371744k059646k266660k098262
$$ plain form
16738 51853445 54371083 56355584 58819821 61087119 63020053 65950826 68412658 71080278
16730 71080278 74289178 76623700 80036397 82862043 85819435 89358129 92946321 95893157
16722 95893157 99509265 102557772 105791790 109148707 112193632 115363752 118242539 120908533
16714 120908533 123263646 125726675 127801550 128751411 130327338 131439901 132037935 131933840
16706 131933840 131980345 131343668 130295965 128995006 127276311 125345930 122931041 120334713
16698 120334713 117759180 114756922 111827224 108640535 105278157 101947503 98788905 95176301
16690 95176301 91956897 88730508 85427174 82054293 78897562 76328386 73102724 70311609
16682 70311609 67860892 64985289 62375125 60097513 57725769 55666123 53399463 51301201
16674E1301201k075671j716853k010844j662798j505795j399853j810706j431171
16666C7687510j267080r57566j450400j244061j121328r49230q22732j151105
16658B8724008j418920m94277m99960j244760q40938l58900j007412p49627n42621
16649B1566593o84772p33033j23950o25356p11396o60615l86744o57596k93313
16640A6689818l09816n82923q25903K03231m17272k02311q04963m66777L0652
16631A3313736l69667j98508l93268l9229o66776k08848j49327l85711k28839
16622A0673563J21304m09755j14704r13467L27867m57945L44896o89605o3604
16613H818550k43057J41269k54131l37397j22679K59024o84811M96028q42614
$$ plain form
16674 51301201 49225530 47508677 45497833 43835035 42329240 40929387 39118681 37687510
16666 37687510 36420430 35462864 34012464 32768403 31647075 30697845 29875113 28724008
16658 28724008 27305088 26810811 26310851 25066091 24225153 23866253 22858841 22109214 21566593
16649 21566593 20881821 20148788 20024838 19399482 18688086 18027471 17640727 16983131 16689818
16640 16689818 16380002 15797079 14971176 15174407 14757135 14554824 13749861 13283084 13313736
16631 13313736 12944069 12745561 12352293 12313064 11646288 11437440 11288113 10902402 10673563
16622 10673563 10794867 10385112 10270408 9356941 9684808 9226863 9571759 8882154 8818550
16613 8818550 8575493 8716762 8462631 8125234 8002555 8261579 7576768 8072796 7230182
16604G230182J60090n16815Q9633Q6336k14742n2327k61938r7684J66995m28536
16594F161194j25221j15255O1626j08331l35719J58005j47229k18499J22095k31686
16584E220980j42294J05088k56663m7482P5043n5463M4829k79362r8001j57878
16574D408797N3873m04406M94160k24880k45691r8962M29431j41958m79032K75224
16564D066556k56155L34522l53808k39459L71462m50838O9229l23908K47682K610
16554C467893n20980K54039J77727j4245k61585P3313k23817L62303k96726J00647
16544C118569j87750J21218k22913N0795j57667J76900l21311K94877l09374J60727
16534B724071n9303J08868k75788J76602l37787m4137K69703j57772o0558J09833
$$ plain form
16604 7230182 7390272 6873457 6963090 7049426 6834684 6782357 6520419 6422735 6589730 6161194
16594 6161194 6035973 5920718 5982344 5874013 5538294 5696299 5549070 5330571 5452666 5220980
16584 5220980 5078686 5183774 4927111 4879629 4954672 4899209 4944038 4664676 4566675 4408797
16574 4408797 4462670 4058264 4552424 4327544 4081853 3982891 4412322 4270364 3791332 4066556
16564 4066556 3810401 4144923 3791115 3551656 3923118 3472280 3541509 3217601 3465283 3467893
16554 3467893 2946913 3200952 3378679 3364434 3102849 3176162 2952345 3314648 3017922 3118569
16544 3118569 2930819 3052037 2829124 2879919 2722252 2899152 2577841 2872718 2563344 2724071
16534 2724071 2664768 2773636 2497848 2674450 2336663 2292526 2562229 2404457 2343899 2453732
16524B453732j69999j23455K66845k31424k5752M64756l73468L8066k58446R4597
16514B135452L80737m72566P527j32188p3986J42611j68930J66775P6228j0279
16504B051381L15240q61360M28393j45790J62125j63742O352K02869N9505m51435
16494A603538J07443P6260j61906j08536K27393j80959J65143K0796k4397k72987
16484A451788K09788J07744n10054N38318j74469j80693j02612K48767J02330
16475A690907k90665J36334R4706m30848O25889l43756j24797K56481k4367o0861
16465A529023q8088j64733j21302P9164L50185k69377j0647j03075J47544L14249
16455A662943m14918O5356k999J03491j82252k32803N46032l59236P272j40298
$$ plain form
16524 2453732 2283733 2160278 2427123 2195699 2169947 2634703 2261235 2299301 2040855 2135452
16514 2135452 2516189 2043623 2051150 1918962 1844976 1987587 1818657 1985432 2061660 2051381
16504 2051381 2366621 1505261 1933654 1787864 1949989 1786247 1792599 1995468 2054973 1603538
16494 1603538 1710981 1787241 1625335 1516799 1744192 1563233 1728376 1749172 1724775 1451788
16484 1451788 1661576 1769320 1259266 1797584 1623115 1442422 1339810 1588577 1690907
16475 1690907 1400242 1536576 1631282 1200434 1826323 1482567 1357770 1614251 1589884 1529023
16465 1529023 1440935 1276202 1154900 1234064 1584249 1314872 1304225 1201150 1348694 1662943
16455 1662943 1248025 1313381 1310382 1413873 1231621 998818 1544850 1185614 1192886 1052588
16445A052588k1212K40278n7350l14017K10511K10225J67320l07340L6206m4594
16435A172615j91234p2720J57178L55077o45739Q2973K59924O6456j54872l8034
16425I91624K5007r0090M2049N9733L3649l54320M80090k43691R2809k85606L95257
16414A146511j62258m1095l3834J76337R3174j88132R9256q5021j68448l6372
16404H00118L04748l02984J47029P021k554k21647N830J32730l26624L82815l08330
16393F18152J17125L08711k17044l3902L1679J2175m388k00442Q1722L5269j70108
16382E78949Q4477n923J66327p1532k3602M5323l2442l3621J50511N6l92944K05266
16370F70845M09249p6952m1323r1156C52094P41718D19251M98999l60329k24801
$$ plain form
16445 1052588 1031376 1271654 1214304 900287 1110798 1321023 1488343 1181003 1217209 1172615
16435 1172615 981381 908661 1065839 1420916 775177 858150 1118074 1184530 1029658 991624
16425 991624 1016631 926541 968590 1028323 1061972 707652 1187742 944051 1036860 751254 1146511
16414 1146511 984253 943158 909324 1085661 1178835 990703 1089959 1004938 836490 800118
16404 800118 1104866 801882 948911 955932 953378 731731 737561 870291 543667 926482 618152
16393 618152 735277 1043988 826944 793042 824721 836896 832508 632066 713788 749057 578949
16382 578949 663426 657503 823830 752298 728696 774019 741577 707956 858467 858523 465579 670845
16370 670845 1080094 1003142 961819 870663 352094 1093812 419251 918250 557921 333120
16360C33120J45367L25894C73100L13671J9197l38968J65039K13742K68631l42125
16350F72287o4925K80277r63J3119m20368q741J0443n7276K58156j64796p514
16339E09699J85756j8716k44964M09756j20107l02178J92144j23814M8512J1653
16329E47741P8796o151n3679K89277D08915K66072O7691k17090J9787Q8630l5028
16318E98977k92794L68898r7338j90736J975M80202l15620Q3135k86596k8158
16308C21945J07720M2199j87733Q2854q770K82915K8595k16985Q6488J51519P97
16297F91544C39494J85735B08014L56210L6486K6644C04318J97406P8183m7632
16287E32275j67293P7810L0926M6200K63321p6319n3948B66943K84312j81593
$$ plain form
16360 333120 478487 804381 373100 686771 705968 367000 532039 745781 1014412 672287
16350 672287 607362 887639 886676 899795 479427 470686 481129 423853 682009 517213 509699
16339 509699 695455 676739 431775 841531 721424 419246 611390 487576 536088 547741
16329 547741 626537 620386 566707 855984 408915 674987 742678 525588 545375 634005 598977
16318 598977 306183 675081 577743 387007 388982 869184 553564 636699 350103 321945
16308 321945 429665 471864 284131 366985 358215 641130 669725 452740 539228 690747 691544
16297 691544 339494 525229 208014 564224 600710 627354 304318 501724 579907 532275
16287 532275 364982 442792 473718 519918 783239 706920 652972 266943 551255 369662
16277C69662J44906r4525j5320j06278J74201j21933K0656P4436J72626k37315
16267C81116j49394O1437o8714J67940K5168j75443E2248L01586A43515J90805
16257C34320J16205l7374j10225a25129C22261J31176J11800J53095l04613j46849
16247B66870J42059A92319L65159B43669O2551J67019P0294A94979L44206q7297
16237D51888L00548p6049k81286j41409R0016J88205B64771M39524j81745j39197
16227C83353J88179B57747F8071M89284A83461I0012K78521l0650K42007B22554
16216C16279P1951Q7663J26781A91496J6674M949K17584A47692R1096J70544o2523
16205C46809J16753A65167R0449n8677J08124m136K18799B19716J64006k6116
$$ plain form
16277 369662 514568 420043 404723 298445 472646 350713 371369 445805 618431 381116
16267 381116 231722 293159 224445 392385 417553 242110 52248 353834 143515 334320
16257 334320 450525 413151 302926 -125129 322261 453437 565237 718332 413719 266870
16247 266870 408929 192319 557478 243669 306220 473239 543533 194979 539185 451888
16237 451888 752436 676387 395101 253692 343708 531913 264771 704295 522550 383353
16227 383353 571532 257747 68071 557355 183461 90012 368533 337883 579890 222554
16216 316279 388230 475893 602674 191496 208170 213119 430703 147692 238788 409332 346809
16205 346809 463562 165167 255616 196939 305063 300927 519726 219716 383722 357606
16195C57606A33596K38985j07110K0365M2993C3661J30355K00351N3546I252a3238
16183E03593E5215K04875o1936B2097L77874A25528J5031J08025J77763j66821
16173B59526J43326k467A18345J22401d9448C34133k3780p7446J08025b7092B36316
16161A72533M0618J8138K09581I5945K51268A63258L89174k69938J58634B04824
16150A60230a8746B64974A1048L486h6655A10473J05957M0512j22367K88191E8031
16138C1748H42K64127l623K75808j91862J55800k10036P3442A61431k4644J44299
16127B81086R1690A29001L40879A95184K12999j57416r4684a02235r2628C4964
16116B17067a91280A01084O2348i2384C06045B4582a4644B00569A5464K75359
$$ plain form
16195 357606 133596 372581 265471 285836 328829 33661 164016 364367 417913 9252 -13238
16183 503593 55215 260090 198154 22097 399971 125528 140559 248584 426347 259526
16173 259526 402852 400385 118345 240746 -49448 334133 310353 232907 340932 -27092 236316
16161 172533 213151 231289 440870 95945 347213 163258 552432 282494 441128 204824
16150 160230 -18746 264974 11048 14534 -86655 110473 216430 256942 134575 422766 58031
16138 31748 842 264969 261346 537154 345292 501092 291056 364498 161431 136787 281086
16127 281086 372776 129001 469880 195184 408183 250767 156083 -102235 -194863 34964
16116 217067 -191280 101084 163432 -92384 306045 24582 -14644 200569 15464 290823
16106B90823A15337j0472J93129H2202R103M287N78252h3421c2962A78519a28697
16094D72995B04574G5215L713J05154k1174n1378Q9808n8987J1281l6798e8891
16082I236J38422o2593J29225a38522F1268a06038B09111q2941E3291a10289B412
16070H0973O2321b10717f1075P707h031H0218J01991r178a30128C90427c2170
16058H0458J8134J89751r3677f7954A53776c55379B83316I8709J97211j06840
16048A89080A2886J3829P3854K46492I707L77861j77438J4851q8244E5472a22420
16036B37025E1545L90060B0929K37171P5453b73252d4363b0812F5891N1689a58482
16024b3766l34948H0714a4576C80738a10624G0098P986K9162R4312a00833M1287
$$ plain form
16106 290823 115337 104865 297994 82202 91305 95592 673844 -83421 -32962 178519 -128697
16094 472995 204574 75215 78928 184082 162908 111530 201338 142351 153632 116834 -58891
16082 9236 147658 85065 214290 -138522 61268 -106038 209111 126170 53291 -110289 2412
16070 80973 143294 -210717 -61075 -53368 -8031 80218 182209 173031 -130128 390427 -32170
16058 80458 98592 288343 194666 -67954 153776 -355379 283316 98709 295920 189080
16048 189080 12886 26715 100569 347061 9707 387568 210130 224981 136737 55472 -122420
16036 237025 51545 441605 20929 258100 333553 -273252 -44363 -20812 65891 117580 -158482
16024 -23766 -358714 80714 -14576 380738 -110624 70098 78084 107246 201558 -100833 -59546
16013e9546B85001A04086h9314H4668J57580j21003j71l7101K09881A11557f4610
16001a33096k9285e4284m8402A65337e4356A07231a47458c3600j66174I8924D2867
15989a9619B87765F6900L52656j75417L1472i7080j88265A86930G2085J63424
15979B35509J27686d9159A5559J55906K3137e2458C53059P4102M9691P2367J66315
15968G15534J20563j99043j9380C08776q5204O6795j589j22296f9134b3877j2787
15957c6664J0493k799A65903A2728P3508c7427j6511B28867b67004D22338b8432
15945b89436e2690k9485A98485q7777J63097C0399i2740B13864b79694L3055a02337
15933E537R1780b31691M3489I0817A8145K09272H2541L9585c00787e0974A94937
$$ plain form
16013 -59546 285001 104086 -89314 84668 242248 121245 121074 83973 293854 111557 -64610
16001 -133096 -162381 -54284 -102686 165337 -54356 107231 -147458 -33600 -199774 98924 42867
15989 -19619 287765 66900 419556 244139 275611 -97080 -285345 186930 72085 235509
15979 235509 363195 -49159 15559 171465 194602 -52458 353059 427161 476852 549219 715534
15968 715534 836097 637054 617674 308776 223572 290367 288778 166482 -69134 -23877 -36664
15957 -36664 -26171 -28970 165903 12728 86236 -37427 -53938 228867 -267004 422338 -28432
15945 -289436 -52690 -82175 198485 110708 273805 30399 -92740 213864 -279694 -246639 -102337
15933 5537 97317 -231691 -188202 90817 18145 227417 82541 122126 -300787 -50974 194937
15921a07401C45049e5542j01934N3953j77670A21820a2269l15714J14496j6040
15911b29527A77283b48352D09386C4551b46068i5611c6061B26410d3266A55722
15900C0891c1493A0923c14390g2646H7435f4567A6337a26532C2142b23129a09472
15888b83764E3199B4260d9307r4337E3614b22679D4368b63306R3724k8168L1671
15877a66079d2203q8843C38001b52467j24025A05618a63124C8499N289b11235
15866B20433a69828g6082p2989A94808g8416C4605J7621a02469k59894A70787
15855H2322L12718b14346A50347c37249A49621o2250a76068A09810e5541k87271
15845c42812A21776J04906C3863D522Q3063J609J45930a56177B22339N8006i1155
$$ plain form
15921 -107401 345049 -55542 -157476 -103523 -281193 121820 -12269 -327983 -213487 -229527
15911 -229527 177283 -248352 409386 34551 -246068 -95611 -36061 226410 -43266 155722
15900 30891 -31493 10923 -314390 -72646 87435 -64567 16337 -126532 32142 -223129 -109472
15888 -283764 53199 24260 -49307 -143644 53614 -222679 44368 -263306 -169582 -197750 -166079
15877 -166079 -42203 -131046 338001 -252467 -376492 105618 -163124 38499 43788 -211235
15866 220433 -169828 -76082 -149071 194808 -78416 34605 52226 -102469 -362363 170787
15855 82322 395040 -214346 150347 -337249 149621 87371 -176068 109810 -55541 -342812
15845 -342812 121776 226682 33863 4522 87585 89194 235124 -156177 222339 280345 -91155
15833b89260m309F9245e8220H5913M0018g5782b2658o212D9901c01663A33532
15821A21252K270H225b88448A96836b62010F685d9538j83340i3467G1523K95362
15810C66885G5775a3263j25699A11963h6897I7200B3778a29917G4422i1487l7521
15799a29008o9728B02986K2763a53691a8031A79810E7789d9922m57159A28531
15788b15198C87181d2646A35780c12115h4961G6813c99600b0290k67048A68510
15777A66372a54685d1317A3660R8018a18073q778D8376E234P3680a65598A05565
15765b7348o4801A65552c9237A14290M5306c02253B65345C5362b05454B43377
15754a13901A3955L0527M1034b38487K4850a02891A30149a62202A41314g3870
$$ plain form
15833 -289260 -293569 69245 -58220 85913 125931 -75782 -22658 -28870 49901 -301663 133532
15821 121252 123522 8225 -288448 196836 -262010 6685 -49538 -232878 -93467 71523 366885
15810 366885 75775 -13263 -138962 111963 -86897 97200 23778 -129917 74422 -91487 -129008
15799 -129008 -198736 202986 225749 -153691 -18031 179810 57789 -49922 -507081 128531
15788 -215198 387181 -42646 135780 -312115 -84961 76813 -399600 -20290 -287338 168510
15777 166372 -154685 -41317 13660 111678 -118073 -126851 48376 5234 78914 -165598 105565
15765 -27348 -92149 165552 -39237 114290 159596 -302253 265345 35362 -205454 243377
15754 -113901 13955 44482 85516 -238487 -213637 -102891 130149 -162202 141314 -73870
15743a36782A60529k2980Q2888P5458a36446E80008d0966H0926c36257i944A26853
15731A14008a83155A26068m7063a37447a1871D0487c4438j1845j80027N7738a1442
15719a7427j80653B6279a41942M3921B05028H6275D0239L316a69360C28194I9558
15707b16533D2959e6382C44989A9840b64076g8470b5669j54430g3301k28502a18163
15695a08091r3759A91808m2941P5849r8629c8728I9610K4613F0136A4665a14413
15683c54502a10928A62788e004B35600B3502b7999A8157P340K54242q3388A5473
15671A46579q939f9318k8889K9928b5155m0678A77271a74509c0778k39137B6458
15659H481Q0058J48379a58177A19525a7519g685Q15B63870h6560A98143c91715
$$ plain form
15743 -136782 160529 137549 220437 295895 -136446 580008 -40966 80926 -336257 -9944 126853
15731 114008 -183155 126068 79005 -137447 -11871 40487 -34438 -46283 -226310 -168572 -11442
15719 -17427 -198080 26279 -141942 -98021 205028 86275 40239 43555 -169360 328194 99558
15707 -216533 42959 -56382 344989 19840 -264076 -78470 -25669 -180099 -73301 -301803 -118163
15695 -108091 -201850 191808 148867 224716 126087 -38728 99610 124223 60136 14665 -114413
15683 -354502 -110928 162788 -5004 235600 23502 -27999 18157 25497 279739 196351 15473
15671 146579 137640 -69318 -98207 -68279 -25155 -65833 177271 -174509 -30778 -269915 26458
15659 8481 88539 236918 -158177 119525 -17519 -7685 -6870 263870 -86560 198143 -391715
15647a85845L4027N9599o3092I7313b67774c7545P247k33701P6424a1376l06381
15636c17757b0962A50010C9023J2133a05997M2504A9194b8141A84059n5740o0064
15625F8255A8758J15766d3314j8663H0976b10434B16396a2515B28564e2672j34453
15614a87125M7472b2332A06443D9314b77713B8650b3684j52099d8385j732l20950
15603c71067C00642I1080a61338M2155e3430o0874B1035K15884M1794E4535b05170
15591g6917A02527i6133A63461c24925B5812b68119k1131A8380a04930e1855l9033
15580i0888j56548a08261J3757E2968a73628n7143D5586d2486E7027c0784j09162
15569a39946B36340I9557l1139h747r0412O125b4883K493A21226a77338D1540
$$ plain form
15647 -185845 -151818 -92219 -155311 97313 -267774 -37545 -30298 -263999 -187575 -11376 -317757
15636 -317757 -20962 150010 39023 51156 -105997 -63493 19194 -28141 184059 128319 68255
15625 68255 18758 134524 -43314 -61977 80976 -210434 216396 -12515 228564 -52672 -187125
15614 -187125 -139653 -22332 106443 49314 -277713 28650 -23684 -175783 -48385 -50117 -371067
15603 -371067 300642 91080 -161338 -119183 -53430 -114304 21035 236919 278713 54535 -205170
15591 -76917 102527 -96133 163461 -324925 25812 -268119 -289250 18380 -104930 -51855 -90888
15580 -90888 -247436 -108261 -94504 52968 -173628 -230771 45586 -42486 57027 -30784 -139946
15569 -139946 236340 99557 68418 -8747 -99159 -93034 -24883 -22390 121226 -177338 41540
15557c07865J42271A3866b26433A29764f2647A00469a99212f4026C5218J87089
15547B22307j7485b44424L1037A99092a88023A6601f6448m1106m39475h0261c844
15535B2622G25c5911k2823A81768n0874J35230l5I7071c0311j59707E9462d16393
15522B72654a74209D267J89122C8334J38051c4685k88727F0717B7004L0149g4047
15510a21362I3925j1911J45725j539g6920A32903e1469A35383h7237A33231L5721
15499A68952P4387r1570l5625Q2429J05109c0799A37371j1034K79259I6279J17773
15488B14052h2706j72956H1291J11825L3174M0820H0910J44531J50823A08520
15477C39830p8462j23727D7619O5637j1017k370H5a59816A74388G3724N2374n5150
$$ plain form
15557 -307865 -165594 13866 -226433 129764 -62647 100469 -199212 -64026 35218 222307
15547 222307 204822 -244424 -213387 199092 -188023 16601 -66448 -107554 -547029 -80261 -3844
15535 22622 725 -35911 -58734 181768 130894 266124 266089 97071 -30311 -190018 59462 -416393
15522 272654 -174209 4267 193389 38334 176385 -34685 -323412 60717 27004 57153 -74047
15510 -121362 93925 82014 227739 226200 -76920 132903 -51469 135383 -87237 133231 168952
15499 168952 243339 151769 116144 198573 303682 -30799 137371 126337 405596 96279 214052
15488 214052 -82706 -255662 81291 193116 226290 267110 80910 225441 376264 108520
15477 339830 261368 137641 47619 113256 102239 99869 85 -159816 174388 73724 126098 70948
15465G0948Q2275J59787A53283K88076A55418K2951K54245r980k04911G3662M12430
15454D86092A73054J27988D2244P3914b5239P186F0864K37387j9088A07521L2542
15443A40063J30340j30142e4390r3285A23144J98650G0130c5655j65337C16114
15432a5290A17051f7127H152M16866n2504J00209O6629L32502J23596m47048m50
15421E47952A66470F9621b7263C08592m5531c3162p0749B46942c9069L913a2761
15409a47024N0141B5565c91982F7554a39687C23554b43161K3195A27435O5441
15399A92876b48385a5503k56887d6685A04246M9940J11159o6460C6630R3005m7070
15388H2565K6956J4813C6211J29558A3459J45783E4452J15092e7371B22783G2778
$$ plain form
15465 70948 153223 313010 153283 441359 155418 178369 432614 422634 217723 73662 486092
15454 486092 173054 301042 42244 116158 -25239 -18053 60864 298251 279163 107521 140063
15443 140063 270403 140261 -54390 -147675 123144 321794 70130 -35655 -200992 316114
15432 -15290 117051 -67127 8152 425018 372514 472723 539352 871854 995450 548402 547952
15421 547952 166470 69621 -27263 308592 263061 -33162 -103911 246942 -39069 -35156 -12761
15409 -147024 -96883 25565 -391982 67554 -139687 323554 -243161 -219966 127435 192876
15399 192876 -248385 -15503 -272390 -46685 104246 154186 265345 198885 36630 129635 82565
15388 82565 109521 124334 36211 165769 13459 159242 54452 169544 -57371 222783 72778
15376G892i3612c9395G7720a03616C50253f6562A42832g0291A9666J55872a53356
15364B51337M1195J1890d38971D0325J01922J00441K58266B47281Q6135d26156
15353I5099M0549J1292J60001A4728J84658K76225a12245A06238K52284J57872
15343E16394b4687r8607A30727C7829f4360H16L29066O788J768E1650L68168B09278
15330I8075J2737J50931K42086o3273A42163K6864L47304j69146j32184E5678
15319f6631G2565J56568J4738G0551J29789m7800a53300A53242J18102j5121K03697
15308D59920A88957j2797m8666L80682k10428b66252B08708a9128j85324E170
15297A18813d9086B95738A28645R8794C2978n442J39927j7387H00K50181a24374
$$ plain form
15376 7892 -93612 -39395 77720 -103616 350253 -66562 142832 -70291 19666 175538 -153356
15364 251337 292532 304422 -438971 40325 142247 242688 500954 247281 333416 -426156
15353 95099 135648 146940 306941 14728 199386 475611 -112245 106238 358522 516394
15343 516394 -24687 -123294 130727 37829 -64360 816 329882 336670 338438 51650 419818 209278
15330 98075 110812 261743 503829 440556 142163 169027 516331 347185 215001 55678
15319 -66631 72565 229133 243871 70551 200340 152540 -153300 153242 271344 256223 459920
15308 459920 188957 176160 127494 508176 297748 -266252 208708 -19128 -204452 5170
15297 118813 -49086 295738 128645 227439 32978 27536 167463 150076 800 250981 -124374
15285a40652A71460e8708K5124A53050M0860n4389J22863n088A9612K38669A16237
15273B0104J8900A3337g7360A92455g4521B26625b05229B14517a89563L2223A98761
15261H7538g0130k50088A97470a08166B96934h4226b8613D2338c42541G177K16887
15250B24064n0443K6071a5401B59444b56069K3424O0934E15308a83486B22704
15239a71339K2921A4735J28015K70682r7936J17788A41703b4997C35607L90121
15229G25728Q1384O73695l13273J24229J67782l82371n27171a10778I8287b45251
15218A07935N8289o9435C9597K2616K1969j9256j0636b46330b1725B69204g993
15206A22865K57085b08029C4946K00809b9442k18069e9093p5198F0317c0817n3709
$$ plain form
15285 -140652 171460 -58708 -33584 153050 193910 139521 262384 257296 19612 258281 116237
15273 20104 39004 13337 -77360 192455 -74521 226625 -205229 214517 -189563 -157340 198761
15261 87538 -70130 -320218 197470 -108166 296934 -84226 -28613 42338 -342541 7177 224064
15250 224064 173621 199692 -15401 259444 -256069 -232645 -171711 515308 -183486 222704
15239 -171339 -148418 14735 142750 413432 315496 433284 141703 -24997 335607 725728
15229 725728 807112 1480807 1167534 1291763 1459545 1077174 550003 -110778 98287 -245251
15218 107935 166224 96789 39597 62213 84182 64926 54290 -246330 -21725 269204 -7993
15206 122865 379950 -208029 34946 235755 -29442 -247511 -59093 -134291 60317 -30817 -84526
15195h4526R201A980i4195c5110R381J846A4470Q5407c4890F6559M8054L9145
15183A53758O197n9246J36713i3654A98025E7287j8114K379a52893j0782B64006
15171A2611K79238a14305j3066C9506g7277A37581b54168D03201j82688N3133
15161B73646B6173J35719c4870A63244Q9571b20332C0761c6128A8206b93178B25365
15149a24593A67673a4655A48522m588a43793B79439O0951A59658m8784n0221g3416
15137a58467k3367C58480a26793D97227A95486r2414o410k8773J12548K378J03126
15126B85941C9404L26454A41104F0905J71403a2354G5619J17694l6770L66339
15116E22882A82632i991B87018d156H4951M1307D548J00738Q1738J22024J14231
$$ plain form
15195 -84526 -75325 1980 -94195 -35110 -25729 -23883 14470 99877 -34890 66559 114613 153758
15183 153758 159955 100709 237422 -93654 198025 57287 39173 41552 -152893 -163675 264006
15171 12611 291849 -114305 -127371 39506 -77277 137581 -254168 403201 220513 273646
15161 273646 26173 161892 -34870 163244 252815 -220332 30761 -36128 18206 -293178 225365
15149 -124593 167673 -14655 148522 143934 -143793 279439 340390 159658 110874 60653 -73416
15137 -158467 -181834 358480 -126793 497227 195486 103072 96662 67889 180437 182815 285941
15126 285941 39404 365858 141104 60905 232308 -12354 75619 193313 156543 522882
15116 522882 182632 -9991 287018 -4156 84951 126258 4548 105286 187024 309048 423279
15105D23279r6821J3681j59151d7696F26551B06461a51535C65089A06717a57521
15094A32534M4274e7508B44496l5137l6414E1771a87514E1880O7182K61832j63607
15083B17287a43205C24340r7871l6675J46748Q0368I9111K61383A30793L4085
15073A64878d504l4895E5815g2967B34147A13188L44173k28423b0996k70606B90278
15061B8593L5988P964h2613k7210L754H5629K13076K05461A91973F3759J61968
15050B25727p206K21472n422l2963A04571J49956E6340K82075m7884J24241P6583
15039D91355R9262f5796B54266Q3659A12328K17707m4493J96292I2940R7948K46409
15028D37297j43453F2377J52802m8909K82186p1151j52803a91874B04982L89100
$$ plain form
15105 423279 326458 340139 180988 -47696 626551 206461 -151535 365089 106717 -157521
15094 132534 176808 -57508 244496 209359 172945 51771 -187514 51880 119062 380894 217287
15083 217287 -143205 324340 226469 189794 336542 416910 99111 360494 130793 164878
15073 164878 -4504 -39399 55815 -72967 234147 113188 457361 228938 -20996 -291602 290278
15061 28593 64581 72545 -82613 -109823 -106069 85629 298705 504166 191973 63759 225727
15050 225727 218521 439993 434571 401608 104571 254527 56340 338415 290531 414772 491355
15039 491355 590617 -65796 254266 337925 112328 330035 285542 481834 92940 190888 437297
15028 437297 293844 62377 215179 166270 448456 377305 224502 -191874 204982 594082
15018E94082B50822J83965A26399M30527J63856m4474k18518N46790o8944k80781
15008F54855A21546L33120J38126n8559B09447M54488j57632j34397O7634D0174
14997E7595K70341k8350J20335o4725J72916B30503K70562A96331K48947r2678
14987C52600N8762Q5014B28806K42648k4167L41529j44402B7142K91542A19835
14976E67817o228j47157j84223J76612P8928J18859O4874C24258K26069K46795
14966G97122L660p0378n6145M139J17587k60666J36871C27612J92494K03097q8755
14955F34448p5521J1235B20953O8302l8922J30858j42466J23578j7793Q659j09463
14944B43706J10206J9802A69751Q1549r8840L42428q9451J10039B2336N66123
$$ plain form
15018 594082 250822 434787 126399 556926 720782 676308 457790 1004580 935636 654855
15008 654855 121546 454666 592792 534233 209447 663935 506303 371906 439540 40174
14997 57595 327936 299586 419921 355196 528112 230503 501065 196331 445278 352600
14987 352600 411362 496376 228806 471454 447287 788816 644414 27142 318684 119835
14976 567817 561589 414432 230209 406821 485749 604608 669482 324258 550327 797122
14966 797122 800782 730404 674259 678398 795985 535319 672190 327612 520106 723203 634448
14955 634448 558927 570162 220953 289255 250333 381191 238725 362303 344510 353169 243706
14944 243706 353912 373714 169751 251300 152460 494888 405437 515476 22336 588459
14934E88459B38493R2456J40682j46593Q76J13381j26940M49108j20774J57165
14924G97854C04143K74296A88918J07967R7834K07050P8777p3387K88074k14399
14914F80834M33696P0731j18134K45710k44453P31386l34143K85460k21542k38510
14904A291035M14361j80267O5495L70241P041K3744n73983J0850l30639K0885
14894A118763l26933M3669Q7019D41764j86797J05600P5668N812A58679K18244
14884C76923j06955J15524j31452K40522J99669k52722R4824J46133j42414L31459
14874H71511m27869n2256Q8600L80313k08317K81778j93619O3193K906J6558k28423
14863E94375M0167K96828k84572K71186k89411j46694j92954L39261j37186k5626
$$ plain form
14934 588459 238493 330949 471631 325038 325914 439295 312355 761463 640689 797854
14924 797854 304143 578439 188918 296885 394719 601769 680546 607159 895233 680834
14914 680834 1114530 1185261 1067127 1312837 1068384 1799770 1465627 1751087 1529545 1291035
14904 1291035 1705396 1525129 1590624 1960865 1967906 1991650 1417667 1428517 1097878 1118763
14894 1118763 791830 835499 922518 441764 254967 360567 436235 442047 158679 376923
14884 376923 269968 385492 254040 494562 694231 441509 536333 682466 540052 871511
14874 871511 443642 391386 479986 860299 651982 933760 740141 803334 806240 822798 594375
14863 594375 634542 931370 646798 917984 628573 481879 288925 628186 491000 465374
14853D65374K28868j41885L89209m63251Q9666J29728N3282M6326j32675j0761
14843F53881k3024q7041N9092K03417k41597j92775P3323P7444B45227M97816
14833G43043j44370k45750L61321k77645J77942k0333J36674K45207K25664J30883
14823A332636j50031J15342k57494k58061l38108J30281L20795l27808j57343
14814D10209J38031J0554j3J10836j17405J93473J1618n3370n9010l8021L1700
14803F38602J09923n8670M1318M79114m58061j13150J70931r4467l43125L38948
14793G11363J2780k40662m6197K43197j06755L65080l2657Q0279n3870k71630
14783F60928k742j84817j11253P5259J08881R4130J13598k38984J29730m8990
$$ plain form
14853 465374 694242 552357 941566 478315 567981 697709 750991 797317 664642 653881
14843 653881 630857 543816 602908 806325 564728 371953 445276 522720 245227 743043
14833 743043 598673 352923 714244 436599 614541 594208 730882 976089 1201753 1332636
14823 1332636 1182605 1297947 1040453 782392 444284 574565 895360 567552 410209
14814 410209 548240 558794 558781 669617 552212 745685 757303 703933 644923 606902 638602
14803 638602 748525 689855 731173 1210287 752226 639076 810007 715540 372415 711363
14793 711363 724143 483481 437284 680481 573726 938806 906149 986428 932558 660928
14783 660928 658186 473369 362116 437375 546256 640386 753984 515000 644730 595740
14773E95740j06188l9644J84556O2766J54276k97703L44068r3456l88145m0090
14763C76180j40594P25652m14706o9321J98828J75810j46659L28026k43301L7253
14753H27168j02625j28243P3714r539A42466N60040k56810J80878J84769J31682
14743I43025l59276J72001k04703j48707J56662j59325L13612M3128j61171j46821
14733D48425M02399k29220K5247k39401M41992k63564P7004j07713M60151N961
14723A021281l28373L04628m3008p758j03322R8236J43685j75997k78738O25682
14713A256316q0779N37979k24006J19600p7974j13990o85311L18010n481k79706
14703G64658J82317J90946k44580m6284R3963j12990q308K63616j13220k70611
$$ plain form
14773 595740 489552 449908 634464 697230 851506 553803 897871 804415 416270 376180
14763 376180 235586 961238 546532 477211 676039 851849 705190 1033216 789915 827168
14753 827168 724543 596300 670014 660475 142466 702506 445696 626574 811343 943025
14743 943025 583749 755750 551047 402340 559002 399677 713289 756417 595246 448425
14733 448425 850824 621604 646851 407450 849442 585878 662882 555169 1015320 1021281
14723 1021281 692908 997536 954528 946770 843448 941684 1085369 909372 630634 1256316
14713 1256316 1175537 1713516 1489510 1609110 1531136 1417146 731835 1049845 1044364 764658
14703 764658 946975 1137921 893341 847057 941020 828030 819722 1083338 970118 699507
14693F99507L92174J694Q7946j01716R2360j01646K20776M01501q3232J44852
14683A754216j18943j58200k03220k9453k11403k352j15841K02435j47366j12985
14673H56888J20517J10420j05808j35161N2825o8620R3824J9691M01293k84771
14663A061098n0844j4212l2998K05978k07508k11499N09174k01854k21033j90314
14653F45988J34150J84289L7374L60332k36042j27911k05836M06845j41670K64424
14643A321943j76745P0035k71206R9370j62510L46070m8686K17772K27537l91803
14633A231777K2420j17934J76889J48424P1050k4581m26961k53546J72241M90298
14623A490077m40572Q1875M42696k27694L5853j97509J0208P756L61026l04251
$$ plain form
14693 699507 1091681 1093375 1181321 1079605 1171965 1070319 1291095 1692596 1609364 1754216
14683 1754216 1635273 1477073 1273853 1244400 1032997 1030645 914804 1117239 969873 856888
14673 856888 977405 1087825 982017 846856 899681 831061 924885 944576 1345869 1061098
14663 1061098 1010254 996042 963044 1169022 961514 750015 1259189 1057335 836302 645988
14653 645988 780138 964427 1001801 1362133 1126091 998180 792344 1199189 1057519 1321943
14643 1321943 1145198 1215233 944027 1043397 880887 1226957 1178271 1396043 1623580 1231777
14633 1231777 1254197 1136263 1313152 1461576 1532626 1508045 1081084 827538 999779 1490077
14623 1490077 1049505 1131380 1574076 1346382 1382235 1184726 1194934 1202690 1563716 1259465
14613A259465R571l8756L19200k68923J09371k45917L16829J5659J31995l61850
14603A246644j20811R7261N18474j69391j83408J74946L3876k4023R0744K6968
14593A691280n9605j49393J1400j46077L76681k06431L00934m23570J51072q8797
14583A457494K09833j18865N05765o96725L06566J22126O6902j56760K97237L6833
14573B030406n27181n4174N36402j44998K00721k29407K27551j95652L36330k53083
14563A926915J58783q8350j11451J64151J67145o4204k36352M13095k97055J73783
14553B206460M19542l74653K30465l25177N91725j21494o2832K00809J07934M23054
14543C295833k46155K84204J44248L54495J27816Q19210K31110J290089J142777
$$ plain form
14613 1259465 1269036 1230280 1549480 1280557 1389928 1144011 1460840 1476499 1608494 1246644
14603 1246644 1125833 1223094 1741568 1572177 1388769 1563715 1597591 1573568 1664312 1691280
14593 1691280 1631675 1482282 1493682 1347605 1724286 1517855 1818789 1395219 1546291 1457494
14583 1457494 1667327 1548462 2054227 1357502 1664068 1786194 1853096 1696336 1993573 2030406
14573 2030406 1503225 1449051 1985453 1840455 2041176 1811769 2039320 1843668 2179998 1926915
14563 1926915 2085698 1997348 1885897 2050048 2217193 2152989 1916637 2329732 2032677 2206460
14553 2206460 2626002 2251349 2481814 2156637 2748362 2626868 2564036 2764845 2872779 3295833
14543 3295833 3049678 3333882 3478130 3832625 3960441 4779651 5010761 6300850 7443627
14534G443627K613617M210342O097779J0677312J319587j4304436p548619l865919
14526F643290j312444l57214L45623j166971j042372k40204l52718k6212L7144
14517B527922r1791n0218j15459L98136o62158L87643j10621N9428o4353J57239
14507B435768J44272l37061P703K09506P5097p2589L27399j48319k36464M68696
14497B874008q9873l3396j58262M9649L38422o1198J01042J36237m82909M57757
14487C131477k30431Q6326j28709M9985L55961l93629P69169m34355l5134Q9134
14477C259794K49040o2664J9950j6652N17908n26209J5363L03160j41022r3283
14467C525385N34618m30649O73320j9216k59348K49389j2269q7117J09291j7955
$$ plain form
14534 7443627 10057244 14267586 20365365 31042677 32362264 18057828 10509209 6643290
14526 6643290 5330846 4973632 5319255 4152284 3109912 2869708 2516990 2490778 2527922
14517 2527922 2436131 2385913 2270454 2668590 2006432 2394075 2283454 2342882 2278529 2435768
14507 2435768 2580040 2242979 2250682 2460188 2535285 2462696 2790095 2641776 2405312 2874008
14497 2874008 2784135 2750739 2592477 2642126 2980548 2919350 3020392 3156629 2673720 3131477
14487 3131477 2901046 2987372 2858663 2908648 3264609 2870980 3640149 3205794 3170660 3259794
14477 3259794 3508834 3446170 3466120 3449468 3967376 3441167 3456530 3759690 3618668 3525385
14467 3525385 4060003 3629354 4302674 4283458 4024110 4273499 4261230 4174113 4283404 4265449
14457D265449k69522p9813N77395j66781J03674j95949J26385M03321k63996L72182
14447D872345J0677k27576M31446m08182L14368l08227M32739j70393J96481J19865
14437E263543J15264L85214j333n19755L85390J14492n59805O26464L5192K37884
14427F082550l18508L07861L39389j85737J26031n5227L98576N539k62073K08728
14417F647129K65520o016q7073N31206J30240J26582m0989m871k6707L43858R037
14406G887916J15929K94245K89328P9691k8996O02520k27923K8383k20968O79935
14396I500060l01233L13795K02992j17320P0409K22575J89097P39273j04744J28930
14386A0843834r7580L84869j77413J12707L73741K59061J77121Q7807K42024O91
$$ plain form
14457 4265449 3995927 3916114 4493509 4326728 4430402 4234453 4360838 4764159 4500163 4872345
14447 4872345 4883022 4655446 5086892 4678710 4993078 4684851 5117590 4947197 5143678 5263543
14437 5263543 5378807 5764021 5762688 5242933 5628323 5742815 5183010 5809474 5844666 6082550
14427 6082550 5764042 6071903 6411292 6225555 6351586 6296359 6694935 6700474 6438401 6647129
14417 6647129 6912649 6906633 6819560 7350766 7481006 7607588 7566599 7561728 7535021 7878879 7887916
14406 7887916 8003845 8298090 8587418 8667109 8638113 9240633 9012710 9041093 8820125 9500060
14396 9500060 9198827 9512622 9715614 9598294 9668703 9891278 10080375 10819648 10714904 10843834
14386 10843834 10746254 11131123 10953710 11066417 11440158 11699219 11876340 11964147 12206171 12206862
14376A2206862L41972k6627K84881J48661M42372K09454J43435O32314P7249J46716
14366A4607289P07246j47026M86828O50771l3905O19N47292j09482O91122J41613
14356A7542367M84858M25194L39770N31737M67956L06911L95118P2000P67091
14347B1333002N45053L59629O58811M20255K86223P13150M41074K95838P25060
14338B5778095P88614P30529L25782J020378N90618O59038P37739Q69723P82917
14329C2283433J195532O52824J022512Q70591J082038Q98816J277322P24474J674253
14320D1681795P56227J412590J429647J494057J249566J622137J671681J771008
14312E3088708J586301J977357J983393K251869J351494K779469K277981K250184
$$ plain form
14376 12206862 12548834 12522207 12807088 12955749 13398121 13607575 13751010 14383324 14460573 14607289
14366 14607289 15314535 15167509 15654337 16305108 16271203 16271822 16819114 16709632 17400754 17542367
14356 17542367 18027225 18452419 18792189 19323926 19791882 20098793 20493911 20565911 21333002
14347 21333002 21878055 22237684 22896495 23316750 23602973 24316123 24757197 25053035 25778095
14338 25778095 26566709 27297238 27623020 28643398 29234016 29893054 30630793 31500516 32283433
14329 32283433 33478965 34131789 35154301 36024892 37106930 38005746 39283068 40007542 41681795
14320 41681795 42438022 43850612 45280259 46774316 48023882 49646019 51317700 53088708
14312 53088708 54675009 56652366 58635759 60887628 62239122 65018591 67296572 69546756
14304F9546756K990819K686005K968902K841747L102144L002416L778589L915823
14296I4833201L677433M052978M486788N000851M819875N656922N299593N810010
14288A33637651O602158O790763P192732P358620Q002376Q215862R065665R493142
14280A96358969J0029168J0295217J1344812J1640686J2465220J3000280J3225392
14273B78359744J3574798J4689064J4477669J4579230J4266352J4117162J4223876
14266C78287895J3256584J2448983J1093140J0066668J0103884Q547092P368621
14259D51172867M957689J419117J23773Q81192J160456j877110p930956p246606
14251D42660422r290279j1598383j2134415j2535308j2358318j3780814j3501719
$$ plain form
14304 69546756 72537575 75223580 78192482 81034229 84136373 87138789 90917378 94833201
14296 94833201 98510634 102563612 107050400 112051251 116871126 122528048 127827641 133637651
14288 133637651 140239809 147030572 154223304 161581924 169584300 177800162 186865827 196358969
14280 196358969 206388137 216683354 228028166 239668852 252134072 265134352 278359744
14273 278359744 291934542 306623606 321101275 335680505 349946857 364064019 378287895
14266 378287895 391544479 403993462 415086602 425153270 435257154 443804246 451172867
14259 451172867 456130556 457549673 457673446 458554638 459715094 457837984 449907028 442660422
14251 442660422 433370143 421771760 409637345 397102037 384743719 370962905 357461186
14244C57461186j4655584j3909178j3524437j3561974j3412549j2837358j2509508
14237B63050598j1822568j1810199j0933192j0433143j0203403j0676228j0479044
14230A86692821q933882q861886q238931p924135p257863o444615o614991n734405
14222A26682113n380080n627493m970116m754184m735887l834596l421637m221260
14214H9736860l447114l563537k917057k926845l026540k714300k634947k104956
14206F6401564k340009k621226j648345k096878j627009j929395j219546j787061
14198E1132095j430003j807818j326657j523316j306801r60137r68425j280616
14190D0528322j255066j064540j191413r71202n92321q83953q92266j040585r07082
$$ plain form
14244 357461186 342805602 328896424 315371987 301810013 288397464 275560106 263050598
14237 263050598 251228030 239417831 228484639 218051496 207848093 197171865 186692821
14230 186692821 177758939 168897053 160658122 152733987 145476124 139031509 132416518 126682113
14222 126682113 121302033 115674540 110704424 105950240 101214353 97379757 93958120 89736860
14214 89736860 86289746 82726209 79809152 76882307 73855767 71141467 68506520 66401564
14206 66401564 64061555 61440329 59791984 57695106 56068097 54138702 52919156 51132095
14198 51132095 49702092 47894274 46567617 45044301 43737500 42777363 41808938 40528322
14190 40528322 39273256 38208716 37017303 36046101 35453780 34569827 33677561 32636976 31729894
14181C1729894p57955j001658j27825j142408n90953p07113m82127r26775o77035
14172B5316045n42590o35058m78225k18055o89062n30619j15201r75964o3582
14163B1067689o93583k89694m41900p20593k02981j79479m12396k65033n30917
14154A7331113j41498l23526m78836l93467Q7924n03660l61066j2747m28617l56052
14144A4419568j29461k06591k83723l53363m23129j91369j49707l55500N0512
14135A2377237j9138n80971J80705l24604r4525m65081N2050l85965l9445o8799
14125A0631464k28650J35766k94741k48012j85292O6161j70297l26587k77536
14116I102276j54952j44105J41587l3891m07257K59902j47702n13248K71612j78452
$$ plain form
14181 31729894 30971939 29970281 29842456 28700048 28109095 27401982 26919855 25993080 25316045
14172 25316045 24773455 24138397 23660172 23442117 22753055 22222436 22107235 21131271 21067689
14163 21067689 20374106 20084412 19642512 18921919 18718938 18539459 18127063 17862030 17331113
14154 17331113 17189615 16866089 16387253 15993786 16081710 15578050 15216984 15204237 14775620 14419568
14144 14419568 14290107 14083516 13799793 13446430 13023301 12831932 12682225 12326725 12377237
14135 12377237 12358099 11777128 11957833 11633229 11538704 11073623 11125673 10739708 10700263 10631464
14125 10631464 10402814 10538580 10243839 9995827 9810535 9876696 9706399 9379812 9102276
14116 9102276 8947324 8803219 8944806 8910915 8503658 8763560 8615858 8102610 8374222 8195770
14106H195770m48181J23055K23203p02840N08407o30184M30990m52593j07861
14097G139766k32056K43669k67873J73182k80114k0182l40565K93786l84345J44843
14087F470111m4413l81065J85604p1860j62985k4149J01808k32573l7518j85622
14077E617338J43932l54890k75047L6326J11529P3764R3571l75487K35831j38915
14067E167952j35315J73618m68115P9257N0649Q3695l79696k73068K08165Q032
14057D515174N4488J773l9847j72381Q7281j19948J80581o41470J31545K45745
14047D242941J99049k22333l03962J90066q0494k63251J62084q5464K04996n81006
14037C462626N99951k22101j55796j47336K09587j13435q5150j03532R1391n7187
$$ plain form
14106 8195770 7747589 7870644 8093847 7391007 7899414 7269230 7700220 7247627 7139766
14097 7139766 6907710 7151379 6883506 7056688 6776574 6756392 6415827 6709613 6325268 6470111
14087 6470111 6425698 6044633 6230237 6158377 5995392 5971243 6073051 5840478 5802960 5617338
14077 5617338 5761270 5406380 5131333 5167659 5279188 5352952 5446523 5071036 5306867 5167952
14067 5167952 5032637 5206255 4738140 4817397 4868046 4951741 4572045 4298977 4507142 4515174
14057 4515174 4569662 4571435 4531588 4359207 4446488 4326540 4507121 3865651 3997196 4242941
14047 4242941 4441990 4219657 3915695 4105761 4025267 3762016 3924100 3838636 4043632 3462626
14037 3462626 4062577 3840476 3684680 3537344 3746931 3633496 3548346 3444814 3536205 3479018
14027C479018o1993k79061K58715Q1560k66791M67291j80107n4820m15907J59026
14017C186931q5562J49312k89099m8942k67534L46573J22580k70902L1209K74317
14007C148883K4074l40119l8953N1791p28250K41405L58112r4275M4893j06398
13997B561163J65511m97476L58267J7723k61193L80170k60456M6792L7471N0637
13987B598609m54102N2384J58746k17798l3025O56369m6637J47700n60774L93794
13977B695266L61409M52651J191301J724893L421649N459481J0428712Q345247
13969C4080609j1308281q396836m597822k298602j506210j191008m62832j95387
13961D123631n42509j54003k19034j68728Q3648k97431K28285j15957l95122o4436
$$ plain form
14027 3479018 3417025 3137964 3396679 3478239 3211448 3678739 3498632 3443812 3027905 3186931
14017 3186931 3101369 3250681 2961582 2912640 2645106 2991679 3114259 2843357 2874566 3148883
14007 3148883 3172957 2832838 2793885 2845676 2117426 2358831 2716943 2622668 2667561 2561163
13997 2561163 2726674 2229198 2587465 2605188 2343995 2724165 2463709 2510501 2547972 2598609
13987 2598609 2144507 2196891 2355637 2137839 2104814 2761183 2714546 2862246 2301472 2695266
13977 2695266 3056675 3509326 4700627 6425520 9847169 15306650 25735362 34080609
13969 34080609 22772328 14375492 9777670 7479068 5972858 4781850 4319018 4123631
13961 4123631 3581122 3427119 3208085 3039357 3123005 2825574 3053859 2937902 2542780 2478344
13951B478344m4942N095Q0151M4718j66599j68478J28960j07394K5315p4925l11892
13940A888353L67342l62664J09071J99958M0970j80223j40077K85609r1860r3268
13930B023211j43871q5872k5439p4343K83166m08446K28366j87367L03529k17979
13920A694955K5112Q0206l50062J68415J51169P7525r5365k23495l401j50101
13910A374958K05311j29144K19853L9847k71927j34662K37663p5063K50112J26858
13900A843806k86730m1707J3319q1007k48305J70663J6541K25735J00154l39634
13890A372835L4226R3608J24300n25785J59590j24763J73585K76353k58425J38261
13880A463785l891J44351l96605L75776m81984k3631M30092N7494k38530j74349
$$ plain form
13951 2478344 2433402 2438497 2518648 2563366 2396767 2228289 2357249 2249855 2275170 2200245 1888353
13940 1888353 2255695 1893031 2002102 2202060 2243030 2062807 1922730 2208339 2116479 2023211
13930 2023211 1879340 1793468 1768029 1693686 1976852 1568406 1796772 1609405 1912934 1694955
13920 1694955 1720067 1800273 1450211 1618626 1769795 1847320 1751955 1528460 1525059 1374958
13910 1374958 1580269 1451125 1670978 1710825 1438898 1304236 1541899 1466836 1716948 1843806
13900 1843806 1557076 1515369 1528688 1447681 1199376 1370039 1386580 1612315 1712469 1372835
13890 1372835 1407061 1500669 1624969 1099184 1258774 1134011 1307596 1583949 1325524 1463785
13880 1463785 1459894 1604245 1207640 1583416 1101432 1077801 1507893 1565387 1326857 1152508
13870A152508K4019K44310j84932j37569L46061k26221n3849l1246J33077l03673
13860I62485j91104K12566L48787J51612k98973k20173M40652j77856j61996j27200
13850I38800L37139r5844K3431j12630J55591J63215m00805J16426J77727n89795
13840G13255L62631k47699O6737M32348j47527l50729M30450l52590L40035n59141
13830F87770N01629l1753J68618m92415l48922M82421J46242r8377J83215k54866
13820I43562j58282J68860R8740l89877L33037k32813M57423m90184J99150N0331
13810I79947l24488L31994K9472j44169o7986k86557L18573L18588l06136K57829
13800A107067K6234j93069o9686j85343N95926M7540m33214k02979j50003K76069
$$ plain form
13870 1152508 1176527 1420837 1235905 1098336 1444397 1218176 1164327 1133081 1266158 962485
13860 962485 771381 983947 1332734 1484346 1185373 965200 1405852 1227996 1066000 938800
13850 938800 1275939 1180095 1203526 1090896 1246487 1409702 1008897 1125323 1303050 713255
13840 713255 1075886 828187 894924 1327272 1179745 829016 1259466 906876 1246911 687770
13830 687770 1189399 1157646 1326264 833849 484927 967348 1113590 1015213 1198428 943562
13820 943562 785280 954140 1052880 663003 996040 763227 1220650 730466 929616 979947
13810 979947 655459 987453 1016925 872756 804770 518213 836786 1155374 849238 1107067
13800 1107067 1133301 940232 870546 685203 1281129 1328669 895455 692476 542473 818542
13790H18542j29702J94492l4431K13542m0307k54498K21707k32891j0757M65756
13780A211453n53370J47399K10100j02010O349j61990J60615r9847L3732j36890
13770G15541K03374j71488o2336P6024k10034k06018L33996N2948K660k03848
13760E30819J59278K55528n4027m1130k48519K9586R1222p2725K65211l10591
13750F04652R7460J24866L5219J38089k69265J84079j95663M3312J41177m31630
13740D72296O5781J00664m0740j06506M54629k73605M2649N731k18592j18177
13730C84130K27828j90217j2247J41946r377L6505R241k4671J79088O1138C63743
13718D56631j15304q9129M34744k79017J54139j30421K34459k18701M59220l57594
$$ plain form
13790 818542 688840 883332 848901 1062443 1022136 767638 989345 756454 745697 1211453
13780 1211453 658083 805482 1015582 913572 919921 757931 918546 818699 852431 715541
13770 715541 918915 747427 685091 761115 551081 345063 679059 732007 734667 530819
13760 530819 690097 945625 891598 850468 601949 631535 722757 650032 915243 604652
13750 604652 702112 826978 862197 1000286 731021 915100 719437 762749 903926 472296
13740 472296 538077 638741 598001 491495 946124 672519 715168 720899 502307 384130
13730 384130 611958 421741 409494 551440 542063 578568 587809 563138 742226 803364 363743
13718 456631 341327 252198 686942 407925 562064 431643 666102 447401 906621 549027
13708E49027Q9930k23833J00926j58072L99149p5159j82550J82256k39843j14944
13698C26887L48255P1599B42137J50243M45761C95763J93962J14086l47823N02653
13688H58641j77330B90335N88998j43221j42169k33898K27000Q8564j84981j4685
13678D75943j43220L58883j37138k40082J77252J6499q2850Q5841K90534l52822
13668D48840R00618E12117K62629j61127B30323J16942K41922j36219R8150l4895
13658E16223J04866k00917J98547k07750P4957A18819M23703F5502N12778A59456
13647F37064k38583L19196k61442j8434M4322r1055M5159L5474J14566j05691
13637D80576j63598K57373j91010n516A85479L07550O386k4846M543k376A15965
$$ plain form
13708 549027 638957 415124 516050 357978 757127 681968 499418 681674 441831 326887
13698 326887 675142 746741 242137 392380 838141 395763 589725 703811 355988 858641
13688 858641 681311 290335 879333 736112 593943 360045 587045 675609 490628 475943
13678 475943 332723 691606 554468 314386 491638 508137 425287 511128 801662 448840
13668 448840 1349458 512117 774746 613619 230323 347265 589187 452968 551118 516223
13658 516223 621089 420172 618719 410969 485926 118819 542522 65502 578280 159456
13647 637064 398481 717677 456235 437801 482123 391068 436227 471701 586267 480576
13637 480576 316978 574351 383341 377825 185479 493029 499415 474569 479112 476736 115965
13625D67363j08188O14243l86059q5703k09850J18221R6696r804J03686k87503
13615C13102e3793D27215r3888o5874K73292j58804K65387C10175j25818K73433
13605D57790q6825q4144n0083J91089k05789K79198O4563j93081m2466K86816
13595F17068B73321L58984j25368k02509L04501o1630l2698n5158K3917R4869
13585E78229k35327L45877B04463R4562J77814K08454F4364J54161j2218k407
13575B03900J48166P069L50806k77709j78433K56131B24022r1641J0294J94969
13565C37644j2632Q884K9683A2997N39285A78927A9302L43119l2794L05010B82994
13553C34630A46758j5308Q2336J2616J85387j99956K42201j28399A43692h2364
$$ plain form
13625 467363 359175 973418 587359 501656 291806 410027 506723 496919 600605 313102
13615 313102 -53793 427215 333327 267453 540745 381941 647328 310175 184357 457790
13605 457790 370965 286821 236738 427827 222038 501236 565799 372718 330252 617068
13595 617068 273321 632305 506937 304428 608929 547299 514601 459443 483360 578229
13585 578229 342902 688779 204463 299025 476839 685293 64364 218525 206307 203900
13575 203900 352066 359135 709941 432232 253799 509930 224022 132381 142675 337644
13565 337644 325012 333896 363579 12997 552282 178927 19302 362421 329627 634637 282994
13553 334630 146758 131450 213786 226402 411789 211833 454034 325635 143692 -82364
13542A73243M1607K21901M3555K26286C42161l6879H762N65876k60011J40382
13532D55009j37247q299j3094K78390B45438J63223k557A03041K4023P1982J22678
13521C21724p9117J00293M0797c7116C37922L1018N01189A65134J7101g056A29460
13509E00637B45385K4865j34105O55285l80706N9178j69533J03758A79233L53668
13499E32901j31942j7903L106n8774d178B20887R8332l2702q809L52569A85454
13487a38087C46865j42473D7557L31695j39437J07923m6072K57415A62468D211
13476B68447a56650D05007q0128A33030J68559J1564j44207j6742f2457a7726
13465B83355I7834J76748A4733R0610J16203J39143j42056Q1521a950D95351r1273
$$ plain form
13542 173243 214850 436751 480306 706592 342161 305282 8762 574638 314627 455009
13532 455009 317762 309463 296369 574759 245438 408661 406104 103041 127064 199046 321724
13521 321724 242607 342900 383697 -37116 337922 368940 870129 165134 182235 -7056 129460
13509 500637 245385 270250 136145 791430 410724 469902 300369 404127 179233 532901
13499 532901 400959 383056 386162 327388 -4178 220887 319219 286517 277708 630277 185454
13487 -138087 346865 204392 47557 379252 239815 347738 301666 559081 162468 4211
13476 268447 -156650 405007 324879 133030 301589 313153 168946 152204 -62457 -17726
13465 283355 97834 274582 14733 105343 221546 360689 218633 300154 -1950 495351 404078
13454D04078F1480J14842J25899j23903l1411J27635A27626h9885C4316g9359
13443D06810J82007k69023g6759C22143J04511j48224B8243J00043L22103b01162
13432B79723Q3004K9078k1544B7352f7581B58139J11995q9159r6035B8113M3636
13421G1749L17001A51822K46125M3734j47857A04317K77881j78876q2920L8830
13411A59232c65891C42398j40390f8811D34522A47348K63161K4222j80224j20833
13401A33674L9387K49959G0618a34907B17455K29062j39053l5490I8344M82303
13391E80647k22405j78697K59606B18469J137K12318G7940a02363C44619j70927
13381A73692p2836Q6917J10728k3698L7669K0122j08380d8945B95802J13306A49142
$$ plain form
13454 404078 61480 176322 302221 178318 146907 274542 127626 -89885 34316 -79359
13443 406810 588817 319794 -76759 322143 426654 278430 28243 128286 450389 -201162
13432 279723 362727 391805 370261 27352 -67581 258139 370134 280975 184940 28113 71749
13421 71749 388750 151822 397947 441681 293824 104317 382198 203322 120402 159232
13411 159232 -365891 342398 202008 -68811 434522 147348 410509 434731 254507 133674
13401 133674 173061 423020 70618 -134907 217455 446517 307464 271974 98344 580647
13391 580647 358242 179545 439151 218469 219606 431924 77940 -102363 344619 173692
13381 173692 100856 187773 298501 274803 312472 332594 224214 -48945 295802 409108 149142
13369B58884o3194r5153A0295i096C31644q8967J10504a48135E34438B05966n9879
13358A46087K02842K48808a31456C00675A40753J61469a51927L4489K0823a2025
13347A25763L19651A38979m0286J34383k4058K14311A32483A4737K19263a79089
13336A14187J41153A5702K33439l2964Q2908K4507J41660A32580K79083A79768
13325D37531J3986k05436h3204C18164A19256J49005c4931B65874m5517D609b4865
13313D06308j09694J3259q4785Q5342k8622K21479d2752A27303P4466p2988L3189
13302A61970k1344J46764j36260l051F4480g1921I8702J18793j01965h0505B1795
13290A53781b01726A32225J31528k7974C6622a34759I7524R2775F9693L50818
$$ plain form
13369 258884 195690 100537 10295 -9096 331644 242677 353181 -148135 534438 205966 146087
13358 146087 348929 597737 -131456 300675 140753 302222 -151927 -117438 -96615 -12025
13347 125763 445414 138979 98693 233076 209018 423329 132483 14737 234000 -179089
13336 114187 255340 15702 249141 216177 299085 323592 465252 132580 411663 179768
13325 437531 451517 246081 -83204 318164 119256 268261 -34931 265874 220357 4609 -24865
13313 406308 296614 309873 225088 310430 281808 503287 -42752 127303 201769 128781 161970
13302 161970 140626 287390 151130 148079 64480 -71921 98702 217495 115530 -80505 21795
13290 153781 -201726 132225 263753 235779 36622 -134759 97524 190299 69693 420511
13280D20511A4866J83313n0699J3539D5294N2847L06803H8426l0878K02817A5484
13268F5390J28138H2730J17032O2054c387D7499J20363R9842i1562B15251D7746
13256A10015a1930m365B43609L1837m4118B1682K95892b4404B21726p8880J82389
13245C25235G3227a20035K5218B16192J465L40446B23202j5856K2727I6063J41150
13234B37213D0706K37890a76730B80575a4977A18459d8458B30202i1268B76922
13223E5535M94184B68231A18587K66041B1098N5533l4504b8287B14125c73735
13212B29256B2739c6282A45227C161K08862m5029E2399L37345A25619a10150A32478
13200A29997b77811B87705K37677E0272K8574F574a931A64936c465B63643j15766
$$ plain form
13280 420511 14866 198179 147480 161019 45294 98141 404944 88426 57548 260365 15484
13268 65390 193528 82730 199762 261816 -3387 47499 167862 267704 -91562 215251 47746
13256 110015 -11930 -16295 243609 275446 231328 21682 317574 -24404 221726 142846 325235
13245 325235 73227 -120035 -94817 216192 217657 558103 223202 207346 230073 96063 237213
13234 237213 40706 278596 -176730 280575 -14977 118459 -48458 230202 -91268 276922
13223 55535 549719 268231 118587 384628 21098 76631 42127 -28287 214125 -373735
13212 229256 22739 -36282 145227 3161 212023 166994 52399 389744 125619 -110150 132478
13200 129997 -277811 287705 525382 50272 78846 6574 -1931 164936 -3465 263643 147877
13189A47877b76013B17733J32704j57004C4788c17308J45282A34365Q3144m2088
13179A75421D6753J25200K22320A43607Q6803H1542a35192A7641b24195D2710
13168A84272F3192J90105P5145E3883a12301C20235f9715G5085K4501f1137q3878
13157a45015C65293e1771I1061a03456B37179p1014d9349I0880L90818D5088k0064
13146B5024c78101f0063B60572b957B840M1082h4935A41101N7577m3949O701o386
13134A55044P0178m0486a3888r0154C5369K12707C3645K856L02886i022C47600
13122H6292f2633B16185a5235P185B96949a19689C56481A31159P4365J5718r6516
13111A24726f9066A57955a74899g1363B03878A5062J49054a2237N111j857B10897
$$ plain form
13189 147877 -276013 217733 350437 193433 34788 -317308 -172026 134365 217509 175421
13179 175421 46753 171953 394273 143607 230410 81542 -135192 17641 -224195 42710
13168 184272 63192 253297 328442 53883 -112301 320235 -69715 75085 99586 -61137 -145015
13157 -145015 365293 -51771 91061 -103456 237179 166165 -49349 90880 481698 45088 25024
13146 25024 -378101 -60063 260572 -2957 2840 43922 -84935 141101 198678 154729 161430 155044
13134 155044 225222 184736 -13888 -104042 35369 248076 33645 36501 339387 -9022 347600
13122 86292 -62633 216185 -15235 -8050 296949 -119689 356481 131159 205524 221242 124726
13111 124726 -69066 157955 -174899 -71363 203878 15062 164116 -12237 -7126 -8983 210897
13099H3849K5163J09299a66288D11425a28210k6253b4682C58005i2021K8027A45050
13087c60953J32594a10427g643k20572a03273B67656I8121d49127D23668a0510
13076A10864b04891B47024D6179J39812n3863k9945g3326c3733A29661L95307
13066E24968A50849P3135A02040B1932e7154I8956a0984C0470J4703K119a393
13054A7558b41850J0590E7559B8405e2038D0913J47371K34604A73360b3215A88653
13042B12360C5146J47565J6150a26768B34584H8301J75986b3884O422A18008A3900
13030g3123b2345k086A99082n1417P0983O5113j32252g5728I9876b09077g5845
13018a76825A5639a81591C20728a64518A88013J5261M2696N6889b2909A17924
$$ plain form
13099 83849 109012 218311 -166288 411425 -128210 -154463 -24682 358005 -92021 -63994 145050
13087 -360953 -228359 -110427 -7643 -228215 -103273 267656 98121 -449127 423668 -10510
13076 110864 -204891 247024 46179 185991 132128 102183 -73326 -33733 129661 524968
13066 524968 150849 223984 102040 21932 -57154 98956 -10984 30470 45173 47292 -1393
13054 17558 -241850 -231260 57559 28405 -52038 40913 188284 422888 173360 -23215 188653
13042 212360 35146 182711 198861 -126768 234584 88301 264287 -23884 -17462 118008 13900
13030 -73123 -22345 -24431 199082 147665 218648 283761 151509 -75728 99876 -209077 -75845
13018 -176825 15639 -181591 320728 -164518 188013 203274 245970 302859 -22909 117924
13007A50205N7614F0100A434J67249D5934K00048O5002j5887o5198h2552A41120
12995a12332m8331D1076J65924l2227e511E93483A71441e4450p0756j11747B61034
12983f7979F5781b97742B51571j15700J48330a03518B89585a85295C74980B9610
12972A92070A4385a28332A83856c4387a6593l3321j71394C2479J32617b4948A9418
12960C2485b57053h0918C10656a99976k3306G4654d3470K762C61127I721J3522
12949B3243a83909h1219o2637M5138C71066k2228H9650J26464n0746J08363b35722
12937f0537j84686B74357C5034Q1827b1878E7241c5296B0973a16063A43544C0515
12925a13702G6053K25646E6487k6930c2539A55134e67267A12358m3862a58541
$$ plain form
13007 150205 207819 60100 1434 168683 45934 245982 310984 295097 229899 -82552 141120
12995 -112332 -160663 41076 207000 174773 -5511 593483 171441 -54450 -125206 -236953 261034
12983 -67979 65781 -297742 251571 135871 284201 -103518 289585 -185295 374980 29610
12972 192070 14385 -128332 183856 -34387 -16593 -49914 -221308 32479 165096 -24948 19418
12960 32485 -257053 -80918 310656 -199976 -223282 74654 -43470 -40708 361127 9721 23243
12949 23243 -183909 -81219 -143856 -98718 371066 348838 89650 216114 165368 273731 -235722
12937 -60537 -245223 274357 35034 116861 -21878 57241 -35296 20973 -116063 143544 30515
12925 -113702 76053 301699 56487 29557 -32539 155134 -567267 112358 68496 -158541
12914A29752Q3252G4004M3890J20529c02435D2550D84P8463J78634f3465A36815
12902C38304b4540A44550i6933a7739A5580J20165J91957A07739l9126a51051
12891H9632N5137B7892J99100j3382B6011a97977B41701D6860c01016A20006M5704
12880A65710j9526E6914N109Q3642P2315H5468b43431i2517B11433G6254a7120
12868b58916g8634m0441A2903K26221A18170a44942F3610g3086j03401A12411
12857A59125Q993c2658j32230A56688b1981A67461b41683A67378G5751G769K75004
12846B82773J20049b22457A00317A9669a55153A35532D6220J06033F7834K01192
12836B69026C5105a48899H7091a61062F317a18680M0902L609k6359A55650R4535
$$ plain form
12914 129752 213004 74004 117894 238423 -302435 42550 484 78947 257581 -63465 136815
12902 338304 -24540 144550 -96933 -17739 15580 135745 327702 107739 68613 -151051
12891 89632 144769 27892 226992 213610 26011 -197977 241701 46860 -301016 120006 165710
12880 165710 146184 56914 62023 145665 217980 85468 -243431 -92517 211433 76254 -17120
12868 -258916 -78634 -119075 12903 239124 118170 -144942 63610 -73086 -176487 112411
12857 159125 168118 -32658 -164888 156688 -21981 167461 -241683 167378 75751 7769 282773
12846 282773 402822 -222457 100317 19669 -155153 135532 46220 152253 67834 269026
12836 269026 35105 -148899 87091 -161062 6317 -118680 -77778 -74169 -100528 155650 250185
12825B50185B7040d75685B2636e9898F0213J23899b68477D3503A4216a97288d9059
12813B54145i5184a7068G4946k5307e533A9231d24546b9100G4200h9967a5240
12801A5354e2621G4280O8177a55257b9038r305B56650n2160a74404m6186L6479
12790a84111O4675I0170a23523l7139N4025N0524A34043a37276d6490n1647F1951
12778C27371d6295j0417E8672P0736D3892i1011A38769O5978g6482B75714k6093
12767B49621e8154A52121J6476n9567a42876O7583G6042f2983k70659f3585f787
12755H0697a29759B38213b65039A13245O6335o5989g9026k0896B60838h2130b3691
12743G5406a6751m1517B39857a21020M3510B41756I8919J07713d0771k26485a09538
$$ plain form
12825 250185 27040 -475685 22636 -59898 60213 184112 -268477 43503 14216 -197288 -49059
12813 254145 -95184 -17068 74946 49639 -5533 19231 -424546 -29100 74200 -89967 -15240
12801 15354 -52621 74280 142457 -155257 -29038 -38343 256650 204490 -174404 -220590 -184111
12790 -184111 -119436 90170 -123523 -160662 -106637 -56113 134043 -137276 -46490 -98137 61951
12778 327371 -46295 -56712 58672 129408 43892 -91011 138769 204747 -76482 275714 249621
12767 249621 -58154 152121 168597 109030 -142876 -75293 76042 -62983 -333642 -63585 -6787
12755 80697 -129759 238213 -265039 113245 179580 113591 -79026 -99922 260838 -82130 -23691
12743 75406 -16751 -58268 239857 -121020 -77510 241756 98919 206632 -40771 -267256 -109538
12731B00066h7687j47915E45887A77843o5405b42194A01437r310k2446h3651k6501
12720a10152h658j37629B9561R1166c1044E6569J28551m0641E5530J06156p2056
12709H9630b53467A18019f0523j29444j23807R4542D5758a19510A81022C7629
12698A6731R7991J49238d4196G8133a78494B06335R3229i7032D38837B00665A2714
12686A9781Q512P2943J61747G0967b51567G769g4515r4164C6866O2762a54391
12674a6643A05945l4739a91026A61842l3116l2974L6083Q6478l9208R7253A01373
12662A83232C9643d8011H2732J74818j26199m1110K98873b07990g467A16380a41933
12650A16955b46264A24960a58103p642A98801b55868A66451O4903c4907m6272
$$ plain form
12731 200066 -87687 -235602 545887 177843 112438 -242194 101437 92127 69681 -83651 -110152
12720 -110152 -8658 -146287 29561 120727 -31044 56569 185120 144479 55530 161686 89630
12709 89630 -253467 118019 -60523 -189967 -313774 -219232 45758 -119510 181022 37629
12698 16731 114722 263960 -44196 78133 -178494 206335 299564 -97032 438837 200665 12714
12686 19781 28293 101236 262983 70967 -251567 7769 -74515 -168679 36866 99628 -154391
12674 -16643 105945 71206 -191026 161842 128726 95752 131835 218313 179105 276358 101373
12662 183232 39643 -48011 82732 257550 131351 90241 389114 -207990 -7467 116380 -141933
12650 116955 -246264 124960 -158103 -165745 198801 -255868 166451 231354 -34907 -81179
12640h1179D8993J68452K69775k39238G117K5415K72865a59835B7803J48895a12814
12628d74364B17083j02237n6109b38291b5666J993m8537f739k23139C4655a69823
12616A40327J92376p3133L67694B31367J75012H4767i8635A0244L1442M6984D2840
12604a34319B66642G6388g9412p4936B06705D441e5357A44682a02182B38279f4452
12592B60329j07495a16948o1267L7037d434A44023K43533p8131j51454b77792
12581D67978A72929D0929a48039I3102c87722A55612A2241J30206a08862R088
12571i9774C9010J64646d46948A22788D1406J14297n085c40192c6723A92648a05845
12559a614j80379f140B56587N2341a87637C7479J17177B5096K05982c04553I2618
$$ plain form
12640 -81179 48993 217445 487220 247982 7117 32532 305397 -159835 27803 176698 -112814
12628 -474364 217083 114846 58737 -238291 -25666 -23673 -72210 -6739 -229878 34655 -169823
12616 140327 332703 259570 627264 231367 406379 84767 -98635 10244 41686 88670 42840
12604 -134319 266642 76388 -79412 -154348 206705 4441 -55357 144682 -102182 238279 -64452
12592 260329 152834 -116948 -178215 -141178 -4434 144023 387556 309425 157971 -277792
12581 467978 172929 40929 -148039 93102 -387722 155612 12241 142447 -108862 -99774
12571 -99774 39010 203656 -446948 122788 41406 155703 150618 -340192 -36723 192648 -105845
12559 -1614 -181993 -6140 256587 308928 -187637 37479 154656 25096 231078 -304553 92618
12547A23645J11687i763D8690K97969h1676J1902l3735D6616a11617H1686i9497
12535E1282a00104A46426e9548J5475F0699a48678A8103a58682J3370A41983K9651
12524A71634M2672B9608c33263c4706B6821N3594d1898G5107K43614J51373k14130
12513B55964a43049l5895E2940a38812A9029d4170A84770m1212k1846a65660A5921
12501B29501f2835k7548c3019A03255a04517C5395c4171B42917c64356c1621A63023
12489h5372D3757j562A0974K86917I9458b92347o2975a43194q9619A8083c67809
12477g1041j4286A77065P5147h8781b7553G1053n549J09695h4558G8709b37277
12465C5184J24380E6086a07043c1543C3051a56209A49930J13805a6662B01237
$$ plain form
12547 123645 235332 -9763 48690 346659 -81676 -69774 -103509 46616 -111617 81686 -99497
12535 51282 -100104 146426 -59548 -44073 60699 -148678 18103 -158682 -145312 141983 171634
12524 171634 214306 29608 -333263 -34706 26821 80415 -41898 75107 318721 470094 255964
12513 255964 -143049 -178944 52940 -138812 19029 -44170 184770 143558 121712 -165660 15921
12501 229501 -62835 -90383 -33019 103255 -104517 35395 -34171 242917 -364356 -31621 163023
12489 -85372 43757 42195 10974 297891 99458 -292347 -355322 -143194 -232813 18083 -367809
12477 -71041 -85327 177065 252212 -88781 -27553 71053 65504 175199 -84558 78709 -237277
12465 35184 159564 56086 -107043 -31543 33051 -156209 149930 263735 -16662 201237
12454b4332C2880b89290n3025C42161i2962q8310A14875b32217h066A31772E0913
12442B8370K02179b1295E05482b05994F2217D881M4157a36824H3138A4560b53911
12430f1124C49364E8796J21377q2862N9274e4425C6582b2583P974l05160D2224
12418a73207c9655o273j11442D8884b35999A63491d1417A13411b07790e6686A08296
12406h8008A63946m7110m597d1270E376d7715j0573E1783J14860o7734C6211i5186
12393B25613c2167r2661A65710g8771A23390n2004Q7196F3040a72504P2898b1861
12381d3750j31541j14688i8947q3056E0067N0712c4830A80199C9551a95320F4291
12369a36243B66361j12600L572c026D08062a04644A14623m4035k7905M02678a6623
$$ plain form
12454 -24332 32880 -289290 -342315 342161 -92962 -181272 114875 -232217 -8066 131772 50913
12442 28370 230549 -21295 505482 -205994 62217 4881 49038 -136824 83138 14560 -253911
12430 -61124 349364 58796 180173 97311 156585 -54425 36582 -22583 -14609 -319769 42224
12418 -173207 -39655 -45928 -157370 48884 -235999 163491 -41417 113411 -207790 -56686 108296
12406 -88008 163946 116836 112239 -41270 5376 -47715 -58288 51783 166643 98909 36211 -95186
12393 225613 -32167 -124828 165710 -78771 123390 71386 158582 63040 -172504 -99606 -21861
12381 -43750 -175291 -289979 -98947 -182003 50067 100779 -34830 180199 39551 -195320 64291
12369 -136243 266361 153761 157333 -3026 408062 -104644 114623 70588 42683 445361 -16623
12357c14610A79480b22857a0891C41987a74959E7817b13739k0760A13727a83588
12346F3516J06987B9870a98836j3973e8308k05037A92271G2639f7763A22816b32522
12334B5337c3641k26030E0622a25687d6589C7587h9933a203n4319a9028G3305
12322a24229A34853J16570p3241o1034g612A23394P0898K28633D3348m71Q115
12311E0992c7399B54840f1600B77643J3053A05520C1632K14508j02535K11256
12301C54861d7197F8398b70614B71855K44871B27476h4844A04148a88726G2054
12290A88186A3138a07855H6282A57J35402K18480b1706o1519A08450J06637o9726
12279A45361a61203E4694K936J50863l4466a19810j09993A32839O3644H9201a72069
$$ plain form
12357 -314610 179480 -222857 -10891 341987 -174959 57817 -213739 -234499 113727 -183588
12346 63516 170503 29870 -198836 -212809 -58308 -263345 192271 72639 -67763 122816 -232522
12334 25337 -33641 -259671 50622 -125687 -46589 37587 -89933 -1203 -55522 -19028 73305
12322 -124229 134853 251423 178182 117148 -7612 123394 194292 422925 43348 42877 50992
12311 50992 -37399 254840 -61600 277643 290696 105520 31632 246140 143605 354861
12301 354861 -47197 68398 -270614 271855 516726 227476 -84844 104148 -188726 72054
12290 188186 13138 -107855 86282 157 135559 354039 -21706 -83225 108450 215087 145361
12279 145361 -161203 54694 57630 208493 174027 -119810 -229803 132839 196483 89201 -172069
12267C2103b9687I6434I524K42387F5504j497J63735J19370j30500A2478Q640
12256B1118a22079B38854f2017E9781A5074L59364N908a49769B33315p7260a1994
12244b9040n0930b2875A99126R605J77778j32748A5851M9448B5440J57435a98002
12232B66459n1357K1399L8091F1502Q4905B260b56294a3261B02194d2794l4923
12221g7717D1396J4003b45554e1589D04118A48482n0370Q5384F736K21166j09303
12210A18599j1069l2096D320M52431o5694E0384K18343I1884P7322J06806n6568
12199B19444J54469r4339O4213G8840K63765a25159F0724n045K88637I7543Q4440
12188A81983a39441A22499n91b53391j19537D41445a47981B15080M1086b8883
$$ plain form
12267 32103 -29687 96434 9524 251911 65504 64007 227742 347112 216612 12478 21118
12256 21118 -122079 238854 -62017 59781 15074 374438 380346 -149769 233315 156055 -11994
12244 -29040 -79970 -22875 199126 208731 386509 253761 15851 65299 25440 182875 -198002
12232 266459 215102 236501 274592 61502 146407 2260 -256294 -13261 202194 -42794 -77717
12221 -77717 41396 55399 -245554 -51589 404118 148482 98112 183496 6736 227902 118599
12210 118599 107530 75434 4320 456751 391057 50384 268727 91884 169206 276012 219444
12199 219444 373913 279574 343787 78840 342605 -125159 60724 55679 344316 97543 181983
12188 181983 -139441 122499 121908 -253391 -372928 441445 -147981 215080 256166 -28883
12177I7046J84352q9845g4214B10753H1457B0857J26128J65109b2170n2742A33832
12165g6230G7443i069D50533C6066o503J51054J03291i5844B90704O0852A5028
12153C75857b52538F6700d5636a4591B88167Q019M9939M2461A37563M2914J67810
12142C48287j00799b06156B88888p5230J20903b42106A46214a84131A73254J1877
12132A85131j9689h8036A83045l0258K21651d8438D3355a05482M7473B64495b0885
12120B49062K7010J6126D776P6921i7615C09710H8465K9623O5898p5008b43382
12108B87436A29752O2844J53177j11931b68514G5754b08515D0610c4764C18180
12097A48990a39991A73193P6681j07365O4977Q5985M8471i8715A17461L52596
$$ plain form
12177 97046 281398 191553 -74214 210753 81457 20857 146985 312094 -22170 -74912 133832
12165 -76230 77443 -9069 450533 36066 29563 180617 283908 -95844 290704 351556 15028
12153 375857 -252538 66700 -45636 -14591 288167 296186 346125 388586 137563 180477 348287
12142 348287 247488 -206156 288888 213658 334561 -242106 146214 -184131 173254 185131
12132 185131 165442 -88036 183045 152787 374438 -48438 43355 -105482 -58009 264495 -20885
12120 249062 276072 292198 4776 81697 -97615 309710 88465 118088 183986 108978 -243382
12108 287436 129752 192596 345773 233842 -268514 75754 -208515 40610 -34764 318180
12097 148990 -139991 173193 249874 142509 207486 293471 341942 -98715 117461 470057
12087D70057H3388J26416G5133d5528I3664a8062C4643J13493a66612c030C2383
12075f2464B1129J0981O8846K41796f821A8762R6569J58319J4449k7368p1220
12064A89511o3619Q4687A03459J36460d26379B24494K41361A46690a75187H7305
12053B7616J28207L97475A28262P0993p6170J11240R3442i1235H5913c7814A02220
12041a520k20525M0686B16895a69745G3440C5602L4490a41871m468A94006b09798
12029b08175N6120A1401b31865D7790P330a93908R2776B46174m5600b22759A79358
12017E8603a45436l5201B56496B1243Q2608J27162A2007L23425a84925B00873
12006b9972j63990A02160q891i624k14934N2433c7743p826r8778C4424M26572
$$ plain form
12087 470057 83388 209804 75133 -45528 93664 -18062 34643 148136 -166612 -3030 32383
12075 -62464 21129 32110 100956 342752 -6821 18762 115331 273650 288099 260731 189511
12064 189511 125892 210579 103459 239919 -426379 224494 465855 146690 -175187 87305
12053 27616 155823 553298 128262 199255 123085 234325 327767 -91235 85913 -37814 102220
12041 -1520 -222045 -181359 216895 -169745 73440 35602 70092 -141871 -146339 194006 -209798
12029 -208175 -152055 11401 -231865 47790 55120 -193908 -101132 246174 200574 -222759 179358
12017 58603 -145436 -180637 256496 21243 103851 231013 12007 335432 -184925 200873
12006 -29972 -193962 102160 93269 -9624 -224558 -172125 -37743 -45569 -144347 34424 460996
11995D60996f3473C5599c925E19081a47203N3286B88285E9053Q8600h9195B51051
11983h5469B37515j15803E7266d5343B07449g2616C95011g1643B67989D212K3322
11972B7534P6862a38677e6334j97442a20391L1604k10758A57774g3836E1197i5818
11960C23695g5728C06613A13151k4946a67503A12529b7779F6438a80764l7462
11950b18226C2920j3532M0271k9619J83728e2484j2627j94690j2390h3850d0632
11938B27233a79716N1164J1163E4974a40489m9512A98548C2127M2620a1625j89172
11927b00797Q9277H1821g7673E0674a03543P822m8396d1254l44025B47211C6248
11915A22966b07010E0803a48148L8916B75043b44503A33410i7298A65482i8139
$$ plain form
11995 460996 -63473 35599 -3925 519081 -147203 -93917 288285 59053 147653 -89195 251051
11983 -85469 237515 121712 57266 -45343 207449 -72616 395011 -71643 267989 4212 27534
11972 27534 104396 -138677 -56334 -253776 -120391 -88787 -299545 157774 -73836 51197 -95818
11960 323695 -75728 306613 113151 88205 -167503 112529 -27779 66438 -180764 -218226
11950 -218226 32920 19388 59659 30040 213768 -52484 -65111 -259801 -272191 -83850 -40632
11938 227233 -179716 -128552 -117389 54974 -140489 -190001 198548 32127 74747 -11625 -200797
11927 -200797 -111520 81821 -77673 50674 -103543 -95721 -144117 -41254 -385279 247211 36248
11915 122966 -207010 50803 -148148 -109232 275043 -244503 133410 -97298 165482 -98139
11904A01042a80946p3019A44619M3768a21430D54756b91269J16093H4814a7900
11893a38090r1766F1568b36577B22555b166j19867K3909C8643a7875A98169o80
11882A97489q8302b00260l25L3970A48580F7700b15034g5032B8003J54274E5022
11870a8597j89305G4064A0742a9498B68431N4285f1648j5867l21393a51398j2673
11859a64071E4350J34570c34606o0079i8552A6496K17152d34717A4615b19747
11848A10019e7920H9249b85990A8786a46705F1474j6594a82106c4016j08244q1768
11837b24028M5544f641j75729I1920P267b82320m617g9470j43080A27955e1167
11825D8121P1738N8882b2721l89189d4236A71285J03604b06030a02292p847k45654
$$ plain form
11904 101042 -180946 -253965 144619 188387 -121430 454756 -291269 -175176 84814 -17900
11893 -138090 -229856 61568 -236577 222555 -2166 -122033 -98124 38643 -17875 198169 197489
11882 197489 109187 -200260 -200585 -166615 148580 67700 -215034 -75032 28003 182277 55022
11870 -18597 -207902 74064 10742 -19498 268431 322716 -61648 -77515 -398908 -151398 -164071
11859 -164071 54350 188920 -334606 -394685 -98552 16496 233648 -434717 14615 -219747
11848 110019 -57920 89249 -285990 18786 -146705 61474 44880 -182106 -34016 -142260 -224028
11837 -224028 -178484 -6641 -182370 91920 99187 -282320 -286937 -79470 -222550 127955 -51167
11825 48121 119859 178741 -22721 -411910 -44236 171285 274889 -206030 -102292 -110139 -355793
11814c55793D02834G6898l4795a8885C9982a32j52347k24012h5876j95543o5745
11803c47164A13155J07195H2369b21552A10739H813g152A18769c21492E44143
11792A10684J01252H160f3722j0802j47656c2231l0050j30283C3893b9906A40108
11780D4861J54974a37020F212K3440K99347i4061j4079j16736b6028k21949g6466
11768A24768c652k6239A28041O1169o2099h6893B23505i8438G4970a90029n962
11757a95991B17310a33823G4850e7122A84848a57761c0425j77845A79962a66908
11746h5358d2672C22249b97323J42389f2324E3731P537P0518N074A1040P8087
11735H9127O8041K54387H9922q841J47351c7382l940r153L991m9499c1639A68434
$$ plain form
11814 -355793 402834 76898 42103 -18885 39982 -132 -152479 -376491 -85876 -281419 -347164
11803 -347164 113155 220350 82369 -221552 110739 8813 -7152 118769 -321492 544143
11792 110684 211936 8160 -63722 -74524 -222180 -32231 -62281 -192564 33893 -29906 140108
11780 44861 199835 -137020 6212 29652 328999 -94061 -108140 -224876 -26028 -247977 -76466
11768 124768 -3652 -29891 128041 189210 127111 -86893 223505 -98438 74970 -190029 -195991
11757 -195991 217310 -133823 74850 -57122 184848 -157761 -30425 -208270 179962 -166908
11746 -85358 -42672 322249 -297323 -154934 -62324 53731 61268 131786 136860 11040 89127
11735 89127 157168 411555 89922 81081 228432 -37382 -41322 -50475 -46484 -95983 -31639 168434
11722a2683j15154d801j18058e672l34983a06023j47321P9339A4170P7953j3416
11711G8707i6585B93833c42421i9328A88097F1204J81781g0257o4808H9820b35536
11699b0228j17322l5500l0222a9053A66243n4416a81648C2649P9240g5046A89176
11687A37282a32671a4356k64489D3389K72537f2706A57149a37345c8724B7511
11676g3995A58819i1633j01965j8752A93399E6062A1416P2607b44977a15987A9569
11664a43486a2286A62879o8839a3651H0537a73526B3402b218H1528B3753a67330
11652a24499j59469e2062j75909O4859D2157a22964A19802n7610R8693L0398b32463
11640e3218j70955C93114a5788C28607a13671H6580a02085N0976A59704a9337
$$ plain form
11722 -12683 -127837 -4801 -122859 -5672 -340655 -106023 -253344 -174005 14170 92123 78707
11711 78707 -96585 293833 -342421 -99328 188097 61204 242985 -70257 -135065 89820 -235536
11699 -20228 -137550 -173050 -203272 -19053 166243 111827 -181648 32649 111889 -75046 189176
11687 137282 -132671 -14356 -278845 43389 315926 -62706 157149 -137345 -38724 27511
11676 -73995 158819 -91633 -193598 -212350 193399 56062 11416 84023 -244977 -115987 19569
11664 -143486 -12286 162879 94040 -13651 80537 -173526 23402 -2218 81528 23753 -167330
11652 -124499 -283968 -52062 -227971 -163112 42157 -122964 119802 62192 160885 191283 -232463
11640 -53218 -224173 393114 -15788 328607 -113671 86580 -102085 -51109 159704 -19337
11629g8693J6717q1463A9928a95000A16411r248r619b6273a1267B7913J82345
11618B10258b08680G1532K4918J3627A5542a97945B40791h7608A40147n6584a45087
11606A24146e5087A74511l6627n0026a45501j03501F3074g5920A31051c96612
11595A23022a03514B8499J1570K02182J89266A27813c76679a56412a4366B78210
11584a48633B91981j39410j1168d8455A92582J11912A13485K929d7619B8793J05582
11573A34375f0209k44691F3845d14311E7290c4015H6141J84376r901A1240R0150
11562A01390A4864K71088e3284j17789O1612b4493A90507a55951D3589e4569F9330
11550a10748K5138I7016J07751e0184A13636A2645J12512d3962A34163a43697
$$ plain form
11629 -78693 -61976 -143439 19928 -195000 116411 107163 97544 -26273 -11267 27913 210258
11618 210258 -208680 71532 96450 110077 15542 -197945 240791 -87608 140147 83563 -145087
11606 124146 -55087 174511 137884 87858 -145501 -249002 63074 -75920 131051 -396612
11595 123022 -103514 28499 40069 242251 431517 127813 -376679 -156412 -14366 278210
11584 -148633 291981 152571 141403 -48455 192582 304494 113485 116414 -47619 28793 134375
11573 134375 -60209 -304900 63845 -414311 57290 -34015 86141 270517 260616 11240 101390
11562 101390 14864 285952 -53284 -171073 -109461 -24493 190507 -155951 43589 -54569 69330
11550 -110748 -85610 97016 204767 -50184 113636 12645 125157 -43962 134163 -143697
11539B97628A20725E4337a16752A46333e1622R151A26781c07472F4171d7803j17553
11528a65356A21466K877l6328K53277a0562D9471h391A44899a39656B17323e4384
11516e7943j28484m8189Q2934A07578m5550F165b30752G7543K51202a14917j03601
11505b18518P837B76957a38318A61891N5924a62183B90813a39226d4665K0784
11495b3881C38446h2174j3272c2590F0230K28045J68445a59674C16006A14893
11484d6610B25664K19065I2764K00721J78728b5995A28559c8887C9390a13526
11473a76610C8791P1222J44580b2925C32265P9724j67221l9827c25830B49817
11462c2000F3719a30009I503J09365b0393B00294J14733j32254h3775a0557F5662
$$ plain form
11539 297628 120725 54337 -116752 146333 -51622 -42471 126781 -307472 64171 -47803 -165356
11528 -165356 121466 124343 88015 341292 -10562 49471 -8391 144899 -139656 217323 -54384
11516 -57943 -186427 -234616 -151682 107578 62028 6165 -230752 77543 328745 -114917 -218518
11505 -218518 -210681 276957 -138318 161891 217815 -162183 290813 -139226 -44665 -23881
11495 -23881 338446 -82174 -95446 -32590 60230 288275 456720 -159674 316006 114893
11484 -46610 225664 444729 92764 293485 472213 -25995 128559 -38887 39390 -113526
11473 -176610 38791 110013 254593 -22925 332265 411989 244768 204941 -325830 249817
11462 -32000 63719 -130009 9503 118868 -20393 200294 315027 182773 -83775 -10557 65662
11450f1906A83572F0074a20195A66327a71348D9617g7656F7998K56445G7934a44330
11438G9061d43823A62562l5899O1026h5743j14304B64335g0255A62977a92009
11427b2878A74875e8314j66581D4536d7370l0994a6403C8835a8751n6418A34435
11415A88958q2716c03717I5291b40814A65921b87907H9996j6628a45654A13522
11404B29658R385c6954C71138E0394a03623Q484k01920a8415j99977e6963C6497
11392a0799n9592C6356g8817j55126B88147a03485o7448a9932E1982j2895A1499
11380d5669A24480a36438E3954Q8b8339B34837b25781E6526i864k31677A36033
11368a23673j5045j28126J17239j42295c6218A37742h9769B1920K6297g5840L0109
$$ plain form
11450 -61906 183572 60074 -120195 166327 -171348 49617 -77656 67998 324443 77934 -144330
11438 79061 -443823 162562 126663 187689 -85743 -200047 264335 -70255 162977 -192009
11427 -22878 174875 -58314 -224895 44536 -47370 -78364 -16403 38835 -18751 -75169 134435
11415 188958 106242 -303717 95291 -240814 165921 -287907 89996 73368 -145654 113522
11404 229658 239043 -36954 371138 50394 -103623 -95139 -297059 -18415 -218392 -56963 36497
11392 -10799 -70391 36356 -78817 -233943 288147 -103485 -170933 -19932 51982 39087 11499
11380 -45669 124480 -136438 53954 54042 -28339 234837 -225781 56526 -9864 -241541 136033
11368 -123673 -138718 -266844 -149605 -291900 -36218 137742 -89769 21920 48217 -75840 -45731
11357d5731E5026a76558M356B61574i4831A7827J12352b31998a07966C9023a54518
11345B36759g3177B2298n806a72359d9471q0506j49759D1501c5971j43047N6392
11334a22626C53327E8208a05373k7451A23039d4186l2765j18846D78827b4600
11323i854j0554k42394N3925j59951R0324h5914L5170a6121k53922C45062h0170
11311I9636N2931a10095A3768f1996C1972b4958p0148c141j68169A17921b88777
11299a58378j3553O3974A01532C5806L7253R9199C4262a67223B9360P337L4096
11288G0793F188c55976d5182G8966b887G0581J1060a04613K1104R169l92393D42969
11275b87603a5958A81964d08361C71437a70330P7905p4361m7380b0782j58674
$$ plain form
11357 -45731 55026 -176558 -172202 261574 -94831 17827 130179 -231998 -107966 39023 -154518
11345 236759 -73177 22298 16492 -172359 -49471 -129977 -279736 41501 -35971 -179018 -122626
11334 -122626 353327 58208 -105373 -132824 123039 -44186 -76951 -195797 478827 -24600
11323 -9854 -20408 -262802 -208877 -368828 -278504 -85914 -50744 -16121 -270043 345062 -80170
11311 99636 152567 -110095 13768 -61996 31972 -24958 -95106 -3141 -171310 117921 -288777
11299 -158378 -171931 -107957 101532 35806 73059 172258 34262 -167223 29360 36697 70793
11288 70793 6188 -355976 -45182 78966 -2887 70581 81641 -104613 -83509 -74340 -466733 442969
11275 -287603 -15958 181964 -408361 371437 -170330 -92425 -166786 -214166 -20782 -179456
11265a79456j07684e5355j03238j37815h8166k27581C89275E1782L15940H1971
11254e9019j60432F3574B6104a89373c9377D19637n2543f6834k15412M8341B77268
11242c9835k0057m3973B6810a02604p0902j38453c9125E480f1690r0592r679C90798
11229B886J56517B872M38039a35014K4951n3914B7558J00615l7942a32636D5551
11217b08254O9346A46019R1353b37525d0816B21896C3328M8221b61691a15320
11206d5830F92e67240C16996a29511J0781E1020J64352b19885H1381a84159A07737
11194a74774n3982A08024J2061e5566b0763j7307A34219h3773A17854a20942B0767
11182I6890d1109E8190b08635a9425j25866B39726G7146b51872j7551A18499M1895
$$ plain form
11265 -179456 -287140 -55355 -158593 -296408 -88166 -315747 389275 51782 367722 81971
11254 -59019 -219451 63574 26104 -189373 -39377 419637 367094 -66834 -282246 -233905 277268
11242 -39835 -59892 -103865 26810 -102604 -173506 -311959 -39125 5480 -61690 -152282 -161961 390798
11229 2886 159403 2872 440911 -135014 -110063 -163977 27558 128173 90231 -132636 45551
11217 -208254 -138908 146019 237372 -237525 -40816 221896 33328 81549 -261691 -115320
11206 -45830 692 -567240 316996 -129511 -118730 51020 215372 -219885 81381 -184159 107737
11194 -174774 -228756 108024 120085 -55566 -20763 -38070 134219 -83773 117854 -120942 20767
11182 96890 -41109 58190 -208635 -19425 -145291 239726 77146 -251872 -269423 118499 160394
11171A60394a76181h6572A8582a09139j03880f8388k99591A11744I786L1150O0929
11160A01865C9160K0693b7119k75063e5452k059F4802K595J05109c54044R6673
11149b57371J8437J9672j12516R4135b5547m82023A18774f4727D4378c10650j06916
11138d17566A43040a06662n7616j4498q8700B26356D7765a08254B9524n829G232
11126a05718j004c8153B57711c8014A16306c5759l65038A39334o0831C5236P9713
11115A14949d217j39967j1267k22927f8279B4345b24464B08546c6243I6618h8083
11103a48595B36953b83271a13515C17558A20788J56213b9264C01462a39916d7382
11092C910c2223B42135a62732o1968J6855B8830n519a19080G8236a09363B22635
$$ plain form
11171 160394 -176181 -86572 18582 -109139 -213019 -68388 -367979 111744 9786 40936 101865
11160 101865 39160 59853 -27119 -302182 -55452 -57511 64802 67397 172506 -354044 -257371
11149 -257371 -238934 -219262 -331778 -237643 -25547 -507570 118774 -64727 44378 -310650 -417566
11138 -417566 143040 -106662 -164278 -178776 -267476 226356 47765 -108254 29524 23695 7232
11126 -105718 -106722 -38153 257711 -38014 116306 -35759 -400797 139334 78503 35236 114949
11115 114949 -4217 -144184 -155451 -378378 -68279 24345 -224464 208546 -36243 96618 -88083
11103 -148595 236953 -283271 -113515 317558 120788 277001 -29264 301462 -139916 -47382
11092 3910 -32223 242135 -162732 -224700 -207845 28830 23311 -119080 78236 -109363 222635
11080C240a63367a3596o0610D3874f7300j05133A80907L653G2443b16233A22520
11068A01246R5810J50227a19407A15387J32743a60055C22069G9145G785L18128
11058C25913c0878B88339n7701N5506J16506D1251d18914a58320B52381b27499
11047D2702L84531b20595J4454D29808j61513G0891L29324n2287M1125P1164a3758
11035C72535J95094n7929j48427O9435J89635k94550M22452B86384J78342J51710
11025F16436j09576r8490j32196J83513j21721K17503A28067O42011l08334M7885
11015E09629M237J47061B33526J71973K67080j41160N7484j18622J37709j64413
11005D43577Q4385J41116B32296L91520k89561N2791J87514B71594N6262o3588
$$ plain form
11080 3240 -163367 -13596 -74206 43874 -67300 -172433 180907 184560 72443 -216233 122520
11068 101246 197056 347283 -119407 115387 248130 -160055 322069 79145 7785 325913
11058 325913 -30878 288339 230638 286144 402650 41251 -418914 -158320 252381 -227499
11047 42702 427233 -220595 -206141 429808 268295 70891 400215 347928 389053 460217 -13758
11035 372535 567629 509700 361273 430708 620343 325793 748245 286384 464726 616436
11025 616436 506860 408370 276174 459687 337966 555469 128067 770078 461744 509629
11015 509629 513866 660927 233526 405499 672579 531419 588903 470281 607990 443577
11005 443577 527962 669078 232296 623816 334255 387046 574560 271594 327856 264268
10995B64268q1900K92094j82732J4909C6237L62029K38589C02235j47985L14111
10985D68361N0791A17795N25587j63058m7149j20613N1046J71728j45463J81394
10975E71267j02952B33967K43666P2755P7777j63781L0104J60674J49947k37484
10965E67625n8822J31675Q2048Q7736L10705j36743Q900J71826k3043j6851J58501
10954A283557J36533R8452K38238k03236P3356l57257j32364J04642L5899j35586
10944A142234k28092J79405L16198m83921L07690k82086M08904K25083l51131
10935A234284j70487J81762j28296k57977N2164C60465K83237j15329q1350m2341
10925D04682A34963N3681n7757Q6916b5955q4332C71136A19726b42351H4775J56910
$$ plain form
10995 264268 182368 474462 291730 306639 36237 398266 636855 302235 154250 468361
10985 468361 519152 117795 643382 480324 433175 312562 363608 535336 389873 571267
10975 571267 468315 233967 477633 550388 628165 464384 494488 655162 805109 567625
10965 567625 508803 640478 722526 810262 1120967 984224 993124 1164950 1141907 1125056 1283557
10954 1283557 1420090 1518542 1756780 1553544 1626900 1269643 1137279 1241921 1277820 1142234
10944 1142234 914142 1093547 1409745 925824 1233514 951428 1360332 1585415 1234284
10935 1234284 1063797 1245559 1117263 859286 911450 360465 643702 528373 447023 404682
10925 404682 134963 188644 130887 217803 -25955 -110287 371136 119726 -242351 84775 241685
10914B41685q7833d8747n1482J1605d2096A91684a79879A79036P6004b01587n1116
10903b52703B2461d72274K02126m7221J32717N0538G0039B4852A1813Q2229d383
10891E3473a46375B4691J95995c6862j36081f9966b7890I6979b31826A5930K23029
10880B38959a29278J3439b3987A00271j7023b38164B41721a93897O4598N7740
10870g1559K7190m863C52867h048a306G0395a34898n6616k73731d8714C2884L9508
10858G2392a84779G907N4516i4358A54522c36776E44952b3248B1555b0032q4341
10847a04373n344o0853b536F437L3851b84335A66600d2301B01360m5794n6470
10836I9096d8109j25483A59184a88785b8966F4095a88403K9192D4727b4489A83894
$$ plain form
10914 241685 153852 -48747 -100229 -88624 -42096 191684 -179879 179036 255040 -201587 -252703
10903 -252703 22461 -472274 -270148 -317369 -184652 -134114 70039 24852 11813 94042 -4383
10891 53473 -146375 24691 220686 -36862 -172943 -69966 -27890 96979 -231826 15930 238959
10880 238959 -129278 -115839 -23987 100271 83248 -238164 241721 -193897 -129299 -71559
10870 -71559 -44369 -49232 352867 -8048 -1306 70395 -134898 -191514 -465245 -48714 32884 72392
10858 72392 -184779 7907 62423 -94358 154522 -336776 544952 -23248 21555 -20032 -104373
10847 -104373 -109717 -170570 -2536 6437 40288 -284335 166600 -42301 201360 155566 99096
10836 99096 -48109 -173592 159184 -188785 -28966 64095 -188403 -159211 44727 -24489 183894
10824a21353b214p5937l65989J33167J8621A7334d8105A9907L17010E3013j3814
10813C9199d29302A86539B3186Q7780C549a4668A00509C3449j5832J22179n2971
10802H6825A0267a40263k28n3346B4707b3709A4573b81173c9404k0273J8340C31964
10789I2274C833a43602A25762h6558A41418b93446Q3995i4870A92779a24396A95356
10777b81370M5826I0068a990k94262c6922a4009p825C24570a50007f6789A21367
10765e7354A22171a62814A68099b96803j99891B03639a43515A53836N525C9815
10754A9491J79434e2574r5228b7261j0373j37006B24516c9741k32400F0933i6838
10742A72886J18890b91998J00712C3268a45871K0023C3686L7257a78817H7056
$$ plain form
10824 -121353 -2214 -78151 -444140 -310973 -292352 17334 -48105 19907 336917 53013 39199
10813 39199 -429302 186539 23186 110966 3549 -14668 100509 33449 17617 139796 86825
10802 86825 10267 -140263 -140491 -193837 24707 -23709 14573 -281173 -39404 -59677 -41337 331964
10789 92274 3833 -143602 125762 -86558 141418 -293446 -209451 -94870 192779 -124396 195356
10777 -281370 -235544 90068 -1990 -296252 -36922 -14009 -21834 324570 -150007 -66789 121367
10765 -57354 122171 -162814 168099 -296803 -496694 203639 -143515 153836 159361 39815
10754 19491 198925 -52574 -147802 -27261 -37634 -174640 224516 -39741 -272141 60933 -96838
10742 172886 291776 -291998 -191286 33268 -145871 -125848 33686 70943 -178817 87056
10731e8008K8447G87J66299a84627e0991j68926E8801c38125i0626L8003G6116
10719f59390H5354a1954I3104m444R5411A2725a30971c5945k13578a30l9543j23510
10707a63183P6586q7312C19149A42810b3121B27608q9255j964d78818a53213n9027
10696b12240N9080m35071B13197L1656I7360L3399h720l5713H7192a09558A01953
10684C87566a08743P832f090A66980b44330A03083B0373d074l06244A03906K87598
10673C91504c22311K2135e0140k18453L3741c1558A6790c22684A90985a49795
10662h823l38078A9523J03755a82703c1613B83745H4893b6478p7467D5161b59888
10650A14598b02537A24545C690a40512e125k32106k4887D5861b05519A62438a47650
$$ plain form
10731 -58008 -29561 787 167086 -184627 -50991 -219917 58801 -338125 -90626 -52623 76116
10719 -659390 85354 -11954 93104 88660 184071 12725 -130971 -35945 -249523 -130 -39673 -163183
10707 -163183 -86597 -173909 319149 142810 -23121 227608 138353 136389 -478818 -153213 -212240
10696 -212240 -153160 -588231 213197 244853 97360 130759 -8720 -44433 87192 -109558 101953
10684 387566 -108743 -100911 -6090 166980 -244330 103083 20373 -4074 -310318 103906 391504
10673 391504 -322311 -300176 -50140 -268593 -234852 -31558 16790 -322684 190985 -149795
10662 -8823 -346901 19523 123278 -182703 -31613 283745 84893 -26478 -103945 45161 -259888
10650 114598 -202537 124545 3690 -140512 -5125 -237231 -262118 45861 -205519 162438 -147650
10638A34281E5937b09543l4841B06301a42171O0305a9658C9938a58666l1395m3833
10627b33894P9788N065k8279m06A15167a01970c6261k26269C617h5817M0747n8346
10615a03416B08324J9578e8579k11189i8108k35317n5151B1597a06021L4901p0857
10604a41977J4816A02146e4935k08585C4532b37659F3486O8821a99253E3195J6185
10593F9380c03027A9868b52390b3487j38467M8936i704B43803b12013R9423q0342
10582a92932D0355a44491O0127A00509a60119J0429C38440a79131G9628f6631
10571A57123c021j20235j28990a03696O956A66810a89601c5625A0435C732a90262
10559E01137a38723A07905b03208C56508c26593H9412j0527b1062A20182m9685
$$ plain form
10638 134281 55937 -209543 -244384 206301 -142171 -81866 -19658 39938 -158666 -190061 -233894
10627 -233894 -154106 -149041 -177320 -177726 115167 -101970 -36261 -262530 3617 -85817 -45070 -103416
10615 -103416 208324 227902 -58579 -269768 -98108 -333425 -388576 21597 -106021 -71120 -141977
10604 -141977 -127161 102146 -54935 -263520 34532 -237659 63486 132307 -199253 53195 69380
10593 69380 -303027 19868 -252390 -23487 -161954 -113018 -9704 243803 -212013 -112590 -192932
10582 -192932 40355 -144491 -84364 100509 -160119 -149690 338440 -179131 79628 -66631
10571 157123 -3021 -123256 -252246 -103696 -96740 166810 -189601 -35625 10435 3732 -190262
10559 501137 -138723 107905 -203208 356508 -326593 89412 78885 -21062 120182 70497
10549G0497i5829A58578d12499D9014g7745D8687a97581k66305A19780a96814
10538C34565q7602b89621j29592C70215d145n4497C8376a4492o8601q9123M7953
10527a24263J8842k9170k67866J99788F2532K4948J04612a30234b5802a002l62019
10516c63021B0728J53775m1665o4698d5383A26762M0712F4233g6867A51744C1319
10504C4645b8104B6317a01323I1202c90099L1211B0913a84984D1192b855k01201
10493b04056I6569a45012A77875b48020A68510c18109i3747k77388H8335K79118
10483C67453c447j79494P8582c7308A0287a53987E8949a13659A23162h1696B10510
10471A96295A0565g1843B27262b85648J27968J4569B9352d8727A25122J92205
$$ plain form
10549 70497 -95829 158578 -412499 49014 -77745 48687 -197581 -463886 119780 -196814
10538 334565 246963 -289621 -419213 370215 -4145 -58642 38376 -14492 -83093 -172216 -124263
10527 -124263 -105421 -134591 -402457 -202669 62532 87480 192092 -130234 -25802 -1002 -363021
10516 -363021 20728 174503 132838 68140 -45383 126762 167474 64233 -76867 151744 31319
10504 34645 -28104 26317 -101323 91202 -390099 -358888 20913 -184984 41192 -2855 -204056
10493 -204056 96569 -145012 177875 -248020 168510 -318109 -93747 -371135 88335 367453
10483 367453 -3447 -182941 -104359 -37308 10287 -153987 58949 -113659 123162 -81696 210510
10471 196295 10565 -71843 227262 -285648 -157680 -143111 29352 -48727 125122 317327
10461C17327A03544J07420b6990A26160K46269h9338K596B60400J00649A33712
10450D0961f1401B65180d9668j53347e8389A52567b74891g9968B0028D800g8703
10438c00552K030C05837A4504Q2560a46924f7600A10351b07302N5967m4983g8718
10426a30126J6425q8846c1464o4878k57826d8574A51520I682B4P5861g0750H7978
10413a86876a8978B05440l4682a18874B9141J36065A0423J15786a39989A95012
10402a4309n5313C85305A09849b06937n88030A43417c29959a07545D56220E1845
10391a2321j0152k54886M7398f3981L0166E30d78224B58945b05410i5075P421
10380h7654j49964A3605N3960P9231a3990o6868B37613N4724a8977A08129b48434
$$ plain form
10461 317327 103544 210964 -26990 126160 372429 -89338 -86742 260400 361049 133712
10450 40961 -61401 265180 -49668 -203015 -58389 152567 -274891 -79968 20028 4800 -78703
10438 -300552 -298522 305837 14504 97064 -146924 -67600 110351 -207302 -151335 -196318 -78718
10426 -130126 -113701 -202547 -31464 -96342 -354168 -48574 151520 9682 24 75885 -70750 87978
10413 -186876 -18978 205440 170758 -118874 29141 165206 10423 126209 -139989 195012
10402 -14309 -69622 385305 109849 -206937 -794967 143417 -329959 -107545 456220 51845
10391 -12321 -22473 -277359 -229961 -63981 -33815 530 -478224 258945 -205410 -95075 -87654
10380 -87654 -237618 13605 67565 146796 -13990 -80858 237613 292337 -18977 108129 -248434
10368a80893E3569d34027h9695c5600B8322L23261c08771c2051B34585A8473J26025
10357A44498E9887J54182J34153l7132A06728i4209c8C11653B2269a11283B66480
10345C01209h8575C20050J17477m4731B749K05254F6481C943e9420B19634J24125
10334C43759A28527R3934I4307l6604J29020P8019o6317h1899C99746j75031I6610
10322C93706j06930N686j24901K981g2331G2827J81253b20281E17556E5304J43195
10311A98499N6712a9982e034j5266o415D5057J33159j4101K7776i4479r7658H0782
10298b82410j6877F0171B264M6291a61819D2996J2965b2152F4498A6772l354d0756
10285D897d2387B46223C2581f5304A7712a15272o2900g193A17970d9680C8686
$$ plain form
10368 -180893 53569 -434027 -89695 -35600 28322 351583 -308771 -32051 234585 18473 144498
10357 144498 59887 214069 348222 311090 106728 -94209 -38 311653 22269 -111283 266480
10345 301209 -88575 320050 437527 392796 2749 208003 66481 3943 -59420 219634 343759
10334 343759 128527 222461 94307 57703 186723 264742 198425 -81899 399746 224715 96610
10322 393706 286776 292462 167561 170542 -72331 72827 254080 -220281 517556 55304 198499
10311 198499 255211 -19982 -5034 -20300 -26715 45057 178216 164115 191891 -94479 -192137 80782
10298 -282410 -299287 60171 2264 48555 -161819 42996 55961 -22152 64498 16772 13418 -40756
10285 4897 -42387 246223 32581 -65304 17712 -115272 -178172 -7193 117970 -49680 38686
10273e8461n2309b5242E5612a82869J9794P5438g536A73976n2115h6229H3855
10261A26789c50936J15769b7896C1730a88501j2603a8299j72534D3932a76535
10250c65558A62275b98468a19850A66635F3466k2430q049a12400q2687p666D61
10238A00078J73342j28627C8315a06623b3812E15374h2575p7917M8327k7516N740
10227a33941B6059P2844b12518D7619d6055k8539l19153J92926h9889K0947E0653
10215c35619A9997a90067K6834m0200c9395r6107J8450A59618D9916Q0631J59838
10204B90385a52840j52101a00058k9238c3407F2025f4387l00966a00337l1592
10194a31929L1795d7277G6514c52364a15810n1630L8684n5057A50320a71533N7943
$$ plain form
10273 -58461 -110770 -25242 55612 -182869 -163075 -87637 -7536 173976 121861 -86229 83855
10261 126789 -350936 -235167 -27896 31730 -188501 -201104 -18299 -190833 43932 -176535
10250 -365558 162275 -298468 -119850 166635 63466 41036 32987 -112400 -195087 -202753 461
10238 100078 273420 144793 38315 -106623 -23812 515374 -82575 -160492 -112165 -139681 -133941
10227 -133941 26059 98903 -212518 47619 -46055 -74594 -393747 -200821 -89889 -68942 50653
10215 -335619 19997 -190067 -163233 -203433 -39395 -135502 -117052 159618 49916 130547 290385
10204 290385 -152840 -304941 -100058 -129296 -33407 62025 -64387 -365353 -100337 -131929
10194 -131929 -100134 -47277 76514 -352364 -115810 -167440 -128756 -183813 150320 -171533 -113590
10183a13590A76924c930j12772d8642p1731j90577B1983K76365a5367k11231A19629
10171a72810j3770K9776K2354F3208P0235b03630e5596E6771a68161b3815p2902
10160i6717m6756j5823g5594a6788j43924A15777h4984A26822h3812j88995A71052
10148d2476A84266N1151g4315B28187b2955B2895A1443e6111k04496D2741o266
10137C6475a8069A75860a87090N4768H4137b6203A45148J07714j23379d597j38224
10126a42821N7301P318D8971P6216b19338M060Q80A41969b07862p5901A22551
10114b3327F194a36971h071F9941k8754R0091b82496A971a61378A2596e300I942
10101B55480b09143A1086K54491n8931k6081b78065D56613a33292k4115n2711
$$ plain form
10183 -113590 176924 -3930 -116702 -48642 -120373 -310950 21983 298348 -15367 -226598 119629
10171 -172810 -186580 -156804 -134450 63208 133443 -203630 -55596 56771 -168161 -23815 -96717
10160 -96717 -143473 -159296 -75594 -16788 -160712 115777 -84984 126822 -83812 -272807 171052
10148 -42476 184266 235417 -74315 228187 -22955 22895 11443 -56111 -260607 42741 36475
10137 36475 -18069 175860 -187090 -132322 84137 -26203 145148 252862 129483 -4597 -142821
10126 -142821 -85520 -78202 48971 125187 -219338 -215278 -214398 141969 -207862 -283763 122551
10114 -23327 6194 -136971 -8071 69941 41187 131278 -282496 1971 -161378 12596 -5300 9942
10101 255480 -209143 11086 265577 206646 180565 -278065 456613 -133292 -157407 -210118
10091b10118A21541b94097C5706f8058D8104B739c483j26872K5761j26025A68830
10079a83171c5861a6065j88558D580h8886j28140L1189A95503E4887a61278d0626
10067i8573j78233F6193A6185i658A0868O5454e9780j15273C18305b96510a04564
10055G5809a95182Q2733c698l51826a2890F7677b44651A33180i1208j61984j06181
10044c59373f3562J7769A03611R281L0434D6712b26108C4797A5355c8623J4526
10033b4097J1150A37160d44840c4116j88772c9746A57142B324b35005c5897A22257
10021A67358d8147A80907a34256G7806b13311J04738Q545k9114K5517A02927h0923
10009d0367j2223C5025J22259b40857e9856j53774I4817a21736j1837D1206h2789
$$ plain form
10091 -210118 121541 -294097 35706 -68058 48104 2739 -3483 -130355 -104594 -230619 168830
10079 -183171 -35861 -16065 -204623 4580 -88886 -217026 -185837 195503 54887 -161278 -40626
10067 -98573 -276806 66193 16185 -9658 10868 76322 -59780 -175053 318305 -296510 -104564
10055 75809 -195182 -112449 -3698 -355524 -12890 67677 -244651 133180 -91208 -253192 -359373
10044 -359373 -63562 -45793 103611 112892 143326 46712 -226108 34797 15355 -38623 -24097
10033 -24097 -12947 137160 -444840 -34116 -222888 -39746 157142 2324 -235005 -35897 122257
10021 167358 -48147 180907 -134256 77806 -213311 -108573 -100028 -129142 -103625 102927 -80923
10009 -40367 -52590 35025 157284 -240857 -59856 -213630 94817 -121736 -133573 41206 -82789
9997d2916l44622a56113b5998B48159a61157a9878I1100q791M1483B3320b76453
9985i3809J4963m10900A28168m2333m1401a44997j23968N1226e4628k01756a18210
9973e9439p8513j01956a0930p7199c3710I2652b00197B30596a15316N3739K2541
9962c9036k8337A82296f94730b14797I7686D4293f4755E3259K8597e252H3509
9950c7188A55382i5237g747j62345A33338a4464H582a68138E3225b1302l47203
9939c68505C04990a27908B0725K29665G180P1815c5744j08912A92535a9444P399
9928a2045A98667q8450b53441p0445J48845Q6417H2787p676a31226b7137j09942
9917a37079c5392j63722B2074Q6162c21486a48642A23774b19442k74279a58723
$$ plain form
9997 -42916 -387538 -156113 -25998 248159 -161157 -19878 91100 82309 123792 23320 -276453
9985 -93809 -78846 -489746 128168 85835 44434 -144997 -268965 -217739 -54628 -256384 -118210
9973 -59439 -137952 -239908 -10930 -88129 -33710 92652 -200197 230596 -115316 -61577 -39036
9962 -39036 -67373 182296 -694730 -214797 97686 44293 -64755 53259 81856 -5252 83509
9950 -37188 155382 -95237 -7747 -170092 133338 -14464 8582 -168138 53225 -21302 -368505
9939 -368505 304990 -127908 20725 250390 7180 78995 -35744 -144656 192535 -19444 -12045
9928 -12045 198667 110217 -253441 -323886 -175041 -88624 82787 75111 -131226 -27137 -137079
9917 -137079 -35392 -199114 22074 108236 -321486 -148642 123774 -219442 -493721 -158723
9906A08411C424a20646N3142j76705Q9657j07514a10753B8468b06608E4094a47985
9894H0547a04797k89208c0746n3160K0441j6626A28025m5163j3771e3409H4342
9882a77882O0158p4051O9519N3100C61864b62787Q9963G9744b10985a00451B1449
9870B9318l322Q3521a28520E8640g1111F5625a16472A20991D1769N6184a723F0842
9857b11108R975e2740J7583A51553d90029a16767A07196a75479A08429B9897c10591
9845B46469d824C3724c55431C31031b38346h6763c8444A66498g5528B18362a09203
9833A2527c0829k86998B9331e5433B46895b449o8325m9792c6735m3671j54271
9822b34677a5400A44241b20407I9548m0258O1438j1225c5040D00779A78396I889
$$ plain form
9906 108411 3424 -120646 -67504 -244209 -154552 -262066 -110753 28468 -206608 54094 -147985
9894 80547 -104797 -394005 -30746 -83906 -63465 -80091 128025 82862 69091 -53409 84342
9882 -177882 -117724 -191775 -122256 -69156 361864 -262787 -172824 79744 -210985 -100451 21449
9870 29318 25996 109517 -128520 58640 -71111 65625 -116472 120991 41769 97953 -1723 60842
9857 -211108 -201133 -52740 -35157 151553 -490029 -116767 107196 -175479 108429 29897 -310591
9845 246469 -4824 33724 -355431 331031 -238346 -86763 -38444 166498 -75528 218362 -109203
9833 12527 -30829 -317827 29331 -55433 246895 -2449 -70774 -120566 -36735 -80406 -234677
9822 -234677 -15400 144241 -220407 99548 59290 120728 109503 -35040 400779 178396 9889
9810c39353A8659b4961A08562a52477b3158h544n1986A28914a15896j36494R1439
9799a60951o4277D10574h8625A06136J73529D0071M1904b10337l6591D1366d363
9787b29451E6780b48919L0558J00018c5209m06019d5512k8322M633E9835b19457
9775a29885I9253h4725c8161A26600J73522g6112k17850e853k56569d930j76498
9764a81428O9315N3686m07288I5930c43421B95802b99960p4775A06617a71084
9753e2954A66432a92041h6711n0713J6214c6224k3610k861j00949P3941L5613
9742e4090r4872F1789a43653A376b45818J12098A25868m3157b62139D5916i2802
9730i9494b1778C6831c29134D84381b26335A19591l4040R6354a0143B9404J6037
$$ plain form
9810 -339353 18659 -24961 108562 -152477 -23158 -8544 -60530 128914 -115896 -252390 -160951
9799 -160951 -225228 410574 -88625 106136 279665 40071 81975 -210337 -246928 41366 -4363
9787 -229451 56780 -248919 -218361 -118343 -35209 -441228 -45512 -73834 -69201 59835 -219457
9775 -129885 99253 -84725 -38161 126600 300122 -76112 -293962 -5853 -262422 -4930 -181428
9764 -181428 -112113 -58427 -465715 95930 -343421 295802 -299960 -374735 106617 -171084
9753 -52954 166432 -192041 -86711 -137424 -121210 -36224 -59834 -62695 -163644 -89703 -54090
9742 -54090 -148962 61789 -143653 1376 -245818 -133720 125868 82711 -262139 45916 -92802
9730 -99494 -21778 36831 -329134 484381 -226335 119591 85551 181905 -10143 29404 45441
9719D5441b04642C90907F654O6761D534i0329l10584b4194j39283e7600C6034
9707c22629a20230B2248b01315r2073b5421q5426d2306p0713k34035D2615a03200
9695G69K29317b02501A863d8580A17430a47044K1738a3829j09806j68248b7879
9683b00591m3871J6675m174C5325J3966b972p3726j13724h7921j83544b9619A20065
9670c38542a13227c8420j71622D659c4182C9283b7743a3722n3472l5070B46409
9658b06693M3192j02894k60572d1468l80958C25710F4100a0447j24850N9468B2483
9646b16032m404i9002C1056a76695P5325M9546j83093e5158j07205p9013B30292
9634b41659A81620A7244J80168a90585h140A65330Q4920H3743K8155E373c44440
$$ plain form
9719 45441 -204642 390907 6654 73415 4534 -90329 -400913 -24194 -163477 -57600 36034
9707 -322629 -120230 22248 -201315 -293388 -25421 -110847 -42306 -113019 -347054 42615 -103200
9695 769 230086 -202501 1863 -48580 117430 -147044 -125306 -13829 -123635 -291883 -27879
9683 -200591 -244462 -227787 -231961 35325 49291 -2972 -76698 -190422 -87921 -271465 -29619 120065
9670 -338542 -113227 -38420 -210042 4659 -34182 39283 -27743 -13722 -67194 -102264 246409
9658 -206693 -163501 -266395 -526967 -41468 -422426 325710 64100 -10447 -135297 -75829 22483
9646 -216032 -220436 -99002 31056 -176695 -101370 -51824 -234917 -55158 -162363 -241376 230292
9634 -241659 181620 17244 197412 -190585 -8140 165330 250250 83743 111898 5373 -344440
9622E6322c05369F7616c0513k07395A8518i1918C25646d254E7328J86074b59592
9610g4669k10234J03029D79e67498C3251a64540j73403g2377A56917d5522l25979
9599c71501c9912j58661a9782m8388j65672k66113a96103A36122e46406E1621
9588B3157M41i0623j84580a01654A1523a38729k0100G831J86021a17106m4156
9577a61262C87854a60638a3904c231k0277k90100D4550a15767J2754j029D482
9565G6071J67882c4882j44216A249b32808P4005C6641f3877k81734b4164C23313
9553A41307m9325e2115C3941K74253F2437b33810E0536b36638c133A54100c75757
9541d0159p116G1985c47103J73150j48885J35115I945M9972J20525a19994B4950
$$ plain form
9622 56322 -305369 67616 -30513 -237908 18518 -91918 325646 -4254 57328 243402 -259592
9610 -74669 -284903 -181874 479 -567498 33251 -164540 -337943 -72377 156917 -45522 -371501
9599 -371501 -39912 -198573 -19782 -68170 -233842 -499955 -196103 136122 -546406 51621
9588 23157 23598 -90623 -275203 -101654 11523 -138729 -158829 7831 193852 -117106 -161262
9577 -161262 387854 -160638 -13904 -3231 -23508 -313608 44550 -115767 -103013 -104042 4482
9565 76071 243953 -34882 -179098 1249 -232808 -158803 36641 -63877 -345611 -24164 323313
9553 141307 91982 -52115 33941 308194 62437 -233810 50536 -236638 -3133 154100 -375757
9541 -40159 -47275 71985 -347103 -173953 -322838 -187723 9945 59917 180442 -119994 24950
9529a69381e8884A08510e9543j7712B03515H9104a43884I1872A4362o349a55631
9517B97701b24063j04000B45652c12435B24610a61593B09132d82879f0680A0119
9506a01660d2850C4095b53586G7112h1591p8898K4933j27610a02992k57233A09729
9494A59151b93431I5753c22299A09794b5504j13336L9224k72242C20716p8558
9484B42158q4014a66362B18227a38455E5094a70887G1911b25116a4904A32395
9473a67434j60613L9147h7443D3129R663a48882r7777O9967j01243L5908I6711
9461c96950a6020n39549A6606f1538q4234j7623P6459r3165p292q614d3618j45396
9449a89014P3717B5618b71924E8235c16785N6421G4643K4227a55891d9817C6871
$$ plain form
9529 -169381 -58884 108510 -59543 -77255 203515 89104 -143884 91872 14362 8013 -155631
9517 297701 -224063 -328063 245652 -312435 224610 -161593 209132 -482879 -60680 10119
9506 -101660 -42850 34095 -253586 77112 -81591 -160489 -135556 -263166 -102992 -360225 109729
9494 159151 -293431 95753 -322299 109794 -25504 -138840 -99616 -371858 320716 242158
9484 242158 158144 -166362 218227 -138455 55094 -170887 71911 -225116 -14904 132395
9473 -167434 -328047 -288900 -87443 43129 52792 -148882 -246659 -176692 -277935 -242027 96711
9461 -396950 -16020 -555569 16606 -61538 -145772 -163395 -86936 -180101 -187393 -196007 -43618 -189014
9449 -189014 -115297 25618 -271924 58235 -316785 -260364 74643 98870 -155891 -49817 36871
9437I9973a16323L7271G964k306K83970A2899a81508f3141n2847b6345C1412L0015
9425F1427a68191o6517a5371l58623a50003l6455c3254k75686C2354K1135Q1331
9414A34820a48208j37804a6401J512l00864i2653j26096d1359F9800j7675J72592
9403B24717a76261j22383a29366A09004b39368G0250K16283b47667a17301l5616
9393a52917A42664d18214C75591e91133b55729C25290a6224A81493c24040d9498
9382A77738A6462a948k03896A23280a98892A11851f3159G9335b1137A63147a35356
9370D972e3229j062B51373a53305I9717c3055J6091A09242b80220C7848g1331
9358c92881a94865j01257a23374A40155b0200F0476a19257I5337d43688a54061
$$ plain form
9437 99973 -116323 -79052 7964 5658 289628 12899 -181508 -63141 -115988 -26345 31412 61427
9425 61427 -168191 -234708 -15371 -373994 -150003 -186458 -33254 -308940 32354 53489 134820
9414 134820 -148208 -286012 -16401 -14889 -315753 -92653 -218749 -41359 69800 52125 224717
9403 224717 -176261 -298644 -129366 109004 -239368 70250 286533 -247667 -117301 -152917
9393 -152917 142664 -418214 375591 -591133 -255729 325290 -16224 181493 -324040 -49498
9382 177738 16462 -1948 -205844 123280 -198892 111851 -63159 79335 -21137 163147 -135356
9370 4972 -53229 -54291 251373 -153305 99717 -33055 -16964 109242 -280220 37848 -71331
9358 -392881 -194865 -296122 -123374 140155 -20200 60476 -119257 95337 -443688 -154061
9347c40696a34641j86899B3473h2941F8595J71818b60569j92829b07561b1137
9336B91123c60233j86123F6836b41998D6407L22428G7068c37950J42146Q9832
9326a05972A88578H2696b00950L5688B13901a66830K6465e4425j54902B0128i9615
9314A01141d1204A33483A0219K05166I6757a14265F3191c99309J21367J06007
9304a71935A37179L5554d01301J50052g2768C9682a01611B69696A02431a89760
9293a63520d2665G9306c13348n4518C1334a37031k4960D6392a46980j35028b409
9281C1672b12125E1507h6376c0284k11079F319b10240A41283a93159l1245B39921
9269a94495B49394F9336j0705K2330a50259C9575J37780a67466B7991a4134C8096
$$ plain form
9347 -340696 -134641 -321540 23473 -82941 68595 240413 -260569 -453398 -207561 -21137
9336 291123 -360233 -546356 66836 -241998 46407 368835 77068 -337950 -195804 -105972
9326 -105972 188578 82696 -200950 -165262 213901 -166830 -140365 -54425 -209327 20128 -99615
9314 101141 -41204 133483 10219 215385 96757 -114265 63191 -399309 -277942 -171935
9304 -171935 137179 172733 -401301 -251249 -72768 39682 -101611 269696 102431 -189760
9293 -163520 -42665 79306 -313348 -367866 31334 -137031 -161991 46392 -146980 -282008 -2409
9281 31672 -212125 51507 -86376 -30284 -241363 6319 -210240 141283 -193159 -224404 239921
9269 -194495 249394 69336 58631 80961 -150259 39575 177355 -167466 27991 -14134 38096
9257C28614a03295k067A84845a40511B1747c84654g4328p197B12907A04108b12211
9245A43720a99065P5608L4560E0794a55179D8944a88544B6583b15122q3487h1005
9233a41370p5466p1371J33426B7818M2495a40198o8617A11329R0157c58623a0519
9221h6052I8168a34468e603r3956C9323a73003E6396b14879Q1812B081b61903
9209h2016j751C399f6595I6778a27961B31929f9082m3698B25855e0614j35861
9198a86475n5893A580J32833h8709p4274m4422A45805g2184k30429a25097c6676
9186a53610j6323n8383A16763a55321J5720B59633A17437l3828J45619a32266
9175a84270n4221j82722a30257l5328A46665a91103M9078G933b14845d784k35124
$$ plain form
9257 328614 -103295 -105362 184845 -140511 21747 -384654 -74328 -81525 212907 104108 -212211
9245 143720 -199065 -123457 -88897 50794 -155179 48944 -188544 26583 -215122 -298609 -81005
9233 -141370 -216836 -288207 -154781 27818 70313 -140198 -208815 111329 201486 -358623 -10519
9221 -86052 98168 -134468 -5603 -99559 39323 -173003 56396 -214879 -133067 2081 -261903
9209 -82016 -83767 3399 -66595 96778 -127961 231929 -69082 -112780 225855 -50614 -186475
9198 -186475 -242368 1580 134413 -88709 -162983 -207405 145805 -72184 -302613 -125097 -36676
9186 -153610 -169933 -228316 116763 -155321 -139601 259633 117437 83609 229228 -132266
9175 -184270 -238491 -421213 -130257 -165585 146665 -191103 -142025 7933 -214845 -4784 -239908
9164b39908D9875J35133e4963k5046l29254G4152b89086J02374A56067p5318f610
9152h2606k14523C8588j9094e7857j49226a01535j04884O685G6628h9828K41E3588
9139i9161F0249d1150l686A70105o2644P8648D5905A3134J8922a49671b4657l17168
9127c41825J03781I4148a32025j61688R4560A29422B3449a51548c4863A77184
9116A42216a48906b4557l4815j3845B18248A8987a03027j6851E8870b17682n445
9105b23127B8509K4583a79228A92559K14250j35726b76436A39883A253i6027j0756
9094a06783A54826a31772M6078k07752D8519H537J23018c21348B01522D5145a26103
9082c50535C01779b37762A15854g7772B7524K06424n1587a11670l4212j6125o9177
$$ plain form
9164 -239908 49875 185008 -54963 -80009 -409263 74152 -289086 -186712 156067 80749 -6610
9152 -82606 -297129 38588 19494 -57857 -207083 -101535 -206419 -199734 76628 -89828 -89587 53588
9139 -99161 60249 -41150 -44836 170105 107461 186109 45905 13134 32056 -149671 -24657 -341825
9127 -341825 -238044 94148 -132025 -293713 -199153 129422 23449 -151548 -34863 177184
9116 142216 -148906 -24557 -59372 -73217 218248 18987 -103027 -119878 58870 -217682 -223127
9105 -223127 28509 53092 -179228 192559 406809 271083 -276436 139883 1253 -96027 -106783
9094 -106783 154826 -131772 -85694 -293446 48519 8537 131555 -321348 201522 45145 -126103
9082 -350535 301779 -237762 115854 -77772 27524 233948 182361 -111670 -145882 -162007 -231184
9071b31184E8127c9428A43763f8780n7195b9336C04676g9302B4173K7763a74638
9059a24540C0731a2562q5870B84575f4804B02620b02786j26203a34718j65636
9049c00354j555P0740A5190J66486e1058n9181B67936C0802e8595B6514e8694
9037a21167o292L2825j6664e2965N317G3076J60328G701N2257R9215J7563a53206
9024g8332b9375j31763f6104l5569m8719n8059O268F3295g4202A62866h9179B10112
9011A14928N0149d2869A61030c60467L4752i8329A55947a67647m1618A65955G403
8999A04896c8449m3508j41978A08804c5189k72659l3354B42421a83780E8874Q1773
8988A40647a21177B39644g1964C8635b20852F9790c84472a40921Q797D4747c24288
$$ plain form
9071 -231184 58127 -39428 143763 -68780 -125975 -29336 304676 -79302 24173 51936 -174638
9059 -124540 30731 -12562 -98432 284575 -64804 202620 -202786 -328989 -134718 -300354
9049 -300354 -301909 -231169 15190 181676 -51058 -110239 267936 30802 -58595 26514 -58694
9037 -121167 -127459 -94634 -111298 -52965 -47648 73076 233404 7701 59958 159173 176736 -153206
9024 -78332 -29375 -161138 -66104 -101673 -150392 -208451 -202183 63295 -74202 162866 -89179 210112
9011 114928 165077 -42869 161030 -360467 -325715 -98329 155947 -167647 -209265 165955 7403
8999 104896 -38449 -81957 -223935 108804 -35189 -307848 -341202 242421 -183780 58874 140647
8988 140647 -121177 239644 -71964 38635 -220852 69790 -384472 -140921 -132124 44747 -324288
8976e65079h3350j8031d4368F408K18550b44640m9913J43273A45937a52480f8762
8964a34032o0344l4362a02645A49727c52089b4727k01509I9705h906j59160P001
8953a61065O431m517C37826B3702a0685l61731J15005a09118j7041N2237o8151
8942a42073j06433B86850a13826m3217d3980C09264a11427l17040a41937A28458
8931b60656A90724d86735a18907I8838a31291K9441a068m6264A20866a33864C00876
8919F7631b22060B36382K1729P4997j02458R600A03399a59935A30812J40539J62824
8908D34175l3466L49579M28791N67989K186349M379479l422416B023921q81876
8899A142045m84279m9986J90290B31667P0594G4062J94917j01630K31967Q1651
$$ plain form
8976 -565079 -83350 -101381 -44368 6408 224958 -244640 -294553 -151280 145937 -152480 -68762
8964 -134032 -194376 -228738 -102645 149727 -352089 -24727 -226236 99705 -8906 -168066 -161065
8953 -161065 -154634 -159151 337826 23702 -10685 -372416 -257411 -109118 -126159 -73922 -142073
8942 -142073 -248506 286850 -113826 -157043 -43980 309264 -111427 -428467 -141937 128458
8931 -260656 190724 -486735 -118907 98838 -131291 -101850 -1068 -47332 120866 -133864 300876
8919 67631 -222060 236382 258111 333108 230650 240250 103399 -159935 130812 271351 434175
8908 434175 400709 750288 1179079 1747068 3933417 8312896 4890480 2023921 1142045
8899 1142045 657766 607780 798070 231667 302261 74062 268979 167349 399316 480967
8889D80967q3602a80237l16445b45559q6434B24136h7588k91596g4620a3055B3304
8877h2489K5637M790o2960j83028d751j91305A1385P4566A2598J9364c45371f2639
8864f9836j39131j24435f2568j6936A97103J32014g5675F9253e6506q1681k51151
8853c89338A43625F2468a59236A76283a26844p311P130f2709D3680h9033l01104
8842c90137J12171a4110r2247C62194a60929p3531O6001Q546L1737J9658M39A30333
$$ plain form
8889 480967 397365 -180237 -496682 -245559 -331993 224136 -87588 -379184 -74620 -13055 23304
8877 -82489 -56852 -52062 -115022 -298050 -4751 -196056 11385 85951 12598 31962 -345371 -62639
8864 -69836 -208967 -333402 -62568 -79504 197103 329117 -75675 69253 -56506 -138187 -389338
8853 -389338 143625 62468 -159236 176283 -126844 -134155 -127025 -62709 43680 -89033 -390137
8842 -390137 -277966 -14110 -106357 362194 -160929 -234460 -168459 -159913 -128176 -108518 -108079 130333
$$ [...]
##END NTUPLES=NMR SPECTRUM
##END=
