
##TITLE=AC1191_Casanare-sacama_5898592_LQBaTDzb3T
##JCAMPDX= 6.0         $$ Bruker NMR JCAMP-DX V2.0
##DATA TYPE= NMR SPECTRUM
##DATA CLASS= NTUPLES
##ORIGIN= BRUKER
##OWNER= Administrator
$$ 1.72 TOPSPIN		Version 2.1
$$ 2012-04-03 19:19:15.328 -0500  Administrator@TOPSPIN
$$ Compression mode = diff/dup
##.OBSERVE FREQUENCY= 400.13188235
##.OBSERVE NUCLEUS= ^1H
##.ACQUISITION MODE= SIMULTANEOUS (DQD)
##.ACQUISITION SCHEME= undefined
##.AVERAGES= 8
##.DIGITISER RES= 22
##SPECTROMETER/DATA SYSTEM= spect
##.PULSE SEQUENCE= zg30
##.SOLVENT NAME= COFFEE_meoh
##.SHIFT REFERENCE= INTERNAL, COFFEE_meoh, 1, 14.98061
##AUDIT TRAIL= $$ (NUMBER, WHEN, WHO, WHERE, PROCESS, VERSION, WHAT)
$$ ##TITLE= Audit trail, TOPSPIN		Version 2.1
$$ ##JCAMPDX= 5.01
$$ ##ORIGIN= Bruker BioSpin GmbH
$$ ##OWNER= Administrator
$$ $$ C:\Bruker\TOPSPIN/data/COFFEE/nmr/AC1191_Casanare-sacama_5898592_LQBaTDzb3T/10/pdata/1/auditp.txt
$$ ##AUDIT TRAIL=  $$ (NUMBER, WHEN, WHO, WHERE, PROCESS, VERSION, WHAT)
(   1,<2012-04-03 19:19:08.281 -0500>,<Administrator>,<TOPSPIN>,<go>,<TOPSPIN 2.1>,
      <created by zg
	started at 2012-04-03 19:18:01.796 -0500,
	POWCHK enabled, PULCHK disabled,
       configuration hash MD5:
       1A 1E CE 29 27 FD 77 03 67 4E F0 E3 C4 B2 CB 90
       data hash MD5: 64K
       F2 19 18 AB 69 55 A5 58 64 2A 5C AD 41 30 6B 5F>)
(   2,<2012-04-03 19:19:10.906 -0500>,<Administrator>,<TOPSPIN>,<proc1d>,<TOPSPIN 2.1>,
      <Start of raw data processing
       efp LB = 0 FT_mod = 6 PKNL = 1 PHC0 = 0 PHC1 = 0 SI = 32K 
       data hash MD5: 32K
       22 F4 9D 49 54 C9 6E 4E DF 75 BE E5 3F ED 0E 83>)
(   3,<2012-04-03 19:19:11.359 -0500>,<Administrator>,<TOPSPIN>,<proc1d>,<TOPSPIN 2.1>,
      <pk PHC0 = 214.4037 PHC1 = 0 
       data hash MD5: 32K
       63 0E B9 5E 29 4B 6B 1B 63 7F 32 B9 DD F9 62 A9>)
(   4,<2012-04-03 19:19:11.437 -0500>,<Administrator>,<TOPSPIN>,<proc1d>,<TOPSPIN 2.1>,
      <abs ABSG = 1 
       data hash MD5: 32K
       CB E3 B7 02 86 08 BA 8C 6A 6A 0F 60 3C F7 14 ED>)
(   5,<2012-04-03 19:19:11.468 -0500>,<Administrator>,<TOPSPIN>,<proc1d>,<TOPSPIN 2.1>,
      <abs ABSG = 2 
       data hash MD5: 32K
       99 24 3F C3 48 22 05 C1 69 1E 14 57 EA 15 E3 FA>)
(   6,<2012-04-03 19:19:11.500 -0500>,<Administrator>,<TOPSPIN>,<proc1d>,<TOPSPIN 2.1>,
      <abs ABSG = 3 
       data hash MD5: 32K
       14 48 91 A1 AF B4 AA A2 36 8A 45 AF FA F5 74 5A>)
(   7,<2012-04-03 19:19:11.531 -0500>,<Administrator>,<TOPSPIN>,<proc1d>,<TOPSPIN 2.1>,
      <abs ABSG = 4 
       data hash MD5: 32K
       79 CB D5 F8 B6 4F 10 6E 0D 59 80 18 CD 02 01 1E>)
(   8,<2012-04-03 19:19:11.562 -0500>,<Administrator>,<TOPSPIN>,<proc1d>,<TOPSPIN 2.1>,
      <abs ABSG = 5 
       data hash MD5: 32K
       01 66 0F 48 45 6F 86 36 DF F9 6C C6 6A 63 09 27>)
$$ ##END=
$$ 
$$ $$ hash MD5
$$ $$ 25 3B F5 1E 3C D2 30 3E 41 8E 65 C7 9E E0 97 F8
##$RELAX= 
##$RELAX= 
##$RELAX= 
##$RELAX= 
##$RELAX= 
##$RELAX= 
##$RELAX= 
$$ Bruker specific parameters
$$ --------------------------
$$ [...]
##$TP= (0..7)
150 150 150 150 150 150 150 150
##$TP07= 0
##$TPNAME0= <>
##$TPNAME1= <>
##$TPNAME2= <>
##$TPNAME3= <>
##$TPNAME4= <>
##$TPNAME5= <>
##$TPNAME6= <>
##$TPNAME7= <>
##$TPOAL= (0..7)
0.5 0.5 0.5 0.5 0.5 0.5 0.5 0.5
##$TPOFFS= (0..7)
0 0 0 0 0 0 0 0
##$TUNHIN= 0
##$TUNHOUT= 0
##$TUNXOUT= 0
##$USERA1= <user>
##$USERA2= <user>
##$USERA3= <user>
##$USERA4= <user>
##$USERA5= <user>
##$V9= 5
##$VALIST= <valist>
##$VCLIST= <CCCCCCCCCCCCCCC>
##$VD= 0
##$VDLIST= <DDDDDDDDDDDDDDD>
##$VPLIST= <PPPPPPPPPPPPPPP>
##$VTLIST= <TTTTTTTTTTTTTTT>
##$WBST= 2048
##$WBSW= 25
##$XGAIN= (0..3)
0 0 0 0
##$XL= 0
##$YL= 0
##$YMAX_a= 532873
##$YMIN_a= -644602
##$ZGOPTNS= <>
##$ZL1= 120
##$ZL2= 120
##$ZL3= 120
##$ZL4= 120
##$ABSF1= 14.98061
##$ABSF2= -5.57192
##$ABSG= 5
##$ABSL= 3
##$ALPHA= 0
##$AQORDER= 0
##$ASSFAC= 0
##$ASSFACI= 0
##$ASSFACX= 0
##$ASSWID= 0
##$AUNMP= <proc_prof1d_extract_pilot.lims>
##$AXLEFT= 0
##$AXNAME= <>
##$AXNUC= <1H>
##$AXRIGHT= 0
##$AXTYPE= 0
##$AXUNIT= <>
##$AZFE= 0.1
##$AZFW= 0.1
##$BCFW= 0
##$BC_mod= 0
##$BYTORDP= 0
##$COROFFS= 0
##$CY= 15
##$DATMOD= 1
##$DC= 0
##$DFILT= <>
##$DTYPP= 0
##$F1P= 0
##$F2P= 0
##$FCOR= 0.5
##$FTSIZE= 32768
##$FT_mod= 6
##$GAMMA= 0
##$GB= 0
##$INTBC= 1
##$INTSCL= 1
##$ISEN= 128
##$LB= 0
##$LEV0= 0
##$LPBIN= 0
##$MAXI= 10000
##$MC2= 0
##$MEAN= 0
##$ME_mod= 0
##$MI= 0
##$NCOEF= 0
##$NC_proc= -8
##$NLEV= 6
##$NOISF1= 0
##$NOISF2= 0
##$NSP= 0
##$NTH_PI= 0
##$NZP= 0
##$OFFSET= 14.98061
##$PC= 1
##$PHC0= 214.4037
##$PHC1= 0
##$PH_mod= 1
##$PKNL= yes
##$PPARMOD= 0
##$PPDIAG= 0
##$PPIPTYP= 0
##$PPMPNUM= 2147483647
##$PPRESOL= 1
##$PSCAL= 4
##$PSIGN= 0
##$PYNMP= <proc.py>
##$REVERSE= no
##$SF= 400.13
##$SI= 32768
##$SIGF1= 0
##$SIGF2= 0
##$SINO= 400
##$SIOLD= 32768
##$SPECTYP= <>
##$SREGLST= <1H.CDCl3>
##$SSB= 0
##$STSI= 32768
##$STSR= 0
##$SW_p= 8223.68421052632
##$SYMM= 0
##$S_DEV= 0
##$TDeff= 65536
##$TDoff= 0
##$TI= <>
##$TILT= no
##$TM1= 0
##$TM2= 0
##$TOPLEV= 0
##$USERP1= <user>
##$USERP2= <user>
##$USERP3= <user>
##$USERP4= <user>
##$USERP5= <user>
##$WDW= 1
##$XDIM= 32768
##$YMAX_p= 467075955
##$YMIN_p= -720414
##$CURPLOT= <Network HP LaserJet P1505>
##$CURPRIN= <$Network HP LaserJet P1505>
##$DFORMAT= <normdp>
##$LAYOUT= <+/1D_H.xwp>
##$LFORMAT= <normlp>
##$PFORMAT= <normpl>
##$SURQMSG= 1
$$ End of Bruker specific parameters
$$ ---------------------------------
##NTUPLES= NMR SPECTRUM
##VAR_NAME=  FREQUENCY,     SPECTRUM/REAL,   SPECTRUM/IMAG
##SYMBOL=    X,             R,               I
##VAR_TYPE=  INDEPENDENT,   DEPENDENT,       DEPENDENT
##VAR_FORM=  AFFN,          ASDF,            ASDF
##VAR_DIM=   32768,         32768,           32768
##UNITS=     HZ,            ARBITRARY UNITS, ARBITRARY UNITS
##FACTOR=    0.250966925370066, 1,           1
##FIRST=     8223.43324360095, -127103,      50522
##LAST=      0,             -237604,         -36685
##MIN=       0,             -720414,         0
##MAX=       8223.43324360095, 467075955,    0
$$ Real data points
##PAGE= N=1
##DATA TABLE= (X++(R..R)), XYDATA
$$ [...]
19474A4966a92760B3551g2804C198b05483e3507L370l65550D3994j6140M0913
19463F8767J28125B5123b65460P5902A4300a10400D851e4167g061k19979c8040
19451a2048j85617F298b51649I1851g1380j80666E5687a01654B12562c35518B68806
19439a31528j68949A56501a80450K7557j60479g6212j91113a30365j89603I2252
19428A06086J09145a49429j17040G0001a42470A22891g9125m305k97224Q5234
19418b95420f0220l2306c8865k43407F027a04707k66687B12845b42726D82367
19407e3920A49218h2669c1011C1756J48630H5339a22807k41256C7409a70276a2492
19395d63259e6960n7507c7618A81355a46723j38886A53457N3950a76283K3435
$$ plain form
19474 14966 -192760 23551 -72804 3198 -205483 -53507 -50137 -415687 43994 27854 68767
19463 68767 196892 25123 -265460 -189558 14300 -110400 4851 -54167 -7061 -227040 -38040
19451 -12048 -197665 6298 -251649 91851 -71380 -252046 55687 -101654 212562 -335518 268806
19439 -131528 -300477 156501 -180450 -152893 -313372 -76212 -267325 -130365 -319968 92252
19428 106086 215231 -149429 -266469 70001 -142470 122891 -79125 -83430 -380654 -295420
19418 -295420 -60220 -92526 -38865 -282272 6027 -104707 -371394 212845 -242726 482367
19407 -53920 149218 -82669 -31011 31756 180386 85339 -122807 -364063 37409 -170276 -12492
19395 -463259 -56960 -114467 -37618 181355 -146723 -285609 153457 207407 -176283 -152848
19385a52848l23438A75087a5934l10458j95894a48493I4313b71300M6455c25F7023
19373B3853J48764a17982l71834A09715d358m21141r6067G7961c1423A5152a76129
19361i5807A57722a78436j42497D2398c00657A19416b22277g4137H282i1631B03174
19349C2566J0140a59654j11B5853a67545l05199b11883J5363B00934c25393D1477
19337f3217n4657n4558j8918d7522B82169b29904j1111l8227A20323c0912k43622
19326b74534i2219A21433J00445H512b59068B62614B6724Q9808g7881L0572B59422
19314b5788j15601c2896K305j87457Q087L4022O3105K7113m5791A233c6183k18476
19302b54659q4129a16936k85227B9266J39459e9187H1435A476J10981d44805J38810
$$ plain form
19385 -152848 -476286 175087 -15934 -326392 -522286 -148493 94313 -271300 -224845 -325 67023
19373 23853 172617 -117982 -489816 109715 -4358 -425499 -521566 77961 -31423 15152 -176129
19361 -95807 157722 -178436 -320933 42398 -300657 119416 -222277 -74137 8282 -91631 203174
19349 32566 42706 -159654 -159765 25853 -167545 -472744 -211883 -196520 200934 -325393 41477
19337 -63217 -117874 -172432 -191350 -47522 282169 -229904 -241015 -279242 120323 -30912 -274534
19326 -274534 -92219 121433 221878 8512 -259068 262614 26724 116532 -77881 -47309 259422
19314 -25788 -141389 -32896 -30591 -218048 -209961 -175939 -112834 -85721 -131512 1233 -36183 -254659
19302 -254659 -338788 -116936 -402163 29266 168725 -59187 81435 1476 112457 -444805 -305995
19291c05995J50287A07834b78620G3569c99606J71347G4280d07436c2605k0501
19281e3106p9183A044c1680l4563A38255c0987l42713J58488p1486r8038J76572
19270b08164g4517k16694A03775R9777l9371J36673b12747I7298D0721a54225
19259a9426C2148K2209a65754k7262A8102h6217l7496E165c28504a09078o4550
19248a73628j92048b4859F4814N2710b22873A36660H959A57a97206f1577H4151
19236a99485c2603k66773a24332A64387f7872k29435m851a19745M5963k92456
19226c66238a28739k6243B67091a37521C069J77178H8379a33437m8115k24180
19216d05732K3500J29546B8927a90944m1688d8493A83777b96398e4370B61507
$$ plain form
19291 -305995 -155708 107834 -278620 73569 -399606 -228259 74280 -407436 -32605 -53106
19281 -53106 -132289 1044 -31680 -66243 138255 -30987 -373700 -215212 -286698 -384736 -208164
19270 -208164 -74517 -291211 103775 203552 164181 300854 -212747 97298 40721 -154225
19259 -19426 32148 54357 -165754 -193016 18102 -86217 -123713 5165 -328504 -109078 -173628
19248 -173628 -365676 -24859 64814 117524 -222873 136660 8959 157 -197206 -61577 84151
19236 -199485 -32603 -299376 -124332 164387 -67872 -297307 -302158 -119745 -73782 -366238
19226 -366238 -128739 -154982 267091 -137521 3069 180247 88379 -133437 -181552 -405732
19216 -405732 -382232 -252686 28927 -190944 -232632 -48493 183777 -296398 -54370 261507
19205d0743J6807p3137p5199l96761f2684A38398a51077j37672a28098A52482
19194i7305I9784l6204e6577b2872k07741N2060P8574c7184l04152B35458a91245
19182g9333n8859j43711A0114J53766c6199F5148c34150G4918d22048e950m4067
19171e0017J6127k58096j12645D9698b36398C1112K1926B1154c40557g4140A45891
19159b16336J6192F8907c874p5677c6720l7243n6680C6737J04697b45702A39594
19147a8848F2725d8240j64934h9617D9557a76071j06486g5842A85105A9020a75158
19135d44241C7845a73726L6029A02940g2496a0703E3639a19926j37282A69782
19124B99251b20787j27273M3175B48189a60262A74300h0346b7895A20644i1462
$$ plain form
19205 -40743 -23936 -97073 -172272 -569033 -62684 138398 -151077 -288749 -128098 152482
19194 -97305 99784 63580 -56577 -22872 -230613 -178553 -99979 -37184 -341336 235458 -191245
19182 -79333 -138192 -281903 10114 163880 -36199 65148 -334150 74918 -422048 -5950 -50017
19171 -50017 -33890 -291986 -404631 49698 -236398 31112 53038 21154 -340557 -74140 145891
19159 -216336 -200144 68907 -3874 -79551 -36720 -73963 -130643 36737 141434 -245702 139594
19147 -18848 62725 -48240 -213174 -89617 49557 -176071 -282557 -75842 185105 19020 -175158
19135 -444241 37845 -173726 -137697 102940 -72496 -10703 53639 -119926 -257208 169782
19124 299251 -220787 -348060 -304885 248189 -160262 174300 -80346 -27895 120644 -91462
19113B35475K12919b67958B25813j04718E681a27176I2355b52395P0263e0738
19102c74244J26647B08408i349k24172c6865A03885d18740F3592b61278l7287
19092b98565K0886a23178H7480J51807a78524B41210a48805M7258B96459a58163
19081b00945G095L4814J9440O1298B1778b40031B7145b51115O4243A21158b66184
19069a63176q7958c0888A78909b30086A76512a85903c6140m83447i1009F1528
19058a64459F6550a10769j46549K9647C65551i554m8905I9663d61075g9690H2298
19046D07815a87947I6636J66641j24607D5510b49827A5985b66953A03824P2317
19036A76141p392q1715c07375b7561h799A84573J65918g1269A19232c84663h7048
$$ plain form
19113 235475 448394 -267958 225813 121095 5681 -127176 92355 -252395 -182132 -50738
19102 -374244 -247597 208408 -9349 -233521 -36865 103885 -418740 63592 -261278 -298565
19092 -298565 -277679 -123178 87480 239287 -178524 241210 -148805 -101547 296459 -158163
19081 -200945 7095 41909 61349 122647 21778 -240031 27145 -251115 -186872 121158 -266184
19069 -163176 -251134 -30888 178909 -230086 176512 -185903 -36140 -519587 -91009 61528
19058 -164459 66550 -110769 -257318 -227671 365551 -9554 -58459 99663 -461075 -79690 82298
19046 407815 -187947 96636 263277 138670 45510 -249827 15985 -266953 103824 176141
19036 176141 168749 87034 -307375 -27561 -8799 184573 350491 -71269 119232 -384663 -87048
19024a89491H2552K3720d8698l76463e0719N758q1866o444A08243j2150c99588
19012A06623a87961d5194B21165a34137d2736j12650B62631b04136k25295K05431
19002b24000I4784a7648j09317j86331H4020e2652k4336A90035F8189a22493D4515
18990a1057B57072E5515a2199j44428O7113A23844A6769b346A56755D5998P5562
18979A21560m4222a62411A31576b24048b0729m913m6176r4272C7821L14770A03718
18967C38290H5785f2470l01392b0664l1296E3489g5894B88460o7598L8622r9662
18956A59822J8945p6220a11733B19460a3778j58404c8687A39405b99643A43520
18945E1654a63840N4516A50896e0257B23518b8297l8992B953c41413J847h1214
$$ plain form
19024 -189491 82552 106272 -48698 -425161 -50719 -44961 -126827 -133271 108243 96093 -399588
19012 106623 -187961 -45194 221165 -134137 -42736 -155386 262631 -204136 -429431 -224000
19002 -224000 94784 -17648 -126965 -313296 84020 -52652 -76988 190035 68189 -122493 44515
18990 -11057 257072 55515 -12199 -156627 -89514 123844 16769 -2346 156755 45998 121560
18979 121560 77338 -162411 131576 -224048 -20729 -25642 -71818 -166090 37821 352591 103718
18967 338290 85785 -62470 -363862 -20664 -51960 53489 -75894 288460 220862 259484 159822
18956 159822 178767 102547 -111733 219460 -13778 -172182 -38687 139405 -299643 143520
18945 51654 -163840 -109324 150896 -50257 223518 -28297 -67289 2953 -341413 -339566 -81214
18933a73654K1012g1423A89101b19563R7168G8674J61460A09275b31062a08840
18922A94316a59688l5391o7547J31301O2991E0859J2546i2167A4473b20989f3260
18910E0227J51100b6498B30409a49777B19280h0891b5436j85367e5225k3966A68363
18898G364R2449R2364I3064J66146L60604C4247J68924n1710D6666r084a69486
18886F8047K03946D8362a62762j78752B32875a38776f3445K604l06747B05461
18875I2688J08177G6303b5929k3586k16235E617c15315F9911K62130a46974k01669
18864c48643Q2382a10944o3171c9296k14108C3552J52106b49344J08734B98873
18853A06197a00387a6711A11757a05808r1458E9024h1598j34039b7837q6278B5118
$$ plain form
18933 -173654 -152642 -71423 189101 -219563 -122395 78674 240134 109275 -231062 -108840
18922 194316 -159688 -195079 -262626 -131325 -68334 50859 63405 -92167 14473 -220989 -63260
18910 50227 201327 -26498 230409 -149777 219280 -80891 -25436 -210803 -55225 -79191 168363
18898 7364 99813 192177 93064 259210 619814 34247 203171 151461 46666 37582 -169486
18886 68047 271993 48362 -162762 -341514 232875 -138776 -63445 -60841 -367588 205461
18875 92688 200865 76303 -25929 -49515 -265750 5617 -315315 69911 332041 -146974 -348643
18864 -348643 -266261 -110944 -174115 -39296 -253404 33552 185658 -249344 -140610 298873
18853 106197 -100387 -16711 111757 -105808 -197266 59024 -81598 -215637 -27837 -114115 25118
18841d2562a1146j63545A4237b6058r8671j40533C02157j13746n1295L9907q2127
18830I4896l257D2921m079c21040J55476d8073m5201D6261b83606D2310i8889
18818b88916g7725H2321A7629c01151l5024i571E1770b44435D9327g883j87969
18807a95852I7182a42075D4273d80996H2102a07874A71618Q8097a82715C89066
18796A8519c9658m6377L5760A04047O7906B8524A3603J8750A2616f969k05493
18785b12462K0409A18106D2237J05936o6758d14413a16555B7437a21337r5800
18775b17137g1608J0512j58222J8433M6563B8350b00132M6998K6522K2281F7379
18763B56923E8722K05749a62573L9725J5250q5165A01009c45325b9712j85575
$$ plain form
18841 -42562 -11146 -174691 14237 -26058 -124729 -265262 302157 188411 137116 177023 94896
18830 94896 91639 42921 38842 -321040 -165564 -48073 -93274 46261 -283606 42310 -98889
18818 -288916 -77725 82321 17629 -301151 -336175 -9571 51770 -244435 49327 -7883 -195852
18807 -195852 97182 -142075 44273 -480996 82102 -107874 171618 259715 -182715 389066
18796 18519 -39658 -86035 -50275 104047 171953 28524 13603 32353 12616 -6969 -212462
18785 -212462 -192053 118106 42237 148173 81415 -414413 -116555 27437 -121337 -217137
18775 -217137 -71608 -61096 -219318 -200885 -154322 28350 -200132 -153134 -126612 -104331 67379
18763 256923 58722 264471 -162573 -122848 -107598 -192763 101009 -345325 -29712 -215287
18753b15287j08332f9071l6369d9070A39624b45575M4002N8025A5888a74618h4097
18741b68980b4512l84853G9168f847F7116B8358e184k6921g082A18511k7453b91611
18728H6845b28562F8957b23654D1961J5819f3952m4570j5313m621O1879A61129
18716b29882A42774f6267A9212i2676A5128R6179b53416d1640k6587a3216e313
18704C736N152K21022d31208A97162C6309O7718b9432B33b25975i2555k55382
18693c47937a18306J711h649C3543O1372a78551Q2929A70556m6154i444l27666
18682c37110j6625C1895d59871A4652c2086j67924B03677a03955j01782a02646
18671a07335B4802J21075c204j7375j9521k69931e3904j2061I8932J48438b43939
$$ plain form
18753 -215287 -323619 -69071 -105440 -49070 139624 -245575 -201573 -143548 15888 -174618 -84097
18741 -268980 -24512 -409365 79168 -6847 67116 28358 -5184 -32105 -7082 118511 91058 -291611
18728 86845 -228562 68957 -223654 41961 57780 -63952 -108522 -123835 -128456 -66577 161129
18716 -229882 142774 -66267 19212 -92676 15128 111307 -253416 -41640 -68227 -13216 -5313
18704 3736 8888 229910 -431208 197162 36309 104027 -29432 233 -225975 -92555 -347937
18693 -347937 -118306 -116595 -8649 33543 94915 -178551 -95622 170556 124402 -9444 -337110
18682 -337110 -353735 31895 -459871 14652 -32086 -200010 203677 -103955 -205737 -102646
18671 -107335 24802 145877 -3204 -20579 -40100 -310031 -53904 -65965 98932 247370 -243939
18659C3313J2441c4659j5284l93585l659a44782b4149j97350C45340c68212J75942
18648a92270h212G6823b97594Q9144A4143c51272G1939b56287A20375e00417B8060
18636a30271e7154l75308a22258K3412M1508l48964a02435q8373B76866A2550
18625c50k18903P7487A47274M3685j4753a48612N7087H3407K4889C2237c03906
18613e25864J04079a54185B11088h8104r902j24795j14713B63708b3937p2584
18603i6521j4440j23967a13487j7145m9052e4661A3503J16633J4471F3418L3381
18592I6799b82412A98393b06499G2940d0466k73638N5182J16765A67001D7775
18581a27096M591n6228H2656g1203P20D6074d6993A5984c06311d2765A64349b78335
$$ plain form
18659 33313 45754 -34659 -49943 -443528 -447187 -144782 -24149 -221499 345340 -368212 -192270
18648 -192270 -8212 76823 -297594 -208450 14143 -351272 71939 -256287 120375 -500417 28060
18636 -130271 -57154 -432462 -122258 -98846 -57338 -406302 -102435 -190808 276866 12550
18625 -350 -219253 -141766 147274 190959 176206 -148612 -91525 83407 108296 32237 -303906
18613 -525864 -421785 -154185 211088 -88104 -98006 -222801 -337514 263708 -23937 -96521
18603 -96521 -110961 -234928 -113487 -130632 -179684 -54661 13503 130136 144607 63418 96799
18592 96799 -282412 198393 -206499 72940 -40466 -314104 -258922 -142157 167001 47775
18581 -127096 -122505 -178733 82656 -71203 -70483 46074 -46993 15984 -306311 -42765 164349 -278335
18568b25776i3915n0395b4800B0205c4820M02B1134c5813A05656E0582g2787j66173
18556b38960a10691C17728A2320g027p3600C47900i1392l0602L6917b4082l07576
18545c31658C8347M3677d2881a6198j73875C5443K5932a08229G6603b25567P3033
18534a52534r3882A37030f6194l8209D1419a9341A86188A1355a81179G6103a48217
18522b33728B61435o1784h0744l1085r0601r2343J31533k89347I5603a23500A46839
18510A67778g0452D9848P232l40k5854H333i3922O102k8564j95976J54537B3528
18497b13018D00142F5187G683J62589d1602A36416E4493d06727A40774E5879Q4076
18486A39955i1252m2329e5073j81640A19671J23999b30924D72302G0231b0848
$$ plain form
18568 -225776 -93915 -144310 -24800 20205 -34820 -34418 21134 -35813 105656 50582 -72787 -238960
18556 -238960 -110691 317728 12320 -7027 -80627 347900 -91392 -121994 -85077 -24082 -331658
18545 -331658 38347 82024 -42881 -16198 -190073 35443 61375 -108229 76603 -225567 -152534
18534 -152534 -246416 137030 -66194 -104403 41419 -19341 186188 11355 -181179 76103 -148217
18522 -233728 261435 199651 -80744 -111829 -202430 -294773 -163240 -452587 95603 -123500 146839
18510 167778 -70452 49848 57080 56740 30886 8333 -93922 -87820 -116384 -312360 -157823 23528
18497 -213018 400142 65187 7683 170272 -41602 136416 54493 -406727 140774 55879 139955
18486 139955 -91252 -133581 -55073 -236713 119671 243670 -230924 472302 70231 -20848
18475a38862f8393k9567k17415G1472C64J26844D5223K11500e8006j14416C22811
18463a93703E1150a43752e2258F9030k4128b24715K1430k83298b38511c5530F4370
18451a78971N1289A14339a15407H2001J2268c2397q1874E9827L8386d6E3785d29192
18438i7703a4652j8019A81464a10181F5018c7432G042J38251Q5132C6069a00043
18426H0566a17522o7992c3621l0644r4505p646A53480b29448D7761c21091F1152
18414b47511B54046a37204j87255a49996K6915J7440r5656N0912I2137a04207
18403g0518E0666a24539A26255J2042e686l11098a20849m6110L2126G4201b64165
18391A19491K2578i0285d3305D8838L2220K7317K82687a66686C0006a95410A59735
$$ plain form
18475 -138862 -68393 -97960 -315375 71472 364 127208 45223 256723 -58006 -172422 322811
18463 -193703 51150 -143752 -52258 69030 44902 -224715 -203285 -486583 -238511 -35530 64370
18451 -178971 -127682 114339 -115407 82001 94269 -32397 -114271 59827 98213 -46 53785 -429192
18438 -97703 -14652 -32671 181464 -110181 65018 -37432 7042 145293 230425 36069 -100043
18426 80566 -117522 -185514 -33621 -64265 -158770 -166416 153480 -229448 47761 -321091 61152
18414 -247511 254046 -137204 -324459 -149996 -123081 -105641 -201297 -150385 92137 -104207
18403 -70518 50666 -124539 126255 138297 -5686 -316784 -120849 -166959 -134833 74201 -264165
18391 119491 142069 -90285 -43305 48838 81058 108375 391062 -166686 30006 -195410 159735
18379e7035o8577d2774o7467B76017A07111a01292k13153J16643i6252A03138
18368c04275B06538F1622q574O5116J21011b55516e6703B02461a84897J3612K5964
18357a45321i29j21013A76303a97482C16389b38278P6449g7396j03385A77538
18346F3492P4885O0777a03264C8347L2611R72A2057k49a52181H836b69797G3952
18333b86965j20258A7863J58269A4836a10515A63413G6354g781j35791A02759
18322b04989L2896H31a06717L9326G091P948N5859M5290a76175O5057k07316a24970
18309a82518k58598c5436j01587A3735h3272k77917A62080h2581p9455d235q5708
18298h9943A69966h3059D56178D808J69562q6199B4674Q9663a26502A93464F6641
$$ plain form
18379 -57035 -125612 -42774 -110241 276017 107111 -101292 -314445 -197802 -96252 103138
18368 -304275 206538 61622 53048 118164 239175 -255516 -56703 202461 -184897 -171285 -145321
18357 -145321 -929 -121942 176303 -197482 316389 -238278 -161829 -77396 -180781 177538
18346 63492 138377 199154 -103264 38347 70958 71930 12057 11808 -152181 8836 -269797 73952
18333 -286965 -407223 17863 176132 14836 -110515 163413 76354 -7781 -143572 102759
18322 -204989 -172093 831 -106717 -67391 7091 15039 70898 116188 -176175 -111118 -318434 -124970
18309 -182518 -441116 -35436 -137023 13735 -83272 -361189 162080 -82581 -162036 -4235 -89943
18298 -89943 169966 -83059 456178 4808 174370 88171 24674 114337 -126502 193464 66641
18286i4519j95931M8070J2285C8805a58621L1188j02817A75209n0775a04536b263
18274A3300L5873b28731f0132i598j63450A4259b05245c7468I1892a24022M1371
18263h2651G9578O8743a74893e000l4524m8680M3181k78713A06838j5122c8116
18251a72751A34315i7084K718A55331B3439d0062A12977h8001A59948J01038c31390
18239A31569b28329B28277d9446j80268e8088j24476C6147b06109B57186d31509
18228d8553a8182N236q8429n553k2604A76921b93861G2659r849g6783o627I8232
18215b00070A21350b51054j1611b0289p5868B70470k4052C3512J37190b76957
18204G3058N140O1758l7478b35398i3053L682j70398c2915A28131b59772E7415
$$ plain form
18286 -94519 -290450 -242380 -230095 38805 -158621 -127433 -230250 175209 124434 -104536 -2263
18274 13300 49173 -228731 -60132 -9598 -173048 14259 -205245 -37468 91892 -124022 -82651
18263 -82651 79578 148321 -174893 -5000 -39524 -88204 -45023 -323736 106838 91716 -38116
18251 -172751 134315 -97084 -94366 155331 23439 -40062 112977 -88001 159948 260986 -331390
18239 131569 -228329 228277 -49446 -229714 -58088 -182564 36147 -206109 257186 -431509
18228 -48553 -18182 -12946 -101375 -106928 -129532 176921 -293861 72659 62810 -76783 -83410 98232
18215 -200070 121350 -251054 -262665 -20289 -96157 270470 246418 33512 170702 -276957
18204 73058 78198 139956 102478 -235398 -93053 -89371 -259769 -32915 128131 -259772 57415
18192a08367l1069M8146l5902M8087n4829r1524B09848i1443j10042b0075D5611
18180b29579B94418A35930K29630j66829a78453I4698a00546K1103n9271G7554
18169b74023k18101F8844A9367L8380d8668A76246c4270j36500P9195H087K3352
18158C1439J00836a78184L4823j13356i0970j5120o7297H0314J03318e15913A840
18146A0005K9541b4624k51020A0230g9908m7945D37259f4339J6136A82242a00839
18134f9680I3932a96982B09887b85722J09221A53336b40518O5148D02053a48901
18123g2257A43479b42313Q4749e2024m2690c1841D8778a47276C6070O3778d07558
18111D741a05402A14970J22469a27083Q401A57188o5424A1996J67419a73988Q2998
$$ plain form
18192 -108367 -139436 -91290 -127192 -79105 -133934 -225458 209848 -91443 -201485 -20075 45611
18180 -229579 294418 135930 365560 198731 -178453 94698 -100546 -79443 -138714 77554
18169 -274023 -492124 68844 19367 57747 -48668 176246 -34270 -170770 -91575 8087 31439
18158 31439 132275 -178184 -143361 -256717 -90970 -106090 -173387 80314 183632 -515913 1840
18146 10005 39546 -24624 -275644 10230 -79908 -127853 437259 -64339 -48203 182242 -100839
18134 -69680 93932 -196982 209887 -285722 -176501 153336 -240518 -175370 402053 -148901
18123 -72257 143479 -242313 -157564 -52024 -94714 -31841 48778 -147276 36070 99848 -407558
18111 4741 -105402 114970 237439 -127083 -118682 157188 91764 11996 179415 -173988 -90990
18100i0990B3256a09610F6937A1466a8459B47159q4982a98874P2738j7209f4399
18088B34592G7368g5973A97771E4544J51470a31985O575G8136K4090d53495b19456
18076G6531b10430e6450o1744B46948c7476D2697Q6640a1890j20229H139J37201
18065A45340C6464A7332d5181r255B676h0481j47314A89934B0524K15618O4028
18054C00170b12786e3144K2832G6131a30337J1221A71655h6205C06282F6700d3770
18042A98067m4982o3792a19080j02169G1622i0524r7132E9548b18059R0911g110
18030a92664e6476C3580b03826A33547a97558h3570B16222r5943m2162b27231
18019c2899C47741a5620B34599j14825a14633A0666J13491a32234A94271B3474
$$ plain form
18100 -90990 23256 -109610 66937 11466 -18459 247159 162177 -198874 -126136 -143345 -64399
18088 234592 77368 -75973 197771 54544 206014 -131985 -125410 78136 102226 -453495 -219456
18076 76531 -210430 -56450 -118194 246948 -37476 42697 129337 -11890 -132119 8139 145340
18065 145340 36464 17332 -45181 -54436 2676 -80481 -227795 189934 20524 236142 300170
18054 300170 -212786 -53144 -30312 76131 -130337 -119116 171655 -86205 306282 66700 -43770
18042 198067 153085 89293 -119080 -221249 71622 -90524 -187656 59548 -218059 -127148 -7110
18030 -192664 -56476 33580 -203826 133547 -197558 -83570 216222 120279 78117 -227231
18019 -32899 347741 -15620 234599 119774 -114633 10666 124157 -132234 194271 23474
18008H1617g4102j02278d7784k62680I2781c8376A31448l9314a48830A40518g1120
17996a89669Q8927C15043I9701a36644r6908R547f1397J6572A48256a62638B7974
17984D9107h2626b6112C369R3928A2168b7668o4377A48701B6132J0671N0431a01472
17971c50778I9642m8301R4574a73058A33341l8777R3320b10523E8939i1769k67521
17960c59290G6711K26092H6018f5690C0576J4844a06974c5470G9233i6647k52525
17949c49172g8378a773k3967B610a03121A1265b1833C5737D708L72146j46162
17938B30692c21882f0264G4323a05184l7574O0568A12331N2660J61908j05651
17928B21248a58775D1995G561J93090q9665J94427b3342n0838B97495D1305M581
$$ plain form
18008 81617 -74102 -176380 -47784 -310464 92781 -38376 131448 92134 -148830 140518 -71120
17996 -189669 -100742 315043 99701 -136644 -233552 -224005 -61397 -44825 148256 -162638 27974
17984 49107 -82626 -26112 3369 97297 12168 -27668 -92045 148701 26132 36803 87234 -101472
17971 -350778 99642 51341 145915 -173058 133341 94564 187884 -210523 58939 -91769 -359290
17960 -359290 76711 302803 86018 -65690 30576 45420 -106974 -35470 79233 -96647 -349172
17949 -349172 -78378 -1773 -25740 2610 -103121 11265 -21833 35737 4708 376854 230692
17938 230692 -321882 -60264 74323 -105184 -142758 -82190 112331 164991 326899 221248
17928 221248 -158775 41995 7561 200651 110986 305413 -23342 -74180 297495 41305 45886
17917D5886K81928b58513F8281a70867c8997A23502J18998I1894p002e1373E39920
17905a43036A10537a41590G7182f1939B05873m8740n1682K01896H1842g2655C07093
17893A2226a19950l0095C742b1931H2923A014b20115e1050A14370d88928A19223
17881g5978A73896J6684f089A59206H458J7157a25167o7360A03724O1564E0949
17869D474J03408J77269c17459b9891G4918i3753j116B57823c98733E7267a56843
17857A57176h190H3277J50358I1119C9182L73812a91701g6204K9460A07910G588
17845C43451C8533J05937a14449I7594a65014k2946e6640F947f6187P351I6809
17833b27155B01749J89635b75704A84528A1997b97768D8654K35702H1088J16939
$$ plain form
17917 45886 327814 -258513 68281 -170867 -38997 123502 242500 91894 84892 -51373 539920
17905 -143036 110537 -141590 77182 -61939 205873 157133 105451 307347 81842 -72655 307093
17893 12226 -119950 -150045 3742 -21931 82923 1014 -220115 -51050 114370 -488928 119223
17881 -75978 173896 190580 -6089 159206 8458 25615 -125167 -192527 103724 165288 50949
17869 4474 107882 285151 -317459 -29891 74918 -93753 -94869 257823 -398733 57267 -156843
17857 157176 -8190 83277 233635 91119 39182 412994 -191701 -76204 -46744 107910 7588
17845 343451 38533 144470 -114449 97594 -165014 -187960 -56640 6947 -66187 -58836 96809
17833 -227155 201749 391384 -275704 184528 11997 -297768 48654 284356 81088 198027
17823A98027q506Q5146g4693r4713d7672b3742B9985a09222M4356K1619D0850
17811A8119Q5616J51239c01935f666B14439g6467B27967r581d36495B35822d8600
17799B433Q7899a4668A55639J62549m0327D4835b41152B65503h1305A4632a78662
17787A48537b444j99743A20190K04046b86779a26411e6909A58233L15744a71743
17776A57771N6474b01378A38095e7060B08775B2282K85064a4397B53367f5819
17765B19222c2742j08976A98108A6993G269J32850b12206B0861Q4915b7109A29189
17753B08557g6606A16988k9630K18766c4160E44072B52479a52965A89600a34156
17742F2164a29334G8765a43058D8568J94903A8383b24148e4102B98277E5121B0529
$$ plain form
17823 198027 189521 274667 -74693 -169406 -47672 -23742 29985 -109222 -64866 -43247 40850
17811 18119 103735 254974 -301935 -6666 214439 -76467 227967 218386 -436495 235822 -48600
17799 2433 90332 -14668 155639 318188 277861 44835 -241152 265503 -81305 14632 -178662
17787 148537 -2444 -202187 120190 324236 -286779 -126411 -56909 158233 473977 -171743
17776 157771 214245 -201378 138095 -57060 208775 22282 307346 -14397 253367 -65819
17765 219222 -32742 -141718 198108 16993 7269 140119 -212206 20861 105776 -27109 129189
17753 208557 -76606 116988 87358 306124 -34160 544072 252479 -152965 189600 -134156
17742 62164 -129334 78765 -143058 48568 243471 18383 -224148 -54102 298277 55121 20529
17730A50187D2256A5951b9845B9809K35072G2815K8690M6148J22576B8694i7057
17718h507A30440g2794L0455n6336D8194J81483b61936i6728D6313G648J31531
17707A39179B7996g42B08923a10293A16008J01346J37643a0929B62580b52309
17696g2166l5354K4858B730a10915B54199c37413B9920J63454n3087d8352B57642
17684C22609J7970j56071i4075A0937M5322K33456F8120J02473b4761m2589j9490
17673h6840b4864A15824J86525l5328d5046F253L8666i7643B44116a56121j26345
17662b82466E3970b4771l15832a55913d8688B31645F435e8689D2999K18329C4054
17650D12580d9248B11445j04933m2812K47094c371j27708j23169C90365i9834
$$ plain form
17730 150187 42256 15951 -29845 29809 264881 72815 101505 147653 270229 28694 -97057
17718 -8507 130440 -72794 -42339 -98675 48194 229677 -261936 -96728 46313 7648 139179
17707 139179 27996 -742 208923 -110293 116008 217354 354997 -10929 262580 -252309
17696 -72166 -107520 -82662 2730 -110915 254199 -337413 29920 193374 140287 -48352 257642
17684 322609 340579 184508 -94075 10937 56259 289715 68120 170593 -24761 -67350 -86840
17673 -86840 -24864 115824 302349 267021 -45046 6253 44919 -97643 244116 -156121 -282466
17662 -282466 53970 -24771 -340603 -155913 -48688 231645 6435 -58689 42999 261328 34054
17650 412580 -49248 211445 106512 63700 310794 -3371 -131079 -254248 390365 -99834
17639i160H580a42616J1981G844M2016P8363E2159J23446j1132F6305L99880C3365
17626a37398j19417b922G1483a80751d6047A89502M2683B1360J37109M8241J46848
17615C53558a33027C07618h7940b6265C37841a04498A88790K07270H0015c7254
17604i1006c9123B89776r852l1566h5876a4376I0435K9917c30101A9557O3577
17593H3134K49460j7268A18357J64181F7281R7169o1841L26319c04464a7289F380
17581F3528h5480B49624E1916L30827j02883M6236j3667B8076O9598N586c8445
17569A13926a32262B14603N5861B879a39883B11047b09344C98872A30712K48625
17559C79337A35432J84057q0745c05358a26456B2343J64017j0334M1261a59894
$$ plain form
17639 -9160 8580 -142616 -130635 7844 49860 128223 52159 175605 164473 66305 466185 33365
17626 -137398 -256815 -2922 71483 -180751 -46047 189502 232185 21360 158469 206710 353558
17615 353558 -133027 307618 -87940 -26265 337841 -104498 188790 396060 80015 -37254
17604 -91006 -39123 289776 279924 248358 -85876 -14376 90435 120352 -330101 19557 83134
17593 83134 332594 315326 118357 282538 67281 164450 102609 428928 -304464 -17289 6380
17581 63528 -85480 249624 51916 382743 279860 326096 312429 28076 97674 103260 -38445
17569 113926 -132262 214603 270464 2879 -139883 211047 -209344 398872 130712 379337
17559 379337 135432 319489 238744 -305358 -126456 22343 186360 176026 217287 -159894
17548i3427C99181E4716f34C56622K20719j53846l7260n8445K71912k39454j61583
17537A98665i2411C26225O375A54138G0350J95883k9009J10968J0964E0435J54846
17526B05281J78239A7562L324N5763a77585C96951A9346K73250J02249A76007
17515E33466k19694L35549k2655j92384J88555K56506j4470J54846l63193N3819
17505G10345C18997J44939B23583O6536J51832o0678q6149O4862K524K75691K78580
17494I16781J51071K5887j80107l92610o7845J34917P1141A81353L34345A80772
17483A84896M2296O5227q1043q3812K37614j52181p6537R7771K17183A17269N57296
17472F74565A76852k5455n1800J43001A0357L67839j68138J41565j22414J09944
$$ plain form
17548 -93427 399181 54716 -634 356622 577341 423495 386235 327790 599702 360248 198665
17537 198665 -92411 326225 332600 154138 70350 266233 237224 348192 359156 50435 205281
17526 205281 383520 17562 20886 76649 -177585 396951 19346 292596 394845 176007
17515 533466 313772 649321 626666 434282 622837 879343 864873 1019719 656526 710345
17505 710345 318997 463936 223583 290119 441951 381273 295124 359986 362510 638201 916781
17494 916781 1067852 1093739 913632 521022 453177 588094 659235 181353 515698 180772
17483 184896 227192 292419 211376 127564 365178 212997 136460 234231 451414 117269 674565
17472 674565 176852 151397 99597 242598 10357 378196 210058 351623 229209 339153
17462C39153o4069p127J89072j37263D4215K18329K31765d1625B34581A02700
17451B40744N7119A32213L17554P1008l126A3874M02669A31195m1713r228b9837
17439A76177M4271K18857A09484J08487M6180J60355B07334J93487o6254O8585
17429D03152o0085n0707J84254G944L9613L33944R4248k0168j41364j15694L16066
17418E14589H7516N0915J26087K33705A73667n9082P5685k4355r738O5578K83015
17407E04770j03370P7286B27281o6941J69354N2422o3722h3813B77824o8557k8001
17396A81266O7509K68643E2297K16382j28993l5243J05427P3565A20213M5786
17386A65999R1352A03437N2785L08640p2616j95704J56217j61588n0265K16644
$$ plain form
17462 339153 275084 267957 457029 319766 44215 262544 494309 -41625 234581 102700
17451 240744 297863 132213 449767 520775 517649 13874 416543 131195 89482 80254 -29837
17439 176177 220448 439305 109484 217971 264151 424506 207334 400821 334567 403152
17429 403152 343067 292360 476614 7944 47557 381501 475749 455581 314217 198523 514589
17418 514589 87516 138431 264518 498223 173667 114585 190270 165915 156177 221755 504770
17407 504770 401400 478686 227281 160340 329694 382116 318394 -83813 277824 209267 181266
17396 181266 248775 517418 52297 268679 139686 104443 209870 283435 120213 165999
17386 165999 257351 103437 156222 464862 392246 196542 352759 191171 140906 357550
17376C57550j27875J81001A69430J8485g0547B03351j7203P0009j26976K35553
17366C64734H3212a07656A58409N8521q1932M06790j24937j29607M738l3429L5702
17355B94255r9761J48118K7095A03225L18447j32646o1527N1165j18908M4226
17345B03982L35136a35504C30210k5425k8919j27528B6348N1816A7006K31320
17335B48326q4278j9481Q5955k9725K39628A10518J02359R8048j32924Q5328K6268
17324B89597J75352k09764H2069j0965N02574q6446D1359J11333A8006M30378
17314D48384J38908j83972e0882C69374J18286k11924J61574I7379J18581R6361
17304C12321G3601J99633A32261M57675B90551c8761G3377J39808J30578k6773
$$ plain form
17376 357550 229675 410676 169430 187915 -70547 203351 186148 256157 129181 364734
17366 364734 83212 -107656 158409 216930 134998 541788 416851 287244 291982 258553 294255
17355 294255 194494 342612 369707 103225 421672 289026 227499 278664 159756 203982
17345 203982 539118 -135504 330210 304785 275866 148338 26348 78164 17006 248326
17335 248326 164048 144567 230522 200797 440425 110518 212877 310925 178001 263329 289597
17324 289597 464949 255185 82069 71104 573678 487232 41359 152692 18006 448384
17314 448384 587292 403320 -50882 369374 487660 275736 437310 97379 215960 312321
17304 312321 73601 273234 132261 589936 290551 -38761 73377 213185 343763 316990
17294C16990H5057K53055J16791A41452o6702J93470p6625K2274I6742J50153
17284B46895K58710j39017j33568D0166L16504J59974B53339A17653J78727J32462
17274D28842H4884J76331k4293N3441o9147J23136I5621L40802j63408J1364e4843
17262E4663O71209l35344l0357j8167J61313B51088n7523J77280P0147k10934
17252B30058J46751r1164J64700j78906J41433O0223N0262k48284J93920j43121
17242C25872N0229G2295R8079J13257O440R1921J50816j27473j46371n2594L89740
17231E96110O4245A76244m6212L1805o4989J31784J26595M5710o9060N2117A42446
17219C70538J30071j29942J72677B57659l1633L65150k31976j10361m275L3123
$$ plain form
17294 316990 85057 338112 454903 141452 74750 268220 191595 213869 96742 246895
17284 246895 505605 366588 233020 40166 356670 516644 253339 117653 296380 428842
17274 428842 84884 261215 236922 290363 221216 344352 95621 436423 273015 284379 -54843
17262 54663 725872 390528 360171 342004 503317 251088 193565 370845 440992 230058
17252 230058 376809 285645 450345 271439 412872 473095 523357 275073 468993 325872
17242 325872 376101 72295 170374 283631 290071 381992 532808 405335 258964 206370 596110
17231 596110 660355 176244 130032 161837 96848 228632 355227 400937 331877 383994 142446
17219 370538 500609 370667 543344 257659 226026 591176 359200 248839 244564 277687
17209B77687j02737N9822J51202j85712J61327j47572J31534L22511l20057J64299
17199E12304J24699B89501A04040K1471K21664j2205r9496K92510k50740K18759
17189D96003q6453J65630L0554j83171r2211M7673M0765J33981J73279k02047
17179E24003k13212L7353A67976J19317J91951J23605B78017R4126A63226N25903
17169F89129l34350Q520k2955J41928p5984J68989o8798M52345B45949J90777
17159D36726n1147A79668M13201B61527l1476J90267J69312r3208K6558N7451
17149E80431J88639C46209K34454K09993l43260n2754K788K25637k04596j47702
17139B70769q3259N41003j49385j16386j32562N2827L84216j11936l27246K70717
$$ plain form
17209 277687 174950 234772 385974 200262 361589 214017 345551 668062 348005 512304
17199 512304 637003 289501 104040 125511 347175 334970 235474 527984 277244 496003
17189 496003 409550 575180 605734 422563 330352 378025 418790 552771 726050 524003
17179 524003 310791 348144 167976 287293 479244 602849 278017 372143 163226 689129
17169 689129 354779 363299 340344 482272 406288 575277 506479 958824 245949 436726
17159 436726 385579 179668 592869 261527 230051 420318 589630 496422 522980 580431
17149 580431 769070 346209 580663 790656 447396 394642 397430 623067 418471 270769
17139 270769 187510 728513 579128 462742 330180 383007 767223 655287 328041 598758
17129E98758k07391L40731k80524m4335J50934J00000p3466J31592k65051q2124
17119C69124J0482L49580p6674B54672N27214l36716o9300L57504C37673M69654
17109H07327j10605N67N5840A52662L40755P8392J8329Q9346r9828J16958L06741
17098A003355m84886J94893j77531K57052k42791q5035R8897j17654j58050L92837
17088F81087k6678j29669J15048k20240N52685J23040D95781j23497L37976J74259
17078H84519C08181L64975k30743J65405R4085J27779B76101L37420Q6296K91810
17068I91627j13596j15978J37923n3615l59291K78768k08514L03210C38963L76141
17058G15104J04597l04802n4471N227J57016Q5890J60065j75098k01472J55655
$$ plain form
17129 598758 391367 732098 451574 407239 558173 658173 584707 716299 451248 369124
17119 369124 379606 729186 652512 254672 781886 445170 375870 733374 337673 807327
17109 807327 696722 697289 753129 152662 493417 571809 590138 679484 579656 696614 1003355
17098 1003355 518469 713362 535831 792883 550092 465057 563954 446300 288250 681087
17088 681087 654409 524740 639788 419548 972233 1095273 495781 372284 710260 884519
17078 884519 308181 673156 442413 607818 701903 829682 276101 613521 699817 991627
17068 991627 878031 762053 899976 846361 487070 765838 557324 860534 338963 715104
17058 715104 819701 514899 460428 465655 622671 708561 868626 693528 492056 647711
17048F47711n9481J85365j88826K90535k49799J12298J70488j19144M659j32759
17038F61047J72344j66731N5925K38568j45076r8856j0934L94528k10443o3448
17028H26924j48614K74447K36596E44457Q1732N2675j82515N53575k3799j55531
17018H70594M655k1316J69991l56953J05516o7096N05432l40763J16042K509k6495
17007I62116j74528K88074l50911J68061K39658k82953K85090Q5387j48775j96193
16997H75026L63642M0714k23577j00519K38833J7664m39137J73966K13644j91396
16987I68860K61325n6765J23720k57865P9717L9005J455k27320L43628J30509
16977A406269l52522N43385l63525J94456l2655k47032K11339k51444K26806l3962
$$ plain form
17048 647711 588230 773595 584769 875304 625505 737803 908291 789147 793806 661047
17038 661047 833391 666660 722585 961153 816077 717221 706287 1100815 890372 826924
17028 826924 678310 952757 1189353 544457 626189 678864 496349 1049924 1026125 870594
17018 870594 875249 853933 1023924 666971 772487 705391 1210823 870060 986102 988611 962116
17007 962116 787588 1075662 724751 892812 1132470 849517 1134607 1219994 1071219 875026
16997 875026 1238668 1279382 1055805 955286 1194119 1211783 772646 946612 1160256 968860
16987 968860 1230185 1173420 1297140 1039275 1118992 1157997 1159452 932132 1275760 1406269
16977 1406269 1053747 1597132 1233607 1428063 1395408 1148376 1359715 1108271 1335077 1301115
16967A301115j43205K27089J54181p1341m36449J99617J59724l08767L41293K0114
16957A443371K53508m99467K05560N7901O7700j07130J42749n7048M519K08631
16947A720294j44146j4276l37096K35088K9604J10456p10o2294Q4927j3496k09595
16936A398756K31272k1865P4317j39024M55119k76813O5787J30407j62019J19282
16926A875219J80045k26555J18195n8474P1049O9288j37237j11866m0385K34699
16916A973978j37637L61646J73267m77409R1222j32093L77877o6143j60454L77961
16906B382215k64098P8172K19149j07999J6829l2326J37065n9433Q1707J01999
16896B553280j88327r3152K32867J84979n32698J48981K08587J99469j45670L63046
$$ plain form
16967 1301115 1157910 1384999 1539180 1467839 1031390 1231007 1390731 1081964 1423257 1443371
16957 1443371 1696879 1197412 1402972 1460873 1528573 1421443 1564192 1507144 1511663 1720294
16947 1720294 1576148 1561872 1224776 1459864 1489468 1599924 1599214 1536920 1621847 1608351 1398756
16936 1398756 1630028 1608163 1682480 1543456 1998575 1721762 1787549 1917956 1755937 1875219
16926 1875219 2055264 1828709 1946904 1888430 1959479 2028767 1891530 1779664 1739279 1973978
16916 1973978 1836341 2197987 2371254 1893845 1985067 1852974 2230851 2164708 2004254 2382215
16906 2382215 2118117 2196289 2415438 2307439 2324268 2291942 2429007 2369574 2451281 2553280
16896 2553280 2364953 2271801 2504668 2689647 2156949 2305930 2514517 2713986 2568316 2931362
16886B931362M8333l02644J50790p0508K26723k94359L85687j21056n961M2774
16876B991141P5949J78314j257l80297J54624L28997l1506R0734J8248K63513
16866C688460l66054L00370J9852l06111L78525Q109J69330k54316K43841J0600
16856C892606M1272J92826k32821K93318j54483k14500J82943K90425K49854j2140
16846D529300o3301J36707J26578j12318k8778J82196J03872J77916O1439k09722
16836D903889j27324L61659j48682L80471L1711q3207J04316J33390n2007K95590
16826E799806Q0964n3250L87227K80646j79422J51003o112J67827k974J20641
16816F746356M19585L06317j77255K30898k05643M64746l6357J79886L09549J34948
$$ plain form
16886 2931362 2979695 2677051 2827841 2757333 2984056 2689697 3075384 2954328 2948367 2991141
16876 2991141 3067090 3245404 3244147 2863850 3018474 3347471 3315965 3406699 3424947 3688460
16866 3688460 3322406 3622776 3642628 3336517 3715042 3723151 3892481 3638165 3882006 3892606
16856 3892606 3933878 4126704 3893883 4187201 4032718 3818218 4001161 4291586 4541440 4529300
16846 4529300 4465999 4602706 4729284 4616966 4588188 4770384 4874256 5052172 5113611 4903889
16836 4903889 4776565 5138224 4989542 5370013 5401724 5318517 5422833 5556223 5504216 5799806
16826 5799806 5880770 5827520 6214747 6495393 6315971 6466974 6460862 6628689 6625715 6746356
16816 6746356 7165941 7472258 7295003 7525901 7320258 7785004 7748647 7928533 8238082 8373030
16806H373030j90263O81874j31411K02107P9382K23068K04969L31534k22838P26573
16796A0278025j49048J89101J86813M58096J09311K44395M05974N8675K38239
16787A2019581N50723K80439j52798O96591L70271j31284O59097N95923K20229
16778A5108772K64386L77315N03187M53798L25748L15662Q08240l32180J083527
16769A8908455O12342L93642P80513O40117N10425N51480J022059N98533K92058
16760B4309624P35177R73387J146663N90859P37913O80869J232142J107289J007628
16751C2521551J136509J082067J649241R29297J374513J434403J092842J893002
16743D3113425J739140J465881J977577J748800K051728J808350K171105J979565
$$ plain form
16806 8373030 8182767 8864641 8733230 8935337 9014719 9237787 9442756 9774290 9551452 10278025
16796 10278025 10128977 10318078 10504891 10962987 11072298 11316693 11722667 11781342 12019581
16787 12019581 12570304 12850743 12697945 13394536 13764807 13633523 14292620 14888543 15108772
16778 15108772 15373158 15750473 16253660 16707458 17033206 17348868 18157108 17824928 18908455
16769 18908455 19520797 19914439 20694952 21335069 21845494 22396974 23419033 24017566 24309624
16760 24309624 25044801 26018188 27164851 27755710 28493623 29174492 30406634 31513923 32521551
16751 32521551 33658060 34740127 36389368 37318665 38693178 40127581 41220423 43113425
16743 43113425 44852565 46318446 48296023 50044823 52096551 53904901 56076006 58055571
16735E8055571K458006K272160K420332K224755K960880L218621K435419L054740
16727G9100484K934754L338791K969618L448785L156158L449025L150811L079364
16719A04627790L322719L055877L147488K858639K711258K597603K663494K082501
16711A27067369J938815J501898J105919Q98550M96433L6291j82806k82170j318905
16702A31261394j252860k006030j868157k216576k485054k764202l270679k851057
16694A12546779l404561k991833l455102l533372l449497l119978l446217l245120
16686H5901099k968859l363218l261668k848813l016522k215640k728457k611007
16678F2886915k151392k789812j918263k188340k191866k060276k082638j442916
$$ plain form
16735 58055571 60513577 62785737 65206069 67430824 70391704 73610325 76045744 79100484
16727 79100484 82035238 85374029 88343647 91792432 94948590 98397615 101548426 104627790
16719 104627790 107950509 111006386 114153874 117012513 119723771 122321374 124984868 127067369
16711 127067369 129006184 130508082 131614001 132512551 133008984 133045275 132862469 132580299 131261394
16702 131261394 130008534 128002504 126134347 123917771 121432717 118668515 115397836 112546779
16694 112546779 109142218 106150385 102695283 99161911 95712414 92592436 89146219 85901099
16686 85901099 82932240 79569022 76307354 73458541 70442019 68226379 65497922 62886915
16678 62886915 60735523 57945711 56027448 53839108 51647242 49586966 47504328 46061412
16670D6061412j639632j950951j611733j588390j303554j190358j478929j172833
16662C4125032q85230j406894j038865j035500j038324r54706p54940p03270j129634
16653B5177669m31477q38134o40832j067295n88446p62761m30666m23585k40855
16644A9753618p77307n51064p76906j24896p50939l68784k41102o05923m14653
16635A5142044l83672j43682k29896q86574K26992n43602n52481q6107n82844
16626A1960178l50038K08071m46688n5121m66190J75379n49124K5322l84187l67774
16616I749828k52574j6674k71361m15956j26283k59391J70693l41335k61298K68980
16606H244629n78839n1539J53284m64205k04429j02845j08671R6078n01610M28797
$$ plain form
16670 46061412 44421780 42470829 40859096 39270706 37967152 36776794 35297865 34125032
16662 34125032 33239802 31832908 30794043 29758543 28720219 27765513 27010573 26307303 25177669
16653 25177669 24746192 23908058 23267226 22199931 21611485 20848724 20418058 19994473 19753618
16644 19753618 18976311 18425247 17648341 17523445 16772506 16403722 16162620 15556697 15142044
16635 15142044 14758372 14614690 14384794 13498220 13725212 13181610 12629129 12543022 11960178
16626 11960178 11610140 11818211 11371523 11316402 10850212 11025591 10476467 10501789 10117602 9749828
16616 9749828 9497254 9480580 9209219 8793263 8666980 8407589 8578282 8236947 7975649 8244629
16606 8244629 7665790 7614251 7767535 7303330 7098901 6996056 6887385 6983463 6481853 6910650
16596F910650p40783L60121k93059j85360r8809j28916K2032O7969q5091k99381
16586E529373J4003l6126J09884l51229l4279M0378k50050J25932O0070k83313
16576D924643j02652l00041o7836K59106j00021k73644P6949J41446n58340K98264
16566D297874j35040j15616J45201k41373K38005k75937J69651l02368J39412
16557C919809j55950k62914k17246q377J90184j87113j59452J17278r1367M09928
16547C554780n87275J15268N5090k32699K61626n9366l71478j86127N9090N69360
16537C178269l36500J04932m44539K33136L87944j82521l59154K32826k1445j52368
16527B640580P9620O2019j9921l83634k8065J39992p9067j28603M1148j45710
$$ plain form
16596 6910650 6169867 6529988 6236929 6051569 5952760 5823844 5845876 5913845 5828754 5529373
16586 5529373 5543376 5507250 5617134 5265905 5231626 5272004 5021954 5147886 5207956 4924643
16576 4924643 4821991 4521950 4454114 4713220 4613199 4339555 4416504 4557950 3999610 4297874
16566 4297874 4162834 4047218 4192419 3951046 4189051 3913114 4082765 3780397 3919809
16557 3919809 3763859 3500945 3283699 3275322 3465506 3278393 3118941 3236219 3144852 3554780
16547 3554780 2967505 3082773 3137863 2905164 3166790 3107424 2735946 2549819 2608909 3178269
16537 3178269 2841769 2946701 2502162 2735298 3123242 2940721 2581567 2814393 2792948 2640580
16527 2640580 2720200 2782219 2762298 2378664 2350599 2490591 2411524 2282921 2324069 2178359
16517B178359L76206l04078J01709L5035m81968r7774M33009m12669K50924J81482
16507B260235j21822q7250L30850l32407j96753K38444k50258K82159l25048K1311
16497A819461K48557l18427M567k44777M42665K76870n36347J64057j19959K17536
16487A954203l15819p9377L62840l71417M5985J54270j34366P9091K81487l06301
16477A670596J38282m56125J85489o6203L23993n36228M23140k91356J69872k11831
16467A349629L39319j13216j45358O2299M1048Q7103l06917J82733l64316L81741
16457A514065k55856K99822l86182K15588P1258k51988K7586j8465j40552P4215
16447A149491k20870K41117J77980k78908j2028J64409L26279m76980K7438j2013
$$ plain form
16517 2178359 2554565 2250487 2352196 2387231 1905263 1807489 2240498 1827829 2078753 2260235
16507 2260235 2138413 2051163 2382013 2049606 1852853 2091297 1841039 2123198 1798150 1819461
16497 1819461 2068018 1749591 1754158 1509381 1952046 2228916 1692569 1856626 1736667 1954203
16487 1954203 1638384 1559007 1921847 1550430 1596415 1750685 1616319 1695410 1976897 1670596
16477 1670596 1808878 1352753 1538242 1472039 1796032 1259804 1682944 1391588 1561460 1349629
16467 1349629 1688948 1575732 1430374 1492673 1533721 1620824 1313907 1496640 1132324 1514065
16457 1514065 1258209 1558031 1171849 1387437 1458695 1206707 1234293 1215828 1075276 1149491
16447 1149491 928621 1169738 1347718 1068810 1056782 1221191 1547470 1070490 1097928 1085915
16437A085915K46141l15568J74270n02724O00046j32171o2945K88300k05159L136
16427A179241J68820l61457K586J12983l2341o6493k98395J08542R3260j9037
16417H87709k24090J32835M9917J11843Q4316K44355j31980k49784K70598k60345
16407I15374J98181j84847j21515m3056O0211l27526P41041k63993J24422k38684
16397H59608K40196k01525j08645l9722j49939L49177j13321p4112n2613K42015
16387I51119j0834K623o7168J02696J8119N3385l60140j24348J7363J87868j41657
16376F29026L98480l82252J68740j24178n0881L8244j48473N1011R5105p612j74021
16365D93189K41804j97305J31509L90021j75436q5335k55361K00056K04450l21713
$$ plain form
16437 1085915 1332056 1016488 1190758 688034 1288080 1155909 1092964 1381264 1176105 1179241
16427 1179241 1348061 986604 989190 1102173 1069832 1003339 704944 813486 906746 887709
16417 887709 663619 796454 846371 958214 1042530 1286885 1154905 905121 1175719 915374
16407 915374 1113555 928708 807193 764137 824348 496822 1237863 973870 1098292 859608
16397 859608 1099804 898279 789634 749912 599973 949150 835829 761717 709104 951119
16387 951119 940285 942908 875740 978436 996555 1049940 689800 565452 582815 770683 629026
16376 629026 1027506 645254 813994 689816 638935 677179 528706 579717 674822 667210 493189
16365 493189 734993 537688 669197 1059218 883782 798447 543086 743142 947592 625879
16355F25879P2748O3616j44859j32428M35004m01716K37024r3291j36621M6854
16345E72210J47954j96146J52225k7395l1344K537J04906j09185M6973p4407P9276
16334F67604j59250N20973k18132l58334K6506P0704o1066j58361J55684K38636
16324G24964L1926p4359R2144j42947k4445P351B33486L24432A47994O88721j89542
16313F47173p0355j95977J67664L6157l1873J21900k55265R2186K2310J12622
16303F46542K173C02619l4921N3843J83171H3973J22120R45449D42998P738J0399
16292D61135L3097A79536L15275A31135N46612l29600q5746N63252k75737A68925
16281F93796k08899k729L58041B50679R1793l47L03106j77401A92400L9294K50033
$$ plain form
16355 625879 698627 762243 617384 484956 919960 518244 755268 661977 525356 572210
16345 572210 720164 524018 676243 648848 617504 620041 724947 615762 662735 588328 667604
16334 667604 508354 1029327 811195 452861 479367 550071 489005 330644 486328 724964
16324 724964 756890 682531 774675 631728 607283 614634 233486 557918 147994 836715 647173
16313 647173 576818 380841 548505 584662 552789 674689 419424 511610 533920 646542
16303 646542 648715 302619 267698 321541 504712 83973 206093 1151542 442998 450736 461135
16292 461135 494232 179536 494811 131135 677747 348147 262401 825653 549916 168925
16281 693796 484897 482168 840209 250679 342472 342125 645231 467830 192400 231694 481727
16270D81727n0646L3044r2640A22168M93613B69248L02797k1002B69181K76966
16260E46147j6697L51283b18069A30280K05180Q3463D2135L51230q2088A39014
16249B44809L07802J76223C49228L2909n7708L00838k8086k13155M0316j4294
16239D10048j20237a40841D94109M1243j94706J07878m659J57937l0641B71397
16228f8064C20514k3008K13639j10405k2975j39794M61039k89671G0982O83040
16218G54022B96107O9552j04585O3150J72479j70227J85147j51218j64159N47418
16208G43664B61327J01272j19921A3258L68631K6266j36159q404l6122I0254l4541
16197E5713L93879J03470A86635K67227Q1604N6525B80266m1469L64292B13954
$$ plain form
16270 481727 431081 464125 371485 122168 615781 269248 572045 551043 269181 546147
16260 546147 529450 880733 -218069 130280 335460 418923 42135 393365 311277 139014
16249 244809 552611 728834 349228 382137 324429 625267 597181 384026 424342 410048
16239 410048 289811 -140841 494109 535352 340646 448524 443865 601802 571161 271397
16228 -68064 320514 297506 511145 400740 377765 237971 699010 409339 70982 754022
16218 754022 296107 365659 261074 324224 496703 326476 511623 360405 196246 743664
16208 743664 261327 362599 242678 13258 381889 408155 271996 263592 227470 90254 55713
16197 55713 449592 553062 186635 453862 535466 591991 280266 238797 603089 213954
16186D01045H5679L58301q8186J42311F0279K94520q484o7776A04063K2024N1972
16175A78059J04398r1723J22388A25834P1425K0352g6108C86530p4986H9362K27016
16164C16378A46797k2436N06667j62419l9058j63582L3482p8079a39831A35718
16153F2930J72774E1889Q0796J08594P8534m1358L3952I6627P2624c97310A037
16141A6794J643K48880K51646A03049m0097N1203K42057j68454Q2649g0062D35524
16129a4793B9488K22847K267j10490a27655N8981I9079g7621D7174i7700B06359
16117A84801m5760D3832L70262A09903Q1186l3568D5634N6151J76940A6463e1621
16105A76809N7616I2357K17754a00135j22385A13380J13311q9957b1888P37r2829
$$ plain form
16186 401045 85679 443980 355794 498105 60279 354799 346315 278539 104063 126087 178059
16175 178059 282457 190734 313122 125834 197259 217611 -76108 386530 311544 89362 316378
16164 316378 146797 124361 631028 468609 429551 265969 299451 221372 -139831 135718
16153 62930 235704 51889 132685 241279 319813 278455 312407 96627 169251 -397310 1037
16141 16794 18437 267317 518963 103049 62952 114155 356212 187758 270407 -70062 435524
16129 -14793 29488 252335 254602 144112 -127655 -68674 99079 -77621 47174 -97700 206359
16117 184801 139041 43832 414094 109903 191089 157521 45634 101785 278725 16463 -51621
16105 176809 234425 92357 310111 -100135 -222520 113380 226691 136734 -21888 -21151 -113980
16094a13980A66526m3856K3624e3251A78174D3596K31133F3453a16635B93246
16083G4679P0842l4649K18148b6231H3535i3801F9585b39440c3770A34564N5571
16072A90135E1121a8635B6409K93679p2151C1242N1107L35433m4182j01003I0929
16060b39406A85945m9848g9703I2091K51136A6062K08622k4833j4517i5746o9993
16049a65739P2931D87102B1598J76325B815M4268c7444C7481K1613c9557I6744
16037b4508j35824D8806e6005B00137J63284c6162l6137A50384a96740B54890
16026B26171a78210C5365N7357J18428E6078J99334D399c08417f0269j60475B68046
16014D2781J75104p9157a90477A20110c1148B355a33398O6273B17036N8243n1676
$$ plain form
16094 -113980 166526 122670 146294 -53251 178174 43596 274729 63453 -116635 293246
16083 74679 145521 110872 329020 -26231 83535 -93801 69585 -239440 -33770 134564 190135
16072 190135 51121 -18635 26409 320088 247937 31242 82349 417782 373600 272597 90929
16060 -239406 185945 136097 -79703 92091 343227 16062 224684 199851 185334 -95746 -165739
16049 -165739 -92808 487102 21598 197923 2815 47083 -37444 37481 59094 -39557 96744
16037 -24508 -160332 48806 -56005 200137 363421 -36162 -72299 150384 -196740 254890
16026 226171 -178210 35365 92722 211150 56078 255412 4399 -308417 -60269 -220744 268046
16014 42781 217885 138728 -190477 120110 -31148 2355 -133398 -67125 217036 275279 223603
16003B23603c6795l7184A22630K2263o5743J95184a81297B9485b20930E77225
15992C16899n2067D9673K3933a10759k1900B95826b1898A24183h2882b6610o0550
15981h7160M990c6714A03357J94982E201J77852b2053B37846K53619r165K6113
15970E08413L7458K71819M5186M62891n73574k24493A66831K01241j12741j25696
15960A29635Q5111r7416c38602J6606a3414k9142C54761i9775k02537e9400p7569
15949a36969A36776q945a57871L9996B52275D1086b17512A78880c70488J69350
15939b01138C0122J7538K20362b53649a06447A63533M8336a584j75851B7547J38030
15928A65577i1872l2733c5429F7490b90499E8266b37540A97921E6529N6150a41127
$$ plain form
16003 223603 -36795 -73979 122630 144893 79150 274334 -181297 29485 -220930 577225
15992 316899 264832 49673 73606 -110759 -132659 295826 -21898 124183 -82882 -26610 -87160
15981 -87160 -82170 -36714 103357 298339 5201 183053 -22053 237846 491465 482300 508413
15970 508413 545871 817690 862876 1325767 752193 527700 166831 368072 255331 129635
15960 129635 214746 117330 -338602 -321996 -13414 -42556 354761 -99775 -302312 -59400 -136969
15949 -136969 136776 127831 -157871 -117875 252275 41086 -217512 178880 -370488 -201138
15939 -201138 30122 47660 268022 -253649 -106447 163533 211869 -1584 -177435 27547 165577
15928 165577 -91872 -124605 -35429 67490 -290499 58266 -237540 197921 56529 112679 -141127
15916A14859J78987C0019A0285a92911F4620d433A74797p3085a50938r1730R6681
15905a45987I8468c1312j99236e9595k2354D25J20764k6632R3877a25377A11528
15893A99602a64413B60961C9472d61289B0997a50465d652B29619e2028p1957A3541
15881a10807k5416n3718r9826F9277d4527m5038q1830B87417f4623A11829a08583
15869a87039G4019b01598E7541J3931J30713c4605A0646Q1464J48183b68588A14594
15857a60564d7477C3636c8261B59326a84538P1378A99080J02761H2844H308Q8247
15846I6555b6435j79664I8937a45587A36720m8925b5727j48805H5606N2615c01221
15834b3877k7964D6262k2440b17091c072r5447o1926j66391A83254b8683B39945
$$ plain form
15916 114859 293846 30019 10285 -192911 64620 -4433 174797 101712 -150938 -242668 -145987
15905 -145987 98468 -31312 -230548 -59595 -81949 425 121189 94557 188434 -125377 111528
15893 199602 -164413 260961 39472 -461289 20997 -150465 -4652 229619 -52028 -123985 13541
15881 -110807 -136223 -189941 -289767 69277 -44527 -89565 -171395 287417 -64623 111829 -108583
15869 -187039 74019 -201598 57541 71472 202185 -34605 10646 92110 240293 -268588 114594
15857 -160564 -47477 33636 -38261 259326 -184538 -113160 199080 301841 82844 8308 96555
15846 96555 -26435 -206099 98937 -145587 136720 87795 -25727 -174532 85606 138221 -301221
15834 -23877 -51841 46262 23822 -217091 -3072 -98519 -160445 -326836 183254 -28683 239945
15822c9172r2046L9227l90512A0780a945p7490q4856M4267k43488G4817j7726
15811E7091A9094J9486i8795D9377K7775J7876P6232a13458m5254P0540D0064
15799E9564a50294L1710A69209a18240B33405e6953k33116A59947d7274r4206
15789a41480d2431I259m414b05109k33592a80208f5847m9691A09527L41134d925
15777a25613b8251j92210D6595J64872h3256k0465I6370c5168J6915B1443a00730
15765c2900A16139j735a50628P3733k47272B61844A8938r135Q2384B1772a30754
15753a22493A94152b35349A7229a04250L7057O250q1492C36215e910F4820K20592
15742B85412A29558J9847n6534D6220J00188k9512m081m6527a29315j0925b2702
$$ plain form
15822 -39172 -131218 -91991 -482503 10780 -1945 -79435 -164291 -120024 -363512 74817 57091
15811 57091 19094 38580 -98795 49377 77152 95028 171260 -113458 -158712 -88172 40064
15799 59564 -150294 -118584 169209 -118240 233405 -56953 -290069 159947 -47274 -141480
15789 -141480 -42431 9259 4845 -205109 -438701 -180208 -65847 -115538 109527 450661 -4925
15777 -125613 -28251 -220461 46595 211467 -83256 -103721 96370 -35168 -18253 21443 -100730
15765 -32900 116139 114404 -150628 -76895 -324167 261844 18938 9803 92187 21772 -130754
15753 -122493 194152 -235349 17229 -104250 -67193 -60943 -142435 336215 -5910 64820 285412
15742 285412 129558 149405 92871 46220 146408 116896 112815 66288 -129315 -140240 -22702
15730C9523b49924D91080G4703b18640J7948h2124A07327N1850a68436k47614
15720d16050a14405n3332h1312C28237G3619h0319p0962A48989o3106a47613A71628
15708a62540j92055h3007l2812n2315H8364b23741F2822f7267j36447P5654e7631
15696b7170D0580e4274A0301L9328K10367A04570J07171b37668A42155K62140
15686D04295B0305J08456m718c1622m2639B25177j07824O3864G8017K7671g0051
15674a85855H8356d4926A51583a37185N3793H6103c0586J0328k25686b9108A00975
15662a26661f148p6016j0119a0364k01822C16929E1356Q620d262p5410A21383
15650C6647a32868A92133b31611J921a2964G8018O5687b59845I1645J11634o2304
$$ plain form
15730 39523 -249924 491080 74703 -218640 -200692 -82124 107327 159177 -168436 -416050
15720 -416050 -114405 -167737 -81312 328237 73619 -80319 -151281 148989 85883 -147613 171628
15708 -162540 -354595 -83007 -115819 -168134 88364 -223741 62822 -67267 -203714 -128060 -57631
15696 -27170 40580 -54274 10301 49629 259996 104570 211741 -237668 142155 404295
15686 404295 20305 128761 124043 -31622 -74261 225177 117353 181217 78017 105688 -70051
15674 -185855 88356 -44926 151583 -137185 -83392 86103 -30586 -20258 -245944 -29108 100975
15662 -126661 -6148 -82164 -92283 -10364 -212186 316929 51356 59976 -4262 -79672 121383
15650 36647 -132868 192133 -231611 -229690 -12964 78018 143705 -259845 91645 203279 140975
15639A40975a65372B08783D6897b69964a23230q7356p533d9649E7677l743b74177
15627A02883i6599A55123b88128A53388G1369K14435a41568H6257A6473c9667
15616H4334a66412c2924B1634K05134b93741B11744a21818d0171A2566a9912I567
15604a78299C4594b49400c846r5961p0210f9575k22120o6845g4740k8516J0804
15593i2452N741A384d15B65552i8176H4899c429A96105a05987A39576a99451j1485
15581b10936B89985a33842A16263c34637J34860k1459b9404A13877l4507P8127
15571A57497a12641e0672m0182B39792a57743L820O9015b8244b178m39419i1108
15559A8391P2216a35882a7717j06210J7352I4779B1051K2760J55707A7534a70808
$$ plain form
15639 140975 -165372 208783 46897 -269964 -123230 -210586 -218119 -49649 57677 53934 -274177
15627 102883 -96599 155123 -288128 153388 71369 285804 -141568 86257 16473 -39667
15616 84334 -166412 -32924 21634 226768 -293741 211744 -121818 -40171 12566 -19912 9567
15604 -178299 34594 -249400 -3846 -99807 -170017 -69575 -291695 -358540 -74740 -103256 -92452
15593 -92452 -86711 1384 -415 265552 -98176 84899 -3429 196105 -105987 139576 -199451 -210936
15581 -210936 289985 -133842 116263 -334637 -199777 -221236 -29404 113877 79370 157497
15571 157497 -112641 -50672 -90854 239792 -157743 -153923 -84908 -28244 -2178 -441597 -91108
15559 18391 90607 -135882 -17717 -123927 -106575 94779 21051 43811 199518 17534 -170808
15547f5742o8313A88197g3790B10153d7023B5890J47206a66682B99746q3038E0911
15535a98351b8494l41175A041h1030K1412F9841f3543N298a980I9370J4644L27653
15523D41667A87894a56791F303O7048J15553a99660c0528o1782A69666r692A4596
15511g4349k6848A20449K47325b3830j5620I5477C5034L4303L9286J36903c3697
15499E2399c3535D03225a64373f8731A28701g6657J457g430A74030J74140j60315
15488A87855F0181k8328J38845a99245C25570j19021L0045B6293M06987j80586
15478B52694b8583A26400F0234h9476A42574B142K33870H0218a63345E2874J53059
15467B05933q4296K7887J6489i332A80100H768a7138D03866J7094j60850L4423
$$ plain form
15547 -65742 -134055 188197 -73790 210153 -47023 25890 173096 -166682 299746 216708 50911
15535 -198351 -28494 -369669 1041 -81030 -59618 69841 -63543 -58245 -1980 99370 114014 441667
15523 441667 187894 -156791 6303 73351 188904 -199660 -30528 -92310 169666 159974 14596
15511 -74349 -101197 120449 367774 -23830 -39450 95477 35034 69337 108623 245526 -33697
15499 52399 -33535 403225 -164373 -68731 128701 -76657 -75200 -7430 174030 348170 187855
15488 187855 60181 31853 170698 -199245 325570 206549 236594 26293 433280 252694
15478 252694 -28583 126400 60234 -89476 142574 2142 236012 80218 -163345 52874 205933
15467 205933 121637 149524 166013 -9332 180100 8768 -17138 403866 420960 260110 294533
15456B94533P8124q4961R5854G6680a37733B51087f3830j29984e5180C4660J16002
15445A50662a52391N597b7055A25256K4185E0174M30047B7716J22976l1378k1655
15434I7659J36209E8583c710A05925P9930K54038M0612J60718J28915J18572n0312
15423H38398l15557l3603k17605j30952f3924A60862i0804A231L37331b22887
15412A87448P3857H2295h7766k6607J7129k1783D2599b6812l0357k39400A40032
15400A16780D6451a00251a9870r5655K0434k6435B00609c76270a7587j59481Q4405
15389i2663B4467e72070c7928B98859j23950o2783m3046d45262A4857c5437A42133
15377a593A09740J37684A8529J70413D1947b28989J11776b5611m393C30012a92359
$$ plain form
15456 294533 372657 287696 383550 76680 -137733 251087 -63830 -193814 -55180 34660 150662
15445 150662 -152391 -146794 -27055 125256 149441 50174 480221 27716 150692 119314 97659
15434 97659 233868 58583 -3710 105925 185855 439893 480505 641223 770138 888710 838398
15423 838398 522841 489238 271633 140681 -63924 160862 -90804 1231 338562 -222887
15412 187448 261305 82295 -87766 -114373 -97244 -119027 42599 -26812 -57169 -296569 140032
15400 116780 46451 -100251 -19870 -115525 -95091 -121526 200609 -376270 -17587 -177068 -92663
15389 -92663 24467 -572070 -37928 298859 174909 112126 69080 -445262 14857 -35437 142133
15377 -1593 109740 247424 18529 188942 41947 -228989 -117213 -25611 -30004 330012 -192359
15365I2285K09007a65411c4163k68814c2159A21705h9486A80537J57870K82295
15355F20702E4414J70602N3006c7916A43520G1372I244K69824n036N231G6810
15343A28577k7312a33102A99220Q6461E1360K35542J41827A99014E5030J03682
15333A58712P3185r8729J18457J26120L9874q6883r4440G9082K52586M0620H5005
15321d5199a9072G6561J9729a82408A14487n3515L05654b62519B19707f5355C01792
15309A09027J10132j08991J71866A36476i3268A53254L2322J35599J10560a1360
15298D59292g2811F06450A83872e7992A01900J37964J12920a85967A39672P8734
15288B18406F9466L452C412a29333B76291b23190C8852c0880A17769h3244k413
$$ plain form
15365 92285 301292 -165411 -34163 -302977 -32159 121705 -89486 180537 338407 620702
15355 620702 54414 225016 278022 -37916 143520 71372 9244 279068 274032 279263 76810
15343 128577 101265 -133102 199220 285681 51360 286902 428729 199014 55030 158712
15333 158712 231897 133168 251625 377745 417619 330736 236296 79082 331668 372288 85005
15321 -45199 -19072 76561 96290 -182408 114487 60972 366626 -262519 219707 -65355 301792
15309 109027 219159 110168 282034 136476 -93268 153254 185576 321175 431735 -11360
15298 459292 -72811 606450 183872 -57992 101900 239864 352784 -185967 139672 218406
15288 218406 69466 72918 3412 -129333 276291 -223190 38852 -30880 117769 -83244 -85657
15277h5657m2904D56455b02565A80323p1637a23769B39163n627g372A68435D0223
15265h1506B43141a18643k63900C07689A23409a15626M9074i162E4575M7482J46925
15254B48982E4608b18940N4775Q1313a9383A38106a33836A18091D728Q4431R5345
15243A84504a16304A81123K0861a80496D30053c8411q3878A26383D2862M65542
15233E08404j69780K14607c6936C48088L5301N79614N26622F19725Q53959l26963
15223A146721E58043A70713J61829a19986E2521j8943K9443k9439b08604B59225
15212A2799a36004e1759q888A15847e57314E8162K22415a50870c2828B92170D4974
15200c27870A67182K23992P085a15826A99433K34787G411J79661O1641a85036
$$ plain form
15277 -85657 -128561 456455 -202565 180323 108686 -123769 239163 233536 -7372 168435 40223
15265 -81506 243141 -118643 -382543 307689 123409 -115626 -66552 -9162 54575 102057 248982
15254 248982 54608 -218940 -164165 -82852 -19383 138106 -133836 118091 4728 89159 184504
15243 184504 -116304 181123 201984 -180496 430053 -38411 -122289 126383 42862 508404
15233 508404 338624 553231 -36936 348088 383389 963003 1489625 619725 1473684 1146721
15223 1146721 558043 170713 332542 -119986 52521 33578 63021 33582 -208604 259225
15212 12799 -136004 -51759 -60647 115847 -557314 58162 280577 -150870 -32828 292170 44974
15200 -327870 167182 391174 398259 -115826 199433 434220 7411 187072 248713 -185036
15189A03694a20487D67108c5649Q510A70014n6078l8150L6322b02563e7635C2744
15177A30908l7284d9222j30993Q2428C10217F0655I202R8381O2749J36951b80918
15165C79897j16998Q7310C7825L15653a53336a5243A15710h6429B68262C6491
15154f2890B84717A09293O0422J85418a71781B63897b1546A72644K8473J76108
15144C77225A71922C4569b3200F43896b7165C14420A0920P6752N834k7952J40389
15133B05943J2601g6186k26319g5956j35205G7602R5156J19833j29203G364a74697
15121F7529d945C53197I4567J26094H4381f2035C31063c3642A29917c0823C950
15109a38267B75285R2196J19844a8411C77196j3785A14833J64514r4905M5354
$$ plain form
15189 103694 -120487 467108 -35649 -27139 170014 113936 75786 112108 -202563 -57635 32744
15177 130908 93624 -49222 -180215 -97787 310217 60655 9202 107583 170332 307283 -280918
15165 379897 262899 350209 37825 353478 -153336 -15243 115710 -86429 268262 36491
15154 -62890 284717 109293 169715 355133 -171781 263897 -21546 172644 201117 377225
15144 377225 171922 34569 -23200 643896 -27165 314420 10920 87672 93506 65554 205943
15133 205943 218544 -76186 -302505 -75956 -211161 77602 172758 292591 163388 7364 -174697
15121 67529 -4945 353197 94567 220661 84381 -62035 331063 -33642 129917 -30823 3950
15109 -138267 275285 367481 487325 -18411 377196 363411 114833 279347 184442 229796
15099B29796C077J63824E5355K02343j05067K41618A50849J20889q8283e167j40167
15088a45334B15768A1955R9208O4745L15237B10812p6536d493k86607A74835J93910
15077C68745r72A73650P8566B7023d77135A07575D0302h706B02179E1632M252
15066E5884K67891a00087C51122J23755B12784B3583J54257m2634n2562M26713
15056E09357C8728M34374E8640J4826L65879j09320j17998f7898A52484j7387
15046A35097J24755K451J23317D4125K85241K06672k11877l0120A05255m9710
15036E5545L95752j66277Q3446J80229j00909k8184o7773r343D928L33900J30815
15025D69643j93150M4239o3168m4434K30180A60547J00460J85140j30643L44972
$$ plain form
15099 229796 3077 166901 55355 257698 152631 394249 150849 271738 183455 -5167 -145334
15088 -145334 215768 11955 111163 175908 491145 210812 134276 -4493 -291100 174835 368745
15077 368745 367773 173650 252216 27023 -477135 107575 40302 -8706 202179 51632 55884
15066 55884 323775 -100087 351122 474877 212784 23583 177840 135206 82644 509357
15056 509357 38728 473102 58640 73466 439345 330025 212027 -67898 152484 135097
15046 135097 259852 262303 385620 44125 329366 536038 324161 294041 105255 55545
15036 55545 451297 285020 368466 548695 447786 419602 351829 342486 4928 338828 469643
15025 469643 276493 320732 257564 213130 443310 160547 261007 446147 315504 660476
15015F60476J9323J53705j61795J18082k85157K72572j11903k58770n1960J17060
15005D71633J26586A11770N11911j62342j40691P5771J71860H8083J14100J82604
14995C84787J30189L1462p1492j6819o0728J07452k15352N25228k51622K81267
14985H44372k20329j11472j49427A74607K70261M50106D14592O5539j6147R7185
14975E61169N1570j10402j19875K11439K7119k39984K96141l28737L76608l3402
14965F91646J85779l2272k08737R6612j55723J93812k03822k82260M55612l09147
14955D31500R3926j04947l3017J6211r5387D6413K12545K6532O0260r7730J39170
14944C87190J45077J5595k32420P3421N0853B17607J59936A80919O7389R6875
$$ plain form
15015 660476 679799 833504 671709 789791 504634 777206 665303 406533 354573 471633
15005 471633 598219 111770 623681 461339 320648 396419 568279 88083 202183 384787
14995 384787 514976 546438 474946 458127 397399 504851 289499 814727 563105 844372
14985 844372 624043 512571 363144 174607 444868 894974 414592 480131 463984 561169
14975 561169 612739 502337 382462 593901 621020 381036 677177 348440 725048 691646
14965 691646 877425 845153 636416 733028 577305 771117 567295 285035 740647 431500
14955 431500 525426 420479 387462 403673 308286 46413 258958 285490 345750 248020 387190
14944 387190 532267 547862 315442 388863 439716 217607 377543 180919 248308 345183
14934C45183A60840O3992J90290A10548N8268L63463B09564K16801r6050L41912
14924F72227j97920P7709B56987J79054L02553j18391J45786P111J19551j40020
14914G52631M52666O037p7622Q6187M22436n6737L31511l23411N54387o22677
14904A525408l0786L09431L00664j49017J89888k61035o7668k18091l83572N7432
14894A272654j92778k98548J41938C17492K89439O9148l7006j33525A63232K67708
14884D30940P29998D23173J7570n9096M0457K02343A05420M81750P374p2779J27329
14873F49094B96234l4150L06249M17348l24904J89068J25671k26541k42151L31407
14863H38231l33494K68723K21194j78459m7190l66157q0013N853K35982J71505
$$ plain form
14934 345183 160840 224832 415122 110548 168816 532279 209564 426365 330315 672227
14924 672227 474307 552016 256987 436041 738594 620203 765989 773100 892651 752631
14914 752631 1205297 1211334 1133712 1219899 1642335 1585598 1917109 1593698 2148085 1525408
14904 1525408 1494622 1804053 2104717 1955700 2145588 1884553 1816885 1598794 1215222 1272654
14894 1272654 1079876 781328 923266 317492 606931 676079 639073 505548 163232 430940
14884 430940 1160938 423173 440743 381647 422104 624447 105420 587170 594544 521765 649094
14873 649094 296234 262084 568333 985681 660777 849845 975516 748975 506824 838231
14863 838231 504737 773460 994654 816195 769005 402848 322835 328688 564670 736175
14853G36175n2709k76736J69955L22748k30111k57302j40581M79979B24418L55300
14843E79718K22729j81624k85239K48115k30904K63702B67681J55095M17332A69161
14832E49471K93982j26641B00294O34995n3877N7190M33657j38884j31762J31235
14822A132848p6508j50963J76610E03889R3685j13974K86739B28110J06275J48206
14812D82591K21833k44437k9009J94412k09679K31242j07182K25511k10176J55655
14802G10761m7143J81447j29983k44044j90086L80067p7096J80739k9599j75480
14792E59583K81374k01444j1348K63281j70590j29676M67093C37548O23760r747
14782I51561j08178Q8254l98764A87023M90335j14383k5032k38416L11136k7829
$$ plain form
14853 736175 683466 406730 576685 899433 669322 412020 271439 751418 224418 579718
14843 579718 802447 620823 335584 583699 352795 616497 267681 422776 840108 169161
14832 549471 843453 716812 200294 835289 781412 838602 1272259 1133375 1001613 1132848
14822 1132848 1056340 905377 1081987 503889 597574 483600 770339 228110 334385 482591
14812 482591 704424 459987 430978 625390 415711 646953 539771 765282 555106 710761
14802 710761 663618 845065 715082 471038 280952 661019 583923 764662 735063 559583
14792 559583 840957 639513 628165 891446 720856 591180 1058273 337548 961308 951561
14782 951561 843383 931637 532873 187023 677358 562975 537943 299527 610663 582834
14772E82834K18258r7093j40257m7019K03770C53661K49940B49445N30069q2584
14762F96930J1800J63067k17579L07287R4796J74220F09923J05272n9961O4219
14752G19453K06058j25952j92416L9705J32033J34840l16727K63242m5362J12757
14742I27631p8068j7498o5551j67141L5505B67603K17313J28608K26469j16207
14732G23786R6267j27519k08059Q5797K38959j16568k78013L98802k86661J88292
14722G15083k6467L70059l80879r8959K60916K83719J54611l40784K37268q5041
14712A089526N82418r0294K77742m5750j57255j86371l61085L45O9904J41097
14702A320277m71402q4795L98209j63238M59076m48082p1326l5290j92877J01075
$$ plain form
14772 582834 801092 703999 563742 516723 720493 353661 603601 249445 779514 696930
14762 696930 708730 871797 654218 961505 1056301 1230521 609923 715195 655234 719453
14752 719453 925511 799559 607143 646848 778881 913721 596994 860236 814874 927631
14742 927631 849563 832065 766514 599373 634878 267603 484916 613524 839993 723786
14732 723786 820053 692534 484475 570272 809231 692663 414650 813452 526791 715083
14722 715083 688616 1058675 677796 578837 839753 1123472 1278083 937299 1174567 1089526
14712 1089526 1671944 1581650 1859392 1813642 1656387 1470016 1108931 1109276 1179180 1320277
14702 1320277 848875 764080 1162289 999051 1458127 1010045 938719 903429 710552 811627
14692H11627O0256L98136o9327n2480j508K01144R3717M16244j50940K03172n46969
14681A363072j90112L5303k69297M5341j98113O4475O7268j45356M2954J89128
14671A004663J40120j99819j1339R5030k46365L82762l93007N63527l28885Q3468
14661A090155j23964k63044L27995J0951m51211L46185J66602j61823L04862p0852
14651A175856J93101j41706k80810K93903J68797l24603j646L43722l50095k6898
14641A049621K8640m9841Q1173J02537l01306N36935j62541l0477p237j34987
14631A112517P1735M5976K4233m2079K14657l44279J90614q5233K2303q8247j02224
14620A019973L03935n5061j88700J02940K53516l83369K97275k19694J58814m0305
$$ plain form
14692 811627 871883 1270019 1200692 1148212 1146704 1347848 1441565 1857809 1706869 1910041 1363072
14681 1363072 1172960 1208263 938966 984307 786194 850669 917937 772581 815535 1004663
14671 1004663 1144783 944964 933625 1028655 782290 1165052 772045 1335572 1006687 1090155
14661 1090155 966191 703147 1031142 1042093 590882 937067 1103669 941846 1246708 1175856
14651 1175856 1368957 1227251 946441 1240344 1409141 1084538 1082892 1426614 1076519 1049621
14641 1049621 1078261 1028420 1109593 1212130 910824 1447759 1285218 1254741 1247504 1112517
14631 1112517 1184252 1230228 1254461 1212382 1427039 1082760 1273374 1188141 1210444 1122197 1019973
14620 1019973 1323908 1268847 1080147 1183087 1436603 1053234 1350509 1130815 1289629 1249324
14610A249324J31664l631K5586J05161j05537L35502o48728K95429k56894M04425
14600A532301j54328K03521m75401L48659j51012K69626M7115j91307J48900k68909
14590A309165O4534Q9827J29086J70047K8438k20018P8414K4532j22451J13191
14580A664765j15591p9060M15822p853M8013j79066q6530J04168k81317R6757
14570A580108L67252j24375K36990l17118J21834R3633q6275J59564L05012k75770
14560B060855J90311l9188l96328K64065K33428j05035J46724M9308k15540M72755
14550B661355l26707J96443k13876L76661J51614J90682K00543R9147j5355N5183
14540C375690L90613J39577O19962O91987R49039R70607K127077L358773O253422
$$ plain form
14610 1249324 1380988 1377357 1402943 1508104 1402567 1738069 1089341 1384770 1127876 1532301
14600 1532301 1377973 1581494 1106093 1454752 1303740 1573366 1620481 1429174 1578074 1309165
14590 1309165 1373699 1463526 1592612 1762659 1791097 1571079 1649493 1674025 1551574 1664765
14580 1664765 1549174 1470114 1885936 1878083 1926096 1747030 1660500 1764668 1483351 1580108
14570 1580108 1947360 1822985 2059975 1742857 1864691 1958324 1872049 2031613 2336625 2060855
14560 2060855 2251166 2211978 1815650 2079715 2313143 2208108 2354832 2404140 2188600 2661355
14550 2661355 2334648 2531091 2317215 2693876 2845490 3036172 3236715 3335862 3320507 3375690
14540 3375690 3766303 3905880 4525842 5217829 6166868 7137475 9264552 12623325 18876747
14531A8876747R753724O387604j4204020q677816m409600k274852q47026J42738
14523D747499R1752j180627p63688k20481m24892o4530k88208N27115j41340M7722
14513B330322J59269j96147M79O3683n1908j97248P48926k96284J79018n11480
14503B228630J01238J54623J8390j02343L17067K74374j37164P5804k79324J82742
14493B834037L1299J79783l5910L60704m17996J19491M8898q288J0437j04105
14483C018350L77623r7888k75995M34333j00520M29859j08115k30001j99142R2421
14473C340925K25776K4265L1444n8319k5212J07121N18787l50625L12055l63851
14463C762366R7523L67909j85894K49595q9012K46463m22841M17082K808j02737
$$ plain form
14531 18876747 28630471 35018075 20814055 12136239 7726639 5451787 4604761 4747499
14523 4747499 4839251 3658624 2894936 2674455 2249563 2185033 1896825 2423940 2282600 2330322
14513 2330322 2489591 2293444 2293923 2357606 2305698 2108450 2857376 2561092 2740110 2228630
14503 2228630 2329868 2484491 2502881 2400538 2717605 2991979 2854815 2930619 2651295 2834037
14493 2834037 2865336 3045119 3009209 3369913 2951917 3071408 3120306 3112018 3122455 3018350
14483 3018350 3395973 3298085 3022090 3456423 3355903 3785762 3677647 3447646 3248504 3340925
14473 3340925 3566701 3590966 3622410 3564091 3538879 3646000 4164787 3814162 4126217 3762366
14463 3762366 3859889 4227798 4041904 4291499 4202487 4448950 4026109 4443191 4445999 4343262
14453D343262L2969J42038L96088k70152n7696j17398J82726p5010L30753O6280
14443D973860M0921J47250m6367j00727K50475j05938K90921o4607K99691l1295
14433E654184j36758n8707M86957m14691O00146j56148K21554k49246L38162j73993
14423F111460K68433M1139J9120m6572L54853j58792K5784J58750M30323n0270
14413G154228L4927N9662L02001j11477N64951k89632L43138J37639J8292K17350
14403H431079K61527j50474M92490L02917l60052M2767L41308k48158M75921j87024
14393I402301L56321j0034M86064q1920j2059L25545L20486L97881j19080P4752
14383A1140257q0700J96598O74521n5181j49777M91079K78962j79851J97690L59999
$$ plain form
14453 4343262 4376231 4518269 4914357 4644205 4586509 4469111 4651837 4576827 4907580 4973860
14443 4973860 5014781 5162031 5115664 5014937 5265412 5159474 5450395 5385788 5685479 5654184
14433 5654184 5517426 5458719 5945676 5530985 6131131 5974983 6196537 5947291 6285453 6111460
14423 6111460 6379893 6421032 6440152 6393580 6748433 6589641 6615425 6774175 7204498 7154228
14413 7154228 7189155 7248817 7550818 7439341 8004292 7714660 8057798 8195437 8213729 8431079
14403 8431079 8692606 8542132 9034622 9337539 8977487 9020254 9361562 9113404 9589325 9402301
14393 9402301 9758622 9748588 10234652 10152732 10140673 10466218 10786704 11184585 11065505 11140257
14383 11140257 11059557 11256155 11930676 11875495 11725718 12216797 12495759 12315908 12513598 12873597
14373A2873597O22312r0486J91318L51984J62552M90273M8686P73315J57135K26838
14363A5807524L07919K11105J13926N04340M06571j69537O95852J55008N05173
14354A8537881L90981K16418O54381L89642N43872M16613N48210K55861L62840
14345B2316699P28400M07572O13309N33206O1983M30347J065422M45909P07187
14336B7310034N68614M88459J141043Q96359N32145P16676O63841R50686Q41484
14327C4109341R87480Q63767J121568J053957J219323J021294Q09851J587902
14319D2774483J535080R37339J440321J542978J426637J977342J605593J675277
14311E4915050K062709J477645K200220K111028K428415K292066K424855K588463
$$ plain form
14373 12873597 13495909 13405423 13596741 13948725 14111277 14601550 14650236 15423551 15580686 15807524
14363 15807524 16115443 16326548 16440474 16944814 17351385 17181848 17877700 18032708 18537881
14354 18537881 18928862 19145280 19799661 20189303 20733175 21149788 21697998 21953859 22316699
14345 22316699 23045099 23452671 24065980 24599186 24661169 25091516 26156938 26602847 27310034
14336 27310034 27878648 28367107 29508150 30404509 30936654 31653330 32317171 33267857 34109341
14327 34109341 35096821 35960588 37082156 38136113 39355436 40376730 41186581 42774483
14319 42774483 44309563 45246902 46687223 48230201 49656838 51634180 53239773 54915050
14311 54915050 56977759 58455404 60655624 62766652 65195067 67487133 69911988 72500451
14303G2500451K498955L122412K656299K913105L737893L493528L506494L778963
14295I8208100M406143M051521N029701M681964N028342N901297N754573O178303
14287A39239944O681086O996077P259297P634860Q349046Q375564R230078R465268
14279B03231220J0473798J0931395J1056782J1933023J2738958J3117922J3255072
14272B86738170J3889568J4273540J3874945J4458061J4387057J3512776J3177200
14265C84311317J2536272J2040894J0796294R788552Q850895Q425184P501855
14258D54251263O036741L322191J249809J774158M41793o874658n368518q192711
14250D46640068q453607r513496j2208622j3363187j3970129j3493228j3114840
$$ plain form
14303 72500451 74999406 78121818 80778117 83691222 87429115 90922643 94429137 98208100
14295 98208100 102614243 106665764 111695465 116377429 121405771 127307068 133061641 139239944
14287 139239944 145921030 152917107 160176404 167811264 176160310 184535874 193765952 203231220
14279 203231220 213705018 224636413 235693195 247626218 260365176 273483098 286738170
14272 286738170 300627738 314901278 328776223 343234284 357621341 371134117 384311317
14265 384311317 396847589 408888483 419684777 429473329 438324224 446749408 454251263
14258 454251263 460288004 463610195 464860004 466634162 467075955 460201297 454832779 446640068
14250 446640068 438186461 428672965 416464343 403101156 389131027 375637799 362522959
14243C62522959j4187732j4998035j3211185j3724000j3611736j3649634j3270324
14236B65870313j2457495j1879413j0849150j1845828j1178845j0861777j0208864
14229A86588941r075849q748152q142599p678033p117465o623665o147376n644079
14221A27411723o050720n449506m543688m863345m247730l988921l891963m012764
14213I0363086l360461l388532k981177l085108l039658k262927k789318k509980
14205F6945925k148164k006156k314612j742690j965777j595166k126330j028565
14197E2018465j896763j126489j860754j591023q96288q22787j082176j498209
14189D1243976j274636j042321j105724j030880n18783j472187j167040n95070
$$ plain form
14243 362522959 348335227 333337192 320126007 306402007 292790271 279140637 265870313
14236 265870313 253412818 241533405 230684255 218838427 207659582 196797805 186588941
14229 186588941 177513092 168764940 160622341 152944308 145826843 139203178 133055802 127411723
14221 127411723 121361003 115911497 111367809 106504464 102256734 98267813 94375850 90363086
14213 90363086 87002625 83614093 80632916 77547808 74508150 72245223 69455905 66945925
14205 66945925 64797761 62791605 60476993 58734303 56768526 55173360 53047030 52018465
14197 52018465 50121702 48995213 47134459 45543436 44647148 43824361 42742185 41243976
14189 41243976 39969340 38927019 37821295 36790415 36271632 34799445 33632405 33037335
14181C3037335j054657q01096m49619n38531q97115r12692l92610o04746p22417
14172B6663852q82147n84261o04733n46318m65357l81261o63706L8051r28242
14163B1645878n02690j22519m30358o82675k35927o81742j5301p77172j10983
14154A8086511j02801n17424m25640J12207n95730j68943o24171j84685m50668
14145A5128656N5940k51696K7750n57626j46894m66560k6836j57829o18166j34654
14135A2852085p4496m43648K2231Q7350o10663j38582k71484J90163l31472j72606
14125A1108878m1645k1843l24862o80645M01632r027m36936l28415M2194p1381
14115I637950k93874l51243K26206k80574j17396L5073j59346j28360j07992k206
$$ plain form
14181 33037335 31982678 31181582 30731963 30193432 29296317 28383625 27991015 27386269 26663852
14172 26663852 25781705 25197444 24592711 24046393 23581036 23199775 22536069 22574120 21645878
14163 21645878 21143188 21020669 20590311 19907636 19671709 18989967 18974666 18197494 18086511
14154 18086511 17983710 17466286 17040646 17152853 16557123 16388180 15764009 15579324 15128656
14145 15128656 15184596 14932900 14960650 14403024 14256130 13789570 13762734 13604905 12986739 12852085
14135 12852085 12777589 12333941 12356172 12443522 11832859 11694277 11422793 11612956 11281484 11108878
14125 11108878 11067233 11045390 10720528 10039883 10441515 10432488 9995552 9667137 9709331 9637950
14115 9637950 9344076 8992833 9219039 8938465 8821069 8856142 8696796 8568436 8460444 8458238
14105H458238l95011J00474O9428l87834k6717O2730q4148m38770J25567J919
14095G485876k75277j72482L16861m16007J22433k28018M0476l3223j76765J21387
14085F785261o3396j73705k65459J92695j28922P5011n08246J61346l67751l2441
14075E674393o1484M29157o71659n5955J69859n1749K172q2457r4529j94959K98994
14064E361783K7317l43270J10093N9347l78978j32556K43332P4948r05570O58186
14054D774632k84836r4221J74079J9338q5915k01981l11476K46029n9803M9201
14044D225047J31849P6002k26713N5689k28312J57858j65846K40141k13207k15748
14034C836760k170p4567N8457k20779j24005J44998Q892R4932k04613K4626K97759
$$ plain form
14105 8458238 8063227 8163701 8233129 7845295 7818578 7881308 7797160 7358390 7483957 7485876
14095 7485876 7210599 7038117 7354978 6938971 7061404 6833386 6873862 6840639 6663874 6785261
14085 6785261 6721865 6548160 6282701 6475396 6346474 6421485 5913239 6074585 5706834 5674393
14075 5674393 5612909 6042066 5370407 5314452 5484311 5432562 5434734 5352277 5257748 5062789 5361783
14064 5361783 5389100 5045830 5155923 5215270 4836292 4703736 4947068 5022016 4116446 4774632
14054 4774632 4489796 4395575 4569654 4588992 4503077 4301096 3989620 4235649 4175846 4225047
14044 4225047 4356896 4432898 4206185 4261874 4033562 4191420 4025574 4265715 4052508 3836760
14034 3836760 3834590 3760023 3818480 3597701 3473696 3618694 3627586 3722518 3517905 3542531 3840290
14023C840290m50205q5614J90708j36927J04450l47953K79744R6042j83162j42871
14013C164502N3536n0818J32977l37944J97775j94585J21710j64740J56534k02702
14003B876245N2255j57877k55819L68999P9074N6187m98875l6192k26133O4675
13993B322539L12466k12733j8194K28567k57334l16708K11218K60144l63307N17116
13983B683774l33050J04395L69688j31401L20821m6342L33394M76581J475754
13974E253614N26400K740662N489359R728949J1959637j0710037q907475n095367
13966A0985742k744937k106655p59728r42471p4618n53862o3299m77004o6085
13957C197083j30545J5004k73960M4195n0485j59565k23993J69701l29258L18639
$$ plain form
14023 3840290 3390085 3304471 3495179 3358252 3462702 3114749 3394493 3490535 3307373 3164502
14013 3164502 3218038 3167220 3300197 2962253 3160028 2965443 3087153 2922413 3078947 2876245
14003 2876245 2928500 2770623 2514804 2883803 2962877 3019064 2520189 2483997 2257864 2322539
13993 2322539 2635005 2422272 2404078 2632645 2375311 2058603 2269821 2529965 2166658 2683774
13983 2683774 2350724 2455119 2824807 2693406 3014227 2967885 3301279 3777860 5253614
13974 5253614 5780014 8520676 14010035 23738984 35698621 24988584 16081109 10985742
13966 10985742 8240805 6134150 5374422 4431951 4357333 3803471 3740172 3263168 3197083
13957 3197083 3066538 3081542 2807582 2851777 2801292 2641727 2417734 2587435 2258177 2576816
13947B576816k53308J07839M8274m27357N15329m38995J28991j20516j16015p8430
13937A942628M16084k73264o2371j75004K08296k49720M2977K00721l10923K47148
13927A986572J344k5580k27208K934J58479k5011R7134k56614K45822j19489j80889
13916A657494J48373j6215k9794L35779j15465l83122j12288M57999n24862M01621
13906A819520o7552l619j09174J92764j03681J46488l84199l7066R1274K82804
13896A827559j64179l01273P3723K43015l91327K43999L5712o176p3087K44536
13886A732502k46516k51610r9762L55434K24158k10680m6818j28082q1034J97565
13876A445157p4841O294r5481m7123L8411M79120l75015k6413j17895R4258o0381
$$ plain form
13947 2576816 2323508 2431347 2479621 2052264 2567593 2128598 2257589 2137073 2021058 1942628
13937 1942628 2358712 2085448 2023077 1848073 2056369 1806649 1849626 2050347 1739424 1986572
13927 1986572 1987916 1962336 1735128 1738062 1896541 1871530 1968664 1712050 1957872 1838383 1657494
13916 1657494 1805867 1789652 1759858 2095637 1980172 1597050 1484762 1942761 1417899 1819520
13906 1819520 1751968 1748349 1639175 1831939 1728258 1874746 1490547 1453481 1544755 1827559
13896 1827559 1663380 1362107 1435830 1678845 1287518 1531517 1567229 1561053 1487966 1732502
13886 1732502 1485986 1234376 1134614 1490048 1714206 1503526 1456708 1328626 1247592 1445157
13876 1445157 1370316 1376610 1281129 1234006 1272417 1751537 1376522 1350109 1232214 1326472 1266091
13865A266091j11118l8953J59591k1695k15514K5802P2066J78087J44067k24395
13855A234029l92563l3188L32729L1094o5389N9433j46980K54771j19794k5887
13845A128255l7162k7449n2447R2654N0005p1182K52856m62109K54391k79128
13835H48684K86079Q9207N3527n18898J66340L5646L12877p5597k32166Q823q0027
13824H94495L07821k90210J09955l08694M780J03848L39589l33523L12631l12756
13814H27936R076K74621k01698M21850k00662m89559K26152K44339J4071j43756
13804I82370j63073K21683j00657j38461M43282K8841m72038K18631k28667K19528
13794A011439r0833l6414J66207k23657m2763m872L464J29059j17878K96055j76066
$$ plain form
13865 1266091 1154973 1116020 1275611 1253916 1038402 1064204 1136270 1314357 1458424 1234029
13855 1234029 841466 808278 1141007 1172101 1106712 1166145 1019165 1273936 1154142 1128255
13845 1128255 1091093 1063644 1011197 1103851 1153856 1082674 1335530 873421 1127812 848684
13835 848684 1134763 1223970 1277497 758599 924939 960585 1273462 1197865 965699 974522 894495
13824 894495 1202316 912106 1022061 713367 718147 821995 1161584 828061 1140692 827936
13814 827936 837012 1111633 909935 1331785 1131123 641564 867716 1112055 1126126 982370
13804 982370 819297 1040980 940323 801862 1245144 1273985 801947 1020578 791911 1011439
13794 1011439 920606 884192 1050399 826742 783979 779107 782571 911630 793752 1089807 913741
13783I13741J07759j59892L2458m06844M3792J79297K69212j25117K682Q8707
13773I45795k08237N094l5653M6503J72930m2284K1447M0226k70591K76948j84207
13762G67971M4923p4074R085j3912K94124j60309k14172k69758N05669j74249
13752G15298Q8815j59735L4835j3692p8574K43827J66089m57276L32946r4468
13742G78065M49487E69469J29854K78914L8022j56388C90880L24339j05239N0991
13732F60971M641C04046J91621L78872j20831j76934R2633K49765J97371n21886
13722E94657m4906M5191N7371K23319l26024N8507B76708L78984P2114j50568
13712E77238K8178j72691K34310Q2211j14679j96864Q8495n1388J97589j44288
$$ plain form
13783 913741 1021500 861608 894066 487222 531014 710311 979523 854406 857088 945795
13773 945795 737558 742652 706999 753502 926432 884148 905595 945821 675230 952178 767971
13762 767971 812894 738820 747905 733993 1028117 867808 653636 383878 889547 715298
13752 715298 804113 644378 679213 665521 586947 830774 996863 539587 872533 778065
13742 778065 1227552 569469 699323 978237 1016259 859871 390880 715219 609980 660971
13732 660971 665612 304046 495667 874539 753708 576774 669407 919172 1116543 594657
13722 594657 549751 594942 652313 875632 549608 608115 276708 655692 727806 577238
13712 577238 605416 432725 667035 749246 634567 437703 526198 474810 672399 528111
13702E28111K22572l07189P9356J48484m0263J28134A95007M28527l3588O7226
13692F57172j34515o0029J19781K40932D00390P1627k5701M00343k76598R1129
13682F61190j48081J40579M6687j30233j00061L9547k54659l2469L64851B92458
13671D34891N6661l4778p1363L52154B46260K07787Q1712k35644O37941D16658
13660E33018J64274k22029J2961M20299m12163A41352M82731j63674j16677n3655
13650B90077M67441C03829P0602K70579r4363l3969k33316m052K26981k04595
13640C01696j3277K59188j2693P2349E7956O35197j94693j60771K86797j97807
13630D26679J72873o3278j93750J95216o494q4660j95751K82566B48110J5908
$$ plain form
13702 528111 750683 443494 522850 671334 631071 759205 195007 623534 589946 657172
13692 657172 522657 462628 582409 823341 400390 472017 446316 846659 570061 661190
13682 661190 513109 653688 700375 570142 470081 509628 254969 222500 587351 292458
13671 434891 491552 456774 385411 737565 246260 454047 535759 300115 938056 416658
13660 533018 697292 475263 488224 908523 496360 141352 624083 460409 343732 290077
13650 290077 757518 303829 374431 645010 550647 516678 283362 279310 506291 301696
13640 301696 288419 547607 534914 607263 57956 693153 498460 337689 624486 426679
13630 426679 599552 536274 342524 537740 531246 446586 250835 533401 248110 264018
13620B64018J161N3216L81537k26578m8211K13837C16232m2080K1453q9800n4836
13609A50969L27463k4320q6303R9050l6546o1656J02309j07403J93627l3574k21209
13598C02407J90335r3301R5726B32010J93060K36628j35726k62961A12181R9477
13588B11658J27640l6716A19919M31845m0551r3229o3908P3181j94056L46588
13578E79789j83326J59498p7442k543r0088K00373j19860k23284h1257E36187
13567A97810M26405k41493K22521k78469J49423K6062N678L3493K33280l72910
13557D01800j26913O9336L23807k3359E1762K89759K40836p2155j25508C1353
13546D84968A65501L84909A37945J08111k2789M47522B32440L11432j32359j58567
$$ plain form
13620 264018 265179 318395 699932 473354 425143 638980 316232 274152 295605 205805 150969
13609 150969 478432 454112 367809 466859 430313 368657 470966 363563 557190 523616 302407
13598 302407 492742 399441 495167 232010 425070 661698 525972 263011 112181 211658
13588 211658 339298 302582 119919 551764 511213 417984 354076 427257 233201 579789
13578 579789 396463 555961 478519 475976 385888 586261 466401 243117 -81257 536187
13567 197810 624215 382722 605243 326774 476197 502259 507937 541430 774710 401800
13557 401800 274887 344223 668030 644671 51762 341521 582357 510202 384694 31353
13546 484968 165501 550410 137945 246056 223267 670789 232440 543872 411513 252946
13536B52946A7431K04099O5455M26640j06852k30479J58993j27142A91015J92221
13526C83236b13635P1599D52392a83823E14883k47285k3976j14458M90014B44074
13515D67188A35269J94400I6714K33936p2001j18140J86173n3344K5803r649j2326
13504B77166J31497e4042C10618J38050J50657G5919Q8671N4091K69546c7005
13493C39082b03933A08172O9840K7060m0084K61772R2303A34636h8447I0025J05286
13482A95311K20860j88942K9318p5323n1852K0803J93872j53681a80185n0859
13472b31044D76326j21603J4930m739l794j46382o873J75096A86473l4734J2845
13461A64584b2544B96426L22073A37350J09266c6393D19053j32193i0708C38417
$$ plain form
13536 252946 17431 221530 286985 713625 606773 376294 535287 408145 191015 383236
13526 383236 -213635 -142036 452392 -183823 514883 267598 243622 129164 619178 244074
13515 467188 135269 329669 96714 330650 258649 140509 326682 273338 299141 289492 277166
13504 277166 408663 -54042 310618 448668 599325 75919 164590 218681 488227 -37005
13493 339082 -203933 108172 178012 205072 164988 426760 519063 134636 -88447 90025 195311
13482 195311 416171 227229 256547 181224 129372 150175 344047 190366 -180185 -231044
13472 -231044 476326 354723 369653 364914 361120 214738 207865 382961 186473 151739 164584
13461 164584 -22544 296426 618499 137350 246616 -36393 419053 286860 -90708 338417
13450A50346J1544M92378A15605L43909J91766B74804g9523I8723k4909O5410
13440A39224J05738b2414B45575K10386o462j80231E9621K00682N6444A48739
13429C30871l0157j13671K4074D9505L01785j50481J78152J1692E3517K22624
13419B76141G7037J92040L47579F8694J88822J29775a17477C16226L3558j68921
13409A80863L404K59888j98848J7509Q2677g115C15841A46920J6906K0344c27397
13397D23544A03947J51761A20077C0643R4649n1466A5444L07048A11246B3581
13386C63874j392b3720A97201b7648B24452o104m4599J1032m184L55569r5522
13375D40644j98241j09481m2209k1591M2569G678K5364N56627A15790N9611K47049
$$ plain form
13450 150346 161890 654268 115605 459514 651280 274804 -79523 98723 73814 139224
13440 139224 244962 -22414 245575 455961 449499 269268 59621 260303 316747 148739
13429 330871 300714 187043 211117 49505 351290 200809 378961 390653 53517 276141
13419 276141 77037 269077 616656 68694 257516 387291 -117477 316226 349784 180863
13409 180863 184267 444155 245307 262816 345493 -7115 315841 146920 163826 184170 -327397
13397 423544 103947 255708 120077 30643 125292 73826 15444 322492 111246 23581
13386 363874 362482 -23720 197201 -27648 224452 218348 173749 184781 180597 536166 440644
13375 440644 242403 132922 90713 69122 111691 7678 33042 589669 115790 175401 422450
13364D22450j47320j15152i607A34108L2809O7833L0012K5944A21972j9815Q3504
13353A85661J29897Q0671a23932F7714K9161C2034K43804n8729e398E8400P5084
13342A33484J42755o4774I7619K13402G4139P645Q9995J64402A51968J73259j13216
13331B12011f979C61433G7110M50877k32302P2321J55994B11828J50712r2740
13321B69800P7422L0827m5802M7508j7044a34263C71028q6938K69431j22418B15175
13309a32846G5886J0855C1583J91843K35320j09096O3643c6063B98409o561q5163
13298B06685P228H8769O0431J69071E6581K9376a48777C46782J36572f2397C35082
13286A72092n8638J63104l6753a92972C70689A5461K06525a59628D0785L42246
$$ plain form
13364 422450 275130 159978 -9607 134108 166917 234750 264762 290706 121972 102157 185661
13353 185661 315558 396229 -123932 67714 96875 32034 275838 217109 -5398 58400 133484
13342 133484 276239 211465 97619 311021 74139 81784 171779 336181 151968 325227 212011
13331 212011 -6979 361433 77110 527987 295685 368006 524000 211828 362540 269800
13321 269800 347222 378049 332247 379755 362711 -134263 371028 284090 553521 431103 215175
13309 -132846 75886 86741 31583 223426 458746 349650 413293 -36063 298409 291848 206685
13298 206685 213913 88769 149200 318271 56581 85957 -148777 346782 483354 -62397 335082
13286 172092 113454 276558 239805 -192972 370689 15461 221986 -159628 40785 383031
13276C83031E1784K55897d8651C33222j32282K12127b69668A3021A66a57250C09407
13264A25664l5744C7116J08077J81364J53311f4136B23828a07203B16616l3090
13254A83526K08086A45777J12137j25122L49796H9979K06240L15042b00147C34376
13243E27001G5125a01910E5277M18751a1833H0983R0308o6266m5369a43305B3378
13231a82339g0164B53086A22816J4156M24214A50279J93545A64177J25794M1025
13221C30996b88952a7447m3629C67471n7009B3141L3266J01343D3642O8288R1375
13210B03305l9261g8699A50418J46697a20738A53658F8207b37436G7663b54607
13199C4338a50283f3247A96483n3104J67419k4927a69181B0208K74289C1802K85889
$$ plain form
13276 383031 51784 307681 -48651 333222 200940 413067 -269668 13021 166 -157250 309407
13264 125664 89920 37116 145193 326557 479868 -64136 223828 -107203 216616 183526
13254 183526 391612 145777 257914 132792 482588 89979 296219 611261 -200147 334376
13243 527001 75125 -101910 55277 474028 -11833 80983 171291 105025 59656 -143305 23378
13231 -182339 -70164 253086 122816 136972 561186 150279 343824 164177 289971 330996
13221 330996 -288952 -17447 -61076 367471 310462 23141 56407 157750 43642 111930 203305
13210 203305 164044 -78699 150418 297115 -120738 153658 68207 -237436 77663 -254607
13199 34338 -150283 -63247 196483 143379 310798 285871 -169181 20208 294497 31802 317691
13188C17691j15174b27034J07874C50193a44586E42149B30744m1209K96614b4099
13177E6950O5530J2691a72900k2746F0659N98165e5055l3065j1073A43278b22404
13165a33928a0205A63953P4096a85845E2322J35131a24990A2915N6320b09669
13154B62049a72720a8833G1562c18366d7323B57724b71343A51282a52759A17448
13143D4869a2717O334a038A55618g8918A57235b27044f051D47842j11206j38172
13132A98464q8676K32108j14744H7401g488H4810a3939j62085a0642A98993b94347
13120B55939a035j50850P5067a1154k21240R2601O4786j28724Q9826I7158j0504
13109H6654Q5585B8237J01989a42357A30460f5181C48993a04582A77805g0417
$$ plain form
13188 317691 202517 -227034 -119160 350193 -144586 542149 230744 189535 486149 -24099
13177 56950 122480 135171 -172900 -195646 60659 658824 -55055 -88120 -99193 143278 -222404
13165 -133928 -10205 163953 238049 -185845 52322 187453 -124990 12915 69235 -209669
13154 262049 -172720 -18833 71562 -318366 -47323 257724 -271343 151282 -152759 117448
13143 44869 -12717 -6383 -1038 155618 -78918 157235 -227044 -6051 447842 336636 198464
13132 198464 109788 341896 227152 87401 -7488 84810 -13939 -176024 -10642 198993 -294347
13120 255939 -1035 -151885 -76818 -11154 -232394 -139793 -75007 -203731 -113905 97158 86654
13109 86654 172239 28237 130226 -142357 130460 -65181 348993 -104582 177805 -70417
13098G7333M9000K26075N1044p6853A61955f039A97625k6719g3373q3905A06326
13086H9611B8788C941O258K31635L8058l646j13040d9803j07499l0428m1278A2079
13073B12203d3805G5311J26008M9953M8409j47796A4526a97710c8969j91779A94809
13061C32431B9229O5269l5080B9576Q0732m2041K43292E6080J47404b0973B25968
13049d2986B03041M7689a28296A27582h4522I1742a36395B36048K5097G1209g9455
13037a4926B47725i2506B71856j01563p6731J30502B2176b4170A5424a53191H326
13025b52000A72620L4844a47955B7311a21838c6095B45341j15798n158P5330C3290
13013B11987I4776b17261A19619L38154H3175L38031j93144j9680p9829P4754
$$ plain form
13098 77333 126333 352408 403452 326599 161955 -6039 197625 170906 -73373 -157278 106326
13086 89611 28788 3941 10199 241834 279892 276246 163206 -49803 -157302 -187730 -229008 12079
13073 212203 -43805 75311 201319 251272 299681 151885 14526 -197710 -38969 -230748 194809
13061 332431 29229 94498 59418 29576 110308 68267 311559 56080 203484 -20973 225968
13049 -42986 203041 250730 -128296 127582 -84522 91742 -136395 236048 261145 71209 -79455
13037 -14926 247725 -92506 271856 170293 93562 224064 22176 -24170 15424 -153191 8326
13025 -252000 172620 207464 -147955 27311 -121838 -36095 245341 129543 124385 199715 33290
13013 211987 94776 -217261 119619 457773 83175 421206 228062 208382 128553 203307
13003B03307m3098E0468b28910A01885N0123P6937J31565n4510F6099A1576L23217
12992C34793c4024i678A77069a22386p870A18208a64081f6541E3754j7918J62153
12981A97989J64565I9391a72583A94344m9009d8123F2544K10616A23387b9262
12970B44605I0864p899K04956a98998e0480j0997k31091a34662A10803a08501
12959a51185B30824c36923B30832E4019P6140g8100B39787B6384L41747d8060
12948C19937j13657G5632K2956b10193G8901L3420L27437a27305p2601K3832P7031
12937i9043J7852D7774p914h656C8093J21743H476a94822F0502P730f1021j55439
12925b16460a4218C8307N97878I8199M3328R7294i9254I232g3419L6110C05960
$$ plain form
13003 203307 160209 50468 -228910 101885 152008 228945 360510 306000 66099 11576 334793
12992 334793 -34024 -9678 177069 -122386 -130256 118208 -164081 -66541 53754 35836 197989
12981 197989 362554 99391 -172583 194344 145335 -48123 62544 273160 123387 -29262
12970 244605 90864 82965 287921 -198998 -50480 -61477 -292568 -134662 110803 -108501
12959 -151185 230824 -336923 230832 54019 130159 -78100 239787 26384 368131 -48060
12948 319937 206280 75632 98588 -210193 78901 112321 439758 -127305 -199906 -176074 -99043
12937 -99043 -81191 47774 39860 -8656 38093 159836 8476 -194822 60502 68232 -61021 -216460
12925 -216460 -14218 38307 636185 98199 141527 238821 -99254 9232 -73419 -37309 305960
12913A89002L32161a1972p2371F1102b94338f7775J1972D67499D6989J32272j8405
12902A60856F3696f1397F3026K46216b8481H7719m3005a5002D49508A14093Q8719
12891B02812b314C13973a39672A0999K53000n9284h1610A63625K27232a70647
12880A03887k8917l0076i0610C64736a54644A26821N6383l7243b0748C2976J94251
12869B27227D9669d3172B0781b89475A01680b82615C65260j51302h7503E9463
12858E9163e5328D2030O3821b59662B1052c77037C3899Q6652K48452a87420I4606
12846a91066I0332b7098D9015L3456b72951B65782a32730j18728k972h9307E6045
12834B04310a52934B22402d8322A18932B2133b31386C2428J32441a18585D61992
$$ plain form
12913 189002 521163 -11972 -84343 61102 -294338 -67775 -55803 467499 46989 179261 160856
12902 160856 63696 -61397 63026 309242 -28481 87719 44714 -15002 449508 114093 202812
12891 202812 -2314 313973 -139672 10999 263999 204715 -81610 163625 390857 -170647
12880 103887 74970 44894 -90610 364736 -154644 126821 183204 145961 -20748 32976 227227
12869 227227 49669 -43172 20781 -289475 101680 -282615 365260 213958 -87503 59463
12858 59163 -55328 42030 105851 -259662 21052 -377037 33899 120551 369003 -187420 94606
12846 -191066 90332 -27098 49015 82471 -272951 265782 -132730 -251458 -254430 -89307 56045
12834 204310 -152934 222402 -48322 118932 22133 -231386 32428 164869 -118585 461992
12823a39288F2271E448h2997l2765e4875A33364b7748H4924j420j1895Q088O9213
12811A48910a72996O2620o4831e9450B94277A45559j4421d1061k54803a28112
12800C5698a99015A51608b94161a11165C01309j7856a84918A34726a81205a4714
12789c2143C61837a36212O1330k5321M6636C9809b66384a32180o2665I1804c28428
12777C08484D5838a65703A18472Q5008o2760a54957I9748Q9332b8932j56663A6034
12765c6911j07044A59995R8264J04754j61689a25854d8671E3550J66813E0445
12754A34913O1750c56331B07598G1349P3239k525d0617k17215K0882A90560F7790
12742c13440A5024a67105O3632j5842F0847j2706f603B04781E3441a1327q8148
$$ plain form
12823 -139288 62271 5448 -82997 -115762 -54875 133364 -27748 84924 83504 71609 79697 148910
12811 148910 -172996 -110376 -175207 -59450 294277 145559 131138 -41061 -295864 -128112
12800 35698 -199015 151608 -294161 -111165 301309 283453 -184918 134726 -181205 -14714
12789 -32143 361837 -136212 -74882 -100203 -53567 39809 -266384 -132180 -194845 91804 -328428
12777 308484 45838 -165703 118472 203480 140720 -154957 99748 189080 -28932 -185595 16034
12765 -36911 -143955 159995 258259 363013 201324 -125854 -48671 53550 220363 50445
12754 134913 196663 -356331 207598 71349 144588 142063 -40617 -257832 -236950 190560 67790
12742 -313440 15024 -167105 -103473 -119315 60847 48141 -6603 204781 53441 -11327 -99475
12731i9475k8125A44309i4195B28891g9017E4638h2231j22118h2054p4440A47964
12719A00613g4420B7967g014A68628F8917A1843J32207p0414e0911G7147B0565
12707C99050d34647A7297J32197b0329E2114K58396b02591B5425J08610E205d0859
12695g8397K0286A55810n2402C0731J11423J08581g6515A72043o3349K6462L3786
12684A68942q0384O7069c1971J1384A23658K13401B2838N7481f1643G3509q530
12673F4979k93i8574b8959H8251a64819A40191a27327B76906n2332c7390B57906
12661A28422J28657A26875a94746b0122A70323m9267m1177C3127a6303n8639B71554
12649e2738D20859A13107Q206b10105h0427A86682K6932a83393A30792b92153
$$ plain form
12731 -99475 -127600 144309 -94195 228891 -79017 54638 -82231 -204349 -82054 -156494 147964
12719 100613 -74420 27967 -7014 168628 68917 11843 144050 73636 -50911 77147 20565
12707 399050 -434647 17297 149494 -20329 52114 310510 -202591 25425 134035 5205 -40859
12695 -78397 -58111 155810 103408 30731 142154 250735 -76515 172043 108694 135156 168942
12684 168942 88558 155627 -31971 -20587 123658 337059 22838 80319 -61643 73509 64979
12673 64979 64686 -98574 -28959 88251 -164819 140191 -127327 276906 224574 -37390 257906
12661 128422 257079 126875 -194746 -20122 170323 121056 79879 33127 -16303 -74942 271554
12649 -52738 420859 113107 121313 -210105 -80427 186682 213614 -183393 130792 -292153
12638h8497N657j91486G284a762A24046c60026B90115a42201G616K77979j39945
12627A45650i4620j30631B78920b9347l17210C59605A14418D5714g771D7375L7100
12616H4475d8599G8069B6995J09758K10118L9131A70776n5019D703J15458b2883
12604C20033A07557d7772K2246A87973F3245a67633g6714A43505n1219Q7839C9788
12592A10720b80440F953J66829a25157B8683g0335H5067l4606a36157p1256O3912
12581a43501B09931e4182k11848A98059a41586B12183F8451K72632A53389A713
12570B03405b1446A5572O9241M8918J11718m3364a65356A16900k4370c86288C0014
12558b12857Q7351q4203A77546H3627b1040B7434J82008b6816A2252d1074B8149
$$ plain form
12638 -88497 -82840 -274326 7284 -1762 124046 -360026 290115 -142201 7616 285595 145650
12627 145650 -94620 -225251 278920 -29347 -346557 359605 114418 45714 -7771 47375 84475
12616 84475 -48599 78069 26995 136753 346871 386002 170776 115757 4703 120161 -22883
12604 320033 107557 -47772 -25526 187973 63245 -167633 -76714 143505 92286 180125 39788
12592 110720 -280440 6953 173782 -125157 28683 -70335 85067 50461 -136157 -207413 -143501
12581 -143501 209931 -54182 -266030 198059 -141586 212183 68451 341083 153389 1713
12570 203405 -21446 15572 84813 133731 245449 202085 -165356 116900 92530 -386288 30014
12558 -212857 -125506 -209709 177546 83627 -21040 27434 209442 -26816 12252 -41074 28149
12546A75544d2789C6729A496a0180k45189K8438B6295b23076h0696A04938b49361
12534D2138b06113c1391A16246i3461c9802j2345A40432a25010j12012J06662
12524a30360C21464i0349B80262g737k11921h6650c9099j93898J2232r3045e9051
12512E2721Q3215g0902E7866O5734J41827E373J34899B3380e1035l0345k27451
12501c08831A20596B4454f9475G248b61485B29556D339J6483R7087k5370b93724
12489b69930h8965r4468J5980H2464B168K01918a80909C03098F1002g4524b7680
12477A51176A5050c77812I0895C1607e5371p5789f403m243m37355A87204d07141
12465A79430H7665f3608q6773A5933b7118j6084A97935D6547b50496J3243A6578
$$ plain form
12546 175544 -42789 36729 1496 -10180 -255369 -226931 26295 -223076 -80696 104938 -249361
12534 42138 -206113 -31391 116246 -93461 -39802 -52147 140432 -125010 -237022 -130360
12524 -130360 321464 -90349 280262 -7737 -219658 -86650 -39099 -232997 -220765 -313810 -59051
12512 52721 135936 -70902 57866 123600 265427 5373 140272 23380 -51035 -81380 -308831
12501 -308831 120596 24454 -69475 7248 -261485 229556 4339 20822 117909 92539 -293724
12489 -269930 -88965 -183433 -167453 82464 2168 204086 -180909 303098 61002 -74524 -27680
12477 151176 15050 -377812 90895 31607 -55371 -131160 -6403 -10646 -448001 187204 -407141
12465 179430 87665 -63608 -150381 15933 -27118 -43202 197935 46547 -250496 -237253 16578
12453I6183J3673C2085c27349e2895a4709k10901N2882B3863e9017A31660i2792
12441b00198A24767f2135B87136A2434c3910q034n4007d408B93269g3554k7287
12430a00841H9485a41237I7134C5284J1575c54069H0238M278l6621b68749D2808
12418a6540E1565f7613A60279J2279B162c6812G1203e8534H5734a10124r2533
12407b02657J5306L3279H6863A8978O5221Q2261F5700e8240A15540a36293B079
12395A68585a46060f9337B90777i6319A38787R7146e9710G7049e4121q6621B10868
12383f9082Q700j16859B84531b8958B14060k3883A2563Q2712L6772l7581h444
12371B47626J3441A06049l7329M466A1888M17320G4018a00576A66565a7035C5771
$$ plain form
12453 96183 109856 32085 -327349 -52895 -14709 -225610 -172728 23863 -59017 131660 -92792
12441 -200198 124767 -62135 287136 12434 -33910 -41944 -95951 -4408 293269 -73554 -100841
12430 -100841 89485 -141237 97134 35284 46859 -354069 80238 84516 47895 -268749 42808
12418 -16540 51565 -67613 160279 172558 2162 -36812 71203 -58534 85734 -110124 -202657
12407 -202657 -187351 -154072 86863 18978 84199 166460 65700 -58240 115540 -136293 2079
12395 168585 -146060 -69337 290777 -96319 138787 235933 -59710 77049 -54121 -140742 210868
12383 -69082 -60382 -177241 284531 -28958 214060 190177 12563 95275 132047 94466 -8444
12371 247626 261067 106049 68720 73186 11888 429208 74018 -100576 166565 -17035 35771
12359c1730B88689j12558P300J2411J36571q5125j11705d0780j59300B86026a31703
12347A58809b92050a19190M9339D1843J7372L1349f8243B69529d9444A30693d43104
12335c88079c5396f07A81208a1268n1186K3392B2308g0050D1776e0073j60942
12324b11015I0662M30930a07885h942D14306k03458f1911D00862E3826J05992
12314A59818a34205L934A97327r7764K73797A10654b52691C93173l5465A17117
12303f5294B52386J27021q6289k463C5495J47611M7350J7652J2355E0164K54682
12292C04846b51123M3313f0507D2844L9836f4951D15919A36925J52176b26825
12281B80465a46918B26840b89319J08963O3040B2222d1442p8632C390c9767F138
$$ plain form
12359 -31730 288689 176131 183431 195842 332413 247288 135583 -40780 -200080 286026 -131703
12347 158809 -292050 -119190 -69851 41843 59215 90564 -68243 269529 -49444 130693 -443104
12335 -388079 -35396 -607 181208 -11268 -62454 -39062 22308 -70050 41776 -50073 -211015
12324 -211015 90662 521592 -107885 -8942 414306 210848 -61911 400862 53826 159818
12314 159818 -134205 -130271 197327 99563 373360 110654 -252691 393173 357708 117117
12303 -65294 252386 379407 293118 290655 35495 183106 230456 248108 260463 50164 304846
12292 304846 -251123 -207810 -60507 42844 82680 -64951 415919 136925 289101 -226825
12281 280465 -146918 226840 -289319 -180356 -117316 22222 -41442 -120074 3390 -39767 6138
12269a14448k20923C17371J57444A39820a10541d7360A02951a25832A46817h463
12258i8656C87199A64846P911k5316a26871C21733b65508A15917E6711L47417
12248D04128j22577H0144J69603J33586A25151J23162j3461b87726A10888b27848
12237A91647k9299a6510A09699j2560J21736a76320O7565C09342I1085K61709
12227C52794A6331d9932D8499d8869A68186J55234a53531b4982n8847H5427L7921
12216A23348K94668A17455J19442i5501A74147a88016C58448A20845J15289r1802
12206A44332m6575R8577O710L59550b08031B22009J3714K7207b51228A58514J49097
12195C07611a4191N187B02282K2595C0837J04054J92019J58682a33346L2564I6971
$$ plain form
12269 -114448 -335371 317371 474815 139820 -110541 -47360 102951 -125832 146817 -8463
12258 -98656 387199 164846 172757 147441 -126871 321733 -265508 115917 56711 404128
12248 404128 281551 80144 249747 383333 125151 248313 234852 -287726 110888 -227848
12237 191647 162348 -16510 109699 97139 218875 -176320 -108755 309342 91085 352794
12227 352794 16331 -49932 48499 -48869 168186 323420 -153531 -24982 -83829 85427 123348
12216 123348 418016 117455 236897 -95501 174147 -188016 358448 120845 236134 144332
12206 144332 97757 196334 203044 562594 -208031 222009 235723 262930 -251228 158514 307611
12195 307611 -14191 -9004 202282 224877 30837 134891 326910 485592 -133346 -100782 96971
12183B08113k2645J26177K757o6115O8231G1532e0638A18299K40789A63705N0327
12172B14032J98282H5467J66307J29066a3293D31068A90913k4172N8041A02363
12161a97781A77558a43835C07408p7825q155K0712K5944l8023M7200d6462I4455
12149A90651P9605g4803H6177O8361F3307K45073j14470K3151L65P4368j43862
12138A47932j9350a37638A27776o2353P3517J42510K1522A49198D9922g2133L3578
12127c8555C96149b3970o7748B16962d1649B80603j16927a64710B45173E5201
12116B39120r1228d0062G6084J4531J00389E3037J17643j4800C5478a09249A92758
12104a80146A73579i6401B66674P4623m8816C8475d9022A0190J05582C6117K8581
$$ plain form
12183 208113 185468 311645 314402 248287 316518 71532 -50638 118299 359088 163705 214032
12172 214032 412314 85467 251774 380840 -13293 431068 190913 166741 224782 102363
12161 -197781 177558 -143835 307408 229583 221428 242140 268084 230061 277261 -46462 94455
12149 190651 270256 -74803 86177 154538 63307 308380 193910 217061 217426 291794 147932
12138 147932 128582 -137638 127776 65423 138940 281450 302972 149198 49922 -72133 -38555
12127 -38555 396149 -23970 -91718 216962 -41649 280603 163676 -164710 245173 55201
12116 239120 147892 -40062 76084 90615 191004 53037 170680 155880 35478 -109249 192758
12104 -180146 173579 -96401 266674 341297 292481 38475 -49022 10190 115772 36117 64698
12093F4698K2964C7462J84573j6297E2597B596c6018j02444A02079k3267a66484
12081A7829a22421m7807D11384C013K6169J13855g6827F0010N2809K2090J44364
12070B79273b9190A52862p0251Q2335a51445B63176F2698M4787b5415B6026d6498
12058A46677L7461C4693J02676M6153C2162f5335B83366l9487J2248M3080b9127
12046B36576p6088n9335Q4707H6282a4764k587k41276F4229J44728a53666C9985
12034B69645L1937D683R666b44664R4548n8993D85547A17505J29263k3644O0555
12023B83679D0259e371k3290A98876d40199h5531A47543J60615h1614C92170e5680
12011b47683G3616K40121A14595A756Q5286J38757a08156k0703B45642b78458
$$ plain form
12093 64698 87662 37462 222035 205738 52597 2596 -36018 -138462 102079 78812 -166484
12081 17829 -122421 -170228 411384 3013 29182 143037 -76827 60010 112819 134909 279273
12070 279273 -29190 152862 82611 164946 -151445 263176 62698 107485 -25415 26026 -46498
12058 146677 184138 34693 137369 183522 32162 -65335 283366 243879 256127 299207 -29127
12046 236576 160488 101153 185860 86282 -14764 -17351 -258627 64229 208957 -153666 39985
12034 269645 301582 4683 14349 -244664 -150116 -209109 485547 117505 246768 223124 283679
12023 283679 40259 -5371 -28661 198876 -440199 -85531 147543 308158 -81614 392170 -55680
12011 -247683 73616 313737 114595 1756 87042 225799 -108156 -128859 245642 -278458
12000A48758M7028G1976L74888D2058c6821H0208g9032A09682O5978K18484E0979
11988F0968P2329A8229L42737j77162a87226B6403c0077B24100k7872b97959B05902
11976A41102J48870A13046a45347M2253r2819a742m6757n1170E0562b5170e435
11964D1199A9161K23633d9082B5420c58474C01830b66534K1911B86610b72874
11953g6900B70994a51272A61327E5359I964b19924P9764h453j03142D08898g3992
11941A95590G0657i5627d5809a7785C78479A49812l744b27019j14833J21480d2883
11929A43917a1597q9050a4056j10631a644B38528c88693J75735K6292I8108b21820
11917B72757F1235J20112a00369F1824a38767e8832A66104N6525a18340b4250
$$ plain form
12000 148758 195786 71976 446864 42058 -36821 80208 -79032 109682 175660 394144 50979
11988 60968 133297 18229 360966 183804 -187226 26403 -30077 224100 196228 -297959 205902
11976 141102 289972 113046 -145347 -103094 -195913 -1742 -48499 -99669 50562 -25170 -5435
11964 41199 19161 242794 -49082 25420 -358474 301830 -266534 -244623 286610 -272874
11953 -76900 270994 -151272 161327 55359 9964 -219924 -140160 -8453 -111595 408898 -73992
11941 195590 70657 -95627 -45809 -17785 378479 149812 146068 -227019 -341852 -220372 -42883
11929 143917 -11597 -100647 -14056 -124687 -1644 238528 -388693 -212958 -186666 98108 -221820
11917 272757 61235 181347 -100369 61824 -138767 -58832 166104 222629 -118340 -24250
11906d4893A58585a09128H9395a20442I4386h3871A21459a30484j10437N3187
11896a87734J1997l8225A9975J80093a06511H7829K8749h6999a8199A60108b21352
11884a88725B85091a00857A00903c61142f841j40184N0844A63422K44225g0133
11873B24870b35342d6962G7549J01034a40891b5853j3490A70055d0606j20956
11863a61562P184L4191j64924k11184a955k15414A51623m3532E3882b54878L8853
11852b16025R0594c590j68369B61230H8684L0799D5681a82242n8327I4561b97978
11840a85619d1563j783A73798a19497A9635d7680j57752b3598j49375P3639D7328
11828F8704A3412a46842j08292L981E3263J33718a445m6266p2270j15110A37357
$$ plain form
11906 -44893 158585 -109128 89395 -120442 94386 -83871 121459 -130484 -240921 -187734
11896 -187734 -175737 -213962 19975 200068 -106511 87829 116578 -86999 -18199 160108 -221352
11884 -188725 285091 -100857 100903 -361142 -6841 -147025 -96181 163422 407647 -70133
11873 224870 -235342 -46962 77549 178583 -140891 -25853 -39343 170055 -40606 -161562
11863 -161562 -154378 -120187 -285111 -496295 -1955 -217369 151623 108091 53882 -254878 -216025
11852 -216025 -125431 -3590 -171959 261230 88684 119483 45681 -182242 -240569 94561 -297978
11840 -185619 -41563 -43346 173798 -119497 19635 -47680 -205432 -23598 -172973 -99334 47328
11828 68704 13412 -146842 -255134 -251153 53263 186981 -1445 -47711 -119981 -235091 137357
11816a95982d9739C5816b00460h546H5593l6715a58994A39798h6902A73886c38952
11804E1893J1999b3755A53134D5834a80181m1555P9461B03564a94239B09817a23537
11792I2576m0683h0578O495k02845g0231A48853j493g2512A09079C5156K1262
11781E6418G340b9238j07160n2165h0733G8170J3318h1852r0314p0590N8357f2295
11768d167j76529Q4971k81806I0714M04626c3367A21341a90543A24424L5247J4344
11757A74015I059a56575A00860a15237H5614e8135A63718a2696A6996b0453I310
11745E3701a9240A02229a84212A71545a99427A84411C2928N4627k3554F404d8591
11733b00393g3745l98076E5557K19547f5382k5225F0955J25684e3976B8766i3260
$$ plain form
11816 -195982 -49739 35816 -200460 -8546 85593 48878 -158994 139798 -86902 173886 -338952
11804 51893 63892 -23755 153134 45834 -180181 -221736 -142275 203564 -194239 209817 -123537
11792 92576 51893 -80578 -74083 -276928 -70231 148853 147360 -72512 109079 35156 56418
11781 56418 7340 -29238 -136398 -188563 -80733 78170 91488 -81852 -172166 -242756 -184399 -62295
11768 -4167 -180696 -95725 -377531 90714 495340 -33367 121341 -190543 124424 159671 174015
11757 174015 9059 -156575 100860 -115237 85614 -58135 163718 -12696 16996 -20453 9310
11745 53701 -19240 102229 -184212 171545 -199427 184411 32928 87555 64001 6404 -48591
11733 -200393 -73745 -471821 55557 275104 -65382 -90607 60955 186639 -53976 28766 -93260
11721D043J88913e5260j52486g0071p2552J7523d7091A74292b9579e530m7223
11710e2753E0208Q5102j0672J85562a25625E0417L5540b86962F945K58375B8664
11698D2697a9564n214A30174l3379a57094f6777C9834c911l4500A68267q2007
11687H6260N3854C5732c5595G0789g6132M626q4489d7158D3331N9779b88873P7163
11675b11710C0239K14285b1107C38687g2829A48770J37356C9242b66630B8647
11664a8432n8233j74772O5897H7888k6681Q5501J996J51794b36697E0414b44166
11652b5950A00009b5698B8484A4206J30241e1435I6992a53437I1206L13860d8698
11640C11289h7124L9833B346e1748C34298g5811B15890P7857A9784a50619i663
$$ plain form
11721 4043 192956 -55260 -207746 -70071 -142623 -125100 -47091 174292 -29579 -5530 -52753
11710 -52753 50208 135310 124638 310200 -125625 50417 85957 -286962 6945 265320 28664
11698 42697 -19564 -24778 130174 96795 -157094 -66777 39834 -3911 -38411 168267 86260
11687 86260 140114 35732 -35595 70789 -76132 -71506 -155995 -47158 43331 103110 -288873 -211710
11675 -211710 30239 244524 -21107 338687 -72829 148770 286126 39242 -266630 28647
11664 -18432 -76665 -251437 -185540 87888 61207 146708 148704 300498 -236697 50414 -244166
11652 -25950 100009 -25698 28484 14206 144447 -51435 96992 -153437 91206 405066 -48698
11640 311289 -87124 -47291 2346 -51748 334298 -75811 215890 293747 19784 -150619 -9663
11628g2142p4084I8346A3639P471Q7575P604A9800J42917b33841j06520h5724
11616b80805R2204D3020b48091C14234A27843l9889b12922O102A19604l1897b13911
11604b5896I8720a25460N3280F7634b7267p5812H3207a73050m221g3600A06311
11592e1350r0259A08516K2917F2259a21788e5333j5817l1065A63167J17988A15362
11580A74206p6071c7061k31836A11195h6743D6550O6186j9176a19455D57439a2987
11568i496A55890Q1940b21069E053d5801B06767a0020n041A64401R095a23151
11556b04735A63807l2328J63476A41507R6655l4911F6291M932j629B794O8900
11545G1694Q520a68401B24830d9873q7658A0851J51431m0386a32401c8955A33519
$$ plain form
11628 -72142 -146226 98346 13639 21110 108685 116289 19800 162717 -233841 -340361 -85724
11616 -280805 -188601 43020 -248091 314234 127843 87954 -212922 -206820 119604 87707 -213911
11604 -25896 98720 -125460 -72180 67634 -27267 -103079 83207 -173050 -177271 -73600 106311
11592 -51350 -141609 108516 131433 62259 -121788 -55333 -71150 -102215 163167 281155 115362
11580 174206 98135 -37061 -268897 111195 -86743 46550 112736 93560 -119455 457439 -12987
11568 -9496 155890 237830 -221069 5053 -45801 206767 -10020 -15061 164401 173496 -123151
11556 -204735 163807 131479 294955 141507 238162 203251 66291 71223 69594 2794 71694
11545 71694 80214 -168401 224830 -49873 -137531 10851 162282 121896 -132401 -38955 133519
11533E9397Q7713a56968j3282C5319a02751q0572B13614R9637A48325J31486J40325
11522D20136b1388A70407m3635B9713h5831a506r195o8127q3834F3625e8867B81888
11509B7725a59155I951J30916b0742A50756h6722D3530B795a5309B6260J83942
11498B10202b00379A8816J50670B3045J32257d6374o020A39626a70226B16131
11487f2208A37125C1849a66575e529C0698K9171G169K3106L12995j26094A775
11475A88635E9647J10058l7046C9206j0046J74279c9735G6542c5075D1232A4532
11463h0918A34059d9871A93375H9236D1242J12728f8844k91756D973d4117n2029
11452i6146B5988K16132k8616e8842o3845E9511B5796J29596b83860C11322D5189
$$ plain form
11533 59397 147110 -156968 -170250 35319 -102751 -183323 213614 313251 148325 279811 420136
11522 420136 -21388 170407 126772 29713 -85831 -1506 -10701 -78828 -162662 63625 -58867 281888
11509 27725 -159155 9951 140867 -20742 150756 -86722 43530 2795 -15309 26260 210202
11498 210202 -200379 18816 169486 23045 155302 -46374 -52394 139626 -170226 216131
11487 -62208 137125 31849 -166575 -5529 30698 59869 7169 30275 343270 217176 1775
11475 188635 59647 169705 132659 39206 29160 203439 -39735 76542 -35075 41232 14532
11463 -80918 134059 -49871 193375 89236 41242 153970 -68844 -360600 4973 -44117 -96146
11452 -96146 25988 242120 213504 -58842 -122687 59511 25796 155392 -283860 311322 45189
11440A58713G6587j8036g4515D6378A4193O5826d656k10262a04887k7758e113
11428A19583e5230A36372a26051A02883N6240e674D0309f4627A746J01108Q8254
11417A91108r4467N428J4468d6516a3039C10311a81055A29749k5642N3465b21861
11405b78428J01202A96289E5017r49i2190n8158c2864A1215J17203b17164i0450
11393h6511D939J18431l7820e0159C25562d2527A74409Q6912r8956J57795f8729
11381D9930i1752c477C0860K65561D713J79077a42291B97354C3780J8249R0039
11370A42068M8667e2044k11801R1797f392q4814I7877M6665A4729a58036f1249
11358B85750A16364a34834A05678b56882I5533b10003C8616i6142a2347l10508
$$ plain form
11440 158713 76587 58551 -74515 46378 14193 80019 -4656 -214918 -104887 -132645 -5113
11428 119583 -55230 136372 -126051 102883 159123 -5674 40309 -64627 1746 102854 191108
11417 191108 96641 102069 116537 -46516 -13039 310311 -181055 129749 104107 157572 -221861
11405 -278428 -177226 196289 55017 54068 -92190 -150348 -32864 11215 128418 -217164 -90450
11393 -86511 4939 123370 85550 -50159 325562 -42527 174409 261321 162365 320160 -68729
11381 49930 -91752 -3477 30860 296421 4713 183790 -142291 297354 33780 52029 142068
11370 142068 190735 -52044 -263845 -172048 -6392 -91206 97877 144542 14729 -158036 -61249
11358 285750 116364 -134834 105678 -256882 95533 -210003 38616 -96142 -12347 -322855
11348c22855J53978a3575O602l11271C8284d5178n8364l1093c1515P506B10465
11336c50597a22345B07968b79362b6933H2604b3418j57496A81663a67131A79074
11325D3862E806a49003I4702P9797O4754h2967A9111R4959G624b87401a18785
11313a54722H9850P4097g879k33677A21761b04450a3422k49654a16344n2217L5482
11302a33079O3639I2575C6884h0175r4778q7094n5053b019n3188j68788G5812
11290a14024b7478j67404j72342a4250j40845n2226C8784L5088a52270q9793J18916
11279a23147A37972b9825G5174a74605G8834a74524N4257o9375D0643j3998K16174
11268B42819G508a56916A09623a51195B09416D1711h4170r0373A7800n39a41613
$$ plain form
11348 -322855 -168877 -13575 -6973 -318244 38284 -45178 -103542 -134635 -31515 -24009 210465
11336 -350597 -122345 207968 -279362 -26933 82604 -23418 -180914 181663 -167131 179074
11325 43862 5806 -149003 94702 174499 239253 -82967 19111 114070 7624 -287401 -118785
11313 -154722 89850 163947 -7879 -241556 121761 -204450 -13422 -263076 -116344 -168561 -133079
11302 -133079 -69440 92575 36884 -80175 -174953 -262047 -317100 -2019 -55207 -223995 75812
11290 -114024 -27478 -194882 -367224 -14250 -155095 -207321 38784 73872 -152270 -242063 -123147
11279 -123147 137972 -29825 75174 -174605 78834 -174524 -120267 -189642 40643 26645 242819
11268 242819 7508 -156916 109623 -151195 209416 41711 -84170 -174543 17800 17261 -141613
11256G1792i9427A97838H0969o895d08134h1305m4630I0251K84723i2115D5797
11244b28687c279A70684J18325b04410e5679G5748L9191C7041d2220B93423B8238
11232C7297a66211F8009l1414a27867k8137n8325b9954k47583m0089h9054j11517
11221b00571a3904A10554J643F783J39249b13891B30752r4169b37579b9198r4239
11210a23437b2566l604E4122a07438D32776a79151j18170K6234P4259e8041j10213
11199a68254A8988a91937d7897C7341c9274m8256E3516c14772a55189A50744a29571
11187a5636m57436d2663m67721b7067j3261l7496k0708G4248a36065p0092E8564
11175e3586n0366H9527a61589B3845J11855a29597d6882B5903L3893O838f7684
$$ plain form
11256 71792 -99427 197838 80969 74074 -408134 -81305 -125935 90251 374974 -92115 45797
11244 -228687 -3279 170684 289009 -204410 -55679 75748 114939 37041 -42220 293423 28238
11232 37297 -166211 68009 36595 -127867 -156004 -214329 -29954 -277537 -317626 -89054 -200571
11221 -200571 -13904 110554 112197 6783 146032 -213891 230752 136583 -237579 -29198 -123437
11210 -123437 -22566 -26170 54122 -107438 432776 -179151 -297321 -271087 -196828 -58041 -168254
11199 -168254 18988 -191937 -47897 37341 -39274 -87530 53516 -314772 -155189 150744 -129571
11187 -15636 -473072 -42663 -510384 -27067 -40328 -77824 -98532 74248 -136065 -206157 58564
11175 -53586 -103952 89527 -161589 23845 135700 -129597 -46882 25903 59796 66634 -67684
11163G7801P8787i0748k4869j2343o9294O8290b2836k49701b7488A85290E586
11151b05164R3030A38199a56437J9622A3608J25293C6837a91771O7803b116k63870
11140b65986b2701C58589A04881f5512I6186b0527K774A61035g8302k32290i0888
11128c67293J56053A47945a87786E5777d5682l36026c1624A93365b66367A71187
11117A06245l6329i4143j46084F4078c0503l40375E4742L5965k0095b54028f9128
11105a1300o2298j19183B85673E1664f7904H2950K20362a13260B30378C1654o775
11094B4879K15153b05759C33930e0091E7473J12144o9020l642J33842F0835J44883
11083B05718F5814i6521C23067H102a18603F6329R5357K360a53268A76081a93078
$$ plain form
11163 77801 156588 -90748 -115617 -127960 -197254 -128964 -22836 -272537 -27488 185290 5586
11151 -205164 -112134 138199 -156437 -136815 13608 138901 36837 -191771 -123968 -2116 -265986
11140 -265986 -22701 358589 104881 -65512 96186 -20527 -17753 161035 -78302 -310592 -90888
11128 -367293 -211240 147945 -187786 55777 -45682 -381708 -31624 193365 -266367 171187
11117 106245 69916 -94143 -240227 64078 -30503 -370878 54742 90707 70612 -254028 -69128
11105 -11300 -73598 -192781 285673 51664 -67904 82950 303312 -113260 230378 31654 24879
11094 24879 240032 -205759 333930 -50091 57473 169617 100597 96955 230797 60835 205718
11083 205718 65814 -96521 323067 8102 -118603 66329 161686 164046 -153268 176081 -193078
11071A633J16953R1535N1507C6412d7458J8616A95713K18249P2379a12363C39539
11059A03910g2222A50635A0129K8834K2755M08108A87513l609c2187D77868B17125
11047I5964J63768J14018A53034P7597J11159k8641J68924B14677n6517K34798
11037C92958j0050J22046k04687M68587k89723m9482P9110J37922j57216K46099
11027G35564l08412N4646r7960l1525K23125q610q6053J63978Q2909A83896K97551
11016D81447K91858k49439q3869K309k1534P4798J64113J51113A74663M34910
11006F09573R8737j7357B94668R6116J54692k17809J83847k30306O0779J56020
10996D98007r300j80268K00423J07051k89807M5707K19017K1381j03559O1068
$$ plain form
11071 1633 118586 210121 261628 36412 -47458 -28842 195713 413962 486341 -112363 339539
11059 103910 -72222 150635 10129 38963 61718 469826 187513 183904 -32187 477868 217125
11047 95964 259732 373750 153034 230631 341790 313149 482073 214677 158160 392958
11037 392958 382908 504954 300267 768854 479131 429649 508759 646681 489465 735564
11027 735564 427152 481798 383838 352313 575438 566828 480775 644753 727662 183896 481447
11016 481447 773305 523866 439997 442306 420772 495570 659683 810796 174663 609573
11006 609573 708310 690953 294668 390784 545476 327667 511514 281208 341987 498007
10996 498007 488707 308439 508862 615913 326106 371813 590830 612211 508652 569720
10986E69720k11471o6956J11307L00129l03280J23217r7862j3368J77355D9207
10975H10170l51252j57947M67915l26253J53543K33461C24273L91907J07593k93156
10965E30617L48261B91890L88854J95698J97188k58882L72524J15501J65947j502
10955A467218R890L53502K0797k3608J24058l80915Q0920K07185l28730j73177
10945A357140q5326K0686J2626j4517K11524K0347l77379M31167l57868K94472
10935A512872l09521j89650N1492J18075l40057j57809N3430k94315j32781l6764
10925B74972O0131j46932r2182L89973j61406A0947K99514f3300A98105D9670
10914C7489N9032b8202m4724r7393C85749A18393A4508J65616b42319a0767C8848
$$ plain form
10986 569720 358249 291293 402600 702729 399449 522666 424804 411436 588791 49207
10975 810170 458918 300971 768886 442633 596176 829637 324273 716180 823773 530617
10965 530617 878878 291890 680744 876442 1073630 814748 1187272 1302773 1468720 1467218
10955 1467218 1477108 1830610 1851407 1827799 1951857 1570942 1651862 1859047 1530317 1357140
10945 1357140 1271814 1292500 1305126 1290609 1502133 1522480 1145101 1576268 1218400 1512872
10935 1512872 1203351 1013701 1065193 1183268 843211 685402 738832 444517 311736 274972
10925 274972 335103 188171 95989 485962 324556 10947 310461 -63300 198105 49670
10914 37489 96521 -28202 -72926 -170319 385749 118393 14508 180124 -242319 -10767 38848
10902c76287B74601G4687N2775N7890G676J75712K3580a42984A44393b02117i4374
10890c0465B83793j18090a94107A78186a7943I6293a61228n6104A4631h9932k14867
10879c04799A10095h4498A38283o6584c28322D4215d7539a3861k72803i9534B6476
10867b88634c0087A32995J15196m8899a25623B51116E6805L11810a44665g738
10856F4093J57218a60908K2034g50j32064B09926L7426b43805a16974M6418A14140
10844A9900c5902A10059K0480J42594A1743a79601B88661a03574k8110j25897
10834b57581C47336n1719d3550j3845p5653a7310k39246B91870b11935P5241O795
10823a29899J5381H0393A1538c0727A57314d3439A45020B1634P8827a30777m1051
$$ plain form
10902 -376287 274601 74687 127462 185352 7676 183388 206968 -142984 144393 -202117 -94374
10890 -30465 283793 165703 -194107 178186 -17943 96293 -161228 -217332 14631 -89932 -304799
10879 -304799 110095 -84498 138283 71699 -328322 44215 -47539 -13861 -286664 -99534 26476
10867 -288634 -30087 132995 248191 199292 -125623 251116 56805 368615 -144665 -7738
10856 64093 221311 -160908 -138874 -750 -132814 209926 247352 -243805 -116974 -70556 114140
10844 19900 -35902 110059 130539 273133 11743 -179601 288661 -103574 -131684 -257581
10834 -257581 347336 295617 -43550 -57395 -133048 -17310 -256556 291870 -211935 -136694 -129899
10823 -129899 -114518 80393 11538 -30727 157314 -43439 145020 21634 100461 -130777 -171828
10812a71828C2138J73339a1944B15108e0944l09247r5384g2816l8305l70395B54794
10800a8277j77817j07396J02797Q5634A15348f6038J9096m494j99884a04633D8085
10788a83078N814k0200L2219B9380H757b65129a18884m15638c4812E2941b42538
10776A01356i2739A9792b98627B8417b84354J1481A5468h6652G927a2925j0623
10765b3548H9286c28371B1935J28337B9922c69860i634l01792A902J62168p3197
10754I0873b75082i5261H1509B2740a63067A91360g2489E825a17839A32288C7840
10742d3665l57687b3692l5283A46475c1537J0178j7490p0305L7684B07487B7160
10730i0132A34649b81865P9735O929e6374A95578b69087J04207A36065g739q8793
$$ plain form
10812 -171828 32138 205477 -11944 215108 -50944 -360191 -455575 -72816 -111121 -481516 254794
10800 -18277 -196094 -303490 -200693 -115059 115348 -66038 -46942 -51436 -251320 -104633 48085
10788 -183078 -177264 -197464 -165245 29380 8757 -265129 -118884 -534522 -34812 52941 -242538
10776 101356 -92739 19792 -298627 28417 -284354 -272873 15468 -86652 7927 -12925 -23548
10765 -23548 89286 -328371 21935 150272 29922 -369860 -9634 -311426 1902 164070 90873
10754 90873 -275082 -95261 81509 22740 -163067 191360 -72489 5825 -117839 132288 37840
10742 -43665 -401352 -23692 -58975 146475 -31537 -21359 -38849 -109154 -71470 207487 27160
10730 -90132 134649 -281865 -202130 -195201 -56374 195578 -269087 -164880 136065 -7739 -96532
10719i6532A95871d6633J0491A07066d2956o8366o358b2279F2686B1583a6569
10707A32299h0629G0012J27974h3480B42440b68166k3698E5685b9883G4110A6307
10695a28393A475a70898C6745O3398b15955c150l01523A35024i8171D8802c4183
10683A5098J97988b8708f174k79525B11291r2240n3754A9054b37993A15260l0150
10672H5110a35992D5985h5571p5099k4980f9582A8258d05439a70638B97506a3655
10660a14408I3122b52344k09086A43244q22Q2767H3301c39655f6836e786l8372
10649d4158A754P0666a87953G8246a35897j24863A48750a61777j8433j02958E4891
10637B11367L9730M3994h9076M1689j70441P8815N3071J4945F724L6098d27468
$$ plain form
10719 -96532 195871 -46633 -36142 107066 -42956 -111322 -117680 -22279 62686 21583 -16569
10707 132299 -80629 70012 197986 -83480 242440 -268166 -291864 55685 -29883 74110 16307
10695 -128393 1475 -170898 36745 100143 -215955 -3150 -304673 135024 -98171 48802 -34183
10683 15098 213086 -28708 -6174 -285699 211291 119051 65297 19054 -237993 115260 85110
10672 85110 -135992 45985 -85571 -160670 -185650 -69582 18258 -405439 -170638 297506 -13655
10660 -114408 93122 -252344 -461430 143244 142422 225189 83301 -339655 -66836 -5786 -44158
10649 -44158 1754 72420 -187953 78246 -135897 -260760 148750 -161777 -180210 -283168 54891
10637 211367 251097 295091 -89076 -47387 -217828 -139013 -85942 -70997 6724 42822 -427468
10625d72289B29566j03178P7511l0190a82430A1163a65091j04449J3998j9024
10615b74566C996a83427C00514b29073r5652J37072L721a0130B04413H5166k9178
10604E5988J73309b66580J03675K3107F6768j7411b85638A67389A4083a24304
10593a93537O218j07534A26815a36511j1758g2798A12984n0349K66078B4598N9468
10582H4066R5463f2976A21557b39893J6466b4189k7207B6978R0917P5313a53232
10570A64290i4901B8285b11268A31199a09561r4628f802j01616n7492R823D9711
10558d6939n9345A02378e03155C211J40609h440A78597a94997C00679b41721R2617
10547a49104M2117a4164j95130L3214C55978a11956B5479e4947A06126J06849
$$ plain form
10625 -472289 229566 126388 203899 173709 -182430 11163 -165091 -269540 -255542 -274566
10615 -274566 3996 -183427 300514 -229073 -324725 -187653 -183932 -10130 204413 85166 55988
10604 55988 229297 -266580 -162905 -139798 66768 49357 -285638 167389 14083 -124304
10593 -193537 -187319 -294853 126815 -136511 -148269 -72798 112984 62635 328713 24598 84066
10582 84066 179529 -62976 121557 -239893 -223427 -24189 -51396 26978 117895 193208 -153232
10570 164290 -94901 28285 -211268 131199 -109561 -204189 -6802 -108418 -165910 -156087 49711
10558 -46939 -106284 102378 -503155 3211 143820 -8440 178597 -194997 300679 -241721 -149104
10547 -149104 -106987 -14164 -209294 -176080 355978 -111956 25479 -54947 106126 212975
10537B12975c18713A849e4209C98738H2488a58522C4305b23995g8124F1109b54303
10525A19671b9519k47505E7263a01954p364c2255j09389l78017A05220a89238
10514A51023b1080k07042I1644f6005b0927j05076A45147b1883A48468b362G4018
10502h0092B11024g0323k07359m5196B1288J20900c2056j13518m5593d714r5461
10491a00175j3268B96050A02563i0158J44j05094C22170b02810F0755a5941B0256
10479b44513b8041A71052A9233J03161l1160J35524D9646M3551d8415K4032A15166
10467b10405j94795C22599a17833B47497Q6791o2734J37219K62870q0332L7899
10457F29210n426B8089J92139g8910Q451p078A43327g716o0262H856a3377r7904
$$ plain form
10537 212975 -318713 1849 -54209 398738 82488 -158522 34305 -223995 -78124 61109 -254303
10525 119671 -29519 -277024 57263 -101954 -109318 -32255 -141644 -519661 105220 -189238
10514 151023 -21080 -228122 91644 -66005 -20927 -126003 145147 -21883 148468 -2362 74018
10502 -80092 211024 -70323 -277682 -322878 21288 142188 -32056 -145574 -191167 -4714 -100175
10491 -100175 -113443 296050 102563 -90158 -90014 -195108 322170 -202810 60755 -15941 20256
10479 -244513 -28041 171052 19233 122394 91234 226758 49646 93197 -48415 -24383 115166
10467 -210405 -405200 322599 -117833 247497 334288 271554 408773 671643 591311 629210
10457 629210 623784 28089 220228 -78910 -70459 -77537 143327 -7716 -67978 8856 -13377 -111281
10445a11281j65089O5177g4287K1049B19452c2526k10733n0083J23371p4908R9833
10434a45046A88682E117O6904a64302k29351i6351o8175N8402n4176A31731C3268
10422A03006b66753C0466a01357n4115G7743J29842b19304I2583J71625A20583
10411C4262d20895D1167i9180B10151I4113d1139C9955P5921B1595b7242B5361
10399I3248R6061a42449l5487j23060R1504K2421e1276A2172a83744Q5276l10077
10388d08545G7250K31651c2083o0353C7076b93690E4631b25832A79140p1598j7339
10377I0203c30893C693a53813l48601A86341i2959j02014B99769F6798J89947
10367B56745j28150d8776H1756j0332h458o105G48926a70254A34271e0467A23442
$$ plain form
10445 -111281 -276370 -211193 -74287 -53238 219452 -32526 -243259 -293342 -169971 -244879 -145046
10434 -145046 188682 5117 72021 -164302 -393653 -96351 -164526 -106124 -160300 131731 33268
10422 103006 -266753 30466 -101357 -155472 77743 207585 -219304 92583 264208 120583
10411 34262 -420895 41167 -99180 210151 94113 -41139 39955 115876 21595 -27242 25361
10399 93248 189309 -142449 -177936 -300996 -209492 -187071 -51276 12172 -183744 -98468 -408545
10388 -408545 77250 308901 -32083 -92436 37076 -293690 54631 -225832 179140 107542 90203
10377 90203 -330893 3693 -153813 -502414 186341 -92959 -194973 299769 66798 256745
10367 256745 128595 -48776 81756 71424 -8458 -14563 748926 -170254 134271 -50467 123442
10355B75098p3175I4193K8385a94726A87420b30948d9220B44763j0434f3866g075
10343C01201A29645h6387D8549e3048A89634H6939g4720C28639k122G5837K04892
10332B80729j8770K01292A88355K31824m2544C6648L39690J60890A15869K52800
10322C68669e8754A61907J65487A58436C2462J32434K01636I5389N999L7299B8012
10310B00776d6392B67346C5198c67693A87870D7348J98511J95826H428M70974
10300D79402B26723a23930A47584J19132b14002b4550j51120o6468B92378B70
10289C4542J78600b46618a5970j58490A3147K07684j02064h204j0474A58372F0186
10277B4610a40494j53058a7287k96162g6152a1164C3703K4232a79579B0967b33218
$$ plain form
10355 275098 201923 94193 122578 -194726 187420 -230948 -49220 244763 234329 -63866 -7075
10343 301201 129645 -86387 48549 -53048 189634 86939 -74720 328639 326517 75837 280729
10332 280729 261959 463251 188355 420179 377635 36648 376338 537228 115869 368669
10322 368669 -58754 161907 327394 158436 32462 164896 366532 95389 101388 138687 28012
10310 200776 -46392 267346 35198 -367693 187870 47348 245859 441685 8428 479402
10300 479402 226723 -123930 147584 266716 -214002 -24550 -175670 -242138 292378 270
10289 34542 213142 -246618 -15970 -174460 13147 220831 118767 -8204 -18678 158372 60186
10277 24610 -140494 -293552 -17287 -313449 -76152 -11164 33703 57935 -179579 20967 -233218
10265b19549D2659b82459j43224A12611f1189j53842k4103j51009C1527K90264
10255C21791b78681a12081B58192q7646P5310a38898a5729k50228M4662E1017
10244H7292a1443o4566B06239b52623Q4312A02962J39301j10887A6989G146e1817
10232C32574E059a69229d0877a0752k79326E2765d8212q8197B6024J36179k5986
10221A36217a27863B696J8675d82815a64490m4962F0827J25621a24404B01220
10210a36764j00892O3324m3787Q9440r3910D1908b95908d0458r3328j63513B8428
10198A79831D1313a03873L1267J1492M674j17356A98171i9282k48389I5409N9338
10187A54747J3910m3245a32095B09640b5867o9757B36065A16468L5815b5242k60218
$$ plain form
10265 -219549 42659 -282459 -425683 112611 -61189 -215031 -239134 -390143 31527 321791
10255 321791 -278681 -112081 258192 170546 245856 -138898 -15729 -265957 -221295 51017
10244 87292 -11443 -76009 206239 -252623 -168311 102962 242263 131376 16989 7146 -51817
10232 332574 5059 -169229 -40877 -10752 -290078 52765 -48212 -136409 26024 162203 136217
10221 136217 -127863 2696 21371 -482815 -164490 -209452 60827 186448 -124404 201220
10210 -136764 -237656 -174332 -218119 -128679 -222589 41908 -295908 -40458 -133786 -297299 28428
10198 179831 41313 -103873 -72606 -61114 -56440 -173796 198171 -99282 -347671 95409 154747
10187 154747 168657 125412 -132095 209640 -25867 -95624 236065 116468 152283 -25242 -285460
10176b85460Q7359l5601N7310L2899B8375a47818A94333H2213b48034d7992j00372
10165a48364D9918A9191K04726b37941Q3396j68825A16307a55912d4302j235q2059
10154a27596B13887a14224H2444c16169A83538i3256L4741j20371g8049L1033
10144d7016k04003c1777k03626F6724a19561l4863A30099c6626A11266b04916
10133b11265A14455b16050K5483A47217a4700j07127j8142B20418a01473r4665
10123a96138f5559b4007r2894j78249a47548o8076i7432p7364Q5082A78614d61004
10111b39022F31Q5971e1285B03973m6254a02367q8263c1282j00694a1339H2262
10099b08890b0429I480a3102G2570l1324a17743p3950J1089b2751A7206P5000
$$ plain form
10176 -285460 -198101 -233702 -176392 -143493 28375 -147818 194333 82213 -248034 -47992 -148364
10165 -148364 49918 19191 223917 -237941 -154545 -323370 116307 -155912 -44302 -45537 -127596
10154 -127596 213887 -114224 82444 -316169 183538 -93256 -58515 -178886 -78049 -47016
10144 -47016 -251019 -31777 -235403 66724 -119561 -154424 130099 -36626 111266 -204916
10133 -211265 114455 -216050 -190567 147217 -14700 -121827 -139969 220418 -101473 -196138
10123 -196138 -65559 -24007 -116901 -295150 -147548 -215624 -97432 -174796 -89714 178614 -461004
10111 -239022 631 86602 -51285 203973 157719 -102367 -190630 -31282 -131976 -11339 82262
10099 -208890 -20429 9480 -13102 72570 41246 -117743 -191693 -180604 -22751 17206 92206
10088I2206b44975J13247M1712g507p4765C26348a31857A093M2594b20611b8567
10076C2820b54714a422j55385b5138j33076A3311J54088G2802d05698P0605A04166
10064B7323b25712A766b12029C0034a23174l61212B67621F5713b66729R8725L8505
10053a29499l16072D8585a79752d7672o7293B0859K41776O2183n6584F1115b07132
10041c27227A79620a27249A70580F5114i9829j69376Q6801D6394d59772c7169
10030a34612A31332E1061K1945a96091L5986A67196a34964f7096B34461g912j83596
10019a91508q398c7894j4140A00587B2521F981a25373J5000J6491j50157J18357
10008a25682M8897A941a0328o1737j38257C53510a46802l4170A49244d1022B39053
$$ plain form
10088 92206 -244975 -131728 -90016 -7507 -82272 326348 -131857 1093 43687 -220611 -28567
10076 32820 -254714 -1422 -156807 -25138 -158214 13311 167399 72802 -405698 -335093 104166
10064 27323 -225712 1766 -212029 30034 -123174 -484386 267621 65713 -266729 -168004 -129499
10053 -129499 -445571 48585 -179752 -47672 -114965 20859 262635 324818 268234 61115 -207132
10041 -327227 179620 -127249 170580 65114 -99829 -269205 -182404 46394 -459772 -37169
10030 -134612 131332 51061 73006 -196091 -160105 167196 -134964 -67096 234461 -7912 -191508
10019 -191508 -199906 -37894 -52034 100587 22521 6981 -125373 -110373 -93882 -244039 -125682
10008 -125682 -76785 1941 -10328 -72065 -210322 353510 -146802 -180972 149244 -41022 239053
9996D7249a99321C47624B2498J27775C1628a85880j28640E1962O5558n5754N7786
9985A19552h4232H0046B7437d8082I3516h242m4552j26808n399C4275b9036j70011
9973a99047O5589F663K62172a26707C29735a40398j11556B73223a49165H0216
9962a13569p2160l07968F3297b73766c2461j88945n473A92317e166B52761A21704
9950c76735e909k05381c3949o0182D1819a73510N59l2518k13807J39482N9160
9939b20634Q4946j15856A39683a59213L2962j38295j44563a37862j45321A21120
9928e6373j81626k3068j90943C1397L3318L5578K4583J22155g2145j33313A35080
9916e40413a98905l7688C4675b85150J17496f2876j6840A76284e0104D5125J22845
$$ plain form
9996 47249 -199321 347624 22498 150273 31628 -185880 -314520 51962 117520 61766 119552
9985 119552 -84232 80046 27437 -48082 93516 -8242 -52794 -179602 -185001 34275 -29036 -199047
9973 -199047 -133458 6663 268835 -126707 329735 -140398 -251954 273223 -149165 80216
9962 -113569 -185729 -493697 63297 -273766 -32461 -221406 -226879 192317 -5166 252761 121704
9950 -376735 -5909 -211290 -33949 -94131 41819 -173510 -172951 -205469 -419276 -279794 -220634
9939 -220634 -135688 -251544 139683 -159213 -126251 -264546 -409109 -137862 -283183 121120
9928 -56373 -237999 -261067 -452010 31397 64715 100293 124876 247031 -72145 -205458 135080
9916 -540413 -198905 -236593 34675 -285150 -167654 -62876 -79716 176284 -50104 45125 167970
9905A67970J9605c80345p3321a0666k29858J19790I9903g9687a6331B03356f0248
9893B4447I666b77207E9208f12212g1524l21552a74112B09106a24158A36558c31222
9881a08694a6118k63206i832I0285f4189A56352J92e9339k30519f5288n5872B41753
9868g8568j43903B66566e286j27456f5179a9897k11370C56303a90302j1921L5494
9857a66729C58397e37275h7667A19781h551j51593A14674h0127A38274g6171E3647
9845c65911c4073o9691c5430G4051B1784d8126K1702l3483l7586A90084C941J50704
9833A54645b52362a21078C0581e2721I2584c31830M1188I2489f7883j1197k74059
9822c53139A84450a89282G3929a87045N3719E2998b26077A66198a362k42073a04542
$$ plain form
9905 167970 187575 -380345 -453666 -10666 -240524 -120734 99903 -79687 -16331 203356 -60248
9893 24447 9666 -277207 59208 -612212 -71524 -393076 -174112 209106 -124158 136558 -331222
9881 -108694 -16118 -279324 -9832 90285 -64189 156352 156544 -59339 -289858 -65288 -121160 241753
9868 -78568 -222471 266566 -5286 -132742 -65179 -19897 -231267 356303 -190302 -202223 -166729
9857 -166729 358397 -537275 -87667 119781 -8551 -160144 114674 -80127 138274 -76171 53647
9845 -365911 -34073 -103764 -35430 74051 21784 -48126 -26424 -59907 -97493 190084 3941 154645
9833 154645 -252362 -121078 30581 -52721 92584 -331830 -290642 92489 -67883 -79080 -353139
9822 -353139 184450 -189282 73929 -187045 -133326 52998 -226077 166198 -1362 -243435 -104542
9810d0655j01038P447k18884J52497o7857j17945A26860R3213B3454c38172a16798
9798a00177o2300k6414k9174i540p6164m5022o0837l0831J00457N6541k34336
9787b99732h0831j24974f9743K6392j04934B94799a1662j4657A14299P8916a78589
9775b7174j48219A85325c8326p9259G9135Q4633a2461j99912b3577r0215C21233
9763h1478L6552A09271e5018F0362b27522a8314j96000g5381a6161B52972a96903
9751a53657a3724k51737F6097c1554k8178E7096a09954H7512b77007g5713A01547
9739C7915J87769i7706C5274K7961a77808L1946C05518b5785k05069j25644h9214
9727C15903a28136C892L2966b03219F414a3261j27505a5858A45482a58948A37338
$$ plain form
9810 -40655 -141693 -134246 -353130 -200633 -268490 -386435 126860 220073 23454 -338172 -116798
9798 -100177 -162477 -188891 -218065 -9540 -85704 -130726 -191563 -222394 -121937 -65396 -299732
9787 -299732 -80831 -205805 -69743 -43351 -148285 294799 -11662 -26319 114299 193215 -178589
9775 -27174 -175393 185325 -38326 -117585 79135 163768 -12461 -212373 -23577 -113792 321233
9763 -81478 -44926 109271 -55018 60362 -227522 -18314 -214314 -75381 -16161 252972 -196903
9751 -153657 -13724 -265461 66097 -31554 -59732 57096 -109954 87512 -277007 -75713 101547
9739 37915 225684 -97706 35274 63235 -177808 -145862 305518 -25785 -230854 -356498 -89214
9727 315903 -128136 3892 36858 -203219 6414 -13261 -140766 -15858 145482 -158948 137338
9715B05196c3886M061j35284K4311l7162O0034d7003q2829j26694f7620j48688
9704b16308c8282A0475b97072B2739b46507e5906k7192A41630L8892b15214P4282
9693a40932e9051k0029j09005A84284b12232D9728B0669c01008D0252R757b07502
9681C41676a00720c0548B69709d033k59194a7135j74833D516a7675l15445E1369
9669F0501m074r739J40226e5893n1063j84429c7273B9082c02686g2125n66681
9658f38806A20112h2480k1782A14081a6810j38681M9455j33668G9051J98005a48032
9646D1483b16421j47665N6508D4127a50724j38895f5751n4592n9270j90759B6671
9634a76921P9894c2281B14095d1271E5735c0795F1427b11775G9562J26570a26226
$$ plain form
9715 205196 -33886 -29825 -165109 -140798 -177960 -117926 -47003 -129832 -256526 -67620 -216308
9704 -216308 -38282 10475 -297072 22739 -246507 -55906 -83098 141630 180522 -215214 -140932
9693 -140932 -59051 -79080 -188085 184284 -212232 49728 20669 -301008 40252 50009 -207502
9681 341676 -100720 -30548 269709 -4033 -263227 -17135 -191968 4516 -17675 -333120 51369
9669 60501 56427 46688 186914 -55893 -106956 -291385 -37273 29082 -302686 -72125 -638806
9658 -638806 120112 -82480 -104262 114081 -16810 -155491 -106036 -239704 79051 277056 -148032
9646 41483 -216421 -364086 -307578 44127 -150724 -289619 -65751 -120343 -179613 -370372 26671
9634 -176921 -97027 -32281 214095 -41271 55735 -30795 61427 -211775 79562 206132 -126226
9622i243H8744K65624h0267a9145f360m03984A23049E7178L9560B8943J1402b31067
9609g7291o0591j31388e793m26873a29496M5925p3403K5114a7591n3767B672d52523
9596b95329H1466i7688B3708a26565B72060d4104B24562b64549G0117b10283E02615
9584h2671k11643A34919h1131H4093l6253J86417a24780e9701P997C14445a00898
9572F8514d07831f6972A96537h8900l8144E1190a7469k82537a11563l14075A4370
9560b78669J1565J30676B6746g7837K0462K3306k18972p9812k056A89167E5474
9548b86332A61570b75455M8022j31253J46095F3462l1222c34709Q1298j0128D0883
9536B56163d1892m28988f5914J1320B0203b07937F1306a29743q023j34863B49935
$$ plain form
9622 -9243 88744 354368 -80267 -19145 -6360 -410344 123049 57178 96738 28943 40345 -231067
9609 -77291 -137882 -269270 -5793 -432666 -129496 -83571 -156974 -131860 -17591 -71358 2672 -452523
9596 -295329 81466 -97688 23708 -126565 272060 -44104 224562 -264549 70117 -210283 502615
9584 -82671 -294314 134919 -81131 84093 47840 234257 -124780 -59701 -51704 314445 -100898
9572 68514 -407831 -66972 196537 -88900 -127044 51190 -17469 -300006 -111563 -425638 14370
9560 -278669 -267104 -136428 26746 -77837 -57375 -34069 -253041 -332853 -334909 189167 55474
9548 -286332 161570 -275455 -227433 -358686 -212591 63462 32240 -334709 -253411 -263539 40883
9536 256163 -41892 -470880 -65914 -54594 20203 -207937 61306 -129743 -137766 -272629 249935
9524h0415j38055k63083B03780b25699A99326b29643A09024b80812n522d1654
9513A2144J26528a23529J6193G1399b32929G9020d5273q506q3750j35641N8277
9502b14893c1599l4795r2045k5016L3488A0425b63748b8573B0588c98230d8418
9490A33141a02089j57974A9635a67075B2089b54709M9691B24671a29791o4097
9480a93888o3175m38D3830b1460B49634a66737k8394a7883k85955C0454a73622
9468e5944A84777b9879j3444j10210n3703A33698a03411C2155d5192h430D9158
9456b7582P811k7141k04247F497K24942a07556l83353A02973G213J03610g3896
9444D3175a07114B59121b56625g2182I528J6676f690j11413j04857O9662I216
$$ plain form
9524 -80415 -218470 -481553 203780 -225699 199326 -229643 109024 -280812 -286334 -41654
9513 12144 138672 -123529 -107336 71399 -232929 79020 -45273 -53779 -137529 -273170 -214893
9502 -214893 -31599 -66394 -158439 -183455 -149967 10425 -263748 -28573 20588 -398230 -48418
9490 133141 -102089 -260063 19635 -167075 22089 -254709 -205018 224671 -129791 -193888
9480 -193888 -257063 -257501 43830 -21460 249634 -166737 -195131 -17883 -303838 30454 -173622
9468 -55944 184777 -29879 -43323 -153533 -207236 133698 -103411 32155 -45192 -8430 49158
9456 -27582 -19771 -46912 -251159 6497 231439 -107556 -490909 102973 7213 110823 -73896
9444 43175 -107114 259121 -256625 -72182 9528 26204 -6690 -118103 -222960 -153298 9216
9432e1083G7551i1603p5310A14396D4945d17637h528k36880C5586b33397B39470
9420c36183K7871f0128n7104I5251a1957k74287k19858d5061E0780L7415Q5060
9409A73255J51242A27504b73495D2660L0020J47143a05594l97926J21056A56654
9398i3489C1476b85034o0775J46052F2789b49587k2426g9974H9171a88002A64747
9386A62424a30860q834K4053A20478c3047m7528k29155J27337B33821q3547m2865
9375A07409a62927B07747b26018q1a8914n4214p3283a6311k70726c3754l7760
9364g1514A4871a19424l4914p8165L6213I3701M7686a23929l7528j23457f9602
9352D4317b77777F7444J66458b42889A9909a29759R31D5347J5369b77474r7928
$$ plain form
9432 -51083 77551 -91603 -166913 114396 44945 -417637 -8528 -245408 35586 -233397 239470
9420 -336183 -308312 -60128 -117232 95251 -11957 -286244 -506102 -45061 50780 88195 173255
9409 173255 324497 127504 -273495 42660 72680 219823 -105594 -503520 -382464 156654
9398 -93489 31476 -285034 -345809 -199757 62789 -249587 -272013 -79974 89171 -188002 164747
9386 162424 -130860 -139694 -115641 120478 -33047 -80575 -309730 -182393 233821 150274 107409
9375 107409 -162927 207747 -226018 -226099 -18914 -73128 -146411 -16311 -287037 -33754 -71514
9364 -71514 14871 -119424 -154338 -232503 -196290 93701 141387 -123929 -161457 -284914 -69602
9352 44317 -277777 67444 233902 -242889 19909 -129759 -128828 45347 60716 -277474 -375402
9341c75402B6974d5237B0162q735b70568e8990B20802p3561a72804A41614m1061
9330A00553a18889H24K0960a47494A40692b36135a10450j48126J07719j96957
9320c47814A07235D0891H201a17164d8816j76988A50302a61421N5023k5837e2020
9308d7754p5713A67531e1252b952k29117A63663i9878A57893a43072B5385N411
9297C0796J7495G987L5277b27382A6271e1180n694F1365K07309A16683c9047B32354
9284a81334a3913r733A88590b61081g3497j38829K7240J2428A10740b51896f6737
9272d56167J53154a8757j066A25446g4179b5263A30653b81055J24206J7642L5423
9261a03784l46050G3221c5069j44302N8347j47616A24925d94008K31943A83505
$$ plain form
9341 -375402 26974 -45237 20162 11427 -270568 -58990 220802 147241 -172804 141614 100553
9330 100553 -118889 824 21784 -147494 140692 -236135 -110450 -258576 -150857 -347814
9320 -347814 107235 40891 8201 -117164 -48816 -225804 150302 -161421 -106398 -132235 -52020
9308 -47754 -123467 167531 -51252 -2952 -232069 163663 -99878 157893 -143072 25385 30796
9297 30796 48291 7987 43264 -227382 16271 -51180 -56874 61365 268674 116683 -39047 232354
9284 -181334 -13913 -23646 188590 -261081 -73497 -212326 -185086 -172658 110740 -251896 -66737
9272 -456167 -303013 -18757 -19823 125446 -74179 -25263 130653 -281055 -156849 -139207 -103784
9261 -103784 -449834 73221 -35069 -179371 -121024 -268640 124925 -494008 -262065 183505
9250h5461j39675e1846j25140L6145J3284B60199h8239j00444A7648b83132F681
9238a82892D4190J81419C3557a06208k22230D581b932n6784J877n843j02150P9777
9226h6055j21563H3046B2290b7081j60546O2666A8055b37939A89094o4589J78136
9215C02641b98259D0444d3578l33102i4496B88h1882j04475p207k3466B8692d15501
9202A04541a95353B46145b83083J35344I2532d1640j68201L1817e1891l84941
9192d36832E4764b8773k06092a07678F2050g0993k37016b7960j81803I774e529
9180d68302B30840b0244J295B16977a79359n7145B41216h1353p8539m6176I0796
9168b0245l1614B53140d20340B85878A166Q2195d4080o5727A35176h5033c7820
$$ plain form
9250 -85461 -225136 -51846 -176986 -140841 -127557 260199 -88239 -188683 17648 -283132 6681
9238 -182892 44190 225609 33557 -106208 -328438 4581 -2932 -59716 -57839 -63682 -165832 -86055
9226 -86055 -207618 83046 22290 -27081 -187627 -124961 18055 -237939 189094 124505 302641
9215 302641 -298259 40444 -43578 -376680 -94496 288 -81882 -186357 -193564 -217030 28692 -415501
9202 104541 -195353 246145 -283083 -147739 92532 -41640 -209841 -178024 -51891 -436832
9192 -436832 54764 -28773 -234865 -107678 62050 -70993 -308009 -27960 -209763 9774 -5529
9180 -468302 230840 -20244 -18949 216977 -179359 -236504 241216 -81353 -159892 -206068 90796
9168 -20245 -51859 253140 -420340 285878 1166 83361 -44080 -109807 135176 -85033 -37820
9156A2132a85792A6823h5228k98368i999l7086j42478Q5988F590e0004k28780
9145b78784f4226D4977b64300i4923G2997B115N4983g4473A0331a06665A15354
9133D447L1600b37755F7685N9003E2737e3039k07285i3339q9161A15173b22485
9121c45709a17613j77707B9534c37236P6746c6889m6880B69813a76861K0152A45256
9109B2431m805c36421A7291N1695b24035C7171a97551C4286a23477C69242g0421
9097A89039G3204j784Q9308J8727a24550q0571k24829A32304f8577j70828A37924
9085a31828G0233b19905l6408B24361b05406B66871a13903A16764c56601a28061
9074c4999j12343C00034b04486C21501C0449b97020E681a4931A39335a54975j84991
$$ plain form
9156 12132 -185792 16823 -85228 -383596 -9999 -47085 -189563 -103575 6590 -50004 -278784
9145 -278784 -64226 44977 -264300 -94923 72997 2115 57098 -74473 10331 -106665 115354
9133 4447 36047 -237755 67685 126688 52737 -53039 -260324 -93339 -182500 115173 -222485
9121 -345709 -117613 -295320 29534 -337236 -260490 -36889 -83769 269813 -176861 -156709 145256
9109 22431 17626 -336421 17291 68986 -224035 37171 -197551 34286 -123477 369242 -70421
9097 189039 73204 71420 160728 179455 -124550 -205121 -429950 132304 -68577 -239405 137924
9085 -131828 70233 -219905 -256313 224361 -205406 266871 -113903 116764 -356601 -128061
9074 -34999 -147342 300034 -204486 321501 30449 -297020 5681 -14931 139335 -154975 -339966
9063c39966a17539j36407J2222Q7909P6393B854b71249q7364I6088g588B23916
9051A60092a20435a2248l18671b3334B49736b77844A14174L05411b30963A21650
9040b2448k8891p163M579B96649b48350F2473e9653o593B26700b04764I070e499
9027b37986i0208b2671l0839d374l84213J01334A31301a9701D7196J05049C3272
9015D6969a13677A82812e38k78434F2499J60107A0023b11758A01853h2491c9349
9003A19055L72968b55053A5287c5744G0242d0940j81868M6272d7211l19283J30231
8992b36263j48174J77936K5281j81582J66492A09384b91572h7105c9203A05988
8981g1691k12900A05631J3140Q5020f4446D8580K79835C219N7273L25166a11947
$$ plain form
9063 -339966 -117539 -253946 -241724 -153815 -77422 2854 -271249 -358613 96088 -7588 223916
9051 160092 -120435 -12248 -330919 -23334 249736 -277844 114174 419585 -230963 121650
9040 -22448 -51339 -58502 -53923 296649 -248350 62473 -59653 -66246 226700 -204764 9070 -5499
9027 -237986 -90208 -22671 -53510 -4374 -388587 -287253 131301 -19701 47196 152245 33272
9015 46969 -113677 182812 -538 -278972 62499 222606 10023 -211758 101853 -82491 -39349
9003 119055 492023 -255053 15287 -35744 70242 -40940 -222808 -176536 -47211 -366494 -236263
8992 -236263 -384437 -206501 -181220 -362802 -196310 109384 -291572 -87105 -39203 105988
8981 -71691 -284591 105631 118771 203791 -64446 48580 328415 3219 60492 385658 -111947
8969i3206j48606c1252J0189j37799A52717C3103p408N3948J60577b32128d5720
8957a87535p7891c1907M456j19504A18829h9445l959l03058R8218J0353O9280
8946b18611O6696B16463b44F1241m86a09734B46232A10631i4980n4526J7850J4285
8934a17371j43479A22582C2867a2528D5779a72894o6191J08435M9805A17815a45044
8922A60227a90177a3527A07262D8279a05081I7073l7654O578J79529B7327K69920
8911B97247l7236K43143j43482L53686J88704J11326O16483J723735L588577j813252
8901E128931k316169j243579n86513C28987j39140r3519m3381L1589a09240E39117
8890B39462O0427a737H2610a33775E4275b61524D7231c58305C30718a6331p7865
$$ plain form
8969 -93206 -241812 -31252 -21063 -158862 152717 33103 25695 79643 240220 -232128 -45720
8957 -187535 -265426 -31907 -27451 -146955 118829 -89445 -93404 -396462 -298244 -287891 -218611
8946 -218611 -151915 216463 -244 61241 60755 -109734 246232 110631 -94980 -149506 -131656 -117371
8934 -117371 -260850 122582 32867 -12528 45779 -172894 -239085 -130650 -80845 117815 -145044
8922 160227 -190177 -13527 107262 48279 -105081 97073 59419 65997 245526 27327 297247
8911 297247 260011 503154 359672 713358 902062 1013388 1629871 3353606 6942183 5128931
8901 5128931 2812762 1569183 982670 328987 189847 96328 52947 84536 -109240 539117
8890 239462 299889 -1737 82610 -133775 54275 -261524 47231 -358305 330718 -16331 -94196
8879i4196n8891A47573c93577a19091e8062J5680l2883G0247k7610a95962D4257
8867C09928H5422c914l6764C12903h6357m889p1459B20691B0702b878l46199A85816
8854c9770I3129e0754A11802h2745r1503l8007a4932k35761G1897b92158A00468
8842d33513K09671j71229C2344g0534A46776j6260a80600K2920l94741E3027e03181
8830g1039C5240b5774A41904c75760A47644F8893Q066f2776b9569l7758a1227
$$ plain form
8879 -94196 -153087 147573 -393577 -119091 -58062 -42382 -75265 70247 42637 -195962 44257
8867 309928 85422 -3914 -40678 312903 -86357 -91246 -162705 220691 20702 -2878 -349077 185816
8854 -39770 93129 -50754 111802 -82745 -174248 -212255 -14932 -250693 71897 -292158 100468
8842 -433513 -223842 -395071 32344 -70534 146776 130516 -180600 -157680 -552421 53027 -503181
8830 -71039 35240 -25774 141904 -375760 147644 68893 76959 -62776 -29569 -67327 -11227
$$ [...]
##END NTUPLES=NMR SPECTRUM
##END=
